{"text_format":"1","workbook":"xlsx","n_sheets":8,"sheets":["1. LDC Information","2. Smart Meter Data","3.  LDC Assumptions and Data","4. Smart Meter Rev Req","5. PILs","6. Avg Nt Fix Ass &UCC","7. Funding Adder Collected","8. Smart Meter Rate  Adder"],"not_rendered":{"charts":0,"images":0,"macros":0,"external_links":2,"defined_names":16,"comments":0,"pivot_tables":0},"unopened":[],"bounds":{"document_bytes":16777216,"sheet_cells":100000,"rows_first":2000,"rows_last":500,"rows_between":2000,"halvings":0,"cell_chars":16384,"cell_head_chars":4096},"cells_cut":0,"cells_raw":0,"read":"whole","date_system":"1900"}

{"sheet":"1. LDC Information","index":0,"n_rows":20,"n_cols":3,"rows_kept":20,"cut":false,"hidden":false,"merged":[[19,2,19,3],[12,0,12,1],[13,2,13,3],[15,2,15,3],[17,2,17,3]]}
[null,"Sheet 1 Utility Information Sheet"]
[]
[]
[null,"Name of LDC:","Chapleau Public Utilities Corporation"]
[]
[null,"Licence Number:","ED-2002-0528"]
[]
[]
[null,"Date of Submission:","2010-10-29"]
[]
[]
[]
["Contact Information"]
[null,"Name:","Marita Morin"]
[]
[null,"Title:","Secretary Treasurer"]
[]
[null,"Phone Number:","705-864-0111"]
[]
[null,"E-Mail Address:","chec@onlink.net"]
{"$rows_left_out":1}
{"sheet":"2. Smart Meter Data","index":1,"n_rows":147,"n_cols":11,"rows_kept":147,"cut":false,"hidden":false,"merged":[[142,3,142,8],[134,3,134,8],[136,3,136,8],[119,3,119,8],[126,3,126,8],[132,3,132,8],[138,3,138,8],[140,3,140,8],[89,3,89,8],[91,3,91,8],[95,3,95,8],[87,3,87,8],[116,3,116,8],[105,3,105,8],[110,3,110,8],[93,3,93,8],[0,1,0,8],[41,3,41,8],[53,3,53,8],[56,3,56,8],[43,3,43,8],[85,3,85,8],[45,3,45,8],[59,3,59,8],[69,3,69,8],[71,3,71,8]]}
[null,"Sheet 2.  Smart Meter Capital Cost and Operational Expense Data"]
[]
[null,"Smart Meter Unit Installation Plan: "]
[null,"assume calendar year installation",null,2006,2007,2008,2009,2010,2011,"Later","Total"]
[null,null,null,"Audited Actual","Audited Actual","Audited Actual","Audited Actual","Actual","Forecasted","Forecasted"]
[null,null,null,0,0,0,1088,26,0,0,{"$f":"SUM(D6:J6)","v":1114}]
[]
[null,"Planned number of General Service Less Than 50 kW smart meters",null,0,0,0,67,58,36,0,{"$f":"SUM(D8:J8)","v":161}]
[]
[null,"Planned Meter Installation (Residential and Less Than 50 kW only)",null,{"$f":"SUM(D6,D8)","v":0},{"$f":"SUM(E6,E8)","v":0},0,1155,84,36,0,1275]
[]
[null,"Percentage of Completion",null,{"$f":"IF(ISERROR(SUM($D10:D10)/$K10),0,SUM($D10:D10)/$K10)","v":0},{"$f":"IF(ISERROR(SUM($D10:E10)/$K10),0,SUM($D10:E10)/$K10)","v":0},{"$f":"IF(ISERROR(SUM($D10:F10)/$K10),0,SUM($D10:F10)/$K10)","v":0},{"$f":"IF(ISERROR(SUM($D10:G10)/$K10),0,SUM($D10:G10)/$K10)","v":0.90588235294117647},{"$f":"IF(ISERROR(SUM($D10:H10)/$K10),0,SUM($D10:H10)/$K10)","v":0.97176470588235297},{"$f":"IF(ISERROR(SUM($D10:I10)/$K10),0,SUM($D10:I10)/$K10)","v":1},{"$f":"IF(ISERROR(SUM($D10:J10)/$K10),0,SUM($D10:J10)/$K10)","v":1}]
[]
[null,"Planned number of General Service Greater Than 50 kW smart meters",null,0,null,0,0,0,0,0,{"$f":"SUM(D14:J14)","v":0}]
[]
[null,"Planned / Actual Meter Installations",null,{"$f":"SUM(D10,D14)","v":0},0,0,1155,84,36,0,{"$f":"SUM(D16:J16)","v":1275}]
[]
[null,"Other Unit Installation Plan: "]
[null,"assume calendar year installation",null,{"$f":"D4","v":2006},{"$f":"E4","v":2007},2008,2009,2010,2011,"Later","Total"]
[null,null,null,{"$f":"D5","v":"Audited Actual"},{"$f":"E5","v":"Audited Actual"},"Audited Actual","Audited Actual","Actual","Forecasted","Forecasted"]
{"$rows_left_out":128}
{"sheet":"3.  LDC Assumptions and Data","index":2,"n_rows":75,"n_cols":10,"rows_kept":75,"cut":false,"hidden":false,"merged":[[0,1,0,6]]}
[null,"Sheet 3.  LDC Assumptions and Data"]
[]
[]
[null,"Assumptions:"]
[null,"1. Planned meter installations occur evenly through the year."]
[null,"2. Year assumed January to December"]
[null,"3. Amortization is straight line and has half year rule applied in first year"]
[]
[]
[null,null,"2006 EDR Data Information",{"$f":"D29","v":2007},2008,2009,2010,2011,"Later"]
[]
[null,"Rate Base"]
[]
[null,"Deemed Short Term Debt %",null,null,0.04,0.04,0.04,0.04,0.04]
[null,"Deemed Debt",0.5,0.5,0.49299999999999999,0.52700000000000002,0.56000000000000005,0.56000000000000005,0]
[null,"Deemed Equity ",{"$f":"1-C15","v":0.5},{"$f":"1-D15","v":0.5},{"$f":"1-E15-E14","v":0.46700000000000003},{"$f":"1-F15-F14","v":0.433},{"$f":"1-G15-G14","v":0.39999999999999997},{"$f":"1-H15-H14","v":0.39999999999999997},{"$f":"1-I15-I14","v":0.96}]
[]
[null,"Deemed Short Term Debt  Rate%",null,null,4.4699999999999997E-2,1.1299999999999999E-2,1.1299999999999999E-2,1.1299999999999999E-2,1.1299999999999999E-2]
[null,"Weighted Debt Rate",0,0,0,0,0,0,0]
[null,"Proposed ROE",0.09,0.09,8.5699999999999998E-2,8.0100000000000005E-2,8.0100000000000005E-2,8.0100000000000005E-2,8.0100000000000005E-2]
{"$rows_left_out":56}
{"sheet":"4. Smart Meter Rev Req","index":3,"n_rows":55,"n_cols":23,"rows_kept":55,"cut":false,"hidden":false,"merged":[[0,1,0,3],[6,2,6,4],[6,5,6,7],[6,8,6,10],[5,8,5,10],[5,2,5,4],[5,5,5,7],[5,20,5,22],[6,20,6,22],[6,11,6,13],[6,14,6,16],[5,17,5,19],[6,17,6,19],[5,11,5,13],[5,14,5,16]]}
[null,"Sheet 4. Smart Meter Rev Req Calc"]
[]
[]
["Smart Meter Revenue Requirement Calculation"]
[]
[null,"Average Asset Values",{"$f":"'2. Smart Meter Data'!D4","v":2006},null,null,{"$f":"'2. Smart Meter Data'!E4","v":2007},null,null,{"$f":"'2. Smart Meter Data'!F4","v":2008},null,null,{"$f":"'2. Smart Meter Data'!G4","v":2009},null,null,{"$f":"'2. Smart Meter Data'!H4","v":2010},null,null,{"$f":"'2. Smart Meter Data'!I4","v":2011},null,null,{"$f":"'2. Smart Meter Data'!J4","v":"Later"}]
[null,null,{"$f":"'2. Smart Meter Data'!D5","v":"Audited Actual"},null,null,{"$f":"'2. Smart Meter Data'!E5","v":"Audited Actual"},null,null,{"$f":"'2. Smart Meter Data'!F5","v":"Audited Actual"},null,null,{"$f":"'2. Smart Meter Data'!G5","v":"Audited Actual"},null,null,{"$f":"'2. Smart Meter Data'!H5","v":"Actual"},null,null,{"$f":"'2. Smart Meter Data'!I5","v":"Forecasted"},null,null,{"$f":"'2. Smart Meter Data'!J5","v":"Forecasted"}]
[null,"Net Fixed Assets Smart Meters",{"$f":"'6. Avg Nt Fix Ass &UCC'!C18","v":0},null,null,{"$f":"'6. Avg Nt Fix Ass &UCC'!D18","v":0},null,null,{"$f":"'6. Avg Nt Fix Ass &UCC'!E18","v":0},null,null,{"$f":"'6. Avg Nt Fix Ass &UCC'!F18","v":138401.64449999999},null,null,{"$f":"'6. Avg Nt Fix Ass &UCC'!G18","v":272641.18299999996},null,null,{"$f":"'6. Avg Nt Fix Ass &UCC'!H18","v":263106.23933333333},null,null,{"$f":"'6. Avg Nt Fix Ass &UCC'!M18","v":0}]
[null,"Net Fixed Assets Computer Hardware",{"$f":"'6. Avg Nt Fix Ass &UCC'!C33","v":0},null,null,{"$f":"'6. Avg Nt Fix Ass &UCC'!D33","v":0},null,null,{"$f":"'6. Avg Nt Fix Ass &UCC'!E33","v":0},null,null,{"$f":"'6. Avg Nt Fix Ass &UCC'!F33","v":2041.8444999999999},null,null,{"$f":"'6. Avg Nt Fix Ass &UCC'!G33","v":3868.7579999999998},null,null,{"$f":"'6. Avg Nt Fix Ass &UCC'!H33","v":3438.8960000000002},null,null,{"$f":"'6. Avg Nt Fix Ass &UCC'!I33","v":0}]
[null,"Net Fixed Assets Computer Software",{"$f":"'6. Avg Nt Fix Ass &UCC'!C48","v":0},null,null,{"$f":"'6. Avg Nt Fix Ass &UCC'!D48","v":0},null,null,{"$f":"'6. Avg Nt Fix Ass &UCC'!E48","v":4243.2840000000006},null,null,{"$f":"'6. Avg Nt Fix Ass &UCC'!F48","v":18366.822499999998},null,null,{"$f":"'6. Avg Nt Fix Ass &UCC'!G48","v":42355.012499999997},null,null,{"$f":"'6. Avg Nt Fix Ass &UCC'!H48","v":55085.718000000008},null,null,{"$f":"'6. Avg Nt Fix Ass &UCC'!I48","v":0}]
[null,"Net Fixed Assets Tools & Equipment",{"$f":"'6. Avg Nt Fix Ass &UCC'!C63","v":0},null,null,{"$f":"'6. Avg Nt Fix Ass &UCC'!D63","v":0},null,null,{"$f":"'6. Avg Nt Fix Ass &UCC'!E63","v":0},null,null,{"$f":"'6. Avg Nt Fix Ass &UCC'!F63","v":0},null,null,{"$f":"'6. Avg Nt Fix Ass &UCC'!G63","v":0},null,null,{"$f":"'6. Avg Nt Fix Ass &UCC'!H63","v":0},null,null,{"$f":"'6. Avg Nt Fix Ass &UCC'!I63","v":0}]
[null,"Net Fixed Assets Other Equipment",{"$f":"'6. Avg Nt Fix Ass &UCC'!C78","v":0},null,null,{"$f":"'6. Avg Nt Fix Ass &UCC'!D78","v":0},null,null,{"$f":"'6. Avg Nt Fix Ass &UCC'!E78","v":0},null,null,{"$f":"'6. Avg Nt Fix Ass &UCC'!F78","v":0},null,null,{"$f":"'6. Avg Nt Fix Ass &UCC'!G78","v":0},null,null,{"$f":"'6. Avg Nt Fix Ass &UCC'!H78","v":0},null,null,{"$f":"'6. Avg Nt Fix Ass &UCC'!I78","v":0}]
[null,"Total Net Fixed Assets",{"$f":"SUM(C8:C12)","v":0},{"$f":"C13","v":0},null,{"$f":"SUM(F8:F12)","v":0},{"$f":"F13","v":0},null,{"$f":"SUM(I8:I12)","v":4243.2840000000006},{"$f":"I13","v":4243.2840000000006},null,{"$f":"SUM(L8:L12)","v":158810.31150000001},{"$f":"L13","v":158810.31150000001},null,{"$f":"SUM(O8:O12)","v":318864.95349999995},{"$f":"O13","v":318864.95349999995},null,{"$f":"SUM(R8:R12)","v":321630.85333333333},{"$f":"R13","v":321630.85333333333},null,{"$f":"SUM(U8:U12)","v":0},{"$f":"U13","v":0}]
[]
[null,"Working Capital"]
[null,"Operation Expense",{"$f":"E33","v":0},null,null,{"$f":"H33","v":0},null,null,{"$f":"K33","v":0},null,null,{"$f":"N33","v":18310.96},null,null,{"$f":"Q33","v":30485},null,null,{"$f":"T33","v":30500},null,null,{"$f":"W33","v":30500}]
[null,{"$f":"\"Working Capital  %\"","v":"Working Capital  %"},{"$f":"C16*'3.  LDC Assumptions and Data'!$C$23","v":0},{"$f":"C17","v":0},null,{"$f":"F16*'3.  LDC Assumptions and Data'!$D$23","v":0},{"$f":"F17","v":0},null,{"$f":"I16*'3.  LDC Assumptions and Data'!$E$23","v":0},{"$f":"I17","v":0},null,{"$f":"L16*'3.  LDC Assumptions and Data'!$F$23","v":2746.6439999999998},{"$f":"L17","v":2746.6439999999998},null,{"$f":"O16*'3.  LDC Assumptions and Data'!$G$23","v":4572.75},{"$f":"O17","v":4572.75},null,{"$f":"R16*'3.  LDC Assumptions and Data'!$H$23","v":4575},{"$f":"R17","v":4575},null,{"$f":"U16*'3.  LDC Assumptions and Data'!$I$23","v":4575},{"$f":"U17","v":4575}]
[]
[null,"Smart Meters included in Rate Base",null,{"$f":"SUM(D9:D17)","v":0},null,null,{"$f":"SUM(G9:G17)","v":0},null,null,{"$f":"SUM(J9:J17)","v":4243.2840000000006},null,null,{"$f":"SUM(M9:M17)","v":161556.95550000001},null,null,{"$f":"SUM(P9:P17)","v":323437.70349999995},null,null,{"$f":"SUM(S9:S17)","v":326205.85333333333},null,null,{"$f":"SUM(V9:V17)","v":4575}]
[]
{"$rows_left_out":36}
{"sheet":"5. PILs","index":4,"n_rows":42,"n_cols":9,"rows_kept":42,"cut":false,"hidden":false,"merged":[[0,1,0,4]]}
[null,"Sheet 5. PILs"]
[]
[]
[null,"PILs Calculation"]
[]
[null,null,{"$f":"'2. Smart Meter Data'!D4","v":2006},{"$f":"'2. Smart Meter Data'!E4","v":2007},{"$f":"'2. Smart Meter Data'!F4","v":2008},{"$f":"'2. Smart Meter Data'!G4","v":2009},{"$f":"'2. Smart Meter Data'!H4","v":2010},{"$f":"'2. Smart Meter Data'!I4","v":2011},{"$f":"'2. Smart Meter Data'!J4","v":"Later"}]
[null,"INCOME TAX",{"$f":"'2. Smart Meter Data'!D5","v":"Audited Actual"},{"$f":"'2. Smart Meter Data'!E5","v":"Audited Actual"},{"$f":"'2. Smart Meter Data'!F5","v":"Audited Actual"},{"$f":"'2. Smart Meter Data'!G5","v":"Audited Actual"},{"$f":"'2. Smart Meter Data'!H5","v":"Actual"},{"$f":"'2. Smart Meter Data'!I5","v":"Forecasted"},{"$f":"'2. Smart Meter Data'!J5","v":"Forecasted"}]
[null,"Net Income",{"$f":"'4. Smart Meter Rev Req'!E49","v":0},{"$f":"'4. Smart Meter Rev Req'!H49","v":0},{"$f":"'4. Smart Meter Rev Req'!K49","v":169.82428791960001},{"$f":"'4. Smart Meter Rev Req'!N49","v":5603.328354693147},{"$f":"'4. Smart Meter Rev Req'!Q49","v":10362.944020139996},{"$f":"'4. Smart Meter Rev Req'!T49","v":10451.635540799994},{"$f":"'4. Smart Meter Rev Req'!S49","v":0}]
[null,"Amortization ",{"$f":"-'4. Smart Meter Rev Req'!E47","v":0},{"$f":"-'4. Smart Meter Rev Req'!H47","v":0},{"$f":"-'4. Smart Meter Rev Req'!K47","v":942.952},{"$f":"-'4. Smart Meter Rev Req'!N47","v":14050.932999999999},{"$f":"-'4. Smart Meter Rev Req'!Q47","v":30466.312999999998},{"$f":"-'4. Smart Meter Rev Req'!T47","v":36329.997333333333},{"$f":"-'4. Smart Meter Rev Req'!S47","v":0}]
[null,"CCA - Smart Meters",{"$f":"-'6. Avg Nt Fix Ass &UCC'!C93","v":0},{"$f":"-'6. Avg Nt Fix Ass &UCC'!D93","v":0},{"$f":"-'6. Avg Nt Fix Ass &UCC'!E93","v":0},{"$f":"-'6. Avg Nt Fix Ass &UCC'!F93","v":-11453.929199999999},{"$f":"-'6. Avg Nt Fix Ass &UCC'!G93","v":-22437.020064},{"$f":"-'6. Avg Nt Fix Ass &UCC'!H93","v":-21463.53445888},{"$f":"-'6. Avg Nt Fix Ass &UCC'!I93","v":0}]
[null,"CCA -  Computers",{"$f":"-'6. Avg Nt Fix Ass &UCC'!C107","v":0},{"$f":"-'6. Avg Nt Fix Ass &UCC'!D107","v":0},{"$f":"-'6. Avg Nt Fix Ass &UCC'!E107","v":-2593.1180000000004},{"$f":"-'6. Avg Nt Fix Ass &UCC'!F107","v":-11556.323350000001},{"$f":"-'6. Avg Nt Fix Ass &UCC'!G107","v":-23664.230507500008},{"$f":"-'6. Avg Nt Fix Ass &UCC'!H107","v":-24891.486478375002},{"$f":"-'6. Avg Nt Fix Ass &UCC'!I107","v":0}]
[null,"CCA -  Other Equipment",{"$f":"-'6. Avg Nt Fix Ass &UCC'!C121","v":0},{"$f":"-'6. Avg Nt Fix Ass &UCC'!D121","v":0},{"$f":"-'6. Avg Nt Fix Ass &UCC'!E121","v":0},{"$f":"-'6. Avg Nt Fix Ass &UCC'!F121","v":0},{"$f":"-'6. Avg Nt Fix Ass &UCC'!G121","v":0},{"$f":"-'6. Avg Nt Fix Ass &UCC'!H121","v":0},{"$f":"-'6. Avg Nt Fix Ass &UCC'!I121","v":0}]
[null,"Change in taxable income",{"$f":"SUM(C8:C12)","v":0},0,-1480.3417120804004,-3355.9911953068531,-5271.993551360014,426.61193687832565,0]
[null,"Tax Rate (3.  LDC Assumptions and Data)",{"$f":"'3.  LDC Assumptions and Data'!C26","v":0.36120000000000002},{"$f":"'3.  LDC Assumptions and Data'!D26","v":0.36120000000000002},{"$f":"'3.  LDC Assumptions and Data'!E26","v":0.33500000000000002},{"$f":"'3.  LDC Assumptions and Data'!F26","v":0.33},{"$f":"'3.  LDC Assumptions and Data'!G26","v":0.31},{"$f":"'3.  LDC Assumptions and Data'!H26","v":0.28249999999999997},{"$f":"'3.  LDC Assumptions and Data'!I26","v":0.26250000000000001}]
[null,"Income Taxes Payable",{"$f":"C13*C14","v":0},0,-495.91447354693418,-1107.4770944512616,-1634.3180009216044,120.51787216812698,0]
[]
[null,"ONTARIO CAPITAL TAX"]
[null,"Smart Meters",{"$f":"'6. Avg Nt Fix Ass &UCC'!C17","v":0},{"$f":"'6. Avg Nt Fix Ass &UCC'!D17","v":0},{"$f":"'6. Avg Nt Fix Ass &UCC'!E17","v":0},{"$f":"'6. Avg Nt Fix Ass &UCC'!F17","v":276803.28899999999},{"$f":"'6. Avg Nt Fix Ass &UCC'!G17","v":268479.07699999999},{"$f":"'6. Avg Nt Fix Ass &UCC'!H17","v":257733.40166666667},{"$f":"'6. Avg Nt Fix Ass &UCC'!I17","v":0}]
[null,"Computer Hardware",{"$f":"'6. Avg Nt Fix Ass &UCC'!C32","v":0},{"$f":"'6. Avg Nt Fix Ass &UCC'!D32","v":0},{"$f":"'6. Avg Nt Fix Ass &UCC'!E32","v":0},{"$f":"'6. Avg Nt Fix Ass &UCC'!F32","v":4083.6889999999999},{"$f":"'6. Avg Nt Fix Ass &UCC'!G32","v":3653.8270000000002},{"$f":"'6. Avg Nt Fix Ass &UCC'!H32","v":3223.9650000000001},{"$f":"'6. Avg Nt Fix Ass &UCC'!I32","v":0}]
[null,"Computer Software",{"$f":"'6. Avg Nt Fix Ass &UCC'!C47","v":0},{"$f":"'6. Avg Nt Fix Ass &UCC'!D47","v":0},{"$f":"'6. Avg Nt Fix Ass &UCC'!E47","v":8486.5680000000011},{"$f":"'6. Avg Nt Fix Ass &UCC'!F47","v":28247.076999999997},{"$f":"'6. Avg Nt Fix Ass &UCC'!G47","v":56462.948000000004},{"$f":"'6. Avg Nt Fix Ass &UCC'!H47","v":53708.488000000005},{"$f":"'6. Avg Nt Fix Ass &UCC'!I47","v":0}]
{"$rows_left_out":23}
{"sheet":"6. Avg Nt Fix Ass &UCC","index":5,"n_rows":122,"n_cols":8,"rows_kept":122,"cut":false,"hidden":false,"merged":[[0,1,0,4]]}
[null,"Sheet 6. Avg Net Fixed Assets &UCC"]
[]
[]
[null,"Smart Meter Average Net Fixed Assets"]
[null,null,{"$f":"'2. Smart Meter Data'!D4","v":2006},{"$f":"'2. Smart Meter Data'!E4","v":2007},{"$f":"'2. Smart Meter Data'!F4","v":2008},{"$f":"'2. Smart Meter Data'!G4","v":2009},{"$f":"'2. Smart Meter Data'!H4","v":2010},{"$f":"'2. Smart Meter Data'!I4","v":2011}]
[null,"Net Fixed Assets - Smart Meters",{"$f":"'2. Smart Meter Data'!D5","v":"Audited Actual"},{"$f":"'2. Smart Meter Data'!E5","v":"Audited Actual"},{"$f":"'2. Smart Meter Data'!F5","v":"Audited Actual"},{"$f":"'2. Smart Meter Data'!G5","v":"Audited Actual"},{"$f":"'2. Smart Meter Data'!H5","v":"Actual"},{"$f":"'2. Smart Meter Data'!I5","v":"Forecasted"}]
[]
[null,"Opening Capital Investment",0,{"$f":"C10","v":0},{"$f":"D10","v":0},{"$f":"E10","v":0},{"$f":"F10","v":286348.23},{"$f":"G10","v":297485.13}]
[null,"Capital Investment (3.  LDC Assumptions and Data)",{"$f":"'3.  LDC Assumptions and Data'!C31","v":0},{"$f":"'3.  LDC Assumptions and Data'!D31","v":0},{"$f":"'3.  LDC Assumptions and Data'!E31","v":0},{"$f":"'3.  LDC Assumptions and Data'!F31","v":286348.23},{"$f":"'3.  LDC Assumptions and Data'!G31","v":11136.9},{"$f":"'3.  LDC Assumptions and Data'!H31","v":9400}]
[null,"Closing Capital Investment",{"$f":"SUM(C8:C9)","v":0},0,0,286348.23,297485.13,306885.13]
[]
[null,"Opening Accumulated Amortization",0,{"$f":"C14","v":0},{"$f":"D14","v":0},{"$f":"E14","v":0},{"$f":"F14","v":9544.9409999999989},{"$f":"G14","v":29006.052999999996}]
[null,{"$f":"\"Amortization (\"&'3.  LDC Assumptions and Data'!C60&\" Years  Straight Line)\"","v":"Amortization (15 Years  Straight Line)"},{"$f":"IF(C12+(C8/'3.  LDC Assumptions and Data'!C60)+(C9/'3.  LDC Assumptions and Data'!C60/2)<C10,(C8/'3.  LDC Assumptions and Data'!C60)+(C9/'3.  LDC Assumptions and Data'!C60/2),C10-C12)","v":0},{"$f":"IF(D12+(D8/'3.  LDC Assumptions and Data'!D60)+(D9/'3.  LDC Assumptions and Data'!D60/2)<D10,(D8/'3.  LDC Assumptions and Data'!D60)+(D9/'3.  LDC Assumptions and Data'!D60/2),D10-D12)","v":0},{"$f":"IF(E12+(E8/'3.  LDC Assumptions and Data'!E60)+(E9/'3.  LDC Assumptions and Data'!E60/2)<E10,(E8/'3.  LDC Assumptions and Data'!E60)+(E9/'3.  LDC Assumptions and Data'!E60/2),E10-E12)","v":0},{"$f":"IF(F12+(F8/'3.  LDC Assumptions and Data'!F60)+(F9/'3.  LDC Assumptions and Data'!F60/2)<F10,(F8/'3.  LDC Assumptions and Data'!F60)+(F9/'3.  LDC Assumptions and Data'!F60/2),F10-F12)","v":9544.9409999999989},{"$f":"IF(G12+(G8/'3.  LDC Assumptions and Data'!G60)+(G9/'3.  LDC Assumptions and Data'!G60/2)<G10,(G8/'3.  LDC Assumptions and Data'!G60)+(G9/'3.  LDC Assumptions and Data'!G60/2),G10-G12)","v":19461.111999999997},{"$f":"IF(H12+(H8/'3.  LDC Assumptions and Data'!H60)+(H9/'3.  LDC Assumptions and Data'!H60/2)<H10,(H8/'3.  LDC Assumptions and Data'!H60)+(H9/'3.  LDC Assumptions and Data'!H60/2),H10-H12)","v":20145.675333333333}]
[null,"Closing Accumulated Amortization",{"$f":"SUM(C12:C13)","v":0},0,0,9544.9409999999989,29006.052999999996,49151.728333333333]
[]
[null,"Opening Net Fixed Assets",{"$f":"0","v":0},{"$f":"C17","v":0},{"$f":"D17","v":0},{"$f":"E17","v":0},{"$f":"F17","v":276803.28899999999},{"$f":"G17","v":268479.07699999999}]
[null,"Closing Net Fixed Assets",{"$f":"C10-C14","v":0},0,0,276803.28899999999,268479.07699999999,257733.40166666667]
[null,"Average Net Fixed Assets",{"$f":"(C17+C16)/2","v":0},0,0,138401.64449999999,272641.18299999996,263106.23933333333]
[]
[null,null,{"$f":"C5","v":2006},2007,2008,2009,2010,2011]
{"$rows_left_out":103}
{"sheet":"7. Funding Adder Collected","index":6,"n_rows":81,"n_cols":11,"rows_kept":81,"cut":false,"hidden":false,"merged":[]}
[null,"Sheet 7. Smart Meter Funding Adder Collected",null,null,null,null,null,null,null," Approved Deferral and Variance Accounts "," CWIP Account"]
[null,null,null,null,null,null,null,null,null,"Prescribed Interest Rate (per the Bankers' Acceptances-3 months Plus 0.25 Spread)","Prescribed Interest Rate (per the DEX Mid Term Corporate Bond Index Yield 2)"]
["Date","Opening ","Fund Adder","Int. Rate","Interest","Closing",null,null,"Q2 2006 ",4.1399999999999997,4.68]
["2006-01-01",0,0,{"$f":"'3.  LDC Assumptions and Data'!$C$19","v":0},{"$f":"(B4*D4)/12","v":0},{"$f":"SUM(B4:C4,E4)","v":0},null,null,"Q3 2006 ",4.59,5.05]
["2006-02-01",{"$f":"F4","v":0},0,{"$f":"'3.  LDC Assumptions and Data'!$C$19","v":0},0,{"$f":"SUM(B5:C5,E5)","v":0},null,null,"Q4 2006 ",4.59,4.72]
["2006-03-01",0,0,{"$f":"'3.  LDC Assumptions and Data'!$C$19","v":0},0,0,null,null,"Q1 2007 ",4.59,4.72]
["2006-04-01",0,0,4.1399999999999999E-2,0,0,null,null,"Q2 2007 ",4.59,4.72]
["2006-05-01",0,0,4.1399999999999999E-2,0,0,null,null,"Q3 2007 ",4.59,5.18]
["2006-06-01",0,348.92,4.1399999999999999E-2,0,348.92,null,null,"Q4 2007 ",5.14,5.18]
["2006-07-01",348.92,348.92,4.5900000000000003E-2,1.3346190000000002,699.17461900000001,null,null,"Q1 2008 ",5.14,5.18]
["2006-08-01",699.17461900000001,348.92,4.5900000000000003E-2,2.6743429176750002,1050.7689619176749,null,null,"Q2 2008 ",4.08,5.18]
["2006-09-01",1050.7689619176749,348.92,4.5900000000000003E-2,4.0191912793351063,1403.70815319701,null,null,"Q3 2008 ",3.35,5.43]
["2006-10-01",1403.70815319701,348.92,4.5900000000000003E-2,5.3691836859785633,1757.9973368829887,null,null,"Q4 2008 ",3.35,5.43]
["2006-11-01",1757.9973368829887,348.92,4.5900000000000003E-2,6.7243398135774326,2113.6416766965663,null,null,"Q1 2009",2.4500000000000002,6.61]
["2006-12-01",2113.6416766965663,348.92,4.5900000000000003E-2,8.0846794133643662,2470.6463561099308,null,null,"Q2 2009",1,6.61]
["2007-01-01",2470.6463561099308,348.92,4.5900000000000003E-2,9.450222312120486,2829.0165784220512,null,null,"Q3 2009",0.55000000000000004,5.67]
["2007-02-01",2829.0165784220512,348.92,4.5900000000000003E-2,10.820988412464347,3188.7575668345157,null,null,"Q4 2009",0.55000000000000004,4.66]
["2007-03-01",3188.7575668345157,348.92,4.5900000000000003E-2,12.196997693142023,3549.8745645276576,null,null,"Q1 2010",0.55000000000000004,4.34]
["2007-04-01",3549.8745645276576,348.92,4.5900000000000003E-2,13.578270209318291,3912.3728347369761,null,null,"Q2 2010",0.55000000000000004,4.34]
["2007-05-01",3912.3728347369761,348.92,4.5900000000000003E-2,14.964826092868934,4276.257660829845,null,null,"Q3 2010",0.89,4.66]
{"$rows_left_out":62}
{"sheet":"8. Smart Meter Rate  Adder","index":7,"n_rows":20,"n_cols":4,"rows_kept":20,"cut":false,"hidden":false,"merged":[]}
[null,"Sheet 8 Applied for Smart Meter Rate Adder"]
[]
[]
[null,"Description","Amount"]
[null,"Revenue Requirement - 2006",{"$f":"'4. Smart Meter Rev Req'!E55","v":0}]
[null,"Revenue Requirement - 2007",{"$f":"'4. Smart Meter Rev Req'!H55","v":0}]
[null,"Revenue Requirement - 2008",{"$f":"'4. Smart Meter Rev Req'!K55","v":386.13501547308249}]
[null,"Revenue Requirement - 2009",{"$f":"'4. Smart Meter Rev Req'!N55","v":37007.822091202455}]
[null,"Revenue Requirement - 2010",{"$f":"'4. Smart Meter Rev Req'!Q55","v":69192.127096210126}]
[null,"Revenue Requirement - 2011",{"$f":"'4. Smart Meter Rev Req'!T55","v":77449.60203394953}]
[null,"Total Revenue Requirement",{"$f":"SUM(C5:C10)","v":184035.6862368352}]
[]
[null,"Smart Meter Rate Adder Collected",{"$f":"-'7. Funding Adder Collected'!C81","v":-44580.480000000003}]
[null,"Carrying Cost / Interest",{"$f":"-'7. Funding Adder Collected'!E81","v":-1088.4897200853841}]
[]
[null,"Proposed Smart Meter Recovery",{"$f":"SUM(C11:C14)","v":138366.71651674982}]
[]
[null,"2011 Expected Metered Customers",1275,"Does not include GS >50kW (No Expenditures incurred - Not Mandated yet)"]
[]
[null,"Proposed Smart Meter Rate Adder",{"$f":"IF(C18<>0,C16/C18/12,0)","v":9.043576242924825},"Starting May 1, 2011"]