{"text_format":"1","workbook":"xlsx","n_sheets":41,"sheets":["LDC Info","Index","App.2-A_Capital Projects","App.2-B_FA Contin CGAAP 2009","App.2-B_FA Contin CGAAP 2010","App.2-B_FA Contin CGAAP 2011","App.2-B_FA Contin CGAAP 2012","App.2-B_FA Contin MIFRS 2012","App.2-B_FA Contin MIFRS 2013","App.2-CE_CGAAP_DepExp_2011","App.2-CF_CGAAP_DepExp_2012","App.2-CG_MIFRS_DepExp_2012","App.2-CH_MIFRS_DepExp_2013","App.2-D_Overhead","App.2-EB_PP&E Deferral Account","App.2-F_Other_Oper_Rev","App.2-G_Detailed_OM&A_Expenses","App.2-H_OM&A_Detailed_Analysis","App.2-I_OM&A_Summary_Analys","App.2-J_OM&A_Cost _Drivers","App.2-K_Employee Costs","App.2-L_OM&A_per_Cust_FTEE","App.2-M_Regulatory_Costs","App.2-N_Corp_Cost_Allocation","App.2-OA Capital Structure","App.2-OB_Debt Instruments","App.2-P_Cost_Allocation","App.2-Q_Cost of Serv. Emb. Dx","App.2-R_Loss Factors","App.2-S_Stranded Meters","App.2-T_1592_Tax_Variance","App.2-U_IFRS Transition Costs","App.2-V_Rev_Reconciliation","App.2-W_Residential Impacts","App.2.W_GS.50 Impacts","App.2.W_GS<50 -4999 Impacts","App.2.W_Sentinel Light Impacts","App.2.W_Streetlight Impacts","App.2.W. USL Impacts","App.2-X_CoS_Flowchart","Sheet5"],"not_rendered":{"charts":0,"images":3,"macros":1,"external_links":5,"defined_names":36,"comments":2,"pivot_tables":0},"unopened":[],"bounds":{"document_bytes":16777216,"sheet_cells":100000,"rows_first":2000,"rows_last":500,"rows_between":2000,"halvings":0,"cell_chars":16384,"cell_head_chars":4096},"cells_cut":0,"cells_raw":0,"read":"whole","date_system":"1900"}

{"sheet":"LDC Info","index":0,"n_rows":80,"n_cols":27,"rows_kept":80,"cut":false,"hidden":false,"merged":[[19,4,19,10],[33,2,33,11],[37,2,37,12],[13,4,13,10],[15,4,15,8],[17,4,17,8],[21,4,21,8],[23,4,23,8],[25,4,25,6],[27,4,27,6],[35,2,35,13],[29,4,29,6]]}
[]
[]
[null,null,null,null,null,null,null,null,null,null,null,null,null,null,null,null,null,null,null,null,null,null,null,null,null,null,"Algoma Power Inc."]
[null,null,null,null,null,null,null,null,null,null,null,null,null,null,null,null,null,null,null,null,null,null,null,null,null,null,"Atikokan Hydro Inc."]
[null,null,null,null,null,null,null,null,null,null,null,null,null,null,null,null,null,null,null,null,null,null,null,null,null,null,"Attawapiskat Power Corporation"]
[null,null,null,null,null,null,null,null,null,null,null,null,null,null,null,null,null,null,null,null,null,null,null,null,null,null,"Bluewater Power Distribution Corp."]
[null,null,null,null,null,null,null,null,null,null,null,null,null,null,null,null,null,null,null,null,null,null,null,null,null,null,"Brant County Power"]
[null,null,null,null,null,null,null,null,null,null,null,null,null,null,null,null,null,null,null,null,null,null,null,null,null,null,"Brantford Power Inc."]
[null,null,null,null,null,null,null,null,null,null,null,null,null,null,null,null,null,null,null,null,null,null,null,null,null,null,"Burlington Hydro Inc."]
[null,null,null,null,null,null,null,null,null,null,null,null,null,null,null,null,null,null,null,null,null,null,null,null,null,null,"Cambridge and North Dumfries Hydro"]
[null,null,null,null,null,null,null,null,null,null,null,null,null,null,null,null,null,null,null,null,null,null,null,null,null,null,"Canadian Niagara Power Inc. – Eastern Ontario Power/Fort Erie/Port Colborne"]
[null,null,null,null,null,null,null,null,null,null,null,null,null,null,null,null,null,null,null,null,null,null,null,null,null,null,"Centre Wellington Hydro Ltd."]
[null,null,null,null,null,null,null,null,null,null,null,null,null,"Version 1.1",null,null,null,null,null,null,null,null,null,null,null,null,"Chapleau Public Utilities Corporation"]
[null,null,null,"Utility Name   ","Innisfil Hydro Dist. Systems Limited",null,null,null,null,null,null,null,null,null,null,null,null,null,null,null,null,null,null,null,null,null,"COLLUS Power Corp."]
[null,null,null,null,null,null,null,null,null,null,null,null,null,null,null,null,null,null,null,null,null,null,null,null,null,null,"Cooperative Hydro Embrun Inc."]
[null,null,null,"Service Territory",null,null,null,null,null,null,null,null,null,null,null,null,null,null,null,null,null,null,null,null,null,null,"E.L.K. Energy Inc."]
[null,null,null,null,null,null,null,null,null,null,null,null,null,null,null,null,null,null,null,null,null,null,null,null,null,null,"Enersource Hydro Mississauga Inc."]
[null,null,null,"Assigned EB Number","EB-2012-0139",null,null,null,null,null,null,null,null,null,null,null,null,null,null,null,null,null,null,null,null,null,"Entegrus Powerlines Inc."]
[null,null,null,null,null,null,null,null,null,null,null,null,null,null,null,null,null,null,null,null,null,null,null,null,null,null,"ENWIN Utilities Ltd."]
[null,null,null,"Name of Contact and Title","Brenda Pinke, Regulatory and CDM Manager",null,null,null,null,null,null,null,null,null,null,null,null,null,null,null,null,null,null,null,null,null,"Erie Thames Powerlines Corp."]
[null,null,null,null,null,null,null,null,null,null,null,null,null,null,null,null,null,null,null,null,null,null,null,null,null,null,"Espanola Regional Hydro Distribution Corporation"]
[null,null,null,"Phone Number   ","705-431-6870 ext 262",null,null,null,null,null,null,null,null,null,null,null,null,null,null,null,null,null,null,null,null,null,"Essex Powerlines Corporation"]
[null,null,null,null,null,null,null,null,null,null,null,null,null,null,null,null,null,null,null,null,null,null,null,null,null,null,"Festival Hydro Inc."]
[null,null,null,"Email Address   ","brendap@innisfilhydro.com",null,null,null,null,null,null,null,null,null,null,null,null,null,null,null,null,null,null,null,null,null,"Fort Albany Power Corporation"]
[null,null,null,null,null,null,null,null,null,null,null,null,null,null,null,null,null,null,null,null,null,null,null,null,null,null,"Fort Frances Power Corporation"]
[null,null,null,"Bridge Year",2012,null,null,null,null,null,null,null,null,null,null,null,null,null,null,null,null,null,null,null,null,null,"Greater Sudbury Hydro Inc."]
[null,null,null,null,null,null,null,null,null,null,null,null,null,null,null,null,null,null,null,null,null,null,null,null,null,null,"Grimsby Power Inc."]
[null,null,null,"Test Year",2013,null,null,null,null,null,null,null,null,null,null,null,null,null,null,null,null,null,null,null,null,null,"Guelph Hydro Electric Systems Inc."]
[null,null,null,null,null,null,null,null,null,null,null,null,null,null,null,null,null,null,null,null,null,null,null,null,null,null,"Haldimand County Hydro Inc."]
[null,null,null,"Last Rebasing Year",2009,null,null,null,null,null,null,null,null,null,null,null,null,null,null,null,null,null,null,null,null,null,"Guelph Hydro Electric Systems Inc."]
[null,null,null,null,null,null,null,null,null,null,null,null,null,null,null,null,null,null,null,null,null,null,null,null,null,null,"Halton Hills Hydro Inc."]
[null,"Notes",null,null,null,null,null,null,null,null,null,null,null,null,null,null,null,null,null,null,null,null,null,null,null,null,"Hearst Power Distribution Co. Ltd."]
[null,null,null,null,null,null,null,null,null,null,null,null,null,null,null,null,null,null,null,null,null,null,null,null,null,null,"Horizon Utilities Corporation"]
[null,null,"Pale green cells represent input cells.",null,null,null,null,null,null,null,null,null,null,null,null,null,null,null,null,null,null,null,null,null,null,null,"Hydro 2000 Inc."]
[null,null,null,null,null,null,null,null,null,null,null,null,null,null,null,null,null,null,null,null,null,null,null,null,null,null,"Hydro Hawkesbury Inc."]
[null,null,"Pale blue cells represent drop-down lists.  The applicant should select the appropriate item from the drop-down list.",null,null,null,null,null,null,null,null,null,null,null,null,null,null,null,null,null,null,null,null,null,null,null,"Hydro One Brampton Networks Inc."]
[null,null,null,null,null,null,null,null,null,null,null,null,null,null,null,null,null,null,null,null,null,null,null,null,null,null,"Hydro One Networks Inc."]
[null,null,"White cells contain fixed values, automatically generated values or formulae. ",null,null,null,null,null,null,null,null,null,null,null,null,null,null,null,null,null,null,null,null,null,null,null,"Hydro One Remote Communities Inc."]
[null,null,null,null,null,null,null,null,null,null,null,null,null,null,null,null,null,null,null,null,null,null,null,null,null,null,"Hydro Ottawa Limited"]
[null,null,null,null,null,null,null,null,null,null,null,null,null,null,null,null,null,null,null,null,null,null,null,null,null,null,"Innisfil Hydro Dist. Systems Limited"]
[null,null,null,null,null,null,null,null,null,null,null,null,null,null,null,null,null,null,null,null,null,null,null,null,null,null,"Kashechewan Power Corporation"]
[null,null,null,null,null,null,null,null,null,null,null,null,null,null,null,null,null,null,null,null,null,null,null,null,null,null,"Kenora Hydro Electric Corporation Ltd."]
[null,null,null,null,null,null,null,null,null,null,null,null,null,null,null,null,null,null,null,null,null,null,null,null,null,null,"Kingston Hydro Corporation"]
[null,null,null,null,null,null,null,null,null,null,null,null,null,null,null,null,null,null,null,null,null,null,null,null,null,null,"Kitchener-Wilmot Hydro Inc."]
[null,null,null,null,null,null,null,null,null,null,null,null,null,null,null,null,null,null,null,null,null,null,null,null,null,null,"Lakefront Utilities Inc."]
[null,null,null,null,null,null,null,null,null,null,null,null,null,null,null,null,null,null,null,null,null,null,null,null,null,null,"Lakeland Power Distribution Ltd."]
[null,null,null,null,null,null,null,null,null,null,null,null,null,null,null,null,null,null,null,null,null,null,null,null,null,null,"London Hydro Inc."]
[null,null,null,null,null,null,null,null,null,null,null,null,null,null,null,null,null,null,null,null,null,null,null,null,null,null,"Midland Power Utility Corporation"]
[null,null,null,null,null,null,null,null,null,null,null,null,null,null,null,null,null,null,null,null,null,null,null,null,null,null,"Milton Hydro Distribution Inc."]
[null,null,null,null,null,null,null,null,null,null,null,null,null,null,null,null,null,null,null,null,null,null,null,null,null,null,"Newmarket – Tay Power Distribution Ltd."]
[null,null,null,null,null,null,null,null,null,null,null,null,null,null,null,null,null,null,null,null,null,null,null,null,null,null,"Niagara Peninsula Energy Inc."]
[null,null,null,null,null,null,null,null,null,null,null,null,null,null,null,null,null,null,null,null,null,null,null,null,null,null,"Niagara-on-the-Lake Hydro Inc."]
[null,null,null,null,null,null,null,null,null,null,null,null,null,null,null,null,null,null,null,null,null,null,null,null,null,null,"Norfolk Power Distribution Ltd."]
[null,null,null,null,null,null,null,null,null,null,null,null,null,null,null,null,null,null,null,null,null,null,null,null,null,null,"North Bay Hydro Distribution Limited"]
[null,null,null,null,null,null,null,null,null,null,null,null,null,null,null,null,null,null,null,null,null,null,null,null,null,null,"Northern Ontario Wires Inc."]
[null,null,null,null,null,null,null,null,null,null,null,null,null,null,null,null,null,null,null,null,null,null,null,null,null,null,"Oakville Hydro Distribution Inc."]
[null,null,null,null,null,null,null,null,null,null,null,null,null,null,null,null,null,null,null,null,null,null,null,null,null,null,"Orangeville Hydro Limited"]
[null,null,null,null,null,null,null,null,null,null,null,null,null,null,null,null,null,null,null,null,null,null,null,null,null,null,"Orillia Power Distribution Corp."]
[null,null,null,null,null,null,null,null,null,null,null,null,null,null,null,null,null,null,null,null,null,null,null,null,null,null,"Oshawa PUC Networks Inc."]
[null,null,null,null,null,null,null,null,null,null,null,null,null,null,null,null,null,null,null,null,null,null,null,null,null,null,"Ottawa River Power Corporation"]
[null,null,null,null,null,null,null,null,null,null,null,null,null,null,null,null,null,null,null,null,null,null,null,null,null,null,"Parry Sound Power Corporation"]
[null,null,null,null,null,null,null,null,null,null,null,null,null,null,null,null,null,null,null,null,null,null,null,null,null,null,"Peterborough Distribution Inc."]
[null,null,null,null,null,null,null,null,null,null,null,null,null,null,null,null,null,null,null,null,null,null,null,null,null,null,"PowerStream Inc."]
[null,null,null,null,null,null,null,null,null,null,null,null,null,null,null,null,null,null,null,null,null,null,null,null,null,null,"PUC Distribution Inc."]
[null,null,null,null,null,null,null,null,null,null,null,null,null,null,null,null,null,null,null,null,null,null,null,null,null,null,"Renfrew Hydro Inc."]
[null,null,null,null,null,null,null,null,null,null,null,null,null,null,null,null,null,null,null,null,null,null,null,null,null,null,"Rideau St. Lawrence Distribution Inc."]
[null,null,null,null,null,null,null,null,null,null,null,null,null,null,null,null,null,null,null,null,null,null,null,null,null,null,"St. Thomas Energy Inc."]
[null,null,null,null,null,null,null,null,null,null,null,null,null,null,null,null,null,null,null,null,null,null,null,null,null,null,"Sioux Lookout Hydro Inc."]
[null,null,null,null,null,null,null,null,null,null,null,null,null,null,null,null,null,null,null,null,null,null,null,null,null,null,"Thunder Bay Hydro Electricity Distribution"]
[null,null,null,null,null,null,null,null,null,null,null,null,null,null,null,null,null,null,null,null,null,null,null,null,null,null,"Tillsonburg Hydro Inc."]
[null,null,null,null,null,null,null,null,null,null,null,null,null,null,null,null,null,null,null,null,null,null,null,null,null,null,"Toronto Hydro-Electric System Limited"]
[null,null,null,null,null,null,null,null,null,null,null,null,null,null,null,null,null,null,null,null,null,null,null,null,null,null,"Veridian Connections Inc."]
[null,null,null,null,null,null,null,null,null,null,null,null,null,null,null,null,null,null,null,null,null,null,null,null,null,null,"Wasaga Distribution Inc."]
[null,null,null,null,null,null,null,null,null,null,null,null,null,null,null,null,null,null,null,null,null,null,null,null,null,null,"Waterloo North Hydro Inc."]
[null,null,null,null,null,null,null,null,null,null,null,null,null,null,null,null,null,null,null,null,null,null,null,null,null,null,"Welland Hydro Electric System Corp."]
[null,null,null,null,null,null,null,null,null,null,null,null,null,null,null,null,null,null,null,null,null,null,null,null,null,null,"Wellington North Power Inc."]
[null,null,null,null,null,null,null,null,null,null,null,null,null,null,null,null,null,null,null,null,null,null,null,null,null,null,"West Coast Huron Energy Inc."]
[null,null,null,null,null,null,null,null,null,null,null,null,null,null,null,null,null,null,null,null,null,null,null,null,null,null,"Westario Power Inc."]
[null,null,null,null,null,null,null,null,null,null,null,null,null,null,null,null,null,null,null,null,null,null,null,null,null,null,"Whitby Hydro Electric Corporation"]
[null,null,null,null,null,null,null,null,null,null,null,null,null,null,null,null,null,null,null,null,null,null,null,null,null,null,"Woodstock Hydro Services Inc."]

{"sheet":"Index","index":1,"n_rows":32,"n_cols":6,"rows_kept":32,"cut":false,"hidden":false,"merged":[]}
[]
[]
[]
[]
[]
[]
[]
[]
[]
[]
[]
[]
[]
[]
[1,"LDC Information Sheet",null,null,19,"Appendix 2-H OM&A Detailed Analysis"]
[2,"Index",null,null,20,"Appendix 2-I OM&A Summary Analysis"]
[3,"Appendix 2-A Capital Projects",null,null,21,"Appendix 2-J OM&A Cost  Drivers"]
[4,"Appendix 2-B Fixed Asset Continuity",null,null,22,"Appendix 2-K Employee Costs"]
[5,"Appendix 2-CA CGAAP Depreciation Expense 2011",null,null,23,"Appendix 2-L OM&A per Cust FTEE"]
[6,"Appendix 2-CB MIFRS Depreciation Expense 2011",null,null,24,"Appendix 2-M Regulatory Costs"]
[7,"Appendix 2-CC MIFRS Depreciation Expense 2012",null,null,25,"Appendix 2-N Corp Cost Allocation"]
[8,"Appendix 2-CD MIFRS Depreciation Expense 2013",null,null,26,"Appendix 2-OA Capital Structure and Cost of Capital"]
[9,"Appendix 2-CE CGAAP Depreciation Expense 2011",null,null,27,"Appendix 2-OB Debt Instruments"]
[10,"Appendix 2-CF CGAAP Depreciation Expense 2012",null,null,28,"Appendix 2-P Cost Allocation"]
[11,"Appendix 2-CG MIFRS Depreciation Expense 2012",null,null,29,"Appendix 2-Q Cost of Service Embedded Distributor"]
[12,"Appendix 2-CH MIFRS Depreciation Expense 2013",null,null,30,"Appendix 2-R Loss Factors"]
[13,"Appendix 2-CI Alternative Accounting Standards Depreciation Expense",null,null,31,"Appendix 2-S Stranded Meters"]
[14,"Appendix 2-D Overhead",null,null,32,"Appendix 2-T 1592 Tax Variance"]
[15,"Appendix 2-EA PP&E Deferral Account - 2012 IFRS Adopters",null,null,33,"Appendix 2-U IFRS Transition Costs"]
[16,"Appendix 2-EB PP&E Deferral Account - 2013 IFRS Adopters",null,null,34,"Appendix 2-V Rev Reconciliation"]
[17,"Appendix 2-F Other Operating Revenue",null,null,35,"Appendix 2-W Bill Impacts"]
[18,"Appendix 2-G Detailed OM&A Expenses",null,null,36,"Appendix 2-X CoS Flowchart"]

{"sheet":"App.2-A_Capital Projects","index":2,"n_rows":140,"n_cols":8,"rows_kept":140,"cut":false,"hidden":false,"merged":[[11,0,11,7],[141,0,142,8],[9,0,9,7],[8,0,8,7],[137,0,137,7],[139,0,139,7]]}
[null,null,null,null,null,null,"File Number:",{"$f":"'LDC Info'!$E$18","v":"EB-2012-0139"}]
[null,null,null,null,null,null,"Exhibit:","Exhibit 2"]
[null,null,null,null,null,null,"Tab:","Tab 3"]
[null,null,null,null,null,null,"Schedule:","Schedule 2"]
[null,null,null,null,null,null,"Page:"]
[]
[null,null,null,null,null,null,"Date:","2012-08-31"]
[]
["Appendix 2-A"]
["Capital Projects Table"]
[]
[]
["Projects",{"$f":"IF(ISBLANK('LDC Info'!E26), \"Year 1\", 'LDC Info'!E26-5)","v":2007},{"$f":"IF(ISBLANK('LDC Info'!E26), \"Year 2\", 'LDC Info'!E26-4)","v":2008},{"$f":"IF(ISBLANK('LDC Info'!E26), \"Year 3\", 'LDC Info'!E26-3)","v":2009},{"$f":"IF(ISBLANK('LDC Info'!E26), \"Year 4\", 'LDC Info'!E26-2)","v":2010},{"$f":"IF(ISBLANK('LDC Info'!E26), \"Year 5\", 'LDC Info'!E26-1)","v":2011},{"$f":"'LDC Info'!E26 & \" Bridge Year\"","v":"2012 Bridge Year"},{"$f":"'LDC Info'!E28 & \" Test Year\"","v":"2013 Test Year"}]
["Reporting Basis"]
["2009 Distribution Plant"]
["DO-001 Pole Replacement",null,null,257033]
["DO-002 44kv load interruptors",null,null,255043]
["DO-003 Transformer Replacement",null,null,67421]
["DO-004 9M4 extension-20 SR 10th Ln & Lockhart rd",null,null,136224]
["DO-005 Recloser automation & replacement",null,null,84062]
["DO-007 27.6 SCADA mates",null,null,136546]
["DO-008 44 kV line ext 20th SR Lockhart to Fairway Rd ",null,null,424900]
["DO-010 Wholesale meters",null,null,61125]
["DO-011 Guard Rails",null,null,41065]
["DO-012 Urbanization",null,null,1186136]
["DO-015 Infrastructure betterments",null,null,147760]
["DO -017 Line Extension",null,null,656280]
["Base",null," ",293604]
["Meter Disposals",null,null,-1270515]
["Sub-Total",{"$f":"SUM(B26:B27)","v":0},{"$f":"SUM(C26:C27)","v":0},{"$f":"SUM(D15:D29)","v":2476684},{"$f":"SUM(E26:E27)","v":0},{"$f":"SUM(F26:F27)","v":0},{"$f":"SUM(G26:G27)","v":0},{"$f":"SUM(H26:H27)","v":0}]
["2009 General Plant"]
["GB-008 - Network Upgrades, Servers, Workstations",null,null,88448]
["Sub-Total",{"$f":"SUM(B28:B32)","v":0},0,{"$f":"D32","v":88448},0,0,0,0]
["2010 Distribution Plant "]
["DO-006- 20th SR & 7th line extension"]
["DO-008 - Urbanization Precinct 1",null,null," ",323380]
["DO-010 - Pole replacement",null,null," ",421017]
["DO-011-Replace porcelain swirches",null,null," ",157558]
["DO-015- DS oil re-inhibit treatment",null,null," ",12207]
["DO-016 - Replace coiling fans Tempo plastics",null,null," ",17205]
["DO-018 - Urbanization Precinct 2a & 3",null,null," ",2332944]
["DO-020 - 20th SR & 6th Line extension",null,null," ",546690]
["Base",null,null," ",272872]
["Meter Disposals",null,null," ",-492071]
["Sub-Total",{"$f":"SUM(B42:B44)","v":0},{"$f":"SUM(C42:C44)","v":0},{"$f":"SUM(D42:D44)","v":0},{"$f":"SUM(E35:E44)","v":3591802},{"$f":"SUM(F42:F44)","v":0},{"$f":"SUM(G42:G44)","v":0},{"$f":"SUM(H42:H44)","v":0}]
["2010 General Plant"]
["GB-001 Network upgrades and redundancy servers",null,null,null,64210]
["GO-010 Fleet trucks",null,null,null,621180]
["GO-008 Fleet tools",null,null,null,260656]
["Sub-Total",{"$f":"SUM(B47:B49)","v":0},0,0,946046,0,0,0]
["2011Distribution Plant"]
["DO-001 Hwy 89 reconductoring (5th SDRD to Younge ST)",null,null,null,null,200328.37999999998]
["DO-002 Leonards Beach Major Betterment",null,null,null,null,264261.75]
["DO_003 20th SD RD/10th Line extension",null,null,null,null,285119.40000000002]
["DO-006 Reclosurer refurbishments",null,null,null,null,160715.37]
["DO-007 Pole replacement",null,null,null,null,254296.56]
["DO-008 Infrastructure betterments",null,null,null,null,104256]
["DO-009 30th line extension &44kv reconductoring",null,null,null,null,567330.76000000013]
["DO-010 Substation security",null,null,null,null,20029.7]
["DO-011 Hwy 89 & 10SDRD road widening",null,null,null,null,277241.30000000005]
["DO-013 Padmount transformer replacements",null,null,null,null,45081.67]
["DO-014 Substandard transformer re-habs",null,null,null,null,67520.590000000011]
["DO-015 IBR URB precinct 1",null,null,null,null,41358.250000000007]
["DO-016 IBR URB precinct 2a teardown",null,null,null,null,229231.69000000006]
["Storms",null,null,null,null,115256.65999999997]
["Economic evaluation - Woodland Park",null,null,null,null,207565.03000000073]
["Base",null,null,null,null,410360]
["Sub-Total",{"$f":"SUM(B66:B67)","v":0},{"$f":"SUM(C66:C67)","v":0},{"$f":"SUM(D66:D67)","v":0},{"$f":"SUM(E66:E67)","v":0},{"$f":"SUM(F52:F67)","v":3249953.1100000008},{"$f":"SUM(G66:G67)","v":0},{"$f":"SUM(H66:H67)","v":0}]
["2011 General Plant"]
["GB-001 Network upgrades and Hardware",null,null,null,null,86927]
["GO-007 Fleet  Trucks",null,null,null,null,297131]
["GO-008 Fleet tools",null,null,null,null,58448]
["Sub-Total",{"$f":"SUM(B71:B72)","v":0},{"$f":"SUM(C71:C72)","v":0},{"$f":"SUM(D71:D72)","v":0},{"$f":"SUM(E71:E72)","v":0},{"$f":"SUM(F69:F72)","v":442506},{"$f":"SUM(G71:G72)","v":0},{"$f":"SUM(H71:H72)","v":0}]
["2012 Distribution Plant"]
["DO-005",null,null,null,null,null,389270]
["DO-006",null,null,null,null,null,166850]
["DO-007",null,null,null,null,null,33186]
["DO-009",null,null,null,null,null,157808]
["DO-010",null,null,null,null,null,144906]
["DO-012",null,null,null,null,null,67600]
["DO-013",null,null,null,null,null,172110]
["DO-015",null,null,null,null,null,191876]
["DO-016",null,null,null,null,null,197173]
["DO-017",null,null,null,null,null,379402]
["DO-018",null,null,null,null,null,24000]
["DO-019",null,null,null,null,null,154850]
["DO-021",null,null,null,null,null,20020]
["DO-022",null,null,null,null,null,465000]
["DB-001",null,null,null,null,null,74000]
["Base",null,null,null,null,null,583370]
["Smart Meter true up",null,null,null,null,null,11384]
["Sub-Total",{"$f":"SUM(B89:B91)","v":0},{"$f":"SUM(C89:C91)","v":0},{"$f":"SUM(D89:D91)","v":0},{"$f":"SUM(E89:E91)","v":0},0,{"$f":"SUM(G75:G91)","v":3232805},{"$f":"SUM(H89:H91)","v":0}]
["2012 General Plant"]
["GO-010  New Building ",null,null,null,null,null,2000000," "]
["GB-001 Hardware &Software",null,null,null,null,null,193000]
["GO-012 Eng topobase & IFRS enhancements",null,null,null,null,null,164150]
["GO - 011 Scada program conversion",null,null,null,null,null,200000]
["DO-009 27.6kv Scada controlled intercept",null,null,null,null,null,68700]
["Smart Meter true up",null,null,null,null,null,93156]
["Sub-Total",0,0,0,0,0,{"$f":"SUM(G93:G99)","v":2719006},0]
["2013 Distribution Plant"]
["DO-001",null,null,null,null,null," ",207300]
["DO-002",null,null,null,null,null," ",144500]
["DO-003",null,null,null,null,null," ",181180]
["DO-004",null,null,null,null,null," ",210900]
["DO-005",null,null,null,null,null," ",79700]
["DO-006",null,null,null,null,null," ",182700]
["DO-007",null,null,null,null,null," ",391288]
["DO-008",null,null,null,null,null," ",724294]
["DO-009",null,null,null,null,null," ",110743]
["DO-010",null,null,null,null,null," ",68074]
["DB-001",null,null,null,null,null," ",115900]
["Base",null,null,null,null,null," ",615376]
["Sub-Total",0,0,0,0,0,{"$f":"SUM(G102:G113)","v":0},{"$f":"SUM(H102:H113)","v":3031955}]
["2013 General Plant"]
["GB-001 Network Infrastructure for New building",null,null,null,null,null," ",87500]
["GO-010 New building",null,null,null,null,null," ",5000000]
["GB-003 Hardware",null,null,null,null,null," ",185000]
["GO-010Eng topobase & IFRS enhancement",null,null,null,null,null," ",171000]
["GO-003 2 Fleet trucks",null,null,null,null,null," ",80000]
["GO-007 System Supervisory",null,null,null,null,null," ",62000]
["GO-008 Capacitor intelilink to SCADA",null,null,null,null,null,null,51400]
["DO - 003 27.6kv mechanized SCADA load interpt",null,null,null,null,null,null,72000]
["Sub-Total",0,0,0,0,0,{"$f":"SUM(G112:G123)","v":0},{"$f":"SUM(H116:H123)","v":5708900}]
[]
[]
["Miscellaneous"]
["Miscellaneous 2009",null,null,257438]
["Miscellaneous 2010",null,null,null,188227]
["Miscellaneous 2011",null,null,null,null,201860]
["Miscellaneous 2012",null,null,null,null,null,236650]
["Miscellaneous 2013",null,null,null,null,null,null,279997]
["Total",{"$f":"SUMPRODUCT(--($A15:$A101=\"Sub-Total\"), B$15:B$101)+B101","v":0},{"$f":"SUMPRODUCT(--($A15:$A101=\"Sub-Total\"), C$15:C$101)+C101","v":0},{"$f":"SUM(D30+D33)+D128","v":2822570},{"$f":"E45+E50+E129","v":4726075},{"$f":"F68+F73+F130","v":3894319.1100000008},{"$f":"G92+G100+G131","v":6188461},{"$f":"H114+H124+H132","v":9020852}]
[]
[]
["Notes:"]
[]
["1   Please provide a breakdown of the major components of each capital project.  Please ensure that all projects below the materiality threshold are included in the miscellaneous line.  Add more projects as required."]
[]
["2   Amounts should be reported on a MIFRS basis for the adoption year and any subsequent years, only."]

{"sheet":"App.2-B_FA Contin CGAAP 2009","index":3,"n_rows":73,"n_cols":14,"rows_kept":73,"cut":false,"hidden":false,"merged":[[9,0,9,13],[8,0,8,13],[64,1,65,13],[70,1,70,13],[13,4,13,7],[67,1,68,13]]}
[null,null,null,null,null,null,null,null,null,null,null,null,"File Number:",{"$f":"'LDC Info'!$E$18","v":"EB-2012-0139"}]
[null,null,null,null,null,null,null,null,null,null,null,null,"Exhibit:",2]
[null,null,null,null,null,null,null,null,null,null,null,null,"Tab:",2]
[null,null,null,null,null,null,null,null,null,null,null,null,"Schedule:",1]
[null,null,null,null,null,null,null,null,null,null,null,null,"Page:",6]
[]
[null,null,null,null,null,null,null,null,null,null,null,null,"Date:","2012-08-31"]
[]
["Appendix 2-B"]
["Fixed Asset Continuity Schedule"]
[]
[null,null,null,null,null,"Year ",2009]
[]
[null,null,null,null,"Cost",null,null,null,null,null,"Accumulated Depreciation"]
["CCA Class","OEB","Description","Depreciation Rate","Opening Balance","Additions","Disposals","Closing Balance",null,"Opening Balance","Additions","Disposals","Closing Balance","Net Book Value"]
[12,1611,"Computer Software (Formally known as Account 1925)",null,855124,129940,null,{"$f":"E16+F16+G16","v":985064},null,-687862,-113942,null,{"$f":"J16+K16+L16","v":-801804},{"$f":"H16+M16","v":183260}]
["CEC",1612,"Land Rights (Formally known as Account 1906)",null,null,null,null,{"$f":"E17+F17+G17","v":0},null,null,null,null,{"$f":"J17+K17+L17","v":0},{"$f":"H17+M17","v":0}]
["N/A",1805,"Land",null,282031,null,-8261,{"$f":"E18+F18+G18","v":273770},null,null,null,null,{"$f":"J18+K18+L18","v":0},{"$f":"H18+M18","v":273770}]
["CEC",1806,"Land Rights",null,965425,11122,null,{"$f":"E19+F19+G19","v":976547},null,-512797,-14883,null,{"$f":"J19+K19+L19","v":-527680},{"$f":"H19+M19","v":448867}]
[47,1808,"Buildings",null,null,null,null,{"$f":"E20+F20+G20","v":0},null,null,null,null,{"$f":"J20+K20+L20","v":0},{"$f":"H20+M20","v":0}]
[13,1810,"Leasehold Improvements",null,86252,null,null,86252,null,-24150,-3450,null,-27600,58652]
[47,1815,"Transformer Station Equipment >50 kV",null,null,null,null,0,null,null,null,null,0,0]
[47,1820,"Distribution Station Equipment <50 kV",null,4297046,91039,null,4388085,null,-2146513,-142270,null,-2288783,2099302]
[47,1825,"Storage Battery Equipment",null,null,null,null,0,null,null,null,null,0,0]
[47,1830,"Poles, Towers & Fixtures",null,6727068,792949,null,7520017,null,-3423845,-287398,null,-3711243,3808774]
[47,1835,"Overhead Conductors & Devices",null,9716063,1549227,null,11265290,null,-6561447,-418334,null,-6979781,4285509]
[47,1840,"Underground Conduit",null,1771982,11848,null,1783830,null,-268045,-70964,null,-339009,1444821]
[47,1845,"Underground Conductors & Devices",null,5931254,1795662,null,7726916,null,-3219011,-272619,null,-3491630,4235286]
[47,1850,"Line Transformers",null,7595912,247676,null,7843588,null,-4645272,-300997,null,-4946269,2897319]
[47,1855,"Services (Overhead & Underground)",null,3402937,167287,null,3570224,null,-1317615,-139481,null,-1457096,2113128]
[47,1860,"Meters",null,1878437,71174,-1270515,679096,null,-1214152,-64321,1068808,-209665,469431]
[47,1860,"Meters (Smart Meters)",null,null,null,null,0,null,null,null,null,0,0]
[47,1875,"Street Lighting",null,7646,null,null,7646,null,-1755,-305,null,{"$f":"J33+K33+L33","v":-2060},{"$f":"H33+M33","v":5586}]
["N/A",1905,"Land",null,201049,null,null,201049,null,null,null,null,0,201049]
[47,1908,"Buildings & Fixtures",null,699797,3151,null,702948,null,-187636,-27933,null,-215569,487379]
[13,1910,"Leasehold Improvements",null,null,null,null,0,null,null,null,null,0,0]
[8,1915,"Office Furniture & Equipment (10 years)",null,258797,14296,null,273093,null,-192103,-12053,null,-204156,68937]
[8,1915,"Office Furniture & Equipment (5 years)",null,null,null,null,0,null,null,null,null,0,0]
[10,1920,"Computer Equipment - Hardware",null,753908,53941,null,807849,null,-591155,-60219,null,-651374,156475]
[45,1920,"Computer Equip.-Hardware(Post Mar. 22/04)",null,null,null,null,0,null,null,null,null,0,0]
[45.1,1920,"Computer Equip.-Hardware(Post Mar. 19/07)",null,null,null,null,0,null,null,null,null,0,0]
[10,1930,"Transportation Equipment",null,370171,83273,-210930,242514,null,-307866,-28689,210930,-125625,116889]
[8,1935,"Stores Equipment",null,19404,6953,null,26357,null,-13303,-1192,null,-14495,11862]
[8,1940,"Tools, Shop & Garage Equipment",null,159103,6190,null,165293,null,-134338,-3666,null,-138004,27289]
[8,1945,"Measurement & Testing Equipment",null,17029,6064,null,23093,null,-7431,-2006,null,-9437,13656]
[8,1950,"Power Operated Equipment",null,null,null,null,0,null,null,null,null,0,0]
[8,1955,"Communications Equipment",null,null,null,null,0,null,null,null,null,0,0]
[8,1955,"Communication Equipment (Smart Meters)",null,null,null,null,0,null,null,null,null,0,0]
[8,1960,"Miscellaneous Equipment ",null,null,null,null,0,null,null,null,null,0,0]
[47,1975,"Load Management Controls Utility Premises",null,null,null,null,0,null,null,null,null,0,0]
[47,1980,"System Supervisor Equipment",null,1177189,95676,null,1272865,null,-529872,-81593,null,-611465,661400]
[47,1985,"Miscellaneous Fixed Assets",null,null,null,null,0,null,null,null,null,0,0]
[47,1995,"Contributions & Grants",null,-4566109,-825193,null,-5391302,null,836374,197163,null,1033537,-4357765]
[null,"etc.",null,null,null,null,null,0,null,null,null,null,0,0]
[]
[null,null,"Total",null,{"$f":"SUM(E16:E55)","v":42607515},{"$f":"SUM(F16:F55)","v":4312275},-1489706,45430084,null,{"$f":"SUM(J16:J55)","v":-25149794},{"$f":"SUM(K16:K55)","v":-1849152},{"$f":"SUM(L16:L55)","v":1279738},-25719208,19710876]
[]
[null,null,null,null,null,null,null,null,null,"Less: Fully Allocated Depreciation"]
[10,null,"Transportation",null,null,null,null,null,null,"Transportation"]
[8,null,"Stores Equipment",null,null,null,null,null,null,"Stores Equipment"]
[null,null,null,null,null,null,null,null,null,"Net Depreciation",null,{"$f":"K56-L59-L60","v":-1849152}]
[]
["Notes:"]
[]
[1,"Tables in the format outlined above covering all fixed asset accounts should be submitted for the Test Year, Bridge Year and all relevant historical years.  At a minimum , the applicant must provide data for the earlier of: 1) all historical years back to its last rebasing; or 2) at least three years of historical actuals, in addition to Bridge Year and Test Year forecasts."]
[]
[]
[2,"The \"CCA Class\" for fixed assets should agree with the CCA Class used for tax purposes in Tax Returns. Fixed Assets sub-components may be used where the underlying asset components are classified under multiple CCA Classes for tax purposes. If an applicant uses any different classes from those shown in the table, an explanation should be provided. (also see note 3 below)."]
[]
[]
[3,"The table may need to be customized for a utility's asset categories or for any new asset accounts announced or authorized by the Board."]
[]
[4,"The depreciation column (D) is not required as the relevant information will be provided in the following 2-C series of appendices."]

{"sheet":"App.2-B_FA Contin CGAAP 2010","index":4,"n_rows":73,"n_cols":14,"rows_kept":73,"cut":false,"hidden":false,"merged":[[70,1,70,13],[8,0,8,13],[9,0,9,13],[13,4,13,7],[64,1,65,13],[67,1,68,13]]}
[null,null,null,null,null,null,null,null,null,null,null,null,"File Number:",{"$f":"'LDC Info'!$E$18","v":"EB-2012-0139"}]
[null,null,null,null,null,null,null,null,null,null,null,null,"Exhibit:",2]
[null,null,null,null,null,null,null,null,null,null,null,null,"Tab:",2]
[null,null,null,null,null,null,null,null,null,null,null,null,"Schedule:",1]
[null,null,null,null,null,null,null,null,null,null,null,null,"Page:",7]
[]
[null,null,null,null,null,null,null,null,null,null,null,null,"Date:","2012-08-31"]
[]
["Appendix 2-B"]
["Fixed Asset Continuity Schedule"]
[]
[null,null,null,null,null,"Year ",2010]
[]
[null,null,null,null,"Cost",null,null,null,null,null,"Accumulated Depreciation"]
["CCA Class","OEB","Description","Depreciation Rate","Opening Balance","Additions","Disposals","Closing Balance",null,"Opening Balance","Additions","Disposals","Closing Balance","Net Book Value"]
[12,1611,"Computer Software (Formally known as Account 1925)",null,{"$f":"'App.2-B_FA Contin CGAAP 2009'!H16","v":985064},47687,null,{"$f":"E16+F16+G16","v":1032751},null,{"$f":"'App.2-B_FA Contin CGAAP 2009'!M16","v":-801804},-102531,null,{"$f":"J16+K16+L16","v":-904335},{"$f":"H16+M16","v":128416}]
["CEC",1612,"Land Rights (Formally known as Account 1906)",null,{"$f":"'App.2-B_FA Contin CGAAP 2009'!H17","v":0},null,null,{"$f":"E17+F17+G17","v":0},null,{"$f":"'App.2-B_FA Contin CGAAP 2009'!M17","v":0},null,null,{"$f":"J17+K17+L17","v":0},{"$f":"H17+M17","v":0}]
["N/A",1805,"Land",null,{"$f":"'App.2-B_FA Contin CGAAP 2009'!H18","v":273770},null,null,{"$f":"E18+F18+G18","v":273770},null,{"$f":"'App.2-B_FA Contin CGAAP 2009'!M18","v":0},null,null,{"$f":"J18+K18+L18","v":0},{"$f":"H18+M18","v":273770}]
["CEC",1806,"Land Rights",null,{"$f":"'App.2-B_FA Contin CGAAP 2009'!H19","v":976547},11917,null,{"$f":"E19+F19+G19","v":988464},null,{"$f":"'App.2-B_FA Contin CGAAP 2009'!M19","v":-527680},-15130,null,{"$f":"J19+K19+L19","v":-542810},{"$f":"H19+M19","v":445654}]
[47,1808,"Buildings",null,{"$f":"'App.2-B_FA Contin CGAAP 2009'!H20","v":0},null,null,{"$f":"E20+F20+G20","v":0},null,{"$f":"'App.2-B_FA Contin CGAAP 2009'!M20","v":0},null,null,{"$f":"J20+K20+L20","v":0},{"$f":"H20+M20","v":0}]
[13,1810,"Leasehold Improvements",null,{"$f":"'App.2-B_FA Contin CGAAP 2009'!H21","v":86252},null,null,86252,null,{"$f":"'App.2-B_FA Contin CGAAP 2009'!M21","v":-27600},-3450,null,-31050,55202]
[47,1815,"Transformer Station Equipment >50 kV",null,{"$f":"'App.2-B_FA Contin CGAAP 2009'!H22","v":0},null,null,0,null,{"$f":"'App.2-B_FA Contin CGAAP 2009'!M22","v":0},null,null,0,0]
[47,1820,"Distribution Station Equipment <50 kV",null,{"$f":"'App.2-B_FA Contin CGAAP 2009'!H23","v":4388085},43198,null,4431283,null,{"$f":"'App.2-B_FA Contin CGAAP 2009'!M23","v":-2288783},-124522,null,-2413305,2017978]
[47,1825,"Storage Battery Equipment",null,{"$f":"'App.2-B_FA Contin CGAAP 2009'!H24","v":0},null,null,0,null,{"$f":"'App.2-B_FA Contin CGAAP 2009'!M24","v":0},null,null,0,0]
[47,1830,"Poles, Towers & Fixtures",null,{"$f":"'App.2-B_FA Contin CGAAP 2009'!H25","v":7520017},811713,null,8331730,null,{"$f":"'App.2-B_FA Contin CGAAP 2009'!M25","v":-3711243},-319524,null,-4030767,4300963]
[47,1835,"Overhead Conductors & Devices",null,{"$f":"'App.2-B_FA Contin CGAAP 2009'!H26","v":11265290},736529,null,12001819,null,{"$f":"'App.2-B_FA Contin CGAAP 2009'!M26","v":-6979781},-463964,null,-7443745,4558074]
[47,1840,"Underground Conduit",null,{"$f":"'App.2-B_FA Contin CGAAP 2009'!H27","v":1783830},26610,null,1810440,null,{"$f":"'App.2-B_FA Contin CGAAP 2009'!M27","v":-339009},-72373,null,-411382,1399058]
[47,1845,"Underground Conductors & Devices",null,{"$f":"'App.2-B_FA Contin CGAAP 2009'!H28","v":7726916},3834252,null,11561168,null,{"$f":"'App.2-B_FA Contin CGAAP 2009'!M28","v":-3491630},-384602,null,-3876232,7684936]
[47,1850,"Line Transformers",null,{"$f":"'App.2-B_FA Contin CGAAP 2009'!H29","v":7843588},291950,null,8135538,null,{"$f":"'App.2-B_FA Contin CGAAP 2009'!M29","v":-4946269},-314223,null,-5260492,2875046]
[47,1855,"Services (Overhead & Underground)",null,{"$f":"'App.2-B_FA Contin CGAAP 2009'!H30","v":3570224},141283,null,3711507,null,{"$f":"'App.2-B_FA Contin CGAAP 2009'!M30","v":-1457096},-145653,null,-1602749,2108758]
[47,1860,"Meters",null,{"$f":"'App.2-B_FA Contin CGAAP 2009'!H31","v":679096},null,-492071,187025,null,{"$f":"'App.2-B_FA Contin CGAAP 2009'!M31","v":-209665},-22721,192417,-39969,147056]
[47,1860,"Meters (Smart Meters)",null,{"$f":"'App.2-B_FA Contin CGAAP 2009'!H32","v":0},null,null,0,null,{"$f":"'App.2-B_FA Contin CGAAP 2009'!M32","v":0},null,null,0,0]
[47,1875,"Street Lighting",null,{"$f":"'App.2-B_FA Contin CGAAP 2009'!H33","v":7646},null,null,7646,null,{"$f":"'App.2-B_FA Contin CGAAP 2009'!M33","v":-2060},-305,null,-2365,5281]
["N/A",1905,"Land",null,{"$f":"'App.2-B_FA Contin CGAAP 2009'!H34","v":201049},null,null,201049,null,{"$f":"'App.2-B_FA Contin CGAAP 2009'!M34","v":0},null,null,0,201049]
[47,1908,"Buildings & Fixtures",null,{"$f":"'App.2-B_FA Contin CGAAP 2009'!H35","v":702948},34836,null,737784,null,{"$f":"'App.2-B_FA Contin CGAAP 2009'!M35","v":-215569},-28795,null,-244364,493420]
[13,1910,"Leasehold Improvements",null,{"$f":"'App.2-B_FA Contin CGAAP 2009'!H36","v":0},null,null,0,null,{"$f":"'App.2-B_FA Contin CGAAP 2009'!M36","v":0},null,null,0,0]
[8,1915,"Office Furniture & Equipment (10 years)",null,{"$f":"'App.2-B_FA Contin CGAAP 2009'!H37","v":273093},21306,null,294399,null,{"$f":"'App.2-B_FA Contin CGAAP 2009'!M37","v":-204156},-13478,null,-217634,76765]
[8,1915,"Office Furniture & Equipment (5 years)",null,{"$f":"'App.2-B_FA Contin CGAAP 2009'!H38","v":0},null,null,0,null,{"$f":"'App.2-B_FA Contin CGAAP 2009'!M38","v":0},null,null,0,0]
[10,1920,"Computer Equipment - Hardware",null,{"$f":"'App.2-B_FA Contin CGAAP 2009'!H39","v":807849},64210,null,872059,null,{"$f":"'App.2-B_FA Contin CGAAP 2009'!M39","v":-651374},-63093,null,-714467,157592]
[45,1920,"Computer Equip.-Hardware(Post Mar. 22/04)",null,{"$f":"'App.2-B_FA Contin CGAAP 2009'!H40","v":0},null,null,0,null,{"$f":"'App.2-B_FA Contin CGAAP 2009'!M40","v":0},null,null,0,0]
[45.1,1920,"Computer Equip.-Hardware(Post Mar. 19/07)",null,{"$f":"'App.2-B_FA Contin CGAAP 2009'!H41","v":0},null,null,0,null,{"$f":"'App.2-B_FA Contin CGAAP 2009'!M41","v":0},null,null,0,0]
[10,1930,"Transportation Equipment",null,{"$f":"'App.2-B_FA Contin CGAAP 2009'!H42","v":242514},594402,null,836916,null,{"$f":"'App.2-B_FA Contin CGAAP 2009'!M42","v":-125625},-90655,null,-216280,620636]
[8,1935,"Stores Equipment",null,{"$f":"'App.2-B_FA Contin CGAAP 2009'!H43","v":26357},3761,null,30118,null,{"$f":"'App.2-B_FA Contin CGAAP 2009'!M43","v":-14495},-1728,null,-16223,13895]
[8,1940,"Tools, Shop & Garage Equipment",null,{"$f":"'App.2-B_FA Contin CGAAP 2009'!H44","v":165293},304092,null,469385,null,{"$f":"'App.2-B_FA Contin CGAAP 2009'!M44","v":-138004},-19064,null,-157068,312317]
[8,1945,"Measurement & Testing Equipment",null,{"$f":"'App.2-B_FA Contin CGAAP 2009'!H45","v":23093},597,null,23690,null,{"$f":"'App.2-B_FA Contin CGAAP 2009'!M45","v":-9437},-2339,null,-11776,11914]
[8,1950,"Power Operated Equipment",null,{"$f":"'App.2-B_FA Contin CGAAP 2009'!H46","v":0},null,null,0,null,{"$f":"'App.2-B_FA Contin CGAAP 2009'!M46","v":0},null,null,0,0]
[8,1955,"Communications Equipment",null,{"$f":"'App.2-B_FA Contin CGAAP 2009'!H47","v":0},null,null,0,null,{"$f":"'App.2-B_FA Contin CGAAP 2009'!M47","v":0},null,null,0,0]
[8,1955,"Communication Equipment (Smart Meters)",null,{"$f":"'App.2-B_FA Contin CGAAP 2009'!H48","v":0},null,null,0,null,{"$f":"'App.2-B_FA Contin CGAAP 2009'!M48","v":0},null,null,0,0]
[8,1960,"Miscellaneous Equipment ",null,{"$f":"'App.2-B_FA Contin CGAAP 2009'!H49","v":0},null,null,0,null,{"$f":"'App.2-B_FA Contin CGAAP 2009'!M49","v":0},null,null,0,0]
[47,1975,"Load Management Controls Utility Premises",null,{"$f":"'App.2-B_FA Contin CGAAP 2009'!H50","v":0},null,null,0,null,{"$f":"'App.2-B_FA Contin CGAAP 2009'!M50","v":0},null,null,0,0]
[47,1980,"System Supervisor Equipment",null,{"$f":"'App.2-B_FA Contin CGAAP 2009'!H51","v":1272865},52041,null,1324906,null,{"$f":"'App.2-B_FA Contin CGAAP 2009'!M51","v":-611465},-86517,null,-697982,626924]
[47,1985,"Miscellaneous Fixed Assets",null,{"$f":"'App.2-B_FA Contin CGAAP 2009'!H52","v":0},null,null,0,null,{"$f":"'App.2-B_FA Contin CGAAP 2009'!M52","v":0},null,null,0,0]
[47,1995,"Contributions & Grants",null,{"$f":"'App.2-B_FA Contin CGAAP 2009'!H53","v":-5391302},-1802237,null,-7193539,null,{"$f":"'App.2-B_FA Contin CGAAP 2009'!M53","v":1033537},246054,null,1279591,-5913948]
[null,"etc.",null,null,{"$f":"'App.2-B_FA Contin CGAAP 2009'!H54","v":0},null,null,0,null,null,null,null,0,0]
[null,null,null,null,{"$f":"'App.2-B_FA Contin CGAAP 2009'!H55","v":0}]
[null,null,"Total",null,{"$f":"SUM(E16:E55)","v":45430084},{"$f":"SUM(F16:F55)","v":5218147},-492071,50156160,null,{"$f":"SUM(J16:J55)","v":-25719208},{"$f":"SUM(K16:K55)","v":-2028613},{"$f":"SUM(L16:L55)","v":192417},-27555404,22600756]
[]
[null,null,null,null,null,null,null,null,null,"Less: Fully Allocated Depreciation"]
[10,null,"Transportation",null,null,null,null,null,null,"Transportation",null,{"$f":"K42","v":-90655}]
[8,null,"Stores Equipment",null,null,null,null,null,null,"Stranded meters",null,27337]
[null,null,null,null,null,null,null,null,null,"Net Depreciation",null,{"$f":"K56-L59-L60","v":-1965295}]
[]
["Notes:"]
[]
[1,"Tables in the format outlined above covering all fixed asset accounts should be submitted for the Test Year, Bridge Year and all relevant historical years.  At a minimum , the applicant must provide data for the earlier of: 1) all historical years back to its last rebasing; or 2) at least three years of historical actuals, in addition to Bridge Year and Test Year forecasts."]
[]
[]
[2,"The \"CCA Class\" for fixed assets should agree with the CCA Class used for tax purposes in Tax Returns. Fixed Assets sub-components may be used where the underlying asset components are classified under multiple CCA Classes for tax purposes. If an applicant uses any different classes from those shown in the table, an explanation should be provided. (also see note 3 below)."]
[]
[]
[3,"The table may need to be customized for a utility's asset categories or for any new asset accounts announced or authorized by the Board."]
[]
[4,"The depreciation column (D) is not required as the relevant information will be provided in the following 2-C series of appendices."]

{"sheet":"App.2-B_FA Contin CGAAP 2011","index":5,"n_rows":76,"n_cols":14,"rows_kept":76,"cut":false,"hidden":false,"merged":[[73,1,73,13],[8,0,8,13],[9,0,9,13],[13,4,13,7],[67,1,68,13],[70,1,71,13]]}
[null,null,null,null,null,null,null,null,null,null,null,null,"File Number:",{"$f":"'LDC Info'!$E$18","v":"EB-2012-0139"}]
[null,null,null,null,null,null,null,null,null,null,null,null,"Exhibit:",2]
[null,null,null,null,null,null,null,null,null,null,null,null,"Tab:",2]
[null,null,null,null,null,null,null,null,null,null,null,null,"Schedule:",1]
[null,null,null,null,null,null,null,null,null,null,null,null,"Page:",8]
[]
[null,null,null,null,null,null,null,null,null,null,null,null,"Date:","2012-08-31"]
[]
["Appendix 2-B"]
["Fixed Asset Continuity Schedule"]
[]
[null,null,null,null,null,"Year ",2011]
[]
[null,null,null,null,"Cost",null,null,null,null,null,"Accumulated Depreciation"]
["CCA Class","OEB","Description","Depreciation Rate","Opening Balance","Additions","Disposals","Closing Balance",null,"Opening Balance","Additions","Disposals","Closing Balance","Net Book Value"]
[12,1611,"Computer Software (Formally known as Account 1925)",null,{"$f":"'App.2-B_FA Contin CGAAP 2010'!H16","v":1032751},73245,-774930,{"$f":"E16+F16+G16","v":331066},null,{"$f":"'App.2-B_FA Contin CGAAP 2010'!M16","v":-904335},-81963,774427,{"$f":"J16+K16+L16","v":-211871},{"$f":"H16+M16","v":119195}]
["CEC",1612,"Land Rights (Formally known as Account 1906)",null,{"$f":"'App.2-B_FA Contin CGAAP 2010'!H17","v":0},null,null,{"$f":"E17+F17+G17","v":0},null,{"$f":"'App.2-B_FA Contin CGAAP 2010'!M17","v":0},null,null,{"$f":"J17+K17+L17","v":0},{"$f":"H17+M17","v":0}]
["N/A",1805,"Land",null,{"$f":"'App.2-B_FA Contin CGAAP 2010'!H18","v":273770},null,null,{"$f":"E18+F18+G18","v":273770},null,{"$f":"'App.2-B_FA Contin CGAAP 2010'!M18","v":0},null,null,{"$f":"J18+K18+L18","v":0},{"$f":"H18+M18","v":273770}]
["CEC",1806,"Land Rights",null,{"$f":"'App.2-B_FA Contin CGAAP 2010'!H19","v":988464},1981,-7742,{"$f":"E19+F19+G19","v":982703},null,{"$f":"'App.2-B_FA Contin CGAAP 2010'!M19","v":-542810},-15176,null,{"$f":"J19+K19+L19","v":-557986},{"$f":"H19+M19","v":424717}]
[47,1808,"Buildings",null,{"$f":"'App.2-B_FA Contin CGAAP 2010'!H20","v":0},null,null,{"$f":"E20+F20+G20","v":0},null,{"$f":"'App.2-B_FA Contin CGAAP 2010'!M20","v":0},null,null,{"$f":"J20+K20+L20","v":0},{"$f":"H20+M20","v":0}]
[13,1810,"Leasehold Improvements",null,{"$f":"'App.2-B_FA Contin CGAAP 2010'!H21","v":86252},null,null,86252,null,{"$f":"'App.2-B_FA Contin CGAAP 2010'!M21","v":-31050},-3450,null,-34500,51752]
[47,1815,"Transformer Station Equipment >50 kV",null,{"$f":"'App.2-B_FA Contin CGAAP 2010'!H22","v":0},null,null,0,null,{"$f":"'App.2-B_FA Contin CGAAP 2010'!M22","v":0},null,null,0,0]
[47,1820,"Distribution Station Equipment <50 kV",null,{"$f":"'App.2-B_FA Contin CGAAP 2010'!H23","v":4431283},152331,-225053,4358561,null,{"$f":"'App.2-B_FA Contin CGAAP 2010'!M23","v":-2413305},-125218,215647,-2322876,2035685]
[47,1825,"Storage Battery Equipment",null,{"$f":"'App.2-B_FA Contin CGAAP 2010'!H24","v":0},null,null,0,null,{"$f":"'App.2-B_FA Contin CGAAP 2010'!M24","v":0},null,null,0,0]
[47,1830,"Poles, Towers & Fixtures",null,{"$f":"'App.2-B_FA Contin CGAAP 2010'!H25","v":8331730},935010,-188852,9077888,null,{"$f":"'App.2-B_FA Contin CGAAP 2010'!M25","v":-4030767},-347982,92096,-4286653,4791235]
[47,1835,"Overhead Conductors & Devices",null,{"$f":"'App.2-B_FA Contin CGAAP 2010'!H26","v":12001819},1491019,-299892,13192946,null,{"$f":"'App.2-B_FA Contin CGAAP 2010'!M26","v":-7443745},-289141,255965,-7476921,5716025]
[47,1840,"Underground Conduit",null,{"$f":"'App.2-B_FA Contin CGAAP 2010'!H27","v":1810440},225131,null,2035571,null,{"$f":"'App.2-B_FA Contin CGAAP 2010'!M27","v":-411382},-72418,-3967,-487767,1547804]
[47,1845,"Underground Conductors & Devices",null,{"$f":"'App.2-B_FA Contin CGAAP 2010'!H28","v":11561168},251455,-91467,11721156,null,{"$f":"'App.2-B_FA Contin CGAAP 2010'!M28","v":-3876232},-465614,2830,-4339016,7382140]
[47,1850,"Line Transformers",null,{"$f":"'App.2-B_FA Contin CGAAP 2010'!H29","v":8135538},487484,-20236,8602786,null,{"$f":"'App.2-B_FA Contin CGAAP 2010'!M29","v":-5260492},-333051,5597,-5587946,3014840]
[47,1855,"Services (Overhead & Underground)",null,{"$f":"'App.2-B_FA Contin CGAAP 2010'!H30","v":3711507},306192,-563,4017136,null,{"$f":"'App.2-B_FA Contin CGAAP 2010'!M30","v":-1602749},-154495,64,-1757180,2259956]
[47,1860,"Meters",null,{"$f":"'App.2-B_FA Contin CGAAP 2010'!H31","v":187025},10308,89925,287258,null,{"$f":"'App.2-B_FA Contin CGAAP 2010'!M31","v":-39969},-27067,null,-67036,220222]
[47,1860,"Meters (Smart Meters)",null,{"$f":"'App.2-B_FA Contin CGAAP 2010'!H32","v":0},null,null,0,null,{"$f":"'App.2-B_FA Contin CGAAP 2010'!M32","v":0},null,null,0,0]
[47,1875,"Street Lighting",null,{"$f":"'App.2-B_FA Contin CGAAP 2010'!H33","v":7646},null,null,7646,null,{"$f":"'App.2-B_FA Contin CGAAP 2010'!M33","v":-2365},-305,null,-2670,4976]
["N/A",1905,"Land",null,{"$f":"'App.2-B_FA Contin CGAAP 2010'!H34","v":201049},null,null,201049,null,{"$f":"'App.2-B_FA Contin CGAAP 2010'!M34","v":0},null,null,0,201049]
[47,1908,"Buildings & Fixtures",null,{"$f":"'App.2-B_FA Contin CGAAP 2010'!H35","v":737784},1847,null,739631,null,{"$f":"'App.2-B_FA Contin CGAAP 2010'!M35","v":-244364},-29548,null,-273912,465719]
[13,1910,"Leasehold Improvements",null,{"$f":"'App.2-B_FA Contin CGAAP 2010'!H36","v":0},null,null,0,null,{"$f":"'App.2-B_FA Contin CGAAP 2010'!M36","v":0},null,null,0,0]
[8,1915,"Office Furniture & Equipment (10 years)",null,{"$f":"'App.2-B_FA Contin CGAAP 2010'!H37","v":294399},14256,null,308655,null,{"$f":"'App.2-B_FA Contin CGAAP 2010'!M37","v":-217634},-15014,null,-232648,76007]
[8,1915,"Office Furniture & Equipment (5 years)",null,{"$f":"'App.2-B_FA Contin CGAAP 2010'!H38","v":0},null,null,0,null,{"$f":"'App.2-B_FA Contin CGAAP 2010'!M38","v":0},null,null,0,0]
[10,1920,"Computer Equipment - Hardware",null,{"$f":"'App.2-B_FA Contin CGAAP 2010'!H39","v":872059},16388,-373141,515306,null,{"$f":"'App.2-B_FA Contin CGAAP 2010'!M39","v":-714467},-63019,377405,-400081,115225]
[45,1920,"Computer Equip.-Hardware(Post Mar. 22/04)",null,{"$f":"'App.2-B_FA Contin CGAAP 2010'!H40","v":0},null,null,0,null,{"$f":"'App.2-B_FA Contin CGAAP 2010'!M40","v":0},null,null,0,0]
[45.1,1920,"Computer Equip.-Hardware(Post Mar. 19/07)",null,{"$f":"'App.2-B_FA Contin CGAAP 2010'!H41","v":0},null,null,0,null,{"$f":"'App.2-B_FA Contin CGAAP 2010'!M41","v":0},null,null,0,0]
[10,1930,"Transportation Equipment",null,{"$f":"'App.2-B_FA Contin CGAAP 2010'!H42","v":836916},297131,40149,1174196,null,{"$f":"'App.2-B_FA Contin CGAAP 2010'!M42","v":-216280},-220718,-23136,-460134,714062]
[8,1935,"Stores Equipment",null,{"$f":"'App.2-B_FA Contin CGAAP 2010'!H43","v":30118},1706,null,31824,null,{"$f":"'App.2-B_FA Contin CGAAP 2010'!M43","v":-16223},-1949,null,-18172,13652]
[8,1940,"Tools, Shop & Garage Equipment",null,{"$f":"'App.2-B_FA Contin CGAAP 2010'!H44","v":469385},58448,-40149,487684,null,{"$f":"'App.2-B_FA Contin CGAAP 2010'!M44","v":-157068},-34180,3011,-188237,299447]
[8,1945,"Measurement & Testing Equipment",null,{"$f":"'App.2-B_FA Contin CGAAP 2010'!H45","v":23690},9307,null,32997,null,{"$f":"'App.2-B_FA Contin CGAAP 2010'!M45","v":-11776},-2450,null,-14226,18771]
[8,1950,"Power Operated Equipment",null,{"$f":"'App.2-B_FA Contin CGAAP 2010'!H46","v":0},null,null,0,null,{"$f":"'App.2-B_FA Contin CGAAP 2010'!M46","v":0},null,null,0,0]
[8,1955,"Communications Equipment",null,{"$f":"'App.2-B_FA Contin CGAAP 2010'!H47","v":0},null,null,0,null,{"$f":"'App.2-B_FA Contin CGAAP 2010'!M47","v":0},null,null,0,0]
[8,1955,"Communication Equipment (Smart Meters)",null,{"$f":"'App.2-B_FA Contin CGAAP 2010'!H48","v":0},null,null,0,null,{"$f":"'App.2-B_FA Contin CGAAP 2010'!M48","v":0},null,null,0,0]
[8,1960,"Miscellaneous Equipment ",null,{"$f":"'App.2-B_FA Contin CGAAP 2010'!H49","v":0},null,null,0,null,{"$f":"'App.2-B_FA Contin CGAAP 2010'!M49","v":0},null,null,0,0]
[47,1975,"Load Management Controls Utility Premises",null,{"$f":"'App.2-B_FA Contin CGAAP 2010'!H50","v":0},null,null,0,null,{"$f":"'App.2-B_FA Contin CGAAP 2010'!M50","v":0},null,null,0,0]
[47,1980,"System Supervisor Equipment",null,{"$f":"'App.2-B_FA Contin CGAAP 2010'!H51","v":1324906},82487,null,1407393,null,{"$f":"'App.2-B_FA Contin CGAAP 2010'!M51","v":-697982},-91077,null,-789059,618334]
[47,1985,"Miscellaneous Fixed Assets",null,{"$f":"'App.2-B_FA Contin CGAAP 2010'!H52","v":0},null,null,0,null,{"$f":"'App.2-B_FA Contin CGAAP 2010'!M52","v":0},null,null,0,0]
[47,1995,"Contributions & Grants",null,{"$f":"'App.2-B_FA Contin CGAAP 2010'!H53","v":-7193539},-521407,null,-7714946,null,{"$f":"'App.2-B_FA Contin CGAAP 2010'!M53","v":1279591},290627,null,1570218,-6144728]
[null,"etc.",null,null,{"$f":"'App.2-B_FA Contin CGAAP 2009'!H54","v":0},null,null,0,null,null,null,null,0,0]
[null,null,null,null,{"$f":"'App.2-B_FA Contin CGAAP 2009'!H55","v":0}]
[null,null,"Total",null,{"$f":"SUM(E16:E55)","v":50156160},{"$f":"SUM(F16:F55)","v":3894319},-1891951,52158528,null,{"$f":"SUM(J16:J55)","v":-27555404},{"$f":"SUM(K16:K55)","v":-2083208},{"$f":"SUM(L16:L55)","v":1699939},-27938673,24219855]
[null,null,null,null,null,null,null,null,null,null,null,null,null," "]
[null,null,"Smart Meter Trueup"]
[10,null,"Smart meters",null,null,2162281,null,null,null,null,-327495]
[8,null,"Computer software",null,null,32533,null,null,null,null,-27111]
[]
[null,null,null,null,null,null,null,null,null,"Less: Fully Allocated Depreciation"]
[null,null,null,null,null,null,null,null,null,"Transportation",null,{"$f":"K42","v":-220718}]
[null,null,null,null,null,null,null,null,null,"Stores Equipment",null,31745]
[null,null,null,null,null,null,null,null,null,"Net Depreciation",null,{"$f":"K56-L63-L64","v":-1894235}]
["Notes:"]
[]
[1,"Tables in the format outlined above covering all fixed asset accounts should be submitted for the Test Year, Bridge Year and all relevant historical years.  At a minimum , the applicant must provide data for the earlier of: 1) all historical years back to its last rebasing; or 2) at least three years of historical actuals, in addition to Bridge Year and Test Year forecasts."]
[]
[]
[2,"The \"CCA Class\" for fixed assets should agree with the CCA Class used for tax purposes in Tax Returns. Fixed Assets sub-components may be used where the underlying asset components are classified under multiple CCA Classes for tax purposes. If an applicant uses any different classes from those shown in the table, an explanation should be provided. (also see note 3 below)."]
[]
[]
[3,"The table may need to be customized for a utility's asset categories or for any new asset accounts announced or authorized by the Board."]
[]
[4,"The depreciation column (D) is not required as the relevant information will be provided in the following 2-C series of appendices."]

{"sheet":"App.2-B_FA Contin CGAAP 2012","index":6,"n_rows":73,"n_cols":14,"rows_kept":73,"cut":false,"hidden":false,"merged":[[70,1,70,13],[8,0,8,13],[9,0,9,13],[13,4,13,7],[64,1,65,13],[67,1,68,13]]}
[null,null,null,null,null,null,null,null,null,null,null,null,"File Number:",{"$f":"'LDC Info'!$E$18","v":"EB-2012-0139"}]
[null,null,null,null,null,null,null,null,null,null,null,null,"Exhibit:",2]
[null,null,null,null,null,null,null,null,null,null,null,null,"Tab:",2]
[null,null,null,null,null,null,null,null,null,null,null,null,"Schedule:",1]
[null,null,null,null,null,null,null,null,null,null,null,null,"Page:",9]
[]
[null,null,null,null,null,null,null,null,null,null,null,null,"Date:","2012-08-31"]
[]
["Appendix 2-B"]
["Fixed Asset Continuity Schedule"]
[]
[null,null,null,null,null,"Year ",2012]
[]
[null,null,null,null,"Cost",null,null,null,null,null,"Accumulated Depreciation"]
["CCA Class","OEB","Description","Depreciation Rate","Opening Balance","Additions","Disposals","Closing Balance",null,"Opening Balance","Additions","Disposals","Closing Balance","Net Book Value"]
[12,1611,"Computer Software (Formally known as Account 1925)",null,{"$f":"'App.2-B_FA Contin CGAAP 2011'!H16+'App.2-B_FA Contin CGAAP 2011'!F60","v":363599},{"$f":"314683-'App.2-B_FA Contin CGAAP 2011'!F60","v":282150},null,{"$f":"E16+F16+G16","v":645749},null,{"$f":"'App.2-B_FA Contin CGAAP 2011'!M16+'App.2-B_FA Contin CGAAP 2011'!K60","v":-238982},{"$f":"-113920","v":-113920},null,{"$f":"J16+K16+L16","v":-352902},{"$f":"H16+M16","v":292847}]
["CEC",1612,"Land Rights (Formally known as Account 1906)",null,{"$f":"'App.2-B_FA Contin CGAAP 2011'!H17","v":0},null,null,{"$f":"E17+F17+G17","v":0},null,{"$f":"'App.2-B_FA Contin CGAAP 2011'!M17","v":0},null,null,{"$f":"J17+K17+L17","v":0},{"$f":"H17+M17","v":0}]
["N/A",1805,"Land",null,{"$f":"'App.2-B_FA Contin CGAAP 2011'!H18","v":273770},465000,null,{"$f":"E18+F18+G18","v":738770},null,{"$f":"'App.2-B_FA Contin CGAAP 2011'!M18","v":0},null,null,{"$f":"J18+K18+L18","v":0},{"$f":"H18+M18","v":738770}]
["CEC",1806,"Land Rights",null,{"$f":"'App.2-B_FA Contin CGAAP 2011'!H19","v":982703},null,null,{"$f":"E19+F19+G19","v":982703},null,{"$f":"'App.2-B_FA Contin CGAAP 2011'!M19","v":-557986},-14872,null,{"$f":"J19+K19+L19","v":-572858},{"$f":"H19+M19","v":409845}]
[47,1808,"Buildings",null,{"$f":"'App.2-B_FA Contin CGAAP 2011'!H20","v":0},null,null,{"$f":"E20+F20+G20","v":0},null,{"$f":"'App.2-B_FA Contin CGAAP 2011'!M20","v":0},null,null,{"$f":"J20+K20+L20","v":0},{"$f":"H20+M20","v":0}]
[13,1810,"Leasehold Improvements",null,{"$f":"'App.2-B_FA Contin CGAAP 2011'!H21","v":86252},null,null,86252,null,{"$f":"'App.2-B_FA Contin CGAAP 2011'!M21","v":-34500},-3312,null,-37812,48440]
[47,1815,"Transformer Station Equipment >50 kV",null,{"$f":"'App.2-B_FA Contin CGAAP 2011'!H22","v":0},null,null,0,null,{"$f":"'App.2-B_FA Contin CGAAP 2011'!M22","v":0},null,null,0,0]
[47,1820,"Distribution Station Equipment <50 kV",null,{"$f":"'App.2-B_FA Contin CGAAP 2011'!H23","v":4358561},35448,null,4394009,null,{"$f":"'App.2-B_FA Contin CGAAP 2011'!M23","v":-2322876},-120918,null,-2443794,1950215]
[47,1825,"Storage Battery Equipment",null,{"$f":"'App.2-B_FA Contin CGAAP 2011'!H24","v":0},null,null,0,null,{"$f":"'App.2-B_FA Contin CGAAP 2011'!M24","v":0},null,null,0,0]
[47,1830,"Poles, Towers & Fixtures",null,{"$f":"'App.2-B_FA Contin CGAAP 2011'!H25","v":9077888},1172023,-100000,10149911,null,{"$f":"'App.2-B_FA Contin CGAAP 2011'!M25","v":-4286653},-357503,85000,-4559156,5590755]
[47,1835,"Overhead Conductors & Devices",null,{"$f":"'App.2-B_FA Contin CGAAP 2011'!H26","v":13192946},1314249,-150000,14357195,null,{"$f":"'App.2-B_FA Contin CGAAP 2011'!M26","v":-7476921},-303860,127500,-7653281,6703914]
[47,1840,"Underground Conduit",null,{"$f":"'App.2-B_FA Contin CGAAP 2011'!H27","v":2035571},37200,null,2072771,null,{"$f":"'App.2-B_FA Contin CGAAP 2011'!M27","v":-487767},-70265,null,-558032,1514739]
[47,1845,"Underground Conductors & Devices",null,{"$f":"'App.2-B_FA Contin CGAAP 2011'!H28","v":11721156},454700,-50000,12125856,null,{"$f":"'App.2-B_FA Contin CGAAP 2011'!M28","v":-4339016},-456084,42500,-4752600,7373256]
[47,1850,"Line Transformers",null,{"$f":"'App.2-B_FA Contin CGAAP 2011'!H29","v":8602786},545110,-10000,9137896,null,{"$f":"'App.2-B_FA Contin CGAAP 2011'!M29","v":-5587946},{"$f":"-48293-282338","v":-330631},8500,-5910077,3227819]
[47,1855,"Services (Overhead & Underground)",null,{"$f":"'App.2-B_FA Contin CGAAP 2011'!H30","v":4017136},207405,null,4224541,null,{"$f":"'App.2-B_FA Contin CGAAP 2011'!M30","v":-1757180},{"$f":"-33848-118615","v":-152463},null,-1909643,2314898]
[47,1860,"Meters",null,{"$f":"'App.2-B_FA Contin CGAAP 2011'!H31","v":287258},null,null,287258,null,{"$f":"'App.2-B_FA Contin CGAAP 2011'!M31","v":-67036},{"$f":"287258*-0.04","v":-11490.32},null,-78526.320000000007,208731.68]
[47,1860,"Meters (Smart Meters)",null,{"$f":"'App.2-B_FA Contin CGAAP 2011'!F59","v":2162281},{"$f":"2236521-E32","v":74240},null,2236521,null,{"$f":"'App.2-B_FA Contin CGAAP 2011'!K59","v":-327495},{"$f":"-201112-K31+43000","v":-146621.68},null,-474116.68,1762404.32]
[47,1875,"Street Lighting",null,{"$f":"'App.2-B_FA Contin CGAAP 2011'!H33","v":7646},null,-7646,0,null,{"$f":"'App.2-B_FA Contin CGAAP 2011'!M33","v":-2670},null,2670,0,0]
["N/A",1905,"Land",null,{"$f":"'App.2-B_FA Contin CGAAP 2011'!H34","v":201049},null,null,201049,null,{"$f":"'App.2-B_FA Contin CGAAP 2011'!M34","v":0},null,null,0,201049]
[47,1908,"Buildings & Fixtures",null,{"$f":"'App.2-B_FA Contin CGAAP 2011'!H35","v":739631},2025000,null,2764631,null,{"$f":"'App.2-B_FA Contin CGAAP 2011'!M35","v":-273912},-28866,null,-302778,2461853]
[13,1910,"Leasehold Improvements",null,{"$f":"'App.2-B_FA Contin CGAAP 2011'!H36","v":0},null,null,0,null,{"$f":"'App.2-B_FA Contin CGAAP 2011'!M36","v":0},null,null,0,0]
[8,1915,"Office Furniture & Equipment (10 years)",null,{"$f":"'App.2-B_FA Contin CGAAP 2011'!H37","v":308655},25500,null,334155,null,{"$f":"'App.2-B_FA Contin CGAAP 2011'!M37","v":-232648},-12536,null,-245184,88971]
[8,1915,"Office Furniture & Equipment (5 years)",null,{"$f":"'App.2-B_FA Contin CGAAP 2011'!H38","v":0},null,null,0,null,{"$f":"'App.2-B_FA Contin CGAAP 2011'!M38","v":0},null,null,0,0]
[10,1920,"Computer Equipment - Hardware",null,{"$f":"'App.2-B_FA Contin CGAAP 2011'!H39","v":515306},122500,null,637806,null,{"$f":"'App.2-B_FA Contin CGAAP 2011'!M39","v":-400081},-62665,null,-462746,175060]
[45,1920,"Computer Equip.-Hardware(Post Mar. 22/04)",null,{"$f":"'App.2-B_FA Contin CGAAP 2011'!H40","v":0},null,null,0,null,{"$f":"'App.2-B_FA Contin CGAAP 2011'!M40","v":0},null,null,0,0]
[45.1,1920,"Computer Equip.-Hardware(Post Mar. 19/07)",null,{"$f":"'App.2-B_FA Contin CGAAP 2011'!H41","v":0},null,null,0,null,{"$f":"'App.2-B_FA Contin CGAAP 2011'!M41","v":0},null,null,0,0]
[10,1930,"Transportation Equipment",null,{"$f":"'App.2-B_FA Contin CGAAP 2011'!H42","v":1174196},null,null,1174196,null,{"$f":"'App.2-B_FA Contin CGAAP 2011'!M42","v":-460134},-159800,null,-619934,554262]
[8,1935,"Stores Equipment",null,{"$f":"'App.2-B_FA Contin CGAAP 2011'!H43","v":31824},4000,null,35824,null,{"$f":"'App.2-B_FA Contin CGAAP 2011'!M43","v":-18172},-1954,null,-20126,15698]
[8,1940,"Tools, Shop & Garage Equipment",null,{"$f":"'App.2-B_FA Contin CGAAP 2011'!H44","v":487684},27000,null,514684,null,{"$f":"'App.2-B_FA Contin CGAAP 2011'!M44","v":-188237},-32112,null,-220349,294335]
[8,1945,"Measurement & Testing Equipment",null,{"$f":"'App.2-B_FA Contin CGAAP 2011'!H45","v":32997},8500,null,41497,null,{"$f":"'App.2-B_FA Contin CGAAP 2011'!M45","v":-14226},-2631,null,-16857,24640]
[8,1950,"Power Operated Equipment",null,{"$f":"'App.2-B_FA Contin CGAAP 2011'!H46","v":0},null,null,0,null,{"$f":"'App.2-B_FA Contin CGAAP 2011'!M46","v":0},null,null,0,0]
[8,1955,"Communications Equipment",null,{"$f":"'App.2-B_FA Contin CGAAP 2011'!H47","v":0},null,null,0,null,{"$f":"'App.2-B_FA Contin CGAAP 2011'!M47","v":0},null,null,0,0]
[8,1955,"Communication Equipment (Smart Meters)",null,{"$f":"'App.2-B_FA Contin CGAAP 2011'!H48","v":0},null,null,0,null,{"$f":"'App.2-B_FA Contin CGAAP 2011'!M48","v":0},null,null,0,0]
[8,1960,"Miscellaneous Equipment ",null,{"$f":"'App.2-B_FA Contin CGAAP 2011'!H49","v":0},null,null,0,null,{"$f":"'App.2-B_FA Contin CGAAP 2011'!M49","v":0},null,null,0,0]
[47,1975,"Load Management Controls Utility Premises",null,{"$f":"'App.2-B_FA Contin CGAAP 2011'!H50","v":0},null,null,0,null,{"$f":"'App.2-B_FA Contin CGAAP 2011'!M50","v":0},null,null,0,0]
[47,1980,"System Supervisor Equipment",null,{"$f":"'App.2-B_FA Contin CGAAP 2011'!H51","v":1407393},367850,null,1775243,null,{"$f":"'App.2-B_FA Contin CGAAP 2011'!M51","v":-789059},-97267,null,-886326,888917]
[47,1985,"Miscellaneous Fixed Assets",null,{"$f":"'App.2-B_FA Contin CGAAP 2011'!H52","v":0},null,null,0,null,{"$f":"'App.2-B_FA Contin CGAAP 2011'!M52","v":0},null,null,0,0]
[47,1995,"Contributions & Grants",null,{"$f":"'App.2-B_FA Contin CGAAP 2011'!H53","v":-7714946},-1083954,null,-8798900,null,{"$f":"'App.2-B_FA Contin CGAAP 2011'!M53","v":1570218},300681,null,1870899,-6928001]
[null,"etc.",null,null,{"$f":"'App.2-B_FA Contin CGAAP 2009'!H54","v":0},null,null,0,null,null,null,null,0,0]
[null,null,null,null,{"$f":"'App.2-B_FA Contin CGAAP 2009'!H55","v":0}]
[null,null,"Total",null,{"$f":"SUM(E16:E55)","v":54353342},{"$f":"SUM(F16:F55)","v":6083921},-317646,60119617,null,{"$f":"SUM(J16:J55)","v":-28293279},{"$f":"SUM(K16:K55)","v":-2179090},{"$f":"SUM(L16:L55)","v":266170},-30206199,29913418]
[]
[null,null,null,null,{"$f":"E56+J56","v":26060063},null,null,null,null,"Less: Fully Allocated Depreciation"]
[10,null,"Transportation",null,{"$f":"F56+G56+L56","v":6032445},null,null,null,null,"Transportation",null,{"$f":"K42","v":-159800}]
[8,null,"Stores Equipment",null,{"$f":"K56","v":-2179090},null,null,null,null,"Stranded Meters",null,43000]
[null,null,null,null,{"$f":"SUM(E58:E60)","v":29913418},null,null,null,null,"Net Depreciation",null,{"$f":"K56-L59-L60","v":-2062290},{"$f":"L61-'App.2-B_FA Contin MIFRS 2012'!L61","v":-639864}]
[]
["Notes:"]
[]
[1,"Tables in the format outlined above covering all fixed asset accounts should be submitted for the Test Year, Bridge Year and all relevant historical years.  At a minimum , the applicant must provide data for the earlier of: 1) all historical years back to its last rebasing; or 2) at least three years of historical actuals, in addition to Bridge Year and Test Year forecasts."]
[]
[]
[2,"The \"CCA Class\" for fixed assets should agree with the CCA Class used for tax purposes in Tax Returns. Fixed Assets sub-components may be used where the underlying asset components are classified under multiple CCA Classes for tax purposes. If an applicant uses any different classes from those shown in the table, an explanation should be provided. (also see note 3 below)."]
[]
[]
[3,"The table may need to be customized for a utility's asset categories or for any new asset accounts announced or authorized by the Board."]
[]
[4,"The depreciation column (D) is not required as the relevant information will be provided in the following 2-C series of appendices."]

{"sheet":"App.2-B_FA Contin MIFRS 2012","index":7,"n_rows":73,"n_cols":14,"rows_kept":73,"cut":false,"hidden":false,"merged":[[70,1,70,13],[8,0,8,13],[9,0,9,13],[13,4,13,7],[64,1,65,13],[67,1,68,13]]}
[null,null,null,null,null,null,null,null,null,null,null,null,"File Number:",{"$f":"'LDC Info'!$E$18","v":"EB-2012-0139"}]
[null,null,null,null,null,null,null,null,null,null,null,null,"Exhibit:",2]
[null,null,null,null,null,null,null,null,null,null,null,null,"Tab:",2]
[null,null,null,null,null,null,null,null,null,null,null,null,"Schedule:",1]
[null,null,null,null,null,null,null,null,null,null,null,null,"Page:",10]
[]
[null,null,null,null,null,null,null,null,null,null,null,null,"Date:","Sep. 10, 2012"]
[]
["Appendix 2-B"]
["Fixed Asset Continuity Schedule"]
[]
[null,null,null,null,null,"Year ",2012]
[]
[null,null,null,null,"Cost",null,null,null,null,null,"Accumulated Depreciation"]
["CCA Class","OEB","Description","Depreciation Rate","Opening Balance","Additions","Disposals","Closing Balance",null,"Opening Balance","Additions","Disposals","Closing Balance","Net Book Value"]
[12,1611,"Computer Software (Formally known as Account 1925)",null,{"$f":"'App.2-B_FA Contin CGAAP 2011'!H16+'App.2-B_FA Contin CGAAP 2011'!F60","v":363599},{"$f":"314683-'App.2-B_FA Contin CGAAP 2011'!F60","v":282150},null,{"$f":"E16+F16+G16","v":645749},null,{"$f":"'App.2-B_FA Contin CGAAP 2011'!M16+'App.2-B_FA Contin CGAAP 2011'!K60","v":-238982},{"$f":"-113920","v":-113920},null,{"$f":"J16+K16+L16","v":-352902},{"$f":"H16+M16","v":292847}]
["CEC",1612,"Land Rights (Formally known as Account 1906)",null,{"$f":"'App.2-B_FA Contin CGAAP 2011'!H17","v":0},null,null,{"$f":"E17+F17+G17","v":0},null,{"$f":"'App.2-B_FA Contin CGAAP 2011'!M17","v":0},null,null,{"$f":"J17+K17+L17","v":0},{"$f":"H17+M17","v":0}]
["N/A",1805,"Land",null,{"$f":"'App.2-B_FA Contin CGAAP 2011'!H18","v":273770},465000,null,{"$f":"E18+F18+G18","v":738770},null,{"$f":"'App.2-B_FA Contin CGAAP 2011'!M18","v":0},null,null,{"$f":"J18+K18+L18","v":0},{"$f":"H18+M18","v":738770}]
["CEC",1806,"Land Rights",null,{"$f":"'App.2-B_FA Contin CGAAP 2011'!H19","v":982703},null,null,{"$f":"E19+F19+G19","v":982703},null,{"$f":"'App.2-B_FA Contin CGAAP 2011'!M19","v":-557986},-14872,null,{"$f":"J19+K19+L19","v":-572858},{"$f":"H19+M19","v":409845}]
[47,1808,"Buildings",null,{"$f":"'App.2-B_FA Contin CGAAP 2011'!H20","v":0},null,null,{"$f":"E20+F20+G20","v":0},null,{"$f":"'App.2-B_FA Contin CGAAP 2011'!M20","v":0},null,null,{"$f":"J20+K20+L20","v":0},{"$f":"H20+M20","v":0}]
[13,1810,"Leasehold Improvements",null,{"$f":"'App.2-B_FA Contin CGAAP 2011'!H21","v":86252},null,null,86252,null,{"$f":"'App.2-B_FA Contin CGAAP 2011'!M21","v":-34500},-3312,null,-37812,48440]
[47,1815,"Transformer Station Equipment >50 kV",null,{"$f":"'App.2-B_FA Contin CGAAP 2011'!H22","v":0},null,null,0,null,{"$f":"'App.2-B_FA Contin CGAAP 2011'!M22","v":0},null,null,0,0]
[47,1820,"Distribution Station Equipment <50 kV",null,{"$f":"'App.2-B_FA Contin CGAAP 2011'!H23","v":4358561},35448,null,4394009,null,{"$f":"'App.2-B_FA Contin CGAAP 2011'!M23","v":-2322876},-90878,null,-2413754,1980255]
[47,1825,"Storage Battery Equipment",null,{"$f":"'App.2-B_FA Contin CGAAP 2011'!H24","v":0},null,null,0,null,{"$f":"'App.2-B_FA Contin CGAAP 2011'!M24","v":0},null,null,0,0]
[47,1830,"Poles, Towers & Fixtures",null,{"$f":"'App.2-B_FA Contin CGAAP 2011'!H25","v":9077888},1172023,-100000,10149911,null,{"$f":"'App.2-B_FA Contin CGAAP 2011'!M25","v":-4286653},-187013,85000,-4388666,5761245]
[47,1835,"Overhead Conductors & Devices",null,{"$f":"'App.2-B_FA Contin CGAAP 2011'!H26","v":13192946},1314249,-150000,14357195,null,{"$f":"'App.2-B_FA Contin CGAAP 2011'!M26","v":-7476921},-147438,127500,-7496859,6860336]
[47,1840,"Underground Conduit",null,{"$f":"'App.2-B_FA Contin CGAAP 2011'!H27","v":2035571},37200,null,2072771,null,{"$f":"'App.2-B_FA Contin CGAAP 2011'!M27","v":-487767},-48744,null,-536511,1536260]
[47,1845,"Underground Conductors & Devices",null,{"$f":"'App.2-B_FA Contin CGAAP 2011'!H28","v":11721156},454700,-50000,12125856,null,{"$f":"'App.2-B_FA Contin CGAAP 2011'!M28","v":-4339016},-316093,42500,-4612609,7513247]
[47,1850,"Line Transformers",null,{"$f":"'App.2-B_FA Contin CGAAP 2011'!H29","v":8602786},545110,-10000,9137896,null,{"$f":"'App.2-B_FA Contin CGAAP 2011'!M29","v":-5587946},-206644,8500,-5786090,3351806]
[47,1855,"Services (Overhead & Underground)",null,{"$f":"'App.2-B_FA Contin CGAAP 2011'!H30","v":4017136},207405,null,4224541,null,{"$f":"'App.2-B_FA Contin CGAAP 2011'!M30","v":-1757180},-79751,null,-1836931,2387610]
[47,1860,"Meters",null,{"$f":"'App.2-B_FA Contin CGAAP 2011'!H31","v":287258},null,null,287258,null,{"$f":"'App.2-B_FA Contin CGAAP 2011'!M31","v":-67036},{"$f":"287258*-0.04","v":-11490.32},null,-78526.320000000007,208731.68]
[47,1860,"Meters (Smart Meters)",null,{"$f":"'App.2-B_FA Contin CGAAP 2011'!F59","v":2162281},{"$f":"2236521-E32","v":74240},null,2236521,null,{"$f":"'App.2-B_FA Contin CGAAP 2011'!K59","v":-327495},{"$f":"-201112-K31+43000","v":-146621.68},null,-474116.68,1762404.32]
[47,1875,"Street Lighting",null,{"$f":"'App.2-B_FA Contin CGAAP 2011'!H33","v":7646},null,-7646,0,null,{"$f":"'App.2-B_FA Contin CGAAP 2011'!M33","v":-2670},null,2670,0,0]
["N/A",1905,"Land",null,{"$f":"'App.2-B_FA Contin CGAAP 2011'!H34","v":201049},null,null,201049,null,{"$f":"'App.2-B_FA Contin CGAAP 2011'!M34","v":0},null,null,0,201049]
[47,1908,"Buildings & Fixtures",null,{"$f":"'App.2-B_FA Contin CGAAP 2011'!H35","v":739631},2025000,null,2764631,null,{"$f":"'App.2-B_FA Contin CGAAP 2011'!M35","v":-273912},-28866,null,-302778,2461853]
[13,1910,"Leasehold Improvements",null,{"$f":"'App.2-B_FA Contin CGAAP 2011'!H36","v":0},null,null,0,null,{"$f":"'App.2-B_FA Contin CGAAP 2011'!M36","v":0},null,null,0,0]
[8,1915,"Office Furniture & Equipment (10 years)",null,{"$f":"'App.2-B_FA Contin CGAAP 2011'!H37","v":308655},25500,null,334155,null,{"$f":"'App.2-B_FA Contin CGAAP 2011'!M37","v":-232648},-12536,null,-245184,88971]
[8,1915,"Office Furniture & Equipment (5 years)",null,{"$f":"'App.2-B_FA Contin CGAAP 2011'!H38","v":0},null,null,0,null,{"$f":"'App.2-B_FA Contin CGAAP 2011'!M38","v":0},null,null,0,0]
[10,1920,"Computer Equipment - Hardware",null,{"$f":"'App.2-B_FA Contin CGAAP 2011'!H39","v":515306},122500,null,637806,null,{"$f":"'App.2-B_FA Contin CGAAP 2011'!M39","v":-400081},-62665,null,-462746,175060]
[45,1920,"Computer Equip.-Hardware(Post Mar. 22/04)",null,{"$f":"'App.2-B_FA Contin CGAAP 2011'!H40","v":0},null,null,0,null,{"$f":"'App.2-B_FA Contin CGAAP 2011'!M40","v":0},null,null,0,0]
[45.1,1920,"Computer Equip.-Hardware(Post Mar. 19/07)",null,{"$f":"'App.2-B_FA Contin CGAAP 2011'!H41","v":0},null,null,0,null,{"$f":"'App.2-B_FA Contin CGAAP 2011'!M41","v":0},null,null,0,0]
[10,1930,"Transportation Equipment",null,{"$f":"'App.2-B_FA Contin CGAAP 2011'!H42","v":1174196},null,null,1174196,null,{"$f":"'App.2-B_FA Contin CGAAP 2011'!M42","v":-460134},-159800,null,-619934,554262]
[8,1935,"Stores Equipment",null,{"$f":"'App.2-B_FA Contin CGAAP 2011'!H43","v":31824},4000,null,35824,null,{"$f":"'App.2-B_FA Contin CGAAP 2011'!M43","v":-18172},-1954,null,-20126,15698]
[8,1940,"Tools, Shop & Garage Equipment",null,{"$f":"'App.2-B_FA Contin CGAAP 2011'!H44","v":487684},27000,null,514684,null,{"$f":"'App.2-B_FA Contin CGAAP 2011'!M44","v":-188237},-32112,null,-220349,294335]
[8,1945,"Measurement & Testing Equipment",null,{"$f":"'App.2-B_FA Contin CGAAP 2011'!H45","v":32997},8500,null,41497,null,{"$f":"'App.2-B_FA Contin CGAAP 2011'!M45","v":-14226},-2631,null,-16857,24640]
[8,1950,"Power Operated Equipment",null,{"$f":"'App.2-B_FA Contin CGAAP 2011'!H46","v":0},null,null,0,null,{"$f":"'App.2-B_FA Contin CGAAP 2011'!M46","v":0},null,null,0,0]
[8,1955,"Communications Equipment",null,{"$f":"'App.2-B_FA Contin CGAAP 2011'!H47","v":0},null,null,0,null,{"$f":"'App.2-B_FA Contin CGAAP 2011'!M47","v":0},null,null,0,0]
[8,1955,"Communication Equipment (Smart Meters)",null,{"$f":"'App.2-B_FA Contin CGAAP 2011'!H48","v":0},null,null,0,null,{"$f":"'App.2-B_FA Contin CGAAP 2011'!M48","v":0},null,null,0,0]
[8,1960,"Miscellaneous Equipment ",null,{"$f":"'App.2-B_FA Contin CGAAP 2011'!H49","v":0},null,null,0,null,{"$f":"'App.2-B_FA Contin CGAAP 2011'!M49","v":0},null,null,0,0]
[47,1975,"Load Management Controls Utility Premises",null,{"$f":"'App.2-B_FA Contin CGAAP 2011'!H50","v":0},null,null,0,null,{"$f":"'App.2-B_FA Contin CGAAP 2011'!M50","v":0},null,null,0,0]
[47,1980,"System Supervisor Equipment",null,{"$f":"'App.2-B_FA Contin CGAAP 2011'!H51","v":1407393},367850,null,1775243,null,{"$f":"'App.2-B_FA Contin CGAAP 2011'!M51","v":-789059},-97267,null,-886326,888917]
[47,1985,"Miscellaneous Fixed Assets",null,{"$f":"'App.2-B_FA Contin CGAAP 2011'!H52","v":0},null,null,0,null,{"$f":"'App.2-B_FA Contin CGAAP 2011'!M52","v":0},null,null,0,0]
[47,1995,"Contributions & Grants",null,{"$f":"'App.2-B_FA Contin CGAAP 2011'!H53","v":-7714946},-1083954,null,-8798900,null,{"$f":"'App.2-B_FA Contin CGAAP 2011'!M53","v":1570218},225382,null,1795600,-7003300]
[null,"etc.",null,null,{"$f":"'App.2-B_FA Contin CGAAP 2009'!H54","v":0},null,null,0,null,null,null,null,0,0]
[null,null,null,null,{"$f":"'App.2-B_FA Contin CGAAP 2009'!H55","v":0}]
[null,null,"Total",null,{"$f":"SUM(E16:E55)","v":54353342},{"$f":"SUM(F16:F55)","v":6083921},-317646,60119617,null,{"$f":"SUM(J16:J55)","v":-28293279},{"$f":"SUM(K16:K55)","v":-1539226},{"$f":"SUM(L16:L55)","v":266170},-29566335,30553282]
[null,null,null,null,null,null,null,null,null,null,null,null,null,{"$f":"N56+75000","v":30628282}]
[null,null,null,null,null,null,null,null,null,"Less: Fully Allocated Depreciation"]
[10,null,"Transportation",null,null,null,null,null,null,"Transportation",null,{"$f":"K42","v":-159800}]
[8,null,"Stores Equipment",null,null,null,null,null,null,"Stranded Meters",null,43000]
[null,null,null,null,null,null,null,null,null,"Net Depreciation",null,{"$f":"K56-L59-L60","v":-1422426}]
[]
["Notes:"]
[]
[1,"Tables in the format outlined above covering all fixed asset accounts should be submitted for the Test Year, Bridge Year and all relevant historical years.  At a minimum , the applicant must provide data for the earlier of: 1) all historical years back to its last rebasing; or 2) at least three years of historical actuals, in addition to Bridge Year and Test Year forecasts."]
[]
[]
[2,"The \"CCA Class\" for fixed assets should agree with the CCA Class used for tax purposes in Tax Returns. Fixed Assets sub-components may be used where the underlying asset components are classified under multiple CCA Classes for tax purposes. If an applicant uses any different classes from those shown in the table, an explanation should be provided. (also see note 3 below)."]
[]
[]
[3,"The table may need to be customized for a utility's asset categories or for any new asset accounts announced or authorized by the Board."]
[]
[4,"The depreciation column (D) is not required as the relevant information will be provided in the following 2-C series of appendices."]

{"sheet":"App.2-B_FA Contin MIFRS 2013","index":8,"n_rows":73,"n_cols":14,"rows_kept":73,"cut":false,"hidden":false,"merged":[[70,1,70,13],[8,0,8,13],[9,0,9,13],[13,4,13,7],[64,1,65,13],[67,1,68,13]]}
[null,null,null,null,null,null,null,null,null,null,null,null,"File Number:",{"$f":"'LDC Info'!$E$18","v":"EB-2012-0139"}]
[null,null,null,null,null,null,null,null,null,null,null,null,"Exhibit:",2]
[null,null,null,null,null,null,null,null,null,null,null,null,"Tab:",2]
[null,null,null,null,null,null,null,null,null,null,null,null,"Schedule:",1]
[null,null,null,null,null,null,null,null,null,null,null,null,"Page:",11]
[]
[null,null,null,null,null,null,null,null,null,null,null,null,"Date:","2012-08-31"]
[]
["Appendix 2-B"]
["Fixed Asset Continuity Schedule"]
[]
[null,null,null,null,null,"Year ",2013]
[]
[null,null,null,null,"Cost",null,null,null,null,null,"Accumulated Depreciation"]
["CCA Class","OEB","Description","Depreciation Rate","Opening Balance","Additions","Disposals","Closing Balance",null,"Opening Balance","Additions","Disposals","Closing Balance","Net Book Value"]
[12,1611,"Computer Software (Formally known as Account 1925)",null,{"$f":"'App.2-B_FA Contin MIFRS 2012'!H16","v":645749},278500,null,{"$f":"E16+F16+G16","v":924249},null,{"$f":"'App.2-B_FA Contin MIFRS 2012'!M16","v":-352902},-174811,null,{"$f":"J16+K16+L16","v":-527713},{"$f":"H16+M16","v":396536}]
["CEC",1612,"Land Rights (Formally known as Account 1906)",null,{"$f":"'App.2-B_FA Contin MIFRS 2012'!H17","v":0},null,null,{"$f":"E17+F17+G17","v":0},null,{"$f":"'App.2-B_FA Contin MIFRS 2012'!M17","v":0},null,null,{"$f":"J17+K17+L17","v":0},{"$f":"H17+M17","v":0}]
["N/A",1805,"Land",null,{"$f":"'App.2-B_FA Contin MIFRS 2012'!H18","v":738770},null,null,{"$f":"E18+F18+G18","v":738770},null,{"$f":"'App.2-B_FA Contin MIFRS 2012'!M18","v":0},null,null,{"$f":"J18+K18+L18","v":0},{"$f":"H18+M18","v":738770}]
["CEC",1806,"Land Rights",null,{"$f":"'App.2-B_FA Contin MIFRS 2012'!H19","v":982703},null,null,{"$f":"E19+F19+G19","v":982703},null,{"$f":"'App.2-B_FA Contin MIFRS 2012'!M19","v":-572858},-14575,null,{"$f":"J19+K19+L19","v":-587433},{"$f":"H19+M19","v":395270}]
[47,1808,"Buildings",null,{"$f":"'App.2-B_FA Contin MIFRS 2012'!H20","v":0},null,null,{"$f":"E20+F20+G20","v":0},null,{"$f":"'App.2-B_FA Contin MIFRS 2012'!M20","v":0},null,null,{"$f":"J20+K20+L20","v":0},{"$f":"H20+M20","v":0}]
[13,1810,"Leasehold Improvements",null,{"$f":"'App.2-B_FA Contin MIFRS 2012'!H21","v":86252},null,null,86252,null,{"$f":"'App.2-B_FA Contin MIFRS 2012'!M21","v":-37812},-3312,null,-41124,45128]
[47,1815,"Transformer Station Equipment >50 kV",null,{"$f":"'App.2-B_FA Contin MIFRS 2012'!H22","v":0},null,null,0,null,{"$f":"'App.2-B_FA Contin MIFRS 2012'!M22","v":0},null,null,0,0]
[47,1820,"Distribution Station Equipment <50 kV",null,{"$f":"'App.2-B_FA Contin MIFRS 2012'!H23","v":4394009},194422,null,4588431,null,{"$f":"'App.2-B_FA Contin MIFRS 2012'!M23","v":-2413754},-93752,null,-2507506,2080925]
[47,1825,"Storage Battery Equipment",null,{"$f":"'App.2-B_FA Contin MIFRS 2012'!H24","v":0},null,null,0,null,{"$f":"'App.2-B_FA Contin MIFRS 2012'!M24","v":0},null,null,0,0]
[47,1830,"Poles, Towers & Fixtures",null,{"$f":"'App.2-B_FA Contin MIFRS 2012'!H25","v":10149911},918153,-105000,10963064,null,{"$f":"'App.2-B_FA Contin MIFRS 2012'!M25","v":-4388666},-210238,89250,-4509654,6453410]
[47,1835,"Overhead Conductors & Devices",null,{"$f":"'App.2-B_FA Contin MIFRS 2012'!H26","v":14357195},1123543,-157500,15323238,null,{"$f":"'App.2-B_FA Contin MIFRS 2012'!M26","v":-7496859},-167753,133875,-7530737,7792501]
[47,1840,"Underground Conduit",null,{"$f":"'App.2-B_FA Contin MIFRS 2012'!H27","v":2072771},38205,null,2110976,null,{"$f":"'App.2-B_FA Contin MIFRS 2012'!M27","v":-536511},-49686,null,-586197,1524779]
[47,1845,"Underground Conductors & Devices",null,{"$f":"'App.2-B_FA Contin MIFRS 2012'!H28","v":12125856},157573,-52500,12230929,null,{"$f":"'App.2-B_FA Contin MIFRS 2012'!M28","v":-4612609},-323746,44625,-4891730,7339199]
[47,1850,"Line Transformers",null,{"$f":"'App.2-B_FA Contin MIFRS 2012'!H29","v":9137896},649500,-10500,9776896,null,{"$f":"'App.2-B_FA Contin MIFRS 2012'!M29","v":-5786090},{"$f":"-38983-182594","v":-221577},8925,-5998742,3778154]
[47,1855,"Services (Overhead & Underground)",null,{"$f":"'App.2-B_FA Contin MIFRS 2012'!H30","v":4224541},216912,null,4441453,null,{"$f":"'App.2-B_FA Contin MIFRS 2012'!M30","v":-1836931},{"$f":"-17945-66049","v":-83994},null,-1920925,2520528]
[47,1860,"Meters",null,{"$f":"'App.2-B_FA Contin MIFRS 2012'!H31","v":287258},null,null,287258,null,{"$f":"'App.2-B_FA Contin MIFRS 2012'!M31","v":-78526.320000000007},-11490,null,-90016.320000000007,197241.68]
[47,1860,"Meters (Smart Meters)",null,{"$f":"'App.2-B_FA Contin MIFRS 2012'!H32","v":2236521},116170,null,2352691,null,{"$f":"'App.2-B_FA Contin MIFRS 2012'!M32","v":-474116.68},{"$f":"-164458-K31","v":-152968},null,-627084.67999999993,1725606.32]
[47,1875,"Street Lighting",null,{"$f":"'App.2-B_FA Contin MIFRS 2012'!H33","v":0},null,null,0,null,{"$f":"'App.2-B_FA Contin MIFRS 2012'!M33","v":0},null,null,0,0]
["N/A",1905,"Land",null,{"$f":"'App.2-B_FA Contin MIFRS 2012'!H34","v":201049},null,null,201049,null,{"$f":"'App.2-B_FA Contin MIFRS 2012'!M34","v":0},null,null,0,201049]
[47,1908,"Buildings & Fixtures",null,{"$f":"'App.2-B_FA Contin MIFRS 2012'!H35","v":2764631},5127500,null,7892131,null,{"$f":"'App.2-B_FA Contin MIFRS 2012'!M35","v":-302778},-100391,null,-403169,7488962]
[13,1910,"Leasehold Improvements",null,{"$f":"'App.2-B_FA Contin MIFRS 2012'!H36","v":0},null,null,0,null,{"$f":"'App.2-B_FA Contin MIFRS 2012'!M36","v":0},null,null,0,0]
[8,1915,"Office Furniture & Equipment (10 years)",null,{"$f":"'App.2-B_FA Contin MIFRS 2012'!H37","v":334155},35000,null,369155,null,{"$f":"'App.2-B_FA Contin MIFRS 2012'!M37","v":-245184},-15561,null,-260745,108410]
[8,1915,"Office Furniture & Equipment (5 years)",null,{"$f":"'App.2-B_FA Contin MIFRS 2012'!H38","v":0},null,null,0,null,{"$f":"'App.2-B_FA Contin MIFRS 2012'!M38","v":0},null,null,0,0]
[10,1920,"Computer Equipment - Hardware",null,{"$f":"'App.2-B_FA Contin MIFRS 2012'!H39","v":637806},128000,null,765806,null,{"$f":"'App.2-B_FA Contin MIFRS 2012'!M39","v":-462746},-75182,null,-537928,227878]
[45,1920,"Computer Equip.-Hardware(Post Mar. 22/04)",null,{"$f":"'App.2-B_FA Contin MIFRS 2012'!H40","v":0},null,null,0,null,{"$f":"'App.2-B_FA Contin MIFRS 2012'!M40","v":0},null,null,0,0]
[45.1,1920,"Computer Equip.-Hardware(Post Mar. 19/07)",null,{"$f":"'App.2-B_FA Contin MIFRS 2012'!H41","v":0},null,null,0,null,{"$f":"'App.2-B_FA Contin MIFRS 2012'!M41","v":0},null,null,0,0]
[10,1930,"Transportation Equipment",null,{"$f":"'App.2-B_FA Contin MIFRS 2012'!H42","v":1174196},110000,null,1284196,null,{"$f":"'App.2-B_FA Contin MIFRS 2012'!M42","v":-619934},-170800,null,-790734,493462]
[8,1935,"Stores Equipment",null,{"$f":"'App.2-B_FA Contin MIFRS 2012'!H43","v":35824},4200,null,40024,null,{"$f":"'App.2-B_FA Contin MIFRS 2012'!M43","v":-20126},-2364,null,-22490,17534]
[8,1940,"Tools, Shop & Garage Equipment",null,{"$f":"'App.2-B_FA Contin MIFRS 2012'!H44","v":514684},20000,null,534684,null,{"$f":"'App.2-B_FA Contin MIFRS 2012'!M44","v":-220349},-34462,null,-254811,279873]
[8,1945,"Measurement & Testing Equipment",null,{"$f":"'App.2-B_FA Contin MIFRS 2012'!H45","v":41497},19000,null,60497,null,{"$f":"'App.2-B_FA Contin MIFRS 2012'!M45","v":-16857},-4006,null,-20863,39634]
[8,1950,"Power Operated Equipment",null,{"$f":"'App.2-B_FA Contin MIFRS 2012'!H46","v":0},null,null,0,null,{"$f":"'App.2-B_FA Contin MIFRS 2012'!M46","v":0},null,null,0,0]
[8,1955,"Communications Equipment",null,{"$f":"'App.2-B_FA Contin MIFRS 2012'!H47","v":0},null,null,0,null,{"$f":"'App.2-B_FA Contin MIFRS 2012'!M47","v":0},null,null,0,0]
[8,1955,"Communication Equipment (Smart Meters)",null,{"$f":"'App.2-B_FA Contin MIFRS 2012'!H48","v":0},null,null,0,null,{"$f":"'App.2-B_FA Contin MIFRS 2012'!M48","v":0},null,null,0,0]
[8,1960,"Miscellaneous Equipment ",null,{"$f":"'App.2-B_FA Contin MIFRS 2012'!H49","v":0},null,null,0,null,{"$f":"'App.2-B_FA Contin MIFRS 2012'!M49","v":0},null,null,0,0]
[47,1975,"Load Management Controls Utility Premises",null,{"$f":"'App.2-B_FA Contin MIFRS 2012'!H50","v":0},null,null,0,null,{"$f":"'App.2-B_FA Contin MIFRS 2012'!M50","v":0},null,null,0,0]
[47,1980,"System Supervisor Equipment",null,{"$f":"'App.2-B_FA Contin MIFRS 2012'!H51","v":1775243},266697,null,2041940,null,{"$f":"'App.2-B_FA Contin MIFRS 2012'!M51","v":-886326},-118418,null,-1004744,1037196]
[47,1985,"Miscellaneous Fixed Assets",null,{"$f":"'App.2-B_FA Contin MIFRS 2012'!H52","v":0},null,null,0,null,{"$f":"'App.2-B_FA Contin MIFRS 2012'!M52","v":0},null,null,0,0]
[47,1995,"Contributions & Grants",null,{"$f":"'App.2-B_FA Contin MIFRS 2012'!H53","v":-8798900},-382523,null,-9181423,null,{"$f":"'App.2-B_FA Contin MIFRS 2012'!M53","v":1795600},246332,null,2041932,-7139491]
[null,"etc.",null,null,{"$f":"'App.2-B_FA Contin CGAAP 2009'!H54","v":0},null,null,0,null,null,null,null,0,0]
[null,null,null,null,{"$f":"'App.2-B_FA Contin CGAAP 2009'!H55","v":0}]
[null,null,"Total",null,{"$f":"SUM(E16:E55)","v":60119617},{"$f":"SUM(F16:F55)","v":9020852},-325500,68814969,null,{"$f":"SUM(J16:J55)","v":-29566335},{"$f":"SUM(K16:K55)","v":-1782754},{"$f":"SUM(L16:L55)","v":276675},-31072414,37742555]
[null,null,null,null,null,null,null,null,null,null,null,null,null,{"$f":"N56+75000","v":37817555}]
[null,null,null,null,null,null,null,null,null,"Less: Fully Allocated Depreciation"]
[10,null,"Transportation",null,null,null,null,null,null,"Transportation",null,{"$f":"K42","v":-170800}]
[8,null,"Stores Equipment",null,null,null,null,null,null,"Stranded Meters"]
[null,null,null,null,null,null,null,null,null,"Net Depreciation",null,{"$f":"K56-L59-L60","v":-1611954}]
[]
["Notes:"]
[]
[1,"Tables in the format outlined above covering all fixed asset accounts should be submitted for the Test Year, Bridge Year and all relevant historical years.  At a minimum , the applicant must provide data for the earlier of: 1) all historical years back to its last rebasing; or 2) at least three years of historical actuals, in addition to Bridge Year and Test Year forecasts."]
[]
[]
[2,"The \"CCA Class\" for fixed assets should agree with the CCA Class used for tax purposes in Tax Returns. Fixed Assets sub-components may be used where the underlying asset components are classified under multiple CCA Classes for tax purposes. If an applicant uses any different classes from those shown in the table, an explanation should be provided. (also see note 3 below)."]
[]
[]
[3,"The table may need to be customized for a utility's asset categories or for any new asset accounts announced or authorized by the Board."]
[]
[4,"The depreciation column (D) is not required as the relevant information will be provided in the following 2-C series of appendices."]

{"sheet":"App.2-CE_CGAAP_DepExp_2011","index":9,"n_rows":61,"n_cols":14,"rows_kept":61,"cut":false,"hidden":false,"merged":[[60,1,62,12],[9,0,9,12],[8,0,8,12],[59,1,59,12],[58,1,58,12],[13,0,14,0],[13,1,14,1],[13,11,14,11],[10,0,10,12]]}
[null,null,null,null,null,null,null,null,null,null,null,"File Number:",{"$f":"'LDC Info'!$E$18","v":"EB-2012-0139"}]
[null,null,null,null,null,null,null,null,null,null,null,"Exhibit:",2]
[null,null,null,null,null,null,null,null,null,null,null,"Tab:",2]
[null,null,null,null,null,null,null,null,null,null,null,"Schedule:",4]
[null,null,null,null,null,null,null,null,null,null,null,"Page:",1]
[]
[null,null,null,null,null,null,null,null,null,null,null,"Date:","2012-08-31"]
[]
["Appendix 2-CE"]
["Depreciation and Amortization Expense"]
["Assumes the applicant adopted IFRS for financial reporting purposes January 1, 2013"]
[null,null,"Year",2011,null,"CGAAP"]
[]
["Account","Description","Opening Regulatory Gross PP&E as at Jan 1, 2011","Less Fully Depreciated",null,"Net for Depreciation","Additions","Total for Depreciation","Years","Depreciation Rate","2011 Depreciation Expense","2011 Depreciation Expense per Appendix 2-B Fixed Assets, Column K\n (l)","Variance 2"]
[null,null,"(a)","(b)",null,"(c)","(d)","(e) = (c) + ½ x (d) 1","(f)","(g) = 1 / (f)","(h) = (e) / (f)",null,"(m) = (h) - (l)"]
[1611,"Computer Software (Formally known as Account 1925)",{"$f":"'App.2-B_FA Contin CGAAP 2011'!E16","v":1032751},823484.5,{"$f":"D16/C16","v":0.79736984035842129},{"$f":"C16-D16","v":209266.5},{"$f":"'App.2-B_FA Contin CGAAP 2011'!F16","v":73245},{"$f":"F16+0.5*G16","v":245889},3,{"$f":"IF(I16=0,\"\",1/I16)","v":0.33333333333333331},{"$f":"IF(I16=0,0,H16/I16)","v":81963},{"$f":"-'App.2-B_FA Contin CGAAP 2011'!K16","v":81963},{"$f":"IF(ISERROR(+K16-L16), \"\", +K16-L16)","v":0}]
[1612,"Land Rights (Formally known as Account 1906)",{"$f":"'App.2-B_FA Contin CGAAP 2011'!E17","v":0},null,null,{"$f":"C17-D17","v":0},{"$f":"'App.2-B_FA Contin CGAAP 2011'!F17","v":0},{"$f":"F17+0.5*G17","v":0},null,"",0,{"$f":"-'App.2-B_FA Contin CGAAP 2011'!K17","v":0},{"$f":"IF(ISERROR(+K17-L17), \"\", +K17-L17)","v":0}]
[1805,"Land",{"$f":"'App.2-B_FA Contin CGAAP 2011'!E18","v":273770},null,null,273770,{"$f":"'App.2-B_FA Contin CGAAP 2011'!F18","v":0},273770,null,"",0,{"$f":"-'App.2-B_FA Contin CGAAP 2011'!K18","v":0},0]
[1806,"Land rights",{"$f":"'App.2-B_FA Contin CGAAP 2011'!E19","v":988464},230654.3,{"$f":"D19/C19","v":0.23334618155036499},{"$f":"C19-D19","v":757809.7},{"$f":"'App.2-B_FA Contin CGAAP 2011'!F19","v":1981},{"$f":"F19+0.5*G19","v":758800.2},50,{"$f":"IF(I19=0,\"\",1/I19)","v":0.02},{"$f":"IF(I19=0,0,H19/I19)","v":15176.003999999999},{"$f":"-'App.2-B_FA Contin CGAAP 2011'!K19","v":15176},{"$f":"IF(ISERROR(+K19-L19), \"\", +K19-L19)","v":3.9999999989959178E-3}]
[1808,"Buildings",{"$f":"'App.2-B_FA Contin CGAAP 2011'!E20","v":0},null,null,0,{"$f":"'App.2-B_FA Contin CGAAP 2011'!F20","v":0},0,null,"",0,{"$f":"-'App.2-B_FA Contin CGAAP 2011'!K20","v":0},0]
[1810,"Leasehold Improvements",{"$f":"'App.2-B_FA Contin CGAAP 2011'!E21","v":86252},0,null,86252,{"$f":"'App.2-B_FA Contin CGAAP 2011'!F21","v":0},86252,25,0.04,3450.08,{"$f":"-'App.2-B_FA Contin CGAAP 2011'!K21","v":3450},7.999999999992724E-2]
[1815,"Transformer Station Equipment >50 kV",{"$f":"'App.2-B_FA Contin CGAAP 2011'!E22","v":0},null,null,0,{"$f":"'App.2-B_FA Contin CGAAP 2011'!F22","v":0},0,null,"",0,{"$f":"-'App.2-B_FA Contin CGAAP 2011'!K22","v":0},0]
[1820,"Distribution Station Equipment <50 kV",{"$f":"'App.2-B_FA Contin CGAAP 2011'!E23","v":4431283},1376998.5,{"$f":"D23/C23","v":0.31074487907903875},3054284.5,{"$f":"'App.2-B_FA Contin CGAAP 2011'!F23","v":152331},3130450,25,0.04,125218,{"$f":"-'App.2-B_FA Contin CGAAP 2011'!K23","v":125218},0]
[1825,"Storage Battery Equipment",{"$f":"'App.2-B_FA Contin CGAAP 2011'!E24","v":0},null,null,0,{"$f":"'App.2-B_FA Contin CGAAP 2011'!F24","v":0},0,null,"",0,{"$f":"-'App.2-B_FA Contin CGAAP 2011'!K24","v":0},0]
[1830,"Poles, Towers & Fixtures",{"$f":"'App.2-B_FA Contin CGAAP 2011'!E25","v":8331730},99685,{"$f":"D25/C25","v":1.1964501970179063E-2},8232045,{"$f":"'App.2-B_FA Contin CGAAP 2011'!F25","v":935010},8699550,25,0.04,347982,{"$f":"-'App.2-B_FA Contin CGAAP 2011'!K25","v":347982},0]
[1835,"Overhead Conductors & Devices",{"$f":"'App.2-B_FA Contin CGAAP 2011'!E26","v":12001819},5518803.5,0.45983058901321544,6483015.5,{"$f":"'App.2-B_FA Contin CGAAP 2011'!F26","v":1491019},7228525,25,0.04,289141,{"$f":"-'App.2-B_FA Contin CGAAP 2011'!K26","v":289141},0]
[1840,"Underground Conduit",{"$f":"'App.2-B_FA Contin CGAAP 2011'!E27","v":1810440},112555.6,6.2170301142263761E-2,1697884.4,{"$f":"'App.2-B_FA Contin CGAAP 2011'!F27","v":225131},1810449.9,25,0.04,72417.995999999999,{"$f":"-'App.2-B_FA Contin CGAAP 2011'!K27","v":72418},-4.0000000008149073E-3]
[1845,"Underground Conductors & Devices",{"$f":"'App.2-B_FA Contin CGAAP 2011'!E28","v":11561168},46545.4,4.026011904679527E-3,11514622.6,{"$f":"'App.2-B_FA Contin CGAAP 2011'!F28","v":251455},11640350.1,25,0.04,465614.00399999996,{"$f":"-'App.2-B_FA Contin CGAAP 2011'!K28","v":465614},3.9999999571591616E-3]
[1850,"Line Transformers",{"$f":"'App.2-B_FA Contin CGAAP 2011'!E29","v":8135538},53005,6.5152421388726843E-3,8082533,{"$f":"'App.2-B_FA Contin CGAAP 2011'!F29","v":487484},8326275,25,0.04,333051,{"$f":"-'App.2-B_FA Contin CGAAP 2011'!K29","v":333051},0]
[1855,"Services (Overhead & Underground)",{"$f":"'App.2-B_FA Contin CGAAP 2011'!E30","v":3711507},2228,6.0029524395346684E-4,3709279,{"$f":"'App.2-B_FA Contin CGAAP 2011'!F30","v":306192},3862375,25,0.04,154495,{"$f":"-'App.2-B_FA Contin CGAAP 2011'!K30","v":154495},0]
[1860,"Meters",{"$f":"'App.2-B_FA Contin CGAAP 2011'!E31","v":187025},0,0,187025,{"$f":"'App.2-B_FA Contin CGAAP 2011'!F31","v":10308},192179,25,0.04,7687.16,{"$f":"-'App.2-B_FA Contin CGAAP 2011'!K31","v":27067},-19379.84,"Correction of overstating stranded meters and associated accumulated depreciation.  Corrected in 2011."]
[1860,"Meters (Smart Meters)",{"$f":"'App.2-B_FA Contin CGAAP 2011'!E32","v":0},null,null,0,{"$f":"'App.2-B_FA Contin CGAAP 2011'!F32","v":0},0,null,"",0,{"$f":"-'App.2-B_FA Contin CGAAP 2011'!K32","v":0},0]
[1875,"Street Lighting",{"$f":"'App.2-B_FA Contin CGAAP 2011'!E33","v":7646},null,{"$f":"D33/C33","v":0},{"$f":"C33-D33","v":7646},{"$f":"'App.2-B_FA Contin CGAAP 2011'!F33","v":0},{"$f":"F33+0.5*G33","v":7646},25,{"$f":"IF(I33=0,\"\",1/I33)","v":0.04},{"$f":"IF(I33=0,0,H33/I33)","v":305.83999999999997},{"$f":"-'App.2-B_FA Contin CGAAP 2011'!K33","v":305},{"$f":"IF(ISERROR(+K33-L33), \"\", +K33-L33)","v":0.83999999999997499}]
[1905,"Land",{"$f":"'App.2-B_FA Contin CGAAP 2011'!E34","v":201049},null,0,201049,{"$f":"'App.2-B_FA Contin CGAAP 2011'!F34","v":0},201049,0,"",0,{"$f":"-'App.2-B_FA Contin CGAAP 2011'!K34","v":0},0]
[1908,"Buildings & Fixtures",{"$f":"'App.2-B_FA Contin CGAAP 2011'!E35","v":737784},null,0,737784,{"$f":"'App.2-B_FA Contin CGAAP 2011'!F35","v":1847},738707.5,25,0.04,29548.3,{"$f":"-'App.2-B_FA Contin CGAAP 2011'!K35","v":29548},0.2999999999992724]
[1910,"Leasehold Improvements",{"$f":"'App.2-B_FA Contin CGAAP 2011'!E36","v":0},null,null,0,{"$f":"'App.2-B_FA Contin CGAAP 2011'!F36","v":0},0,null,"",0,{"$f":"-'App.2-B_FA Contin CGAAP 2011'!K36","v":0},0]
[1915,"Office Furniture & Equipment (10 years)",{"$f":"'App.2-B_FA Contin CGAAP 2011'!E37","v":294399},151387,{"$f":"D37/C37","v":0.51422389342355102},143012,{"$f":"'App.2-B_FA Contin CGAAP 2011'!F37","v":14256},150140,10,0.1,15014,{"$f":"-'App.2-B_FA Contin CGAAP 2011'!K37","v":15014},0]
[1915,"Office Furniture & Equipment (5 years)",{"$f":"'App.2-B_FA Contin CGAAP 2011'!E38","v":0},null,null,0,{"$f":"'App.2-B_FA Contin CGAAP 2011'!F38","v":0},0,null,"",0,{"$f":"-'App.2-B_FA Contin CGAAP 2011'!K38","v":0},0]
[1920,"Computer Equipment - Hardware",{"$f":"'App.2-B_FA Contin CGAAP 2011'!E39","v":872059},565158,{"$f":"D39/C39","v":0.64807312349279123},306901,{"$f":"'App.2-B_FA Contin CGAAP 2011'!F39","v":16388},315095,5,0.2,63019,{"$f":"-'App.2-B_FA Contin CGAAP 2011'!K39","v":63019},0]
[1920,"Computer Equip.-Hardware(Post Mar. 22/04)",{"$f":"'App.2-B_FA Contin CGAAP 2011'!E40","v":0},null,null,0,{"$f":"'App.2-B_FA Contin CGAAP 2011'!F40","v":0},0,null,"",0,{"$f":"-'App.2-B_FA Contin CGAAP 2011'!K40","v":0},0]
[1920,"Computer Equip.-Hardware(Post Mar. 19/07)",{"$f":"'App.2-B_FA Contin CGAAP 2011'!E41","v":0},null,null,0,{"$f":"'App.2-B_FA Contin CGAAP 2011'!F41","v":0},0,null,"",0,{"$f":"-'App.2-B_FA Contin CGAAP 2011'!K41","v":0},0]
[1930,"Transportation Equipment",{"$f":"'App.2-B_FA Contin CGAAP 2011'!E42","v":836916},0,{"$f":"D42/C42","v":0},836916,{"$f":"'App.2-B_FA Contin CGAAP 2011'!F42","v":297131},985481.5,5,0.2,197096.3,{"$f":"-'App.2-B_FA Contin CGAAP 2011'!K42","v":220718},-23621.700000000012,"Correction of fixed asset subledger to G/L."]
[1935,"Stores Equipment",{"$f":"'App.2-B_FA Contin CGAAP 2011'!E43","v":30118},11481,0.38120061093034063,18637,{"$f":"'App.2-B_FA Contin CGAAP 2011'!F43","v":1706},19490,10,0.1,1949,{"$f":"-'App.2-B_FA Contin CGAAP 2011'!K43","v":1949},0]
[1940,"Tools, Shop & Garage Equipment",{"$f":"'App.2-B_FA Contin CGAAP 2011'!E44","v":469385},156809,0.3340733086911597,312576,{"$f":"'App.2-B_FA Contin CGAAP 2011'!F44","v":58448},341800,10,0.1,34180,{"$f":"-'App.2-B_FA Contin CGAAP 2011'!K44","v":34180},0]
[1945,"Measurement & Testing Equipment",{"$f":"'App.2-B_FA Contin CGAAP 2011'!E45","v":23690},3843.5,0.16224145208948923,19846.5,{"$f":"'App.2-B_FA Contin CGAAP 2011'!F45","v":9307},24500,10,0.1,2450,{"$f":"-'App.2-B_FA Contin CGAAP 2011'!K45","v":2450},0]
[1950,"Power Operated Equipment",{"$f":"'App.2-B_FA Contin CGAAP 2011'!E46","v":0},null,null,0,{"$f":"'App.2-B_FA Contin CGAAP 2011'!F46","v":0},0,null,"",0,{"$f":"-'App.2-B_FA Contin CGAAP 2011'!K46","v":0},0]
[1955,"Communications Equipment",{"$f":"'App.2-B_FA Contin CGAAP 2011'!E47","v":0},null,null,0,{"$f":"'App.2-B_FA Contin CGAAP 2011'!F47","v":0},0,null,"",0,{"$f":"-'App.2-B_FA Contin CGAAP 2011'!K47","v":0},0]
[1955,"Communication Equipment (Smart Meters)",{"$f":"'App.2-B_FA Contin CGAAP 2011'!E48","v":0},null,null,0,{"$f":"'App.2-B_FA Contin CGAAP 2011'!F48","v":0},0,null,"",0,{"$f":"-'App.2-B_FA Contin CGAAP 2011'!K48","v":0},0]
[1960,"Miscellaneous Equipment ",{"$f":"'App.2-B_FA Contin CGAAP 2011'!E49","v":0},null,null,0,{"$f":"'App.2-B_FA Contin CGAAP 2011'!F49","v":0},0,null,"",0,{"$f":"-'App.2-B_FA Contin CGAAP 2011'!K49","v":0},0]
[1975,"Load Management Controls Utility Premises",{"$f":"'App.2-B_FA Contin CGAAP 2011'!E50","v":0},null,null,0,{"$f":"'App.2-B_FA Contin CGAAP 2011'!F50","v":0},0,null,"",0,{"$f":"-'App.2-B_FA Contin CGAAP 2011'!K50","v":0},0]
[1980,"System Supervisor Equipment",{"$f":"'App.2-B_FA Contin CGAAP 2011'!E51","v":1324906},null,null,1324906,{"$f":"'App.2-B_FA Contin CGAAP 2011'!F51","v":82487},1366149.5,15,6.6666666666666666E-2,91076.633333333331,{"$f":"-'App.2-B_FA Contin CGAAP 2011'!K51","v":91077},-0.36666666666860692]
[1985,"Miscellaneous Fixed Assets",{"$f":"'App.2-B_FA Contin CGAAP 2011'!E52","v":0},null,null,0,{"$f":"'App.2-B_FA Contin CGAAP 2011'!F52","v":0},0,null,"",0,{"$f":"-'App.2-B_FA Contin CGAAP 2011'!K52","v":0},0]
[1995,"Contributions & Grants",{"$f":"'App.2-B_FA Contin CGAAP 2011'!E53","v":-7193539},-188567.5,null,-7004971.5,{"$f":"'App.2-B_FA Contin CGAAP 2011'!F53","v":-521407},-7265675,25,0.04,-290627,{"$f":"-'App.2-B_FA Contin CGAAP 2011'!K53","v":-290627},0]
["etc.",null,null,null,null,0,null,0,null,"",0,null,0]
[null,null,null,null,null,0,null,0,null,"",0,null,0]
[null,"Total",{"$f":"SUM(C16:C55)","v":50156160},{"$f":"SUM(D16:D55)","v":8964070.8000000007},{"$f":"D56/C56","v":0.17872322761551124},{"$f":"SUM(F16:F55)","v":41192089.199999996},{"$f":"SUM(G16:G55)","v":3894319},{"$f":"SUM(H16:H55)","v":43139248.699999996},null,null,{"$f":"SUM(K16:K55)","v":2040207.3173333332},{"$f":"SUM(L16:L55)","v":2083208},{"$f":"SUM(M16:M55)","v":-43000.682666666726}]
[]
["Notes:"]
[1,"Board policy of the \"half-year\" rule - the applicant must ensure that additions in the year attract a half-year depreciation expense in the first year.  Deviations from this standard practice must be supported in the application."]
[2,"The applicant must provide an explanation of material variances in evidence"]
["General:","Applicants must provide a breakdown of depreciation and amortization expense in the above format for all relevant accounts.  Asset Retirement Obligations (AROs), depreciation and accretion expense should be disclosed separately consistent with the Notes of historical Audited Financial Statements."]

{"sheet":"App.2-CF_CGAAP_DepExp_2012","index":10,"n_rows":62,"n_cols":14,"rows_kept":62,"cut":false,"hidden":false,"merged":[[9,0,9,12],[8,0,8,12],[58,1,58,12],[59,1,59,12],[61,1,62,12],[13,0,14,0],[13,1,14,1],[13,11,14,11],[10,0,10,12]]}
[null,null,null,null,null,null,null,null,null,null,null,"File Number:",{"$f":"'LDC Info'!$E$18","v":"EB-2012-0139"}]
[null,null,null,null,null,null,null,null,null,null,null,"Exhibit:",2]
[null,null,null,null,null,null,null,null,null,null,null,"Tab:",2]
[null,null,null,null,null,null,null,null,null,null,null,"Schedule:",4]
[null,null,null,null,null,null,null,null,null,null,null,"Page:",2]
[]
[null,null,null,null,null,null,null,null,null,null,null,"Date:","2012-08-31"]
[]
["Appendix 2-CF"]
["Depreciation and Amortization Expense"]
["Assumes the applicant adopted IFRS for financial reporting purposes January 1, 2013"]
[null,null,"Year",2012,null,"CGAAP"]
[]
["Account","Description","Opening Regulatory Gross PP&E as at Jan 1, 2012","Less Fully Depreciated",null,"Net for Depreciation","Additions","Total for Depreciation","Years","Depreciation Rate","2012 Depreciation Expense","2012 Depreciation Expense per Appendix 2-B Fixed Assets, Column K\n (l)","Variance 2"]
[null,null,"(a)","(b)",null,"(c)","(d)","(e) = (c) + ½ x (d) 1","(f)","(g) = 1 / (f)","(h) = (e) / (f)",null,"(m) = (h) - (l)"]
[1611,"Computer Software (Formally known as Account 1925)",{"$f":"'App.2-B_FA Contin CGAAP 2012'!E16","v":363599},162914,{"$f":"D16-'App.2-CE_CGAAP_DepExp_2011'!D16","v":-660570.5},{"$f":"C16-D16","v":200685},{"$f":"'App.2-B_FA Contin CGAAP 2012'!F16","v":282150},{"$f":"F16+0.5*G16","v":341760},{"$f":"'App.2-CE_CGAAP_DepExp_2011'!I16","v":3},{"$f":"IF(I16=0,0,1/I16)","v":0.33333333333333331},{"$f":"IF(I16=0,0,H16/I16)","v":113920},{"$f":"-'App.2-B_FA Contin CGAAP 2012'!K16","v":113920},{"$f":"IF(ISERROR(+K16-L16), 0, +K16-L16)","v":0}]
[1612,"Land Rights (Formally known as Account 1906)",{"$f":"'App.2-B_FA Contin CGAAP 2012'!E17","v":0},{"$f":"'App.2-CE_CGAAP_DepExp_2011'!D17","v":0},{"$f":"D17-'App.2-CE_CGAAP_DepExp_2011'!D17","v":0},{"$f":"C17-D17","v":0},{"$f":"'App.2-B_FA Contin CGAAP 2012'!F17","v":0},{"$f":"F17+0.5*G17","v":0},{"$f":"'App.2-CE_CGAAP_DepExp_2011'!I17","v":0},0,0,{"$f":"-'App.2-B_FA Contin CGAAP 2012'!K17","v":0},0]
[1805,"Land",{"$f":"'App.2-B_FA Contin CGAAP 2012'!E18","v":273770},{"$f":"'App.2-CE_CGAAP_DepExp_2011'!D18","v":0},{"$f":"D18-'App.2-CE_CGAAP_DepExp_2011'!D18","v":0},273770,{"$f":"'App.2-B_FA Contin CGAAP 2012'!F18","v":465000},506270,{"$f":"'App.2-CE_CGAAP_DepExp_2011'!I18","v":0},0,0,{"$f":"-'App.2-B_FA Contin CGAAP 2012'!K18","v":0},0]
[1806,"Land rights",{"$f":"'App.2-B_FA Contin CGAAP 2012'!E19","v":982703},{"$f":"'App.2-CE_CGAAP_DepExp_2011'!D19+8448.5","v":239102.8},{"$f":"D19-'App.2-CE_CGAAP_DepExp_2011'!D19","v":8448.5},{"$f":"C19-D19","v":743600.2},{"$f":"'App.2-B_FA Contin CGAAP 2012'!F19","v":0},{"$f":"F19+0.5*G19","v":743600.2},{"$f":"'App.2-CE_CGAAP_DepExp_2011'!I19","v":50},{"$f":"IF(I19=0,0,1/I19)","v":0.02},{"$f":"IF(I19=0,0,H19/I19)","v":14872.003999999999},{"$f":"-'App.2-B_FA Contin CGAAP 2012'!K19","v":14872},{"$f":"IF(ISERROR(+K19-L19), 0, +K19-L19)","v":3.9999999989959178E-3}]
[1808,"Buildings",{"$f":"'App.2-B_FA Contin CGAAP 2012'!E20","v":0},{"$f":"'App.2-CE_CGAAP_DepExp_2011'!D20","v":0},{"$f":"D20-'App.2-CE_CGAAP_DepExp_2011'!D20","v":0},0,{"$f":"'App.2-B_FA Contin CGAAP 2012'!F20","v":0},0,{"$f":"'App.2-CE_CGAAP_DepExp_2011'!I20","v":0},0,0,{"$f":"-'App.2-B_FA Contin CGAAP 2012'!K20","v":0},0]
[1810,"Leasehold Improvements",{"$f":"'App.2-B_FA Contin CGAAP 2012'!E21","v":86252},3452,{"$f":"D21-'App.2-CE_CGAAP_DepExp_2011'!D21","v":3452},82800,{"$f":"'App.2-B_FA Contin CGAAP 2012'!F21","v":0},82800,{"$f":"'App.2-CE_CGAAP_DepExp_2011'!I21","v":25},0.04,3312,{"$f":"-'App.2-B_FA Contin CGAAP 2012'!K21","v":3312},0]
[1815,"Transformer Station Equipment >50 kV",{"$f":"'App.2-B_FA Contin CGAAP 2012'!E22","v":0},{"$f":"'App.2-CE_CGAAP_DepExp_2011'!D22","v":0},null,0,{"$f":"'App.2-B_FA Contin CGAAP 2012'!F22","v":0},0,{"$f":"'App.2-CE_CGAAP_DepExp_2011'!I22","v":0},0,0,{"$f":"-'App.2-B_FA Contin CGAAP 2012'!K22","v":0},0]
[1820,"Distribution Station Equipment <50 kV",{"$f":"'App.2-B_FA Contin CGAAP 2012'!E23","v":4358561},{"$f":"'App.2-CE_CGAAP_DepExp_2011'!D23-23663.5","v":1353335},{"$f":"D23-'App.2-CE_CGAAP_DepExp_2011'!D23","v":-23663.5},3005226,{"$f":"'App.2-B_FA Contin CGAAP 2012'!F23","v":35448},3022950,{"$f":"'App.2-CE_CGAAP_DepExp_2011'!I23","v":25},0.04,120918,{"$f":"-'App.2-B_FA Contin CGAAP 2012'!K23","v":120918},0]
[1825,"Storage Battery Equipment",{"$f":"'App.2-B_FA Contin CGAAP 2012'!E24","v":0},{"$f":"'App.2-CE_CGAAP_DepExp_2011'!D24","v":0},null,0,{"$f":"'App.2-B_FA Contin CGAAP 2012'!F24","v":0},0,{"$f":"'App.2-CE_CGAAP_DepExp_2011'!I24","v":0},0,0,{"$f":"-'App.2-B_FA Contin CGAAP 2012'!K24","v":0},0]
[1830,"Poles, Towers & Fixtures",{"$f":"'App.2-B_FA Contin CGAAP 2012'!E25","v":9077888},{"$f":"'App.2-CE_CGAAP_DepExp_2011'!D25+626639.5","v":726324.5},{"$f":"D25-'App.2-CE_CGAAP_DepExp_2011'!D25","v":626639.5},8351563.5,{"$f":"'App.2-B_FA Contin CGAAP 2012'!F25","v":1172023},8937575,{"$f":"'App.2-CE_CGAAP_DepExp_2011'!I25","v":25},0.04,357503,{"$f":"-'App.2-B_FA Contin CGAAP 2012'!K25","v":357503},0]
[1835,"Overhead Conductors & Devices",{"$f":"'App.2-B_FA Contin CGAAP 2012'!E26","v":13192946},{"$f":"'App.2-CE_CGAAP_DepExp_2011'!D26+734767","v":6253570.5},{"$f":"D26-'App.2-CE_CGAAP_DepExp_2011'!D26","v":734767},6939375.5,{"$f":"'App.2-B_FA Contin CGAAP 2012'!F26","v":1314249},7596500,{"$f":"'App.2-CE_CGAAP_DepExp_2011'!I26","v":25},0.04,303860,{"$f":"-'App.2-B_FA Contin CGAAP 2012'!K26","v":303860},0]
[1840,"Underground Conduit",{"$f":"'App.2-B_FA Contin CGAAP 2012'!E27","v":2035571},{"$f":"'App.2-CE_CGAAP_DepExp_2011'!D27+184990.5","v":297546.09999999998},{"$f":"D27-'App.2-CE_CGAAP_DepExp_2011'!D27","v":184990.49999999997},1738024.9,{"$f":"'App.2-B_FA Contin CGAAP 2012'!F27","v":37200},1756624.9,{"$f":"'App.2-CE_CGAAP_DepExp_2011'!I27","v":25},0.04,70264.995999999999,{"$f":"-'App.2-B_FA Contin CGAAP 2012'!K27","v":70265},-4.0000000008149073E-3]
[1845,"Underground Conductors & Devices",{"$f":"'App.2-B_FA Contin CGAAP 2012'!E28","v":11721156},{"$f":"'App.2-CE_CGAAP_DepExp_2011'!D28+499860.5","v":546405.9},{"$f":"D28-'App.2-CE_CGAAP_DepExp_2011'!D28","v":499860.5},11174750.1,{"$f":"'App.2-B_FA Contin CGAAP 2012'!F28","v":454700},11402100.1,{"$f":"'App.2-CE_CGAAP_DepExp_2011'!I28","v":25},0.04,456084.00399999996,{"$f":"-'App.2-B_FA Contin CGAAP 2012'!K28","v":456084},3.9999999571591616E-3]
[1850,"Line Transformers",{"$f":"'App.2-B_FA Contin CGAAP 2012'!E29","v":8602786},{"$f":"'App.2-CE_CGAAP_DepExp_2011'!D29+556561","v":609566},{"$f":"D29-'App.2-CE_CGAAP_DepExp_2011'!D29","v":556561},7993220,{"$f":"'App.2-B_FA Contin CGAAP 2012'!F29","v":545110},8265775,{"$f":"'App.2-CE_CGAAP_DepExp_2011'!I29","v":25},0.04,330631,{"$f":"-'App.2-B_FA Contin CGAAP 2012'!K29","v":330631},0]
[1855,"Services (Overhead & Underground)",{"$f":"'App.2-B_FA Contin CGAAP 2012'!E30","v":4017136},{"$f":"'App.2-CE_CGAAP_DepExp_2011'!D30+307035.5","v":309263.5},{"$f":"D30-'App.2-CE_CGAAP_DepExp_2011'!D30","v":307035.5},3707872.5,{"$f":"'App.2-B_FA Contin CGAAP 2012'!F30","v":207405},3811575,{"$f":"'App.2-CE_CGAAP_DepExp_2011'!I30","v":25},0.04,152463,{"$f":"-'App.2-B_FA Contin CGAAP 2012'!K30","v":152463},0]
[1860,"Meters",{"$f":"'App.2-B_FA Contin CGAAP 2012'!E31","v":287258},0,{"$f":"D31-'App.2-CE_CGAAP_DepExp_2011'!D31","v":0},287258,{"$f":"'App.2-B_FA Contin CGAAP 2012'!F31","v":0},287258,{"$f":"'App.2-CE_CGAAP_DepExp_2011'!I31","v":25},0.04,11490.32,{"$f":"-'App.2-B_FA Contin CGAAP 2012'!K31","v":11490.32},0]
[1860,"Meters (Smart Meters)",{"$f":"'App.2-B_FA Contin CGAAP 2012'!E32","v":2162281},{"$f":"'App.2-CE_CGAAP_DepExp_2011'!D32","v":0},{"$f":"D32-'App.2-CE_CGAAP_DepExp_2011'!D32","v":0},2162281,{"$f":"'App.2-B_FA Contin CGAAP 2012'!F32","v":74240},2199401,15,6.6666666666666666E-2,146626.73333333334,{"$f":"-'App.2-B_FA Contin CGAAP 2012'!K32","v":146621.68},5.0533333333441988]
[1875,"Street Lighting",{"$f":"'App.2-B_FA Contin CGAAP 2012'!E33","v":7646},7646,{"$f":"D33-'App.2-CE_CGAAP_DepExp_2011'!D33","v":7646},{"$f":"C33-D33","v":0},{"$f":"'App.2-B_FA Contin CGAAP 2012'!F33","v":0},{"$f":"F33+0.5*G33","v":0},{"$f":"'App.2-CE_CGAAP_DepExp_2011'!I33","v":25},{"$f":"IF(I33=0,0,1/I33)","v":0.04},{"$f":"IF(I33=0,0,H33/I33)","v":0},{"$f":"-'App.2-B_FA Contin CGAAP 2012'!K33","v":0},{"$f":"IF(ISERROR(+K33-L33), 0, +K33-L33)","v":0}]
[1905,"Land",{"$f":"'App.2-B_FA Contin CGAAP 2012'!E34","v":201049},{"$f":"'App.2-CE_CGAAP_DepExp_2011'!D34","v":0},{"$f":"D34-'App.2-CE_CGAAP_DepExp_2011'!D34","v":0},201049,{"$f":"'App.2-B_FA Contin CGAAP 2012'!F34","v":0},201049,{"$f":"'App.2-CE_CGAAP_DepExp_2011'!I34","v":0},0,0,{"$f":"-'App.2-B_FA Contin CGAAP 2012'!K34","v":0},0]
[1908,"Buildings & Fixtures",{"$f":"'App.2-B_FA Contin CGAAP 2012'!E35","v":739631},{"$f":"'App.2-CE_CGAAP_DepExp_2011'!D35","v":0},{"$f":"D35-'App.2-CE_CGAAP_DepExp_2011'!D35","v":0},739631,{"$f":"'App.2-B_FA Contin CGAAP 2012'!F35","v":2025000},1752131,{"$f":"'App.2-CE_CGAAP_DepExp_2011'!I35","v":25},0.04,70085.240000000005,{"$f":"-'App.2-B_FA Contin CGAAP 2012'!K35","v":28866},41219.240000000005,"New building addition depreciation deferred to 2013"]
[1910,"Leasehold Improvements",{"$f":"'App.2-B_FA Contin CGAAP 2012'!E36","v":0},{"$f":"'App.2-CE_CGAAP_DepExp_2011'!D36","v":0},{"$f":"D36-'App.2-CE_CGAAP_DepExp_2011'!D36","v":0},0,{"$f":"'App.2-B_FA Contin CGAAP 2012'!F36","v":0},0,{"$f":"'App.2-CE_CGAAP_DepExp_2011'!I36","v":0},0,0,{"$f":"-'App.2-B_FA Contin CGAAP 2012'!K36","v":0},0]
[1915,"Office Furniture & Equipment (10 years)",{"$f":"'App.2-B_FA Contin CGAAP 2012'!E37","v":308655},{"$f":"'App.2-CE_CGAAP_DepExp_2011'!D37+44658","v":196045},{"$f":"D37-'App.2-CE_CGAAP_DepExp_2011'!D37","v":44658},112610,{"$f":"'App.2-B_FA Contin CGAAP 2012'!F37","v":25500},125360,{"$f":"'App.2-CE_CGAAP_DepExp_2011'!I37","v":10},0.1,12536,{"$f":"-'App.2-B_FA Contin CGAAP 2012'!K37","v":12536},0]
[1915,"Office Furniture & Equipment (5 years)",{"$f":"'App.2-B_FA Contin CGAAP 2012'!E38","v":0},{"$f":"'App.2-CE_CGAAP_DepExp_2011'!D38","v":0},{"$f":"D38-'App.2-CE_CGAAP_DepExp_2011'!D38","v":0},0,{"$f":"'App.2-B_FA Contin CGAAP 2012'!F38","v":0},0,{"$f":"'App.2-CE_CGAAP_DepExp_2011'!I38","v":0},0,0,{"$f":"-'App.2-B_FA Contin CGAAP 2012'!K38","v":0},0]
[1920,"Computer Equipment - Hardware",{"$f":"'App.2-B_FA Contin CGAAP 2012'!E39","v":515306},263231,{"$f":"D39-'App.2-CE_CGAAP_DepExp_2011'!D39","v":-301927},252075,{"$f":"'App.2-B_FA Contin CGAAP 2012'!F39","v":122500},313325,{"$f":"'App.2-CE_CGAAP_DepExp_2011'!I39","v":5},0.2,62665,{"$f":"-'App.2-B_FA Contin CGAAP 2012'!K39","v":62665},0]
[1920,"Computer Equip.-Hardware(Post Mar. 22/04)",{"$f":"'App.2-B_FA Contin CGAAP 2012'!E40","v":0},{"$f":"'App.2-CE_CGAAP_DepExp_2011'!D40","v":0},{"$f":"D40-'App.2-CE_CGAAP_DepExp_2011'!D40","v":0},0,{"$f":"'App.2-B_FA Contin CGAAP 2012'!F40","v":0},0,{"$f":"'App.2-CE_CGAAP_DepExp_2011'!I40","v":0},0,0,{"$f":"-'App.2-B_FA Contin CGAAP 2012'!K40","v":0},0]
[1920,"Computer Equip.-Hardware(Post Mar. 19/07)",{"$f":"'App.2-B_FA Contin CGAAP 2012'!E41","v":0},{"$f":"'App.2-CE_CGAAP_DepExp_2011'!D41","v":0},{"$f":"D41-'App.2-CE_CGAAP_DepExp_2011'!D41","v":0},0,{"$f":"'App.2-B_FA Contin CGAAP 2012'!F41","v":0},0,{"$f":"'App.2-CE_CGAAP_DepExp_2011'!I41","v":0},0,0,{"$f":"-'App.2-B_FA Contin CGAAP 2012'!K41","v":0},0]
[1930,"Transportation Equipment",{"$f":"'App.2-B_FA Contin CGAAP 2012'!E42","v":1174196},null,{"$f":"D42-'App.2-CE_CGAAP_DepExp_2011'!D42","v":0},1174196,{"$f":"'App.2-B_FA Contin CGAAP 2012'!F42","v":0},1174196,7.35,0.1360544217687075,159754.55782312926,{"$f":"-'App.2-B_FA Contin CGAAP 2012'!K42","v":159800},-45.442176870739786]
[1935,"Stores Equipment",{"$f":"'App.2-B_FA Contin CGAAP 2012'!E43","v":31824},{"$f":"'App.2-CE_CGAAP_DepExp_2011'!D43+2803","v":14284},{"$f":"D43-'App.2-CE_CGAAP_DepExp_2011'!D43","v":2803},17540,{"$f":"'App.2-B_FA Contin CGAAP 2012'!F43","v":4000},19540,{"$f":"'App.2-CE_CGAAP_DepExp_2011'!I43","v":10},0.1,1954,{"$f":"-'App.2-B_FA Contin CGAAP 2012'!K43","v":1954},0]
[1940,"Tools, Shop & Garage Equipment",{"$f":"'App.2-B_FA Contin CGAAP 2012'!E44","v":487684},{"$f":"'App.2-CE_CGAAP_DepExp_2011'!D44+23255","v":180064},{"$f":"D44-'App.2-CE_CGAAP_DepExp_2011'!D44","v":23255},307620,{"$f":"'App.2-B_FA Contin CGAAP 2012'!F44","v":27000},321120,{"$f":"'App.2-CE_CGAAP_DepExp_2011'!I44","v":10},0.1,32112,{"$f":"-'App.2-B_FA Contin CGAAP 2012'!K44","v":32112},0]
[1945,"Measurement & Testing Equipment",{"$f":"'App.2-B_FA Contin CGAAP 2012'!E45","v":32997},{"$f":"'App.2-CE_CGAAP_DepExp_2011'!D45+7093.5","v":10937},{"$f":"D45-'App.2-CE_CGAAP_DepExp_2011'!D45","v":7093.5},22060,{"$f":"'App.2-B_FA Contin CGAAP 2012'!F45","v":8500},26310,{"$f":"'App.2-CE_CGAAP_DepExp_2011'!I45","v":10},0.1,2631,{"$f":"-'App.2-B_FA Contin CGAAP 2012'!K45","v":2631},0]
[1950,"Power Operated Equipment",{"$f":"'App.2-B_FA Contin CGAAP 2012'!E46","v":0},{"$f":"'App.2-CE_CGAAP_DepExp_2011'!D46","v":0},{"$f":"D46-'App.2-CE_CGAAP_DepExp_2011'!D46","v":0},0,{"$f":"'App.2-B_FA Contin CGAAP 2012'!F46","v":0},0,{"$f":"'App.2-CE_CGAAP_DepExp_2011'!I46","v":0},0,0,{"$f":"-'App.2-B_FA Contin CGAAP 2012'!K46","v":0},0]
[1955,"Communications Equipment",{"$f":"'App.2-B_FA Contin CGAAP 2012'!E47","v":0},{"$f":"'App.2-CE_CGAAP_DepExp_2011'!D47","v":0},{"$f":"D47-'App.2-CE_CGAAP_DepExp_2011'!D47","v":0},0,{"$f":"'App.2-B_FA Contin CGAAP 2012'!F47","v":0},0,{"$f":"'App.2-CE_CGAAP_DepExp_2011'!I47","v":0},0,0,{"$f":"-'App.2-B_FA Contin CGAAP 2012'!K47","v":0},0]
[1955,"Communication Equipment (Smart Meters)",{"$f":"'App.2-B_FA Contin CGAAP 2012'!E48","v":0},{"$f":"'App.2-CE_CGAAP_DepExp_2011'!D48","v":0},{"$f":"D48-'App.2-CE_CGAAP_DepExp_2011'!D48","v":0},0,{"$f":"'App.2-B_FA Contin CGAAP 2012'!F48","v":0},0,{"$f":"'App.2-CE_CGAAP_DepExp_2011'!I48","v":0},0,0,{"$f":"-'App.2-B_FA Contin CGAAP 2012'!K48","v":0},0]
[1960,"Miscellaneous Equipment ",{"$f":"'App.2-B_FA Contin CGAAP 2012'!E49","v":0},{"$f":"'App.2-CE_CGAAP_DepExp_2011'!D49","v":0},{"$f":"D49-'App.2-CE_CGAAP_DepExp_2011'!D49","v":0},0,{"$f":"'App.2-B_FA Contin CGAAP 2012'!F49","v":0},0,{"$f":"'App.2-CE_CGAAP_DepExp_2011'!I49","v":0},0,0,{"$f":"-'App.2-B_FA Contin CGAAP 2012'!K49","v":0},0]
[1975,"Load Management Controls Utility Premises",{"$f":"'App.2-B_FA Contin CGAAP 2012'!E50","v":0},{"$f":"'App.2-CE_CGAAP_DepExp_2011'!D50","v":0},{"$f":"D50-'App.2-CE_CGAAP_DepExp_2011'!D50","v":0},0,{"$f":"'App.2-B_FA Contin CGAAP 2012'!F50","v":0},0,{"$f":"'App.2-CE_CGAAP_DepExp_2011'!I50","v":0},0,0,{"$f":"-'App.2-B_FA Contin CGAAP 2012'!K50","v":0},0]
[1980,"System Supervisor Equipment",{"$f":"'App.2-B_FA Contin CGAAP 2012'!E51","v":1407393},132313,{"$f":"D51-'App.2-CE_CGAAP_DepExp_2011'!D51","v":132313},1275080,{"$f":"'App.2-B_FA Contin CGAAP 2012'!F51","v":367850},1459005,{"$f":"'App.2-CE_CGAAP_DepExp_2011'!I51","v":15},6.6666666666666666E-2,97267,{"$f":"-'App.2-B_FA Contin CGAAP 2012'!K51","v":97267},0]
[1985,"Miscellaneous Fixed Assets",{"$f":"'App.2-B_FA Contin CGAAP 2012'!E52","v":0},{"$f":"'App.2-CE_CGAAP_DepExp_2011'!D52","v":0},{"$f":"D52-'App.2-CE_CGAAP_DepExp_2011'!D52","v":0},0,{"$f":"'App.2-B_FA Contin CGAAP 2012'!F52","v":0},0,{"$f":"'App.2-CE_CGAAP_DepExp_2011'!I52","v":0},0,0,{"$f":"-'App.2-B_FA Contin CGAAP 2012'!K52","v":0},0]
[1995,"Contributions & Grants",{"$f":"'App.2-B_FA Contin CGAAP 2012'!E53","v":-7714946},{"$f":"'App.2-CE_CGAAP_DepExp_2011'!D53-551330.5","v":-739898},{"$f":"D53-'App.2-CE_CGAAP_DepExp_2011'!D53","v":-551330.5},-6975048,{"$f":"'App.2-B_FA Contin CGAAP 2012'!F53","v":-1083954},-7517025,{"$f":"'App.2-CE_CGAAP_DepExp_2011'!I53","v":25},0.04,-300681,{"$f":"-'App.2-B_FA Contin CGAAP 2012'!K53","v":-300681},0]
["etc.",null,null,null,null,0,null,0,null,0,0,null,0]
[null,null,null,null,null,0,null,0,null,0,0,null,0]
[null,"Total",{"$f":"SUM(C16:C55)","v":54353342},{"$f":"SUM(D16:D55)","v":10566102.300000001},null,{"$f":"SUM(F16:F55)","v":43787239.699999996},{"$f":"SUM(G16:G55)","v":6083921},{"$f":"SUM(H16:H55)","v":46829200.199999996},null,null,{"$f":"SUM(K16:K55)","v":2220268.8551564631},{"$f":"SUM(L16:L55)","v":2179090},{"$f":"SUM(M16:M55)","v":41178.855156462567}]
[]
["Notes:"]
[1,"Board policy of the \"half-year\" rule - the applicant must ensure that additions in the year attract a half-year depreciation expense in the first year.  Deviations from this standard practice must be supported in the application."]
[2,"The applicant must provide an explanation of material variances in evidence"]
[]
["General:","Applicants must provide a breakdown of depreciation and amortization expense in the above format for all relevant accounts.  Asset Retirement Obligations (AROs), depreciation and accretion expense should be disclosed separately consistent with the Notes of historical Audited Financial Statements."]

{"sheet":"App.2-CG_MIFRS_DepExp_2012","index":11,"n_rows":67,"n_cols":15,"rows_kept":67,"cut":false,"hidden":false,"merged":[[66,1,68,11],[9,0,9,14],[8,0,8,14],[10,0,10,14],[63,1,63,14],[62,1,62,14],[61,1,61,14],[60,1,60,14],[59,1,59,14],[13,0,14,0],[13,1,14,1],[13,10,14,10],[13,13,14,13],[64,1,64,14]]}
[null,null,null,null,null,null,null,null,null,null,null,null,null,"File Number:",{"$f":"'LDC Info'!$E$18","v":"EB-2012-0139"}]
[null,null,null,null,null,null,null,null,null,null,null,null,null,"Exhibit:",2]
[null,null,null,null,null,null,null,null,null,null,null,null,null,"Tab:",2]
[null,null,null,null,null,null,null,null,null,null,null,null,null,"Schedule:",4]
[null,null,null,null,null,null,null,null,null,null,null,null,null,"Page:",3]
[]
[null,null,null,null,null,null,null,null,null,null,null,null,null,"Date:","2012-08-31"]
[]
["Appendix 2-CG"]
["Depreciation and Amortization Expense"]
["Assumes the applicant adopted IFRS for financial reporting purposes January 1, 2013"]
[null,null,"Year",2012,"MIFRS"]
[]
["Account","Description","Opening NBV as at Jan 1, 2012 5","Additions","Average Remaining Life of Opening NBV 4","Years (new additions only) 3","Depreciation Rate on New Additions","Depreciation Expense on Opening NBV","Depreciation Expense on Additions 1","2012 Depreciation Expense","2012 Depreciation Expense per Appendix 2-B Fixed Assets, Column K\n (l)","Variance 2","Depreciation Expense on 2012 Full Year Additions","Less Depreciation Expense on Assets Fully Depreciated during the year\n(o)","2012 Full Year Depreciation 6"]
[null,null,"(a)","(d)","(i)","(f)","(g) = 1 / (f)","(j) = (a) / (i)","(h)=((d)*0.5)/(f) ","(k) = (j) + (h)",null,"(m) = (k) - (l)","(n)=((d))/(f) ",null,"(p) = (j) + (n) - (o)"]
[1611,"Computer Software (Formally known as Account 1925)",{"$f":"'App.2-B_FA Contin CGAAP 2011'!N16","v":119195},{"$f":"'App.2-B_FA Contin MIFRS 2012'!F16","v":282150},1.78183,3,{"$f":"IF(F16=0,0,1/F16)","v":0.33333333333333331},{"$f":"IF(E16=0,0,+C16/E16)","v":66894.709371825593},{"$f":"IF(F16=0,0,+(D16*0.5)/F16)","v":47025},{"$f":"IF(ISERROR(+H16+I16), 0, +H16+I16)","v":113919.70937182559},{"$f":"-'App.2-B_FA Contin MIFRS 2012'!K16","v":113920},{"$f":"IF(ISERROR(+J16-K16), 0, +J16-K16)","v":-0.29062817440717481},{"$f":"IF(F16=0,0,+(D16)/F16)","v":94050},32550,{"$f":"IF(ISERROR(+M16+H16-N16), 0, +M16+H16-N16)","v":128394.70937182559}]
[1612,"Land Rights (Formally known as Account 1906)",{"$f":"'App.2-B_FA Contin CGAAP 2011'!N17","v":0},{"$f":"'App.2-B_FA Contin MIFRS 2012'!F17","v":0},null,null,0,0,0,0,{"$f":"-'App.2-B_FA Contin MIFRS 2012'!K17","v":0},0,0,null,{"$f":"IF(ISERROR(+M17+H17-N17), 0, +M17+H17-N17)","v":0}]
[1805,"Land",{"$f":"'App.2-B_FA Contin CGAAP 2011'!N18","v":273770},{"$f":"'App.2-B_FA Contin MIFRS 2012'!F18","v":465000},null,null,0,0,0,0,{"$f":"-'App.2-B_FA Contin MIFRS 2012'!K18","v":0},0,0,null,0]
[1806,"Land rights",{"$f":"'App.2-B_FA Contin CGAAP 2011'!N19","v":424717},{"$f":"'App.2-B_FA Contin MIFRS 2012'!F19","v":0},28.558,50,{"$f":"IF(F19=0,0,1/F19)","v":0.02},{"$f":"IF(E19=0,0,+C19/E19)","v":14872.084879893549},{"$f":"IF(F19=0,0,+(D19*0.5)/F19)","v":0},{"$f":"IF(ISERROR(+H19+I19), 0, +H19+I19)","v":14872.084879893549},{"$f":"-'App.2-B_FA Contin MIFRS 2012'!K19","v":14872},{"$f":"IF(ISERROR(+J19-K19), 0, +J19-K19)","v":8.4879893549441476E-2},{"$f":"IF(F19=0,0,+(D19)/F19)","v":0},297,{"$f":"IF(ISERROR(+M19+H19-N19), 0, +M19+H19-N19)","v":14575.084879893549}]
[1808,"Buildings",{"$f":"'App.2-B_FA Contin CGAAP 2011'!N20","v":0},{"$f":"'App.2-B_FA Contin MIFRS 2012'!F20","v":0},null,null,0,0,0,0,{"$f":"-'App.2-B_FA Contin MIFRS 2012'!K20","v":0},0,0,null,0]
[1810,"Leasehold Improvements",{"$f":"'App.2-B_FA Contin CGAAP 2011'!N21","v":51752},{"$f":"'App.2-B_FA Contin MIFRS 2012'!F21","v":0},15.625,25,0.04,3312.1280000000002,0,3312.1280000000002,{"$f":"-'App.2-B_FA Contin MIFRS 2012'!K21","v":3312},0.12800000000015643,0,null,3312.1280000000002]
[1815,"Transformer Station Equipment >50 kV",{"$f":"'App.2-B_FA Contin CGAAP 2011'!N22","v":0},{"$f":"'App.2-B_FA Contin MIFRS 2012'!F22","v":0},null,null,0,0,0,0,{"$f":"-'App.2-B_FA Contin MIFRS 2012'!K22","v":0},0,0,null,0]
[1820,"Distribution Station Equipment <50 kV",{"$f":"'App.2-B_FA Contin CGAAP 2011'!N23","v":2035685},{"$f":"'App.2-B_FA Contin MIFRS 2012'!F23","v":35448},22.51,40,2.5000000000000001E-2,90434.695690804074,443.1,90877.79569080408,{"$f":"-'App.2-B_FA Contin MIFRS 2012'!K23","v":90878},-0.20430919592035934,886.2,null,91320.895690804071]
[1825,"Storage Battery Equipment",{"$f":"'App.2-B_FA Contin CGAAP 2011'!N24","v":0},{"$f":"'App.2-B_FA Contin MIFRS 2012'!F24","v":0},null,null,0,0,0,0,{"$f":"-'App.2-B_FA Contin MIFRS 2012'!K24","v":0},0,0,null,0]
[1830,"Poles, Towers & Fixtures",{"$f":"'App.2-B_FA Contin CGAAP 2011'!N25","v":4791235},{"$f":"'App.2-B_FA Contin MIFRS 2012'!F25","v":1172023},27.537400000000002,45,2.2222222222222223E-2,173990.10073572668,13022.477777777778,187012.57851350447,{"$f":"-'App.2-B_FA Contin MIFRS 2012'!K25","v":187013},-0.42148649552837014,26044.955555555556,null,{"$f":"IF(ISERROR(+M25+H25-N25), 0, +M25+H25-N25)","v":200035.05629128224}]
[1835,"Overhead Conductors & Devices",{"$f":"'App.2-B_FA Contin CGAAP 2011'!N26","v":5716025},{"$f":"'App.2-B_FA Contin MIFRS 2012'!F26","v":1314249},41.88,60,1.6666666666666666E-2,136485.79274116523,10952.075000000001,147437.86774116525,{"$f":"-'App.2-B_FA Contin MIFRS 2012'!K26","v":147438},-0.132258834753884,21904.15,null,158389.94274116523]
[1840,"Underground Conduit",{"$f":"'App.2-B_FA Contin CGAAP 2011'!N27","v":1547804},{"$f":"'App.2-B_FA Contin MIFRS 2012'!F27","v":37200},32.0595,40,2.5000000000000001E-2,48279.106037212056,465,48744.106037212056,{"$f":"-'App.2-B_FA Contin MIFRS 2012'!K27","v":48744},0.10603721205552574,930,null,49209.106037212056]
[1845,"Underground Conductors & Devices",{"$f":"'App.2-B_FA Contin CGAAP 2011'!N28","v":7382140},{"$f":"'App.2-B_FA Contin MIFRS 2012'!F28","v":454700},23.781949999999998,40,2.5000000000000001E-2,310409.36508570577,5683.75,316093.11508570577,{"$f":"-'App.2-B_FA Contin MIFRS 2012'!K28","v":316093},0.11508570576552302,11367.5,null,321776.86508570577]
[1850,"Line Transformers",{"$f":"'App.2-B_FA Contin CGAAP 2011'!N29","v":3014840},{"$f":"'App.2-B_FA Contin MIFRS 2012'!F29","v":545110},15.087,40,2.5000000000000001E-2,199830.31749188044,6813.875,206644.19249188044,{"$f":"-'App.2-B_FA Contin MIFRS 2012'!K29","v":206644},0.19249188044341281,13627.75,null,213458.06749188044]
[1855,"Services (Overhead & Underground)",{"$f":"'App.2-B_FA Contin CGAAP 2011'!N30","v":2259956},{"$f":"'App.2-B_FA Contin MIFRS 2012'!F30","v":207405},29.0944,50,0.02,77676.666300043988,2074.0500000000002,79750.71630004399,{"$f":"-'App.2-B_FA Contin MIFRS 2012'!K30","v":79751},-0.2836999560095137,4148.1000000000004,null,81824.766300043993]
[1860,"Meters",{"$f":"'App.2-B_FA Contin CGAAP 2011'!N31","v":220222},{"$f":"'App.2-B_FA Contin MIFRS 2012'!F31","v":0},19.166,25,0.04,11490.243138891787,0,11490.243138891787,{"$f":"-'App.2-B_FA Contin MIFRS 2012'!K31","v":11490.32},-7.6861108213051921E-2,0,null,11490.243138891787]
[1860,"Meters (Smart Meters)",{"$f":"'App.2-B_FA Contin MIFRS 2012'!E32+'App.2-B_FA Contin MIFRS 2012'!J32","v":1834786},{"$f":"'App.2-B_FA Contin MIFRS 2012'!F32","v":74240},12.7286,15,6.6666666666666666E-2,144146.72469870999,2474.6666666666665,146621.39136537665,{"$f":"-'App.2-B_FA Contin MIFRS 2012'!K32","v":146621.68},-0.28863462334265932,4949.333333333333,null,149096.05803204334]
[1875,"Street Lighting",{"$f":"'App.2-B_FA Contin CGAAP 2011'!N33","v":4976},{"$f":"'App.2-B_FA Contin MIFRS 2012'!F33","v":0},null,0,{"$f":"IF(F33=0,0,1/F33)","v":0},{"$f":"IF(E33=0,0,+C33/E33)","v":0},{"$f":"IF(F33=0,0,+(D33*0.5)/F33)","v":0},{"$f":"IF(ISERROR(+H33+I33), 0, +H33+I33)","v":0},{"$f":"-'App.2-B_FA Contin MIFRS 2012'!K33","v":0},{"$f":"IF(ISERROR(+J33-K33), 0, +J33-K33)","v":0},{"$f":"IF(F33=0,0,+(D33)/F33)","v":0},null,{"$f":"IF(ISERROR(+M33+H33-N33), 0, +M33+H33-N33)","v":0}]
[1905,"Land",{"$f":"'App.2-B_FA Contin CGAAP 2011'!N34","v":201049},{"$f":"'App.2-B_FA Contin MIFRS 2012'!F34","v":0},null,null,0,0,0,0,{"$f":"-'App.2-B_FA Contin MIFRS 2012'!K34","v":0},0,0,null,0]
[1908,"Buildings & Fixtures",{"$f":"'App.2-B_FA Contin CGAAP 2011'!N35","v":465719},{"$f":"'App.2-B_FA Contin MIFRS 2012'!F35-2000000","v":25000},16.274999999999999,50,0.02,28615.606758832568,250,28865.606758832568,{"$f":"-'App.2-B_FA Contin MIFRS 2012'!K35","v":28866},-0.39324116743227933,500,null,29115.606758832568]
[1910,"Leasehold Improvements",{"$f":"'App.2-B_FA Contin CGAAP 2011'!N36","v":0},{"$f":"'App.2-B_FA Contin MIFRS 2012'!F36","v":0},null,null,0,0,0,0,{"$f":"-'App.2-B_FA Contin MIFRS 2012'!K36","v":0},0,0,null,0]
[1915,"Office Furniture & Equipment (10 years)",{"$f":"'App.2-B_FA Contin CGAAP 2011'!N37","v":76007},{"$f":"'App.2-B_FA Contin MIFRS 2012'!F37","v":25500},6.7495000000000003,10,0.1,11261.130454107712,1275,12536.130454107712,{"$f":"-'App.2-B_FA Contin MIFRS 2012'!K37","v":12536},0.1304541077115573,2550,null,13811.130454107712]
[1915,"Office Furniture & Equipment (5 years)",{"$f":"'App.2-B_FA Contin CGAAP 2011'!N38","v":0},{"$f":"'App.2-B_FA Contin MIFRS 2012'!F38","v":0},null,null,0,0,0,0,{"$f":"-'App.2-B_FA Contin MIFRS 2012'!K38","v":0},0,0,null,0]
[1920,"Computer Equipment - Hardware",{"$f":"'App.2-B_FA Contin CGAAP 2011'!N39","v":115225},{"$f":"'App.2-B_FA Contin MIFRS 2012'!F39","v":122500},2.2855500000000002,5,0.2,50414.561046575218,12250,62664.561046575218,{"$f":"-'App.2-B_FA Contin MIFRS 2012'!K39","v":62665},-0.43895342478208477,24500,12533,62381.561046575225]
[1920,"Computer Equip.-Hardware(Post Mar. 22/04)",{"$f":"'App.2-B_FA Contin CGAAP 2011'!N40","v":0},{"$f":"'App.2-B_FA Contin MIFRS 2012'!F40","v":0},null,null,0,0,0,0,{"$f":"-'App.2-B_FA Contin MIFRS 2012'!K40","v":0},0,0,null,0]
[1920,"Computer Equip.-Hardware(Post Mar. 19/07)",{"$f":"'App.2-B_FA Contin CGAAP 2011'!N41","v":0},{"$f":"'App.2-B_FA Contin MIFRS 2012'!F41","v":0},null,null,0,0,0,0,{"$f":"-'App.2-B_FA Contin MIFRS 2012'!K41","v":0},0,0,null,0]
[1930,"Transportation Equipment",{"$f":"'App.2-B_FA Contin CGAAP 2011'!N42","v":714062},{"$f":"'App.2-B_FA Contin MIFRS 2012'!F42","v":0},4.4684600000000003,5,0.2,159800.46817024209,0,159800.46817024209,{"$f":"-'App.2-B_FA Contin MIFRS 2012'!K42","v":159800},0.46817024209303781,0,null,159800.46817024209]
[1935,"Stores Equipment",{"$f":"'App.2-B_FA Contin CGAAP 2011'!N43","v":13652},{"$f":"'App.2-B_FA Contin MIFRS 2012'!F43","v":4000},7.7850000000000001,10,0.1,1753.6287732819524,200,1953.6287732819524,{"$f":"-'App.2-B_FA Contin MIFRS 2012'!K43","v":1954},-0.37122671804763741,400,null,2153.6287732819524]
[1940,"Tools, Shop & Garage Equipment",{"$f":"'App.2-B_FA Contin CGAAP 2011'!N44","v":299447},{"$f":"'App.2-B_FA Contin MIFRS 2012'!F44","v":27000},9.7341999999999995,10,0.1,30762.363625156664,1350,32112.363625156664,{"$f":"-'App.2-B_FA Contin MIFRS 2012'!K44","v":32112},0.3636251566640567,2700,null,33462.363625156664]
[1945,"Measurement & Testing Equipment",{"$f":"'App.2-B_FA Contin CGAAP 2011'!N45","v":18771},{"$f":"'App.2-B_FA Contin MIFRS 2012'!F45","v":8500},8.51,10,0.1,2205.7579318448884,425,2630.7579318448884,{"$f":"-'App.2-B_FA Contin MIFRS 2012'!K45","v":2631},-0.24206815511161039,850,null,3055.7579318448884]
[1950,"Power Operated Equipment",{"$f":"'App.2-B_FA Contin CGAAP 2011'!N46","v":0},{"$f":"'App.2-B_FA Contin MIFRS 2012'!F46","v":0},null,null,0,0,0,0,{"$f":"-'App.2-B_FA Contin MIFRS 2012'!K46","v":0},0,0,null,0]
[1955,"Communications Equipment",{"$f":"'App.2-B_FA Contin CGAAP 2011'!N47","v":0},{"$f":"'App.2-B_FA Contin MIFRS 2012'!F47","v":0},null,null,0,0,0,0,{"$f":"-'App.2-B_FA Contin MIFRS 2012'!K47","v":0},0,0,null,0]
[1955,"Communication Equipment (Smart Meters)",{"$f":"'App.2-B_FA Contin CGAAP 2011'!N48","v":0},{"$f":"'App.2-B_FA Contin MIFRS 2012'!F48","v":0},null,null,0,0,0,0,{"$f":"-'App.2-B_FA Contin MIFRS 2012'!K48","v":0},0,0,null,0]
[1960,"Miscellaneous Equipment ",{"$f":"'App.2-B_FA Contin CGAAP 2011'!N49","v":0},{"$f":"'App.2-B_FA Contin MIFRS 2012'!F49","v":0},null,null,0,0,0,0,{"$f":"-'App.2-B_FA Contin MIFRS 2012'!K49","v":0},0,0,null,0]
[1975,"Load Management Controls Utility Premises",{"$f":"'App.2-B_FA Contin CGAAP 2011'!N50","v":0},{"$f":"'App.2-B_FA Contin MIFRS 2012'!F50","v":0},null,null,0,0,0,0,{"$f":"-'App.2-B_FA Contin MIFRS 2012'!K50","v":0},0,0,null,0]
[1980,"System Supervisor Equipment",{"$f":"'App.2-B_FA Contin CGAAP 2011'!N51","v":618334},{"$f":"'App.2-B_FA Contin MIFRS 2012'!F51","v":367850},7.2740999999999998,15,6.6666666666666666E-2,85004.880328837928,12261.666666666666,97266.546995504599,{"$f":"-'App.2-B_FA Contin MIFRS 2012'!K51","v":97267},-0.453004495400819,24523.333333333332,null,109528.21366217126]
[1985,"Miscellaneous Fixed Assets",{"$f":"'App.2-B_FA Contin CGAAP 2011'!N52","v":0},{"$f":"'App.2-B_FA Contin MIFRS 2012'!F52","v":0},null,null,0,0,0,0,{"$f":"-'App.2-B_FA Contin MIFRS 2012'!K52","v":0},0,0,null,0]
[1995,"Contributions & Grants",{"$f":"'App.2-B_FA Contin CGAAP 2011'!N53","v":-6144728},{"$f":"'App.2-B_FA Contin MIFRS 2012'!F53","v":-1083954},29.274999999999999,35,2.8571428571428571E-2,-209896.77198975236,-15485.057142857142,-225381.82913260951,{"$f":"-'App.2-B_FA Contin MIFRS 2012'!K53","v":-225382},0.17086739049409516,-30970.114285714284,null,-240866.88627546665]
["etc.",null,null,null,null,null,0,0,0,0,null,0,0,null,0]
[null,null,null,null,null,null,0,0,0,0,null,0,0,null,0]
[null,"Total",{"$f":"SUM(C16:C55)","v":26054641},{"$f":"SUM(D16:D55)","v":4083921},null,null,null,{"$f":"SUM(H16:H55)","v":1437743.5592709859},101480.60396825398,{"$f":"SUM(J16:J55)+2","v":1539226.1632392395},1539226,{"$f":"SUM(L16:L55)+2","v":0.16323923982736233},202961.20793650797,{"$f":"SUM(N16:N55)","v":45380},1595324.767207494]
[]
["Notes:"]
[]
[1,"Board policy of the \"half-year\" rule - the applicant must ensure that additions in the year attract a half-year depreciation expense in the first year.  Deviations from this standard practice must be supported in the application."]
[2,"The applicant must provide an explanation of material variances in evidence"]
[3,"The applicant should ensure that the years for new additions of assets are the asset useful lives determined by management in accordance with IFRS. "]
[4,"A recalculation should be performed to determine the average remaining life of opening balance of assets (i.e. excluding 2012 additions) under IFRS.  For example, Asset A had a useful life of 20 years under CGAAP.  On January 1, 2012, the date of transition, Asset A was 3 years depreciated. As a result, Asset A would have a remaining service life of 17 years (20 years less 3 years) under CGAAP as of January 1, 2012.  Due to the transition to IFRS, management re-assessed the asset useful lives under IFRS principles and concluded that the revised useful life of Asset A is now 30 years. Therefore, the average remaining useful life of opening balance of Asset A is determined to be 27 years (30 years less 3 years) under IFRS as of January 1, 2012."]
[5,"NBV must exclude assets still on the books but which have been fully amortized or depreciated."]
[6,"This column refers to the calculated full year depreciation but excludes the depreciation expense on assets fully depreciated during the year.  This column is used for the purpose of calculating depreciation expense in the following year on the next worksheet."]
[]
["General:","Applicants must provide a breakdown of depreciation and amortization expense in the above format for all relevant accounts.  Asset Retirement Obligations (AROs), depreciation and accretion expense should be disclosed separately consistent with the Notes of historical Audited Financial Statements."]

{"sheet":"App.2-CH_MIFRS_DepExp_2013","index":12,"n_rows":65,"n_cols":10,"rows_kept":65,"cut":false,"hidden":false,"merged":[[8,0,8,9],[57,1,57,4],[64,1,65,9],[61,1,61,9],[60,1,60,9],[13,0,14,0],[13,1,14,1],[13,6,14,6],[10,0,10,9],[9,0,9,9]]}
[null,null,null,null,null,null,null,null,"File Number:",{"$f":"'LDC Info'!$E$18","v":"EB-2012-0139"}]
[null,null,null,null,null,null,null,null,"Exhibit:",2]
[null,null,null,null,null,null,null,null,"Tab:",2]
[null,null,null,null,null,null,null,null,"Schedule:",4]
[null,null,null,null,null,null,null,null,"Page:",4]
[]
[null,null,null,null,null,null,null,null,"Date:","2012-08-31"]
[]
["Appendix 2-CH"]
["Depreciation and Amortization Expense"]
["Assumes the applicant adopted IFRS for financial reporting purposes January 1, 2013"]
[null,null,"Year",2013,"MIFRS"]
[]
["Account","Description","Additions","Years (new additions only)","Depreciation Rate on New Additions","2013 Depreciation Expense 1","2013 Depreciation Expense per Appendix 2-B Fixed Assets, Column K\n (l)","Variance 2"]
[null,null,"(d)","(f)","(g) = 1 / (f)","(h)=2012 Full Year Depreciation + ((d)*0.5)/(f) ",null,"(m) = (h) - (l)"]
[1611,"Computer Software (Formally known as Account 1925)",{"$f":"'App.2-B_FA Contin MIFRS 2013'!F16","v":278500},{"$f":"'App.2-CG_MIFRS_DepExp_2012'!F16","v":3},{"$f":"IF(D16=0,0,1/D16)","v":0.33333333333333331},{"$f":"IF(D16=0,'App.2-CG_MIFRS_DepExp_2012'!O16,+'App.2-CG_MIFRS_DepExp_2012'!O16+((C16*0.5)/D16))","v":174811.37603849225},{"$f":"-'App.2-B_FA Contin MIFRS 2013'!K16","v":174811},{"$f":"IF(ISERROR(+F16-G16), 0, +F16-G16)","v":0.37603849224979058}]
[1612,"Land Rights (Formally known as Account 1906)",{"$f":"'App.2-B_FA Contin MIFRS 2013'!F17","v":0},{"$f":"'App.2-CG_MIFRS_DepExp_2012'!F17","v":0},0,{"$f":"IF(D17=0,'App.2-CG_MIFRS_DepExp_2012'!O17,+'App.2-CG_MIFRS_DepExp_2012'!O17+((C17*0.5)/D17))","v":0},{"$f":"-'App.2-B_FA Contin MIFRS 2013'!K17","v":0},0]
[1805,"Land",{"$f":"'App.2-B_FA Contin MIFRS 2013'!F18","v":0},{"$f":"'App.2-CG_MIFRS_DepExp_2012'!F18","v":0},0,{"$f":"IF(D18=0,'App.2-CG_MIFRS_DepExp_2012'!O18,+'App.2-CG_MIFRS_DepExp_2012'!O18+((C18*0.5)/D18))","v":0},{"$f":"-'App.2-B_FA Contin MIFRS 2013'!K18","v":0},0]
[1806,"Land rights",{"$f":"'App.2-B_FA Contin MIFRS 2013'!F19","v":0},0,{"$f":"IF(D19=0,0,1/D19)","v":0},{"$f":"IF(D19=0,'App.2-CG_MIFRS_DepExp_2012'!O19,+'App.2-CG_MIFRS_DepExp_2012'!O19+((C19*0.5)/D19))","v":14575.084879893549},{"$f":"-'App.2-B_FA Contin MIFRS 2013'!K19","v":14575},{"$f":"IF(ISERROR(+F19-G19), 0, +F19-G19)","v":8.4879893549441476E-2}]
[1808,"Buildings",{"$f":"'App.2-B_FA Contin MIFRS 2013'!F20","v":0},{"$f":"'App.2-CG_MIFRS_DepExp_2012'!F20","v":0},0,{"$f":"IF(D20=0,'App.2-CG_MIFRS_DepExp_2012'!O20,+'App.2-CG_MIFRS_DepExp_2012'!O20+((C20*0.5)/D20))","v":0},{"$f":"-'App.2-B_FA Contin MIFRS 2013'!K20","v":0},0]
[1810,"Leasehold Improvements",{"$f":"'App.2-B_FA Contin MIFRS 2013'!F21","v":0},{"$f":"'App.2-CG_MIFRS_DepExp_2012'!F21","v":25},0.04,{"$f":"IF(D21=0,'App.2-CG_MIFRS_DepExp_2012'!O21,+'App.2-CG_MIFRS_DepExp_2012'!O21+((C21*0.5)/D21))","v":3312.1280000000002},{"$f":"-'App.2-B_FA Contin MIFRS 2013'!K21","v":3312},0.12800000000015643]
[1815,"Transformer Station Equipment >50 kV",{"$f":"'App.2-B_FA Contin MIFRS 2013'!F22","v":0},{"$f":"'App.2-CG_MIFRS_DepExp_2012'!F22","v":0},0,{"$f":"IF(D22=0,'App.2-CG_MIFRS_DepExp_2012'!O22,+'App.2-CG_MIFRS_DepExp_2012'!O22+((C22*0.5)/D22))","v":0},{"$f":"-'App.2-B_FA Contin MIFRS 2013'!K22","v":0},0]
[1820,"Distribution Station Equipment <50 kV",{"$f":"'App.2-B_FA Contin MIFRS 2013'!F23","v":194422},{"$f":"'App.2-CG_MIFRS_DepExp_2012'!F23","v":40},2.5000000000000001E-2,{"$f":"IF(D23=0,'App.2-CG_MIFRS_DepExp_2012'!O23,+'App.2-CG_MIFRS_DepExp_2012'!O23+((C23*0.5)/D23))","v":93751.170690804065},{"$f":"-'App.2-B_FA Contin MIFRS 2013'!K23","v":93752},-0.82930919593491126]
[1825,"Storage Battery Equipment",{"$f":"'App.2-B_FA Contin MIFRS 2013'!F24","v":0},{"$f":"'App.2-CG_MIFRS_DepExp_2012'!F24","v":0},0,{"$f":"IF(D24=0,'App.2-CG_MIFRS_DepExp_2012'!O24,+'App.2-CG_MIFRS_DepExp_2012'!O24+((C24*0.5)/D24))","v":0},{"$f":"-'App.2-B_FA Contin MIFRS 2013'!K24","v":0},0]
[1830,"Poles, Towers & Fixtures",{"$f":"'App.2-B_FA Contin MIFRS 2013'!F25","v":918153},{"$f":"'App.2-CG_MIFRS_DepExp_2012'!F25","v":45},2.2222222222222223E-2,{"$f":"IF(D25=0,'App.2-CG_MIFRS_DepExp_2012'!O25,+'App.2-CG_MIFRS_DepExp_2012'!O25+((C25*0.5)/D25))","v":210236.75629128225},{"$f":"-'App.2-B_FA Contin MIFRS 2013'!K25","v":210238},-1.2437087177531794]
[1835,"Overhead Conductors & Devices",{"$f":"'App.2-B_FA Contin MIFRS 2013'!F26","v":1123543},{"$f":"'App.2-CG_MIFRS_DepExp_2012'!F26","v":60},1.6666666666666666E-2,{"$f":"IF(D26=0,'App.2-CG_MIFRS_DepExp_2012'!O26,+'App.2-CG_MIFRS_DepExp_2012'!O26+((C26*0.5)/D26))","v":167752.80107449857},{"$f":"-'App.2-B_FA Contin MIFRS 2013'!K26","v":167753},-0.19892550143413246]
[1840,"Underground Conduit",{"$f":"'App.2-B_FA Contin MIFRS 2013'!F27","v":38205},{"$f":"'App.2-CG_MIFRS_DepExp_2012'!F27","v":40},2.5000000000000001E-2,{"$f":"IF(D27=0,'App.2-CG_MIFRS_DepExp_2012'!O27,+'App.2-CG_MIFRS_DepExp_2012'!O27+((C27*0.5)/D27))","v":49686.668537212056},{"$f":"-'App.2-B_FA Contin MIFRS 2013'!K27","v":49686},0.66853721205552574]
[1845,"Underground Conductors & Devices",{"$f":"'App.2-B_FA Contin MIFRS 2013'!F28","v":157573},{"$f":"'App.2-CG_MIFRS_DepExp_2012'!F28","v":40},2.5000000000000001E-2,{"$f":"IF(D28=0,'App.2-CG_MIFRS_DepExp_2012'!O28,+'App.2-CG_MIFRS_DepExp_2012'!O28+((C28*0.5)/D28))","v":323746.52758570574},{"$f":"-'App.2-B_FA Contin MIFRS 2013'!K28","v":323746},0.52758570574223995]
[1850,"Line Transformers",{"$f":"'App.2-B_FA Contin MIFRS 2013'!F29","v":649500},{"$f":"'App.2-CG_MIFRS_DepExp_2012'!F29","v":40},2.5000000000000001E-2,{"$f":"IF(D29=0,'App.2-CG_MIFRS_DepExp_2012'!O29,+'App.2-CG_MIFRS_DepExp_2012'!O29+((C29*0.5)/D29))","v":221576.81749188044},{"$f":"-'App.2-B_FA Contin MIFRS 2013'!K29","v":221577},-0.18250811955658719]
[1855,"Services (Overhead & Underground)",{"$f":"'App.2-B_FA Contin MIFRS 2013'!F30","v":216912},50,0.02,{"$f":"IF(D30=0,'App.2-CG_MIFRS_DepExp_2012'!O30,+'App.2-CG_MIFRS_DepExp_2012'!O30+((C30*0.5)/D30))","v":83993.886300043989},{"$f":"-'App.2-B_FA Contin MIFRS 2013'!K30","v":83994},-0.11369995601125993]
[1860,"Meters",{"$f":"'App.2-B_FA Contin MIFRS 2013'!F31","v":0},{"$f":"'App.2-CG_MIFRS_DepExp_2012'!F31","v":25},0.04,{"$f":"IF(D31=0,'App.2-CG_MIFRS_DepExp_2012'!O31,+'App.2-CG_MIFRS_DepExp_2012'!O31+((C31*0.5)/D31))","v":11490.243138891787},{"$f":"-'App.2-B_FA Contin MIFRS 2013'!K31","v":11490},0.24313889178665704]
[1860,"Meters (Smart Meters)",{"$f":"'App.2-B_FA Contin MIFRS 2013'!F32","v":116170},{"$f":"'App.2-CG_MIFRS_DepExp_2012'!F32","v":15},6.6666666666666666E-2,{"$f":"IF(D32=0,'App.2-CG_MIFRS_DepExp_2012'!O32,+'App.2-CG_MIFRS_DepExp_2012'!O32+((C32*0.5)/D32))","v":152968.39136537668},{"$f":"-'App.2-B_FA Contin MIFRS 2013'!K32","v":152968},0.39136537667945959]
[1875,"Street Lighting",{"$f":"'App.2-B_FA Contin MIFRS 2013'!F33","v":0},{"$f":"'App.2-CG_MIFRS_DepExp_2012'!F33","v":0},{"$f":"IF(D33=0,0,1/D33)","v":0},{"$f":"IF(D33=0,'App.2-CG_MIFRS_DepExp_2012'!O34,+'App.2-CG_MIFRS_DepExp_2012'!O34+((C33*0.5)/D33))","v":0},{"$f":"-'App.2-B_FA Contin MIFRS 2013'!K33","v":0},{"$f":"IF(ISERROR(+F33-G33), 0, +F33-G33)","v":0}]
[1905,"Land",{"$f":"'App.2-B_FA Contin MIFRS 2013'!F34","v":0},{"$f":"'App.2-CG_MIFRS_DepExp_2012'!F34","v":0},0,{"$f":"IF(D34=0,'App.2-CG_MIFRS_DepExp_2012'!O34,+'App.2-CG_MIFRS_DepExp_2012'!O34+((C34*0.5)/D34))","v":0},{"$f":"-'App.2-B_FA Contin MIFRS 2013'!K34","v":0},0]
[1908,"Buildings & Fixtures",{"$f":"'App.2-B_FA Contin MIFRS 2013'!F35+2000000","v":7127500},{"$f":"'App.2-CG_MIFRS_DepExp_2012'!F35","v":50},0.02,{"$f":"IF(D35=0,'App.2-CG_MIFRS_DepExp_2012'!O35,+'App.2-CG_MIFRS_DepExp_2012'!O35+((C35*0.5)/D35))","v":100390.60675883257},{"$f":"-'App.2-B_FA Contin MIFRS 2013'!K35","v":100391},-0.39324116743227933]
[1910,"Leasehold Improvements",{"$f":"'App.2-B_FA Contin MIFRS 2013'!F36","v":0},{"$f":"'App.2-CG_MIFRS_DepExp_2012'!F36","v":0},0,{"$f":"IF(D36=0,'App.2-CG_MIFRS_DepExp_2012'!O36,+'App.2-CG_MIFRS_DepExp_2012'!O36+((C36*0.5)/D36))","v":0},{"$f":"-'App.2-B_FA Contin MIFRS 2013'!K36","v":0},0]
[1915,"Office Furniture & Equipment (10 years)",{"$f":"'App.2-B_FA Contin MIFRS 2013'!F37","v":35000},{"$f":"'App.2-CG_MIFRS_DepExp_2012'!F37","v":10},0.1,{"$f":"IF(D37=0,'App.2-CG_MIFRS_DepExp_2012'!O37,+'App.2-CG_MIFRS_DepExp_2012'!O37+((C37*0.5)/D37))","v":15561.130454107712},{"$f":"-'App.2-B_FA Contin MIFRS 2013'!K37","v":15561},0.1304541077115573]
[1915,"Office Furniture & Equipment (5 years)",{"$f":"'App.2-B_FA Contin MIFRS 2013'!F38","v":0},{"$f":"'App.2-CG_MIFRS_DepExp_2012'!F38","v":0},0,{"$f":"IF(D38=0,'App.2-CG_MIFRS_DepExp_2012'!O38,+'App.2-CG_MIFRS_DepExp_2012'!O38+((C38*0.5)/D38))","v":0},{"$f":"-'App.2-B_FA Contin MIFRS 2013'!K38","v":0},0]
[1920,"Computer Equipment - Hardware",{"$f":"'App.2-B_FA Contin MIFRS 2013'!F39","v":128000},{"$f":"'App.2-CG_MIFRS_DepExp_2012'!F39","v":5},0.2,{"$f":"IF(D39=0,'App.2-CG_MIFRS_DepExp_2012'!O39,+'App.2-CG_MIFRS_DepExp_2012'!O39+((C39*0.5)/D39))","v":75181.561046575225},{"$f":"-'App.2-B_FA Contin MIFRS 2013'!K39","v":75182},-0.43895342477480881]
[1920,"Computer Equip.-Hardware(Post Mar. 22/04)",{"$f":"'App.2-B_FA Contin MIFRS 2013'!F40","v":0},{"$f":"'App.2-CG_MIFRS_DepExp_2012'!F40","v":0},0,{"$f":"IF(D40=0,'App.2-CG_MIFRS_DepExp_2012'!O40,+'App.2-CG_MIFRS_DepExp_2012'!O40+((C40*0.5)/D40))","v":0},{"$f":"-'App.2-B_FA Contin MIFRS 2013'!K40","v":0},0]
[1920,"Computer Equip.-Hardware(Post Mar. 19/07)",{"$f":"'App.2-B_FA Contin MIFRS 2013'!F41","v":0},{"$f":"'App.2-CG_MIFRS_DepExp_2012'!F41","v":0},0,{"$f":"IF(D41=0,'App.2-CG_MIFRS_DepExp_2012'!O41,+'App.2-CG_MIFRS_DepExp_2012'!O41+((C41*0.5)/D41))","v":0},{"$f":"-'App.2-B_FA Contin MIFRS 2013'!K41","v":0},0]
[1930,"Transportation Equipment",{"$f":"'App.2-B_FA Contin MIFRS 2013'!F42","v":110000},{"$f":"'App.2-CG_MIFRS_DepExp_2012'!F42","v":5},0.2,{"$f":"IF(D42=0,'App.2-CG_MIFRS_DepExp_2012'!O42,+'App.2-CG_MIFRS_DepExp_2012'!O42+((C42*0.5)/D42))","v":170800.46817024209},{"$f":"-'App.2-B_FA Contin MIFRS 2013'!K42","v":170800},0.46817024209303781]
[1935,"Stores Equipment",{"$f":"'App.2-B_FA Contin MIFRS 2013'!F43","v":4200},{"$f":"'App.2-CG_MIFRS_DepExp_2012'!F43","v":10},0.1,{"$f":"IF(D43=0,'App.2-CG_MIFRS_DepExp_2012'!O43,+'App.2-CG_MIFRS_DepExp_2012'!O43+((C43*0.5)/D43))","v":2363.6287732819524},{"$f":"-'App.2-B_FA Contin MIFRS 2013'!K43","v":2364},-0.37122671804763741]
[1940,"Tools, Shop & Garage Equipment",{"$f":"'App.2-B_FA Contin MIFRS 2013'!F44","v":20000},{"$f":"'App.2-CG_MIFRS_DepExp_2012'!F44","v":10},0.1,{"$f":"IF(D44=0,'App.2-CG_MIFRS_DepExp_2012'!O44,+'App.2-CG_MIFRS_DepExp_2012'!O44+((C44*0.5)/D44))","v":34462.363625156664},{"$f":"-'App.2-B_FA Contin MIFRS 2013'!K44","v":34462},0.3636251566640567]
[1945,"Measurement & Testing Equipment",{"$f":"'App.2-B_FA Contin MIFRS 2013'!F45","v":19000},{"$f":"'App.2-CG_MIFRS_DepExp_2012'!F45","v":10},0.1,{"$f":"IF(D45=0,'App.2-CG_MIFRS_DepExp_2012'!O45,+'App.2-CG_MIFRS_DepExp_2012'!O45+((C45*0.5)/D45))","v":4005.7579318448884},{"$f":"-'App.2-B_FA Contin MIFRS 2013'!K45","v":4006},-0.24206815511161039]
[1950,"Power Operated Equipment",{"$f":"'App.2-B_FA Contin MIFRS 2013'!F46","v":0},{"$f":"'App.2-CG_MIFRS_DepExp_2012'!F46","v":0},0,{"$f":"IF(D46=0,'App.2-CG_MIFRS_DepExp_2012'!O46,+'App.2-CG_MIFRS_DepExp_2012'!O46+((C46*0.5)/D46))","v":0},{"$f":"-'App.2-B_FA Contin MIFRS 2013'!K46","v":0},0]
[1955,"Communications Equipment",{"$f":"'App.2-B_FA Contin MIFRS 2013'!F47","v":0},{"$f":"'App.2-CG_MIFRS_DepExp_2012'!F47","v":0},0,{"$f":"IF(D47=0,'App.2-CG_MIFRS_DepExp_2012'!O47,+'App.2-CG_MIFRS_DepExp_2012'!O47+((C47*0.5)/D47))","v":0},{"$f":"-'App.2-B_FA Contin MIFRS 2013'!K47","v":0},0]
[1955,"Communication Equipment (Smart Meters)",{"$f":"'App.2-B_FA Contin MIFRS 2013'!F48","v":0},{"$f":"'App.2-CG_MIFRS_DepExp_2012'!F48","v":0},0,{"$f":"IF(D48=0,'App.2-CG_MIFRS_DepExp_2012'!O48,+'App.2-CG_MIFRS_DepExp_2012'!O48+((C48*0.5)/D48))","v":0},{"$f":"-'App.2-B_FA Contin MIFRS 2013'!K48","v":0},0]
[1960,"Miscellaneous Equipment ",{"$f":"'App.2-B_FA Contin MIFRS 2013'!F49","v":0},{"$f":"'App.2-CG_MIFRS_DepExp_2012'!F49","v":0},0,{"$f":"IF(D49=0,'App.2-CG_MIFRS_DepExp_2012'!O49,+'App.2-CG_MIFRS_DepExp_2012'!O49+((C49*0.5)/D49))","v":0},{"$f":"-'App.2-B_FA Contin MIFRS 2013'!K49","v":0},0]
[1975,"Load Management Controls Utility Premises",{"$f":"'App.2-B_FA Contin MIFRS 2013'!F50","v":0},{"$f":"'App.2-CG_MIFRS_DepExp_2012'!F50","v":0},0,{"$f":"IF(D50=0,'App.2-CG_MIFRS_DepExp_2012'!O50,+'App.2-CG_MIFRS_DepExp_2012'!O50+((C50*0.5)/D50))","v":0},{"$f":"-'App.2-B_FA Contin MIFRS 2013'!K50","v":0},0]
[1980,"System Supervisor Equipment",{"$f":"'App.2-B_FA Contin MIFRS 2013'!F51","v":266697},{"$f":"'App.2-CG_MIFRS_DepExp_2012'!F51","v":15},6.6666666666666666E-2,{"$f":"IF(D51=0,'App.2-CG_MIFRS_DepExp_2012'!O51,+'App.2-CG_MIFRS_DepExp_2012'!O51+((C51*0.5)/D51))","v":118418.11366217125},{"$f":"-'App.2-B_FA Contin MIFRS 2013'!K51","v":118418},0.11366217125032563]
[1985,"Miscellaneous Fixed Assets",{"$f":"'App.2-B_FA Contin MIFRS 2013'!F52","v":0},{"$f":"'App.2-CG_MIFRS_DepExp_2012'!F52","v":0},0,{"$f":"IF(D52=0,'App.2-CG_MIFRS_DepExp_2012'!O52,+'App.2-CG_MIFRS_DepExp_2012'!O52+((C52*0.5)/D52))","v":0},{"$f":"-'App.2-B_FA Contin MIFRS 2013'!K52","v":0},0]
[1995,"Contributions & Grants",{"$f":"'App.2-B_FA Contin MIFRS 2013'!F53","v":-382523},{"$f":"'App.2-CG_MIFRS_DepExp_2012'!F53","v":35},2.8571428571428571E-2,{"$f":"IF(D53=0,'App.2-CG_MIFRS_DepExp_2012'!O53,+'App.2-CG_MIFRS_DepExp_2012'!O53+((C53*0.5)/D53))","v":-246331.50056118093},{"$f":"-'App.2-B_FA Contin MIFRS 2013'!K53","v":-246332},0.49943881906801835]
["etc.",null,null,null,0,{"$f":"IF(D54=0,'App.2-CG_MIFRS_DepExp_2012'!O54,+'App.2-CG_MIFRS_DepExp_2012'!O54+((C54*0.5)/D54))","v":0},null,0]
[null,null,null,null,0,{"$f":"IF(D55=0,'App.2-CG_MIFRS_DepExp_2012'!O55,+'App.2-CG_MIFRS_DepExp_2012'!O55+((C55*0.5)/D55))","v":0},null,0]
[null,"Total",{"$f":"SUM(C16:C55)","v":11020852},null,null,{"$f":"SUM(F16:F55)","v":1782753.9812551127},{"$f":"SUM(G16:G55)","v":1782754},{"$f":"SUM(H16:H55)","v":-1.8744887206139538E-2}]
[null,"Depreciation expense adjustment resulting from  amortization of Account 1575",null,null,null,{"$f":"'App.2-EB_PP&E Deferral Account'!E40","v":-639864}]
[null,"Total Depreciation expense to be included in the test year revenue requirement",null,null,null,{"$f":"+F57+F56","v":1142889.9812551127}]
[]
["Notes:"]
[1,"Board policy of the \"half-year\" rule - the applicant must ensure that additions in the year attract a half-year depreciation expense in the first year.  Deviations from this standard practice must be supported in the application."]
[2,"The applicant must provide an explanation of material variances in evidence"]
[]
[]
["General:","Applicants must provide a breakdown of depreciation and amortization expense in the above format for all relevant accounts.  Asset Retirement Obligations (AROs), depreciation and accretion expense should be disclosed separately consistent with the Notes of historical Audited Financial Statements."]

{"sheet":"App.2-D_Overhead","index":13,"n_rows":56,"n_cols":13,"rows_kept":56,"cut":false,"hidden":false,"merged":[[68,0,71,0],[73,0,74,0],[60,0,61,0],[60,1,60,4],[62,0,63,0],[65,0,66,0],[51,0,51,2],[51,10,51,12],[52,0,52,2],[52,10,52,12],[57,0,58,0],[57,1,58,4],[55,1,56,12],[48,0,48,2],[48,10,48,12],[49,0,49,2],[49,10,49,12],[50,0,50,2],[50,10,50,12],[45,0,45,2],[45,10,45,12],[46,0,46,2],[46,10,46,12],[47,0,47,2],[47,10,47,12],[44,0,44,2],[44,10,44,12],[38,0,38,2],[38,10,38,12],[39,0,39,2],[39,10,39,12],[40,0,40,2],[40,10,40,12],[41,0,41,2],[41,10,41,12],[42,0,42,2],[42,10,42,12],[43,10,43,12],[35,0,37,2],[35,10,35,12],[36,10,36,12],[37,10,37,12],[26,0,26,2],[26,10,26,12],[27,0,27,2],[27,10,27,12],[28,0,28,2],[28,10,28,12],[29,0,29,2],[29,10,29,12],[30,0,30,2],[30,10,30,12],[33,0,33,12],[23,0,23,2],[23,10,23,12],[24,0,24,2],[24,10,24,12],[25,0,25,2],[25,10,25,12],[22,0,22,2],[22,10,22,12],[16,0,16,2],[16,10,16,12],[17,0,17,2],[17,10,17,12],[18,0,18,2],[18,10,18,12],[19,0,19,2],[19,10,19,12],[20,0,20,2],[20,10,20,12],[21,10,21,12],[8,0,8,12],[9,0,9,12],[11,0,11,12],[13,0,15,2],[13,10,13,12],[14,10,14,12],[15,10,15,12]]}
[null,null,null,null,null,null,null,null,null,null,null,"File Number:",{"$f":"'LDC Info'!$E$18","v":"EB-2012-0139"}]
[null,null,null,null,null,null,null,null,null,null,null,"Exhibit:",2]
[null,null,null,null,null,null,null,null,null,null,null,"Tab:",5]
[null,null,null,null,null,null,null,null,null,null,null,"Schedule:",2]
[null,null,null,null,null,null,null,null,null,null,null,"Page:"]
[]
[null,null,null,null,null,null,null,null,null,null,null,"Date:","2012-08-31"]
[]
["Appendix 2-D"]
["Overhead Expense"]
[]
["The following table should be completed based on the information requested below. An explanation should be provided for any blank entries.  The entries should include overhead costs that are currently capitalized on self-constructed assets under MIFRS or an alternate accounting standard."]
[null,null,null,null,"(A) 1","(B)","(C)","(D)","(E) 1","(F)","(G)"]
["Nature of the Overhead Costs",null,null,null,"Dollar","Dollar","Dollar","Dollar Impact - ","Dollar Impact - ","Directly","Reasons why the overhead costs are allowed to be"]
[null,null,null,null,"Impact on PP&E","Impact on PP&E","Impact on PP&E","PP&E Variance","PP&E Variance","Attributable?","capitalized under MIFRS or an alternate accounting"]
[null,null,null,null,"Historic Year","Bridge Year","Test Year","Test versus Bridge","Test versus Historic","(Y/N)","standard given limitations on capitalized overhead"]
["employee benefits",null,null,null,null,null,null,{"$f":"+G17-F17","v":0},{"$f":"+G17-E17","v":0},"Y","Employee wages directly attributed to a capital job are recorded to the applicable capital account.  The associated employee benefits are recorded with the wages."]
["costs of site preparation",null,null,null,null,null,null,0,0,"N","These costs are not currently capitalized by IHDSL."]
["initial delivery and handling costs",null,null,null,null,null,null,0,0,"N","These costs are not currently capitalized by IHDSL."]
["costs of testing whether the asset is functioning properly",null,null,null,null,null,null,0,0,"N","These costs are not currently capitalized by IHDSL."]
["professional fees",null,null,null,null,null,null,0,0,"N","These costs are not currently capitalized by IHDSL."]
[null,null,null,null,null,null,null,0,0]
["costs of opening a new facility",null,null,null,null,null,null,0,0,"N","These costs are not currently capitalized by IHDSL."]
["costs of introducing a new product or service (including costs of advertising and promotional activities)",null,null,null,null,null,null,0,0,"N","These costs are not currently capitalized by IHDSL."]
["costs of conducting business in a new location or with a new class of customer (including costs of staff training)",null,null,null,null,null,null,0,0,"N","These costs are not currently capitalized by IHDSL."]
["administration and other general overhead costs",null,null,null,null,null,null,0,0,"N","These costs are not currently capitalized by IHDSL."]
[null,null,null,null,null,null,null,0,0]
[null,null,null,null,null,null,null,0,0]
[null,null,null,null,null,null,null,0,0]
["Insert description of additional item(s) and new rows if needed.",null,null,null,null,null,null,0,0]
["Total",null,null,null,{"$f":"SUM(E17:E30)","v":0},{"$f":"SUM(F17:F30)","v":0},{"$f":"SUM(G17:G30)","v":0},{"$f":"SUM(H17:H30)","v":0},{"$f":"SUM(I17:I30)","v":0}]
[]
[]
["The following table should be completed based on the information requested below. An explanation should be provided for any blank entries.  The entries should include overhead costs that were capitalized on self-constructed assets under CGAAP but are no longer capitalized under MIFRS or an alternate accounting standard and are included in OM&A."]
[null,null,null,null,"(A) 1","(B)","(C)","(D)","(E) 1","(F)","(G)"]
["Nature of the Overhead Costs",null,null,null,"Dollar","Dollar","Dollar","Dollar Impact - ","Dollar Impact - ","Directly","Reasons why the overhead costs are not allowed to be"]
[null,null,null,null,"Impact on OM&A","Impact on OM&A","Impact on OM&A","OM&A Variance","OM&A Variance","Attributable?","capitalized under MIFRS or an alternate accounting"]
[null,null,null,null,"Historic Year","Bridge Year","Test Year","Test versus Bridge","Test versus Historic","(Y/N)","standard given limitations on capitalized overhead"]
["employee benefits",null,null,null,null,null,null,{"$f":"+G39-F39","v":0},{"$f":"+G39-E39","v":0},"Y","Employee wages directly attributed to a capital job are recorded to the applicable capital account.  The associated employee benefits are recorded with the wages."]
["costs of site preparation",null,null,null,null,null,null,{"$f":"+G40-F40","v":0},{"$f":"+G40-E40","v":0},"N","These costs are not currently capitalized by IHDSL."]
["initial delivery and handling costs",null,null,null,null,null,null,{"$f":"+G41-F41","v":0},{"$f":"+G41-E41","v":0},"N","These costs are not currently capitalized by IHDSL."]
["costs of testing whether the asset is functioning properly",null,null,null,null,null,null,{"$f":"+G42-F42","v":0},{"$f":"+G42-E42","v":0},"N","These costs are not currently capitalized by IHDSL."]
["professional fees",null,null,null,null,null,null,{"$f":"+G43-F43","v":0},{"$f":"+G43-E43","v":0},"N","These costs are not currently capitalized by IHDSL."]
[]
["costs of opening a new facility",null,null,null,null,null,null,{"$f":"+G45-F45","v":0},{"$f":"+G45-E45","v":0},"N","These costs are not currently capitalized by IHDSL."]
["costs of introducing a new product or service (including costs of advertising and promotional activities)",null,null,null,null,null,null,0,0,"N","These costs are not currently capitalized by IHDSL."]
["costs of conducting business in a new location or with a new class of customer (including costs of staff training)",null,null,null,null,null,null,0,0,"N","These costs are not currently capitalized by IHDSL."]
["administration and other general overhead costs",null,null,null,null,null,null,0,0,"N","These costs are not currently capitalized by IHDSL."]
[null,null,null,null,null,null,null,0,0]
[null,null,null,null,null,null,null,0,0]
[null,null,null,null,null,null,null,0,0]
["Insert description of additional item(s) and new rows if needed.",null,null,null,null,null,null,0,0]
["Total",null,null,null,{"$f":"SUM(E39:E52)","v":0},{"$f":"SUM(F39:F52)","v":0},{"$f":"SUM(G39:G52)","v":0},{"$f":"SUM(H39:H52)","v":0},{"$f":"SUM(I39:I52)","v":0}]
[]
["Notes:"]
[1,"If the applicant chooses to adopt IFRS or an alternate accounting standard for financial reporting purposes in 2013, the applicant does not need to complete Columns A, E.  If the applicant adopts IFRS or an alternate accounting standard for financial reporting purposes in 2012, the applicant must complete all columns."]

{"sheet":"App.2-EB_PP&E Deferral Account","index":14,"n_rows":55,"n_cols":10,"rows_kept":55,"cut":false,"hidden":false,"merged":[[54,0,55,8],[20,1,20,8],[8,0,8,8],[9,0,9,8],[10,0,10,8],[14,0,14,8],[12,0,12,8]]}
[null,null,null,null,null,null,null,"File Number:",{"$f":"'LDC Info'!$E$18","v":"EB-2012-0139"}]
[null,null,null,null,null,null,null,"Exhibit:",2]
[null,null,null,null,null,null,null,"Tab:",5]
[null,null,null,null,null,null,null,"Schedule:",4]
[null,null,null,null,null,null,null,"Page:"]
[]
[null,null,null,null,null,null,null,"Date:","2012-08-31"]
[]
["Appendix 2-EB"]
["IFRS-CGAAP Transitional PP&E Amounts"]
["2013 Adopters of IFRS for Financial Reporting Purposes"]
[]
["For applicants that adopt IFRS on January 1, 2013 for financial reporting purposes"]
[]
["Note: this sheet should be filled out if the applicant adopts IFRS for its financial reporting purpose as of January 1, 2013. "]
[]
[null,"2009 Rebasing Year",2010,2011,2012,"2013 Rebasing Year",2014,2015,2016]
["Reporting Basis","CGAAP","IRM","IRM","IRM","MIFRS","IRM","IRM","IRM"]
["Forecast vs. Actual Used in Rebasing Year","Forecast","Actual","Actual","Forecast","Forecast"]
[null,null,null,"$","$","$","$","$","$"]
["PP&E Values under CGAAP"]
["            Opening net PP&E - Note 1",null,null,null,{"$f":"'App.2-B_FA Contin CGAAP 2012'!E56+'App.2-B_FA Contin CGAAP 2012'!J56","v":26060063}]
["            Additions",null,null,null,{"$f":"'App.2-B_FA Contin CGAAP 2012'!F56+'App.2-B_FA Contin CGAAP 2012'!G56+'App.2-B_FA Contin CGAAP 2012'!L56","v":6032445}]
["            Depreciation (amounts should be negative)",null,null,null,{"$f":"'App.2-B_FA Contin CGAAP 2012'!K56","v":-2179090}]
["            Closing net PP&E (1)",null,null,null,{"$f":"SUM(E22:E24)","v":29913418}]
[]
["PP&E Values under MIFRS (Starts from 2012, the transition year)"]
["            Opening net PP&E  - Note 1",null,null,null,{"$f":"'App.2-B_FA Contin MIFRS 2012'!E56+'App.2-B_FA Contin MIFRS 2012'!J56","v":26060063}]
["            Additions",null,null,null,{"$f":"'App.2-B_FA Contin MIFRS 2012'!F56+'App.2-B_FA Contin MIFRS 2012'!G56+'App.2-B_FA Contin MIFRS 2012'!L56","v":6032445}]
["            Depreciation (amounts should be negative)",null,null,null,{"$f":"'App.2-B_FA Contin MIFRS 2012'!K56","v":-1539226}]
["            Closing net PP&E (2)",null,null,null,{"$f":"SUM(E28:E30)","v":30553282}]
[]
["Difference in Closing net PP&E, CGAAP vs. MIFRS (Shown as adjustment to rate base on rebasing)",null,null,null,{"$f":"+E25-E31","v":-639864},null,null,null,null,"This is the impact to the net assets for the change in useful lives due the to Kinetric study.  Innisfil's net assets are increasing due to longer useful lives."]
[]
["Account 1575 - IFRS-CGAAP Transitional PP&E Amounts"]
["          Opening balance ",null,null,null,{"$f":"D40","v":0},{"$f":"E40","v":-639864},{"$f":"F40","v":-479898},{"$f":"G40","v":-319932},{"$f":"H40","v":-159966}]
["          Amounts added in the year",null,null,null,{"$f":"E33-D33","v":-639864}]
["Sub-total",null,null,null,{"$f":"E36+E37","v":-639864},{"$f":"F36+F37","v":-639864},{"$f":"G36+G37","v":-479898},{"$f":"H36+H37","v":-319932},{"$f":"I36+I37","v":-159966}]
["Amount of amortization, included in  depreciation expense  - Note 2",null,null,null,null,{"$f":"IF(ISERROR(E33/I44), 0,-E33/I44)","v":159966},{"$f":"+F39","v":159966},{"$f":"+F39","v":159966},{"$f":"+F39","v":159966}]
["          Closing balance in deferral account",null,null,null,{"$f":"E38+E39","v":-639864},{"$f":"IF(ISERROR(F38+F39), 0, F38+F39)","v":-479898},{"$f":"G38+G39","v":-319932},{"$f":"H38+H39","v":-159966},{"$f":"I38+I39","v":0}]
[]
["Effect on Revenue Requirement"]
["        Amortization of deferred balance as above - Note 2",null,null,null,null,{"$f":"IF(ISERROR(E37/I44), 0, E37/I44)","v":-159966},null,"WACC",6.59E-2]
["Return on Rate Base Associated with deferred PP&E balance at WACC  - Note 3 ",null,null,null,null,{"$f":"E33*I43","v":-42167.037600000003},null,"Disposition Period - Note 4",4,"Years"]
["     Amount included in Revenue Requirement on rebasing",null,null,null,null,{"$f":"SUM(F43:F44)","v":-202133.03760000001}]
[]
["Notes:"]
["1  For an applicant that adopts IFRS on January 1, 2013, the PP&E values as of January 1, 2012 under both CGAAP and MIFRS should be the same. "]
["2  Amortization of the deferred balance in Account 1575 will start from the rebasing year. "]
["    Assume the utility requests for a certain disposition period, the amortization that should be included in the depreciation expense is calculated as:"]
["   the opening balance of Account 1575 / the approved disposition period"]
["3  Return on rate base associated with deferred balance is calculated as:"]
["     the deferred account opening balance as of 2013 rebasing year x WACC "]
["     * Please note that the calculation should be adjusted once WACC is updated and finalized in the rate application."]
["4  Consistent with the 4 year normal rate cycle, the model is using a 4 year amortization period as a default selection to \"clear\" the PP&E deferral account through a one-time adjustment to ratebase to capture and remove the impact of the accounting policy changes as caused by the transition from CGAAP to MIFRS."]

{"sheet":"App.2-F_Other_Oper_Rev","index":15,"n_rows":130,"n_cols":9,"rows_kept":130,"cut":false,"hidden":false,"merged":[[108,0,108,1],[109,0,109,1],[101,0,101,1],[102,0,102,1],[103,0,103,1],[107,0,107,1],[95,0,95,1],[96,0,96,1],[100,0,100,1],[87,0,87,1],[88,0,88,1],[89,0,89,1],[90,0,90,1],[94,0,94,1],[81,0,81,1],[82,0,82,1],[80,0,80,1],[79,0,79,1],[86,0,86,1],[68,0,68,1],[72,0,72,1],[73,0,73,1],[74,0,74,1],[78,0,78,1],[60,0,60,1],[61,0,61,1],[62,0,62,1],[66,0,66,1],[67,0,67,1],[50,0,50,1],[54,0,54,1],[55,0,55,1],[56,0,56,1],[48,0,48,1],[49,0,49,1],[128,1,128,8],[129,1,129,8],[118,0,118,1],[112,0,113,8],[117,0,117,1],[123,0,123,1],[119,0,119,1],[120,0,120,1],[121,0,121,1],[122,0,122,1],[41,0,42,8],[28,0,28,1],[29,0,29,1],[8,0,8,8],[9,0,9,8],[26,0,26,8],[27,0,27,1],[36,2,36,8],[37,2,38,8],[30,0,30,1],[31,0,31,1],[34,0,34,1],[35,0,35,1],[36,0,36,1],[37,0,37,1]]}
[null,null,null,null,null,null,null,"File Number:",{"$f":"'LDC Info'!$E$18","v":"EB-2012-0139"}]
[null,null,null,null,null,null,null,"Exhibit:",3]
[null,null,null,null,null,null,null,"Tab:"]
[null,null,null,null,null,null,null,"Schedule:"]
[null,null,null,null,null,null,null,"Page:"]
[]
[null,null,null,null,null,null,null,"Date:","2012-08-31"]
[]
["Appendix 2-F"]
["Other Operating Revenue"]
[]
["USoA #","USoA Description",{"$f":"G13-3 & \" Actual\"","v":"2009 Actual"},{"$f":"G13-2 & \" Actual\"","v":"2010 Actual"},{"$f":"G13-1 & \" Actual\"& CHAR(178)","v":"2011 Actual²"},{"$f":"G13-1 & \" Actual\"& CHAR(178)","v":"2011 Actual²"},{"$f":"\"Bridge Year\" & CHAR(179)","v":"Bridge Year³"},{"$f":"\"Bridge Year\" & CHAR(179)","v":"Bridge Year³"},"Test Year"]
[null,null,null,null,null,null,{"$f":"'LDC Info'!E26","v":2012},{"$f":"'LDC Info'!E26","v":2012},{"$f":"'LDC Info'!E28","v":2013}]
[null,"Reporting Basis","CGAAP","CGAAP","CGAAP","CGAAP","CGAAP","MIFRS","MIFRS"]
[4235,"Specific Service Charges",{"$f":"44584+97610","v":142194},{"$f":"29002+98671","v":127673},{"$f":"42133+123934","v":166067},{"$f":"42133+123934","v":166067},{"$f":"39730+109940","v":149670},{"$f":"39730+109940","v":149670},{"$f":"40900+113200","v":154100}]
[4225,"Late Payment Charges",105597,111120,104841,104841,110402,110402,113700]
[4082,"Retail Services Revenues",35349,42813,78272,78272,54203,54203,55033]
[4210,"Pole Rental",154992,161381,157442,157442,162676,162676,167600]
[4305,"Regulatory Debit",0,0,0,0,{"$f":"'App.2-EB_PP&E Deferral Account'!E33","v":-639864},{"$f":"G19","v":-639864},0]
[4325,"Special Purpose Chg Reco",null,49901]
[4355,"Gain(Loss) on Disposal",33840,0,-126618,-126618,-51476,-51476,-48825]
[4375,"Misc Non-Utility Income",{"$f":"29091+348870","v":377961},{"$f":"18842+269154","v":287996},{"$f":"7575+272008","v":279583},{"$f":"7575+272008","v":279583},{"$f":"103406+6700+274700","v":384806},{"$f":"103406+6700+274700","v":384806},{"$f":"219168+6800+274700","v":500668}]
[4380,"Misc Non-Utility Expense",{"$f":"-15630-315736","v":-331366},{"$f":"-2888-386542","v":-389430},{"$f":"-3965-264735","v":-268700},{"$f":"-3965-264735","v":-268700},{"$f":"-127762-3400-274700","v":-405862},{"$f":"-127762-3400-274700","v":-405862},{"$f":"-191128-3400-274700","v":-469228}]
[4390,"Misc Non-Utility Income",9629,52823,24952,24952,30009,30009,30900]
[4405,"Interest Income",{"$f":"7765+15852","v":23617},{"$f":"31796+5043","v":36839},{"$f":"37901+15427","v":53328},{"$f":"37901+15427","v":53328},14600,14600,3000]
[4406,"SRED Revenue",0,0,153377,153377,50000,50000,50000]
[]
["Specific Service Charges",null,{"$f":"C15","v":142194},127673,166067,{"$f":"F15","v":166067},{"$f":"G15","v":149670},{"$f":"H15","v":149670},{"$f":"I15","v":154100}]
["Late Payment Charges",null,105597,111120,104841,{"$f":"F16","v":104841},{"$f":"G16","v":110402},{"$f":"H16","v":110402},{"$f":"I16","v":113700}]
["Other Operating Revenues",null,{"$f":"SUM(C17:C18)","v":190341},{"$f":"SUM(D17:D18)","v":204194},235714,235714,216879,216879,222633]
["Other Income or Deductions",null,{"$f":"SUM(C19:C26)","v":113681},{"$f":"SUM(D19:D26)","v":38129},115922,115922,-617787,-617787,66515]
["Total",null,{"$f":"SUM(C28:C31)","v":551813},481116,622544,622544,-140836,-140836,556948]
[]
["Description",null,"Account(s)"]
["Specific Service Charges:",null,4235]
["Late Payment Charges:",null,4225]
["Other Distribution Revenues:",null,"4080, 4082, 4084, 4090, 4205, 4210, 4215, 4220, 4240, 4245"]
["Other Income and Expenses:",null,"4305, 4310, 4315, 4320, 4325, 4330, 4335, 4340, 4345, 4350, 4355, 4360, 4365, 4370, 4375, 4380, 4385, 4390, 4395, 4398, 4405, 4415"]
[]
[]
["Note: Add all applicable accounts listed above to the table and include all relevant information."]
["The above table assumes adoption of MIFRS as of January 1, 2013.  If the adoption year differs, please adjust the table accordingly."]
[]
[]
["Account Breakdown Details"]
[]
["Account 4082 Retail Services Revenue"]
[null,null,{"$f":"C$12","v":"2009 Actual"},"2010 Actual","2011 Actual²","2011 Actual²","Bridge Year³","Bridge Year³","Test Year"]
["Reporting Basis",null,null,null,null,null,{"$f":"G$14","v":"CGAAP"},{"$f":"H$14","v":"MIFRS"},{"$f":"I$14","v":"MIFRS"}]
["Retail Services Revenue",null,{"$f":"C17","v":35349},42813,78272,78272,54203,54203,55033]
["Total",null,{"$f":"SUM(C50:C50)","v":35349},42813,78272,78272,54203,54203,55033]
[]
["Account 4210 Pole Rental"]
[null,null,{"$f":"C$12","v":"2009 Actual"},"2010 Actual","2011 Actual²","2011 Actual²","Bridge Year³","Bridge Year³","Test Year"]
["Reporting Basis",null,null,null,null,null,{"$f":"G$14","v":"CGAAP"},{"$f":"H$14","v":"MIFRS"},{"$f":"I$14","v":"MIFRS"}]
["Pole Attachment revenue",null,{"$f":"C18","v":154992},{"$f":"D18","v":161381},157442,157442,162676,162676,167600]
["Total",null,{"$f":"SUM(C56:C56)","v":154992},161381,157442,157442,162676,162676,167600]
[]
["Account 4305 Regulatory Debit"]
[null,null,{"$f":"C$12","v":"2009 Actual"},"2010 Actual","2011 Actual²","2011 Actual²","Bridge Year³","Bridge Year³","Test Year"]
["Reporting Basis",null,null,null,null,null,{"$f":"G$14","v":"CGAAP"},{"$f":"H$14","v":"MIFRS"},{"$f":"I$14","v":"MIFRS"}]
["Depreciation variance due to chg in useful life",null,{"$f":"C19","v":0},{"$f":"D19","v":0},0,0,-639864,-639864,0]
["Total",null,{"$f":"SUM(C62:C62)","v":0},0,0,0,-639864,-639864,0]
[]
["Account 4325 "]
[null,null,{"$f":"C$12","v":"2009 Actual"},"2010 Actual","2011 Actual²","2011 Actual²","Bridge Year³","Bridge Year³","Test Year"]
["Reporting Basis",null,null,null,null,null,{"$f":"G$14","v":"CGAAP"},{"$f":"H$14","v":"MIFRS"},{"$f":"I$14","v":"MIFRS"}]
["Special Purpose charge recovery",null,{"$f":"C20","v":0},{"$f":"D20","v":49901},0,0,0,0,0]
["Total",null,{"$f":"SUM(C68:C68)","v":0},49901,0,0,0,0,0]
[]
["Account 4355 Gain/(Loss) on disposals"]
[null,null,{"$f":"C$12","v":"2009 Actual"},"2010 Actual","2011 Actual²","2011 Actual²","Bridge Year³","Bridge Year³","Test Year"]
["Reporting Basis",null,null,null,null,null,{"$f":"G$14","v":"CGAAP"},{"$f":"H$14","v":"MIFRS"},{"$f":"I$14","v":"MIFRS"}]
["Gain/(Loss) on disposals of capital assets",null,{"$f":"C21","v":33840},0,-126618,-126618,-51476,-51476,-48825]
["Total",null,{"$f":"SUM(C74:C74)","v":33840},0,-126618,-126618,-51476,-51476,-48825]
[]
["Account 4375 Misc Non-Utility Income"]
[null,null,{"$f":"C$12","v":"2009 Actual"},"2010 Actual","2011 Actual²","2011 Actual²","Bridge Year³","Bridge Year³","Test Year"]
["Reporting Basis",null,null,null,null,null,{"$f":"G$14","v":"CGAAP"},{"$f":"H$14","v":"MIFRS"},{"$f":"I$14","v":"MIFRS"}]
["Water billing revenue",null,0,0,0,0,103406,103406,219168]
["Interco management fee",null,29091,18842,7575,7575,6700,6700,6800]
["OPA revenue",null,348870,269154,272008,272008,274700,274700,274700]
["Total",null,{"$f":"SUM(C80:C82)","v":377961},{"$f":"SUM(D80:D82)","v":287996},279583,279583,384806,384806,500668]
[]
["Account 4380 Misc Non-Utility Expense"]
[null,null,{"$f":"C$12","v":"2009 Actual"},"2010 Actual","2011 Actual²","2011 Actual²","Bridge Year³","Bridge Year³","Test Year"]
["Reporting Basis",null,null,null,null,null,{"$f":"G$14","v":"CGAAP"},{"$f":"H$14","v":"MIFRS"},{"$f":"I$14","v":"MIFRS"}]
["Water billing expenses",null,0,0,0,0,-127762,-127762,-191128]
["Interco expense",null,-15630,-2888,-3965,-3965,-3400,-3400,-3400]
["OPA expenses",null,-315736,-386542,-264735,-264735,-274700,-274700,-274700]
["Total",null,{"$f":"SUM(C88:C90)","v":-331366},-389430,-268700,-268700,-405862,-405862,-469228]
[]
["Account 4390 Misc Non-Utility Income"]
[null,null,{"$f":"C$12","v":"2009 Actual"},"2010 Actual","2011 Actual²","2011 Actual²","Bridge Year³","Bridge Year³","Test Year"]
["Reporting Basis",null,null,null,null,null,{"$f":"G$14","v":"CGAAP"},{"$f":"H$14","v":"MIFRS"},{"$f":"I$14","v":"MIFRS"}]
[null,null,{"$f":"C24","v":9629},{"$f":"D24","v":52823},24952,24952,30009,30009,30900]
["Total",null,{"$f":"SUM(C96:C96)","v":9629},52823,24952,24952,30009,30009,30900]
[]
["Account 4405 - Interest and Dividend Income"]
[null,null,{"$f":"C$12","v":"2009 Actual"},"2010 Actual","2011 Actual²","2011 Actual²","Bridge Year³","Bridge Year³","Test Year"]
["Reporting Basis",null,null,null,null,null,{"$f":"G$14","v":"CGAAP"},{"$f":"H$14","v":"MIFRS"},{"$f":"I$14","v":"MIFRS"}]
["Regulatory accounts interest",null,7765,31796,37901]
["Bank interest",null,15852,5043,15427,null,null,14600,3000]
["Total",null,{"$f":"SUM(C102:C103)","v":23617},36839,53328,0,0,14600,3000]
[]
["Account 4406 "]
[null,null,{"$f":"C$12","v":"2009 Actual"},"2010 Actual","2011 Actual²","2011 Actual²","Bridge Year³","Bridge Year³","Test Year"]
["Reporting Basis",null,null,null,null,null,{"$f":"G$14","v":"CGAAP"},{"$f":"H$14","v":"MIFRS"},{"$f":"I$14","v":"MIFRS"}]
["SHRED revenue",null,{"$f":"C26","v":0},0,153377,153377,50000,50000,50000]
["Total",null,{"$f":"SUM(C109:C109)","v":0},0,153377,153377,50000,50000,50000]
[]
[]
["For each \"Other Operating Revenue\" and \"Other Income or Deductions\" Account, a detailed breakdown of the account components is required.  See the example below for Account 4405, Interest and Dividend Income."]
[]
[]
["Account 4405 - Interest and Dividend Income"]
[null,null,{"$f":"C12","v":"2009 Actual"},{"$f":"D12","v":"2010 Actual"},{"$f":"E12","v":"2011 Actual²"},{"$f":"F12","v":"2011 Actual²"},"Bridge Year","Bridge Year","Test Year"]
["Reporting Basis",null,{"$f":"IF(ISBLANK(C14), \"\", C14)","v":"CGAAP"},{"$f":"IF(ISBLANK(D14), \"\", D14)","v":"CGAAP"},{"$f":"IF(ISBLANK(E14), \"\", E14)","v":"CGAAP"},null,{"$f":"IF(ISBLANK(G14), \"\", G14)","v":"CGAAP"},{"$f":"IF(ISBLANK(H14), \"\", H14)","v":"MIFRS"},{"$f":"IF(ISBLANK(I14), \"\", I14)","v":"MIFRS"}]
["Short-term Investment Interest"]
["Bank Deposit Interest"]
["Miscellaneous Interest Revenue"]
["etc.1"]
[]
["Total",null,{"$f":"SUM(C119:C123)","v":0},0,0,0,0,0,0]
[]
[]
["Notes:"]
[1,"List and specify any other interest revenue"]
[2,"If the applicant is adopting IFRS or an alternate accounting standard as of January 1, 2012 for financial reporting purposes, 2011 must be presented on both a CGAAP and MIFRS (or alternate accounting standard) basis."]
[3,"If the applicant is adopting IFRS or an alternate accounting standard as of January 1, 2013 for financial reporting purposes, 2012 must be presented on both a CGAAP and MIFRS (or alternate accounting standard) basis."]

{"sheet":"App.2-G_Detailed_OM&A_Expenses","index":16,"n_rows":126,"n_cols":9,"rows_kept":126,"cut":false,"hidden":false,"merged":[[41,0,41,8],[62,0,62,8],[71,0,71,1],[8,0,8,8],[9,0,9,8],[10,0,10,8],[39,0,39,1],[15,0,15,8],[12,4,12,5],[12,6,12,7],[118,0,118,1],[85,0,85,8],[60,0,60,1],[124,1,124,8],[125,1,125,8],[123,1,123,8],[112,0,112,1],[73,0,73,8],[111,0,111,1]]}
[null,null,null,null,null,null,null,"File Number:",{"$f":"'LDC Info'!$E$18","v":"EB-2012-0139"}]
[null,null,null,null,null,null,null,"Exhibit:",4]
[null,null,null,null,null,null,null,"Tab:",2]
[null,null,null,null,null,null,null,"Schedule:",2]
[null,null,null,null,null,null,null,"Page:"]
[]
[null,null,null,null,null,null,null,"Date:","2012-08-31"]
[]
["Appendix 2-G"]
["Detailed, Account by Account, OM&A Expense Table"]
["(excluding Depreciation and Amortization)"]
[]
[]
["Account","Description",{"$f":"\"Last Rebasing Year (\" & 'LDC Info'!E30 & \" Actuals)\"","v":"Last Rebasing Year (2009 Actuals)"},{"$f":"'LDC Info'!E26-2 & \" Actual\"","v":"2010 Actual"},{"$f":"'LDC Info'!E26-1 & \" Actual\" & CHAR(178)","v":"2011 Actual²"},{"$f":"'LDC Info'!E26-1 & \" Actual\"& CHAR(178)","v":"2011 Actual²"},{"$f":"\"Bridge Year \" & 'LDC Info'!E26& CHAR(179)","v":"Bridge Year 2012³"},{"$f":"\"Bridge Year \" & 'LDC Info'!E26& CHAR(179)","v":"Bridge Year 2012³"},{"$f":"\"Test Year \" & 'LDC Info'!E28","v":"Test Year 2013"}]
["Reporting Basis",null,"CGAAP","CGAAP","CGAAP","CGAAP","CGAAP","MIFRS","MIFRS"]
["Operations"]
[5005,"Operation Supervision and Engineering",94914,128729,142878,142878,188345,188345,199285]
[5010,"Load Dispatching",8118,6141,10772,10772,10700,10700,11050]
[5012,"Station Buildings and Fixtures Expense",43110,48791,40852,40852,45000,45000,47400]
[5014,"Transformer Station Equipment - Operation Labour"]
[5015,"Transformer Station Equipment - Operation Supplies and Expenses"]
[5016,"Distribution Station Equipment - Operation Labour",6999,6943,6632,6632,6900,6900,7100]
[5017,"Distribution Station Equipment - Operation Supplies and Expenses",1026,1755,2685,2685,2800,2800,2900]
[5020,"Overhead Distribution Lines and Feeders - Operation Labour",69027,74500,96661,96661,107000,107000,109100]
[5025,"Overhead Distribution Lines and Feeders - Operation Supplies and Expenses",36414,34688,21151,21151,24100,24100,25050]
[5030,"Overhead Sub-transmission Feeders - Operation",1501,2739,3457,3457,3700,3700,3850]
[5035,"Overhead Distribution Transformers - Operation",36,308,1260,1260,900,900,1000]
[5040,"Underground Distribution Lines and Feeders - Operation Labour",23923,24103,40890,40890,35000,35000,36100]
[5045,"Underground Distribution Lines and Feeders - Operation Supplies and Expenses",2814,10394,19559,19559,21400,21400,23650]
[5050,"Underground Sub-transmission Feeders - Operation"]
[5055,"Underground Distribution Transformers - Operation"]
[5060,"Street Lighting and Signal System Expense"]
[5065,"Meter Expense",55781,77690,77675,77675,206500,206500,339849]
[5070,"Customer Premises - Operation Labour",43380,43122,42062,42062,47000,47000,48400]
[5075,"Customer Premises - Operation Materials and Expenses",3842,7544,13553,13553,14250,14250,14800]
[5085,"Miscellaneous Distribution Expenses",300796,394603,420151,420151,438100,438100,546628]
[5090,"Underground Distribution Lines and Feeders - Rental Paid"]
[5095,"Overhead Distribution Lines and Feeders - Rental Paid",2578,8103,7203,7203,7500,7500,7700]
[5096,"Other Rent"]
["Total - Operations",null,{"$f":"SUM(C17:C39)","v":694259},{"$f":"SUM(D17:D39)","v":870153},{"$f":"SUM(E17:E39)","v":947441},{"$f":"SUM(F17:F39)","v":947441},1159195,1159195,{"$f":"SUM(I17:I39)","v":1423862}]
["Account","Description",{"$f":"C14","v":"Last Rebasing Year (2009 Actuals)"},"2010 Actual","2011 Actual²","2011 Actual²","Bridge Year 2012³","Bridge Year 2012³","Test Year 2013"]
["Maintenance"]
[5105,"Maintenance Supervision and Engineering",16047,17770,16605,16605,18900,18900,19550]
[5110,"Maintenance of Buildings and Fixtures - Distribution Stations"]
[5112,"Maintenance of Transformer Station Equipment"]
[5114,"Maintenance of Distribution Station Equipment",42337,53377,37758,37758,54600,54600,56230]
[5120,"Maintenance of Poles, Towers and Fixtures",32833,2423,1671,1671,5550,5550,19340]
[5125,"Maintenance of Overhead Conductors and Devices",55600,60636,47742,47742,72950,72950,101000]
[5130,"Maintenance of Overhead Services",66730,52512,67089,67089,60750,60750,62650]
[5135,"Overhead Distribution Lines and Feeders - Right of Way",177192,127532,184235,184235,215100,215100,222650]
[5145,"Maintenance of Underground Conduit"]
[5150,"Maintenance of Underground Conductors and Devices",3716,1996,2587,2587,4750,4750,5050]
[5155,"Maintenance of Underground Services",81414,69956,80843,80843,96850,96850,99850]
[5160,"Maintenance of Line Transformers",{"$f":"23154+12388","v":35542},{"$f":"15633+1516","v":17149},{"$f":"53283+5704","v":58987},{"$f":"53283+5704","v":58987},{"$f":"25400+6250","v":31650},{"$f":"25400+6250","v":31650},{"$f":"26250+56280","v":82530}]
[5165,"Maintenance of Street Lighting and Signal Systems"]
[5170,"Sentinel Lights - Labour"]
[5172,"Sentinel Lights - Materials and Expenses"]
[5175,"Maintenance of Meters",33351,32857,31356,31356,40700,40700,44800]
[5178,"Customer Installations Expenses - Leased Property"]
[5195,"Maintenance of Other Installations on Customer Premises"]
["Total - Maintenance",null,{"$f":"SUM(C43:C60)","v":544762},{"$f":"SUM(D43:D60)","v":436208},{"$f":"SUM(E43:E60)","v":528873},{"$f":"SUM(F43:F60)","v":528873},601800,601800,{"$f":"SUM(I43:I60)","v":713650}]
["Account","Description",{"$f":"C41","v":"Last Rebasing Year (2009 Actuals)"},"2010 Actual","2011 Actual²","2011 Actual²","Bridge Year 2012³","Bridge Year 2012³","Test Year 2013"]
["Billing and Collecting"]
[5305,"Supervision",50754,55307,63860,63860,64900,64900,66800]
[5310,"Meter Reading Expense",137851,125935,69829,69829,33300,33300,38000]
[5315,"Customer Billing",352201,335375,376323,376323,384600,384600,480600]
[5320,"Collecting",293500,268080,286478,286478,327800,327800,340820]
[5325,"Collecting - Cash Over and Short",30,138,35,35,50,50,100]
[5330,"Collection Charges"]
[5335,"Bad Debt Expense",87724,85020,67044,67044,75000,75000,100000]
[5340,"Miscellaneous Customer Accounts Expenses",48387,52889,61727,61727,69850,69850,79700]
["Total - Billing and Collecting",null,{"$f":"SUM(C64:C71)","v":970447},{"$f":"SUM(D64:D71)","v":922744},{"$f":"SUM(E64:E71)","v":925296},{"$f":"SUM(F64:F71)","v":925296},955500,955500,{"$f":"SUM(I64:I71)","v":1106020}]
["Account","Description",{"$f":"C62","v":"Last Rebasing Year (2009 Actuals)"},{"$f":"D62","v":"2010 Actual"},{"$f":"E62","v":"2011 Actual²"},{"$f":"F62","v":"2011 Actual²"},"Bridge Year 2012³","Bridge Year 2012³",{"$f":"I62","v":"Test Year 2013"}]
["Community Relations"]
[5405,"Supervision"]
[5410,"Community Relations - Sundry",7572,5867,15137,15137,14400,14400,19400]
[5415,"Energy Conservation",0,41,208,208]
[5420,"Community Safety Program",1704,1000,0,0,1500,1500,1500]
[5425,"Miscellaneous Customer Service and Informational Expenses",1550,2206,2547,2547,2500,2500,3000]
[5505,"Supervision"]
[5510,"Demonstrating and Selling Expense"]
[5515,"Advertising Expenses"]
[5520,"Miscellaneous Sales Expense"]
["Total - Community Relations",null,{"$f":"SUM(C75:C83)","v":10826},{"$f":"SUM(D75:D83)","v":9114},{"$f":"SUM(E75:E83)","v":17892},{"$f":"SUM(F75:F83)","v":17892},18400,18400,{"$f":"SUM(I75:I83)","v":23900}]
["Account","Description",{"$f":"C73","v":"Last Rebasing Year (2009 Actuals)"},{"$f":"D73","v":"2010 Actual"},{"$f":"E73","v":"2011 Actual²"},{"$f":"F73","v":"2011 Actual²"},"Bridge Year 2012³","Bridge Year 2012³",{"$f":"I73","v":"Test Year 2013"}]
["Administrative and General Expenses"]
[5605,"Executive Salaries and Expenses",209979,209923,218153,218153,227875,227875,233375]
[5610,"Management Salaries and Expenses",189103,201551,214395,214395,225025,225025,232247]
[5615,"General Administrative Salaries and Expenses",486302,576121,673158,673158,699800,699800,849125]
[5620,"Office Supplies and Expenses",67522,73767,86725,86725,94000,94000,107000]
[5625,"Administrative Expense Transferred - Credit"]
[5630,"Outside Services Employed",64876,93488,104144,104144,148500,148500,152895]
[5635,"Property Insurance",39448,75239,57252,57252,59470,59470,61254]
[5640,"Injuries and Damages",34487,30319,34561,34561,37000,37000,38110]
[5645,"OMERS Pensions and Benefits",28828,3555,3461,3461,4400,4400,4500]
[5646,"Employee Pensions and OPEB"]
[5647,"Employee Sick Leave"]
[5650,"Franchise Requirements"]
[5655,"Regulatory Expenses",99623,44657,56135,56135,56000,56000,107000]
[5660,"General Advertising Expenses"]
[5665,"Miscellaneous General Expenses",91366,104035,105153,105153,116395,116395,114884]
[5670,"Rent",755,319,335,335,600,600,750]
[5672,"Lease Payment Charge"]
[5675,"Maintenance of General Plant",155401,198768,181370,181370,221000,221000,286500]
[5680,"Electrical Safety Authority Fees",8427,{"$f":"58428-49801","v":8627},8928,8928,9800,9800,10000]
[5681,"Special Purpose Charge Expense",null,49901]
[5685,"Independent Electricity System Operator Fees and Penalties"]
[5695,"OM&A Contra Account"]
[6205,"Donations",844,1718,531,531,1000,1000,1000]
[6205,"Donations, Sub-account LEAP Funding",null,null,32483,32483]
["Total - Administrative and General Expenses",null,{"$f":"SUM(C87:C110)","v":1476961},{"$f":"SUM(D87:D110)","v":1671988},1776784,1776784,1900865,1900865,2198640]
["Total OM&A",null,{"$f":"C40+C61+C72+C84+C111","v":3697255},3910207,4196286,4196286,4635760,4635760,5466072]
["Adjustments for non-recoverable items"]
[5681,"Special Purpose Charge Expense",null,49901,0]
[6205,"Donations1",844,1718,531,531,1000,1000,1000]
[]
[]
[]
["Total Recoverable OM&A",null,{"$f":"C112-SUM(C114:C118)","v":3696411},{"$f":"D112-SUM(D114:D118)","v":3858588},4195755,{"$f":"F112-SUM(F114:F118)","v":4195755},4634760,4634760,5465072]
[]
["1 Account 6205 - Donations is generally non-recoverable.  However, the sub-account LEAP funding of account 6205 is generally recoverable."]
[]
["Note:"]
[1,"If it has been more than three years since the applicant last filed a cost of service application, additional years of historical actuals should be incorporated into the table, as necessary, to go back to the last cost of service application.  If the applicant last filed a cost of service application less than three years ago, a minimum of three years of actual information is required."]
[2,"If the applicant is adopting IFRS or an alternate accounting standard as of January 1, 2012 for financial reporting purposes, 2011 must be presented on both a CGAAP and MIFRS (or alternate accounting standard) basis."]
[3,"If the applicant is adopting IFRS or an alternate accounting standard as of January 1, 2013 for financial reporting purposes, 2012 must be presented on both a CGAAP and MIFRS (or alternate accounting standard) basis."]

{"sheet":"App.2-H_OM&A_Detailed_Analysis","index":17,"n_rows":137,"n_cols":9,"rows_kept":137,"cut":false,"hidden":false,"merged":[[41,3,42,3],[41,4,42,4],[41,5,41,6],[41,7,41,8],[64,0,65,0],[64,1,65,1],[64,2,65,2],[64,3,65,3],[64,4,65,4],[64,5,64,6],[64,7,64,8],[41,0,42,0],[41,1,42,1],[41,2,42,2],[135,1,135,8],[136,1,136,8],[121,0,121,1],[81,0,81,8],[95,0,95,8],[92,0,93,0],[92,1,93,1],[92,2,93,2],[92,3,93,3],[92,4,93,4],[92,5,92,6],[92,7,92,8],[80,1,80,8],[128,0,128,1],[122,0,122,1],[44,0,44,8],[67,0,67,8],[76,0,76,1],[63,0,63,1],[77,0,78,0],[77,1,78,1],[77,2,78,2],[77,3,78,3],[77,4,78,4],[77,5,77,6],[77,7,77,8],[8,0,8,8],[9,0,9,8],[10,0,10,8],[40,0,40,1],[16,0,16,8],[13,0,14,0],[13,1,14,1],[13,2,14,2],[13,3,14,3],[13,4,14,4],[13,7,13,8],[13,5,13,6]]}
[null,null,null,null,null,null,null,"File Number:",{"$f":"'LDC Info'!$E$18","v":"EB-2012-0139"}]
[null,null,null,null,null,null,null,"Exhibit:",4]
[null,null,null,null,null,null,null,"Tab:",2]
[null,null,null,null,null,null,null,"Schedule:",3]
[null,null,null,null,null,null,null,"Page:"]
[]
[null,null,null,null,null,null,null,"Date:","2012-08-31"]
[]
["Appendix 2-H"]
["OM&A Detailed Variance Analysis"]
["(excluding Depreciation and Amortization)"]
[]
[]
["Account","Description",{"$f":"\"Last Board-approved Rebasing Year (\"&'LDC Info'!E30&\" Year)\"","v":"Last Board-approved Rebasing Year (2009 Year)"},"Most Current Actuals               Year 2011",{"$f":"\"Test Year \" & 'LDC Info'!E28","v":"Test Year 2013"},"Test Year Versus Last Rebasing",null,"Test Year Versus Most Current Actuals"]
[null,null,null,null,null,"Variance ($)","Percentage Change (%)","Variance ($)","Percentage Change (%)"]
["Reporting Basis",null,"CGAAP","CGAAP","MIFRS"]
["Operations"]
[5005,"Operation Supervision and Engineering",72325,{"$f":"'App.2-G_Detailed_OM&A_Expenses'!E17","v":142878},{"$f":"'App.2-G_Detailed_OM&A_Expenses'!I17","v":199285},{"$f":"E18-C18","v":126960},{"$f":"IF(C18=0,\"\",(E18/C18)-1)","v":1.7554096094020046},{"$f":"E18-D18","v":56407},{"$f":"IF(D18=0,\"\",(E18/D18)-1)","v":0.39479136046137264}]
[5010,"Load Dispatching",6050,{"$f":"'App.2-G_Detailed_OM&A_Expenses'!E18","v":10772},{"$f":"'App.2-G_Detailed_OM&A_Expenses'!I18","v":11050},{"$f":"E19-C19","v":5000},{"$f":"IF(C19=0,\"\",(E19/C19)-1)","v":0.82644628099173545},{"$f":"E19-D19","v":278},{"$f":"IF(D19=0,\"\",(E19/D19)-1)","v":2.5807649461567106E-2}]
[5012,"Station Buildings and Fixtures Expense",40400,{"$f":"'App.2-G_Detailed_OM&A_Expenses'!E19","v":40852},{"$f":"'App.2-G_Detailed_OM&A_Expenses'!I19","v":47400},7000,0.1732673267326732,6548,0.16028591011455995]
[5014,"Transformer Station Equipment - Operation Labour",null,{"$f":"'App.2-G_Detailed_OM&A_Expenses'!E20","v":0},{"$f":"'App.2-G_Detailed_OM&A_Expenses'!I20","v":0},0,"",0,""]
[5015,"Transformer Station Equipment - Operation Supplies and Expenses",null,{"$f":"'App.2-G_Detailed_OM&A_Expenses'!E21","v":0},{"$f":"'App.2-G_Detailed_OM&A_Expenses'!I21","v":0},0,"",0,""]
[5016,"Distribution Station Equipment - Operation Labour",7400,{"$f":"'App.2-G_Detailed_OM&A_Expenses'!E22","v":6632},{"$f":"'App.2-G_Detailed_OM&A_Expenses'!I22","v":7100},-300,-4.0540540540540571E-2,468,7.0566948130277529E-2]
[5017,"Distribution Station Equipment - Operation Supplies and Expenses",2000,{"$f":"'App.2-G_Detailed_OM&A_Expenses'!E23","v":2685},{"$f":"'App.2-G_Detailed_OM&A_Expenses'!I23","v":2900},900,0.44999999999999996,215,8.0074487895716917E-2]
[5020,"Overhead Distribution Lines and Feeders - Operation Labour",40850,{"$f":"'App.2-G_Detailed_OM&A_Expenses'!E24","v":96661},{"$f":"'App.2-G_Detailed_OM&A_Expenses'!I24","v":109100},68250,1.6707466340269277,12439,0.1286868540569619]
[5025,"Overhead Distribution Lines and Feeders - Operation Supplies and Expenses",36600,{"$f":"'App.2-G_Detailed_OM&A_Expenses'!E25","v":21151},{"$f":"'App.2-G_Detailed_OM&A_Expenses'!I25","v":25050},-11550,-0.31557377049180324,3899,0.1843411659023213]
[5030,"Overhead Sub-transmission Feeders - Operation",3250,{"$f":"'App.2-G_Detailed_OM&A_Expenses'!E26","v":3457},{"$f":"'App.2-G_Detailed_OM&A_Expenses'!I26","v":3850},600,0.18461538461538463,393,0.11368238356956906]
[5035,"Overhead Distribution Transformers - Operation",3650,{"$f":"'App.2-G_Detailed_OM&A_Expenses'!E27","v":1260},{"$f":"'App.2-G_Detailed_OM&A_Expenses'!I27","v":1000},-2650,-0.72602739726027399,-260,-0.20634920634920639]
[5040,"Underground Distribution Lines and Feeders - Operation Labour",27000,{"$f":"'App.2-G_Detailed_OM&A_Expenses'!E28","v":40890},{"$f":"'App.2-G_Detailed_OM&A_Expenses'!I28","v":36100},9100,0.33703703703703702,-4790,-0.11714355588163361]
[5045,"Underground Distribution Lines and Feeders - Operation Supplies and Expenses",8950,{"$f":"'App.2-G_Detailed_OM&A_Expenses'!E29","v":19559},{"$f":"'App.2-G_Detailed_OM&A_Expenses'!I29","v":23650},14700,1.6424581005586592,4091,0.20916202259829242]
[5050,"Underground Sub-transmission Feeders - Operation",null,{"$f":"'App.2-G_Detailed_OM&A_Expenses'!E30","v":0},{"$f":"'App.2-G_Detailed_OM&A_Expenses'!I30","v":0},0,"",0,""]
[5055,"Underground Distribution Transformers - Operation",250,{"$f":"'App.2-G_Detailed_OM&A_Expenses'!E31","v":0},{"$f":"'App.2-G_Detailed_OM&A_Expenses'!I31","v":0},-250,-1,0,""]
[5060,"Street Lighting and Signal System Expense",null,{"$f":"'App.2-G_Detailed_OM&A_Expenses'!E32","v":0},{"$f":"'App.2-G_Detailed_OM&A_Expenses'!I32","v":0},0,"",0,""]
[5065,"Meter Expense",67750,{"$f":"'App.2-G_Detailed_OM&A_Expenses'!E33","v":77675},{"$f":"'App.2-G_Detailed_OM&A_Expenses'!I33","v":339849},272099,4.0162214022140219,262174,3.3752687479884136]
[5070,"Customer Premises - Operation Labour",47200,{"$f":"'App.2-G_Detailed_OM&A_Expenses'!E34","v":42062},{"$f":"'App.2-G_Detailed_OM&A_Expenses'!I34","v":48400},1200,2.5423728813559254E-2,6338,0.15068232609005761]
[5075,"Customer Premises - Operation Materials and Expenses",9500,{"$f":"'App.2-G_Detailed_OM&A_Expenses'!E35","v":13553},{"$f":"'App.2-G_Detailed_OM&A_Expenses'!I35","v":14800},5300,0.55789473684210522,1247,9.2009149265845247E-2]
[5085,"Miscellaneous Distribution Expenses",401700,{"$f":"'App.2-G_Detailed_OM&A_Expenses'!E36","v":420151},{"$f":"'App.2-G_Detailed_OM&A_Expenses'!I36","v":546628},144928,0.3607866567089868,126477,0.30102748773655197]
[5090,"Underground Distribution Lines and Feeders - Rental Paid",null,{"$f":"'App.2-G_Detailed_OM&A_Expenses'!E37","v":0},{"$f":"'App.2-G_Detailed_OM&A_Expenses'!I37","v":0},0,"",0,""]
[5095,"Overhead Distribution Lines and Feeders - Rental Paid",3700,{"$f":"'App.2-G_Detailed_OM&A_Expenses'!E38","v":7203},{"$f":"'App.2-G_Detailed_OM&A_Expenses'!I38","v":7700},4000,1.0810810810810811,497,6.899902818270176E-2]
[5096,"Other Rent",null,null,null,0,"",0,""]
["Total - Operations",null,{"$f":"SUM(C18:C40)","v":778575},{"$f":"SUM(D18:D40)","v":947441},{"$f":"SUM(E18:E40)","v":1423862},645287,0.82880518896702315,476421,0.5028503094124066]
["Account","Description",{"$f":"\"Last Board-approved Rebasing Year (\"&'LDC Info'!E58&\" Year)\"","v":"Last Board-approved Rebasing Year ( Year)"},"Most Current Actuals               Year 2011",{"$f":"\"Test Year \" & 'LDC Info'!E56","v":"Test Year "},"Test Year Versus Last Rebasing",null,"Test Year Versus Most Current Actuals"]
[null,null,null,null,null,"Variance ($)","Percentage Change (%)","Variance ($)","Percentage Change (%)"]
["Reporting Basis",null,"CGAAP","CGAAP","MIFRS"]
["Maintenance"]
[5105,"Maintenance Supervision and Engineering",11950,{"$f":"'App.2-G_Detailed_OM&A_Expenses'!E43","v":16605},{"$f":"'App.2-G_Detailed_OM&A_Expenses'!I43","v":19550},{"$f":"E46-C46","v":7600},{"$f":"IF(C46=0,\"\",(E46/C46)-1)","v":0.63598326359832646},{"$f":"E46-D46","v":2945},{"$f":"IF(D46=0,\"\",(E46/D46)-1)","v":0.1773562180066246}]
[5110,"Maintenance of Buildings and Fixtures - Distribution Stations",null,{"$f":"'App.2-G_Detailed_OM&A_Expenses'!E44","v":0},{"$f":"'App.2-G_Detailed_OM&A_Expenses'!I44","v":0},0,"",0,""]
[5112,"Maintenance of Transformer Station Equipment",null,{"$f":"'App.2-G_Detailed_OM&A_Expenses'!E45","v":0},{"$f":"'App.2-G_Detailed_OM&A_Expenses'!I45","v":0},0,"",0,""]
[5114,"Maintenance of Distribution Station Equipment",39300,{"$f":"'App.2-G_Detailed_OM&A_Expenses'!E46","v":37758},{"$f":"'App.2-G_Detailed_OM&A_Expenses'!I46","v":56230},16930,0.43078880407124687,18472,0.48922082737433126]
[5120,"Maintenance of Poles, Towers and Fixtures",44680,{"$f":"'App.2-G_Detailed_OM&A_Expenses'!E47","v":1671},{"$f":"'App.2-G_Detailed_OM&A_Expenses'!I47","v":19340},-25340,-0.56714413607878245,17669,10.573907839616997]
[5125,"Maintenance of Overhead Conductors and Devices",143500,{"$f":"'App.2-G_Detailed_OM&A_Expenses'!E48","v":47742},{"$f":"'App.2-G_Detailed_OM&A_Expenses'!I48","v":101000},-42500,-0.29616724738675959,53258,1.1155376817058356]
[5130,"Maintenance of Overhead Services",67700,{"$f":"'App.2-G_Detailed_OM&A_Expenses'!E49","v":67089},{"$f":"'App.2-G_Detailed_OM&A_Expenses'!I49","v":62650},-5050,-7.4593796159527326E-2,-4439,-6.6165839407354432E-2]
[5135,"Overhead Distribution Lines and Feeders - Right of Way",188100,{"$f":"'App.2-G_Detailed_OM&A_Expenses'!E50","v":184235},{"$f":"'App.2-G_Detailed_OM&A_Expenses'!I50","v":222650},34550,0.18367889420520989,38415,0.20851086927022555]
[5145,"Maintenance of Underground Conduit",null,{"$f":"'App.2-G_Detailed_OM&A_Expenses'!E51","v":0},{"$f":"'App.2-G_Detailed_OM&A_Expenses'!I51","v":0},0,"",0,""]
[5150,"Maintenance of Underground Conductors and Devices",13050,{"$f":"'App.2-G_Detailed_OM&A_Expenses'!E52","v":2587},{"$f":"'App.2-G_Detailed_OM&A_Expenses'!I52","v":5050},-8000,-0.61302681992337171,2463,0.95206803247004257]
[5155,"Maintenance of Underground Services",64550,{"$f":"'App.2-G_Detailed_OM&A_Expenses'!E53","v":80843},{"$f":"'App.2-G_Detailed_OM&A_Expenses'!I53","v":99850},35300,0.54686289697908608,19007,0.2351100280791163]
[5160,"Maintenance of Line Transformers",50250,{"$f":"'App.2-G_Detailed_OM&A_Expenses'!E54","v":58987},{"$f":"'App.2-G_Detailed_OM&A_Expenses'!I54","v":82530},32280,0.6423880597014926,23543,0.39912184040551302]
[5165,"Maintenance of Street Lighting and Signal Systems",null,{"$f":"'App.2-G_Detailed_OM&A_Expenses'!E55","v":0},{"$f":"'App.2-G_Detailed_OM&A_Expenses'!I55","v":0},0,"",0,""]
[5170,"Sentinel Lights - Labour",null,{"$f":"'App.2-G_Detailed_OM&A_Expenses'!E56","v":0},{"$f":"'App.2-G_Detailed_OM&A_Expenses'!I56","v":0},0,"",0,""]
[5172,"Sentinel Lights - Materials and Expenses",null,{"$f":"'App.2-G_Detailed_OM&A_Expenses'!E57","v":0},{"$f":"'App.2-G_Detailed_OM&A_Expenses'!I57","v":0},0,"",0,""]
[5175,"Maintenance of Meters",34000,{"$f":"'App.2-G_Detailed_OM&A_Expenses'!E58","v":31356},{"$f":"'App.2-G_Detailed_OM&A_Expenses'!I58","v":44800},10800,0.31764705882352939,13444,0.42875366755963773]
[5178,"Customer Installations Expenses - Leased Property",null,null,null,0,"",0,""]
[5195,"Maintenance of Other Installations on Customer Premises",null,null,null,0,"",0,""]
["Total - Maintenance",null,{"$f":"SUM(C46:C63)","v":657080},{"$f":"SUM(D46:D63)","v":528873},{"$f":"SUM(E46:E63)","v":713650},56570,8.6093017592987264E-2,184777,0.34937877335390533]
["Account","Description",{"$f":"\"Last Board-approved Rebasing Year (\"&'LDC Info'!E81&\" Year)\"","v":"Last Board-approved Rebasing Year ( Year)"},"Most Current Actuals               Year 2011",{"$f":"\"Test Year \" & 'LDC Info'!E79","v":"Test Year "},"Test Year Versus Last Rebasing",null,"Test Year Versus Most Current Actuals"]
[null,null,null,null,null,"Variance ($)","Percentage Change (%)","Variance ($)","Percentage Change (%)"]
["Reporting Basis",null,"CGAAP","CGAAP","MIFRS"]
["Billing and Collecting"]
[5305,"Supervision",44900,{"$f":"'App.2-G_Detailed_OM&A_Expenses'!E64","v":63860},{"$f":"'App.2-G_Detailed_OM&A_Expenses'!I64","v":66800},{"$f":"E69-C69","v":21900},{"$f":"IF(C69=0,\"\",(E69/C69)-1)","v":0.48775055679287305},{"$f":"E69-D69","v":2940},{"$f":"IF(D69=0,\"\",(E69/D69)-1)","v":4.6038208581271611E-2}]
[5310,"Meter Reading Expense",153200,{"$f":"'App.2-G_Detailed_OM&A_Expenses'!E65","v":69829},{"$f":"'App.2-G_Detailed_OM&A_Expenses'!I65","v":38000},-115200,-0.75195822454308092,-31829,-0.455813487233098]
[5315,"Customer Billing",383950,{"$f":"'App.2-G_Detailed_OM&A_Expenses'!E66","v":376323},{"$f":"'App.2-G_Detailed_OM&A_Expenses'!I66","v":480600},96650,0.25172548508920434,104277,0.27709441091828024]
[5320,"Collecting",345200,{"$f":"'App.2-G_Detailed_OM&A_Expenses'!E67","v":286478},{"$f":"'App.2-G_Detailed_OM&A_Expenses'!I67","v":340820},-4380,-1.2688296639629226E-2,54342,0.18968995874028716]
[5325,"Collecting - Cash Over and Short",50,{"$f":"'App.2-G_Detailed_OM&A_Expenses'!E68","v":35},{"$f":"'App.2-G_Detailed_OM&A_Expenses'!I68","v":100},50,1,65,1.8571428571428572]
[5330,"Collection Charges",null,{"$f":"'App.2-G_Detailed_OM&A_Expenses'!E69","v":0},{"$f":"'App.2-G_Detailed_OM&A_Expenses'!I69","v":0},0,"",0,""]
[5335,"Bad Debt Expense",30000,{"$f":"'App.2-G_Detailed_OM&A_Expenses'!E70","v":67044},{"$f":"'App.2-G_Detailed_OM&A_Expenses'!I70","v":100000},70000,2.3333333333333335,32956,0.49155778294851138]
[5340,"Miscellaneous Customer Accounts Expenses",53300,{"$f":"'App.2-G_Detailed_OM&A_Expenses'!E71","v":61727},{"$f":"'App.2-G_Detailed_OM&A_Expenses'!I71","v":79700},26400,0.49530956848030017,17973,0.2911691804234775]
["Total - Billing and Collecting",null,{"$f":"SUM(C69:C76)","v":1010600},{"$f":"SUM(D69:D76)","v":925296},{"$f":"SUM(E69:E76)","v":1106020},95420,9.4419156936473403E-2,180724,0.19531479656239736]
["Account","Description",{"$f":"\"Last Board-approved Rebasing Year (\"&'LDC Info'!E94&\" Year)\"","v":"Last Board-approved Rebasing Year ( Year)"},"Most Current Actuals               Year 2011",{"$f":"\"Test Year \" & 'LDC Info'!E92","v":"Test Year "},"Test Year Versus Last Rebasing",null,"Test Year Versus Most Current Actuals"]
[null,null,null,null,null,"Variance ($)","Percentage Change (%)","Variance ($)","Percentage Change (%)"]
["Reporting Basis",null,"CGAAP","CGAAP","MIFRS"]
["Account","Description"]
["Community Relations"]
[5405,"Supervision",{"$f":"'App.2-G_Detailed_OM&A_Expenses'!C75","v":0},{"$f":"'App.2-G_Detailed_OM&A_Expenses'!E75","v":0},{"$f":"'App.2-G_Detailed_OM&A_Expenses'!I75","v":0},{"$f":"E83-C83","v":0},{"$f":"IF(C83=0,\"\",(E83/C83)-1)","v":""},{"$f":"E83-D83","v":0},{"$f":"IF(D83=0,\"\",(E83/D83)-1)","v":""}]
[5410,"Community Relations - Sundry",8100,{"$f":"'App.2-G_Detailed_OM&A_Expenses'!E76","v":15137},{"$f":"'App.2-G_Detailed_OM&A_Expenses'!I76","v":19400},11300,1.3950617283950617,4263,0.28162779943185567]
[5415,"Energy Conservation",0,{"$f":"'App.2-G_Detailed_OM&A_Expenses'!E77","v":208},{"$f":"'App.2-G_Detailed_OM&A_Expenses'!I77","v":0},0,"",-208,-1]
[5420,"Community Safety Program",1000,{"$f":"'App.2-G_Detailed_OM&A_Expenses'!E78","v":0},{"$f":"'App.2-G_Detailed_OM&A_Expenses'!I78","v":1500},500,0.5,1500,""]
[5425,"Miscellaneous Customer Service and Informational Expenses",2600,{"$f":"'App.2-G_Detailed_OM&A_Expenses'!E79","v":2547},{"$f":"'App.2-G_Detailed_OM&A_Expenses'!I79","v":3000},400,0.15384615384615374,453,0.17785630153121312]
[5505,"Supervision",{"$f":"'App.2-G_Detailed_OM&A_Expenses'!C80","v":0},{"$f":"'App.2-G_Detailed_OM&A_Expenses'!E80","v":0},{"$f":"'App.2-G_Detailed_OM&A_Expenses'!I80","v":0},0,"",0,""]
[5510,"Demonstrating and Selling Expense",{"$f":"'App.2-G_Detailed_OM&A_Expenses'!C81","v":0},{"$f":"'App.2-G_Detailed_OM&A_Expenses'!E81","v":0},{"$f":"'App.2-G_Detailed_OM&A_Expenses'!I81","v":0},0,"",0,""]
[5515,"Advertising Expenses",{"$f":"'App.2-G_Detailed_OM&A_Expenses'!C82","v":0},{"$f":"'App.2-G_Detailed_OM&A_Expenses'!E82","v":0},{"$f":"'App.2-G_Detailed_OM&A_Expenses'!I82","v":0},0,"",0,""]
[5520,"Miscellaneous Sales Expense",{"$f":"'App.2-G_Detailed_OM&A_Expenses'!C83","v":0},{"$f":"'App.2-G_Detailed_OM&A_Expenses'!E83","v":0},{"$f":"'App.2-G_Detailed_OM&A_Expenses'!I83","v":0},0,"",0,""]
["Total - Community Relations",null,{"$f":"SUM(C83:C91)","v":11700},{"$f":"SUM(D83:D91)","v":17892},{"$f":"SUM(E83:E91)","v":23900},12200,1.0427350427350426,6008,0.3357925329756315]
["Account","Description",{"$f":"\"Last Board-approved Rebasing Year (\"&'LDC Info'!E109&\" Year)\"","v":"Last Board-approved Rebasing Year ( Year)"},"Most Current Actuals               Year 2011",{"$f":"\"Test Year \" & 'LDC Info'!E107","v":"Test Year "},"Test Year Versus Last Rebasing",null,"Test Year Versus Most Current Actuals"]
[null,null,null,null,null,"Variance ($)","Percentage Change (%)","Variance ($)","Percentage Change (%)"]
["Reporting Basis",null,"CGAAP","CGAAP","MIFRS"]
["Administrative and General Expenses"]
[5605,"Executive Salaries and Expenses",214350,{"$f":"'App.2-G_Detailed_OM&A_Expenses'!E87","v":218153},{"$f":"'App.2-G_Detailed_OM&A_Expenses'!I87","v":233375},{"$f":"E97-C97","v":19025},{"$f":"IF(C97=0,\"\",(E97/C97)-1)","v":8.8756706321436951E-2},{"$f":"E97-D97","v":15222},{"$f":"IF(D97=0,\"\",(E97/D97)-1)","v":6.9776716341283462E-2}]
[5610,"Management Salaries and Expenses",165525,{"$f":"'App.2-G_Detailed_OM&A_Expenses'!E88","v":214395},{"$f":"'App.2-G_Detailed_OM&A_Expenses'!I88","v":232247},66722,0.40309318834012986,17852,8.3266867231045483E-2]
[5615,"General Administrative Salaries and Expenses",519170,{"$f":"'App.2-G_Detailed_OM&A_Expenses'!E89","v":673158},{"$f":"'App.2-G_Detailed_OM&A_Expenses'!I89","v":849125},329955,0.63554327099023444,175967,0.26140519759105585]
[5620,"Office Supplies and Expenses",82450,{"$f":"'App.2-G_Detailed_OM&A_Expenses'!E90","v":86725},{"$f":"'App.2-G_Detailed_OM&A_Expenses'!I90","v":107000},24550,0.29775621588841727,20275,0.23378495243586039]
[5625,"Administrative Expense Transferred - Credit",null,{"$f":"'App.2-G_Detailed_OM&A_Expenses'!E91","v":0},{"$f":"'App.2-G_Detailed_OM&A_Expenses'!I91","v":0},0,"",0,""]
[5630,"Outside Services Employed",{"$f":"81800-25000","v":56800},{"$f":"'App.2-G_Detailed_OM&A_Expenses'!E92","v":104144},{"$f":"'App.2-G_Detailed_OM&A_Expenses'!I92","v":152895},96095,1.6918133802816899,48751,0.46811146105392543]
[5635,"Property Insurance",44200,{"$f":"'App.2-G_Detailed_OM&A_Expenses'!E93","v":57252},{"$f":"'App.2-G_Detailed_OM&A_Expenses'!I93","v":61254},17054,0.38583710407239824,4002,6.9901488157618985E-2]
[5640,"Injuries and Damages",40600,{"$f":"'App.2-G_Detailed_OM&A_Expenses'!E94","v":34561},{"$f":"'App.2-G_Detailed_OM&A_Expenses'!I94","v":38110},-2490,-6.1330049261083763E-2,3549,0.10268800092589903]
[5645,"OMERS Pensions and Benefits",7516,{"$f":"'App.2-G_Detailed_OM&A_Expenses'!E95","v":3461},{"$f":"'App.2-G_Detailed_OM&A_Expenses'!I95","v":4500},-3016,-0.40127727514635447,1039,0.30020225368390641]
[5646,"Employee Pensions and OPEB",null,{"$f":"'App.2-G_Detailed_OM&A_Expenses'!E96","v":0},{"$f":"'App.2-G_Detailed_OM&A_Expenses'!I96","v":0},{"$f":"E106-C106","v":0},{"$f":"IF(C106=0,\"\",(E106/C106)-1)","v":""},{"$f":"E106-D106","v":0},{"$f":"IF(D106=0,\"\",(E106/D106)-1)","v":""}]
[5647,"Employee Sick Leave",null,{"$f":"'App.2-G_Detailed_OM&A_Expenses'!E97","v":0},{"$f":"'App.2-G_Detailed_OM&A_Expenses'!I97","v":0},0,"",0,""]
[5650,"Franchise Requirements",null,{"$f":"'App.2-G_Detailed_OM&A_Expenses'!E98","v":0},{"$f":"'App.2-G_Detailed_OM&A_Expenses'!I98","v":0},0,"",0,""]
[5655,"Regulatory Expenses",90690,{"$f":"'App.2-G_Detailed_OM&A_Expenses'!E99","v":56135},{"$f":"'App.2-G_Detailed_OM&A_Expenses'!I99","v":107000},16310,0.179843422648583,50865,0.9061191769840562]
[5660,"General Advertising Expenses",null,{"$f":"'App.2-G_Detailed_OM&A_Expenses'!E100","v":0},{"$f":"'App.2-G_Detailed_OM&A_Expenses'!I100","v":0},0,"",0,""]
[5665,"Miscellaneous General Expenses",51434,{"$f":"'App.2-G_Detailed_OM&A_Expenses'!E101","v":105153},{"$f":"'App.2-G_Detailed_OM&A_Expenses'!I101","v":114884},63450,1.2336197845782944,9731,9.2541344517037105E-2]
[5670,"Rent",350,{"$f":"'App.2-G_Detailed_OM&A_Expenses'!E102","v":335},{"$f":"'App.2-G_Detailed_OM&A_Expenses'!I102","v":750},{"$f":"E112-C112","v":400},{"$f":"IF(C112=0,\"\",(E112/C112)-1)","v":1.1428571428571428},{"$f":"E112-D112","v":415},1.2388059701492535]
[5672,"Lease Payment Charge",null,{"$f":"'App.2-G_Detailed_OM&A_Expenses'!E103","v":0},{"$f":"'App.2-G_Detailed_OM&A_Expenses'!I103","v":0},0,"",0]
[5675,"Maintenance of General Plant",150600,{"$f":"'App.2-G_Detailed_OM&A_Expenses'!E104","v":181370},{"$f":"'App.2-G_Detailed_OM&A_Expenses'!I104","v":286500},135900,0.90239043824701204,105130,0.57964382202128251]
[5680,"Electrical Safety Authority Fees",16100,{"$f":"'App.2-G_Detailed_OM&A_Expenses'!E105","v":8928},{"$f":"'App.2-G_Detailed_OM&A_Expenses'!I105","v":10000},-6100,-0.3788819875776398,1072,0.12007168458781359]
[5681,"Special Purpose Charge Expense",null,{"$f":"'App.2-G_Detailed_OM&A_Expenses'!E106","v":0},{"$f":"'App.2-G_Detailed_OM&A_Expenses'!I106","v":0},0,"",0]
[5685,"Independent Electricity System Operator Fees and Penalties",null,{"$f":"'App.2-G_Detailed_OM&A_Expenses'!E107","v":0},{"$f":"'App.2-G_Detailed_OM&A_Expenses'!I107","v":0},0,"",0,""]
[5695,"OM&A Contra Account",null,{"$f":"'App.2-G_Detailed_OM&A_Expenses'!E108","v":0},{"$f":"'App.2-G_Detailed_OM&A_Expenses'!I108","v":0},0,"",0,""]
[6205,"Donations",1600,{"$f":"'App.2-G_Detailed_OM&A_Expenses'!E109","v":531},{"$f":"'App.2-G_Detailed_OM&A_Expenses'!I109","v":1000},{"$f":"E119-C119","v":-600},{"$f":"IF(C119=0,\"\",(E119/C119)-1)","v":-0.375},{"$f":"E119-D119","v":469},{"$f":"IF(D119=0,\"\",(E119/D119)-1)","v":0.88323917137476449}]
[6205,"Donations, Sub-account LEAP Funding",{"$f":"'App.2-G_Detailed_OM&A_Expenses'!C110","v":0},{"$f":"'App.2-G_Detailed_OM&A_Expenses'!E110","v":32483},{"$f":"'App.2-G_Detailed_OM&A_Expenses'!I110","v":0},0,"",-32483,-1]
["Total - Administrative and General Expenses",null,{"$f":"SUM(C97:C120)","v":1441385},{"$f":"SUM(D97:D120)","v":1776784},{"$f":"SUM(E97:E120)","v":2198640},757255,0.52536622762135021,421856,0.23742672153733935]
["Total OM&A",null,{"$f":"C121+C92+C77+C64+C41","v":3899340},{"$f":"D121+D92+D77+D64+D41","v":4196286},{"$f":"E121+E92+E77+E64+E41","v":5466072},1566732,0.40179414977919348,1269786,0.30259758271957637]
["Adjustments for non-recoverable items"]
[5681,"Special Purpose Charge Expense",{"$f":"'App.2-G_Detailed_OM&A_Expenses'!C114","v":0},{"$f":"'App.2-G_Detailed_OM&A_Expenses'!E114","v":0},{"$f":"'App.2-G_Detailed_OM&A_Expenses'!I114","v":0},{"$f":"E124-C124","v":0},{"$f":"IF(C124=0,\"\",(E124/C124)-1)","v":""},{"$f":"E124-D124","v":0},{"$f":"IF(D124=0,\"\",(E124/D124)-1)","v":""}]
[6205,"Donations1",{"$f":"C119","v":1600},{"$f":"'App.2-G_Detailed_OM&A_Expenses'!E115","v":531},{"$f":"'App.2-G_Detailed_OM&A_Expenses'!I115","v":1000},{"$f":"E125-C125","v":-600},{"$f":"IF(C125=0,\"\",(E125/C125)-1)","v":-0.375},{"$f":"E125-D125","v":469},{"$f":"IF(D125=0,\"\",(E125/D125)-1)","v":0.88323917137476449}]
[null,null,null,null,null,{"$f":"E126-C126","v":0},{"$f":"IF(C126=0,\"\",(E126/C126)-1)","v":""},{"$f":"E126-D126","v":0},{"$f":"IF(D126=0,\"\",(E126/D126)-1)","v":""}]
[null,null,null,null,null,{"$f":"E127-C127","v":0},{"$f":"IF(C127=0,\"\",(E127/C127)-1)","v":""},{"$f":"E127-D127","v":0},{"$f":"IF(D127=0,\"\",(E127/D127)-1)","v":""}]
[null,null,null,null,null,{"$f":"E128-C128","v":0},{"$f":"IF(C128=0,\"\",(E128/C128)-1)","v":""},{"$f":"E128-D128","v":0},{"$f":"IF(D128=0,\"\",(E128/D128)-1)","v":""}]
["Total Recoverable OM&A",null,{"$f":"C122-SUM(C124:C128)","v":3897740},{"$f":"D122-SUM(D124:D128)","v":4195755},5465072,1567332,{"$f":"IF(C129=0,\"\",(E129/C129)-1)","v":0.40211301933941201},1269317,{"$f":"IF(D129=0,\"\",(E129/D129)-1)","v":0.30252409876172459}]
[]
["1 Account 6205 - Donations is generally non-recoverable.  However, the sub-account LEAP funding of account 6205 is generally recoverable."]
[]
[]
["Note:"]
[]
[1,"If the applicant is adopting IFRS or an alternate accounting standard as of January 1, 2013 for financial reporting purposes, Column D \"Most Current Actual Year\" must be provided on CGAAP."]
[2,"If the applicant is adopting IFRS or an alternate accounting standard as of January 1, 2012 for financial reporting purposes, Column D \"Most Current Actual Year\" must be provided on that standard."]

{"sheet":"App.2-I_OM&A_Summary_Analys","index":18,"n_rows":59,"n_cols":12,"rows_kept":59,"cut":false,"hidden":false,"merged":[[61,1,62,5],[56,0,57,11],[8,0,8,6],[9,0,9,6],[12,7,12,8]]}
[null,null,null,null,null,null,null,null,null,null,"File Number:",{"$f":"'LDC Info'!$E$18","v":"EB-2012-0139"}]
[null,null,null,null,null,null,null,null,null,null,"Exhibit:",4]
[null,null,null,null,null,null,null,null,null,null,"Tab:",1]
[null,null,null,null,null,null,null,null,null,null,"Schedule:",1]
[null,null,null,null,null,null,null,null,null,null,"Page:"]
[]
[null,null,null,null,null,null,null,null,null,null,"Date:","2012-08-31"]
[]
["Appendix 2-I"]
["Summary of Recoverable OM&A Expenses"]
[]
[]
[null,{"$f":"\"Last Rebasing Year (\" & 'LDC Info'!E30 & \" BA)\"","v":"Last Rebasing Year (2009 BA)"},{"$f":"\"Last Rebasing Year (\" & 'LDC Info'!E30 & \" Actuals)\"","v":"Last Rebasing Year (2009 Actuals)"},{"$f":"'LDC Info'!E26 -2 & \" Actuals\"","v":"2010 Actuals"},{"$f":"'LDC Info'!E26 -1 & \" Actuals\"","v":"2011 Actuals"},{"$f":"'LDC Info'!E26 & \" Bridge Year\"","v":"2012 Bridge Year"},{"$f":"'LDC Info'!E28 & \" Test Year\"","v":"2013 Test Year"}]
["Reporting Basis","CGAAP","CGAAP","CGAAP","CGAAP","MIFRS","MIFRS"]
["Operations",{"$f":"'App.2-H_OM&A_Detailed_Analysis'!C41","v":778575},{"$f":"'App.2-G_Detailed_OM&A_Expenses'!C40","v":694259},{"$f":"'App.2-G_Detailed_OM&A_Expenses'!D40","v":870153},{"$f":"'App.2-G_Detailed_OM&A_Expenses'!E40","v":947441},{"$f":"'App.2-G_Detailed_OM&A_Expenses'!H40","v":1159195},{"$f":"'App.2-G_Detailed_OM&A_Expenses'!I40","v":1423862}]
["Maintenance",{"$f":"'App.2-H_OM&A_Detailed_Analysis'!C64","v":657080},{"$f":"'App.2-G_Detailed_OM&A_Expenses'!C61","v":544762},{"$f":"'App.2-G_Detailed_OM&A_Expenses'!D61","v":436208},{"$f":"'App.2-G_Detailed_OM&A_Expenses'!E61","v":528873},{"$f":"'App.2-G_Detailed_OM&A_Expenses'!H61","v":601800},{"$f":"'App.2-G_Detailed_OM&A_Expenses'!I61","v":713650}]
["SubTotal",{"$f":"SUM(B15:B16)","v":1435655},{"$f":"SUM(C15:C16)","v":1239021},1306361,1476314,1760995,2137512]
["%Change (year over year)",null,null,{"$f":"IF(ISERROR((D17-C17)/C17), \"\", (D17-C17)/C17)","v":5.4349361310260275E-2},{"$f":"IF(ISERROR((E17-D17)/D17), \"\", (E17-D17)/D17)","v":0.13009650471806797},0.19283228364697483,0.2138092385270827]
["%Change (Test Year vs \nLast Rebasing Year - Actual)",null,null,null,null,null,{"$f":"IF(ISERROR((G17-C17)/C17), \"\", (G17-C17)/C17)","v":0.72516204325834666}]
["Billing and Collecting",{"$f":"'App.2-H_OM&A_Detailed_Analysis'!C77","v":1010600},{"$f":"'App.2-G_Detailed_OM&A_Expenses'!C72","v":970447},{"$f":"'App.2-G_Detailed_OM&A_Expenses'!D72","v":922744},{"$f":"'App.2-G_Detailed_OM&A_Expenses'!E72","v":925296},{"$f":"'App.2-G_Detailed_OM&A_Expenses'!H72","v":955500},{"$f":"'App.2-G_Detailed_OM&A_Expenses'!I72","v":1106020}]
["Community Relations",{"$f":"'App.2-H_OM&A_Detailed_Analysis'!C92","v":11700},{"$f":"'App.2-G_Detailed_OM&A_Expenses'!C84","v":10826},{"$f":"'App.2-G_Detailed_OM&A_Expenses'!D84","v":9114},{"$f":"'App.2-G_Detailed_OM&A_Expenses'!E84","v":17892},{"$f":"'App.2-G_Detailed_OM&A_Expenses'!H84","v":18400},{"$f":"'App.2-G_Detailed_OM&A_Expenses'!I84","v":23900}]
["Administrative and General",{"$f":"'App.2-H_OM&A_Detailed_Analysis'!C121-'App.2-H_OM&A_Detailed_Analysis'!C125","v":1439785},{"$f":"'App.2-G_Detailed_OM&A_Expenses'!C111-'App.2-G_Detailed_OM&A_Expenses'!C114-'App.2-G_Detailed_OM&A_Expenses'!C115","v":1476117},{"$f":"'App.2-G_Detailed_OM&A_Expenses'!D111-'App.2-G_Detailed_OM&A_Expenses'!D114-'App.2-G_Detailed_OM&A_Expenses'!D115","v":1620369},{"$f":"'App.2-G_Detailed_OM&A_Expenses'!E111-'App.2-G_Detailed_OM&A_Expenses'!E114-'App.2-G_Detailed_OM&A_Expenses'!E115","v":1776253},{"$f":"'App.2-G_Detailed_OM&A_Expenses'!H111-'App.2-G_Detailed_OM&A_Expenses'!H114-'App.2-G_Detailed_OM&A_Expenses'!H115","v":1899865},{"$f":"'App.2-G_Detailed_OM&A_Expenses'!I111-'App.2-G_Detailed_OM&A_Expenses'!I114-'App.2-G_Detailed_OM&A_Expenses'!I115","v":2197640}]
["SubTotal",{"$f":"SUM(B20:B22)","v":2462085},{"$f":"SUM(C20:C22)","v":2457390},2552227,2719441,2873765,3327560]
["%Change (year over year)",null,null,{"$f":"IF(ISERROR((D23-C23)/C23), \"\", (D23-C23)/C23)","v":3.8592571793650984E-2},{"$f":"IF(ISERROR((E23-D23)/D23), \"\", (E23-D23)/D23)","v":6.5516899554780975E-2},{"$f":"IF(ISERROR((F23-E23)/E23), \"\", (F23-E23)/E23)","v":5.6748427342236882E-2},{"$f":"IF(ISERROR((G23-F23)/F23), \"\", (G23-F23)/F23)","v":0.15790957158988295}]
["%Change (Test Year vs \nLast Rebasing Year - Actual)",null,null,null,null,null,{"$f":"IF(ISERROR((G23-C23)/C23), \"\", (G23-C23)/C23)","v":0.35410333728061072}]
["Total",{"$f":"SUM(B23,B17)","v":3897740},{"$f":"SUM(C23,C17)","v":3696411},3858588,4195755,4634760,5465072]
["%Change (year over year)",null,null,{"$f":"IF(ISERROR((D26-C26)/C26), \"\", (D26-C26)/C26)","v":4.3874179575810156E-2},{"$f":"IF(ISERROR((E26-D26)/D26), \"\", (E26-D26)/D26)","v":8.7380927945663031E-2},{"$f":"IF(ISERROR((F26-E26)/E26), \"\", (F26-E26)/E26)","v":0.1046307517955648},{"$f":"IF(ISERROR((G26-F26)/F26), \"\", (G26-F26)/F26)","v":0.1791488663922188}]
[]
[]
[null,{"$f":"B13","v":"Last Rebasing Year (2009 BA)"},{"$f":"C13","v":"Last Rebasing Year (2009 Actuals)"},"2010 Actuals","2011 Actuals","2012 Bridge Year","2013 Test Year"]
["Operations",{"$f":"B15","v":778575},{"$f":"C15","v":694259},870153,947441,1159195,1423862]
["Maintenance",{"$f":"B16","v":657080},{"$f":"C16","v":544762},436208,528873,601800,713650]
["Billing and Collecting",{"$f":"B20","v":1010600},{"$f":"C20","v":970447},922744,925296,955500,1106020]
["Community Relations",{"$f":"B21","v":11700},{"$f":"C21","v":10826},9114,17892,18400,23900]
["Administrative and General",{"$f":"B22","v":1439785},{"$f":"C22","v":1476117},1620369,1776253,1899865,2197640]
["Total",{"$f":"SUM(B31:B35)","v":3897740},{"$f":"SUM(C31:C35)","v":3696411},3858588,4195755,4634760,5465072]
["%Change (year over year)",null,null,{"$f":"IF(ISERROR((D36-C36)/C36), \"\", (D36-C36)/C36)","v":4.3874179575810156E-2},{"$f":"IF(ISERROR((E36-D36)/D36), \"\", (E36-D36)/D36)","v":8.7380927945663031E-2},{"$f":"IF(ISERROR((F36-E36)/E36), \"\", (F36-E36)/E36)","v":0.1046307517955648},{"$f":"IF(ISERROR((G36-F36)/F36), \"\", (G36-F36)/F36)","v":0.1791488663922188}]
[]
[]
[null,{"$f":"B13","v":"Last Rebasing Year (2009 BA)"},{"$f":"C13","v":"Last Rebasing Year (2009 Actuals)"},{"$f":"\"Variance \" & 'LDC Info'!E30 & \"  BA – \" & 'LDC Info'!E30 & \" Actuals\"","v":"Variance 2009  BA – 2009 Actuals"},{"$f":"D13","v":"2010 Actuals"},{"$f":"\"Variance \" & 'LDC Info'!E26 -2 & \" Actuals vs. \" &  'LDC Info'!E30 & \" Actuals\"","v":"Variance 2010 Actuals vs. 2009 Actuals"},{"$f":"E13","v":"2011 Actuals"},{"$f":"\"Variance \" & 'LDC Info'!E26 -1 & \" Actuals vs. \" &  'LDC Info'!E26-2 & \" Actuals\"","v":"Variance 2011 Actuals vs. 2010 Actuals"},{"$f":"F13","v":"2012 Bridge Year"},{"$f":"\"Variance \" & 'LDC Info'!E26 & \" Bridge vs. \" & 'LDC Info'!E26 -1 & \" Actuals\"","v":"Variance 2012 Bridge vs. 2011 Actuals"},{"$f":"G13","v":"2013 Test Year"},{"$f":"\"Variance \" & 'LDC Info'!E28 & \" Test vs. \" & 'LDC Info'!E26 & \" Bridge\"","v":"Variance 2013 Test vs. 2012 Bridge"}]
["Operations",{"$f":"B15","v":778575},694259,{"$f":"B41-C41","v":84316},{"$f":"D15","v":870153},{"$f":"E41-C41","v":175894},{"$f":"E15","v":947441},{"$f":"G41-E41","v":77288},{"$f":"F15","v":1159195},{"$f":"I41-G41","v":211754},{"$f":"G15","v":1423862},{"$f":"K41-I41","v":264667}]
["Maintenance ",657080,544762,{"$f":"B42-C42","v":112318},{"$f":"D16","v":436208},{"$f":"E42-C42","v":-108554},{"$f":"E16","v":528873},{"$f":"G42-E42","v":92665},{"$f":"F16","v":601800},72927,{"$f":"G16","v":713650},111850]
["Billing and Collecting ",{"$f":"B20","v":1010600},970447,40153,{"$f":"D20","v":922744},-47703,{"$f":"E20","v":925296},2552,{"$f":"F20","v":955500},30204,{"$f":"G20","v":1106020},150520]
["Community Relations ",11700,10826,874,{"$f":"D21","v":9114},-1712,{"$f":"E21","v":17892},8778,{"$f":"F21","v":18400},508,{"$f":"G21","v":23900},5500]
["Administrative and General ",1439785,1476117,-36332,1620369,144252,1776253,155884,1899865,123612,2197640,297775]
["Total OM&A Expenses ",{"$f":"SUM(B41:B45)","v":3897740},{"$f":"SUM(C41:C45)","v":3696411},201329,3858588,162177,4195755,337167,4634760,439005,5465072,830312]
["Variance from previous year ",null,null,null,{"$f":"E46-C46","v":162177},null,{"$f":"G46-E46","v":337167},null,{"$f":"I46-G46","v":439005},null,{"$f":"K46-I46","v":830312}]
["Percent change (year over year) ",null,null,null,{"$f":"IF(ISERROR(E47/C46), \"\", E47/C46)","v":4.3874179575810156E-2},null,{"$f":"IF(ISERROR(G47/E46), \"\", G47/E46)","v":8.7380927945663031E-2},null,{"$f":"IF(ISERROR(I47/G46), \"\", I47/G46)","v":0.1046307517955648},null,{"$f":"IF(ISERROR(K47/I46), \"\", K47/I46)","v":0.1791488663922188}]
["Percent Change:                                                    Test year vs. Most Current Actual ",null,null,null,null,null,{"$f":"IF(ISERROR((K46-G46)/G46), \"\", (K46-G46)/G46)","v":0.30252409876172465}]
["Simple average of % variance for all years",null,null,null,null,null,{"$f":"IF(ISERROR((K46-C46)/C46), \"\", (K46-C46)/C46)","v":0.47848061268078684},null,null,null,null,{"$f":"IF(ISERROR(AVERAGE(E48,G48,I48,K48)), \"\", AVERAGE(E48,G48,I48,K48))","v":0.1037586814273142}]
["Compound Annual Growth Rate for all years",null,null,null,null,null,{"$f":"IF(ISERROR((K47-C47)/C47), \"\", (K47-C47)/C47)","v":""},null,null,null,null,{"$f":"IF((K46-C46)=0, \"\", (K46/C46)^(1/4)-100%)","v":0.10269119945930649}]
[{"$f":"\"Compound Growth Rate                                                            (\" & E13 & \" vs. \" & 'LDC Info'!E30 & \" Actuals)\"","v":"Compound Growth Rate                                                            (2011 Actuals vs. 2009 Actuals)"},null,null,null,null,null,{"$f":"IF(ISERROR((G46/C46)^(1/(2010-2008)) - 1), \"\", (G46-C46)/C46)","v":0.13508887404566214}]
[]
["Note:"]
[]
["1     \"BA\" = Board-Approved"]
["2     If it has been more than three years since the applicant last filed a cost of service application, additional years of historical actuals should be incorporated into the table, as necessary, to go back to the last cost of service application.  If the applicant last filed a cost of service application less than three years ago, a minimum of three years of actual information is required."]
[]
["3     Recoverable OM&A that is included on these tables should be identical to the recoverable OM&A that is shown for the corresponding periods on Appendix 2-H."]

{"sheet":"App.2-J_OM&A_Cost _Drivers","index":19,"n_rows":36,"n_cols":7,"rows_kept":36,"cut":false,"hidden":false,"merged":[[9,0,9,6],[10,0,10,6],[31,1,34,6],[35,1,36,6]]}
[null,null,null,null,null,"File Number:",{"$f":"'LDC Info'!$E$18","v":"EB-2012-0139"}]
[null,null,null,null,null,"Exhibit:","1900-01-04"]
[null,null,null,null,null,"Tab:","1900-01-02"]
[null,null,null,null,null,"Schedule:","1900-01-03"]
[null,null,null,null,null,"Page:"]
[]
[null,null,null,null,null,"Date:","2012-08-31"]
[]
[]
["Appendix 2-J"]
["OM&A Cost Driver Table"]
[]
["OM&A",{"$f":"\"Last Rebasing Year (\" & 'LDC Info'!E30 & \" Actuals)\"","v":"Last Rebasing Year (2009 Actuals)"},"2009 Actuals",{"$f":"'LDC Info'!E26 -2 & \" Actuals\"","v":"2010 Actuals"},{"$f":"'LDC Info'!E26 -1 & \" Actuals\"","v":"2011 Actuals"},{"$f":"'LDC Info'!E26 & \" Bridge Year\"","v":"2012 Bridge Year"},{"$f":"'LDC Info'!E28 & \" Test Year\"","v":"2013 Test Year"}]
["Reporting Basis"]
["Opening Balance",{"$f":"'App.2-I_OM&A_Summary_Analys'!B26","v":3897740},{"$f":"B24","v":3696411},{"$f":"IF(ISERROR(FIND(\"2008\", $B$13)), B24, C24)","v":3696411},{"$f":"D24","v":3858587.9966666666},{"$f":"E24","v":4195754.9698999999},{"$f":"F24","v":4634759.8689970002}]
["Cost Driver #1 - 3% inflation",null,null,110892.33,115757.63989999999,125872.64909699999,139042.79606990999]
["Cost Driver #2 - Asset Mgt Plan",-174800,null,-193602,-301710,-94856,81834]
["Cost Driver #3 - Meter/Smart meter costs",0,null,0,-47000,155800,25000]
["Cost Driver #4 - Payroll cost",-91500,null,198786.66666666666,563119.33333333337,231781.25,436225]
["Cost Driver #5 - Bad debts",58000,null,-2700,-20500,8000,22750]
["Cost Driver #6 - Admin services",6971,null,48800,19000,12407,125460]
["Cost Driver #7 - Annual leap program",null,null,null,8500]
[]
["Closing Balance",{"$f":"SUM(B15:B23)","v":3696411},3696411,3858587.9966666666,4195754.9698999999,4634759.8689970002,5465071.66506691]
[]
[]
["Notes:"]
[]
[1,"For each year, a detailed explanation for each cost driver and associated amount is"]
[null,"required."]
[2,"The closing balance for each year becomes the opening balance for the next year."]
[3,"If it has been more than three years since the applicant last filed a cost of service application, additional years of historical actuals should be incorporated into the table, as necessary, to go back to the last cost of service application.  If the applicant last filed a cost of service application less than three years ago, a minimum of three years of actual information is required."]
[]
[]
[]
[4,"Opening Balance for \"Last Rebasing Year\" (cell B15) should be equal to the Board-Approved amount."]

{"sheet":"App.2-K_Employee Costs","index":20,"n_rows":93,"n_cols":7,"rows_kept":93,"cut":false,"hidden":false,"merged":[[8,0,8,6],[13,0,13,6],[19,0,19,6],[25,0,25,6],[31,0,31,6],[37,0,37,6],[43,0,43,6],[9,0,9,6],[74,0,74,6],[80,0,80,6],[49,0,49,6],[56,0,56,6],[62,0,62,6],[68,0,68,6]]}
[null,null,null,null,null,"File Number:",{"$f":"'LDC Info'!$E$18","v":"EB-2012-0139"}]
[null,null,null,null,null,"Exhibit:"]
[null,null,null,null,null,"Tab:"]
[null,null,null,null,null,"Schedule:"]
[null,null,null,null,null,"Page:"]
[]
[null,null,null,null,null,"Date:","2012-08-31"]
[]
["Appendix 2-K"]
["Employee Costs"]
[]
[null,{"$f":"\"Last Rebasing Year (\" & 'LDC Info'!E30 & \" Board-Approved)\"","v":"Last Rebasing Year (2009 Board-Approved)"},{"$f":"\"Last Rebasing Year (\" & 'LDC Info'!E30 & \" Actuals)\"","v":"Last Rebasing Year (2009 Actuals)"},{"$f":"'LDC Info'!E26 -2 & \" Actuals\"","v":"2010 Actuals"},{"$f":"'LDC Info'!E26 -1 & \" Actuals\"","v":"2011 Actuals"},{"$f":"'LDC Info'!E26 & \" Bridge Year\"","v":"2012 Bridge Year"},{"$f":"'LDC Info'!E28 & \" Test Year\"","v":"2013 Test Year"}]
["Reporting Basis","CGAAP","CGAAP","CGAAP","CGAAP","CGAAP","MIFRS"]
["Number of Employees (FTEs including Part-Time)1"]
["Executive"]
["Management",8,9,10,10.5,11.5,11.5]
["Non-Union"]
["Union",18.3,17.8,22.5,23.8,24.8,29]
["Total",{"$f":"SUM(B15:B18)","v":26.3},26.8,32.5,34.299999999999997,36.299999999999997,40.5]
["Number of Part-Time Employees"]
["Executive"]
["Management",null,null,null,0.5,0.5,0.5]
["Non-Union"]
["Union",null,null,0.5,0.5,0.5,1]
["Total",{"$f":"SUM(B21:B24)","v":0},0,0.5,1,1,1.5]
["Total Salary and Wages"]
["Executive"]
["Management",763988,753181.01500000001,884165.7024999999,995529.66700000002,1162162.2861194334,1217027]
["Non-Union"]
["Union",944616.20915999997,857885.96,964138.73750000005,1349451.9306000001,1533214.0925755999,1916707]
["Total",{"$f":"SUM(B27:B30)","v":1708604.2091600001},1611066.9750000001,1848304.44,2344981.5976,2695376.3786950335,3133734]
["Current Benefits"]
["Executive"]
["Management",174099.68341999999,157020.82330000002,186476.78306250001,217805.20674499997,272290.57152985834,296878]
["Non-Union"]
["Union",234593.56906900002,188589.71120000002,213432.24093749997,299127.72369100002,362439.54314389999,475994]
["Total",{"$f":"SUM(B33:B36)","v":408693.25248899998},345610.53450000007,399909.02399999998,516932.930436,634730.11467375839,772872]
["Accrued Pension and Post-Retirement Benefits"]
["Executive"]
["Management",2192.2433460076045,1511.1940298507461,1093.8461538461538,1059.4897959183675,1393.939393939394,1278]
["Non-Union"]
["Union",5014.7566539923955,2988.8059701492534,2461.1538461538462,2401.5102040816328,3006.0606060606065,3222]
["Total",{"$f":"SUM(B39:B42)","v":7207},4500,3555,3461,4400,4500]
["Total Benefits (Current + Accrued)"]
["Executive",{"$f":"B33+B39","v":0},0,0,0,0,0]
["Management",{"$f":"B34+B40","v":176291.92676600759},158532.01732985076,187570.62921634616,218864.69654091835,273684.51092379773,298156]
["Non-Union",0,0,0,0,0,0]
["Union",239608.32572299242,191578.51717014928,215893.39478365381,301529.23389508168,365445.6037499606,479216]
["Total",415900.25248899998,350110.53450000007,403464.02399999998,520393.930436,639130.11467375839,777372]
["Total Compensation (Salary, Wages, & Benefits)"]
["Executive",{"$f":"B27+B45","v":0},0,0,0,0,0]
["Management",940279.92676600756,911713.03232985083,1071736.3317163461,1214394.3635409183,1435846.7970432311,1515183]
["Non-Union",0,0,0,0,0,0]
["Union",1184224.5348829925,1049464.4771701493,1180032.1322836538,1650981.1644950816,1898659.6963255606,2395923]
["Total",2124504.4616490002,1961177.5095000002,2251768.4639999997,2865375.5280360002,3334506.4933687919,3911106]
[]
["Compensation - Average Yearly Base Wages"]
["Executive"]
["Management",90993.5,79303.446111111116,82878.57024999999,88269.587333333329,94709.764010385508,99290.187365479709]
["Non-Union"]
["Union",51500.382513661199,48158.761797752806,42159.455000000002,53482.518092436978,58457.990829661285,63129.229922512692]
["Total"]
["Compensation - Average Yearly Overtime"]
["Executive"]
["Management",4505,4383.333333333333,5538,6542.7619047619046,6347.826086956522,6538.260869565217]
["Non-Union"]
["Union",117.98957158469945,37.078651685393254,691.15555555555557,3217.1428571428569,3365.1580645161293,2964.124055172414]
["Total"]
["Compensation - Average Yearly Incentive Pay"]
["Executive"]
["Management"]
["Non-Union"]
["Union"]
["Total"]
["Compensation - Average Yearly Benefits"]
["Executive"]
["Management",22036.490845750948,17446.758144444448,18647.67830625,20743.353023333329,23677.441002596377,25815.448715024719]
["Non-Union"]
["Union",13093.351132403957,10594.927595505618,9485.8773749999982,12568.391751722689,14614.497707415321,16413.599779853299]
["Total"]
[]
["Total Compensation",{"$f":"SUM(B51:B54)","v":2124504.4616490002},{"$f":"SUM(C51:C54)","v":1961177.5095000002},2251768.4639999997,2865375.5280360002,3334506.4933687914,3911106]
["Total Compensation Capitalized (CGAAP)",147000,135014,245271,474840,697092]
["Total Compensation Charged to OM&A (CGAAP)",{"$f":"B82-B83","v":1977504.4616490002},{"$f":"C82-C83","v":1826163.5095000002},{"$f":"D82-D83","v":2006497.4639999997},{"$f":"E82-E83","v":2390535.5280360002},{"$f":"F82-F83","v":2637414.4933687914}]
[]
["Total Compensation Capitalized (MIFRS)",null,null,null,{"$f":"E83","v":474840},697092,792446]
["Total Compensation Charged to OM&A (MIFRS)",null,null,null,{"$f":"E82-E86","v":2390535.5280360002},{"$f":"F82-F86","v":2637414.4933687914},{"$f":"G82-G86","v":3118660}]
[]
[]
["1 If an applicant wishes to use headcount, it must also file the same schedule on an FTE basis."]
[]
["Note:"]
["1   Please report compensation on a CGAAP and MIFRS basis for your transition year."]

{"sheet":"App.2-L_OM&A_per_Cust_FTEE","index":21,"n_rows":29,"n_cols":8,"rows_kept":29,"cut":false,"hidden":false,"merged":[[8,0,8,7],[9,0,9,7],[28,1,29,6],[22,1,25,6],[27,1,27,6],[15,0,15,1],[16,0,16,1],[17,0,17,1],[18,0,18,1],[13,0,13,1],[14,0,14,1],[12,0,12,1]]}
[null,null,null,null,null,null,"File Number:",{"$f":"'LDC Info'!$E$18","v":"EB-2012-0139"}]
[null,null,null,null,null,null,"Exhibit:",4]
[null,null,null,null,null,null,"Tab:",1]
[null,null,null,null,null,null,"Schedule:",1]
[null,null,null,null,null,null,"Page:"]
[]
[null,null,null,null,null,null,"Date:","2012-08-31"]
[]
["Appendix 2-L"]
["Recoverable OM&A Cost per Customer and per FTEE"]
[]
[null,null,{"$f":"\"Last Rebasing Year (\" & 'LDC Info'!E30 & \" Board-Approved)\"","v":"Last Rebasing Year (2009 Board-Approved)"},{"$f":"\"Last Rebasing Year (\" & 'LDC Info'!E30 & \" Actuals)\"","v":"Last Rebasing Year (2009 Actuals)"},{"$f":"'LDC Info'!E26 -2 & \" Actuals\"","v":"2010 Actuals"},{"$f":"'LDC Info'!E26 -1 & \" Actuals\"","v":"2011 Actuals"},{"$f":"'LDC Info'!E26 & \" Bridge Year\"","v":"2012 Bridge Year"},{"$f":"'LDC Info'!E28 & \" Test Year\"","v":"2013 Test Year"}]
["Reporting Basis",null,"CGAAP","CGAAP","CGAAP","CGAAP","CGAAP","MIFRS"]
["Number of Customers",null,14411,14460,14584,14742,14952,15165]
["Total Recoverable OM&A from Appendix 2-I",null,{"$f":"'App.2-I_OM&A_Summary_Analys'!B36","v":3897740},{"$f":"'App.2-I_OM&A_Summary_Analys'!C36","v":3696411},{"$f":"'App.2-I_OM&A_Summary_Analys'!D36","v":3858588},{"$f":"'App.2-I_OM&A_Summary_Analys'!E36","v":4195755},{"$f":"'App.2-I_OM&A_Summary_Analys'!F36","v":4634760},{"$f":"'App.2-I_OM&A_Summary_Analys'!G36","v":5465072}]
["OM&A cost per customer",null,{"$f":"IF(C14=0,\"\",C15/C14)","v":270.46978002914443},255.63008298755187,264.57679648930332,284.61233211233213,309.97592295345106,360.37401912298054]
["Number of FTEEs",null,26.3,26.8,32.5,34.299999999999997,36.299999999999997,40.5]
["Customers/FTEEs",null,{"$f":"IF(C17=0,\"\",C14/C17)","v":547.94676806083646},539.55223880597009,448.73846153846154,429.79591836734699,411.90082644628103,374.44444444444446]
["OM&A Cost per FTEE",null,{"$f":"IF(C17=0,\"\",C15/C17)","v":148203.04182509505},137925.78358208956,118725.78461538462,122325.21865889213,127679.33884297522,134940.04938271604]
[]
["Notes:"]
[]
[1,"If it has been more than three years since the applicant last filed a cost of service application, additional years of historical actuals should be incorporated into the table, as necessary, to go back to the last cost of service application.  If the applicant last filed a cost of service application less than three years ago, a minimum of three years of actual information is required."]
[]
[]
[]
[2,"The method of calculating the number of customers must be identified.  The number of residential, GS<>50 per load forecast"]
[3,"The method of calculating the number of FTEEs must be identified.  See also Appendix 2-K"]
[4,"The number of customers and the number of FTEEs should correspond to mid-year or average of January 1 and December 31 figures."]

{"sheet":"App.2-M_Regulatory_Costs","index":22,"n_rows":45,"n_cols":11,"rows_kept":45,"cut":false,"hidden":false,"merged":[[12,0,12,1],[13,0,13,1],[8,0,8,10],[9,0,9,10]]}
[null,null,null,null,null,null,null,null,null,"File Number:",{"$f":"'LDC Info'!$E$18","v":"EB-2012-0139"}]
[null,null,null,null,null,null,null,null,null,"Exhibit:",4]
[null,null,null,null,null,null,null,null,null,"Tab:",1]
[null,null,null,null,null,null,null,null,null,"Schedule:",1]
[null,null,null,null,null,null,null,null,null,"Page:"]
[]
[null,null,null,null,null,null,null,null,null,"Date:","2012-08-31"]
[]
["Appendix 2-M"]
["Regulatory Cost Schedule"]
[]
[]
["Regulatory Cost Category",null,"USoA Account","USoA Account Balance","Ongoing or One-time Cost? 2",{"$f":"\"Last Rebasing Year (\" & 'LDC Info'!E30 & \" Board Approved)\"","v":"Last Rebasing Year (2009 Board Approved)"},"Most Current Actuals               Year 2011",{"$f":"'LDC Info'!E26 & \" Bridge Year\"","v":"2012 Bridge Year"},"Annual % Change",{"$f":"'LDC Info'!E28 & \" Test Year\"","v":"2013 Test Year"},"Annual % Change"]
["(A)",null,"(B)","(C )","(D)","(E)","(F)","(G)","(H) = [(G)-(F)]/(F)","(I)","(J) = [(I)-(G)]/(G)"]
[1,"OEB Annual Assessment",5655,null,"On-Going",49990,46951,48000,{"$f":"IF(G15=0,\"\",(H15-G15)/G15)","v":2.2342442120508614E-2},49000,{"$f":"IF(H15=0,\"\",(J15-H15)/H15)","v":2.0833333333333332E-2}]
[2,"OEB Section 30 Costs (Applicant-originated)",5655,null,"On-Going",4000,6546,8000,{"$f":"IF(G16=0,\"\",(H16-G16)/G16)","v":0.22212037885731745},8000,{"$f":"IF(H16=0,\"\",(J16-H16)/H16)","v":0}]
[3,"OEB Section 30 Costs (OEB-initiated)",5655,null,"On-Going",4000,6546,8000,0.22212037885731745,8000,0]
[4,"Expert Witness costs for regulatory matters",5655,null,"On-Time",null,null,null,"",16000,""]
[5,"Legal costs for regulatory matters",null,null,null,null,null,null,"",null,""]
[6,"Consultants' costs for regulatory matters",5655,null,"On-Time",28700,0,0,"",{"$f":"41000-16000","v":25000},""]
[7,"Operating expenses associated with staff resources allocated to regulatory matters",null,null,null,null,null,null,"",null,""]
[8,"Operating expenses associated with other resources allocated to regulatory matters 1",null,null,null,null,null,null,"",null,""]
[9,"Other regulatory agency fees or assessments",null,null,null,null,null,null,"",null,""]
[10,"Any other costs for regulatory matters (please define)",null,null,null,null,null,null,"",null,""]
[11,"Intervenor costs",null,null,"On-Time",8000,null,null,"",9000,""]
[12,"Sub-total - Ongoing Costs 3",null,{"$f":"SUMIF($E15:$E25,$E11,D15:D25)","v":0},null,{"$f":"SUM(F15:F25)","v":94690},{"$f":"SUM(G15:G25)","v":60043},{"$f":"SUM(H15:H25)","v":64000},6.5902769681728091E-2,{"$f":"SUM(J15:J25)","v":115000},0.796875]
[13,"Sub-total - One-time Costs 4",null,{"$f":"SUMIF($E15:$E25,$E12,D15:D25)","v":0},null,{"$f":"SUMIF($E15:$E25,$E12,F15:F25)","v":0},{"$f":"SUMIF($E15:$E25,$E12,G15:G25)","v":0},{"$f":"SUMIF($E15:$E25,$E12,H15:H25)","v":0},"",{"$f":"SUMIF($E15:$E25,$E12,J15:J25)","v":0},""]
[14,"Total",null,{"$f":"D26+D27","v":0},null,{"$f":"F26+F27","v":94690},{"$f":"G26+G27","v":60043},{"$f":"H26+H27","v":64000},6.5902769681728091E-2,{"$f":"J26+J27","v":115000},0.796875]
[]
[]
["1","Please identify the resources involved."]
["2","Where a category's costs include both one-time and ongoing costs, the applicant should prove a separate breakdown between one-time and ongoing costs."]
["3","Sum of all ongoing costs identified in rows 1 to 11 inclusive."]
["4","Sum of all one-time costs identified in rows 1 to 11 inclusive."]
[]
[]
["Please fill out the following table for all one-time costs related to this cost of service application"]
[]
[null,null,"Historical Year(s)",{"$f":"H13","v":"2012 Bridge Year"},{"$f":"J13","v":"2013 Test Year"}]
[4,"Expert Witness costs for regulatory matters",null,{"$f":"H18","v":0},{"$f":"J18","v":16000}]
[6,"Consultants' costs for regulatory matters",{"$f":"(28822+21470+26798)/4","v":19272.5},{"$f":"H20","v":0},{"$f":"J20","v":25000}]
[7,"Operating expenses associated with staff resources allocated to regulatory matters",null,{"$f":"H21","v":0},{"$f":"J21","v":0}]
[8,"Operating expenses associated with other resources allocated to regulatory matters 1",null,{"$f":"H22","v":0},{"$f":"J22","v":0}]
[11,"Intervenor costs",{"$f":"32172/4","v":8043},{"$f":"H25","v":0},{"$f":"J25","v":9000}]
[null,"Total",{"$f":"SUM(C40:C44)","v":27315.5},null,{"$f":"SUM(E40:E44)","v":50000}]

{"sheet":"App.2-N_Corp_Cost_Allocation","index":23,"n_rows":69,"n_cols":7,"rows_kept":69,"cut":false,"hidden":false,"merged":[[37,4,38,4],[37,5,38,5],[38,0,39,0],[38,1,39,1],[45,0,45,1],[45,2,47,2],[45,3,47,3],[45,4,46,4],[45,5,46,5],[46,0,47,0],[46,1,47,1],[30,0,31,0],[30,1,31,1],[37,0,37,1],[37,2,39,2],[37,3,39,3],[13,6,14,6],[55,0,55,1],[55,2,57,2],[55,3,57,3],[55,5,56,5],[55,4,56,4],[56,0,57,0],[56,1,57,1],[53,0,53,5],[21,0,21,1],[21,2,23,2],[21,3,23,3],[21,4,22,4],[21,5,22,5],[22,0,23,0],[22,1,23,1],[11,0,11,5],[8,0,8,5],[9,0,9,5],[68,1,69,5],[14,0,15,0],[14,1,15,1],[13,2,15,2],[13,3,15,3],[13,0,13,1],[13,4,14,4],[13,5,14,5],[29,0,29,1],[29,2,31,2],[29,3,31,3],[29,4,30,4],[29,5,30,5]]}
[null,null,null,null,null,"File Number:",{"$f":"'LDC Info'!$E$18","v":"EB-2012-0139"}]
[null,null,null,null,null,"Exhibit:"]
[null,null,null,null,null,"Tab:"]
[null,null,null,null,null,"Schedule:"]
[null,null,null,null,null,"Page:"]
[]
[null,null,null,null,null,"Date:","2012-08-31"]
[]
["Appendix 2-N"]
["Shared Services and Corporate Cost Allocation"]
[]
["Shared Services"]
[null,"Year:",2009]
["Name of Company",null,"Service Offered","Pricing Methdology","Price for the Service","Cost for the Service"]
["From","To"]
[null,null,null,null,"$","$"]
["Innisfil Hydro","Innisfil Energy Services Ltd","Accounting & CSR","Cost plus ",29091,15630,{"$f":"1-F17/E17","v":0.46272042899865939}]
[]
[]
[]
[null,"Year:",2010]
["Name of Company",null,"Service Offered","Pricing Methdology","Price for the Service","Cost for the Service"]
["From","To"]
[null,null,null,null,"$","$"]
["Innisfil Hydro","Innisfil Energy Services Ltd","Accounting & CSR","Cost plus ",{"$f":"F25/0.53","v":5449.0566037735844},2888,{"$f":"1-F25/E25","v":0.47}]
[]
[]
[]
[null,"Year:",2011]
["Name of Company",null,"Service Offered","Pricing Methdology","Price for the Service","Cost for the Service"]
["From","To"]
[null,null,null,null,"$","$"]
["Innisfil Hydro","Innisfil Energy Services Ltd","Accounting & CSR","Cost plus ",7575,3965,{"$f":"1-F33/E33","v":0.47656765676567658}]
[]
[]
[]
[null,"Year:",2012]
["Name of Company",null,"Service Offered","Pricing Methdology","Price for the Service","Cost for the Service"]
["From","To"]
[null,null,null,null,"$","$"]
["Innisfil Hydro","Innisfil Energy Services Ltd","Accounting & CSR","Cost plus ",6700,3400,{"$f":"1-F41/E41","v":0.4925373134328358}]
[]
[]
[]
[null,"Year:",2013]
["Name of Company",null,"Service Offered","Pricing Methdology","Price for the Service","Cost for the Service"]
["From","To"]
[null,null,null,null,"$","$"]
["Innisfil Hydro","Innisfil Energy Services Ltd","Accounting & CSR","Cost plus ",6800,3400,{"$f":"1-F49/E49","v":0.5}]
[]
[]
[]
[]
["Corporate Cost Allocation - N/A"]
[]
["Name of Company",null,"Service Offered","Pricing Methdology","% of Corporate Costs Allocated","Amount Allocated"]
["From","To"]
[null,null,null,null,"%","$"]
["eg: parent company","eg: regulated entity"]
[]
[]
[]
[]
[]
[]
[]
[]
["Note: "]
[1,"This appendix must be completed in relation to each service provided or received for the Historical (actuals), Bridge and Test years."]

{"sheet":"App.2-OA Capital Structure","index":24,"n_rows":124,"n_cols":15,"rows_kept":124,"cut":false,"hidden":false,"merged":[[96,10,96,11],[103,0,104,0],[104,4,104,8],[50,4,50,8],[52,2,52,14],[60,10,60,11],[68,4,68,8],[70,2,70,14],[129,2,129,14],[12,0,12,14],[123,2,123,14],[124,2,124,14],[125,2,125,14],[126,2,126,14],[127,2,127,14],[128,2,128,14],[122,0,122,14],[78,10,78,11],[85,0,86,0],[86,4,86,8],[88,2,88,14],[106,2,106,14],[114,10,114,11],[67,0,68,0],[42,10,42,11],[49,0,50,0],[9,2,9,14],[10,2,10,14],[31,0,32,0],[32,4,32,8],[34,2,34,14],[14,0,15,0],[15,4,15,8],[24,10,24,11],[16,2,16,14]]}
[null,null,null,null,null,null,null,null,null,null,"File Number:",null,null,null,{"$f":"'LDC Info'!$E$18","v":"EB-2012-0139"}]
[null,null,null,null,null,null,null,null,null,null,"Exhibit:",null,null,null,5]
[null,null,null,null,null,null,null,null,null,null,"Tab:",null,null,null,1]
[null,null,null,null,null,null,null,null,null,null,"Schedule:",null,null,null,2]
[null,null,null,null,null,null,null,null,null,null,"Page:"]
[]
[null,null,null,null,null,null,null,null,null,null,"Date:",null,null,null,"2012-08-31"]
[]
[]
[null,null,"Appendix 2-OA"]
[null,null,"Capital Structure and Cost of Capital"]
[]
["This table must be completed for the required years of all historical years, the bridge year and the test year."]
[]
["Line No."]
[null,null,"Particulars",null,"Capitalization Ratio",null,null,null,null,null,"Cost Rate",null,null,null,"Return"]
[null,null,"2009 Board Approved"]
[null,null,null,null,"(%)",null,null,null,"($)",null,"(%)",null,null,null,"($)"]
[null,null,"Debt"]
[1,null,"  Long-term Debt",null,0.52669999999999995,null,null,null,{"$f":"$I$29*E20","v":12045623.732999999},null,7.283773502052529E-2,null,null,null,{"$f":"K20*I20","v":877375.94962120464}]
[2,null,"  Short-term Debt",null,0.04,null,"(1)",null,{"$f":"$I$29*E21","v":914799.6},null,1.3299999999999999E-2,null,null,null,{"$f":"K21*I21","v":12166.83468}]
[3,null,"Total Debt",null,{"$f":"SUM(E20:E21)","v":0.56669999999999998},null,null,null,{"$f":"SUM(I20:I21)","v":12960423.332999999},null,{"$f":"IF(E22=0,0,SUMPRODUCT(E20:E21,K20:K21)/E22)","v":6.8635318572985118E-2},null,null,null,{"$f":"SUM(O20:O21)","v":889542.78430120461}]
[]
[null,null,"Equity"]
[4,null,"  Common Equity",null,0.43330000000000002,null,null,null,{"$f":"$I$29*E25","v":9909566.6670000013},null,8.0100000000000005E-2,null,null,null,{"$f":"K25*I25","v":793756.29002670012}]
[5,null,"  Preferred Shares",null,null,null,null,null,{"$f":"$I$29*E26","v":0},null,null,null,null,null,{"$f":"K26*I26","v":0}]
[6,null,"Total Equity",null,{"$f":"SUM(E25:E26)","v":0.43330000000000002},null,null,null,{"$f":"SUM(I25:I26)","v":9909566.6670000013},null,{"$f":"IF(E27=0,0,SUMPRODUCT(E25:E26,K25:K26)/E27)","v":8.0100000000000005E-2},null,null,null,{"$f":"SUM(O25:O26)","v":793756.29002670012}]
[]
[7,null,"Total",null,1,null,null,null,22869990,null,{"$f":"(K22*E22)+(K27*E27)","v":7.3602965035310663E-2},null,null,null,{"$f":"O22+O27","v":1683299.0743279047}]
[]
[]
["Line No."]
[null,null,"Particulars",null,"Capitalization Ratio",null,null,null,null,null,"Cost Rate",null,null,null,"Return"]
[]
[null,null,"2009"]
[null,null,null,null,"(%)",null,null,null,"($)",null,"(%)",null,null,null,"($)"]
[null,null,"Debt"]
[1,null,"  Long-term Debt",null,0.52669999999999995,null,null,null,{"$f":"$I$47*E38","v":11574236.186899999},null,7.205727355071348E-2,null,null,null,{"$f":"K38*I38","v":834007.90306002018}]
[2,null,"  Short-term Debt",null,0.04,null,"(1)",null,{"$f":"$I$47*E39","v":879000.28},null,1.3299999999999999E-2,null,null,null,{"$f":"K39*I39","v":11690.703723999999}]
[3,null,"Total Debt",null,{"$f":"SUM(E38:E39)","v":0.56669999999999998},null,null,null,{"$f":"SUM(I38:I39)","v":12453236.466899998},null,{"$f":"IF(E40=0,0,SUMPRODUCT(E38:E39,K38:K39)/E40)","v":6.7909945260562529E-2},null,null,null,{"$f":"SUM(O38:O39)","v":845698.6067840202}]
[]
[null,null,"Equity"]
[4,null,"  Common Equity",null,0.43330000000000002,null,null,null,{"$f":"$I$47*E43","v":9521770.5330999997},null,8.0100000000000005E-2,null,null,null,{"$f":"K43*I43","v":762693.81970131001}]
[5,null,"  Preferred Shares",null,null,null,null,null,{"$f":"$I$47*E44","v":0},null,null,null,null,null,{"$f":"K44*I44","v":0}]
[6,null,"Total Equity",null,{"$f":"SUM(E43:E44)","v":0.43330000000000002},null,null,null,{"$f":"SUM(I43:I44)","v":9521770.5330999997},null,{"$f":"IF(E45=0,0,SUMPRODUCT(E43:E44,K43:K44)/E45)","v":8.0100000000000005E-2},null,null,null,{"$f":"SUM(O43:O44)","v":762693.81970131001}]
[]
[7,null,"Total",null,1,null,null,null,21975007,null,{"$f":"(K40*E40)+(K45*E45)","v":7.3191895979160787E-2},null,null,null,{"$f":"O40+O45","v":1608392.4264853303}]
[]
[]
["Line No."]
[null,null,"Particulars",null,"Capitalization Ratio",null,null,null,null,null,"Cost Rate",null,null,null,"Return"]
[]
[null,null,"2010"]
[null,null,null,null,"(%)",null,null,null,"($)",null,"(%)",null,null,null,"($)"]
[null,null,"Debt"]
[1,null,"  Long-term Debt",null,0.56000000000000005,null,null,null,{"$f":"$I$65*E56","v":13890430.960000001},null,5.4787227271735024E-2,null,null,null,{"$f":"K56*I56","v":761018.19790786458}]
[2,null,"  Short-term Debt",null,0.04,null,"(1)",null,{"$f":"$I$65*E57","v":992173.64},null,1.3299999999999999E-2,null,null,null,{"$f":"K57*I57","v":13195.909411999999}]
[3,null,"Total Debt",null,{"$f":"SUM(E56:E57)","v":0.60000000000000009},null,null,null,{"$f":"SUM(I56:I57)","v":14882604.600000001},null,{"$f":"IF(E58=0,0,SUMPRODUCT(E56:E57,K56:K57)/E58)","v":5.202141212028602E-2},null,null,null,{"$f":"SUM(O56:O57)","v":774214.10731986456}]
[]
[null,null,"Equity"]
[4,null,"  Common Equity",null,0.4,null,null,null,{"$f":"$I$65*E61","v":9921736.4000000004},null,8.0100000000000005E-2,null,null,null,{"$f":"K61*I61","v":794731.08564000006}]
[5,null,"  Preferred Shares",null,null,null,null,null,{"$f":"$I$65*E62","v":0},null,null,null,null,null,{"$f":"K62*I62","v":0}]
[6,null,"Total Equity",null,{"$f":"SUM(E61:E62)","v":0.4},null,null,null,{"$f":"SUM(I61:I62)","v":9921736.4000000004},null,{"$f":"IF(E63=0,0,SUMPRODUCT(E61:E62,K61:K62)/E63)","v":8.0100000000000005E-2},null,null,null,{"$f":"SUM(O61:O62)","v":794731.08564000006}]
[]
[7,null,"Total",null,1,null,null,null,24804341,null,{"$f":"(K58*E58)+(K63*E63)","v":6.325284727217162E-2},null,null,null,{"$f":"O58+O63","v":1568945.1929598646}]
[]
[]
["Line No."]
[null,null,"Particulars",null,"Capitalization Ratio",null,null,null,null,null,"Cost Rate",null,null,null,"Return"]
[]
[null,null,"2011"]
[null,null,null,null,"(%)",null,null,null,"($)",null,"(%)",null,null,null,"($)"]
[null,null,"Debt"]
[1,null,"  Long-term Debt",null,0.56000000000000005,null,null,null,{"$f":"$I$83*E74","v":15272322.800000001},null,5.1782972125053277E-2,null,null,null,{"$f":"K74*I74","v":790846.2658372157}]
[2,null,"  Short-term Debt",null,0.04,null,"(1)",null,1090880.2,null,1.3299999999999999E-2,null,null,null,{"$f":"K75*I75","v":14508.706659999998}]
[3,null,"Total Debt",null,{"$f":"SUM(E74:E75)","v":0.60000000000000009},null,null,null,{"$f":"SUM(I74:I75)","v":16363203},null,{"$f":"IF(E76=0,0,SUMPRODUCT(E74:E75,K74:K75)/E76)","v":4.9217440650049724E-2},null,null,null,{"$f":"SUM(O74:O75)","v":805354.97249721573}]
[]
[null,null,"Equity"]
[4,null,"  Common Equity",null,0.4,null,null,null,{"$f":"$I$83*E79","v":10908802},null,8.0100000000000005E-2,null,null,null,{"$f":"K79*I79","v":873795.04020000005}]
[5,null,"  Preferred Shares",null,null,null,null,null,{"$f":"$I$83*E80","v":0},null,null,null,null,null,{"$f":"K80*I80","v":0}]
[6,null,"Total Equity",null,{"$f":"SUM(E79:E80)","v":0.4},null,null,null,{"$f":"SUM(I79:I80)","v":10908802},null,{"$f":"IF(E81=0,0,SUMPRODUCT(E79:E80,K79:K80)/E81)","v":8.0100000000000005E-2},null,null,null,{"$f":"SUM(O79:O80)","v":873795.04020000005}]
[]
[7,null,"Total",null,1,null,null,null,27272005,null,{"$f":"(K76*E76)+(K81*E81)","v":6.1570464390029847E-2},null,null,null,{"$f":"O76+O81","v":1679150.0126972157}]
[]
[]
["Line No."]
[null,null,"Particulars",null,"Capitalization Ratio",null,null,null,null,null,"Cost Rate",null,null,null,"Return"]
[]
[null,null,"2012 Bridge"]
[null,null,null,null,"(%)",null,null,null,"($)",null,"(%)",null,null,null,"($)"]
[null,null,"Debt"]
[1,null,"  Long-term Debt",null,0.56000000000000005,null,null,null,{"$f":"$I$101*E92","v":17767758.960000001},null,5.225936201206674E-2,null,null,null,{"$f":"K92*I92","v":928531.74763378245}]
[2,null,"  Short-term Debt",null,0.04,null,"(1)",null,1269125.6400000001,null,1.3299999999999999E-2,null,null,null,{"$f":"K93*I93","v":16879.371012}]
[3,null,"Total Debt",null,{"$f":"SUM(E92:E93)","v":0.60000000000000009},null,null,null,{"$f":"SUM(I92:I93)","v":19036884.600000001},null,{"$f":"IF(E94=0,0,SUMPRODUCT(E92:E93,K92:K93)/E94)","v":4.9662071211262288E-2},null,null,null,{"$f":"SUM(O92:O93)","v":945411.11864578247}]
[]
[null,null,"Equity"]
[4,null,"  Common Equity",null,0.4,null,null,null,{"$f":"$I$101*E97","v":12691256.4},null,8.0100000000000005E-2,null,null,null,{"$f":"K97*I97","v":1016569.6376400001}]
[5,null,"  Preferred Shares",null,null,null,null,null,{"$f":"$I$101*E98","v":0},null,null,null,null,null,{"$f":"K98*I98","v":0}]
[6,null,"Total Equity",null,{"$f":"SUM(E97:E98)","v":0.4},null,null,null,{"$f":"SUM(I97:I98)","v":12691256.4},null,{"$f":"IF(E99=0,0,SUMPRODUCT(E97:E98,K97:K98)/E99)","v":8.0100000000000005E-2},null,null,null,{"$f":"SUM(O97:O98)","v":1016569.6376400001}]
[]
[7,null,"Total",null,1,null,null,null,31728141,null,{"$f":"(K94*E94)+(K99*E99)","v":6.1837242726757384E-2},null,null,null,{"$f":"O94+O99","v":1961980.7562857824}]
[]
[]
["Line No."]
[null,null,"Particulars",null,"Capitalization Ratio",null,null,null,null,null,"Cost Rate",null,null,null,"Return"]
[]
[null,null,"2013 Test"]
[null,null,null,null,"(%)",null,null,null,"($)",null,"(%)",null,null,null,"($)"]
[null,null,"Debt"]
[1,null,"  Long-term Debt",null,0.56000000000000005,null,null,null,{"$f":"$I$119*E110","v":21286134.240000002},null,5.1121969485464276E-2,null,null,null,{"$f":"K110*I110","v":1088189.1050807764}]
[2,null,"  Short-term Debt",null,0.04,null,"(1)",null,1520438.16,null,2.0799999999999999E-2,null,null,null,{"$f":"K111*I111","v":31625.113727999997}]
[3,null,"Total Debt",null,{"$f":"SUM(E110:E111)","v":0.60000000000000009},null,null,null,{"$f":"SUM(I110:I111)","v":22806572.400000002},null,{"$f":"IF(E112=0,0,SUMPRODUCT(E110:E111,K110:K111)/E112)","v":4.910050485309999E-2},null,null,null,{"$f":"SUM(O110:O111)","v":1119814.2188087765}]
[]
[null,null,"Equity"]
[4,null,"  Common Equity",null,0.4,null,null,null,{"$f":"$I$119*E115","v":15204381.600000001},null,9.1200000000000003E-2,null,null,null,{"$f":"K115*I115","v":1386639.6019200003}]
[5,null,"  Preferred Shares",null,null,null,null,null,{"$f":"$I$119*E116","v":0},null,null,null,null,null,{"$f":"K116*I116","v":0}]
[6,null,"Total Equity",null,{"$f":"SUM(E115:E116)","v":0.4},null,null,null,{"$f":"SUM(I115:I116)","v":15204381.600000001},null,{"$f":"IF(E117=0,0,SUMPRODUCT(E115:E116,K115:K116)/E117)","v":9.1200000000000003E-2},null,null,null,{"$f":"SUM(O115:O116)","v":1386639.6019200003}]
[]
[7,null,"Total",null,1,null,null,null,38010954,null,{"$f":"(K112*E112)+(K117*E117)","v":6.594030291186001E-2},null,null,null,{"$f":"O112+O117","v":2506453.820728777}]
[]
[]
[]
["Notes"]
["(1)",null,"4.0% unless an applicant has proposed or been approved for a different amount."]

{"sheet":"App.2-OB_Debt Instruments","index":25,"n_rows":114,"n_cols":11,"rows_kept":114,"cut":false,"hidden":false,"merged":[[9,0,9,10],[10,0,10,10],[10,11,10,14],[12,0,12,10]]}
[null,null,null,null,null,null,null,null,null,"File Number:",{"$f":"'LDC Info'!$E$18","v":"EB-2012-0139"}]
[null,null,null,null,null,null,null,null,null,"Exhibit:",5]
[null,null,null,null,null,null,null,null,null,"Tab:",1]
[null,null,null,null,null,null,null,null,null,"Schedule:",2]
[null,null,null,null,null,null,null,null,null,"Page:"]
[]
[null,null,null,null,null,null,null,null,null,"Date:","2012-08-31"]
[]
[]
["Appendix 2-OB"]
["Debt Instruments"]
[]
["This table must be completed for the required years of all historical years, the bridge year and the test year."]
[null,null,null,"Year",2009]
[]
["Row","Description","Lender","Affiliated or Third-Party Debt?","Fixed or Variable-Rate?","Start Date","Term              (years)","Principal                         ($)","Rate (%)                     (Note 2)","Interest ($)       (Note 1)"]
[1,"Notes Payable","Town of Innsfil","Affiliated","Variable Rate","2007-12-31",3,2107444,1.1299999999999999E-2,{"$f":"H17*I17","v":23814.117199999997}]
[2,"Debentures","Town of Innsfil","Third-Party","Fixed Rate","1995-04-01",20,5032000,9.7500000000000003E-2,{"$f":"H18*I18","v":490620}]
[3,null,null,null,null,null,null,null,null,0]
[4,null,null,null,null,null,null,null,null,0]
[5,null,null,null,null,null,null,null,null,0]
[6,null,null,null,null,null,null,null,null,0]
[7,null,null,null,null,null,null,null,null,0]
[8,null,null,null,null,null,null,null,null,0]
[9,null,null,null,null,null,null,null,null,0]
[10,null,null,null,null,null,null,null,null,0]
[11,null,null,null,null,null,null,null,null,0]
[12,null,null,null,null,null,null,null,null,0]
[]
["Total",null,null,null,null,null,null,{"$f":"SUM(H17:H28)","v":7139444},{"$f":"IF(H30=0,\"\",J30/H30)","v":7.205520726824105E-2},{"$f":"SUM(J17:J28)","v":514434.11719999998}]
[]
[]
[null,null,null,"Year",null,2010]
[]
["Row","Description","Lender","Affiliated or Third-Party Debt?","Fixed or Variable-Rate?","Start Date","Term              (years)","Principal                         ($)","Rate (%)                     (Note 2)","Interest ($)       (Note 1)"]
[1,"Bank Loan","Toronto Dominion Bank","Third-Party","Fixed Rate","2010-10-29",20,2096644,4.53E-2,28420.009419999998]
[2,"Debentures","Town of Innsfil","Third-Party","Fixed Rate","1995-04-01",20,4382000,9.7500000000000003E-2,{"$f":"H37*I37","v":427245}]
[3,"Construction Loan","Infrastructure Ontario","Third-Party","Variable Rate","2010-04-15","Demand",2500000,1.4500000000000001E-2,36250]
[4,null,null,null,null,null,null,null,null,0]
[5,null,null,null,null,null,null,null,null,0]
[6,null,null,null,null,null,null,null,null,0]
[7,null,null,null,null,null,null,null,null,0]
[8,null,null,null,null,null,null,null,null,0]
[9,null,null,null,null,null,null,null,null,0]
[10,null,null,null,null,null,null,null,null,0]
[11,null,null,null,null,null,null,null,null,0]
[12,null,null,null,null,null,null,null,null,0]
[]
["Total",null,null,null,null,null,null,{"$f":"SUM(H36:H47)","v":8978644},{"$f":"IF(H49=0,\"\",J49/H49)","v":5.4787227271735024E-2},{"$f":"SUM(J36:J47)","v":491915.00942000002}]
[]
[]
[null,null,null,"Year",null,2011]
[]
["Row","Description","Lender","Affiliated or Third-Party Debt?","Fixed or Variable-Rate?","Start Date","Term              (years)","Principal                         ($)","Rate (%)                     (Note 2)","Interest ($)       (Note 1)"]
[1,"Bank Loan","Toronto Dominion Bank","Third-Party","Fixed Rate","2010-10-29",20,2029826,4.53E-2,{"$f":"H55*I55","v":91951.117799999993}]
[2,"Debentures","Town of Innsfil","Third-Party","Fixed Rate","1995-04-01",20,3666000,9.7500000000000003E-2,{"$f":"H56*I56","v":357435}]
[3,"Debentures","Infrastructure Ontario","Third-Party","Fixed Rate","2011-08-15",15,2500000,3.9100000000000003E-2,97750]
[4,"Demand Load","Toronto Dominion Bank","Third-Party","Variable Rate","2011-01-01","Demand",4000000,2.1100000000000001E-2,84400]
[5,null,null,null,null,null,null,null,null,0]
[6,null,null,null,null,null,null,null,null,0]
[7,null,null,null,null,null,null,null,null,0]
[8,null,null,null,null,null,null,null,null,0]
[9,null,null,null,null,null,null,null,null,0]
[10,null,null,null,null,null,null,null,null,0]
[11,null,null,null,null,null,null,null,null,0]
[12,null,null,null,null,null,null,null,null,0]
[]
["Total",null,null,null,null,null,null,{"$f":"SUM(H55:H66)","v":12195826},{"$f":"IF(H68=0,\"\",J68/H68)","v":5.1782972125053277E-2},{"$f":"SUM(J55:J66)","v":631536.11780000001}]
[]
[]
[null,null,null,"Year",2012]
[]
["Row","Description","Lender","Affiliated or Third-Party Debt?","Fixed or Variable-Rate?","Start Date","Term              (years)","Principal                         ($)","Rate (%)                     (Note 2)","Interest ($)       (Note 1)"]
[1,"Bank Loan","Toronto Dominion Bank","Third-Party","Fixed Rate","2010-10-29",20,1960178,4.53E-2,{"$f":"H74*I74","v":88796.063399999999}]
[2,"Debentures","Town of Innsfil","Third-Party","Fixed Rate","1995-04-01",20,2876000,9.7500000000000003E-2,{"$f":"H75*I75","v":280410}]
[3,"Debentures","Infrastructure Ontario","Third-Party","Fixed Rate","2011-08-15",15,2333333,3.9100000000000003E-2,91233.320300000007]
[4,"Commercial Loan","Toronto Dominion Bank","Third-Party","Fixed Rate","2012-03-14",24,3909391,4.0500000000000001E-2,158330.33550000002]
[5,"Demand Loan","Toronto Dominion Bank","Third-Party","Variable Rate","2012-01-01","Demand",5481662,4.4999999999999998E-2,246674.78999999998]
[6,null,null,null,null,null,null,null,null,0]
[7,null,null,null,null,null,null,null,null,0]
[8,null,null,null,null,null,null,null,null,0]
[9,null,null,null,null,null,null,null,null,0]
[10,null,null,null,null,null,null,null,null,0]
[11,null,null,null,null,null,null,null,null,0]
[12,null,null,null,null,null,null,null,null,0]
[]
["Total",null,null,null,null,null,null,{"$f":"SUM(H74:H85)","v":16560564},{"$f":"IF(H87=0,\"\",J87/H87)","v":5.225936201206674E-2},{"$f":"SUM(J74:J85)","v":865444.50919999997}]
[]
[]
[null,null,null,"Year",2013]
[]
["Row","Description","Lender","Affiliated or Third-Party Debt?","Fixed or Variable-Rate?","Start Date","Term              (years)","Principal                         ($)","Rate (%)                     (Note 2)","Interest ($)       (Note 1)"]
[1,"Bank Loan","Toronto Dominion Bank","Third-Party","Fixed Rate","2010-10-29",20,1887048,4.53E-2,{"$f":"H93*I93","v":85483.274399999995}]
[2,"Debentures","Town of Innsfil","Third-Party","Fixed Rate","1995-04-01",20,2005000,9.7500000000000003E-2,{"$f":"H94*I94","v":195487.5}]
[3,"Debentures","Infrastructure Ontario","Third-Party","Fixed Rate","2011-08-15",15,2166667,3.9100000000000003E-2,84716.679700000008]
[4,"Commercial Loan","Toronto Dominion Bank","Third-Party","Fixed Rate","2012-03-14",24,3805466,4.0500000000000001E-2,154121.37299999999]
[5,"Demand","Toronto Dominion Bank","Third-Party","Variable Rate","2012-01-01","Demand",13843930,0.05,692196.5]
[6,null,null,null,null,null,null,null,null,0]
[7,null,null,null,null,null,null,null,null,0]
[8,null,null,null,null,null,null,null,null,0]
[9,null,null,null,null,null,null,null,null,0]
[10,null,null,null,null,null,null,null,null,0]
[11,null,null,null,null,null,null,null,null,0]
[12,null,null,null,null,null,null,null,null,0]
[]
["Total",null,null,null,null,null,null,{"$f":"SUM(H93:H104)","v":23708111},{"$f":"IF(H106=0,\"\",J106/H106)","v":5.1121969485464276E-2},{"$f":"SUM(J93:J104)","v":1212005.3270999999}]
[]
[]
[]
["Notes"]
[]
[1,"If financing is in place only part of the year, calculate the pro-rated interest and input in the cell."]
[2,"Input actual or deemed long-term debt rate in accordance with the guidelines in The Report of the Board on the Cost of Capital for Ontario's Regulated Utilities, issued December 11, 2009"]
[3,"Add more lines above row 12 if necessary."]

{"sheet":"App.2-P_Cost_Allocation","index":26,"n_rows":119,"n_cols":6,"rows_kept":119,"cut":false,"hidden":false,"merged":[[88,5,89,5],[91,0,91,1],[97,0,97,1],[105,0,107,5],[94,0,94,1],[95,0,95,1],[96,0,96,1],[100,0,103,5],[71,0,71,1],[72,0,72,1],[93,0,93,1],[88,0,90,1],[88,2,88,4],[73,0,73,1],[50,0,50,1],[57,0,57,5],[76,0,76,1],[59,0,60,5],[92,0,92,1],[62,0,63,5],[81,0,82,5],[84,0,84,5],[77,0,77,1],[74,0,74,1],[75,0,75,1],[67,0,69,1],[67,5,69,5],[68,3,69,3],[68,4,69,4],[70,0,70,1],[38,1,38,5],[40,0,40,1],[41,3,42,3],[41,4,42,4],[41,5,42,5],[47,0,47,1],[41,0,42,1],[41,2,42,2],[44,0,44,1],[45,0,45,1],[43,0,43,1],[8,0,8,5],[9,0,9,5],[117,0,117,1],[110,4,111,4],[110,0,112,1],[113,0,113,1],[114,0,114,1],[115,0,115,1],[116,0,116,1],[54,0,55,5],[48,0,48,1],[49,0,49,1],[27,0,28,4],[30,0,32,4],[34,0,35,4],[46,0,46,1]]}
[null,null,null,null,"File Number:",{"$f":"'LDC Info'!$E$18","v":"EB-2012-0139"}]
[null,null,null,null,"Exhibit:",7]
[null,null,null,null,"Tab:"]
[null,null,null,null,"Schedule:",1]
[null,null,null,null,"Page:",7]
[]
[null,null,null,null,"Date:","Sep. 10, 2012"]
[]
["Appendix 2-P"]
["Cost Allocation"]
[]
["Please complete the following four tables."]
[]
["A)  Allocated Costs"]
[]
["Classes","Costs Allocated from Previous Study","%","Costs Allocated in Test Year Study                    (Column 7A)","%"]
["Residential",6458733.54,{"$f":"IF(B$24=0,\"\",B17/B$24)","v":0.78366608220730627},{"$f":"'[3]O1 Revenue to cost|RR'!$D$40","v":7902556.9287966024},{"$f":"IF(D$24=0,\"\",D17/D$24)","v":0.83894512667725651}]
["GS < 50 kW",600098.18999999994,7.2812509539911391E-2,{"$f":"'[3]O1 Revenue to cost|RR'!$E$40","v":550328.25651295355},5.842352203651132E-2]
["GS > 50 kW-4,999 kW",524422.06999999995,6.3630398509975636E-2,{"$f":"'[3]O1 Revenue to cost|RR'!$F$40","v":442688.39635868382},4.6996342589871454E-2]
["Street Lighting",539062.01,6.5406725765543156E-2,{"$f":"'[3]O1 Revenue to cost|RR'!$J$40","v":464772.80374440452},4.9340850338280291E-2]
["Sentinel Lighting",43871.69,5.3231419455823312E-3,{"$f":"'[3]O1 Revenue to cost|RR'!$K$40","v":41367.055288420277},4.3915772770641258E-3]
["Unmetered Scattered Load (USL)",75503.3,9.1611420316811687E-3,{"$f":"'[3]O1 Revenue to cost|RR'!$L$40","v":17921.619455532411},1.9025810810163672E-3]
["Embedded distributor class",null,0,null,0]
["Total",{"$f":"SUM(B17:B23)","v":8241690.8000000007},{"$f":"SUM(C17:C23)","v":1},{"$f":"SUM(D17:D23)","v":9419635.0601565968},{"$f":"SUM(E17:E23)","v":1}]
[]
["Notes"]
[]
["1     Customer Classification - If proposed rate classes differ from those in place in the previous Cost Allocation study, modify the rate classes to match the current application as closely as possible."]
[]
[]
["2     Host Distributors -  Provide information on embedded distributor(s) as a separate class, if applicable.   If embedded distributor(s) are billed as customers in a General Service class, include the allocated cost and revenue of the embedded distributor(s) in the applicable class.  Also complete Appendix 2-Q."]
[]
[]
["  "]
["3     Class Revenue Requirements - If using the Board-issued model, in column 7A enter the results from Worksheet O-1, Revenue Requirement (row 40 in the 2013 model).  This excludes costs in deferral and variance accounts.  Note to Embedded Distributor(s), it also does not include Account 4750 - Low Voltage (LV) Costs. "]
[]
[]
[]
["B)  Calculated Class Revenues"]
[]
[null,null,"Column 7B","Column 7C","Column 7D","Column 7E"]
["Classes (same as previous table)",null,"Load Forecast (LF) X current approved rates","L.F. X current approved rates X (1 + d)","LF X proposed rates","Miscellaneous Revenue"]
[]
[{"$f":"A17","v":"Residential"},null,{"$f":"'[3]O1 Revenue to cost|RR'!$D$18","v":6344681.8083782922},{"$f":"'[3]O1 Revenue to cost|RR'!$D$23","v":6941360.9788685152},{"$f":"'[4]Cost Allocation Study-RD6'!$K$5","v":7234972.7253284343},{"$f":"'[4]Cost Allocation Study-RD6'!$D$5","v":477568.01237094664}]
["GS < 50 kW",null,{"$f":"'[3]O1 Revenue to cost|RR'!$E$18","v":654386.66263399809},{"$f":"'[3]O1 Revenue to cost|RR'!$E$23","v":715927.79311665054},{"$f":"'[4]Cost Allocation Study-RD6'!$K$6","v":629480.61379112967},{"$f":"'[4]Cost Allocation Study-RD6'!$D$6","v":30913.294024414648}]
["GS > 50 kW-4,999 kW",null,{"$f":"'[3]O1 Revenue to cost|RR'!$F$18","v":673571.01863016479},{"$f":"'[3]O1 Revenue to cost|RR'!$F$23","v":736916.32242960448},{"$f":"'[4]Cost Allocation Study-RD6'!$K$7","v":518208.03401811532},{"$f":"'[4]Cost Allocation Study-RD6'!$D$7","v":13018.041612305278}]
["Street Lighting",null,{"$f":"'[3]O1 Revenue to cost|RR'!$J$18","v":351024.37888185715},{"$f":"'[3]O1 Revenue to cost|RR'!$J$23","v":384036.11083924078},{"$f":"'[4]Cost Allocation Study-RD6'!$K$11","v":422247.44078318728},{"$f":"'[4]Cost Allocation Study-RD6'!$D$11","v":31349.94737246339}]
["Sentinel Lighting",null,{"$f":"'[3]O1 Revenue to cost|RR'!$K$18","v":31826.320588950752},{"$f":"'[3]O1 Revenue to cost|RR'!$K$23","v":34819.39465354674},{"$f":"'[4]Cost Allocation Study-RD6'!$K$10","v":37807.222242406053},{"$f":"'[4]Cost Allocation Study-RD6'!$D$10","v":2565.1663383096911}]
["Unmetered Scattered Load (USL)",null,{"$f":"'[3]O1 Revenue to cost|RR'!$L$18","v":45360.571293556728},{"$f":"'[3]O1 Revenue to cost|RR'!$L$23","v":49626.460249037707},{"$f":"'[4]Cost Allocation Study-RD6'!$K$12","v":19972.405065078539},{"$f":"'[4]Cost Allocation Study-RD6'!$D$12","v":1533.5382815603518}]
["Embedded distributor class"]
["Total",null,{"$f":"SUM(C44:C50)","v":8100850.7604068201},{"$f":"SUM(D44:D50)","v":8862687.0601565968},{"$f":"SUM(E44:E50)","v":8862688.4412283506},{"$f":"SUM(F44:F50)","v":556948}]
[]
["Notes:",null,null,null," "]
[]
["1     Columns 7B to 7D - LF means Load Forecast of Annual Billing Quantities (i.e. customers or connections X 12, (kWh or kW, as applicable).  Revenue Quantities should be net of Transfomrer Ownership Allowance.  Exclude revenue from rate adders and rate riders.  "]
[]
[]
["2     Columns 7C and 7D - Column total in each column should equal the Base Revenue Requirement"]
[]
["3     Columns 7C - The Board cost allocation model calculates \"1+d\" in worksheet O-1, cell C21. \"d\" is defined as Revenue Deficiency/ Revenue at Current Rates."]
[]
[]
["4     Columns 7E - If using the Board-issued Cost Allocation model, enter Miscellaneous Revenue as it appears in Worksheet O-1, row 19."]
[]
[]
["C)  Rebalancing Revenue-to-Cost (R/C) Ratios"]
[]
["Class",null,"Previously Approved Ratios","Status Quo Ratios","Proposed Ratios","Policy Range"]
[null,null,"Most Recent Year:","(7C + 7E) / (7A)","(7D + 7E) / (7A)"]
[null,null,"May,1,2009"]
[null,null,"%","%","%","%"]
[{"$f":"A44","v":"Residential"},null,101.2,{"$f":"IF(D17=0,\"\",(D44+F44)/D17*100)","v":93.880108148353614},{"$f":"'[4]Cost Allocation Study-RD6'!$H$5","v":0.97595509999999996},"85 - 115"]
["GS < 50 kW",null,116.2,135.70829378692574,{"$f":"'[4]Cost Allocation Study-RD6'!$H$6","v":1.2},"80 - 120"]
["GS > 50 kW-4,999 kW",null,135.80000000000001,169.40456768473396,{"$f":"'[4]Cost Allocation Study-RD6'!$H$7","v":1.2},"80 - 120"]
["Street Lighting",null,70,89.374002709534636,{"$f":"'[4]Cost Allocation Study-RD6'!$H$11","v":0.97595509999999996},"70 - 120"]
["Sentinel Lighting",null,70,90.372787550873483,{"$f":"'[4]Cost Allocation Study-RD6'!$H$10","v":0.97595509999999996},"80 - 120"]
["Unmetered Scattered Load (USL)",null,80,285.46526533239688,{"$f":"'[4]Cost Allocation Study-RD6'!$H$12","v":1.2},"80 - 120"]
["Embedded distributor class",null,null,"",{"$f":"IF(D23=0,\"\",(E50+F50)/D23*100)","v":""}]
[]
["Notes"]
[]
["1     Previously Approved Revenue-to-Cost Ratios - For most applicants, Most Recent Year would be the third year of the IRM 3 period,  e.g. if the applicant rebased in 2009 with further adjustments over 2 years, the Most recent year is 2011.  For applicants that have had rates adjusted only under IRM 2, the Most Recent Year is 2006, and the applicant should enter the ratios from their Informational Filing."]
[]
[]
["2     Status Quo Ratios - The Board's updated Cost Allocation Model yields the Status Quo Ratios in Worksheet O-1.  Status Quo means \"Before Rebalancing\"."]
[]
["D)  Proposed Revenue-to-Cost Ratios"]
[]
["Class",null,"Proposed Revenue-to-Cost Ratios",null,null,"Policy Range"]
[null,null,2013,2014,2015]
[null,null,"%","%","%","%"]
[{"$f":"A72","v":"Residential"},null,{"$f":"E72","v":0.97595509999999996},null,null,{"$f":"F72","v":"85 - 115"}]
["GS < 50 kW",null,1.2,null,null,{"$f":"F73","v":"80 - 120"}]
["GS > 50 kW-4,999 kW",null,1.2,null,null,{"$f":"F74","v":"80 - 120"}]
["Street Lighting",null,0.97595509999999996,null,null,{"$f":"F75","v":"70 - 120"}]
["Sentinel Lighting",null,0.97595509999999996,null,null,"80 - 120"]
["Unmetered Scattered Load (USL)",null,1.2,null,null,"80 - 120"]
[{"$f":"A78","v":"Embedded distributor class"},null,""]
[]
["Note"]
["1     The applicant should complete Table D if it is applying for approval of a revenue to cost ratio in 2012 that is outside the Board’s policy range for any customer class. Table (d) will show the information that the distributor would likely enter in the IRM model) in 2013.  In 2013 Table (d), enter the planned ratios for the classes that will be ‘Change’ and ‘No Change’ in 2013 (in the current Revenue Cost Ratio Adjustment Workform, Worksheet C1.1 ‘Decision – Cost Revenue Adjustment’, column d), and enter TBD for class(es) that will be entered as ‘Rebalance’. "]
[]
[]
[]
[]
[]
[]
[]
[]
[]
["Class",null,"Status Quo","Proposed ","BOARD PolicyRange"]
[null,null,"Ratios","Ratios"]
[null,null,null,null,"%"]
["Residential",null,0.95709999999999995,0.999,"85-115"]
["GS< 50 kW",null,1.3607,1.2,"80-120"]
["GS > 50 kW - 4,999 kW",null,1.6947000000000001,1.2,"80-120"]
["Street Lighting",null,0.68310000000000004,0.7,"70-120"]
["Sentinel Lighting",null,0.81299999999999994,0.81100000000000005,"80-120"]
["Unmetered Scattered Load",null,2.516,1.2,"80-120"]

{"sheet":"App.2-Q_Cost of Serv. Emb. Dx","index":27,"n_rows":61,"n_cols":7,"rows_kept":61,"cut":false,"hidden":false,"merged":[[9,7,9,11],[12,0,12,6],[11,0,11,6],[14,0,14,1],[14,2,14,3],[59,3,60,3],[59,4,60,4],[54,4,55,4],[8,0,8,6],[9,0,9,6],[16,0,16,1],[16,2,16,3],[54,3,55,3]]}
[null,null,null,null,null,"File Number:",{"$f":"'LDC Info'!$E$18","v":"EB-2012-0139"}]
[null,null,null,null,null,"Exhibit:"]
[null,null,null,null,null,"Tab:"]
[null,null,null,null,null,"Schedule:"]
[null,null,null,null,null,"Page:"]
[]
[null,null,null,null,null,"Date:","2012-08-31"]
[]
["Appendix 2-Q"]
["Cost of Serving Embedded Distributor(s) "]
[]
["To be completed by Host Distributors*"]
["(Not required if Host Distributor has an Embedded Distributor rate class, i.e. a separate row in Appendix 2-P.)"]
[]
[]
[]
["Proposed Rate Class for Billing Embedded Distributor(s)"]
[]
["Host's Distribution Facilities used by Embedded Distributor(s)"]
[]
["(1)","(2)","(3)","(4)","(5)","(6) = '(3) + (4)"]
["Asset Class","Total OM&A costs asociated with asset class ","Original cost of asset class ","Accumulated amortization of asset class","Annual amortization of asset class","Net Book Value of asset class"]
["Totals for Host Distributor:","($)","($)","($)","($)"]
["Distribution Stations",null,null,null,null,{"$f":"C24+D24","v":0}]
["Low Voltage Line",null,null,null,null,0]
["LV Line category # 2 (if applcable)",null,null,null,null,0]
["TS (owned by host)",null,null,null,null,0]
["add rows if necessary... ",null,null,null,null,0]
[null,null,null,null,null,0]
[null,null,null,null,null,0]
[]
["(1)","(7)","(8)","(9)","(10)","(11)"]
[{"$f":"A22","v":"Asset Class"},"Total line length or station capacity in asset class","Line length or capacity required to provide LV service to Embedded Distributor(s)","Annual total demand on station/line providing LV services (sum of 12 monthly peaks)","Annual billed Embedded Distributor demand on station/line providing LV services","Embedded Distributor(s)' Responsibility Share "]
["Embedded Distributor's share:","kW or kVa; km","kW or kVA; km","kW or kVA","kW or kVA","percent"]
["Distribution Stations",null,null,null,null,{"$f":"IF(D35=0,0,(C35/B35)*(E35/D35))","v":0}]
["Low Voltage Line",null,null,null,null,{"$f":"IF(D36=0,0,(C36/B36)*(E36/D36))","v":0}]
["LV Line # 2 (if applicable) ",null,null,null,null,{"$f":"IF(D37=0,0,(C37/B37)*(E37/D37))","v":0}]
["TS (owned by host)",null,null,null,null,{"$f":"IF(D38=0,0,(C38/B38)*(E38/D38))","v":0}]
["add rows if necessary ",null,null,null,null,{"$f":"IF(D39=0,0,(C39/B39)*(E39/D39))","v":0}]
[]
["(1)","(12)","(12a)","(13)","(14)","(15)","(16)"]
[{"$f":"A33","v":"Asset Class"},"Return on Assets used to Provide LV services","Taxes/PILs","Annual amortization on assets used to provide LV services","OM&A costs with burden associated with assets used to provide LV services","Total annual cost associated with assets used to provide LV services","Monthly cost associated with the delivery of LV services"]
[null,"($)","($)","($)","($)","($)","$/kW or $/kVA"]
["Distribution Stations",{"$f":"E$55*(F24+B24*E$60)*F35","v":0},{"$f":"(B44-(B$55*C$55*F35*(F24+B24*E58)+B$56*C$56*F35*(F24+B24*E$58)))*E$58/(1-E$58)","v":0},{"$f":"E24*F35","v":0},{"$f":"B24*F35","v":0},{"$f":"SUM(B44:E44)","v":0},{"$f":"IF(E35=0,0,(D44/E35))","v":0}]
["Low Voltage Line",{"$f":"E$55*(F25+B25*E$60)*F36","v":0},{"$f":"(B45-(B$55*C$55*F36*(F25+B25*E59)+B$56*C$56*F36*(F25+B25*E59)))*E$58/(1-E$58)","v":0},{"$f":"E25*F36","v":0},{"$f":"B25*F36","v":0},{"$f":"SUM(B45:E45)","v":0},{"$f":"IF(E36=0,0,(D45/E36))","v":0}]
["LV Line # 2 (if applicable) ",{"$f":"E$55*(F26+B26*E$60)*F37","v":0},{"$f":"(B46-(B$55*C$55*F37*(F26+B26*E60)+B$56*C$56*F37*(F26+B26*E$60)))*E$58/(1-E$58)","v":0},{"$f":"E26*F37","v":0},{"$f":"B26*F37","v":0},{"$f":"SUM(B46:E46)","v":0},{"$f":"IF(E37=0,0,(D46/E37))","v":0}]
["TS (owned by host)",{"$f":"E$55*(F27+B27*E$60)*F38","v":0},{"$f":"(B47-(B$55*C$55*F38*(F27+B27*E61)+B$56*C$56*F38*(F27+B27*E61)))*E$58/(1-E$58)","v":0},{"$f":"E27*F38","v":0},{"$f":"B27*F38","v":0},{"$f":"SUM(B47:E47)","v":0},{"$f":"IF(E38=0,0,(D47/E38))","v":0}]
["add rows if necessary ",{"$f":"E$55*(F28+B28*E$60)*F39","v":0},{"$f":"(B48-(B$55*C$55*F39*(F28+B28*I62)+B$56*C$56*F39*(F28+B28*I62)))*E$58/(1-E$58)","v":0},{"$f":"E28*F39","v":0},{"$f":"B28*F39","v":0},{"$f":"SUM(B48:E48)","v":0},{"$f":"IF(E39=0,0,(D48/E39))","v":0}]
[]
["Total",null,null,null,null,{"$f":"SUM(F44:F48)","v":0},{"$f":"SUM(G44:G48)","v":0}]
[]
["(17)","(18)","(19)","(20)","(21)"]
[null,"Capital Structure","Cost Rate"]
[null,"(%)","(%)",null,"(%)"]
["Long-Term Debt",null,null,"Weighted Average Cost of Capital",{"$f":"IF(B61=0%,0,SUMPRODUCT(B55:B59,C55:C59)/B61)","v":0}]
["Short-term Debt"]
[]
["Common Equity",null,null,"Tax/PILs Rate"]
["Preferred Shares"]
[null,null,null,"Working Capital Allowance Factor"]
["Total",{"$f":"SUM(B55:B59)","v":0}]

{"sheet":"App.2-R_Loss Factors","index":28,"n_rows":73,"n_cols":9,"rows_kept":73,"cut":false,"hidden":false,"merged":[[57,1,58,7],[60,1,61,7],[32,1,34,7],[71,1,71,7],[63,1,63,7],[65,1,65,7],[67,1,69,6],[52,1,52,7],[15,1,15,7],[24,1,24,7],[26,1,26,7],[54,1,55,7],[36,1,39,7],[43,1,45,7],[47,1,50,7],[8,0,8,7],[9,0,9,7],[11,0,11,7],[13,0,14,1],[13,2,13,6],[13,7,14,7]]}
[null,null,null,null,null,null,"File Number:",{"$f":"'LDC Info'!$E$18","v":"EB-2012-0139"}]
[null,null,null,null,null,null,"Exhibit:",8]
[null,null,null,null,null,null,"Tab:"]
[null,null,null,null,null,null,"Schedule:",1]
[null,null,null,null,null,null,"Page:"]
[]
[null,null,null,null,null,null,"Date:","2012-08-31"]
[]
["Appendix 2-R"]
["Loss Factors"]
[]
[]
[]
[null,null,"Historical Years",null,null,null,null,"5-Year Average"]
[null,null,{"$f":"IF(ISBLANK('LDC Info'!E26-5), \"Year 5\", 'LDC Info'!E26-5)","v":2007},{"$f":"IF(ISBLANK('LDC Info'!E26-4), \"Year 5\", 'LDC Info'!E26-4)","v":2008},{"$f":"IF(ISBLANK('LDC Info'!E26-3), \"Year 5\", 'LDC Info'!E26-3)","v":2009},{"$f":"IF(ISBLANK('LDC Info'!E26-2), \"Year 5\", 'LDC Info'!E26-2)","v":2010},{"$f":"IF(ISBLANK('LDC Info'!E26-1), \"Year 5\", 'LDC Info'!E26-1)","v":2011}]
[null,"Losses Within Distributor's System"]
["A(1)","\"Wholesale\" kWh delivered to distributor (higher value)",241154636,245623028,247239189,250239379,246758167,{"$f":"IF(SUM(C17:G17)=0,0,AVERAGE(C17:G17))","v":246202879.80000001}]
["A(2)","\"Wholesale\" kWh delivered to distributor (lower value)",235121981,240965463,240653353,244035081,240111859,{"$f":"IF(SUM(C18:G18)=0,0,AVERAGE(C18:G18))","v":240177547.40000001}]
["B","Portion of \"Wholesale\" kWh delivered to distributor for its Large Use Customer(s)",null,null,null,null,null,{"$f":"IF(SUM(C19:G19)=0,0,AVERAGE(C19:G19))","v":0}]
["C","Net \"Wholesale\" kWh delivered to distributor  = A(2) - B",{"$f":"C18-C19","v":235121981},240965463,240653353,244035081,240111859,240177547.40000001]
["D","\"Retail\" kWh delivered by distributor",224169495,226442150,229263240,231788047,231635167,{"$f":"IF(SUM(C21:G21)=0,0,AVERAGE(C21:G21))","v":228659619.80000001},"Per 2011 PBR filing (load forecast is based on month billed)"]
["E","Portion of \"Retail\" kWh delivered by distributor to its Large Use Customer(s)",null,null,null,null,null,{"$f":"IF(SUM(C22:G22)=0,0,AVERAGE(C22:G22))","v":0}]
["F","Net \"Retail\" kWh delivered by distributor = D - E",{"$f":"C21-C22","v":224169495},226442150,229263240,231788047,231635167,228659619.80000001]
["G","Loss Factor in Distributor's system = C / F",{"$f":"IF(C23=0,\"\",C20/C23)","v":1.0488580571589368},1.0641369683161903,1.0496813749993239,1.0528372112303099,1.0365950132261221,1.0503714980811842]
[null,"Losses Upstream of Distributor's System"]
["H","Supply Facilities Loss Factor",1.026,1.0189999999999999,1.0269999999999999,1.0249999999999999,1.028,{"$f":"IF(SUM(C26:G26)=0,0,AVERAGE(C26:G26))","v":1.0249999999999999}]
[null,"Total Losses"]
["I","Total Loss Factor = G x H",{"$f":"IF(C24=\"\",\"\",C24*C26)","v":1.0761283666450692},1.0843555707141979,1.0780227721243056,1.0791581415110676,1.0656196735964536,1.0766307855332138]
[]
["Notes"]
[]
[]
["A(1)","If directly connected to the IESO-controlled grid, kWh pertains to the virtual meter on the primary or high voltage side of the transformer at the interface with the transmission grid.  This corresponds to the \"With Losses\" kWh value provided by the IESO's MV-WEB.  It is the higher of the two values provided by MV-WEB."]
[]
[]
[]
[null,"If fully embedded within a host distributor, kWh pertains to the virtual meter on the primary or high voltage side of the transformer, at the interface between the host distributor and the transmission grid.  For example, if the host distributor is Hydro One Networks Inc., kWh from the Hydro One Networks' invoice corresponding to \"Total kWh w Losses\" should be reported.  This corresponds to the higher of the two kWh values provided in Hydro One Networks' invoice."]
[]
[]
[]
[]
[null,"If partially embedded, kWh pertains to the sum of the above."]
[]
["A(2)","If directly connected to the IESO-controlled grid, kWh pertains to a metering installation on the secondary or low voltage side of the transformer at the interface with the transmission grid.  This corresponds to the \"Without Losses\" kWh value provided by the IESO's MV-WEB.  It is the lower of the two kWh values provided by MV-WEB."]
[]
[]
[]
[null,"If fully embedded with the host distributor, kWh pertains to an actual or virtual meter at the interface between the embedded distributor and the host distributor.  For example, if the host distributor is Hydro One Networks Inc., kWh from the Hydro One Networks' invoice corresponding to \"Total kWh\" should be reported.  This corresponds to the lower of the two kWh values provided in Hydro One Networks' invoice."]
[]
[]
[]
[]
[null,"If partially embedded, kWh pertains to the sum of the above."]
[]
[null,"Additionally, kWh pertaining to distributed generation directly connected to the distributor's own distribution network should be included in A(2)."]
[]
[]
["B","If a Large Use Customer is metered on the secondary or low voltage side of the transformer, the default loss is 1%                         (i.e., B = 1.01 X E)."]
[]
[]
["D","kWh corresponding to D should equal metered or estimated kWh at the customer’s delivery point."]
[]
[]
["G and I","These loss factors pertain to secondary-metered customers with demand less than 5,000 kW."]
[]
["H","If directly connected to the IESO-controlled grid, SFLF = 1.0045."]
[]
[null,"If fully embedded within a host distributor, SFLF = loss factor re losses in transformer at grid interface X loss factor re losses in host distributor's system.  If the host distributor is Hydro One Networks Inc., SFLF = 1.0060 X 1.0278 = 1.0340. If partially embedded, SFLF should be calculated as the weighted average of above."]
[]
[]
[]
[null,"Distributors that wish to propose a different SFLF should provide appropriate justification for any such proposal including supporting"]
[null,"calculations and any other relevant material."]

{"sheet":"App.2-S_Stranded Meters","index":29,"n_rows":109,"n_cols":9,"rows_kept":109,"cut":false,"hidden":false,"merged":[[8,0,8,7],[9,0,9,7],[28,0,31,7],[33,0,34,7],[61,2,62,7],[74,2,76,7],[83,0,84,7],[36,1,37,7],[42,1,44,7],[48,1,51,7],[56,1,59,7],[66,2,69,7],[108,0,111,7],[101,1,103,7],[105,1,106,7],[86,1,87,7],[93,1,95,7],[97,1,99,7],[89,1,91,7]]}
[null,null,null,null,null,null,"File Number:",{"$f":"'LDC Info'!$E$18","v":"EB-2012-0139"}]
[null,null,null,null,null,null,"Exhibit:",3]
[null,null,null,null,null,null,"Tab:",1]
[null,null,null,null,null,null,"Schedule:",1]
[null,null,null,null,null,null,"Page:"]
[]
[null,null,null,null,null,null,"Date:","2012-08-31"]
[]
["Appendix 2-S"]
["Stranded Meter Treatment"]
[]
["Year","Notes","Gross Asset Value","Accumulated Amortization","Contributed Capital (Net of Amortization)","Net Asset","Proceeds on Disposition","Residual Net Book Value"]
[null,null,"(A)","(B)","(C)","(D ) = (A) - (B) - (C)","(E)","(F) = (D) - (E)"]
[2006,null,null,null,null,{"$f":"C14-D14-E14","v":0},null,{"$f":"F14-G14","v":0}]
[2007,null,null,null,null,0,null,0]
[2008,null,null,null,null,0,null,0,"Cummulative NBV"]
[2009,"Actual",1270515,1068807,null,201708,null,201708,{"$f":"SUM(H$17:H17)","v":201708}]
[2010,"Actual",426641,181320,null,245321,null,245321,{"$f":"SUM(H$17:H18)","v":447029}]
[2011,"Actual",null,31125,null,-31125,null,-31125,{"$f":"SUM(H$17:H19)","v":415904}]
[2012,"Forecast",null,42532,null,{"$f":"C20-D20-E20","v":-42532},null,{"$f":"F20-G20","v":-42532},{"$f":"SUM(H$17:H20)","v":373372}]
[2013,"Forecast",null,{"$f":"42532/12*4","v":14177.333333333334},null,-14177.333333333334,null,-14177.333333333334,{"$f":"SUM(H$17:H21)","v":359194.66666666669}]
["as at 12/31/11",null,{"$f":"SUM(C17:C19)","v":1697156},{"$f":"SUM(D17:D19)","v":1281252}]
[]
[null,null,null,null,null,{"$f":"SUM(F17:F21)","v":359194.66666666669},null,{"$f":"SUM(H17:H21)","v":359194.66666666669}]
["Notes:"]
[]
["(1)","For 2012, please indicate whether the amounts provided are on a forecast or actual basis."]
[]
["Some distributors have transferred the cost of stranded meters from Account 1860 - Meters to \"Sub-account Stranded Meter Costs of Account 1555\", while in some cases distributors have left these costs in Account 1860.  Depending on which treatment the applicant has chosen. please provide the information under either of the two scenarios (A and B below), as applicable."]
[]
[]
[]
[]
["Scenario A:  If the stranded meter costs were transferred to \"Sub-account Stranded Meter Costs\" of Account 1555, the above table should be completed and the following information should be provided."]
[]
[]
[1,"A description of the accounting treatment followed by the applicant on stranded meter costs for financial accounting and reporting purposes."]
[]
[]
[null,"Stranded meters cost and accumulated depreciation were transferred to account 1555 and continued depreciation.  The "]
[null,"stranded meters were reported within the regulatory asset classification within the balance sheet."]
[]
[2,"The amount of the pooled residual net book value of the removed from service stranded meters, less any contributed capital (net of accumulated amortization), and less any net proceeds from sales, which were transferred to this sub-account as of December 31, 2010."]
[]
[]
[]
[null,"The amount of the pooled residual net book value of the stranded meters as of Dec 31, 2010 is forecasted $447,029."]
[]
[3,"A statement as to whether or not, since transferring the removed stranded meter costs to the sub-account, the recording of depreciation expenses was continued in order to reduce the net book value through accumulated depreciation.  If so, the total depreciation expense amount for the period from the time the costs for the stranded meters were transferred to the sub-account to December 31, 2010 should be provided."]
[]
[]
[]
[]
[null,"Depreciation has continued since transferring the stranded meter costs to account 1555.  The amount of depreciation"]
[null,"since the stranded meters were transferred equals $31,125 for 2011, $42,532 for 2012 and $14,177 equalling $87,834."]
[]
[null,"If no depreciation expenses were recorded to reduce the net book value of stranded meter costs through accumulated depreciation, the total depreciation expense amount that would have been applicable from the time that the stranded meter costs were transferred to the sub-account of Account 1555 to December 31, 2010 should be provided.  In addition, the following information should be provided:"]
[]
[]
[]
[]
[null,"a)","Whether or not carrying charges were recorded for the stranded meter cost balances in the sub-account, and if so, the total carrying charges recorded to December 31, 2010."]
[]
[]
[null,null,"No carrying charges were recorded for the stranded meter cost balances in account 1555."]
[]
[null,"b)","The estimated amount of the pooled residual net book value of the removed from service meters, less any net proceeds from sales and contributed capital, at the time when the smart meters will have been fully deployed (e.g., as of December 31, 2010).  If the smart meters have been fully deployed, the actual amount should be provided."]
[]
[]
[]
[]
[null,null,"The amount of the pooled residual net book value of the stranded meters when the smart meters were fully deployed "]
[null,null,"as of Dec 31, 2011 is $415,904"]
[]
[null,"c)","A description as to how the applicant intends to recover in rates the remaining costs for stranded meters, including the proposed accounting treatment, the proposed disposition period, and the associated bill impacts."]
[]
[]
[]
[null,null,"The pooled residual net book value of the stranded meters as of April 2013 is forecasted to be $359,195.  Innisfil Hydro is "]
[null,null,"proposing to recover the residual net book value of the stranded meters for a 2 year period to the residential and GS<50 customer"]
[null,null,"classes.  Innisfil Hydro is proposing to transfer the residual net book value of the stranded meter to a sub account of the DVA recovery"]
[null,null,"account 1595 and record the customer recovery to sub DVA account 1595."]
[]
["Scenario B:  If the stranded meter costs remained recorded in Account 1860, the above table should be completed and the following information should be provided:"]
[]
[]
[1,"A description of the accounting treatment followed by the applicant on stranded meter costs for financial accounting and reporting purposes."]
[]
[]
[2,"The amount of the pooled residual net book value of the removed from service stranded meters, less any contributed capital (net of accumulated amortization), and less any net proceeds from sales, as of December 31, 2010."]
[]
[]
[]
[3,"A statement as to whether or not the recording of depreciation expenses continued in order to reduce the net book value through accumulated depreciation.  If so, provision of the total (cumulative) depreciation expense for the period from the time that the meters became stranded to December 31, 2010."]
[]
[]
[]
[4,"If no depreciation expenses were recorded to reduce the net book value of stranded meters through accumulated depreciation, the total (cumulative) depreciation expense amount that would have been applicable for the period from the time that the meters became stranded to December 31, 2010."]
[]
[]
[]
[5,"The estimated amount of the pooled residual net book value of the removed from service meters, less any net proceeds from sales and contributed capital, at the time when smart meters will have been fully deployed.  If the smart meters have been fully deployed, please provide the actual amount."]
[]
[]
[]
[6,"A description as to how the applicant intends to recover in rates the costs for stranded meters, including the proposed accounting treatment, the proposed disposition period and the associated bill impacts."]
[]
[]
["Distributors should also provide the Net Book Value per class of meter as of December 31, 2010 as well as the number of meters that were removed / stranded.  In preparing this information, distributors should review the Board's letter of January 16, 2007 Stranded Meter Costs Related to the Installation of Smart Meters   which stated that records were to be kept of the type and number of each meter to support the stranded meter costs."]

{"sheet":"App.2-T_1592_Tax_Variance","index":30,"n_rows":66,"n_cols":7,"rows_kept":66,"cut":false,"hidden":false,"merged":[[17,0,17,2],[18,0,18,2],[19,0,19,2],[24,0,24,2],[53,1,54,4],[31,0,31,2],[40,1,41,4],[25,0,25,2],[26,0,26,2],[28,0,28,2],[30,0,30,2],[38,0,39,0],[20,0,20,2],[21,0,21,2],[22,0,22,2],[23,0,23,2],[8,0,8,4],[9,0,9,4],[11,0,11,4],[13,0,15,2],[16,0,16,2],[27,0,27,2],[65,1,66,4],[35,0,36,0],[40,0,41,0],[53,0,54,0],[58,0,61,0],[65,0,66,0],[35,1,36,4],[38,1,38,4],[58,1,61,4],[29,0,29,2]]}
[null,null,"File Number:",null,{"$f":"'LDC Info'!$E$18","v":"EB-2012-0139"}]
[null,null,"Exhibit:"]
[null,null,"Tab:"]
[null,null,"Schedule:"]
[null,null,"Page:"]
[]
[null,null,"Date:",null,"2012-08-31"]
[]
["Appendix 2-T"]
["Deferred PILs Account 1592 Balances"]
[]
["The following table should be completed based on the information requested below, in accordance with the notes following the table. An explanation should be provided for any blank entries."]
[]
["Tax Item",null,null,null,"Principal as of"]
[null,null,null,null,"December 31,"]
[null,null,null,null,2012]
["Large Corporation Tax grossed-up proxy from 2006 EDR application PILs model for the period from May 1, 2006 to April 30, 2007"]
["Large Corporation Tax grossed-up proxy from 2006 EDR application PILs model for the period from January 1, 2006 to April 30, 2006 (4/12ths of the approved grossed-up proxy), if not recorded in PILs account 1562"]
["Ontario Capital Tax rate decrease and increase in capital deduction for 2007"]
["Ontario Capital Tax rate decrease and increase in capital deduction for 2008"]
["Ontario Capital Tax rate decrease and increase in capital deduction for 2009"]
["Ontario Capital Tax rate decrease and increase in capital deduction for 2010"]
["Capital Cost Allowance class changes from 2006 EDR application for 2006"]
["Capital Cost Allowance class changes from 2006 EDR application for 2007"]
["Capital Cost Allowance class changes from 2006 EDR application for 2008"]
["Capital Cost Allowance class changes from 2006 EDR application for 2009"]
["Capital Cost Allowance class changes from 2006 EDR application for 2010"]
["Capital Cost Allowance class changes from 2006 EDR application for 2011"]
["Capital Cost Allowance class changes from any prior application not recorded above.  Please provide details and explanation separately."]
["PST Savings due to the PST becoming part of HST effective July 1, 2010.  The amount represented is 50% of the PST savings due to the ratepayer 7/10 to 12/12.",null,null,null,{"$f":"-G48","v":-43208.5}]
["Insert description of additional item(s) and new rows if needed."]
["Total",null,null,null,{"$f":"SUM(E17:E31)","v":-43208.5}]
[]
["Notes:"]
[]
[1,"Revise the deferral and variance account continuity schedule to include account 1592 as a group 2 account and enter all relevant information for transactions, adjustments, etc., for all relevant years."]
[]
[]
[2,"Describe each type of tax item that has been recorded in account 1592."]
[]
[3,"Provide the calculations that show how each item was determined and provide any pertinent supporting evidence and documentation."]
[]
[]
[null,null,2010,null,2011,2012,"Total"]
[null,"OM&A expenses PST savings",{"$f":"25713*0.5","v":12856.5},null,25713,25713,{"$f":"SUM(C45:F45)","v":64282.5}]
[null,"Captial items PST savings",{"$f":"4025*0.5","v":2012.5},null,8049,12073,{"$f":"SUM(C46:F46)","v":22134.5}]
[null,"Total Annual PST savings",{"$f":"SUM(C45:C46)","v":14869},null,{"$f":"SUM(E45:E46)","v":33762},{"$f":"SUM(F45:F46)","v":37786},{"$f":"SUM(G45:G46)","v":86417}]
[null,"50% Savings for rate payer by year",{"$f":"C47*0.5","v":7434.5},null,{"$f":"E47*0.5","v":16881},{"$f":"F47*0.5","v":18893},{"$f":"SUM(C48:F48)","v":43208.5}]
[null,"50% Savings for rate payer cummulative by year",{"$f":"SUM($C48:C48)","v":7434.5},null,{"$f":"SUM($C48:E48)","v":24315.5},{"$f":"SUM($C48:F48)","v":43208.5}]
[]
[null,"The pst savings resulting from PST converting to HST effective July 2010 is based on the 2009 actual financial results as a typical"]
[null,"year."]
[]
[4,"Please state whether or not the applicant followed the guidance provided in the FAQ of July 2007.  If not, please provide an explanation."]
[]
[]
[null,"Any tax sharing changes that have occurred since the last COS filing (2009) have been incorporated within the IRM filings."]
[]
[5,"Identify the account balance as of December 31, 2011 as per the 2011 Audited Financial Statements.  Identify the account balance as of December 31, 2011 as per the April 2012 2.1.7 RRR filing to the Board.  Provide a reconciliation if the balances provided are not identical to each other and to the total shown on the continuity schedule."]
[]
[]
[]
[]
[null,"The account balance as of December 31, 2011 per audited statements and the April 2012 2.1.7 RRR filing to the Board is $48,631."]
[]
[6,"Complete the above table based on the answers to the previous.  Add rows as required to complete the analysis in an informative manner.  Please provide the completed table as a working Excel spreadsheet."]

{"sheet":"App.2-U_IFRS Transition Costs","index":31,"n_rows":36,"n_cols":12,"rows_kept":36,"cut":false,"hidden":false,"merged":[[41,0,42,0],[41,1,42,4],[44,0,47,0],[44,1,47,4],[49,0,50,0],[49,1,50,4],[38,0,39,0],[38,1,39,4],[23,0,23,2],[24,0,24,2],[25,0,25,2],[26,0,26,2],[27,0,27,2],[28,0,28,2],[29,0,29,2],[33,0,34,0],[33,1,34,11],[36,0,37,0],[36,1,36,4],[22,0,22,2],[8,0,8,11],[9,0,9,11],[11,0,11,11],[13,0,15,2],[13,11,15,11],[16,0,16,2],[17,0,17,2],[18,0,18,2],[19,0,19,2],[20,0,20,2],[21,0,21,2]]}
[null,null,null,null,null,null,null,null,null,"File Number:",{"$f":"'LDC Info'!$E$18","v":"EB-2012-0139"}]
[null,null,null,null,null,null,null,null,null,"Exhibit:",9]
[null,null,null,null,null,null,null,null,null,"Tab:",2]
[null,null,null,null,null,null,null,null,null,"Schedule:",1]
[null,null,null,null,null,null,null,null,null,"Page:"]
[]
[null,null,null,null,null,null,null,null,null,"Date:","2012-08-31"]
[]
["Appendix 2-U"]
["One-Time Incremental IFRS Transition Costs"]
[]
["The following table should be completed based on the information requested below. An explanation should be provided for any blank entries.  The entries should include one-time incremental IFRS transition costs that are currently included in Account 1508, Other Regulatory Assets, sub-account Deferred IFRS Transition Costs Account, or Account 1508, Other Regulatory Assets, sub-account IFRS Transition Costs Variance Account."]
[]
["Nature of One-Time Incremental IFRS Transition Costs 1",null,null,null,"Audited Actual","Audited Actual","Audited Actual","Audited Carrying","Total Audited","RRR 2.1.7","Variance 2","Reasons why the costs recorded meet the criteria of one-time IFRS administrative incremental costs"]
[null,null,null,null,"Costs Incurred","Costs Incurred","Costs Incurred","Charges","Actual Costs","Balance"]
[null,null,null,null,2009,2010,2011,"to Dec 31, 2011","to Dec 31, 2011","2011-12-31"]
["professional accounting fees",null,null,null,7813,85046,10495,null,{"$f":"SUM(E17:H17)","v":103354},null,null,"One time costs incurred to create an distribution open item asset listing"]
["professional legal fees",null,null,null,null,null,null,null,{"$f":"SUM(E18:H18)","v":0}]
["salaries, wages and benefits of staff added to support the transition to IFRS",null,null,null,null,null,null,null,0]
["associated staff training and development costs",null,null,null,2874,null,null,null,2874,null,null,"One time initial training costs"]
["costs related to system upgrades, or replacements or changes where IFRS was the major reason for conversion",null,null,null,1246,53175,195484,null,249905,null,null,"Initial setup costs incurred to develop and implement a identifiable asset process within GIS and financial reporting system for disposition referencing."]
[null,null,null,null,null,null,null,null,0]
["Recovery of estimated IFRS costs from ratepayers",null,null,null,-16667,-25000,-25000,null,-66667]
["Total net carrying charges",null,null,null,null,null,null,3354,3354]
[null,null,null,null,null,null,null,null,0]
[null,null,null,null,null,null,null,null,0]
[null,null,null,null,null,null,null,null,0]
[null,null,null,null,null,null,null,null,0]
["Insert description of additional item(s) and new rows if needed.",null,null,null,null,null,null,null,0]
["Total",null,null,null,{"$f":"SUM(E17:E29)","v":-4734},{"$f":"SUM(F17:F29)","v":113221},{"$f":"SUM(G17:G29)","v":180979},{"$f":"SUM(H17:H29)","v":3354},{"$f":"SUM(I17:I29)","v":292820},{"$f":"289466+3354","v":292820},{"$f":"+I30-J30","v":0}]
[]
[]
["Note:"]
[1,"The Deferred IFRS Transition Costs Account and the IFRS Transition Costs Variance Account are exclusively for necessary, incremental transition costs and shall not include ongoing IFRS compliance costs or impacts arising from adopting accounting policy changes that reflect changes in the timing of the recognition of income. The incremental costs in these accounts shall not include costs related to system upgrades, or replacements or changes where IFRS was not the major reason for conversion. In addition, incremental IFRS costs shall not include capital assets or expenditures."]
[]
[2,"Applicants are to provide an explanation of material variances in evidence"]

{"sheet":"App.2-V_Rev_Reconciliation","index":32,"n_rows":34,"n_cols":16,"rows_kept":34,"cut":false,"hidden":false,"merged":[[33,0,34,13],[8,0,8,15],[11,10,12,10],[9,0,9,15],[11,5,11,6],[11,2,11,4],[11,12,12,12],[11,13,12,13],[11,14,12,14],[11,15,12,15],[11,1,12,1],[12,8,12,9],[11,7,11,9]]}
[null,null,null,null,null,null,null,null,null,null,null,null,null,null,"File Number:",{"$f":"'LDC Info'!$E$18","v":"EB-2012-0139"}]
[null,null,null,null,null,null,null,null,null,null,null,null,null,null,"Exhibit:",8]
[null,null,null,null,null,null,null,null,null,null,null,null,null,null,"Tab:"]
[null,null,null,null,null,null,null,null,null,null,null,null,null,null,"Schedule:",7]
[null,null,null,null,null,null,null,null,null,null,null,null,null,null,"Page:"]
[]
[null,null,null,null,null,null,null,null,null,null,null,null,null,null,"Date:","2012-09-10"]
[]
["Appendix 2-V"]
["Revenue Reconciliation"]
[]
["Rate Class","Customers/ Connections","Number of Customers/Connections",null,null,"Test Year Consumption",null,"Proposed Rates",null,null,"Revenues at Proposed Rates",null,"Class Specific Revenue Requirement","Transformer Allowance Credit","Total","Difference"]
[null,null,"Start of Test Year","End of Test Year","Average","kWh","kW","Monthly Service Charge","Volumetric"]
[null,null,null,null,null,null,null,null,"kWh","kW"]
[]
["Residential","Customers",null,{"$f":"'[4]Forecast Data For2013-RD3'!$C$5","v":14189.197206911933},{"$f":"IF(SUM(C16:D16)=0,0,AVERAGE(C16:D16))","v":14189.197206911933},{"$f":"'[4]Forecast Data For2013-RD3'!$C$6","v":146562898.02754521},null,{"$f":"'[4]Rates By Rate Class-RD7'!$E$25","v":24.037962762533862},{"$f":"'[4]Rates By Rate Class-RD7'!$E$6","v":2.143803130624462E-2},null,{"$f":"H16*E16*12+I16*F16+J16*G16","v":7234972.7253284343},null,{"$f":"'[4]Cost Allocation Study-RD6'!$K$5","v":7234972.7253284343},null,{"$f":"SUM(M16:N16)","v":7234972.7253284343},{"$f":"O16-K16","v":0}]
["GS < 50 kW","Customers",null,{"$f":"'[4]Forecast Data For2013-RD3'!$C$7","v":909.66588974932517},909.66588974932517,{"$f":"'[4]Forecast Data For2013-RD3'!$C$8","v":31437454.722956143},null,{"$f":"'[4]Rates By Rate Class-RD7'!$E$26","v":33.841044229163693},{"$f":"'[4]Rates By Rate Class-RD7'!$E$7","v":8.2726827848438791E-3},null,629480.61379112967,null,{"$f":"'[4]Cost Allocation Study-RD6'!$K$6","v":629480.61379112967},null,629480.61379112967,0]
["GS > 50 to 4,999 kW","Customers",null,{"$f":"'[4]Forecast Data For2013-RD3'!$C$9","v":66.142173037729634},66.142173037729634,null,{"$f":"'[4]Forecast Data For2013-RD3'!$C$10","v":146479.74934501474},{"$f":"'[4]Rates By Rate Class-RD7'!$E$27","v":246.68256120265224},null,{"$f":"'[4]Rates By Rate Class-RD7'!$E$8","v":2.3151963855281084},534922.8340181153,null,{"$f":"'[4]Cost Allocation Study-RD6'!$K$7","v":518208.03401811532},{"$f":"'[4]Rates By Rate Class-RD7'!$H$8","v":16714.8},534922.8340181153,0]
["Large Use",null,null,null,0,null,null,null,null,null,0,null,null,null,0,0]
["Streetlighting","Connections",null,{"$f":"'[4]Forecast Data For2013-RD3'!$C$21","v":2889.1708016991734},2889.1708016991734,null,{"$f":"'[4]Forecast Data For2013-RD3'!$C$22","v":4400.1600657253011},{"$f":"'[4]Rates By Rate Class-RD7'!$E$31","v":6.4836343078820002},null,{"$f":"'[4]Rates By Rate Class-RD7'!$E$12","v":44.875530585023512},422247.44078318728,null,{"$f":"'[4]Cost Allocation Study-RD6'!$K$11","v":422247.44078318728},null,422247.44078318728,0]
["Sentinel Lighting","Connections",null,{"$f":"'[4]Forecast Data For2013-RD3'!$C$18","v":237.32316393407066},237.32316393407066,null,{"$f":"'[4]Forecast Data For2013-RD3'!$C$19","v":289.36640272553188},{"$f":"'[4]Rates By Rate Class-RD7'!$E$30","v":9.0757326824723261},null,{"$f":"'[4]Rates By Rate Class-RD7'!$E$11","v":41.333903960718963},37807.222242406053,null,{"$f":"'[4]Cost Allocation Study-RD6'!$K$10","v":37807.222242406053},null,37807.222242406053,0]
["Unmetered Scattered Load","Connections",null,{"$f":"'[4]Forecast Data For2013-RD3'!$C$24","v":77.657252756648802},77.657252756648802,{"$f":"'[4]Forecast Data For2013-RD3'!$C$25","v":592219.87742047897},null,{"$f":"'[4]Rates By Rate Class-RD7'!$E$32","v":10.35152842412931},{"$f":"'[4]Rates By Rate Class-RD7'!$E$13","v":1.7436007043620614E-2},null,19972.405065078539,null,{"$f":"'[4]Cost Allocation Study-RD6'!$K$12","v":19972.405065078539},null,19972.405065078539,0]
["Standby Power",null,null,null,0,null,null,null,null,null,0,null,null,null,0,0]
["Embedded Distributor Class",null,null,null,0,null,null,null,null,null,0,null,null,null,0,0]
["etc.",null,null,null,0,null,null,null,null,null,0,null,null,null,0,0]
[null,null,null,null,0,null,null,null,null,null,0,null,null,null,0,0]
[null,null,null,null,0,null,null,null,null,null,0,null,null,null,0,0]
[null,null,null,null,0,null,null,null,null,null,0,null,null,null,0,0]
[]
["Total",null,null,{"$f":"SUM(D16:D29)","v":18369.15648808888},null,{"$f":"SUM(F16:F29)","v":178592572.62792185},null,null,null,null,{"$f":"SUM(K16:K28)","v":8879403.2412283514},null,{"$f":"SUM(M16:M28)","v":8862688.4412283506},{"$f":"SUM(N16:N28)","v":16714.8},{"$f":"M30+N30","v":8879403.2412283514},{"$f":"O30-K30","v":0}]
[]
["Note"]
[]
["1       The class specific revenue requirements in column N must be the amounts used in the final rate design process.  The total of column N should equate to the proposed base revenue requirement"]

{"sheet":"App.2-W_Residential Impacts","index":33,"n_rows":85,"n_cols":31,"rows_kept":85,"cut":false,"hidden":false,"merged":[[13,19,13,30],[17,21,17,23],[17,25,17,27],[17,29,17,30],[18,19,19,19],[18,29,19,29],[18,30,19,30],[60,1,60,3],[66,1,66,3],[67,1,67,3],[61,1,61,3],[18,3,19,3],[18,13,19,13],[18,14,19,14],[2,0,2,10],[17,5,17,7],[17,9,17,11],[17,13,17,14],[13,3,13,14],[9,1,9,14],[10,1,10,14]]}
[null,null,null,null,null,null,null,null,null,null,null,null,null,"File Number:",{"$f":"'LDC Info'!$E$18","v":"EB-2012-0139"},null,null,null,"1900-01-01"]
[null,null,null,null,null,null,null,null,null,null,null,null,null,"Exhibit:",8]
[null,null,null,null,null,null,null,null,null,null,null,null,null,"Tab:"]
[null,null,null,null,null,null,null,null,null,null,null,null,null,"Schedule:",9]
[null,null,null,null,null,null,null,null,null,null,null,null,null,"Page:"]
[]
[null,null,null,null,null,null,null,null,null,null,null,null,null,"Date:","2012-09-10"]
[]
[]
[null,"Appendix 2-W"]
[null,"Bill Impacts"]
[]
[]
[null,"Customer Class:",null,"Residential",null,null,null,null,null,null,null,null,null,null,null,null,null,"Customer Class:",null,"Residential"]
[]
[null,null,null,"Consumption",null,800," kWh",null,null,null,null,null,null,null,null,null,null,null,null,"Consumption",null,800," kWh"]
[]
[null,null,null,null,null,"Current Board-Approved",null,null,null,"Proposed",null,null,null,"Impact",null,null,null,null,null,null,null,"Current Board-Approved",null,null,null,"Proposed",null,null,null,"Impact"]
[null,null,null,"Charge Unit",null,"Rate","Volume","Charge",null,"Rate","Volume","Charge",null,"$ Change","% Change",null,null,null,null,"Charge Unit",null,"Rate","Volume","Charge",null,"Rate","Volume","Charge",null,"$ Change","% Change"]
[null,null,null,null,null,"($)",null,"($)",null,"($)",null,"($)",null,null,null,null,null,null,null,null,null,"($)",null,"($)",null,"($)",null,"($)"]
[null,"Monthly Service Charge",null,"Monthly",null,{"$f":"V21","v":21.08},1,{"$f":"G21*F21","v":21.08},null,{"$f":"Z21","v":24.04},1,{"$f":"K21*J21","v":24.04},null,{"$f":"L21-H21","v":2.9600000000000009},{"$f":"IF((H21)=0,\"\",(N21/H21))","v":0.1404174573055029},null,null,"Monthly Service Charge",null,"monthly",null,{"$f":"+'[4]2012 Existing Rates-RD4'!$C$6","v":21.08},1,{"$f":"W21*V21","v":21.08},null,{"$f":"+'[4]Rate Schedule (Part 1)-RD13'!$E$10","v":24.04},1,{"$f":"AA21*Z21","v":24.04},null,{"$f":"AB21-X21","v":2.9600000000000009},{"$f":"IF((X21)=0,\"\",(AD21/X21))","v":0.1404174573055029}]
[null,"Smart Meter Disposition Rider",null,"Monthly",null,{"$f":"V22","v":0.27},1,{"$f":"G22*F22","v":0.27},null,{"$f":"Z22","v":0.27},1,{"$f":"K22*J22","v":0.27},null,{"$f":"L22-H22","v":0},{"$f":"IF((H22)=0,\"\",(N22/H22))","v":0},null,null,"Smart Meter Disposition Rider",null,"monthly",null,{"$f":"+'[4]2012 Existing Rates-RD4'!$B$43","v":0.27},1,0.27,null,{"$f":"V22","v":0.27},1,0.27,null,0,0]
[null,"Stranded Meter Rider",null,"Monthly",null,0,1,0,null,{"$f":"Z34","v":0.83},1,{"$f":"K23*J23","v":0.83},null,{"$f":"L23-H23","v":0.83},{"$f":"IF((H23)=0,\"\",(N23/H23))","v":""},null,null,"Smart Meter Inc Rev Req Rider",null,"monthly",null,{"$f":"'[4]2012 Existing Rates-RD4'!$C$43","v":1.86},1,1.86,null,null,1,0,null,-1.86,-1]
[null,"SMIRR",null,"Monthly",null,{"$f":"V23","v":1.86},1,1.86,null,0,1,0,null,-1.86,-1,null,null,"GEA Rate Adder/Rider",null,"monthly",null,null,1,0,null,{"$f":"'[4]Rate Schedule (Part 1)-RD13'!$E$14","v":0.52329999999999999},1,0.52329999999999999,null,0.52329999999999999,""]
[null,"GEA Rate Adder",null,"Monthly",null,0,1,0,null,{"$f":"Z24","v":0.52329999999999999},1,0.52329999999999999,null,0.52329999999999999,"",null,null,null,null,null,null,null,1,0,null,null,1,0,null,0,""]
[null,null,null,null,null,null,1,0,null,null,1,0,null,0,"",null,null,"Service Charge Rate Rider(s)",null,null,null,null,1,0,null,null,1,0,null,0,""]
[null,"Distribution Volumetric Rate",null,"per kWh",null,{"$f":"V27","v":1.8800000000000001E-2},{"$f":"$F$16","v":800},15.040000000000001,null,{"$f":"Z27","v":2.1399999999999999E-2},{"$f":"$F$16","v":800},17.119999999999997,null,2.0799999999999965,0.13829787234042529,null,null,"Distribution Volumetric Rate",null,"per kWh",null,{"$f":"+'[4]2012 Existing Rates-RD4'!$B$68","v":1.8800000000000001E-2},{"$f":"V16","v":800},15.040000000000001,null,{"$f":"+'[4]Rate Schedule (Part 1)-RD13'!$E$11","v":2.1399999999999999E-2},{"$f":"V16","v":800},17.119999999999997,null,2.0799999999999965,0.13829787234042529]
[null,"LRAM & SSM Rate Rider",null,"Monthly",null,0,{"$f":"$F$16","v":800},0,null,0,{"$f":"$F$16","v":800},0,null,0,"",null,null,"Low Voltage Rate Adder",null,"per kWh",null,{"$f":"+'[4]2012 Existing Rates-RD4'!$B$31","v":2.2000000000000001E-3},{"$f":"W27","v":800},1.76,null,{"$f":"+'[4]Rate Schedule (Part 1)-RD13'!$E$12","v":2.2000000000000001E-3},{"$f":"AA27","v":800},1.76,null,0,0]
[null,null,null,null,null,null,{"$f":"$F$16","v":800},0,null,null,800,0,null,0,"",null,null,"Volumetric Rate Adder(s)",null,null,null,null,800,0,null,null,800,0,null,0,""]
[null,null,null,null,null,null,{"$f":"$F$16","v":800},{"$f":"G30*F30","v":0},null,null,800,{"$f":"K30*J30","v":0},null,{"$f":"L30-H30","v":0},{"$f":"IF((H30)=0,\"\",(N30/H30))","v":""},null,null,"Volumetric Rate Rider(s)",null,null,null,null,800,0,null,null,800,0,null,0,""]
[null,null,null,null,null,null,800,0,null,null,800,0,null,0,"",null,null,"Smart Meter Disposition Rider",null,null,null,null,800,0,null,null,800,0,null,0,""]
[null,null,null,null,null,null,800,0,null,null,800,0,null,0,"",null,null,"LRAM & SSM Rate Rider",null,"per kWh",null,{"$f":"'[4]2012 Existing Rates-RD4'!$B$55","v":0},800,0,null,{"$f":"'[4]Rate Schedule (Part 1)-RD13'!C91","v":0},800,0,null,0,""]
[null,null,null,null,null,null,{"$f":"$F$16","v":800},0,null,null,800,0,null,0,"",null,null,"Deferral/Variance Account Disposition Rate Rider",null,"per kWh",null,{"$f":"+'[4]2012 Existing Rates-RD4'!$B$19","v":-3.2000000000000002E-3},800,-2.56,null,{"$f":"+'[4]Rate Schedule (Part 1)-RD13'!$E$16","v":-5.1000000000000004E-3},800,-4.08,null,-1.52,0.59375]
[null,null,null,null,null,null,800,0,null,null,800,0,null,0,"",null,null,"Stranded meter rider",null,"monthly",null,0,1,0,null,{"$f":"'[4]2013 Rate Rider-RD11'!$B$60","v":0.83},1,0.83,null,0.83,""]
[null,null,null,null,null,null,800,0,null,null,800,0,null,0,"",null,null,null,null,null,null,null,null,0,null,null,null,0,null,0,""]
[null,null,null,null,null,null,800,0,null,null,800,0,null,0,"",null,null,null,null,null,null,null,null,0,null,null,null,0,null,0,""]
[null,"Sub-Total A",null,null,null,null,null,{"$f":"SUM(H21:H36)","v":38.25},null,null,null,{"$f":"SUM(L21:L36)","v":42.783299999999997},null,4.533299999999997,0.11851764705882345,null,null,null,null,null,null,null,null,0,null,null,null,0,null,0,""]
[null,"Deferral/Variance Account Disposition Rate Rider ",null,"per kWh",null,{"$f":"V33","v":-3.2000000000000002E-3},{"$f":"$F$16","v":800},{"$f":"G38*F38","v":-2.56},null,{"$f":"Z33","v":-5.1000000000000004E-3},{"$f":"$F$16","v":800},{"$f":"K38*J38","v":-4.08},null,{"$f":"L38-H38","v":-1.52},{"$f":"IF((H38)=0,\"\",(N38/H38))","v":0.59375},null,null,"Sub-Total A - Distribution",null,null,null,null,null,{"$f":"SUM(X21:X37)","v":37.449999999999996},null,null,null,{"$f":"SUM(AB21:AB37)","v":40.463299999999997},null,3.013300000000001,8.0461949265687616E-2]
[null,null,null,null,null,null,{"$f":"$F$16","v":800},{"$f":"G39*F39","v":0},null,null,{"$f":"$F$16","v":800},{"$f":"K39*J39","v":0},null,{"$f":"L39-H39","v":0},{"$f":"IF((H39)=0,\"\",(N39/H39))","v":""},null,null,"RTSR - Network",null,"per kWh",null,{"$f":"'[4]Other Electriciy Rates-RD17'!$B$8","v":5.1999999999999998E-3},{"$f":"V16*(1+V53)","v":859.68},{"$f":"W39*V39","v":4.4703359999999996},null,{"$f":"'[4]Other Electriciy Rates-RD17'!$B$23","v":5.0000000000000001E-3},{"$f":"V16*(1+Z53)","v":861.28},{"$f":"AA39*Z39","v":4.3064},null,-0.16393599999999964,-3.6671963807642122E-2]
[null,null,null,null,null,null,800,0,null,null,800,0,null,0,"",null,null,"RTSR - Line and Transformation Connection",null,"per kWh",null,{"$f":"'[4]Other Electriciy Rates-RD17'!$C$8","v":4.1000000000000003E-3},{"$f":"W39","v":859.68},{"$f":"W40*V40","v":3.5246880000000003},null,{"$f":"'[4]Other Electriciy Rates-RD17'!$C$23","v":4.0000000000000001E-3},{"$f":"AA39","v":861.28},{"$f":"AA40*Z40","v":3.4451200000000002},null,-7.9568000000000083E-2,-2.2574480351168692E-2]
[null,null,null,null,null,null,800,0,null,null,800,0,null,0,"",null,null,"Sub-Total B - Delivery (including Sub-Total A)",null,null,null,null,null,{"$f":"SUM(X38:X40)","v":45.445023999999989},null,null,null,{"$f":"SUM(AB38:AB40)","v":48.214820000000003},null,2.7697960000000137,6.0948278957890185E-2]
[null,"Low Voltage Service Charge",null,"per kWh",null,{"$f":"V28","v":2.2000000000000001E-3},800,{"$f":"G42*F42","v":1.76},null,{"$f":"Z28","v":2.2000000000000001E-3},800,{"$f":"K42*J42","v":1.76},null,{"$f":"L42-H42","v":0},{"$f":"IF((H42)=0,\"\",(N42/H42))","v":0},null,null,"Wholesale Market Service Charge (WMSC)",null,"per kWh",null,{"$f":"'[4]Other Electriciy Rates-RD17'!$D$8","v":5.1999999999999998E-3},{"$f":"W40","v":859.68},{"$f":"W42*V42","v":4.4703359999999996},null,{"$f":"'[4]Other Electriciy Rates-RD17'!$D$23","v":5.1999999999999998E-3},{"$f":"AA40","v":861.28},{"$f":"AA42*Z42","v":4.478656},null,8.3200000000003271E-3,1.8611576400521857E-3]
[null,"Smart Meter Entity Charge",null,null,null,null,null,null,null,null,800,{"$f":"K43*J43","v":0},null,{"$f":"L43-H43","v":0},null,null,null,"Rural and Remote Rate Protection (RRRP)",null,"per kWh",null,{"$f":"'[4]Other Electriciy Rates-RD17'!$E$8","v":1.1000000000000001E-3},{"$f":"W40","v":859.68},0.94564800000000004,null,{"$f":"'[4]Other Electriciy Rates-RD17'!$E$23","v":1.1000000000000001E-3},{"$f":"AA40","v":861.28},0.94740800000000003,null,1.7599999999999838E-3,1.8611576400520951E-3]
[null,"Sub-Total B - Distribution (includes Sub-Total A)",null,null,null,null,null,{"$f":"SUM(H38:H42)+H37","v":37.450000000000003},null,null,null,{"$f":"SUM(L38:L42)+L37","v":40.463299999999997},null,{"$f":"L44-H44","v":3.0132999999999939},{"$f":"IF((H44)=0,\"\",(N44/H44))","v":8.0461949265687407E-2},null,null,"Standard Supply Service Charge",null,"monthly",null,0.25,1,0.25,null,0.25,1,0.25,null,0,0]
[null,"RTSR - Network",null,null,null,{"$f":"V39","v":5.1999999999999998E-3},{"$f":"F16*(1+F71)","v":859.68},{"$f":"G45*F45","v":4.4703359999999996},null,{"$f":"Z39","v":5.0000000000000001E-3},{"$f":"F16*(1+J71)","v":861.28},{"$f":"K45*J45","v":4.3064},null,-0.16393599999999964,-3.6671963807642122E-2,null,null,"Debt Retirement Charge (DRC)",null,"per kWh",null,{"$f":"'[4]Other Electriciy Rates-RD17'!$F$8","v":7.0000000000000001E-3},{"$f":"W42","v":859.68},6.01776,null,{"$f":"'[4]Other Electriciy Rates-RD17'!$F$23","v":7.0000000000000001E-3},{"$f":"AA42","v":861.28},6.0289599999999997,null,1.1199999999999655E-2,1.861157640052055E-3]
[null,"RTSR - Line and Transformation Connection",null,null,null,{"$f":"V40","v":4.1000000000000003E-3},{"$f":"G45","v":859.68},{"$f":"G46*F46","v":3.5246880000000003},null,{"$f":"Z40","v":4.0000000000000001E-3},{"$f":"K45","v":861.28},{"$f":"K46*J46","v":3.4451200000000002},null,-7.9568000000000083E-2,-2.2574480351168692E-2,null,null,"Energy",null,null,null,null,null,0,null,null,null,0,null,0,""]
[null,"Sub-Total C - Delivery (including Sub-Total B)",null,null,null,null,null,{"$f":"SUM(H44:H46)","v":45.445024000000004},null,null,null,{"$f":"SUM(L44:L46)","v":48.214820000000003},null,2.7697959999999995,6.0948278957889852E-2,null,null,"Energy First Block",null,"per kWh",null,{"$f":"+'[4]Other Electriciy Rates-RD17'!$M$8","v":7.4999999999999997E-2},{"$f":"IF($X16*(1+$X53)>600,600,($X16*(1+$X53)))","v":0},0,null,{"$f":"+'[4]Other Electriciy Rates-RD17'!$M$23","v":7.4999999999999997E-2},{"$f":"IF($X16*(1+$AB53)>600,600,($X16*(1+$AB53)))","v":0},0,null,0,""]
[null,"Wholesale Market Service Charge (WMSC)",null,"per kWh",null,{"$f":"V42","v":5.1999999999999998E-3},{"$f":"G46","v":859.68},{"$f":"G48*F48","v":4.4703359999999996},null,{"$f":"Z42","v":5.1999999999999998E-3},{"$f":"K46","v":861.28},{"$f":"K48*J48","v":4.478656},null,8.3200000000003271E-3,1.8611576400521857E-3,null,null,"Energy Second Block",null,null,null,{"$f":"+'[4]Other Electriciy Rates-RD17'!$N$8","v":8.7999999999999995E-2},{"$f":"IF($X16*(1+$X53)>600,$X16*(1+$X53)-$Y47,0)","v":0},0,null,{"$f":"+'[4]Other Electriciy Rates-RD17'!$N$23","v":8.7999999999999995E-2},{"$f":"IF($X16*(1+$AB53)>600,$X16*(1+$AB53)-$Y47,0)","v":0},0,null,0,""]
[null,"Rural and Remote Rate Protection (RRRP)",null,"per kWh",null,{"$f":"V43","v":1.1000000000000001E-3},{"$f":"G46","v":859.68},0.94564800000000004,null,{"$f":"Z43","v":1.1000000000000001E-3},{"$f":"K46","v":861.28},0.94740800000000003,null,1.7599999999999838E-3,1.8611576400520951E-3,null,null,"Total Bill (before Taxes)",null,null,null,null,null,{"$f":"SUM(X41:X48)","v":57.128767999999994},null,null,null,{"$f":"SUM(AB41:AB48)","v":59.919844000000005},null,2.791076000000011,4.8855875904763278E-2]
[null,"Standard Supply Service Charge",null,"Monthly",null,{"$f":"V44","v":0.25},"1900-01-01",0.25,null,{"$f":"Z44","v":0.25},"1900-01-01",0.25,null,0,0,null,null,"HST",null,null,null,0.13,null,{"$f":"X49*V50","v":7.4267398399999998},null,0.13,null,{"$f":"AB49*Z50","v":7.7895797200000008},null,0.362839880000001,4.8855875904763216E-2]
[null,"Debt Retirement Charge (DRC)",null,"per kWh",null,{"$f":"V45","v":7.0000000000000001E-3},{"$f":"G49","v":859.68},6.01776,null,{"$f":"Z45","v":7.0000000000000001E-3},{"$f":"K49","v":861.28},6.0289599999999997,null,1.1199999999999655E-2,1.861157640052055E-3,null,null,"Total Bill (including Sub-total B)",null,null,null,null,null,{"$f":"ROUND(SUM(X49:X50),2)","v":64.56},null,null,null,{"$f":"ROUND(SUM(AB49:AB50),2)","v":67.709999999999994},null,3.1499999999999915,4.8791821561338156E-2]
[null,"Energy - RPP - Tier 1",null,null,null,7.4999999999999997E-2,0,{"$f":"G52*F52","v":0},null,7.4999999999999997E-2,0,{"$f":"K52*J52","v":0},null,0,""]
[null,"Energy - RPP - Tier 2",null,null,null,8.7999999999999995E-2,0,{"$f":"G53*F53","v":0},null,8.7999999999999995E-2,0,{"$f":"K53*J53","v":0},null,0,"",null,null,"Loss Factor (%)",null,null,null,{"$f":"'[4]Other Electriciy Rates-RD17'!$O$8-1","v":7.46E-2},null,null,null,{"$f":"'[4]Other Electriciy Rates-RD17'!$O$23-1","v":7.6600000000000001E-2}]
[null,"TOU - Off Peak",null,null,null,6.5000000000000002E-2,{"$f":"0.64*$F$16*(1+$F$71)","v":550.1952},35.762688000000004,null,6.5000000000000002E-2,{"$f":"0.64*$F$16*(1+$J$71)","v":551.2192},35.829248,null,6.6559999999995512E-2,1.8611576400519867E-3]
[null,"TOU - Mid Peak",null,null,null,0.1,{"$f":"0.18*$F$16*(1+$F$71)","v":154.7424},15.474240000000002,null,0.1,{"$f":"0.18*$F$16*(1+$J$71)","v":155.03039999999999},15.503039999999999,null,2.8799999999996828E-2,1.8611576400519073E-3,null,null,null,null,null,null,null,null,null,null,"TOU variance",null,null,null,0.13]
[null,"TOU - On Peak",null,null,null,0.11700000000000001,{"$f":"0.18*$F$16*(1+$F$71)","v":154.7424},18.104860800000001,null,0.11700000000000001,{"$f":"0.18*$F$16*(1+$J$71)","v":155.03039999999999},18.1385568,null,3.369599999999906E-2,1.8611576400520604E-3,null,null,null,null,null,null,null,null,null,null,"OCEB",null,null,null,-0.31]
[]
[null,"Total Bill on RPP (before Taxes)",null,null,null,null,null,{"$f":"SUM(H47:H53)","v":57.128768000000008},null,null,null,{"$f":"SUM(L47:L53)","v":59.919844000000005},null,2.7910759999999968,4.8855875904763015E-2,null,null,null,null,null,null,null,null,null,null,"Total",null,null,null,{"$f":"SUM(AD51:AD56)","v":2.9699999999999913}]
[null,"HST",null,null,null,0.13,null,{"$f":"H58*F59","v":7.4267398400000015},null,0.13,null,{"$f":"L58*J59","v":7.7895797200000008},null,{"$f":"L59-H59","v":0.36283987999999923},{"$f":"IF((H59)=0,\"\",(N59/H59))","v":4.8855875904762966E-2}]
[null,"Total Bill (including HST)",null,null,null,null,null,{"$f":"H58+H59","v":64.555507840000004},null,null,null,{"$f":"L58+L59","v":67.709423720000004},null,{"$f":"L60-H60","v":3.1539158799999996},{"$f":"IF((H60)=0,\"\",(N60/H60))","v":4.885587590476307E-2}]
[null,"Ontario Clean Energy Benefit 1",null,null,null,null,null,{"$f":"ROUND(-H60*10%,2)","v":-6.46},null,null,null,{"$f":"ROUND(-L60*10%,2)","v":-6.77},null,{"$f":"L61-H61","v":-0.30999999999999961},{"$f":"IF((H61)=0,\"\",(N61/H61))","v":4.7987616099071144E-2}]
[null,"Total Bill on RPP (including OCEB)",null,null,null,null,null,{"$f":"SUM(H60:H61)","v":58.095507840000003},null,null,null,{"$f":"SUM(L60:L61)","v":60.939423720000008},null,2.8439158800000044,4.8952423100119755E-2]
[]
[null,"Total Bill on TOU (before Taxes)",null,null,null,null,null,{"$f":"SUM(H47:H51,H54:H56)","v":126.47055680000001},null,null,null,{"$f":"SUM(L47:L51,L54:L56)","v":129.39068879999999},null,{"$f":"L64-H64","v":2.9201319999999811},{"$f":"IF((H64)=0,\"\",(N64/H64))","v":2.3089421553016999E-2}]
[null,"HST",null,null,null,0.13,null,{"$f":"H64*F65","v":16.441172384000001},null,0.13,null,{"$f":"L64*J65","v":16.820789544},null,0.37961715999999868,2.3089421553017069E-2]
[null,"Total Bill (including HST)",null,null,null,null,null,{"$f":"H64+H65","v":142.91172918400002},null,null,null,{"$f":"L64+L65","v":146.211478344},null,3.2997491599999762,2.3089421553016982E-2]
[null,"Ontario Clean Energy Benefit 1",null,null,null,null,null,{"$f":"ROUND(-H66*10%,2)","v":-14.29},null,null,null,{"$f":"ROUND(-L66*10%,2)","v":-14.62},null,-0.33000000000000007,2.3093072078376492E-2]
[null,"Total Bill on TOU (including OCEB)",null,null,null,null,null,{"$f":"H66+H67","v":128.62172918400003},null,null,null,{"$f":"L66+L67","v":131.591478344},null,2.9697491599999637,2.3089015976076516E-2]
[]
[]
[null,"Loss Factor (%)",null,null,null,{"$f":"V53","v":7.46E-2},null,null,null,{"$f":"Z53","v":7.6600000000000001E-2}]
[]
["1 Applicable to eligible customers only.  Refer to the Ontario Clean Energy Benefit Act, 2010."]
[]
["Note that the \"Charge $\" columns provide breakdowns of the amounts that each bill component contributes to the total monthly bill at the referenced "]
["consumption level at existing and proposed rates."]
[]
["Applicants must provide bill impacts for residential at 800 kWh and GS<50kW at 2000 kWh. In addition, their filing should cover the range that is relevant"]
["to their service territory, class by class. A general guideline of consumption levels follows:"]
[]
["Residential (kWh) - 100, 250, 500, 800, 1000, 1500, 2000"]
["GS<50kW (kWh) - 1000, 2000, 5000, 10000, 15000"]
["GS>50kW (kW) - 60, 100, 500, 1000"]
["Large User - range appropriate for utility"]
["Lighting Classes and USL - 150 kWh and 1 kW, range appropriate for utility."]

{"sheet":"App.2.W_GS.50 Impacts","index":34,"n_rows":127,"n_cols":15,"rows_kept":127,"cut":false,"hidden":false,"merged":[[92,3,93,3],[92,13,93,13],[92,14,93,14],[18,3,19,3],[18,13,19,13],[18,14,19,14],[60,1,60,3],[61,1,61,3],[66,1,66,3],[67,1,67,3],[87,3,87,14],[91,5,91,7],[91,9,91,11],[91,13,91,14],[2,0,2,10],[9,1,9,14],[10,1,10,14],[13,3,13,14],[17,5,17,7],[17,9,17,11],[17,13,17,14]]}
[null,null,null,null,null,null,null,null,null,null,null,null,null,"File Number:",{"$f":"'LDC Info'!$E$18","v":"EB-2012-0139"}]
[null,null,null,null,null,null,null,null,null,null,null,null,null,"Exhibit:",8]
[null,null,null,null,null,null,null,null,null,null,null,null,null,"Tab:"]
[null,null,null,null,null,null,null,null,null,null,null,null,null,"Schedule:",9]
[null,null,null,null,null,null,null,null,null,null,null,null,null,"Page:"]
[]
[null,null,null,null,null,null,null,null,null,null,null,null,null,"Date:","2012-09-10"]
[]
[]
[null,"Appendix 2-W"]
[null,"Bill Impacts"]
[]
[]
[null,"Customer Class:",null,"GS> 50 kW"]
[]
[null,null,null,"Consumption",null,2000," kWh"]
[]
[null,null,null,null,null,"Current Board-Approved",null,null,null,"Proposed",null,null,null,"Impact"]
[null,null,null,"Charge Unit",null,"Rate","Volume","Charge",null,"Rate","Volume","Charge",null,"$ Change","% Change"]
[null,null,null,null,null,"($)",null,"($)",null,"($)",null,"($)"]
[null,"Monthly Service Charge",null,"Monthly",null,{"$f":"F95","v":35.18},1,{"$f":"G21*F21","v":35.18},null,{"$f":"J95","v":33.840000000000003},1,{"$f":"K21*J21","v":33.840000000000003},null,{"$f":"L21-H21","v":-1.3399999999999963},{"$f":"IF((H21)=0,\"\",(N21/H21))","v":-3.8089823763501882E-2}]
[null,"Smart Meter Disposition Rider",null,"Monthly",null,{"$f":"F96","v":0.92},1,{"$f":"G22*F22","v":0.92},null,{"$f":"J96","v":0.92},1,{"$f":"K22*J22","v":0.92},null,{"$f":"L22-H22","v":0},{"$f":"IF((H22)=0,\"\",(N22/H22))","v":0}]
[null,"Stranded Meter Rider",null,"Monthly",null,0,1,0,null,{"$f":"J108","v":3.53},1,{"$f":"K23*J23","v":3.53},null,{"$f":"L23-H23","v":3.53},{"$f":"IF((H23)=0,\"\",(N23/H23))","v":""}]
[null,"SMIRR",null,"Monthly",null,{"$f":"F97","v":6.33},1,6.33,null,0,1,0,null,-6.33,-1]
[null,"GEA Rate Adder",null,"Monthly",null,0,1,0,null,{"$f":"J98","v":0.52329999999999999},1,0.52329999999999999,null,0.52329999999999999,""]
[null,null,null,null,null,null,1,0,null,null,1,0,null,0,""]
[null,"Distribution Volumetric Rate",null,"per kWh",null,{"$f":"F101","v":8.6E-3},{"$f":"$F$16","v":2000},17.2,null,{"$f":"J101","v":8.3000000000000001E-3},{"$f":"$F$16","v":2000},16.600000000000001,null,-0.59999999999999787,-3.4883720930232433E-2]
[null,"LRAM & SSM Rate Rider",null,"Monthly",null,0,{"$f":"$F$16","v":2000},0,null,0,{"$f":"$F$16","v":2000},0,null,0,""]
[null,null,null,null,null,null,{"$f":"$F$16","v":2000},0,null,null,2000,0,null,0,""]
[null,null,null,null,null,null,{"$f":"$F$16","v":2000},0,null,null,2000,0,null,0,""]
[null,null,null,null,null,null,2000,0,null,null,2000,0,null,0,""]
[null,null,null,null,null,null,2000,0,null,null,2000,0,null,0,""]
[null,null,null,null,null,null,2000,0,null,null,2000,0,null,0,""]
[null,null,null,null,null,null,2000,0,null,null,2000,0,null,0,""]
[null,null,null,null,null,null,2000,0,null,null,2000,0,null,0,""]
[null,null,null,null,null,null,2000,0,null,null,2000,0,null,0,""]
[null,"Sub-Total A",null,null,null,null,null,{"$f":"SUM(H21:H36)","v":59.629999999999995},null,null,null,{"$f":"SUM(L21:L36)","v":55.413300000000007},null,-4.2166999999999888,-7.0714405500586774E-2]
[null,"Deferral/Variance Account Disposition Rate Rider ",null,"per kWh",null,{"$f":"F107","v":-2.5999999999999999E-3},{"$f":"$F$16","v":2000},{"$f":"G38*F38","v":-5.2},null,{"$f":"J107","v":6.9999999999999988E-4},{"$f":"$F$16","v":2000},{"$f":"K38*J38","v":1.3999999999999997},null,{"$f":"L38-H38","v":6.6},{"$f":"IF((H38)=0,\"\",(N38/H38))","v":-1.2692307692307692}]
[null,null,null,null,null,null,{"$f":"$F$16","v":2000},{"$f":"G39*F39","v":0},null,null,{"$f":"$F$16","v":2000},{"$f":"K39*J39","v":0},null,{"$f":"L39-H39","v":0},{"$f":"IF((H39)=0,\"\",(N39/H39))","v":""}]
[null,null,null,null,null,null,2000,0,null,null,2000,0,null,0,""]
[null,null,null,null,null,null,2000,0,null,null,2000,0,null,0,""]
[null,"Low Voltage Service Charge",null,"per kWh",null,{"$f":"F102","v":2E-3},2000,{"$f":"G42*F42","v":4},null,{"$f":"J102","v":2.0999999999999999E-3},2000,{"$f":"K42*J42","v":4.2},null,{"$f":"L42-H42","v":0.20000000000000018},{"$f":"IF((H42)=0,\"\",(N42/H42))","v":5.0000000000000044E-2}]
[null,"Smart Meter Entity Charge",null,null,null,null,null,null,null,null,2000,{"$f":"K43*J43","v":0},null,{"$f":"L43-H43","v":0}]
[null,"Sub-Total B - Distribution (includes Sub-Total A)",null,null,null,null,null,{"$f":"SUM(H38:H42)+H37","v":58.429999999999993},null,null,null,{"$f":"SUM(L38:L42)+L37","v":61.013300000000008},null,{"$f":"L44-H44","v":2.5833000000000155},{"$f":"IF((H44)=0,\"\",(N44/H44))","v":4.4211877460209069E-2}]
[null,"RTSR - Network",null,null,null,{"$f":"F113","v":4.7000000000000002E-3},{"$f":"F16*(1+F71)","v":2149.1999999999998},{"$f":"G45*F45","v":10.101239999999999},null,{"$f":"J113","v":4.5999999999999999E-3},{"$f":"F16*(1+J71)","v":2153.1999999999998},{"$f":"K45*J45","v":9.9047199999999993},null,-0.19651999999999958,-1.9455037203353214E-2]
[null,"RTSR - Line and Transformation Connection",null,null,null,{"$f":"F114","v":3.8E-3},{"$f":"G45","v":2149.1999999999998},{"$f":"G46*F46","v":8.1669599999999996},null,{"$f":"J114","v":3.7000000000000002E-3},{"$f":"K45","v":2153.1999999999998},{"$f":"K46*J46","v":7.9668399999999995},null,-0.20012000000000008,-2.450360966626506E-2]
[null,"Sub-Total C - Delivery (including Sub-Total B)",null,null,null,null,null,{"$f":"SUM(H44:H46)","v":76.6982},null,null,null,{"$f":"SUM(L44:L46)","v":78.884860000000018},null,2.1866600000000176,2.8509925917427237E-2]
[null,"Wholesale Market Service Charge (WMSC)",null,"per kWh",null,{"$f":"F116","v":5.1999999999999998E-3},{"$f":"G46","v":2149.1999999999998},{"$f":"G48*F48","v":11.175839999999999},null,{"$f":"J116","v":5.1999999999999998E-3},{"$f":"K46","v":2153.1999999999998},{"$f":"K48*J48","v":11.196639999999999},null,2.0799999999999486E-2,1.8611576400520665E-3]
[null,"Rural and Remote Rate Protection (RRRP)",null,"per kWh",null,{"$f":"F117","v":1.1000000000000001E-3},{"$f":"G46","v":2149.1999999999998},2.3641199999999998,null,{"$f":"J117","v":1.1000000000000001E-3},{"$f":"K46","v":2153.1999999999998},2.3685199999999997,null,4.3999999999999595E-3,1.8611576400520955E-3]
[null,"Standard Supply Service Charge",null,"Monthly",null,{"$f":"F118","v":0.25},"1900-01-01",0.25,null,{"$f":"J118","v":0.25},"1900-01-01",0.25,null,0,0]
[null,"Debt Retirement Charge (DRC)",null,"per kWh",null,{"$f":"F119","v":7.0000000000000001E-3},{"$f":"G49","v":2149.1999999999998},15.0444,null,{"$f":"J119","v":7.0000000000000001E-3},{"$f":"K49","v":2153.1999999999998},15.072399999999998,null,2.7999999999998693E-2,1.8611576400520255E-3]
[null,"Energy - RPP - Tier 1",null,null,null,7.4999999999999997E-2,0,{"$f":"G52*F52","v":0},null,7.4999999999999997E-2,0,{"$f":"K52*J52","v":0},null,0,""]
[null,"Energy - RPP - Tier 2",null,null,null,8.7999999999999995E-2,0,{"$f":"G53*F53","v":0},null,8.7999999999999995E-2,0,{"$f":"K53*J53","v":0},null,0,""]
[null,"TOU - Off Peak",null,null,null,6.5000000000000002E-2,{"$f":"0.64*$F$16*(1+$F$71)","v":1375.4880000000001},89.406720000000007,null,6.5000000000000002E-2,{"$f":"0.64*$F$16*(1+$J$71)","v":1378.048},89.573120000000003,null,0.16639999999999588,1.8611576400520663E-3]
[null,"TOU - Mid Peak",null,null,null,0.1,{"$f":"0.18*$F$16*(1+$F$71)","v":386.85599999999999},38.685600000000001,null,0.1,{"$f":"0.18*$F$16*(1+$J$71)","v":387.57600000000002},38.757600000000004,null,7.2000000000002728E-2,1.8611576400521829E-3]
[null,"TOU - On Peak",null,null,null,0.11700000000000001,{"$f":"0.18*$F$16*(1+$F$71)","v":386.85599999999999},45.262152,null,0.11700000000000001,{"$f":"0.18*$F$16*(1+$J$71)","v":387.57600000000002},45.346392000000009,null,8.4240000000008308E-2,1.8611576400522959E-3]
[]
[null,"Total Bill on RPP (before Taxes)",null,null,null,null,null,{"$f":"SUM(H47:H53)","v":105.53255999999999},null,null,null,{"$f":"SUM(L47:L53)","v":107.77242000000003},null,2.2398600000000357,2.1224350096311847E-2]
[null,"HST",null,null,null,0.13,null,{"$f":"H58*F59","v":13.719232799999999},null,0.13,null,{"$f":"L58*J59","v":14.010414600000004},null,0.29118180000000571,2.1224350096311927E-2]
[null,"Total Bill (including HST)",null,null,null,null,null,{"$f":"H58+H59","v":119.25179279999999},null,null,null,{"$f":"L58+L59","v":121.78283460000003},null,2.5310418000000396,2.1224350096311843E-2]
[null,"Ontario Clean Energy Benefit 1",null,null,null,null,null,{"$f":"ROUND(-H60*10%,2)","v":-11.93},null,null,null,{"$f":"ROUND(-L60*10%,2)","v":-12.18},null,-0.25,2.0955574182732608E-2]
[null,"Total Bill on RPP (including OCEB)",null,null,null,null,null,{"$f":"SUM(H60:H61)","v":107.3217928},null,null,null,{"$f":"SUM(L60:L61)","v":109.60283460000002},null,2.2810418000000254,2.1254227501127109E-2]
[]
[null,"Total Bill on TOU (before Taxes)",null,null,null,null,null,{"$f":"SUM(H47:H51,H54:H56)","v":278.88703199999998},null,null,null,{"$f":"SUM(L47:L51,L54:L56)","v":281.44953200000003},null,{"$f":"L64-H64","v":2.5625000000000568},{"$f":"IF((H64)=0,\"\",(N64/H64))","v":9.1883081892458057E-3}]
[null,"HST",null,null,null,0.13,null,{"$f":"H64*F65","v":36.255314159999998},null,0.13,null,{"$f":"L64*J65","v":36.588439160000007},null,0.33312500000000966,9.1883081892458682E-3]
[null,"Total Bill (including HST)",null,null,null,null,null,{"$f":"H64+H65","v":315.14234615999999},null,null,null,{"$f":"L64+L65","v":318.03797116000004},null,2.8956250000000523,9.1883081892457676E-3]
[null,"Ontario Clean Energy Benefit 1",null,null,null,null,null,{"$f":"ROUND(-H66*10%,2)","v":-31.51},null,null,null,{"$f":"ROUND(-L66*10%,2)","v":-31.8},null,-0.28999999999999915,9.203427483338595E-3]
[null,"Total Bill on TOU (including OCEB)",null,null,null,null,null,{"$f":"H66+H67","v":283.63234616},null,null,null,{"$f":"L66+L67","v":286.23797116000003},null,2.6056250000000318,9.1866285184912279E-3]
[]
[]
[null,"Loss Factor (%)",null,null,null,7.46E-2,null,null,null,7.6600000000000001E-2]
[]
["1 Applicable to eligible customers only.  Refer to the Ontario Clean Energy Benefit Act, 2010."]
[]
["Note that the \"Charge $\" columns provide breakdowns of the amounts that each bill component contributes to the total monthly bill at the referenced "]
["consumption level at existing and proposed rates."]
[]
["Applicants must provide bill impacts for residential at 800 kWh and GS<50kW at 2000 kWh. In addition, their filing should cover the range that is relevant"]
["to their service territory, class by class. A general guideline of consumption levels follows:"]
[]
["Residential (kWh) - 100, 250, 500, 800, 1000, 1500, 2000"]
["GS<50kW (kWh) - 1000, 2000, 5000, 10000, 15000"]
["GS>50kW (kW) - 60, 100, 500, 1000"]
["Large User - range appropriate for utility"]
["Lighting Classes and USL - 150 kWh and 1 kW, range appropriate for utility."]
[]
[]
[null,"Customer Class:",null,"General Service < 50"]
[]
[null,null,null,"Consumption",null,2000," kWh"]
[]
[null,null,null,null,null,"Current Board-Approved",null,null,null,"Proposed",null,null,null,"Impact"]
[null,null,null,"Charge Unit",null,"Rate","Volume","Charge",null,"Rate","Volume","Charge",null,"$ Change","% Change"]
[null,null,null,null,null,"($)",null,"($)",null,"($)",null,"($)"]
[null,"Monthly Service Charge",null,"monthly",null,{"$f":"+'[4]2012 Existing Rates-RD4'!$C$7","v":35.18},1,{"$f":"G95*F95","v":35.18},null,{"$f":"+'[4]Rate Schedule (Part 1)-RD13'!$E$19","v":33.840000000000003},1,{"$f":"K95*J95","v":33.840000000000003},null,{"$f":"L95-H95","v":-1.3399999999999963},{"$f":"IF((H95)=0,\"\",(N95/H95))","v":-3.8089823763501882E-2}]
[null,"Smart Meter Disposition Rider",null,"monthly",null,{"$f":"+'[4]2012 Existing Rates-RD4'!$B$44","v":0.92},1,0.92,null,{"$f":"F96","v":0.92},1,0.92,null,0,0]
[null,"Smart Meter Inc Rev Req Rider",null,"monthly",null,{"$f":"'[4]2012 Existing Rates-RD4'!$C$44","v":6.33},1,6.33,null,null,1,0,null,-6.33,-1]
[null,"GEA Rate Adder/Rider",null,"monthly",null,null,1,0,null,{"$f":"'[4]Rate Schedule (Part 1)-RD13'!$E$23","v":0.52329999999999999},1,0.52329999999999999,null,0.52329999999999999,""]
[null,"Service Charge Rate Adder(s)",null,null,null,null,1,0,null,null,1,0,null,0,""]
[null,"Service Charge Rate Rider(s)",null,null,null,null,1,0,null,null,1,0,null,0,""]
[null,"Distribution Volumetric Rate",null,"per kWh",null,{"$f":"+'[4]2012 Existing Rates-RD4'!$B$69","v":8.6E-3},{"$f":"F90","v":2000},17.2,null,{"$f":"+'[4]Rate Schedule (Part 1)-RD13'!$E$20","v":8.3000000000000001E-3},{"$f":"F90","v":2000},16.600000000000001,null,-0.59999999999999787,-3.4883720930232433E-2]
[null,"Low Voltage Rate Adder",null,"per kWh",null,{"$f":"+'[4]2012 Existing Rates-RD4'!$B$32","v":2E-3},{"$f":"G101","v":2000},4,null,{"$f":"+'[4]Rate Schedule (Part 1)-RD13'!$E$21","v":2.0999999999999999E-3},{"$f":"K101","v":2000},4.2,null,0.20000000000000018,5.0000000000000044E-2]
[null,"Volumetric Rate Adder(s)",null,null,null,null,2000,0,null,null,2000,0,null,{"$f":"L103-H103","v":0},{"$f":"IF((H103)=0,\"\",(N103/H103))","v":""}]
[null,"Volumetric Rate Rider(s)",null,null,null,null,2000,0,null,null,2000,0,null,{"$f":"L104-H104","v":0},{"$f":"IF((H104)=0,\"\",(N104/H104))","v":""}]
[null,"Smart Meter Disposition Rider",null,null,null,null,2000,0,null,null,2000,0,null,{"$f":"L105-H105","v":0},{"$f":"IF((H105)=0,\"\",(N105/H105))","v":""}]
[null,"LRAM & SSM Rate Rider",null,"per kWh",null,{"$f":"'[4]2012 Existing Rates-RD4'!$B$56","v":0},2000,0,null,{"$f":"'[4]Rate Schedule (Part 1)-RD13'!$E$22","v":0},2000,0,null,{"$f":"L106-H106","v":0},{"$f":"IF((H106)=0,\"\",(N106/H106))","v":""}]
[null,"Deferral/Variance Account Disposition Rate Rider",null,"per kWh",null,{"$f":"+'[4]2012 Existing Rates-RD4'!$B$20","v":-2.5999999999999999E-3},2000,-5.2,null,{"$f":"+'[4]Rate Schedule (Part 1)-RD13'!$E$25","v":6.9999999999999988E-4},2000,1.3999999999999997,null,6.6,-1.2692307692307692]
[null,"Stranded meter Rider",null,"monthly",null,null,null,0,null,{"$f":"'[4]Rate Schedule (Part 1)-RD13'!$E$24","v":3.53},1,3.53,null,3.53,""]
[null,null,null,null,null,null,null,0,null,null,null,0,null,0,""]
[null,null,null,null,null,null,null,0,null,null,null,0,null,0,""]
[null,null,null,null,null,null,null,0,null,null,null,0,null,0,""]
[null,"Sub-Total A - Distribution",null,null,null,null,null,{"$f":"SUM(H95:H111)","v":58.429999999999993},null,null,null,{"$f":"SUM(L95:L111)","v":61.013300000000008},null,2.5833000000000155,4.4211877460209069E-2]
[null,"RTSR - Network",null,"per kWh",null,{"$f":"'[4]Other Electriciy Rates-RD17'!$B$9","v":4.7000000000000002E-3},{"$f":"F90*(1+F127)","v":2149.1999999999998},{"$f":"G113*F113","v":10.101239999999999},null,{"$f":"'[4]Other Electriciy Rates-RD17'!$B$24","v":4.5999999999999999E-3},{"$f":"F90*(1+J127)","v":2153.1999999999998},{"$f":"K113*J113","v":9.9047199999999993},null,-0.19651999999999958,-1.9455037203353214E-2]
[null,"RTSR - Line and Transformation Connection",null,"per kWh",null,{"$f":"'[4]Other Electriciy Rates-RD17'!$C$9","v":3.8E-3},{"$f":"G113","v":2149.1999999999998},{"$f":"G114*F114","v":8.1669599999999996},null,{"$f":"'[4]Other Electriciy Rates-RD17'!$C$24","v":3.7000000000000002E-3},{"$f":"K113","v":2153.1999999999998},{"$f":"K114*J114","v":7.9668399999999995},null,-0.20012000000000008,-2.450360966626506E-2]
[null,"Sub-Total B - Delivery (including Sub-Total A)",null,null,null,null,null,{"$f":"SUM(H112:H114)","v":76.6982},null,null,null,{"$f":"SUM(L112:L114)","v":78.884860000000018},null,2.1866600000000176,2.8509925917427237E-2]
[null,"Wholesale Market Service Charge (WMSC)",null,"per kWh",null,{"$f":"'[4]Other Electriciy Rates-RD17'!$D$9","v":5.1999999999999998E-3},{"$f":"G114","v":2149.1999999999998},{"$f":"G116*F116","v":11.175839999999999},null,{"$f":"'[4]Other Electriciy Rates-RD17'!$D$24","v":5.1999999999999998E-3},{"$f":"K114","v":2153.1999999999998},{"$f":"K116*J116","v":11.196639999999999},null,2.0799999999999486E-2,1.8611576400520665E-3]
[null,"Rural and Remote Rate Protection (RRRP)",null,"per kWh",null,{"$f":"'[4]Other Electriciy Rates-RD17'!$E$9","v":1.1000000000000001E-3},{"$f":"G114","v":2149.1999999999998},2.3641199999999998,null,{"$f":"'[4]Other Electriciy Rates-RD17'!$E$24","v":1.1000000000000001E-3},{"$f":"K114","v":2153.1999999999998},2.3685199999999997,null,4.3999999999999595E-3,1.8611576400520955E-3]
[null,"Standard Supply Service Charge",null,"monthly",null,0.25,1,0.25,null,0.25,1,0.25,null,0,0]
[null,"Debt Retirement Charge (DRC)",null,"per kWh",null,{"$f":"'[4]Other Electriciy Rates-RD17'!$F$9","v":7.0000000000000001E-3},{"$f":"+$H90","v":0},0,null,{"$f":"'[4]Other Electriciy Rates-RD17'!$F$24","v":7.0000000000000001E-3},{"$f":"+$H90","v":0},0,null,0,""]
[null,"Energy",null,null,null,null,null,0,null,null,null,0,null,0,""]
[null,"Energy First Block",null,"per kWh",null,{"$f":"+'[4]Other Electriciy Rates-RD17'!$M$9","v":7.4999999999999997E-2},600,45,null,{"$f":"+'[4]Other Electriciy Rates-RD17'!$M$24","v":7.4999999999999997E-2},600,45,null,0,0]
[null,"Energy Second Block",null,null,null,{"$f":"+'[4]Other Electriciy Rates-RD17'!$N$9","v":8.7999999999999995E-2},{"$f":"IF($H90*(1+$H127)>600,$H90*(1+$H127)-$I121,0)","v":0},0,null,{"$f":"+'[4]Other Electriciy Rates-RD17'!$N$24","v":8.7999999999999995E-2},474.6,41.764800000000001,null,41.764800000000001,""]
[null,"Total Bill (before Taxes)",null,null,null,null,null,{"$f":"SUM(H115:H122)","v":135.48815999999999},null,null,null,{"$f":"SUM(L115:L122)","v":179.46482000000003},null,43.976660000000038,0.32457935807822647]
[null,"HST",null,null,null,0.13,null,{"$f":"H123*F124","v":17.613460799999999},null,0.13,null,{"$f":"L123*J124","v":23.330426600000006},null,5.7169658000000076,0.32457935807822663]
[null,"Total Bill (including Sub-total B)",null,null,null,null,null,{"$f":"ROUND(SUM(H123:H124),2)","v":153.1},null,null,null,{"$f":"ROUND(SUM(L123:L124),2)","v":202.8},null,49.700000000000017,0.32462442847811901]
[]
[null,"Loss Factor (%)",null,null,null,{"$f":"'[4]Other Electriciy Rates-RD17'!$O$9-1","v":7.46E-2},null,null,null,{"$f":"'[4]Other Electriciy Rates-RD17'!$O$24-1","v":7.6600000000000001E-2}]

{"sheet":"App.2.W_GS<50 -4999 Impacts","index":35,"n_rows":53,"n_cols":15,"rows_kept":53,"cut":false,"hidden":false,"merged":[[48,1,48,3],[49,1,49,3],[1,3,1,14],[5,5,5,7],[5,9,5,11],[5,13,5,14],[6,3,7,3],[6,13,7,13],[6,14,7,14]]}
[]
[null,"Customer Class:",null,"General Service Greater Than 50KW"]
[]
[null,null,null,"Consumption",null,1095000," kWh",null,null,"Consumption",null,2500,"KW"]
[]
[null,null,null,null,null,"Current Board-Approved",null,null,null,"Proposed",null,null,null,"Impact"]
[null,null,null,"Charge Unit",null,"Rate","Volume","Charge",null,"Rate","Volume","Charge",null,"$ Change","% Change"]
[null,null,null,null,null,"($)",null,"($)",null,"($)",null,"($)"]
[null,"Monthly Service Charge",null,"Monthly",null,{"$f":"'[4]Appendix 2-V GS>50-4999-RD20'!$H$17","v":320.64},1,{"$f":"G9*F9","v":320.64},null,{"$f":"'[4]Appendix 2-V GS>50-4999-RD20'!$L$17","v":246.68},1,{"$f":"K9*J9","v":246.68},null,{"$f":"L9-H9","v":-73.95999999999998},{"$f":"IF((H9)=0,\"\",(N9/H9))","v":-0.23066367265469057}]
[null,"Smart Meter Rate Adder",null,null,null,null,1,{"$f":"G10*F10","v":0},null,null,1,{"$f":"K10*J10","v":0},null,{"$f":"L10-H10","v":0},{"$f":"IF((H10)=0,\"\",(N10/H10))","v":""}]
[null,"GEA Rate Adder",null,"Monthly",null,0,1,0,null,{"$f":"'[4]Appendix 2-V GS>50-4999-RD20'!$L$20","v":0.52329999999999999},1,{"$f":"K11*J11","v":0.52329999999999999},null,{"$f":"L11-H11","v":0.52329999999999999},{"$f":"IF((H11)=0,\"\",(N11/H11))","v":""}]
[null,null,null,null,null,null,1,0,null,null,1,0,null,0,""]
[null,null,null,null,null,null,1,0,null,null,1,0,null,0,""]
[null,null,null,null,null,null,1,0,null,null,1,0,null,0,""]
[null,"Distribution Volumetric Rate",null,"per kW",null,{"$f":"'[4]Appendix 2-V GS>50-4999-RD20'!$H$23","v":2.9750999999999999},{"$f":"+L4","v":2500},7437.75,null,{"$f":"'[4]Appendix 2-V GS>50-4999-RD20'!$L$23","v":2.3151999999999999},{"$f":"+G15","v":2500},5788,null,-1649.75,-0.22180767033040907]
[null,null,null,null,null,null,1,0,null,null,{"$f":"+G16","v":1},0,null,0,""]
[null,"LRAM & SSM Rate Rider",null,"per kW",null,0,{"$f":"+L4","v":2500},0,null,null,{"$f":"+G17","v":2500},0,null,0,""]
[null,null,null,null,null,null,1,0,null,null,{"$f":"+G18","v":1},0,null,0,""]
[null,null,null,null,null,null,null,0,null,null,null,0,null,0,""]
[null,null,null,null,null,null,null,0,null,null,null,0,null,0,""]
[null,null,null,null,null,null,null,0,null,null,null,0,null,0,""]
[null,null,null,null,null,null,null,0,null,null,null,0,null,0,""]
[null,null,null,null,null,null,null,0,null,null,null,0,null,0,""]
[null,null,null,null,null,null,null,0,null,null,null,0,null,0,""]
[null,"Sub-Total A",null,null,null,null,null,{"$f":"SUM(H9:H24)","v":7758.39},null,null,null,{"$f":"SUM(L9:L24)","v":6035.2033000000001},null,-1723.1867000000002,-0.22210622306947705]
[null,"Deferral/Variance Account Disposition Rate Rider",null,"per kW",null,{"$f":"'[4]Appendix 2-V GS>50-4999-RD20'!$H$29","v":-0.78600000000000003},{"$f":"+L4","v":2500},{"$f":"G26*F26","v":-1965},null,{"$f":"'[4]Appendix 2-V GS>50-4999-RD20'!$L$29","v":-1.4555},{"$f":"+L4","v":2500},{"$f":"K26*J26","v":-3638.75},null,-1673.75,0.85178117048346058]
[null,null,null,null,null,null,1,{"$f":"G27*F27","v":0},null,null,1,0,null,0,""]
[null,null,null,null,null,null,{"$f":"+L4","v":2500},{"$f":"G28*F28","v":0},null,null,{"$f":"+L4","v":2500},0,null,0,""]
[null,null,null,null,null,null,{"$f":"+L4","v":2500},{"$f":"G29*F29","v":0},null,null,{"$f":"+L4","v":2500},0,null,0,""]
[null,"Low Voltage Service Charge",null,"per kW",null,{"$f":"'[4]Appendix 2-V GS>50-4999-RD20'!$H$24","v":0.7883},{"$f":"+L4","v":2500},{"$f":"G30*F30","v":1970.75},null,{"$f":"'[4]Appendix 2-V GS>50-4999-RD20'!$L$24","v":0.75800000000000001},{"$f":"+L4","v":2500},1895,null,-75.75,-3.8437143219586453E-2]
[null,null,null,"Monthly",null,null,null,null,null,null,1,0,null,0,""]
[null,"Sub-Total B - Distribution (includes Sub-Total A)",null,null,null,null,null,{"$f":"SUM(H26:H30)+H25","v":7764.14},null,null,null,{"$f":"SUM(L26:L31)+L25","v":4291.4533000000001},null,-3472.6867000000002,-0.44727255046920844]
[null,"RTSR - Network",null,"per kW",null,{"$f":"'[4]Appendix 2-V GS>50-4999-RD20'!$H$35","v":1.9279999999999999},{"$f":"+L4","v":2500},{"$f":"G33*F33","v":4820},null,{"$f":"'[4]Appendix 2-V GS>50-4999-RD20'!$L$35","v":1.8708},{"$f":"+L4","v":2500},{"$f":"K33*J33","v":4677},null,-143,-2.9668049792531119E-2]
[null,"RTSR - Line and Transformation Connection",null,"per kW",null,{"$f":"'[4]Appendix 2-V GS>50-4999-RD20'!$H$36","v":1.4824999999999999},{"$f":"+L4","v":2500},{"$f":"G34*F34","v":3706.25},null,{"$f":"'[4]Appendix 2-V GS>50-4999-RD20'!$L$36","v":1.4516},{"$f":"+L4","v":2500},{"$f":"K34*J34","v":3629},null,-77.25,-2.0843170320404721E-2]
[null,"Sub-Total C - Delivery (including Sub-Total B)",null,null,null,null,null,{"$f":"SUM(H32:H34)","v":16290.39},null,null,null,{"$f":"SUM(L32:L34)","v":12597.453300000001},null,-3692.9366999999984,-0.22669418595871543]
[null,"Wholesale Market Service Charge (WMSC)",null,"per kWh",null,5.1999999999999998E-3,{"$f":"+F4*(1+F53)","v":1176687},{"$f":"G36*F36","v":6118.7723999999998},null,5.1999999999999998E-3,{"$f":"+F4*(1+J53)","v":1178877},{"$f":"K36*J36","v":6130.1603999999998},null,11.38799999999992,1.8611576400520994E-3]
[null,"Rural and Remote Rate Protection (RRRP)",null,"per kWh",null,{"$f":"+'[5]17. Other Electriciy Rates'!$E$10","v":1.1000000000000001E-3},{"$f":"F4*(1+F53)","v":1176687},1294.3557000000001,null,{"$f":"+'[5]17. Other Electriciy Rates'!$E$25","v":1.1000000000000001E-3},{"$f":"+F4*(1+J53)","v":1178877},1296.7647000000002,null,2.4090000000001055,1.8611576400521938E-3]
[null,"Standard Supply Service Charge",null,"Monthly",null,0.25,1,0.25,null,0.25,1,0.25,null,0,0]
[null,"Debt Retirement Charge (DRC)",null,"per kWh",null,{"$f":"+'[5]17. Other Electriciy Rates'!$F$10","v":7.0000000000000001E-3},{"$f":"G37","v":1176687},8236.8089999999993,null,{"$f":"+'[5]17. Other Electriciy Rates'!$F$25","v":7.0000000000000001E-3},{"$f":"K37","v":1178877},8252.139000000001,null,15.330000000001746,1.8611576400523245E-3]
[null,"Energy - RPP - Tier 1",null,null,null,7.4999999999999997E-2,null,0,null,7.4999999999999997E-2,null,0,null,0,""]
[null,"Energy - RPP - Tier 2",null,null,null,8.7999999999999995E-2,null,0,null,8.7999999999999995E-2,null,0,null,0,""]
[null,"Energy - Commodity COP",null,"per kWh",null,{"$f":"+'[5]17. Other Electriciy Rates'!$M$25","v":8.0689999999999998E-2},{"$f":"+G39","v":1176687},94946.874029999992,null,{"$f":"+F42","v":8.0689999999999998E-2},{"$f":"+K39","v":1178877},95123.585129999992,null,176.71110000000044,1.8611576400521172E-3]
[null," ",null,null,null,0.1,null,0,null,0.1,null,0,null,0,""]
[null," ",null,null,null,0.11700000000000001,null,0,null,0.11700000000000001,null,0,null,0,""]
[]
[null,"Total Bill on Commodity COP",null,null,null,null,null,{"$f":"SUM(H35:H39,H42:H44)","v":126887.45113},null,null,null,{"$f":"SUM(L35:L39,L42:L44)","v":123400.35253},null,{"$f":"L46-H46","v":-3487.0985999999975},{"$f":"IF((H46)=0,\"\",(N46/H46))","v":-2.7481824001865718E-2}]
[null,"HST",null,null,null,0.13,null,{"$f":"H46*F47","v":16495.368646900002},null,0.13,null,{"$f":"L46*J47","v":16042.045828900002},null,{"$f":"L47-H47","v":-453.32281800000055},{"$f":"IF((H47)=0,\"\",(N47/H47))","v":-2.748182400186577E-2}]
[null,"Total Bill (including HST)",null,null,null,null,null,{"$f":"H46+H47","v":143382.8197769},null,null,null,{"$f":"L46+L47","v":139442.39835890001},null,{"$f":"L48-H48","v":-3940.4214179999835},{"$f":"IF((H48)=0,\"\",(N48/H48))","v":-2.7481824001865624E-2}]
[null,"Ontario Clean Energy Benefit 1",null,null,null,null,null,{"$f":"ROUND(-H48*10%,2)","v":-14338.28},null,null,null,{"$f":"ROUND(-L48*10%,2)","v":-13944.24},null,{"$f":"L49-H49","v":394.04000000000087},{"$f":"IF((H49)=0,\"\",(N49/H49))","v":-2.7481678416100178E-2}]
[null,"Total Bill on TOU (including OCEB)",null,null,null,null,null,{"$f":"H48+H49","v":129044.5397769},null,null,null,{"$f":"L48+L49","v":125498.15835890001},null,{"$f":"L50-H50","v":-3546.3814179999899},{"$f":"IF((H50)=0,\"\",(N50/H50))","v":-2.7481840178059363E-2}]
[]
[]
[null,"Loss Factor (%)",null,null,null,7.46E-2,null,null,null,7.6600000000000001E-2]

{"sheet":"App.2.W_Sentinel Light Impacts","index":36,"n_rows":54,"n_cols":15,"rows_kept":54,"cut":false,"hidden":false,"merged":[[49,1,49,3],[50,1,50,3],[2,3,2,14],[6,5,6,7],[6,9,6,11],[6,13,6,14],[7,3,8,3],[7,13,8,13],[7,14,8,14]]}
[]
[]
[null,"Customer Class:",null,"Sentinel Lights"]
[]
[null,null,null,"Consumption",null,180," kWh",null,null,"Consumption",null,1,"KW"]
[]
[null,null,null,null,null,"Current Board-Approved",null,null,null,"Proposed",null,null,null,"Impact"]
[null,null,null,"Charge Unit",null,"Rate","Volume","Charge",null,"Rate","Volume","Charge",null,"$ Change","% Change"]
[null,null,null,null,null,"($)",null,"($)",null,"($)",null,"($)"]
[null,"Monthly Service Charge",null,"Monthly",null,{"$f":"'[4]Appendix 2-V Sentinel-RD24'!$H$17","v":7.64},3,{"$f":"G10*F10","v":22.919999999999998},null,{"$f":"'[4]Appendix 2-V Sentinel-RD24'!$L$17","v":9.0756999999999994},{"$f":"+G10","v":3},{"$f":"K10*J10","v":27.2271},null,{"$f":"L10-H10","v":4.3071000000000019},{"$f":"IF((H10)=0,\"\",(N10/H10))","v":0.18791884816753937}]
[null,"Smart Meter Rate Adder",null,null,null,null,1,{"$f":"G11*F11","v":0},null,null,1,{"$f":"K11*J11","v":0},null,{"$f":"L11-H11","v":0},{"$f":"IF((H11)=0,\"\",(N11/H11))","v":""}]
[null,null,null,null,null,null,1,0,null,null,1,{"$f":"K12*J12","v":0},null,{"$f":"L12-H12","v":0},{"$f":"IF((H12)=0,\"\",(N12/H12))","v":""}]
[null,null,null,null,null,null,1,0,null,null,1,0,null,0,""]
[null,null,null,null,null,null,1,0,null,null,1,0,null,0,""]
[null,null,null,null,null,null,1,0,null,null,1,0,null,0,""]
[null,"Distribution Volumetric Rate",null,"per kW",null,{"$f":"'[4]Appendix 2-V Sentinel-RD24'!$H$20","v":34.795099999999998},1,34.795099999999998,null,{"$f":"'[4]Appendix 2-V Sentinel-RD24'!$L$20","v":41.3339},{"$f":"+G16","v":1},41.3339,null,6.5388000000000019,0.18792301214826232]
[null,null,null,null,null,null,1,0,null,null,{"$f":"+G17","v":1},0,null,0,""]
[null,null,null,null,null,null,{"$f":"+L5","v":1},0,null,null,{"$f":"+G18","v":1},0,null,0,""]
[null,null,null,null,null,null,1,0,null,null,{"$f":"+G19","v":1},0,null,0,""]
[null,null,null,null,null,null,null,0,null,null,null,0,null,0,""]
[null,null,null,null,null,null,null,0,null,null,null,0,null,0,""]
[null,null,null,null,null,null,null,0,null,null,null,0,null,0,""]
[null,null,null,null,null,null,null,0,null,null,null,0,null,0,""]
[null,null,null,null,null,null,null,0,null,null,null,0,null,0,""]
[null,null,null,null,null,null,null,0,null,null,null,0,null,0,""]
[null,"Sub-Total A",null,null,null,null,null,{"$f":"SUM(H10:H25)","v":57.715099999999993},null,null,null,{"$f":"SUM(L10:L25)","v":68.561000000000007},null,10.845900000000015,0.18792135853528827]
[null,"Deferral/Variance Account Disposition Rate Rider",null,"per kW",null,{"$f":"'[4]Appendix 2-V Sentinel-RD24'!$H$26","v":-1.3065},{"$f":"+L5","v":1},{"$f":"G27*F27","v":-1.3065},null,{"$f":"'[4]Appendix 2-V Sentinel-RD24'!$L$26","v":0.6119},{"$f":"+L5","v":1},{"$f":"K27*J27","v":0.6119},null,1.9184000000000001,-1.4683505549177192]
[null,null,null,null,null,null,1,{"$f":"G28*F28","v":0},null,null,1,0,null,0,""]
[null,null,null,null,null,null,{"$f":"+L5","v":1},{"$f":"G29*F29","v":0},null,null,{"$f":"+L5","v":1},0,null,0,""]
[null,null,null,null,null,null,{"$f":"+L5","v":1},{"$f":"G30*F30","v":0},null,null,{"$f":"+L5","v":1},0,null,0,""]
[null,"Low Voltage Service Charge",null,"per kW",null,{"$f":"'[4]Appendix 2-V Sentinel-RD24'!$H$21","v":0.60650000000000004},{"$f":"+L5","v":1},{"$f":"G31*F31","v":0.60650000000000004},null,{"$f":"'[4]Appendix 2-V Sentinel-RD24'!$L$21","v":0.58589999999999998},{"$f":"+L5","v":1},0.58589999999999998,null,-2.0600000000000063E-2,-3.3965375103050387E-2]
[null,"Smart Meter Entity Charge",null,"Monthly",null,null,null,null,null,null,1,0,null,0,""]
[null,"Sub-Total B - Distribution (includes Sub-Total A)",null,null,null,null,null,{"$f":"SUM(H27:H31)+H26","v":57.01509999999999},null,null,null,{"$f":"SUM(L27:L32)+L26","v":69.758800000000008},null,12.743700000000018,0.22351447248185166]
[null,"RTSR - Network",null,"per kW",null,{"$f":"'[4]Appendix 2-V Sentinel-RD24'!$H$32","v":1.4614},{"$f":"+L5","v":1},{"$f":"G34*F34","v":1.4614},null,{"$f":"'[4]Appendix 2-V Sentinel-RD24'!$L$32","v":1.4179999999999999},{"$f":"+L5","v":1},{"$f":"K34*J34","v":1.4179999999999999},null,-4.3400000000000105E-2,-2.9697550294238474E-2]
[null,"RTSR - Line and Transformation Connection",null,"per kW",null,{"$f":"'[4]Appendix 2-V Sentinel-RD24'!$H$33","v":1.1698999999999999},{"$f":"+L5","v":1},{"$f":"G35*F35","v":1.1698999999999999},null,{"$f":"'[4]Appendix 2-V Sentinel-RD24'!$L$33","v":1.6635},{"$f":"+L5","v":1},{"$f":"K35*J35","v":1.6635},null,0.49360000000000004,0.42191640311137707]
[null,"Sub-Total C - Delivery (including Sub-Total B)",null,null,null,null,null,{"$f":"SUM(H33:H35)","v":59.646399999999986},null,null,null,{"$f":"SUM(L33:L35)","v":72.840300000000013},null,13.193900000000028,0.22120195015960781]
[null,"Wholesale Market Service Charge (WMSC)",null,"per kWh",null,{"$f":"+'[5]17. Other Electriciy Rates'!$D$14","v":5.1999999999999998E-3},{"$f":"+F5*(1+F54)","v":193.428},{"$f":"G37*F37","v":1.0058255999999999},null,{"$f":"+'[5]17. Other Electriciy Rates'!$D$29","v":5.1999999999999998E-3},{"$f":"+F5*(1+J54)","v":193.78800000000001},{"$f":"K37*J37","v":1.0076976},null,1.8720000000000958E-3,1.8611576400522079E-3]
[null,"Rural and Remote Rate Protection (RRRP)",null,"per kWh",null,{"$f":"+'[5]17. Other Electriciy Rates'!$E$14","v":1.1000000000000001E-3},{"$f":"F5*(1+F54)","v":193.428},0.21277080000000001,null,{"$f":"+'[5]17. Other Electriciy Rates'!$E$29","v":1.1000000000000001E-3},{"$f":"+F5*(1+J54)","v":193.78800000000001},0.21316680000000002,null,3.9600000000000746E-4,1.8611576400521474E-3]
[null,"Standard Supply Service Charge",null,"Monthly",null,0.25,1,0.25,null,0.25,1,0.25,null,0,0]
[null,"Debt Retirement Charge (DRC)",null,"per kWh",null,{"$f":"+'[5]17. Other Electriciy Rates'!$F$14","v":7.0000000000000001E-3},{"$f":"G38","v":193.428},1.353996,null,{"$f":"+'[5]17. Other Electriciy Rates'!$F$29","v":7.0000000000000001E-3},{"$f":"K38","v":193.78800000000001},1.3565160000000001,null,2.5200000000000777E-3,1.8611576400521699E-3]
[null,"Energy - RPP - Tier 1",null,null,null,7.4999999999999997E-2,null,0,null,7.4999999999999997E-2,null,0,null,0,""]
[null,"Energy - RPP - Tier 2",null,null,null,8.7999999999999995E-2,null,0,null,8.7999999999999995E-2,null,0,null,0,""]
[null,"Energy - Commodity COP",null,"per kWh",null,{"$f":"+'[5]17. Other Electriciy Rates'!$M$25","v":8.0689999999999998E-2},{"$f":"+G40","v":193.428},15.607705319999999,null,{"$f":"+F43","v":8.0689999999999998E-2},{"$f":"+K40","v":193.78800000000001},15.63675372,null,2.904840000000064E-2,1.8611576400521536E-3]
[null," ",null,null,null,0.1,null,0,null,0.1,null,0,null,0,""]
[null," ",null,null,null,0.11700000000000001,null,0,null,0.11700000000000001,null,0,null,0,""]
[]
[null,"Total Bill on Commodity COP",null,null,null,null,null,{"$f":"SUM(H36:H40,H43:H45)","v":78.076697719999984},null,null,null,{"$f":"SUM(L36:L40,L43:L45)","v":91.30443412000001},null,{"$f":"L47-H47","v":13.227736400000026},{"$f":"IF((H47)=0,\"\",(N47/H47))","v":0.1694197729447724}]
[null,"HST",null,null,null,0.13,null,{"$f":"H47*F48","v":10.149970703599998},null,0.13,null,{"$f":"L47*J48","v":11.869576435600003},null,{"$f":"L48-H48","v":1.7196057320000051},{"$f":"IF((H48)=0,\"\",(N48/H48))","v":0.16941977294477256}]
[null,"Total Bill (including HST)",null,null,null,null,null,{"$f":"H47+H48","v":88.226668423599989},null,null,null,{"$f":"L47+L48","v":103.17401055560001},null,{"$f":"L49-H49","v":14.947342132000017},{"$f":"IF((H49)=0,\"\",(N49/H49))","v":0.16941977294477226}]
[null,"Ontario Clean Energy Benefit 1",null,null,null,null,null,{"$f":"ROUND(-H49*10%,2)","v":-8.82},null,null,null,{"$f":"ROUND(-L49*10%,2)","v":-10.32},null,{"$f":"L50-H50","v":-1.5},{"$f":"IF((H50)=0,\"\",(N50/H50))","v":0.17006802721088435}]
[null,"Total Bill on TOU (including OCEB)",null,null,null,null,null,{"$f":"H49+H50","v":79.406668423599996},null,null,null,{"$f":"L49+L50","v":92.854010555600013},null,{"$f":"L51-H51","v":13.447342132000017},{"$f":"IF((H51)=0,\"\",(N51/H51))","v":0.16934776888339281}]
[]
[]
[null,"Loss Factor (%)",null,null,null,7.46E-2,null,null,null,7.6600000000000001E-2]

{"sheet":"App.2.W_Streetlight Impacts","index":37,"n_rows":54,"n_cols":15,"rows_kept":54,"cut":false,"hidden":false,"merged":[[2,3,2,14],[49,1,49,3],[50,1,50,3],[6,5,6,7],[6,9,6,11],[6,13,6,14],[7,3,8,3],[7,13,8,13],[7,14,8,14]]}
[]
[]
[null,"Customer Class:",null,"Streetlights"]
[]
[null,null,null,"Consumption",null,108831," kWh",null,null,"Consumption",null,37,"KW"]
[]
[null,null,null,null,null,"Current Board-Approved",null,null,null,"Proposed",null,null,null,"Impact"]
[null,null,null,"Charge Unit",null,"Rate","Volume","Charge",null,"Rate","Volume","Charge",null,"$ Change","% Change"]
[null,null,null,null,null,"($)",null,"($)",null,"($)",null,"($)"]
[null,"Monthly Service Charge",null,"Monthly",null,{"$f":"'[4]Appendix 2-V Streetlight-RD23'!$H$17","v":5.39},238,{"$f":"G10*F10","v":1282.82},null,{"$f":"'[4]Appendix 2-V Streetlight-RD23'!$L$17","v":6.4836},{"$f":"+G10","v":238},{"$f":"K10*J10","v":1543.0968},null,{"$f":"L10-H10","v":260.27680000000009},{"$f":"IF((H10)=0,\"\",(N10/H10))","v":0.20289424860853442}]
[null,"Smart Meter Rate Adder",null,null,null,null,1,{"$f":"G11*F11","v":0},null,null,1,{"$f":"K11*J11","v":0},null,{"$f":"L11-H11","v":0},{"$f":"IF((H11)=0,\"\",(N11/H11))","v":""}]
[null,null,null,null,null,null,1,0,null,null,1,{"$f":"K12*J12","v":0},null,{"$f":"L12-H12","v":0},{"$f":"IF((H12)=0,\"\",(N12/H12))","v":""}]
[null,null,null,null,null,null,1,0,null,null,1,0,null,0,""]
[null,null,null,null,null,null,1,0,null,null,1,0,null,0,""]
[null,null,null,null,null,null,1,0,null,null,1,0,null,0,""]
[null,"Distribution Volumetric Rate",null,"per kW",null,{"$f":"'[4]Appendix 2-V Streetlight-RD23'!$H$20","v":37.306100000000001},{"$f":"+L5","v":37},1380.3257000000001,null,{"$f":"'[4]Appendix 2-V Streetlight-RD23'!$L$20","v":44.875500000000002},{"$f":"+G16","v":37},1660.3935000000001,null,280.06780000000003,0.20289979386749085]
[null,null,null,null,null,null,1,0,null,null,{"$f":"+G17","v":1},0,null,0,""]
[null,null,null,null,null,null,{"$f":"+L5","v":37},0,null,null,{"$f":"+G18","v":37},0,null,0,""]
[null,null,null,null,null,null,1,0,null,null,{"$f":"+G19","v":1},0,null,0,""]
[null,null,null,null,null,null,null,0,null,null,null,0,null,0,""]
[null,null,null,null,null,null,null,0,null,null,null,0,null,0,""]
[null,null,null,null,null,null,null,0,null,null,null,0,null,0,""]
[null,null,null,null,null,null,null,0,null,null,null,0,null,0,""]
[null,null,null,null,null,null,null,0,null,null,null,0,null,0,""]
[null,null,null,null,null,null,null,0,null,null,null,0,null,0,""]
[null,"Sub-Total A",null,null,null,null,null,{"$f":"SUM(H10:H25)","v":2663.1457},null,null,null,{"$f":"SUM(L10:L25)","v":3203.4903000000004},null,540.34460000000036,0.20289712275224009]
[null,"Deferral/Variance Account Disposition Rate Rider",null,"per kW",null,{"$f":"'[4]Appendix 2-V Streetlight-RD23'!$H$26","v":-0.95489999999999997},{"$f":"+L5","v":37},{"$f":"G27*F27","v":-35.331299999999999},null,{"$f":"'[4]Appendix 2-V Streetlight-RD23'!$L$26","v":-1.6040999999999999},{"$f":"+L5","v":37},{"$f":"K27*J27","v":-59.351699999999994},null,-24.020399999999995,0.67986176562990874]
[null,null,null,null,null,null,1,{"$f":"G28*F28","v":0},null,null,1,0,null,0,""]
[null,null,null,null,null,null,{"$f":"+L5","v":37},{"$f":"G29*F29","v":0},null,null,{"$f":"+L5","v":37},0,null,0,""]
[null,null,null,null,null,null,{"$f":"+L5","v":37},{"$f":"G30*F30","v":0},null,null,{"$f":"+L5","v":37},0,null,0,""]
[null,"Low Voltage Service Charge",null,"per kW",null,{"$f":"'[4]Appendix 2-V Streetlight-RD23'!$H$21","v":1.6331},{"$f":"+L5","v":37},{"$f":"G31*F31","v":60.424700000000001},null,{"$f":"'[4]Appendix 2-V Streetlight-RD23'!$L$21","v":0.86870000000000003},{"$f":"+L5","v":37},32.1419,null,-28.282800000000002,-0.46806686669524217]
[null,"Smart Meter Entity Charge",null,"Monthly",null,null,null,null,null,null,1,0,null,0,""]
[null,"Sub-Total B - Distribution (includes Sub-Total A)",null,null,null,null,null,{"$f":"SUM(H27:H31)+H26","v":2688.2391000000002},null,null,null,{"$f":"SUM(L27:L32)+L26","v":3176.2805000000003},null,488.04140000000007,0.18154687207696668]
[null,"RTSR - Network",null,"per kW",null,{"$f":"'[4]Appendix 2-V Streetlight-RD23'!$H$32","v":1.454},{"$f":"+L5","v":37},{"$f":"G34*F34","v":53.798000000000002},null,{"$f":"'[4]Appendix 2-V Streetlight-RD23'!$L$32","v":1.4109},{"$f":"+L5","v":37},{"$f":"K34*J34","v":52.203299999999999},null,-1.5947000000000031,-2.9642365887207759E-2]
[null,"RTSR - Line and Transformation Connection",null,"per kW",null,{"$f":"'[4]Appendix 2-V Streetlight-RD23'!$H$33","v":1.1458999999999999},{"$f":"+L5","v":37},{"$f":"G35*F35","v":42.398299999999999},null,{"$f":"'[4]Appendix 2-V Streetlight-RD23'!$L$33","v":1.1220000000000001},{"$f":"+L5","v":37},{"$f":"K35*J35","v":41.514000000000003},null,-0.88429999999999609,-2.0856968321843E-2]
[null,"Sub-Total C - Delivery (including Sub-Total B)",null,null,null,null,null,{"$f":"SUM(H33:H35)","v":2784.4354000000003},null,null,null,{"$f":"SUM(L33:L35)","v":3269.9978000000006},null,485.56240000000025,0.17438450897442268]
[null,"Wholesale Market Service Charge (WMSC)",null,"per kWh",null,{"$f":"+'[5]17. Other Electriciy Rates'!$D$14","v":5.1999999999999998E-3},{"$f":"+F5*(1+F54)","v":116949.7926},{"$f":"G37*F37","v":608.13892151999994},null,{"$f":"+'[5]17. Other Electriciy Rates'!$D$29","v":5.1999999999999998E-3},{"$f":"+F5*(1+J54)","v":117167.4546},{"$f":"K37*J37","v":609.27076391999992},null,1.1318423999999823,1.8611576400520834E-3]
[null,"Rural and Remote Rate Protection (RRRP)",null,"per kWh",null,{"$f":"+'[5]17. Other Electriciy Rates'!$E$14","v":1.1000000000000001E-3},{"$f":"F5*(1+F54)","v":116949.7926},128.64477186000002,null,{"$f":"+'[5]17. Other Electriciy Rates'!$E$29","v":1.1000000000000001E-3},{"$f":"+F5*(1+J54)","v":117167.4546},128.88420006000001,null,0.23942819999999188,1.8611576400520489E-3]
[null,"Standard Supply Service Charge",null,"Monthly",null,0.25,1,0.25,null,0.25,1,0.25,null,0,0]
[null,"Debt Retirement Charge (DRC)",null,"per kWh",null,{"$f":"+'[5]17. Other Electriciy Rates'!$F$14","v":7.0000000000000001E-3},{"$f":"G38","v":116949.7926},818.64854820000005,null,{"$f":"+'[5]17. Other Electriciy Rates'!$F$29","v":7.0000000000000001E-3},{"$f":"K38","v":117167.4546},820.17218219999995,null,1.5236339999999018,1.8611576400519923E-3]
[null,"Energy - RPP - Tier 1",null,null,null,7.4999999999999997E-2,null,0,null,7.4999999999999997E-2,null,0,null,0,""]
[null,"Energy - RPP - Tier 2",null,null,null,8.7999999999999995E-2,null,0,null,8.7999999999999995E-2,null,0,null,0,""]
[null,"Energy - Commodity COP",null,"per kWh",null,{"$f":"+'[5]17. Other Electriciy Rates'!$M$25","v":8.0689999999999998E-2},{"$f":"+G40","v":116949.7926},9436.678764893999,null,{"$f":"+F43","v":8.0689999999999998E-2},{"$f":"+K40","v":117167.4546},9454.2419116740002,null,17.563146780001262,1.8611576400522462E-3]
[null," ",null,null,null,0.1,null,0,null,0.1,null,0,null,0,""]
[null," ",null,null,null,0.11700000000000001,null,0,null,0.11700000000000001,null,0,null,0,""]
[]
[null,"Total Bill on Commodity COP",null,null,null,null,null,{"$f":"SUM(H36:H40,H43:H45)","v":13776.796406473999},null,null,null,{"$f":"SUM(L36:L40,L43:L45)","v":14282.816857854001},null,{"$f":"L47-H47","v":506.02045138000176},{"$f":"IF((H47)=0,\"\",(N47/H47))","v":3.6729907044442664E-2}]
[null,"HST",null,null,null,0.13,null,{"$f":"H47*F48","v":1790.98353284162},null,0.13,null,{"$f":"L47*J48","v":1856.7661915210201},null,{"$f":"L48-H48","v":65.782658679400129},{"$f":"IF((H48)=0,\"\",(N48/H48))","v":3.6729907044442608E-2}]
[null,"Total Bill (including HST)",null,null,null,null,null,{"$f":"H47+H48","v":15567.779939315618},null,null,null,{"$f":"L47+L48","v":16139.583049375022},null,{"$f":"L49-H49","v":571.80311005940348},{"$f":"IF((H49)=0,\"\",(N49/H49))","v":3.6729907044442761E-2}]
[null,"Ontario Clean Energy Benefit 1",null,null,null,null,null,{"$f":"ROUND(-H49*10%,2)","v":-1556.78},null,null,null,{"$f":"ROUND(-L49*10%,2)","v":-1613.96},null,{"$f":"L50-H50","v":-57.180000000000064},{"$f":"IF((H50)=0,\"\",(N50/H50))","v":3.6729659939105118E-2}]
[null,"Total Bill on TOU (including OCEB)",null,null,null,null,null,{"$f":"H49+H50","v":14010.999939315618},null,null,null,{"$f":"L49+L50","v":14525.623049375023},null,{"$f":"L51-H51","v":514.62311005940501},{"$f":"IF((H51)=0,\"\",(N51/H51))","v":3.672993450063082E-2}]
[]
[]
[null,"Loss Factor (%)",null,null,null,7.46E-2,null,null,null,7.6600000000000001E-2]

{"sheet":"App.2.W. USL Impacts","index":38,"n_rows":57,"n_cols":17,"rows_kept":57,"cut":false,"hidden":false,"merged":[[52,3,52,5],[53,3,53,5],[5,5,5,16],[9,7,9,9],[9,11,9,13],[9,15,9,16],[10,5,11,5],[10,15,11,15],[10,16,11,16]]}
[]
[]
[]
[]
[]
[null,null,null,"Customer Class:",null,"Unmetered Scattered Load"]
[]
[null,null,null,null,null,"Consumption",null,150," kWh",null,null,"Consumption",null,1,"KW"]
[]
[null,null,null,null,null,null,null,"Current Board-Approved",null,null,null,"Proposed",null,null,null,"Impact"]
[null,null,null,null,null,"Charge Unit",null,"Rate","Volume","Charge",null,"Rate","Volume","Charge",null,"$ Change","% Change"]
[null,null,null,null,null,null,null,"($)",null,"($)",null,"($)",null,"($)"]
[null,null,null,"Monthly Service Charge",null,"Monthly",null,{"$f":"'[4]Appendix 2-V USL-RD25'!$H$17","v":23.51},1,{"$f":"I13*H13","v":23.51},null,{"$f":"'[4]Appendix 2-V USL-RD25'!$L$17","v":10.3515},{"$f":"+I13","v":1},{"$f":"M13*L13","v":10.3515},null,{"$f":"N13-J13","v":-13.158500000000002},{"$f":"IF((J13)=0,\"\",(P13/J13))","v":-0.55969800085070187}]
[null,null,null,"Smart Meter Rate Adder",null,null,null,null,1,{"$f":"I14*H14","v":0},null,null,1,{"$f":"M14*L14","v":0},null,{"$f":"N14-J14","v":0},{"$f":"IF((J14)=0,\"\",(P14/J14))","v":""}]
[null,null,null,null,null,null,null,null,1,0,null,null,1,{"$f":"M15*L15","v":0},null,{"$f":"N15-J15","v":0},{"$f":"IF((J15)=0,\"\",(P15/J15))","v":""}]
[null,null,null,null,null,null,null,null,1,0,null,null,1,0,null,0,""]
[null,null,null,null,null,null,null,null,1,0,null,null,1,0,null,0,""]
[null,null,null,null,null,null,null,null,1,0,null,null,1,0,null,0,""]
[null,null,null,"Distribution Volumetric Rate",null,"per kW",null,{"$f":"'[4]Appendix 2-V USL-RD25'!$H$20","v":3.9600000000000003E-2},{"$f":"I37","v":161.19},6.3831240000000005,null,{"$f":"'[4]Appendix 2-V USL-RD25'!$L$20","v":1.7399999999999999E-2},{"$f":"+I19","v":161.19},2.8047059999999999,null,-3.5784180000000005,-0.56060606060606066]
[null,null,null,null,null,null,null,null,1,0,null,null,{"$f":"+I20","v":1},0,null,0,""]
[null,null,null,null,null,null,null,null,{"$f":"+N8","v":1},0,null,null,{"$f":"+I21","v":1},0,null,0,""]
[null,null,null,null,null,null,null,null,1,0,null,null,{"$f":"+I22","v":1},0,null,0,""]
[null,null,null,null,null,null,null,null,null,0,null,null,null,0,null,0,""]
[null,null,null,null,null,null,null,null,null,0,null,null,null,0,null,0,""]
[null,null,null,null,null,null,null,null,null,0,null,null,null,0,null,0,""]
[null,null,null,null,null,null,null,null,null,0,null,null,null,0,null,0,""]
[null,null,null,null,null,null,null,null,null,0,null,null,null,0,null,0,""]
[null,null,null,null,null,null,null,null,null,0,null,null,null,0,null,0,""]
[null,null,null,"Sub-Total A",null,null,null,null,null,{"$f":"SUM(J13:J28)","v":29.893124},null,null,null,{"$f":"SUM(N13:N28)","v":13.156205999999999},null,-16.736918000000003,-0.55989190022427904]
[null,null,null,"Deferral/Variance Account Disposition Rate Rider",null,"per kW",null,{"$f":"'[4]Appendix 2-V USL-RD25'!$H$26","v":-3.5999999999999999E-3},{"$f":"+N8","v":1},{"$f":"I30*H30","v":-3.5999999999999999E-3},null,{"$f":"'[4]Appendix 2-V USL-RD25'!$L$26","v":-5.4999999999999997E-3},{"$f":"+N8","v":1},{"$f":"M30*L30","v":-5.4999999999999997E-3},null,-1.8999999999999998E-3,0.52777777777777768]
[null,null,null,null,null,null,null,null,1,{"$f":"I31*H31","v":0},null,null,1,0,null,0,""]
[null,null,null,null,null,null,null,null,{"$f":"+N8","v":1},{"$f":"I32*H32","v":0},null,null,{"$f":"+N8","v":1},0,null,0,""]
[null,null,null,null,null,null,null,null,{"$f":"+N8","v":1},{"$f":"I33*H33","v":0},null,null,{"$f":"+N8","v":1},0,null,0,""]
[null,null,null,"Low Voltage Service Charge",null,"per kW",null,{"$f":"'[4]Appendix 2-V USL-RD25'!$H$21","v":2E-3},{"$f":"I37","v":161.19},{"$f":"I34*H34","v":0.32238},null,{"$f":"'[4]Appendix 2-V USL-RD25'!$L$21","v":2.0999999999999999E-3},{"$f":"+N8","v":1},2.0999999999999999E-3,null,-0.32028000000000001,-0.99348594825981762]
[null,null,null,"Smart Meter Entity Charge",null,"Monthly",null,null,null,null,null,null,1,0,null,0,""]
[null,null,null,"Sub-Total B - Distribution (includes Sub-Total A)",null,null,null,null,null,{"$f":"SUM(J30:J34)+J29","v":30.211904000000001},null,null,null,{"$f":"SUM(N30:N35)+N29","v":13.152806},null,-17.059097999999999,-0.56464822607671461]
[null,null,null,"RTSR - Network",null,"per kW",null,{"$f":"'[4]Appendix 2-V USL-RD25'!$H$32","v":4.7000000000000002E-3},{"$f":"I40","v":161.19},{"$f":"I37*H37","v":0.75759300000000007},null,{"$f":"'[4]Appendix 2-V USL-RD25'!$L$32","v":4.5999999999999999E-3},{"$f":"'[4]Appendix 2-V USL-RD25'!$M$32","v":161.49},{"$f":"M37*L37","v":0.74285400000000001},null,-1.4739000000000058E-2,-1.9455037203353325E-2]
[null,null,null,"RTSR - Line and Transformation Connection",null,"per kW",null,{"$f":"'[4]Appendix 2-V USL-RD25'!$H$33","v":3.8E-3},{"$f":"I37","v":161.19},{"$f":"I38*H38","v":0.61252200000000001},null,{"$f":"'[4]Appendix 2-V USL-RD25'!$L$33","v":3.7000000000000002E-3},{"$f":"'[4]Appendix 2-V USL-RD25'!$M$33","v":161.49},{"$f":"M38*L38","v":0.59751300000000007},null,-1.5008999999999939E-2,-2.4503609666264949E-2]
[null,null,null,"Sub-Total C - Delivery (including Sub-Total B)",null,null,null,null,null,{"$f":"SUM(J36:J38)","v":31.582018999999999},null,null,null,{"$f":"SUM(N36:N38)","v":14.493172999999999},null,-17.088846,-0.54109415867300947]
[null,null,null,"Wholesale Market Service Charge (WMSC)",null,"per kWh",null,{"$f":"'[4]Appendix 2-V USL-RD25'!$H$35","v":5.1999999999999998E-3},{"$f":"+H8*(1+H57)","v":161.19},{"$f":"I40*H40","v":0.83818799999999993},null,{"$f":"'[4]Appendix 2-V USL-RD25'!$L$35","v":5.1999999999999998E-3},{"$f":"+H8*(1+L57)","v":161.49},{"$f":"M40*L40","v":0.83974800000000005},null,1.5600000000001168E-3,1.8611576400522519E-3]
[null,null,null,"Rural and Remote Rate Protection (RRRP)",null,"per kWh",null,{"$f":"'[4]Appendix 2-V USL-RD25'!$H$36","v":1.1000000000000001E-3},{"$f":"H8*(1+H57)","v":161.19},0.17730899999999999,null,{"$f":"'[4]Appendix 2-V USL-RD25'!$L$36","v":1.1000000000000001E-3},{"$f":"+H8*(1+L57)","v":161.49},0.17763900000000002,null,3.3000000000002472E-4,1.8611576400522519E-3]
[null,null,null,"Standard Supply Service Charge",null,"Monthly",null,0.25,1,0.25,null,0.25,1,0.25,null,0,0]
[null,null,null,"Debt Retirement Charge (DRC)",null,"per kWh",null,{"$f":"'[4]Appendix 2-V USL-RD25'!$H$38","v":7.0000000000000001E-3},{"$f":"I41","v":161.19},1.1283300000000001,null,{"$f":"'[4]Appendix 2-V USL-RD25'!$L$38","v":7.0000000000000001E-3},{"$f":"M41","v":161.49},1.13043,null,2.0999999999999908E-3,1.8611576400521042E-3]
[null,null,null,"Energy - RPP - Tier 1",null,null,null,7.4999999999999997E-2,null,0,null,7.4999999999999997E-2,null,0,null,0,""]
[null,null,null,"Energy - RPP - Tier 2",null,null,null,8.7999999999999995E-2,null,0,null,8.7999999999999995E-2,null,0,null,0,""]
[null,null,null,"Energy - Commodity COP",null,"per kWh",null,{"$f":"+'[5]17. Other Electriciy Rates'!$M$25","v":8.0689999999999998E-2},{"$f":"+I43","v":161.19},13.006421099999999,null,{"$f":"+H46","v":8.0689999999999998E-2},{"$f":"+M43","v":161.49},13.030628100000001,null,2.420700000000231E-2,1.8611576400522903E-3]
[null,null,null," ",null,null,null,0.1,null,0,null,0.1,null,0,null,0,""]
[null,null,null," ",null,null,null,0.11700000000000001,null,0,null,0.11700000000000001,null,0,null,0,""]
[]
[null,null,null,"Total Bill on Commodity COP",null,null,null,null,null,{"$f":"SUM(J39:J43,J46:J48)","v":46.982267099999994},null,null,null,{"$f":"SUM(N39:N43,N46:N48)","v":29.9216181},null,{"$f":"N50-J50","v":-17.060648999999994},{"$f":"IF((J50)=0,\"\",(P50/J50))","v":-0.3631295391447808}]
[null,null,null,"HST",null,null,null,0.13,null,{"$f":"J50*H51","v":6.1076947229999998},null,0.13,null,{"$f":"N50*L51","v":3.8898103530000001},null,{"$f":"N51-J51","v":-2.2178843699999997},{"$f":"IF((J51)=0,\"\",(P51/J51))","v":-0.3631295391447808}]
[null,null,null,"Total Bill (including HST)",null,null,null,null,null,{"$f":"J50+J51","v":53.089961822999996},null,null,null,{"$f":"N50+N51","v":33.811428452999998},null,{"$f":"N52-J52","v":-19.278533369999998},{"$f":"IF((J52)=0,\"\",(P52/J52))","v":-0.36312953914478086}]
[null,null,null,"Ontario Clean Energy Benefit 1",null,null,null,null,null,{"$f":"ROUND(-J52*10%,2)","v":-5.31},null,null,null,{"$f":"ROUND(-N52*10%,2)","v":-3.38},null,{"$f":"N53-J53","v":1.9299999999999997},{"$f":"IF((J53)=0,\"\",(P53/J53))","v":-0.36346516007532953}]
[null,null,null,"Total Bill on TOU (including OCEB)",null,null,null,null,null,{"$f":"J52+J53","v":47.779961822999994},null,null,null,{"$f":"N52+N53","v":30.431428452999999},null,{"$f":"N54-J54","v":-17.348533369999995},{"$f":"IF((J54)=0,\"\",(P54/J54))","v":-0.36309224009569796}]
[]
[]
[null,null,null,"Loss Factor (%)",null,null,null,7.46E-2,null,null,null,7.6600000000000001E-2]

{"sheet":"App.2-X_CoS_Flowchart","index":39,"n_rows":16,"n_cols":7,"rows_kept":16,"cut":false,"hidden":false,"merged":[[15,1,15,6],[12,1,12,6],[13,1,13,6]]}
[null,null,null,null,null,"File Number:",{"$f":"'LDC Info'!$E$18","v":"EB-2012-0139"}]
[null,null,null,null,null,"Exhibit:"]
[null,null,null,null,null,"Tab:"]
[null,null,null,null,null,"Schedule:"]
[null,null,null,null,null,"Page:"]
[]
[null,null,null,null,null,"Date:","2012-08-31"]
[]
[]
[]
[]
[]
[null,"Appendix 2-X"]
[null,"Cost of Service Rate Application Schematic"]
[]
[null,"The Cost of Service Rate Application Schematic is a flowchart appended to Chapter 2 of the Filing Requirements as a guide for the components of an application and how demand and costs interrelate to derive the revenue requirement and then how the revenue requirement is allocated between classes and through fixed/variable splits to derive rates that will be compensatory for the annual revenue requirement, based on the the forecasted demand.  There is no form to be filled out; therefore, this Schedule is not required to be filed. "]

{"sheet":"Sheet5","index":40,"n_rows":17,"n_cols":2,"rows_kept":17,"cut":false,"hidden":false,"merged":[]}
[]
[]
[]
[]
[]
[]
[]
[]
[]
[]
[]
[]
[]
[]
[]
[]
[null,"2013 CHAPTER 2 APPENDICIES"]