{"text_format":"1","workbook":"xlsx","n_sheets":59,"sheets":["LDC Info","Index","App.2-A_Capital Projects","App.2-B_Fixed Asset Cont 2007","App.2-B_Fixed Asset Cont 2008","App.2-B_Fixed Asset Cont 2009","App.2-B_Fixed Asset Cont 2010","App.2-B_Fixed Asset Cont 2011","App.2-B_Fixed Asset Cont 2012","App.2-B_Fixed Asset Cont 2013","App.2-B_FA Cont MIFRS 2012","App.2-B_FA Cont MIFRS 2013","App.2-CA_CGAAP_DepExp_2011","App.2-CB_MIFRS_DepExp_2011","App.2-CC_MIFRS_DepExp_2012","App.2-CD_MIFRS_DepExp_2013","App.2-CE_CGAAP_DepExp_2011","App.2-CF_CGAAP_DepExp_2012","App.2-CJ_CGAAP_DepExp_2013","App.2-CG_MIFRS_DepExp_2012","App.2-CH_MIFRS_DepExp_2013","App.2-CI_AltAccStd_DepExp","App.2-D_Overhead","App.2-EA_PP&E Deferral Account","App.2-EB_PP&E Deferral Account","App.2-F_Other_Oper_Rev","App.2-G_Detailed_OM&A_Expenses","App.2-H_OM&A_Detailed_Analysis","App.2-I_OM&A_Summary_Analys","App.2-J_OM&A_Cost _Drivers","App.2-K_Employee Costs","App.2-L_OM&A_per_Cust_FTEE","App.2-M_Regulatory_Costs","App.2-N_Corp_Cost_Allocation","App.2-OA Capital StructureA2009","App.2-OA Capital Structure 2009","App.2-OA Capital Structure 2010","App.2-OA Capital Structure 2011","App.2-OA Capital Structure 2012","App.2-OA Capital Structure 2013","App.2-OB_Debt Instruments 2009","App.2-OB_Debt Instruments 2010","App.2-OB_Debt Instruments 2011","App.2-OB_Debt Instruments 2012","App.2-OB_Debt Instruments 2013","App.2-P_Cost_Allocation","App.2-Q_Cost of Serv. Emb. Dx","App.2-R_Loss Factors","App.2-S_Stranded Meters","App.2-T_1592_Tax_Variance","App.2-U_IFRS Transition Costs","App.2-V_Rev_Reconciliation","App.2-W_Bill Impacts_RES800","App.2-W_Bill Impacts_GS<50","App.2-W_Bill Impacts_GS>50","App.2-W_Bill Impacts_USL","App.2-W_Bill Impacts_Sentinel","App.2-W_Bill Impacts_Streetligh","App.2-X_CoS_Flowchart"],"not_rendered":{"charts":0,"images":3,"macros":1,"external_links":4,"defined_names":74,"comments":7,"pivot_tables":0},"unopened":[],"bounds":{"document_bytes":16777216,"sheet_cells":100000,"rows_first":2000,"rows_last":500,"rows_between":2000,"halvings":0,"cell_chars":16384,"cell_head_chars":4096},"cells_cut":0,"cells_raw":0,"read":"whole","date_system":"1900"}

{"sheet":"LDC Info","index":0,"n_rows":80,"n_cols":27,"rows_kept":80,"cut":false,"hidden":false,"merged":[[19,4,19,10],[33,2,33,11],[37,2,37,12],[13,4,13,10],[15,4,15,8],[17,4,17,8],[21,4,21,8],[23,4,23,8],[25,4,25,6],[27,4,27,6],[35,2,35,13],[29,4,29,6]]}
[]
[]
[null,null,null,null,null,null,null,null,null,null,null,null,null,null,null,null,null,null,null,null,null,null,null,null,null,null,"Algoma Power Inc."]
[null,null,null,null,null,null,null,null,null,null,null,null,null,null,null,null,null,null,null,null,null,null,null,null,null,null,"Atikokan Hydro Inc."]
[null,null,null,null,null,null,null,null,null,null,null,null,null,null,null,null,null,null,null,null,null,null,null,null,null,null,"Attawapiskat Power Corporation"]
[null,null,null,null,null,null,null,null,null,null,null,null,null,null,null,null,null,null,null,null,null,null,null,null,null,null,"Bluewater Power Distribution Corp."]
[null,null,null,null,null,null,null,null,null,null,null,null,null,null,null,null,null,null,null,null,null,null,null,null,null,null,"Brant County Power"]
[null,null,null,null,null,null,null,null,null,null,null,null,null,null,null,null,null,null,null,null,null,null,null,null,null,null,"Brantford Power Inc."]
[null,null,null,null,null,null,null,null,null,null,null,null,null,null,null,null,null,null,null,null,null,null,null,null,null,null,"Burlington Hydro Inc."]
[null,null,null,null,null,null,null,null,null,null,null,null,null,null,null,null,null,null,null,null,null,null,null,null,null,null,"Cambridge and North Dumfries Hydro"]
[null,null,null,null,null,null,null,null,null,null,null,null,null,null,null,null,null,null,null,null,null,null,null,null,null,null,"Canadian Niagara Power Inc. – Eastern Ontario Power/Fort Erie/Port Colborne"]
[null,null,null,null,null,null,null,null,null,null,null,null,null,null,null,null,null,null,null,null,null,null,null,null,null,null,"Centre Wellington Hydro Ltd."]
[null,null,null,null,null,null,null,null,null,null,null,null,null,"Version 1.1",null,null,null,null,null,null,null,null,null,null,null,null,"Chapleau Public Utilities Corporation"]
[null,null,null,"Utility Name   ","Westario Power Inc.",null,null,null,null,null,null,null,null,null,null,null,null,null,null,null,null,null,null,null,null,null,"COLLUS Power Corp."]
[null,null,null,null,null,null,null,null,null,null,null,null,null,null,null,null,null,null,null,null,null,null,null,null,null,null,"Cooperative Hydro Embrun Inc."]
[null,null,null,"Service Territory",null,null,null,null,null,null,null,null,null,null,null,null,null,null,null,null,null,null,null,null,null,null,"E.L.K. Energy Inc."]
[null,null,null,null,null,null,null,null,null,null,null,null,null,null,null,null,null,null,null,null,null,null,null,null,null,null,"Enersource Hydro Mississauga Inc."]
[null,null,null,"Assigned EB Number","EB2012-0176",null,null,null,null,null,null,null,null,null,null,null,null,null,null,null,null,null,null,null,null,null,"Entegrus Powerlines Inc."]
[null,null,null,null,null,null,null,null,null,null,null,null,null,null,null,null,null,null,null,null,null,null,null,null,null,null,"ENWIN Utilities Ltd."]
[null,null,null,"Name of Contact and Title","Lisa Milne, President/CEO",null,null,null,null,null,null,null,null,null,null,null,null,null,null,null,null,null,null,null,null,null,"Erie Thames Powerlines Corp."]
[null,null,null,null,null,null,null,null,null,null,null,null,null,null,null,null,null,null,null,null,null,null,null,null,null,null,"Espanola Regional Hydro Distribution Corporation"]
[null,null,null,"Phone Number   ","519-507-6666 Ext. 216",null,null,null,null,null,null,null,null,null,null,null,null,null,null,null,null,null,null,null,null,null,"Essex Powerlines Corporation"]
[null,null,null,null,null,null,null,null,null,null,null,null,null,null,null,null,null,null,null,null,null,null,null,null,null,null,"Festival Hydro Inc."]
[null,null,null,"Email Address   ","lisa.milne@westario.com",null,null,null,null,null,null,null,null,null,null,null,null,null,null,null,null,null,null,null,null,null,"Fort Albany Power Corporation"]
[null,null,null,null,null,null,null,null,null,null,null,null,null,null,null,null,null,null,null,null,null,null,null,null,null,null,"Fort Frances Power Corporation"]
[null,null,null,"Bridge Year",2012,null,null,null,null,null,null,null,null,null,null,null,null,null,null,null,null,null,null,null,null,null,"Greater Sudbury Hydro Inc."]
[null,null,null,null,null,null,null,null,null,null,null,null,null,null,null,null,null,null,null,null,null,null,null,null,null,null,"Grimsby Power Inc."]
[null,null,null,"Test Year",2013,null,null,null,null,null,null,null,null,null,null,null,null,null,null,null,null,null,null,null,null,null,"Guelph Hydro Electric Systems Inc."]
[null,null,null,null,null,null,null,null,null,null,null,null,null,null,null,null,null,null,null,null,null,null,null,null,null,null,"Haldimand County Hydro Inc."]
[null,null,null,"Last Rebasing Year",2009,null,null,null,null,null,null,null,null,null,null,null,null,null,null,null,null,null,null,null,null,null,"Guelph Hydro Electric Systems Inc."]
[null,null,null,null,null,null,null,null,null,null,null,null,null,null,null,null,null,null,null,null,null,null,null,null,null,null,"Halton Hills Hydro Inc."]
[null,"Notes",null,null,null,null,null,null,null,null,null,null,null,null,null,null,null,null,null,null,null,null,null,null,null,null,"Hearst Power Distribution Co. Ltd."]
[null,null,null,null,null,null,null,null,null,null,null,null,null,null,null,null,null,null,null,null,null,null,null,null,null,null,"Horizon Utilities Corporation"]
[null,null,"Pale green cells represent input cells.",null,null,null,null,null,null,null,null,null,null,null,null,null,null,null,null,null,null,null,null,null,null,null,"Hydro 2000 Inc."]
[null,null,null,null,null,null,null,null,null,null,null,null,null,null,null,null,null,null,null,null,null,null,null,null,null,null,"Hydro Hawkesbury Inc."]
[null,null,"Pale blue cells represent drop-down lists.  The applicant should select the appropriate item from the drop-down list.",null,null,null,null,null,null,null,null,null,null,null,null,null,null,null,null,null,null,null,null,null,null,null,"Hydro One Brampton Networks Inc."]
[null,null,null,null,null,null,null,null,null,null,null,null,null,null,null,null,null,null,null,null,null,null,null,null,null,null,"Hydro One Networks Inc."]
[null,null,"White cells contain fixed values, automatically generated values or formulae. ",null,null,null,null,null,null,null,null,null,null,null,null,null,null,null,null,null,null,null,null,null,null,null,"Hydro One Remote Communities Inc."]
[null,null,null,null,null,null,null,null,null,null,null,null,null,null,null,null,null,null,null,null,null,null,null,null,null,null,"Hydro Ottawa Limited"]
[null,null,null,null,null,null,null,null,null,null,null,null,null,null,null,null,null,null,null,null,null,null,null,null,null,null,"Innisfil Hydro Dist. Systems Limited"]
[null,null,null,null,null,null,null,null,null,null,null,null,null,null,null,null,null,null,null,null,null,null,null,null,null,null,"Kashechewan Power Corporation"]
[null,null,null,null,null,null,null,null,null,null,null,null,null,null,null,null,null,null,null,null,null,null,null,null,null,null,"Kenora Hydro Electric Corporation Ltd."]
[null,null,null,null,null,null,null,null,null,null,null,null,null,null,null,null,null,null,null,null,null,null,null,null,null,null,"Kingston Hydro Corporation"]
[null,null,null,null,null,null,null,null,null,null,null,null,null,null,null,null,null,null,null,null,null,null,null,null,null,null,"Kitchener-Wilmot Hydro Inc."]
[null,null,null,null,null,null,null,null,null,null,null,null,null,null,null,null,null,null,null,null,null,null,null,null,null,null,"Lakefront Utilities Inc."]
[null,null,null,null,null,null,null,null,null,null,null,null,null,null,null,null,null,null,null,null,null,null,null,null,null,null,"Lakeland Power Distribution Ltd."]
[null,null,null,null,null,null,null,null,null,null,null,null,null,null,null,null,null,null,null,null,null,null,null,null,null,null,"London Hydro Inc."]
[null,null,null,null,null,null,null,null,null,null,null,null,null,null,null,null,null,null,null,null,null,null,null,null,null,null,"Midland Power Utility Corporation"]
[null,null,null,null,null,null,null,null,null,null,null,null,null,null,null,null,null,null,null,null,null,null,null,null,null,null,"Milton Hydro Distribution Inc."]
[null,null,null,null,null,null,null,null,null,null,null,null,null,null,null,null,null,null,null,null,null,null,null,null,null,null,"Newmarket – Tay Power Distribution Ltd."]
[null,null,null,null,null,null,null,null,null,null,null,null,null,null,null,null,null,null,null,null,null,null,null,null,null,null,"Niagara Peninsula Energy Inc."]
[null,null,null,null,null,null,null,null,null,null,null,null,null,null,null,null,null,null,null,null,null,null,null,null,null,null,"Niagara-on-the-Lake Hydro Inc."]
[null,null,null,null,null,null,null,null,null,null,null,null,null,null,null,null,null,null,null,null,null,null,null,null,null,null,"Norfolk Power Distribution Ltd."]
[null,null,null,null,null,null,null,null,null,null,null,null,null,null,null,null,null,null,null,null,null,null,null,null,null,null,"North Bay Hydro Distribution Limited"]
[null,null,null,null,null,null,null,null,null,null,null,null,null,null,null,null,null,null,null,null,null,null,null,null,null,null,"Northern Ontario Wires Inc."]
[null,null,null,null,null,null,null,null,null,null,null,null,null,null,null,null,null,null,null,null,null,null,null,null,null,null,"Oakville Hydro Distribution Inc."]
[null,null,null,null,null,null,null,null,null,null,null,null,null,null,null,null,null,null,null,null,null,null,null,null,null,null,"Orangeville Hydro Limited"]
[null,null,null,null,null,null,null,null,null,null,null,null,null,null,null,null,null,null,null,null,null,null,null,null,null,null,"Orillia Power Distribution Corp."]
[null,null,null,null,null,null,null,null,null,null,null,null,null,null,null,null,null,null,null,null,null,null,null,null,null,null,"Oshawa PUC Networks Inc."]
[null,null,null,null,null,null,null,null,null,null,null,null,null,null,null,null,null,null,null,null,null,null,null,null,null,null,"Ottawa River Power Corporation"]
[null,null,null,null,null,null,null,null,null,null,null,null,null,null,null,null,null,null,null,null,null,null,null,null,null,null,"Parry Sound Power Corporation"]
[null,null,null,null,null,null,null,null,null,null,null,null,null,null,null,null,null,null,null,null,null,null,null,null,null,null,"Peterborough Distribution Inc."]
[null,null,null,null,null,null,null,null,null,null,null,null,null,null,null,null,null,null,null,null,null,null,null,null,null,null,"PowerStream Inc."]
[null,null,null,null,null,null,null,null,null,null,null,null,null,null,null,null,null,null,null,null,null,null,null,null,null,null,"PUC Distribution Inc."]
[null,null,null,null,null,null,null,null,null,null,null,null,null,null,null,null,null,null,null,null,null,null,null,null,null,null,"Renfrew Hydro Inc."]
[null,null,null,null,null,null,null,null,null,null,null,null,null,null,null,null,null,null,null,null,null,null,null,null,null,null,"Rideau St. Lawrence Distribution Inc."]
[null,null,null,null,null,null,null,null,null,null,null,null,null,null,null,null,null,null,null,null,null,null,null,null,null,null,"St. Thomas Energy Inc."]
[null,null,null,null,null,null,null,null,null,null,null,null,null,null,null,null,null,null,null,null,null,null,null,null,null,null,"Sioux Lookout Hydro Inc."]
[null,null,null,null,null,null,null,null,null,null,null,null,null,null,null,null,null,null,null,null,null,null,null,null,null,null,"Thunder Bay Hydro Electricity Distribution"]
[null,null,null,null,null,null,null,null,null,null,null,null,null,null,null,null,null,null,null,null,null,null,null,null,null,null,"Tillsonburg Hydro Inc."]
[null,null,null,null,null,null,null,null,null,null,null,null,null,null,null,null,null,null,null,null,null,null,null,null,null,null,"Toronto Hydro-Electric System Limited"]
[null,null,null,null,null,null,null,null,null,null,null,null,null,null,null,null,null,null,null,null,null,null,null,null,null,null,"Veridian Connections Inc."]
[null,null,null,null,null,null,null,null,null,null,null,null,null,null,null,null,null,null,null,null,null,null,null,null,null,null,"Wasaga Distribution Inc."]
[null,null,null,null,null,null,null,null,null,null,null,null,null,null,null,null,null,null,null,null,null,null,null,null,null,null,"Waterloo North Hydro Inc."]
[null,null,null,null,null,null,null,null,null,null,null,null,null,null,null,null,null,null,null,null,null,null,null,null,null,null,"Welland Hydro Electric System Corp."]
[null,null,null,null,null,null,null,null,null,null,null,null,null,null,null,null,null,null,null,null,null,null,null,null,null,null,"Wellington North Power Inc."]
[null,null,null,null,null,null,null,null,null,null,null,null,null,null,null,null,null,null,null,null,null,null,null,null,null,null,"West Coast Huron Energy Inc."]
[null,null,null,null,null,null,null,null,null,null,null,null,null,null,null,null,null,null,null,null,null,null,null,null,null,null,"Westario Power Inc."]
[null,null,null,null,null,null,null,null,null,null,null,null,null,null,null,null,null,null,null,null,null,null,null,null,null,null,"Whitby Hydro Electric Corporation"]
[null,null,null,null,null,null,null,null,null,null,null,null,null,null,null,null,null,null,null,null,null,null,null,null,null,null,"Woodstock Hydro Services Inc."]

{"sheet":"Index","index":1,"n_rows":32,"n_cols":6,"rows_kept":32,"cut":false,"hidden":false,"merged":[]}
[]
[]
[]
[]
[]
[]
[]
[]
[]
[]
[]
[]
[]
[]
[1,"LDC Information Sheet",null,null,19,"Appendix 2-H OM&A Detailed Analysis"]
[2,"Index",null,null,20,"Appendix 2-I OM&A Summary Analysis"]
[3,"Appendix 2-A Capital Projects",null,null,21,"Appendix 2-J OM&A Cost  Drivers"]
[4,"Appendix 2-B Fixed Asset Continuity",null,null,22,"Appendix 2-K Employee Costs"]
[5,"Appendix 2-CA CGAAP Depreciation Expense 2011",null,null,23,"Appendix 2-L OM&A per Cust FTEE"]
[6,"Appendix 2-CB MIFRS Depreciation Expense 2011",null,null,24,"Appendix 2-M Regulatory Costs"]
[7,"Appendix 2-CC MIFRS Depreciation Expense 2012",null,null,25,"Appendix 2-N Corp Cost Allocation"]
[8,"Appendix 2-CD MIFRS Depreciation Expense 2013",null,null,26,"Appendix 2-OA Capital Structure and Cost of Capital"]
[9,"Appendix 2-CE CGAAP Depreciation Expense 2011",null,null,27,"Appendix 2-OB Debt Instruments"]
[10,"Appendix 2-CF CGAAP Depreciation Expense 2012",null,null,28,"Appendix 2-P Cost Allocation"]
[11,"Appendix 2-CG MIFRS Depreciation Expense 2012",null,null,29,"Appendix 2-Q Cost of Service Embedded Distributor"]
[12,"Appendix 2-CH MIFRS Depreciation Expense 2013",null,null,30,"Appendix 2-R Loss Factors"]
[13,"Appendix 2-CI Alternative Accounting Standards Depreciation Expense",null,null,31,"Appendix 2-S Stranded Meters"]
[14,"Appendix 2-D Overhead",null,null,32,"Appendix 2-T 1592 Tax Variance"]
[15,"Appendix 2-EA PP&E Deferral Account - 2012 IFRS Adopters",null,null,33,"Appendix 2-U IFRS Transition Costs"]
[16,"Appendix 2-EB PP&E Deferral Account - 2013 IFRS Adopters",null,null,34,"Appendix 2-V Rev Reconciliation"]
[17,"Appendix 2-F Other Operating Revenue",null,null,35,"Appendix 2-W Bill Impacts"]
[18,"Appendix 2-G Detailed OM&A Expenses",null,null,36,"Appendix 2-X CoS Flowchart"]

{"sheet":"App.2-A_Capital Projects","index":2,"n_rows":657,"n_cols":8,"rows_kept":657,"cut":false,"hidden":false,"merged":[[656,0,656,7],[11,0,11,7],[9,0,9,7],[8,0,8,7],[650,0,650,7],[652,0,652,7]]}
[null,null,null,null,null,null,"File Number:",{"$f":"'LDC Info'!$E$18","v":"EB2012-0176"}]
[null,null,null,null,null,null,"Exhibit:"]
[null,null,null,null,null,null,"Tab:"]
[null,null,null,null,null,null,"Schedule:"]
[null,null,null,null,null,null,"Page:"]
[]
[null,null,null,null,null,null,"Date:"]
[]
["Appendix 2-A"]
["Capital Projects Table"]
[]
[]
["Projects",{"$f":"IF(ISBLANK('LDC Info'!E26), \"Year 1\", 'LDC Info'!E26-5)","v":2007},{"$f":"IF(ISBLANK('LDC Info'!E26), \"Year 2\", 'LDC Info'!E26-4)","v":2008},{"$f":"IF(ISBLANK('LDC Info'!E26), \"Year 3\", 'LDC Info'!E26-3)","v":2009},{"$f":"IF(ISBLANK('LDC Info'!E26), \"Year 4\", 'LDC Info'!E26-2)","v":2010},{"$f":"IF(ISBLANK('LDC Info'!E26), \"Year 5\", 'LDC Info'!E26-1)","v":2011},{"$f":"'LDC Info'!E26 & \" Bridge Year\"","v":"2012 Bridge Year"},{"$f":"'LDC Info'!E28 & \" Test Year\"","v":"2013 Test Year"}]
["Reporting Basis","CGAAP","CGAAP","CGAAP","CGAAP","CGAAP","CGAAP","CGAAP"]
["Capital #6 Primary Replacement"]
["Poles, Towers & Fixtures",null,null,143729,182424,224903,322551,351114]
["Overhead Conductors & Devices",null,null,201622,201865,295784,387061,421338]
["Underground Conduit",null,null,10799,7802,4070]
["Underground Conductors & Devices",null,null,82044,36147,58496,64510,70223]
["Line Transformers",null,null,137421,23617,136620,258040,280892]
["Services",null,null,75775,60143,163793,258040,280892]
["Meters",null,null,782,947]
["Sub-Total",{"$f":"SUM(B16:B22)","v":0},{"$f":"SUM(C16:C22)","v":0},652172,512945,883666,1290202,1404459]
[]
["Capital Poles - Priority Level 5"]
["Poles, Towers & Fixtures",null,null,204510,151385,182403,200696,198504]
["Overhead Conductors & Devices",null,null,259122,120732,243633,229367,226862]
["Underground Conduit",null,null,9848,4364,6823,14336,14179]
["Underground Conductors & Devices",null,null,124252,5468,21975,43006,42537]
["Line Transformers",null,null,133695,10252,140419,28671,28358]
["Services",null,null,78986,15413,72855,57342,56715]
["Meters",null,null,58,5071,1057]
["Sub-Total",{"$f":"SUM(B26:B32)","v":0},0,810471,312685,669165,573418,567155]
[]
["Capital Poles"]
["Capital Cost",295760,155438]
["Poles, Towers & Fixtures",null,null,84835,71400,105344,283535,286173]
["Overhead Conductors & Devices",null,null,41557,45296,42486,118139,119238]
["Underground Conduit",null,null,1964,3166,530]
["Underground Conductors & Devices",null,null,10320,11525,2835,11814,11924]
["Line Transformers",null,null,21938,14319,12098,35442,35771]
["Services",null,null,9837,5685,9514,23628,23848]
["Meters",null,null,null,499,1302]
["Sub-Total",{"$f":"SUM(B36:B43)","v":295760},{"$f":"SUM(C36:C43)","v":155438},{"$f":"SUM(D37:D43)","v":170451},151890,174109,472558,476954]
[]
["Southampton Saugeen Street"]
["Capital Cost",null,39600]
["Poles, Towers & Fixtures",null,null,5600]
["Overhead Conductors & Devices",null,null,8538]
["Underground Conduit",null,null,241]
["Underground Conductors & Devices",null,null,19396]
["Line Transformers",null,null,51044]
["Services",null,null,12620]
["Meters",null,null,1503]
["Sub-Total",{"$f":"SUM(B48:B54)","v":0},{"$f":"SUM(C47:C54)","v":39600},98942,0,0,0,0]
[]
["Kincardine Saugeen Street Rebuild"]
["Capital Cost",115402]
["Sub-Total",{"$f":"SUM(B58:B58)","v":115402},0,0,0,0,0,0]
[]
["Harriston Substation Contingency 2 MVA"]
["Distribution Station Equipment",null,null,4094,81230]
["Poles, Towers & Fixtures",null,null,11655]
["Overhead Conductors & Devices",null,null,8341,4015]
["Underground Conduit",null,null,924,469]
["Underground Conductors & Devices",null,null,55553,6351]
["Line Transformers",null,null,1007,1807]
["Services"]
["Meters",null,null,null,32243]
["Sub-Total",{"$f":"SUM(B62:B69)","v":0},{"$f":"SUM(C62:C69)","v":0},81574,126115,0,0,0]
[]
["Wingham MS1 Reclosure Replacement"]
["Distribution Station Equipment",null,null,113046]
["Poles, Towers & Fixtures"]
["Overhead Conductors & Devices",null,null,224]
["Underground Conduit"]
["Underground Conductors & Devices",null,null,13726]
["Line Transformers"]
["Services"]
["Meters"]
["Sub-Total",{"$f":"SUM(B73:B80)","v":0},{"$f":"SUM(C73:C80)","v":0},126996,0,0,0,0]
[]
["Southampton MS1 Structure Rebuild"]
["Poles, Towers & Fixtures",null,null,null,17082,84318]
["Overhead Conductors & Devices",null,null,null,35587]
["Underground Conduit",null,null,null,1495]
["Underground Conductors & Devices",null,null,null,1924]
["Line Transformers"]
["Services"]
["Meters"]
["Sub-Total",{"$f":"SUM(B84:B90)","v":0},0,0,56088,84318,0,0]
[]
["Emergency Transformer Refurb & Ready Stations"]
["Capital Cost"]
["Distribution Station Equipment",null,null,null,null,null,null,256064]
["Poles, Towers & Fixtures",null,null,null,null,null,null,30125]
["Overhead Conductors & Devices",null,null,null,null,null,null,15063]
["Sub-Total",{"$f":"SUM(B94:B94)","v":0},0,0,0,0,0,{"$f":"SUM(H94:H97)","v":301252}]
[]
["Hanover MS2 Cable Replacement"]
["Capital Cost",null,41250]
["Sub-Total",{"$f":"SUM(B101:B101)","v":0},41250,0,0,0,0,0]
[]
["Hanover MS2 Ground Grid Reactor"]
["Distribution Station Equipment",null,null,null,null,169049]
["Sub-Total",{"$f":"SUM(B105:B105)","v":0},0,0,0,169049,0,0]
[]
["Upgrade Station Metering"]
["Distribution Station Equipment",null,null,null,null,null,null,129422]
["Sub-Total",{"$f":"SUM(B109:B109)","v":0},0,0,0,0,0,129422]
[]
["Hanover MS1 Reactor Installation"]
["Distribution Station Equipment",null,null,null,null,null,242020]
["Sub-Total",{"$f":"SUM(B113:B113)","v":0},0,0,0,0,242020,0]
[]
["Palmerston MS Recloser Replacement"]
["Capital Cost",null,143325]
["Sub-Total",{"$f":"SUM(B117:B117)","v":0},143325,0,0,0,0,0]
[]
["Substation Fencing"]
["Building",null,null,null,3263]
["Distribution Station Equipment",null,null,null,13760]
["Poles, Towers & Fixtures"]
["Overhead Conductors & Devices"]
["Underground Conduit"]
["Underground Conductors & Devices"]
["Line Transformers"]
["Services"]
["Meters"]
["Sub-Total",{"$f":"SUM(B123:B129)","v":0},0,0,{"$f":"SUM(E121:E129)","v":17023},0,0,0]
[]
["Station Grid Upgrade - 25 Stations"]
["Distribution Station Equipment",null,null,null,102543,147139,120928,209369]
["Sub-Total",{"$f":"SUM(B133:B133)","v":0},0,0,102543,147139,120928,209369]
[]
["Substation Transformer Refurbishment"]
["Capital Cost",47196]
["Sub-Total",{"$f":"SUM(B137:B137)","v":47196},0,0,0,0,0,0]
[]
["Harriston MS Spare Substation Transformer"]
["Capital Cost",null,64433]
["Sub-Total",{"$f":"SUM(B141:B141)","v":0},64433,0,0,0,0,0]
[]
["Harriston T2 Upgrade"]
["Distribution Substation Equipment",null,null,null,null,null,143891]
["Sub-Total",{"$f":"SUM(B145:B145)","v":0},0,0,0,0,143891,0]
[]
["Walkerton MS1 New Substation Transformer"]
["Capital Cost",null,175176]
["Sub-Total",{"$f":"SUM(B149:B149)","v":0},175176,0,0,0,0,0]
[]
["Live Line Openers"]
["Capital Cost",null,21299]
["Sub-Total",{"$f":"SUM(B153:B153)","v":0},21299,0,0,0,0,0]
[]
["Lucknow 6-Plex"]
["Capital Cost",null,3897]
["Sub-Total",{"$f":"SUM(B157:B157)","v":0},3897,0,0,0,0,0]
[]
["Port Elgin 5KV Cable & Poletran Replacement"]
["Poles, Towers & Fixtures",null,null,null,5708,12234,24503,37068]
["Overhead Conductors & Devices",null,null,null,14637,18862,24503,37068]
["Underground Conduit",null,null,null,1454,259280,220529,333610]
["Underground Conductors & Devices",null,null,null,194247,113176,122516,185339]
["Line Transformers",null,null,null,37217,34568,49007,74135]
["Services",null,null,null,6086,12463,49007,74135]
["Meters"]
["Sub-Total",{"$f":"SUM(B161:B167)","v":0},0,0,259349,450583,490065,741355]
[]
["Kincardine Poletran & BRI Cable Replacement"]
["Capital Cost",344866,411744]
["Sub-Total",{"$f":"SUM(B171:B171)","v":344866},411744,0,0,0,0,0]
[]
["Harriston Poletran Rebuild"]
["Capital Cost",49798]
["Sub-Total",{"$f":"SUM(B175:B175)","v":49798},0,0,0,0,0,0]
[]
["Kincardine Hunter Street Defective Transformer Foundations"]
["Capital Cost",null,54334]
["Sub-Total",{"$f":"SUM(B179:B179)","v":0},54334,0,0,0,0,0]
[]
["Padmount Transformers with no Ground Gradient"]
["Distribution Station Equipment",null,null,null,null,2176]
["Poles, Towers & Fixtures",null,null,null,467,1798]
["Overhead Conductors & Devices",null,null,2398,null,3555]
["Underground Conduit",null,null,525,null,468]
["Underground Conductors & Devices",null,null,17427,678,7593]
["Line Transformers",null,null,16434,1427,38492]
["Services",null,null,null,2205,5658]
["Meters",null,null,null,null,2523]
["Sub-Total",{"$f":"SUM(B184:B190)","v":0},0,36784,4777,{"$f":"SUM(F183:F190)","v":62263},0,0]
[]
["New 3 Phase Customers"]
["Capital Cost",214345,119891]
["Poles, Towers & Fixtures",null,null,3265,14108,18287,32009,30389]
["Overhead Conductors & Devices",null,null,9506,19505,18824,32009,30389]
["Underground Conduit",null,null,707,2142,216,8002,7597]
["Underground Conductors & Devices",null,null,7595,20760,30342,48014,45584]
["Line Transformers",null,null,114813,79551,94318,160046,151946]
["Services",null,null,2302,7825,9620,16005,15195]
["Meters",null,null,7426,11236,{"$f":"5567+1945","v":7512},24006,22793]
["Sub-Total",{"$f":"SUM(B194:B201)","v":214345},{"$f":"SUM(C194:C201)","v":119891},{"$f":"SUM(D195:D201)","v":145614},155127,179119,320091,303893]
[]
["New low voltage services"]
["Capital Cost",{"$f":"43180+200000","v":243180},200000]
["Poles, Towers & Fixtures",null,null,7074,396,2723,7323,6496]
["Overhead Conductors & Devices",null,null,2261,9278,3358,7323,6496]
["Underground Conduit",null,null,442,3763,566,7323,6496]
["Underground Conductors & Devices",null,null,27053,19508,29192,29293,25983]
["Line Transformers",null,null,77586,9793,831,7323,6496]
["Services",null,null,264,101079,122044,219703,194874]
["Meters",null,null,null,2858,{"$f":"5191+1542","v":6733},14646,12991]
["Sub-Total",{"$f":"SUM(B205:B212)","v":243180},{"$f":"SUM(C205:C212)","v":200000},{"$f":"SUM(D206:D212)","v":114680},146675,165447,292934,259832]
[]
["Non-demarcation Customers"]
["Capital Cost",22744]
["Poles, Towers & Fixtures",null,null,null,33863,2922,4757,6300]
["Overhead Conductors & Devices"]
["Underground Conduit",null,null,10849,2310,18556,26959,35700]
["Underground Conductors & Devices"]
["Line Transformers"]
["Services"]
["Meters"]
["Sub-Total",{"$f":"SUM(B216:B223)","v":22744},{"$f":"SUM(C217:C223)","v":0},10849,36173,21478,31716,42000]
[]
["New Lots Developed"]
["Capital Cost",30832,262618]
["Poles, Towers & Fixtures",null,null,226,973,29337,13532,12407]
["Overhead Conductors & Devices",null,null,15955,5586,42783,40595,37221]
["Underground Conduit",null,null,4575,973,2559,13532,12407]
["Underground Conductors & Devices",null,null,106235,42688,154318,135315,124071]
["Line Transformers",null,null,194308,9887,63511,54127,49629]
["Services",null,null,3239,486,10219,13532,12407]
["Meters"]
["Sub-Total",{"$f":"SUM(B227:B234)","v":30832},{"$f":"SUM(C227:C234)","v":262618},{"$f":"SUM(D228:D234)","v":324538},60593,302727,270633,248142]
[]
["Registered Meter Point Resealing"]
["Poles, Towers & Fixtures"]
["Overhead Conductors & Devices"]
["Underground Conduit"]
["Underground Conductors & Devices"]
["Line Transformers"]
["Services"]
["Meters",null,null,null,13885]
["Sub-Total",{"$f":"SUM(B238:B244)","v":0},0,0,13885,0,0,0]
[]
["Prior Year Capital Projects Completed"]
["Poles, Towers & Fixtures",null,null,3270]
["Overhead Conductors & Devices",null,null,8038]
["Underground Conduit"]
["Underground Conductors & Devices",null,null,3270]
["Line Transformers",null,null,1327]
["Services"]
["Meters"]
["Sub-Total",{"$f":"SUM(B248:B254)","v":0},{"$f":"SUM(C248:C254)","v":0},15905,0,0,0,0]
[]
["Current Year Capital Projects - non budgeted"]
["Poles, Towers & Fixtures",null,null,1041]
["Overhead Conductors & Devices",null,null,3237]
["Underground Conduit",null,null,397]
["Underground Conductors & Devices",null,null,27261]
["Line Transformers",null,null,11593]
["Services",null,null,26048]
["Meters"]
["Sub-Total",{"$f":"SUM(B258:B264)","v":0},0,69577,0,0,0,0]
[]
["Municipal Roads Act"]
["Poles, Towers & Fixtures",null,null,16246]
["Overhead Conductors & Devices",null,null,16545]
["Underground Conduit",null,null,1223]
["Underground Conductors & Devices",null,null,41528]
["Line Transformers",null,null,4017]
["Services",null,null,787]
["Meters"]
["Sub-Total",{"$f":"SUM(B268:B274)","v":0},0,80346,0,0,0,0]
[]
["Mildmay PME Lightning Strike"]
["Poles, Towers & Fixtures"]
["Overhead Conductors & Devices",null,null,5838]
["Underground Conduit",null,null,154]
["Underground Conductors & Devices",null,null,26227]
["Line Transformers",null,null,20874]
["Services"]
["Meters",null,null,7746,16471]
["Sub-Total",{"$f":"SUM(B278:B284)","v":0},0,60839,16471,0,0,0]
[]
["Walkerton MS3 - Copper Theft"]
["Distribution Station Equipment",null,null,6001]
["Poles, Towers & Fixtures"]
["Overhead Conductors & Devices"]
["Underground Conduit"]
["Underground Conductors & Devices",null,null,11859]
["Line Transformers"]
["Services"]
["Meters"]
["Sub-Total",{"$f":"SUM(B289:B295)","v":0},0,{"$f":"SUM(D288:D295)","v":17860},0,0,0,0]
[]
["Service Upgrade for Customer Owned Substation"]
["Poles, Towers & Fixtures",null,null,30904]
["Overhead Conductors & Devices",null,null,35823]
["Underground Conduit",null,null,2181]
["Underground Conductors & Devices",null,null,13066]
["Line Transformers",null,null,5229]
["Services",null,null,393]
["Meters",null,null,2404]
["Sub-Total",{"$f":"SUM(B299:B305)","v":0},0,90000,0,0,0,0]
[]
["Service Upgrade for Industrial Customer - EkoFuels"]
["Poles, Towers & Fixtures",null,null,57]
["Overhead Conductors & Devices",null,null,1947]
["Underground Conduit",null,null,134]
["Underground Conductors & Devices",null,null,1566]
["Line Transformers",null,null,26026]
["Services"]
["Meters",null,null,1454]
["Sub-Total",{"$f":"SUM(B309:B315)","v":0},0,31184,0,0,0,0]
[]
["Service Upgrade - PE Docks"]
["Capital Cost",26863]
["Poles, Towers & Fixtures",null,null,214]
["Overhead Conductors & Devices",null,null,440]
["Underground Conduit"]
["Underground Conductors & Devices",null,null,3919]
["Line Transformers",null,null,21472]
["Services"]
["Meters"]
["Sub-Total",{"$f":"SUM(B319:B326)","v":26863},{"$f":"SUM(C320:C326)","v":0},26045,0,0,0,0]
[]
["Power Supply - Eastlink"]
["Poles, Towers & Fixtures"]
["Overhead Conductors & Devices",null,null,5193]
["Underground Conduit"]
["Underground Conductors & Devices",null,null,80]
["Line Transformers",null,null,5515]
["Services",null,null,11008]
["Meters",null,null,3538]
["Sub-Total",{"$f":"SUM(B330:B336)","v":0},0,25334,0,0,0,0]
[]
["Fibre Make Ready"]
["Capital Cost",null,25533]
["Poles, Towers & Fixtures",null,null,148425,13680,853]
["Overhead Conductors & Devices",null,null,93024,21215,366]
["Underground Conduit",null,null,31938,1149]
["Underground Conductors & Devices",null,null,23913,6861]
["Line Transformers",null,null,19235,515,487]
["Services",null,null,23050,250,731]
["Meters"]
["Sub-Total",{"$f":"SUM(B341:B347)","v":0},{"$f":"SUM(C340:C347)","v":25533},339585,43670,2437,0,0]
[]
["New Service or Upgrade to 400 Amp"]
["Capital Cost",65805,3273]
["Poles, Towers & Fixtures",null,null,null,2080]
["Overhead Conductors & Devices",null,null,null,2734]
["Underground Conduit",null,null,null,371]
["Underground Conductors & Devices",null,null,null,1581]
["Line Transformers",null,null,null,33749]
["Services",null,null,null,1092]
["Meters",null,null,null,364]
["Sub-Total",{"$f":"SUM(B351:B358)","v":65805},{"$f":"SUM(C351:C358)","v":3273},{"$f":"SUM(D352:D358)","v":0},41971,0,0,0]
[]
["Replace 3 Phase Bank"]
["Poles, Towers & Fixtures"]
["Overhead Conductors & Devices",null,null,null,2312]
["Underground Conduit",null,null,null,460]
["Underground Conductors & Devices",null,null,null,884]
["Line Transformers",null,null,null,13873]
["Services"]
["Meters"]
["Sub-Total",{"$f":"SUM(B362:B368)","v":0},0,0,17529,0,0,0]
[]
["New Load Transfer Customer"]
["Poles, Towers & Fixtures"]
["Overhead Conductors & Devices",null,null,null,1232]
["Underground Conduit",null,null,null,246]
["Underground Conductors & Devices",null,null,null,13230]
["Line Transformers",null,null,null,8331]
["Services",null,null,null,1142]
["Meters"]
["Sub-Total",{"$f":"SUM(B372:B378)","v":0},0,0,24181,0,0,0]
[]
["Service Relocation for Town of Hanover - Left Turn Lane Reconstruction"]
["Poles, Towers & Fixtures",null,null,null,45516]
["Overhead Conductors & Devices",null,null,null,31590]
["Underground Conduit",null,null,null,727]
["Underground Conductors & Devices"]
["Line Transformers"]
["Services"]
["Meters"]
["Sub-Total",{"$f":"SUM(B382:B388)","v":0},0,0,77833,0,0,0]
[]
["Steel Pole Relocation for Town of Lucknow - Fire Hall"]
["Poles, Towers & Fixtures",null,null,null,2080]
["Overhead Conductors & Devices",null,null,null,4297]
["Underground Conduit",null,null,null,759]
["Underground Conductors & Devices",null,null,null,11524]
["Line Transformers"]
["Services",null,null,null,1054]
["Meters"]
["Sub-Total",{"$f":"SUM(B392:B398)","v":0},0,0,19714,0,0,0]
[]
["Pole Line Relocation"]
["Capital Cost",15703,16363]
["Poles, Towers & Fixtures",null,null,null,8096]
["Overhead Conductors & Devices",null,null,null,9504]
["Underground Conduit",null,null,null,430]
["Underground Conductors & Devices",null,null,null,2417]
["Line Transformers"]
["Services"]
["Meters"]
["Sub-Total",{"$f":"SUM(B402:B409)","v":15703},{"$f":"SUM(C402:C409)","v":16363},{"$f":"SUM(D403:D409)","v":0},20447,0,0,0]
[]
["Infrastructure Rebuild - Storm"]
["Poles, Towers & Fixtures",null,null,null,17936]
["Overhead Conductors & Devices",null,null,null,8111]
["Underground Conduit",null,null,null,519]
["Underground Conductors & Devices"]
["Line Transformers"]
["Services",null,null,null,3230]
["Meters"]
["Sub-Total",{"$f":"SUM(B413:B419)","v":0},0,0,29796,0,0,0]
[]
["Non-budgeted Work Orders"]
["Capital Cost",249844,317468]
["Poles, Towers & Fixtures",null,null,3345,478,1344]
["Overhead Conductors & Devices",null,null,9570,7252,3947]
["Underground Conduit",null,null,1451,793,151]
["Underground Conductors & Devices",null,null,300,7820,1964]
["Line Transformers",null,null,6304,6870,515]
["Services",null,null,63421,38161,81004]
["Meters",null,null,4825,5565,{"$f":"1087+1348","v":2435}]
["Sub-Total",{"$f":"SUM(B423:B430)","v":249844},{"$f":"SUM(C423:C430)","v":317468},{"$f":"SUM(D424:D430)","v":89216},66939,91360,0,0]
[]
["Metering"]
["Meters",null,null,null,null,null,null,280648]
["Sub-Total",{"$f":"SUM(B434)","v":0},{"$f":"SUM(C434)","v":0},{"$f":"SUM(D434)","v":0},{"$f":"SUM(E434)","v":0},{"$f":"SUM(F434)","v":0},{"$f":"SUM(G434)","v":0},{"$f":"SUM(H434)","v":280648}]
[]
["Walkerton: Peter Street"]
["Capital Cost",103529]
["Sub-Total",{"$f":"SUM(B438)","v":103529},{"$f":"SUM(C438)","v":0},0,0,0,0,0]
[]
["Southampton: Strut Guy Conversion"]
["Capital Cost",4576]
["Sub-Total",{"$f":"SUM(B442)","v":4576},{"$f":"SUM(C442)","v":0},{"$f":"SUM(D442)","v":0},{"$f":"SUM(E442)","v":0},{"$f":"SUM(F442)","v":0},{"$f":"SUM(G442)","v":0},{"$f":"SUM(H442)","v":0}]
[]
["Hanover: Broken Pole"]
["Capital Cost",16034]
["Sub-Total",{"$f":"SUM(B446)","v":16034},{"$f":"SUM(C446)","v":0},{"$f":"SUM(D446)","v":0},{"$f":"SUM(E446)","v":0},{"$f":"SUM(F446)","v":0},{"$f":"SUM(G446)","v":0},{"$f":"SUM(H446)","v":0}]
[]
["Walkerton: Walkerton Industrial Park"]
["Capital Cost",32621]
["Sub-Total",{"$f":"SUM(B450)","v":32621},{"$f":"SUM(C450)","v":0},{"$f":"SUM(D450)","v":0},{"$f":"SUM(E450)","v":0},{"$f":"SUM(F450)","v":0},{"$f":"SUM(G450)","v":0},{"$f":"SUM(H450)","v":0}]
[]
["Port Elgin: Elgin Lodge Addition"]
["Capital Cost",56075]
["Sub-Total",{"$f":"SUM(B454)","v":56075},{"$f":"SUM(C454)","v":0},{"$f":"SUM(D454)","v":0},{"$f":"SUM(E454)","v":0},{"$f":"SUM(F454)","v":0},{"$f":"SUM(G454)","v":0},{"$f":"SUM(H454)","v":0}]
[]
["Hanover: Hanover Industrial Park"]
["Capital Cost",60828]
["Sub-Total",{"$f":"SUM(B458)","v":60828},{"$f":"SUM(C458)","v":0},{"$f":"SUM(D458)","v":0},{"$f":"SUM(E458)","v":0},{"$f":"SUM(F458)","v":0},{"$f":"SUM(G458)","v":0},{"$f":"SUM(H458)","v":0}]
[]
["Hanover: Mini Plaza"]
["Capital Cost",null,2932]
["Sub-Total",{"$f":"SUM(B462)","v":0},{"$f":"SUM(C462)","v":2932},{"$f":"SUM(D462)","v":0},{"$f":"SUM(E462)","v":0},{"$f":"SUM(F462)","v":0},{"$f":"SUM(G462)","v":0},{"$f":"SUM(H462)","v":0}]
[]
["Overhead to Underground - Customer Driven"]
["Capital Cost",null,79928]
["Sub-Total",{"$f":"SUM(B466)","v":0},{"$f":"SUM(C466)","v":79928},{"$f":"SUM(D466)","v":0},{"$f":"SUM(E466)","v":0},{"$f":"SUM(F466)","v":0},{"$f":"SUM(G466)","v":0},{"$f":"SUM(H466)","v":0}]
[]
["Port Elgin 4-Plex"]
["Capital Cost",null,2865]
["Sub-Total",{"$f":"SUM(B470)","v":0},{"$f":"SUM(C470)","v":2865},{"$f":"SUM(D470)","v":0},{"$f":"SUM(E470)","v":0},{"$f":"SUM(F470)","v":0},{"$f":"SUM(G470)","v":0},{"$f":"SUM(H470)","v":0}]
[]
["Service Upgrade - Teeswater School"]
["Capital Cost",null,2875]
["Sub-Total",{"$f":"SUM(B474)","v":0},{"$f":"SUM(C474)","v":2875},{"$f":"SUM(D474)","v":0},{"$f":"SUM(E474)","v":0},{"$f":"SUM(F474)","v":0},{"$f":"SUM(G474)","v":0},{"$f":"SUM(H474)","v":0}]
[]
["Southampton: Service 2 Lots to Line Lot"]
["Capital Cost",null,3331]
["Sub-Total",{"$f":"SUM(B478)","v":0},{"$f":"SUM(C478)","v":3331},{"$f":"SUM(D478)","v":0},{"$f":"SUM(E478)","v":0},{"$f":"SUM(F478)","v":0},{"$f":"SUM(G478)","v":0},{"$f":"SUM(H478)","v":0}]
[]
["Walkerton: Durham Street - Metering Upgrade"]
["Capital Cost",null,3367]
["Sub-Total",{"$f":"SUM(B482)","v":0},{"$f":"SUM(C482)","v":3367},{"$f":"SUM(D482)","v":0},{"$f":"SUM(E482)","v":0},{"$f":"SUM(F482)","v":0},{"$f":"SUM(G482)","v":0},{"$f":"SUM(H482)","v":0}]
[]
["Walkerton: Industrial Road Updgrade"]
["Capital Cost",null,16049]
["Sub-Total",{"$f":"SUM(B486)","v":0},{"$f":"SUM(C486)","v":16049},{"$f":"SUM(D486)","v":0},{"$f":"SUM(E486)","v":0},{"$f":"SUM(F486)","v":0},{"$f":"SUM(G486)","v":0},{"$f":"SUM(H486)","v":0}]
[]
["Wingham: Capital Rebuild - Martha to George Street"]
["Capital Cost",null,70280]
["Sub-Total",{"$f":"SUM(B490)","v":0},{"$f":"SUM(C490)","v":70280},{"$f":"SUM(D490)","v":0},{"$f":"SUM(E490)","v":0},{"$f":"SUM(F490)","v":0},{"$f":"SUM(G490)","v":0},{"$f":"SUM(H490)","v":0}]
[]
["Wingham: Metering Upgrade"]
["Capital Cost",null,2568]
["Sub-Total",{"$f":"SUM(B494)","v":0},{"$f":"SUM(C494)","v":2568},{"$f":"SUM(D494)","v":0},{"$f":"SUM(E494)","v":0},{"$f":"SUM(F494)","v":0},{"$f":"SUM(G494)","v":0},{"$f":"SUM(H494)","v":0}]
[]
["Underground Burnoffs"]
["Poles, Towers & Fixtures",null,null,null,null,17582]
["Overhead Conductors & Devices",null,null,null,null,11651]
["Underground Conduit",null,null,null,null,57235]
["Underground Conductors & Devices",null,null,null,null,64209]
["Line Transformers",null,null,null,null,2148]
["Services",null,null,null,null,5695]
["Meters",null,null,null,null,1277]
["Sub-Total",{"$f":"SUM(B498:B504)","v":0},0,0,0,159797,0,0]
[]
["Neustadt PME"]
["Poles, Towers & Fixtures",null,null,null,null,1862]
["Overhead Conductors & Devices",null,null,null,null,23140]
["Underground Conduit"]
["Underground Conductors & Devices"]
["Line Transformers",null,null,null,null,2333]
["Services",null,null,null,null,23013]
["Meters"]
["Sub-Total",{"$f":"SUM(B508:B514)","v":0},0,0,0,50348,0,0]
[]
["Bi-Directional Meters"]
["Poles, Towers & Fixtures",null,null,null,null,413]
["Overhead Conductors & Devices",null,null,null,null,4735]
["Underground Conduit",null,null,null,null,47]
["Underground Conductors & Devices"]
["Line Transformers",null,null,null,null,4423]
["Services",null,null,null,null,1738]
["Meters",null,null,null,null,1431]
["Sub-Total",{"$f":"SUM(B518:B524)","v":0},0,0,0,12787,0,0]
[]
["Rellocate Transformers"]
["Poles, Towers & Fixtures",null,null,null,null,65]
["Overhead Conductors & Devices",null,null,null,null,50]
["Underground Conduit"]
["Underground Conductors & Devices"]
["Line Transformers",null,null,null,null,4483]
["Services",null,null,null,null,1328]
["Meters",null,null,null,null,104]
["Sub-Total",{"$f":"SUM(B528:B534)","v":0},0,0,0,6030,0,0]
[]
["Underground Cable Installation"]
["Poles, Towers & Fixtures",null,null,null,null,1217]
["Overhead Conductors & Devices",null,null,null,null,924]
["Underground Conduit",null,null,null,null,170]
["Underground Conductors & Devices",null,null,null,null,44382]
["Line Transformers",null,null,null,null,74]
["Services",null,null,null,null,22550]
["Meters"]
["Sub-Total",{"$f":"SUM(B538:B544)","v":0},0,0,0,69317,0,0]
[]
["New Pole"]
["Poles, Towers & Fixtures",null,null,null,null,18424]
["Overhead Conductors & Devices",null,null,null,null,4398]
["Underground Conduit",null,null,null,null,331]
["Underground Conductors & Devices",null,null,null,null,126]
["Line Transformers"]
["Services",null,null,null,null,811]
["Meters",null,null,null,null,104]
["Sub-Total",{"$f":"SUM(B548:B554)","v":0},0,0,0,24194,0,0]
[]
["Install Primary, Transformer & Metering"]
["Poles, Towers & Fixtures",null,null,null,null,14379]
["Overhead Conductors & Devices",null,null,null,null,12628]
["Underground Conduit",null,null,null,null,423]
["Underground Conductors & Devices",null,null,null,null,11445]
["Line Transformers",null,null,null,null,40556]
["Services",null,null,null,null,11413]
["Meters",null,null,null,null,3270]
["Sub-Total",{"$f":"SUM(B558:B564)","v":0},0,0,0,94114,0,0]
[]
["Strut Guy Installation"]
["Poles, Towers & Fixtures",null,null,null,null,8113]
["Overhead Conductors & Devices",null,null,null,null,772]
["Underground Conduit",null,null,null,null,264]
["Underground Conductors & Devices",null,null,null,null,317]
["Line Transformers",null,null,null,null,317]
["Services",null,null,null,null,211]
["Meters",null,null,null,null,493]
["Sub-Total",{"$f":"SUM(B568:B574)","v":0},0,0,0,10487,0,0]
[]
["Harriston Library Upgrade"]
["Poles, Towers & Fixtures",null,null,null,null,1935]
["Overhead Conductors & Devices",null,null,null,null,290]
["Underground Conduit"]
["Underground Conductors & Devices"]
["Line Transformers",null,null,null,null,9766]
["Services"]
["Meters"]
["Sub-Total",{"$f":"SUM(B578:B584)","v":0},0,0,0,11991,0,0]
[]
["Retro for Demolition"]
["Poles, Towers & Fixtures",null,null,null,null,1995]
["Overhead Conductors & Devices",null,null,null,null,173]
["Underground Conduit"]
["Underground Conductors & Devices"]
["Line Transformers",null,null,null,null,115]
["Services",null,null,null,null,462]
["Meters"]
["Sub-Total",{"$f":"SUM(B588:B594)","v":0},0,0,0,2745,0,0]
[]
["Stock"]
["Distribution Station Equipment",null,null,null,55648]
["Poles, Towers & Fixtures",null,null,null,3249]
["Overhead Conductors & Devices",null,null,null,624]
["Underground Conduit",null,null,null,22]
["Underground Conductors & Devices",null,null,null,40764]
["Line Transformers",24158,30696,-2944,18899]
["Services",null,null,null,7135]
["Meters",50000,50000,55395,6571,112118]
["Sub-Total",{"$f":"SUM(B599:B605)","v":74158},80696,52451,{"$f":"SUM(E598:E605)","v":132912},112118,0,0]
[]
["Other - Burden Clearing and Scrap Inventory Adjustment"]
["Capital Cost",1015100,283194]
["Distribution Station Equipment",null,null,null,null,47957]
["Poles, Towers & Fixtures",null,null,-65358,9011,-105818]
["Overhead Conductors & Devices",null,null,-69910,11906,-59036]
["Underground Conduit",null,null,-7472,1990,-13339]
["Underground Conductors & Devices",null,null,-57711,78,10694]
["Line Transformers",null,null,-85665,257,-72048]
["Services",null,null,-40406,-109,-63683]
["Meters",null,null,-3023,60,{"$f":"18262-12854","v":5408}]
["Sub-Total",{"$f":"SUM(B609:B617)","v":1015100},{"$f":"SUM(C609:C617)","v":283194},{"$f":"SUM(D609:D617)","v":-329545},{"$f":"SUM(E611:E617)","v":23193},{"$f":"SUM(F610:F617)","v":-249865},0,0]
[]
["Reclassified or Transferred"]
["Poles, Towers & Fixtures"]
["Overhead Conductors & Devices",null,null,1202043,-1032464]
["Underground Conduit"]
["Underground Conductors & Devices",null,null,null,1760894]
["Line Transformers",null,null,null,-721852]
["Services"]
["Meters",null,null,null,2605]
["Sub-Total",{"$f":"SUM(B621:B627)","v":0},0,1202043,9183,0,0,0]
[]
["Other"]
["Buildings",2443787,null,30908,1843,null,5000,9000]
["Office Furniture & Equipment",null,{"$f":"16995+227058","v":244053},null,7834,10589,5000,2000]
["Computer Hardware",null,{"$f":"40015+357474","v":397489},24238,14881,45385,22000,28600]
["Computer Sofware",null,{"$f":"317300+409572","v":726872},23488,104332,89765,50000,45000]
["Transportation Equipment",null,{"$f":"54907+1563355","v":1618262},28862,276547,284250,450000,400000]
["Stores Equipment",null,{"$f":"3659+19842","v":23501},67436]
["Tools, Shop & Garage Equipment",null,{"$f":"29764+184420","v":214184},27924,36167,18505,72000,72000]
["Measurement & Testing Equipment",null,{"$f":"8278+51482","v":59760},null,3379,4405]
["Power Operated Equipment",null,{"$f":"36936+30011","v":66947},33325]
["Communications Equipment",null,{"$f":"2882+99188","v":102070},null,99028]
["Miscellaneous Equipment",null,{"$f":"4933+27970","v":32903},4890,5700,null,40000,45000]
["Sub-Total",{"$f":"SUM(B631:B641)","v":2443787},{"$f":"SUM(C631:C641)","v":3486041},{"$f":"SUM(D631:D641)","v":241071},{"$f":"SUM(E631:E641)","v":549711},{"$f":"SUM(F631:F640)","v":452899},{"$f":"SUM(G631:G641)","v":644000},{"$f":"SUM(H631:H641)","v":601600}]
[]
["Miscellaneous",null,1427]
["Total",{"$f":"SUMPRODUCT(--($A15:$A644=\"Sub-Total\"), B$15:B$644)+B644","v":5529046},6091195,4584982,3029418,4159822,4892456,5566081]
["Contributed Capital",{"$f":"+'App.2-B_Fixed Asset Cont 2007'!F52","v":-677549},{"$f":"+'App.2-B_Fixed Asset Cont 2008'!F52","v":-892416},{"$f":"+'App.2-B_Fixed Asset Cont 2009'!F52","v":-1264357.4000000001},{"$f":"+'App.2-B_Fixed Asset Cont 2010'!F52","v":-287613.29000000044},{"$f":"+'App.2-B_Fixed Asset Cont 2011'!F52","v":-632720.38},{"$f":"+'App.2-B_Fixed Asset Cont 2012'!F52","v":-433861},{"$f":"+'App.2-B_Fixed Asset Cont 2013'!F52","v":-417663}]
["Net Total",{"$f":"SUM(B645:B646)","v":4851497},5198779,3320624.5999999996,2741804.7099999995,3527101.62,4458595,5148418]
[]
["Notes:"]
[]
["1   Please provide a breakdown of the major components of each capital project.  Please ensure that all projects below the materiality threshold are included in the miscellaneous line.  Add more projects as required."]
[]
["2   Amounts should be reported on a MIFRS basis for the adoption year and any subsequent years, only."]
[]
["WPI Notes:"]
[]
["1  Received direction from Ted A at OEB that it was acceptable to report CGAAP for each year as the proper accounting treatment is addressed along with all other assets in subsequent schedules"]

{"sheet":"App.2-B_Fixed Asset Cont 2007","index":3,"n_rows":72,"n_cols":14,"rows_kept":72,"cut":false,"hidden":false,"merged":[[69,1,69,13],[8,0,8,13],[9,0,9,13],[13,4,13,7],[63,1,64,13],[66,1,67,13]]}
[null,null,null,null,null,null,null,null,null,null,null,null,"File Number:",{"$f":"'LDC Info'!$E$18","v":"EB2012-0176"}]
[null,null,null,null,null,null,null,null,null,null,null,null,"Exhibit:"]
[null,null,null,null,null,null,null,null,null,null,null,null,"Tab:"]
[null,null,null,null,null,null,null,null,null,null,null,null,"Schedule:"]
[null,null,null,null,null,null,null,null,null,null,null,null,"Page:"]
[]
[null,null,null,null,null,null,null,null,null,null,null,null,"Date:"]
[]
["Appendix 2-B"]
["Fixed Asset Continuity Schedule"]
[]
[null,null,null,null,null,"Year ",2007]
[]
[null,null,null,null,"Cost",null,null,null,null,null,"Accumulated Depreciation"]
["CCA Class","OEB","Description","Depreciation Rate","Opening Balance","Additions","Disposals","Closing Balance",null,"Opening Balance","Additions","Disposals","Closing Balance","Net Book Value"]
[12,1611,"Computer Software (Formally known as Account 1925)",null,null,null,null,{"$f":"E16+F16+G16","v":0},null,null,null,null,{"$f":"J16+K16+L16","v":0},{"$f":"H16+M16","v":0}]
["CEC",1612,"Land Rights (Formally known as Account 1906)",null,null,null,null,{"$f":"E17+F17+G17","v":0},null,null,null,null,{"$f":"J17+K17+L17","v":0},{"$f":"H17+M17","v":0}]
["N/A",1805,"Land",null,242769,null,-15000,{"$f":"E18+F18+G18","v":227769},null,null,null,null,{"$f":"J18+K18+L18","v":0},{"$f":"H18+M18","v":227769}]
[47,1808,"Buildings",0.02,6517,2443787,null,{"$f":"E19+F19+G19","v":2450304},null,-2023,-24758,null,{"$f":"J19+K19+L19","v":-26781},{"$f":"H19+M19","v":2423523}]
[13,1810,"Leasehold Improvements",null,null,null,null,0,null,null,null,null,0,0]
[47,1815,"Transformer Station Equipment >50 kV",null,null,null,null,0,null,null,null,null,0,0]
[47,1820,"Distribution Station Equipment <50 kV",3.3300000000000003E-2,3073798,83593,null,3157391,null,-862166,-143364,null,-1005530,2151861]
[47,1825,"Storage Battery Equipment",null,null,null,null,0,null,null,null,null,0,0]
[47,1830,"Poles, Towers & Fixtures",0.04,4811058,194258,null,5005316,null,-1094849,-217108,null,-1311957,3693359]
[47,1835,"Overhead Conductors & Devices",0.04,6734937,622265,null,7357202,null,-1442428,-316175,null,-1758603,5598599]
[47,1840,"Underground Conduit",0.04,2094546,389798,null,2484344,null,-393133,-100545,null,-493678,1990666]
[47,1845,"Underground Conductors & Devices",0.04,5563155,695407,null,6258562,null,-1130311,-265053,null,-1395364,4863198]
[47,1850,"Line Transformers",0.04,5896988,624935,null,6521923,null,-1143249,-276309,null,-1419558,5102365]
[47,1855,"Services (Overhead & Underground)",0.04,2727052,277646,null,3004698,null,-555934,-125438,null,-681372,2323326]
[47,1860,"Meters",0.04,2302027,136217,-61140,2377104,null,-490587,-105800,null,-596387,1780717]
[8,1860,"Meters (Smart Meters)",0.04,null,61140,null,61140,null,null,null,null,0,61140]
["N/A",1905,"Land",null,null,null,null,0,null,null,null,null,0,0]
[47,1908,"Buildings & Fixtures",null,null,null,null,0,null,null,null,null,0,0]
[13,1910,"Leasehold Improvements",null,null,null,null,0,null,null,null,null,0,0]
[8,1915,"Office Furniture & Equipment (10 years)",null,null,null,null,0,null,null,null,null,0,0]
[8,1915,"Office Furniture & Equipment (5 years)",null,null,null,null,0,null,null,null,null,0,0]
[10,1920,"Computer Equipment - Hardware",null,null,null,null,0,null,null,null,null,0,0]
[45,1920,"Computer Equip.-Hardware(Post Mar. 22/04)",null,null,null,null,0,null,null,null,null,0,0]
[45.1,1920,"Computer Equip.-Hardware(Post Mar. 19/07)",null,null,null,null,0,null,null,null,null,0,0]
[12,1925,"Computer Software (Formally known as Account 1925)",0.2,267519,null,null,267519,null,-209098,-53503,null,-262601,4918]
[10,1930,"Transportation Equipment",null,null,null,null,0,null,null,null,null,0,0]
[8,1935,"Stores Equipment",null,null,null,null,0,null,null,null,null,0,0]
[8,1940,"Tools, Shop & Garage Equipment",null,null,null,null,0,null,null,null,null,0,0]
[8,1945,"Measurement & Testing Equipment",null,null,null,null,0,null,null,null,null,0,0]
[8,1950,"Power Operated Equipment",null,null,null,null,0,null,null,null,null,0,0]
[8,1955,"Communications Equipment",null,null,null,null,0,null,null,null,null,0,0]
[8,1955,"Communication Equipment (Smart Meters)",null,null,null,null,0,null,null,null,null,0,0]
[8,1960,"Miscellaneous Equipment ",null,null,null,null,0,null,null,null,null,0,0]
[47,1975,"Load Management Controls Utility Premises",0.1,258631,null,null,258631,null,-258631,null,null,-258631,0]
[47,1980,"System Supervisor Equipment",null,null,null,null,0,null,null,null,null,0,0]
[47,1985,"Miscellaneous Fixed Assets",null,null,null,null,0,null,null,null,null,0,0]
[47,1995,"Contributions & Grants",0.04,-4437179,-677549,null,-5114728,null,424159,194413,null,618572,-4496156]
[null,"etc.",null,null,null,null,null,0,null,null,null,null,0,0]
[]
[null,null,"Total",null,{"$f":"SUM(E16:E54)","v":29541818},{"$f":"SUM(F16:F54)","v":4851497},-76140,34317175,null,{"$f":"SUM(J16:J54)","v":-7158250},{"$f":"SUM(K16:K54)","v":-1433640},0,-8591890,25725285]
[]
[null,null,null,null,null,null,null,null,null,"Less: Fully Allocated Depreciation"]
[10,null,"Transportation",null,null,null,null,null,null,"Transportation"]
[8,null,"Stores Equipment",null,null,null,null,null,null,"Stores Equipment"]
[null,null,null,null,null,null,null,null,null,"Net Depreciation",null,{"$f":"L55-L58-L59","v":0}]
[]
["Notes:"]
[]
[1,"Tables in the format outlined above covering all fixed asset accounts should be submitted for the Test Year, Bridge Year and all relevant historical years.  At a minimum , the applicant must provide data for the earlier of: 1) all historical years back to its last rebasing; or 2) at least three years of historical actuals, in addition to Bridge Year and Test Year forecasts."]
[]
[]
[2,"The \"CCA Class\" for fixed assets should agree with the CCA Class used for tax purposes in Tax Returns. Fixed Assets sub-components may be used where the underlying asset components are classified under multiple CCA Classes for tax purposes. If an applicant uses any different classes from those shown in the table, an explanation should be provided. (also see note 3 below)."]
[]
[]
[3,"The table may need to be customized for a utility's asset categories or for any new asset accounts announced or authorized by the Board."]
[]
[4,"The depreciation column (D) is not required as the relevant information will be provided in the following 2-C series of appendices."]

{"sheet":"App.2-B_Fixed Asset Cont 2008","index":4,"n_rows":72,"n_cols":14,"rows_kept":72,"cut":false,"hidden":false,"merged":[[69,1,69,13],[8,0,8,13],[9,0,9,13],[13,4,13,7],[63,1,64,13],[66,1,67,13]]}
[null,null,null,null,null,null,null,null,null,null,null,null,"File Number:",{"$f":"'LDC Info'!$E$18","v":"EB2012-0176"}]
[null,null,null,null,null,null,null,null,null,null,null,null,"Exhibit:"]
[null,null,null,null,null,null,null,null,null,null,null,null,"Tab:"]
[null,null,null,null,null,null,null,null,null,null,null,null,"Schedule:"]
[null,null,null,null,null,null,null,null,null,null,null,null,"Page:"]
[]
[null,null,null,null,null,null,null,null,null,null,null,null,"Date:"]
[]
["Appendix 2-B"]
["Fixed Asset Continuity Schedule"]
[]
[null,null,null,null,null,"Year ",2008]
[]
[null,null,null,null,"Cost",null,null,null,null,null,"Accumulated Depreciation"]
["CCA Class","OEB","Description","Depreciation Rate","Opening Balance","Additions","Disposals","Closing Balance",null,"Opening Balance","Additions","Disposals","Closing Balance","Net Book Value"]
[12,1611,"Computer Software (Formally known as Account 1925)",null,null,null,null,{"$f":"E16+F16+G16","v":0},null,null,null,null,{"$f":"J16+K16+L16","v":0},{"$f":"H16+M16","v":0}]
["CEC",1612,"Land Rights (Formally known as Account 1906)",null,null,null,null,{"$f":"E17+F17+G17","v":0},null,null,null,null,{"$f":"J17+K17+L17","v":0},{"$f":"H17+M17","v":0}]
["N/A",1805,"Land",null,{"$f":"+'App.2-B_Fixed Asset Cont 2007'!H18","v":227769},null,null,{"$f":"E18+F18+G18","v":227769},null,null,null,null,{"$f":"J18+K18+L18","v":0},{"$f":"H18+M18","v":227769}]
[47,1808,"Buildings",0.02,{"$f":"+'App.2-B_Fixed Asset Cont 2007'!H19","v":2450304},null,null,{"$f":"E19+F19+G19","v":2450304},null,{"$f":"+'App.2-B_Fixed Asset Cont 2007'!M19","v":-26781},{"$f":"-24130-25066","v":-49196},null,{"$f":"J19+K19+L19","v":-75977},{"$f":"H19+M19","v":2374327}]
[13,1810,"Leasehold Improvements",null,null,null,null,0,null,null,null,null,0,0]
[47,1815,"Transformer Station Equipment >50 kV",null,null,null,null,0,null,null,null,null,0,0]
[47,1820,"Distribution Station Equipment <50 kV",3.3300000000000003E-2,{"$f":"+'App.2-B_Fixed Asset Cont 2007'!H22","v":3157391},387320,null,3544711,null,{"$f":"+'App.2-B_Fixed Asset Cont 2007'!M22","v":-1005530},{"$f":"-148825-1394","v":-150219},null,-1155749,2388962]
[47,1825,"Storage Battery Equipment",null,null,null,null,0,null,null,null,null,0,0]
[47,1830,"Poles, Towers & Fixtures",0.04,{"$f":"+'App.2-B_Fixed Asset Cont 2007'!H24","v":5005316},284012,null,5289328,null,{"$f":"+'App.2-B_Fixed Asset Cont 2007'!M24","v":-1311957},{"$f":"-207410-19268","v":-226678},null,-1538635,3750693]
[47,1835,"Overhead Conductors & Devices",0.04,{"$f":"+'App.2-B_Fixed Asset Cont 2007'!H25","v":7357202},325395,null,7682597,null,{"$f":"+'App.2-B_Fixed Asset Cont 2007'!M25","v":-1758603},{"$f":"-322873-170479","v":-493352},null,-2251955,5430642]
[47,1840,"Underground Conduit",0.04,{"$f":"+'App.2-B_Fixed Asset Cont 2007'!H26","v":2484344},113840,null,2598184,null,{"$f":"+'App.2-B_Fixed Asset Cont 2007'!M26","v":-493678},{"$f":"-90910-19700","v":-110610},null,-604288,1993896]
[47,1845,"Underground Conductors & Devices",0.04,{"$f":"+'App.2-B_Fixed Asset Cont 2007'!H27","v":6258562},523410,null,6781972,null,{"$f":"+'App.2-B_Fixed Asset Cont 2007'!M27","v":-1395364},{"$f":"-211970+80718","v":-131252},null,-1526616,5255356]
[47,1850,"Line Transformers",0.04,{"$f":"+'App.2-B_Fixed Asset Cont 2007'!H28","v":6521923},699162,null,7221085,null,{"$f":"+'App.2-B_Fixed Asset Cont 2007'!M28","v":-1419558},{"$f":"-253079-49709","v":-302788},null,-1722346,5498739]
[47,1855,"Services (Overhead & Underground)",0.04,{"$f":"+'App.2-B_Fixed Asset Cont 2007'!H29","v":3004698},356816,null,3361514,null,{"$f":"+'App.2-B_Fixed Asset Cont 2007'!M29","v":-681372},{"$f":"-122218-15906","v":-138124},null,-819496,2542018]
[47,1860,"Meters",0.04,{"$f":"+'App.2-B_Fixed Asset Cont 2007'!H30","v":2377104},151290,null,2528394,null,{"$f":"+'App.2-B_Fixed Asset Cont 2007'!M30","v":-596387},{"$f":"-98806-3011","v":-101817},null,-698204,1830190]
[8,1860,"Meters (Smart Meters)",0.04,{"$f":"+'App.2-B_Fixed Asset Cont 2007'!H31","v":61140},null,null,61140,null,null,-9774,null,-9774,51366]
["N/A",1905,"Land",null,null,null,null,0,null,null,null,null,0,0]
[47,1908,"Buildings & Fixtures",null,null,null,null,0,null,null,null,null,0,0]
[13,1910,"Leasehold Improvements",null,null,null,null,0,null,null,null,null,0,0]
[8,1915,"Office Furniture & Equipment (10 years)",0.1,null,244053,null,244053,null,null,-133197,null,-133197,110856]
[8,1915,"Office Furniture & Equipment (5 years)",null,null,null,null,0,null,null,null,null,0,0]
[10,1920,"Computer Equipment - Hardware",0.2,null,69332,null,69332,null,null,-152871,null,-152871,-83539]
[45,1920,"Computer Equip.-Hardware(Post Mar. 22/04)",0.2,null,275946,null,275946,null,null,-132138,null,-132138,143808]
[45.1,1920,"Computer Equip.-Hardware(Post Mar. 19/07)",0.2,null,52212,null,52212,null,null,-44775,null,-44775,7437]
[12,1925,"Computer Software (Formally known as Account 1925)",0.33329999999999999,{"$f":"+'App.2-B_Fixed Asset Cont 2007'!H40","v":267519},459353,null,726872,null,{"$f":"+'App.2-B_Fixed Asset Cont 2007'!M40","v":-262601},-408731,null,-671332,55540]
[10,1930,"Transportation Equipment",0.125,null,1648262,-30000,1618262,null,null,-978880,30000,-948880,669382]
[8,1935,"Stores Equipment",0.1,null,23501,null,23501,null,null,-7006,null,-7006,16495]
[8,1940,"Tools, Shop & Garage Equipment",0.1,null,214184,null,214184,null,null,-136811,null,-136811,77373]
[8,1945,"Measurement & Testing Equipment",0.1,null,59760,null,59760,null,null,-16339,null,-16339,43421]
[8,1950,"Power Operated Equipment",0.125,null,66947,null,66947,null,null,-26037,null,-26037,40910]
[8,1955,"Communications Equipment",0.1,null,102070,null,102070,null,null,-86622,null,-86622,15448]
[8,1955,"Communication Equipment (Smart Meters)",null,null,null,null,0,null,null,null,null,0,0]
[8,1960,"Miscellaneous Equipment ",0.1,null,32903,null,32903,null,null,-18442,null,-18442,14461]
[47,1975,"Load Management Controls Utility Premises",0.1,{"$f":"+'App.2-B_Fixed Asset Cont 2007'!H49","v":258631},null,null,258631,null,{"$f":"+'App.2-B_Fixed Asset Cont 2007'!M49","v":-258631},null,null,-258631,0]
[47,1980,"System Supervisor Equipment",null,null,null,null,0,null,null,null,null,0,0]
[47,1985,"Miscellaneous Fixed Assets",0.1,null,1427,null,1427,null,null,-1427,null,-1427,0]
[47,1995,"Contributions & Grants",0.04,{"$f":"+'App.2-B_Fixed Asset Cont 2007'!H52","v":-5114728},-892416,null,-6007144,null,{"$f":"+'App.2-B_Fixed Asset Cont 2007'!M52","v":618572},{"$f":"160815+62401","v":223216},null,841788,-5165356]
[null,"etc.",null,null,null,null,null,0,null,null,null,null,0,0]
[]
[null,null,"Total",null,{"$f":"SUM(E16:E54)","v":34317175},{"$f":"SUM(F16:F54)","v":5198779},-30000,39485954,null,{"$f":"SUM(J16:J54)","v":-8591890},{"$f":"SUM(K16:K54)","v":-3633870},30000,-12195760,27290194]
[]
[null,null,null,null,null,null,null,null,null,"Less: Fully Allocated Depreciation"]
[10,null,"Transportation",null,null,null,null,null,null,"Transportation"]
[8,null,"Stores Equipment",null,null,null,null,null,null,"Stores Equipment"]
[null,null,null,null,null,null,null,null,null,"Net Depreciation",null,{"$f":"L55-L58-L59","v":30000}]
[]
["Notes:"]
[]
[1,"Tables in the format outlined above covering all fixed asset accounts should be submitted for the Test Year, Bridge Year and all relevant historical years.  At a minimum , the applicant must provide data for the earlier of: 1) all historical years back to its last rebasing; or 2) at least three years of historical actuals, in addition to Bridge Year and Test Year forecasts."]
[]
[]
[2,"The \"CCA Class\" for fixed assets should agree with the CCA Class used for tax purposes in Tax Returns. Fixed Assets sub-components may be used where the underlying asset components are classified under multiple CCA Classes for tax purposes. If an applicant uses any different classes from those shown in the table, an explanation should be provided. (also see note 3 below)."]
[]
[]
[3,"The table may need to be customized for a utility's asset categories or for any new asset accounts announced or authorized by the Board."]
[]
[4,"The depreciation column (D) is not required as the relevant information will be provided in the following 2-C series of appendices."]

{"sheet":"App.2-B_Fixed Asset Cont 2009","index":5,"n_rows":72,"n_cols":14,"rows_kept":72,"cut":false,"hidden":false,"merged":[[69,1,69,13],[8,0,8,13],[9,0,9,13],[13,4,13,7],[63,1,64,13],[66,1,67,13]]}
[null,null,null,null,null,null,null,null,null,null,null,null,"File Number:",{"$f":"'LDC Info'!$E$18","v":"EB2012-0176"}]
[null,null,null,null,null,null,null,null,null,null,null,null,"Exhibit:"]
[null,null,null,null,null,null,null,null,null,null,null,null,"Tab:"]
[null,null,null,null,null,null,null,null,null,null,null,null,"Schedule:"]
[null,null,null,null,null,null,null,null,null,null,null,null,"Page:"]
[]
[null,null,null,null,null,null,null,null,null,null,null,null,"Date:"]
[]
["Appendix 2-B"]
["Fixed Asset Continuity Schedule"]
[]
[null,null,null,null,null,"Year ",2009]
[]
[null,null,null,null,"Cost",null,null,null,null,null,"Accumulated Depreciation"]
["CCA Class","OEB","Description","Depreciation Rate","Opening Balance","Additions","Disposals","Closing Balance",null,"Opening Balance","Additions","Disposals","Closing Balance","Net Book Value"]
[12,1611,"Computer Software (Formally known as Account 1925)",null,null,null,null,{"$f":"E16+F16+G16","v":0},null,null,null,null,{"$f":"J16+K16+L16","v":0},{"$f":"H16+M16","v":0}]
["CEC",1612,"Land Rights (Formally known as Account 1906)",null,null,null,null,{"$f":"E17+F17+G17","v":0},null,null,null,null,{"$f":"J17+K17+L17","v":0},{"$f":"H17+M17","v":0}]
["N/A",1805,"Land",null,227768.86,null,null,{"$f":"E18+F18+G18","v":227768.86},null,null,null,null,{"$f":"J18+K18+L18","v":0},{"$f":"H18+M18","v":227768.86}]
[47,1808,"Buildings",0.02,2450303.9,30908,null,{"$f":"E19+F19+G19","v":2481211.9},null,-75977.2,-49513,null,{"$f":"J19+K19+L19","v":-125490.2},{"$f":"H19+M19","v":2355721.6999999997}]
[13,1810,"Leasehold Improvements",null,null,null,null,0,null,null,null,null,0,0]
[47,1815,"Transformer Station Equipment >50 kV",null,null,null,null,0,null,null,null,null,0,0]
[47,1820,"Distribution Station Equipment <50 kV",3.3300000000000003E-2,3544711.27,123140.78,null,3667852.05,null,-1155748.69,-158695.01999999999,null,-1314443.71,2353408.34]
[47,1825,"Storage Battery Equipment",null,null,null,null,0,null,null,null,null,0,0]
[47,1830,"Poles, Towers & Fixtures",0.04,5289327.3,591965.42000000004,null,5881292.7199999997,null,-1538635.3,-244175.92,null,-1782811.22,4098481.5]
[47,1835,"Overhead Conductors & Devices",0.04,8884640.1400000006,664080.74,-1202043,8346677.8800000008,null,-2251955.14,-403032.24,null,-2654987.38,5691690.5000000009]
[47,1840,"Underground Conduit",0.04,2598184.09,72698.66,null,2670882.75,null,-604287.79,-114349.66,null,-718637.45000000007,1952245.2999999998]
[47,1845,"Underground Conductors & Devices",0.04,5229426,2435317.3899999997,null,7664743.3899999997,null,-1526615.59,-262472.8,null,-1789088.3900000001,5875655]
[47,1850,"Line Transformers",0.04,7571587,29689.070000000298,null,7601276.0700000003,null,{"$f":"-1066643.91-655701.6","v":-1722345.5099999998},{"$f":"-171567.6-159849.46","v":-331417.06},null,-2053762.5699999998,5547513.5]
[47,1855,"Services (Overhead & Underground)",0.04,{"$f":"1227525.5+2133987.74","v":3361513.24},{"$f":"131842.68+212805.08","v":344647.76},null,3706161,null,{"$f":"-342638.5-476857.24","v":-819495.74},{"$f":"-57062.68-95097.08","v":-152159.76},null,-971655.5,2734505.5]
[47,1860,"Meters",0.04,{"$f":"1766764.43+761629.61","v":2528394.04},{"$f":"26507.75-125726.72+181591.75","v":82372.78},-602915.31999999995,2007851.5,null,{"$f":"-707978.02+0+9773.98","v":-698204.04},-87460,{"$f":"246719-9774","v":236945},-548719.04,1459132.46]
[8,1860,"Meters (Smart Meters)",0.04,61139.98,null,-61140,-1.9999999996798579E-2,null,-9773.98,null,9773.98,0,-1.9999999996798579E-2]
["N/A",1905,"Land",null,null,null,null,0,null,null,null,null,0,0]
[47,1908,"Buildings & Fixtures",null,null,null,null,0,null,null,null,null,0,0]
[13,1910,"Leasehold Improvements",null,null,null,null,0,null,null,null,null,0,0]
[8,1915,"Office Furniture & Equipment (10 years)",0.1,244053.3,null,null,244053.3,null,-133196.79999999999,-18953,null,-152149.79999999999,91903.5]
[8,1915,"Office Furniture & Equipment (5 years)",null,null,null,null,0,null,null,null,null,0,0]
[10,1920,"Computer Equipment - Hardware",0.2,{"$f":"156649.36+70507.42+18173.17-6425.08-3780+40821.16","v":275946.02999999997},null,null,275946.02999999997,null,-152871.07,null,null,-152871.07,123074.95999999996]
[45,1920,"Computer Equip.-Hardware(Post Mar. 22/04)",0.2,{"$f":"6328.34+21247.41+24635.88","v":52211.630000000005},null,null,52211.630000000005,null,{"$f":"-56456.32-55482.39-20198.88","v":-132137.59},{"$f":"-4249-4927","v":-9176},null,-141313.59,-89101.959999999992]
[45.1,1920,"Computer Equip.-Hardware(Post Mar. 19/07)",0.2,{"$f":"29316.41+40015.48","v":69331.89},24238.11,null,93570,null,{"$f":"-24469.41-20306","v":-44775.41},{"$f":"-5863-8003-2422.11","v":-16288.11},null,-61063.520000000004,32506.479999999996]
[12,1925,"Computer Software (Formally known as Account 1925)",0.33329999999999999,726871.27,23487.95,null,750359.22,null,-671331.77,-34565.449999999997,null,-705897.22,44462]
[10,1930,"Transportation Equipment",0.125,1618262.33,28861.91,null,1647124.24,null,-948879.83,-130149.41,null,-1079029.24,568095]
[8,1935,"Stores Equipment",0.1,23501.39,67435.820000000007,null,90937.21,null,-7005.89,-5518.32,null,-12524.21,78413]
[8,1940,"Tools, Shop & Garage Equipment",0.1,214184.3,27924.48,null,242108.78,null,-136811.29999999999,-12919.48,null,-149730.78,92378]
[8,1945,"Measurement & Testing Equipment",0.1,59760,null,null,59760,null,-16338.5,-5973,null,-22311.5,37448.5]
[8,1950,"Power Operated Equipment",0.125,66946.94,33325.019999999997,null,100271.95999999999,null,-26037.439999999999,-6335.02,null,-32372.46,67899.5]
[8,1955,"Communications Equipment",0.1,102070.39,null,null,102070.39,null,-86622.39,-10862,null,-97484.39,4586]
[8,1955,"Communication Equipment (Smart Meters)",null,null,null,null,0,null,null,null,null,0,0]
[8,1960,"Miscellaneous Equipment ",0.1,32903.480000000003,4889.78,null,37793.26,null,-18441.98,-3542.78,null,-21984.76,15808.500000000004]
[47,1975,"Load Management Controls Utility Premises",0.1,258630.5,null,null,258630.5,null,-258630.5,null,null,-258630.5,0]
[47,1980,"System Supervisor Equipment",null,null,null,null,0,null,null,null,null,0,0]
[47,1985,"Miscellaneous Fixed Assets",0.1,null,1427,null,1427,null,-1426.68,null,null,-1426.68,0.31999999999993634]
[47,1995,"Contributions & Grants",0.04,{"$f":"-(299558.47+2352820.34+558004.61+960617.92+1765272.85+70869.96)","v":-6007144.1499999994},{"$f":"-(225705.82+245178.6+205755.75+423828.02+114813.85+45697.49)-3377.87","v":-1264357.4000000001},3377.87,-7268123.6799999997,null,{"$f":"(346134.31+134650.61+97959.92+252045.85+10996.96)","v":841787.64999999991},{"$f":"(116061.92+26486.75+47036.52+72916.85+3091.88)+720.98","v":266314.89999999997},-720.98,1107381.5699999998,-6160742.1099999994]
[null,"etc.",null,null,null,null,null,0,null,null,null,null,0,0]
[]
[null,null,"Total",null,{"$f":"SUM(E16:E54)","v":39484525.119999997},{"$f":"SUM(F16:F54)","v":3322053.2700000005},-1862720.4499999997,40943857.940000005,null,{"$f":"SUM(J16:J54)","v":-12195758.480000002},{"$f":"SUM(K16:K54)","v":-1791243.1300000001},245998,-13741003.610000003,27202854.330000002]
[]
[null,null,null,null,null,null,null,null,null,"Less: Fully Allocated Depreciation"]
[10,null,"Transportation",null,null,null,null,null,null,"Transportation"]
[8,null,"Stores Equipment",null,null,null,null,null,null,"Stores Equipment"]
[null,null,null,null,null,null,null,null,null,"Net Depreciation",null,{"$f":"L55-L58-L59","v":245998}]
[]
["Notes:"]
[]
[1,"Tables in the format outlined above covering all fixed asset accounts should be submitted for the Test Year, Bridge Year and all relevant historical years.  At a minimum , the applicant must provide data for the earlier of: 1) all historical years back to its last rebasing; or 2) at least three years of historical actuals, in addition to Bridge Year and Test Year forecasts."]
[]
[]
[2,"The \"CCA Class\" for fixed assets should agree with the CCA Class used for tax purposes in Tax Returns. Fixed Assets sub-components may be used where the underlying asset components are classified under multiple CCA Classes for tax purposes. If an applicant uses any different classes from those shown in the table, an explanation should be provided. (also see note 3 below)."]
[]
[]
[3,"The table may need to be customized for a utility's asset categories or for any new asset accounts announced or authorized by the Board."]
[]
[4,"The depreciation column (D) is not required as the relevant information will be provided in the following 2-C series of appendices."]

{"sheet":"App.2-B_Fixed Asset Cont 2010","index":6,"n_rows":72,"n_cols":14,"rows_kept":72,"cut":false,"hidden":false,"merged":[[69,1,69,13],[8,0,8,13],[9,0,9,13],[13,4,13,7],[63,1,64,13],[66,1,67,13]]}
[null,null,null,null,null,null,null,null,null,null,null,null,"File Number:",{"$f":"'LDC Info'!$E$18","v":"EB2012-0176"}]
[null,null,null,null,null,null,null,null,null,null,null,null,"Exhibit:"]
[null,null,null,null,null,null,null,null,null,null,null,null,"Tab:"]
[null,null,null,null,null,null,null,null,null,null,null,null,"Schedule:"]
[null,null,null,null,null,null,null,null,null,null,null,null,"Page:"]
[]
[null,null,null,null,null,null,null,null,null,null,null,null,"Date:"]
[]
["Appendix 2-B"]
["Fixed Asset Continuity Schedule"]
[]
[null,null,null,null,null,"Year ",2010]
[]
[null,null,null,null,"Cost",null,null,null,null,null,"Accumulated Depreciation"]
["CCA Class","OEB","Description","Depreciation Rate","Opening Balance","Additions","Disposals","Closing Balance",null,"Opening Balance","Additions","Disposals","Closing Balance","Net Book Value"]
[12,1611,"Computer Software (Formally known as Account 1925)",null,null,null,null,{"$f":"E16+F16+G16","v":0},null,null,null,null,{"$f":"J16+K16+L16","v":0},{"$f":"H16+M16","v":0}]
["CEC",1612,"Land Rights (Formally known as Account 1906)",null,null,null,null,{"$f":"E17+F17+G17","v":0},null,null,null,null,{"$f":"J17+K17+L17","v":0},{"$f":"H17+M17","v":0}]
["N/A",1805,"Land",null,{"$f":"+'App.2-B_Fixed Asset Cont 2009'!H18","v":227768.86},null,null,{"$f":"E18+F18+G18","v":227768.86},null,null,null,null,{"$f":"J18+K18+L18","v":0},{"$f":"H18+M18","v":227768.86}]
[47,1808,"Buildings",0.02,{"$f":"+'App.2-B_Fixed Asset Cont 2009'!H19","v":2481211.9},5106.1000000000004,null,{"$f":"E19+F19+G19","v":2486318},null,{"$f":"+'App.2-B_Fixed Asset Cont 2009'!M19","v":-125490.2},-49820.62,null,{"$f":"J19+K19+L19","v":-175310.82},{"$f":"H19+M19","v":2311007.1800000002}]
[13,1810,"Leasehold Improvements",null,null,null,null,0,null,null,null,null,0,0]
[47,1815,"Transformer Station Equipment >50 kV",null,null,null,null,0,null,null,null,null,0,0]
[47,1820,"Distribution Station Equipment <50 kV",3.3300000000000003E-2,{"$f":"+'App.2-B_Fixed Asset Cont 2009'!H22","v":3667852.05},150637.49,null,3818489.54,null,{"$f":"+'App.2-B_Fixed Asset Cont 2009'!M22","v":-1314443.71},-124772.33,null,-1439216.04,2379273.5]
[47,1825,"Storage Battery Equipment",null,null,null,null,0,null,null,null,null,0,0]
[47,1830,"Poles, Towers & Fixtures",0.04,{"$f":"+'App.2-B_Fixed Asset Cont 2009'!H24","v":5881292.7199999997},682474.67,null,6563767.3899999997,null,{"$f":"+'App.2-B_Fixed Asset Cont 2009'!M24","v":-1782811.22},-270377.23,null,-2053188.45,4510578.9399999995]
[47,1835,"Overhead Conductors & Devices",0.04,{"$f":"+'App.2-B_Fixed Asset Cont 2009'!H25","v":8346677.8800000008},726856.4,null,9073534.2800000012,null,{"$f":"+'App.2-B_Fixed Asset Cont 2009'!M25","v":-2654987.38},-273416.42,null,-2928403.8,6145130.4800000014]
[47,1840,"Underground Conduit",0.04,{"$f":"+'App.2-B_Fixed Asset Cont 2009'!H26","v":2670882.75},35402.839999999997,null,2706285.59,null,{"$f":"+'App.2-B_Fixed Asset Cont 2009'!M26","v":-718637.45000000007},-116732.16,null,-835369.6100000001,1870915.9799999997]
[47,1845,"Underground Conductors & Devices",0.04,{"$f":"+'App.2-B_Fixed Asset Cont 2009'!H27","v":7664743.3899999997},632802.96,null,8297546.3499999996,null,{"$f":"+'App.2-B_Fixed Asset Cont 2009'!M27","v":-1789088.3900000001},-490426,null,-2279514.39,6018031.959999999]
[47,1850,"Line Transformers",0.04,{"$f":"+'App.2-B_Fixed Asset Cont 2009'!H28","v":7601276.0700000003},{"$f":"-100985.31","v":-100985.31},null,7500290.7600000007,null,{"$f":"+'App.2-B_Fixed Asset Cont 2009'!M28","v":-2053762.5699999998},{"$f":"-1114546.34+815551.06","v":-298995.28000000003},null,-2352757.8499999996,5147532.9100000011]
[47,1855,"Services (Overhead & Underground)",0.04,{"$f":"+'App.2-B_Fixed Asset Cont 2009'!H29","v":3706161},{"$f":"2597670.14-2346792.82","v":250877.3200000003},null,3957038.3200000003,null,{"$f":"+'App.2-B_Fixed Asset Cont 2009'!M29","v":-971655.5},{"$f":"-736293.57+571954.32","v":-164339.25},null,-1135994.75,2821043.5700000003]
[47,1860,"Meters",0.04,{"$f":"+'App.2-B_Fixed Asset Cont 2009'!H30","v":2007851.5},{"$f":"755419.4-943221.36+286176.86","v":98374.900000000023},-286176.86,1820049.54,null,{"$f":"+'App.2-B_Fixed Asset Cont 2009'!M30","v":-548719.04},-74019,154488,-468250.04000000004,1351799.5]
[8,1860,"Meters (Smart Meters)",0.04,null,null,null,0,null,null,null,null,0,0]
["N/A",1905,"Land",null,null,null,null,0,null,null,null,null,0,0]
[47,1908,"Buildings & Fixtures",null,null,null,null,0,null,null,null,null,0,0]
[13,1910,"Leasehold Improvements",null,null,null,null,0,null,null,null,null,0,0]
[8,1915,"Office Furniture & Equipment (10 years)",0.1,{"$f":"+'App.2-B_Fixed Asset Cont 2009'!H35","v":244053.3},7834.05,null,251887.34999999998,null,{"$f":"+'App.2-B_Fixed Asset Cont 2009'!M35","v":-152149.79999999999},-19348.2,null,-171498,80389.349999999977]
[8,1915,"Office Furniture & Equipment (5 years)",null,null,null,null,0,null,null,null,null,0,0]
[10,1920,"Computer Equipment - Hardware",0.2,{"$f":"+'App.2-B_Fixed Asset Cont 2009'!H37","v":275946.02999999997},null,null,275946.02999999997,null,{"$f":"+'App.2-B_Fixed Asset Cont 2009'!M37","v":-152871.07},null,null,-152871.07,123074.95999999996]
[45,1920,"Computer Equip.-Hardware(Post Mar. 22/04)",0.2,{"$f":"+'App.2-B_Fixed Asset Cont 2009'!H38","v":52211.630000000005},null,null,52211.630000000005,null,{"$f":"+'App.2-B_Fixed Asset Cont 2009'!M38","v":-141313.59},{"$f":"-4927","v":-4927},null,-146240.59,-94028.959999999992]
[45.1,1920,"Computer Equip.-Hardware(Post Mar. 19/07)",0.2,{"$f":"+'App.2-B_Fixed Asset Cont 2009'!H39","v":93570},14881.22,null,108451.22,null,{"$f":"+'App.2-B_Fixed Asset Cont 2009'!M39","v":-61063.520000000004},{"$f":"-25129.12+4927","v":-20202.12},null,-81265.64,27185.58]
[12,1925,"Computer Software (Formally known as Account 1925)",0.33329999999999999,{"$f":"+'App.2-B_Fixed Asset Cont 2009'!H40","v":750359.22},104332.02,null,854691.24,null,{"$f":"+'App.2-B_Fixed Asset Cont 2009'!M40","v":-705897.22},-41811.68,null,-747708.9,106982.33999999997]
[10,1930,"Transportation Equipment",0.125,{"$f":"+'App.2-B_Fixed Asset Cont 2009'!H41","v":1647124.24},{"$f":"191546.79+85000","v":276546.79000000004},-85000,1838671.03,null,{"$f":"+'App.2-B_Fixed Asset Cont 2009'!M41","v":-1079029.24},{"$f":"-64235.83-85000","v":-149235.83000000002},85000,-1143265.07,695405.96]
[8,1935,"Stores Equipment",0.1,{"$f":"+'App.2-B_Fixed Asset Cont 2009'!H42","v":90937.21},null,null,90937.21,null,{"$f":"+'App.2-B_Fixed Asset Cont 2009'!M42","v":-12524.21},-8885.89,null,-21410.1,69527.110000000015]
[8,1940,"Tools, Shop & Garage Equipment",0.1,{"$f":"+'App.2-B_Fixed Asset Cont 2009'!H43","v":242108.78},36167.24,null,278276.02,null,{"$f":"+'App.2-B_Fixed Asset Cont 2009'!M43","v":-149730.78},-16123.03,null,-165853.81,112422.21000000002]
[8,1945,"Measurement & Testing Equipment",0.1,{"$f":"+'App.2-B_Fixed Asset Cont 2009'!H44","v":59760},3378.5,null,63138.5,null,{"$f":"+'App.2-B_Fixed Asset Cont 2009'!M44","v":-22311.5},-6144.93,null,-28456.43,34682.07]
[8,1950,"Power Operated Equipment",0.125,{"$f":"+'App.2-B_Fixed Asset Cont 2009'!H45","v":100271.95999999999},null,null,100271.95999999999,null,{"$f":"+'App.2-B_Fixed Asset Cont 2009'!M45","v":-32372.46},-7997.33,null,-40369.79,59902.169999999991]
[8,1955,"Communications Equipment",0.1,{"$f":"+'App.2-B_Fixed Asset Cont 2009'!H46","v":102070.39},{"$f":"74102.85+24925.26","v":99028.11},-24925.26,176173.24,null,{"$f":"+'App.2-B_Fixed Asset Cont 2009'!M46","v":-97484.39},{"$f":"11875.97-22355.26","v":-10479.289999999999},22355.26,-85608.42,90564.819999999992]
[8,1955,"Communication Equipment (Smart Meters)",null,null,null,null,0,null,null,null,null,0,0]
[8,1960,"Miscellaneous Equipment ",0.1,{"$f":"+'App.2-B_Fixed Asset Cont 2009'!H48","v":37793.26},5700.21,null,43493.47,null,{"$f":"+'App.2-B_Fixed Asset Cont 2009'!M48","v":-21984.76},-4064.17,null,-26048.93,17444.54]
[47,1975,"Load Management Controls Utility Premises",0.1,{"$f":"+'App.2-B_Fixed Asset Cont 2009'!H49","v":258630.5},null,null,258630.5,null,{"$f":"+'App.2-B_Fixed Asset Cont 2009'!M49","v":-258630.5},null,null,-258630.5,0]
[47,1980,"System Supervisor Equipment",null,null,null,null,0,null,null,null,null,0,0]
[47,1985,"Miscellaneous Fixed Assets",0.1,{"$f":"+'App.2-B_Fixed Asset Cont 2009'!H51","v":1427},null,null,1427,null,{"$f":"+'App.2-B_Fixed Asset Cont 2009'!M51","v":-1426.68},null,null,-1426.68,0.31999999999993634]
[47,1995,"Contributions & Grants",0.04,{"$f":"+'App.2-B_Fixed Asset Cont 2009'!H52","v":-7268123.6799999997},{"$f":"-7030472.68+2597998.94+763760.36+1384445.94+1880086.7+116567.45","v":-287613.29000000044},null,-7555736.9699999997,null,{"$f":"+'App.2-B_Fixed Asset Cont 2009'!M52","v":1107381.5699999998},{"$f":"941979.13-161137.36-144996.44-324962.7-14088.84","v":296793.79000000004},null,1404175.3599999999,-6151561.6099999994]
[null,"etc.",null,null,null,null,null,0,null,null,null,null,0,0]
[]
[null,null,"Total",null,{"$f":"SUM(E16:E54)","v":40943857.960000008},{"$f":"SUM(F16:F54)","v":2741802.2199999997},-396102.12,43289558.06000001,null,{"$f":"SUM(J16:J54)","v":-13741003.610000003},{"$f":"SUM(K16:K54)","v":-1855323.9700000002},261843.26,-15334484.32,27955073.740000002]
[]
[null,null,null,null,null,null,null,null,null,"Less: Fully Allocated Depreciation"]
[10,null,"Transportation",null,null,null,null,null,null,"Transportation"]
[8,null,"Stores Equipment",null,null,null,null,null,null,"Stores Equipment"]
[null,null,null,null,null,null,null,null,null,"Net Depreciation",null,{"$f":"L55-L58-L59","v":261843.26}]
[]
["Notes:"]
[]
[1,"Tables in the format outlined above covering all fixed asset accounts should be submitted for the Test Year, Bridge Year and all relevant historical years.  At a minimum , the applicant must provide data for the earlier of: 1) all historical years back to its last rebasing; or 2) at least three years of historical actuals, in addition to Bridge Year and Test Year forecasts."]
[]
[]
[2,"The \"CCA Class\" for fixed assets should agree with the CCA Class used for tax purposes in Tax Returns. Fixed Assets sub-components may be used where the underlying asset components are classified under multiple CCA Classes for tax purposes. If an applicant uses any different classes from those shown in the table, an explanation should be provided. (also see note 3 below)."]
[]
[]
[3,"The table may need to be customized for a utility's asset categories or for any new asset accounts announced or authorized by the Board."]
[]
[4,"The depreciation column (D) is not required as the relevant information will be provided in the following 2-C series of appendices."]

{"sheet":"App.2-B_Fixed Asset Cont 2011","index":7,"n_rows":72,"n_cols":14,"rows_kept":72,"cut":false,"hidden":false,"merged":[[69,1,69,13],[8,0,8,13],[9,0,9,13],[13,4,13,7],[63,1,64,13],[66,1,67,13]]}
[null,null,null,null,null,null,null,null,null,null,null,null,"File Number:",{"$f":"'LDC Info'!$E$18","v":"EB2012-0176"}]
[null,null,null,null,null,null,null,null,null,null,null,null,"Exhibit:"]
[null,null,null,null,null,null,null,null,null,null,null,null,"Tab:"]
[null,null,null,null,null,null,null,null,null,null,null,null,"Schedule:"]
[null,null,null,null,null,null,null,null,null,null,null,null,"Page:"]
[]
[null,null,null,null,null,null,null,null,null,null,null,null,"Date:"]
[]
["Appendix 2-B"]
["Fixed Asset Continuity Schedule"]
[]
[null,null,null,null,null,"Year ",2011]
[]
[null,null,null,null,"Cost",null,null,null,null,null,"Accumulated Depreciation"]
["CCA Class","OEB","Description","Depreciation Rate","Opening Balance","Additions","Disposals","Closing Balance",null,"Opening Balance","Additions","Disposals","Closing Balance","Net Book Value"]
[12,1611,"Computer Software (Formally known as Account 1925)",null,null,null,null,{"$f":"E16+F16+G16","v":0},null,null,null,null,{"$f":"J16+K16+L16","v":0},{"$f":"H16+M16","v":0}]
["CEC",1612,"Land Rights (Formally known as Account 1906)",null,null,null,null,{"$f":"E17+F17+G17","v":0},null,null,null,null,{"$f":"J17+K17+L17","v":0},{"$f":"H17+M17","v":0}]
["N/A",1805,"Land",null,{"$f":"+'App.2-B_Fixed Asset Cont 2010'!H18","v":227768.86},null,null,{"$f":"E18+F18+G18","v":227768.86},null,null,null,null,{"$f":"J18+K18+L18","v":0},{"$f":"H18+M18","v":227768.86}]
[47,1808,"Buildings",0.02,{"$f":"+'App.2-B_Fixed Asset Cont 2010'!H19","v":2486318},null,null,{"$f":"E19+F19+G19","v":2486318},null,{"$f":"+'App.2-B_Fixed Asset Cont 2010'!M19","v":-175310.82},-49886.67,null,{"$f":"J19+K19+L19","v":-225197.49},{"$f":"H19+M19","v":2261120.5099999998}]
[13,1810,"Leasehold Improvements",null,null,null,null,0,null,null,null,null,0,0]
[47,1815,"Transformer Station Equipment >50 kV",null,null,null,null,0,null,null,null,null,0,0]
[47,1820,"Distribution Station Equipment <50 kV",3.3300000000000003E-2,{"$f":"+'App.2-B_Fixed Asset Cont 2010'!H22","v":3818489.54},450639.48,null,4269129.0199999996,null,{"$f":"+'App.2-B_Fixed Asset Cont 2010'!M22","v":-1439216.04},-136439.37,null,-1575655.4100000001,2693473.6099999994]
[47,1825,"Storage Battery Equipment",null,null,null,null,0,null,null,null,null,0,0]
[47,1830,"Poles, Towers & Fixtures",0.04,{"$f":"+'App.2-B_Fixed Asset Cont 2010'!H24","v":6563767.3899999997},542315.17000000004,null,7106082.5599999996,null,{"$f":"+'App.2-B_Fixed Asset Cont 2010'!M24","v":-2053188.45},-294873,null,-2348061.4500000002,4758021.1099999994]
[47,1835,"Overhead Conductors & Devices",0.04,{"$f":"+'App.2-B_Fixed Asset Cont 2010'!H25","v":9073534.2800000012},673323.17,null,9746857.4500000011,null,{"$f":"+'App.2-B_Fixed Asset Cont 2010'!M25","v":-2928403.8},-411444.53,null,-3339848.33,6407009.120000001]
[47,1840,"Underground Conduit",0.04,{"$f":"+'App.2-B_Fixed Asset Cont 2010'!H26","v":2706285.59},338350.33,null,3044635.92,null,{"$f":"+'App.2-B_Fixed Asset Cont 2010'!M26","v":-835369.6100000001},-124188.43,null,-959558.04,2085077.88]
[47,1845,"Underground Conductors & Devices",0.04,{"$f":"+'App.2-B_Fixed Asset Cont 2010'!H27","v":8297546.3499999996},551064.43999999994,null,8848610.7899999991,null,{"$f":"+'App.2-B_Fixed Asset Cont 2010'!M27","v":-2279514.39},-372006.35,null,-2651520.7400000002,6197090.0499999989]
[47,1850,"Line Transformers",0.04,{"$f":"+'App.2-B_Fixed Asset Cont 2010'!H28","v":7500290.7600000007},507269.99,null,8007560.7500000009,null,{"$f":"+'App.2-B_Fixed Asset Cont 2010'!M28","v":-2352757.8499999996},-338711.37,null,-2691469.2199999997,5316091.5300000012]
[47,1855,"Services (Overhead & Underground)",0.04,{"$f":"+'App.2-B_Fixed Asset Cont 2010'!H29","v":3957038.3200000003},473443.88,null,4430482.2,null,{"$f":"+'App.2-B_Fixed Asset Cont 2010'!M29","v":-1135994.75},-178825.3,null,-1314820.05,3115662.1500000004]
[47,1860,"Meters",0.04,{"$f":"+'App.2-B_Fixed Asset Cont 2010'!H30","v":1820049.54},64884,-305369.88,1579563.6600000001,null,{"$f":"+'App.2-B_Fixed Asset Cont 2010'!M30","v":-468250.04000000004},{"$f":"-61785","v":-61785},{"$f":"110230+2522","v":112752},-417283.04000000004,1162280.6200000001]
[8,1860,"Meters (Smart Meters)",0.04,null,105634,null,105634,null,null,-2150.23,null,-2150.23,103483.77]
["N/A",1905,"Land",null,null,null,null,0,null,null,null,null,0,0]
[47,1908,"Buildings & Fixtures",null,null,null,null,0,null,null,null,null,0,0]
[13,1910,"Leasehold Improvements",null,null,null,null,0,null,null,null,null,0,0]
[8,1915,"Office Furniture & Equipment (10 years)",0.1,{"$f":"+'App.2-B_Fixed Asset Cont 2010'!H35","v":251887.34999999998},10588.8,null,262476.14999999997,null,{"$f":"+'App.2-B_Fixed Asset Cont 2010'!M35","v":-171498},-14530.6,null,-186028.6,76447.549999999959]
[8,1915,"Office Furniture & Equipment (5 years)",null,null,null,null,0,null,null,null,null,0,0]
[10,1920,"Computer Equipment - Hardware",0.2,{"$f":"+'App.2-B_Fixed Asset Cont 2010'!H37","v":275946.02999999997},null,null,275946.02999999997,null,{"$f":"+'App.2-B_Fixed Asset Cont 2010'!M37","v":-152871.07},null,null,-152871.07,123074.95999999996]
[45,1920,"Computer Equip.-Hardware(Post Mar. 22/04)",0.2,{"$f":"+'App.2-B_Fixed Asset Cont 2010'!H38","v":52211.630000000005},null,null,52211.630000000005,null,{"$f":"+'App.2-B_Fixed Asset Cont 2010'!M38","v":-146240.59},null,null,-146240.59,-94028.959999999992]
[45.1,1920,"Computer Equip.-Hardware(Post Mar. 19/07)",0.2,{"$f":"+'App.2-B_Fixed Asset Cont 2010'!H39","v":108451.22},45385.48,null,153836.70000000001,null,{"$f":"+'App.2-B_Fixed Asset Cont 2010'!M39","v":-81265.64},-26228.240000000002,null,-107493.88,46342.820000000007]
[12,1925,"Computer Software (Formally known as Account 1925)",0.33333333333333337,{"$f":"+'App.2-B_Fixed Asset Cont 2010'!H40","v":854691.24},89764.83,null,944456.07,null,{"$f":"+'App.2-B_Fixed Asset Cont 2010'!M40","v":-747708.9},-65863.259999999995,null,-813572.16,130883.90999999992]
[10,1930,"Transportation Equipment",0.125,{"$f":"+'App.2-B_Fixed Asset Cont 2010'!H41","v":1838671.03},284250,-138750,1984171.0300000003,null,{"$f":"+'App.2-B_Fixed Asset Cont 2010'!M41","v":-1143265.07},{"$f":"-45358.13-138750","v":-184108.13},138750,-1188623.2000000002,795547.83000000007]
[8,1935,"Stores Equipment",0.1,{"$f":"+'App.2-B_Fixed Asset Cont 2010'!H42","v":90937.21},null,-5900,85037.21,null,{"$f":"+'App.2-B_Fixed Asset Cont 2010'!M42","v":-21410.1},{"$f":"-4755.89-3540","v":-8295.89},3540,-26165.989999999998,58871.220000000008]
[8,1940,"Tools, Shop & Garage Equipment",0.1,{"$f":"+'App.2-B_Fixed Asset Cont 2010'!H43","v":278276.02},18504.95,null,296780.97000000003,null,{"$f":"+'App.2-B_Fixed Asset Cont 2010'!M43","v":-165853.81},-18526.099999999999,null,-184379.91,112401.06000000003]
[8,1945,"Measurement & Testing Equipment",0.1,{"$f":"+'App.2-B_Fixed Asset Cont 2010'!H44","v":63138.5},4405.08,null,67543.58,null,{"$f":"+'App.2-B_Fixed Asset Cont 2010'!M44","v":-28456.43},-6533.03,null,-34989.46,32554.120000000003]
[8,1950,"Power Operated Equipment",0.125,{"$f":"+'App.2-B_Fixed Asset Cont 2010'!H45","v":100271.95999999999},null,-11000,89271.959999999992,null,{"$f":"+'App.2-B_Fixed Asset Cont 2010'!M45","v":-40369.79},-7997.33,11000,-37367.120000000003,51904.839999999989]
[8,1955,"Communications Equipment",0.1,{"$f":"+'App.2-B_Fixed Asset Cont 2010'!H46","v":176173.24},null,null,176173.24,null,{"$f":"+'App.2-B_Fixed Asset Cont 2010'!M46","v":-85608.42},-20382.11,null,-105990.53,70182.709999999992]
[8,1955,"Communication Equipment (Smart Meters)",null,null,null,null,0,null,null,null,null,0,0]
[8,1960,"Miscellaneous Equipment ",0.1,{"$f":"+'App.2-B_Fixed Asset Cont 2010'!H48","v":43493.47},null,null,43493.47,null,{"$f":"+'App.2-B_Fixed Asset Cont 2010'!M48","v":-26048.93},-3693.18,null,-29742.11,13751.36]
[47,1975,"Load Management Controls Utility Premises",0.1,{"$f":"+'App.2-B_Fixed Asset Cont 2010'!H49","v":258630.5},null,null,258630.5,null,{"$f":"+'App.2-B_Fixed Asset Cont 2010'!M49","v":-258630.5},null,null,-258630.5,0]
[47,1980,"System Supervisor Equipment",null,null,null,null,0,null,null,null,null,0,0]
[47,1985,"Miscellaneous Fixed Assets",0.1,{"$f":"+'App.2-B_Fixed Asset Cont 2010'!H51","v":1427},null,null,1427,null,{"$f":"+'App.2-B_Fixed Asset Cont 2010'!M51","v":-1426.68},null,null,-1426.68,0.31999999999993634]
[47,1995,"Contributions & Grants",0.04,{"$f":"+'App.2-B_Fixed Asset Cont 2010'!H52","v":-7555736.9699999997},-632720.38,null,-8188457.3499999996,null,{"$f":"+'App.2-B_Fixed Asset Cont 2010'!M52","v":1404175.3599999999},315631.19,null,1719806.5499999998,-6468650.7999999998]
[null,"etc.",null,null,null,null,null,0,null,null,null,null,0,0]
[]
[null,null,"Total",null,{"$f":"SUM(E16:E54)","v":43289558.06000001},{"$f":"SUM(F16:F54)","v":3527103.22},-461019.88,46355641.400000013,null,{"$f":"SUM(J16:J54)","v":-15334484.32},{"$f":"SUM(K16:K54)","v":-2010836.9300000006},266042,-17079279.25,29276362.149999995]
[]
[null,null,null,null,null,null,null,null,null,"Less: Fully Allocated Depreciation"]
[10,null,"Transportation",null,null,null,null,null,null,"Transportation"]
[8,null,"Stores Equipment",null,null,null,null,null,null,"Stores Equipment"]
[null,null,null,null,null,null,null,null,null,"Net Depreciation",null,{"$f":"L55-L58-L59","v":266042}]
[]
["Notes:"]
[]
[1,"Tables in the format outlined above covering all fixed asset accounts should be submitted for the Test Year, Bridge Year and all relevant historical years.  At a minimum , the applicant must provide data for the earlier of: 1) all historical years back to its last rebasing; or 2) at least three years of historical actuals, in addition to Bridge Year and Test Year forecasts."]
[]
[]
[2,"The \"CCA Class\" for fixed assets should agree with the CCA Class used for tax purposes in Tax Returns. Fixed Assets sub-components may be used where the underlying asset components are classified under multiple CCA Classes for tax purposes. If an applicant uses any different classes from those shown in the table, an explanation should be provided. (also see note 3 below)."]
[]
[]
[3,"The table may need to be customized for a utility's asset categories or for any new asset accounts announced or authorized by the Board."]
[]
[4,"The depreciation column (D) is not required as the relevant information will be provided in the following 2-C series of appendices."]

{"sheet":"App.2-B_Fixed Asset Cont 2012","index":8,"n_rows":72,"n_cols":14,"rows_kept":72,"cut":false,"hidden":false,"merged":[[69,1,69,13],[8,0,8,13],[9,0,9,13],[13,4,13,7],[63,1,64,13],[66,1,67,13]]}
[null,null,null,null,null,null,null,null,null,null,null,null,"File Number:",{"$f":"'LDC Info'!$E$18","v":"EB2012-0176"}]
[null,null,null,null,null,null,null,null,null,null,null,null,"Exhibit:"]
[null,null,null,null,null,null,null,null,null,null,null,null,"Tab:"]
[null,null,null,null,null,null,null,null,null,null,null,null,"Schedule:"]
[null,null,null,null,null,null,null,null,null,null,null,null,"Page:"]
[]
[null,null,null,null,null,null,null,null,null,null,null,null,"Date:"]
[]
["Appendix 2-B"]
["Fixed Asset Continuity Schedule - CGAAP"]
[]
[null,null,null,null,null,"Year ",2012]
[]
[null,null,null,null,"Cost",null,null,null,null,null,"Accumulated Depreciation"]
["CCA Class","OEB","Description","Depreciation Rate","Opening Balance","Additions","Disposals","Closing Balance",null,"Opening Balance","Additions","Disposals","Closing Balance","Net Book Value"]
[12,1611,"Computer Software (Formally known as Account 1925)",null,null,null,null,{"$f":"E16+F16+G16","v":0},null,null,null,null,{"$f":"J16+K16+L16","v":0},{"$f":"H16+M16","v":0}]
["CEC",1612,"Land Rights (Formally known as Account 1906)",null,null,null,null,{"$f":"E17+F17+G17","v":0},null,null,null,null,{"$f":"J17+K17+L17","v":0},{"$f":"H17+M17","v":0}]
["N/A",1805,"Land",null,{"$f":"+'App.2-B_Fixed Asset Cont 2011'!H18","v":227768.86},null,null,{"$f":"E18+F18+G18","v":227768.86},null,null,null,null,{"$f":"J18+K18+L18","v":0},{"$f":"H18+M18","v":227768.86}]
[47,1808,"Buildings",0.02,{"$f":"+'App.2-B_Fixed Asset Cont 2011'!H19","v":2486318},5000,null,{"$f":"E19+F19+G19","v":2491318},null,{"$f":"+'App.2-B_Fixed Asset Cont 2011'!M19","v":-225197.49},-49937,null,{"$f":"J19+K19+L19","v":-275134.49},{"$f":"H19+M19","v":2216183.5099999998}]
[13,1810,"Leasehold Improvements",null,null,null,null,0,null,{"$f":"+'App.2-B_Fixed Asset Cont 2011'!M20","v":0},null,null,0,0]
[47,1815,"Transformer Station Equipment >50 kV",null,null,null,null,0,null,{"$f":"+'App.2-B_Fixed Asset Cont 2011'!M21","v":0},null,null,0,0]
[47,1820,"Distribution Station Equipment <50 kV",3.3300000000000003E-2,{"$f":"+'App.2-B_Fixed Asset Cont 2011'!H22","v":4269129.0199999996},506839,null,4775968.0199999996,null,{"$f":"+'App.2-B_Fixed Asset Cont 2011'!M22","v":-1575655.4100000001},-147775,null,-1723430.4100000001,3052537.6099999994]
[47,1825,"Storage Battery Equipment",null,null,null,null,0,null,{"$f":"+'App.2-B_Fixed Asset Cont 2011'!M23","v":0},null,null,0,0]
[47,1830,"Poles, Towers & Fixtures",0.04,{"$f":"+'App.2-B_Fixed Asset Cont 2011'!H24","v":7106082.5599999996},888906,null,7994988.5599999996,null,{"$f":"+'App.2-B_Fixed Asset Cont 2011'!M24","v":-2348061.4500000002},-327658,null,-2675719.4500000002,5319269.1099999994]
[47,1835,"Overhead Conductors & Devices",0.04,{"$f":"+'App.2-B_Fixed Asset Cont 2011'!H25","v":9746857.4500000011},838997,null,10585854.450000001,null,{"$f":"+'App.2-B_Fixed Asset Cont 2011'!M25","v":-3339848.33},-441852,null,-3781700.33,6804154.120000001]
[47,1840,"Underground Conduit",0.04,{"$f":"+'App.2-B_Fixed Asset Cont 2011'!H26","v":3044635.92},290681,null,3335316.92,null,{"$f":"+'App.2-B_Fixed Asset Cont 2011'!M26","v":-959558.04},-136788,null,-1096346.04,2238970.8799999999]
[47,1845,"Underground Conductors & Devices",0.04,{"$f":"+'App.2-B_Fixed Asset Cont 2011'!H27","v":8848610.7899999991},454468,null,9303078.7899999991,null,{"$f":"+'App.2-B_Fixed Asset Cont 2011'!M27","v":-2651520.7400000002},-392366,null,-3043886.74,6259192.0499999989]
[47,1850,"Line Transformers",0.04,{"$f":"+'App.2-B_Fixed Asset Cont 2011'!H28","v":8007560.7500000009},592656,null,8600216.75,null,{"$f":"+'App.2-B_Fixed Asset Cont 2011'!M28","v":-2691469.2199999997},-360782,null,-3052251.2199999997,5547965.5300000003]
[47,1855,"Services (Overhead & Underground)",0.04,{"$f":"+'App.2-B_Fixed Asset Cont 2011'!H29","v":4430482.2},637257,null,5067739.2,null,{"$f":"+'App.2-B_Fixed Asset Cont 2011'!M29","v":-1314820.05},-201040,null,-1515860.05,3551879.1500000004]
[47,1860,"Meters",0.04,{"$f":"+'App.2-B_Fixed Asset Cont 2011'!H30","v":1579563.6600000001},null,null,1579563.6600000001,null,{"$f":"+'App.2-B_Fixed Asset Cont 2011'!M30","v":-417283.04000000004},-67812,null,-485095.04000000004,1094468.6200000001]
[8,1860,"Meters (Smart Meters)",6.6699999999999995E-2,{"$f":"+'App.2-B_Fixed Asset Cont 2011'!H31","v":105634},38652,null,144286,null,{"$f":"+'App.2-B_Fixed Asset Cont 2011'!M31","v":-2150.23},-8418,null,-10568.23,133717.76999999999]
["N/A",1905,"Land",null,null,null,null,0,null,{"$f":"+'App.2-B_Fixed Asset Cont 2011'!M32","v":0},null,null,0,0]
[47,1908,"Buildings & Fixtures",null,null,null,null,0,null,{"$f":"+'App.2-B_Fixed Asset Cont 2011'!M33","v":0},null,null,0,0]
[13,1910,"Leasehold Improvements",null,null,null,null,0,null,{"$f":"+'App.2-B_Fixed Asset Cont 2011'!M34","v":0},null,null,0,0]
[8,1915,"Office Furniture & Equipment (10 years)",0.1,{"$f":"+'App.2-B_Fixed Asset Cont 2011'!H35","v":262476.14999999997},5000,null,267476.14999999997,null,{"$f":"+'App.2-B_Fixed Asset Cont 2011'!M35","v":-186028.6},-15084,null,-201112.6,66363.549999999959]
[8,1915,"Office Furniture & Equipment (5 years)",null,null,null,null,0,null,{"$f":"+'App.2-B_Fixed Asset Cont 2011'!M36","v":0},null,null,0,0]
[10,1920,"Computer Equipment - Hardware",0.2,{"$f":"+'App.2-B_Fixed Asset Cont 2011'!H37","v":275946.02999999997},null,null,275946.02999999997,null,{"$f":"+'App.2-B_Fixed Asset Cont 2011'!M37","v":-152871.07},null,null,-152871.07,123074.95999999996]
[45,1920,"Computer Equip.-Hardware(Post Mar. 22/04)",0.2,{"$f":"+'App.2-B_Fixed Asset Cont 2011'!H38","v":52211.630000000005},null,null,52211.630000000005,null,{"$f":"+'App.2-B_Fixed Asset Cont 2011'!M38","v":-146240.59},null,null,-146240.59,-94028.959999999992]
[45.1,1920,"Computer Equip.-Hardware(Post Mar. 19/07)",0.2,{"$f":"+'App.2-B_Fixed Asset Cont 2011'!H39","v":153836.70000000001},22000,null,175836.7,null,{"$f":"+'App.2-B_Fixed Asset Cont 2011'!M39","v":-107493.88},-27104,null,-134597.88,41238.820000000007]
[12,1925,"Computer Software (Formally known as Account 1925)",0.33329999999999999,{"$f":"+'App.2-B_Fixed Asset Cont 2011'!H40","v":944456.07},50000,null,994456.07,null,{"$f":"+'App.2-B_Fixed Asset Cont 2011'!M40","v":-813572.16},-70279,null,-883851.16,110604.90999999992]
[10,1930,"Transportation Equipment",0.125,{"$f":"+'App.2-B_Fixed Asset Cont 2011'!H41","v":1984171.0300000003},450000,-150000,2284171.0300000003,null,{"$f":"+'App.2-B_Fixed Asset Cont 2011'!M41","v":-1188623.2000000002},-229861,150000,-1268484.2000000002,1015686.8300000001]
[8,1935,"Stores Equipment",0.1,{"$f":"+'App.2-B_Fixed Asset Cont 2011'!H42","v":85037.21},null,null,85037.21,null,{"$f":"+'App.2-B_Fixed Asset Cont 2011'!M42","v":-26165.989999999998},-8296,null,-34461.99,50575.220000000008]
[8,1940,"Tools, Shop & Garage Equipment",0.1,{"$f":"+'App.2-B_Fixed Asset Cont 2011'!H43","v":296780.97000000003},72000,null,368780.97000000003,null,{"$f":"+'App.2-B_Fixed Asset Cont 2011'!M43","v":-184379.91},-22364,null,-206743.91,162037.06000000003]
[8,1945,"Measurement & Testing Equipment",0.1,{"$f":"+'App.2-B_Fixed Asset Cont 2011'!H44","v":67543.58},null,null,67543.58,null,{"$f":"+'App.2-B_Fixed Asset Cont 2011'!M44","v":-34989.46},-6645,null,-41634.46,25909.120000000003]
[8,1950,"Power Operated Equipment",0.125,{"$f":"+'App.2-B_Fixed Asset Cont 2011'!H45","v":89271.959999999992},null,null,89271.959999999992,null,{"$f":"+'App.2-B_Fixed Asset Cont 2011'!M45","v":-37367.120000000003},-7997,null,-45364.12,43907.839999999989]
[8,1955,"Communications Equipment",0.1,{"$f":"+'App.2-B_Fixed Asset Cont 2011'!H46","v":176173.24},null,null,176173.24,null,{"$f":"+'App.2-B_Fixed Asset Cont 2011'!M46","v":-105990.53},-20382,null,-126372.53,49800.709999999992]
[8,1955,"Communication Equipment (Smart Meters)",null,null,null,null,0,null,{"$f":"+'App.2-B_Fixed Asset Cont 2011'!M47","v":0},null,null,0,0]
[8,1960,"Miscellaneous Equipment ",0.1,{"$f":"+'App.2-B_Fixed Asset Cont 2011'!H48","v":43493.47},40000,null,83493.47,null,{"$f":"+'App.2-B_Fixed Asset Cont 2011'!M48","v":-29742.11},-4342,null,-34084.11,49409.36]
[47,1975,"Load Management Controls Utility Premises",0.1,{"$f":"+'App.2-B_Fixed Asset Cont 2011'!H49","v":258630.5},null,null,258630.5,null,{"$f":"+'App.2-B_Fixed Asset Cont 2011'!M49","v":-258630.5},null,null,-258630.5,0]
[47,1980,"System Supervisor Equipment",null,null,null,null,0,null,{"$f":"+'App.2-B_Fixed Asset Cont 2011'!M50","v":0},null,null,0,0]
[47,1985,"Miscellaneous Fixed Assets",0.1,{"$f":"+'App.2-B_Fixed Asset Cont 2011'!H51","v":1427},null,null,1427,null,{"$f":"+'App.2-B_Fixed Asset Cont 2011'!M51","v":-1426.68},null,null,-1426.68,0.31999999999993634]
[47,1995,"Contributions & Grants",0.04,{"$f":"+'App.2-B_Fixed Asset Cont 2011'!H52","v":-8188457.3499999996},-433861,null,-8622318.3499999996,null,{"$f":"+'App.2-B_Fixed Asset Cont 2011'!M52","v":1719806.5499999998},336986,null,2056792.5499999998,-6565525.7999999998]
[null,"etc.",null,null,null,null,null,0,null,null,null,null,0,0]
[]
[null,null,"Total",null,{"$f":"SUM(E16:E54)","v":46355641.400000013},{"$f":"SUM(F16:F54)","v":4458595},-150000,50664236.400000013,null,{"$f":"SUM(J16:J54)","v":-17079279.25},{"$f":"SUM(K16:K54)","v":-2209796},150000,-19139075.25,31525161.149999995]
[]
[null,null,null,null,null,null,null,null,null,"Less: Fully Allocated Depreciation"]
[10,null,"Transportation",null,null,null,null,null,null,"Transportation"]
[8,null,"Stores Equipment",null,null,null,null,null,null,"Stores Equipment"]
[null,null,null,null,null,null,null,null,null,"Net Depreciation",null,{"$f":"L55-L58-L59","v":150000}]
[]
["Notes:"]
[]
[1,"Tables in the format outlined above covering all fixed asset accounts should be submitted for the Test Year, Bridge Year and all relevant historical years.  At a minimum , the applicant must provide data for the earlier of: 1) all historical years back to its last rebasing; or 2) at least three years of historical actuals, in addition to Bridge Year and Test Year forecasts."]
[]
[]
[2,"The \"CCA Class\" for fixed assets should agree with the CCA Class used for tax purposes in Tax Returns. Fixed Assets sub-components may be used where the underlying asset components are classified under multiple CCA Classes for tax purposes. If an applicant uses any different classes from those shown in the table, an explanation should be provided. (also see note 3 below)."]
[]
[]
[3,"The table may need to be customized for a utility's asset categories or for any new asset accounts announced or authorized by the Board."]
[]
[4,"The depreciation column (D) is not required as the relevant information will be provided in the following 2-C series of appendices."]

{"sheet":"App.2-B_Fixed Asset Cont 2013","index":9,"n_rows":77,"n_cols":14,"rows_kept":77,"cut":false,"hidden":false,"merged":[[58,14,58,15],[74,1,74,13],[8,0,8,13],[9,0,9,13],[13,4,13,7],[68,1,69,13],[71,1,72,13]]}
[null,null,null,null,null,null,null,null,null,null,null,null,"File Number:",{"$f":"'LDC Info'!$E$18","v":"EB2012-0176"}]
[null,null,null,null,null,null,null,null,null,null,null,null,"Exhibit:"]
[null,null,null,null,null,null,null,null,null,null,null,null,"Tab:"]
[null,null,null,null,null,null,null,null,null,null,null,null,"Schedule:"]
[null,null,null,null,null,null,null,null,null,null,null,null,"Page:"]
[]
[null,null,null,null,null,null,null,null,null,null,null,null,"Date:"]
[]
["Appendix 2-B"]
["Fixed Asset Continuity Schedule - CGAAP"]
[]
[null,null,null,null,null,"Year ",2013]
[]
[null,null,null,null,"Cost",null,null,null,null,null,"Accumulated Depreciation"]
["CCA Class","OEB","Description","Depreciation Rate","Opening Balance","Additions","Disposals","Closing Balance",null,"Opening Balance","Additions","Disposals","Closing Balance","Net Book Value"]
[12,1611,"Computer Software (Formally known as Account 1925)",null,null,null,null,{"$f":"E16+F16+G16","v":0},null,null,null,null,{"$f":"J16+K16+L16","v":0},{"$f":"H16+M16","v":0}]
["CEC",1612,"Land Rights (Formally known as Account 1906)",null,null,null,null,{"$f":"E17+F17+G17","v":0},null,null,null,null,{"$f":"J17+K17+L17","v":0},{"$f":"H17+M17","v":0}]
["N/A",1805,"Land",null,{"$f":"+'App.2-B_Fixed Asset Cont 2012'!H18","v":227768.86},null,null,{"$f":"E18+F18+G18","v":227768.86},null,null,null,null,{"$f":"J18+K18+L18","v":0},{"$f":"H18+M18","v":227768.86}]
[47,1808,"Buildings",0.02,{"$f":"+'App.2-B_Fixed Asset Cont 2012'!H19","v":2491318},9000,null,{"$f":"E19+F19+G19","v":2500318},null,{"$f":"+'App.2-B_Fixed Asset Cont 2012'!M19","v":-275134.49},-50077,null,{"$f":"J19+K19+L19","v":-325211.49},{"$f":"H19+M19","v":2175106.5099999998}]
[13,1810,"Leasehold Improvements",null,null,null,null,0,null,null,null,null,0,0]
[47,1815,"Transformer Station Equipment >50 kV",null,null,null,null,0,null,null,null,null,0,0]
[47,1820,"Distribution Station Equipment <50 kV",3.3300000000000003E-2,{"$f":"+'App.2-B_Fixed Asset Cont 2012'!H22","v":4775968.0199999996},594855,null,5370823.0199999996,null,{"$f":"+'App.2-B_Fixed Asset Cont 2012'!M22","v":-1723430.4100000001},-166136,null,-1889566.4100000001,3481256.6099999994]
[47,1825,"Storage Battery Equipment",null,null,null,null,0,null,null,null,null,0,0]
[47,1830,"Poles, Towers & Fixtures",0.04,{"$f":"+'App.2-B_Fixed Asset Cont 2012'!H24","v":7994988.5599999996},958576,null,8953564.5599999987,null,{"$f":"+'App.2-B_Fixed Asset Cont 2012'!M24","v":-2675719.4500000002},-364607,null,-3040326.45,5913238.1099999985]
[47,1835,"Overhead Conductors & Devices",0.04,{"$f":"+'App.2-B_Fixed Asset Cont 2012'!H25","v":10585854.450000001},893675,null,11479529.450000001,null,{"$f":"+'App.2-B_Fixed Asset Cont 2012'!M25","v":-3781700.33},-476505,null,-4258205.33,7221324.120000001]
[47,1840,"Underground Conduit",0.04,{"$f":"+'App.2-B_Fixed Asset Cont 2012'!H26","v":3335316.92},409989,null,3745305.92,null,{"$f":"+'App.2-B_Fixed Asset Cont 2012'!M26","v":-1096346.04},-150801,null,-1247147.04,2498158.88]
[47,1845,"Underground Conductors & Devices",0.04,{"$f":"+'App.2-B_Fixed Asset Cont 2012'!H27","v":9303078.7899999991},505661,null,9808739.7899999991,null,{"$f":"+'App.2-B_Fixed Asset Cont 2012'!M27","v":-3043886.74},-411569,null,-3455455.74,6353284.0499999989]
[47,1850,"Line Transformers",0.04,{"$f":"+'App.2-B_Fixed Asset Cont 2012'!H28","v":8600216.75},627227,null,9227443.75,null,{"$f":"+'App.2-B_Fixed Asset Cont 2012'!M28","v":-3052251.2199999997},-385180,null,-3437431.2199999997,5790012.5300000003]
[47,1855,"Services (Overhead & Underground)",0.04,{"$f":"+'App.2-B_Fixed Asset Cont 2012'!H29","v":5067739.2},658066,null,5725805.2000000002,null,{"$f":"+'App.2-B_Fixed Asset Cont 2012'!M29","v":-1515860.05},-226946,null,-1742806.05,3982999.1500000004]
[47,1860,"Meters",0.04,{"$f":"+'App.2-B_Fixed Asset Cont 2012'!H30","v":1579563.6600000001},null,null,1579563.6600000001,null,{"$f":"+'App.2-B_Fixed Asset Cont 2012'!M30","v":-485095.04000000004},-67812,null,-552907.04,1026656.6200000001]
[8,1860,"Meters (Smart Meters)",6.6699999999999995E-2,{"$f":"+'App.2-B_Fixed Asset Cont 2012'!H31","v":144286},316432,null,460718,null,{"$f":"+'App.2-B_Fixed Asset Cont 2012'!M31","v":-10568.23},-20245,null,-30813.23,429904.77]
["N/A",1905,"Land",null,null,null,null,0,null,null,null,null,0,0]
[47,1908,"Buildings & Fixtures",null,null,null,null,0,null,null,null,null,0,0]
[13,1910,"Leasehold Improvements",null,null,null,null,0,null,null,null,null,0,0]
[8,1915,"Office Furniture & Equipment (10 years)",0.1,{"$f":"+'App.2-B_Fixed Asset Cont 2012'!H35","v":267476.14999999997},2000,null,269476.14999999997,null,{"$f":"+'App.2-B_Fixed Asset Cont 2012'!M35","v":-201112.6},-14437,null,-215549.6,53926.549999999959]
[8,1915,"Office Furniture & Equipment (5 years)",null,null,null,null,0,null,null,null,null,0,0]
[10,1920,"Computer Equipment - Hardware",0.2,{"$f":"+'App.2-B_Fixed Asset Cont 2012'!H37","v":275946.02999999997},null,null,275946.02999999997,null,{"$f":"+'App.2-B_Fixed Asset Cont 2012'!M37","v":-152871.07},null,null,-152871.07,123074.95999999996]
[45,1920,"Computer Equip.-Hardware(Post Mar. 22/04)",0.2,{"$f":"+'App.2-B_Fixed Asset Cont 2012'!H38","v":52211.630000000005},null,null,52211.630000000005,null,{"$f":"+'App.2-B_Fixed Asset Cont 2012'!M38","v":-146240.59},null,null,-146240.59,-94028.959999999992]
[45.1,1920,"Computer Equip.-Hardware(Post Mar. 19/07)",0.2,{"$f":"+'App.2-B_Fixed Asset Cont 2012'!H39","v":175836.7},28600,null,204436.7,null,{"$f":"+'App.2-B_Fixed Asset Cont 2012'!M39","v":-134597.88},-28162,null,-162759.88,41676.820000000007]
[12,1925,"Computer Software (Formally known as Account 1925)",0.33329999999999999,{"$f":"+'App.2-B_Fixed Asset Cont 2012'!H40","v":994456.07},45000,null,1039456.07,null,{"$f":"+'App.2-B_Fixed Asset Cont 2012'!M40","v":-883851.16},-68144,null,-951995.16,87460.909999999916]
[10,1930,"Transportation Equipment",0.125,{"$f":"+'App.2-B_Fixed Asset Cont 2012'!H41","v":2284171.0300000003},400000,-50000,2634171.0300000003,null,{"$f":"+'App.2-B_Fixed Asset Cont 2012'!M41","v":-1268484.2000000002},-254125,50000,-1472609.2000000002,1161561.83]
[8,1935,"Stores Equipment",0.1,{"$f":"+'App.2-B_Fixed Asset Cont 2012'!H42","v":85037.21},null,null,85037.21,null,{"$f":"+'App.2-B_Fixed Asset Cont 2012'!M42","v":-34461.99},-8296,null,-42757.99,42279.220000000008]
[8,1940,"Tools, Shop & Garage Equipment",0.1,{"$f":"+'App.2-B_Fixed Asset Cont 2012'!H43","v":368780.97000000003},72000,null,440780.97000000003,null,{"$f":"+'App.2-B_Fixed Asset Cont 2012'!M43","v":-206743.91},-27972,null,-234715.91,206065.06000000003]
[8,1945,"Measurement & Testing Equipment",0.1,{"$f":"+'App.2-B_Fixed Asset Cont 2012'!H44","v":67543.58},null,null,67543.58,null,{"$f":"+'App.2-B_Fixed Asset Cont 2012'!M44","v":-41634.46},-6645,null,-48279.46,19264.120000000003]
[8,1950,"Power Operated Equipment",0.125,{"$f":"+'App.2-B_Fixed Asset Cont 2012'!H45","v":89271.959999999992},null,null,89271.959999999992,null,{"$f":"+'App.2-B_Fixed Asset Cont 2012'!M45","v":-45364.12},-7997,null,-53361.120000000003,35910.839999999989]
[8,1955,"Communications Equipment",0.1,{"$f":"+'App.2-B_Fixed Asset Cont 2012'!H46","v":176173.24},null,null,176173.24,null,{"$f":"+'App.2-B_Fixed Asset Cont 2012'!M46","v":-126372.53},-20092,null,-146464.53,29708.709999999992]
[8,1955,"Communication Equipment (Smart Meters)",null,null,null,null,0,null,null,null,null,0,0]
[8,1960,"Miscellaneous Equipment ",0.1,{"$f":"+'App.2-B_Fixed Asset Cont 2012'!H48","v":83493.47},45000,null,128493.47,null,{"$f":"+'App.2-B_Fixed Asset Cont 2012'!M48","v":-34084.11},-4592,null,-38676.11,89817.36]
[47,1975,"Load Management Controls Utility Premises",0.1,{"$f":"+'App.2-B_Fixed Asset Cont 2012'!H49","v":258630.5},null,null,258630.5,null,{"$f":"+'App.2-B_Fixed Asset Cont 2012'!M49","v":-258630.5},null,null,-258630.5,0]
[47,1980,"System Supervisor Equipment",null,null,null,null,0,null,null,null,null,0,0]
[47,1985,"Miscellaneous Fixed Assets",0.1,{"$f":"+'App.2-B_Fixed Asset Cont 2012'!H51","v":1427},null,null,1427,null,{"$f":"+'App.2-B_Fixed Asset Cont 2012'!M51","v":-1426.68},null,null,-1426.68,0.31999999999993634]
[47,1995,"Contributions & Grants",0.04,{"$f":"+'App.2-B_Fixed Asset Cont 2012'!H52","v":-8622318.3499999996},-417663,null,-9039981.3499999996,null,{"$f":"+'App.2-B_Fixed Asset Cont 2012'!M52","v":2056792.5499999998},354039,null,2410831.5499999998,-6629149.7999999998]
[null,"etc.",null,null,null,null,null,0,null,null,null,null,0,0]
[]
[null,null,"Total",null,{"$f":"SUM(E16:E54)","v":50664236.400000013},{"$f":"SUM(F16:F54)","v":5148418},-50000,55762654.400000013,null,{"$f":"SUM(J16:J54)","v":-19139075.25},{"$f":"SUM(K16:K54)","v":-2406301},50000,-21495376.25,34267278.149999991]
[null,null,"Smart Meter Additions (from 1555)"]
[8,1860,"Meters (Smart Meters)",6.6699999999999995E-2,3626141,null,null,{"$f":"E57+F57+G57","v":3626141},null,-662079,-241743,null,{"$f":"J57+K57+L57","v":-903822},{"$f":"H57+M57","v":2722319}]
[45.1,1920,"Computer Hardware (Smart Meters)",0.2,62873,null,null,62873,null,-35193,-12575,null,-47768,15105]
[12,1925,"Computer Software (Smart Meters)",0.33329999999999999,274217,null,null,{"$f":"E59+F59+G59","v":274217},null,-99859,-54843,null,{"$f":"J59+K59+L59","v":-154702},{"$f":"H59+M59","v":119515}]
[null,null,"Revised Total",null,{"$f":"SUM(E55:E59)","v":54627467.400000013},{"$f":"SUM(F55:F59)","v":5148418},-50000,59725885.400000013,null,{"$f":"SUM(J55:J59)","v":-19936206.25},{"$f":"SUM(K55:K59)","v":-2715462},50000,-22601668.25,37124217.149999991]
[]
[null,null,null,null,null,null,null,null,null,"Less: Fully Allocated Depreciation"]
[10,null,"Transportation",null,null,null,null,null,null,"Transportation"]
[8,null,"Stores Equipment",null,null,null,null,null,null,"Stores Equipment"]
[null,null,null,null,null,null,null,null,null,"Net Depreciation",null,{"$f":"L55-L63-L64","v":50000}]
[]
["Notes:"]
[]
[1,"Tables in the format outlined above covering all fixed asset accounts should be submitted for the Test Year, Bridge Year and all relevant historical years.  At a minimum , the applicant must provide data for the earlier of: 1) all historical years back to its last rebasing; or 2) at least three years of historical actuals, in addition to Bridge Year and Test Year forecasts."]
[]
[]
[2,"The \"CCA Class\" for fixed assets should agree with the CCA Class used for tax purposes in Tax Returns. Fixed Assets sub-components may be used where the underlying asset components are classified under multiple CCA Classes for tax purposes. If an applicant uses any different classes from those shown in the table, an explanation should be provided. (also see note 3 below)."]
[]
[]
[3,"The table may need to be customized for a utility's asset categories or for any new asset accounts announced or authorized by the Board."]
[]
[4,"The depreciation column (D) is not required as the relevant information will be provided in the following 2-C series of appendices."]

{"sheet":"App.2-B_FA Cont MIFRS 2012","index":10,"n_rows":72,"n_cols":14,"rows_kept":72,"cut":false,"hidden":false,"merged":[[69,1,69,13],[8,0,8,13],[9,0,9,13],[13,4,13,7],[63,1,64,13],[66,1,67,13]]}
[null,null,null,null,null,null,null,null,null,null,null,null,"File Number:",{"$f":"'LDC Info'!$E$18","v":"EB2012-0176"}]
[null,null,null,null,null,null,null,null,null,null,null,null,"Exhibit:"]
[null,null,null,null,null,null,null,null,null,null,null,null,"Tab:"]
[null,null,null,null,null,null,null,null,null,null,null,null,"Schedule:"]
[null,null,null,null,null,null,null,null,null,null,null,null,"Page:"]
[]
[null,null,null,null,null,null,null,null,null,null,null,null,"Date:"]
[]
["Appendix 2-B"]
["Fixed Asset Continuity Schedule - MIFRS"]
[]
[null,null,null,null,null,"Year ",2012]
[]
[null,null,null,null,"Cost",null,null,null,null,null,"Accumulated Depreciation"]
["CCA Class","OEB","Description","Depreciation Rate","Opening Balance","Additions","Disposals","Closing Balance",null,"Opening Balance","Additions","Disposals","Closing Balance","Net Book Value"]
[12,1611,"Computer Software (Formally known as Account 1925)",null,null,null,null,{"$f":"E16+F16+G16","v":0},null,null,null,null,{"$f":"J16+K16+L16","v":0},{"$f":"H16+M16","v":0}]
["CEC",1612,"Land Rights (Formally known as Account 1906)",null,null,null,null,{"$f":"E17+F17+G17","v":0},null,null,null,null,{"$f":"J17+K17+L17","v":0},{"$f":"H17+M17","v":0}]
["N/A",1805,"Land",null,{"$f":"+'App.2-B_Fixed Asset Cont 2011'!H18","v":227768.86},null,null,{"$f":"E18+F18+G18","v":227768.86},null,null,null,null,{"$f":"J18+K18+L18","v":0},{"$f":"H18+M18","v":227768.86}]
[47,1808,"Buildings",0.02,{"$f":"+'App.2-B_Fixed Asset Cont 2011'!H19","v":2486318},5000,null,{"$f":"E19+F19+G19","v":2491318},null,{"$f":"+'App.2-B_Fixed Asset Cont 2011'!M19","v":-225197.49},-49979,null,{"$f":"J19+K19+L19","v":-275176.49},{"$f":"H19+M19","v":2216141.5099999998}]
[13,1810,"Leasehold Improvements",null,null,null,null,0,null,{"$f":"+'App.2-B_Fixed Asset Cont 2011'!M20","v":0},null,null,0,0]
[47,1815,"Transformer Station Equipment >50 kV",null,null,null,null,0,null,{"$f":"+'App.2-B_Fixed Asset Cont 2011'!M21","v":0},null,null,0,0]
[47,1820,"Distribution Station Equipment <50 kV",3.3300000000000003E-2,{"$f":"+'App.2-B_Fixed Asset Cont 2011'!H22","v":4269129.0199999996},463809,null,4732938.0199999996,null,{"$f":"+'App.2-B_Fixed Asset Cont 2011'!M22","v":-1575655.4100000001},-293076,null,-1868731.4100000001,2864206.6099999994]
[47,1825,"Storage Battery Equipment",null,null,null,null,0,null,{"$f":"+'App.2-B_Fixed Asset Cont 2011'!M23","v":0},null,null,0,0]
[47,1830,"Poles, Towers & Fixtures",0.04,{"$f":"+'App.2-B_Fixed Asset Cont 2011'!H24","v":7106082.5599999996},734446,null,7840528.5599999996,null,{"$f":"+'App.2-B_Fixed Asset Cont 2011'!M24","v":-2348061.4500000002},-101800,null,-2449861.4500000002,5390667.1099999994]
[47,1835,"Overhead Conductors & Devices",0.04,{"$f":"+'App.2-B_Fixed Asset Cont 2011'!H25","v":9746857.4500000011},707985,null,10454842.450000001,null,{"$f":"+'App.2-B_Fixed Asset Cont 2011'!M25","v":-3339848.33},-124763,null,-3464611.33,6990231.120000001]
[47,1840,"Underground Conduit",0.04,{"$f":"+'App.2-B_Fixed Asset Cont 2011'!H26","v":3044635.92},239152,null,3283787.92,null,{"$f":"+'App.2-B_Fixed Asset Cont 2011'!M26","v":-959558.04},-29018,null,-988576.04,2295211.88]
[47,1845,"Underground Conductors & Devices",0.04,{"$f":"+'App.2-B_Fixed Asset Cont 2011'!H27","v":8848610.7899999991},368494,null,9217104.7899999991,null,{"$f":"+'App.2-B_Fixed Asset Cont 2011'!M27","v":-2651520.7400000002},-127289,null,-2778809.74,6438295.0499999989]
[47,1850,"Line Transformers",0.04,{"$f":"+'App.2-B_Fixed Asset Cont 2011'!H28","v":8007560.7500000009},504230,null,8511790.75,null,{"$f":"+'App.2-B_Fixed Asset Cont 2011'!M28","v":-2691469.2199999997},-216368,null,-2907837.2199999997,5603953.5300000003]
[47,1855,"Services (Overhead & Underground)",0.04,{"$f":"+'App.2-B_Fixed Asset Cont 2011'!H29","v":4430482.2},527103,null,4957585.2,null,{"$f":"+'App.2-B_Fixed Asset Cont 2011'!M29","v":-1314820.05},-76296,null,-1391116.05,3566469.1500000004]
[47,1860,"Meters",0.04,{"$f":"+'App.2-B_Fixed Asset Cont 2011'!H30","v":1579563.6600000001},null,null,1579563.6600000001,null,{"$f":"+'App.2-B_Fixed Asset Cont 2011'!M30","v":-417283.04000000004},-50089,null,-467372.04000000004,1112191.6200000001]
[8,1860,"Meters (Smart Meters)",6.6699999999999995E-2,{"$f":"+'App.2-B_Fixed Asset Cont 2011'!H31","v":105634},29737,null,135371,null,{"$f":"+'App.2-B_Fixed Asset Cont 2011'!M31","v":-2150.23},-8038,null,-10188.23,125182.77]
["N/A",1905,"Land",null,null,null,null,0,null,{"$f":"+'App.2-B_Fixed Asset Cont 2011'!M32","v":0},null,null,0,0]
[47,1908,"Buildings & Fixtures",null,null,null,null,0,null,{"$f":"+'App.2-B_Fixed Asset Cont 2011'!M33","v":0},null,null,0,0]
[13,1910,"Leasehold Improvements",null,null,null,null,0,null,{"$f":"+'App.2-B_Fixed Asset Cont 2011'!M34","v":0},null,null,0,0]
[8,1915,"Office Furniture & Equipment (10 years)",0.1,{"$f":"+'App.2-B_Fixed Asset Cont 2011'!H35","v":262476.14999999997},5000,null,267476.14999999997,null,{"$f":"+'App.2-B_Fixed Asset Cont 2011'!M35","v":-186028.6},-7895,null,-193923.6,73552.549999999959]
[8,1915,"Office Furniture & Equipment (5 years)",null,null,null,null,0,null,{"$f":"+'App.2-B_Fixed Asset Cont 2011'!M36","v":0},null,null,0,0]
[10,1920,"Computer Equipment - Hardware",0.2,{"$f":"+'App.2-B_Fixed Asset Cont 2011'!H37","v":275946.02999999997},null,null,275946.02999999997,null,{"$f":"+'App.2-B_Fixed Asset Cont 2011'!M37","v":-152871.07},null,null,-152871.07,123074.95999999996]
[45,1920,"Computer Equip.-Hardware(Post Mar. 22/04)",0.2,{"$f":"+'App.2-B_Fixed Asset Cont 2011'!H38","v":52211.630000000005},null,null,52211.630000000005,null,{"$f":"+'App.2-B_Fixed Asset Cont 2011'!M38","v":-146240.59},null,null,-146240.59,-94028.959999999992]
[45.1,1920,"Computer Equip.-Hardware(Post Mar. 19/07)",0.2,{"$f":"+'App.2-B_Fixed Asset Cont 2011'!H39","v":153836.70000000001},22000,null,175836.7,null,{"$f":"+'App.2-B_Fixed Asset Cont 2011'!M39","v":-107493.88},{"$f":"-1274-16004","v":-17278},null,-124771.88,51064.820000000007]
[12,1925,"Computer Software (Formally known as Account 1925)",0.33329999999999999,{"$f":"+'App.2-B_Fixed Asset Cont 2011'!H40","v":944456.07},50000,null,994456.07,null,{"$f":"+'App.2-B_Fixed Asset Cont 2011'!M40","v":-813572.16},-36848,null,-850420.16,144035.90999999992]
[10,1930,"Transportation Equipment",0.125,{"$f":"+'App.2-B_Fixed Asset Cont 2011'!H41","v":1984171.0300000003},450000,-150000,2284171.0300000003,null,{"$f":"+'App.2-B_Fixed Asset Cont 2011'!M41","v":-1188623.2000000002},-97893,150000,-1136516.2000000002,1147654.83]
[8,1935,"Stores Equipment",0.1,{"$f":"+'App.2-B_Fixed Asset Cont 2011'!H42","v":85037.21},null,null,85037.21,null,{"$f":"+'App.2-B_Fixed Asset Cont 2011'!M42","v":-26165.989999999998},-5887,null,-32052.989999999998,52984.220000000008]
[8,1940,"Tools, Shop & Garage Equipment",0.1,{"$f":"+'App.2-B_Fixed Asset Cont 2011'!H43","v":296780.97000000003},72000,null,368780.97000000003,null,{"$f":"+'App.2-B_Fixed Asset Cont 2011'!M43","v":-184379.91},-14840,null,-199219.91,169561.06000000003]
[8,1945,"Measurement & Testing Equipment",0.1,{"$f":"+'App.2-B_Fixed Asset Cont 2011'!H44","v":67543.58},null,null,67543.58,null,{"$f":"+'App.2-B_Fixed Asset Cont 2011'!M44","v":-34989.46},-3255,null,-38244.46,29299.120000000003]
[8,1950,"Power Operated Equipment",0.125,{"$f":"+'App.2-B_Fixed Asset Cont 2011'!H45","v":89271.959999999992},null,null,89271.959999999992,null,{"$f":"+'App.2-B_Fixed Asset Cont 2011'!M45","v":-37367.120000000003},-5190,null,-42557.120000000003,46714.839999999989]
[8,1955,"Communications Equipment",0.1,{"$f":"+'App.2-B_Fixed Asset Cont 2011'!H46","v":176173.24},null,null,176173.24,null,{"$f":"+'App.2-B_Fixed Asset Cont 2011'!M46","v":-105990.53},-8288,null,-114278.53,61894.709999999992]
[8,1955,"Communication Equipment (Smart Meters)",null,null,null,null,0,null,{"$f":"+'App.2-B_Fixed Asset Cont 2011'!M47","v":0},null,null,0,0]
[8,1960,"Miscellaneous Equipment ",0.1,{"$f":"+'App.2-B_Fixed Asset Cont 2011'!H48","v":43493.47},40000,null,83493.47,null,{"$f":"+'App.2-B_Fixed Asset Cont 2011'!M48","v":-29742.11},-3462,null,-33204.11,50289.36]
[47,1975,"Load Management Controls Utility Premises",0.1,{"$f":"+'App.2-B_Fixed Asset Cont 2011'!H49","v":258630.5},null,null,258630.5,null,{"$f":"+'App.2-B_Fixed Asset Cont 2011'!M49","v":-258630.5},null,null,-258630.5,0]
[47,1980,"System Supervisor Equipment",null,null,null,null,0,null,{"$f":"+'App.2-B_Fixed Asset Cont 2011'!M50","v":0},null,null,0,0]
[47,1985,"Miscellaneous Fixed Assets",0.1,{"$f":"+'App.2-B_Fixed Asset Cont 2011'!H51","v":1427},null,null,1427,null,{"$f":"+'App.2-B_Fixed Asset Cont 2011'!M51","v":-1426.68},null,null,-1426.68,0.31999999999993634]
[47,1995,"Contributions & Grants",0.04,{"$f":"+'App.2-B_Fixed Asset Cont 2011'!H52","v":-8188457.3499999996},-366832,null,-8555289.3499999996,null,{"$f":"+'App.2-B_Fixed Asset Cont 2011'!M52","v":1719806.5499999998},140936,null,1860742.5499999998,-6694546.7999999998]
[null,"etc.",null,null,null,null,null,0,null,null,null,null,0,0]
[]
[null,null,"Total",null,{"$f":"SUM(E16:E54)","v":46355641.400000013},{"$f":"SUM(F16:F54)","v":3852124},-150000,50057765.400000013,null,{"$f":"SUM(J16:J54)","v":-17079279.25},{"$f":"SUM(K16:K54)","v":-1136616},150000,-18065895.25,31991870.149999995]
[]
[null,null,null,null,null,null,null,null,null,"Less: Fully Allocated Depreciation"]
[10,null,"Transportation",null,null,null,null,null,null,"Transportation"]
[8,null,"Stores Equipment",null,null,null,null,null,null,"Stores Equipment"]
[null,null,null,null,null,null,null,null,null,"Net Depreciation",null,{"$f":"L55-L58-L59","v":150000}]
[]
["Notes:"]
[]
[1,"Tables in the format outlined above covering all fixed asset accounts should be submitted for the Test Year, Bridge Year and all relevant historical years.  At a minimum , the applicant must provide data for the earlier of: 1) all historical years back to its last rebasing; or 2) at least three years of historical actuals, in addition to Bridge Year and Test Year forecasts."]
[]
[]
[2,"The \"CCA Class\" for fixed assets should agree with the CCA Class used for tax purposes in Tax Returns. Fixed Assets sub-components may be used where the underlying asset components are classified under multiple CCA Classes for tax purposes. If an applicant uses any different classes from those shown in the table, an explanation should be provided. (also see note 3 below)."]
[]
[]
[3,"The table may need to be customized for a utility's asset categories or for any new asset accounts announced or authorized by the Board."]
[]
[4,"The depreciation column (D) is not required as the relevant information will be provided in the following 2-C series of appendices."]

{"sheet":"App.2-B_FA Cont MIFRS 2013","index":11,"n_rows":77,"n_cols":14,"rows_kept":77,"cut":false,"hidden":false,"merged":[[74,1,74,13],[8,0,8,13],[9,0,9,13],[13,4,13,7],[68,1,69,13],[71,1,72,13]]}
[null,null,null,null,null,null,null,null,null,null,null,null,"File Number:",{"$f":"'LDC Info'!$E$18","v":"EB2012-0176"}]
[null,null,null,null,null,null,null,null,null,null,null,null,"Exhibit:"]
[null,null,null,null,null,null,null,null,null,null,null,null,"Tab:"]
[null,null,null,null,null,null,null,null,null,null,null,null,"Schedule:"]
[null,null,null,null,null,null,null,null,null,null,null,null,"Page:"]
[]
[null,null,null,null,null,null,null,null,null,null,null,null,"Date:"]
[]
["Appendix 2-B"]
["Fixed Asset Continuity Schedule - MIFRS"]
[]
[null,null,null,null,null,"Year ",2013]
[]
[null,null,null,null,"Cost",null,null,null,null,null,"Accumulated Depreciation"]
["CCA Class","OEB","Description","Depreciation Rate","Opening Balance","Additions","Disposals","Closing Balance",null,"Opening Balance","Additions","Disposals","Closing Balance","Net Book Value"]
[12,1611,"Computer Software (Formally known as Account 1925)",null,null,null,null,{"$f":"E16+F16+G16","v":0},null,null,null,null,{"$f":"J16+K16+L16","v":0},{"$f":"H16+M16","v":0}]
["CEC",1612,"Land Rights (Formally known as Account 1906)",null,null,null,null,{"$f":"E17+F17+G17","v":0},null,null,null,null,{"$f":"J17+K17+L17","v":0},{"$f":"H17+M17","v":0}]
["N/A",1805,"Land",null,{"$f":"+'App.2-B_FA Cont MIFRS 2012'!H18","v":227768.86},null,null,{"$f":"E18+F18+G18","v":227768.86},null,null,null,null,{"$f":"J18+K18+L18","v":0},{"$f":"H18+M18","v":227768.86}]
[47,1808,"Buildings",0.02,{"$f":"+'App.2-B_FA Cont MIFRS 2012'!H19","v":2491318},9000,null,{"$f":"E19+F19+G19","v":2500318},null,{"$f":"+'App.2-B_FA Cont MIFRS 2012'!M19","v":-275176.49},-50119,null,{"$f":"J19+K19+L19","v":-325295.49},{"$f":"H19+M19","v":2175022.5099999998}]
[13,1810,"Leasehold Improvements",null,{"$f":"+'App.2-B_FA Cont MIFRS 2012'!H20","v":0},null,null,0,null,{"$f":"+'App.2-B_FA Cont MIFRS 2012'!M20","v":0},null,null,0,0]
[47,1815,"Transformer Station Equipment >50 kV",null,{"$f":"+'App.2-B_FA Cont MIFRS 2012'!H21","v":0},null,null,0,null,{"$f":"+'App.2-B_FA Cont MIFRS 2012'!M21","v":0},null,null,0,0]
[47,1820,"Distribution Station Equipment <50 kV",3.3300000000000003E-2,{"$f":"+'App.2-B_FA Cont MIFRS 2012'!H22","v":4732938.0199999996},520121,null,5253059.0199999996,null,{"$f":"+'App.2-B_FA Cont MIFRS 2012'!M22","v":-1868731.4100000001},-230732,null,-2099463.41,3153595.6099999994]
[47,1825,"Storage Battery Equipment",null,{"$f":"+'App.2-B_FA Cont MIFRS 2012'!H23","v":0},null,null,0,null,{"$f":"+'App.2-B_FA Cont MIFRS 2012'!M23","v":0},null,null,0,0]
[47,1830,"Poles, Towers & Fixtures",0.04,{"$f":"+'App.2-B_FA Cont MIFRS 2012'!H24","v":7840528.5599999996},781179,null,8621707.5599999987,null,{"$f":"+'App.2-B_FA Cont MIFRS 2012'!M24","v":-2449861.4500000002},-114430,null,-2564291.4500000002,6057416.1099999985]
[47,1835,"Overhead Conductors & Devices",0.04,{"$f":"+'App.2-B_FA Cont MIFRS 2012'!H25","v":10454842.450000001},748211,null,11203053.450000001,null,{"$f":"+'App.2-B_FA Cont MIFRS 2012'!M25","v":-3464611.33},-135965,null,-3600576.33,7602477.120000001]
[47,1840,"Underground Conduit",0.04,{"$f":"+'App.2-B_FA Cont MIFRS 2012'!H26","v":3283787.92},335057,null,3618844.92,null,{"$f":"+'App.2-B_FA Cont MIFRS 2012'!M26","v":-988576.04},-32396,null,-1020972.04,2597872.88]
[47,1845,"Underground Conductors & Devices",0.04,{"$f":"+'App.2-B_FA Cont MIFRS 2012'!H27","v":9217104.7899999991},404073,null,9621177.7899999991,null,{"$f":"+'App.2-B_FA Cont MIFRS 2012'!M27","v":-2778809.74},-133727,null,-2912536.74,6708641.0499999989]
[47,1850,"Line Transformers",0.04,{"$f":"+'App.2-B_FA Cont MIFRS 2012'!H28","v":8511790.75},529371,null,9041161.75,null,{"$f":"+'App.2-B_FA Cont MIFRS 2012'!M28","v":-2907837.2199999997},-229328,null,-3137165.2199999997,5903996.5300000003]
[47,1855,"Services (Overhead & Underground)",0.04,{"$f":"+'App.2-B_FA Cont MIFRS 2012'!H29","v":4957585.2},532665,null,5490250.2000000002,null,{"$f":"+'App.2-B_FA Cont MIFRS 2012'!M29","v":-1391116.05},-85957,null,-1477073.05,4013177.1500000004]
[47,1860,"Meters",0.04,{"$f":"+'App.2-B_FA Cont MIFRS 2012'!H30","v":1579563.6600000001},null,null,1579563.6600000001,null,{"$f":"+'App.2-B_FA Cont MIFRS 2012'!M30","v":-467372.04000000004},-50099,null,-517471.04000000004,1062092.6200000001]
[8,1860,"Meters (Smart Meters)",6.6699999999999995E-2,{"$f":"+'App.2-B_FA Cont MIFRS 2012'!H31","v":135371},168851,null,304222,null,{"$f":"+'App.2-B_FA Cont MIFRS 2012'!M31","v":-10188.23},-14566,null,-24754.23,279467.77]
["N/A",1905,"Land",null,{"$f":"+'App.2-B_FA Cont MIFRS 2012'!H32","v":0},null,null,0,null,{"$f":"+'App.2-B_FA Cont MIFRS 2012'!M32","v":0},null,null,0,0]
[47,1908,"Buildings & Fixtures",null,{"$f":"+'App.2-B_FA Cont MIFRS 2012'!H33","v":0},null,null,0,null,{"$f":"+'App.2-B_FA Cont MIFRS 2012'!M33","v":0},null,null,0,0]
[13,1910,"Leasehold Improvements",null,{"$f":"+'App.2-B_FA Cont MIFRS 2012'!H34","v":0},null,null,0,null,{"$f":"+'App.2-B_FA Cont MIFRS 2012'!M34","v":0},null,null,0,0]
[8,1915,"Office Furniture & Equipment (10 years)",0.1,{"$f":"+'App.2-B_FA Cont MIFRS 2012'!H35","v":267476.14999999997},2000,null,269476.14999999997,null,{"$f":"+'App.2-B_FA Cont MIFRS 2012'!M35","v":-193923.6},-8245,null,-202168.6,67307.549999999959]
[8,1915,"Office Furniture & Equipment (5 years)",null,{"$f":"+'App.2-B_FA Cont MIFRS 2012'!H36","v":0},null,null,0,null,{"$f":"+'App.2-B_FA Cont MIFRS 2012'!M36","v":0},null,null,0,0]
[10,1920,"Computer Equipment - Hardware",0.2,{"$f":"+'App.2-B_FA Cont MIFRS 2012'!H37","v":275946.02999999997},null,null,275946.02999999997,null,{"$f":"+'App.2-B_FA Cont MIFRS 2012'!M37","v":-152871.07},null,null,-152871.07,123074.95999999996]
[45,1920,"Computer Equip.-Hardware(Post Mar. 22/04)",0.2,{"$f":"+'App.2-B_FA Cont MIFRS 2012'!H38","v":52211.630000000005},null,null,52211.630000000005,null,{"$f":"+'App.2-B_FA Cont MIFRS 2012'!M38","v":-146240.59},null,null,-146240.59,-94028.959999999992]
[45.1,1920,"Computer Equip.-Hardware(Post Mar. 19/07)",0.2,{"$f":"+'App.2-B_FA Cont MIFRS 2012'!H39","v":175836.7},28600,null,204436.7,null,{"$f":"+'App.2-B_FA Cont MIFRS 2012'!M39","v":-124771.88},{"$f":"-2548-19789","v":-22337},null,-147108.88,57327.820000000007]
[12,1925,"Computer Software (Formally known as Account 1925)",0.33329999999999999,{"$f":"+'App.2-B_FA Cont MIFRS 2012'!H40","v":994456.07},45000,null,1039456.07,null,{"$f":"+'App.2-B_FA Cont MIFRS 2012'!M40","v":-850420.16},-47960,null,-898380.16,141075.90999999992]
[10,1930,"Transportation Equipment",0.125,{"$f":"+'App.2-B_FA Cont MIFRS 2012'!H41","v":2284171.0300000003},400000,-50000,2634171.0300000003,null,{"$f":"+'App.2-B_FA Cont MIFRS 2012'!M41","v":-1136516.2000000002},-126308,50000,-1212824.2000000002,1421346.83]
[8,1935,"Stores Equipment",0.1,{"$f":"+'App.2-B_FA Cont MIFRS 2012'!H42","v":85037.21},null,null,85037.21,null,{"$f":"+'App.2-B_FA Cont MIFRS 2012'!M42","v":-32052.989999999998},-5887,null,-37939.99,47097.220000000008]
[8,1940,"Tools, Shop & Garage Equipment",0.1,{"$f":"+'App.2-B_FA Cont MIFRS 2012'!H43","v":368780.97000000003},72000,null,440780.97000000003,null,{"$f":"+'App.2-B_FA Cont MIFRS 2012'!M43","v":-199219.91},-22040,null,-221259.91,219521.06000000003]
[8,1945,"Measurement & Testing Equipment",0.1,{"$f":"+'App.2-B_FA Cont MIFRS 2012'!H44","v":67543.58},null,null,67543.58,null,{"$f":"+'App.2-B_FA Cont MIFRS 2012'!M44","v":-38244.46},-3255,null,-41499.46,26044.120000000003]
[8,1950,"Power Operated Equipment",0.125,{"$f":"+'App.2-B_FA Cont MIFRS 2012'!H45","v":89271.959999999992},null,null,89271.959999999992,null,{"$f":"+'App.2-B_FA Cont MIFRS 2012'!M45","v":-42557.120000000003},-5190,null,-47747.12,41524.839999999989]
[8,1955,"Communications Equipment",0.1,{"$f":"+'App.2-B_FA Cont MIFRS 2012'!H46","v":176173.24},null,null,176173.24,null,{"$f":"+'App.2-B_FA Cont MIFRS 2012'!M46","v":-114278.53},-8288,null,-122566.53,53606.709999999992]
[8,1955,"Communication Equipment (Smart Meters)",null,{"$f":"+'App.2-B_FA Cont MIFRS 2012'!H47","v":0},null,null,0,null,{"$f":"+'App.2-B_FA Cont MIFRS 2012'!M47","v":0},null,null,0,0]
[8,1960,"Miscellaneous Equipment ",0.1,{"$f":"+'App.2-B_FA Cont MIFRS 2012'!H48","v":83493.47},45000,null,128493.47,null,{"$f":"+'App.2-B_FA Cont MIFRS 2012'!M48","v":-33204.11},-7712,null,-40916.11,87577.36]
[47,1975,"Load Management Controls Utility Premises",0.1,{"$f":"+'App.2-B_FA Cont MIFRS 2012'!H49","v":258630.5},null,null,258630.5,null,{"$f":"+'App.2-B_FA Cont MIFRS 2012'!M49","v":-258630.5},null,null,-258630.5,0]
[47,1980,"System Supervisor Equipment",null,{"$f":"+'App.2-B_FA Cont MIFRS 2012'!H50","v":0},null,null,0,null,{"$f":"+'App.2-B_FA Cont MIFRS 2012'!M50","v":0},null,null,0,0]
[47,1985,"Miscellaneous Fixed Assets",0.1,{"$f":"+'App.2-B_FA Cont MIFRS 2012'!H51","v":1427},null,null,1427,null,{"$f":"+'App.2-B_FA Cont MIFRS 2012'!M51","v":-1426.68},null,null,-1426.68,0.31999999999993634]
[47,1995,"Contributions & Grants",0.04,{"$f":"+'App.2-B_FA Cont MIFRS 2012'!H52","v":-8555289.3499999996},-373740,null,-8929029.3499999996,null,{"$f":"+'App.2-B_FA Cont MIFRS 2012'!M52","v":1860742.5499999998},147888,null,2008630.5499999998,-6920398.7999999998]
[null,"etc.",null,null,null,null,null,0,null,null,null,null,0,0]
[]
[null,null,"Total",null,{"$f":"SUM(E16:E54)","v":50057765.400000013},{"$f":"SUM(F16:F54)","v":4247388},-50000,54255153.400000013,null,{"$f":"SUM(J16:J54)","v":-18065895.25},{"$f":"SUM(K16:K54)","v":-1186653},50000,-19202548.25,35052605.149999991]
[null,null,"Smart Meter Additions (from 1555)"]
[8,1860,"Meters (Smart Meters)",6.6699999999999995E-2,{"$f":"+'App.2-B_Fixed Asset Cont 2013'!E57","v":3626141},null,null,{"$f":"E57+F57+G57","v":3626141},null,{"$f":"+'App.2-B_Fixed Asset Cont 2013'!J57","v":-662079},{"$f":"+'App.2-B_Fixed Asset Cont 2013'!K57","v":-241743},null,{"$f":"J57+K57+L57","v":-903822},{"$f":"H57+M57","v":2722319}]
[45.1,1920,"Computer Hardware (Smart Meters)",0.2,{"$f":"+'App.2-B_Fixed Asset Cont 2013'!E58","v":62873},null,null,62873,null,{"$f":"+'App.2-B_Fixed Asset Cont 2013'!J58","v":-35193},{"$f":"+'App.2-B_Fixed Asset Cont 2013'!K58","v":-12575},null,-47768,15105]
[12,1925,"Computer Software (Smart Meters)",0.33329999999999999,{"$f":"+'App.2-B_Fixed Asset Cont 2013'!E59","v":274217},null,null,274217,null,{"$f":"+'App.2-B_Fixed Asset Cont 2013'!J59","v":-99859},{"$f":"+'App.2-B_Fixed Asset Cont 2013'!K59","v":-54843},null,-154702,119515]
[null,null,"Revised Total",null,{"$f":"SUM(E55:E59)","v":54020996.400000013},{"$f":"SUM(F55:F59)","v":4247388},{"$f":"SUM(G55:G59)","v":-50000},{"$f":"SUM(H55:H59)","v":58218384.400000013},null,{"$f":"SUM(J55:J59)","v":-18863026.25},{"$f":"SUM(K55:K59)","v":-1495814},{"$f":"SUM(L55:L59)","v":50000},{"$f":"SUM(M55:M59)","v":-20308840.25},{"$f":"SUM(N55:N59)","v":37909544.149999991}]
[]
[null,null,null,null,null,null,null,null,null,"Less: Fully Allocated Depreciation"]
[10,null,"Transportation",null,null,null,null,null,null,"Transportation"]
[8,null,"Stores Equipment",null,null,null,null,null,null,"Stores Equipment"]
[null,null,null,null,null,null,null,null,null,"Net Depreciation",null,{"$f":"L55-L63-L64","v":50000}]
[]
["Notes:"]
[]
[1,"Tables in the format outlined above covering all fixed asset accounts should be submitted for the Test Year, Bridge Year and all relevant historical years.  At a minimum , the applicant must provide data for the earlier of: 1) all historical years back to its last rebasing; or 2) at least three years of historical actuals, in addition to Bridge Year and Test Year forecasts."]
[]
[]
[2,"The \"CCA Class\" for fixed assets should agree with the CCA Class used for tax purposes in Tax Returns. Fixed Assets sub-components may be used where the underlying asset components are classified under multiple CCA Classes for tax purposes. If an applicant uses any different classes from those shown in the table, an explanation should be provided. (also see note 3 below)."]
[]
[]
[3,"The table may need to be customized for a utility's asset categories or for any new asset accounts announced or authorized by the Board."]
[]
[4,"The depreciation column (D) is not required as the relevant information will be provided in the following 2-C series of appendices."]

{"sheet":"App.2-CA_CGAAP_DepExp_2011","index":12,"n_rows":61,"n_cols":12,"rows_kept":61,"cut":false,"hidden":true,"merged":[[10,0,10,11],[8,0,8,11],[9,0,9,11],[57,1,57,11],[60,1,61,11],[58,1,59,9],[13,0,14,0],[13,1,14,1],[13,10,14,10]]}
[null,null,null,null,null,null,null,null,null,null,"File Number:",{"$f":"'LDC Info'!$E$18","v":"EB2012-0176"}]
[null,null,null,null,null,null,null,null,null,null,"Exhibit:"]
[null,null,null,null,null,null,null,null,null,null,"Tab:"]
[null,null,null,null,null,null,null,null,null,null,"Schedule:"]
[null,null,null,null,null,null,null,null,null,null,"Page:"]
[]
[null,null,null,null,null,null,null,null,null,null,"Date:"]
[]
["Appendix 2-CA"]
["Depreciation and Amortization Expense"]
["Assumes the applicant adopted IFRS for financial reporting purposes January 1, 2012"]
[null,null,"Year",2011,"CGAAP"]
[]
["Account","Description","Opening Regulatory Gross PP&E as at Jan 1, 2011 ","Less Fully Depreciated","Net for Depreciation","Additions","Total for Depreciation","Years","Depreciation Rate","Depreciation Expense","2011 Depreciation Expense per Appendix 2-B Fixed Assets, Column K \n (l)","Variance 2"]
[null,null,"(a)","(b)","(c)","(d)","(e) = (c) + ½ x (d) 1","(f)","(g) = 1 / (f)","(h) = (e) / (f)",null,"(m) = (h) - (l)"]
[1611,"Computer Software (Formally known as Account 1925)",null,null,{"$f":"C16-D16","v":0},null,{"$f":"E16+0.5*F16","v":0},null,{"$f":"IF(H16=0,0,1/H16)","v":0},{"$f":"IF(H16=0,0,G16/H16)","v":0},null,{"$f":"IF(ISERROR(+J16-K16), 0, +J16-K16)","v":0}]
[1612,"Land Rights (Formally known as Account 1906)",null,null,{"$f":"C17-D17","v":0},null,{"$f":"E17+0.5*F17","v":0},null,0,0,null,0]
[1805,"Land",null,null,0,null,0,null,0,0,null,0]
[1808,"Buildings",null,null,0,null,0,null,0,0,null,0]
[1810,"Leasehold Improvements",null,null,0,null,0,null,0,0,null,0]
[1815,"Transformer Station Equipment >50 kV",null,null,0,null,0,null,0,0,null,0]
[1820,"Distribution Station Equipment <50 kV",null,null,0,null,0,null,0,0,null,0]
[1825,"Storage Battery Equipment",null,null,0,null,0,null,0,0,null,0]
[1830,"Poles, Towers & Fixtures",null,null,0,null,0,null,0,0,null,0]
[1835,"Overhead Conductors & Devices",null,null,0,null,0,null,0,0,null,0]
[1840,"Underground Conduit",null,null,0,null,0,null,0,0,null,0]
[1845,"Underground Conductors & Devices",null,null,0,null,0,null,0,0,null,0]
[1850,"Line Transformers",null,null,0,null,0,null,0,0,null,0]
[1855,"Services (Overhead & Underground)",null,null,0,null,0,null,0,0,null,0]
[1860,"Meters",null,null,0,null,0,null,0,0,null,0]
[1860,"Meters (Smart Meters)",null,null,0,null,0,null,0,0,null,0]
[1905,"Land",null,null,0,null,0,null,0,0,null,0]
[1908,"Buildings & Fixtures",null,null,0,null,0,null,0,0,null,0]
[1910,"Leasehold Improvements",null,null,0,null,0,null,0,0,null,0]
[1915,"Office Furniture & Equipment (10 years)",null,null,0,null,0,null,0,0,null,0]
[1915,"Office Furniture & Equipment (5 years)",null,null,0,null,0,null,0,0,null,0]
[1920,"Computer Equipment - Hardware",null,null,0,null,0,null,0,0,null,0]
[1920,"Computer Equip.-Hardware(Post Mar. 22/04)",null,null,0,null,0,null,0,0,null,0]
[1920,"Computer Equip.-Hardware(Post Mar. 19/07)",null,null,0,null,0,null,0,0,null,0]
[1930,"Transportation Equipment",null,null,0,null,0,null,0,0,null,0]
[1935,"Stores Equipment",null,null,0,null,0,null,0,0,null,0]
[1940,"Tools, Shop & Garage Equipment",null,null,0,null,0,null,0,0,null,0]
[1945,"Measurement & Testing Equipment",null,null,0,null,0,null,0,0,null,0]
[1950,"Power Operated Equipment",null,null,0,null,0,null,0,0,null,0]
[1955,"Communications Equipment",null,null,0,null,0,null,0,0,null,0]
[1955,"Communication Equipment (Smart Meters)",null,null,0,null,0,null,0,0,null,0]
[1960,"Miscellaneous Equipment ",null,null,0,null,0,null,0,0,null,0]
[1975,"Load Management Controls Utility Premises",null,null,0,null,0,null,0,0,null,0]
[1980,"System Supervisor Equipment",null,null,0,null,0,null,0,0,null,0]
[1985,"Miscellaneous Fixed Assets",null,null,0,null,0,null,0,0,null,0]
[1995,"Contributions & Grants",null,null,0,null,0,null,0,0,null,0]
["etc.",null,null,null,0,null,0,null,0,0,null,0]
[null,null,null,null,0,null,0,null,0,0,null,0]
[null,"Total",{"$f":"SUM(C16:C53)","v":0},{"$f":"SUM(D16:D53)","v":0},{"$f":"SUM(E16:E53)","v":0},{"$f":"SUM(F16:F53)","v":0},{"$f":"SUM(G16:G53)","v":0},null,null,{"$f":"SUM(J16:J53)","v":0},{"$f":"SUM(K16:K53)","v":0},{"$f":"SUM(L16:L53)","v":0}]
[]
["Notes:"]
[]
[1,"Board policy of the \"half-year\" rule - the applicant must ensure that additions in the year attract a half-year depreciation expense in the first year.  Deviations from this standard practice must be supported in the application."]
[2,"The applicant must provide an explanation of material variances in evidence"]
[]
["General","Applicants must provide a breakdown of depreciation and amortization expense in the above format for all relevant accounts.  Asset Retirement Obligations (AROs), depreciation and accretion expense should be disclosed separately consistent with the Notes of historical Audited Financial Statements."]

{"sheet":"App.2-CB_MIFRS_DepExp_2011","index":13,"n_rows":65,"n_cols":15,"rows_kept":65,"cut":false,"hidden":true,"merged":[[8,0,8,14],[9,0,9,14],[10,0,10,14],[61,1,61,14],[64,1,65,14],[57,1,57,14],[58,1,58,14],[59,1,59,14],[60,1,60,14],[13,0,14,0],[13,1,14,1],[13,10,14,10],[13,13,14,13],[62,1,62,14]]}
[null,null,null,null,null,null,null,null,null,null,null,null,null,"File Number:",{"$f":"'LDC Info'!$E$18","v":"EB2012-0176"}]
[null,null,null,null,null,null,null,null,null,null,null,null,null,"Exhibit:"]
[null,null,null,null,null,null,null,null,null,null,null,null,null,"Tab:"]
[null,null,null,null,null,null,null,null,null,null,null,null,null,"Schedule:"]
[null,null,null,null,null,null,null,null,null,null,null,null,null,"Page:"]
[]
[null,null,null,null,null,null,null,null,null,null,null,null,null,"Date:"]
[]
["Appendix 2-CB"]
["Depreciation and Amortization Expense"]
["Assumes the applicant adopted IFRS for financial reporting purposes January 1, 2012"]
[null,null,"Year",2011,"MIFRS"]
[]
["Account","Description","Opening NBV as at Jan 1, 2011 5","Additions","Average Remaining Life of Opening NBV 4","Years (new additions only) 3","Depreciation Rate on New Additions","Depreciation Expense on Opening NBV","Depreciation Expense on Additions 1","2011 Depreciation Expense","2011 Depreciation Expense per Appendix 2-B Fixed Assets, Column K \n (l)","Variance 2","Depreciation Expense on 2011 Full Year Additions","Less Depreciation Expense on Assets Fully Depreciated during the year\n(o)","2011 Full Year Depreciation 6"]
[null,null,"(a)","(d)","(i)","(f)","(g) = 1 / (f)","(j) = (a) / (i)","(h)=((d)*0.5)/(f) ","(k) = (j) + (h)",null,"(m) = (k) - (l)","(n) = (d)/(f) ",null,"(p) = (j) + (n) - (o)"]
[1611,"Computer Software (Formally known as Account 1925)",null,null,null,null,{"$f":"IF(F16=0,0,1/F16)","v":0},{"$f":"IF(E16=0,0,+C16/E16)","v":0},{"$f":"IF(F16=0,0,+(D16*0.5)/F16)","v":0},{"$f":"IF(ISERROR(+H16+I16), 0, +H16+I16)","v":0},null,{"$f":"IF(ISERROR(+J16-K16), 0, +J16-K16)","v":0},{"$f":"IF(F16=0,0,+(D16)/F16)","v":0},null,{"$f":"IF(ISERROR(+M16+H16-N16), 0, +M16+H16-N16)","v":0}]
[1612,"Land Rights (Formally known as Account 1906)",null,null,null,null,0,0,0,0,null,0,0,null,{"$f":"IF(ISERROR(+M17+H17-N17), 0, +M17+H17-N17)","v":0}]
[1805,"Land",null,null,null,null,0,0,0,0,null,0,0,null,0]
[1808,"Buildings",null,null,null,null,0,0,0,0,null,0,0,null,0]
[1810,"Leasehold Improvements",null,null,null,null,0,0,0,0,null,0,0,null,0]
[1815,"Transformer Station Equipment >50 kV",null,null,null,null,0,0,0,0,null,0,0,null,0]
[1820,"Distribution Station Equipment <50 kV",null,null,null,null,0,0,0,0,null,0,0,null,0]
[1825,"Storage Battery Equipment",null,null,null,null,0,0,0,0,null,0,0,null,0]
[1830,"Poles, Towers & Fixtures",null,null,null,null,0,0,0,0,null,0,0,null,0]
[1835,"Overhead Conductors & Devices",null,null,null,null,0,0,0,0,null,0,0,null,0]
[1840,"Underground Conduit",null,null,null,null,0,0,0,0,null,0,0,null,0]
[1845,"Underground Conductors & Devices",null,null,null,null,0,0,0,0,null,0,0,null,0]
[1850,"Line Transformers",null,null,null,null,0,0,0,0,null,0,0,null,0]
[1855,"Services (Overhead & Underground)",null,null,null,null,0,0,0,0,null,0,0,null,0]
[1860,"Meters",null,null,null,null,0,0,0,0,null,0,0,null,0]
[1860,"Meters (Smart Meters)",null,null,null,null,0,0,0,0,null,0,0,null,0]
[1905,"Land",null,null,null,null,0,0,0,0,null,0,0,null,0]
[1908,"Buildings & Fixtures",null,null,null,null,0,0,0,0,null,0,0,null,0]
[1910,"Leasehold Improvements",null,null,null,null,0,0,0,0,null,0,0,null,0]
[1915,"Office Furniture & Equipment (10 years)",null,null,null,null,0,0,0,0,null,0,0,null,0]
[1915,"Office Furniture & Equipment (5 years)",null,null,null,null,0,0,0,0,null,0,0,null,0]
[1920,"Computer Equipment - Hardware",null,null,null,null,0,0,0,0,null,0,0,null,0]
[1920,"Computer Equip.-Hardware(Post Mar. 22/04)",null,null,null,null,0,0,0,0,null,0,0,null,0]
[1920,"Computer Equip.-Hardware(Post Mar. 19/07)",null,null,null,null,0,0,0,0,null,0,0,null,0]
[1930,"Transportation Equipment",null,null,null,null,0,0,0,0,null,0,0,null,0]
[1935,"Stores Equipment",null,null,null,null,0,0,0,0,null,0,0,null,0]
[1940,"Tools, Shop & Garage Equipment",null,null,null,null,0,0,0,0,null,0,0,null,0]
[1945,"Measurement & Testing Equipment",null,null,null,null,0,0,0,0,null,0,0,null,0]
[1950,"Power Operated Equipment",null,null,null,null,0,0,0,0,null,0,0,null,0]
[1955,"Communications Equipment",null,null,null,null,0,0,0,0,null,0,0,null,0]
[1955,"Communication Equipment (Smart Meters)",null,null,null,null,0,0,0,0,null,0,0,null,0]
[1960,"Miscellaneous Equipment ",null,null,null,null,0,0,0,0,null,0,0,null,0]
[1975,"Load Management Controls Utility Premises",null,null,null,null,0,0,0,0,null,0,0,null,0]
[1980,"System Supervisor Equipment",null,null,null,null,0,0,0,0,null,0,0,null,0]
[1985,"Miscellaneous Fixed Assets",null,null,null,null,0,0,0,0,null,0,0,null,0]
[1995,"Contributions & Grants",null,null,null,null,0,0,0,0,null,0,0,null,0]
["etc.",null,null,null,null,null,0,0,0,0,null,0,0,null,0]
[null,null,null,null,null,null,0,0,0,0,null,0,0,null,0]
[null,"Total",{"$f":"SUM(C16:C53)","v":0},{"$f":"SUM(D16:D53)","v":0},null,null,null,{"$f":"SUM(H16:H53)","v":0},0,0,0,0,0,{"$f":"SUM(N16:N53)","v":0},0]
[]
["Notes:"]
[]
[1,"Board policy of the \"half-year\" rule - the applicant must ensure that additions in the year attract a half-year depreciation expense in the first year.  Deviations from this standard practice must be supported in the application."]
[2,"The applicant must provide an explanation of material variances in evidence"]
[3,"The applicant should ensure that the years for new additions of assets are the asset useful lives determined by management in accordance with IFRS. "]
[4,"A recalculation should be performed to determine the average remaining life of opening balance of assets (i.e. excluding 2011 additions) under IFRS.  For example, Asset A had a useful life of 20 years under CGAAP.  On January 1, 2011, the date of transition, Asset A was 3 years depreciated. As a result, Asset A would have a remaining service life of 17 years (20 years less 3 years) under CGAAP as of January 1, 2011.  Due to the transition to IFRS, management re-assessed the asset useful lives under IFRS principles and concluded that the revised useful life of Asset A is now 30 years. Therefore, the average remaining useful life of opening balance of Asset A is determined to be 27 years (30 years less 3 years) under IFRS as of January 1, 2011."]
[5," NBV must exclude assets still on the books but which have been fully amortized or depreciated."]
[6,"This column refers to the calculated full year depreciation but excludes the depreciation expense on assets fully depreciated during the year.  This column is used for the purpose of calculating depreciation expense in the following year on the next worksheet."]
[]
["General:","Applicants must provide a breakdown of depreciation and amortization expense in the above format for all relevant accounts.  Asset Retirement Obligations (AROs), depreciation and accretion expense should be disclosed separately consistent with the Notes of historical Audited Financial Statements."]

{"sheet":"App.2-CC_MIFRS_DepExp_2012","index":14,"n_rows":61,"n_cols":11,"rows_kept":61,"cut":false,"hidden":true,"merged":[[8,0,8,10],[56,1,56,10],[57,1,57,10],[58,1,58,10],[9,0,9,10],[60,1,61,10],[13,0,14,0],[13,1,14,1],[13,6,14,6],[10,0,10,10],[13,9,14,9]]}
[null,null,null,null,null,null,null,null,null,"File Number:",{"$f":"'LDC Info'!$E$18","v":"EB2012-0176"}]
[null,null,null,null,null,null,null,null,null,"Exhibit:"]
[null,null,null,null,null,null,null,null,null,"Tab:"]
[null,null,null,null,null,null,null,null,null,"Schedule:"]
[null,null,null,null,null,null,null,null,null,"Page:"]
[]
[null,null,null,null,null,null,null,null,null,"Date:"]
[]
["Appendix 2-CC"]
["Depreciation and Amortization Expense"]
["Assumes the applicant adopted IFRS for financial reporting purposes January 1, 2012"]
[null,null,2012,"MIFRS"]
[]
["Account","Description","Additions","Years (new additions only)","Depreciation Rate on New Additions","2012 Depreciation Expense 1","2012 Depreciation Expense per Apppendix 2-B Fixed Assets, Column K\n (l)","Variance 2","Depreciation Expense on 2012 Full Year Additions","Less Depreciation Expense on Assets Fully Depreciated during the year\n(o)","2012 Full Year Depreciation 3"]
[null,null,"(d)","(f)","(g) = 1 / (f)","(h)=2011 Full Year Deprecation + ((d)*0.5)/(f) ",null,"(m) = (h) - (l)","(n)=((d))/(f) ",null,"(o) = 2011 Full Year Depreciation  + (n) - (o)"]
[1611,"Computer Software (Formally known as Account 1925)",null,null,{"$f":"IF(D16=0,0,1/D16)","v":0},{"$f":"IF(D16=0,+'App.2-CB_MIFRS_DepExp_2011'!O16,+'App.2-CB_MIFRS_DepExp_2011'!O16+((C16*0.5)/D16))","v":0},null,{"$f":"IF(ISERROR(+F16-G16), 0, +F16-G16)","v":0},{"$f":"IF(D16=0,0,+(C16)/D16)","v":0},null,{"$f":"IF(ISERROR(+I16+'App.2-CB_MIFRS_DepExp_2011'!O16-J16), 0, +I16+'App.2-CB_MIFRS_DepExp_2011'!O16-J16)","v":0}]
[1612,"Land Rights (Formally known as Account 1906)",null,null,0,{"$f":"IF(D17=0,+'App.2-CB_MIFRS_DepExp_2011'!O17,+'App.2-CB_MIFRS_DepExp_2011'!O17+((C17*0.5)/D17))","v":0},null,0,0,null,{"$f":"IF(ISERROR(+I17+'App.2-CB_MIFRS_DepExp_2011'!O17-J17), 0, +I17+'App.2-CB_MIFRS_DepExp_2011'!O17-J17)","v":0}]
[1805,"Land",null,null,0,{"$f":"IF(D18=0,+'App.2-CB_MIFRS_DepExp_2011'!O18,+'App.2-CB_MIFRS_DepExp_2011'!O18+((C18*0.5)/D18))","v":0},null,0,0,null,{"$f":"IF(ISERROR(+I18+'App.2-CB_MIFRS_DepExp_2011'!O18-J18), 0, +I18+'App.2-CB_MIFRS_DepExp_2011'!O18-J18)","v":0}]
[1808,"Buildings",null,null,0,{"$f":"IF(D19=0,+'App.2-CB_MIFRS_DepExp_2011'!O19,+'App.2-CB_MIFRS_DepExp_2011'!O19+((C19*0.5)/D19))","v":0},null,0,0,null,{"$f":"IF(ISERROR(+I19+'App.2-CB_MIFRS_DepExp_2011'!O19-J19), 0, +I19+'App.2-CB_MIFRS_DepExp_2011'!O19-J19)","v":0}]
[1810,"Leasehold Improvements",null,null,0,{"$f":"IF(D20=0,+'App.2-CB_MIFRS_DepExp_2011'!O20,+'App.2-CB_MIFRS_DepExp_2011'!O20+((C20*0.5)/D20))","v":0},null,0,0,null,{"$f":"IF(ISERROR(+I20+'App.2-CB_MIFRS_DepExp_2011'!O20-J20), 0, +I20+'App.2-CB_MIFRS_DepExp_2011'!O20-J20)","v":0}]
[1815,"Transformer Station Equipment >50 kV",null,null,0,{"$f":"IF(D21=0,+'App.2-CB_MIFRS_DepExp_2011'!O21,+'App.2-CB_MIFRS_DepExp_2011'!O21+((C21*0.5)/D21))","v":0},null,0,0,null,{"$f":"IF(ISERROR(+I21+'App.2-CB_MIFRS_DepExp_2011'!O21-J21), 0, +I21+'App.2-CB_MIFRS_DepExp_2011'!O21-J21)","v":0}]
[1820,"Distribution Station Equipment <50 kV",null,null,0,{"$f":"IF(D22=0,+'App.2-CB_MIFRS_DepExp_2011'!O22,+'App.2-CB_MIFRS_DepExp_2011'!O22+((C22*0.5)/D22))","v":0},null,0,0,null,{"$f":"IF(ISERROR(+I22+'App.2-CB_MIFRS_DepExp_2011'!O22-J22), 0, +I22+'App.2-CB_MIFRS_DepExp_2011'!O22-J22)","v":0}]
[1825,"Storage Battery Equipment",null,null,0,{"$f":"IF(D23=0,+'App.2-CB_MIFRS_DepExp_2011'!O23,+'App.2-CB_MIFRS_DepExp_2011'!O23+((C23*0.5)/D23))","v":0},null,0,0,null,{"$f":"IF(ISERROR(+I23+'App.2-CB_MIFRS_DepExp_2011'!O23-J23), 0, +I23+'App.2-CB_MIFRS_DepExp_2011'!O23-J23)","v":0}]
[1830,"Poles, Towers & Fixtures",null,null,0,{"$f":"IF(D24=0,+'App.2-CB_MIFRS_DepExp_2011'!O24,+'App.2-CB_MIFRS_DepExp_2011'!O24+((C24*0.5)/D24))","v":0},null,0,0,null,{"$f":"IF(ISERROR(+I24+'App.2-CB_MIFRS_DepExp_2011'!O24-J24), 0, +I24+'App.2-CB_MIFRS_DepExp_2011'!O24-J24)","v":0}]
[1835,"Overhead Conductors & Devices",null,null,0,{"$f":"IF(D25=0,+'App.2-CB_MIFRS_DepExp_2011'!O25,+'App.2-CB_MIFRS_DepExp_2011'!O25+((C25*0.5)/D25))","v":0},null,0,0,null,{"$f":"IF(ISERROR(+I25+'App.2-CB_MIFRS_DepExp_2011'!O25-J25), 0, +I25+'App.2-CB_MIFRS_DepExp_2011'!O25-J25)","v":0}]
[1840,"Underground Conduit",null,null,0,{"$f":"IF(D26=0,+'App.2-CB_MIFRS_DepExp_2011'!O26,+'App.2-CB_MIFRS_DepExp_2011'!O26+((C26*0.5)/D26))","v":0},null,0,0,null,{"$f":"IF(ISERROR(+I26+'App.2-CB_MIFRS_DepExp_2011'!O26-J26), 0, +I26+'App.2-CB_MIFRS_DepExp_2011'!O26-J26)","v":0}]
[1845,"Underground Conductors & Devices",null,null,0,{"$f":"IF(D27=0,+'App.2-CB_MIFRS_DepExp_2011'!O27,+'App.2-CB_MIFRS_DepExp_2011'!O27+((C27*0.5)/D27))","v":0},null,0,0,null,{"$f":"IF(ISERROR(+I27+'App.2-CB_MIFRS_DepExp_2011'!O27-J27), 0, +I27+'App.2-CB_MIFRS_DepExp_2011'!O27-J27)","v":0}]
[1850,"Line Transformers",null,null,0,{"$f":"IF(D28=0,+'App.2-CB_MIFRS_DepExp_2011'!O28,+'App.2-CB_MIFRS_DepExp_2011'!O28+((C28*0.5)/D28))","v":0},null,0,0,null,{"$f":"IF(ISERROR(+I28+'App.2-CB_MIFRS_DepExp_2011'!O28-J28), 0, +I28+'App.2-CB_MIFRS_DepExp_2011'!O28-J28)","v":0}]
[1855,"Services (Overhead & Underground)",null,null,0,{"$f":"IF(D29=0,+'App.2-CB_MIFRS_DepExp_2011'!O29,+'App.2-CB_MIFRS_DepExp_2011'!O29+((C29*0.5)/D29))","v":0},null,0,0,null,{"$f":"IF(ISERROR(+I29+'App.2-CB_MIFRS_DepExp_2011'!O29-J29), 0, +I29+'App.2-CB_MIFRS_DepExp_2011'!O29-J29)","v":0}]
[1860,"Meters",null,null,0,{"$f":"IF(D30=0,+'App.2-CB_MIFRS_DepExp_2011'!O30,+'App.2-CB_MIFRS_DepExp_2011'!O30+((C30*0.5)/D30))","v":0},null,0,0,null,{"$f":"IF(ISERROR(+I30+'App.2-CB_MIFRS_DepExp_2011'!O30-J30), 0, +I30+'App.2-CB_MIFRS_DepExp_2011'!O30-J30)","v":0}]
[1860,"Meters (Smart Meters)",null,null,0,{"$f":"IF(D31=0,+'App.2-CB_MIFRS_DepExp_2011'!O31,+'App.2-CB_MIFRS_DepExp_2011'!O31+((C31*0.5)/D31))","v":0},null,0,0,null,{"$f":"IF(ISERROR(+I31+'App.2-CB_MIFRS_DepExp_2011'!O31-J31), 0, +I31+'App.2-CB_MIFRS_DepExp_2011'!O31-J31)","v":0}]
[1905,"Land",null,null,0,{"$f":"IF(D32=0,+'App.2-CB_MIFRS_DepExp_2011'!O32,+'App.2-CB_MIFRS_DepExp_2011'!O32+((C32*0.5)/D32))","v":0},null,0,0,null,{"$f":"IF(ISERROR(+I32+'App.2-CB_MIFRS_DepExp_2011'!O32-J32), 0, +I32+'App.2-CB_MIFRS_DepExp_2011'!O32-J32)","v":0}]
[1908,"Buildings & Fixtures",null,null,0,{"$f":"IF(D33=0,+'App.2-CB_MIFRS_DepExp_2011'!O33,+'App.2-CB_MIFRS_DepExp_2011'!O33+((C33*0.5)/D33))","v":0},null,0,0,null,{"$f":"IF(ISERROR(+I33+'App.2-CB_MIFRS_DepExp_2011'!O33-J33), 0, +I33+'App.2-CB_MIFRS_DepExp_2011'!O33-J33)","v":0}]
[1910,"Leasehold Improvements",null,null,0,{"$f":"IF(D34=0,+'App.2-CB_MIFRS_DepExp_2011'!O34,+'App.2-CB_MIFRS_DepExp_2011'!O34+((C34*0.5)/D34))","v":0},null,0,0,null,{"$f":"IF(ISERROR(+I34+'App.2-CB_MIFRS_DepExp_2011'!O34-J34), 0, +I34+'App.2-CB_MIFRS_DepExp_2011'!O34-J34)","v":0}]
[1915,"Office Furniture & Equipment (10 years)",null,null,0,{"$f":"IF(D35=0,+'App.2-CB_MIFRS_DepExp_2011'!O35,+'App.2-CB_MIFRS_DepExp_2011'!O35+((C35*0.5)/D35))","v":0},null,0,0,null,{"$f":"IF(ISERROR(+I35+'App.2-CB_MIFRS_DepExp_2011'!O35-J35), 0, +I35+'App.2-CB_MIFRS_DepExp_2011'!O35-J35)","v":0}]
[1915,"Office Furniture & Equipment (5 years)",null,null,0,{"$f":"IF(D36=0,+'App.2-CB_MIFRS_DepExp_2011'!O36,+'App.2-CB_MIFRS_DepExp_2011'!O36+((C36*0.5)/D36))","v":0},null,0,0,null,{"$f":"IF(ISERROR(+I36+'App.2-CB_MIFRS_DepExp_2011'!O36-J36), 0, +I36+'App.2-CB_MIFRS_DepExp_2011'!O36-J36)","v":0}]
[1920,"Computer Equipment - Hardware",null,null,0,{"$f":"IF(D37=0,+'App.2-CB_MIFRS_DepExp_2011'!O37,+'App.2-CB_MIFRS_DepExp_2011'!O37+((C37*0.5)/D37))","v":0},null,0,0,null,{"$f":"IF(ISERROR(+I37+'App.2-CB_MIFRS_DepExp_2011'!O37-J37), 0, +I37+'App.2-CB_MIFRS_DepExp_2011'!O37-J37)","v":0}]
[1920,"Computer Equip.-Hardware(Post Mar. 22/04)",null,null,0,{"$f":"IF(D38=0,+'App.2-CB_MIFRS_DepExp_2011'!O38,+'App.2-CB_MIFRS_DepExp_2011'!O38+((C38*0.5)/D38))","v":0},null,0,0,null,{"$f":"IF(ISERROR(+I38+'App.2-CB_MIFRS_DepExp_2011'!O38-J38), 0, +I38+'App.2-CB_MIFRS_DepExp_2011'!O38-J38)","v":0}]
[1920,"Computer Equip.-Hardware(Post Mar. 19/07)",null,null,0,{"$f":"IF(D39=0,+'App.2-CB_MIFRS_DepExp_2011'!O39,+'App.2-CB_MIFRS_DepExp_2011'!O39+((C39*0.5)/D39))","v":0},null,0,0,null,{"$f":"IF(ISERROR(+I39+'App.2-CB_MIFRS_DepExp_2011'!O39-J39), 0, +I39+'App.2-CB_MIFRS_DepExp_2011'!O39-J39)","v":0}]
[1930,"Transportation Equipment",null,null,0,{"$f":"IF(D40=0,+'App.2-CB_MIFRS_DepExp_2011'!O40,+'App.2-CB_MIFRS_DepExp_2011'!O40+((C40*0.5)/D40))","v":0},null,0,0,null,{"$f":"IF(ISERROR(+I40+'App.2-CB_MIFRS_DepExp_2011'!O40-J40), 0, +I40+'App.2-CB_MIFRS_DepExp_2011'!O40-J40)","v":0}]
[1935,"Stores Equipment",null,null,0,{"$f":"IF(D41=0,+'App.2-CB_MIFRS_DepExp_2011'!O41,+'App.2-CB_MIFRS_DepExp_2011'!O41+((C41*0.5)/D41))","v":0},null,0,0,null,{"$f":"IF(ISERROR(+I41+'App.2-CB_MIFRS_DepExp_2011'!O41-J41), 0, +I41+'App.2-CB_MIFRS_DepExp_2011'!O41-J41)","v":0}]
[1940,"Tools, Shop & Garage Equipment",null,null,0,{"$f":"IF(D42=0,+'App.2-CB_MIFRS_DepExp_2011'!O42,+'App.2-CB_MIFRS_DepExp_2011'!O42+((C42*0.5)/D42))","v":0},null,0,0,null,{"$f":"IF(ISERROR(+I42+'App.2-CB_MIFRS_DepExp_2011'!O42-J42), 0, +I42+'App.2-CB_MIFRS_DepExp_2011'!O42-J42)","v":0}]
[1945,"Measurement & Testing Equipment",null,null,0,{"$f":"IF(D43=0,+'App.2-CB_MIFRS_DepExp_2011'!O43,+'App.2-CB_MIFRS_DepExp_2011'!O43+((C43*0.5)/D43))","v":0},null,0,0,null,{"$f":"IF(ISERROR(+I43+'App.2-CB_MIFRS_DepExp_2011'!O43-J43), 0, +I43+'App.2-CB_MIFRS_DepExp_2011'!O43-J43)","v":0}]
[1950,"Power Operated Equipment",null,null,0,{"$f":"IF(D44=0,+'App.2-CB_MIFRS_DepExp_2011'!O44,+'App.2-CB_MIFRS_DepExp_2011'!O44+((C44*0.5)/D44))","v":0},null,0,0,null,{"$f":"IF(ISERROR(+I44+'App.2-CB_MIFRS_DepExp_2011'!O44-J44), 0, +I44+'App.2-CB_MIFRS_DepExp_2011'!O44-J44)","v":0}]
[1955,"Communications Equipment",null,null,0,{"$f":"IF(D45=0,+'App.2-CB_MIFRS_DepExp_2011'!O45,+'App.2-CB_MIFRS_DepExp_2011'!O45+((C45*0.5)/D45))","v":0},null,0,0,null,{"$f":"IF(ISERROR(+I45+'App.2-CB_MIFRS_DepExp_2011'!O45-J45), 0, +I45+'App.2-CB_MIFRS_DepExp_2011'!O45-J45)","v":0}]
[1955,"Communication Equipment (Smart Meters)",null,null,0,{"$f":"IF(D46=0,+'App.2-CB_MIFRS_DepExp_2011'!O46,+'App.2-CB_MIFRS_DepExp_2011'!O46+((C46*0.5)/D46))","v":0},null,0,0,null,{"$f":"IF(ISERROR(+I46+'App.2-CB_MIFRS_DepExp_2011'!O46-J46), 0, +I46+'App.2-CB_MIFRS_DepExp_2011'!O46-J46)","v":0}]
[1960,"Miscellaneous Equipment ",null,null,0,{"$f":"IF(D47=0,+'App.2-CB_MIFRS_DepExp_2011'!O47,+'App.2-CB_MIFRS_DepExp_2011'!O47+((C47*0.5)/D47))","v":0},null,0,0,null,{"$f":"IF(ISERROR(+I47+'App.2-CB_MIFRS_DepExp_2011'!O47-J47), 0, +I47+'App.2-CB_MIFRS_DepExp_2011'!O47-J47)","v":0}]
[1975,"Load Management Controls Utility Premises",null,null,0,{"$f":"IF(D48=0,+'App.2-CB_MIFRS_DepExp_2011'!O48,+'App.2-CB_MIFRS_DepExp_2011'!O48+((C48*0.5)/D48))","v":0},null,0,0,null,{"$f":"IF(ISERROR(+I48+'App.2-CB_MIFRS_DepExp_2011'!O48-J48), 0, +I48+'App.2-CB_MIFRS_DepExp_2011'!O48-J48)","v":0}]
[1980,"System Supervisor Equipment",null,null,0,{"$f":"IF(D49=0,+'App.2-CB_MIFRS_DepExp_2011'!O49,+'App.2-CB_MIFRS_DepExp_2011'!O49+((C49*0.5)/D49))","v":0},null,0,0,null,{"$f":"IF(ISERROR(+I49+'App.2-CB_MIFRS_DepExp_2011'!O49-J49), 0, +I49+'App.2-CB_MIFRS_DepExp_2011'!O49-J49)","v":0}]
[1985,"Miscellaneous Fixed Assets",null,null,0,{"$f":"IF(D50=0,+'App.2-CB_MIFRS_DepExp_2011'!O50,+'App.2-CB_MIFRS_DepExp_2011'!O50+((C50*0.5)/D50))","v":0},null,0,0,null,{"$f":"IF(ISERROR(+I50+'App.2-CB_MIFRS_DepExp_2011'!O50-J50), 0, +I50+'App.2-CB_MIFRS_DepExp_2011'!O50-J50)","v":0}]
[1995,"Contributions & Grants",null,null,0,{"$f":"IF(D51=0,+'App.2-CB_MIFRS_DepExp_2011'!O51,+'App.2-CB_MIFRS_DepExp_2011'!O51+((C51*0.5)/D51))","v":0},null,0,0,null,{"$f":"IF(ISERROR(+I51+'App.2-CB_MIFRS_DepExp_2011'!O51-J51), 0, +I51+'App.2-CB_MIFRS_DepExp_2011'!O51-J51)","v":0}]
["etc.",null,null,null,0,{"$f":"IF(D52=0,+'App.2-CB_MIFRS_DepExp_2011'!O52,+'App.2-CB_MIFRS_DepExp_2011'!O52+((C52*0.5)/D52))","v":0},null,0,0,null,{"$f":"IF(ISERROR(+I52+'App.2-CB_MIFRS_DepExp_2011'!O52-J52), 0, +I52+'App.2-CB_MIFRS_DepExp_2011'!O52-J52)","v":0}]
[null,null,null,null,0,{"$f":"IF(D53=0,+'App.2-CB_MIFRS_DepExp_2011'!O53,+'App.2-CB_MIFRS_DepExp_2011'!O53+((C53*0.5)/D53))","v":0},null,0,0,null,{"$f":"IF(ISERROR(+I53+'App.2-CB_MIFRS_DepExp_2011'!O53-J53), 0, +I53+'App.2-CB_MIFRS_DepExp_2011'!O53-J53)","v":0}]
[null,"Total",{"$f":"SUM(C16:C53)","v":0},null,null,{"$f":"SUM(F16:F53)","v":0},0,0,0,0,0]
[]
["Notes:"]
[1,"Board policy of the \"half-year\" rule - the applicant must ensure that additions in the year attract a half-year depreciation expense in the first year.  Deviations from this standard practice must be supported in the application."]
[2,"The applicant must provide an explanation of material variances in evidence"]
[3,"This column refers to the calculated full year depreciation but excludes the depreciation expense on assets fully depreciated during the year.  This column is used for the purpose of calculating depreciation expense in the following year on the next worksheet."]
[]
["General:","Applicants must provide a breakdown of depreciation and amortization expense in the above format for all relevant accounts.  Asset Retirement Obligations (AROs), depreciation and accretion expense should be disclosed separately consistent with the Notes of historical Audited Financial Statements."]

{"sheet":"App.2-CD_MIFRS_DepExp_2013","index":15,"n_rows":61,"n_cols":8,"rows_kept":61,"cut":false,"hidden":true,"merged":[[59,1,59,9],[58,1,58,9],[55,1,55,4],[57,1,57,7],[60,1,61,7],[54,1,54,4],[13,1,14,1],[13,6,14,6],[8,0,8,9],[9,0,9,9],[10,0,10,9]]}
[null,null,null,null,null,null,"File Number:",{"$f":"'LDC Info'!$E$18","v":"EB2012-0176"}]
[null,null,null,null,null,null,"Exhibit:"]
[null,null,null,null,null,null,"Tab:"]
[null,null,null,null,null,null,"Schedule:"]
[null,null,null,null,null,null,"Page:"]
[]
[null,null,null,null,null,null,"Date:"]
[]
["Appendix 2-CD"]
["Depreciation and Amortization Expense"]
["Assumes the applicant adopted IFRS for financial reporting purposes January 1, 2012"]
[null,null,2013,"MIFRS"]
[]
["Account","Description","Additions","Years (new additions only)","Depreciation Rate on New Additions","2013 Depreciation Expense 1","2013 Depreciation Expense per Appendix 2-B Fixed Assets, Column K\n (l)","Variance 2"]
[null,null,"(d)","(f)","(g) = 1 / (f)","(h)=2012 Full Year Depreciation + ((d)*0.5)/(f) ",null,"(m) = (h) - (l)"]
[1611,"Computer Software (Formally known as Account 1925)",null,null,{"$f":"IF(D16=0,0,1/D16)","v":0},{"$f":"IF(D16=0,'App.2-CC_MIFRS_DepExp_2012'!K16,+'App.2-CC_MIFRS_DepExp_2012'!K16+((C16*0.5)/D16))","v":0},null,{"$f":"IF(ISERROR(+F16-G16), 0, +F16-G16)","v":0}]
[1612,"Land Rights (Formally known as Account 1906)",null,null,0,{"$f":"IF(D17=0,'App.2-CC_MIFRS_DepExp_2012'!K17,+'App.2-CC_MIFRS_DepExp_2012'!K17+((C17*0.5)/D17))","v":0},null,0]
[1805,"Land",null,null,0,{"$f":"IF(D18=0,'App.2-CC_MIFRS_DepExp_2012'!K18,+'App.2-CC_MIFRS_DepExp_2012'!K18+((C18*0.5)/D18))","v":0},null,0]
[1808,"Buildings",null,null,0,{"$f":"IF(D19=0,'App.2-CC_MIFRS_DepExp_2012'!K19,+'App.2-CC_MIFRS_DepExp_2012'!K19+((C19*0.5)/D19))","v":0},null,0]
[1810,"Leasehold Improvements",null,null,0,{"$f":"IF(D20=0,'App.2-CC_MIFRS_DepExp_2012'!K20,+'App.2-CC_MIFRS_DepExp_2012'!K20+((C20*0.5)/D20))","v":0},null,0]
[1815,"Transformer Station Equipment >50 kV",null,null,0,{"$f":"IF(D21=0,'App.2-CC_MIFRS_DepExp_2012'!K21,+'App.2-CC_MIFRS_DepExp_2012'!K21+((C21*0.5)/D21))","v":0},null,0]
[1820,"Distribution Station Equipment <50 kV",null,null,0,{"$f":"IF(D22=0,'App.2-CC_MIFRS_DepExp_2012'!K22,+'App.2-CC_MIFRS_DepExp_2012'!K22+((C22*0.5)/D22))","v":0},null,0]
[1825,"Storage Battery Equipment",null,null,0,{"$f":"IF(D23=0,'App.2-CC_MIFRS_DepExp_2012'!K23,+'App.2-CC_MIFRS_DepExp_2012'!K23+((C23*0.5)/D23))","v":0},null,0]
[1830,"Poles, Towers & Fixtures",null,null,0,{"$f":"IF(D24=0,'App.2-CC_MIFRS_DepExp_2012'!K24,+'App.2-CC_MIFRS_DepExp_2012'!K24+((C24*0.5)/D24))","v":0},null,0]
[1835,"Overhead Conductors & Devices",null,null,0,{"$f":"IF(D25=0,'App.2-CC_MIFRS_DepExp_2012'!K25,+'App.2-CC_MIFRS_DepExp_2012'!K25+((C25*0.5)/D25))","v":0},null,0]
[1840,"Underground Conduit",null,null,0,{"$f":"IF(D26=0,'App.2-CC_MIFRS_DepExp_2012'!K26,+'App.2-CC_MIFRS_DepExp_2012'!K26+((C26*0.5)/D26))","v":0},null,0]
[1845,"Underground Conductors & Devices",null,null,0,{"$f":"IF(D27=0,'App.2-CC_MIFRS_DepExp_2012'!K27,+'App.2-CC_MIFRS_DepExp_2012'!K27+((C27*0.5)/D27))","v":0},null,0]
[1850,"Line Transformers",null,null,0,{"$f":"IF(D28=0,'App.2-CC_MIFRS_DepExp_2012'!K28,+'App.2-CC_MIFRS_DepExp_2012'!K28+((C28*0.5)/D28))","v":0},null,0]
[1855,"Services (Overhead & Underground)",null,null,0,{"$f":"IF(D29=0,'App.2-CC_MIFRS_DepExp_2012'!K29,+'App.2-CC_MIFRS_DepExp_2012'!K29+((C29*0.5)/D29))","v":0},null,0]
[1860,"Meters",null,null,0,{"$f":"IF(D30=0,'App.2-CC_MIFRS_DepExp_2012'!K30,+'App.2-CC_MIFRS_DepExp_2012'!K30+((C30*0.5)/D30))","v":0},null,0]
[1860,"Meters (Smart Meters)",null,null,0,{"$f":"IF(D31=0,'App.2-CC_MIFRS_DepExp_2012'!K31,+'App.2-CC_MIFRS_DepExp_2012'!K31+((C31*0.5)/D31))","v":0},null,0]
[1905,"Land",null,null,0,{"$f":"IF(D32=0,'App.2-CC_MIFRS_DepExp_2012'!K32,+'App.2-CC_MIFRS_DepExp_2012'!K32+((C32*0.5)/D32))","v":0},null,0]
[1908,"Buildings & Fixtures",null,null,0,{"$f":"IF(D33=0,'App.2-CC_MIFRS_DepExp_2012'!K33,+'App.2-CC_MIFRS_DepExp_2012'!K33+((C33*0.5)/D33))","v":0},null,0]
[1910,"Leasehold Improvements",null,null,0,{"$f":"IF(D34=0,'App.2-CC_MIFRS_DepExp_2012'!K34,+'App.2-CC_MIFRS_DepExp_2012'!K34+((C34*0.5)/D34))","v":0},null,0]
[1915,"Office Furniture & Equipment (10 years)",null,null,0,{"$f":"IF(D35=0,'App.2-CC_MIFRS_DepExp_2012'!K35,+'App.2-CC_MIFRS_DepExp_2012'!K35+((C35*0.5)/D35))","v":0},null,0]
[1915,"Office Furniture & Equipment (5 years)",null,null,0,{"$f":"IF(D36=0,'App.2-CC_MIFRS_DepExp_2012'!K36,+'App.2-CC_MIFRS_DepExp_2012'!K36+((C36*0.5)/D36))","v":0},null,0]
[1920,"Computer Equipment - Hardware",null,null,0,{"$f":"IF(D37=0,'App.2-CC_MIFRS_DepExp_2012'!K37,+'App.2-CC_MIFRS_DepExp_2012'!K37+((C37*0.5)/D37))","v":0},null,0]
[1920,"Computer Equip.-Hardware(Post Mar. 22/04)",null,null,0,{"$f":"IF(D38=0,'App.2-CC_MIFRS_DepExp_2012'!K38,+'App.2-CC_MIFRS_DepExp_2012'!K38+((C38*0.5)/D38))","v":0},null,0]
[1920,"Computer Equip.-Hardware(Post Mar. 19/07)",null,null,0,{"$f":"IF(D39=0,'App.2-CC_MIFRS_DepExp_2012'!K39,+'App.2-CC_MIFRS_DepExp_2012'!K39+((C39*0.5)/D39))","v":0},null,0]
[1930,"Transportation Equipment",null,null,0,{"$f":"IF(D40=0,'App.2-CC_MIFRS_DepExp_2012'!K40,+'App.2-CC_MIFRS_DepExp_2012'!K40+((C40*0.5)/D40))","v":0},null,0]
[1935,"Stores Equipment",null,null,0,{"$f":"IF(D41=0,'App.2-CC_MIFRS_DepExp_2012'!K41,+'App.2-CC_MIFRS_DepExp_2012'!K41+((C41*0.5)/D41))","v":0},null,0]
[1940,"Tools, Shop & Garage Equipment",null,null,0,{"$f":"IF(D42=0,'App.2-CC_MIFRS_DepExp_2012'!K42,+'App.2-CC_MIFRS_DepExp_2012'!K42+((C42*0.5)/D42))","v":0},null,0]
[1945,"Measurement & Testing Equipment",null,null,0,{"$f":"IF(D43=0,'App.2-CC_MIFRS_DepExp_2012'!K43,+'App.2-CC_MIFRS_DepExp_2012'!K43+((C43*0.5)/D43))","v":0},null,0]
[1950,"Power Operated Equipment",null,null,0,{"$f":"IF(D44=0,'App.2-CC_MIFRS_DepExp_2012'!K44,+'App.2-CC_MIFRS_DepExp_2012'!K44+((C44*0.5)/D44))","v":0},null,0]
[1955,"Communications Equipment",null,null,0,{"$f":"IF(D45=0,'App.2-CC_MIFRS_DepExp_2012'!K45,+'App.2-CC_MIFRS_DepExp_2012'!K45+((C45*0.5)/D45))","v":0},null,0]
[1955,"Communication Equipment (Smart Meters)",null,null,0,{"$f":"IF(D46=0,'App.2-CC_MIFRS_DepExp_2012'!K46,+'App.2-CC_MIFRS_DepExp_2012'!K46+((C46*0.5)/D46))","v":0},null,0]
[1960,"Miscellaneous Equipment ",null,null,0,{"$f":"IF(D47=0,'App.2-CC_MIFRS_DepExp_2012'!K47,+'App.2-CC_MIFRS_DepExp_2012'!K47+((C47*0.5)/D47))","v":0},null,0]
[1975,"Load Management Controls Utility Premises",null,null,0,{"$f":"IF(D48=0,'App.2-CC_MIFRS_DepExp_2012'!K48,+'App.2-CC_MIFRS_DepExp_2012'!K48+((C48*0.5)/D48))","v":0},null,0]
[1980,"System Supervisor Equipment",null,null,0,{"$f":"IF(D49=0,'App.2-CC_MIFRS_DepExp_2012'!K49,+'App.2-CC_MIFRS_DepExp_2012'!K49+((C49*0.5)/D49))","v":0},null,0]
[1985,"Miscellaneous Fixed Assets",null,null,0,{"$f":"IF(D50=0,'App.2-CC_MIFRS_DepExp_2012'!K50,+'App.2-CC_MIFRS_DepExp_2012'!K50+((C50*0.5)/D50))","v":0},null,0]
[1995,"Contributions & Grants",null,null,0,{"$f":"IF(D51=0,'App.2-CC_MIFRS_DepExp_2012'!K51,+'App.2-CC_MIFRS_DepExp_2012'!K51+((C51*0.5)/D51))","v":0},null,0]
["etc.",null,null,null,0,{"$f":"IF(D52=0,'App.2-CC_MIFRS_DepExp_2012'!K52,+'App.2-CC_MIFRS_DepExp_2012'!K52+((C52*0.5)/D52))","v":0},null,0]
[null,null,null,null,0,{"$f":"IF(D53=0,'App.2-CC_MIFRS_DepExp_2012'!K53,+'App.2-CC_MIFRS_DepExp_2012'!K53+((C53*0.5)/D53))","v":0},null,0]
[null,"Total",{"$f":"SUM(C16:C53)","v":0},null,null,{"$f":"SUM(F16:F53)","v":0},{"$f":"SUM(G16:G53)","v":0},{"$f":"SUM(H16:H53)","v":0}]
[null,"Depreciation expense adjustment resulting from  amortization of Account 1575",null,null,null,0]
[null,"Total Depreciation expense to be included in the test year revenue requirement",null,null,null,{"$f":"+F54+F55","v":0}]
["Notes:"]
[1,"Board policy of the \"half-year\" rule - the applicant must ensure that additions in the year attract a half-year depreciation expense in the first year.  Deviations from this standard practice must be supported in the application."]
[2,"The applicant must provide an explanation of material variances in evidence"]
[]
["General:","Applicants must provide a breakdown of depreciation and amortization expense in the above format for all relevant accounts.  Asset Retirement Obligations (AROs), depreciation and accretion expense should be disclosed separately consistent with the Notes of historical Audited Financial Statements."]

{"sheet":"App.2-CE_CGAAP_DepExp_2011","index":16,"n_rows":60,"n_cols":12,"rows_kept":60,"cut":false,"hidden":false,"merged":[[59,1,61,11],[9,0,9,11],[8,0,8,11],[58,1,58,11],[57,1,57,11],[13,0,14,0],[13,1,14,1],[13,10,14,10],[10,0,10,11]]}
[null,null,null,null,null,null,null,null,null,null,"File Number:",{"$f":"'LDC Info'!$E$18","v":"EB2012-0176"}]
[null,null,null,null,null,null,null,null,null,null,"Exhibit:"]
[null,null,null,null,null,null,null,null,null,null,"Tab:"]
[null,null,null,null,null,null,null,null,null,null,"Schedule:"]
[null,null,null,null,null,null,null,null,null,null,"Page:"]
[]
[null,null,null,null,null,null,null,null,null,null,"Date:"]
[]
["Appendix 2-CE"]
["Depreciation and Amortization Expense"]
["Assumes the applicant adopted IFRS for financial reporting purposes January 1, 2013"]
[null,null,"Year",2011,"CGAAP"]
[]
["Account","Description","Opening Regulatory Gross PP&E as at Jan 1, 2011","Less Fully Depreciated","Net for Depreciation","Additions","Total for Depreciation","Years","Depreciation Rate","2011 Depreciation Expense","2011 Depreciation Expense per Appendix 2-B Fixed Assets, Column K\n (l)","Variance 2"]
[null,null,"(a)","(b)","(c)","(d)","(e) = (c) + ½ x (d) 1","(f)","(g) = 1 / (f)","(h) = (e) / (f)",null,"(m) = (h) - (l)"]
[1611,"Computer Software (Formally known as Account 1925)",{"$f":"+'App.2-B_Fixed Asset Cont 2011'!E16","v":0},null,{"$f":"C16-D16","v":0},{"$f":"+'App.2-B_Fixed Asset Cont 2011'!F16","v":0},{"$f":"E16+0.5*F16","v":0},null,{"$f":"IF(H16=0,\"\",1/H16)","v":""},{"$f":"IF(H16=0,0,G16/H16)","v":0},{"$f":"+'App.2-B_Fixed Asset Cont 2011'!K16","v":0},{"$f":"IF(ISERROR(+J16+K16), \"\", +J16+K16)","v":0}]
[1612,"Land Rights (Formally known as Account 1906)",{"$f":"+'App.2-B_Fixed Asset Cont 2011'!E17","v":0},null,{"$f":"C17-D17","v":0},{"$f":"+'App.2-B_Fixed Asset Cont 2011'!F17","v":0},{"$f":"E17+0.5*F17","v":0},null,"",0,{"$f":"+'App.2-B_Fixed Asset Cont 2011'!K17","v":0},{"$f":"IF(ISERROR(+J17+K17), \"\", +J17+K17)","v":0}]
[1805,"Land",{"$f":"+'App.2-B_Fixed Asset Cont 2011'!E18","v":227768.86},null,227768.86,{"$f":"+'App.2-B_Fixed Asset Cont 2011'!F18","v":0},227768.86,null,"",0,{"$f":"+'App.2-B_Fixed Asset Cont 2011'!K18","v":0},{"$f":"IF(ISERROR(+J18+K18), \"\", +J18+K18)","v":0}]
[1808,"Buildings",{"$f":"+'App.2-B_Fixed Asset Cont 2011'!E19","v":2486318},null,2486318,{"$f":"+'App.2-B_Fixed Asset Cont 2011'!F19","v":0},2486318,50,0.02,49726.36,{"$f":"+'App.2-B_Fixed Asset Cont 2011'!K19","v":-49886.67},{"$f":"IF(ISERROR(+J19+K19), \"\", +J19+K19)","v":-160.30999999999767}]
[1810,"Leasehold Improvements",{"$f":"+'App.2-B_Fixed Asset Cont 2011'!E20","v":0},null,0,{"$f":"+'App.2-B_Fixed Asset Cont 2011'!F20","v":0},0,null,"",0,{"$f":"+'App.2-B_Fixed Asset Cont 2011'!K20","v":0},{"$f":"IF(ISERROR(+J20+K20), \"\", +J20+K20)","v":0}]
[1815,"Transformer Station Equipment >50 kV",{"$f":"+'App.2-B_Fixed Asset Cont 2011'!E21","v":0},null,0,{"$f":"+'App.2-B_Fixed Asset Cont 2011'!F21","v":0},0,null,"",0,{"$f":"+'App.2-B_Fixed Asset Cont 2011'!K21","v":0},0]
[1820,"Distribution Station Equipment <50 kV",{"$f":"+'App.2-B_Fixed Asset Cont 2011'!E22","v":3818489.54},null,3818489.54,{"$f":"+'App.2-B_Fixed Asset Cont 2011'!F22","v":450639.48},4043809.2800000003,30,3.3333333333333333E-2,134793.64266666668,{"$f":"+'App.2-B_Fixed Asset Cont 2011'!K22","v":-136439.37},-1645.7273333333142]
[1825,"Storage Battery Equipment",{"$f":"+'App.2-B_Fixed Asset Cont 2011'!E23","v":0},null,0,{"$f":"+'App.2-B_Fixed Asset Cont 2011'!F23","v":0},0,null,"",0,{"$f":"+'App.2-B_Fixed Asset Cont 2011'!K23","v":0},0]
[1830,"Poles, Towers & Fixtures",{"$f":"+'App.2-B_Fixed Asset Cont 2011'!E24","v":6563767.3899999997},null,6563767.3899999997,{"$f":"+'App.2-B_Fixed Asset Cont 2011'!F24","v":542315.17000000004},6834924.9749999996,23,4.3478260869565216E-2,297170.6510869565,{"$f":"+'App.2-B_Fixed Asset Cont 2011'!K24","v":-294873},2297.6510869564954]
[1835,"Overhead Conductors & Devices",{"$f":"+'App.2-B_Fixed Asset Cont 2011'!E25","v":9073534.2800000012},null,9073534.2800000012,{"$f":"+'App.2-B_Fixed Asset Cont 2011'!F25","v":673323.17},9410195.8650000021,23,4.3478260869565216E-2,409138.95065217401,{"$f":"+'App.2-B_Fixed Asset Cont 2011'!K25","v":-411444.53},-2305.5793478260166]
[1840,"Underground Conduit",{"$f":"+'App.2-B_Fixed Asset Cont 2011'!E26","v":2706285.59},null,2706285.59,{"$f":"+'App.2-B_Fixed Asset Cont 2011'!F26","v":338350.33},2875460.7549999999,23,4.3478260869565216E-2,125020.03282608696,{"$f":"+'App.2-B_Fixed Asset Cont 2011'!K26","v":-124188.43},831.60282608696434]
[1845,"Underground Conductors & Devices",{"$f":"+'App.2-B_Fixed Asset Cont 2011'!E27","v":8297546.3499999996},null,8297546.3499999996,{"$f":"+'App.2-B_Fixed Asset Cont 2011'!F27","v":551064.43999999994},8573078.5700000003,23,4.3478260869565216E-2,372742.54652173916,{"$f":"+'App.2-B_Fixed Asset Cont 2011'!K27","v":-372006.35},736.19652173918439]
[1850,"Line Transformers",{"$f":"+'App.2-B_Fixed Asset Cont 2011'!E28","v":7500290.7600000007},null,7500290.7600000007,{"$f":"+'App.2-B_Fixed Asset Cont 2011'!F28","v":507269.99},7753925.7550000008,23,4.3478260869565216E-2,337127.20673913049,{"$f":"+'App.2-B_Fixed Asset Cont 2011'!K28","v":-338711.37},-1584.1632608695072]
[1855,"Services (Overhead & Underground)",{"$f":"+'App.2-B_Fixed Asset Cont 2011'!E29","v":3957038.3200000003},null,3957038.3200000003,{"$f":"+'App.2-B_Fixed Asset Cont 2011'!F29","v":473443.88},4193760.2600000002,23.5,4.2553191489361701E-2,178457.88340425532,{"$f":"+'App.2-B_Fixed Asset Cont 2011'!K29","v":-178825.3},-367.41659574466757]
[1860,"Meters",{"$f":"+'App.2-B_Fixed Asset Cont 2011'!E30","v":1820049.54},305370,1514679.54,{"$f":"+'App.2-B_Fixed Asset Cont 2011'!F30","v":64884},1547121.54,24.5,4.0816326530612242E-2,63147.817959183674,{"$f":"+'App.2-B_Fixed Asset Cont 2011'!K30","v":-61785},1362.8179591836742]
[1860,"Meters (Smart Meters)",{"$f":"+'App.2-B_Fixed Asset Cont 2011'!E31","v":0},null,0,{"$f":"+'App.2-B_Fixed Asset Cont 2011'!F31","v":105634},52817,25,0.04,2112.6799999999998,{"$f":"+'App.2-B_Fixed Asset Cont 2011'!K31","v":-2150.23},-37.550000000000182]
[1905,"Land",{"$f":"+'App.2-B_Fixed Asset Cont 2011'!E32","v":0},null,0,{"$f":"+'App.2-B_Fixed Asset Cont 2011'!F32","v":0},0,null,"",0,{"$f":"+'App.2-B_Fixed Asset Cont 2011'!K32","v":0},0]
[1908,"Buildings & Fixtures",{"$f":"+'App.2-B_Fixed Asset Cont 2011'!E33","v":0},null,0,{"$f":"+'App.2-B_Fixed Asset Cont 2011'!F33","v":0},0,null,"",0,{"$f":"+'App.2-B_Fixed Asset Cont 2011'!K33","v":0},0]
[1910,"Leasehold Improvements",{"$f":"+'App.2-B_Fixed Asset Cont 2011'!E34","v":0},null,0,{"$f":"+'App.2-B_Fixed Asset Cont 2011'!F34","v":0},0,null,"",0,{"$f":"+'App.2-B_Fixed Asset Cont 2011'!K34","v":0},0]
[1915,"Office Furniture & Equipment (10 years)",{"$f":"+'App.2-B_Fixed Asset Cont 2011'!E35","v":251887.34999999998},111863,140024.34999999998,{"$f":"+'App.2-B_Fixed Asset Cont 2011'!F35","v":10588.8},145318.74999999997,10,0.1,14531.874999999996,{"$f":"+'App.2-B_Fixed Asset Cont 2011'!K35","v":-14530.6},1.2749999999959982]
[1915,"Office Furniture & Equipment (5 years)",{"$f":"+'App.2-B_Fixed Asset Cont 2011'!E36","v":0},null,0,{"$f":"+'App.2-B_Fixed Asset Cont 2011'!F36","v":0},0,null,"",0,{"$f":"+'App.2-B_Fixed Asset Cont 2011'!K36","v":0},0]
[1920,"Computer Equipment - Hardware",{"$f":"+'App.2-B_Fixed Asset Cont 2011'!E37","v":275946.02999999997},275946,2.9999999969732016E-2,{"$f":"+'App.2-B_Fixed Asset Cont 2011'!F37","v":0},2.9999999969732016E-2,5,0.2,5.9999999939464033E-3,{"$f":"+'App.2-B_Fixed Asset Cont 2011'!K37","v":0},5.9999999939464033E-3]
[1920,"Computer Equip.-Hardware(Post Mar. 22/04)",{"$f":"+'App.2-B_Fixed Asset Cont 2011'!E38","v":52211.630000000005},52212,-0.36999999999534339,{"$f":"+'App.2-B_Fixed Asset Cont 2011'!F38","v":0},-0.36999999999534339,5,0.2,-7.3999999999068672E-2,{"$f":"+'App.2-B_Fixed Asset Cont 2011'!K38","v":0},-7.3999999999068672E-2]
[1920,"Computer Equip.-Hardware(Post Mar. 19/07)",{"$f":"+'App.2-B_Fixed Asset Cont 2011'!E39","v":108451.22},null,108451.22,{"$f":"+'App.2-B_Fixed Asset Cont 2011'!F39","v":45385.48},131143.96,5,0.2,26228.791999999998,{"$f":"+'App.2-B_Fixed Asset Cont 2011'!K39","v":-26228.240000000002},0.55199999999604188]
[1925,"Computer Software (Formally known as Account 1925)",{"$f":"+'App.2-B_Fixed Asset Cont 2011'!E40","v":854691.24},{"$f":"677090+24891","v":701981},152710.24,{"$f":"+'App.2-B_Fixed Asset Cont 2011'!F40","v":89764.83},197592.655,3,0.33333333333333331,65864.218333333338,{"$f":"+'App.2-B_Fixed Asset Cont 2011'!K40","v":-65863.259999999995},0.95833333334303461]
[1930,"Transportation Equipment",{"$f":"+'App.2-B_Fixed Asset Cont 2011'!E41","v":1838671.03},{"$f":"369181+138750","v":507931},1330740.03,{"$f":"+'App.2-B_Fixed Asset Cont 2011'!F41","v":284250},1472865.03,8,0.125,184108.12875,{"$f":"+'App.2-B_Fixed Asset Cont 2011'!K41","v":-184108.13},-1.2500000011641532E-3]
[1935,"Stores Equipment",{"$f":"+'App.2-B_Fixed Asset Cont 2011'!E42","v":90937.21},{"$f":"2078+5900","v":7978},82959.210000000006,{"$f":"+'App.2-B_Fixed Asset Cont 2011'!F42","v":0},82959.210000000006,10,0.1,8295.9210000000003,{"$f":"+'App.2-B_Fixed Asset Cont 2011'!K42","v":-8295.89},3.1000000000858563E-2]
[1940,"Tools, Shop & Garage Equipment",{"$f":"+'App.2-B_Fixed Asset Cont 2011'!E43","v":278276.02},102262,176014.02000000002,{"$f":"+'App.2-B_Fixed Asset Cont 2011'!F43","v":18504.95},185266.49500000002,10,0.1,18526.649500000003,{"$f":"+'App.2-B_Fixed Asset Cont 2011'!K43","v":-18526.099999999999},0.54950000000462751]
[1945,"Measurement & Testing Equipment",{"$f":"+'App.2-B_Fixed Asset Cont 2011'!E44","v":63138.5},null,63138.5,{"$f":"+'App.2-B_Fixed Asset Cont 2011'!F44","v":4405.08},65341.04,10,0.1,6534.1040000000003,{"$f":"+'App.2-B_Fixed Asset Cont 2011'!K44","v":-6533.03},1.0740000000005239]
[1950,"Power Operated Equipment",{"$f":"+'App.2-B_Fixed Asset Cont 2011'!E45","v":100271.95999999999},{"$f":"9299+11000","v":20299},79972.959999999992,{"$f":"+'App.2-B_Fixed Asset Cont 2011'!F45","v":0},79972.959999999992,10,0.1,7997.2959999999994,{"$f":"+'App.2-B_Fixed Asset Cont 2011'!K45","v":-7997.33},-3.4000000000560249E-2]
[1955,"Communications Equipment",{"$f":"+'App.2-B_Fixed Asset Cont 2011'!E46","v":176173.24},77145,99028.239999999991,{"$f":"+'App.2-B_Fixed Asset Cont 2011'!F46","v":0},99028.239999999991,5,0.2,19805.647999999997,{"$f":"+'App.2-B_Fixed Asset Cont 2011'!K46","v":-20382.11},-576.46200000000317]
[1955,"Communication Equipment (Smart Meters)",{"$f":"+'App.2-B_Fixed Asset Cont 2011'!E47","v":0},null,0,{"$f":"+'App.2-B_Fixed Asset Cont 2011'!F47","v":0},0,null,"",0,{"$f":"+'App.2-B_Fixed Asset Cont 2011'!K47","v":0},0]
[1960,"Miscellaneous Equipment ",{"$f":"+'App.2-B_Fixed Asset Cont 2011'!E48","v":43493.47},6562,36931.47,{"$f":"+'App.2-B_Fixed Asset Cont 2011'!F48","v":0},36931.47,10,0.1,3693.1469999999999,{"$f":"+'App.2-B_Fixed Asset Cont 2011'!K48","v":-3693.18},-3.2999999999901775E-2]
[1975,"Load Management Controls Utility Premises",{"$f":"+'App.2-B_Fixed Asset Cont 2011'!E49","v":258630.5},258631,-0.5,{"$f":"+'App.2-B_Fixed Asset Cont 2011'!F49","v":0},-0.5,10,0.1,-0.05,{"$f":"+'App.2-B_Fixed Asset Cont 2011'!K49","v":0},-0.05]
[1980,"System Supervisor Equipment",{"$f":"+'App.2-B_Fixed Asset Cont 2011'!E50","v":0},null,0,{"$f":"+'App.2-B_Fixed Asset Cont 2011'!F50","v":0},0,null,"",0,{"$f":"+'App.2-B_Fixed Asset Cont 2011'!K50","v":0},0]
[1985,"Miscellaneous Fixed Assets",{"$f":"+'App.2-B_Fixed Asset Cont 2011'!E51","v":1427},1427,0,{"$f":"+'App.2-B_Fixed Asset Cont 2011'!F51","v":0},0,10,0.1,0,{"$f":"+'App.2-B_Fixed Asset Cont 2011'!K51","v":0},0]
[1995,"Contributions & Grants",{"$f":"+'App.2-B_Fixed Asset Cont 2011'!E52","v":-7555736.9699999997},-632720,-6923016.9699999997,{"$f":"+'App.2-B_Fixed Asset Cont 2011'!F52","v":-632720.38},-7239377.1600000001,23,4.3478260869565216E-2,-314755.5286956522,{"$f":"+'App.2-B_Fixed Asset Cont 2011'!K52","v":315631.19},875.66130434779916]
["etc.",null,null,null,0,null,0,null,"",0,null,{"$f":"IF(ISERROR(+J53-K53), \"\", +J53-K53)","v":0}]
[null,null,null,null,0,null,0,null,"",0,null,0]
[null,"Total",{"$f":"SUM(C16:C54)","v":43289558.06000001},{"$f":"SUM(D16:D54)","v":1796887},{"$f":"SUM(E16:E54)","v":41492671.06000001},{"$f":"SUM(F16:F54)","v":3527103.22},{"$f":"SUM(G16:G54)","v":43256222.670000017},null,null,{"$f":"SUM(J16:J54)","v":2010267.9047438735},{"$f":"SUM(K16:K54)","v":-2010836.9300000006},{"$f":"SUM(L16:L54)","v":-569.02525612605473}]
[]
["Notes:"]
[1,"Board policy of the \"half-year\" rule - the applicant must ensure that additions in the year attract a half-year depreciation expense in the first year.  Deviations from this standard practice must be supported in the application."]
[2,"The applicant must provide an explanation of material variances in evidence"]
["General:","Applicants must provide a breakdown of depreciation and amortization expense in the above format for all relevant accounts.  Asset Retirement Obligations (AROs), depreciation and accretion expense should be disclosed separately consistent with the Notes of historical Audited Financial Statements."]

{"sheet":"App.2-CF_CGAAP_DepExp_2012","index":17,"n_rows":61,"n_cols":12,"rows_kept":61,"cut":false,"hidden":false,"merged":[[9,0,9,11],[8,0,8,11],[57,1,57,11],[58,1,58,11],[60,1,61,11],[13,0,14,0],[13,1,14,1],[13,10,14,10],[10,0,10,11]]}
[null,null,null,null,null,null,null,null,null,null,"File Number:",{"$f":"'LDC Info'!$E$18","v":"EB2012-0176"}]
[null,null,null,null,null,null,null,null,null,null,"Exhibit:"]
[null,null,null,null,null,null,null,null,null,null,"Tab:"]
[null,null,null,null,null,null,null,null,null,null,"Schedule:"]
[null,null,null,null,null,null,null,null,null,null,"Page:"]
[]
[null,null,null,null,null,null,null,null,null,null,"Date:"]
[]
["Appendix 2-CF"]
["Depreciation and Amortization Expense"]
["Assumes the applicant adopted IFRS for financial reporting purposes January 1, 2013"]
[null,null,"Year",2012,"CGAAP"]
[]
["Account","Description","Opening Regulatory Gross PP&E as at Jan 1, 2012","Less Fully Depreciated","Net for Depreciation","Additions","Total for Depreciation","Years","Depreciation Rate","2012 Depreciation Expense","2012 Depreciation Expense per Appendix 2-B Fixed Assets, Column K\n (l)","Variance 2"]
[null,null,"(a)","(b)","(c)","(d)","(e) = (c) + ½ x (d) 1","(f)","(g) = 1 / (f)","(h) = (e) / (f)",null,"(m) = (h) - (l)"]
[1611,"Computer Software (Formally known as Account 1925)",{"$f":"+'App.2-B_Fixed Asset Cont 2012'!E16","v":0},null,{"$f":"C16-D16","v":0},{"$f":"+'App.2-B_Fixed Asset Cont 2012'!F16","v":0},{"$f":"E16+0.5*F16","v":0},{"$f":"+'App.2-CE_CGAAP_DepExp_2011'!H16","v":0},{"$f":"IF(H16=0,0,1/H16)","v":0},{"$f":"IF(H16=0,0,G16/H16)","v":0},{"$f":"+'App.2-B_Fixed Asset Cont 2012'!K16","v":0},{"$f":"IF(ISERROR(+J16+K16), 0, +J16+K16)","v":0}]
[1612,"Land Rights (Formally known as Account 1906)",{"$f":"+'App.2-B_Fixed Asset Cont 2012'!E17","v":0},null,{"$f":"C17-D17","v":0},{"$f":"+'App.2-B_Fixed Asset Cont 2012'!F17","v":0},{"$f":"E17+0.5*F17","v":0},{"$f":"+'App.2-CE_CGAAP_DepExp_2011'!H17","v":0},0,0,{"$f":"+'App.2-B_Fixed Asset Cont 2012'!K17","v":0},{"$f":"IF(ISERROR(+J17+K17), 0, +J17+K17)","v":0}]
[1805,"Land",{"$f":"+'App.2-B_Fixed Asset Cont 2012'!E18","v":227768.86},null,227768.86,{"$f":"+'App.2-B_Fixed Asset Cont 2012'!F18","v":0},227768.86,{"$f":"+'App.2-CE_CGAAP_DepExp_2011'!H18","v":0},0,0,{"$f":"+'App.2-B_Fixed Asset Cont 2012'!K18","v":0},0]
[1808,"Buildings",{"$f":"+'App.2-B_Fixed Asset Cont 2012'!E19","v":2486318},null,2486318,{"$f":"+'App.2-B_Fixed Asset Cont 2012'!F19","v":5000},2488818,{"$f":"+'App.2-CE_CGAAP_DepExp_2011'!H19","v":50},0.02,49776.36,{"$f":"+'App.2-B_Fixed Asset Cont 2012'!K19","v":-49937},-160.63999999999942]
[1810,"Leasehold Improvements",{"$f":"+'App.2-B_Fixed Asset Cont 2012'!E20","v":0},null,0,{"$f":"+'App.2-B_Fixed Asset Cont 2012'!F20","v":0},0,{"$f":"+'App.2-CE_CGAAP_DepExp_2011'!H20","v":0},0,0,{"$f":"+'App.2-B_Fixed Asset Cont 2012'!K20","v":0},0]
[1815,"Transformer Station Equipment >50 kV",{"$f":"+'App.2-B_Fixed Asset Cont 2012'!E21","v":0},null,0,{"$f":"+'App.2-B_Fixed Asset Cont 2012'!F21","v":0},0,{"$f":"+'App.2-CE_CGAAP_DepExp_2011'!H21","v":0},0,0,{"$f":"+'App.2-B_Fixed Asset Cont 2012'!K21","v":0},0]
[1820,"Distribution Station Equipment <50 kV",{"$f":"+'App.2-B_Fixed Asset Cont 2012'!E22","v":4269129.0199999996},null,4269129.0199999996,{"$f":"+'App.2-B_Fixed Asset Cont 2012'!F22-89310","v":417529},4477893.5199999996,{"$f":"+'App.2-CE_CGAAP_DepExp_2011'!H22","v":30},3.3333333333333333E-2,149263.11733333333,{"$f":"+'App.2-B_Fixed Asset Cont 2012'!K22","v":-147775},1488.1173333333281]
[1825,"Storage Battery Equipment",{"$f":"+'App.2-B_Fixed Asset Cont 2012'!E23","v":0},null,0,{"$f":"+'App.2-B_Fixed Asset Cont 2012'!F23","v":0},0,{"$f":"+'App.2-CE_CGAAP_DepExp_2011'!H23","v":0},0,0,{"$f":"+'App.2-B_Fixed Asset Cont 2012'!K23","v":0},0]
[1830,"Poles, Towers & Fixtures",{"$f":"+'App.2-B_Fixed Asset Cont 2012'!E24","v":7106082.5599999996},null,7106082.5599999996,{"$f":"+'App.2-B_Fixed Asset Cont 2012'!F24","v":888906},7550535.5599999996,{"$f":"+'App.2-CE_CGAAP_DepExp_2011'!H24","v":23},4.3478260869565216E-2,328284.15478260868,{"$f":"+'App.2-B_Fixed Asset Cont 2012'!K24","v":-327658},626.1547826086753]
[1835,"Overhead Conductors & Devices",{"$f":"+'App.2-B_Fixed Asset Cont 2012'!E25","v":9746857.4500000011},null,9746857.4500000011,{"$f":"+'App.2-B_Fixed Asset Cont 2012'!F25","v":838997},10166355.950000001,{"$f":"+'App.2-CE_CGAAP_DepExp_2011'!H25","v":23},4.3478260869565216E-2,442015.47608695657,{"$f":"+'App.2-B_Fixed Asset Cont 2012'!K25","v":-441852},163.47608695656527]
[1840,"Underground Conduit",{"$f":"+'App.2-B_Fixed Asset Cont 2012'!E26","v":3044635.92},null,3044635.92,{"$f":"+'App.2-B_Fixed Asset Cont 2012'!F26","v":290681},3189976.42,{"$f":"+'App.2-CE_CGAAP_DepExp_2011'!H26","v":23},4.3478260869565216E-2,138694.62695652174,{"$f":"+'App.2-B_Fixed Asset Cont 2012'!K26","v":-136788},1906.6269565217372]
[1845,"Underground Conductors & Devices",{"$f":"+'App.2-B_Fixed Asset Cont 2012'!E27","v":8848610.7899999991},null,8848610.7899999991,{"$f":"+'App.2-B_Fixed Asset Cont 2012'!F27","v":454468},9075844.7899999991,{"$f":"+'App.2-CE_CGAAP_DepExp_2011'!H27","v":23},4.3478260869565216E-2,394601.9473913043,{"$f":"+'App.2-B_Fixed Asset Cont 2012'!K27","v":-392366},2235.9473913043039]
[1850,"Line Transformers",{"$f":"+'App.2-B_Fixed Asset Cont 2012'!E28","v":8007560.7500000009},null,8007560.7500000009,{"$f":"+'App.2-B_Fixed Asset Cont 2012'!F28","v":592656},8303888.7500000009,{"$f":"+'App.2-CE_CGAAP_DepExp_2011'!H28","v":23},4.3478260869565216E-2,361038.64130434784,{"$f":"+'App.2-B_Fixed Asset Cont 2012'!K28","v":-360782},256.64130434783874]
[1855,"Services (Overhead & Underground)",{"$f":"+'App.2-B_Fixed Asset Cont 2012'!E29","v":4430482.2},null,4430482.2,{"$f":"+'App.2-B_Fixed Asset Cont 2012'!F29","v":637257},4749110.7,23.5,4.2553191489361701E-2,202089.8170212766,{"$f":"+'App.2-B_Fixed Asset Cont 2012'!K29","v":-201040},1049.8170212765981]
[1860,"Meters",{"$f":"+'App.2-B_Fixed Asset Cont 2012'!E30","v":1579563.6600000001},null,1579563.6600000001,{"$f":"+'App.2-B_Fixed Asset Cont 2012'!F30+89310","v":89310},1624218.6600000001,{"$f":"+'App.2-CE_CGAAP_DepExp_2011'!H30","v":24.5},4.0816326530612242E-2,66294.639183673469,{"$f":"+'App.2-B_Fixed Asset Cont 2012'!K30","v":-67812},-1517.3608163265308]
[1860,"Meters (Smart Meters)",{"$f":"+'App.2-B_Fixed Asset Cont 2012'!E31","v":105634},null,105634,{"$f":"+'App.2-B_Fixed Asset Cont 2012'!F31","v":38652},124960,15,6.6666666666666666E-2,8330.6666666666661,{"$f":"+'App.2-B_Fixed Asset Cont 2012'!K31","v":-8418},-87.33333333333394]
[1905,"Land",{"$f":"+'App.2-B_Fixed Asset Cont 2012'!E32","v":0},null,0,{"$f":"+'App.2-B_Fixed Asset Cont 2012'!F32","v":0},0,{"$f":"+'App.2-CE_CGAAP_DepExp_2011'!H32","v":0},0,0,{"$f":"+'App.2-B_Fixed Asset Cont 2012'!K32","v":0},0]
[1908,"Buildings & Fixtures",{"$f":"+'App.2-B_Fixed Asset Cont 2012'!E33","v":0},null,0,{"$f":"+'App.2-B_Fixed Asset Cont 2012'!F33","v":0},0,{"$f":"+'App.2-CE_CGAAP_DepExp_2011'!H33","v":0},0,0,{"$f":"+'App.2-B_Fixed Asset Cont 2012'!K33","v":0},0]
[1910,"Leasehold Improvements",{"$f":"+'App.2-B_Fixed Asset Cont 2012'!E34","v":0},null,0,{"$f":"+'App.2-B_Fixed Asset Cont 2012'!F34","v":0},0,{"$f":"+'App.2-CE_CGAAP_DepExp_2011'!H34","v":0},0,0,{"$f":"+'App.2-B_Fixed Asset Cont 2012'!K34","v":0},0]
[1915,"Office Furniture & Equipment (10 years)",{"$f":"+'App.2-B_Fixed Asset Cont 2012'!E35","v":262476.14999999997},114122,148354.14999999997,{"$f":"+'App.2-B_Fixed Asset Cont 2012'!F35","v":5000},150854.14999999997,{"$f":"+'App.2-CE_CGAAP_DepExp_2011'!H35","v":10},0.1,15085.414999999997,{"$f":"+'App.2-B_Fixed Asset Cont 2012'!K35","v":-15084},1.4149999999972351]
[1915,"Office Furniture & Equipment (5 years)",{"$f":"+'App.2-B_Fixed Asset Cont 2012'!E36","v":0},null,0,{"$f":"+'App.2-B_Fixed Asset Cont 2012'!F36","v":0},0,{"$f":"+'App.2-CE_CGAAP_DepExp_2011'!H36","v":0},0,0,{"$f":"+'App.2-B_Fixed Asset Cont 2012'!K36","v":0},0]
[1920,"Computer Equipment - Hardware",{"$f":"+'App.2-B_Fixed Asset Cont 2012'!E37","v":275946.02999999997},275946,2.9999999969732016E-2,{"$f":"+'App.2-B_Fixed Asset Cont 2012'!F37","v":0},2.9999999969732016E-2,{"$f":"+'App.2-CE_CGAAP_DepExp_2011'!H37","v":5},0.2,5.9999999939464033E-3,{"$f":"+'App.2-B_Fixed Asset Cont 2012'!K37","v":0},5.9999999939464033E-3]
[1920,"Computer Equip.-Hardware(Post Mar. 22/04)",{"$f":"+'App.2-B_Fixed Asset Cont 2012'!E38","v":52211.630000000005},52212,-0.36999999999534339,{"$f":"+'App.2-B_Fixed Asset Cont 2012'!F38","v":0},-0.36999999999534339,{"$f":"+'App.2-CE_CGAAP_DepExp_2011'!H38","v":5},0.2,-7.3999999999068672E-2,{"$f":"+'App.2-B_Fixed Asset Cont 2012'!K38","v":0},-7.3999999999068672E-2]
[1920,"Computer Equip.-Hardware(Post Mar. 19/07)",{"$f":"+'App.2-B_Fixed Asset Cont 2012'!E39","v":153836.70000000001},29316,124520.70000000001,{"$f":"+'App.2-B_Fixed Asset Cont 2012'!F39","v":22000},135520.70000000001,{"$f":"+'App.2-CE_CGAAP_DepExp_2011'!H39","v":5},0.2,27104.140000000003,{"$f":"+'App.2-B_Fixed Asset Cont 2012'!K39","v":-27104},0.1400000000030559]
[1925,"Computer Software (Formally known as Account 1925)",{"$f":"+'App.2-B_Fixed Asset Cont 2012'!E40","v":944456.07},{"$f":"726871+11744+20000","v":758615},185841.06999999995,{"$f":"+'App.2-B_Fixed Asset Cont 2012'!F40","v":50000},210841.06999999995,{"$f":"+'App.2-CE_CGAAP_DepExp_2011'!H40","v":3},0.33333333333333331,70280.356666666645,{"$f":"+'App.2-B_Fixed Asset Cont 2012'!K40","v":-70279},1.3566666666447418]
[1930,"Transportation Equipment",{"$f":"+'App.2-B_Fixed Asset Cont 2012'!E41","v":1984171.0300000003},{"$f":"369181+1072","v":370253},1613918.0300000003,{"$f":"+'App.2-B_Fixed Asset Cont 2012'!F41","v":450000},1838918.0300000003,{"$f":"+'App.2-CE_CGAAP_DepExp_2011'!H41","v":8},0.125,229864.75375000003,{"$f":"+'App.2-B_Fixed Asset Cont 2012'!K41","v":-229861},3.7537500000325963]
[1935,"Stores Equipment",{"$f":"+'App.2-B_Fixed Asset Cont 2012'!E42","v":85037.21},2078,82959.210000000006,{"$f":"+'App.2-B_Fixed Asset Cont 2012'!F42","v":0},82959.210000000006,{"$f":"+'App.2-CE_CGAAP_DepExp_2011'!H42","v":10},0.1,8295.9210000000003,{"$f":"+'App.2-B_Fixed Asset Cont 2012'!K42","v":-8296},-7.8999999999723514E-2]
[1940,"Tools, Shop & Garage Equipment",{"$f":"+'App.2-B_Fixed Asset Cont 2012'!E43","v":296780.97000000003},109125,187655.97000000003,{"$f":"+'App.2-B_Fixed Asset Cont 2012'!F43","v":72000},223655.97000000003,{"$f":"+'App.2-CE_CGAAP_DepExp_2011'!H43","v":10},0.1,22365.597000000002,{"$f":"+'App.2-B_Fixed Asset Cont 2012'!K43","v":-22364},1.5970000000015716]
[1945,"Measurement & Testing Equipment",{"$f":"+'App.2-B_Fixed Asset Cont 2012'!E44","v":67543.58},1095,66448.58,{"$f":"+'App.2-B_Fixed Asset Cont 2012'!F44","v":0},66448.58,{"$f":"+'App.2-CE_CGAAP_DepExp_2011'!H44","v":10},0.1,6644.8580000000002,{"$f":"+'App.2-B_Fixed Asset Cont 2012'!K44","v":-6645},-0.14199999999982538]
[1950,"Power Operated Equipment",{"$f":"+'App.2-B_Fixed Asset Cont 2012'!E45","v":89271.959999999992},9299,79972.959999999992,{"$f":"+'App.2-B_Fixed Asset Cont 2012'!F45","v":0},79972.959999999992,{"$f":"+'App.2-CE_CGAAP_DepExp_2011'!H45","v":10},0.1,7997.2959999999994,{"$f":"+'App.2-B_Fixed Asset Cont 2012'!K45","v":-7997},0.29599999999936699]
[1955,"Communications Equipment",{"$f":"+'App.2-B_Fixed Asset Cont 2012'!E46","v":176173.24},74263,101910.23999999999,{"$f":"+'App.2-B_Fixed Asset Cont 2012'!F46","v":0},101910.23999999999,{"$f":"+'App.2-CE_CGAAP_DepExp_2011'!H46","v":5},0.2,20382.047999999999,{"$f":"+'App.2-B_Fixed Asset Cont 2012'!K46","v":-20382},4.7999999998864951E-2]
[1955,"Communication Equipment (Smart Meters)",{"$f":"+'App.2-B_Fixed Asset Cont 2012'!E47","v":0},null,0,{"$f":"+'App.2-B_Fixed Asset Cont 2012'!F47","v":0},0,{"$f":"+'App.2-CE_CGAAP_DepExp_2011'!H47","v":0},0,0,{"$f":"+'App.2-B_Fixed Asset Cont 2012'!K47","v":0},0]
[1960,"Miscellaneous Equipment ",{"$f":"+'App.2-B_Fixed Asset Cont 2012'!E48","v":43493.47},{"$f":"21142-1072","v":20070},23423.47,{"$f":"+'App.2-B_Fixed Asset Cont 2012'!F48","v":40000},43423.47,{"$f":"+'App.2-CE_CGAAP_DepExp_2011'!H48","v":10},0.1,4342.3469999999998,{"$f":"+'App.2-B_Fixed Asset Cont 2012'!K48","v":-4342},0.34699999999975262]
[1975,"Load Management Controls Utility Premises",{"$f":"+'App.2-B_Fixed Asset Cont 2012'!E49","v":258630.5},258631,-0.5,{"$f":"+'App.2-B_Fixed Asset Cont 2012'!F49","v":0},-0.5,{"$f":"+'App.2-CE_CGAAP_DepExp_2011'!H49","v":10},0.1,-0.05,{"$f":"+'App.2-B_Fixed Asset Cont 2012'!K49","v":0},-0.05]
[1980,"System Supervisor Equipment",{"$f":"+'App.2-B_Fixed Asset Cont 2012'!E50","v":0},null,0,{"$f":"+'App.2-B_Fixed Asset Cont 2012'!F50","v":0},0,{"$f":"+'App.2-CE_CGAAP_DepExp_2011'!H50","v":0},0,0,{"$f":"+'App.2-B_Fixed Asset Cont 2012'!K50","v":0},0]
[1985,"Miscellaneous Fixed Assets",{"$f":"+'App.2-B_Fixed Asset Cont 2012'!E51","v":1427},1427,0,{"$f":"+'App.2-B_Fixed Asset Cont 2012'!F51","v":0},0,{"$f":"+'App.2-CE_CGAAP_DepExp_2011'!H51","v":10},0.1,0,{"$f":"+'App.2-B_Fixed Asset Cont 2012'!K51","v":0},0]
[1995,"Contributions & Grants",{"$f":"+'App.2-B_Fixed Asset Cont 2012'!E52","v":-8188457.3499999996},-632720,-7555737.3499999996,{"$f":"+'App.2-B_Fixed Asset Cont 2012'!F52","v":-433861},-7772667.8499999996,{"$f":"+'App.2-CE_CGAAP_DepExp_2011'!H52","v":23},4.3478260869565216E-2,-337942.08043478261,{"$f":"+'App.2-B_Fixed Asset Cont 2012'!K52","v":336986},-956.08043478260515]
["etc.",null,null,null,0,null,0,null,0,0,null,{"$f":"IF(ISERROR(+J53-K53), 0, +J53-K53)","v":0}]
[null,null,null,null,0,null,0,null,0,0,null,0]
[null,"Total",{"$f":"SUM(C16:C54)","v":46355641.400000013},{"$f":"SUM(D16:D54)","v":1443732},{"$f":"SUM(E16:E54)","v":44911909.400000013},{"$f":"SUM(F16:F54)","v":4458595},{"$f":"SUM(G16:G54)","v":47141206.900000013},null,null,{"$f":"SUM(J16:J54)","v":2214809.9807085739},{"$f":"SUM(K16:K54)","v":-2209796},{"$f":"SUM(L16:L54)","v":5013.98070857325}]
[]
["Notes:"]
[1,"Board policy of the \"half-year\" rule - the applicant must ensure that additions in the year attract a half-year depreciation expense in the first year.  Deviations from this standard practice must be supported in the application."]
[2,"The applicant must provide an explanation of material variances in evidence"]
[]
["General:","Applicants must provide a breakdown of depreciation and amortization expense in the above format for all relevant accounts.  Asset Retirement Obligations (AROs), depreciation and accretion expense should be disclosed separately consistent with the Notes of historical Audited Financial Statements."]

{"sheet":"App.2-CJ_CGAAP_DepExp_2013","index":18,"n_rows":65,"n_cols":13,"rows_kept":65,"cut":false,"hidden":false,"merged":[[58,12,58,13],[61,1,61,11],[62,1,62,11],[64,1,65,11],[8,0,8,11],[9,0,9,11],[10,0,10,11],[13,0,14,0],[13,1,14,1],[13,10,14,10]]}
[null,null,null,null,null,null,null,null,null,null,"File Number:",{"$f":"'LDC Info'!$E$18","v":"EB2012-0176"}]
[null,null,null,null,null,null,null,null,null,null,"Exhibit:"]
[null,null,null,null,null,null,null,null,null,null,"Tab:"]
[null,null,null,null,null,null,null,null,null,null,"Schedule:"]
[null,null,null,null,null,null,null,null,null,null,"Page:"]
[]
[null,null,null,null,null,null,null,null,null,null,"Date:"]
[]
["Appendix 2-CJ"]
["Depreciation and Amortization Expense"]
["Assumes the applicant adopted IFRS for financial reporting purposes January 1, 2013"]
[null,null,"Year",2013,"CGAAP"]
[]
["Account","Description","Opening Regulatory Gross PP&E as at Jan 1, 2013","Less Fully Depreciated","Net for Depreciation","Additions","Total for Depreciation","Years","Depreciation Rate","2013 Depreciation Expense","2013 Depreciation Expense per Appendix 2-B Fixed Assets, Column K\n (l)","Variance 2"]
[null,null,"(a)","(b)","(c)","(d)","(e) = (c) + ½ x (d) 1","(f)","(g) = 1 / (f)","(h) = (e) / (f)",null,"(m) = (h) - (l)"]
[1611,"Computer Software (Formally known as Account 1925)",{"$f":"+'App.2-B_Fixed Asset Cont 2013'!E16","v":0},null,{"$f":"C16-D16","v":0},{"$f":"+'App.2-B_Fixed Asset Cont 2013'!F16","v":0},{"$f":"E16+0.5*F16","v":0},{"$f":"+'App.2-CE_CGAAP_DepExp_2011'!H16","v":0},{"$f":"IF(H16=0,0,1/H16)","v":0},{"$f":"IF(H16=0,0,G16/H16)","v":0},{"$f":"+'App.2-B_Fixed Asset Cont 2013'!K16","v":0},{"$f":"IF(ISERROR(+J16+K16), 0, +J16+K16)","v":0}]
[1612,"Land Rights (Formally known as Account 1906)",{"$f":"+'App.2-B_Fixed Asset Cont 2013'!E17","v":0},null,{"$f":"C17-D17","v":0},{"$f":"+'App.2-B_Fixed Asset Cont 2013'!F17","v":0},{"$f":"E17+0.5*F17","v":0},{"$f":"+'App.2-CE_CGAAP_DepExp_2011'!H17","v":0},0,0,{"$f":"+'App.2-B_Fixed Asset Cont 2013'!K17","v":0},{"$f":"IF(ISERROR(+J17+K17), 0, +J17+K17)","v":0}]
[1805,"Land",{"$f":"+'App.2-B_Fixed Asset Cont 2013'!E18","v":227768.86},null,227768.86,{"$f":"+'App.2-B_Fixed Asset Cont 2013'!F18","v":0},227768.86,{"$f":"+'App.2-CE_CGAAP_DepExp_2011'!H18","v":0},0,0,{"$f":"+'App.2-B_Fixed Asset Cont 2013'!K18","v":0},0]
[1808,"Buildings",{"$f":"+'App.2-B_Fixed Asset Cont 2013'!E19","v":2491318},null,2491318,{"$f":"+'App.2-B_Fixed Asset Cont 2013'!F19","v":9000},2495818,{"$f":"+'App.2-CE_CGAAP_DepExp_2011'!H19","v":50},0.02,49916.36,{"$f":"+'App.2-B_Fixed Asset Cont 2013'!K19","v":-50077},-160.63999999999942]
[1810,"Leasehold Improvements",{"$f":"+'App.2-B_Fixed Asset Cont 2013'!E20","v":0},null,0,{"$f":"+'App.2-B_Fixed Asset Cont 2013'!F20","v":0},0,{"$f":"+'App.2-CE_CGAAP_DepExp_2011'!H20","v":0},0,0,{"$f":"+'App.2-B_Fixed Asset Cont 2013'!K20","v":0},0]
[1815,"Transformer Station Equipment >50 kV",{"$f":"+'App.2-B_Fixed Asset Cont 2013'!E21","v":0},null,0,{"$f":"+'App.2-B_Fixed Asset Cont 2013'!F21","v":0},0,{"$f":"+'App.2-CE_CGAAP_DepExp_2011'!H21","v":0},0,0,{"$f":"+'App.2-B_Fixed Asset Cont 2013'!K21","v":0},0]
[1820,"Distribution Station Equipment <50 kV",{"$f":"+'App.2-B_Fixed Asset Cont 2013'!E22","v":4775968.0199999996},null,4775968.0199999996,{"$f":"+'App.2-B_Fixed Asset Cont 2013'!F22","v":594855},5073395.5199999996,{"$f":"+'App.2-CE_CGAAP_DepExp_2011'!H22","v":30},3.3333333333333333E-2,169113.18399999998,{"$f":"+'App.2-B_Fixed Asset Cont 2013'!K22","v":-166136},2977.1839999999793]
[1825,"Storage Battery Equipment",{"$f":"+'App.2-B_Fixed Asset Cont 2013'!E23","v":0},null,0,{"$f":"+'App.2-B_Fixed Asset Cont 2013'!F23","v":0},0,{"$f":"+'App.2-CE_CGAAP_DepExp_2011'!H23","v":0},0,0,{"$f":"+'App.2-B_Fixed Asset Cont 2013'!K23","v":0},0]
[1830,"Poles, Towers & Fixtures",{"$f":"+'App.2-B_Fixed Asset Cont 2013'!E24","v":7994988.5599999996},null,7994988.5599999996,{"$f":"+'App.2-B_Fixed Asset Cont 2013'!F24","v":958576},8474276.5599999987,23.25,4.3010752688172046E-2,364485.01333333325,{"$f":"+'App.2-B_Fixed Asset Cont 2013'!K24","v":-364607},-121.98666666675126]
[1835,"Overhead Conductors & Devices",{"$f":"+'App.2-B_Fixed Asset Cont 2013'!E25","v":10585854.450000001},null,10585854.450000001,{"$f":"+'App.2-B_Fixed Asset Cont 2013'!F25","v":893675},11032691.950000001,23.25,4.3010752688172046E-2,474524.38494623662,{"$f":"+'App.2-B_Fixed Asset Cont 2013'!K25","v":-476505},-1980.6150537633803]
[1840,"Underground Conduit",{"$f":"+'App.2-B_Fixed Asset Cont 2013'!E26","v":3335316.92},null,3335316.92,{"$f":"+'App.2-B_Fixed Asset Cont 2013'!F26","v":409989},3540311.42,23.25,4.3010752688172046E-2,152271.45892473118,{"$f":"+'App.2-B_Fixed Asset Cont 2013'!K26","v":-150801},1470.4589247311815]
[1845,"Underground Conductors & Devices",{"$f":"+'App.2-B_Fixed Asset Cont 2013'!E27","v":9303078.7899999991},null,9303078.7899999991,{"$f":"+'App.2-B_Fixed Asset Cont 2013'!F27","v":505661},9555909.2899999991,23.25,4.3010752688172046E-2,411006.85118279565,{"$f":"+'App.2-B_Fixed Asset Cont 2013'!K27","v":-411569},-562.14881720434641]
[1850,"Line Transformers",{"$f":"+'App.2-B_Fixed Asset Cont 2013'!E28","v":8600216.75},null,8600216.75,{"$f":"+'App.2-B_Fixed Asset Cont 2013'!F28","v":627227},8913830.25,23.25,4.3010752688172046E-2,383390.54838709679,{"$f":"+'App.2-B_Fixed Asset Cont 2013'!K28","v":-385180},-1789.4516129032127]
[1855,"Services (Overhead & Underground)",{"$f":"+'App.2-B_Fixed Asset Cont 2013'!E29","v":5067739.2},null,5067739.2,{"$f":"+'App.2-B_Fixed Asset Cont 2013'!F29","v":658066},5396772.2000000002,24,4.1666666666666664E-2,224865.50833333333,{"$f":"+'App.2-B_Fixed Asset Cont 2013'!K29","v":-226946},-2080.4916666666686]
[1860,"Meters",{"$f":"+'App.2-B_Fixed Asset Cont 2013'!E30","v":1579563.6600000001},null,1579563.6600000001,{"$f":"+'App.2-B_Fixed Asset Cont 2013'!F30","v":0},1579563.6600000001,{"$f":"+'[4]App.2-CE_CGAAP_DepExp_2011'!H30","v":24.5},4.0816326530612242E-2,64471.986122448987,{"$f":"+'App.2-B_Fixed Asset Cont 2013'!K30","v":-67812},-3340.0138775510131]
[1860,"Meters (Smart Meters)",{"$f":"+'App.2-B_Fixed Asset Cont 2013'!E31","v":144286},null,144286,{"$f":"+'App.2-B_Fixed Asset Cont 2013'!F31","v":316432},302502,15,6.6666666666666666E-2,20166.8,{"$f":"+'App.2-B_Fixed Asset Cont 2013'!K31","v":-20245},-78.200000000000728]
[1905,"Land",{"$f":"+'App.2-B_Fixed Asset Cont 2013'!E32","v":0},null,0,{"$f":"+'App.2-B_Fixed Asset Cont 2013'!F32","v":0},0,{"$f":"+'App.2-CE_CGAAP_DepExp_2011'!H32","v":0},0,0,{"$f":"+'App.2-B_Fixed Asset Cont 2013'!K32","v":0},0]
[1908,"Buildings & Fixtures",{"$f":"+'App.2-B_Fixed Asset Cont 2013'!E33","v":0},null,0,{"$f":"+'App.2-B_Fixed Asset Cont 2013'!F33","v":0},0,{"$f":"+'App.2-CE_CGAAP_DepExp_2011'!H33","v":0},0,0,{"$f":"+'App.2-B_Fixed Asset Cont 2013'!K33","v":0},0]
[1910,"Leasehold Improvements",{"$f":"+'App.2-B_Fixed Asset Cont 2013'!E34","v":0},null,0,{"$f":"+'App.2-B_Fixed Asset Cont 2013'!F34","v":0},0,{"$f":"+'App.2-CE_CGAAP_DepExp_2011'!H34","v":0},0,0,{"$f":"+'App.2-B_Fixed Asset Cont 2013'!K34","v":0},0]
[1915,"Office Furniture & Equipment (10 years)",{"$f":"+'App.2-B_Fixed Asset Cont 2013'!E35","v":267476.14999999997},124075,143401.14999999997,{"$f":"+'App.2-B_Fixed Asset Cont 2013'!F35","v":2000},144401.14999999997,{"$f":"+'App.2-CE_CGAAP_DepExp_2011'!H35","v":10},0.1,14440.114999999996,{"$f":"+'App.2-B_Fixed Asset Cont 2013'!K35","v":-14437},3.1149999999961437]
[1915,"Office Furniture & Equipment (5 years)",{"$f":"+'App.2-B_Fixed Asset Cont 2013'!E36","v":0},null,0,{"$f":"+'App.2-B_Fixed Asset Cont 2013'!F36","v":0},0,{"$f":"+'App.2-CE_CGAAP_DepExp_2011'!H36","v":0},0,0,{"$f":"+'App.2-B_Fixed Asset Cont 2013'!K36","v":0},0]
[1920,"Computer Equipment - Hardware",{"$f":"+'App.2-B_Fixed Asset Cont 2013'!E37","v":275946.02999999997},275946,2.9999999969732016E-2,{"$f":"+'App.2-B_Fixed Asset Cont 2013'!F37","v":0},2.9999999969732016E-2,{"$f":"+'App.2-CE_CGAAP_DepExp_2011'!H37","v":5},0.2,5.9999999939464033E-3,{"$f":"+'App.2-B_Fixed Asset Cont 2013'!K37","v":0},5.9999999939464033E-3]
[1920,"Computer Equip.-Hardware(Post Mar. 22/04)",{"$f":"+'App.2-B_Fixed Asset Cont 2013'!E38","v":52211.630000000005},52212,-0.36999999999534339,{"$f":"+'App.2-B_Fixed Asset Cont 2013'!F38","v":0},-0.36999999999534339,{"$f":"+'App.2-CE_CGAAP_DepExp_2011'!H38","v":5},0.2,-7.3999999999068672E-2,{"$f":"+'App.2-B_Fixed Asset Cont 2013'!K38","v":0},-7.3999999999068672E-2]
[1920,"Computer Equip.-Hardware(Post Mar. 19/07)",{"$f":"+'App.2-B_Fixed Asset Cont 2013'!E39","v":175836.7},49324,126512.70000000001,{"$f":"+'App.2-B_Fixed Asset Cont 2013'!F39","v":28600},140812.70000000001,{"$f":"+'App.2-CE_CGAAP_DepExp_2011'!H39","v":5},0.2,28162.54,{"$f":"+'App.2-B_Fixed Asset Cont 2013'!K39","v":-28162},0.54000000000087311]
[1925,"Computer Software (Formally known as Account 1925)",{"$f":"+'App.2-B_Fixed Asset Cont 2013'!E40","v":994456.07},{"$f":"802525+10000","v":812525},181931.06999999995,{"$f":"+'App.2-B_Fixed Asset Cont 2013'!F40","v":45000},204431.06999999995,{"$f":"+'App.2-CE_CGAAP_DepExp_2011'!H40","v":3},0.33333333333333331,68143.689999999988,{"$f":"+'App.2-B_Fixed Asset Cont 2013'!K40","v":-68144},-0.31000000001222361]
[1930,"Transportation Equipment",{"$f":"+'App.2-B_Fixed Asset Cont 2013'!E41","v":2284171.0300000003},{"$f":"491171-40000","v":451171},1833000.0300000003,{"$f":"+'App.2-B_Fixed Asset Cont 2013'!F41","v":400000},2033000.0300000003,8,0.125,254125.00375000003,{"$f":"+'App.2-B_Fixed Asset Cont 2013'!K41","v":-254125},3.7500000325962901E-3]
[1935,"Stores Equipment",{"$f":"+'App.2-B_Fixed Asset Cont 2013'!E42","v":85037.21},2078,82959.210000000006,{"$f":"+'App.2-B_Fixed Asset Cont 2013'!F42","v":0},82959.210000000006,{"$f":"+'App.2-CE_CGAAP_DepExp_2011'!H42","v":10},0.1,8295.9210000000003,{"$f":"+'App.2-B_Fixed Asset Cont 2013'!K42","v":-8296},-7.8999999999723514E-2]
[1940,"Tools, Shop & Garage Equipment",{"$f":"+'App.2-B_Fixed Asset Cont 2013'!E43","v":368780.97000000003},125031,243749.97000000003,{"$f":"+'App.2-B_Fixed Asset Cont 2013'!F43","v":72000},279749.97000000003,{"$f":"+'App.2-CE_CGAAP_DepExp_2011'!H43","v":10},0.1,27974.997000000003,{"$f":"+'App.2-B_Fixed Asset Cont 2013'!K43","v":-27972},2.9970000000030268]
[1945,"Measurement & Testing Equipment",{"$f":"+'App.2-B_Fixed Asset Cont 2013'!E44","v":67543.58},1095,66448.58,{"$f":"+'App.2-B_Fixed Asset Cont 2013'!F44","v":0},66448.58,{"$f":"+'App.2-CE_CGAAP_DepExp_2011'!H44","v":10},0.1,6644.8580000000002,{"$f":"+'App.2-B_Fixed Asset Cont 2013'!K44","v":-6645},-0.14199999999982538]
[1950,"Power Operated Equipment",{"$f":"+'App.2-B_Fixed Asset Cont 2013'!E45","v":89271.959999999992},9299,79972.959999999992,{"$f":"+'App.2-B_Fixed Asset Cont 2013'!F45","v":0},79972.959999999992,{"$f":"+'App.2-CE_CGAAP_DepExp_2011'!H45","v":10},0.1,7997.2959999999994,{"$f":"+'App.2-B_Fixed Asset Cont 2013'!K45","v":-7997},0.29599999999936699]
[1955,"Communications Equipment",{"$f":"+'App.2-B_Fixed Asset Cont 2013'!E46","v":176173.24},{"$f":"74263+(1441)","v":75704},100469.23999999999,{"$f":"+'App.2-B_Fixed Asset Cont 2013'!F46","v":0},100469.23999999999,{"$f":"+'App.2-CE_CGAAP_DepExp_2011'!H46","v":5},0.2,20093.847999999998,{"$f":"+'App.2-B_Fixed Asset Cont 2013'!K46","v":-20092},1.8479999999981374]
[1955,"Communication Equipment (Smart Meters)",{"$f":"+'App.2-B_Fixed Asset Cont 2013'!E47","v":0},null,0,{"$f":"+'App.2-B_Fixed Asset Cont 2013'!F47","v":0},0,{"$f":"+'App.2-CE_CGAAP_DepExp_2011'!H47","v":0},0,0,{"$f":"+'App.2-B_Fixed Asset Cont 2013'!K47","v":0},0]
[1960,"Miscellaneous Equipment ",{"$f":"+'App.2-B_Fixed Asset Cont 2013'!E48","v":83493.47},{"$f":"21142-1072+40000","v":60070},23423.47,{"$f":"+'App.2-B_Fixed Asset Cont 2013'!F48","v":45000},45923.47,{"$f":"+'App.2-CE_CGAAP_DepExp_2011'!H48","v":10},0.1,4592.3469999999998,{"$f":"+'App.2-B_Fixed Asset Cont 2013'!K48","v":-4592},0.34699999999975262]
[1975,"Load Management Controls Utility Premises",{"$f":"+'App.2-B_Fixed Asset Cont 2013'!E49","v":258630.5},258631,-0.5,{"$f":"+'App.2-B_Fixed Asset Cont 2013'!F49","v":0},-0.5,{"$f":"+'App.2-CE_CGAAP_DepExp_2011'!H49","v":10},0.1,-0.05,{"$f":"+'App.2-B_Fixed Asset Cont 2013'!K49","v":0},-0.05]
[1980,"System Supervisor Equipment",{"$f":"+'App.2-B_Fixed Asset Cont 2013'!E50","v":0},null,0,{"$f":"+'App.2-B_Fixed Asset Cont 2013'!F50","v":0},0,{"$f":"+'App.2-CE_CGAAP_DepExp_2011'!H50","v":0},0,0,{"$f":"+'App.2-B_Fixed Asset Cont 2013'!K50","v":0},0]
[1985,"Miscellaneous Fixed Assets",{"$f":"+'App.2-B_Fixed Asset Cont 2013'!E51","v":1427},1427,0,{"$f":"+'App.2-B_Fixed Asset Cont 2013'!F51","v":0},0,{"$f":"+'App.2-CE_CGAAP_DepExp_2011'!H51","v":10},0.1,0,{"$f":"+'App.2-B_Fixed Asset Cont 2013'!K51","v":0},0]
[1995,"Contributions & Grants",{"$f":"+'App.2-B_Fixed Asset Cont 2013'!E52","v":-8622318.3499999996},-688000,-7934318.3499999996,{"$f":"+'App.2-B_Fixed Asset Cont 2013'!F52","v":-417663},-8143149.8499999996,{"$f":"+'App.2-CE_CGAAP_DepExp_2011'!H52","v":23},4.3478260869565216E-2,-354049.99347826088,{"$f":"+'App.2-B_Fixed Asset Cont 2013'!K52","v":354039},-10.993478260876145]
["etc.",null,null,null,0,null,0,null,0,0,null,{"$f":"IF(ISERROR(+J53-K53), 0, +J53-K53)","v":0}]
[null,null,null,null,0,null,0,null,0,0,null,0]
[null,"Total",{"$f":"SUM(C16:C54)","v":50664236.400000013},{"$f":"SUM(D16:D54)","v":1610588},{"$f":"SUM(E16:E54)","v":49053648.400000013},{"$f":"SUM(F16:F54)","v":5148418},{"$f":"SUM(G16:G54)","v":51627857.400000013},null,null,{"$f":"SUM(J16:J54)","v":2400632.599501715},{"$f":"SUM(K16:K54)","v":-2406301},{"$f":"SUM(L16:L54)","v":-5668.4004982850747}]
[null,"Smart Meter Additions"]
[null,"Meters (Smart Meters)",null,null,{"$f":"C57-D57","v":0},{"$f":"+'App.2-B_Fixed Asset Cont 2013'!H57","v":3626141},{"$f":"E57+F57","v":3626141},15,{"$f":"IF(H57=0,0,1/H57)","v":6.6666666666666666E-2},{"$f":"IF(H57=0,0,G57/H57)","v":241742.73333333334},{"$f":"+'App.2-B_Fixed Asset Cont 2013'!K57","v":-241743},{"$f":"IF(ISERROR(+J57+K57), 0, +J57+K57)","v":-0.26666666666278616}]
[null,"Computer Hardware (Smart Meters)",null,null,0,{"$f":"+'App.2-B_Fixed Asset Cont 2013'!H58","v":62873},{"$f":"E58+F58","v":62873},5,0.2,12574.6,{"$f":"+'App.2-B_Fixed Asset Cont 2013'!K58","v":-12575},{"$f":"IF(ISERROR(+J58+K58), 0, +J58+K58)","v":-0.3999999999996362}]
[null,"Computer Software (Smart Meters)",null,null,0,{"$f":"+'App.2-B_Fixed Asset Cont 2013'!H59","v":274217},{"$f":"E59+F59","v":274217},3,0.33333333333333331,91405.666666666672,{"$f":"+'App.2-B_Fixed Asset Cont 2013'!K59","v":-54843},36562.666666666672,"different depreciation rates between SM model and CGAAP"]
[null,"Revised Total",{"$f":"SUM(C55:C59)","v":50664236.400000013},{"$f":"SUM(D55:D59)","v":1610588},{"$f":"SUM(E55:E59)","v":49053648.400000013},{"$f":"SUM(F55:F59)","v":9111649},{"$f":"SUM(G55:G59)","v":55591088.400000013},null,null,{"$f":"SUM(J55:J59)","v":2746355.599501715},{"$f":"SUM(K55:K59)","v":-2715462},{"$f":"SUM(L55:L59)","v":30893.599501714933}]
["Notes:"]
[1,"Board policy of the \"half-year\" rule - the applicant must ensure that additions in the year attract a half-year depreciation expense in the first year.  Deviations from this standard practice must be supported in the application."]
[2,"The applicant must provide an explanation of material variances in evidence"]
[]
["General:","Applicants must provide a breakdown of depreciation and amortization expense in the above format for all relevant accounts.  Asset Retirement Obligations (AROs), depreciation and accretion expense should be disclosed separately consistent with the Notes of historical Audited Financial Statements."]

{"sheet":"App.2-CG_MIFRS_DepExp_2012","index":19,"n_rows":66,"n_cols":15,"rows_kept":66,"cut":false,"hidden":false,"merged":[[65,1,67,11],[9,0,9,14],[8,0,8,14],[10,0,10,14],[62,1,62,14],[61,1,61,14],[60,1,60,14],[59,1,59,14],[58,1,58,14],[13,0,14,0],[13,1,14,1],[13,10,14,10],[13,13,14,13],[63,1,63,14]]}
[null,null,null,null,null,null,null,null,null,null,null,null,null,"File Number:",{"$f":"'LDC Info'!$E$18","v":"EB2012-0176"}]
[null,null,null,null,null,null,null,null,null,null,null,null,null,"Exhibit:"]
[null,null,null,null,null,null,null,null,null,null,null,null,null,"Tab:"]
[null,null,null,null,null,null,null,null,null,null,null,null,null,"Schedule:"]
[null,null,null,null,null,null,null,null,null,null,null,null,null,"Page:"]
[]
[null,null,null,null,null,null,null,null,null,null,null,null,null,"Date:"]
[]
["Appendix 2-CG"]
["Depreciation and Amortization Expense"]
["Assumes the applicant adopted IFRS for financial reporting purposes January 1, 2013"]
[null,null,"Year",2012,"MIFRS"]
[]
["Account","Description","Opening NBV as at Jan 1, 2012 5","Additions","Average Remaining Life of Opening NBV 4","Years (new additions only) 3","Depreciation Rate on New Additions","Depreciation Expense on Opening NBV","Depreciation Expense on Additions 1","2012 Depreciation Expense","2012 Depreciation Expense per Appendix 2-B Fixed Assets, Column K\n (l)","Variance 2","Depreciation Expense on 2012 Full Year Additions","Less Depreciation Expense on Assets Fully Depreciated during the year\n(o)","2012 Full Year Depreciation 6"]
[null,null,"(a)","(d)","(i)","(f)","(g) = 1 / (f)","(j) = (a) / (i)","(h)=((d)*0.5)/(f) ","(k) = (j) + (h)",null,"(m) = (k) - (l)","(n)=((d))/(f) ",null,"(p) = (j) + (n) - (o)"]
[1611,"Computer Software (Formally known as Account 1925)",null,null,null,null,{"$f":"IF(F16=0,0,1/F16)","v":0},{"$f":"IF(E16=0,0,+C16/E16)","v":0},{"$f":"IF(F16=0,0,+(D16*0.5)/F16)","v":0},{"$f":"IF(ISERROR(+H16+I16), 0, +H16+I16)","v":0},null,{"$f":"IF(ISERROR(+J16-K16), 0, +J16-K16)","v":0},{"$f":"IF(F16=0,0,+(D16)/F16)","v":0},null,{"$f":"IF(ISERROR(+M16+H16-N16), 0, +M16+H16-N16)","v":0}]
[1612,"Land Rights (Formally known as Account 1906)",null,null,null,null,0,0,0,0,null,0,0,null,{"$f":"IF(ISERROR(+M17+H17-N17), 0, +M17+H17-N17)","v":0}]
[1805,"Land",227769,null,null,null,0,0,0,0,null,0,0,null,0]
[1808,"Buildings",{"$f":"2261121","v":2261121},{"$f":"+'App.2-B_Fixed Asset Cont 2012'!F19","v":5000},{"$f":"+C19/49929","v":45.28672715255663},50,0.02,49929,50,49979,{"$f":"-'App.2-B_FA Cont MIFRS 2012'!K19","v":49979},0,100,null,50029]
[1810,"Leasehold Improvements",null,{"$f":"+'App.2-B_Fixed Asset Cont 2012'!F20","v":0},null,null,0,0,0,0,{"$f":"-'App.2-B_FA Cont MIFRS 2012'!K20","v":0},0,0,null,0]
[1815,"Transformer Station Equipment >50 kV",null,{"$f":"+'App.2-B_Fixed Asset Cont 2012'!F21","v":0},null,null,0,0,0,0,{"$f":"-'App.2-B_FA Cont MIFRS 2012'!K21","v":0},0,0,null,0]
[1820,"Distribution Station Equipment <50 kV",{"$f":"2621205-120659","v":2500546},463809,{"$f":"+C22/287923","v":8.6847733595440442},45,2.2222222222222223E-2,287923,5153.4333333333334,293076.43333333335,{"$f":"-'App.2-B_FA Cont MIFRS 2012'!K22","v":293076},0.43333333334885538,10306.866666666667,73277,224952.86666666664]
[1825,"Storage Battery Equipment",null,null,null,null,0,0,0,0,{"$f":"-'App.2-B_FA Cont MIFRS 2012'!K23","v":0},0,0,null,0]
[1830,"Poles, Towers & Fixtures",4758021,734446,{"$f":"+C24/95680","v":49.728480351170568},60,1.6666666666666666E-2,95680,6120.3833333333332,101800.38333333333,{"$f":"-'App.2-B_FA Cont MIFRS 2012'!K24","v":101800},0.38333333333139308,12240.766666666666,null,107920.76666666666]
[1835,"Overhead Conductors & Devices",6407009,707985,{"$f":"+C25/119317","v":53.697369192990102},65,1.5384615384615385E-2,119317,5446.0384615384619,124763.03846153847,{"$f":"-'App.2-B_FA Cont MIFRS 2012'!K25","v":124763},3.846153846825473E-2,10892.076923076924,null,130209.07692307692]
[1840,"Underground Conduit",2085078,239152,{"$f":"+C26/27611","v":75.516207308681317},85,1.1764705882352941E-2,27611.000000000004,1406.7764705882353,29017.77647058824,{"$f":"-'App.2-B_FA Cont MIFRS 2012'!K26","v":29018},-0.22352941175995511,2813.5529411764705,null,30424.552941176473]
[1845,"Underground Conductors & Devices",6197090,368494,{"$f":"+C27/124218","v":49.888824485984316},60,1.6666666666666666E-2,124218,3070.7833333333333,127288.78333333334,{"$f":"-'App.2-B_FA Cont MIFRS 2012'!K27","v":127289},-0.21666666665987577,6141.5666666666666,null,130359.56666666667]
[1850,"Line Transformers",5316092,504230,{"$f":"+C28/210065","v":25.30689072429962},40,2.5000000000000001E-2,210065,6302.875,216367.875,{"$f":"-'App.2-B_FA Cont MIFRS 2012'!K28","v":216368},-0.125,12605.75,null,222670.75]
[1855,"Services (Overhead & Underground)",3115662,527103,{"$f":"+C29/71504","v":43.573254643096888},55,1.8181818181818181E-2,71504,4791.8454545454542,76295.845454545459,{"$f":"-'App.2-B_FA Cont MIFRS 2012'!K29","v":76296},-0.15454545454122126,9583.6909090909085,null,81087.690909090903]
[1860,"Meters",1225937,null,{"$f":"+C30/50089","v":24.475174189941903},30,3.3333333333333333E-2,50089,0,50089,{"$f":"-'App.2-B_FA Cont MIFRS 2012'!K30","v":50089},0,0,null,50089]
[1860,"Meters (Smart Meters)",103522,29737,{"$f":"+C31/7047","v":14.690222789839648},15,6.6666666666666666E-2,7047,991.23333333333335,8038.2333333333336,{"$f":"-'App.2-B_FA Cont MIFRS 2012'!K31","v":8038},0.23333333333357587,1982.4666666666667,null,9029.4666666666672]
[1905,"Land",null,{"$f":"+'App.2-B_Fixed Asset Cont 2012'!F32","v":0},null,null,0,0,0,0,{"$f":"-'App.2-B_FA Cont MIFRS 2012'!K32","v":0},0,0,null,0]
[1908,"Buildings & Fixtures",null,{"$f":"+'App.2-B_Fixed Asset Cont 2012'!F33","v":0},null,null,0,0,0,0,{"$f":"-'App.2-B_FA Cont MIFRS 2012'!K33","v":0},0,0,null,0]
[1910,"Leasehold Improvements",null,{"$f":"+'App.2-B_Fixed Asset Cont 2012'!F34","v":0},null,null,0,0,0,0,{"$f":"-'App.2-B_FA Cont MIFRS 2012'!K34","v":0},0,0,null,0]
[1915,"Office Furniture & Equipment (10 years)",76448,{"$f":"+'App.2-B_Fixed Asset Cont 2012'!F35","v":5000},{"$f":"+C35/7645","v":9.9997383911052982},10,0.1,7645,250,7895,{"$f":"-'App.2-B_FA Cont MIFRS 2012'!K35","v":7895},0,500,null,8145]
[1915,"Office Furniture & Equipment (5 years)",null,{"$f":"+'App.2-B_Fixed Asset Cont 2012'!F36","v":0},null,null,0,0,0,0,{"$f":"-'App.2-B_FA Cont MIFRS 2012'!K36","v":0},0,0,null,0]
[1920,"Computer Equipment - Hardware",null,{"$f":"+'App.2-B_Fixed Asset Cont 2012'!F37","v":0},null,null,0,0,0,0,{"$f":"-'App.2-B_FA Cont MIFRS 2012'!K37","v":0},0,0,null,0]
[1920,"Computer Equip.-Hardware(Post Mar. 22/04)",null,{"$f":"+'App.2-B_Fixed Asset Cont 2012'!F38","v":0},null,null,0,0,0,0,{"$f":"-'App.2-B_FA Cont MIFRS 2012'!K38","v":0},0,0,null,0]
[1920,"Computer Equip.-Hardware(Post Mar. 19/07)",75389,{"$f":"+'App.2-B_Fixed Asset Cont 2012'!F39","v":22000},{"$f":"+C39/15078","v":4.9999336782066583},5,0.2,15078.000000000002,2200,17278,{"$f":"-'App.2-B_FA Cont MIFRS 2012'!K39","v":17278},0,4400,null,19478]
[1925,"Computer Software (Formally known as Account 1925)",130884,{"$f":"+'App.2-B_Fixed Asset Cont 2012'!F40","v":50000},{"$f":"+C40/31848","v":4.1096458176337602},5,{"$f":"IF(F40=0,0,1/F40)","v":0.2},{"$f":"IF(E40=0,0,+C40/E40)","v":31848},{"$f":"IF(F40=0,0,+(D40*0.5)/F40)","v":5000},{"$f":"IF(ISERROR(+H40+I40), 0, +H40+I40)","v":36848},{"$f":"-'App.2-B_FA Cont MIFRS 2012'!K40","v":36848},{"$f":"IF(ISERROR(+J40-K40), 0, +J40-K40)","v":0},{"$f":"IF(F40=0,0,+(D40)/F40)","v":10000},-1612,43460]
[1930,"Transportation Equipment",794677,{"$f":"+'App.2-B_Fixed Asset Cont 2012'!F41","v":450000},{"$f":"+C41/79893","v":9.9467662999261517},12.5,0.08,79893,18000,97893,{"$f":"-'App.2-B_FA Cont MIFRS 2012'!K41","v":97893},0,36000,2918,112975]
[1935,"Stores Equipment",58871,{"$f":"+'App.2-B_Fixed Asset Cont 2012'!F42","v":0},{"$f":"+C42/5887","v":10.000169865806013},10,0.1,5887,0,5887,{"$f":"-'App.2-B_FA Cont MIFRS 2012'!K42","v":5887},0,0,null,5887]
[1940,"Tools, Shop & Garage Equipment",112401,{"$f":"+'App.2-B_Fixed Asset Cont 2012'!F43","v":72000},10,10,0.1,11240.1,3600,14840.1,{"$f":"-'App.2-B_FA Cont MIFRS 2012'!K43","v":14840},0.1000000000003638,7200,null,18440.099999999999]
[1945,"Measurement & Testing Equipment",32554,{"$f":"+'App.2-B_Fixed Asset Cont 2012'!F44","v":0},10,10,0.1,3255.4,0,3255.4,{"$f":"-'App.2-B_FA Cont MIFRS 2012'!K44","v":3255},0.40000000000009095,0,null,3255.4]
[1950,"Power Operated Equipment",51905,{"$f":"+'App.2-B_Fixed Asset Cont 2012'!F45","v":0},10,10,0.1,5190.5,0,5190.5,{"$f":"-'App.2-B_FA Cont MIFRS 2012'!K45","v":5190},0.5,0,null,5190.5]
[1955,"Communications Equipment",70183,{"$f":"+'App.2-B_Fixed Asset Cont 2012'!F46","v":0},{"$f":"+C46/8288","v":8.4680260617760617},10,0.1,8288,0,8288,{"$f":"-'App.2-B_FA Cont MIFRS 2012'!K46","v":8288},0,0,null,8288]
[1955,"Communication Equipment (Smart Meters)",null,{"$f":"+'App.2-B_Fixed Asset Cont 2012'!F47","v":0},null,null,0,0,0,0,{"$f":"-'App.2-B_FA Cont MIFRS 2012'!K47","v":0},0,0,null,0]
[1960,"Miscellaneous Equipment ",14623,{"$f":"+'App.2-B_Fixed Asset Cont 2012'!F48","v":40000},10,10,0.1,1462.3,2000,3462.3,{"$f":"-'App.2-B_FA Cont MIFRS 2012'!K48","v":3462},0.3000000000001819,4000,null,5462.3]
[1975,"Load Management Controls Utility Premises",null,{"$f":"+'App.2-B_Fixed Asset Cont 2012'!F49","v":0},null,null,0,0,0,0,{"$f":"-'App.2-B_FA Cont MIFRS 2012'!K49","v":0},0,0,null,0]
[1980,"System Supervisor Equipment",null,{"$f":"+'App.2-B_Fixed Asset Cont 2012'!F50","v":0},null,null,0,0,0,0,{"$f":"-'App.2-B_FA Cont MIFRS 2012'!K50","v":0},0,0,null,0]
[1985,"Miscellaneous Fixed Assets",null,{"$f":"+'App.2-B_Fixed Asset Cont 2012'!F51","v":0},null,null,0,0,0,0,{"$f":"-'App.2-B_FA Cont MIFRS 2012'!K51","v":0},0,0,null,0]
[1995,"Contributions & Grants",-6468651,{"$f":"+'App.2-B_Fixed Asset Cont 2012'!F52","v":-433861},{"$f":"6468651/136703","v":47.319012750268833},51.25,1.9512195121951219E-2,-136703,-4232.7902439024392,-140935.79024390245,{"$f":"-'App.2-B_FA Cont MIFRS 2012'!K52","v":-140936},0.20975609755259939,-8465.5804878048784,null,-145168.58048780487]
["etc.",null,null,null,null,null,0,0,0,0,null,0,0,null,0]
[null,null,null,null,null,null,0,0,0,0,null,0,0,null,0]
[null,"Total",{"$f":"SUM(C16:C54)","v":29147131},{"$f":"SUM(D16:D54)","v":3785095},null,null,null,{"$f":"SUM(H16:H54)","v":1076467.3},60150.578476103045,1136617.8784761033,1136616,1.8784761030742629,120301.15695220609,{"$f":"SUM(N16:N54)","v":74583},1122185.4569522061]
[]
["Notes:"]
[]
[1,"Board policy of the \"half-year\" rule - the applicant must ensure that additions in the year attract a half-year depreciation expense in the first year.  Deviations from this standard practice must be supported in the application."]
[2,"The applicant must provide an explanation of material variances in evidence"]
[3,"The applicant should ensure that the years for new additions of assets are the asset useful lives determined by management in accordance with IFRS. "]
[4,"A recalculation should be performed to determine the average remaining life of opening balance of assets (i.e. excluding 2012 additions) under IFRS.  For example, Asset A had a useful life of 20 years under CGAAP.  On January 1, 2012, the date of transition, Asset A was 3 years depreciated. As a result, Asset A would have a remaining service life of 17 years (20 years less 3 years) under CGAAP as of January 1, 2012.  Due to the transition to IFRS, management re-assessed the asset useful lives under IFRS principles and concluded that the revised useful life of Asset A is now 30 years. Therefore, the average remaining useful life of opening balance of Asset A is determined to be 27 years (30 years less 3 years) under IFRS as of January 1, 2012."]
[5,"NBV must exclude assets still on the books but which have been fully amortized or depreciated."]
[6,"This column refers to the calculated full year depreciation but excludes the depreciation expense on assets fully depreciated during the year.  This column is used for the purpose of calculating depreciation expense in the following year on the next worksheet."]
[]
["General:","Applicants must provide a breakdown of depreciation and amortization expense in the above format for all relevant accounts.  Asset Retirement Obligations (AROs), depreciation and accretion expense should be disclosed separately consistent with the Notes of historical Audited Financial Statements."]

{"sheet":"App.2-CH_MIFRS_DepExp_2013","index":20,"n_rows":68,"n_cols":10,"rows_kept":68,"cut":false,"hidden":false,"merged":[[8,0,8,9],[60,1,60,4],[67,1,68,9],[64,1,64,9],[63,1,63,9],[13,0,14,0],[13,1,14,1],[13,6,14,6],[10,0,10,9],[9,0,9,9]]}
[null,null,null,null,null,null,null,null,"File Number:",{"$f":"'LDC Info'!$E$18","v":"EB2012-0176"}]
[null,null,null,null,null,null,null,null,"Exhibit:"]
[null,null,null,null,null,null,null,null,"Tab:"]
[null,null,null,null,null,null,null,null,"Schedule:"]
[null,null,null,null,null,null,null,null,"Page:"]
[]
[null,null,null,null,null,null,null,null,"Date:"]
[]
["Appendix 2-CH"]
["Depreciation and Amortization Expense"]
["Assumes the applicant adopted IFRS for financial reporting purposes January 1, 2013"]
[null,null,"Year",2013,"MIFRS"]
[]
["Account","Description","Additions","Years (new additions only)","Depreciation Rate on New Additions","2013 Depreciation Expense 1","2013 Depreciation Expense per Appendix 2-B Fixed Assets, Column K\n (l)","Variance 2"]
[null,null,"(d)","(f)","(g) = 1 / (f)","(h)=2012 Full Year Depreciation + ((d)*0.5)/(f) ",null,"(m) = (h) - (l)"]
[1611,"Computer Software (Formally known as Account 1925)",null,null,{"$f":"IF(D16=0,0,1/D16)","v":0},{"$f":"IF(D16=0,'App.2-CG_MIFRS_DepExp_2012'!O16,+'App.2-CG_MIFRS_DepExp_2012'!O16+((C16*0.5)/D16))","v":0},null,{"$f":"IF(ISERROR(+F16-G16), 0, +F16-G16)","v":0}]
[1612,"Land Rights (Formally known as Account 1906)",null,null,0,{"$f":"IF(D17=0,'App.2-CG_MIFRS_DepExp_2012'!O17,+'App.2-CG_MIFRS_DepExp_2012'!O17+((C17*0.5)/D17))","v":0},null,0]
[1805,"Land",null,null,0,{"$f":"IF(D18=0,'App.2-CG_MIFRS_DepExp_2012'!O18,+'App.2-CG_MIFRS_DepExp_2012'!O18+((C18*0.5)/D18))","v":0},null,0]
[1808,"Buildings",{"$f":"+'App.2-B_FA Cont MIFRS 2013'!F19","v":9000},{"$f":"+'App.2-CG_MIFRS_DepExp_2012'!F19","v":50},0.02,{"$f":"IF(D19=0,'App.2-CG_MIFRS_DepExp_2012'!O19,+'App.2-CG_MIFRS_DepExp_2012'!O19+((C19*0.5)/D19))","v":50119},{"$f":"-'App.2-B_FA Cont MIFRS 2013'!K19","v":50119},0]
[1810,"Leasehold Improvements",{"$f":"+'App.2-B_FA Cont MIFRS 2013'!F20","v":0},{"$f":"+'App.2-CG_MIFRS_DepExp_2012'!F20","v":0},0,{"$f":"IF(D20=0,'App.2-CG_MIFRS_DepExp_2012'!O20,+'App.2-CG_MIFRS_DepExp_2012'!O20+((C20*0.5)/D20))","v":0},{"$f":"-'App.2-B_FA Cont MIFRS 2013'!K20","v":0},0]
[1815,"Transformer Station Equipment >50 kV",{"$f":"+'App.2-B_FA Cont MIFRS 2013'!F21","v":0},{"$f":"+'App.2-CG_MIFRS_DepExp_2012'!F21","v":0},0,{"$f":"IF(D21=0,'App.2-CG_MIFRS_DepExp_2012'!O21,+'App.2-CG_MIFRS_DepExp_2012'!O21+((C21*0.5)/D21))","v":0},{"$f":"-'App.2-B_FA Cont MIFRS 2013'!K21","v":0},0]
[1820,"Distribution Station Equipment <50 kV",{"$f":"+'App.2-B_FA Cont MIFRS 2013'!F22","v":520121},{"$f":"+'App.2-CG_MIFRS_DepExp_2012'!F22","v":45},2.2222222222222223E-2,{"$f":"IF(D22=0,'App.2-CG_MIFRS_DepExp_2012'!O22,+'App.2-CG_MIFRS_DepExp_2012'!O22+((C22*0.5)/D22))","v":230731.98888888885},{"$f":"-'App.2-B_FA Cont MIFRS 2013'!K22","v":230732},-1.1111111147329211E-2]
[1825,"Storage Battery Equipment",{"$f":"+'App.2-B_FA Cont MIFRS 2013'!F23","v":0},{"$f":"+'App.2-CG_MIFRS_DepExp_2012'!F23","v":0},0,{"$f":"IF(D23=0,'App.2-CG_MIFRS_DepExp_2012'!O23,+'App.2-CG_MIFRS_DepExp_2012'!O23+((C23*0.5)/D23))","v":0},{"$f":"-'App.2-B_FA Cont MIFRS 2013'!K23","v":0},0]
[1830,"Poles, Towers & Fixtures",{"$f":"+'App.2-B_FA Cont MIFRS 2013'!F24","v":781179},{"$f":"+'App.2-CG_MIFRS_DepExp_2012'!F24","v":60},1.6666666666666666E-2,{"$f":"IF(D24=0,'App.2-CG_MIFRS_DepExp_2012'!O24,+'App.2-CG_MIFRS_DepExp_2012'!O24+((C24*0.5)/D24))","v":114430.59166666666},{"$f":"-'App.2-B_FA Cont MIFRS 2013'!K24","v":114430},0.59166666665987577]
[1835,"Overhead Conductors & Devices",{"$f":"+'App.2-B_FA Cont MIFRS 2013'!F25","v":748211},{"$f":"+'App.2-CG_MIFRS_DepExp_2012'!F25","v":65},1.5384615384615385E-2,{"$f":"IF(D25=0,'App.2-CG_MIFRS_DepExp_2012'!O25,+'App.2-CG_MIFRS_DepExp_2012'!O25+((C25*0.5)/D25))","v":135964.54615384614},{"$f":"-'App.2-B_FA Cont MIFRS 2013'!K25","v":135965},-0.45384615386137739]
[1840,"Underground Conduit",{"$f":"+'App.2-B_FA Cont MIFRS 2013'!F26","v":335057},{"$f":"+'App.2-CG_MIFRS_DepExp_2012'!F26","v":85},1.1764705882352941E-2,{"$f":"IF(D26=0,'App.2-CG_MIFRS_DepExp_2012'!O26,+'App.2-CG_MIFRS_DepExp_2012'!O26+((C26*0.5)/D26))","v":32395.476470588237},{"$f":"-'App.2-B_FA Cont MIFRS 2013'!K26","v":32396},-0.52352941176286549]
[1845,"Underground Conductors & Devices",{"$f":"+'App.2-B_FA Cont MIFRS 2013'!F27","v":404073},{"$f":"+'App.2-CG_MIFRS_DepExp_2012'!F27","v":60},1.6666666666666666E-2,{"$f":"IF(D27=0,'App.2-CG_MIFRS_DepExp_2012'!O27,+'App.2-CG_MIFRS_DepExp_2012'!O27+((C27*0.5)/D27))","v":133726.84166666667},{"$f":"-'App.2-B_FA Cont MIFRS 2013'!K27","v":133727},-0.15833333332557231]
[1850,"Line Transformers",{"$f":"+'App.2-B_FA Cont MIFRS 2013'!F28","v":529371},{"$f":"+'App.2-CG_MIFRS_DepExp_2012'!F28","v":40},2.5000000000000001E-2,{"$f":"IF(D28=0,'App.2-CG_MIFRS_DepExp_2012'!O28,+'App.2-CG_MIFRS_DepExp_2012'!O28+((C28*0.5)/D28))","v":229287.88750000001},{"$f":"-'App.2-B_FA Cont MIFRS 2013'!K28","v":229328},-40.112499999988358]
[1855,"Services (Overhead & Underground)",{"$f":"+'App.2-B_FA Cont MIFRS 2013'!F29","v":532665},{"$f":"+'App.2-CG_MIFRS_DepExp_2012'!F29","v":55},1.8181818181818181E-2,{"$f":"IF(D29=0,'App.2-CG_MIFRS_DepExp_2012'!O29,+'App.2-CG_MIFRS_DepExp_2012'!O29+((C29*0.5)/D29))","v":85930.099999999991},{"$f":"-'App.2-B_FA Cont MIFRS 2013'!K29","v":85957},-26.900000000008731]
[1860,"Meters",{"$f":"+'App.2-B_FA Cont MIFRS 2013'!F30","v":0},{"$f":"+'App.2-CG_MIFRS_DepExp_2012'!F30","v":30},3.3333333333333333E-2,{"$f":"IF(D30=0,'App.2-CG_MIFRS_DepExp_2012'!O30,+'App.2-CG_MIFRS_DepExp_2012'!O30+((C30*0.5)/D30))","v":50089},{"$f":"-'App.2-B_FA Cont MIFRS 2013'!K30","v":50099},-10]
[1860,"Meters (Smart Meters)",{"$f":"+'App.2-B_FA Cont MIFRS 2013'!F31","v":168851},{"$f":"+'App.2-CG_MIFRS_DepExp_2012'!F31","v":15},6.6666666666666666E-2,{"$f":"IF(D31=0,'App.2-CG_MIFRS_DepExp_2012'!O31,+'App.2-CG_MIFRS_DepExp_2012'!O31+((C31*0.5)/D31))","v":14657.833333333334},{"$f":"-'App.2-B_FA Cont MIFRS 2013'!K31","v":14566},91.83333333333394]
[1905,"Land",{"$f":"+'App.2-B_FA Cont MIFRS 2013'!F32","v":0},{"$f":"+'App.2-CG_MIFRS_DepExp_2012'!F32","v":0},0,{"$f":"IF(D32=0,'App.2-CG_MIFRS_DepExp_2012'!O32,+'App.2-CG_MIFRS_DepExp_2012'!O32+((C32*0.5)/D32))","v":0},{"$f":"-'App.2-B_FA Cont MIFRS 2013'!K32","v":0},0]
[1908,"Buildings & Fixtures",{"$f":"+'App.2-B_FA Cont MIFRS 2013'!F33","v":0},{"$f":"+'App.2-CG_MIFRS_DepExp_2012'!F33","v":0},0,{"$f":"IF(D33=0,'App.2-CG_MIFRS_DepExp_2012'!O33,+'App.2-CG_MIFRS_DepExp_2012'!O33+((C33*0.5)/D33))","v":0},{"$f":"-'App.2-B_FA Cont MIFRS 2013'!K33","v":0},0]
[1910,"Leasehold Improvements",{"$f":"+'App.2-B_FA Cont MIFRS 2013'!F34","v":0},{"$f":"+'App.2-CG_MIFRS_DepExp_2012'!F34","v":0},0,{"$f":"IF(D34=0,'App.2-CG_MIFRS_DepExp_2012'!O34,+'App.2-CG_MIFRS_DepExp_2012'!O34+((C34*0.5)/D34))","v":0},{"$f":"-'App.2-B_FA Cont MIFRS 2013'!K34","v":0},0]
[1915,"Office Furniture & Equipment (10 years)",{"$f":"+'App.2-B_FA Cont MIFRS 2013'!F35","v":2000},{"$f":"+'App.2-CG_MIFRS_DepExp_2012'!F35","v":10},0.1,{"$f":"IF(D35=0,'App.2-CG_MIFRS_DepExp_2012'!O35,+'App.2-CG_MIFRS_DepExp_2012'!O35+((C35*0.5)/D35))","v":8245},{"$f":"-'App.2-B_FA Cont MIFRS 2013'!K35","v":8245},0]
[1915,"Office Furniture & Equipment (5 years)",{"$f":"+'App.2-B_FA Cont MIFRS 2013'!F36","v":0},{"$f":"+'App.2-CG_MIFRS_DepExp_2012'!F36","v":0},0,{"$f":"IF(D36=0,'App.2-CG_MIFRS_DepExp_2012'!O36,+'App.2-CG_MIFRS_DepExp_2012'!O36+((C36*0.5)/D36))","v":0},{"$f":"-'App.2-B_FA Cont MIFRS 2013'!K36","v":0},0]
[1920,"Computer Equipment - Hardware",{"$f":"+'App.2-B_FA Cont MIFRS 2013'!F37","v":0},{"$f":"+'App.2-CG_MIFRS_DepExp_2012'!F37","v":0},0,{"$f":"IF(D37=0,'App.2-CG_MIFRS_DepExp_2012'!O37,+'App.2-CG_MIFRS_DepExp_2012'!O37+((C37*0.5)/D37))","v":0},{"$f":"-'App.2-B_FA Cont MIFRS 2013'!K37","v":0},0]
[1920,"Computer Equip.-Hardware(Post Mar. 22/04)",{"$f":"+'App.2-B_FA Cont MIFRS 2013'!F38","v":0},{"$f":"+'App.2-CG_MIFRS_DepExp_2012'!F38","v":0},0,{"$f":"IF(D38=0,'App.2-CG_MIFRS_DepExp_2012'!O38,+'App.2-CG_MIFRS_DepExp_2012'!O38+((C38*0.5)/D38))","v":0},{"$f":"-'App.2-B_FA Cont MIFRS 2013'!K38","v":0},0]
[1920,"Computer Equip.-Hardware(Post Mar. 19/07)",{"$f":"+'App.2-B_FA Cont MIFRS 2013'!F39","v":28600},{"$f":"+'App.2-CG_MIFRS_DepExp_2012'!F39","v":5},0.2,{"$f":"IF(D39=0,'App.2-CG_MIFRS_DepExp_2012'!O39,+'App.2-CG_MIFRS_DepExp_2012'!O39+((C39*0.5)/D39))","v":22338},{"$f":"-'App.2-B_FA Cont MIFRS 2013'!K39","v":22337},1]
[1925,"Computer Software (Formally known as Account 1925)",{"$f":"+'App.2-B_FA Cont MIFRS 2013'!F40","v":45000},5,{"$f":"IF(D40=0,0,1/D40)","v":0.2},{"$f":"IF(D40=0,'App.2-CG_MIFRS_DepExp_2012'!O40,+'App.2-CG_MIFRS_DepExp_2012'!O40+((C40*0.5)/D40))","v":47960},{"$f":"-'App.2-B_FA Cont MIFRS 2013'!K40","v":47960},{"$f":"IF(ISERROR(+F40-G40), 0, +F40-G40)","v":0}]
[1930,"Transportation Equipment",{"$f":"+'App.2-B_FA Cont MIFRS 2013'!F41","v":400000},15,6.6666666666666666E-2,{"$f":"IF(D41=0,'App.2-CG_MIFRS_DepExp_2012'!O41,+'App.2-CG_MIFRS_DepExp_2012'!O41+((C41*0.5)/D41))","v":126308.33333333333},{"$f":"-'App.2-B_FA Cont MIFRS 2013'!K41","v":126308},0.33333333332848269]
[1935,"Stores Equipment",{"$f":"+'App.2-B_FA Cont MIFRS 2013'!F42","v":0},{"$f":"+'App.2-CG_MIFRS_DepExp_2012'!F42","v":10},0.1,{"$f":"IF(D42=0,'App.2-CG_MIFRS_DepExp_2012'!O42,+'App.2-CG_MIFRS_DepExp_2012'!O42+((C42*0.5)/D42))","v":5887},{"$f":"-'App.2-B_FA Cont MIFRS 2013'!K42","v":5887},0]
[1940,"Tools, Shop & Garage Equipment",{"$f":"+'App.2-B_FA Cont MIFRS 2013'!F43","v":72000},{"$f":"+'App.2-CG_MIFRS_DepExp_2012'!F43","v":10},0.1,{"$f":"IF(D43=0,'App.2-CG_MIFRS_DepExp_2012'!O43,+'App.2-CG_MIFRS_DepExp_2012'!O43+((C43*0.5)/D43))","v":22040.1},{"$f":"-'App.2-B_FA Cont MIFRS 2013'!K43","v":22040},9.9999999998544808E-2]
[1945,"Measurement & Testing Equipment",{"$f":"+'App.2-B_FA Cont MIFRS 2013'!F44","v":0},{"$f":"+'App.2-CG_MIFRS_DepExp_2012'!F44","v":10},0.1,{"$f":"IF(D44=0,'App.2-CG_MIFRS_DepExp_2012'!O44,+'App.2-CG_MIFRS_DepExp_2012'!O44+((C44*0.5)/D44))","v":3255.4},{"$f":"-'App.2-B_FA Cont MIFRS 2013'!K44","v":3255},0.40000000000009095]
[1950,"Power Operated Equipment",{"$f":"+'App.2-B_FA Cont MIFRS 2013'!F45","v":0},{"$f":"+'App.2-CG_MIFRS_DepExp_2012'!F45","v":10},0.1,{"$f":"IF(D45=0,'App.2-CG_MIFRS_DepExp_2012'!O45,+'App.2-CG_MIFRS_DepExp_2012'!O45+((C45*0.5)/D45))","v":5190.5},{"$f":"-'App.2-B_FA Cont MIFRS 2013'!K45","v":5190},0.5]
[1955,"Communications Equipment",{"$f":"+'App.2-B_FA Cont MIFRS 2013'!F46","v":0},{"$f":"+'App.2-CG_MIFRS_DepExp_2012'!F46","v":10},0.1,{"$f":"IF(D46=0,'App.2-CG_MIFRS_DepExp_2012'!O46,+'App.2-CG_MIFRS_DepExp_2012'!O46+((C46*0.5)/D46))","v":8288},{"$f":"-'App.2-B_FA Cont MIFRS 2013'!K46","v":8288},0]
[1955,"Communication Equipment (Smart Meters)",{"$f":"+'App.2-B_FA Cont MIFRS 2013'!F47","v":0},{"$f":"+'App.2-CG_MIFRS_DepExp_2012'!F47","v":0},0,{"$f":"IF(D47=0,'App.2-CG_MIFRS_DepExp_2012'!O47,+'App.2-CG_MIFRS_DepExp_2012'!O47+((C47*0.5)/D47))","v":0},{"$f":"-'App.2-B_FA Cont MIFRS 2013'!K47","v":0},0]
[1960,"Miscellaneous Equipment ",{"$f":"+'App.2-B_FA Cont MIFRS 2013'!F48","v":45000},{"$f":"+'App.2-CG_MIFRS_DepExp_2012'!F48","v":10},0.1,{"$f":"IF(D48=0,'App.2-CG_MIFRS_DepExp_2012'!O48,+'App.2-CG_MIFRS_DepExp_2012'!O48+((C48*0.5)/D48))","v":7712.3},{"$f":"-'App.2-B_FA Cont MIFRS 2013'!K48","v":7712},0.3000000000001819]
[1975,"Load Management Controls Utility Premises",{"$f":"+'App.2-B_FA Cont MIFRS 2013'!F49","v":0},{"$f":"+'App.2-CG_MIFRS_DepExp_2012'!F49","v":0},0,{"$f":"IF(D49=0,'App.2-CG_MIFRS_DepExp_2012'!O49,+'App.2-CG_MIFRS_DepExp_2012'!O49+((C49*0.5)/D49))","v":0},{"$f":"-'App.2-B_FA Cont MIFRS 2013'!K49","v":0},0]
[1980,"System Supervisor Equipment",{"$f":"+'App.2-B_FA Cont MIFRS 2013'!F50","v":0},{"$f":"+'App.2-CG_MIFRS_DepExp_2012'!F50","v":0},0,{"$f":"IF(D50=0,'App.2-CG_MIFRS_DepExp_2012'!O50,+'App.2-CG_MIFRS_DepExp_2012'!O50+((C50*0.5)/D50))","v":0},{"$f":"-'App.2-B_FA Cont MIFRS 2013'!K50","v":0},0]
[1985,"Miscellaneous Fixed Assets",{"$f":"+'App.2-B_FA Cont MIFRS 2013'!F51","v":0},{"$f":"+'App.2-CG_MIFRS_DepExp_2012'!F51","v":0},0,{"$f":"IF(D51=0,'App.2-CG_MIFRS_DepExp_2012'!O51,+'App.2-CG_MIFRS_DepExp_2012'!O51+((C51*0.5)/D51))","v":0},{"$f":"-'App.2-B_FA Cont MIFRS 2013'!K51","v":0},0]
[1995,"Contributions & Grants",{"$f":"+'App.2-B_FA Cont MIFRS 2013'!F52","v":-373740},{"$f":"+'App.2-CG_MIFRS_DepExp_2012'!F52","v":51.25},1.9512195121951219E-2,{"$f":"IF(D52=0,'App.2-CG_MIFRS_DepExp_2012'!O52,+'App.2-CG_MIFRS_DepExp_2012'!O52+((C52*0.5)/D52))","v":-148814.82439024388},{"$f":"-'App.2-B_FA Cont MIFRS 2013'!K52","v":-147888},-926.82439024388441]
["etc.",null,null,null,0,{"$f":"IF(D53=0,'App.2-CG_MIFRS_DepExp_2012'!O53,+'App.2-CG_MIFRS_DepExp_2012'!O53+((C53*0.5)/D53))","v":0},null,0]
[null,null,null,null,0,{"$f":"IF(D54=0,'App.2-CG_MIFRS_DepExp_2012'!O54,+'App.2-CG_MIFRS_DepExp_2012'!O54+((C54*0.5)/D54))","v":0},null,0]
[null,"Total",{"$f":"SUM(C16:C54)","v":4247388},null,null,{"$f":"SUM(F16:F54)","v":1185743.074623079},{"$f":"SUM(G16:G54)","v":1186653},{"$f":"SUM(H16:H54)","v":-909.92537692065753}]
[null,"Smart Meter Additions"]
[null,"Meters (Smart Meters)",null,{"$f":"+D31","v":15},{"$f":"IF(D57=0,0,1/D57)","v":6.6666666666666666E-2},241743,{"$f":"-'App.2-B_FA Cont MIFRS 2013'!K57","v":241743},{"$f":"IF(ISERROR(+F57-G57), 0, +F57-G57)","v":0}]
[null,"Computer Hardware (Smart Meters)",null,{"$f":"+D39","v":5},0.2,12575,{"$f":"-'App.2-B_FA Cont MIFRS 2013'!K58","v":12575},0]
[null,"Computer Software (Smart Meters)",null,{"$f":"+D40","v":5},0.2,54843,{"$f":"-'App.2-B_FA Cont MIFRS 2013'!K59","v":54843},0]
[null,"Depreciation expense adjustment resulting from  amortization of Account 1575",null,null,null,{"$f":"+'App.2-EB_PP&E Deferral Account'!F39","v":116677.25}]
[null,"Total Depreciation expense to be included in the test year revenue requirement",null,null,null,{"$f":"SUM(F55:F60)","v":1611581.324623079}]
[]
["Notes:"]
[1,"Board policy of the \"half-year\" rule - the applicant must ensure that additions in the year attract a half-year depreciation expense in the first year.  Deviations from this standard practice must be supported in the application."]
[2,"The applicant must provide an explanation of material variances in evidence"]
[]
[]
["General:","Applicants must provide a breakdown of depreciation and amortization expense in the above format for all relevant accounts.  Asset Retirement Obligations (AROs), depreciation and accretion expense should be disclosed separately consistent with the Notes of historical Audited Financial Statements."]

{"sheet":"App.2-CI_AltAccStd_DepExp","index":21,"n_rows":62,"n_cols":12,"rows_kept":62,"cut":false,"hidden":true,"merged":[[58,1,58,11],[57,1,57,11],[61,1,62,11],[10,0,10,11],[9,0,9,11],[8,0,8,11],[11,4,11,5],[13,0,14,0],[13,1,14,1],[13,10,14,10]]}
[null,null,null,null,null,null,null,null,null,null,"File Number:",{"$f":"'LDC Info'!$E$18","v":"EB2012-0176"}]
[null,null,null,null,null,null,null,null,null,null,"Exhibit:"]
[null,null,null,null,null,null,null,null,null,null,"Tab:"]
[null,null,null,null,null,null,null,null,null,null,"Schedule:"]
[null,null,null,null,null,null,null,null,null,null,"Page:"]
[]
[null,null,null,null,null,null,null,null,null,null,"Date:"]
[]
["Appendix 2-CI"]
["Depreciation and Amortization Expense"]
["Assumes the applicant adopted an alternate accounting standard other than IFRS for financial reporting purposes.  For applicants adopting an Alternate Accounting Standard for financial reporting purposes January 1, 2012, applicants must complete 4 versions of the table below (2011 CGAAP, 2011 Alternate Accounting Standard, 2012 Alternate Accounting Standard and 2013 Alternate Accounting Standard).  For applicants adopting an Alternate Accounting Standard for financial reporting purposes January 1, 2013, applicants must complete 4 versions of the table below (2011 CGAAP, 2012 CGAAP, 2012 Alternate Accounting Standard and 2013 Alternate Accounting Standard)."]
[null,"Year",null,null,"Accounting Standard"]
[]
["Account","Description","Opening\nRegulatory Gross PP&E","Less Fully Depreciated","Net for Depreciation","Additions","Total for Depreciation","Years","Depreciation Rate","Depreciation Expense","Depreciation Expense per Appendix 2-B Fixed Assets, Column K\n (l)","Variance 2"]
[null,null,"(a)","(b)","(c)","(d)","(e) = (c) + ½ x (d) 1","(f)","(g) = 1 / (f)","(h) = (e) / (f)",null,"(m) = (h) - (l)"]
[1611,"Computer Software (Formally known as Account 1925)",null,null,{"$f":"C16-D16","v":0},null,{"$f":"E16+0.5*F16","v":0},null,{"$f":"IF(H16=0,0,1/H16)","v":0},{"$f":"IF(H16=0,0,G16/H16)","v":0},null,{"$f":"IF(ISERROR(+J16-K16), 0, +J16-K16)","v":0}]
[1612,"Land Rights (Formally known as Account 1906)",null,null,{"$f":"C17-D17","v":0},null,{"$f":"E17+0.5*F17","v":0},null,0,0,null,0]
[1805,"Land",null,null,0,null,0,null,0,0,null,0]
[1808,"Buildings",null,null,0,null,0,null,0,0,null,0]
[1810,"Leasehold Improvements",null,null,0,null,0,null,0,0,null,0]
[1815,"Transformer Station Equipment >50 kV",null,null,0,null,0,null,0,0,null,0]
[1820,"Distribution Station Equipment <50 kV",null,null,0,null,0,null,0,0,null,0]
[1825,"Storage Battery Equipment",null,null,0,null,0,null,0,0,null,0]
[1830,"Poles, Towers & Fixtures",null,null,0,null,0,null,0,0,null,0]
[1835,"Overhead Conductors & Devices",null,null,0,null,0,null,0,0,null,0]
[1840,"Underground Conduit",null,null,0,null,0,null,0,0,null,0]
[1845,"Underground Conductors & Devices",null,null,0,null,0,null,0,0,null,0]
[1850,"Line Transformers",null,null,0,null,0,null,0,0,null,0]
[1855,"Services (Overhead & Underground)",null,null,0,null,0,null,0,0,null,0]
[1860,"Meters",null,null,0,null,0,null,0,0,null,0]
[1860,"Meters (Smart Meters)",null,null,0,null,0,null,0,0,null,0]
[1905,"Land",null,null,0,null,0,null,0,0,null,0]
[1908,"Buildings & Fixtures",null,null,0,null,0,null,0,0,null,0]
[1910,"Leasehold Improvements",null,null,0,null,0,null,0,0,null,0]
[1915,"Office Furniture & Equipment (10 years)",null,null,0,null,0,null,0,0,null,0]
[1915,"Office Furniture & Equipment (5 years)",null,null,0,null,0,null,0,0,null,0]
[1920,"Computer Equipment - Hardware",null,null,0,null,0,null,0,0,null,0]
[1920,"Computer Equip.-Hardware(Post Mar. 22/04)",null,null,0,null,0,null,0,0,null,0]
[1920,"Computer Equip.-Hardware(Post Mar. 19/07)",null,null,0,null,0,null,0,0,null,0]
[1930,"Transportation Equipment",null,null,0,null,0,null,0,0,null,0]
[1935,"Stores Equipment",null,null,0,null,0,null,0,0,null,0]
[1940,"Tools, Shop & Garage Equipment",null,null,0,null,0,null,0,0,null,0]
[1945,"Measurement & Testing Equipment",null,null,0,null,0,null,0,0,null,0]
[1950,"Power Operated Equipment",null,null,0,null,0,null,0,0,null,0]
[1955,"Communications Equipment",null,null,0,null,0,null,0,0,null,0]
[1955,"Communication Equipment (Smart Meters)",null,null,0,null,0,null,0,0,null,0]
[1960,"Miscellaneous Equipment ",null,null,0,null,0,null,0,0,null,0]
[1975,"Load Management Controls Utility Premises",null,null,0,null,0,null,0,0,null,0]
[1980,"System Supervisor Equipment",null,null,0,null,0,null,0,0,null,0]
[1985,"Miscellaneous Fixed Assets",null,null,0,null,0,null,0,0,null,0]
[1995,"Contributions & Grants",null,null,0,null,0,null,0,0,null,0]
["etc.",null,null,null,0,null,0,null,0,0,null,0]
[null,null,null,null,0,null,0,null,0,0,null,0]
[null,"Total",{"$f":"SUM(C16:C53)","v":0},{"$f":"SUM(D16:D53)","v":0},{"$f":"SUM(E16:E53)","v":0},0,0,null,null,{"$f":"SUM(J16:J53)","v":0},{"$f":"SUM(K16:K53)","v":0},{"$f":"SUM(L16:L53)","v":0}]
[]
["Notes:"]
[]
[1,"Board policy of the \"half-year\" rule - the applicant must ensure that additions in the year attract a half-year depreciation expense in the first year.  Deviations from this standard practice must be supported in the application."]
[2,"The applicant must provide an explanation of material variances in evidence"]
[]
[]
["General:","Applicants must provide a breakdown of depreciation and amortization expense in the above format for all relevant accounts.  Asset Retirement Obligations (AROs), depreciation and accretion expense should be disclosed separately consistent with the Notes of historical Audited Financial Statements."]

{"sheet":"App.2-D_Overhead","index":22,"n_rows":54,"n_cols":13,"rows_kept":54,"cut":false,"hidden":false,"merged":[[60,0,61,0],[63,0,64,0],[66,0,69,0],[71,0,72,0],[50,0,50,2],[50,10,50,12],[53,1,54,12],[55,0,56,0],[55,1,56,4],[58,0,59,0],[58,1,58,4],[47,0,47,2],[47,10,47,12],[48,0,48,2],[48,10,48,12],[49,0,49,2],[49,10,49,12],[44,0,44,2],[44,10,44,12],[45,0,45,2],[45,10,45,12],[46,0,46,2],[46,10,46,12],[43,0,43,2],[43,10,43,12],[37,0,37,2],[37,10,37,12],[38,0,38,2],[38,10,38,12],[39,0,39,2],[39,10,39,12],[40,0,40,2],[40,10,40,12],[41,0,41,2],[41,10,41,12],[42,10,42,12],[29,0,29,2],[29,10,29,12],[32,0,32,12],[34,0,36,2],[34,10,34,12],[35,10,35,12],[36,10,36,12],[26,0,26,2],[26,10,26,12],[27,0,27,2],[27,10,27,12],[28,0,28,2],[28,10,28,12],[23,0,23,2],[23,10,23,12],[24,0,24,2],[24,10,24,12],[25,0,25,2],[25,10,25,12],[22,0,22,2],[22,10,22,12],[16,0,16,2],[16,10,16,12],[17,0,17,2],[17,10,17,12],[18,0,18,2],[18,10,18,12],[19,0,19,2],[19,10,19,12],[20,0,20,2],[20,10,20,12],[21,10,21,12],[8,0,8,12],[9,0,9,12],[11,0,11,12],[13,0,15,2],[13,10,13,12],[14,10,14,12],[15,10,15,12]]}
[null,null,null,null,null,null,null,null,null,null,null,"File Number:",{"$f":"'LDC Info'!$E$18","v":"EB2012-0176"}]
[null,null,null,null,null,null,null,null,null,null,null,"Exhibit:"]
[null,null,null,null,null,null,null,null,null,null,null,"Tab:"]
[null,null,null,null,null,null,null,null,null,null,null,"Schedule:"]
[null,null,null,null,null,null,null,null,null,null,null,"Page:"]
[]
[null,null,null,null,null,null,null,null,null,null,null,"Date:"]
[]
["Appendix 2-D"]
["Overhead Expense"]
[]
["The following table should be completed based on the information requested below. An explanation should be provided for any blank entries.  The entries should include overhead costs that are currently capitalized on self-constructed assets under MIFRS or an alternate accounting standard."]
[null,null,null,null,"(A) 1","(B)","(C)","(D)","(E) 1","(F)","(G)"]
["Nature of the Overhead Costs",null,null,null,"Dollar","Dollar","Dollar","Dollar Impact - ","Dollar Impact - ","Directly","Reasons why the overhead costs are allowed to be"]
[null,null,null,null,"Impact on PP&E","Impact on PP&E","Impact on PP&E","PP&E Variance","PP&E Variance","Attributable?","capitalized under MIFRS or an alternate accounting"]
[null,null,null,null,"Historic Year","Bridge Year","Test Year","Test versus Bridge","Test versus Historic","(Y/N)","standard given limitations on capitalized overhead"]
["employee benefits",null,null,null,null,61307,67526,{"$f":"+G17-F17","v":6219},{"$f":"+G17-E17","v":67526},"Y","lineman labour hours - directly trackable to capital jobs"]
["costs of site preparation",null,null,null,null,null,null,0,0,null,"no overhead costs to be realized"]
["initial delivery and handling costs",null,null,null,null,29612,30257,645,30257,"N","costs specifically tracked via time study that are directly attributable to capital jobs"]
["costs of testing whether the asset is functioning properly",null,null,null,null,null,null,0,0,null,"no overhead costs to be realized"]
["professional fees",null,null,null,null,null,null,0,0,null,"costs are directly charged to jobs.  Therefore not overhead"]
[null,null,null,null,null,null,null,0,0]
["costs of opening a new facility",null,null,null,null,null,null,0,0,null,"WPI does not have any new facilities"]
["costs of introducing a new product or service (including costs of advertising and promotional activities)",null,null,null,null,null,null,0,0,null,"WPI does not have any new costs or services"]
["costs of conducting business in a new location or with a new class of customer (including costs of staff training)",null,null,null,null,null,null,0,0,null,"WPI does not have any new locations or new customer classes"]
["administration and other general overhead costs",null,null,null,null,476956,486329,9373,486329,"N","costs specifically tracked via time study that are directly attributable to capital jobs"]
[null,null,null,null,null,null,null,0,0]
["costs for operation of trucks",null,null,null,null,{"$f":"386000*0.650477016478751","v":251084.12836079788},234300,-16784.128360797884,234300,"Y","truck costs - directly trackable by labour hour"]
[null,null,null,null,null,null,null,0,0]
["Total",null,null,null,{"$f":"SUM(E17:E29)","v":0},{"$f":"SUM(F17:F29)","v":818959.12836079788},{"$f":"SUM(G17:G29)","v":818412},{"$f":"SUM(H17:H29)","v":-547.12836079788394},{"$f":"SUM(I17:I29)","v":818412}]
[]
[]
["The following table should be completed based on the information requested below. An explanation should be provided for any blank entries.  The entries should include overhead costs that were capitalized on self-constructed assets under CGAAP but are no longer capitalized under MIFRS or an alternate accounting standard and are included in OM&A."]
[null,null,null,null,"(A) 1","(B)","(C)","(D)","(E) 1","(F)","(G)"]
["Nature of the Overhead Costs",null,null,null,"Dollar","Dollar","Dollar","Dollar Impact - ","Dollar Impact - ","Directly","Reasons why the overhead costs are not allowed to be"]
[null,null,null,null,"Impact on OM&A","Impact on OM&A","Impact on OM&A","OM&A Variance","OM&A Variance","Attributable?","capitalized under MIFRS or an alternate accounting"]
[null,null,null,null,"Historic Year","Bridge Year","Test Year","Test versus Bridge","Test versus Historic","(Y/N)","standard given limitations on capitalized overhead"]
["employee benefits",null,null,null,null,null,null,{"$f":"+G38-F38","v":0},{"$f":"+G38-E38","v":0},null,"these costs are permitted under MIFRS"]
["costs of site preparation",null,null,null,null,null,null,{"$f":"+G39-F39","v":0},{"$f":"+G39-E39","v":0},null,"no overhead costs to be realized"]
["initial delivery and handling costs",null,null,null,null,36772,34683,{"$f":"+G40-F40","v":-2089},{"$f":"+G40-E40","v":34683},"N"]
["costs of testing whether the asset is functioning properly",null,null,null,null,null,null,{"$f":"+G41-F41","v":0},{"$f":"+G41-E41","v":0},null,"no overhead costs to be realized"]
["professional fees",null,null,null,null,null,null,{"$f":"+G42-F42","v":0},{"$f":"+G42-E42","v":0},null,"costs are directly charged to jobs.  Therefore not overhead"]
[]
["costs of opening a new facility",null,null,null,null,null,null,{"$f":"+G44-F44","v":0},{"$f":"+G44-E44","v":0},null,"WPI does not have any new facilities"]
["costs of introducing a new product or service (including costs of advertising and promotional activities)",null,null,null,null,null,null,0,0,null,"WPI does not have any new costs or services"]
["costs of conducting business in a new location or with a new class of customer (including costs of staff training)",null,null,null,null,null,null,0,0,null,"WPI does not have any new locations or new customer classes"]
["administration and other general overhead costs",null,null,null,null,150516,136688,-13828,136688,"N","these costs are not directly attributable and therefore specifically disallowed under MIFRS"]
[null,null,null,null,null,null,null,0,0]
["Engineering Charges",null,null,null,null,474220,419992,-54228,419992,"N","these costs are not directly attributable and therefore specifically disallowed under MIFRS"]
["costs for operation of trucks",null,null,null,null,-81900,-91800,-9900,-91800,"Y","this is a negative because under CGAAP, we did not include depreciation for truck depreciation and insurance but under MIFRS we do.  Truck costs are directly trackable by labour hour."]
["Total",null,null,null,{"$f":"SUM(E38:E50)","v":0},{"$f":"SUM(F38:F50)","v":579608},{"$f":"SUM(G38:G50)","v":499563},{"$f":"SUM(H38:H50)","v":-80045},{"$f":"SUM(I38:I50)","v":499563}]
[]
["Notes:"]
[1,"If the applicant chooses to adopt IFRS or an alternate accounting standard for financial reporting purposes in 2013, the applicant does not need to complete Columns A, E.  If the applicant adopts IFRS or an alternate accounting standard for financial reporting purposes in 2012, the applicant must complete all columns."]

{"sheet":"App.2-EA_PP&E Deferral Account","index":23,"n_rows":55,"n_cols":10,"rows_kept":55,"cut":false,"hidden":true,"merged":[[8,0,8,8],[9,0,9,8],[10,0,10,8],[14,0,14,8],[12,0,12,8],[54,0,55,8],[33,1,34,2],[25,1,26,2],[20,1,20,8],[19,1,19,2],[19,5,19,8],[25,5,26,8],[31,5,31,8],[31,1,31,2]]}
[null,null,null,null,null,null,null,"File Number:",{"$f":"'LDC Info'!$E$18","v":"EB2012-0176"}]
[null,null,null,null,null,null,null,"Exhibit:"]
[null,null,null,null,null,null,null,"Tab:"]
[null,null,null,null,null,null,null,"Schedule:"]
[null,null,null,null,null,null,null,"Page:"]
[]
[null,null,null,null,null,null,null,"Date:"]
[]
["Appendix 2-EA"]
["IFRS-CGAAP Transitional PP&E Amounts"]
["2012 Adopters of IFRS for Financial Reporting Purposes"]
[]
["For applicants that adopt IFRS on January 1, 2012 for financial reporting purposes"]
[]
["Note: this sheet should be filled out if the applicant adopts IFRS for its financial reporting purpose as of January 1, 2012. "]
[]
[null,"2009 Rebasing Year",2010,2011,2012,"2013 Rebasing Year",2014,2015,2016]
["Reporting Basis","CGAAP","IRM","IRM","IRM","MIFRS","IRM","IRM","IRM"]
["Forecast vs. Actual Used in Rebasing Year","Forecast","Actual","Actual","Forecast","Forecast"]
[null,null,null,"$","$"]
["PP&E Values under CGAAP"]
["            Opening net PP&E - Note 1"]
["            Additions"]
["            Depreciation (amounts should be negative)"]
["            Closing net PP&E (1)",null,null,{"$f":"D22+D23+D24","v":0},{"$f":"E22+E23+E24","v":0}]
[]
["PP&E Values under MIFRS (Starts from 2011, the transition year)"]
["            Opening net PP&E  - Note 1"]
["            Additions"]
["            Depreciation (amounts should be negative)"]
["            Closing net PP&E (2)",null,null,{"$f":"SUM(D28:D30)","v":0},{"$f":"SUM(E28:E30)","v":0}]
[]
["Difference in Closing net PP&E, CGAAP vs. MIFRS (Shown as adjustment to rate base on rebasing)",null,null,{"$f":"D25-D31","v":0},{"$f":"E25-E31","v":0}]
[]
["Account 1575 - IFRS-CGAAP Transitional PP&E Amounts"]
["Opening balance ",null,null,0,{"$f":"D40","v":0},{"$f":"E40","v":0},{"$f":"F40","v":0},{"$f":"G40","v":0},{"$f":"H40","v":0}]
["Amounts added in the year",null,null,{"$f":"D33","v":0},{"$f":"E33-D33","v":0}]
["Sub-total",null,null,{"$f":"D36+D37","v":0},0,0,0,0,0]
["Amount of amortization, included in  depreciation expense  - Note 2",null,null,null,null,{"$f":"IF(ISERROR(-E33/I44), 0, -E33/I44)","v":0},{"$f":"+F39","v":0},{"$f":"+F39","v":0},{"$f":"+F39","v":0}]
["          Closing balance in deferral account",null,null,{"$f":"D38+D39","v":0},0,{"$f":"IF(ISERROR(F38+F39), 0, F38+F39)","v":0},0,0,0]
[]
["Effect on Revenue Requirement"]
["Amortization of deferred balance as above - Note 2",null,null,null,null,{"$f":"IF(ISERROR(E33/I44), 0, E33/I44)","v":0},null,"WACC"]
["Return on Rate Base Associated with deferred PP&E balance at WACC  - Note 3 ",null,null,null,null,{"$f":"E33*I43","v":0},null,"Disposition Period - Note 4",4,"Years"]
["     Amount included in Revenue Requirement on rebasing",null,null,null,null,{"$f":"F43+F44","v":0}]
[]
["Notes:"]
["1  For an applicant that adopts IFRS on January 1, 2012, the PP&E values as of January 1, 2011 under both CGAAP and MIFRS should be the same. "]
["2  Amortization of the deferred balance in Account 1575 will start from the rebasing year. "]
["    Assume the utility requests for a certain disposition period, the amortization that should be included in the depreciation expense is calculated as:"]
["   the opening balance of Account 1575 / the approved disposition period"]
["3  Return on rate base associated with deferred balance is calculated as:"]
["     the deferred account opening balance as of 2013 rebasing year x WACC"]
["     * Please note that the calculation should be adjusted once WACC is updated and finalized in the rate application."]
["4  Consistent with the 4 year normal rate cycle, the model is using a 4 year amortization period as a default selection to \"clear\" the PP&E deferral account through a one-time adjustment to ratebase to capture and remove the impact of the accounting policy changes as caused by the transition from CGAAP to MIFRS."]

{"sheet":"App.2-EB_PP&E Deferral Account","index":24,"n_rows":55,"n_cols":10,"rows_kept":55,"cut":false,"hidden":false,"merged":[[54,0,55,8],[20,1,20,8],[8,0,8,8],[9,0,9,8],[10,0,10,8],[14,0,14,8],[12,0,12,8]]}
[null,null,null,null,null,null,null,"File Number:",{"$f":"'LDC Info'!$E$18","v":"EB2012-0176"}]
[null,null,null,null,null,null,null,"Exhibit:"]
[null,null,null,null,null,null,null,"Tab:"]
[null,null,null,null,null,null,null,"Schedule:"]
[null,null,null,null,null,null,null,"Page:"]
[]
[null,null,null,null,null,null,null,"Date:"]
[]
["Appendix 2-EB"]
["IFRS-CGAAP Transitional PP&E Amounts"]
["2013 Adopters of IFRS for Financial Reporting Purposes"]
[]
["For applicants that adopt IFRS on January 1, 2013 for financial reporting purposes"]
[]
["Note: this sheet should be filled out if the applicant adopts IFRS for its financial reporting purpose as of January 1, 2013. "]
[]
[null,"2009 Rebasing Year",2010,2011,2012,"2013 Rebasing Year",2014,2015,2016]
["Reporting Basis","CGAAP","IRM","IRM","IRM","MIFRS","IRM","IRM","IRM"]
["Forecast vs. Actual Used in Rebasing Year","Forecast","Actual","Actual","Forecast","Forecast"]
[null,null,null,"$","$","$","$","$","$"]
["PP&E Values under CGAAP"]
["            Opening net PP&E - Note 1",null,{"$f":"+B25","v":27424582},{"$f":"+C25","v":28311060.25},{"$f":"+D25","v":29827326.539999999},{"$f":"+E25","v":32076125.539999999}]
["            Additions",null,{"$f":"+'App.2-B_Fixed Asset Cont 2010'!F55","v":2741802.2199999997},{"$f":"+'App.2-B_Fixed Asset Cont 2011'!F55","v":3527103.22},{"$f":"+'App.2-B_Fixed Asset Cont 2012'!F55","v":4458595},{"$f":"+'App.2-B_Fixed Asset Cont 2013'!F60","v":5148418}]
["            Depreciation (amounts should be negative)",null,{"$f":"+'App.2-B_Fixed Asset Cont 2010'!K55","v":-1855323.9700000002},{"$f":"+'App.2-B_Fixed Asset Cont 2011'!K55","v":-2010836.9300000006},{"$f":"+'App.2-B_Fixed Asset Cont 2012'!K55","v":-2209796},{"$f":"+'App.2-B_Fixed Asset Cont 2013'!K60","v":-2715462}]
["            Closing net PP&E (1)",27424582,{"$f":"SUM(C22:C24)","v":28311060.25},{"$f":"SUM(D22:D24)","v":29827326.539999999},{"$f":"SUM(E22:E24)","v":32076125.539999999},{"$f":"SUM(F22:F24)","v":34509081.539999999}]
[]
["PP&E Values under MIFRS (Starts from 2012, the transition year)"]
["            Opening net PP&E  - Note 1",null,{"$f":"+C22","v":27424582},{"$f":"+D22","v":28311060.25},{"$f":"+D31","v":29827326.539999999},{"$f":"+E31","v":32542834.539999999}]
["            Additions",null,{"$f":"+C23","v":2741802.2199999997},3527103.22,{"$f":"+'App.2-B_FA Cont MIFRS 2012'!F55","v":3852124},{"$f":"+'App.2-B_FA Cont MIFRS 2013'!F60","v":4247388}]
["            Depreciation (amounts should be negative)",null,-1855323.9700000002,-2010836.9300000006,{"$f":"+'App.2-B_FA Cont MIFRS 2012'!K55","v":-1136616},{"$f":"+'App.2-B_FA Cont MIFRS 2013'!K60","v":-1495814}]
["            Closing net PP&E (2)",{"$f":"+B25","v":27424582},28311060.25,29827326.539999999,{"$f":"SUM(E28:E30)","v":32542834.539999999},{"$f":"SUM(F28:F30)","v":35294408.539999999}]
[]
["Difference in Closing net PP&E, CGAAP vs. MIFRS (Shown as adjustment to rate base on rebasing)",null,null,null,{"$f":"E25-E31","v":-466709}]
[]
["Account 1575 - IFRS-CGAAP Transitional PP&E Amounts"]
["          Opening balance ",null,null,null,{"$f":"D40","v":0},{"$f":"E40","v":-466709},{"$f":"F40","v":-350031.75},{"$f":"G40","v":-233354.5},{"$f":"H40","v":-116677.25}]
["          Amounts added in the year",null,null,null,{"$f":"E33-D33","v":-466709}]
["Sub-total",null,null,null,{"$f":"E36+E37","v":-466709},{"$f":"F36+F37","v":-466709},{"$f":"G36+G37","v":-350031.75},{"$f":"H36+H37","v":-233354.5},{"$f":"I36+I37","v":-116677.25}]
["Amount of amortization, included in  depreciation expense  - Note 2",null,null,null,null,{"$f":"IF(ISERROR(-E33/I44), 0, -E33/I44)","v":116677.25},{"$f":"+F39","v":116677.25},{"$f":"+F39","v":116677.25},{"$f":"+F39","v":116677.25}]
["          Closing balance in deferral account",null,null,null,{"$f":"E38+E39","v":-466709},{"$f":"IF(ISERROR(F38+F39), 0, F38+F39)","v":-350031.75},{"$f":"G38+G39","v":-233354.5},{"$f":"H38+H39","v":-116677.25},{"$f":"I38+I39","v":0}]
[]
["Effect on Revenue Requirement"]
["        Amortization of deferred balance as above - Note 2",null,null,null,null,{"$f":"IF(ISERROR(E33/I44), 0, E33/I44)","v":-116677.25},null,"WACC",6.9699999999999998E-2]
["Return on Rate Base Associated with deferred PP&E balance at WACC  - Note 3 ",null,null,null,null,{"$f":"E33*I43","v":-32529.617299999998},null,"Disposition Period - Note 4",4,"Years"]
["     Amount included in Revenue Requirement on rebasing",null,null,null,null,{"$f":"F43+F44","v":-149206.86729999998}]
[]
["Notes:"]
["1  For an applicant that adopts IFRS on January 1, 2013, the PP&E values as of January 1, 2012 under both CGAAP and MIFRS should be the same. "]
["2  Amortization of the deferred balance in Account 1575 will start from the rebasing year. "]
["    Assume the utility requests for a certain disposition period, the amortization that should be included in the depreciation expense is calculated as:"]
["   the opening balance of Account 1575 / the approved disposition period"]
["3  Return on rate base associated with deferred balance is calculated as:"]
["     the deferred account opening balance as of 2013 rebasing year x WACC "]
["     * Please note that the calculation should be adjusted once WACC is updated and finalized in the rate application."]
["4  Consistent with the 4 year normal rate cycle, the model is using a 4 year amortization period as a default selection to \"clear\" the PP&E deferral account through a one-time adjustment to ratebase to capture and remove the impact of the accounting policy changes as caused by the transition from CGAAP to MIFRS."]

{"sheet":"App.2-F_Other_Oper_Rev","index":25,"n_rows":123,"n_cols":9,"rows_kept":123,"cut":false,"hidden":false,"merged":[[121,1,121,8],[122,1,122,8],[58,0,58,1],[52,0,53,8],[57,0,57,1],[67,0,67,1],[59,0,59,1],[60,0,60,1],[61,0,61,1],[66,0,66,1],[77,0,77,1],[78,0,78,1],[79,0,79,1],[80,0,80,1],[81,0,81,1],[104,0,104,1],[47,0,48,8],[34,0,34,1],[35,0,35,1],[11,0,11,8],[12,0,12,8],[32,0,32,8],[33,0,33,1],[42,2,42,8],[43,2,44,8],[36,0,36,1],[37,0,37,1],[40,0,40,1],[41,0,41,1],[42,0,42,1],[43,0,43,1],[105,0,105,1],[91,0,91,1],[94,0,94,1],[95,0,95,1],[99,0,99,1],[100,0,100,1],[92,0,92,1],[62,0,62,1],[63,0,63,1],[101,0,101,1],[102,0,102,1],[103,0,103,1],[83,0,83,1],[87,0,87,1],[88,0,88,1],[89,0,89,1],[90,0,90,1],[82,0,82,1],[93,0,93,1],[72,0,72,8],[73,0,73,8],[116,0,116,1],[117,0,117,1],[110,0,110,1],[111,0,111,1],[112,0,112,1],[114,0,114,1],[115,0,115,1],[113,0,113,1]]}
[null,null,null,null,null,null,null,"File Number:",{"$f":"'LDC Info'!$E$18","v":"EB2012-0176"}]
[null,null,null,null,null,null,null,"Exhibit:"]
[null,null,null,null,null,null,null,"Tab:"]
[null,null,null,null,null,null,null,"Schedule:"]
[null,null,null,null,null,null,null,"Page:"]
[]
[null,null,null,null,null,null,null,"Date:"]
[]
[]
[]
[]
["Appendix 2-F"]
["Other Operating Revenue"]
[]
["USoA #","USoA Description",{"$f":"G16-3 & \" Actual\"","v":"2009 Actual"},{"$f":"G16-2 & \" Actual\"","v":"2010 Actual"},{"$f":"G16-1 & \" Actual\"& CHAR(178)","v":"2011 Actual²"},{"$f":"G16-1 & \" Actual\"& CHAR(178)","v":"2011 Actual²"},{"$f":"\"Bridge Year\" & CHAR(179)","v":"Bridge Year³"},{"$f":"\"Bridge Year\" & CHAR(179)","v":"Bridge Year³"},"Test Year"]
[null,null,null,null,null,null,{"$f":"'LDC Info'!E26","v":2012},{"$f":"'LDC Info'!E26","v":2012},{"$f":"'LDC Info'!E28","v":2013}]
[null,"Reporting Basis","CGAAP","CGAAP","CGAAP","CGAAP","CGAAP","MIFRS","MIFRS"]
[4235,"Specific Service Charges",{"$f":"C96","v":161105},{"$f":"D96","v":150551},126903,0,130321,130321,130636]
[4225,"Late Payment Charges",{"$f":"C106","v":80833.58},83638.87,95563.00499999999,0,89685,89685,{"$f":"I106","v":89685}]
[4082,"Retail Services Revenues",{"$f":"C84","v":33183.199999999997},{"$f":"D84","v":30429.1},25671.8,0,20960,20960,19900]
[4080,"Distribution Services Revenue",56468,58073,60111,null,62625,62625,65756.25]
[4084,"Service Transaction Requests (STR) Revenues",{"$f":"C68","v":126246},{"$f":"D68","v":118361.5},103948,null,115200,115200,115125]
[]
[]
[4210,"Specific Charge for Access to Power Poles",122947.35,109649.1,109626.75,null,105000.3,105000,105000.3]
[]
[null,"Other Income and Exp.",{"$f":"C118","v":226448},{"$f":"D118","v":149161},266026,0,79138,79138,71938]
[4405,"Interest & Dividend Inc.",288156,83143,150880,null,55000,55000,55000]
["etc."]
[]
[]
[]
[]
["Specific Service Charges",null,{"$f":"C18","v":161105},150551,126903,{"$f":"F18","v":0},130321,{"$f":"H18","v":130321},{"$f":"I18","v":130636}]
["Late Payment Charges",null,80833.58,83638.87,95563.00499999999,{"$f":"F19","v":0},89685,{"$f":"H19","v":89685},{"$f":"I19","v":89685}]
["Other Operating Revenues",null,{"$f":"C20+C21+C22+C25","v":338844.55000000005},{"$f":"D20+D21+D22+D25","v":316512.7},299357.55,0,303785.3,303785,305781.55]
["Other Income or Deductions",null,{"$f":"C27+C28","v":514604},232304,416906,0,134138,134138,{"$f":"I27+I28","v":126938}]
["Total",null,{"$f":"SUM(C34:C37)","v":1095387.1300000001},783006.57000000007,938729.55499999993,0,657929.30000000005,657929,653040.55000000005]
[]
["Description",null,"Account(s)"]
["Specific Service Charges:",null,4235]
["Late Payment Charges:",null,4225]
["Other Distribution Revenues:",null,"4080, 4082, 4084, 4090, 4205, 4210, 4215, 4220, 4240, 4245"]
["Other Income and Expenses:",null,"4305, 4310, 4315, 4320, 4325, 4330, 4335, 4340, 4345, 4350, 4355, 4360, 4365, 4370, 4375, 4380, 4385, 4390, 4395, 4398, 4405, 4415"]
[]
[]
["Note: Add all applicable accounts listed above to the table and include all relevant information."]
["The above table assumes adoption of MIFRS as of January 1, 2013.  If the adoption year differs, please adjust the table accordingly."]
[]
[]
["Account Breakdown Details"]
[]
["For each \"Other Operating Revenue\" and \"Other Income or Deductions\" Account, a detailed breakdown of the account components is required.  See the example below for Account 4405, Interest and Dividend Income."]
[]
[]
["Account 4084 - Service Transaction Requests (STR) Revenues"]
[null,null,{"$f":"C15","v":"2009 Actual"},{"$f":"D15","v":"2010 Actual"},{"$f":"E15","v":"2011 Actual²"},{"$f":"F15","v":"2011 Actual²"},"Bridge Year","Bridge Year","Test Year"]
[null,null,{"$f":"IF(ISBLANK(C17), \"\", C17)","v":"CGAAP"},"CGAAP","CGAAP",null,"CGAAP","MIFRS","MIFRS"]
["Arrears Certificate",null,825,450,345,null,225,225,150]
["Statement of Account",null,1110,480,375,null,225,225,225]
["Income Tax Letter",null,30,30,60]
["Notification Change",null,123465,116235,102300,null,114000,114000,114000]
["Service Transaction Request - request fee (per request)",null,329,429.5,309,null,250,250,250]
["Service Transaction Request - processing fee (per processed request)",null,487,737,559,null,500,500,500]
[]
[]
[]
["Total",null,{"$f":"SUM(C59:C67)","v":126246},118361.5,103948,0,115200,115200,115125]
[]
[]
[]
[]
["Appendix 2-F"]
["Other Operating Revenue"]
[]
["Account 4082 - Retail Service Revenues"]
[null,null,{"$f":"C15","v":"2009 Actual"},{"$f":"D15","v":"2010 Actual"},"2011 Actual²","2011 Actual²","Bridge Year³","Bridge Year³","Test Year"]
["Reporting Basis",null,{"$f":"IF(ISBLANK(C17), \"\", C17)","v":"CGAAP"},{"$f":"IF(ISBLANK(D17), \"\", D17)","v":"CGAAP"},"CGAAP","CGAAP","CGAAP","MIFRS","MIFRS"]
["Retailer Service Agreement -- standard charge",null,300,100,300,null,100,100,100]
["Retailer Service Agreement -- monthly fixed charge (per retailer)",null,2740,3240,3820,null,3260,3260,3200]
["Retailer Service Agreement -- monthly variable charge (per customer)",null,18947.5,17224.5,13490.5,null,11000,11000,10000]
["Distributor-Consolidated Billing -- monthly charge (per customer)",null,11195.699999999999,9864.6,8061.2999999999993,null,6600,6600,6600]
[]
["Total",null,{"$f":"SUM(C79:C83)","v":33183.199999999997},30429.1,25671.8,0,20960,20960,19900]
[]
["Account 4235","Misc Service Revenues"]
[null,null,{"$f":"C15","v":"2009 Actual"},{"$f":"D15","v":"2010 Actual"},"2011 Actual²","2011 Actual²","Bridge Year³","Bridge Year³","Test Year"]
["Reporting Basis",null,{"$f":"IF(ISBLANK(C17), \"\", C17)","v":"CGAAP"},{"$f":"IF(ISBLANK(D17), \"\", D17)","v":"CGAAP"},"CGAAP","CGAAP","CGAAP","MIFRS","MIFRS"]
["Credit reference/credit check (plus credit agency costs)",null,1500,1065,945,null,750,750,750]
["Returned Cheque charge (plus bank charges)",null,2625,2055,2160,null,1500,1500,1500]
["Account set up charge / change of occupancy charge",null,100770,102660,98160,null,100500,100500,100500]
["Special Meter reads",null,180,120,60]
["Disconnect/Reconnect at meter – during regular hours",null,56030,44525,24765,null,26000,26000,26000]
["Disconnect/Reconnect at pole – during regular hours",null,null,null,null,null,185,185,185]
["Misc Revenue - microFIT service charge",null,null,126,813,null,1386,1386,1701]
["Total",null,{"$f":"SUM(C89:C95)","v":161105},150551,126903,0,130321,130321,130636]
[]
["Account 4225 - Late Payment Charges"]
[null,null,{"$f":"C15","v":"2009 Actual"},{"$f":"D15","v":"2010 Actual"},"2011 Actual²","2011 Actual²","Bridge Year³","Bridge Year³","Test Year"]
["Reporting Basis",null,{"$f":"IF(ISBLANK(C17), \"\", C17)","v":"CGAAP"},{"$f":"IF(ISBLANK(D17), \"\", D17)","v":"CGAAP"},"CGAAP","CGAAP","CGAAP","MIFRS","MIFRS"]
["Late Payment - per month",null,80833.58,83638.87,95563.00499999999,null,86685,86685,86685]
["Collection of account charge – no disconnection",null,null,null,null,null,3000,3000,3000]
[]
[]
[]
["Total",null,{"$f":"SUM(C101:C105)","v":80833.58},83638.87,95563.00499999999,0,89685,89685,89685]
[]
[]
["Other Income and Expenses"]
[null,null,{"$f":"C15","v":"2009 Actual"},{"$f":"D15","v":"2010 Actual"},"2011 Actual²","2011 Actual²","Bridge Year³","Bridge Year³","Test Year"]
["Reporting Basis",null,{"$f":"IF(ISBLANK(C17), \"\", C17)","v":"CGAAP"},{"$f":"IF(ISBLANK(D17), \"\", D17)","v":"CGAAP"},"CGAAP","CGAAP","CGAAP","MIFRS","MIFRS"]
["4325 - Revenues from Merchandise",null,270835,122480,218034,null,212138,212138,210938]
["4330 - Costs and Expenses of Merchandising",null,-44419,-21431,-11061,null,-167000,-167000,-167000]
["4355/4360 - Gains/Losses on Capital Items",null,-6110,15671,15000,null,14000,14000,8000]
["4375 - Revenues from non-utility operations",null,21774,279576,203499,null,200000,200000,200000]
["4380 - Expenses of non-utility operations",null,-19974,-250819,-182206,null,-200000,-200000,-200000]
["4390 - Miscellaneous non-operating income",null,4342,3684,22760,null,20000,20000,20000]
["Total",null,{"$f":"SUM(C112:C117)","v":226448},149161,266026,0,79138,79138,71938]
[]
["Notes:"]
[1,"List and specify any other interest revenue"]
[2,"If the applicant is adopting IFRS or an alternate accounting standard as of January 1, 2012 for financial reporting purposes, 2011 must be presented on both a CGAAP and MIFRS (or alternate accounting standard) basis."]
[3,"If the applicant is adopting IFRS or an alternate accounting standard as of January 1, 2013 for financial reporting purposes, 2012 must be presented on both a CGAAP and MIFRS (or alternate accounting standard) basis."]

{"sheet":"App.2-G_Detailed_OM&A_Expenses","index":26,"n_rows":126,"n_cols":10,"rows_kept":126,"cut":false,"hidden":false,"merged":[[41,0,41,8],[62,0,62,8],[71,0,71,1],[8,0,8,8],[9,0,9,8],[10,0,10,8],[39,0,39,1],[15,0,15,8],[12,4,12,5],[12,6,12,7],[118,0,118,1],[85,0,85,8],[60,0,60,1],[124,1,124,8],[125,1,125,8],[123,1,123,8],[112,0,112,1],[73,0,73,8],[111,0,111,1]]}
[null,null,null,null,null,null,null,"File Number:",null,{"$f":"'LDC Info'!$E$18","v":"EB2012-0176"}]
[null,null,null,null,null,null,null,"Exhibit:"]
[null,null,null,null,null,null,null,"Tab:"]
[null,null,null,null,null,null,null,"Schedule:"]
[null,null,null,null,null,null,null,"Page:"]
[]
[null,null,null,null,null,null,null,"Date:"]
[]
["Appendix 2-G"]
["Detailed, Account by Account, OM&A Expense Table"]
["(excluding Depreciation and Amortization)"]
[]
[]
["Account","Description",{"$f":"\"Last Rebasing Year (\" & 'LDC Info'!E30 & \" Actuals)\"","v":"Last Rebasing Year (2009 Actuals)"},{"$f":"'LDC Info'!E26-2 & \" Actual\"","v":"2010 Actual"},{"$f":"'LDC Info'!E26-1 & \" Actual\" & CHAR(178) & \" CGAAP\"","v":"2011 Actual² CGAAP"},{"$f":"'LDC Info'!E26-1 & \" Actual\"& CHAR(178)","v":"2011 Actual²"},{"$f":"\"Bridge Year \" & 'LDC Info'!E26& CHAR(179) & \" CGAAP\"","v":"Bridge Year 2012³ CGAAP"},{"$f":"\"Bridge Year \" & 'LDC Info'!E26& CHAR(179) & \" IFRS\"","v":"Bridge Year 2012³ IFRS"},{"$f":"\"Test Year \" & 'LDC Info'!E28 & \" CGAAP\"","v":"Test Year 2013 CGAAP"},{"$f":"\"Test Year \" & \"2013 IFRS\"","v":"Test Year 2013 IFRS"}]
["Reporting Basis"]
["Operations"]
[5005,"Operation Supervision and Engineering"]
[5010,"Load Dispatching",47,null,-77]
[5012,"Station Buildings and Fixtures Expense"]
[5014,"Transformer Station Equipment - Operation Labour"]
[5015,"Transformer Station Equipment - Operation Supplies and Expenses"]
[5016,"Distribution Station Equipment - Operation Labour",null,null,520]
[5017,"Distribution Station Equipment - Operation Supplies and Expenses"]
[5020,"Overhead Distribution Lines and Feeders - Operation Labour",null,null,-1945]
[5025,"Overhead Distribution Lines and Feeders - Operation Supplies and Expenses"]
[5030,"Overhead Sub-transmission Feeders - Operation"]
[5035,"Overhead Distribution Transformers - Operation",185,672]
[5040,"Underground Distribution Lines and Feeders - Operation Labour",182539,165988,193401,null,193000,204000,216000,231000]
[5045,"Underground Distribution Lines and Feeders - Operation Supplies and Expenses"]
[5050,"Underground Sub-transmission Feeders - Operation"]
[5055,"Underground Distribution Transformers - Operation"]
[5060,"Street Lighting and Signal System Expense"]
[5065,"Meter Expense",53790,46228,71983,null,81000,150000,113000,194000]
[5070,"Customer Premises - Operation Labour"]
[5075,"Customer Premises - Operation Materials and Expenses"]
[5085,"Miscellaneous Distribution Expenses",2108,275,1454,null,15000,15000,5000,15000]
[5090,"Underground Distribution Lines and Feeders - Rental Paid"]
[5095,"Overhead Distribution Lines and Feeders - Rental Paid"]
[5096,"Other Rent"]
["Total - Operations",null,{"$f":"SUM(C17:C39)","v":238669},{"$f":"SUM(D17:D39)","v":213163},{"$f":"SUM(E17:E39)","v":265336},{"$f":"SUM(F17:F39)","v":0},289000,369000,{"$f":"SUM(I17:I39)","v":334000},{"$f":"SUM(J17:J39)","v":440000}]
["Account","Description",{"$f":"C14","v":"Last Rebasing Year (2009 Actuals)"},"2010 Actual","2011 Actual² CGAAP","2011 Actual²","Bridge Year 2012³ CGAAP","Bridge Year 2012³ IFRS","Test Year 2013 CGAAP",{"$f":"J14","v":"Test Year 2013 IFRS"}]
["Maintenance"]
[5105,"Maintenance Supervision and Engineering",13845,18611,16906,null,18000,18000,18000,18000]
[5110,"Maintenance of Buildings and Fixtures - Distribution Stations",6436,3895,5573]
[5112,"Maintenance of Transformer Station Equipment"]
[5114,"Maintenance of Distribution Station Equipment",279502,122608,270915,null,241000,304000,222000,254000]
[5120,"Maintenance of Poles, Towers and Fixtures",83421,97137,75811,null,110000,149000,146000,220000]
[5125,"Maintenance of Overhead Conductors and Devices",293181,183688,197254,null,124000,214000,141000,251000]
[5130,"Maintenance of Overhead Services",101546,117956,81891,null,111000,202000,134000,244000]
[5135,"Overhead Distribution Lines and Feeders - Right of Way",310591,278753,132971,null,431000,545000,447000,580000]
[5145,"Maintenance of Underground Conduit",47790,48051,39006,null,42000,68000,71000,115000]
[5150,"Maintenance of Underground Conductors and Devices"]
[5155,"Maintenance of Underground Services",145595,189232,230736,null,183000,320000,195000,341000]
[5160,"Maintenance of Line Transformers",107605,112303,102204,null,107000,180000,124000,215000]
[5165,"Maintenance of Street Lighting and Signal Systems"]
[5170,"Sentinel Lights - Labour",185,817,3208]
[5172,"Sentinel Lights - Materials and Expenses",null,7910]
[5175,"Maintenance of Meters",62772,54668,59217,null,60000,60000,60000,60000]
[5178,"Customer Installations Expenses - Leased Property"]
[5195,"Maintenance of Other Installations on Customer Premises",null,796,1394]
["Total - Maintenance",null,{"$f":"SUM(C43:C60)","v":1452469},{"$f":"SUM(D43:D60)","v":1236425},{"$f":"SUM(E43:E60)","v":1217086},{"$f":"SUM(F43:F60)","v":0},1427000,2060000,{"$f":"SUM(I43:I60)","v":1558000},{"$f":"SUM(J43:J60)","v":2298000}]
["Account","Description",{"$f":"C41","v":"Last Rebasing Year (2009 Actuals)"},{"$f":"D41","v":"2010 Actual"},{"$f":"E41","v":"2011 Actual² CGAAP"},{"$f":"F41","v":"2011 Actual²"},"Bridge Year 2012³ CGAAP","Bridge Year 2012³ IFRS",{"$f":"I41","v":"Test Year 2013 CGAAP"},{"$f":"J41","v":"Test Year 2013 IFRS"}]
["Billing and Collecting"]
[5305,"Supervision",13845,18611,16906,null,18000,18000,18000,18000]
[5310,"Meter Reading Expense",272932,275348,272000,null,272000,272000,276000,276000]
[5315,"Customer Billing",367012,416168,367868,null,352000,352000,356000,356000]
[5320,"Collecting",365185,387666,398059,null,392000,392000,435000,435000]
[5325,"Collecting - Cash Over and Short"]
[5330,"Collection Charges",null,null,null,null,34000,34000,37000,37000]
[5335,"Bad Debt Expense",347206,67602,70517,null,62000,62000,69000,69000]
[5340,"Miscellaneous Customer Accounts Expenses"]
["Total - Billing and Collecting",null,{"$f":"SUM(C64:C71)","v":1366180},{"$f":"SUM(D64:D71)","v":1165395},{"$f":"SUM(E64:E71)","v":1125350},{"$f":"SUM(F64:F71)","v":0},1130000,1130000,{"$f":"SUM(I64:I71)","v":1191000},{"$f":"SUM(J64:J71)","v":1191000}]
["Account","Description",{"$f":"C62","v":"Last Rebasing Year (2009 Actuals)"},{"$f":"D62","v":"2010 Actual"},{"$f":"E62","v":"2011 Actual² CGAAP"},{"$f":"F62","v":"2011 Actual²"},"Bridge Year 2012³ CGAAP","Bridge Year 2012³ IFRS",{"$f":"I62","v":"Test Year 2013 CGAAP"},{"$f":"J62","v":"Test Year 2013 IFRS"}]
["Community Relations"]
[5405,"Supervision"]
[5410,"Community Relations - Sundry",null,null,null,null,25000,25000,25000,25000]
[5415,"Energy Conservation",null,350]
[5420,"Community Safety Program",10936,3286,12288,null,14000,14000,14000,14000]
[5425,"Miscellaneous Customer Service and Informational Expenses",3760,null,null,null,6000,6000,7000,7000]
[5505,"Supervision"]
[5510,"Demonstrating and Selling Expense"]
[5515,"Advertising Expenses"]
[5520,"Miscellaneous Sales Expense"]
["Total - Community Relations",null,{"$f":"SUM(C75:C83)","v":14696},{"$f":"SUM(D75:D83)","v":3636},{"$f":"SUM(E75:E83)","v":12288},{"$f":"SUM(F75:F83)","v":0},45000,45000,{"$f":"SUM(I75:I83)","v":46000},{"$f":"SUM(J75:J83)","v":46000}]
["Account","Description",{"$f":"C73","v":"Last Rebasing Year (2009 Actuals)"},{"$f":"D73","v":"2010 Actual"},{"$f":"E73","v":"2011 Actual² CGAAP"},{"$f":"F73","v":"2011 Actual²"},"Bridge Year 2012³ CGAAP","Bridge Year 2012³ IFRS",{"$f":"I73","v":"Test Year 2013 CGAAP"},{"$f":"J73","v":"Test Year 2013 IFRS"}]
["Administrative and General Expenses"]
[5605,"Executive Salaries and Expenses",343007,355289,421135,null,542000,542000,525000,525000]
[5610,"Management Salaries and Expenses",296653,345079,423368,null,408000,439000,373000,444000]
[5615,"General Administrative Salaries and Expenses",130243,150725,159152,null,120000,303000,136000,310000]
[5620,"Office Supplies and Expenses",280974,286317,315157,null,478000,499000,507000,507000]
[5625,"Administrative Expense Transferred - Credit"]
[5630,"Outside Services Employed",159276,194979,155412,null,248000,201000,161000,161000]
[5635,"Property Insurance",106444,101469,116789,null,122000,80000,105000,87000]
[5640,"Injuries and Damages",135," ",160000,null,1000,1000,1000,1000]
[5645,"OMERS Pensions and Benefits"]
[5646,"Employee Pensions and OPEB"]
[5647,"Employee Sick Leave"]
[5650,"Franchise Requirements"]
[5655,"Regulatory Expenses",85751,98974,116652,null,107000,107000,120000,120000]
[5660,"General Advertising Expenses",3040,13568,5771]
[5665,"Miscellaneous General Expenses",27690,37222,33812,null,37000,37000,37000,37000]
[5670,"Rent"]
[5672,"Lease Payment Charge"]
[5675,"Maintenance of General Plant",72243,92082,69211,null,85000,113000,85000,113000]
[5680,"Electrical Safety Authority Fees"]
[5681,"Special Purpose Charge Expense"]
[5685,"Independent Electricity System Operator Fees and Penalties"]
[5695,"OM&A Contra Account"]
[6205,"Donations"]
[6205,"Donations, Sub-account LEAP Funding",null,null,10500,null,10500,10500,12500,12500]
["Total - Administrative and General Expenses",null,{"$f":"SUM(C87:C110)","v":1505456},{"$f":"SUM(D87:D110)","v":1675704},1986959,0,2158500,2332500,2062500,{"$f":"SUM(J87:J110)","v":2317500}]
["Total OM&A",null,{"$f":"C40+C61+C72+C84+C111","v":4577470},{"$f":"D40+D61+D72+D84+D111","v":4294323},{"$f":"E40+E61+E72+E84+E111","v":4607019},{"$f":"F40+F61+F72+F84+F111","v":0},5049500,5936500,{"$f":"I40+I61+I72+I84+I111","v":5191500},{"$f":"J40+J61+J72+J84+J111","v":6292500}]
["Adjustments for non-recoverable items"]
[5681,"Special Purpose Charge Expense"]
[6205,"Donations1",12290,30504,{"$f":"20263-E110","v":9763}]
[]
[]
[]
["Total Recoverable OM&A",null,{"$f":"C112-SUM(C114:C118)","v":4565180},{"$f":"D112-SUM(D114:D118)","v":4263819},4597256,{"$f":"F112-SUM(F114:F118)","v":0},5049500,5936500,5191500,{"$f":"J112-SUM(J114:J118)","v":6292500}]
[]
["1 Account 6205 - Donations is generally non-recoverable.  However, the sub-account LEAP funding of account 6205 is generally recoverable."]
[]
["Note:"]
[1,"If it has been more than three years since the applicant last filed a cost of service application, additional years of historical actuals should be incorporated into the table, as necessary, to go back to the last cost of service application.  If the applicant last filed a cost of service application less than three years ago, a minimum of three years of actual information is required."]
[2,"If the applicant is adopting IFRS or an alternate accounting standard as of January 1, 2012 for financial reporting purposes, 2011 must be presented on both a CGAAP and MIFRS (or alternate accounting standard) basis."]
[3,"If the applicant is adopting IFRS or an alternate accounting standard as of January 1, 2013 for financial reporting purposes, 2012 must be presented on both a CGAAP and MIFRS (or alternate accounting standard) basis."]

{"sheet":"App.2-H_OM&A_Detailed_Analysis","index":27,"n_rows":128,"n_cols":9,"rows_kept":128,"cut":false,"hidden":false,"merged":[[126,1,126,8],[127,1,127,8],[112,0,112,1],[74,0,74,8],[86,0,86,8],[73,1,73,8],[85,1,85,8],[119,0,119,1],[113,0,113,1],[42,0,42,8],[63,0,63,8],[62,1,62,8],[72,0,72,1],[61,0,61,1],[41,1,41,8],[8,0,8,8],[9,0,9,8],[10,0,10,8],[40,0,40,1],[16,0,16,8],[13,0,14,0],[13,1,14,1],[13,2,14,2],[13,3,14,3],[13,4,14,4],[13,7,13,8],[13,5,13,6]]}
[null,null,null,null,null,null,null,"File Number:",{"$f":"'LDC Info'!$E$18","v":"EB2012-0176"}]
[null,null,null,null,null,null,null,"Exhibit:"]
[null,null,null,null,null,null,null,"Tab:"]
[null,null,null,null,null,null,null,"Schedule:"]
[null,null,null,null,null,null,null,"Page:"]
[]
[null,null,null,null,null,null,null,"Date:"]
[]
["Appendix 2-H"]
["OM&A Detailed Variance Analysis"]
["(excluding Depreciation and Amortization)"]
[]
[]
["Account","Description",{"$f":"\"Last Board-approved Rebasing Year (\"&'LDC Info'!E30&\" Year)\"","v":"Last Board-approved Rebasing Year (2009 Year)"},"Most Current Actuals               Year 2011",{"$f":"\"Test Year \" & 'LDC Info'!E28","v":"Test Year 2013"},"Test Year Versus Last Rebasing",null,"Test Year Versus Most Current Actuals"]
[null,null,null,null,null,"Variance ($)","Percentage Change (%)","Variance ($)","Percentage Change (%)"]
["Reporting Basis",null,"CGAAP","CGAAP","CGAAP"]
["Operations"]
[5005,"Operation Supervision and Engineering",null,{"$f":"'App.2-G_Detailed_OM&A_Expenses'!E17","v":0},{"$f":"'App.2-G_Detailed_OM&A_Expenses'!I17","v":0},{"$f":"E18-C18","v":0},{"$f":"IF(C18=0,\"\",(E18/C18)-1)","v":""},{"$f":"E18-D18","v":0},{"$f":"IF(D18=0,\"\",(E18/D18)-1)","v":""}]
[5010,"Load Dispatching",null,{"$f":"'App.2-G_Detailed_OM&A_Expenses'!E18","v":-77},{"$f":"'App.2-G_Detailed_OM&A_Expenses'!I18","v":0},{"$f":"E19-C19","v":0},{"$f":"IF(C19=0,\"\",(E19/C19)-1)","v":""},{"$f":"E19-D19","v":77},{"$f":"IF(D19=0,\"\",(E19/D19)-1)","v":-1}]
[5012,"Station Buildings and Fixtures Expense",null,{"$f":"'App.2-G_Detailed_OM&A_Expenses'!E19","v":0},{"$f":"'App.2-G_Detailed_OM&A_Expenses'!I19","v":0},0,"",0,""]
[5014,"Transformer Station Equipment - Operation Labour",null,{"$f":"'App.2-G_Detailed_OM&A_Expenses'!E20","v":0},{"$f":"'App.2-G_Detailed_OM&A_Expenses'!I20","v":0},0,"",0,""]
[5015,"Transformer Station Equipment - Operation Supplies and Expenses",null,{"$f":"'App.2-G_Detailed_OM&A_Expenses'!E21","v":0},{"$f":"'App.2-G_Detailed_OM&A_Expenses'!I21","v":0},0,"",0,""]
[5016,"Distribution Station Equipment - Operation Labour",null,{"$f":"'App.2-G_Detailed_OM&A_Expenses'!E22","v":520},{"$f":"'App.2-G_Detailed_OM&A_Expenses'!I22","v":0},0,"",-520,-1]
[5017,"Distribution Station Equipment - Operation Supplies and Expenses",null,{"$f":"'App.2-G_Detailed_OM&A_Expenses'!E23","v":0},{"$f":"'App.2-G_Detailed_OM&A_Expenses'!I23","v":0},0,"",0,""]
[5020,"Overhead Distribution Lines and Feeders - Operation Labour",null,{"$f":"'App.2-G_Detailed_OM&A_Expenses'!E24","v":-1945},{"$f":"'App.2-G_Detailed_OM&A_Expenses'!I24","v":0},0,"",1945,-1]
[5025,"Overhead Distribution Lines and Feeders - Operation Supplies and Expenses",null,{"$f":"'App.2-G_Detailed_OM&A_Expenses'!E25","v":0},{"$f":"'App.2-G_Detailed_OM&A_Expenses'!I25","v":0},0,"",0,""]
[5030,"Overhead Sub-transmission Feeders - Operation",null,{"$f":"'App.2-G_Detailed_OM&A_Expenses'!E26","v":0},{"$f":"'App.2-G_Detailed_OM&A_Expenses'!I26","v":0},0,"",0,""]
[5035,"Overhead Distribution Transformers - Operation",null,{"$f":"'App.2-G_Detailed_OM&A_Expenses'!E27","v":0},{"$f":"'App.2-G_Detailed_OM&A_Expenses'!I27","v":0},0,"",0,""]
[5040,"Underground Distribution Lines and Feeders - Operation Labour",469400,{"$f":"'App.2-G_Detailed_OM&A_Expenses'!E28","v":193401},{"$f":"'App.2-G_Detailed_OM&A_Expenses'!I28","v":216000},-253400,-0.53983809118023007,22599,0.11685048164177014]
[5045,"Underground Distribution Lines and Feeders - Operation Supplies and Expenses",10000,{"$f":"'App.2-G_Detailed_OM&A_Expenses'!E29","v":0},{"$f":"'App.2-G_Detailed_OM&A_Expenses'!I29","v":0},-10000,-1,0,""]
[5050,"Underground Sub-transmission Feeders - Operation",null,{"$f":"'App.2-G_Detailed_OM&A_Expenses'!E30","v":0},{"$f":"'App.2-G_Detailed_OM&A_Expenses'!I30","v":0},0,"",0,""]
[5055,"Underground Distribution Transformers - Operation",null,{"$f":"'App.2-G_Detailed_OM&A_Expenses'!E31","v":0},{"$f":"'App.2-G_Detailed_OM&A_Expenses'!I31","v":0},0,"",0,""]
[5060,"Street Lighting and Signal System Expense",null,{"$f":"'App.2-G_Detailed_OM&A_Expenses'!E32","v":0},{"$f":"'App.2-G_Detailed_OM&A_Expenses'!I32","v":0},0,"",0,""]
[5065,"Meter Expense",null,{"$f":"'App.2-G_Detailed_OM&A_Expenses'!E33","v":71983},{"$f":"'App.2-G_Detailed_OM&A_Expenses'!I33","v":113000},113000,"",41017,0.5698150952308183]
[5070,"Customer Premises - Operation Labour",null,{"$f":"'App.2-G_Detailed_OM&A_Expenses'!E34","v":0},{"$f":"'App.2-G_Detailed_OM&A_Expenses'!I34","v":0},0,"",0,""]
[5075,"Customer Premises - Operation Materials and Expenses",1000,{"$f":"'App.2-G_Detailed_OM&A_Expenses'!E35","v":0},{"$f":"'App.2-G_Detailed_OM&A_Expenses'!I35","v":0},-1000,-1,0,""]
[5085,"Miscellaneous Distribution Expenses",null,{"$f":"'App.2-G_Detailed_OM&A_Expenses'!E36","v":1454},{"$f":"'App.2-G_Detailed_OM&A_Expenses'!I36","v":5000},5000,"",3546,2.4387895460797799]
[5090,"Underground Distribution Lines and Feeders - Rental Paid",null,{"$f":"'App.2-G_Detailed_OM&A_Expenses'!E37","v":0},{"$f":"'App.2-G_Detailed_OM&A_Expenses'!I37","v":0},0,"",0,""]
[5095,"Overhead Distribution Lines and Feeders - Rental Paid",null,{"$f":"'App.2-G_Detailed_OM&A_Expenses'!E38","v":0},{"$f":"'App.2-G_Detailed_OM&A_Expenses'!I38","v":0},0,"",0,""]
[5096,"Other Rent",null,{"$f":"'App.2-G_Detailed_OM&A_Expenses'!E39","v":0},{"$f":"'App.2-G_Detailed_OM&A_Expenses'!I39","v":0},0,"",0,""]
["Total - Operations",null,{"$f":"SUM(C18:C40)","v":480400},{"$f":"SUM(D18:D40)","v":265336},{"$f":"SUM(E18:E40)","v":334000},-146400,-0.30474604496253122,68664,0.25878131878071575]
["Account","Description"]
["Maintenance"]
[5105,"Maintenance Supervision and Engineering",16775,{"$f":"'App.2-G_Detailed_OM&A_Expenses'!E43","v":16906},{"$f":"'App.2-G_Detailed_OM&A_Expenses'!I43","v":18000},{"$f":"E44-C44","v":1225},{"$f":"IF(C44=0,\"\",(E44/C44)-1)","v":7.3025335320417328E-2},{"$f":"E44-D44","v":1094},{"$f":"IF(D44=0,\"\",(E44/D44)-1)","v":6.4710753578611113E-2}]
[5110,"Maintenance of Buildings and Fixtures - Distribution Stations",25900,{"$f":"'App.2-G_Detailed_OM&A_Expenses'!E44","v":5573},{"$f":"'App.2-G_Detailed_OM&A_Expenses'!I44","v":0},-25900,-1,-5573,-1]
[5112,"Maintenance of Transformer Station Equipment",null,{"$f":"'App.2-G_Detailed_OM&A_Expenses'!E45","v":0},{"$f":"'App.2-G_Detailed_OM&A_Expenses'!I45","v":0},0,"",0,""]
[5114,"Maintenance of Distribution Station Equipment",246800,{"$f":"'App.2-G_Detailed_OM&A_Expenses'!E46","v":270915},{"$f":"'App.2-G_Detailed_OM&A_Expenses'!I46","v":222000},-24800,-0.10048622366288495,-48915,-0.18055478655666901]
[5120,"Maintenance of Poles, Towers and Fixtures",77400,{"$f":"'App.2-G_Detailed_OM&A_Expenses'!E47","v":75811},{"$f":"'App.2-G_Detailed_OM&A_Expenses'!I47","v":146000},68600,0.88630490956072361,70189,0.92584189629473301]
[5125,"Maintenance of Overhead Conductors and Devices",131200,{"$f":"'App.2-G_Detailed_OM&A_Expenses'!E48","v":197254},{"$f":"'App.2-G_Detailed_OM&A_Expenses'!I48","v":141000},9800,7.4695121951219523E-2,-56254,-0.28518559826416701]
[5130,"Maintenance of Overhead Services",106600,{"$f":"'App.2-G_Detailed_OM&A_Expenses'!E49","v":81891},{"$f":"'App.2-G_Detailed_OM&A_Expenses'!I49","v":134000},27400,0.25703564727954964,52109,0.63632145168577736]
[5135,"Overhead Distribution Lines and Feeders - Right of Way",240900,{"$f":"'App.2-G_Detailed_OM&A_Expenses'!E50","v":132971},{"$f":"'App.2-G_Detailed_OM&A_Expenses'!I50","v":447000},206100,0.85554171855541727,314029,2.3616352437749586]
[5145,"Maintenance of Underground Conduit",0,{"$f":"'App.2-G_Detailed_OM&A_Expenses'!E51","v":39006},{"$f":"'App.2-G_Detailed_OM&A_Expenses'!I51","v":71000},71000,"",31994,0.82023278469978989]
[5150,"Maintenance of Underground Conductors and Devices",null,{"$f":"'App.2-G_Detailed_OM&A_Expenses'!E52","v":0},{"$f":"'App.2-G_Detailed_OM&A_Expenses'!I52","v":0},0,"",0,""]
[5155,"Maintenance of Underground Services",112000,{"$f":"'App.2-G_Detailed_OM&A_Expenses'!E53","v":230736},{"$f":"'App.2-G_Detailed_OM&A_Expenses'!I53","v":195000},83000,0.7410714285714286,-35736,-0.15487830247555645]
[5160,"Maintenance of Line Transformers",108000,{"$f":"'App.2-G_Detailed_OM&A_Expenses'!E54","v":102204},{"$f":"'App.2-G_Detailed_OM&A_Expenses'!I54","v":124000},16000,0.14814814814814814,21796,0.21325975499980432]
[5165,"Maintenance of Street Lighting and Signal Systems",null,{"$f":"'App.2-G_Detailed_OM&A_Expenses'!E55","v":0},{"$f":"'App.2-G_Detailed_OM&A_Expenses'!I55","v":0},0,"",0,""]
[5170,"Sentinel Lights - Labour",null,{"$f":"'App.2-G_Detailed_OM&A_Expenses'!E56","v":3208},{"$f":"'App.2-G_Detailed_OM&A_Expenses'!I56","v":0},0,"",-3208,-1]
[5172,"Sentinel Lights - Materials and Expenses",null,{"$f":"'App.2-G_Detailed_OM&A_Expenses'!E57","v":0},{"$f":"'App.2-G_Detailed_OM&A_Expenses'!I57","v":0},0,"",0,""]
[5175,"Maintenance of Meters",95000,{"$f":"'App.2-G_Detailed_OM&A_Expenses'!E58","v":59217},{"$f":"'App.2-G_Detailed_OM&A_Expenses'!I58","v":60000},-35000,-0.36842105263157898,783,1.3222554334059389E-2]
[5178,"Customer Installations Expenses - Leased Property",null,{"$f":"'App.2-G_Detailed_OM&A_Expenses'!E59","v":0},{"$f":"'App.2-G_Detailed_OM&A_Expenses'!I59","v":0},0,"",0,""]
[5195,"Maintenance of Other Installations on Customer Premises",null,{"$f":"'App.2-G_Detailed_OM&A_Expenses'!E60","v":1394},{"$f":"'App.2-G_Detailed_OM&A_Expenses'!I60","v":0},0,"",-1394,-1]
["Total - Maintenance",null,{"$f":"SUM(C44:C61)","v":1160575},{"$f":"SUM(D44:D61)","v":1217086},{"$f":"SUM(E44:E61)","v":1558000},397425,0.34243801563879983,340914,0.28010674677056513]
["Account","Description"]
["Billing and Collecting"]
[5305,"Supervision",16775,{"$f":"'App.2-G_Detailed_OM&A_Expenses'!E64","v":16906},{"$f":"'App.2-G_Detailed_OM&A_Expenses'!I64","v":18000},{"$f":"E65-C65","v":1225},{"$f":"IF(C65=0,\"\",(E65/C65)-1)","v":7.3025335320417328E-2},{"$f":"E65-D65","v":1094},{"$f":"IF(D65=0,\"\",(E65/D65)-1)","v":6.4710753578611113E-2}]
[5310,"Meter Reading Expense",272000,{"$f":"'App.2-G_Detailed_OM&A_Expenses'!E65","v":272000},{"$f":"'App.2-G_Detailed_OM&A_Expenses'!I65","v":276000},4000,1.4705882352941124E-2,4000,1.4705882352941124E-2]
[5315,"Customer Billing",387725,{"$f":"'App.2-G_Detailed_OM&A_Expenses'!E66","v":367868},{"$f":"'App.2-G_Detailed_OM&A_Expenses'!I66","v":356000},-31725,-8.1823457347346751E-2,-11868,-3.2261572085639401E-2]
[5320,"Collecting",416400,{"$f":"'App.2-G_Detailed_OM&A_Expenses'!E67","v":398059},{"$f":"'App.2-G_Detailed_OM&A_Expenses'!I67","v":435000},18600,4.4668587896253609E-2,36941,9.2802825711766346E-2]
[5325,"Collecting - Cash Over and Short",null,{"$f":"'App.2-G_Detailed_OM&A_Expenses'!E68","v":0},{"$f":"'App.2-G_Detailed_OM&A_Expenses'!I68","v":0},0,"",0,""]
[5330,"Collection Charges",null,{"$f":"'App.2-G_Detailed_OM&A_Expenses'!E69","v":0},{"$f":"'App.2-G_Detailed_OM&A_Expenses'!I69","v":37000},37000,"",37000,""]
[5335,"Bad Debt Expense",150000,{"$f":"'App.2-G_Detailed_OM&A_Expenses'!E70","v":70517},{"$f":"'App.2-G_Detailed_OM&A_Expenses'!I70","v":69000},-81000,-0.54,-1517,-2.1512543074719614E-2]
[5340,"Miscellaneous Customer Accounts Expenses",null,{"$f":"'App.2-G_Detailed_OM&A_Expenses'!E71","v":0},{"$f":"'App.2-G_Detailed_OM&A_Expenses'!I71","v":0},0,"",0,""]
["Total - Billing and Collecting",null,{"$f":"SUM(C65:C72)","v":1242900},{"$f":"SUM(D65:D72)","v":1125350},{"$f":"SUM(E65:E72)","v":1191000},-51900,-4.1757180786869408E-2,65650,5.8337406140311909E-2]
["Account","Description"]
["Community Relations"]
[5405,"Supervision",null,{"$f":"'App.2-G_Detailed_OM&A_Expenses'!E75","v":0},{"$f":"'App.2-G_Detailed_OM&A_Expenses'!I75","v":0},{"$f":"E76-C76","v":0},{"$f":"IF(C76=0,\"\",(E76/C76)-1)","v":""},{"$f":"E76-D76","v":0},{"$f":"IF(D76=0,\"\",(E76/D76)-1)","v":""}]
[5410,"Community Relations - Sundry",20500,{"$f":"'App.2-G_Detailed_OM&A_Expenses'!E76","v":0},{"$f":"'App.2-G_Detailed_OM&A_Expenses'!I76","v":25000},4500,0.21951219512195119,25000,""]
[5415,"Energy Conservation",0,{"$f":"'App.2-G_Detailed_OM&A_Expenses'!E77","v":0},{"$f":"'App.2-G_Detailed_OM&A_Expenses'!I77","v":0},0,"",0,""]
[5420,"Community Safety Program",15000,{"$f":"'App.2-G_Detailed_OM&A_Expenses'!E78","v":12288},{"$f":"'App.2-G_Detailed_OM&A_Expenses'!I78","v":14000},-1000,-6.6666666666666652E-2,1712,0.13932291666666674]
[5425,"Miscellaneous Customer Service and Informational Expenses",null,{"$f":"'App.2-G_Detailed_OM&A_Expenses'!E79","v":0},{"$f":"'App.2-G_Detailed_OM&A_Expenses'!I79","v":7000},7000,"",7000,""]
[5505,"Supervision",null,{"$f":"'App.2-G_Detailed_OM&A_Expenses'!E80","v":0},{"$f":"'App.2-G_Detailed_OM&A_Expenses'!I80","v":0},0,"",0,""]
[5510,"Demonstrating and Selling Expense",null,{"$f":"'App.2-G_Detailed_OM&A_Expenses'!E81","v":0},{"$f":"'App.2-G_Detailed_OM&A_Expenses'!I81","v":0},0,"",0,""]
[5515,"Advertising Expenses",null,{"$f":"'App.2-G_Detailed_OM&A_Expenses'!E82","v":0},{"$f":"'App.2-G_Detailed_OM&A_Expenses'!I82","v":0},0,"",0,""]
[5520,"Miscellaneous Sales Expense",null,{"$f":"'App.2-G_Detailed_OM&A_Expenses'!E83","v":0},{"$f":"'App.2-G_Detailed_OM&A_Expenses'!I83","v":0},0,"",0,""]
["Total - Community Relations",null,{"$f":"SUM(C76:C84)","v":35500},{"$f":"SUM(D76:D84)","v":12288},{"$f":"SUM(E76:E84)","v":46000},10500,0.29577464788732399,33712,2.7434895833333335]
["Account","Description"]
["Administrative and General Expenses"]
[5605,"Executive Salaries and Expenses",130000,{"$f":"'App.2-G_Detailed_OM&A_Expenses'!E87","v":421135},{"$f":"'App.2-G_Detailed_OM&A_Expenses'!I87","v":525000},{"$f":"E88-C88","v":395000},{"$f":"IF(C88=0,\"\",(E88/C88)-1)","v":3.0384615384615383},{"$f":"E88-D88","v":103865},{"$f":"IF(D88=0,\"\",(E88/D88)-1)","v":0.24663112778562701}]
[5610,"Management Salaries and Expenses",689400,{"$f":"'App.2-G_Detailed_OM&A_Expenses'!E88","v":423368},{"$f":"'App.2-G_Detailed_OM&A_Expenses'!I88","v":373000},-316400,-0.45894981143022917,-50368,-0.11896978515145218]
[5615,"General Administrative Salaries and Expenses",143300,{"$f":"'App.2-G_Detailed_OM&A_Expenses'!E89","v":159152},{"$f":"'App.2-G_Detailed_OM&A_Expenses'!I89","v":136000},-7300,-5.0942079553384478E-2,-23152,-0.14547099628028548]
[5620,"Office Supplies and Expenses",368650,{"$f":"'App.2-G_Detailed_OM&A_Expenses'!E90","v":315157},{"$f":"'App.2-G_Detailed_OM&A_Expenses'!I90","v":507000},138350,0.37528821375288213,191843,0.60872200204977212]
[5625,"Administrative Expense Transferred - Credit",null,{"$f":"'App.2-G_Detailed_OM&A_Expenses'!E91","v":0},{"$f":"'App.2-G_Detailed_OM&A_Expenses'!I91","v":0},0,"",0,""]
[5630,"Outside Services Employed",178500,{"$f":"'App.2-G_Detailed_OM&A_Expenses'!E92","v":155412},{"$f":"'App.2-G_Detailed_OM&A_Expenses'!I92","v":161000},-17500,-9.8039215686274495E-2,5588,3.5956039430674602E-2]
[5635,"Property Insurance",101125,{"$f":"'App.2-G_Detailed_OM&A_Expenses'!E93","v":116789},{"$f":"'App.2-G_Detailed_OM&A_Expenses'!I93","v":105000},3875,3.8318912237329972E-2,-11789,-0.10094272577040642]
[5640,"Injuries and Damages",2500,{"$f":"'App.2-G_Detailed_OM&A_Expenses'!E94","v":160000},{"$f":"'App.2-G_Detailed_OM&A_Expenses'!I94","v":1000},-1500,-0.6,-159000,-0.99375000000000002]
[5645,"OMERS Pensions and Benefits",null,{"$f":"'App.2-G_Detailed_OM&A_Expenses'!E95","v":0},{"$f":"'App.2-G_Detailed_OM&A_Expenses'!I95","v":0},0,"",0,""]
[5646,"Employee Pensions and OPEB",null,{"$f":"'App.2-G_Detailed_OM&A_Expenses'!E96","v":0},{"$f":"'App.2-G_Detailed_OM&A_Expenses'!I96","v":0},{"$f":"E97-C97","v":0},{"$f":"IF(C97=0,\"\",(E97/C97)-1)","v":""},{"$f":"E97-D97","v":0},{"$f":"IF(D97=0,\"\",(E97/D97)-1)","v":""}]
[5647,"Employee Sick Leave",null,{"$f":"'App.2-G_Detailed_OM&A_Expenses'!E97","v":0},{"$f":"'App.2-G_Detailed_OM&A_Expenses'!I97","v":0},0,"",0,""]
[5650,"Franchise Requirements",null,{"$f":"'App.2-G_Detailed_OM&A_Expenses'!E98","v":0},{"$f":"'App.2-G_Detailed_OM&A_Expenses'!I98","v":0},0,"",0,""]
[5655,"Regulatory Expenses",120000,{"$f":"'App.2-G_Detailed_OM&A_Expenses'!E99","v":116652},{"$f":"'App.2-G_Detailed_OM&A_Expenses'!I99","v":120000},0,0,3348,2.8700750951548226E-2]
[5660,"General Advertising Expenses",3000,{"$f":"'App.2-G_Detailed_OM&A_Expenses'!E100","v":5771},{"$f":"'App.2-G_Detailed_OM&A_Expenses'!I100","v":0},-3000,-1,-5771,-1]
[5665,"Miscellaneous General Expenses",33550,{"$f":"'App.2-G_Detailed_OM&A_Expenses'!E101","v":33812},{"$f":"'App.2-G_Detailed_OM&A_Expenses'!I101","v":37000},3450,0.10283159463487324,3188,9.428605228912823E-2]
[5670,"Rent",null,{"$f":"'App.2-G_Detailed_OM&A_Expenses'!E102","v":0},{"$f":"'App.2-G_Detailed_OM&A_Expenses'!I102","v":0},{"$f":"E103-C103","v":0},{"$f":"IF(C103=0,\"\",(E103/C103)-1)","v":""},{"$f":"E103-D103","v":0},""]
[5672,"Lease Payment Charge",null,{"$f":"'App.2-G_Detailed_OM&A_Expenses'!E103","v":0},{"$f":"'App.2-G_Detailed_OM&A_Expenses'!I103","v":0},0,"",0]
[5675,"Maintenance of General Plant",48325,{"$f":"'App.2-G_Detailed_OM&A_Expenses'!E104","v":69211},{"$f":"'App.2-G_Detailed_OM&A_Expenses'!I104","v":85000},36675,0.75892395240558708,15789,0.2281284766872318]
[5680,"Electrical Safety Authority Fees",null,{"$f":"'App.2-G_Detailed_OM&A_Expenses'!E105","v":0},{"$f":"'App.2-G_Detailed_OM&A_Expenses'!I105","v":0},0,"",0,""]
[5681,"Special Purpose Charge Expense",null,{"$f":"'App.2-G_Detailed_OM&A_Expenses'!E106","v":0},{"$f":"'App.2-G_Detailed_OM&A_Expenses'!I106","v":0},0,"",0]
[5685,"Independent Electricity System Operator Fees and Penalties",null,{"$f":"'App.2-G_Detailed_OM&A_Expenses'!E107","v":0},{"$f":"'App.2-G_Detailed_OM&A_Expenses'!I107","v":0},0,"",0,""]
[5695,"OM&A Contra Account",null,{"$f":"'App.2-G_Detailed_OM&A_Expenses'!E108","v":0},{"$f":"'App.2-G_Detailed_OM&A_Expenses'!I108","v":0},0,"",0,""]
[6205,"Donations",null,{"$f":"'App.2-G_Detailed_OM&A_Expenses'!E109","v":0},{"$f":"'App.2-G_Detailed_OM&A_Expenses'!I109","v":0},{"$f":"E110-C110","v":0},{"$f":"IF(C110=0,\"\",(E110/C110)-1)","v":""},{"$f":"E110-D110","v":0},{"$f":"IF(D110=0,\"\",(E110/D110)-1)","v":""}]
[6205,"Donations, Sub-account LEAP Funding",null,{"$f":"'App.2-G_Detailed_OM&A_Expenses'!E110","v":10500},{"$f":"'App.2-G_Detailed_OM&A_Expenses'!I110","v":12500},12500,"",2000,0.19047619047619047]
["Total - Administrative and General Expenses",null,{"$f":"SUM(C88:C111)","v":1818350},{"$f":"SUM(D88:D111)","v":1986959},{"$f":"SUM(E88:E111)","v":2062500},244150,0.13427008001759844,75541,3.8018398970486977E-2]
["Total OM&A",null,{"$f":"C112+C85+C73+C62+C41","v":4737725},{"$f":"D112+D85+D73+D62+D41","v":4607019},{"$f":"E112+E85+E73+E62+E41","v":5191500},453775,9.5779092285854572E-2,584481,0.12686750369382027]
["Adjustments for non-recoverable items"]
[5681,"Special Purpose Charge Expense",null,null,null,{"$f":"E115-C115","v":0},{"$f":"IF(C115=0,\"\",(E115/C115)-1)","v":""},{"$f":"E115-D115","v":0},{"$f":"IF(D115=0,\"\",(E115/D115)-1)","v":""}]
[6205,"Donations1",null,null,null,{"$f":"E116-C116","v":0},{"$f":"IF(C116=0,\"\",(E116/C116)-1)","v":""},{"$f":"E116-D116","v":0},{"$f":"IF(D116=0,\"\",(E116/D116)-1)","v":""}]
[null,null,null,null,null,{"$f":"E117-C117","v":0},{"$f":"IF(C117=0,\"\",(E117/C117)-1)","v":""},{"$f":"E117-D117","v":0},{"$f":"IF(D117=0,\"\",(E117/D117)-1)","v":""}]
[null,null,null,null,null,{"$f":"E118-C118","v":0},{"$f":"IF(C118=0,\"\",(E118/C118)-1)","v":""},{"$f":"E118-D118","v":0},{"$f":"IF(D118=0,\"\",(E118/D118)-1)","v":""}]
[null,null,null,null,null,{"$f":"E119-C119","v":0},{"$f":"IF(C119=0,\"\",(E119/C119)-1)","v":""},{"$f":"E119-D119","v":0},{"$f":"IF(D119=0,\"\",(E119/D119)-1)","v":""}]
["Total Recoverable OM&A",null,{"$f":"C113-SUM(C115:C119)","v":4737725},{"$f":"D113-SUM(D115:D119)","v":4607019},5191500,453775,{"$f":"IF(C120=0,\"\",(E120/C120)-1)","v":9.5779092285854572E-2},584481,{"$f":"IF(D120=0,\"\",(E120/D120)-1)","v":0.12686750369382027}]
[]
["1 Account 6205 - Donations is generally non-recoverable.  However, the sub-account LEAP funding of account 6205 is generally recoverable."]
[]
[]
["Note:"]
[]
[1,"If the applicant is adopting IFRS or an alternate accounting standard as of January 1, 2013 for financial reporting purposes, Column D \"Most Current Actual Year\" must be provided on CGAAP."]
[2,"If the applicant is adopting IFRS or an alternate accounting standard as of January 1, 2012 for financial reporting purposes, Column D \"Most Current Actual Year\" must be provided on that standard."]

{"sheet":"App.2-I_OM&A_Summary_Analys","index":28,"n_rows":64,"n_cols":12,"rows_kept":64,"cut":false,"hidden":false,"merged":[[66,1,67,5],[61,0,62,11],[8,0,8,6],[9,0,9,6],[12,7,12,8],[38,1,39,5]]}
[null,null,null,null,null,null,null,null,null,null,"File Number:",{"$f":"'LDC Info'!$E$18","v":"EB2012-0176"}]
[null,null,null,null,null,null,null,null,null,null,"Exhibit:"]
[null,null,null,null,null,null,null,null,null,null,"Tab:"]
[null,null,null,null,null,null,null,null,null,null,"Schedule:"]
[null,null,null,null,null,null,null,null,null,null,"Page:"]
[]
[null,null,null,null,null,null,null,null,null,null,"Date:"]
[]
["Appendix 2-I"]
["Summary of Recoverable OM&A Expenses"]
[]
[]
[null,{"$f":"\"Last Rebasing Year (\" & 'LDC Info'!E30 & \" BA)\"","v":"Last Rebasing Year (2009 BA)"},{"$f":"\"Last Rebasing Year (\" & 'LDC Info'!E30 & \" Actuals)\"","v":"Last Rebasing Year (2009 Actuals)"},{"$f":"'LDC Info'!E26 -2 & \" Actuals\"","v":"2010 Actuals"},{"$f":"'LDC Info'!E26 -1 & \" Actuals\"","v":"2011 Actuals"},{"$f":"'LDC Info'!E26 & \" Bridge Year\"","v":"2012 Bridge Year"},{"$f":"'LDC Info'!E28 & \" Test Year\"","v":"2013 Test Year"}]
["Reporting Basis","CGAAP","CGAAP","CGAAP","CGAAP","CGAAP","CGAAP"]
["Operations",{"$f":"'App.2-H_OM&A_Detailed_Analysis'!C41","v":480400},{"$f":"'App.2-G_Detailed_OM&A_Expenses'!C40","v":238669},{"$f":"'App.2-G_Detailed_OM&A_Expenses'!D40","v":213163},{"$f":"'App.2-G_Detailed_OM&A_Expenses'!E40","v":265336},{"$f":"'App.2-G_Detailed_OM&A_Expenses'!G40","v":289000},{"$f":"'App.2-G_Detailed_OM&A_Expenses'!I40","v":334000}]
["Maintenance",{"$f":"'App.2-H_OM&A_Detailed_Analysis'!C62","v":1160575},{"$f":"'App.2-G_Detailed_OM&A_Expenses'!C61","v":1452469},{"$f":"'App.2-G_Detailed_OM&A_Expenses'!D61","v":1236425},{"$f":"'App.2-G_Detailed_OM&A_Expenses'!E61","v":1217086},{"$f":"'App.2-G_Detailed_OM&A_Expenses'!G61","v":1427000},{"$f":"'App.2-G_Detailed_OM&A_Expenses'!I61","v":1558000}]
["SubTotal",{"$f":"SUM(B15:B16)","v":1640975},{"$f":"SUM(C15:C16)","v":1691138},1449588,1482422,1716000,1892000]
["%Change (year over year)",null,null,{"$f":"IF(ISERROR((D17-C17)/C17), \"\", (D17-C17)/C17)","v":-0.14283281435341172},{"$f":"IF(ISERROR((E17-D17)/D17), \"\", (E17-D17)/D17)","v":2.2650573818215933E-2},0.15756511978370533,0.10256410256410256]
["%Change (Test Year vs \nLast Rebasing Year - Actual)",null,null,null,null,null,{"$f":"IF(ISERROR((G17-C17)/C17), \"\", (G17-C17)/C17)","v":0.11877327574686394}]
["Billing and Collecting",{"$f":"'App.2-H_OM&A_Detailed_Analysis'!C73","v":1242900},{"$f":"'App.2-G_Detailed_OM&A_Expenses'!C72","v":1366180},{"$f":"'App.2-G_Detailed_OM&A_Expenses'!D72","v":1165395},{"$f":"'App.2-G_Detailed_OM&A_Expenses'!E72","v":1125350},{"$f":"'App.2-G_Detailed_OM&A_Expenses'!G72","v":1130000},{"$f":"'App.2-G_Detailed_OM&A_Expenses'!I72","v":1191000}]
["Community Relations",{"$f":"'App.2-H_OM&A_Detailed_Analysis'!C85","v":35500},{"$f":"'App.2-G_Detailed_OM&A_Expenses'!C84","v":14696},{"$f":"'App.2-G_Detailed_OM&A_Expenses'!D84","v":3636},{"$f":"'App.2-G_Detailed_OM&A_Expenses'!E84","v":12288},{"$f":"'App.2-G_Detailed_OM&A_Expenses'!G84","v":45000},{"$f":"'App.2-G_Detailed_OM&A_Expenses'!I84","v":46000}]
["Administrative and General",{"$f":"'App.2-H_OM&A_Detailed_Analysis'!C112","v":1818350},{"$f":"'App.2-G_Detailed_OM&A_Expenses'!C111","v":1505456},{"$f":"'App.2-G_Detailed_OM&A_Expenses'!D111","v":1675704},{"$f":"'App.2-G_Detailed_OM&A_Expenses'!E111","v":1986959},{"$f":"'App.2-G_Detailed_OM&A_Expenses'!G111","v":2158500},{"$f":"'App.2-G_Detailed_OM&A_Expenses'!I111","v":2062500}]
["SubTotal",{"$f":"SUM(B20:B22)","v":3096750},{"$f":"SUM(C20:C22)","v":2886332},2844735,3124597,3333500,3299500]
["%Change (year over year)",null,null,{"$f":"IF(ISERROR((D23-C23)/C23), \"\", (D23-C23)/C23)","v":-1.441171701661486E-2},{"$f":"IF(ISERROR((E23-D23)/D23), \"\", (E23-D23)/D23)","v":9.8378935120494532E-2},{"$f":"IF(ISERROR((F23-E23)/E23), \"\", (F23-E23)/E23)","v":6.6857581953768758E-2},{"$f":"IF(ISERROR((G23-F23)/F23), \"\", (G23-F23)/F23)","v":-1.0199490025498725E-2}]
["%Change (Test Year vs \nLast Rebasing Year - Actual)",null,null,null,null,null,{"$f":"IF(ISERROR((G23-C23)/C23), \"\", (G23-C23)/C23)","v":0.14314638787221984}]
["Total",{"$f":"SUM(B23,B17)","v":4737725},{"$f":"SUM(C23,C17)","v":4577470},4294323,4607019,5049500,5191500]
["%Change (year over year)",null,null,{"$f":"IF(ISERROR((D26-C26)/C26), \"\", (D26-C26)/C26)","v":-6.1856658809342276E-2},{"$f":"IF(ISERROR((E26-D26)/D26), \"\", (E26-D26)/D26)","v":7.2816134231169852E-2},{"$f":"IF(ISERROR((F26-E26)/E26), \"\", (F26-E26)/E26)","v":9.6044969643059863E-2},{"$f":"IF(ISERROR((G26-F26)/F26), \"\", (G26-F26)/F26)","v":2.8121596197643331E-2}]
[]
[]
[null,{"$f":"B13","v":"Last Rebasing Year (2009 BA)"},{"$f":"C13","v":"Last Rebasing Year (2009 Actuals)"},"2010 Actuals","2011 Actuals","2012 Bridge Year","2013 Test Year"]
["Operations",{"$f":"B15","v":480400},{"$f":"C15","v":238669},213163,265336,289000,334000]
["Maintenance",{"$f":"B16","v":1160575},{"$f":"C16","v":1452469},1236425,1217086,1427000,1558000]
["Billing and Collecting",{"$f":"B20","v":1242900},{"$f":"C20","v":1366180},1165395,1125350,1130000,1191000]
["Community Relations",{"$f":"B21","v":35500},{"$f":"C21","v":14696},3636,12288,45000,46000]
["Administrative and General",{"$f":"B22","v":1818350},{"$f":"C22","v":1505456},1675704,1986959,2158500,2062500]
["Total",{"$f":"SUM(B31:B35)","v":4737725},{"$f":"SUM(C31:C35)","v":4577470},4294323,4607019,5049500,5191500]
["%Change (year over year)",null,null,{"$f":"IF(ISERROR((D36-C36)/C36), \"\", (D36-C36)/C36)","v":-6.1856658809342276E-2},{"$f":"IF(ISERROR((E36-D36)/D36), \"\", (E36-D36)/D36)","v":7.2816134231169852E-2},{"$f":"IF(ISERROR((F36-E36)/E36), \"\", (F36-E36)/E36)","v":9.6044969643059863E-2},{"$f":"IF(ISERROR((G36-F36)/F36), \"\", (G36-F36)/F36)","v":2.8121596197643331E-2}]
[]
[]
[]
[]
[]
[]
[]
[null,{"$f":"B13","v":"Last Rebasing Year (2009 BA)"},{"$f":"C13","v":"Last Rebasing Year (2009 Actuals)"},{"$f":"\"Variance \" & 'LDC Info'!E30 & \"  BA – \" & 'LDC Info'!E30 & \" Actuals\"","v":"Variance 2009  BA – 2009 Actuals"},{"$f":"D13","v":"2010 Actuals"},{"$f":"\"Variance \" & 'LDC Info'!E26 -2 & \" Actuals vs. \" &  'LDC Info'!E30 & \" Actuals\"","v":"Variance 2010 Actuals vs. 2009 Actuals"},{"$f":"E13","v":"2011 Actuals"},{"$f":"\"Variance \" & 'LDC Info'!E26 -1 & \" Actuals vs. \" &  'LDC Info'!E26-2 & \" Actuals\"","v":"Variance 2011 Actuals vs. 2010 Actuals"},{"$f":"F13","v":"2012 Bridge Year"},{"$f":"\"Variance \" & 'LDC Info'!E26 & \" Bridge vs. \" & 'LDC Info'!E26 -1 & \" Actuals\"","v":"Variance 2012 Bridge vs. 2011 Actuals"},{"$f":"G13","v":"2013 Test Year"},{"$f":"\"Variance \" & 'LDC Info'!E28 & \" Test vs. \" & 'LDC Info'!E26 & \" Bridge\"","v":"Variance 2013 Test vs. 2012 Bridge"}]
["Operations",{"$f":"B15","v":480400},238669,{"$f":"B46-C46","v":241731},{"$f":"D15","v":213163},{"$f":"E46-C46","v":-25506},{"$f":"E15","v":265336},{"$f":"G46-E46","v":52173},{"$f":"F15","v":289000},{"$f":"I46-G46","v":23664},{"$f":"G15","v":334000},{"$f":"K46-I46","v":45000}]
["Maintenance ",1160575,1452469,{"$f":"B47-C47","v":-291894},{"$f":"D16","v":1236425},{"$f":"E47-C47","v":-216044},{"$f":"E16","v":1217086},{"$f":"G47-E47","v":-19339},{"$f":"F16","v":1427000},209914,{"$f":"G16","v":1558000},131000]
["Billing and Collecting ",{"$f":"B20","v":1242900},1366180,-123280,{"$f":"D20","v":1165395},-200785,{"$f":"E20","v":1125350},-40045,{"$f":"F20","v":1130000},4650,{"$f":"G20","v":1191000},61000]
["Community Relations ",35500,14696,20804,{"$f":"D21","v":3636},-11060,{"$f":"E21","v":12288},8652,{"$f":"F21","v":45000},32712,{"$f":"G21","v":46000},1000]
["Administrative and General ",1818350,1505456,312894,1675704,170248,1986959,311255,2158500,171541,2062500,-96000]
["Total OM&A Expenses ",{"$f":"SUM(B46:B50)","v":4737725},{"$f":"SUM(C46:C50)","v":4577470},160255,4294323,-283147,4607019,312696,5049500,442481,5191500,142000]
["Variance from previous year ",null,null,null,{"$f":"E51-C51","v":-283147},null,{"$f":"G51-E51","v":312696},null,{"$f":"I51-G51","v":442481},null,{"$f":"K51-I51","v":142000}]
["Percent change (year over year) ",null,null,null,{"$f":"IF(ISERROR(E52/C51), \"\", E52/C51)","v":-6.1856658809342276E-2},null,{"$f":"IF(ISERROR(G52/E51), \"\", G52/E51)","v":7.2816134231169852E-2},null,{"$f":"IF(ISERROR(I52/G51), \"\", I52/G51)","v":9.6044969643059863E-2},null,{"$f":"IF(ISERROR(K52/I51), \"\", K52/I51)","v":2.8121596197643331E-2}]
["Percent Change:                                                    Test year vs. Most Current Actual ",null,null,null,null,null,{"$f":"IF(ISERROR((K51-G51)/G51), \"\", (K51-G51)/G51)","v":0.12686750369382024}]
["Simple average of % variance for all years",null,null,null,null,null,{"$f":"IF(ISERROR((K51-C51)/C51), \"\", (K51-C51)/C51)","v":0.13414178574627469},null,null,null,null,{"$f":"IF(ISERROR(AVERAGE(E53,G53,I53,K53)), \"\", AVERAGE(E53,G53,I53,K53))","v":3.3781510315632687E-2}]
["Compound Annual Growth Rate for all years",null,null,null,null,null,{"$f":"IF(ISERROR((K52-C52)/C52), \"\", (K52-C52)/C52)","v":""},null,null,null,null,{"$f":"IF((K51-C51)=0, \"\", (K51/C51)^(1/4)-1)","v":3.1969443132234154E-2}]
[{"$f":"\"Compound Growth Rate                                                            (\" & E13 & \" vs. \" & 'LDC Info'!E30 & \" Actuals)\"","v":"Compound Growth Rate                                                            (2011 Actuals vs. 2009 Actuals)"},null,null,null,null,null,{"$f":"IF(ISERROR((G51/C51)^(1/(2010-2008)) - 1), \"\", (G51-C51)/C51)","v":6.4553126508748284E-3}]
[]
["Note:"]
[]
["1     \"BA\" = Board-Approved"]
["2     If it has been more than three years since the applicant last filed a cost of service application, additional years of historical actuals should be incorporated into the table, as necessary, to go back to the last cost of service application.  If the applicant last filed a cost of service application less than three years ago, a minimum of three years of actual information is required."]
[]
["3     Recoverable OM&A that is included on these tables should be identical to the recoverable OM&A that is shown for the corresponding periods on Appendix 2-H."]

{"sheet":"App.2-J_OM&A_Cost _Drivers","index":29,"n_rows":39,"n_cols":7,"rows_kept":39,"cut":false,"hidden":false,"merged":[[9,0,9,6],[10,0,10,6],[34,1,37,6],[38,1,39,6]]}
[null,null,null,null,null,"File Number:",{"$f":"'LDC Info'!$E$18","v":"EB2012-0176"}]
[null,null,null,null,null,"Exhibit:"]
[null,null,null,null,null,"Tab:"]
[null,null,null,null,null,"Schedule:"]
[null,null,null,null,null,"Page:"]
[]
[null,null,null,null,null,"Date:"]
[]
[]
["Appendix 2-J"]
["OM&A Cost Driver Table"]
[]
["OM&A",{"$f":"\"Last Rebasing Year (\" & 'LDC Info'!E30 & \" Actuals)\"","v":"Last Rebasing Year (2009 Actuals)"},"2009 Actuals",{"$f":"'LDC Info'!E26 -2 & \" Actuals\"","v":"2010 Actuals"},{"$f":"'LDC Info'!E26 -1 & \" Actuals\"","v":"2011 Actuals"},{"$f":"'LDC Info'!E26 & \" Bridge Year\"","v":"2012 Bridge Year"},{"$f":"'LDC Info'!E28 & \" Test Year\"","v":"2013 Test Year"}]
["Reporting Basis","CGAAP",null,"CGAAP","CGAAP","CGAAP","CGAAP"]
["Opening Balance",4737725,4577473,{"$f":"IF(ISERROR(FIND(\"2008\", $B$13)), B28, C28)","v":4577473},{"$f":"+D28","v":4294320},{"$f":"+E28","v":4607019},{"$f":"+F28","v":5049500}]
["UG Distribution Lines and Feeders",-286861]
["Mtnce of Distribution Stations",null,null,-159435,150505]
["Mtnce of OH Conductors and Devices",161981,null,-109493,null,-72254]
["OH Lines and Feeders (ROW)",69691,null,null,-145782,298029]
["Mtnce of OH & UG Services",null,null,60047]
["Collecting",-51215]
["Bad Debt Expense",197206,null,-279604]
["Salaries and Expenses included in OM&A",-192797,null,81190,152562,66850]
["Office Supplies and Expenses",-87676,null,null,null,162843]
["Outside Service - Employed",null,null,null,null,92588,-87000]
["Injuries and Damages",null,null,null,160000]
["Other",{"$f":"+B28-SUM(B15:B26)","v":29419},0,124142,-4586,-105575,229000]
["Closing Balance",4577473,4577473,4294320,4607019,5049500,5191500]
[]
["Notes:"]
[]
[1,"For each year, a detailed explanation for each cost driver and associated amount is"]
[null,"required."]
[2,"The closing balance for each year becomes the opening balance for the next year."]
[3,"If it has been more than three years since the applicant last filed a cost of service application, additional years of historical actuals should be incorporated into the table, as necessary, to go back to the last cost of service application.  If the applicant last filed a cost of service application less than three years ago, a minimum of three years of actual information is required."]
[]
[]
[]
[4,"Opening Balance for \"Last Rebasing Year\" (cell B15) should be equal to the Board-Approved amount."]

{"sheet":"App.2-K_Employee Costs","index":30,"n_rows":92,"n_cols":7,"rows_kept":92,"cut":false,"hidden":false,"merged":[[8,0,8,6],[13,0,13,6],[19,0,19,6],[25,0,25,6],[31,0,31,6],[37,0,37,6],[43,0,43,6],[9,0,9,6],[73,0,73,6],[79,0,79,6],[49,0,49,6],[55,0,55,6],[61,0,61,6],[67,0,67,6]]}
[null,null,null,null,null,"File Number:",{"$f":"'LDC Info'!$E$18","v":"EB2012-0176"}]
[null,null,null,null,null,"Exhibit:"]
[null,null,null,null,null,"Tab:"]
[null,null,null,null,null,"Schedule:"]
[null,null,null,null,null,"Page:"]
[]
[null,null,null,null,null,"Date:"]
[]
["Appendix 2-K"]
["Employee Costs"]
[]
[null,{"$f":"\"Last Rebasing Year (\" & 'LDC Info'!E30 & \" Board-Approved)\"","v":"Last Rebasing Year (2009 Board-Approved)"},{"$f":"\"Last Rebasing Year (\" & 'LDC Info'!E30 & \" Actuals)\"","v":"Last Rebasing Year (2009 Actuals)"},{"$f":"'LDC Info'!E26 -2 & \" Actuals\"","v":"2010 Actuals"},{"$f":"'LDC Info'!E26 -1 & \" Actuals\"","v":"2011 Actuals"},{"$f":"'LDC Info'!E26 & \" Bridge Year\"","v":"2012 Bridge Year"},{"$f":"'LDC Info'!E28 & \" Test Year\"","v":"2013 Test Year"}]
["Reporting Basis","CGAAP","CGAAP","CGAAP","CGAAP","MIFRS","MIFRS"]
["Number of Employees (FTEs including Part-Time)1"]
["Executive",10]
["Management",8,6.5,8,9,10,10]
["Non-Union"]
["Union",30,30.5,29,25,25,26]
["Total",{"$f":"SUM(B15:B18)","v":48},37,37,34,35,36]
["Number of Part-Time Employees"]
["Executive"]
["Management"]
["Non-Union"]
["Union"]
["Total",{"$f":"SUM(B21:B24)","v":0},0,0,0,0,0]
["Total Salary and Wages"]
["Executive"]
["Management",null,709268,774942,947806,1001627,1035133]
["Non-Union"]
["Union",null,1893975,1677232,1496630,1460874,1573067]
["Total",{"$f":"SUM(B27:B30)","v":0},2603243,2452174,2444436,2462501,2608200]
["Current Benefits"]
["Executive"]
["Management",null,133805,156760,192918,245864,244009]
["Non-Union"]
["Union",null,390120,388003,346338,378525,411707]
["Total",{"$f":"SUM(B33:B36)","v":0},523925,544763,539256,624389,655716]
["Accrued Pension and Post-Retirement Benefits"]
["Executive"]
["Management",null,-773,791,-773,-342,-383]
["Non-Union",null,-7473,7651,-7984,-3532,-3947]
["Union",null,-3865,3957,-2833,-1253,-1403]
["Total",{"$f":"SUM(B39:B42)","v":0},-12111,12399,-11590,-5127,-5733]
["Total Benefits (Current + Accrued)"]
["Executive",{"$f":"B33+B39","v":0},0,0,0,0,0]
["Management",0,133032,157551,192145,245522,243626]
["Non-Union",0,-7473,7651,-7984,-3532,-3947]
["Union",0,386255,391960,343505,377272,410304]
["Total",0,511814,557162,527666,619262,649983]
["Total Compensation (Salary, Wages, & Benefits)"]
["Executive",{"$f":"B27+B45","v":0},0,0,0,0,0]
["Management",0,842300,932493,1139951,1247149,1278759]
["Non-Union",0,-7473,7651,-7984,-3532,-3947]
["Union",0,2280230,2069192,1840135,1838146,1983371]
["Total",0,3115057,3009336,2972102,3081763,3258183]
["Compensation - Average Yearly Base Wages"]
["Executive",26246]
["Management",82788,82222,82395,87572,100163,{"$f":"+G28/G16","v":103513.3}]
["Non-Union"]
["Union",53321,52421,52812,54803,58435,{"$f":"+G30/G18","v":60502.576923076922}]
["Total"]
["Compensation - Average Yearly Overtime"]
["Executive"]
["Management",5474,8208,1854,7036,2400,2400]
["Non-Union"]
["Union",8240,8705,3659,4197,3000,3000]
["Total",null,null,null,null,"."]
["Compensation - Average Yearly Incentive Pay"]
["Executive",4501]
["Management",4925,7372,10233,6800,8000,8000]
["Non-Union"]
["Union"]
["Total"]
["Compensation - Average Yearly Benefits"]
["Executive",2503]
["Management",12903,20585,19595,21435,24586,24401]
["Non-Union"]
["Union",9015,12791,13379,13854,15141,15835]
["Total"]
[]
["Total Compensation",{"$f":"SUM(B51:B54)","v":0},3115057,3009336,2972102,3081763,3258183]
["Total Compensation Capitalized (CGAAP)",null,1199688,933294,1087684,1290843]
["Total Compensation Charged to OM&A (CGAAP)",{"$f":"B81-B82","v":0},{"$f":"C81-C82","v":1915369},{"$f":"D81-D82","v":2076042},{"$f":"E81-E82","v":1884418},{"$f":"F81-F82","v":1790920}]
[]
["Total Compensation Capitalized (MIFRS)",null,null,null,null,784502,813279]
["Total Compensation Charged to OM&A (MIFRS)",null,null,null,{"$f":"E81-E85","v":2972102},{"$f":"F81-F85","v":2297261},{"$f":"G81-G85","v":2444904}]
[]
[]
["1 If an applicant wishes to use headcount, it must also file the same schedule on an FTE basis."]
[]
["Note:"]
["1   Please report compensation on a CGAAP and MIFRS basis for your transition year."]

{"sheet":"App.2-L_OM&A_per_Cust_FTEE","index":31,"n_rows":29,"n_cols":8,"rows_kept":29,"cut":false,"hidden":false,"merged":[[8,0,8,7],[9,0,9,7],[28,1,29,6],[22,1,25,6],[26,1,26,6],[27,1,27,6],[15,0,15,1],[16,0,16,1],[17,0,17,1],[18,0,18,1],[13,0,13,1],[14,0,14,1],[12,0,12,1]]}
[null,null,null,null,null,null,"File Number:",{"$f":"'LDC Info'!$E$18","v":"EB2012-0176"}]
[null,null,null,null,null,null,"Exhibit:"]
[null,null,null,null,null,null,"Tab:"]
[null,null,null,null,null,null,"Schedule:"]
[null,null,null,null,null,null,"Page:"]
[]
[null,null,null,null,null,null,"Date:"]
[]
["Appendix 2-L"]
["Recoverable OM&A Cost per Customer and per FTEE"]
[]
[null,null,{"$f":"\"Last Rebasing Year (\" & 'LDC Info'!E30 & \" Board-Approved)\"","v":"Last Rebasing Year (2009 Board-Approved)"},{"$f":"\"Last Rebasing Year (\" & 'LDC Info'!E30 & \" Actuals)\"","v":"Last Rebasing Year (2009 Actuals)"},{"$f":"'LDC Info'!E26 -2 & \" Actuals\"","v":"2010 Actuals"},{"$f":"'LDC Info'!E26 -1 & \" Actuals\"","v":"2011 Actuals"},{"$f":"'LDC Info'!E26 & \" Bridge Year\"","v":"2012 Bridge Year"},{"$f":"'LDC Info'!E28 & \" Test Year\"","v":"2013 Test Year"}]
["Reporting Basis",null,"CGAAP","CGAAP","CGAAP","CGAAP","CGAAP","CGAAP"]
["Number of Customers",null,21572,21720,21999,22293,22589,22876]
["Total Recoverable OM&A from Appendix 2-I",null,{"$f":"'App.2-I_OM&A_Summary_Analys'!B36","v":4737725},{"$f":"'App.2-I_OM&A_Summary_Analys'!C36","v":4577470},{"$f":"'App.2-I_OM&A_Summary_Analys'!D36","v":4294323},{"$f":"'App.2-I_OM&A_Summary_Analys'!E36","v":4607019},{"$f":"'App.2-I_OM&A_Summary_Analys'!F36","v":5049500},{"$f":"'App.2-I_OM&A_Summary_Analys'!G36","v":5191500}]
["OM&A cost per customer",null,{"$f":"IF(C14=0,\"\",C15/C14)","v":219.62381791210828},210.74907918968694,195.20537297149872,206.65765038352845,223.53800522378148,226.94089875852421]
["Number of FTEEs",null,48,37,37,34,35,36]
["Customers/FTEEs",null,{"$f":"IF(C17=0,\"\",C14/C17)","v":449.41666666666669},587.02702702702697,594.56756756756761,655.67647058823525,645.4,635.44444444444446]
["OM&A Cost per FTEE",null,{"$f":"IF(C17=0,\"\",C15/C17)","v":98702.604166666672},123715.4054054054,116062.78378378379,135500.5588235294,144271.42857142858,144208.33333333334]
[]
["Notes:"]
[]
[1,"If it has been more than three years since the applicant last filed a cost of service application, additional years of historical actuals should be incorporated into the table, as necessary, to go back to the last cost of service application.  If the applicant last filed a cost of service application less than three years ago, a minimum of three years of actual information is required."]
[]
[]
[]
[2,"The method of calculating the number of customers must be identified."]
[3,"The method of calculating the number of FTEEs must be identified.  See also Appendix 2-K"]
[4,"The number of customers and the number of FTEEs should correspond to mid-year or average of January 1 and December 31 figures."]

{"sheet":"App.2-M_Regulatory_Costs","index":32,"n_rows":46,"n_cols":11,"rows_kept":46,"cut":false,"hidden":false,"merged":[[12,0,12,1],[13,0,13,1],[8,0,8,10],[9,0,9,10]]}
[null,null,null,null,null,null,null,null,null,"File Number:",{"$f":"'LDC Info'!$E$18","v":"EB2012-0176"}]
[null,null,null,null,null,null,null,null,null,"Exhibit:"]
[null,null,null,null,null,null,null,null,null,"Tab:"]
[null,null,null,null,null,null,null,null,null,"Schedule:"]
[null,null,null,null,null,null,null,null,null,"Page:"]
[]
[null,null,null,null,null,null,null,null,null,"Date:"]
[]
["Appendix 2-M"]
["Regulatory Cost Schedule"]
[]
[]
["Regulatory Cost Category",null,"USoA Account","USoA Account Balance","Ongoing or One-time Cost? 2",{"$f":"\"Last Rebasing Year (\" & 'LDC Info'!E30 & \" Board Approved)\"","v":"Last Rebasing Year (2009 Board Approved)"},"Most Current Actuals               Year 2011",{"$f":"'LDC Info'!E26 & \" Bridge Year\"","v":"2012 Bridge Year"},"Annual % Change",{"$f":"'LDC Info'!E28 & \" Test Year\"","v":"2013 Test Year"},"Annual % Change"]
["(A)",null,"(B)","(C )","(D)","(E)","(F)","(G)","(H) = [(G)-(F)]/(F)","(I)","(J) = [(I)-(G)]/(G)"]
[1,"OEB Annual Assessment",5655,null,"On-Going",55170,56092,58878,{"$f":"IF(G15=0,\"\",(H15-G15)/G15)","v":4.9668401911145972E-2},60000,{"$f":"IF(H15=0,\"\",(J15-H15)/H15)","v":1.9056353816366046E-2}]
[2,"OEB Section 30 Costs (Applicant-originated)",null,null,"On-Going",73,109,581,{"$f":"IF(G16=0,\"\",(H16-G16)/G16)","v":4.330275229357798},null,{"$f":"IF(H16=0,\"\",(J16-H16)/H16)","v":-1}]
[3,"OEB Section 30 Costs (OEB-initiated)",null,null,"On-Going",1064,800,800,0,800,0]
[4,"Expert Witness costs for regulatory matters",null,null,"On-Going",null,null,null,"",null,""]
[5,"Legal costs for regulatory matters",null,null,"On-Time",3055,4583,4583,0,10000,1.181976871045167]
[6,"Consultants' costs for regulatory matters",null,null,"On-Time",19045,49768,30168,-0.39382735894550713,32500,7.730045080880403E-2]
[7,"Operating expenses associated with staff resources allocated to regulatory matters",null,null,null,null,null,null,"",null,""]
[8,"Operating expenses associated with other resources allocated to regulatory matters 1",null,null,null,null,null,null,"",null,""]
[9,"Other regulatory agency fees or assessments",null,null,null,null,null,null,"",null,""]
[10,"Any other costs for regulatory matters (please define)",null,null,"On-Going",1304,31,3856,123.38709677419355,3000,-0.22199170124481327]
[null,"Intervenor costs",null,null,"On-Going",6041,5269,8134,0.54374644144999051,6200,-0.23776739611507253]
[11,"Intervenor costs",null,null,"On-Time",null,null,null,"",7500,""]
[12,"Sub-total - Ongoing Costs 3",null,{"$f":"SUMIF($E15:$E26,$E11,D15:D26)","v":0},null,{"$f":"+F15+F16+F17+F18+F24+F25","v":63652},{"$f":"+G15+G16+G17+G18+G24+G25","v":62301},72249,0.15967640968844801,{"$f":"+J15+J16+J17+J18+J24+J25","v":70000},-3.1128458525377514E-2]
[13,"Sub-total - One-time Costs 4",null,{"$f":"SUMIF($E15:$E26,$E12,D15:D26)","v":0},null,{"$f":"+F19+F20+F26","v":22100},{"$f":"+G19+G20+G26","v":54351},34751,-0.36061893985391252,{"$f":"+J19+J20+J26","v":50000},0.43880751633046533]
[14,"Total",null,{"$f":"D27+D28","v":0},null,{"$f":"F27+F28","v":85752},{"$f":"G27+G28","v":116652},{"$f":"H27+H28","v":107000},-8.2741830401536196E-2,{"$f":"J27+J28","v":120000},0.12149532710280374]
[]
[]
["1","Please identify the resources involved."]
["2","Where a category's costs include both one-time and ongoing costs, the applicant should prove a separate breakdown between one-time and ongoing costs."]
["3","Sum of all ongoing costs identified in rows 1 to 11 inclusive."]
["4","Sum of all one-time costs identified in rows 1 to 11 inclusive."]
[]
[]
["Please fill out the following table for all one-time costs related to this cost of service application"]
[]
[null,null,"Historical Year(s)",{"$f":"H13","v":"2012 Bridge Year"},{"$f":"J13","v":"2013 Test Year"}]
[4,"Expert Witness costs for regulatory matters",null,{"$f":"H18","v":0},{"$f":"J18","v":0}]
[5,"Legal costs for Regulatory Matters",null,null,{"$f":"+J19","v":10000}]
[6,"Consultants' costs for regulatory matters",null,0,{"$f":"J20","v":32500}]
[7,"Operating expenses associated with staff resources allocated to regulatory matters",null,{"$f":"H21","v":0},{"$f":"J21","v":0}]
[8,"Operating expenses associated with other resources allocated to regulatory matters 1",null,{"$f":"H22","v":0},{"$f":"J22","v":0}]
[11,"Intervenor costs",null,{"$f":"H26","v":0},{"$f":"J26","v":7500}]

{"sheet":"App.2-N_Corp_Cost_Allocation","index":33,"n_rows":43,"n_cols":7,"rows_kept":43,"cut":false,"hidden":false,"merged":[[15,6,16,6],[29,0,29,1],[29,2,31,2],[29,3,31,3],[29,5,30,5],[29,4,30,4],[30,0,31,0],[30,1,31,1],[27,0,27,5],[13,0,13,5],[8,0,8,5],[9,0,9,5],[42,1,43,5],[16,0,17,0],[16,1,17,1],[15,2,17,2],[15,3,17,3],[15,0,15,1],[15,4,16,4],[15,5,16,5]]}
[null,null,null,null,null,"File Number:",{"$f":"'LDC Info'!$E$18","v":"EB2012-0176"}]
[null,null,null,null,null,"Exhibit:"]
[null,null,null,null,null,"Tab:"]
[null,null,null,null,null,"Schedule:"]
[null,null,null,null,null,"Page:"]
[]
[null,null,null,null,null,"Date:"]
[]
["Appendix 2-N"]
["Shared Services and Corporate Cost Allocation"]
[]
[null,"Year:"]
[]
["Shared Services"]
[]
["Name of Company",null,"Service Offered","Pricing Methdology","Price for the Service","Cost for the Service"]
["From","To"]
[null,null,null,null,"$","$"]
[]
[]
[]
[]
[]
[]
[]
[]
[]
["Corporate Cost Allocation"]
[]
["Name of Company",null,"Service Offered","Pricing Methdology","% of Corporate Costs Allocated","Amount Allocated"]
["From","To"]
[null,null,null,null,"%","$"]
["eg: parent company","eg: regulated entity"]
[]
[]
[]
[]
[]
[]
[]
[]
["Note: "]
[1,"This appendix must be completed in relation to each service provided or received for the Historical (actuals), Bridge and Test years."]

{"sheet":"App.2-OA Capital StructureA2009","index":34,"n_rows":35,"n_cols":15,"rows_kept":35,"cut":false,"hidden":false,"merged":[[18,2,18,14],[9,2,9,14],[10,2,10,14],[12,0,12,14],[14,0,15,0],[15,4,15,8],[39,2,39,14],[40,2,40,14],[33,0,33,14],[34,2,34,14],[35,2,35,14],[36,2,36,14],[37,2,37,14],[38,2,38,14]]}
[null,null,null,null,null,null,null,null,null,null,"File Number:",null,null,null,{"$f":"'LDC Info'!$E$18","v":"EB2012-0176"}]
[null,null,null,null,null,null,null,null,null,null,"Exhibit:"]
[null,null,null,null,null,null,null,null,null,null,"Tab:"]
[null,null,null,null,null,null,null,null,null,null,"Schedule:"]
[null,null,null,null,null,null,null,null,null,null,"Page:"]
[]
[null,null,null,null,null,null,null,null,null,null,"Date:"]
[]
[]
[null,null,"Appendix 2-OA"]
[null,null,"2009 Board Approved Capital Structure and Cost of Capital"]
[]
["This table must be completed for the required years of all historical years, the bridge year and the test year."]
[]
["Line No."]
[null,null,"Particulars",null,"Capitalization Ratio",null,null,null,null,null,"Cost Rate",null,null,null,"Return"]
[]
[]
[null,null,"Application"]
[null,null,null,null,"(%)",null,null,null,"($)",null,"(%)",null,null,null,"($)"]
[null,null,"Debt"]
[1,null,"  Long-term Debt",null,0.52700000000000002,null,null,null,17901221,null,5.8200000000000002E-2,null,null,null,{"$f":"K22*I22","v":1041851.0622}]
[2,null,"  Short-term Debt",null,0.04,null,"(1)",null,1358726,null,1.3100000000000001E-2,null,null,null,{"$f":"K23*I23","v":17799.310600000001}]
[3,null,"Total Debt",null,{"$f":"SUM(E22:E23)","v":0.56700000000000006},null,null,null,{"$f":"SUM(I22:I23)","v":19259947},null,{"$f":"IF(E24=0,0,SUMPRODUCT(E22:E23,K22:K23)/E24)","v":5.5018342151675483E-2},null,null,null,{"$f":"SUM(O22:O23)","v":1059650.3728}]
[]
[null,null,"Equity"]
[4,null,"  Common Equity",null,0.433,null,null,null,14708214,null,8.0100000000000005E-2,null,null,null,{"$f":"K27*I27","v":1178127.9414000001}]
[5,null,"  Preferred Shares",null,null,null,null,null,{"$f":"$I$31*E28","v":0},null,null,null,null,null,{"$f":"K28*I28","v":0}]
[6,null,"Total Equity",null,{"$f":"SUM(E27:E28)","v":0.433},null,null,null,{"$f":"SUM(I27:I28)","v":14708214},null,{"$f":"IF(E29=0,0,SUMPRODUCT(E27:E28,K27:K28)/E29)","v":8.0100000000000005E-2},null,null,null,{"$f":"SUM(O27:O28)","v":1178127.9414000001}]
[]
[7,null,"Total",null,1,null,null,null,{"$f":"I27+I23+I22","v":33968161},null,{"$f":"(K24*E24)+(K29*E29)","v":6.5878699999999998E-2},null,null,null,{"$f":"O24+O29","v":2237778.3141999999}]
[]
[]
["Notes"]
["(1)",null,"4.0% unless an applicant has proposed or been approved for a different amount."]

{"sheet":"App.2-OA Capital Structure 2009","index":35,"n_rows":35,"n_cols":15,"rows_kept":35,"cut":false,"hidden":false,"merged":[[18,2,18,14],[9,2,9,14],[10,2,10,14],[12,0,12,14],[14,0,15,0],[15,4,15,8],[39,2,39,14],[40,2,40,14],[33,0,33,14],[34,2,34,14],[35,2,35,14],[36,2,36,14],[37,2,37,14],[38,2,38,14]]}
[null,null,null,null,null,null,null,null,null,null,"File Number:",null,null,null,{"$f":"'LDC Info'!$E$18","v":"EB2012-0176"}]
[null,null,null,null,null,null,null,null,null,null,"Exhibit:"]
[null,null,null,null,null,null,null,null,null,null,"Tab:"]
[null,null,null,null,null,null,null,null,null,null,"Schedule:"]
[null,null,null,null,null,null,null,null,null,null,"Page:"]
[]
[null,null,null,null,null,null,null,null,null,null,"Date:"]
[]
[]
[null,null,"Appendix 2-OA"]
[null,null,"2009 Capital Structure and Cost of Capital"]
[]
["This table must be completed for the required years of all historical years, the bridge year and the test year."]
[]
["Line No."]
[null,null,"Particulars",null,"Capitalization Ratio",null,null,null,null,null,"Cost Rate",null,null,null,"Return"]
[]
[]
[null,null,"Application"]
[null,null,null,null,"(%)",null,null,null,"($)",null,"(%)",null,null,null,"($)"]
[null,null,"Debt"]
[1,null,"  Long-term Debt",null,0.52700000000000002,null,null,null,17107363,null,5.8200000000000002E-2,null,null,null,{"$f":"K22*I22","v":995648.52659999998}]
[2,null,"  Short-term Debt",null,0.04,null,"(1)",null,1298472,null,1.3100000000000001E-2,null,null,null,{"$f":"K23*I23","v":17009.983200000002}]
[3,null,"Total Debt",null,{"$f":"SUM(E22:E23)","v":0.56700000000000006},null,null,null,{"$f":"SUM(I22:I23)","v":18405835},null,{"$f":"IF(E24=0,0,SUMPRODUCT(E22:E23,K22:K23)/E24)","v":5.5018342151675483E-2},null,null,null,{"$f":"SUM(O22:O23)","v":1012658.5098}]
[]
[null,null,"Equity"]
[4,null,"  Common Equity",null,0.433,null,null,null,14055955,null,8.0100000000000005E-2,null,null,null,{"$f":"K27*I27","v":1125881.9955}]
[5,null,"  Preferred Shares",null,null,null,null,null,{"$f":"$I$31*E28","v":0},null,null,null,null,null,{"$f":"K28*I28","v":0}]
[6,null,"Total Equity",null,{"$f":"SUM(E27:E28)","v":0.433},null,null,null,{"$f":"SUM(I27:I28)","v":14055955},null,{"$f":"IF(E29=0,0,SUMPRODUCT(E27:E28,K27:K28)/E29)","v":8.0100000000000005E-2},null,null,null,{"$f":"SUM(O27:O28)","v":1125881.9955}]
[]
[7,null,"Total",null,1,null,null,null,{"$f":"I27+I23+I22","v":32461790},null,{"$f":"(K24*E24)+(K29*E29)","v":6.5878699999999998E-2},null,null,null,{"$f":"O24+O29","v":2138540.5052999998}]
[]
[]
["Notes"]
["(1)",null,"4.0% unless an applicant has proposed or been approved for a different amount."]

{"sheet":"App.2-OA Capital Structure 2010","index":36,"n_rows":35,"n_cols":15,"rows_kept":35,"cut":false,"hidden":false,"merged":[[18,2,18,14],[9,2,9,14],[10,2,10,14],[12,0,12,14],[14,0,15,0],[15,4,15,8],[39,2,39,14],[40,2,40,14],[33,0,33,14],[34,2,34,14],[35,2,35,14],[36,2,36,14],[37,2,37,14],[38,2,38,14]]}
[null,null,null,null,null,null,null,null,null,null,"File Number:",null,null,null,{"$f":"'LDC Info'!$E$18","v":"EB2012-0176"}]
[null,null,null,null,null,null,null,null,null,null,"Exhibit:"]
[null,null,null,null,null,null,null,null,null,null,"Tab:"]
[null,null,null,null,null,null,null,null,null,null,"Schedule:"]
[null,null,null,null,null,null,null,null,null,null,"Page:"]
[]
[null,null,null,null,null,null,null,null,null,null,"Date:"]
[]
[]
[null,null,"Appendix 2-OA"]
[null,null,"2010 Capital Structure and Cost of Capital"]
[]
["This table must be completed for the required years of all historical years, the bridge year and the test year."]
[]
["Line No."]
[null,null,"Particulars",null,"Capitalization Ratio",null,null,null,null,null,"Cost Rate",null,null,null,"Return"]
[]
[]
[null,null,"Application"]
[null,null,null,null,"(%)",null,null,null,"($)",null,"(%)",null,null,null,"($)"]
[null,null,"Debt"]
[1,null,"  Long-term Debt",null,0.56000000000000005,null,null,null,18888581,null,5.8200000000000002E-2,null,null,null,{"$f":"K22*I22","v":1099315.4142}]
[2,null,"  Short-term Debt",null,0.04,null,"(1)",null,1349184,null,1.3100000000000001E-2,null,null,null,{"$f":"K23*I23","v":17674.310400000002}]
[3,null,"Total Debt",null,{"$f":"SUM(E22:E23)","v":0.60000000000000009},null,null,null,{"$f":"SUM(I22:I23)","v":20237765},null,{"$f":"IF(E24=0,0,SUMPRODUCT(E22:E23,K22:K23)/E24)","v":5.5193333333333323E-2},null,null,null,{"$f":"SUM(O22:O23)","v":1116989.7246000001}]
[]
[null,null,"Equity"]
[4,null,"  Common Equity",null,0.4,null,null,null,13491843,null,8.0100000000000005E-2,null,null,null,{"$f":"K27*I27","v":1080696.6243}]
[5,null,"  Preferred Shares",null,null,null,null,null,{"$f":"$I$31*E28","v":0},null,null,null,null,null,{"$f":"K28*I28","v":0}]
[6,null,"Total Equity",null,{"$f":"SUM(E27:E28)","v":0.4},null,null,null,{"$f":"SUM(I27:I28)","v":13491843},null,{"$f":"IF(E29=0,0,SUMPRODUCT(E27:E28,K27:K28)/E29)","v":8.0100000000000005E-2},null,null,null,{"$f":"SUM(O27:O28)","v":1080696.6243}]
[]
[7,null,"Total",null,1,null,null,null,{"$f":"I27+I23+I22","v":33729608},null,{"$f":"(K24*E24)+(K29*E29)","v":6.5156000000000006E-2},null,null,null,{"$f":"O24+O29","v":2197686.3489000001}]
[]
[]
["Notes"]
["(1)",null,"4.0% unless an applicant has proposed or been approved for a different amount."]

{"sheet":"App.2-OA Capital Structure 2011","index":37,"n_rows":35,"n_cols":15,"rows_kept":35,"cut":false,"hidden":false,"merged":[[18,2,18,14],[9,2,9,14],[10,2,10,14],[12,0,12,14],[14,0,15,0],[15,4,15,8],[39,2,39,14],[40,2,40,14],[33,0,33,14],[34,2,34,14],[35,2,35,14],[36,2,36,14],[37,2,37,14],[38,2,38,14]]}
[null,null,null,null,null,null,null,null,null,null,"File Number:",null,null,null,{"$f":"'LDC Info'!$E$18","v":"EB2012-0176"}]
[null,null,null,null,null,null,null,null,null,null,"Exhibit:"]
[null,null,null,null,null,null,null,null,null,null,"Tab:"]
[null,null,null,null,null,null,null,null,null,null,"Schedule:"]
[null,null,null,null,null,null,null,null,null,null,"Page:"]
[]
[null,null,null,null,null,null,null,null,null,null,"Date:"]
[]
[]
[null,null,"Appendix 2-OA"]
[null,null,"2011 Capital Structure and Cost of Capital"]
[]
["This table must be completed for the required years of all historical years, the bridge year and the test year."]
[]
["Line No."]
[null,null,"Particulars",null,"Capitalization Ratio",null,null,null,null,null,"Cost Rate",null,null,null,"Return"]
[]
[]
[null,null,"Application"]
[null,null,null,null,"(%)",null,null,null,"($)",null,"(%)",null,null,null,"($)"]
[null,null,"Debt"]
[1,null,"  Long-term Debt",null,0.56000000000000005,null,null,null,19492858,null,5.8200000000000002E-2,null,null,null,{"$f":"K22*I22","v":1134484.3356000001}]
[2,null,"  Short-term Debt",null,0.04,null,"(1)",null,1392347,null,1.3100000000000001E-2,null,null,null,{"$f":"K23*I23","v":18239.745699999999}]
[3,null,"Total Debt",null,{"$f":"SUM(E22:E23)","v":0.60000000000000009},null,null,null,{"$f":"SUM(I22:I23)","v":20885205},null,{"$f":"IF(E24=0,0,SUMPRODUCT(E22:E23,K22:K23)/E24)","v":5.5193333333333323E-2},null,null,null,{"$f":"SUM(O22:O23)","v":1152724.0813000002}]
[]
[null,null,"Equity"]
[4,null,"  Common Equity",null,0.4,null,null,null,13923470,null,8.0100000000000005E-2,null,null,null,{"$f":"K27*I27","v":1115269.9470000002}]
[5,null,"  Preferred Shares",null,null,null,null,null,{"$f":"$I$31*E28","v":0},null,null,null,null,null,{"$f":"K28*I28","v":0}]
[6,null,"Total Equity",null,{"$f":"SUM(E27:E28)","v":0.4},null,null,null,{"$f":"SUM(I27:I28)","v":13923470},null,{"$f":"IF(E29=0,0,SUMPRODUCT(E27:E28,K27:K28)/E29)","v":8.0100000000000005E-2},null,null,null,{"$f":"SUM(O27:O28)","v":1115269.9470000002}]
[]
[7,null,"Total",null,1,null,null,null,{"$f":"I27+I23+I22","v":34808675},null,{"$f":"(K24*E24)+(K29*E29)","v":6.5156000000000006E-2},null,null,null,{"$f":"O24+O29","v":2267994.0283000004}]
[]
[]
["Notes"]
["(1)",null,"4.0% unless an applicant has proposed or been approved for a different amount."]

{"sheet":"App.2-OA Capital Structure 2012","index":38,"n_rows":35,"n_cols":15,"rows_kept":35,"cut":false,"hidden":false,"merged":[[18,2,18,14],[9,2,9,14],[10,2,10,14],[12,0,12,14],[14,0,15,0],[15,4,15,8],[39,2,39,14],[40,2,40,14],[33,0,33,14],[34,2,34,14],[35,2,35,14],[36,2,36,14],[37,2,37,14],[38,2,38,14]]}
[null,null,null,null,null,null,null,null,null,null,"File Number:",null,null,null,{"$f":"'LDC Info'!$E$18","v":"EB2012-0176"}]
[null,null,null,null,null,null,null,null,null,null,"Exhibit:"]
[null,null,null,null,null,null,null,null,null,null,"Tab:"]
[null,null,null,null,null,null,null,null,null,null,"Schedule:"]
[null,null,null,null,null,null,null,null,null,null,"Page:"]
[]
[null,null,null,null,null,null,null,null,null,null,"Date:"]
[]
[]
[null,null,"Appendix 2-OA"]
[null,null,"2012 Capital Structure and Cost of Capital"]
[]
["This table must be completed for the required years of all historical years, the bridge year and the test year."]
[]
["Line No."]
[null,null,"Particulars",null,"Capitalization Ratio",null,null,null,null,null,"Cost Rate",null,null,null,"Return"]
[]
[]
[null,null,"Application"]
[null,null,null,null,"(%)",null,null,null,"($)",null,"(%)",null,null,null,"($)"]
[null,null,"Debt"]
[1,null,"  Long-term Debt",null,0.56000000000000005,null,null,null,21267178,null,5.8200000000000002E-2,null,null,null,{"$f":"K22*I22","v":1237749.7596}]
[2,null,"  Short-term Debt",null,0.04,null,"(1)",null,1519084,null,1.3100000000000001E-2,null,null,null,{"$f":"K23*I23","v":19900.000400000001}]
[3,null,"Total Debt",null,{"$f":"SUM(E22:E23)","v":0.60000000000000009},null,null,null,{"$f":"SUM(I22:I23)","v":22786262},null,{"$f":"IF(E24=0,0,SUMPRODUCT(E22:E23,K22:K23)/E24)","v":5.5193333333333323E-2},null,null,null,{"$f":"SUM(O22:O23)","v":1257649.76}]
[]
[null,null,"Equity"]
[4,null,"  Common Equity",null,0.4,null,null,null,15190841,null,8.0100000000000005E-2,null,null,null,{"$f":"K27*I27","v":1216786.3641000001}]
[5,null,"  Preferred Shares",null,null,null,null,null,{"$f":"$I$31*E28","v":0},null,null,null,null,null,{"$f":"K28*I28","v":0}]
[6,null,"Total Equity",null,{"$f":"SUM(E27:E28)","v":0.4},null,null,null,{"$f":"SUM(I27:I28)","v":15190841},null,{"$f":"IF(E29=0,0,SUMPRODUCT(E27:E28,K27:K28)/E29)","v":8.0100000000000005E-2},null,null,null,{"$f":"SUM(O27:O28)","v":1216786.3641000001}]
[]
[7,null,"Total",null,1,null,null,null,{"$f":"I27+I23+I22","v":37977103},null,{"$f":"(K24*E24)+(K29*E29)","v":6.5156000000000006E-2},null,null,null,{"$f":"O24+O29","v":2474436.1241000001}]
[]
[]
["Notes"]
["(1)",null,"4.0% unless an applicant has proposed or been approved for a different amount."]

{"sheet":"App.2-OA Capital Structure 2013","index":39,"n_rows":35,"n_cols":15,"rows_kept":35,"cut":false,"hidden":false,"merged":[[40,2,40,14],[12,0,12,14],[34,2,34,14],[35,2,35,14],[36,2,36,14],[37,2,37,14],[38,2,38,14],[39,2,39,14],[33,0,33,14],[9,2,9,14],[10,2,10,14],[14,0,15,0],[15,4,15,8],[18,2,18,14]]}
[null,null,null,null,null,null,null,null,null,null,"File Number:",null,null,null,{"$f":"'LDC Info'!$E$18","v":"EB2012-0176"}]
[null,null,null,null,null,null,null,null,null,null,"Exhibit:"]
[null,null,null,null,null,null,null,null,null,null,"Tab:"]
[null,null,null,null,null,null,null,null,null,null,"Schedule:"]
[null,null,null,null,null,null,null,null,null,null,"Page:"]
[]
[null,null,null,null,null,null,null,null,null,null,"Date:"]
[]
[]
[null,null,"Appendix 2-OA"]
[null,null,"2013 Capital Structure and Cost of Capital"]
[]
["This table must be completed for the required years of all historical years, the bridge year and the test year."]
[]
["Line No."]
[null,null,"Particulars",null,"Capitalization Ratio",null,null,null,null,null,"Cost Rate",null,null,null,"Return"]
[]
[]
[null,null,"Application"]
[null,null,null,null,"(%)",null,null,null,"($)",null,"(%)",null,null,null,"($)"]
[null,null,"Debt"]
[1,null,"  Long-term Debt",null,0.56000000000000005,null,null,null,22918083,null,5.79E-2,null,null,null,{"$f":"K22*I22","v":1326957.0057000001}]
[2,null,"  Short-term Debt",null,0.04,null,"(1)",null,1637006,null,2.0799999999999999E-2,null,null,null,{"$f":"K23*I23","v":34049.724799999996}]
[3,null,"Total Debt",null,{"$f":"SUM(E22:E23)","v":0.60000000000000009},null,null,null,{"$f":"SUM(I22:I23)","v":24555089},null,{"$f":"IF(E24=0,0,SUMPRODUCT(E22:E23,K22:K23)/E24)","v":5.5426666666666659E-2},null,null,null,{"$f":"SUM(O22:O23)","v":1361006.7305000001}]
[]
[null,null,"Equity"]
[4,null,"  Common Equity",null,0.4,null,null,null,16370059,null,9.1200000000000003E-2,null,null,null,{"$f":"K27*I27","v":1492949.3808000002}]
[5,null,"  Preferred Shares",null,null,null,null,null,{"$f":"$I$31*E28","v":0},null,null,null,null,null,{"$f":"K28*I28","v":0}]
[6,null,"Total Equity",null,{"$f":"SUM(E27:E28)","v":0.4},null,null,null,{"$f":"SUM(I27:I28)","v":16370059},null,{"$f":"IF(E29=0,0,SUMPRODUCT(E27:E28,K27:K28)/E29)","v":9.1200000000000003E-2},null,null,null,{"$f":"SUM(O27:O28)","v":1492949.3808000002}]
[]
[7,null,"Total",null,1,null,null,null,{"$f":"I27+I23+I22","v":40925148},null,{"$f":"(K24*E24)+(K29*E29)","v":6.9736000000000006E-2},null,null,null,{"$f":"O24+O29","v":2853956.1113}]
[]
[]
["Notes"]
["(1)",null,"4.0% unless an applicant has proposed or been approved for a different amount."]

{"sheet":"App.2-OB_Debt Instruments 2009","index":40,"n_rows":36,"n_cols":11,"rows_kept":36,"cut":false,"hidden":false,"merged":[[9,0,9,10],[10,0,10,10],[10,11,10,14],[12,0,12,10]]}
[null,null,null,null,null,null,null,null,null,"File Number:",{"$f":"'LDC Info'!$E$18","v":"EB2012-0176"}]
[null,null,null,null,null,null,null,null,null,"Exhibit:"]
[null,null,null,null,null,null,null,null,null,"Tab:"]
[null,null,null,null,null,null,null,null,null,"Schedule:"]
[null,null,null,null,null,null,null,null,null,"Page:"]
[]
[null,null,null,null,null,null,null,null,null,"Date:"]
[]
[]
["Appendix 2-OB"]
["Debt Instruments"]
[]
["This table must be completed for the required years of all historical years, the bridge year and the test year."]
[null,null,null,"Year",2009]
[]
["Row","Description","Lender","Affiliated or Third-Party Debt?","Fixed or Variable-Rate?","Start Date","Term              (years)","Principal                         ($)","Rate (%)                     (Note 2)","Interest ($)       (Note 1)"]
[1,"Consolidated Loan","CIBC","Third-Party","Fixed Rate","2007-06-28",15,5281424,6.13E-2,{"$f":"H17*I17","v":323751.29119999998}]
[2,"Building Loan","CIBC","Third-Party","Fixed Rate","2007-07-01",20,2406155,6.1800000000000001E-2,148700.37900000002]
[3,"Shareholders' Notes","Shareholders","Affiliated","Fixed Rate","2002-02-01","no term",5260461,5.4699999999999999E-2,287747.21669999999]
[4,null,null,null,null,null,null,null,null,0]
[5,null,null,null,null,null,null,null,null,0]
[6,null,null,null,null,null,null,null,null,0]
[7,null,null,null,null,null,null,null,null,0]
[8,null,null,null,null,null,null,null,null,0]
[9,null,null,null,null,null,null,null,null,0]
[10,null,null,null,null,null,null,null,null,0]
[11,null,null,null,null,null,null,null,null,0]
[12,null,null,null,null,null,null,null,null,0]
[]
["Total",null,null,null,null,null,null,{"$f":"SUM(H17:H28)","v":12948040},{"$f":"IF(H30=0,\"\",J30/H30)","v":5.8711502814325571E-2},{"$f":"SUM(J17:J28)","v":760198.88690000004}]
[]
["Notes"]
[]
[1,"If financing is in place only part of the year, calculate the pro-rated interest and input in the cell."]
[2,"Input actual or deemed long-term debt rate in accordance with the guidelines in The Report of the Board on the Cost of Capital for Ontario's Regulated Utilities, issued December 11, 2009"]
[3,"Add more lines above row 12 if necessary."]

{"sheet":"App.2-OB_Debt Instruments 2010","index":41,"n_rows":36,"n_cols":11,"rows_kept":36,"cut":false,"hidden":false,"merged":[[9,0,9,10],[10,0,10,10],[10,11,10,14],[12,0,12,10]]}
[null,null,null,null,null,null,null,null,null,"File Number:",{"$f":"'LDC Info'!$E$18","v":"EB2012-0176"}]
[null,null,null,null,null,null,null,null,null,"Exhibit:"]
[null,null,null,null,null,null,null,null,null,"Tab:"]
[null,null,null,null,null,null,null,null,null,"Schedule:"]
[null,null,null,null,null,null,null,null,null,"Page:"]
[]
[null,null,null,null,null,null,null,null,null,"Date:"]
[]
[]
["Appendix 2-OB"]
["Debt Instruments"]
[]
["This table must be completed for the required years of all historical years, the bridge year and the test year."]
[null,null,null,"Year",null,2010]
[]
["Row","Description","Lender","Affiliated or Third-Party Debt?","Fixed or Variable-Rate?","Start Date","Term              (years)","Principal                         ($)","Rate (%)                     (Note 2)","Interest ($)       (Note 1)"]
[1,"Consolidated Loan","CIBC","Third-Party","Fixed Rate","2007-06-28",15,5012185,6.13E-2,{"$f":"H17*I17","v":307246.94050000003}]
[2,"Building Loan","CIBC","Third-Party","Fixed Rate","2007-07-01",20,2334801,6.1800000000000001E-2,{"$f":"H18*I18","v":144290.70180000001}]
[3,"Shareholders' Notes","Shareholders","Affiliated","Fixed Rate","2002-02-01","no term",5260461,5.4699999999999999E-2,287747.21669999999]
[4,null,null,null,null,null,null,null,null,0]
[5,null,null,null,null,null,null,null,null,0]
[6,null,null,null,null,null,null,null,null,0]
[7,null,null,null,null,null,null,null,null,0]
[8,null,null,null,null,null,null,null,null,0]
[9,null,null,null,null,null,null,null,null,0]
[10,null,null,null,null,null,null,null,null,0]
[11,null,null,null,null,null,null,null,null,0]
[12,null,null,null,null,null,null,null,null,0]
[]
["Total",null,null,null,null,null,null,{"$f":"SUM(H17:H28)","v":12607447},{"$f":"IF(H30=0,\"\",J30/H30)","v":5.8638744148597259E-2},{"$f":"SUM(J17:J28)","v":739284.85900000005}]
[]
["Notes"]
[]
[1,"If financing is in place only part of the year, calculate the pro-rated interest and input in the cell."]
[2,"Input actual or deemed long-term debt rate in accordance with the guidelines in The Report of the Board on the Cost of Capital for Ontario's Regulated Utilities, issued December 11, 2009"]
[3,"Add more lines above row 12 if necessary."]

{"sheet":"App.2-OB_Debt Instruments 2011","index":42,"n_rows":36,"n_cols":11,"rows_kept":36,"cut":false,"hidden":false,"merged":[[9,0,9,10],[10,0,10,10],[10,11,10,14],[12,0,12,10]]}
[null,null,null,null,null,null,null,null,null,"File Number:",{"$f":"'LDC Info'!$E$18","v":"EB2012-0176"}]
[null,null,null,null,null,null,null,null,null,"Exhibit:"]
[null,null,null,null,null,null,null,null,null,"Tab:"]
[null,null,null,null,null,null,null,null,null,"Schedule:"]
[null,null,null,null,null,null,null,null,null,"Page:"]
[]
[null,null,null,null,null,null,null,null,null,"Date:"]
[]
[]
["Appendix 2-OB"]
["Debt Instruments"]
[]
["This table must be completed for the required years of all historical years, the bridge year and the test year."]
[null,null,null,"Year",null,2011]
[]
["Row","Description","Lender","Affiliated or Third-Party Debt?","Fixed or Variable-Rate?","Start Date","Term              (years)","Principal                         ($)","Rate (%)                     (Note 2)","Interest ($)       (Note 1)"]
[1,"Consolidated Loan","CIBC","Third-Party","Fixed Rate","2007-06-28",15,4725970,6.13E-2,{"$f":"H17*I17","v":289701.96100000001}]
[2,"Building Loan","CIBC","Third-Party","Fixed Rate","2007-07-01",20,2258910,6.1800000000000001E-2,{"$f":"H18*I18","v":139600.63800000001}]
[3,"Smart Meter Loan","CIBC","Third-Party","Fixed Rate","2011-06-30",20,3234184,5.0299999999999997E-2,81520]
[4,"Shareholders' Notes","Shareholders","Affiliated","Fixed Rate","2002-02-01","no term",5260461,5.4699999999999999E-2,287747.21669999999]
[5,null,null,null,null,null,null,null,null,0]
[6,null,null,null,null,null,null,null,null,0]
[7,null,null,null,null,null,null,null,null,0]
[8,null,null,null,null,null,null,null,null,0]
[9,null,null,null,null,null,null,null,null,0]
[10,null,null,null,null,null,null,null,null,0]
[11,null,null,null,null,null,null,null,null,0]
[12,null,null,null,null,null,null,null,null,0]
[]
["Total",null,null,null,null,null,null,{"$f":"SUM(H17:H28)","v":15479525},{"$f":"IF(H30=0,\"\",J30/H30)","v":5.1588780385703054E-2},{"$f":"SUM(J17:J28)","v":798569.81570000004}]
[]
["Notes"]
[]
[1,"If financing is in place only part of the year, calculate the pro-rated interest and input in the cell."]
[2,"Input actual or deemed long-term debt rate in accordance with the guidelines in The Report of the Board on the Cost of Capital for Ontario's Regulated Utilities, issued December 11, 2009"]
[3,"Add more lines above row 12 if necessary."]

{"sheet":"App.2-OB_Debt Instruments 2012","index":43,"n_rows":36,"n_cols":11,"rows_kept":36,"cut":false,"hidden":false,"merged":[[9,0,9,10],[10,0,10,10],[10,11,10,14],[12,0,12,10]]}
[null,null,null,null,null,null,null,null,null,"File Number:",{"$f":"'LDC Info'!$E$18","v":"EB2012-0176"}]
[null,null,null,null,null,null,null,null,null,"Exhibit:"]
[null,null,null,null,null,null,null,null,null,"Tab:"]
[null,null,null,null,null,null,null,null,null,"Schedule:"]
[null,null,null,null,null,null,null,null,null,"Page:"]
[]
[null,null,null,null,null,null,null,null,null,"Date:"]
[]
[]
["Appendix 2-OB"]
["Debt Instruments"]
[]
["This table must be completed for the required years of all historical years, the bridge year and the test year."]
[null,null,null,"Year",2012]
[]
["Row","Description","Lender","Affiliated or Third-Party Debt?","Fixed or Variable-Rate?","Start Date","Term              (years)","Principal                         ($)","Rate (%)                     (Note 2)","Interest ($)       (Note 1)"]
[1,"Consolidated Loan","CIBC","Third-Party","Fixed Rate","2007-06-28",15,4258136,6.13E-2,269826]
[2,"Building Loan","CIBC","Third-Party","Fixed Rate","2007-07-01",20,2223805,6.1800000000000001E-2,{"$f":"H18*I18","v":137431.149}]
[3,"Smart Meter Loan","CIBC","Third-Party","Fixed Rate","2011-06-30",13.5,3101776,5.0299999999999997E-2,156019.3328]
[4,"Shareholders' Notes","Shareholders","Affiliated","Fixed Rate","2002-02-01","no term",5260461,5.4699999999999999E-2,287747.21669999999]
[5,null,null,null,null,null,null,null,null,0]
[6,null,null,null,null,null,null,null,null,0]
[7,null,null,null,null,null,null,null,null,0]
[8,null,null,null,null,null,null,null,null,0]
[9,null,null,null,null,null,null,null,null,0]
[10,null,null,null,null,null,null,null,null,0]
[11,null,null,null,null,null,null,null,null,0]
[12,null,null,null,null,null,null,null,null,0]
[]
["Total",null,null,null,null,null,null,{"$f":"SUM(H17:H28)","v":14844178},{"$f":"IF(H30=0,\"\",J30/H30)","v":5.7330469797654E-2},{"$f":"SUM(J17:J28)","v":851023.69849999994}]
[]
["Notes"]
[]
[1,"If financing is in place only part of the year, calculate the pro-rated interest and input in the cell."]
[2,"Input actual or deemed long-term debt rate in accordance with the guidelines in The Report of the Board on the Cost of Capital for Ontario's Regulated Utilities, issued December 11, 2009"]
[3,"Add more lines above row 12 if necessary."]

{"sheet":"App.2-OB_Debt Instruments 2013","index":44,"n_rows":35,"n_cols":11,"rows_kept":35,"cut":false,"hidden":false,"merged":[[9,0,9,10],[10,0,10,10],[10,11,10,14]]}
[null,null,null,null,null,null,null,null,null,"File Number:",{"$f":"'LDC Info'!$E$18","v":"EB2012-0176"}]
[null,null,null,null,null,null,null,null,null,"Exhibit:"]
[null,null,null,null,null,null,null,null,null,"Tab:"]
[null,null,null,null,null,null,null,null,null,"Schedule:"]
[null,null,null,null,null,null,null,null,null,"Page:"]
[]
[null,null,null,null,null,null,null,null,null,"Date:"]
[]
[]
["Appendix 2-OB"]
["Debt Instruments"]
[]
[null,null,null,"Year",2013]
[]
["Row","Description","Lender","Affiliated or Third-Party Debt?","Fixed or Variable-Rate?","Start Date","Term              (years)","Principal                         ($)","Rate (%)                     (Note 2)","Interest ($)       (Note 1)"]
[1,"Consolidated Loan","CIBC","Third-Party","Fixed Rate","2007-06-28",15,3926344,6.13E-2,251224]
[2,"Building Loan","CIBC","Third-Party","Fixed Rate","2007-07-01",20,2135269,6.1800000000000001E-2,134612]
[3,"Smart Meter Loan","CIBC","Third-Party","Fixed Rate","2011-06-30",13.5,2918771,5.0299999999999997E-2,151534]
[4,"Shareholders' Notes","Shareholders","Affiliated","Fixed Rate","2002-02-01","no term",5260461,5.4699999999999999E-2,287747]
[5,null,null,null,null,null,null,null,null,{"$f":"H20*I20","v":0}]
[6,null,null,null,null,null,null,null,null,0]
[7,null,null,null,null,null,null,null,null,0]
[8,null,null,null,null,null,null,null,null,0]
[9,null,null,null,null,null,null,null,null,0]
[10,null,null,null,null,null,null,null,null,0]
[11,null,null,null,null,null,null,null,null,0]
[12,null,null,null,null,null,null,null,null,0]
[]
["Total",null,null,null,null,null,null,{"$f":"SUM(H16:H27)","v":14240845},{"$f":"IF(H29=0,\"\",J29/H29)","v":5.7940171387301807E-2},{"$f":"SUM(J16:J27)","v":825117}]
[]
["Notes"]
[]
[1,"If financing is in place only part of the year, calculate the pro-rated interest and input in the cell."]
[2,"Input actual or deemed long-term debt rate in accordance with the guidelines in The Report of the Board on the Cost of Capital for Ontario's Regulated Utilities, issued December 11, 2009"]
[3,"Add more lines above row 12 if necessary."]

{"sheet":"App.2-P_Cost_Allocation","index":45,"n_rows":117,"n_cols":6,"rows_kept":117,"cut":false,"hidden":false,"merged":[[113,0,113,1],[121,0,123,5],[106,0,106,1],[107,0,107,1],[108,0,108,1],[109,0,109,1],[110,0,110,1],[111,0,111,1],[116,0,119,5],[112,0,112,1],[105,0,105,1],[100,0,102,1],[100,2,100,4],[100,5,101,5],[103,0,103,1],[86,0,86,1],[87,0,87,1],[88,0,88,1],[67,0,68,5],[104,0,104,1],[70,0,71,5],[93,0,94,5],[96,0,96,5],[89,0,89,1],[84,0,84,1],[85,0,85,1],[75,0,77,1],[75,5,77,5],[76,3,77,3],[76,4,77,4],[78,0,78,1],[62,0,63,5],[54,0,54,1],[55,0,55,1],[56,0,56,1],[57,0,57,1],[58,0,58,1],[83,0,83,1],[65,0,65,5],[79,0,79,1],[80,0,80,1],[81,0,81,1],[82,0,82,1],[42,1,42,5],[44,0,44,1],[45,3,46,3],[45,4,46,4],[45,5,46,5],[52,0,52,1],[53,0,53,1],[45,0,46,1],[45,2,46,2],[48,0,48,1],[49,0,49,1],[50,0,50,1],[51,0,51,1],[47,0,47,1],[31,0,32,4],[34,0,36,4],[38,0,39,4],[8,0,8,5],[9,0,9,5]]}
[null,null,null,null,"File Number:",{"$f":"'LDC Info'!$E$18","v":"EB2012-0176"}]
[null,null,null,null,"Exhibit:"]
[null,null,null,null,"Tab:"]
[null,null,null,null,"Schedule:"]
[null,null,null,null,"Page:"]
[]
[null,null,null,null,"Date:"]
[]
["Appendix 2-P"]
["Cost Allocation"]
[]
["Please complete the following four tables."]
[]
["A)  Allocated Costs"]
[]
["Classes","Costs Allocated from Previous Study","%","Costs Allocated in Test Year Study                    (Column 7A)","%"]
["Residential",5496182,{"$f":"IF(B$28=0,\"\",B17/B$28)","v":0.65617270810677164},7196715,{"$f":"IF(D$28=0,\"\",D17/D$28)","v":0.68023803319205334}]
["GS < 50 kW",1476358,{"$f":"IF(B$28=0,\"\",B18/B$28)","v":0.17625795997932694},1461393,0.13813178652213329]
["GS > 50 kW (or 50 kW < GS < xxx kW, if applicable)",970136,0.11582163151654566,1351071,0.12770408161818561]
["GS > xxx kW, if applicable",null,0,null,0]
["Large User, if applicable",null,0,null,0]
["Street Lighting",399848,4.7736655189197959E-2,559656,5.2899037505880361E-2]
["Sentinel Lighting",543,6.4827143733955139E-5,1239,1.1711106013298485E-4]
["Unmetered Scattered Load (USL)",33054,3.9462180644238547E-3,9627,9.0995010161440295E-4]
["Other class, if applicable",null,0,null,0]
[null,null,0,null,0]
["Embedded distributor class",null,0,null,0]
["Total",{"$f":"SUM(B17:B27)","v":8376121},{"$f":"SUM(C17:C27)","v":1},{"$f":"SUM(D17:D27)","v":10579701},{"$f":"SUM(E17:E27)","v":1}]
[]
["Notes"]
[]
["1     Customer Classification - If proposed rate classes differ from those in place in the previous Cost Allocation study, modify the rate classes to match the current application as closely as possible."]
[]
[]
["2     Host Distributors -  Provide information on embedded distributor(s) as a separate class, if applicable.   If embedded distributor(s) are billed as customers in a General Service class, include the allocated cost and revenue of the embedded distributor(s) in the applicable class.  Also complete Appendix 2-Q."]
[]
[]
["  "]
["3     Class Revenue Requirements - If using the Board-issued model, in column 7A enter the results from Worksheet O-1, Revenue Requirement (row 40 in the 2013 model).  This excludes costs in deferral and variance accounts.  Note to Embedded Distributor(s), it also does not include Account 4750 - Low Voltage (LV) Costs. "]
[]
[]
[]
["B)  Calculated Class Revenues"]
[]
[null,null,"Column 7B","Column 7C","Column 7D","Column 7E"]
["Classes (same as previous table)",null,"Load Forecast (LF) X current approved rates","L.F. X current approved rates X (1 + d)","LF X proposed rates","Miscellaneous Revenue"]
[]
[{"$f":"A17","v":"Residential"},null,5605008,6223997,6645846,426526]
["GS < 50 kW",null,1205485,1338613,1359406,111502]
["GS > 50 kW (or 50 kW < GS < xxx kW, if applicable)",null,1779790,1976340,1543837,77448]
["GS > xxx kW, if applicable"]
["Large User, if applicable"]
["Street Lighting",null,329107,365452,365795,36797]
["Sentinel Lighting",null,496,550,897,94]
["Unmetered Scattered Load (USL)",null,19549,21708,10879,673]
["Other class, if applicable"]
[]
[{"$f":"A27","v":"Embedded distributor class"}]
[{"$f":"A28","v":"Total"},null,{"$f":"SUM(C48:C58)","v":8939435},{"$f":"SUM(D48:D58)","v":9926660},{"$f":"SUM(E48:E58)","v":9926660},{"$f":"SUM(F48:F58)","v":653040}]
[]
["Notes:"]
[]
["1     Columns 7B to 7D - LF means Load Forecast of Annual Billing Quantities (i.e. customers or connections X 12, (kWh or kW, as applicable).  Revenue Quantities should be net of Transfomrer Ownership Allowance.  Exclude revenue from rate adders and rate riders.  "]
[]
[]
["2     Columns 7C and 7D - Column total in each column should equal the Base Revenue Requirement"]
[]
["3     Columns 7C - The Board cost allocation model calculates \"1+d\" in worksheet O-1, cell C21. \"d\" is defined as Revenue Deficiency/ Revenue at Current Rates."]
[]
[]
["4     Columns 7E - If using the Board-issued Cost Allocation model, enter Miscellaneous Revenue as it appears in Worksheet O-1, row 19."]
[]
[]
["C)  Rebalancing Revenue-to-Cost (R/C) Ratios"]
[]
["Class",null,"Previously Approved Ratios","Status Quo Ratios","Proposed Ratios","Policy Range"]
[null,null,"Most Recent Year:","(7C + 7E) / (7A)","(7D + 7E) / (7A)"]
[null,null,2009]
[null,null,"%","%","%","%"]
[{"$f":"A48","v":"Residential"},null,95.55,{"$f":"IF(D17=0,\"\",(D48+F48)/D17*100)","v":92.410537307646607},{"$f":"IF(D17=0,\"\",(E48+F48)/D17*100)","v":98.272225591815157},"85 - 115"]
["GS < 50 kW",null,81.38,{"$f":"IF(D18=0,\"\",(D49+F49)/D18*100)","v":99.228270561033199},100.65109111648954,"80 - 120"]
["GS > 50 kW (or 50 kW < GS < xxx kW, if applicable)",null,162.33000000000001,152.01184837806451,119.99998519692896,"80 - 120"]
["GS > xxx kW, if applicable",null,null,"","","80 - 120"]
["Large User, if applicable",null,null,"","","85 - 115"]
["Street Lighting",null,74.88,71.87432994553798,71.935617593664674,"70 - 120"]
["Sentinel Lighting",null,71.03,51.977401129943502,79.983857949959642,"80 - 120"]
["Unmetered Scattered Load (USL)",null,100,232.48156227277451,119.99584501921679,"80 - 120"]
["Other class, if applicable",null,null,"",""]
[null,null,null,"",""]
[{"$f":"A58","v":"Embedded distributor class"},null,null,"",""]
[]
["Notes"]
[]
["1     Previously Approved Revenue-to-Cost Ratios - For most applicants, Most Recent Year would be the third year of the IRM 3 period,  e.g. if the applicant rebased in 2009 with further adjustments over 2 years, the Most recent year is 2011.  For applicants that have had rates adjusted only under IRM 2, the Most Recent Year is 2006, and the applicant should enter the ratios from their Informational Filing."]
[]
[]
["2     Status Quo Ratios - The Board's updated Cost Allocation Model yields the Status Quo Ratios in Worksheet O-1.  Status Quo means \"Before Rebalancing\"."]
[]
["D)  Proposed Revenue-to-Cost Ratios"]
[]
["Class",null,"Proposed Revenue-to-Cost Ratios",null,null,"Policy Range"]
[null,null,2013,2014,2015]
[null,null,"%","%","%","%"]
[{"$f":"A80","v":"Residential"},null,{"$f":"E80","v":98.272225591815157},null,null,{"$f":"F80","v":"85 - 115"}]
[{"$f":"A81","v":"GS < 50 kW"},null,{"$f":"E81","v":100.65109111648954},null,null,{"$f":"F81","v":"80 - 120"}]
["GS > 50 kW (or 50 kW < GS < xxx kW, if applicable)",null,119.99998519692896,null,null,"80 - 120"]
["GS > xxx kW, if applicable",null,"",null,null,"80 - 120"]
["Large User, if applicable",null,"",null,null,"85 - 115"]
["Street Lighting",null,71.935617593664674,null,null,"70 - 120"]
["Sentinel Lighting",null,79.983857949959642,null,null,"80 - 120"]
["Unmetered Scattered Load (USL)",null,119.99584501921679,null,null,"80 - 120"]
["Other class, if applicable",null,"",null,null,{"$f":"F88","v":0}]
[null,null,"",null,null,{"$f":"F89","v":0}]
["Embedded distributor class",null,""]
[]
["Note"]
["1     The applicant should complete Table D if it is applying for approval of a revenue to cost ratio in 2012 that is outside the Board’s policy range for any customer class. Table (d) will show the information that the distributor would likely enter in the IRM model) in 2013.  In 2013 Table (d), enter the planned ratios for the classes that will be ‘Change’ and ‘No Change’ in 2013 (in the current Revenue Cost Ratio Adjustment Workform, Worksheet C1.1 ‘Decision – Cost Revenue Adjustment’, column d), and enter TBD for class(es) that will be entered as ‘Rebalance’. "]

{"sheet":"App.2-Q_Cost of Serv. Emb. Dx","index":46,"n_rows":61,"n_cols":7,"rows_kept":61,"cut":false,"hidden":false,"merged":[[9,7,9,11],[12,0,12,6],[11,0,11,6],[14,0,14,1],[14,2,14,3],[59,3,60,3],[59,4,60,4],[54,4,55,4],[8,0,8,6],[9,0,9,6],[16,0,16,1],[16,2,16,3],[54,3,55,3]]}
[null,null,null,null,null,"File Number:",{"$f":"'LDC Info'!$E$18","v":"EB2012-0176"}]
[null,null,null,null,null,"Exhibit:"]
[null,null,null,null,null,"Tab:"]
[null,null,null,null,null,"Schedule:"]
[null,null,null,null,null,"Page:"]
[]
[null,null,null,null,null,"Date:"]
[]
["Appendix 2-Q"]
["Cost of Serving Embedded Distributor(s) "]
[]
["To be completed by Host Distributors*"]
["(Not required if Host Distributor has an Embedded Distributor rate class, i.e. a separate row in Appendix 2-P.)"]
[]
[]
[]
["Proposed Rate Class for Billing Embedded Distributor(s)"]
[]
["Host's Distribution Facilities used by Embedded Distributor(s)"]
[]
["(1)","(2)","(3)","(4)","(5)","(6) = '(3) + (4)"]
["Asset Class","Total OM&A costs asociated with asset class ","Original cost of asset class ","Accumulated amortization of asset class","Annual amortization of asset class","Net Book Value of asset class"]
["Totals for Host Distributor:","($)","($)","($)","($)"]
["Distribution Stations",null,null,null,null,{"$f":"C24+D24","v":0}]
["Low Voltage Line",null,null,null,null,0]
["LV Line category # 2 (if applcable)",null,null,null,null,0]
["TS (owned by host)",null,null,null,null,0]
["add rows if necessary... ",null,null,null,null,0]
[null,null,null,null,null,0]
[null,null,null,null,null,0]
[]
["(1)","(7)","(8)","(9)","(10)","(11)"]
[{"$f":"A22","v":"Asset Class"},"Total line length or station capacity in asset class","Line length or capacity required to provide LV service to Embedded Distributor(s)","Annual total demand on station/line providing LV services (sum of 12 monthly peaks)","Annual billed Embedded Distributor demand on station/line providing LV services","Embedded Distributor(s)' Responsibility Share "]
["Embedded Distributor's share:","kW or kVa; km","kW or kVA; km","kW or kVA","kW or kVA","percent"]
["Distribution Stations",null,null,null,null,{"$f":"IF(D35=0,0,(C35/B35)*(E35/D35))","v":0}]
["Low Voltage Line",null,null,null,null,{"$f":"IF(D36=0,0,(C36/B36)*(E36/D36))","v":0}]
["LV Line # 2 (if applicable) ",null,null,null,null,{"$f":"IF(D37=0,0,(C37/B37)*(E37/D37))","v":0}]
["TS (owned by host)",null,null,null,null,{"$f":"IF(D38=0,0,(C38/B38)*(E38/D38))","v":0}]
["add rows if necessary ",null,null,null,null,{"$f":"IF(D39=0,0,(C39/B39)*(E39/D39))","v":0}]
[]
["(1)","(12)","(12a)","(13)","(14)","(15)","(16)"]
[{"$f":"A33","v":"Asset Class"},"Return on Assets used to Provide LV services","Taxes/PILs","Annual amortization on assets used to provide LV services","OM&A costs with burden associated with assets used to provide LV services","Total annual cost associated with assets used to provide LV services","Monthly cost associated with the delivery of LV services"]
[null,"($)","($)","($)","($)","($)","$/kW or $/kVA"]
["Distribution Stations",{"$f":"E$55*(F24+B24*E$60)*F35","v":0},{"$f":"(B44-(B$55*C$55*F35*(F24+B24*E58)+B$56*C$56*F35*(F24+B24*E$58)))*E$58/(1-E$58)","v":0},{"$f":"E24*F35","v":0},{"$f":"B24*F35","v":0},{"$f":"SUM(B44:E44)","v":0},{"$f":"IF(E35=0,0,(D44/E35))","v":0}]
["Low Voltage Line",{"$f":"E$55*(F25+B25*E$60)*F36","v":0},{"$f":"(B45-(B$55*C$55*F36*(F25+B25*E59)+B$56*C$56*F36*(F25+B25*E59)))*E$58/(1-E$58)","v":0},{"$f":"E25*F36","v":0},{"$f":"B25*F36","v":0},{"$f":"SUM(B45:E45)","v":0},{"$f":"IF(E36=0,0,(D45/E36))","v":0}]
["LV Line # 2 (if applicable) ",{"$f":"E$55*(F26+B26*E$60)*F37","v":0},{"$f":"(B46-(B$55*C$55*F37*(F26+B26*E60)+B$56*C$56*F37*(F26+B26*E$60)))*E$58/(1-E$58)","v":0},{"$f":"E26*F37","v":0},{"$f":"B26*F37","v":0},{"$f":"SUM(B46:E46)","v":0},{"$f":"IF(E37=0,0,(D46/E37))","v":0}]
["TS (owned by host)",{"$f":"E$55*(F27+B27*E$60)*F38","v":0},{"$f":"(B47-(B$55*C$55*F38*(F27+B27*E61)+B$56*C$56*F38*(F27+B27*E61)))*E$58/(1-E$58)","v":0},{"$f":"E27*F38","v":0},{"$f":"B27*F38","v":0},{"$f":"SUM(B47:E47)","v":0},{"$f":"IF(E38=0,0,(D47/E38))","v":0}]
["add rows if necessary ",{"$f":"E$55*(F28+B28*E$60)*F39","v":0},{"$f":"(B48-(B$55*C$55*F39*(F28+B28*I62)+B$56*C$56*F39*(F28+B28*I62)))*E$58/(1-E$58)","v":0},{"$f":"E28*F39","v":0},{"$f":"B28*F39","v":0},{"$f":"SUM(B48:E48)","v":0},{"$f":"IF(E39=0,0,(D48/E39))","v":0}]
[]
["Total",null,null,null,null,{"$f":"SUM(F44:F48)","v":0},{"$f":"SUM(G44:G48)","v":0}]
[]
["(17)","(18)","(19)","(20)","(21)"]
[null,"Capital Structure","Cost Rate"]
[null,"(%)","(%)",null,"(%)"]
["Long-Term Debt",null,null,"Weighted Average Cost of Capital",{"$f":"IF(B61=0%,0,SUMPRODUCT(B55:B59,C55:C59)/B61)","v":0}]
["Short-term Debt"]
[]
["Common Equity",null,null,"Tax/PILs Rate"]
["Preferred Shares"]
[null,null,null,"Working Capital Allowance Factor"]
["Total",{"$f":"SUM(B55:B59)","v":0}]

{"sheet":"App.2-R_Loss Factors","index":47,"n_rows":73,"n_cols":8,"rows_kept":73,"cut":false,"hidden":false,"merged":[[57,1,58,7],[60,1,61,7],[32,1,34,7],[71,1,71,7],[63,1,63,7],[65,1,65,7],[67,1,69,6],[52,1,52,7],[15,1,15,7],[24,1,24,7],[26,1,26,7],[54,1,55,7],[36,1,39,7],[43,1,45,7],[47,1,50,7],[8,0,8,7],[9,0,9,7],[11,0,11,7],[13,0,14,1],[13,2,13,6],[13,7,14,7]]}
[null,null,null,null,null,null,"File Number:",{"$f":"'LDC Info'!$E$18","v":"EB2012-0176"}]
[null,null,null,null,null,null,"Exhibit:"]
[null,null,null,null,null,null,"Tab:"]
[null,null,null,null,null,null,"Schedule:"]
[null,null,null,null,null,null,"Page:"]
[]
[null,null,null,null,null,null,"Date:"]
[]
["Appendix 2-R"]
["Loss Factors"]
[]
[]
[]
[null,null,"Historical Years",null,null,null,null,"5-Year Average"]
[null,null,{"$f":"IF(ISBLANK('LDC Info'!E26-5), \"Year 5\", 'LDC Info'!E26-5)","v":2007},{"$f":"IF(ISBLANK('LDC Info'!E26-4), \"Year 5\", 'LDC Info'!E26-4)","v":2008},{"$f":"IF(ISBLANK('LDC Info'!E26-3), \"Year 5\", 'LDC Info'!E26-3)","v":2009},{"$f":"IF(ISBLANK('LDC Info'!E26-2), \"Year 5\", 'LDC Info'!E26-2)","v":2010},{"$f":"IF(ISBLANK('LDC Info'!E26-1), \"Year 5\", 'LDC Info'!E26-1)","v":2011}]
[null,"Losses Within Distributor's System"]
["A(1)","\"Wholesale\" kWh delivered to distributor (higher value)",470987374.88,468419524.93759924,482358097.20509398,470860970.88910007,471627001.13000005,{"$f":"IF(SUM(C17:G17)=0,0,AVERAGE(C17:G17))","v":472850593.80835867}]
["A(2)","\"Wholesale\" kWh delivered to distributor (lower value)",459504027,454616955,468534412,457120491,458002862,{"$f":"IF(SUM(C18:G18)=0,0,AVERAGE(C18:G18))","v":459555749.39999998}]
["B","Portion of \"Wholesale\" kWh delivered to distributor for its Large Use Customer(s)",null,null,null,null,null,{"$f":"IF(SUM(C19:G19)=0,0,AVERAGE(C19:G19))","v":0}]
["C","Net \"Wholesale\" kWh delivered to distributor  = A(2) - B",{"$f":"C18-C19","v":459504027},454616955,468534412,457120491,458002862,459555749.39999998]
["D","\"Retail\" kWh delivered by distributor",438284553.85550386,445385739,445824184,445211912.64244384,434957195.90349287,{"$f":"IF(SUM(C21:G21)=0,0,AVERAGE(C21:G21))","v":441932717.08028811}]
["E","Portion of \"Retail\" kWh delivered by distributor to its Large Use Customer(s)",null,null,null,null,null,{"$f":"IF(SUM(C22:G22)=0,0,AVERAGE(C22:G22))","v":0}]
["F","Net \"Retail\" kWh delivered by distributor = D - E",{"$f":"C21-C22","v":438284553.85550386},444257509.91594625,446170528.88444519,445211912.64244384,434957195.90349287,441932717.08028811]
["G","Loss Factor in Distributor's system = C / F",{"$f":"IF(C23=0,\"\",C20/C23)","v":1.0484148322313269},1.0233185592878637,1.0501240706585238,1.0267481125715523,1.0529837563639721,1.0398771841020094]
[null,"Losses Upstream of Distributor's System"]
["H","Supply Facilities Loss Factor",{"$f":"C17/C18","v":1.0249907448145172},{"$f":"D17/D18","v":1.0303608780662377},1.0295040979937542,1.030058770410929,1.0297468427828298,{"$f":"IF(SUM(C26:G26)=0,0,AVERAGE(C26:G26))","v":1.0289322668136536}]
[null,"Total Losses"]
["I","Total Loss Factor = G x H",{"$f":"IF(C24=\"\",\"\",C24*C26)","v":1.074615499763375},1.0543874092893206,1.081107034144833,1.0576108983571952,1.0843066986174048,1.0699631882458795]
[]
["Notes"]
[]
[]
["A(1)","If directly connected to the IESO-controlled grid, kWh pertains to the virtual meter on the primary or high voltage side of the transformer at the interface with the transmission grid.  This corresponds to the \"With Losses\" kWh value provided by the IESO's MV-WEB.  It is the higher of the two values provided by MV-WEB."]
[]
[]
[]
[null,"If fully embedded within a host distributor, kWh pertains to the virtual meter on the primary or high voltage side of the transformer, at the interface between the host distributor and the transmission grid.  For example, if the host distributor is Hydro One Networks Inc., kWh from the Hydro One Networks' invoice corresponding to \"Total kWh w Losses\" should be reported.  This corresponds to the higher of the two kWh values provided in Hydro One Networks' invoice."]
[]
[]
[]
[]
[null,"If partially embedded, kWh pertains to the sum of the above."]
[]
["A(2)","If directly connected to the IESO-controlled grid, kWh pertains to a metering installation on the secondary or low voltage side of the transformer at the interface with the transmission grid.  This corresponds to the \"Without Losses\" kWh value provided by the IESO's MV-WEB.  It is the lower of the two kWh values provided by MV-WEB."]
[]
[]
[]
[null,"If fully embedded with the host distributor, kWh pertains to an actual or virtual meter at the interface between the embedded distributor and the host distributor.  For example, if the host distributor is Hydro One Networks Inc., kWh from the Hydro One Networks' invoice corresponding to \"Total kWh\" should be reported.  This corresponds to the lower of the two kWh values provided in Hydro One Networks' invoice."]
[]
[]
[]
[]
[null,"If partially embedded, kWh pertains to the sum of the above."]
[]
[null,"Additionally, kWh pertaining to distributed generation directly connected to the distributor's own distribution network should be included in A(2)."]
[]
[]
["B","If a Large Use Customer is metered on the secondary or low voltage side of the transformer, the default loss is 1%                         (i.e., B = 1.01 X E)."]
[]
[]
["D","kWh corresponding to D should equal metered or estimated kWh at the customer’s delivery point."]
[]
[]
["G and I","These loss factors pertain to secondary-metered customers with demand less than 5,000 kW."]
[]
["H","If directly connected to the IESO-controlled grid, SFLF = 1.0045."]
[]
[null,"If fully embedded within a host distributor, SFLF = loss factor re losses in transformer at grid interface X loss factor re losses in host distributor's system.  If the host distributor is Hydro One Networks Inc., SFLF = 1.0060 X 1.0278 = 1.0340. If partially embedded, SFLF should be calculated as the weighted average of above."]
[]
[]
[]
[null,"Distributors that wish to propose a different SFLF should provide appropriate justification for any such proposal including supporting"]
[null,"calculations and any other relevant material."]

{"sheet":"App.2-S_Stranded Meters","index":48,"n_rows":88,"n_cols":8,"rows_kept":88,"cut":false,"hidden":false,"merged":[[8,0,8,7],[9,0,9,7],[25,0,28,7],[30,0,31,7],[50,2,51,7],[13,10,13,14],[87,0,90,7],[80,1,82,7],[84,1,85,7],[65,1,66,7],[72,1,74,7],[76,1,78,7],[68,1,70,7],[58,2,60,7],[62,0,63,7],[33,1,34,7],[36,1,38,7],[40,1,43,7],[45,1,48,7],[53,2,56,7]]}
[null,null,null,null,null,null,"File Number:",{"$f":"'LDC Info'!$E$18","v":"EB2012-0176"}]
[null,null,null,null,null,null,"Exhibit:"]
[null,null,null,null,null,null,"Tab:"]
[null,null,null,null,null,null,"Schedule:"]
[null,null,null,null,null,null,"Page:"]
[]
[null,null,null,null,null,null,"Date:"]
[]
["Appendix 2-S"]
["Stranded Meter Treatment"]
[]
["Year","Notes","Cumulative Gross Asset Value","Cumulative Accumulated Amortization","Contributed Capital (Net of Amortization)","Net Asset","Proceeds on Disposition","Residual Net Book Value"]
[null,null,"(A)","(B)","(C)","(D ) = (A) - (B) - (C)","(E)","(F) = (D) - (E)"]
[2006,null,null,null,null,{"$f":"C14-D14-E14","v":0},0,{"$f":"F14-G14","v":0}]
[2007,null,null,null,null,0,0,0]
[2008,null,null,null,null,0,0,0]
[2009,null,{"$f":"463636+200419","v":664055},{"$f":"166955+79763","v":246718},{"$f":"3378-721","v":2657},414680,5223,409457]
[2010,null,{"$f":"C17+286177","v":950232},{"$f":"D17+86670+68293","v":401681},{"$f":"E17+1752","v":4409},544142,{"$f":"G17+1116","v":6339},537803]
[2011,null,{"$f":"C18+44146+227317","v":1221695},{"$f":"D18+110230","v":511911},{"$f":"E18","v":4409},705375,{"$f":"G18","v":6339},699036]
[2012,"(1)",{"$f":"C19","v":1221695},{"$f":"D19+137820","v":649731},{"$f":"E19","v":4409},567555,{"$f":"G19","v":6339},561216]
[]
["Notes:"]
[]
["(1)","For 2012, please indicate whether the amounts provided are on a forecast or actual basis."]
[]
["Some distributors have transferred the cost of stranded meters from Account 1860 - Meters to \"Sub-account Stranded Meter Costs of Account 1555\", while in some cases distributors have left these costs in Account 1860.  Depending on which treatment the applicant has chosen. please provide the information under either of the two scenarios (A and B below), as applicable."]
[]
[]
[]
[]
["Scenario A:  If the stranded meter costs were transferred to \"Sub-account Stranded Meter Costs\" of Account 1555, the above table should be completed and the following information should be provided."]
[]
[]
[1,"A description of the accounting treatment followed by the applicant on stranded meter costs for financial accounting and reporting purposes."]
[]
[]
[2,"The amount of the pooled residual net book value of the removed from service stranded meters, less any contributed capital (net of accumulated amortization), and less any net proceeds from sales, which were transferred to this sub-account as of December 31, 2010."]
[]
[]
[]
[3,"A statement as to whether or not, since transferring the removed stranded meter costs to the sub-account, the recording of depreciation expenses was continued in order to reduce the net book value through accumulated depreciation.  If so, the total depreciation expense amount for the period from the time the costs for the stranded meters were transferred to the sub-account to December 31, 2010 should be provided."]
[]
[]
[]
[]
[null,"If no depreciation expenses were recorded to reduce the net book value of stranded meter costs through accumulated depreciation, the total depreciation expense amount that would have been applicable from the time that the stranded meter costs were transferred to the sub-account of Account 1555 to December 31, 2010 should be provided.  In addition, the following information should be provided:"]
[]
[]
[]
[]
[null,"a)","Whether or not carrying charges were recorded for the stranded meter cost balances in the sub-account, and if so, the total carrying charges recorded to December 31, 2010."]
[]
[]
[null,"b)","The estimated amount of the pooled residual net book value of the removed from service meters, less any net proceeds from sales and contributed capital, at the time when the smart meters will have been fully deployed (e.g., as of December 31, 2010).  If the smart meters have been fully deployed, the actual amount should be provided."]
[]
[]
[]
[]
[null,"c)","A description as to how the applicant intends to recover in rates the remaining costs for stranded meters, including the proposed accounting treatment, the proposed disposition period, and the associated bill impacts."]
[]
[]
[]
["Scenario B:  If the stranded meter costs remained recorded in Account 1860, the above table should be completed and the following information should be provided:"]
[]
[]
[1,"A description of the accounting treatment followed by the applicant on stranded meter costs for financial accounting and reporting purposes."]
[]
[]
[2,"The amount of the pooled residual net book value of the removed from service stranded meters, less any contributed capital (net of accumulated amortization), and less any net proceeds from sales, as of December 31, 2010."]
[]
[]
[]
[3,"A statement as to whether or not the recording of depreciation expenses continued in order to reduce the net book value through accumulated depreciation.  If so, provision of the total (cumulative) depreciation expense for the period from the time that the meters became stranded to December 31, 2010."]
[]
[]
[]
[4,"If no depreciation expenses were recorded to reduce the net book value of stranded meters through accumulated depreciation, the total (cumulative) depreciation expense amount that would have been applicable for the period from the time that the meters became stranded to December 31, 2010."]
[]
[]
[]
[5,"The estimated amount of the pooled residual net book value of the removed from service meters, less any net proceeds from sales and contributed capital, at the time when smart meters will have been fully deployed.  If the smart meters have been fully deployed, please provide the actual amount."]
[]
[]
[]
[6,"A description as to how the applicant intends to recover in rates the costs for stranded meters, including the proposed accounting treatment, the proposed disposition period and the associated bill impacts."]
[]
[]
["Distributors should also provide the Net Book Value per class of meter as of December 31, 2010 as well as the number of meters that were removed / stranded.  In preparing this information, distributors should review the Board's letter of January 16, 2007 Stranded Meter Costs Related to the Installation of Smart Meters   which stated that records were to be kept of the type and number of each meter to support the stranded meter costs."]

{"sheet":"App.2-T_1592_Tax_Variance","index":49,"n_rows":51,"n_cols":5,"rows_kept":51,"cut":false,"hidden":false,"merged":[[17,0,17,2],[18,0,18,2],[19,0,19,2],[24,0,24,2],[42,1,43,4],[30,0,30,2],[39,1,40,4],[25,0,25,2],[26,0,26,2],[28,0,28,2],[29,0,29,2],[37,0,38,0],[20,0,20,2],[21,0,21,2],[22,0,22,2],[23,0,23,2],[8,0,8,4],[9,0,9,4],[11,0,11,4],[13,0,15,2],[16,0,16,2],[27,0,27,2],[50,1,51,4],[34,0,35,0],[39,0,40,0],[42,0,43,0],[45,0,48,0],[50,0,51,0],[34,1,35,4],[37,1,37,4],[45,1,48,4]]}
[null,null,"File Number:",null,{"$f":"'LDC Info'!$E$18","v":"EB2012-0176"}]
[null,null,"Exhibit:"]
[null,null,"Tab:"]
[null,null,"Schedule:"]
[null,null,"Page:"]
[]
[null,null,"Date:"]
[]
["Appendix 2-T"]
["Deferred PILs Account 1592 Balances"]
[]
["The following table should be completed based on the information requested below, in accordance with the notes following the table. An explanation should be provided for any blank entries."]
[]
["Tax Item",null,null,null,"Principal as of"]
[null,null,null,null,"December 31,"]
[null,null,null,null,"20XX"]
["Large Corporation Tax grossed-up proxy from 2006 EDR application PILs model for the period from May 1, 2006 to April 30, 2007"]
["Large Corporation Tax grossed-up proxy from 2006 EDR application PILs model for the period from January 1, 2006 to April 30, 2006 (4/12ths of the approved grossed-up proxy), if not recorded in PILs account 1562"]
["Ontario Capital Tax rate decrease and increase in capital deduction for 2007"]
["Ontario Capital Tax rate decrease and increase in capital deduction for 2008"]
["Ontario Capital Tax rate decrease and increase in capital deduction for 2009"]
["Ontario Capital Tax rate decrease and increase in capital deduction for 2010"]
["Capital Cost Allowance class changes from 2006 EDR application for 2006"]
["Capital Cost Allowance class changes from 2006 EDR application for 2007"]
["Capital Cost Allowance class changes from 2006 EDR application for 2008"]
["Capital Cost Allowance class changes from 2006 EDR application for 2009"]
["Capital Cost Allowance class changes from 2006 EDR application for 2010"]
["Capital Cost Allowance class changes from 2006 EDR application for 2011"]
["Capital Cost Allowance class changes from any prior application not recorded above.  Please provide details and explanation separately."]
["Insert description of additional item(s) and new rows if needed."]
["Total",null,null,null,{"$f":"SUM(E17:E30)","v":0}]
[]
["Notes:"]
[]
[1,"Revise the deferral and variance account continuity schedule to include account 1592 as a group 2 account and enter all relevant information for transactions, adjustments, etc., for all relevant years."]
[]
[]
[2,"Describe each type of tax item that has been recorded in account 1592."]
[]
[3,"Provide the calculations that show how each item was determined and provide any pertinent supporting evidence and documentation."]
[]
[]
[4,"Please state whether or not the applicant followed the guidance provided in the FAQ of July 2007.  If not, please provide an explanation."]
[]
[]
[5,"Identify the account balance as of December 31, 2011 as per the 2011 Audited Financial Statements.  Identify the account balance as of December 31, 2011 as per the April 2012 2.1.7 RRR filing to the Board.  Provide a reconciliation if the balances provided are not identical to each other and to the total shown on the continuity schedule."]
[]
[]
[]
[]
[6,"Complete the above table based on the answers to the previous.  Add rows as required to complete the analysis in an informative manner.  Please provide the completed table as a working Excel spreadsheet."]

{"sheet":"App.2-U_IFRS Transition Costs","index":50,"n_rows":36,"n_cols":12,"rows_kept":36,"cut":false,"hidden":false,"merged":[[41,0,42,0],[41,1,42,4],[44,0,47,0],[44,1,47,4],[49,0,50,0],[49,1,50,4],[38,0,39,0],[38,1,39,4],[23,0,23,2],[24,0,24,2],[25,0,25,2],[26,0,26,2],[27,0,27,2],[28,0,28,2],[29,0,29,2],[33,0,34,0],[33,1,34,11],[36,0,37,0],[36,1,36,4],[22,0,22,2],[8,0,8,11],[9,0,9,11],[11,0,11,11],[13,0,15,2],[13,11,15,11],[16,0,16,2],[17,0,17,2],[18,0,18,2],[19,0,19,2],[20,0,20,2],[21,0,21,2]]}
[null,null,null,null,null,null,null,null,null,"File Number:",{"$f":"'LDC Info'!$E$18","v":"EB2012-0176"}]
[null,null,null,null,null,null,null,null,null,"Exhibit:"]
[null,null,null,null,null,null,null,null,null,"Tab:"]
[null,null,null,null,null,null,null,null,null,"Schedule:"]
[null,null,null,null,null,null,null,null,null,"Page:"]
[]
[null,null,null,null,null,null,null,null,null,"Date:"]
[]
["Appendix 2-U"]
["One-Time Incremental IFRS Transition Costs"]
[]
["The following table should be completed based on the information requested below. An explanation should be provided for any blank entries.  The entries should include one-time incremental IFRS transition costs that are currently included in Account 1508, Other Regulatory Assets, sub-account Deferred IFRS Transition Costs Account, or Account 1508, Other Regulatory Assets, sub-account IFRS Transition Costs Variance Account."]
[]
["Nature of One-Time Incremental IFRS Transition Costs 1",null,null,null,"Audited Actual","Audited Actual","Audited Actual","Audited Carrying","Total Audited","RRR 2.1.7","Variance 2","Reasons why the costs recorded meet the criteria of one-time IFRS administrative incremental costs"]
[null,null,null,null,"Costs Incurred","Costs Incurred","Costs Incurred","Charges","Actual Costs","Balance"]
[null,null,null,null,2009,2010,2011,"to Dec 31, 2011","to Dec 31, 2011","2011-12-31"]
["professional accounting fees",null,null,null,4000,7500,16500,null,{"$f":"SUM(E17:H17)","v":28000},null,null,"Auditor Consulting Fees"]
["professional legal fees",null,null,null,null,null,null,null,{"$f":"SUM(E18:H18)","v":0}]
["salaries, wages and benefits of staff added to support the transition to IFRS",null,null,null,null,null,null,null,0]
["associated staff training and development costs",null,null,null,2714,1285,1129,null,5128]
["costs related to system upgrades, or replacements or changes where IFRS was the major reason for conversion",null,null,null,null,4157,293,null,4450]
["Carrying Charges",null,null,null,null,null,null,498,498]
[null,null,null,null,null,null,null,null,0]
[null,null,null,null,null,null,null,null,0]
[null,null,null,null,null,null,null,null,0]
[null,null,null,null,null,null,null,null,0]
[null,null,null,null,null,null,null,null,0]
[null,null,null,null,null,null,null,null,0]
["Insert description of additional item(s) and new rows if needed.",null,null,null,null,null,null,null,0]
["Total",null,null,null,{"$f":"SUM(E17:E29)","v":6714},{"$f":"SUM(F17:F29)","v":12942},{"$f":"SUM(G17:G29)","v":17922},{"$f":"SUM(H17:H29)","v":498},{"$f":"SUM(I17:I29)","v":38076},null,{"$f":"+I30-J30","v":38076}]
[]
[]
["Note:"]
[1,"The Deferred IFRS Transition Costs Account and the IFRS Transition Costs Variance Account are exclusively for necessary, incremental transition costs and shall not include ongoing IFRS compliance costs or impacts arising from adopting accounting policy changes that reflect changes in the timing of the recognition of income. The incremental costs in these accounts shall not include costs related to system upgrades, or replacements or changes where IFRS was not the major reason for conversion. In addition, incremental IFRS costs shall not include capital assets or expenditures."]
[]
[2,"Applicants are to provide an explanation of material variances in evidence"]

{"sheet":"App.2-V_Rev_Reconciliation","index":51,"n_rows":34,"n_cols":16,"rows_kept":34,"cut":false,"hidden":false,"merged":[[33,0,34,13],[8,0,8,15],[11,10,12,10],[9,0,9,15],[11,5,11,6],[11,2,11,4],[11,12,12,12],[11,13,12,13],[11,14,12,14],[11,15,12,15],[11,1,12,1],[12,8,12,9],[11,7,11,9]]}
[null,null,null,null,null,null,null,null,null,null,null,null,null,null,"File Number:",{"$f":"'LDC Info'!$E$18","v":"EB2012-0176"}]
[null,null,null,null,null,null,null,null,null,null,null,null,null,null,"Exhibit:"]
[null,null,null,null,null,null,null,null,null,null,null,null,null,null,"Tab:"]
[null,null,null,null,null,null,null,null,null,null,null,null,null,null,"Schedule:"]
[null,null,null,null,null,null,null,null,null,null,null,null,null,null,"Page:"]
[]
[null,null,null,null,null,null,null,null,null,null,null,null,null,null,"Date:"]
[]
["Appendix 2-V"]
["Revenue Reconciliation"]
[]
["Rate Class","Customers/ Connections","Number of Customers/Connections",null,null,"Test Year Consumption",null,"Proposed Rates",null,null,"Revenues at Proposed Rates",null,"Class Specific Revenue Requirement","Transformer Allowance Credit","Total","Difference"]
[null,null,"Start of Test Year","End of Test Year","Average","kWh","kW","Monthly Service Charge","Volumetric"]
[null,null,null,null,null,null,null,null,"kWh","kW"]
[]
["Residential","Customers",null,null,20036,202711942,null,13.45,1.6799999999999999E-2,null,{"$f":"H16*E16*12+I16*F16+J16*G16","v":6639371.0256000003},null,6645846,null,{"$f":"SUM(M16:N16)","v":6645846},{"$f":"O16-K16","v":6474.9743999997154}]
["GS < 50 kW","Customers",null,null,2471,64088366,null,20.77,1.1599999999999999E-2,null,1359297.0855999999,null,1359406,null,1359406,108.91440000012517]
["GS > 50 to 4,999 kW","Customers",null,null,280,168781699,476416,208.31,null,1.9665999999999999,1636841.3056000001,null,1543837,93000,{"$f":"SUM(M18:N18)","v":1636837},{"$f":"O18-K18","v":-4.3056000000797212}]
["Large Use",null,null,null,{"$f":"IF(SUM(C19:D19)=0,0,AVERAGE(C19:D19))","v":0},null,null,null,null,null,0,null,null,null,0,0]
["Streetlighting","Connections",null,null,6026,5355530,14889,4.3099999999999996,null,3.6356000000000002,365795.16839999997,null,365795,null,365795,-0.16839999996591359]
["Sentinel Lighting","Connections",null,null,9,17900,17,4.58,null,23.68,897.2,null,897,null,897,-0.20000000000004547]
["Unmetered Scattered Load","Customers",null,null,60,270442,null,6.29,2.35E-2,null,10884.186999999998,null,10879,null,10879,-5.1869999999980791]
["Standby Power",null,null,null,0,null,null,null,null,null,0,null,null,null,0,0]
["Embedded Distributor Class",null,null,null,0,null,null,null,null,null,0,null,null,null,0,0]
["etc.",null,null,null,0,null,null,null,null,null,0,null,null,null,0,0]
[null,null,null,null,0,null,null,null,null,null,0,null,null,null,0,0]
[null,null,null,null,0,null,null,null,null,null,0,null,null,null,0,0]
[null,null,null,null,0,null,null,null,null,null,0,null,null,null,0,0]
[]
["Total",null,null,null,null,null,null,null,null,null,{"$f":"SUM(K16:K28)","v":10013085.972200001},null,{"$f":"SUM(M16:M28)","v":9926660},{"$f":"SUM(N16:N28)","v":93000},{"$f":"M30+N30","v":10019660},{"$f":"O30-K30","v":6574.0277999993414}]
[]
["Note"]
[]
["1       The class specific revenue requirements in column N must be the amounts used in the final rate design process.  The total of column N should equate to the proposed base revenue requirement"]

{"sheet":"App.2-W_Bill Impacts_RES800","index":52,"n_rows":85,"n_cols":20,"rows_kept":85,"cut":false,"hidden":false,"merged":[[2,0,2,10],[9,1,9,14],[10,1,10,14],[13,3,13,14],[17,5,17,7],[17,9,17,11],[17,13,17,14],[67,1,67,3],[18,3,19,3],[18,13,19,13],[18,14,19,14],[60,1,60,3],[61,1,61,3],[66,1,66,3]]}
[null,null,null,null,null,null,null,null,null,null,null,null,null,"File Number:",{"$f":"'[3]LDC Info'!$E$18","v":"EB2012-0176"},null,null,null,null,1]
[null,null,null,null,null,null,null,null,null,null,null,null,null,"Exhibit:"]
[null,null,null,null,null,null,null,null,null,null,null,null,null,"Tab:"]
[null,null,null,null,null,null,null,null,null,null,null,null,null,"Schedule:"]
[null,null,null,null,null,null,null,null,null,null,null,null,null,"Page:"]
[]
[null,null,null,null,null,null,null,null,null,null,null,null,null,"Date:"]
[]
[]
[null,"Appendix 2-W"]
[null,"Bill Impacts"]
[]
[]
[null,"Customer Class:",null,"Residential"]
[]
[null,null,null,"Consumption",null,800," kWh"]
[]
[null,null,null,null,null,"Current Board-Approved",null,null,null,"Proposed",null,null,null,"Impact"]
[null,null,null,"Charge Unit",null,"Rate","Volume","Charge",null,"Rate","Volume","Charge",null,"$ Change","% Change"]
[null,null,null,null,null,"($)",null,"($)",null,"($)",null,"($)"]
[null,"Monthly Service Charge",null,"per kWh",null,11.34,1,{"$f":"G21*F21","v":11.34},null,13.45,1,{"$f":"K21*J21","v":13.45},null,{"$f":"L21-H21","v":2.1099999999999994},{"$f":"IF((H21)=0,\"\",(N21/H21))","v":0.1860670194003527}]
[null,"Smart Meter Rate Adder",null,"Monthly",null,null,1,{"$f":"G22*F22","v":0},null,null,1,{"$f":"K22*J22","v":0},null,{"$f":"L22-H22","v":0},{"$f":"IF((H22)=0,\"\",(N22/H22))","v":""}]
[null,"SMDR",null,"Monthly",null,null,1,0,null,0.34,1,{"$f":"K23*J23","v":0.34},null,{"$f":"L23-H23","v":0.34},{"$f":"IF((H23)=0,\"\",(N23/H23))","v":""}]
[null,"Stranded Meter Rate Rider",null,"Monthly",null,null,1,0,null,0.6744,1,0.6744,null,0.6744,""]
[null,null,null,null,null,null,1,0,null,null,1,0,null,0,""]
[null,null,null,null,null,null,1,0,null,null,1,0,null,0,""]
[null,"Distribution Volumetric Rate",null,"per kWh",null,1.4200000000000001E-2,{"$f":"$F$16","v":800},11.360000000000001,null,1.6799999999999999E-2,{"$f":"$F$16","v":800},13.44,null,2.0799999999999983,0.18309859154929561]
[null,"Smart Meter Disposition Rider",null,null,null,null,{"$f":"$F$16","v":800},0,null,null,{"$f":"$F$16","v":800},0,null,0,""]
[null,"LRAM & SSM Rate Rider",null,"per kWh",null,6.9999999999999999E-4,{"$f":"$F$16","v":800},0.55999999999999994,null,null,800,0,null,-0.55999999999999994,-1]
[null,"Rate Rider for Tax Adjustments",null,"per kWh",null,-2.9999999999999997E-4,{"$f":"$F$16","v":800},-0.24,null,null,800,0,null,0.24,-1]
[null,null,null,"per kWh",null,null,800,0,null,null,800,0,null,0,""]
[null,null,null,null,null,null,800,0,null,null,800,0,null,0,""]
[null,null,null,null,null,null,800,0,null,null,800,0,null,0,""]
[null,null,null,null,null,null,800,0,null,null,800,0,null,0,""]
[null,null,null,null,null,null,800,0,null,null,800,0,null,0,""]
[null,null,null,null,null,null,800,0,null,null,800,0,null,0,""]
[null,"Sub-Total A",null,null,null,null,null,{"$f":"SUM(H21:H36)","v":23.020000000000003},null,null,null,{"$f":"SUM(L21:L36)","v":27.904399999999999},null,4.8843999999999959,0.21218071242397893]
[null,"Deferral/Variance Account Disposition Rate Rider",null,"per kWh",null,-1.5E-3,{"$f":"$F$16","v":800},{"$f":"G38*F38","v":-1.2},null,2.7000000000000001E-3,{"$f":"$F$16","v":800},{"$f":"K38*J38","v":2.16},null,{"$f":"L38-H38","v":3.3600000000000003},{"$f":"IF((H38)=0,\"\",(N38/H38))","v":-2.8000000000000003}]
[null,null,null,null,null,null,{"$f":"$F$16","v":800},{"$f":"G39*F39","v":0},null,null,{"$f":"$F$16","v":800},{"$f":"K39*J39","v":0},null,{"$f":"L39-H39","v":0},{"$f":"IF((H39)=0,\"\",(N39/H39))","v":""}]
[null,null,null,null,null,null,800,0,null,null,800,0,null,0,""]
[null,null,null,null,null,null,800,0,null,null,800,0,null,0,""]
[null,"Low Voltage Service Charge",null,null,null,1.1999999999999999E-3,800,{"$f":"G42*F42","v":0.96},null,1.6999999999999999E-3,800,{"$f":"K42*J42","v":1.3599999999999999},null,{"$f":"L42-H42","v":0.39999999999999991},{"$f":"IF((H42)=0,\"\",(N42/H42))","v":0.41666666666666657}]
[null,"Smart Meter Entity Charge",null,null,null,null,null,null,null,null,800,{"$f":"K43*J43","v":0},null,{"$f":"L43-H43","v":0}]
[null,"Sub-Total B - Distribution (includes Sub-Total A)",null,null,null,null,null,{"$f":"SUM(H38:H42)+H37","v":22.780000000000005},null,null,null,{"$f":"SUM(L38:L42)+L37","v":31.424399999999999},null,{"$f":"L44-H44","v":8.6443999999999939},{"$f":"IF((H44)=0,\"\",(N44/H44))","v":0.37947322212467044}]
[null,"RTSR - Network",null,"per kWh",null,5.1999999999999998E-3,{"$f":"F16*(1+F71)","v":863.04},{"$f":"G45*F45","v":4.4878079999999994},null,6.0000000000000001E-3,{"$f":"F16*(1+J71)","v":856},{"$f":"K45*J45","v":5.1360000000000001},null,0.64819200000000077,0.14443398648070524]
[null,"RTSR - Line and Transformation Connection",null,"per kWh",null,1.9E-3,{"$f":"G45","v":863.04},{"$f":"G46*F46","v":1.6397759999999999},null,2.0999999999999999E-3,{"$f":"K45","v":856},{"$f":"K46*J46","v":1.7975999999999999},null,0.15782399999999996,9.6247292313096408E-2]
[null,"Sub-Total C - Delivery (including Sub-Total B)",null,null,null,null,null,{"$f":"SUM(H44:H46)","v":28.907584000000003},null,null,null,{"$f":"SUM(L44:L46)","v":38.358000000000004},null,9.4504160000000006,0.32691822325933567]
[null,"Wholesale Market Service Charge (WMSC)",null,"per kWh",null,5.1999999999999998E-3,{"$f":"G46","v":863.04},{"$f":"G48*F48","v":4.4878079999999994},null,5.1999999999999998E-3,{"$f":"K46","v":856},{"$f":"K48*J48","v":4.4512},null,-3.6607999999999308E-2,-8.1572117167221306E-3]
[null,"Rural and Remote Rate Protection (RRRP)",null,"per kWh",null,1.1000000000000001E-3,{"$f":"G46","v":863.04},0.94934399999999997,null,1.1000000000000001E-3,{"$f":"K46","v":856},0.9416000000000001,null,-7.7439999999998621E-3,-8.1572117167221393E-3]
[null,"Standard Supply Service Charge",null,"Monthly",null,0.25,1,0.25,null,0.25,1,0.25,null,0,0]
[null,"Debt Retirement Charge (DRC)",null,"per kWh",null,6.9999999999999999E-4,{"$f":"G49","v":863.04},0.604128,null,6.9999999999999999E-4,{"$f":"K49","v":856},0.59919999999999995,null,-4.9280000000000435E-3,-8.1572117167223561E-3]
[null,"Energy - RPP - Tier 1",null,"per kWh",null,7.4999999999999997E-2,{"$f":"IF($T$1=1,IF($F$16>=600,600,IF($F$16<600,$F$16*(1+$F$71),$F$16-600)),IF($T$1=2,IF($F$16>=1000,1000,IF($F$16<1000,$F$16*(1+$F$71),$F$16-1000))))","v":600},{"$f":"G52*F52","v":45},null,7.4999999999999997E-2,{"$f":"IF($T$1=1,IF($F$16>=600,600,IF($F$16<600,$F$16*(1+$J$71),$F$16-600)),IF($T$1=2,IF($F$16>=1000,1000,IF($F$16<1000,$F$16*(1+$J$71),$F$16-1000))))","v":600},{"$f":"K52*J52","v":45},null,0,0]
[null,"Energy - RPP - Tier 2",null,"per kWh",null,8.7999999999999995E-2,{"$f":"IF($T$1=1,IF($F$16>=600,$F$16*(1+$F$71)-600,IF($F$16<600,0,)), IF($T$1=2,IF($F$16>=1000,$F$16*(1+$F$71)-1000,IF($F$16<1000,0))))","v":263.03999999999996},{"$f":"G53*F53","v":23.147519999999997},null,8.7999999999999995E-2,{"$f":"IF($T$1=1,IF($F$16>=600,$F$16*(1+$J$71)-600,IF($F$16<600,0,)), IF($T$1=2,IF($F$16>=1000,$F$16*(1+$J$71)-1000,IF($F$16<1000,0))))","v":256},{"$f":"K53*J53","v":22.527999999999999},null,-0.61951999999999785,-2.6763990267639814E-2]
[null,"TOU - Off Peak",null,"per kWh",null,6.5000000000000002E-2,{"$f":"0.64*$F$16*(1+$F$71)","v":552.34559999999999},35.902464000000002,null,6.5000000000000002E-2,{"$f":"0.64*$F$16*(1+$J$71)","v":547.84},35.6096,null,-0.29286400000000157,-8.1572117167223266E-3]
[null,"TOU - Mid Peak",null,"per kWh",null,0.1,{"$f":"0.18*$F$16*(1+$F$71)","v":155.34719999999999},15.53472,null,0.1,{"$f":"0.18*$F$16*(1+$J$71)","v":154.08000000000001},15.408000000000001,null,-0.12671999999999883,-8.1572117167222086E-3]
[null,"TOU - On Peak",null,"per kWh",null,0.11700000000000001,{"$f":"0.18*$F$16*(1+$F$71)","v":155.34719999999999},18.175622399999998,null,0.11700000000000001,{"$f":"0.18*$F$16*(1+$J$71)","v":154.08000000000001},18.027360000000002,null,-0.14826239999999657,-8.1572117167220959E-3]
[]
[null,"Total Bill on RPP (before Taxes)",null,null,null,null,null,{"$f":"SUM(H47:H53)","v":103.346384},null,null,null,{"$f":"SUM(L47:L53)","v":112.12800000000001},null,8.7816160000000139,8.4972648873713988E-2]
[null,"HST",null,null,null,0.13,null,{"$f":"H58*F59","v":13.43502992},null,0.13,null,{"$f":"L58*J59","v":14.576640000000003},null,1.1416100800000031,8.4972648873714085E-2]
[null,"Total Bill (including HST)",null,null,null,null,null,{"$f":"H58+H59","v":116.78141392000001},null,null,null,{"$f":"L58+L59","v":126.70464000000001},null,9.9232260800000063,8.4972648873713905E-2]
[null,"Ontario Clean Energy Benefit 1",null,null,null,null,null,{"$f":"ROUND(-H60*10%,2)","v":-11.68},null,null,null,{"$f":"ROUND(-L60*10%,2)","v":-12.67},null,-0.99000000000000021,8.4760273972602759E-2]
[null,"Total Bill on RPP (including OCEB)",null,null,null,null,null,{"$f":"SUM(H60:H61)","v":105.10141392},null,null,null,{"$f":"SUM(L60:L61)","v":114.03464000000001},null,8.9332260800000114,8.4996250257867237E-2]
[]
[null,"Total Bill on TOU (before Taxes)",null,null,null,null,null,{"$f":"SUM(H47:H51,H54:H56)","v":104.81167039999998},null,null,null,{"$f":"SUM(L47:L51,L54:L56)","v":113.64496000000001},null,{"$f":"L64-H64","v":8.8332896000000289},{"$f":"IF((H64)=0,\"\",(N64/H64))","v":8.4277729438801408E-2}]
[null,"HST",null,null,null,0.13,null,{"$f":"H64*F65","v":13.625517151999999},null,0.13,null,{"$f":"L64*J65","v":14.773844800000003},null,1.148327648000004,8.4277729438801421E-2]
[null,"Total Bill (including HST)",null,null,null,null,null,{"$f":"H64+H65","v":118.43718755199998},null,null,null,{"$f":"L64+L65","v":128.4188048},null,9.9816172480000205,8.427772943880131E-2]
[null,"Ontario Clean Energy Benefit 1",null,null,null,null,null,{"$f":"ROUND(-H66*10%,2)","v":-11.84},null,null,null,{"$f":"ROUND(-L66*10%,2)","v":-12.84},null,-1,8.4459459459459457E-2]
[null,"Total Bill on TOU (including OCEB)",null,null,null,null,null,{"$f":"H66+H67","v":106.59718755199998},null,null,null,{"$f":"L66+L67","v":115.5788048},null,8.9816172480000205,8.4257544258554001E-2]
[]
[]
[null,"Loss Factor (%)",null,null,null,7.8799999999999995E-2,null,null,null,7.0000000000000007E-2]
[]
["1 Applicable to eligible customers only.  Refer to the Ontario Clean Energy Benefit Act, 2010."]
[]
["Note that the \"Charge $\" columns provide breakdowns of the amounts that each bill component contributes to the total monthly bill at the referenced "]
["consumption level at existing and proposed rates."]
[]
["Applicants must provide bill impacts for residential at 800 kWh and GS<50kW at 2000 kWh. In addition, their filing should cover the range that is relevant"]
["to their service territory, class by class. A general guideline of consumption levels follows:"]
[]
["Residential (kWh) - 100, 250, 500, 800, 1000, 1500, 2000"]
["GS<50kW (kWh) - 1000, 2000, 5000, 10000, 15000"]
["GS>50kW (kW) - 60, 100, 500, 1000"]
["Large User - range appropriate for utility"]
["Lighting Classes and USL - 150 kWh and 1 kW, range appropriate for utility."]

{"sheet":"App.2-W_Bill Impacts_GS<50","index":53,"n_rows":85,"n_cols":20,"rows_kept":85,"cut":false,"hidden":false,"merged":[[2,0,2,10],[9,1,9,14],[10,1,10,14],[13,3,13,14],[17,5,17,7],[17,9,17,11],[17,13,17,14],[67,1,67,3],[18,3,19,3],[18,13,19,13],[18,14,19,14],[60,1,60,3],[61,1,61,3],[66,1,66,3]]}
[null,null,null,null,null,null,null,null,null,null,null,null,null,"File Number:",{"$f":"'[3]LDC Info'!$E$18","v":"EB2012-0176"},null,null,null,null,1]
[null,null,null,null,null,null,null,null,null,null,null,null,null,"Exhibit:"]
[null,null,null,null,null,null,null,null,null,null,null,null,null,"Tab:"]
[null,null,null,null,null,null,null,null,null,null,null,null,null,"Schedule:"]
[null,null,null,null,null,null,null,null,null,null,null,null,null,"Page:"]
[]
[null,null,null,null,null,null,null,null,null,null,null,null,null,"Date:"]
[]
[]
[null,"Appendix 2-W"]
[null,"Bill Impacts"]
[]
[]
[null,"Customer Class:",null,"GS<50"]
[]
[null,null,null,"Consumption",null,2000," kWh"]
[]
[null,null,null,null,null,"Current Board-Approved",null,null,null,"Proposed",null,null,null,"Impact"]
[null,null,null,"Charge Unit",null,"Rate","Volume","Charge",null,"Rate","Volume","Charge",null,"$ Change","% Change"]
[null,null,null,null,null,"($)",null,"($)",null,"($)",null,"($)"]
[null,"Monthly Service Charge",null,"per kWh",null,20.77,1,{"$f":"G21*F21","v":20.77},null,20.77,1,{"$f":"K21*J21","v":20.77},null,{"$f":"L21-H21","v":0},{"$f":"IF((H21)=0,\"\",(N21/H21))","v":0}]
[null,"Smart Meter Rate Adder",null,"Monthly",null,null,1,{"$f":"G22*F22","v":0},null,null,1,0,null,{"$f":"L22-H22","v":0},{"$f":"IF((H22)=0,\"\",(N22/H22))","v":""}]
[null,"SMDR",null,"Monthly",null,null,1,0,null,0.51,1,0.51,null,{"$f":"L23-H23","v":0.51},{"$f":"IF((H23)=0,\"\",(N23/H23))","v":""}]
[null,"Stranded Meter Rate Rider",null,"Monthly",null,null,1,0,null,4.1574,1,4.1574,null,4.1574,""]
[null,null,null,null,null,null,1,0,null,null,1,0,null,0,""]
[null,null,null,null,null,null,1,0,null,null,1,0,null,0,""]
[null,"Distribution Volumetric Rate",null,"per kWh",null,9.1999999999999998E-3,{"$f":"$F$16","v":2000},18.399999999999999,null,1.1599999999999999E-2,{"$f":"$F$16","v":2000},23.2,null,4.8000000000000007,0.26086956521739135]
[null,"Smart Meter Disposition Rider",null,null,null,null,{"$f":"$F$16","v":2000},0,null,null,{"$f":"$F$16","v":2000},0,null,0,""]
[null,"LRAM & SSM Rate Rider",null,"per kWh",null,2.0000000000000001E-4,{"$f":"$F$16","v":2000},0.4,null,null,2000,0,null,-0.4,-1]
[null,"Rate Rider for Tax Adjustments",null,"per kWh",null,-2.0000000000000001E-4,{"$f":"$F$16","v":2000},-0.4,null,null,2000,0,null,0.4,-1]
[null,null,null,"per kWh",null,null,2000,0,null,null,2000,0,null,0,""]
[null,null,null,null,null,null,2000,0,null,null,2000,0,null,0,""]
[null,null,null,null,null,null,2000,0,null,null,2000,0,null,0,""]
[null,null,null,null,null,null,2000,0,null,null,2000,0,null,0,""]
[null,null,null,null,null,null,2000,0,null,null,2000,0,null,0,""]
[null,null,null,null,null,null,2000,0,null,null,2000,0,null,0,""]
[null,"Sub-Total A",null,null,null,null,null,{"$f":"SUM(H21:H36)","v":39.17},null,null,null,{"$f":"SUM(L21:L36)","v":48.6374},null,9.4673999999999978,0.24170028082716358]
[null,"Deferral/Variance Account Disposition Rate Rider",null,"per kWh",null,-1.5E-3,{"$f":"$F$16","v":2000},{"$f":"G38*F38","v":-3},null,2.5999999999999999E-3,{"$f":"$F$16","v":2000},{"$f":"K38*J38","v":5.2},null,{"$f":"L38-H38","v":8.1999999999999993},{"$f":"IF((H38)=0,\"\",(N38/H38))","v":-2.7333333333333329}]
[null,null,null,null,null,null,{"$f":"$F$16","v":2000},{"$f":"G39*F39","v":0},null,null,{"$f":"$F$16","v":2000},{"$f":"K39*J39","v":0},null,{"$f":"L39-H39","v":0},{"$f":"IF((H39)=0,\"\",(N39/H39))","v":""}]
[null,null,null,null,null,null,2000,0,null,null,2000,0,null,0,""]
[null,null,null,null,null,null,2000,0,null,null,2000,0,null,0,""]
[null,"Low Voltage Service Charge",null,null,null,1.1000000000000001E-3,2000,{"$f":"G42*F42","v":2.2000000000000002},null,1.5E-3,2000,{"$f":"K42*J42","v":3},null,{"$f":"L42-H42","v":0.79999999999999982},{"$f":"IF((H42)=0,\"\",(N42/H42))","v":0.36363636363636354}]
[null,"Smart Meter Entity Charge",null,null,null,null,null,null,null,null,2000,{"$f":"K43*J43","v":0},null,{"$f":"L43-H43","v":0}]
[null,"Sub-Total B - Distribution (includes Sub-Total A)",null,null,null,null,null,{"$f":"SUM(H38:H42)+H37","v":38.370000000000005},null,null,null,{"$f":"SUM(L38:L42)+L37","v":56.837400000000002},null,{"$f":"L44-H44","v":18.467399999999998},{"$f":"IF((H44)=0,\"\",(N44/H44))","v":0.4812978889757622}]
[null,"RTSR - Network",null,"per kWh",null,4.7999999999999996E-3,{"$f":"F16*(1+F71)","v":2157.6},{"$f":"G45*F45","v":10.356479999999999},null,5.4999999999999997E-3,{"$f":"F16*(1+J71)","v":2140},{"$f":"K45*J45","v":11.77},null,1.4135200000000001,0.13648652824125573]
[null,"RTSR - Line and Transformation Connection",null,"per kWh",null,1.6999999999999999E-3,{"$f":"G45","v":2157.6},{"$f":"G46*F46","v":3.6679199999999996},null,1.9E-3,{"$f":"K45","v":2140},{"$f":"K46*J46","v":4.0659999999999998},null,0.39808000000000021,0.10853017514013398]
[null,"Sub-Total C - Delivery (including Sub-Total B)",null,null,null,null,null,{"$f":"SUM(H44:H46)","v":52.394400000000005},null,null,null,{"$f":"SUM(L44:L46)","v":72.673400000000001},null,20.278999999999996,0.38704518040095875]
[null,"Wholesale Market Service Charge (WMSC)",null,"per kWh",null,5.1999999999999998E-3,{"$f":"G46","v":2157.6},{"$f":"G48*F48","v":11.219519999999999},null,5.1999999999999998E-3,{"$f":"K46","v":2140},{"$f":"K48*J48","v":11.128},null,-9.1519999999999158E-2,-8.1572117167222086E-3]
[null,"Rural and Remote Rate Protection (RRRP)",null,"per kWh",null,1.1000000000000001E-3,{"$f":"G46","v":2157.6},2.3733599999999999,null,1.1000000000000001E-3,{"$f":"K46","v":2140},2.3540000000000001,null,-1.9359999999999822E-2,-8.1572117167222086E-3]
[null,"Standard Supply Service Charge",null,"Monthly",null,0.25,1,0.25,null,0.25,1,0.25,null,0,0]
[null,"Debt Retirement Charge (DRC)",null,"per kWh",null,6.9999999999999999E-4,{"$f":"G49","v":2157.6},1.5103199999999999,null,6.9999999999999999E-4,{"$f":"K49","v":2140},1.498,null,-1.2319999999999887E-2,-8.1572117167222104E-3]
[null,"Energy - RPP - Tier 1",null,"per kWh",null,7.4999999999999997E-2,{"$f":"IF($T$1=1,IF($F$16>=600,600,IF($F$16<600,$F$16*(1+$F$71),$F$16-600)),IF($T$1=2,IF($F$16>=1000,1000,IF($F$16<1000,$F$16*(1+$F$71),$F$16-1000))))","v":600},{"$f":"G52*F52","v":45},null,7.4999999999999997E-2,{"$f":"IF($T$1=1,IF($F$16>=600,600,IF($F$16<600,$F$16*(1+$J$71),$F$16-600)),IF($T$1=2,IF($F$16>=1000,1000,IF($F$16<1000,$F$16*(1+$J$71),$F$16-1000))))","v":600},{"$f":"K52*J52","v":45},null,0,0]
[null,"Energy - RPP - Tier 2",null,"per kWh",null,8.7999999999999995E-2,{"$f":"IF($T$1=1,IF($F$16>=600,$F$16*(1+$F$71)-600,IF($F$16<600,0,)), IF($T$1=2,IF($F$16>=1000,$F$16*(1+$F$71)-1000,IF($F$16<1000,0))))","v":1557.6},{"$f":"G53*F53","v":137.06879999999998},null,8.7999999999999995E-2,{"$f":"IF($T$1=1,IF($F$16>=600,$F$16*(1+$J$71)-600,IF($F$16<600,0,)), IF($T$1=2,IF($F$16>=1000,$F$16*(1+$J$71)-1000,IF($F$16<1000,0))))","v":1540},{"$f":"K53*J53","v":135.51999999999998},null,-1.5488,-1.1299435028248589E-2]
[null,"TOU - Off Peak",null,"per kWh",null,6.5000000000000002E-2,{"$f":"0.64*$F$16*(1+$F$71)","v":1380.864},89.756160000000008,null,6.5000000000000002E-2,{"$f":"0.64*$F$16*(1+$J$71)","v":1369.6000000000001},89.024000000000015,null,-0.73215999999999326,-8.1572117167222086E-3]
[null,"TOU - Mid Peak",null,"per kWh",null,0.1,{"$f":"0.18*$F$16*(1+$F$71)","v":388.36799999999999},38.836800000000004,null,0.1,{"$f":"0.18*$F$16*(1+$J$71)","v":385.20000000000005},38.52000000000001,null,-0.31679999999999353,-8.1572117167221167E-3]
[null,"TOU - On Peak",null,"per kWh",null,0.11700000000000001,{"$f":"0.18*$F$16*(1+$F$71)","v":388.36799999999999},45.439056000000001,null,0.11700000000000001,{"$f":"0.18*$F$16*(1+$J$71)","v":385.20000000000005},45.068400000000011,null,-0.37065599999998966,-8.157211716722056E-3]
[]
[null,"Total Bill on RPP (before Taxes)",null,null,null,null,null,{"$f":"SUM(H47:H53)","v":249.81639999999999},null,null,null,{"$f":"SUM(L47:L53)","v":268.42340000000002},null,18.607000000000028,7.4482700094949852E-2]
[null,"HST",null,null,null,0.13,null,{"$f":"H58*F59","v":32.476132},null,0.13,null,{"$f":"L58*J59","v":34.895042000000004},null,2.4189100000000039,7.4482700094949852E-2]
[null,"Total Bill (including HST)",null,null,null,null,null,{"$f":"H58+H59","v":282.29253199999999},null,null,null,{"$f":"L58+L59","v":303.318442},null,21.02591000000001,7.4482700094949769E-2]
[null,"Ontario Clean Energy Benefit 1",null,null,null,null,null,{"$f":"ROUND(-H60*10%,2)","v":-28.23},null,null,null,{"$f":"ROUND(-L60*10%,2)","v":-30.33},null,-2.0999999999999979,7.4388947927736371E-2]
[null,"Total Bill on RPP (including OCEB)",null,null,null,null,null,{"$f":"SUM(H60:H61)","v":254.062532},null,null,null,{"$f":"SUM(L60:L61)","v":272.98844200000002},null,18.925910000000016,7.4493117308616033E-2]
[]
[null,"Total Bill on TOU (before Taxes)",null,null,null,null,null,{"$f":"SUM(H47:H51,H54:H56)","v":241.779616},null,null,null,{"$f":"SUM(L47:L51,L54:L56)","v":260.51580000000007},null,{"$f":"L64-H64","v":18.736184000000065},{"$f":"IF((H64)=0,\"\",(N64/H64))","v":7.7492818914891751E-2}]
[null,"HST",null,null,null,0.13,null,{"$f":"H64*F65","v":31.431350080000001},null,0.13,null,{"$f":"L64*J65","v":33.86705400000001},null,2.4357039200000088,7.7492818914891765E-2]
[null,"Total Bill (including HST)",null,null,null,null,null,{"$f":"H64+H65","v":273.21096607999999},null,null,null,{"$f":"L64+L65","v":294.38285400000007},null,21.171887920000074,7.7492818914891765E-2]
[null,"Ontario Clean Energy Benefit 1",null,null,null,null,null,{"$f":"ROUND(-H66*10%,2)","v":-27.32},null,null,null,{"$f":"ROUND(-L66*10%,2)","v":-29.44},null,-2.120000000000001,7.7598828696925359E-2]
[null,"Total Bill on TOU (including OCEB)",null,null,null,null,null,{"$f":"H66+H67","v":245.89096608},null,null,null,{"$f":"L66+L67","v":264.94285400000007},null,19.05188792000007,7.7481040575527224E-2]
[]
[]
[null,"Loss Factor (%)",null,null,null,7.8799999999999995E-2,null,null,null,7.0000000000000007E-2]
[]
["1 Applicable to eligible customers only.  Refer to the Ontario Clean Energy Benefit Act, 2010."]
[]
["Note that the \"Charge $\" columns provide breakdowns of the amounts that each bill component contributes to the total monthly bill at the referenced "]
["consumption level at existing and proposed rates."]
[]
["Applicants must provide bill impacts for residential at 800 kWh and GS<50kW at 2000 kWh. In addition, their filing should cover the range that is relevant"]
["to their service territory, class by class. A general guideline of consumption levels follows:"]
[]
["Residential (kWh) - 100, 250, 500, 800, 1000, 1500, 2000"]
["GS<50kW (kWh) - 1000, 2000, 5000, 10000, 15000"]
["GS>50kW (kW) - 60, 100, 500, 1000"]
["Large User - range appropriate for utility"]
["Lighting Classes and USL - 150 kWh and 1 kW, range appropriate for utility."]

{"sheet":"App.2-W_Bill Impacts_GS>50","index":54,"n_rows":85,"n_cols":20,"rows_kept":85,"cut":false,"hidden":false,"merged":[[67,1,67,3],[18,3,19,3],[18,13,19,13],[18,14,19,14],[60,1,60,3],[61,1,61,3],[66,1,66,3],[2,0,2,10],[9,1,9,14],[10,1,10,14],[13,3,13,14],[17,5,17,7],[17,9,17,11],[17,13,17,14]]}
[null,null,null,null,null,null,null,null,null,null,null,null,null,"File Number:",{"$f":"'[3]LDC Info'!$E$18","v":"EB2012-0176"},null,null,null,null,1]
[null,null,null,null,null,null,null,null,null,null,null,null,null,"Exhibit:"]
[null,null,null,null,null,null,null,null,null,null,null,null,null,"Tab:"]
[null,null,null,null,null,null,null,null,null,null,null,null,null,"Schedule:"]
[null,null,null,null,null,null,null,null,null,null,null,null,null,"Page:"]
[]
[null,null,null,null,null,null,null,null,null,null,null,null,null,"Date:"]
[]
[]
[null,"Appendix 2-W"]
[null,"Bill Impacts"]
[]
[]
[null,"Customer Class:",null,"GS 50 to 4,999 kW"]
[]
[null,null,null,"Consumption",null,50000," kWh"]
[null,null,null,null,null,140,"KW"]
[null,null,null,null,null,"Current Board-Approved",null,null,null,"Proposed",null,null,null,"Impact"]
[null,null,null,"Charge Unit",null,"Rate","Volume","Charge",null,"Rate","Volume","Charge",null,"$ Change","% Change"]
[null,null,null,null,null,"($)",null,"($)",null,"($)",null,"($)"]
[null,"Monthly Service Charge",null,"Monthly",null,240.15,1,{"$f":"G21*F21","v":240.15},null,208.31,{"$f":"+G21","v":1},{"$f":"K21*J21","v":208.31},null,{"$f":"L21-H21","v":-31.840000000000003},{"$f":"IF((H21)=0,\"\",(N21/H21))","v":-0.13258380179054757}]
[null,"Smart Meter Rate Adder",null,"Monthly",null,null,1,{"$f":"G22*F22","v":0},null,null,{"$f":"+G22","v":1},0,null,{"$f":"L22-H22","v":0},{"$f":"IF((H22)=0,\"\",(N22/H22))","v":""}]
[null,"SMDR",null,"Monthly",null,null,1,0,null,3.04,1,3.04,null,{"$f":"L23-H23","v":3.04},{"$f":"IF((H23)=0,\"\",(N23/H23))","v":""}]
[null,"Stranded Meter Rate Rider",null,"Monthly",null,null,1,0,null,null,1,0,null,0,""]
[null,null,null,null,null,null,1,0,null,null,1,0,null,0,""]
[null,null,null,null,null,null,1,0,null,null,1,0,null,0,""]
[null,"Distribution Volumetric Rate",null,"per kW",null,2.2372999999999998,{"$f":"+$F$17","v":140},313.22199999999998,null,1.9665999999999999,140,275.32400000000001,null,-37.897999999999968,-0.12099405533455494]
[null,"Smart Meter Disposition Rider",null,null,null,null,{"$f":"+$F$17","v":140},0,null,null,140,0,null,0,""]
[null,"LRAM & SSM Rate Rider",null,"per kW",null,2.4400000000000002E-2,140,3.4160000000000004,null,null,140,0,null,-3.4160000000000004,-1]
[null,"Rate Rider for Tax Adjustments",null,"per kW",null,-3.7100000000000001E-2,140,-5.194,null,null,140,0,null,5.194,-1]
[null,null,null,"per kWh",null,null,140,0,null,null,140,0,null,0,""]
[null,null,null,null,null,null,140,0,null,null,140,0,null,0,""]
[null,null,null,null,null,null,140,0,null,null,140,0,null,0,""]
[null,null,null,null,null,null,140,0,null,null,140,0,null,0,""]
[null,null,null,null,null,null,140,0,null,null,140,0,null,0,""]
[null,null,null,null,null,null,140,0,null,null,140,0,null,0,""]
[null,"Sub-Total A",null,null,null,null,null,{"$f":"SUM(H21:H36)","v":551.59400000000005},null,null,null,{"$f":"SUM(L21:L36)","v":486.67399999999998},null,-64.920000000000073,-0.11769526136977572]
[null,"Deferral/Variance Account Disposition Rate Rider",null,"per kW",null,-0.57699999999999996,{"$f":"+$F$17","v":140},{"$f":"G38*F38","v":-80.78},null,0.90680000000000005,140,{"$f":"K38*J38","v":126.95200000000001},null,{"$f":"L38-H38","v":207.73200000000003},{"$f":"IF((H38)=0,\"\",(N38/H38))","v":-2.5715771230502602}]
[null,"Global Adjustment Rate Rider",null,"per kW",null,-0.1048,{"$f":"+$F$17","v":140},{"$f":"G39*F39","v":-14.672000000000001},null,0.59840000000000004,140,{"$f":"K39*J39","v":83.77600000000001},null,{"$f":"L39-H39","v":98.448000000000008},{"$f":"IF((H39)=0,\"\",(N39/H39))","v":-6.7099236641221376}]
[null,null,null,null,null,null,{"$f":"+$F$17","v":140},0,null,null,140,0,null,0,""]
[null,null,null,null,null,null,{"$f":"+$F$17","v":140},0,null,null,140,0,null,0,""]
[null,"Low Voltage Service Charge",null,"per kW",null,0.39900000000000002,{"$f":"+$F$17","v":140},{"$f":"G42*F42","v":55.86},null,0.56969999999999998,140,{"$f":"K42*J42","v":79.757999999999996},null,{"$f":"L42-H42","v":23.897999999999996},{"$f":"IF((H42)=0,\"\",(N42/H42))","v":0.42781954887218038}]
[null,"Smart Meter Entity Charge",null,null,null,null,null,null,null,null,0,{"$f":"K43*J43","v":0},null,{"$f":"L43-H43","v":0}]
[null,"Sub-Total B - Distribution (includes Sub-Total A)",null,null,null,null,null,{"$f":"SUM(H38:H42)+H37","v":512.00200000000007},null,null,null,{"$f":"SUM(L38:L42)+L37","v":777.16},null,{"$f":"L44-H44","v":265.1579999999999},{"$f":"IF((H44)=0,\"\",(N44/H44))","v":0.51788469576290697}]
[null,"RTSR - Network",null,"per kW",null,1.9886999999999999,{"$f":"+$F$17","v":140},{"$f":"G45*F45","v":278.41800000000001},null,2.2885,140,{"$f":"K45*J45","v":320.39},null,41.97199999999998,0.15075174737265543]
[null,"RTSR - Line and Transformation Connection",null,"per kW",null,0.69289999999999996,{"$f":"G45","v":140},{"$f":"G46*F46","v":97.006},null,0.76319999999999999,140,{"$f":"K46*J46","v":106.848},null,9.8419999999999987,0.10145764179535285]
[null,"Sub-Total C - Delivery (including Sub-Total B)",null,null,null,null,null,{"$f":"SUM(H44:H46)","v":887.42600000000004},null,null,null,{"$f":"SUM(L44:L46)","v":1204.3979999999999},null,316.97199999999987,0.35718133117578238]
[null,"Wholesale Market Service Charge (WMSC)",null,"per kWh",null,5.1999999999999998E-3,{"$f":"+$F$16","v":50000},{"$f":"G48*F48","v":260},null,5.1999999999999998E-3,50000,{"$f":"K48*J48","v":260},null,0,0]
[null,"Rural and Remote Rate Protection (RRRP)",null,"per kWh",null,1.1000000000000001E-3,{"$f":"+$F$16","v":50000},55,null,1.1000000000000001E-3,50000,55,null,0,0]
[null,"Standard Supply Service Charge",null,"Monthly",null,0.25,1,0.25,null,0.25,1,0.25,null,0,0]
[null,"Debt Retirement Charge (DRC)",null,"per kWh",null,6.9999999999999999E-4,{"$f":"G49","v":50000},35,null,6.9999999999999999E-4,50000,35,null,0,0]
[null,"Energy - RPP - Tier 1",null,"per kWh",null,7.4999999999999997E-2,{"$f":"IF($T$1=1,IF($F$16>=600,600,IF($F$16<600,$F$16*(1+$F$71),$F$16-600)),IF($T$1=2,IF($F$16>=1000,1000,IF($F$16<1000,$F$16*(1+$F$71),$F$16-1000))))","v":600},{"$f":"G52*F52","v":45},null,7.4999999999999997E-2,600,{"$f":"K52*J52","v":45},null,0,0]
[null,"Energy - RPP - Tier 2",null,"per kWh",null,8.7999999999999995E-2,{"$f":"IF($T$1=1,IF($F$16>=600,$F$16*(1+$F$71)-600,IF($F$16<600,0,)), IF($T$1=2,IF($F$16>=1000,$F$16*(1+$F$71)-1000,IF($F$16<1000,0))))","v":53340},{"$f":"G53*F53","v":4693.92},null,8.7999999999999995E-2,53340,{"$f":"K53*J53","v":4693.92},null,0,0]
[null,"TOU - Off Peak",null,"per kWh",null,6.5000000000000002E-2,{"$f":"0.64*$F$16*(1+$F$71)","v":34521.599999999999},2243.904,null,6.5000000000000002E-2,34521.599999999999,2243.904,null,0,0]
[null,"TOU - Mid Peak",null,"per kWh",null,0.1,{"$f":"0.18*$F$16*(1+$F$71)","v":9709.2000000000007},970.92000000000007,null,0.1,9709.2000000000007,970.92000000000007,null,0,0]
[null,"TOU - On Peak",null,"per kWh",null,0.11700000000000001,{"$f":"0.18*$F$16*(1+$F$71)","v":9709.2000000000007},1135.9764000000002,null,0.11700000000000001,9709.2000000000007,1135.9764000000002,null,0,0]
[]
[null,"Total Bill on RPP (before Taxes)",null,null,null,null,null,{"$f":"SUM(H47:H53)","v":5976.5959999999995},null,null,null,{"$f":"SUM(L47:L53)","v":6293.5680000000002},null,316.97200000000066,5.3035540632159289E-2]
[null,"HST",null,null,null,0.13,null,{"$f":"H58*F59","v":776.95747999999992},null,0.13,null,{"$f":"L58*J59","v":818.16384000000005},null,41.206360000000132,5.3035540632159352E-2]
[null,"Total Bill (including HST)",null,null,null,null,null,{"$f":"H58+H59","v":6753.5534799999996},null,null,null,{"$f":"L58+L59","v":7111.7318400000004},null,358.17836000000079,5.3035540632159296E-2]
[null,"Ontario Clean Energy Benefit 1",null,null,null,null,null,{"$f":"ROUND(-H60*10%,2)","v":-675.36},null,null,null,{"$f":"ROUND(-L60*10%,2)","v":-711.17},null,-35.809999999999945,5.3023572613124771E-2]
[null,"Total Bill on RPP (including OCEB)",null,null,null,null,null,{"$f":"SUM(H60:H61)","v":6078.1934799999999},null,null,null,{"$f":"SUM(L60:L61)","v":6400.5618400000003},null,322.36836000000039,5.3036870422229536E-2]
[]
[null,"Total Bill on TOU (before Taxes)",null,null,null,null,null,{"$f":"SUM(H47:H51,H54:H56)","v":5588.4764000000005},null,null,null,{"$f":"SUM(L47:L51,L54:L56)","v":5905.4484000000002},null,{"$f":"L64-H64","v":316.97199999999975},{"$f":"IF((H64)=0,\"\",(N64/H64))","v":5.6718858113098541E-2}]
[null,"HST",null,null,null,0.13,null,{"$f":"H64*F65","v":726.50193200000012},null,0.13,null,{"$f":"L64*J65","v":767.70829200000003},null,41.206359999999904,5.6718858113098451E-2]
[null,"Total Bill (including HST)",null,null,null,null,null,{"$f":"H64+H65","v":6314.9783320000006},null,null,null,{"$f":"L64+L65","v":6673.1566920000005},null,358.17835999999988,5.6718858113098569E-2]
[null,"Ontario Clean Energy Benefit 1",null,null,null,null,null,{"$f":"ROUND(-H66*10%,2)","v":-631.5},null,null,null,{"$f":"ROUND(-L66*10%,2)","v":-667.32},null,-35.82000000000005,5.6722090261282741E-2]
[null,"Total Bill on TOU (including OCEB)",null,null,null,null,null,{"$f":"H66+H67","v":5683.4783320000006},null,null,null,{"$f":"L66+L67","v":6005.8366920000008},null,322.35836000000018,5.6718498984153452E-2]
[]
[]
[null,"Loss Factor (%)",null,null,null,7.8799999999999995E-2,null,null,null,7.0000000000000007E-2]
[]
["1 Applicable to eligible customers only.  Refer to the Ontario Clean Energy Benefit Act, 2010."]
[]
["Note that the \"Charge $\" columns provide breakdowns of the amounts that each bill component contributes to the total monthly bill at the referenced "]
["consumption level at existing and proposed rates."]
[]
["Applicants must provide bill impacts for residential at 800 kWh and GS<50kW at 2000 kWh. In addition, their filing should cover the range that is relevant"]
["to their service territory, class by class. A general guideline of consumption levels follows:"]
[]
["Residential (kWh) - 100, 250, 500, 800, 1000, 1500, 2000"]
["GS<50kW (kWh) - 1000, 2000, 5000, 10000, 15000"]
["GS>50kW (kW) - 60, 100, 500, 1000"]
["Large User - range appropriate for utility"]
["Lighting Classes and USL - 150 kWh and 1 kW, range appropriate for utility."]

{"sheet":"App.2-W_Bill Impacts_USL","index":55,"n_rows":85,"n_cols":20,"rows_kept":85,"cut":false,"hidden":false,"merged":[[67,1,67,3],[18,3,19,3],[18,13,19,13],[18,14,19,14],[60,1,60,3],[61,1,61,3],[66,1,66,3],[2,0,2,10],[9,1,9,14],[10,1,10,14],[13,3,13,14],[17,5,17,7],[17,9,17,11],[17,13,17,14]]}
[null,null,null,null,null,null,null,null,null,null,null,null,null,"File Number:",{"$f":"'[3]LDC Info'!$E$18","v":"EB2012-0176"},null,null,null,null,1]
[null,null,null,null,null,null,null,null,null,null,null,null,null,"Exhibit:"]
[null,null,null,null,null,null,null,null,null,null,null,null,null,"Tab:"]
[null,null,null,null,null,null,null,null,null,null,null,null,null,"Schedule:"]
[null,null,null,null,null,null,null,null,null,null,null,null,null,"Page:"]
[]
[null,null,null,null,null,null,null,null,null,null,null,null,null,"Date:"]
[]
[]
[null,"Appendix 2-W"]
[null,"Bill Impacts"]
[]
[]
[null,"Customer Class:",null,"Unmetered Scattered Load"]
[]
[null,null,null,"Consumption",null,375," kWh"]
[]
[null,null,null,null,null,"Current Board-Approved",null,null,null,"Proposed",null,null,null,"Impact"]
[null,null,null,"Charge Unit",null,"Rate","Volume","Charge",null,"Rate","Volume","Charge",null,"$ Change","% Change"]
[null,null,null,null,null,"($)",null,"($)",null,"($)",null,"($)"]
[null,"Monthly Service Charge",null,"per kWh",null,11.3,1,{"$f":"G21*F21","v":11.3},null,6.29,1,{"$f":"K21*J21","v":6.29},null,{"$f":"L21-H21","v":-5.0100000000000007},{"$f":"IF((H21)=0,\"\",(N21/H21))","v":-0.44336283185840714}]
[null,"Smart Meter Rate Adder",null,"Monthly",null,null,1,{"$f":"G22*F22","v":0},null,null,1,{"$f":"K22*J22","v":0},null,{"$f":"L22-H22","v":0},{"$f":"IF((H22)=0,\"\",(N22/H22))","v":""}]
[null,"SMDR",null,"Monthly",null,null,1,0,null,null,1,{"$f":"K23*J23","v":0},null,{"$f":"L23-H23","v":0},{"$f":"IF((H23)=0,\"\",(N23/H23))","v":""}]
[null,"Stranded Meter Rate Rider",null,"Monthly",null,null,1,0,null,null,1,0,null,0,""]
[null,null,null,null,null,null,1,0,null,null,1,0,null,0,""]
[null,null,null,null,null,null,1,0,null,null,1,0,null,0,""]
[null,"Distribution Volumetric Rate",null,"per kWh",null,4.2200000000000001E-2,{"$f":"$F$16","v":375},15.825000000000001,null,2.35E-2,{"$f":"$F$16","v":375},8.8125,null,-7.0125000000000011,-0.44312796208530808]
[null,"Smart Meter Disposition Rider",null,null,null,null,{"$f":"$F$16","v":375},0,null,null,{"$f":"$F$16","v":375},0,null,0,""]
[null,"LRAM & SSM Rate Rider",null,"per kWh",null,null,{"$f":"$F$16","v":375},0,null,null,375,0,null,0,""]
[null,"Rate Rider for Tax Adjustments",null,"per kWh",null,-5.9999999999999995E-4,{"$f":"$F$16","v":375},-0.22499999999999998,null,null,375,0,null,0.22499999999999998,-1]
[null,null,null,"per kWh",null,null,375,0,null,null,375,0,null,0,""]
[null,null,null,null,null,null,375,0,null,null,375,0,null,0,""]
[null,null,null,null,null,null,375,0,null,null,375,0,null,0,""]
[null,null,null,null,null,null,375,0,null,null,375,0,null,0,""]
[null,null,null,null,null,null,375,0,null,null,375,0,null,0,""]
[null,null,null,null,null,null,375,0,null,null,375,0,null,0,""]
[null,"Sub-Total A",null,null,null,null,null,{"$f":"SUM(H21:H36)","v":26.9},null,null,null,{"$f":"SUM(L21:L36)","v":15.102499999999999},null,-11.797499999999999,-0.43856877323420074]
[null,"Deferral/Variance Account Disposition Rate Rider",null,"per kWh",null,-1.1999999999999999E-3,{"$f":"$F$16","v":375},{"$f":"G38*F38","v":-0.44999999999999996},null,2.8999999999999998E-3,{"$f":"$F$16","v":375},{"$f":"K38*J38","v":1.0874999999999999},null,{"$f":"L38-H38","v":1.5374999999999999},{"$f":"IF((H38)=0,\"\",(N38/H38))","v":-3.4166666666666665}]
[null,null,null,null,null,null,{"$f":"$F$16","v":375},{"$f":"G39*F39","v":0},null,null,{"$f":"$F$16","v":375},{"$f":"K39*J39","v":0},null,{"$f":"L39-H39","v":0},{"$f":"IF((H39)=0,\"\",(N39/H39))","v":""}]
[null,null,null,null,null,null,375,0,null,null,375,0,null,0,""]
[null,null,null,null,null,null,375,0,null,null,375,0,null,0,""]
[null,"Low Voltage Service Charge",null,null,null,1.1000000000000001E-3,375,{"$f":"G42*F42","v":0.41250000000000003},null,1.5E-3,375,{"$f":"K42*J42","v":0.5625},null,{"$f":"L42-H42","v":0.14999999999999997},{"$f":"IF((H42)=0,\"\",(N42/H42))","v":0.36363636363636354}]
[null,"Smart Meter Entity Charge",null,null,null,null,null,null,null,null,375,{"$f":"K43*J43","v":0},null,{"$f":"L43-H43","v":0}]
[null,"Sub-Total B - Distribution (includes Sub-Total A)",null,null,null,null,null,{"$f":"SUM(H38:H42)+H37","v":26.862499999999997},null,null,null,{"$f":"SUM(L38:L42)+L37","v":16.752499999999998},null,{"$f":"L44-H44","v":-10.11},{"$f":"IF((H44)=0,\"\",(N44/H44))","v":-0.37636109818520241}]
[null,"RTSR - Network",null,"per kWh",null,4.7999999999999996E-3,{"$f":"F16*(1+F71)","v":404.55},{"$f":"G45*F45","v":1.9418399999999998},null,5.4999999999999997E-3,{"$f":"F16*(1+J71)","v":401.25},{"$f":"K45*J45","v":2.2068749999999997},null,0.26503499999999991,0.13648652824125568]
[null,"RTSR - Line and Transformation Connection",null,"per kWh",null,1.6999999999999999E-3,{"$f":"G45","v":404.55},{"$f":"G46*F46","v":0.68773499999999999},null,1.9E-3,{"$f":"K45","v":401.25},{"$f":"K46*J46","v":0.76237500000000002},null,7.464000000000004E-2,0.10853017514013398]
[null,"Sub-Total C - Delivery (including Sub-Total B)",null,null,null,null,null,{"$f":"SUM(H44:H46)","v":29.492074999999996},null,null,null,{"$f":"SUM(L44:L46)","v":19.721749999999997},null,-9.7703249999999997,-0.33128645576820215]
[null,"Wholesale Market Service Charge (WMSC)",null,"per kWh",null,5.1999999999999998E-3,{"$f":"G46","v":404.55},{"$f":"G48*F48","v":2.1036600000000001},null,5.1999999999999998E-3,{"$f":"K46","v":401.25},{"$f":"K48*J48","v":2.0865},null,-1.7160000000000064E-2,-8.1572117167223145E-3]
[null,"Rural and Remote Rate Protection (RRRP)",null,"per kWh",null,1.1000000000000001E-3,{"$f":"G46","v":404.55},0.44500500000000004,null,1.1000000000000001E-3,{"$f":"K46","v":401.25},0.44137500000000002,null,-3.6300000000000221E-3,-8.1572117167223335E-3]
[null,"Standard Supply Service Charge",null,"Monthly",null,0.25,1,0.25,null,0.25,1,0.25,null,0,0]
[null,"Debt Retirement Charge (DRC)",null,"per kWh",null,6.9999999999999999E-4,{"$f":"G49","v":404.55},0.28318500000000002,null,6.9999999999999999E-4,{"$f":"K49","v":401.25},0.28087499999999999,null,-2.3100000000000342E-3,-8.1572117167224047E-3]
[null,"Energy - RPP - Tier 1",null,"per kWh",null,7.4999999999999997E-2,{"$f":"IF($T$1=1,IF($F$16>=600,600,IF($F$16<600,$F$16*(1+$F$71),$F$16-600)),IF($T$1=2,IF($F$16>=1000,1000,IF($F$16<1000,$F$16*(1+$F$71),$F$16-1000))))","v":404.55},{"$f":"G52*F52","v":30.341249999999999},null,7.4999999999999997E-2,{"$f":"IF($T$1=1,IF($F$16>=600,600,IF($F$16<600,$F$16*(1+$J$71),$F$16-600)),IF($T$1=2,IF($F$16>=1000,1000,IF($F$16<1000,$F$16*(1+$J$71),$F$16-1000))))","v":401.25},{"$f":"K52*J52","v":30.09375},null,-0.24749999999999872,-8.1572117167222416E-3]
[null,"Energy - RPP - Tier 2",null,"per kWh",null,8.7999999999999995E-2,{"$f":"IF($T$1=1,IF($F$16>=600,$F$16*(1+$F$71)-600,IF($F$16<600,0,)), IF($T$1=2,IF($F$16>=1000,$F$16*(1+$F$71)-1000,IF($F$16<1000,0))))","v":0},{"$f":"G53*F53","v":0},null,8.7999999999999995E-2,{"$f":"IF($T$1=1,IF($F$16>=600,$F$16*(1+$J$71)-600,IF($F$16<600,0,)), IF($T$1=2,IF($F$16>=1000,$F$16*(1+$J$71)-1000,IF($F$16<1000,0))))","v":0},{"$f":"K53*J53","v":0},null,0,""]
[null,"TOU - Off Peak",null,"per kWh",null,6.5000000000000002E-2,{"$f":"0.64*$F$16*(1+$F$71)","v":258.91199999999998},16.829280000000001,null,6.5000000000000002E-2,{"$f":"0.64*$F$16*(1+$J$71)","v":256.8},16.692,null,-0.13728000000000051,-8.1572117167223145E-3]
[null,"TOU - Mid Peak",null,"per kWh",null,0.1,{"$f":"0.18*$F$16*(1+$F$71)","v":72.819000000000003},7.2819000000000003,null,0.1,{"$f":"0.18*$F$16*(1+$J$71)","v":72.225000000000009},7.222500000000001,null,-5.9399999999999231E-2,-8.1572117167221774E-3]
[null,"TOU - On Peak",null,"per kWh",null,0.11700000000000001,{"$f":"0.18*$F$16*(1+$F$71)","v":72.819000000000003},8.5198230000000006,null,0.11700000000000001,{"$f":"0.18*$F$16*(1+$J$71)","v":72.225000000000009},8.4503250000000012,null,-6.9497999999999394E-2,-8.1572117167222121E-3]
[]
[null,"Total Bill on RPP (before Taxes)",null,null,null,null,null,{"$f":"SUM(H47:H53)","v":62.915175000000005},null,null,null,{"$f":"SUM(L47:L53)","v":52.874249999999996},null,-10.040925000000009,-0.15959464469422532]
[null,"HST",null,null,null,0.13,null,{"$f":"H58*F59","v":8.1789727500000016},null,0.13,null,{"$f":"L58*J59","v":6.8736524999999995},null,-1.3053202500000021,-0.15959464469422543]
[null,"Total Bill (including HST)",null,null,null,null,null,{"$f":"H58+H59","v":71.094147750000005},null,null,null,{"$f":"L58+L59","v":59.747902499999995},null,-11.34624525000001,-0.15959464469422532]
[null,"Ontario Clean Energy Benefit 1",null,null,null,null,null,{"$f":"ROUND(-H60*10%,2)","v":-7.11},null,null,null,{"$f":"ROUND(-L60*10%,2)","v":-5.97},null,1.1400000000000006,-0.1603375527426161]
[null,"Total Bill on RPP (including OCEB)",null,null,null,null,null,{"$f":"SUM(H60:H61)","v":63.984147750000005},null,null,null,{"$f":"SUM(L60:L61)","v":53.777902499999996},null,-10.206245250000009,-0.15951209180558334]
[]
[null,"Total Bill on TOU (before Taxes)",null,null,null,null,null,{"$f":"SUM(H47:H51,H54:H56)","v":65.204927999999995},null,null,null,{"$f":"SUM(L47:L51,L54:L56)","v":55.145325},null,{"$f":"L64-H64","v":-10.059602999999996},{"$f":"IF((H64)=0,\"\",(N64/H64))","v":-0.15427672889999966}]
[null,"HST",null,null,null,0.13,null,{"$f":"H64*F65","v":8.4766406399999994},null,0.13,null,{"$f":"L64*J65","v":7.1688922499999999},null,-1.3077483899999995,-0.15427672889999966]
[null,"Total Bill (including HST)",null,null,null,null,null,{"$f":"H64+H65","v":73.681568639999995},null,null,null,{"$f":"L64+L65","v":62.314217249999999},null,-11.367351389999996,-0.15427672889999966]
[null,"Ontario Clean Energy Benefit 1",null,null,null,null,null,{"$f":"ROUND(-H66*10%,2)","v":-7.37},null,null,null,{"$f":"ROUND(-L66*10%,2)","v":-6.23},null,1.1399999999999997,-0.15468113975576658]
[null,"Total Bill on TOU (including OCEB)",null,null,null,null,null,{"$f":"H66+H67","v":66.31156863999999},null,null,null,{"$f":"L66+L67","v":56.084217249999995},null,-10.227351389999995,-0.15423178187087441]
[]
[]
[null,"Loss Factor (%)",null,null,null,7.8799999999999995E-2,null,null,null,7.0000000000000007E-2]
[]
["1 Applicable to eligible customers only.  Refer to the Ontario Clean Energy Benefit Act, 2010."]
[]
["Note that the \"Charge $\" columns provide breakdowns of the amounts that each bill component contributes to the total monthly bill at the referenced "]
["consumption level at existing and proposed rates."]
[]
["Applicants must provide bill impacts for residential at 800 kWh and GS<50kW at 2000 kWh. In addition, their filing should cover the range that is relevant"]
["to their service territory, class by class. A general guideline of consumption levels follows:"]
[]
["Residential (kWh) - 100, 250, 500, 800, 1000, 1500, 2000"]
["GS<50kW (kWh) - 1000, 2000, 5000, 10000, 15000"]
["GS>50kW (kW) - 60, 100, 500, 1000"]
["Large User - range appropriate for utility"]
["Lighting Classes and USL - 150 kWh and 1 kW, range appropriate for utility."]

{"sheet":"App.2-W_Bill Impacts_Sentinel","index":56,"n_rows":85,"n_cols":20,"rows_kept":85,"cut":false,"hidden":false,"merged":[[67,1,67,3],[18,3,19,3],[18,13,19,13],[18,14,19,14],[60,1,60,3],[61,1,61,3],[66,1,66,3],[2,0,2,10],[9,1,9,14],[10,1,10,14],[13,3,13,14],[17,5,17,7],[17,9,17,11],[17,13,17,14]]}
[null,null,null,null,null,null,null,null,null,null,null,null,null,"File Number:",{"$f":"'[3]LDC Info'!$E$18","v":"EB2012-0176"},null,null,null,null,1]
[null,null,null,null,null,null,null,null,null,null,null,null,null,"Exhibit:"]
[null,null,null,null,null,null,null,null,null,null,null,null,null,"Tab:"]
[null,null,null,null,null,null,null,null,null,null,null,null,null,"Schedule:"]
[null,null,null,null,null,null,null,null,null,null,null,null,null,"Page:"]
[]
[null,null,null,null,null,null,null,null,null,null,null,null,null,"Date:"]
[]
[]
[null,"Appendix 2-W"]
[null,"Bill Impacts"]
[]
[]
[null,"Customer Class:",null,"Sentinel Lighting"]
[]
[null,null,null,"Consumption",null,200," kWh"]
[null,null,null,null,null,0.2,"KW"]
[null,null,null,null,null,"Current Board-Approved",null,null,null,"Proposed",null,null,null,"Impact"]
[null,null,null,"Charge Unit",null,"Rate","Volume","Charge",null,"Rate","Volume","Charge",null,"$ Change","% Change"]
[null,null,null,null,null,"($)",null,"($)",null,"($)",null,"($)"]
[null,"Monthly Service Charge",null,"Monthly",null,2.5299999999999998,1,{"$f":"G21*F21","v":2.5299999999999998},null,4.58,{"$f":"+G21","v":1},{"$f":"K21*J21","v":4.58},null,{"$f":"L21-H21","v":2.0500000000000003},{"$f":"IF((H21)=0,\"\",(N21/H21))","v":0.81027667984189744}]
[null,"Smart Meter Rate Adder",null,"Monthly",null,null,1,{"$f":"G22*F22","v":0},null,null,{"$f":"+G22","v":1},0,null,{"$f":"L22-H22","v":0},{"$f":"IF((H22)=0,\"\",(N22/H22))","v":""}]
[null,"SMDR",null,"Monthly",null,null,1,0,null,null,1,0,null,{"$f":"L23-H23","v":0},{"$f":"IF((H23)=0,\"\",(N23/H23))","v":""}]
[null,"Stranded Meter Rate Rider",null,"Monthly",null,null,1,0,null,null,1,0,null,0,""]
[null,null,null,null,null,null,1,0,null,null,1,0,null,0,""]
[null,null,null,null,null,null,1,0,null,null,1,0,null,0,""]
[null,"Distribution Volumetric Rate",null,"per kW",null,13.0802,{"$f":"+$F$17","v":0.2},2.6160399999999999,null,23.68,0.2,4.7359999999999998,null,2.1199599999999998,0.81036987202030542]
[null,"Smart Meter Disposition Rider",null,null,null,null,{"$f":"+$F$17","v":0.2},0,null,null,0.2,0,null,0,""]
[null,"LRAM & SSM Rate Rider",null,"per kW",null,null,0.2,0,null,null,0.2,0,null,0,""]
[null,"Rate Rider for Tax Adjustments",null,"per kW",null,-0.2288,0.2,-4.5760000000000002E-2,null,null,0.2,0,null,4.5760000000000002E-2,-1]
[null,null,null,"per kWh",null,null,0.2,0,null,null,0.2,0,null,0,""]
[null,null,null,null,null,null,0.2,0,null,null,0.2,0,null,0,""]
[null,null,null,null,null,null,0.2,0,null,null,0.2,0,null,0,""]
[null,null,null,null,null,null,0.2,0,null,null,0.2,0,null,0,""]
[null,null,null,null,null,null,0.2,0,null,null,0.2,0,null,0,""]
[null,null,null,null,null,null,0.2,0,null,null,0.2,0,null,0,""]
[null,"Sub-Total A",null,null,null,null,null,{"$f":"SUM(H21:H36)","v":5.1002799999999997},null,null,null,{"$f":"SUM(L21:L36)","v":9.3159999999999989},null,4.2157199999999992,0.82656638459064979]
[null,"Deferral/Variance Account Disposition Rate Rider",null,"per kW",null,-1.1627000000000001,{"$f":"+$F$17","v":0.2},{"$f":"G38*F38","v":-0.23254000000000002},null,3.2890999999999999,0.2,{"$f":"K38*J38","v":0.65782000000000007},null,{"$f":"L38-H38","v":0.89036000000000004},{"$f":"IF((H38)=0,\"\",(N38/H38))","v":-3.8288466500387028}]
[null,"Global Adjustment Rate Rider",null,"per kW",null,null,{"$f":"+$F$17","v":0.2},{"$f":"G39*F39","v":0},null,null,0.2,{"$f":"K39*J39","v":0},null,{"$f":"L39-H39","v":0},{"$f":"IF((H39)=0,\"\",(N39/H39))","v":""}]
[null,null,null,null,null,null,{"$f":"+$F$17","v":0.2},0,null,null,0.2,0,null,0,""]
[null,null,null,null,null,null,{"$f":"+$F$17","v":0.2},0,null,null,0.2,0,null,0,""]
[null,"Low Voltage Service Charge",null,"per kW",null,0.31530000000000002,{"$f":"+$F$17","v":0.2},{"$f":"G42*F42","v":6.3060000000000005E-2},null,0.43969999999999998,0.2,{"$f":"K42*J42","v":8.7940000000000004E-2},null,{"$f":"L42-H42","v":2.4879999999999999E-2},{"$f":"IF((H42)=0,\"\",(N42/H42))","v":0.39454487789406911}]
[null,"Smart Meter Entity Charge",null,null,null,null,null,null,null,null,0,{"$f":"K43*J43","v":0},null,{"$f":"L43-H43","v":0}]
[null,"Sub-Total B - Distribution (includes Sub-Total A)",null,null,null,null,null,{"$f":"SUM(H38:H42)+H37","v":4.9307999999999996},null,null,null,{"$f":"SUM(L38:L42)+L37","v":10.06176},null,{"$f":"L44-H44","v":5.13096},{"$f":"IF((H44)=0,\"\",(N44/H44))","v":1.0405938184473109}]
[null,"RTSR - Network",null,"per kW",null,1.5096000000000001,{"$f":"+$F$17","v":0.2},{"$f":"G45*F45","v":0.30192000000000002},null,1.7234,0.2,{"$f":"K45*J45","v":0.34468000000000004},null,4.276000000000002E-2,0.14162692103868579]
[null,"RTSR - Line and Transformation Connection",null,"per kW",null,0.54759999999999998,{"$f":"G45","v":0.2},{"$f":"G46*F46","v":0.10952000000000001},null,0.58899999999999997,0.2,{"$f":"K46*J46","v":0.1178},null,8.2799999999999957E-3,7.560262965668367E-2]
[null,"Sub-Total C - Delivery (including Sub-Total B)",null,null,null,null,null,{"$f":"SUM(H44:H46)","v":5.3422399999999994},null,null,null,{"$f":"SUM(L44:L46)","v":10.524240000000001},null,5.1820000000000013,0.97000509149720004]
[null,"Wholesale Market Service Charge (WMSC)",null,"per kWh",null,5.1999999999999998E-3,{"$f":"+$F$16","v":200},{"$f":"G48*F48","v":1.04},null,5.1999999999999998E-3,200,{"$f":"K48*J48","v":1.04},null,0,0]
[null,"Rural and Remote Rate Protection (RRRP)",null,"per kWh",null,1.1000000000000001E-3,{"$f":"+$F$16","v":200},0.22,null,1.1000000000000001E-3,200,0.22,null,0,0]
[null,"Standard Supply Service Charge",null,"Monthly",null,0.25,1,0.25,null,0.25,1,0.25,null,0,0]
[null,"Debt Retirement Charge (DRC)",null,"per kWh",null,6.9999999999999999E-4,{"$f":"G49","v":200},0.13999999999999999,null,6.9999999999999999E-4,200,0.13999999999999999,null,0,0]
[null,"Energy - RPP - Tier 1",null,"per kWh",null,7.4999999999999997E-2,{"$f":"IF($T$1=1,IF($F$16>=600,600,IF($F$16<600,$F$16*(1+$F$71),$F$16-600)),IF($T$1=2,IF($F$16>=1000,1000,IF($F$16<1000,$F$16*(1+$F$71),$F$16-1000))))","v":215.76},{"$f":"G52*F52","v":16.181999999999999},null,7.4999999999999997E-2,215.76,{"$f":"K52*J52","v":16.181999999999999},null,0,0]
[null,"Energy - RPP - Tier 2",null,"per kWh",null,8.7999999999999995E-2,{"$f":"IF($T$1=1,IF($F$16>=600,$F$16*(1+$F$71)-600,IF($F$16<600,0,)), IF($T$1=2,IF($F$16>=1000,$F$16*(1+$F$71)-1000,IF($F$16<1000,0))))","v":0},{"$f":"G53*F53","v":0},null,8.7999999999999995E-2,0,{"$f":"K53*J53","v":0},null,0,""]
[null,"TOU - Off Peak",null,"per kWh",null,6.5000000000000002E-2,{"$f":"0.64*$F$16*(1+$F$71)","v":138.0864},8.9756160000000005,null,6.5000000000000002E-2,138.0864,8.9756160000000005,null,0,0]
[null,"TOU - Mid Peak",null,"per kWh",null,0.1,{"$f":"0.18*$F$16*(1+$F$71)","v":38.836799999999997},3.88368,null,0.1,38.836799999999997,3.88368,null,0,0]
[null,"TOU - On Peak",null,"per kWh",null,0.11700000000000001,{"$f":"0.18*$F$16*(1+$F$71)","v":38.836799999999997},4.5439055999999995,null,0.11700000000000001,38.836799999999997,4.5439055999999995,null,0,0]
[]
[null,"Total Bill on RPP (before Taxes)",null,null,null,null,null,{"$f":"SUM(H47:H53)","v":23.174239999999998},null,null,null,{"$f":"SUM(L47:L53)","v":28.35624},null,5.1820000000000022,0.22361035356499298]
[null,"HST",null,null,null,0.13,null,{"$f":"H58*F59","v":3.0126511999999996},null,0.13,null,{"$f":"L58*J59","v":3.6863112},null,0.67366000000000037,0.22361035356499301]
[null,"Total Bill (including HST)",null,null,null,null,null,{"$f":"H58+H59","v":26.186891199999998},null,null,null,{"$f":"L58+L59","v":32.042551199999998},null,5.8556600000000003,0.22361035356499287]
[null,"Ontario Clean Energy Benefit 1",null,null,null,null,null,{"$f":"ROUND(-H60*10%,2)","v":-2.62},null,null,null,{"$f":"ROUND(-L60*10%,2)","v":-3.2},null,-0.58000000000000007,0.22137404580152673]
[null,"Total Bill on RPP (including OCEB)",null,null,null,null,null,{"$f":"SUM(H60:H61)","v":23.566891199999997},null,null,null,{"$f":"SUM(L60:L61)","v":28.842551199999999},null,5.275660000000002,0.22385897041863556]
[]
[null,"Total Bill on TOU (before Taxes)",null,null,null,null,null,{"$f":"SUM(H47:H51,H54:H56)","v":24.395441599999998},null,null,null,{"$f":"SUM(L47:L51,L54:L56)","v":29.577441600000004},null,{"$f":"L64-H64","v":5.1820000000000057},{"$f":"IF((H64)=0,\"\",(N64/H64))","v":0.21241673280470585}]
[null,"HST",null,null,null,0.13,null,{"$f":"H64*F65","v":3.1714074079999999},null,0.13,null,{"$f":"L64*J65","v":3.8450674080000007},null,0.67366000000000081,0.21241673280470588]
[null,"Total Bill (including HST)",null,null,null,null,null,{"$f":"H64+H65","v":27.566849007999998},null,null,null,{"$f":"L64+L65","v":33.422509008000006},null,5.8556600000000074,0.21241673280470588]
[null,"Ontario Clean Energy Benefit 1",null,null,null,null,null,{"$f":"ROUND(-H66*10%,2)","v":-2.76},null,null,null,{"$f":"ROUND(-L66*10%,2)","v":-3.34},null,-0.58000000000000007,0.21014492753623193]
[null,"Total Bill on TOU (including OCEB)",null,null,null,null,null,{"$f":"H66+H67","v":24.806849008},null,null,null,{"$f":"L66+L67","v":30.082509008000006},null,5.2756600000000056,0.21266949294118934]
[]
[]
[null,"Loss Factor (%)",null,null,null,7.8799999999999995E-2,null,null,null,7.0000000000000007E-2]
[]
["1 Applicable to eligible customers only.  Refer to the Ontario Clean Energy Benefit Act, 2010."]
[]
["Note that the \"Charge $\" columns provide breakdowns of the amounts that each bill component contributes to the total monthly bill at the referenced "]
["consumption level at existing and proposed rates."]
[]
["Applicants must provide bill impacts for residential at 800 kWh and GS<50kW at 2000 kWh. In addition, their filing should cover the range that is relevant"]
["to their service territory, class by class. A general guideline of consumption levels follows:"]
[]
["Residential (kWh) - 100, 250, 500, 800, 1000, 1500, 2000"]
["GS<50kW (kWh) - 1000, 2000, 5000, 10000, 15000"]
["GS>50kW (kW) - 60, 100, 500, 1000"]
["Large User - range appropriate for utility"]
["Lighting Classes and USL - 150 kWh and 1 kW, range appropriate for utility."]

{"sheet":"App.2-W_Bill Impacts_Streetligh","index":57,"n_rows":85,"n_cols":20,"rows_kept":85,"cut":false,"hidden":false,"merged":[[67,1,67,3],[18,3,19,3],[18,13,19,13],[18,14,19,14],[60,1,60,3],[61,1,61,3],[66,1,66,3],[2,0,2,10],[9,1,9,14],[10,1,10,14],[13,3,13,14],[17,5,17,7],[17,9,17,11],[17,13,17,14]]}
[null,null,null,null,null,null,null,null,null,null,null,null,null,"File Number:",{"$f":"'[3]LDC Info'!$E$18","v":"EB2012-0176"},null,null,null,null,1]
[null,null,null,null,null,null,null,null,null,null,null,null,null,"Exhibit:"]
[null,null,null,null,null,null,null,null,null,null,null,null,null,"Tab:"]
[null,null,null,null,null,null,null,null,null,null,null,null,null,"Schedule:"]
[null,null,null,null,null,null,null,null,null,null,null,null,null,"Page:"]
[]
[null,null,null,null,null,null,null,null,null,null,null,null,null,"Date:"]
[]
[]
[null,"Appendix 2-W"]
[null,"Bill Impacts"]
[]
[]
[null,"Customer Class:",null,"Street Lighting"]
[]
[null,null,null,"Consumption",null,500," kWh"]
[null,null,null,null,null,3,"KW"]
[null,null,null,null,null,"Current Board-Approved",null,null,null,"Proposed",null,null,null,"Impact"]
[null,null,null,"Charge Unit",null,"Rate","Volume","Charge",null,"Rate","Volume","Charge",null,"$ Change","% Change"]
[null,null,null,null,null,"($)",null,"($)",null,"($)",null,"($)"]
[null,"Monthly Service Charge",null,"Monthly",null,3.88,1,{"$f":"G21*F21","v":3.88},null,4.3099999999999996,{"$f":"+G21","v":1},{"$f":"K21*J21","v":4.3099999999999996},null,{"$f":"L21-H21","v":0.42999999999999972},{"$f":"IF((H21)=0,\"\",(N21/H21))","v":0.11082474226804116}]
[null,"Smart Meter Rate Adder",null,"Monthly",null,null,1,{"$f":"G22*F22","v":0},null,null,{"$f":"+G22","v":1},0,null,{"$f":"L22-H22","v":0},{"$f":"IF((H22)=0,\"\",(N22/H22))","v":""}]
[null,"SMDR",null,"Monthly",null,null,1,0,null,null,1,0,null,{"$f":"L23-H23","v":0},{"$f":"IF((H23)=0,\"\",(N23/H23))","v":""}]
[null,"Stranded Meter Rate Rider",null,"Monthly",null,null,1,0,null,null,1,0,null,0,""]
[null,null,null,null,null,null,1,0,null,null,1,0,null,0,""]
[null,null,null,null,null,null,1,0,null,null,1,0,null,0,""]
[null,"Distribution Volumetric Rate",null,"per kW",null,3.2599,{"$f":"+$F$17","v":3},9.7797000000000001,null,3.6356000000000002,3,10.9068,null,1.1271000000000004,0.11524893401638091]
[null,"Smart Meter Disposition Rider",null,null,null,null,{"$f":"+$F$17","v":3},0,null,null,3,0,null,0,""]
[null,"LRAM & SSM Rate Rider",null,"per kW",null,null,3,0,null,null,3,0,null,0,""]
[null,"Rate Rider for Tax Adjustments",null,"per kW",null,-0.27800000000000002,3,-0.83400000000000007,null,null,3,0,null,0.83400000000000007,-1]
[null,null,null,"per kWh",null,null,3,0,null,null,3,0,null,0,""]
[null,null,null,null,null,null,3,0,null,null,3,0,null,0,""]
[null,null,null,null,null,null,3,0,null,null,3,0,null,0,""]
[null,null,null,null,null,null,3,0,null,null,3,0,null,0,""]
[null,null,null,null,null,null,3,0,null,null,3,0,null,0,""]
[null,null,null,null,null,null,3,0,null,null,3,0,null,0,""]
[null,"Sub-Total A",null,null,null,null,null,{"$f":"SUM(H21:H36)","v":12.825700000000001},null,null,null,{"$f":"SUM(L21:L36)","v":15.216799999999999},null,2.391099999999998,0.1864303702721877]
[null,"Deferral/Variance Account Disposition Rate Rider",null,"per kW",null,8.4709999999999994E-2,{"$f":"+$F$17","v":3},{"$f":"G38*F38","v":0.25412999999999997},null,1.5929,3,{"$f":"K38*J38","v":4.7786999999999997},null,{"$f":"L38-H38","v":4.5245699999999998},{"$f":"IF((H38)=0,\"\",(N38/H38))","v":17.804155353559203}]
[null,"Global Adjustment Rate Rider",null,"per kW",null,null,{"$f":"+$F$17","v":3},{"$f":"G39*F39","v":0},null,null,3,{"$f":"K39*J39","v":0},null,{"$f":"L39-H39","v":0},{"$f":"IF((H39)=0,\"\",(N39/H39))","v":""}]
[null,null,null,null,null,null,{"$f":"+$F$17","v":3},0,null,null,3,0,null,0,""]
[null,null,null,null,null,null,{"$f":"+$F$17","v":3},0,null,null,3,0,null,0,""]
[null,"Low Voltage Service Charge",null,"per kW",null,0.30790000000000001,{"$f":"+$F$17","v":3},{"$f":"G42*F42","v":0.92369999999999997},null,0.45019999999999999,3,{"$f":"K42*J42","v":1.3506},null,{"$f":"L42-H42","v":0.42690000000000006},{"$f":"IF((H42)=0,\"\",(N42/H42))","v":0.46216303994803515}]
[null,"Smart Meter Entity Charge",null,null,null,null,null,null,null,null,0,{"$f":"K43*J43","v":0},null,{"$f":"L43-H43","v":0}]
[null,"Sub-Total B - Distribution (includes Sub-Total A)",null,null,null,null,null,{"$f":"SUM(H38:H42)+H37","v":14.003530000000001},null,null,null,{"$f":"SUM(L38:L42)+L37","v":21.3461},null,{"$f":"L44-H44","v":7.3425699999999985},{"$f":"IF((H44)=0,\"\",(N44/H44))","v":0.52433707786536665}]
[null,"RTSR - Network",null,"per kW",null,1.4976,{"$f":"+$F$17","v":3},{"$f":"G45*F45","v":4.4927999999999999},null,1.7372000000000001,3,{"$f":"K45*J45","v":5.2116000000000007},null,0.71880000000000077,0.15998931623931642]
[null,"RTSR - Line and Transformation Connection",null,"per kW",null,0.53480000000000005,{"$f":"G45","v":3},{"$f":"G46*F46","v":1.6044},null,0.60309999999999997,3,{"$f":"K46*J46","v":1.8092999999999999},null,0.20489999999999986,0.12771129394166034]
[null,"Sub-Total C - Delivery (including Sub-Total B)",null,null,null,null,null,{"$f":"SUM(H44:H46)","v":20.100729999999999},null,null,null,{"$f":"SUM(L44:L46)","v":28.367000000000001},null,8.2662700000000022,0.41124227826551585]
[null,"Wholesale Market Service Charge (WMSC)",null,"per kWh",null,5.1999999999999998E-3,{"$f":"+$F$16","v":500},{"$f":"G48*F48","v":2.6},null,5.1999999999999998E-3,500,{"$f":"K48*J48","v":2.6},null,0,0]
[null,"Rural and Remote Rate Protection (RRRP)",null,"per kWh",null,1.1000000000000001E-3,{"$f":"+$F$16","v":500},0.55000000000000004,null,1.1000000000000001E-3,500,0.55000000000000004,null,0,0]
[null,"Standard Supply Service Charge",null,"Monthly",null,0.25,1,0.25,null,0.25,1,0.25,null,0,0]
[null,"Debt Retirement Charge (DRC)",null,"per kWh",null,6.9999999999999999E-4,{"$f":"G49","v":500},0.35,null,6.9999999999999999E-4,500,0.35,null,0,0]
[null,"Energy - RPP - Tier 1",null,"per kWh",null,7.4999999999999997E-2,{"$f":"IF($T$1=1,IF($F$16>=600,600,IF($F$16<600,$F$16*(1+$F$71),$F$16-600)),IF($T$1=2,IF($F$16>=1000,1000,IF($F$16<1000,$F$16*(1+$F$71),$F$16-1000))))","v":539.4},{"$f":"G52*F52","v":40.454999999999998},null,7.4999999999999997E-2,539.4,{"$f":"K52*J52","v":40.454999999999998},null,0,0]
[null,"Energy - RPP - Tier 2",null,"per kWh",null,8.7999999999999995E-2,{"$f":"IF($T$1=1,IF($F$16>=600,$F$16*(1+$F$71)-600,IF($F$16<600,0,)), IF($T$1=2,IF($F$16>=1000,$F$16*(1+$F$71)-1000,IF($F$16<1000,0))))","v":0},{"$f":"G53*F53","v":0},null,8.7999999999999995E-2,0,{"$f":"K53*J53","v":0},null,0,""]
[null,"TOU - Off Peak",null,"per kWh",null,6.5000000000000002E-2,{"$f":"0.64*$F$16*(1+$F$71)","v":345.21600000000001},22.439040000000002,null,6.5000000000000002E-2,345.21600000000001,22.439040000000002,null,0,0]
[null,"TOU - Mid Peak",null,"per kWh",null,0.1,{"$f":"0.18*$F$16*(1+$F$71)","v":97.091999999999999},9.7092000000000009,null,0.1,97.091999999999999,9.7092000000000009,null,0,0]
[null,"TOU - On Peak",null,"per kWh",null,0.11700000000000001,{"$f":"0.18*$F$16*(1+$F$71)","v":97.091999999999999},11.359764,null,0.11700000000000001,97.091999999999999,11.359764,null,0,0]
[]
[null,"Total Bill on RPP (before Taxes)",null,null,null,null,null,{"$f":"SUM(H47:H53)","v":64.305729999999997},null,null,null,{"$f":"SUM(L47:L53)","v":72.572000000000003},null,8.2662700000000058,0.12854639858687564]
[null,"HST",null,null,null,0.13,null,{"$f":"H58*F59","v":8.359744899999999},null,0.13,null,{"$f":"L58*J59","v":9.4343599999999999},null,1.0746151000000008,0.12854639858687567]
[null,"Total Bill (including HST)",null,null,null,null,null,{"$f":"H58+H59","v":72.665474899999992},null,null,null,{"$f":"L58+L59","v":82.006360000000001},null,9.3408851000000084,0.12854639858687567]
[null,"Ontario Clean Energy Benefit 1",null,null,null,null,null,{"$f":"ROUND(-H60*10%,2)","v":-7.27},null,null,null,{"$f":"ROUND(-L60*10%,2)","v":-8.1999999999999993},null,-0.92999999999999972,0.12792297111416778]
[null,"Total Bill on RPP (including OCEB)",null,null,null,null,null,{"$f":"SUM(H60:H61)","v":65.395474899999996},null,null,null,{"$f":"SUM(L60:L61)","v":73.806359999999998},null,8.4108851000000016,0.12861570487654647]
[]
[null,"Total Bill on TOU (before Taxes)",null,null,null,null,null,{"$f":"SUM(H47:H51,H54:H56)","v":67.358734000000013},null,null,null,{"$f":"SUM(L47:L51,L54:L56)","v":75.625004000000004},null,{"$f":"L64-H64","v":8.2662699999999916},{"$f":"IF((H64)=0,\"\",(N64/H64))","v":0.12272009150290726}]
[null,"HST",null,null,null,0.13,null,{"$f":"H64*F65","v":8.7566354200000021},null,0.13,null,{"$f":"L64*J65","v":9.8312505200000011},null,1.074615099999999,0.12272009150290726]
[null,"Total Bill (including HST)",null,null,null,null,null,{"$f":"H64+H65","v":76.115369420000007},null,null,null,{"$f":"L64+L65","v":85.456254520000002},null,9.3408850999999942,0.12272009150290732]
[null,"Ontario Clean Energy Benefit 1",null,null,null,null,null,{"$f":"ROUND(-H66*10%,2)","v":-7.61},null,null,null,{"$f":"ROUND(-L66*10%,2)","v":-8.5500000000000007},null,-0.94000000000000039,0.12352168199737193]
[null,"Total Bill on TOU (including OCEB)",null,null,null,null,null,{"$f":"H66+H67","v":68.505369420000008},null,null,null,{"$f":"L66+L67","v":76.906254520000005},null,8.4008850999999964,0.12263104587459352]
[]
[]
[null,"Loss Factor (%)",null,null,null,7.8799999999999995E-2,null,null,null,7.0000000000000007E-2]
[]
["1 Applicable to eligible customers only.  Refer to the Ontario Clean Energy Benefit Act, 2010."]
[]
["Note that the \"Charge $\" columns provide breakdowns of the amounts that each bill component contributes to the total monthly bill at the referenced "]
["consumption level at existing and proposed rates."]
[]
["Applicants must provide bill impacts for residential at 800 kWh and GS<50kW at 2000 kWh. In addition, their filing should cover the range that is relevant"]
["to their service territory, class by class. A general guideline of consumption levels follows:"]
[]
["Residential (kWh) - 100, 250, 500, 800, 1000, 1500, 2000"]
["GS<50kW (kWh) - 1000, 2000, 5000, 10000, 15000"]
["GS>50kW (kW) - 60, 100, 500, 1000"]
["Large User - range appropriate for utility"]
["Lighting Classes and USL - 150 kWh and 1 kW, range appropriate for utility."]

{"sheet":"App.2-X_CoS_Flowchart","index":58,"n_rows":16,"n_cols":7,"rows_kept":16,"cut":false,"hidden":false,"merged":[[15,1,15,6],[12,1,12,6],[13,1,13,6]]}
[null,null,null,null,null,"File Number:",{"$f":"'LDC Info'!$E$18","v":"EB2012-0176"}]
[null,null,null,null,null,"Exhibit:"]
[null,null,null,null,null,"Tab:"]
[null,null,null,null,null,"Schedule:"]
[null,null,null,null,null,"Page:"]
[]
[null,null,null,null,null,"Date:"]
[]
[]
[]
[]
[]
[null,"Appendix 2-X"]
[null,"Cost of Service Rate Application Schematic"]
[]
[null,"The Cost of Service Rate Application Schematic is a flowchart appended to Chapter 2 of the Filing Requirements as a guide for the components of an application and how demand and costs interrelate to derive the revenue requirement and then how the revenue requirement is allocated between classes and through fixed/variable splits to derive rates that will be compensatory for the annual revenue requirement, based on the the forecasted demand.  There is no form to be filled out; therefore, this Schedule is not required to be filed. "]