{"text_format":"1","workbook":"xlsx","n_sheets":18,"sheets":["1. Information Sheet","2. Table of Contents","3. Rate Class Selection","4. Current Tariff Schedule","4. Hidden","5. 2013 Continuity Schedule","6. Billing Det. for Def-Var","6. hidden","7. Allocating Def-Var Balances","8. Calculation of Def-Var RR","9. Rev2Cost_GDPIPI","9. hidden","10. Other Charges & LF","11. Proposed Rates","12. Summary Sheet","13. Final Tariff Schedule","14. Bill Impacts","lists"],"not_rendered":{"charts":0,"images":2,"macros":1,"external_links":3,"defined_names":356,"comments":0,"pivot_tables":0},"unopened":[],"bounds":{"document_bytes":16777216,"sheet_cells":100000,"rows_first":2000,"rows_last":500,"rows_between":2000,"halvings":0,"cell_chars":16384,"cell_head_chars":4096},"cells_cut":0,"cells_raw":0,"read":"whole","date_system":"1900"}

{"sheet":"1. Information Sheet","index":0,"n_rows":35,"n_cols":14,"rows_kept":35,"cut":false,"hidden":false,"merged":[[30,2,30,11],[32,2,32,13],[34,2,34,12],[25,5,25,7],[23,5,23,9],[21,5,21,9],[19,5,19,9],[13,5,13,11],[15,5,15,9],[17,5,17,9]]}
[]
[]
[]
[]
[]
[]
[]
[]
[]
[]
{"$rows_left_out":26}
{"sheet":"2. Table of Contents","index":1,"n_rows":20,"n_cols":8,"rows_kept":20,"cut":false,"hidden":false,"merged":[]}
[]
[]
[]
[]
[]
[]
[]
[]
[]
[]
{"$rows_left_out":11}
{"sheet":"3. Rate Class Selection","index":2,"n_rows":19,"n_cols":10,"rows_kept":19,"cut":false,"hidden":false,"merged":[[11,0,11,13],[18,1,18,9],[17,1,17,9]]}
[]
[]
[]
[]
[]
[]
[]
[]
[]
[]
{"$rows_left_out":10}
{"sheet":"4. Current Tariff Schedule","index":3,"n_rows":84,"n_cols":28,"rows_kept":84,"cut":false,"hidden":false,"merged":[[52,1,52,6],[25,1,30,8],[33,1,35,8],[36,1,39,8],[40,1,42,8],[43,1,46,8],[76,1,76,6],[75,1,75,6],[74,1,74,6],[73,1,73,6],[71,1,71,6],[11,1,17,8],[72,1,72,6],[48,1,48,6],[57,1,57,6],[20,1,20,8],[21,1,21,8],[23,1,23,8],[49,1,49,6],[53,1,53,6],[54,1,54,6],[55,1,55,6],[56,1,56,6],[58,1,58,6],[59,1,59,6],[50,1,50,6],[51,1,51,6],[83,1,83,6],[77,1,77,6],[80,1,80,6],[81,1,81,6],[82,1,82,6],[60,1,60,6],[61,1,61,6],[69,1,69,6],[70,1,70,6],[64,1,64,6],[65,1,65,6],[62,1,62,6],[63,1,63,6],[66,1,66,6],[67,1,67,6],[68,1,68,6]]}
[null,null,null,null,null,null,null,null,null,null,null,null,null,null,null,null,null,null,null,null,null,null,null,null,null,3,"January","≥"]
[null,null,null,null,null,null,null,null,null,null,null,null,null,null,null,null,null,null,null,null,null,null,null,null,null,null,"February"]
[null,null,null,null,null,null,null,null,null,null,null,null,null,null,null,null,null,null,null,null,null,null,null,null,null,null,"March"]
[null,null,null,null,null,null,null,null,null,null,null,null,null,null,null,null,null,null,null,null,null,null,null,null,null,null,"April"]
[null,null,null,null,null,null,null,null,null,null,null,null,null,null,null,null,null,null,null,null,null,null,null,null,null,null,"May"]
[null,null,null,null,null,null,null,null,null,null,null,null,null,null,null,null,null,null,null,null,null,null,null,null,null,null,"June"]
[null,null,null,null,null,null,null,null,null,null,null,null,null,null,null,null,null,null,null,null,null,null,null,null,null,null,"July"]
[null,null,null,null,null,null,null,null,null,null,null,null,null,null,null,null,null,null,null,null,null,null,null,null,null,null,"August"]
[null,null,null,null,null,null,null,null,null,null,null,null,null,null,null,null,null,null,null,null,null,null,null,null,null,null,"September"]
[null,null,null,null,null,null,null,null,null,null,null,null,null,null,null,null,null,null,null,null,null,null,null,null,null,null,"October"]
{"$rows_left_out":75}
{"sheet":"4. Hidden","index":4,"n_rows":84,"n_cols":18,"rows_kept":84,"cut":false,"hidden":true,"merged":[[77,1,77,6],[80,1,80,6],[81,1,81,6],[82,1,82,6],[83,1,83,6],[48,1,48,6],[49,1,49,6],[50,1,50,6],[51,1,51,6],[52,1,52,6],[62,1,62,6],[63,1,63,6],[64,1,64,6],[76,1,76,6],[66,1,66,6],[67,1,67,6],[68,1,68,6],[69,1,69,6],[70,1,70,6],[71,1,71,6],[72,1,72,6],[73,1,73,6],[74,1,74,6],[75,1,75,6],[57,1,57,6],[58,1,58,6],[43,1,46,8],[65,1,65,6],[23,1,23,8],[25,1,30,8],[33,1,35,8],[36,1,39,8],[40,1,42,8],[53,1,53,6],[54,1,54,6],[55,1,55,6],[56,1,56,6],[59,1,59,6],[60,1,60,6],[61,1,61,6]]}
[null,null,null,null,null,null,null,null,null,null,null,null,"Current Rate Classes","Changed to Rate Classes","Values in A that are NOT in B","Values in B that are Not in A","Count of A","Count of B"]
[null,null,null,null,null,null,null,null,null,null,null,null,"Embedded Distributor","Embedded Distributor",null,null,1,1]
[]
[]
[]
[]
[]
[]
[]
[]
{"$rows_left_out":75}
{"sheet":"5. 2013 Continuity Schedule","index":5,"n_rows":58,"n_cols":86,"rows_kept":58,"cut":false,"hidden":false,"merged":[[19,38,21,38],[19,27,21,27],[19,28,21,28],[18,54,18,63],[18,64,18,76],[19,29,21,29],[19,30,21,30],[19,31,21,31],[19,32,21,32],[19,33,21,33],[19,34,21,34],[19,35,21,35],[19,36,21,36],[19,37,21,37],[19,50,21,50],[19,39,21,39],[18,77,18,80],[18,81,18,83],[18,34,18,43],[18,44,18,53],[18,4,18,13],[18,14,18,23],[18,24,18,33],[19,26,21,26],[19,2,21,2],[19,3,21,3],[19,5,21,5],[19,6,21,6],[19,24,21,24],[19,25,21,25],[19,4,21,4],[19,23,21,23],[19,20,21,20],[19,14,21,14],[19,15,21,15],[19,16,21,16],[19,17,21,17],[19,9,21,9],[19,10,21,10],[19,40,21,40],[19,41,21,41],[19,42,21,42],[19,43,21,43],[19,44,21,44],[19,45,21,45],[19,46,21,46],[19,47,21,47],[19,48,21,48],[19,49,21,49],[19,64,21,64],[19,52,21,52],[19,53,21,53],[19,54,21,54],[19,55,21,55],[19,56,21,56],[19,62,21,62],[19,58,21,58],[19,59,21,59],[19,60,21,60],[19,61,21,61],[19,51,21,51],[19,85,21,85],[19,75,21,75],[19,76,21,76],[19,77,21,77],[19,78,21,78],[19,79,21,79],[19,80,21,80],[19,69,21,69],[19,70,21,70],[19,71,21,71],[19,72,21,72],[19,73,21,73],[19,74,21,74],[19,57,21,57],[19,63,21,63],[19,81,21,81],[19,82,21,82],[19,83,21,83],[19,84,21,84],[19,65,21,65],[19,66,21,66],[19,67,21,67],[19,68,21,68],[14,2,14,3],[50,2,51,3],[19,8,21,8],[19,21,21,21],[19,22,21,22],[19,7,21,7],[19,13,21,13],[19,11,21,11],[19,12,21,12],[19,18,21,18],[19,19,21,19]]}
[]
[]
[]
[]
[]
[]
[]
[]
[]
[]
{"$rows_left_out":49}
{"sheet":"6. Billing Det. for Def-Var","index":6,"n_rows":33,"n_cols":12,"rows_kept":33,"cut":false,"hidden":false,"merged":[[31,0,31,7],[32,0,32,7],[14,11,15,11],[12,0,12,7],[14,4,15,4],[14,10,15,10],[14,6,15,6],[14,9,15,9],[14,5,15,5],[14,7,15,7],[14,8,15,8],[23,1,23,2],[24,1,24,2],[25,1,25,2],[25,3,26,7],[29,0,30,7]]}
[]
[]
[]
[]
[]
[]
[]
[]
[]
[]
{"$rows_left_out":24}
{"sheet":"6. hidden","index":7,"n_rows":3,"n_cols":12,"rows_kept":3,"cut":false,"hidden":true,"merged":[[0,10,1,10],[0,11,1,11],[0,4,1,4],[0,5,1,5],[0,6,1,6],[0,7,1,7],[0,8,1,8],[0,9,1,9]]}
[null,null,null,null,"Billed kWh for Non-RPP Customers","Estimated kW for Non-RPP Customers","Distribution Revenue 1","1590 Recovery Share Proportion*","1595 Recovery Share Proportion (2008) 2","1595 Recovery Share Proportion (2009) 2","1595 Recovery Share Proportion (2010) 2","1568 LRAM Variance Account Class Allocation"]
["Rate Class","Unit","Metered kWh","Metered kW"]
["Embedded Distributor","$/kW",74192250,264787,74192250,null,172340,0,0,0,0,0]

{"sheet":"7. Allocating Def-Var Balances","index":8,"n_rows":24,"n_cols":18,"rows_kept":24,"cut":false,"hidden":false,"merged":[[15,17,16,17],[12,0,13,8],[15,12,16,12],[15,13,16,13],[15,15,16,15],[15,14,16,14],[15,16,16,16],[15,3,16,3],[15,4,16,4],[15,2,16,2]]}
[]
[]
[]
[]
[]
[]
[]
[]
[]
[]
{"$rows_left_out":15}
{"sheet":"8. Calculation of Def-Var RR","index":9,"n_rows":21,"n_cols":9,"rows_kept":21,"cut":false,"hidden":false,"merged":[[11,0,12,5],[16,4,17,4],[16,5,17,5],[16,8,17,8],[16,7,17,7],[16,6,17,6]]}
[]
[]
[]
[]
[]
[]
[]
[]
[]
[]
{"$rows_left_out":12}
{"sheet":"9. Rev2Cost_GDPIPI","index":10,"n_rows":22,"n_cols":26,"rows_kept":22,"cut":false,"hidden":false,"merged":[[18,5,19,5],[18,7,19,7],[11,0,12,6],[18,2,19,2],[18,1,19,1],[18,3,19,3],[18,6,19,6],[18,4,19,4]]}
[null,null,null,null,null,null,null,null,null,null,null,null,null,null,null,null,null,null,null,null,null,null,null,null,null,0]
[]
[]
[]
[]
[]
[]
[]
[]
[]
{"$rows_left_out":13}
{"sheet":"9. hidden","index":11,"n_rows":2,"n_cols":3,"rows_kept":2,"cut":false,"hidden":true,"merged":[]}
["Rate Class","MFC Adjustment from R/C Model","DVR Adjustment from R/C Model"]
["Embedded Distributor",0,0]

{"sheet":"10. Other Charges & LF","index":12,"n_rows":149,"n_cols":8,"rows_kept":149,"cut":false,"hidden":false,"merged":[[10,0,12,1]]}
[]
[]
[]
[]
[]
[]
[]
[]
[]
[]
{"$rows_left_out":140}
{"sheet":"11. Proposed Rates","index":13,"n_rows":51,"n_cols":27,"rows_kept":51,"cut":false,"hidden":false,"merged":[[25,0,25,5],[28,0,28,5],[30,0,30,5],[31,0,31,5],[32,0,32,5],[54,0,54,5],[11,0,17,7],[48,0,48,5],[21,0,21,5],[22,0,22,5],[23,0,23,5],[24,0,24,5],[27,0,27,5],[43,0,43,5],[26,0,26,5],[29,0,29,5],[36,0,36,5],[37,0,37,5],[38,0,38,5],[39,0,39,5],[40,0,40,5],[53,0,53,5],[33,0,33,5],[35,0,35,5],[44,0,44,5],[45,0,45,5],[46,0,46,5],[51,0,51,5],[52,0,52,5],[49,0,49,5],[50,0,50,5],[34,0,34,5],[41,0,41,5],[42,0,42,5]]}
[null,null,null,null,null,null,null,null,null,null,null,null,null,null,null,null,null,null,null,null,null,null,null,null,0,3,"≥"]
[null,null,null,null,null,null,null,null,null,null,null,null,null,null,null,null,null,null,null,null,null,null,null,null,null,"February"]
[null,null,null,null,null,null,null,null,null,null,null,null,null,null,null,null,null,null,null,null,null,null,null,null,null,"March"]
[null,null,null,null,null,null,null,null,null,null,null,null,null,null,null,null,null,null,null,null,null,null,null,null,null,"April"]
[null,null,null,null,null,null,null,null,null,null,null,null,null,null,null,null,null,null,null,null,null,null,null,null,null,"May"]
[null,null,null,null,null,null,null,null,null,null,null,null,null,null,null,null,null,null,null,null,null,null,null,null,null,"June"]
[null,null,null,null,null,null,null,null,null,null,null,null,null,null,null,null,null,null,null,null,null,null,null,null,null,"July"]
[null,null,null,null,null,null,null,null,null,null,null,null,null,null,null,null,null,null,null,null,null,null,null,null,null,"August"]
[null,null,null,null,null,null,null,null,null,null,null,null,null,null,null,null,null,null,null,null,null,null,null,null,null,"September"]
[null,null,null,null,null,null,null,null,null,null,null,null,null,null,null,null,null,null,null,null,null,null,null,null,null,"October"]
{"$rows_left_out":42}
{"sheet":"12. Summary Sheet","index":14,"n_rows":27,"n_cols":27,"rows_kept":27,"cut":false,"hidden":false,"merged":[]}
[null,null,null,null,null,null,null,null,null,null,null,null,null,null,null,null,null,null,null,null,null,null,null,null,3,3,"≥"]
[null,null,null,null,null,null,null,null,null,null,null,null,null,null,null,null,null,null,null,null,null,null,null,null,null,"February"]
[null,null,null,null,null,null,null,null,null,null,null,null,null,null,null,null,null,null,null,null,null,null,null,null,null,"March"]
[null,null,null,null,null,null,null,null,null,null,null,null,null,null,null,null,null,null,null,null,null,null,null,null,null,"April"]
[null,null,null,null,null,null,null,null,null,null,null,null,null,null,null,null,null,null,null,null,null,null,null,null,null,"May"]
[null,null,null,null,null,null,null,null,null,null,null,null,null,null,null,null,null,null,null,null,null,null,null,null,null,"June"]
[null,null,null,null,null,null,null,null,null,null,null,null,null,null,null,null,null,null,null,null,null,null,null,null,null,"July"]
[null,null,null,null,null,null,null,null,null,null,null,null,null,null,null,null,null,null,null,null,null,null,null,null,null,"August"]
[null,null,null,null,null,null,null,null,null,null,null,null,null,null,null,null,null,null,null,null,null,null,null,null,null,"September"]
[null,null,null,null,null,null,null,null,null,null,null,null,null,null,null,null,null,null,null,null,null,null,null,null,null,"October"]
{"$rows_left_out":18}
{"sheet":"13. Final Tariff Schedule","index":15,"n_rows":128,"n_cols":27,"rows_kept":128,"cut":false,"hidden":false,"merged":[[47,0,47,5],[49,0,49,5],[51,0,51,5],[52,0,52,5],[53,0,53,5],[21,0,21,8],[22,0,22,8],[2,0,2,8],[11,0,17,7],[18,0,18,8],[19,0,19,8],[20,0,20,8],[44,0,44,5],[45,0,45,5],[46,0,46,5],[23,0,23,8],[24,0,24,8],[27,0,27,8],[31,0,31,8],[33,0,33,8],[35,0,35,8],[37,0,37,8],[42,0,42,5],[41,0,41,5],[43,0,43,5]]}
[null,null,null,null,null,null,null,null,null,null,null,null,null,null,null,null,null,null,null,null,null,null,null,null,3,3,"≥"]
[null,null,null,null,null,null,null,null,null,null,null,null,null,null,null,null,null,null,null,null,null,null,null,null,null,"February"]
[null,null,null,null,null,null,null,null,null,null,null,null,null,null,null,null,null,null,null,null,null,null,null,null,null,"March"]
[null,null,null,null,null,null,null,null,null,null,null,null,null,null,null,null,null,null,null,null,null,null,null,null,null,"April"]
[null,null,null,null,null,null,null,null,null,null,null,null,null,null,null,null,null,null,null,null,null,null,null,null,null,"May"]
[null,null,null,null,null,null,null,null,null,null,null,null,null,null,null,null,null,null,null,null,null,null,null,null,null,"June"]
[null,null,null,null,null,null,null,null,null,null,null,null,null,null,null,null,null,null,null,null,null,null,null,null,null,"July"]
[null,null,null,null,null,null,null,null,null,null,null,null,null,null,null,null,null,null,null,null,null,null,null,null,null,"August"]
[null,null,null,null,null,null,null,null,null,null,null,null,null,null,null,null,null,null,null,null,null,null,null,null,null,"September"]
[null,null,null,null,null,null,null,null,null,null,null,null,null,null,null,null,null,null,null,null,null,null,null,null,null,"October"]
{"$rows_left_out":119}
{"sheet":"14. Bill Impacts","index":16,"n_rows":54,"n_cols":27,"rows_kept":54,"cut":false,"hidden":false,"merged":[[51,6,51,7],[52,6,52,7],[53,6,53,7],[41,6,41,7],[12,0,12,2],[21,6,21,7],[20,1,20,3],[20,4,20,7],[29,6,29,7],[30,6,30,7],[35,6,35,7],[36,6,36,7],[37,6,37,7],[38,6,38,7],[39,6,39,7],[40,6,40,7],[10,0,10,9],[34,6,34,7],[31,6,31,7],[32,6,32,7],[33,6,33,7],[23,6,23,7],[22,6,22,7],[25,6,25,7],[26,6,26,7],[27,6,27,7],[42,6,42,7],[43,6,43,7],[44,6,44,7],[50,6,50,7],[45,6,45,7],[46,6,46,7],[47,6,47,7],[48,6,48,7],[49,6,49,7]]}
[null,null,null,null,null,null,null,null,null,null,null,null,null,null,null,null,null,null,null,null,null,null,null,null,null,{"$f":"MATCH(A13, '3. Rate Class Selection'!B19:B40,0)","v":1},{"$f":"VLOOKUP(A13, lists!AO:AP,2,0)","v":"kW"}]
[]
[]
[]
[]
[]
[]
[]
[]
[]
{"$rows_left_out":45}
{"sheet":"lists","index":17,"n_rows":133,"n_cols":55,"rows_kept":133,"cut":false,"hidden":true,"merged":[[12,51,12,52],[1,51,1,52],[0,51,0,52],[11,51,11,52],[10,51,10,52],[9,51,9,52],[8,51,8,52],[7,51,7,52],[5,51,5,52],[4,51,4,52],[3,51,3,52],[2,51,2,52],[6,51,6,52],[13,51,13,52],[14,51,14,52],[15,51,15,52],[16,51,16,52],[17,51,17,52]]}
["Residential","Embedded Distributor",{"$f":"COUNTA(B1:B17)","v":4},null,null,null,null,null,"Distribution Volumetric Rate",null,null,"Loss Factors",null,"Units","Units1","Units2",null,null,null,null,null,null,null,null,null,"Account History","Account set up charge/change of occupancy charge (plus credit agency costs if applicable)","Total Loss Factor – Embedded Distributor – Hydro One Networks Inc.",null,null,null,null,null,null,null,null,null,null,"Algoma Power Inc.",null,"Embedded Distributor","kW",null,null,null,"Sub-Total:  Delivery (Distribution and Retail Transmission)"]
["Residential - Time of Use","General Service 3,000 to 4,999 kW",null,null,null,null,null,null,"GEA Rate Rider - Effective Until December 31, 2012",null,null,"Total Loss Factor – Primary Metered Customer",null,"$","$/kWh","$",null,null,null,null,null,null,null,null,null,"Account set up charge/change of occupancy charge","Administrative Billing Charge","Total Loss Factor – Primary Metered Customer",null,null,null,null,null,null,null,null,null,null,"Atikokan Hydro Inc.",null,"Farms – Single Phase energy-billed [F1]","kWh",null,null,null,"Wholesale Market Service Rate ",null,null,{"$f":"AU2*AV2","v":0},{"$f":"AU2","v":0},0,{"$f":"AX2*AY2","v":0},null,{"$f":"AZ2-AW2","v":0},{"$f":"BB2/AW2","v":{"$error":"#DIV/0!"}}]
["Residential Regular","General Service 1,000 to 4,999 kW",null,null,null,null,null,null,"Green Energy Act Initiatives Funding Adder",null,null,"Total Loss Factor – Primary Metered Customer < 5,000 kW",null,"$/kWh","$/kW","%",null,null,null,null,null,null,"MSC",null,null,"Account set up charge/change of occupancy charge (plus credit agency costs if applicable – Residential)","Bell Canada Pole Rentals","Total Loss Factor – Primary Metered Customer < 5,000 kW",null,null,null,null,null,null,null,null,null,null,"Attawapiskat Power Corporation",null,"Farms – Three Phase energy-billed [F3]","kWh",null,null,null,"Rural Rate Protection Charge",null,null,{"$f":"AU3*AV3","v":0},0,0,{"$f":"AX3*AY3","v":0},null,{"$f":"AZ3-AW3","v":0},{"$f":"BB3/AW3","v":{"$error":"#DIV/0!"}}]
["Residential Urban","General Service Equal To Or Greater Than 1,500 kW - Interval Metered",null,null,null,null,null,null,"Green Energy Act Plan Funding Adder – Effective until March 31, 2013",null,null,"Total Loss Factor – Primary Metered Customer > 5,000 kW",null,"$/kW","$/kVA",null,null,null,null,null,null,null,"SM_Rate_Adder",null,null,"Account set up charge/change of occupancy charge (plus credit agency costs if applicable)","Clearance Pole Attachment charge $/pole/year","Total Loss Factor – Primary Metered Customer > 5,000 kW",null,null,null,null,null,null,null,null,null,null,"Bluewater Power Distribution Corp.",null,"General Service  50 to 2,499 kW","kW",null,null,null,"Standard Supply Service – Administration Charge (if applicable)",null,null,0,0,0,{"$f":"AX4*AY4","v":0},null,0,{"$error":"#DIV/0!"}]
["General Service Less Than 50 kW",null,null,null,null,null,null,null,"Low Voltage Service Charge",null,null,"Total Loss Factor – Secondary Metered Customer",null,"$/kVA",null,null,null,null,null,null,null,null,"MSC_Rate_Rider_",null,null,"Arrears certificate","Collection of account charge – no disconnection","Total Loss Factor – Secondary Metered Customer",null,null,null,null,null,null,null,null,null,null,"Brant County Power",null,"General Service - Commercial","kW",null,null,null,"Sub-Total:  Regulatory",null,null,{"$f":"SUM(AW2:AW4)","v":0},null,null,{"$f":"SUM(AZ2:BA4)","v":0},null,{"$f":"AZ5-AW5","v":0},{"$error":"#DIV/0!"}]
["General Service Less Than 50 kW – Single Phase energy-billed [G1]",null,null,null,null,null,null,null,"Low Voltage Service Rate",null,null,"Total Loss Factor – Secondary Metered Customer < 5,000 kW",null,null,null,null,null,null,null,null,null,null,"VC",null,null,"Arrears certificate (credit reference)","Collection of account charge – no disconnection – after regular hours","Total Loss Factor – Secondary Metered Customer < 5,000 kW",null,null,null,null,null,null,null,null,null,null,"Brantford Power Inc.",null,"General Service - Institutional","kW",null,null,null,"Debt Retirement Charge (DRC)",null,null,0,{"$f":"AU6","v":0},{"$f":"AV6","v":0},{"$f":"AX6*AY6","v":0},null,0,{"$error":"#DIV/0!"}]
[null,null,null,null,null,null,null,null,"Low Voltage Volumetric Rate"]
["General Service Less Than 50 kW – Three Phase energy-billed [G3]",null,null,null,null,null,null,null,null,null,null,"Total Loss Factor – Secondary Metered Customer > 5,000 kW",null,null,null,null,null,null,null,null,null,null,"VC_Rate_Rider_",null,null,"Charge to certify cheque","Collection of account charge – no disconnection - during regular business hours","Total Loss Factor – Secondary Metered Customer > 5,000 kW",null,null,null,null,null,null,null,null,null,null,"Burlington Hydro Inc.",null,"General Service 1,000 to 2,999 kW","kW",null,null,null,"Total Bill on RPP (before taxes)",null,null,null,null,null,null,null,{"$f":"AZ8-AW8","v":0}]
["General Service Less Than 50 kW – Transmission Class energy-billed [T]",null,null,null,null,null,null,null,"Minimum Distribution Charge – per KW of maximum billing demand in the previous 11 months",null,null,"Distribution Loss Factor - Secondary Metered Customer < 5,000 kW",null,null,null,null,null,null,null,null,null,null,"VC_GA_Rate_Rider_kW_",null,null,"Collection of Account Charge – No Disconnection","Collection of account charge – no disconnection – during regular hours",null,null,null,null,null,null,null,null,null,null,null,"Cambridge and North Dumfries Hydro",null,"General Service 1,000 to 4,999 kW","kW",null,null,null,"HST",null,null,{"$f":"AV9*AW8","v":0},null,{"$f":"AV9","v":0},{"$f":"AY9*AZ8","v":0},null,{"$f":"AZ9-AW9","v":0},{"$f":"BB9/AW9","v":{"$error":"#DIV/0!"}}]
["General Service Less Than 50 kW – Urban energy-billed [UG]",null,null,null,null,null,null,null,"Monthly Distribution Wheeling Service Rate – Dedicated LV Line",null,null,"Distribution Loss Factor - Secondary Metered Customer > 5,000 kW",null,null,null,null,null,null,null,null,null,null,"VC_LV_Rate",null,null,"Credit Card Convenience Charge","Collection/Disconnection/Load Limiter/Reconnection – if in Community",null,null,null,null,null,null,null,null,null,null,null,"Canadian Niagara Power Inc. – Eastern Ontario Power/Fort Erie/Port Colborne",null,"General Service 1,000 to 4,999 kW - Interval Meters","kW",null,null,null,"Total Bill (including HST)",null,null,{"$f":"AW9+AW8","v":0},null,null,{"$f":"AZ9+AZ8","v":0},null,{"$f":"AZ10-AW10","v":0},{"$f":"BB10/AW10","v":{"$error":"#DIV/0!"}}]
{"$rows_left_out":123}