{"text_format":"1","workbook":"xlsx","n_sheets":18,"sheets":["1. Information Sheet","2. Table of Contents","3. Rate Class Selection","4. Current Tariff Schedule","4. Hidden","5. 2013 Continuity Schedule","6. Billing Det. for Def-Var","6. hidden","7. Allocating Def-Var Balances","8. Calculation of Def-Var RR","9. Rev2Cost_GDPIPI","9. hidden","10. Other Charges & LF","11. Proposed Rates","12. Summary Sheet","13. Final Tariff Schedule","14. Bill Impacts","lists"],"not_rendered":{"charts":0,"images":2,"macros":1,"external_links":3,"defined_names":356,"comments":0,"pivot_tables":0},"unopened":[],"bounds":{"document_bytes":16777216,"sheet_cells":100000,"rows_first":2000,"rows_last":500,"rows_between":2000,"halvings":0,"cell_chars":16384,"cell_head_chars":4096},"cells_cut":0,"cells_raw":0,"read":"whole","date_system":"1900"}

{"sheet":"1. Information Sheet","index":0,"n_rows":35,"n_cols":14,"rows_kept":35,"cut":false,"hidden":false,"merged":[[30,2,30,11],[32,2,32,13],[34,2,34,12],[25,5,25,7],[23,5,23,9],[21,5,21,9],[19,5,19,9],[13,5,13,11],[15,5,15,9],[17,5,17,9]]}
[]
[]
[]
[]
[]
[]
{"$rows_left_out":30}
{"sheet":"2. Table of Contents","index":1,"n_rows":20,"n_cols":8,"rows_kept":20,"cut":false,"hidden":false,"merged":[]}
[]
[]
[]
[]
[]
[]
{"$rows_left_out":15}
{"sheet":"3. Rate Class Selection","index":2,"n_rows":23,"n_cols":10,"rows_kept":23,"cut":false,"hidden":false,"merged":[[21,1,21,9],[22,1,22,9],[11,0,11,13],[18,1,18,9],[17,1,17,9],[19,1,19,9],[20,1,20,9]]}
[]
[]
[]
[]
[]
[]
{"$rows_left_out":18}
{"sheet":"4. Current Tariff Schedule","index":3,"n_rows":330,"n_cols":28,"rows_kept":330,"cut":false,"hidden":false,"merged":[[74,1,74,6],[73,1,73,6],[71,1,71,6],[52,1,52,6],[25,1,30,8],[33,1,35,8],[36,1,39,8],[40,1,42,8],[43,1,46,8],[11,1,17,8],[72,1,72,6],[48,1,48,6],[57,1,57,6],[20,1,20,8],[21,1,21,8],[23,1,23,8],[49,1,49,6],[53,1,53,6],[54,1,54,6],[55,1,55,6],[56,1,56,6],[58,1,58,6],[59,1,59,6],[50,1,50,6],[51,1,51,6],[136,1,136,6],[88,1,93,8],[96,1,98,8],[99,1,102,8],[103,1,105,8],[106,1,109,8],[60,1,60,6],[61,1,61,6],[69,1,69,6],[70,1,70,6],[64,1,64,6],[65,1,65,6],[62,1,62,6],[63,1,63,6],[66,1,66,6],[67,1,67,6],[68,1,68,6],[83,1,83,6],[77,1,77,6],[80,1,80,6],[81,1,81,6],[82,1,82,6],[76,1,76,6],[75,1,75,6],[113,1,113,6],[114,1,114,6],[115,1,115,6],[116,1,116,6],[117,1,117,6],[118,1,118,6],[119,1,119,6],[134,1,134,6],[135,1,135,6],[159,1,161,8],[162,1,165,8],[166,1,168,8],[169,1,172,8],[186,1,186,6],[187,1,187,6],[188,1,188,6],[86,1,86,8],[126,1,126,6],[127,1,127,6],[128,1,128,6],[129,1,129,6],[130,1,130,6],[131,1,131,6],[132,1,132,6],[133,1,133,6],[120,1,120,6],[121,1,121,6],[122,1,122,6],[123,1,123,6],[124,1,124,6],[125,1,125,6],[111,1,111,6],[112,1,112,6],[311,1,311,6],[312,1,312,6],[314,1,314,6],[315,1,315,6],[316,1,316,6],[317,1,317,6],[318,1,318,6],[324,1,324,6],[225,1,228,8],[229,1,231,8],[232,1,235,8],[250,1,250,6],[251,1,251,6],[252,1,252,6],[253,1,253,6],[254,1,254,6],[242,1,242,6],[243,1,243,6],[244,1,244,6],[245,1,245,6],[246,1,246,6],[247,1,247,6],[248,1,248,6],[249,1,249,6],[189,1,189,6],[190,1,190,6],[137,1,137,6],[138,1,138,6],[139,1,139,6],[140,1,140,6],[174,1,174,6],[143,1,143,6],[144,1,144,6],[145,1,145,6],[146,1,146,6],[149,1,149,8],[175,1,175,6],[176,1,176,6],[177,1,177,6],[178,1,178,6],[179,1,179,6],[180,1,180,6],[181,1,181,6],[182,1,182,6],[183,1,183,6],[184,1,184,6],[185,1,185,6],[151,1,156,8],[196,1,196,6],[197,1,197,6],[198,1,198,6],[199,1,199,6],[200,1,200,6],[191,1,191,6],[192,1,192,6],[193,1,193,6],[194,1,194,6],[195,1,195,6],[201,1,201,6],[202,1,202,6],[203,1,203,6],[237,1,237,6],[238,1,238,6],[212,1,212,8],[239,1,239,6],[240,1,240,6],[241,1,241,6],[214,1,219,8],[222,1,224,8],[206,1,206,6],[207,1,207,6],[208,1,208,6],[209,1,209,6],[260,1,260,6],[261,1,261,6],[262,1,262,6],[263,1,263,6],[264,1,264,6],[255,1,255,6],[256,1,256,6],[257,1,257,6],[258,1,258,6],[259,1,259,6],[265,1,265,6],[266,1,266,6],[300,1,300,6],[301,1,301,6],[302,1,302,6],[313,1,313,6],[277,1,282,8],[285,1,287,8],[288,1,291,8],[292,1,294,8],[295,1,298,8],[269,1,269,6],[270,1,270,6],[271,1,271,6],[272,1,272,6],[275,1,275,8],[303,1,303,6],[304,1,304,6],[305,1,305,6],[306,1,306,6],[307,1,307,6],[308,1,308,6],[309,1,309,6],[310,1,310,6],[329,1,329,6],[325,1,325,6],[326,1,326,6],[327,1,327,6],[328,1,328,6],[319,1,319,6],[320,1,320,6],[321,1,321,6],[322,1,322,6],[323,1,323,6]]}
[null,null,null,null,null,null,null,null,null,null,null,null,null,null,null,null,null,null,null,null,null,null,null,null,null,3,"January","≥"]
[null,null,null,null,null,null,null,null,null,null,null,null,null,null,null,null,null,null,null,null,null,null,null,null,null,null,"February"]
[null,null,null,null,null,null,null,null,null,null,null,null,null,null,null,null,null,null,null,null,null,null,null,null,null,null,"March"]
[null,null,null,null,null,null,null,null,null,null,null,null,null,null,null,null,null,null,null,null,null,null,null,null,null,null,"April"]
[null,null,null,null,null,null,null,null,null,null,null,null,null,null,null,null,null,null,null,null,null,null,null,null,null,null,"May"]
[null,null,null,null,null,null,null,null,null,null,null,null,null,null,null,null,null,null,null,null,null,null,null,null,null,null,"June"]
{"$rows_left_out":325}
{"sheet":"4. Hidden","index":4,"n_rows":393,"n_cols":18,"rows_kept":393,"cut":false,"hidden":true,"merged":[[62,1,62,6],[63,1,63,6],[64,1,64,6],[57,1,57,6],[58,1,58,6],[81,1,81,6],[82,1,82,6],[83,1,83,6],[48,1,48,6],[49,1,49,6],[50,1,50,6],[51,1,51,6],[52,1,52,6],[76,1,76,6],[66,1,66,6],[67,1,67,6],[68,1,68,6],[69,1,69,6],[70,1,70,6],[71,1,71,6],[72,1,72,6],[86,1,86,8],[88,1,93,8],[96,1,98,8],[99,1,102,8],[103,1,105,8],[43,1,46,8],[23,1,23,8],[25,1,30,8],[33,1,35,8],[36,1,39,8],[40,1,42,8],[77,1,77,6],[80,1,80,6],[73,1,73,6],[74,1,74,6],[75,1,75,6],[65,1,65,6],[53,1,53,6],[54,1,54,6],[55,1,55,6],[56,1,56,6],[59,1,59,6],[60,1,60,6],[61,1,61,6],[115,1,115,6],[116,1,116,6],[117,1,117,6],[118,1,118,6],[119,1,119,6],[106,1,109,8],[111,1,111,6],[112,1,112,6],[113,1,113,6],[114,1,114,6],[125,1,125,6],[126,1,126,6],[127,1,127,6],[128,1,128,6],[129,1,129,6],[120,1,120,6],[121,1,121,6],[122,1,122,6],[123,1,123,6],[124,1,124,6],[135,1,135,6],[136,1,136,6],[137,1,137,6],[138,1,138,6],[139,1,139,6],[130,1,130,6],[131,1,131,6],[132,1,132,6],[133,1,133,6],[134,1,134,6],[149,1,149,8],[151,1,156,8],[159,1,161,8],[162,1,165,8],[166,1,168,8],[140,1,140,6],[143,1,143,6],[144,1,144,6],[145,1,145,6],[146,1,146,6],[178,1,178,6],[179,1,179,6],[180,1,180,6],[181,1,181,6],[182,1,182,6],[169,1,172,8],[174,1,174,6],[175,1,175,6],[176,1,176,6],[177,1,177,6],[188,1,188,6],[189,1,189,6],[190,1,190,6],[191,1,191,6],[192,1,192,6],[183,1,183,6],[184,1,184,6],[185,1,185,6],[186,1,186,6],[187,1,187,6],[198,1,198,6],[199,1,199,6],[200,1,200,6],[201,1,201,6],[202,1,202,6],[193,1,193,6],[194,1,194,6],[195,1,195,6],[196,1,196,6],[197,1,197,6],[212,1,212,8],[214,1,219,8],[222,1,224,8],[225,1,228,8],[229,1,231,8],[203,1,203,6],[206,1,206,6],[207,1,207,6],[208,1,208,6],[209,1,209,6],[241,1,241,6],[242,1,242,6],[243,1,243,6],[244,1,244,6],[245,1,245,6],[232,1,235,8],[237,1,237,6],[238,1,238,6],[239,1,239,6],[240,1,240,6],[251,1,251,6],[252,1,252,6],[253,1,253,6],[254,1,254,6],[255,1,255,6],[246,1,246,6],[247,1,247,6],[248,1,248,6],[249,1,249,6],[250,1,250,6],[261,1,261,6],[262,1,262,6],[263,1,263,6],[264,1,264,6],[265,1,265,6],[256,1,256,6],[257,1,257,6],[258,1,258,6],[259,1,259,6],[260,1,260,6],[275,1,275,8],[277,1,282,8],[285,1,287,8],[288,1,291,8],[292,1,294,8],[266,1,266,6],[269,1,269,6],[270,1,270,6],[271,1,271,6],[272,1,272,6],[304,1,304,6],[305,1,305,6],[306,1,306,6],[307,1,307,6],[308,1,308,6],[295,1,298,8],[300,1,300,6],[301,1,301,6],[302,1,302,6],[303,1,303,6],[314,1,314,6],[315,1,315,6],[316,1,316,6],[317,1,317,6],[318,1,318,6],[309,1,309,6],[310,1,310,6],[311,1,311,6],[312,1,312,6],[313,1,313,6],[324,1,324,6],[325,1,325,6],[326,1,326,6],[327,1,327,6],[328,1,328,6],[319,1,319,6],[320,1,320,6],[321,1,321,6],[322,1,322,6],[323,1,323,6],[338,1,338,8],[340,1,345,8],[348,1,350,8],[351,1,354,8],[355,1,357,8],[329,1,329,6],[332,1,332,6],[333,1,333,6],[334,1,334,6],[335,1,335,6],[367,1,367,6],[368,1,368,6],[369,1,369,6],[370,1,370,6],[371,1,371,6],[358,1,361,8],[363,1,363,6],[364,1,364,6],[365,1,365,6],[366,1,366,6],[377,1,377,6],[378,1,378,6],[379,1,379,6],[380,1,380,6],[381,1,381,6],[372,1,372,6],[373,1,373,6],[374,1,374,6],[375,1,375,6],[376,1,376,6],[392,1,392,6],[387,1,387,6],[388,1,388,6],[389,1,389,6],[390,1,390,6],[391,1,391,6],[382,1,382,6],[383,1,383,6],[384,1,384,6],[385,1,385,6],[386,1,386,6]]}
[null,null,null,null,null,null,null,null,null,null,null,null,"Current Rate Classes","Changed to Rate Classes","Values in A that are NOT in B","Values in B that are Not in A","Count of A","Count of B"]
[null,null,null,null,null,null,null,null,null,null,null,null,"Residential","Residential",null,null,5,5]
[null,null,null,null,null,null,null,null,null,null,null,null,"General Service Less Than 50 kW","General Service Less Than 50 kW"]
[null,null,null,null,null,null,null,null,null,null,null,null,"General Service 50 to 4,999 kW","General Service 50 to 4,999 kW"]
[null,null,null,null,null,null,null,null,null,null,null,null,"Street Lighting","Street Lighting"]
[null,null,null,null,null,null,null,null,null,null,null,null,"MicroFit","MicroFit"]
{"$rows_left_out":388}
{"sheet":"5. 2013 Continuity Schedule","index":5,"n_rows":58,"n_cols":86,"rows_kept":58,"cut":false,"hidden":false,"merged":[[19,38,21,38],[19,27,21,27],[19,28,21,28],[18,54,18,63],[18,64,18,76],[19,29,21,29],[19,30,21,30],[19,31,21,31],[19,32,21,32],[19,33,21,33],[19,34,21,34],[19,35,21,35],[19,36,21,36],[19,37,21,37],[19,50,21,50],[19,39,21,39],[18,77,18,80],[18,81,18,83],[18,34,18,43],[18,44,18,53],[18,4,18,13],[18,14,18,23],[18,24,18,33],[19,26,21,26],[19,2,21,2],[19,3,21,3],[19,5,21,5],[19,6,21,6],[19,24,21,24],[19,25,21,25],[19,4,21,4],[19,23,21,23],[19,20,21,20],[19,14,21,14],[19,15,21,15],[19,16,21,16],[19,17,21,17],[19,9,21,9],[19,10,21,10],[19,40,21,40],[19,41,21,41],[19,42,21,42],[19,43,21,43],[19,44,21,44],[19,45,21,45],[19,46,21,46],[19,47,21,47],[19,48,21,48],[19,49,21,49],[19,64,21,64],[19,52,21,52],[19,53,21,53],[19,54,21,54],[19,55,21,55],[19,56,21,56],[19,62,21,62],[19,58,21,58],[19,59,21,59],[19,60,21,60],[19,61,21,61],[19,51,21,51],[19,85,21,85],[19,75,21,75],[19,76,21,76],[19,77,21,77],[19,78,21,78],[19,79,21,79],[19,80,21,80],[19,69,21,69],[19,70,21,70],[19,71,21,71],[19,72,21,72],[19,73,21,73],[19,74,21,74],[19,57,21,57],[19,63,21,63],[19,81,21,81],[19,82,21,82],[19,83,21,83],[19,84,21,84],[19,65,21,65],[19,66,21,66],[19,67,21,67],[19,68,21,68],[14,2,14,3],[50,2,51,3],[19,8,21,8],[19,21,21,21],[19,22,21,22],[19,7,21,7],[19,13,21,13],[19,11,21,11],[19,12,21,12],[19,18,21,18],[19,19,21,19]]}
[]
[]
[]
[]
[]
[]
{"$rows_left_out":53}
{"sheet":"6. Billing Det. for Def-Var","index":6,"n_rows":37,"n_cols":12,"rows_kept":37,"cut":false,"hidden":false,"merged":[[14,11,15,11],[12,0,12,7],[14,4,15,4],[14,10,15,10],[14,6,15,6],[14,9,15,9],[14,5,15,5],[14,7,15,7],[14,8,15,8],[27,1,27,2],[29,3,30,7],[33,0,34,7],[35,0,35,7],[36,0,36,7],[28,1,28,2],[29,1,29,2]]}
[]
[]
[]
[]
[]
[]
{"$rows_left_out":32}
{"sheet":"6. hidden","index":7,"n_rows":7,"n_cols":12,"rows_kept":7,"cut":false,"hidden":true,"merged":[[0,10,1,10],[0,11,1,11],[0,4,1,4],[0,5,1,5],[0,6,1,6],[0,7,1,7],[0,8,1,8],[0,9,1,9]]}
[null,null,null,null,"Billed kWh for Non-RPP Customers","Estimated kW for Non-RPP Customers","Distribution Revenue 1","1590 Recovery Share Proportion*","1595 Recovery Share Proportion (2008) 2","1595 Recovery Share Proportion (2009) 2","1595 Recovery Share Proportion (2010) 2","1568 LRAM Variance Account Class Allocation"]
["Rate Class","Unit","Metered kWh","Metered kW"]
["Residential","$/kWh",11113021,0,0,null,0,0,0,0,0,194.31]
["General Service Less Than 50 kW","$/kWh",6246087,0,43364,null,287448,0,0,0,0,567.73]
["General Service 50 to 4,999 kW","$/kW",5218563,13872,3311465,null,106909,0,0,0,0,4.22]
["Street Lighting","$/kW",466493,1316,466493,null,84093,0,0,0,0,0]
{"$rows_left_out":2}
{"sheet":"7. Allocating Def-Var Balances","index":8,"n_rows":28,"n_cols":18,"rows_kept":28,"cut":false,"hidden":false,"merged":[[15,17,16,17],[12,0,13,8],[15,12,16,12],[15,13,16,13],[15,15,16,15],[15,14,16,14],[15,16,16,16],[15,3,16,3],[15,4,16,4],[15,2,16,2]]}
[]
[]
[]
[]
[]
[]
{"$rows_left_out":23}
{"sheet":"8. Calculation of Def-Var RR","index":9,"n_rows":25,"n_cols":9,"rows_kept":25,"cut":false,"hidden":false,"merged":[[11,0,12,5],[16,4,17,4],[16,5,17,5],[16,8,17,8],[16,7,17,7],[16,6,17,6]]}
[]
[]
[]
[]
[]
[]
{"$rows_left_out":20}
{"sheet":"9. Rev2Cost_GDPIPI","index":10,"n_rows":26,"n_cols":26,"rows_kept":26,"cut":false,"hidden":false,"merged":[[18,5,19,5],[18,7,19,7],[11,0,12,6],[18,2,19,2],[18,1,19,1],[18,3,19,3],[18,6,19,6],[18,4,19,4]]}
[null,null,null,null,null,null,null,null,null,null,null,null,null,null,null,null,null,null,null,null,null,null,null,null,null,0]
[]
[]
[]
[]
[]
{"$rows_left_out":21}
{"sheet":"9. hidden","index":11,"n_rows":6,"n_cols":3,"rows_kept":6,"cut":false,"hidden":true,"merged":[]}
["Rate Class","MFC Adjustment from R/C Model","DVR Adjustment from R/C Model"]
["Residential",0,0]
["General Service Less Than 50 kW",0,0]
["General Service 50 to 4,999 kW",0,0]
["Street Lighting",0,0]
["MicroFit",0,0]
{"$rows_left_out":1}
{"sheet":"10. Other Charges & LF","index":12,"n_rows":150,"n_cols":8,"rows_kept":150,"cut":false,"hidden":false,"merged":[[10,0,12,1]]}
[]
[]
[]
[]
[]
[]
{"$rows_left_out":145}
{"sheet":"11. Proposed Rates","index":13,"n_rows":166,"n_cols":27,"rows_kept":166,"cut":false,"hidden":false,"merged":[[11,0,17,7],[77,0,77,5],[78,0,78,5],[79,0,79,5],[80,0,80,5],[81,0,81,5],[72,0,72,5],[73,0,73,5],[74,0,74,5],[75,0,75,5],[76,0,76,5],[37,0,37,5],[38,0,38,5],[53,0,53,5],[54,0,54,5],[21,0,21,5],[22,0,22,5],[26,0,26,5],[27,0,27,5],[28,0,28,5],[23,0,23,5],[24,0,24,5],[25,0,25,5],[29,0,29,5],[88,0,88,5],[89,0,89,5],[90,0,90,5],[93,0,93,5],[94,0,94,5],[82,0,82,5],[84,0,84,5],[85,0,85,5],[86,0,86,5],[87,0,87,5],[102,0,102,5],[101,0,101,5],[97,0,97,5],[96,0,96,5],[104,0,104,5],[95,0,95,5],[103,0,103,5],[98,0,98,5],[99,0,99,5],[100,0,100,5],[110,0,110,5],[111,0,111,5],[112,0,112,5],[113,0,113,5],[114,0,114,5],[105,0,105,5],[106,0,106,5],[107,0,107,5],[108,0,108,5],[109,0,109,5],[115,0,115,5],[116,0,116,5],[117,0,117,5],[118,0,118,5],[120,0,120,5],[134,0,134,5],[131,0,131,5],[135,0,135,5],[132,0,132,5],[133,0,133,5],[126,0,126,5],[129,0,129,5],[130,0,130,5],[138,0,138,5],[139,0,139,5],[140,0,140,5],[141,0,141,5],[142,0,142,5],[137,0,137,5],[121,0,121,5],[122,0,122,5],[123,0,123,5],[124,0,124,5],[125,0,125,5],[136,0,136,5],[148,0,148,5],[149,0,149,5],[150,0,150,5],[151,0,151,5],[152,0,152,5],[143,0,143,5],[144,0,144,5],[145,0,145,5],[146,0,146,5],[147,0,147,5],[169,0,169,5],[170,0,170,5],[159,0,159,5],[160,0,160,5],[161,0,161,5],[162,0,162,5],[165,0,165,5],[153,0,153,5],[154,0,154,5],[156,0,156,5],[157,0,157,5],[158,0,158,5],[166,0,166,5],[167,0,167,5],[168,0,168,5],[186,0,186,5],[187,0,187,5],[188,0,188,5],[189,0,189,5],[190,0,190,5],[181,0,181,5],[182,0,182,5],[183,0,183,5],[184,0,184,5],[185,0,185,5],[176,0,176,5],[177,0,177,5],[178,0,178,5],[179,0,179,5],[180,0,180,5],[171,0,171,5],[172,0,172,5],[173,0,173,5],[174,0,174,5],[175,0,175,5],[39,0,39,5],[40,0,40,5],[41,0,41,5],[42,0,42,5],[43,0,43,5],[30,0,30,5],[31,0,31,5],[32,0,32,5],[33,0,33,5],[34,0,34,5],[35,0,35,5],[36,0,36,5],[44,0,44,5],[45,0,45,5],[46,0,46,5],[48,0,48,5],[49,0,49,5],[50,0,50,5],[51,0,51,5],[52,0,52,5],[57,0,57,5],[67,0,67,5],[68,0,68,5],[69,0,69,5],[70,0,70,5],[71,0,71,5],[58,0,58,5],[60,0,60,5],[61,0,61,5],[62,0,62,5],[63,0,63,5],[64,0,64,5],[59,0,59,5],[65,0,65,5],[66,0,66,5]]}
[null,null,null,null,null,null,null,null,null,null,null,null,null,null,null,null,null,null,null,null,null,null,null,null,0,3,"≥"]
[null,null,null,null,null,null,null,null,null,null,null,null,null,null,null,null,null,null,null,null,null,null,null,null,null,"February"]
[null,null,null,null,null,null,null,null,null,null,null,null,null,null,null,null,null,null,null,null,null,null,null,null,null,"March"]
[null,null,null,null,null,null,null,null,null,null,null,null,null,null,null,null,null,null,null,null,null,null,null,null,null,"April"]
[null,null,null,null,null,null,null,null,null,null,null,null,null,null,null,null,null,null,null,null,null,null,null,null,null,"May"]
[null,null,null,null,null,null,null,null,null,null,null,null,null,null,null,null,null,null,null,null,null,null,null,null,null,"June"]
{"$rows_left_out":161}
{"sheet":"12. Summary Sheet","index":14,"n_rows":78,"n_cols":27,"rows_kept":78,"cut":false,"hidden":false,"merged":[]}
[null,null,null,null,null,null,null,null,null,null,null,null,null,null,null,null,null,null,null,null,null,null,null,null,3,3,"≥"]
[null,null,null,null,null,null,null,null,null,null,null,null,null,null,null,null,null,null,null,null,null,null,null,null,null,"February"]
[null,null,null,null,null,null,null,null,null,null,null,null,null,null,null,null,null,null,null,null,null,null,null,null,null,"March"]
[null,null,null,null,null,null,null,null,null,null,null,null,null,null,null,null,null,null,null,null,null,null,null,null,null,"April"]
[null,null,null,null,null,null,null,null,null,null,null,null,null,null,null,null,null,null,null,null,null,null,null,null,null,"May"]
[null,null,null,null,null,null,null,null,null,null,null,null,null,null,null,null,null,null,null,null,null,null,null,null,null,"June"]
{"$rows_left_out":73}
{"sheet":"13. Final Tariff Schedule","index":15,"n_rows":260,"n_cols":27,"rows_kept":260,"cut":false,"hidden":false,"merged":[[147,0,147,5],[148,0,148,5],[150,0,150,5],[152,0,152,5],[154,0,154,5],[47,0,47,5],[48,0,48,5],[165,0,165,8],[111,0,111,5],[122,0,122,5],[112,0,112,5],[113,0,113,5],[114,0,114,5],[115,0,115,5],[116,0,116,5],[143,0,143,5],[144,0,144,5],[145,0,145,5],[146,0,146,5],[93,0,93,8],[97,0,97,8],[21,0,21,8],[22,0,22,8],[2,0,2,8],[11,0,17,7],[18,0,18,8],[19,0,19,8],[20,0,20,8],[44,0,44,5],[45,0,45,5],[46,0,46,5],[23,0,23,8],[24,0,24,8],[27,0,27,8],[31,0,31,8],[33,0,33,8],[35,0,35,8],[37,0,37,8],[42,0,42,5],[41,0,41,5],[43,0,43,5],[66,0,66,8],[68,0,68,8],[70,0,70,8],[74,0,74,5],[87,0,87,5],[75,0,75,5],[76,0,76,5],[77,0,77,5],[82,0,82,5],[84,0,84,5],[86,0,86,5],[78,0,78,5],[79,0,79,5],[80,0,80,5],[81,0,81,5],[49,0,49,5],[51,0,51,5],[53,0,53,5],[60,0,60,8],[64,0,64,8],[54,0,54,5],[55,0,55,5],[109,0,109,5],[110,0,110,5],[99,0,99,8],[101,0,101,8],[88,0,88,5],[107,0,107,5],[108,0,108,5],[103,0,103,8],[159,0,159,8],[163,0,163,8],[173,0,173,5],[167,0,167,8],[117,0,117,5],[123,0,123,5],[119,0,119,5],[121,0,121,5],[128,0,128,8],[132,0,132,8],[134,0,134,8],[136,0,136,8],[138,0,138,8],[142,0,142,5],[153,0,153,5],[169,0,169,8]]}
[null,null,null,null,null,null,null,null,null,null,null,null,null,null,null,null,null,null,null,null,null,null,null,null,3,3,"≥"]
[null,null,null,null,null,null,null,null,null,null,null,null,null,null,null,null,null,null,null,null,null,null,null,null,null,"February"]
[null,null,null,null,null,null,null,null,null,null,null,null,null,null,null,null,null,null,null,null,null,null,null,null,null,"March"]
[null,null,null,null,null,null,null,null,null,null,null,null,null,null,null,null,null,null,null,null,null,null,null,null,null,"April"]
[null,null,null,null,null,null,null,null,null,null,null,null,null,null,null,null,null,null,null,null,null,null,null,null,null,"May"]
[null,null,null,null,null,null,null,null,null,null,null,null,null,null,null,null,null,null,null,null,null,null,null,null,null,"June"]
{"$rows_left_out":255}
{"sheet":"14. Bill Impacts","index":16,"n_rows":58,"n_cols":27,"rows_kept":58,"cut":false,"hidden":false,"merged":[[54,6,54,7],[51,6,51,7],[52,6,52,7],[53,6,53,7],[57,0,57,8],[41,6,41,7],[12,0,12,2],[21,6,21,7],[20,1,20,3],[20,4,20,7],[29,6,29,7],[30,6,30,7],[35,6,35,7],[36,6,36,7],[37,6,37,7],[38,6,38,7],[39,6,39,7],[40,6,40,7],[10,0,10,9],[34,6,34,7],[31,6,31,7],[32,6,32,7],[33,6,33,7],[23,6,23,7],[22,6,22,7],[25,6,25,7],[26,6,26,7],[27,6,27,7],[42,6,42,7],[43,6,43,7],[44,6,44,7],[50,6,50,7],[45,6,45,7],[46,6,46,7],[47,6,47,7],[48,6,48,7],[49,6,49,7]]}
[null,null,null,null,null,null,null,null,null,null,null,null,null,null,null,null,null,null,null,null,null,null,null,null,null,{"$f":"MATCH(A13, '3. Rate Class Selection'!B19:B40,0)","v":2},{"$f":"VLOOKUP(A13, lists!AO:AP,2,0)","v":"kWh"}]
[]
[]
[]
[]
[]
{"$rows_left_out":53}
{"sheet":"lists","index":17,"n_rows":133,"n_cols":55,"rows_kept":133,"cut":false,"hidden":true,"merged":[[12,51,12,52],[1,51,1,52],[0,51,0,52],[11,51,11,52],[10,51,10,52],[9,51,9,52],[8,51,8,52],[7,51,7,52],[5,51,5,52],[4,51,4,52],[3,51,3,52],[2,51,2,52],[6,51,6,52],[13,51,13,52],[14,51,14,52],[15,51,15,52],[16,51,16,52],[17,51,17,52]]}
["Residential","Embedded Distributor",{"$f":"COUNTA(B1:B17)","v":4},null,null,null,null,null,"Distribution Volumetric Rate",null,null,"Loss Factors",null,"Units","Units1","Units2",null,null,null,null,null,null,null,null,null,"Account History","Account set up charge/change of occupancy charge (plus credit agency costs if applicable)","Total Loss Factor – Embedded Distributor – Hydro One Networks Inc.",null,null,null,null,null,null,null,null,null,null,"Algoma Power Inc.",null,"Embedded Distributor","kW",null,null,null,"Sub-Total:  Delivery (Distribution and Retail Transmission)"]
["Residential - Time of Use","General Service 3,000 to 4,999 kW",null,null,null,null,null,null,"GEA Rate Rider - Effective Until December 31, 2012",null,null,"Total Loss Factor – Primary Metered Customer",null,"$","$/kWh","$",null,null,null,null,null,null,null,null,null,"Account set up charge/change of occupancy charge","Administrative Billing Charge","Total Loss Factor – Primary Metered Customer",null,null,null,null,null,null,null,null,null,null,"Atikokan Hydro Inc.",null,"Farms – Single Phase energy-billed [F1]","kWh",null,null,null,"Wholesale Market Service Rate ",null,null,{"$f":"AU2*AV2","v":0},{"$f":"AU2","v":0},0,{"$f":"AX2*AY2","v":0},null,{"$f":"AZ2-AW2","v":0},{"$f":"BB2/AW2","v":{"$error":"#DIV/0!"}}]
["Residential Regular","General Service 1,000 to 4,999 kW",null,null,null,null,null,null,"Green Energy Act Initiatives Funding Adder",null,null,"Total Loss Factor – Primary Metered Customer < 5,000 kW",null,"$/kWh","$/kW","%",null,null,null,null,null,null,"MSC",null,null,"Account set up charge/change of occupancy charge (plus credit agency costs if applicable – Residential)","Bell Canada Pole Rentals","Total Loss Factor – Primary Metered Customer < 5,000 kW",null,null,null,null,null,null,null,null,null,null,"Attawapiskat Power Corporation",null,"Farms – Three Phase energy-billed [F3]","kWh",null,null,null,"Rural Rate Protection Charge",null,null,{"$f":"AU3*AV3","v":0},0,0,{"$f":"AX3*AY3","v":0},null,{"$f":"AZ3-AW3","v":0},{"$f":"BB3/AW3","v":{"$error":"#DIV/0!"}}]
["Residential Urban","General Service Equal To Or Greater Than 1,500 kW - Interval Metered",null,null,null,null,null,null,"Green Energy Act Plan Funding Adder – Effective until March 31, 2013",null,null,"Total Loss Factor – Primary Metered Customer > 5,000 kW",null,"$/kW","$/kVA",null,null,null,null,null,null,null,"SM_Rate_Adder",null,null,"Account set up charge/change of occupancy charge (plus credit agency costs if applicable)","Clearance Pole Attachment charge $/pole/year","Total Loss Factor – Primary Metered Customer > 5,000 kW",null,null,null,null,null,null,null,null,null,null,"Bluewater Power Distribution Corp.",null,"General Service  50 to 2,499 kW","kW",null,null,null,"Standard Supply Service – Administration Charge (if applicable)",null,null,0,0,0,{"$f":"AX4*AY4","v":0},null,0,{"$error":"#DIV/0!"}]
["General Service Less Than 50 kW",null,null,null,null,null,null,null,"Low Voltage Service Charge",null,null,"Total Loss Factor – Secondary Metered Customer",null,"$/kVA",null,null,null,null,null,null,null,null,"MSC_Rate_Rider_",null,null,"Arrears certificate","Collection of account charge – no disconnection","Total Loss Factor – Secondary Metered Customer",null,null,null,null,null,null,null,null,null,null,"Brant County Power",null,"General Service - Commercial","kW",null,null,null,"Sub-Total:  Regulatory",null,null,{"$f":"SUM(AW2:AW4)","v":0},null,null,{"$f":"SUM(AZ2:BA4)","v":0},null,{"$f":"AZ5-AW5","v":0},{"$error":"#DIV/0!"}]
["General Service Less Than 50 kW – Single Phase energy-billed [G1]",null,null,null,null,null,null,null,"Low Voltage Service Rate",null,null,"Total Loss Factor – Secondary Metered Customer < 5,000 kW",null,null,null,null,null,null,null,null,null,null,"VC",null,null,"Arrears certificate (credit reference)","Collection of account charge – no disconnection – after regular hours","Total Loss Factor – Secondary Metered Customer < 5,000 kW",null,null,null,null,null,null,null,null,null,null,"Brantford Power Inc.",null,"General Service - Institutional","kW",null,null,null,"Debt Retirement Charge (DRC)",null,null,0,{"$f":"AU6","v":0},{"$f":"AV6","v":0},{"$f":"AX6*AY6","v":0},null,0,{"$error":"#DIV/0!"}]
{"$rows_left_out":127}