{"text_format":"1","workbook":"xlsx","n_sheets":13,"sheets":["1. Info","2. Table of Contents","3. Data_Input_Sheet","4. Rate_Base","5. Utility Income","6. Taxes_PILs","7. Cost_of_Capital","8. Rev_Def_Suff","9. Rev_Reqt","10A. Bill Impacts - Res (1)","10A. Bill Impacts - Res (2)","10B. Bill Impacts -GS_LT_50 (1)","10B. Bill Impacts -GS_LT_50 (2)"],"not_rendered":{"charts":0,"images":13,"macros":1,"external_links":1,"defined_names":15,"comments":0,"pivot_tables":0},"unopened":[],"bounds":{"document_bytes":16777216,"sheet_cells":100000,"rows_first":2000,"rows_last":500,"rows_between":2000,"halvings":0,"cell_chars":16384,"cell_head_chars":4096},"cells_cut":0,"cells_raw":0,"read":"whole","date_system":"1900"}

{"sheet":"1. Info","index":0,"n_rows":107,"n_cols":29,"rows_kept":107,"cut":false,"hidden":false,"merged":[[34,1,40,11],[0,2,1,12],[2,2,3,12],[27,4,27,9],[25,4,25,9],[23,4,23,9],[21,4,21,9],[21,1,21,2],[23,1,23,2],[25,1,25,3],[27,1,27,3]]}
[null,null,null,null,null,null,null,null,null,null,null,null,null,null,null,null,null,null,null,null,null,null,null,null,null,null,67,{"$f":"VLOOKUP(AA1, Z21:AA107, 2,0)","v":"PowerStream Inc."},{"$f":"IF('3. Data_Input_Sheet'!M10=0, \"\", '3. Data_Input_Sheet'!M10)","v":"Settlement Agreement"}]
[]
[]
[]
[]
[]
[]
[]
[]
[]
[]
[]
[]
[]
[]
{"$rows_left_out":93}
{"sheet":"2. Table of Contents","index":1,"n_rows":28,"n_cols":16,"rows_kept":28,"cut":false,"hidden":false,"merged":[[0,2,0,4],[1,3,1,6],[3,3,3,4],[27,1,27,11],[23,1,23,7],[24,1,24,7],[25,1,25,7],[26,1,26,11]]}
[null,null,null,null,null,null,null,null,null,null,null,null,null,null,null,"1. Info"]
[]
[]
[]
[]
[]
[]
[]
[]
[null,null,null,"1. Info",null,null,null,null,"7. Cost_of_Capital"]
[]
[null,null,null,"2. Table of Contents",null,null,null,null,"8. Rev_Def_Suff"]
[]
[null,null,null,"3. Data_Input_Sheet",null,null,null,null,"9. Rev_Reqt"]
[]
{"$rows_left_out":14}
{"sheet":"3. Data_Input_Sheet","index":2,"n_rows":77,"n_cols":23,"rows_kept":77,"cut":false,"hidden":false,"merged":[[77,2,77,20],[9,4,10,4],[9,8,10,8],[9,20,10,20],[70,2,70,20],[9,12,10,12],[9,16,10,16],[72,2,72,20],[73,2,73,20],[74,2,74,20],[0,2,0,12],[7,4,7,20],[17,24,18,24],[79,2,80,20],[67,2,67,20],[68,2,68,20],[66,2,66,20],[78,2,78,20],[71,2,71,20],[65,2,65,20],[75,2,75,20],[76,2,76,20],[3,2,3,10],[1,2,1,10],[2,2,2,10],[69,2,69,20]]}
[null,null,null,null,null,null,null,null,null,null,null,null,null,null,null,null,null,null,null,null,{"$f":"CONCATENATE('2. Table of Contents'!$F$6,\" \",'2. Table of Contents'!$G$6)","v":" "}]
[]
[]
[]
[]
[]
[]
[]
[]
[null,null,null,null,"Initial Application",null,null,null,{"$f":"IF(ISBLANK(M10),\"\",\"Adjustments\")","v":"Adjustments"},null,null,null,"Settlement Agreement",null,"(6)",null,{"$f":"IF(ISBLANK(M10),\"\",\"Adjustments\")","v":"Adjustments"},null,null,null,"Per Board Decision"]
[]
[]
[null,1,"Rate Base"]
[null,null,"   Gross Fixed Assets (average)",null,805987959.66000009,null,"(8)",null,-2936675,null,null,null,{"$f":"IF(ISBLANK(E14),0,E14+I14)","v":803051284.66000009},null,null,null,-7184145,null,null,null,{"$f":"IF(ISBLANK(E14),\"\",E14+I14+Q14)","v":795867139.66000009}]
[null,null,"   Accumulated Depreciation (average)",null,-86642887.808449835,null,"(5)",null,0,null,null,null,{"$f":"IF(ISBLANK(E15),0,E15+I15)","v":-86642887.808449835},null,null,null,941500.47159071267,null,null,null,{"$f":"IF(ISBLANK(E15),\"\",E15+I15+Q15)","v":-85701387.336859122}]
{"$rows_left_out":63}
{"sheet":"4. Rate_Base","index":3,"n_rows":34,"n_cols":23,"rows_kept":34,"cut":false,"hidden":false,"merged":[[33,3,33,22],[16,22,17,22],[0,2,0,10],[1,2,1,22],[20,3,20,22],[16,6,17,6],[16,10,17,10],[2,2,2,6],[31,1,31,22],[7,5,7,22],[3,2,3,6],[16,3,17,3],[16,14,17,14],[16,18,17,18],[32,3,32,22],[34,3,34,22],[39,3,39,22],[40,3,40,22],[35,3,35,22],[36,3,36,22],[37,3,37,22],[38,3,38,22]]}
[]
[]
[]
[]
[]
[]
[]
[]
[]
[null,"Line No.",null,"Particulars",null,null,"Initial Application",null,null,null,{"$f":"IF(ISBLANK('3. Data_Input_Sheet'!M10:M11),\"\",\"Adjustments\")","v":"Adjustments"},null,null,null,{"$f":"IF(ISBLANK('3. Data_Input_Sheet'!M10:M11),\"\",'3. Data_Input_Sheet'!M10:M11)","v":"Settlement Agreement"},null,null,null,{"$f":"IF(ISBLANK('3. Data_Input_Sheet'!Q10:Q11),\"\",'3. Data_Input_Sheet'!Q10:Q11)","v":"Adjustments"},null,null,null,{"$f":"'3. Data_Input_Sheet'!U10","v":"Per Board Decision"}]
[]
[null,1,null,"Gross Fixed Assets (average)","(3)",null,{"$f":"'3. Data_Input_Sheet'!E14","v":805987959.66000009},null,null,null,{"$f":"'3. Data_Input_Sheet'!I14","v":-2936675},null,null,null,{"$f":"G12+K12","v":803051284.66000009},null,null,null,{"$f":"'3. Data_Input_Sheet'!Q14","v":-7184145},null,null,null,{"$f":"G12+K12+S12","v":795867139.66000009}]
[null,2,null,"Accumulated Depreciation (average)","(3)",null,{"$f":"'3. Data_Input_Sheet'!E15","v":-86642887.808449835},null,null,null,{"$f":"'3. Data_Input_Sheet'!I15","v":0},null,null,null,{"$f":"G13+K13","v":-86642887.808449835},null,null,null,{"$f":"'3. Data_Input_Sheet'!Q15","v":941500.47159071267},null,null,null,{"$f":"G13+K13+S13","v":-85701387.336859122}]
[null,3,null,"Net Fixed Assets (average)","(3)",null,{"$f":"SUM(G12:G13)","v":719345071.85155022},null,null,null,{"$f":"SUM(K12:K13)","v":-2936675},null,null,null,{"$f":"SUM(O12:O13)","v":716408396.85155022},null,null,null,{"$f":"SUM(S12:S13)","v":-6242644.5284092873},null,null,null,{"$f":"SUM(W12:W13)","v":710165752.32314098}]
[]
{"$rows_left_out":20}
{"sheet":"5. Utility Income","index":4,"n_rows":46,"n_cols":22,"rows_kept":46,"cut":false,"hidden":false,"merged":[[33,21,34,21],[33,5,34,5],[31,13,32,13],[23,13,24,13],[29,13,30,13],[31,9,32,9],[33,9,34,9],[23,17,24,17],[29,17,30,17],[23,21,24,21],[29,21,30,21],[31,21,32,21],[31,5,32,5],[29,5,30,5],[0,2,0,11],[2,2,2,7],[3,2,3,7],[1,2,1,21],[7,5,7,21],[14,9,15,9],[14,21,15,21],[23,9,24,9],[14,5,15,5],[23,5,24,5],[14,13,15,13],[14,17,15,17],[53,3,53,21],[51,3,51,21],[52,3,52,21],[48,3,48,21],[29,9,30,9],[50,3,50,21],[49,3,49,21],[44,13,45,13],[44,17,45,17],[31,17,32,17],[44,5,45,5],[44,21,45,21],[38,1,38,21],[33,13,34,13],[33,17,34,17],[44,9,45,9]]}
[]
[]
[]
[]
[]
[]
[]
[]
[]
[null,"Line No.",null,"Particulars                                ",null,"Initial Application   ",null,null,null,{"$f":"IF(N10=\"\",\"\",\"Adjustments\")","v":"Adjustments"},null,null,null,{"$f":"IF(ISBLANK('3. Data_Input_Sheet'!M10:M11),\"\",'3. Data_Input_Sheet'!M10:M11)","v":"Settlement Agreement"},null,null,null,{"$f":"IF(N10=\"\",\"\",\"Adjustments\")","v":"Adjustments"},null,null,null,{"$f":"'3. Data_Input_Sheet'!U10","v":"Per Board Decision"}]
[]
[null,null,null,"Operating Revenues:"]
[null,1,null,"Distribution Revenue (at Proposed Rates)",null,{"$f":"'3. Data_Input_Sheet'!E24","v":169870651.28262034},null,null,null,{"$f":"N13-F13","v":-7642643.8624749184},null,null,null,{"$f":"'3. Data_Input_Sheet'!M24","v":162228007.42014542},null,null,null,{"$f":"V13-N13","v":-8003233.1226615608},null,null,null,{"$f":"IF(ISBLANK('3. Data_Input_Sheet'!U24),'5. Utility Income'!N13,'3. Data_Input_Sheet'!U24)","v":154224774.29748386}]
[null,2,null,"Other Revenue","(1)",{"$f":"F45","v":9062000},null,null,null,{"$f":"N14-F14","v":782598.27254684456},null,null,null,{"$f":"N45","v":9844598.2725468446},null,null,null,{"$f":"V14-N14","v":0},null,null,null,{"$f":"V45","v":9844598.2725468446}]
[null,null,null,null,null,{"$f":"SUM(F13:F14)","v":178932651.28262034},null,null,null,{"$f":"SUM(J13:J14)","v":-6860045.5899280738},null,null,null,{"$f":"SUM(N13:N14)","v":172072605.69269228},null,null,null,{"$f":"SUM(R13:R14)","v":-8003233.1226615608},null,null,null,{"$f":"SUM(V13:V14)","v":164069372.57003072}]
{"$rows_left_out":32}
{"sheet":"6. Taxes_PILs","index":5,"n_rows":43,"n_cols":15,"rows_kept":43,"cut":false,"hidden":false,"merged":[[42,3,42,14],[49,3,49,14],[50,3,50,14],[43,3,43,14],[47,3,47,14],[48,3,48,14],[0,3,0,12],[2,2,2,6],[3,2,3,6],[1,2,1,14],[41,1,41,14],[7,3,7,14],[23,6,24,6],[23,14,24,14],[13,3,13,4],[15,3,15,4],[17,3,17,4],[30,3,30,4],[23,10,24,10]]}
[]
[]
[]
[]
[]
[]
[]
[]
[]
[null,"Line No.",null,"Particulars ",null,null,"Application",null,null,null,{"$f":"IF(ISBLANK('3. Data_Input_Sheet'!M10:M11),\"\",'3. Data_Input_Sheet'!M10:M11)","v":"Settlement Agreement"},null,null,null,{"$f":"'3. Data_Input_Sheet'!U10","v":"Per Board Decision"}]
[]
[null,null,null,"Determination of Taxable Income"]
[]
[null,1,null,"Utility net income before taxes",null,null,{"$f":"'7. Cost_of_Capital'!P22","v":30717683.537278954},null,null,null,{"$f":"'7. Cost_of_Capital'!P38","v":30581904.794878952},null,null,null,{"$f":"'7. Cost_of_Capital'!P54","v":29721794.515764195}]
[]
{"$rows_left_out":29}
{"sheet":"7. Cost_of_Capital","index":6,"n_rows":62,"n_cols":16,"rows_kept":62,"cut":false,"hidden":false,"merged":[[0,2,0,13],[2,2,2,13],[3,2,3,9],[1,2,1,17],[66,3,66,15],[64,3,64,15],[7,3,7,15],[10,5,10,9],[60,1,60,15],[45,3,45,15],[13,3,13,15],[29,3,29,15],[67,3,67,15],[65,3,65,15],[61,3,61,15],[62,3,62,15],[63,3,63,15]]}
[]
[]
[]
[]
[]
[]
[]
[]
[]
[]
[null,"Line No.",null,"Particulars",null,"Capitalization Ratio",null,null,null,null,null,"Cost Rate",null,null,null,"Return"]
[]
[]
[]
[null,null,null,null,null,"(%)",null,null,null,"($)",null,"(%)",null,null,null,"($)"]
{"$rows_left_out":48}
{"sheet":"8. Rev_Def_Suff","index":7,"n_rows":53,"n_cols":16,"rows_kept":53,"cut":false,"hidden":false,"merged":[[55,3,55,15],[52,3,52,15],[53,3,53,15],[54,3,54,15],[51,1,51,8],[7,5,7,15],[11,11,12,11],[0,2,0,14],[1,2,1,14],[2,2,2,14],[3,2,3,7],[9,5,9,7],[11,1,12,1],[11,3,12,3],[9,9,9,11],[11,7,12,7],[11,15,12,15],[11,13,12,13],[11,5,12,5],[11,9,12,9],[9,13,9,15]]}
[null,null,null,null,null,null,null,null,null,null,null,null,null,null,null,{"$f":"CONCATENATE('2. Table of Contents'!$F$6,\" \",'2. Table of Contents'!$G$6)","v":" "}]
[]
[]
[]
[]
[]
[]
[]
[]
[null,null,null,null,null,"Initial Application",null,null,null,{"$f":"IF(ISBLANK('3. Data_Input_Sheet'!M10:M11),\"\",'3. Data_Input_Sheet'!M10:M11)","v":"Settlement Agreement"},null,null,null,{"$f":"'3. Data_Input_Sheet'!U10","v":"Per Board Decision"}]
[]
[null,"Line No.",null,"Particulars",null,"At Current Approved Rates",null,"At Proposed Rates",null,"At Current Approved Rates",null,"At Proposed Rates",null,"At Current Approved Rates",null,"At Proposed Rates"]
[]
[]
[]
{"$rows_left_out":39}
{"sheet":"9. Rev_Reqt","index":8,"n_rows":35,"n_cols":17,"rows_kept":35,"cut":false,"hidden":false,"merged":[[27,13,27,14],[28,9,29,9],[30,9,31,9],[30,5,31,5],[28,5,29,5],[28,13,29,14],[30,13,31,14],[26,13,26,14],[14,13,14,14],[15,13,15,14],[18,13,18,14],[19,13,19,14],[25,13,25,14],[23,13,23,14],[24,13,24,14],[33,1,33,14],[0,2,0,13],[0,14,0,16],[40,3,40,14],[35,3,35,14],[36,3,36,14],[37,3,37,14],[38,3,38,14],[16,13,16,14],[12,13,12,14],[13,13,13,14],[17,13,17,14],[21,13,21,14],[1,2,1,17],[2,2,2,17],[39,3,39,14],[3,2,3,13],[11,13,11,14],[10,13,10,14],[9,13,9,14],[7,5,7,14]]}
[]
[]
[]
[]
[]
[]
[]
[]
[]
[null,"Line No.",null,"Particulars",null,"Application   ",null,null,null,{"$f":"IF(ISBLANK('3. Data_Input_Sheet'!M10:M11),\"\",'3. Data_Input_Sheet'!M10:M11)","v":"Settlement Agreement"},null,null,null,{"$f":"'3. Data_Input_Sheet'!U10","v":"Per Board Decision"}]
[]
[null,1,null,"OM&A Expenses",null,{"$f":"'5. Utility Income'!F19","v":84245961},null,null,null,{"$f":"'5. Utility Income'!N19","v":78204961},null,null,null,{"$f":"'5. Utility Income'!V19","v":78204961}]
[null,2,null,"Amortization/Depreciation",null,{"$f":"'5. Utility Income'!F20","v":36607421.642767914},null,null,null,{"$f":"'5. Utility Income'!N20","v":36531431.642767914},null,null,null,{"$f":"'5. Utility Income'!V20","v":32852395.395780802}]
[null,3,null,"Property Taxes",null,{"$f":"'5. Utility Income'!F21","v":1795039},null,null,null,{"$f":"'5. Utility Income'!N21","v":1795039},null,null,null,{"$f":"'5. Utility Income'!V21","v":1795039}]
[null,4,null,"Capital Taxes",null,{"$f":"'6. Taxes_PILs'!G23","v":0},null,null,null,{"$f":"'6. Taxes_PILs'!K23","v":0},null,null,null,{"$f":"'6. Taxes_PILs'!O23","v":0}]
{"$rows_left_out":21}
{"sheet":"10A. Bill Impacts - Res (1)","index":9,"n_rows":53,"n_cols":23,"rows_kept":53,"cut":false,"hidden":false,"merged":[[50,1,50,16],[51,1,51,16],[1,2,1,14],[53,1,53,16],[54,1,54,16],[52,1,52,16],[11,5,12,5],[11,15,12,15],[11,16,12,16],[0,16,0,17],[10,7,10,9],[10,11,10,13],[10,15,10,16],[7,5,7,16],[0,2,0,12],[2,2,2,12],[3,2,3,9]]}
[null,null,null,null,null,null,null,null,null,null,null,null,null,null,null,null,{"$f":"CONCATENATE('2. Table of Contents'!$F$6,\" \",'2. Table of Contents'!$G$6)","v":" "},null,null,null,null,null,1]
[]
[]
[]
[]
[]
[]
[null,"monthly"]
[null,"per kWh",null,null,null,"Consumption",null,800," kWh"]
[null,"per kW"]
[null,null,null,null,null,null,null,"Current Board-Approved",null,null,null,"Proposed",null,null,null,"Impact"]
[null,null,null,null,null,"Charge Unit",null,"Rate","Volume","Charge",null,"Rate","Volume","Charge",null,"$ Change","% Change"]
[null,null,null,null,null,null,null,"($)",null,"($)",null,"($)",null,"($)"]
[null,1,null,"Monthly Service Charge",null,"monthly",null,11.99,1,{"$f":"I14*H14","v":11.99},null,12.34,1,{"$f":"M14*L14","v":12.34},null,{"$f":"N14-J14","v":0.34999999999999964},{"$f":"IF((J14)=0,\"\",(P14/J14))","v":2.9190992493744756E-2}]
[null,2,null,"Smart Meter Rate Adder",null,"monthly",null,1.28,1,{"$f":"I15*H15","v":1.28},null,null,1,{"$f":"M15*L15","v":0},null,{"$f":"N15-J15","v":-1.28},{"$f":"IF((J15)=0,\"\",(P15/J15))","v":-1}]
{"$rows_left_out":39}
{"sheet":"10A. Bill Impacts - Res (2)","index":10,"n_rows":53,"n_cols":23,"rows_kept":53,"cut":false,"hidden":false,"merged":[[0,16,0,17],[10,7,10,9],[10,11,10,13],[10,15,10,16],[7,5,7,16],[0,2,0,12],[2,2,2,12],[3,2,3,9],[11,15,12,15],[11,16,12,16],[1,2,1,14],[53,1,53,16],[54,1,54,16],[50,1,50,16],[51,1,51,16],[52,1,52,16],[11,5,12,5]]}
[null,null,null,null,null,null,null,null,null,null,null,null,null,null,null,null,{"$f":"CONCATENATE('2. Table of Contents'!$F$6,\" \",'2. Table of Contents'!$G$6)","v":" "},null,null,null,null,null,1]
[]
[]
[]
[]
[]
[]
[null,"monthly"]
[null,"per kWh",null,null,null,"Consumption",null,800," kWh"]
[null,"per kW"]
[null,null,null,null,null,null,null,"Current Board-Approved",null,null,null,"Proposed",null,null,null,"Impact"]
[null,null,null,null,null,"Charge Unit",null,"Rate","Volume","Charge",null,"Rate","Volume","Charge",null,"$ Change","% Change"]
[null,null,null,null,null,null,null,"($)",null,"($)",null,"($)",null,"($)"]
[null,1,null,"Monthly Service Charge",null,"monthly",null,15.34,1,{"$f":"I14*H14","v":15.34},null,12.34,1,{"$f":"M14*L14","v":12.34},null,{"$f":"N14-J14","v":-3},{"$f":"IF((J14)=0,\"\",(P14/J14))","v":-0.19556714471968709}]
[null,2,null,"Smart Meter Rate Adder",null,"monthly",null,null,1,0,null,null,1,0,null,0,""]
{"$rows_left_out":39}
{"sheet":"10B. Bill Impacts -GS_LT_50 (1)","index":11,"n_rows":53,"n_cols":23,"rows_kept":53,"cut":false,"hidden":false,"merged":[[0,16,0,17],[10,7,10,9],[10,11,10,13],[10,15,10,16],[7,5,7,16],[51,1,51,16],[52,1,52,16],[53,1,53,16],[54,1,54,16],[11,15,12,15],[11,16,12,16],[11,5,12,5],[50,1,50,16]]}
[null,null,null,null,null,null,null,null,null,null,null,null,null,null,null,null,{"$f":"CONCATENATE('2. Table of Contents'!$F$6,\" \",'2. Table of Contents'!$G$6)","v":" "},null,null,null,null,null,1]
[]
[]
[]
[]
[]
[]
[null,"monthly"]
[null,"per kWh",null,null,null,"Consumption",null,2000," kWh"]
[null,"per kW"]
[null,null,null,null,null,null,null,"Current Board-Approved",null,null,null,"Proposed",null,null,null,"Impact"]
[null,null,null,null,null,"Charge Unit",null,"Rate","Volume","Charge",null,"Rate","Volume","Charge",null,"$ Change","% Change"]
[null,null,null,null,null,null,null,"($)",null,"($)",null,"($)",null,"($)"]
[null,1,null,"Monthly Service Charge",null,"monthly",null,28.64,1,{"$f":"I14*H14","v":28.64},null,25.39,1,{"$f":"M14*L14","v":25.39},null,{"$f":"N14-J14","v":-3.25},{"$f":"IF((J14)=0,\"\",(P14/J14))","v":-0.11347765363128491}]
[null,2,null,"Smart Meter Rate Adder",null,"monthly",null,1.01,1,1.01,null,null,1,0,null,-1.01,-1]
{"$rows_left_out":39}
{"sheet":"10B. Bill Impacts -GS_LT_50 (2)","index":12,"n_rows":53,"n_cols":23,"rows_kept":53,"cut":false,"hidden":false,"merged":[[0,16,0,17],[10,7,10,9],[10,11,10,13],[10,15,10,16],[7,5,7,16],[53,1,53,16],[54,1,54,16],[11,15,12,15],[11,16,12,16],[11,5,12,5],[50,1,50,16],[51,1,51,16],[52,1,52,16]]}
[null,null,null,null,null,null,null,null,null,null,null,null,null,null,null,null,{"$f":"CONCATENATE('2. Table of Contents'!$F$6,\" \",'2. Table of Contents'!$G$6)","v":" "},null,null,null,null,null,1]
[]
[]
[]
[]
[]
[]
[null,"monthly"]
[null,"per kWh",null,null,null,"Consumption",null,2000," kWh"]
[null,"per kW"]
[null,null,null,null,null,null,null,"Current Board-Approved",null,null,null,"Proposed",null,null,null,"Impact"]
[null,null,null,null,null,"Charge Unit",null,"Rate","Volume","Charge",null,"Rate","Volume","Charge",null,"$ Change","% Change"]
[null,null,null,null,null,null,null,"($)",null,"($)",null,"($)",null,"($)"]
[null,1,null,"Monthly Service Charge",null,"monthly",null,16.11,1,{"$f":"I14*H14","v":16.11},null,25.39,1,{"$f":"M14*L14","v":25.39},null,{"$f":"N14-J14","v":9.2800000000000011},{"$f":"IF((J14)=0,\"\",(P14/J14))","v":0.57603972687771576}]
[null,2,null,"Smart Meter Rate Adder",null,"monthly",null,null,1,0,null,null,1,0,null,0,""]
{"$rows_left_out":38}