{"text_format":"1","workbook":"xlsx","n_sheets":9,"sheets":["1. Info","2. Table of Contents","3. Data_Input_Sheet","4. Rate_Base","5. Utility Income","6. Taxes_PILs","7. Cost_of_Capital","8. Rev_Def_Suff","9. Rev_Reqt"],"not_rendered":{"charts":0,"images":4,"macros":1,"external_links":2,"defined_names":12,"comments":0,"pivot_tables":0},"unopened":[],"bounds":{"document_bytes":16777216,"sheet_cells":100000,"rows_first":2000,"rows_last":500,"rows_between":2000,"halvings":0,"cell_chars":16384,"cell_head_chars":4096},"cells_cut":0,"cells_raw":0,"read":"whole","date_system":"1900"}

{"sheet":"1. Info","index":0,"n_rows":98,"n_cols":29,"rows_kept":98,"cut":false,"hidden":false,"merged":[[27,1,27,3],[34,1,40,11],[0,2,1,12],[2,2,3,12],[27,4,27,9],[25,6,25,10],[21,1,21,2],[15,6,15,12],[17,6,17,10],[19,6,19,10],[21,6,21,10],[23,6,23,10],[23,1,23,2],[25,1,25,3]]}
[null,null,null,null,null,null,null,null,null,null,null,null,null,null,null,null,null,null,null,null,null,null,null,null,null,null,null,null,{"$f":"IF('3. Data_Input_Sheet'!M12=0, \"\", '3. Data_Input_Sheet'!M12)","v":"Supplementary Interrogatory Responses"}]
[]
[]
[]
[]
[]
[]
[]
[]
[]
[null,null,null,null,null,null,null,null,null,null,null,null,null,null,null,"Version",3]
[]
[]
[]
[]
[null,null,null,null,null,"Utility Name   ","Westario Power Inc."]
[]
[null,null,null,null,null,"Service Territory"]
[]
[null,null,null,null,null,"Assigned EB Number","EB2012-0176",null,null,null,null,null,null,null,null,null,null,null,null,null,null,null,null,null,null,null,"Company Name"]
{"$rows_left_out":79}
{"sheet":"2. Table of Contents","index":1,"n_rows":29,"n_cols":9,"rows_kept":29,"cut":false,"hidden":false,"merged":[[0,2,0,4],[1,3,1,6],[3,3,3,4],[28,1,28,11],[24,1,24,7],[25,1,25,7],[26,1,26,7],[27,1,27,11]]}
[]
[]
[]
[]
[]
[]
[]
[]
[]
[]
[null,null,null,"1. Info",null,null,null,null,"6. Taxes_PILs"]
[]
[null,null,null,"2. Table of Contents",null,null,null,null,"7. Cost_of_Capital"]
[]
[null,null,null,"3. Data_Input_Sheet",null,null,null,null,"8. Rev_Def_Suff"]
[]
[null,null,null,"4. Rate_Base",null,null,null,null,"9. Rev_Reqt"]
[]
[null,null,null,"5. Utility Income"]
[]
{"$rows_left_out":10}
{"sheet":"3. Data_Input_Sheet","index":2,"n_rows":82,"n_cols":23,"rows_kept":82,"cut":false,"hidden":false,"merged":[[88,2,89,20],[71,2,71,20],[72,2,72,20],[70,2,70,20],[87,2,87,20],[75,2,75,20],[81,2,81,20],[73,2,73,20],[76,2,76,20],[77,2,77,20],[82,2,82,20],[83,2,83,20],[84,2,84,20],[85,2,85,20],[86,2,86,20],[74,2,74,20],[78,2,79,20],[80,2,80,20],[0,2,0,12],[7,4,7,20],[19,24,20,24],[69,2,69,20],[3,2,3,10],[1,2,1,10],[2,2,2,10],[11,14,12,14],[11,6,12,6],[11,16,12,16],[11,4,12,4],[11,8,12,8],[11,20,12,20],[11,12,12,12]]}
[null,null,null,null,null,null,null,null,null,null,null,null,null,null,null,null,null,null,null,null,{"$f":"CONCATENATE('2. Table of Contents'!$F$6,\" \",'2. Table of Contents'!$G$6)","v":" "}]
[]
[]
[]
[]
[]
[]
[]
[null,"Data Input (1)"]
[]
[]
[null,null,null,null,"Initial Application",null,"(2)",null,{"$f":"IF(ISBLANK(M12),\"\",\"Adjustments\")","v":"Adjustments"},null,null,null,"Supplementary Interrogatory Responses",null,"(6)",null,{"$f":"IF(ISBLANK(M12),\"\",\"Adjustments\")","v":"Adjustments"},null,null,null,"Per Board Decision"]
[]
[]
[null,1,"Rate Base"]
[null,null,"   Gross Fixed Assets (average)",null,{"$f":"+(50057765+58218384)/2","v":54138074.5},null,null,null,-685259,null,null,null,{"$f":"IF(ISBLANK(E16),0,E16+I16)","v":53452815.5},null,null,null,{"$f":"+((52717692+57406732)/2)-M16","v":1609396.5},null,null,null,{"$f":"IF(ISBLANK(E16),\"\",E16+I16+Q16)","v":55062212}]
[null,null,"   Accumulated Depreciation (average)",null,{"$f":"+(-18065895-20308840)/2","v":-19187367.5},null,"(5)",null,23129,null,null,null,{"$f":"IF(ISBLANK(E17),0,E17+I17)","v":-19164238.5},null,null,null,{"$f":"+((-18757895-20186224)/2)-M17","v":-307821},null,null,null,{"$f":"IF(ISBLANK(E17),\"\",E17+I17+Q17)","v":-19472059.5}]
[null,null,"Allowance for Working Capital:"]
[null,null,"   Controllable Expenses",null,6325500,null,null,null,14200,null,null,null,{"$f":"IF(ISBLANK(E19),0,E19+I19)","v":6339700},null,null,null,-150000,null,null,null,{"$f":"IF(ISBLANK(E19),\"\",E19+I19+Q19)","v":6189700}]
[null,null,"   Cost of Power",null,45548250,null,null,null,{"$f":"45037744-45548250","v":-510506},null,null,null,{"$f":"IF(ISBLANK(E20),0,E20+I20)","v":45037744},null,null,null,{"$f":"46149157-M20","v":1111413},null,null,null,{"$f":"IF(ISBLANK(E20),\"\",E20+I20+Q20)","v":46149157}]
{"$rows_left_out":63}
{"sheet":"4. Rate_Base","index":3,"n_rows":35,"n_cols":23,"rows_kept":35,"cut":false,"hidden":false,"merged":[[2,2,2,6],[3,2,3,6],[0,2,0,10],[1,2,1,22],[32,1,32,22],[17,6,18,6],[17,10,18,10],[17,22,18,22],[17,3,18,3],[21,3,21,22],[17,14,18,14],[17,18,18,18],[33,3,33,22],[34,3,34,22],[35,3,35,22],[40,3,40,22],[41,3,41,22],[36,3,36,22],[37,3,37,22],[38,3,38,22],[39,3,39,22]]}
[]
[]
[]
[]
[]
[null,"Rate Base and Working Capital"]
[]
[]
[]
[null,null,null,"Rate Base"]
[null,"Line No.",null,"Particulars",null,null,"Initial Application",null,null,null,{"$f":"IF(ISBLANK('3. Data_Input_Sheet'!M12),\"\",'3. Data_Input_Sheet'!I12)","v":"Adjustments"},null,null,null,{"$f":"IF(ISBLANK('3. Data_Input_Sheet'!M12),\" \",'3. Data_Input_Sheet'!M12)","v":"Supplementary Interrogatory Responses"},null,null,null,{"$f":"IF(ISBLANK('3. Data_Input_Sheet'!Q12),\"\",'3. Data_Input_Sheet'!Q12)","v":"Adjustments"},null,null,null,{"$f":"'3. Data_Input_Sheet'!U12","v":"Per Board Decision"}]
[]
[null,1,null,"Gross Fixed Assets (average)","(3)",null,{"$f":"'3. Data_Input_Sheet'!E16","v":54138074.5},null,null,null,{"$f":"'3. Data_Input_Sheet'!I16","v":-685259},null,null,null,{"$f":"G13+K13","v":53452815.5},null,null,null,{"$f":"'3. Data_Input_Sheet'!Q16","v":1609396.5},null,null,null,{"$f":"G13+K13+S13","v":55062212}]
[null,2,null,"Accumulated Depreciation (average)","(3)",null,{"$f":"'3. Data_Input_Sheet'!E17","v":-19187367.5},null,null,null,{"$f":"'3. Data_Input_Sheet'!I17","v":23129},null,null,null,{"$f":"G14+K14","v":-19164238.5},null,null,null,{"$f":"'3. Data_Input_Sheet'!Q17","v":-307821},null,null,null,{"$f":"G14+K14+S14","v":-19472059.5}]
[null,3,null,"Net Fixed Assets (average)","(3)",null,{"$f":"SUM(G13:G14)","v":34950707},null,null,null,{"$f":"SUM(K13:K14)","v":-662130},null,null,null,{"$f":"SUM(O13:O14)","v":34288577},null,null,null,{"$f":"SUM(S13:S14)","v":1301575.5},null,null,null,{"$f":"SUM(W13:W14)","v":35590152.5}]
[]
[null,4,null,"Allowance for Working Capital","(1)",null,{"$f":"G30","v":6743587.5},null,null,null,{"$f":"K30","v":-64519.779999999329},null,null,null,{"$f":"O30","v":6679067.7200000007},null,null,null,{"$f":"S30","v":-398404.88000000082},null,null,null,{"$f":"W30","v":6280662.8399999999}]
[null,null,null,"Total Rate Base",null,null,{"$f":"G17+G15","v":41694294.5},null,null,null,{"$f":"K17+K15","v":-726649.77999999933},null,null,null,{"$f":"O17+O15","v":40967644.719999999},null,null,null,{"$f":"S17+S15","v":903170.61999999918},null,null,null,{"$f":"W15+W17","v":41870815.340000004}]
[null,5]
[null,null,null,"Allowance for Working Capital - Derivation"]
{"$rows_left_out":16}
{"sheet":"5. Utility Income","index":4,"n_rows":51,"n_cols":22,"rows_kept":51,"cut":false,"hidden":false,"merged":[[58,3,58,21],[56,3,56,21],[57,3,57,21],[53,3,53,21],[26,5,27,5],[55,3,55,21],[54,3,54,21],[49,5,50,5],[49,21,50,21],[43,1,43,21],[38,13,39,13],[26,21,27,21],[26,13,27,13],[36,13,37,13],[26,17,27,17],[36,17,37,17],[0,2,0,11],[2,2,2,7],[3,2,3,7],[1,2,1,21],[17,21,18,21],[17,13,18,13],[17,17,18,17],[7,5,7,21],[17,5,18,5],[17,9,18,9],[26,9,27,9],[36,21,37,21],[36,5,37,5],[38,21,39,21],[38,5,39,5],[38,17,39,17],[49,9,50,9],[49,13,50,13],[49,17,50,17],[36,9,37,9],[38,9,39,9]]}
[]
[]
[]
[]
[]
[]
[]
[]
[]
[]
[null,"Utility Income"]
[]
[null,"Line No.",null,"Particulars                                ",null,"Initial Application   ",null,null,null,{"$f":"IF(N13=\"\",\"\",\"Adjustments\")","v":"Adjustments"},null,null,null,{"$f":"IF(ISBLANK('3. Data_Input_Sheet'!M12),\"\",'3. Data_Input_Sheet'!M12)","v":"Supplementary Interrogatory Responses"},null,null,null,{"$f":"IF(N13=\"\",\"\",\"Adjustments\")","v":"Adjustments"},null,null,null,{"$f":"'3. Data_Input_Sheet'!U12","v":"Per Board Decision"}]
[]
[null,null,null,"Operating Revenues:"]
[null,1,null,"Distribution Revenue (at Proposed Rates)",null,{"$f":"'3. Data_Input_Sheet'!E26","v":9926660},null,null,null,{"$f":"N16-F16","v":-235857},null,null,null,{"$f":"'3. Data_Input_Sheet'!M26","v":9690803},null,null,null,{"$f":"V16-N16","v":-59222},null,null,null,{"$f":"IF(ISBLANK('3. Data_Input_Sheet'!U26),'5. Utility Income'!N16,'3. Data_Input_Sheet'!U26)","v":9631581}]
[null,2,null,"Other Revenue","(1)",{"$f":"F50","v":653041},null,null,null,{"$f":"N17-F17","v":0},null,null,null,{"$f":"N50","v":653041},null,null,null,{"$f":"V17-N17","v":0},null,null,null,{"$f":"V50","v":653041}]
[null,null,null,null,null,{"$f":"SUM(F16:F17)","v":10579701},null,null,null,{"$f":"SUM(J16:J17)","v":-235857},null,null,null,{"$f":"SUM(N16:N17)","v":10343844},null,null,null,{"$f":"SUM(R16:R17)","v":-59222},null,null,null,{"$f":"SUM(V16:V17)","v":10284622}]
[null,3,null,"Total Operating Revenues"]
[]
{"$rows_left_out":32}
{"sheet":"6. Taxes_PILs","index":5,"n_rows":45,"n_cols":15,"rows_kept":45,"cut":false,"hidden":false,"merged":[[0,3,0,12],[2,2,2,6],[3,2,3,6],[1,2,1,14],[43,1,43,14],[8,1,8,12],[25,6,26,6],[25,14,26,14],[15,3,15,4],[17,3,17,4],[19,3,19,4],[32,3,32,4],[25,10,26,10],[44,3,44,14],[51,3,51,14],[52,3,52,14],[45,3,45,14],[49,3,49,14],[50,3,50,14]]}
[]
[]
[]
[]
[]
[]
[]
[]
[null,"Taxes/PILs"]
[]
[]
[null,"Line No.",null,"Particulars ",null,null,"Application",null,null,null,{"$f":"IF(ISBLANK('3. Data_Input_Sheet'!M12),\"\",'3. Data_Input_Sheet'!M12)","v":"Supplementary Interrogatory Responses"},null,null,null,{"$f":"'3. Data_Input_Sheet'!U12","v":"Per Board Decision"}]
[]
[null,null,null,"Determination of Taxable Income"]
[]
[null,1,null,"Utility net income before taxes",null,null,{"$f":"'7. Cost_of_Capital'!P22","v":1521007.8633600001},null,null,null,{"$f":"'7. Cost_of_Capital'!P38","v":1463364.2693984001},null,null,null,{"$f":"'7. Cost_of_Capital'!P54","v":1503999.6870128002}]
[]
[null,2,null,"Adjustments required to arrive at taxable utility income",null,null,{"$f":"'3. Data_Input_Sheet'!E44","v":-1547168},null,null,null,{"$f":"'3. Data_Input_Sheet'!M44","v":-1484657},null,null,null,{"$f":"IF(ISBLANK('3. Data_Input_Sheet'!U44),G18,'3. Data_Input_Sheet'!U44)","v":-1474412}]
[]
[null,3,null,"Taxable income",null,null,{"$f":"G16+G18","v":-26160.136639999924},null,null,null,{"$f":"K16+K18","v":-21292.730601599906},null,null,null,{"$f":"O16+O18","v":29587.687012800248}]
{"$rows_left_out":26}
{"sheet":"7. Cost_of_Capital","index":6,"n_rows":62,"n_cols":16,"rows_kept":62,"cut":false,"hidden":false,"merged":[[0,2,0,13],[2,2,2,13],[3,2,3,9],[1,2,1,17],[12,5,12,9],[4,1,4,13],[10,5,10,9],[67,3,67,15],[65,3,65,15],[61,3,61,15],[62,3,62,15],[63,3,63,15],[64,3,64,15],[13,3,13,15],[29,3,29,15],[44,5,44,9],[28,5,28,9],[66,3,66,15],[60,1,60,15],[45,3,45,15]]}
[]
[]
[]
[]
[null,"Capitalization/Cost of Capital"]
[]
[]
[]
[]
[]
[null,"Line No.",null,"Particulars",null,"Capitalization Ratio",null,null,null,null,null,"Cost Rate",null,null,null,"Return"]
[]
[null,null,null,null,null,"Initial Application"]
[]
[null,null,null,null,null,"(%)",null,null,null,"($)",null,"(%)",null,null,null,"($)"]
[null,null,null,"Debt"]
[null,1,null,"  Long-term Debt",null,{"$f":"'3. Data_Input_Sheet'!E55","v":0.56000000000000005},null,null,null,{"$f":"$J$26*F17","v":23348804.920000002},null,{"$f":"'3. Data_Input_Sheet'!E62","v":5.79E-2},null,null,null,{"$f":"L17*J17","v":1351895.8048680001}]
[null,2,null,"  Short-term Debt",null,{"$f":"'3. Data_Input_Sheet'!E56","v":0.04},null,null,null,{"$f":"$J$26*F18","v":1667771.78},null,{"$f":"'3. Data_Input_Sheet'!E63","v":2.0799999999999999E-2},null,null,null,{"$f":"L18*J18","v":34689.653023999999}]
[null,3,null,"Total Debt",null,{"$f":"SUM(F17:F18)","v":0.60000000000000009},null,null,null,{"$f":"SUM(J17:J18)","v":25016576.700000003},null,{"$f":"IF(F19=0,0,SUMPRODUCT(F17:F18,L17:L18)/F19)","v":5.5426666666666659E-2},null,null,null,{"$f":"SUM(P17:P18)","v":1386585.4578920002}]
[]
{"$rows_left_out":43}
{"sheet":"8. Rev_Def_Suff","index":7,"n_rows":58,"n_cols":16,"rows_kept":58,"cut":false,"hidden":false,"merged":[[0,2,0,14],[1,2,1,14],[2,2,2,14],[3,2,3,7],[55,1,55,8],[14,3,15,3],[14,1,15,1],[12,5,12,7],[60,3,60,15],[56,3,56,15],[58,3,58,15],[59,3,59,15],[7,5,7,15],[14,7,15,7],[14,15,15,15],[14,5,15,5],[12,13,12,15],[14,13,15,13],[12,9,12,11],[14,9,15,9],[14,11,15,11],[57,3,57,15]]}
[null,null,null,null,null,null,null,null,null,null,null,null,null,null,null,{"$f":"CONCATENATE('2. Table of Contents'!$F$6,\" \",'2. Table of Contents'!$G$6)","v":" "}]
[]
[]
[]
[]
[]
[]
[]
[]
[null,"Revenue Deficiency/Sufficiency"]
[]
[]
[null,null,null,null,null,"Initial Application",null,null,null,{"$f":"IF(ISBLANK('3. Data_Input_Sheet'!M12),\"\",'3. Data_Input_Sheet'!M12)","v":"Supplementary Interrogatory Responses"},null,null,null,{"$f":"'3. Data_Input_Sheet'!U12","v":"Per Board Decision"}]
[]
[null,"Line No.",null,"Particulars",null,"At Current Approved Rates",null,"At Proposed Rates",null,"At Current Approved Rates",null,"At Proposed Rates",null,"At Current Approved Rates",null,"At Proposed Rates"]
[]
[]
[]
[null,1,null,"Revenue Deficiency from Below",null,null,null,{"$f":"F53","v":977793.43525254494},null,null,null,{"$f":"J53","v":743691.32178058429},null,null,null,{"$f":"N53","v":656372.84860905062}]
[null,2,null,"Distribution Revenue",null,{"$f":"'3. Data_Input_Sheet'!E25","v":8939434},null,{"$f":"'3. Data_Input_Sheet'!E26-H19","v":8948866.5647474546},null,{"$f":"IF(ISBLANK('3. Data_Input_Sheet'!M25),'3. Data_Input_Sheet'!E25,'3. Data_Input_Sheet'!M25)","v":8939434},null,{"$f":"IF(ISBLANK('3. Data_Input_Sheet'!M26),'3. Data_Input_Sheet'!E26-L19,'3. Data_Input_Sheet'!M26-L19)","v":8947111.6782194152},null,{"$f":"IF(ISBLANK('3. Data_Input_Sheet'!U25),'3. Data_Input_Sheet'!M25,'3. Data_Input_Sheet'!U25)","v":8975208},null,{"$f":"IF(ISBLANK('3. Data_Input_Sheet'!U26),'3. Data_Input_Sheet'!M26-P19,'3. Data_Input_Sheet'!U26-P19)","v":8975208.1513909493}]
{"$rows_left_out":39}
{"sheet":"9. Rev_Reqt","index":8,"n_rows":40,"n_cols":17,"rows_kept":40,"cut":false,"hidden":false,"merged":[[42,3,42,16],[43,3,43,16],[44,3,44,16],[45,3,45,16],[15,13,15,14],[16,13,16,14],[20,13,20,14],[25,13,25,14],[40,3,40,16],[41,3,41,16],[38,1,38,14],[32,13,32,14],[33,9,34,9],[35,9,36,9],[35,5,36,5],[33,5,34,5],[3,2,3,13],[14,13,14,14],[13,13,13,14],[12,13,12,14],[7,5,7,14],[33,13,34,14],[35,13,36,14],[0,2,0,13],[0,14,0,16],[19,13,19,14],[31,13,31,14],[17,13,17,14],[18,13,18,14],[21,13,21,14],[22,13,22,14],[30,13,30,14],[27,13,27,14],[28,13,28,14],[23,13,23,14],[1,2,1,17],[2,2,2,17]]}
[]
[]
[]
[]
[]
[]
[]
[]
[]
[]
[null,"Revenue Requirement"]
[]
[null,"Line No.",null,"Particulars",null,"Application   ",null,null,null,{"$f":"IF(ISBLANK('3. Data_Input_Sheet'!M12),\"\",'3. Data_Input_Sheet'!M12)","v":"Supplementary Interrogatory Responses"},null,null,null,{"$f":"'3. Data_Input_Sheet'!U12","v":"Per Board Decision"}]
[]
[null,1,null,"OM&A Expenses",null,{"$f":"'5. Utility Income'!F22","v":6292500},null,null,null,{"$f":"'5. Utility Income'!N22","v":6306700},null,null,null,{"$f":"'5. Utility Income'!V22","v":6156700}]
[null,2,null,"Amortization/Depreciation",null,{"$f":"'5. Utility Income'!F23","v":1379137},null,null,null,{"$f":"'5. Utility Income'!N23","v":1335460},null,null,null,{"$f":"'5. Utility Income'!V23","v":1343824}]
[null,3,null,"Property Taxes",null,{"$f":"'5. Utility Income'!F24","v":33000},null,null,null,{"$f":"'5. Utility Income'!N24","v":33000},null,null,null,{"$f":"'5. Utility Income'!V24","v":33000}]
[null,4,null,"Capital Taxes",null,{"$f":"'6. Taxes_PILs'!G25","v":0},null,null,null,{"$f":"'6. Taxes_PILs'!K25","v":0},null,null,null,{"$f":"'6. Taxes_PILs'!O25","v":0}]
[null,5,null,"Income Taxes (Grossed up)",null,{"$f":"'6. Taxes_PILs'!G33-F18","v":0},null,null,null,{"$f":"'6. Taxes_PILs'!K33-J18","v":0},null,null,null,{"$f":"'6. Taxes_PILs'!O33-N18","v":5427.2189349112432}]
[null,6,null,"Other Expenses",null,{"$f":"'5. Utility Income'!F26","v":0},null,null,null,{"$f":"'5. Utility Income'!N26","v":""},null,null,null,{"$f":"'5. Utility Income'!V26","v":""}]
{"$rows_left_out":20}