{"text_format":"1","workbook":"xlsx","n_sheets":6,"sheets":["1. Information Sheet","2. 2014 Continuity Schedule","3. Appendix A","4. Billing Determinants","5. Allocation of Balances","6. Rate Rider Calculations"],"not_rendered":{"charts":0,"images":2,"macros":1,"external_links":3,"defined_names":144,"comments":0,"pivot_tables":0},"unopened":[],"bounds":{"document_bytes":16777216,"sheet_cells":100000,"rows_first":2000,"rows_last":500,"rows_between":2000,"halvings":0,"cell_chars":16384,"cell_head_chars":4096},"cells_cut":0,"cells_raw":0,"read":"whole","date_system":"1900"}

{"sheet":"1. Information Sheet","index":0,"n_rows":35,"n_cols":14,"rows_kept":35,"cut":false,"hidden":false,"merged":[[30,2,30,11],[32,2,32,13],[34,2,34,12],[26,1,26,12],[13,5,13,11],[15,5,15,9],[17,5,17,9],[19,5,19,9],[21,5,21,9],[23,5,23,9]]}
[]
[]
[]
[]
[]
[]
{"$rows_left_out":30}
{"sheet":"2. 2014 Continuity Schedule","index":1,"n_rows":111,"n_cols":95,"rows_kept":111,"cut":false,"hidden":false,"merged":[[19,70,21,70],[19,71,21,71],[19,72,21,72],[19,69,21,69],[98,2,100,7],[19,2,21,2],[19,3,21,3],[19,53,21,53],[19,51,21,51],[19,52,21,52],[19,48,21,48],[19,5,21,5],[19,6,21,6],[19,9,21,9],[19,10,21,10],[19,13,21,13],[19,11,21,11],[19,30,21,30],[19,28,21,28],[19,18,21,18],[19,37,21,37],[19,41,21,41],[19,42,21,42],[19,40,21,40],[19,20,21,20],[19,19,21,19],[19,17,21,17],[19,16,21,16],[19,15,21,15],[19,63,21,63],[19,61,21,61],[19,54,21,54],[19,55,21,55],[19,93,21,93],[19,94,21,94],[18,90,18,92],[19,92,21,92],[19,91,21,91],[19,90,21,90],[19,43,21,43],[19,62,21,62],[19,57,21,57],[19,58,21,58],[19,59,21,59],[19,56,21,56],[19,50,21,50],[19,49,21,49],[19,46,21,46],[19,47,21,47],[19,60,21,60],[18,64,18,72],[19,64,21,64],[19,65,21,65],[19,66,21,66],[19,67,21,67],[19,68,21,68],[19,73,21,73],[18,86,18,89],[19,86,21,86],[19,87,21,87],[19,88,21,88],[19,89,21,89],[91,2,91,7],[19,29,21,29],[18,73,18,85],[19,80,21,80],[19,85,21,85],[19,36,21,36],[18,54,18,63],[19,23,21,23],[19,24,21,24],[19,25,21,25],[18,44,18,53],[19,44,21,44],[19,45,21,45],[18,4,18,13],[18,24,18,33],[18,34,18,43],[19,35,21,35],[19,34,21,34],[19,32,21,32],[19,14,21,14],[19,12,21,12],[19,8,21,8],[19,7,21,7],[19,4,21,4],[18,14,18,23],[19,82,21,82],[19,83,21,83],[19,84,21,84],[19,74,21,74],[19,75,21,75],[19,76,21,76],[19,77,21,77],[19,78,21,78],[19,79,21,79],[19,81,21,81],[19,38,21,38],[19,39,21,39],[19,33,21,33],[19,31,21,31],[19,27,21,27],[19,26,21,26],[19,22,21,22],[19,21,21,21]]}
[]
[]
[]
[]
[]
[]
{"$rows_left_out":106}
{"sheet":"3. Appendix A","index":2,"n_rows":67,"n_cols":6,"rows_kept":67,"cut":false,"hidden":false,"merged":[[19,4,21,4],[19,5,21,5],[19,2,21,2],[19,3,21,3],[15,1,15,4]]}
[]
[]
[]
[]
[]
[]
{"$rows_left_out":62}
{"sheet":"4. Billing Determinants","index":3,"n_rows":47,"n_cols":14,"rows_kept":47,"cut":false,"hidden":false,"merged":[[46,0,46,7],[18,5,19,5],[18,4,19,4],[18,2,19,2],[18,1,19,1],[18,6,19,6],[18,7,19,7],[15,1,16,8],[18,3,19,3],[18,12,19,12],[18,13,19,13],[44,0,45,7],[18,8,19,8],[18,9,19,9],[18,10,19,10],[18,11,19,11]]}
[]
[]
[]
[]
[]
[]
{"$rows_left_out":42}
{"sheet":"5. Allocation of Balances","index":4,"n_rows":52,"n_cols":25,"rows_kept":52,"cut":false,"hidden":false,"merged":[[46,1,46,2],[47,1,47,2],[49,1,49,2],[50,1,50,2],[51,1,51,2]]}
[]
[]
[]
[null,null,null,"Amounts from Sheet 2","Allocator",{"$f":"IF(LEN(TRIM('4. Billing Determinants'!$B21))=0, \"\", '4. Billing Determinants'!$B21)","v":"Residential"},{"$f":"IF(LEN(TRIM('4. Billing Determinants'!$B22))=0, \"\", '4. Billing Determinants'!$B22)","v":"GS<50 kW"},{"$f":"IF(LEN(TRIM('4. Billing Determinants'!$B23))=0, \"\", '4. Billing Determinants'!$B23)","v":"GS>50 kW"},{"$f":"IF(LEN(TRIM('4. Billing Determinants'!$B24))=0, \"\", '4. Billing Determinants'!$B24)","v":"USL"},{"$f":"IF(LEN(TRIM('4. Billing Determinants'!$B25))=0, \"\", '4. Billing Determinants'!$B25)","v":"Large User"},{"$f":"IF(LEN(TRIM('4. Billing Determinants'!$B26))=0, \"\", '4. Billing Determinants'!$B26)","v":"Street Lighting "},{"$f":"IF(LEN(TRIM('4. Billing Determinants'!$B27))=0, \"\", '4. Billing Determinants'!$B27)","v":"Embedded Distributor"},{"$f":"IF(LEN(TRIM('4. Billing Determinants'!$B28))=0, \"\", '4. Billing Determinants'!$B28)","v":""},{"$f":"IF(LEN(TRIM('4. Billing Determinants'!$B29))=0, \"\", '4. Billing Determinants'!$B29)","v":""},{"$f":"IF(LEN(TRIM('4. Billing Determinants'!$B30))=0, \"\", '4. Billing Determinants'!$B30)","v":""},{"$f":"IF(LEN(TRIM('4. Billing Determinants'!$B31))=0, \"\", '4. Billing Determinants'!$B31)","v":""},{"$f":"IF(LEN(TRIM('4. Billing Determinants'!$B32))=0, \"\", '4. Billing Determinants'!$B32)","v":""},{"$f":"IF(LEN(TRIM('4. Billing Determinants'!$B33))=0, \"\", '4. Billing Determinants'!$B33)","v":""},{"$f":"IF(LEN(TRIM('4. Billing Determinants'!$B34))=0, \"\", '4. Billing Determinants'!$B34)","v":""},{"$f":"IF(LEN(TRIM('4. Billing Determinants'!$B35))=0, \"\", '4. Billing Determinants'!$B35)","v":""},{"$f":"IF(LEN(TRIM('4. Billing Determinants'!$B36))=0, \"\", '4. Billing Determinants'!$B36)","v":""},{"$f":"IF(LEN(TRIM('4. Billing Determinants'!$B37))=0, \"\", '4. Billing Determinants'!$B37)","v":""},{"$f":"IF(LEN(TRIM('4. Billing Determinants'!$B38))=0, \"\", '4. Billing Determinants'!$B38)","v":""},{"$f":"IF(LEN(TRIM('4. Billing Determinants'!$B39))=0, \"\", '4. Billing Determinants'!$B39)","v":""},{"$f":"IF(LEN(TRIM('4. Billing Determinants'!$B40))=0, \"\", '4. Billing Determinants'!$B40)","v":""}]
[null,"LV Variance Account",1550,0,"kWh",0,0,0,0,0,0,0,{"$f":"IF(M$4=\"\",0,IF($E5=\"kWh\",VLOOKUP(M$4,'4. Billing Determinants'!$B$19:$N$41,4,0)/'4. Billing Determinants'!$E$41*$D5,IF($E5=\"kW\",VLOOKUP(M$4,'4. Billing Determinants'!$B$19:$N$41,5,0)/'4. Billing Determinants'!$F$41*$D5,IF($E5=\"Non-RPP kWh\",VLOOKUP(M$4,'4. Billing Determinants'!$B$19:$N$41,6,0)/'4. Billing Determinants'!$G$41*$D5,IF($E5=\"Distribution Rev.\",VLOOKUP(M$4,'4. Billing Determinants'!$B$19:$N$41,8,0)/'4. Billing Determinants'!$I$41*$D5, VLOOKUP(M$4,'4. Billing Determinants'!$B$19:$N$41,3,0)/'4. Billing Determinants'!$D$41*$D5)))))","v":0},{"$f":"IF(N$4=\"\",0,IF($E5=\"kWh\",VLOOKUP(N$4,'4. Billing Determinants'!$B$19:$N$41,4,0)/'4. Billing Determinants'!$E$41*$D5,IF($E5=\"kW\",VLOOKUP(N$4,'4. Billing Determinants'!$B$19:$N$41,5,0)/'4. Billing Determinants'!$F$41*$D5,IF($E5=\"Non-RPP kWh\",VLOOKUP(N$4,'4. Billing Determinants'!$B$19:$N$41,6,0)/'4. Billing Determinants'!$G$41*$D5,IF($E5=\"Distribution Rev.\",VLOOKUP(N$4,'4. Billing Determinants'!$B$19:$N$41,8,0)/'4. Billing Determinants'!$I$41*$D5, VLOOKUP(N$4,'4. Billing Determinants'!$B$19:$N$41,3,0)/'4. Billing Determinants'!$D$41*$D5)))))","v":0},{"$f":"IF(O$4=\"\",0,IF($E5=\"kWh\",VLOOKUP(O$4,'4. Billing Determinants'!$B$19:$N$41,4,0)/'4. Billing Determinants'!$E$41*$D5,IF($E5=\"kW\",VLOOKUP(O$4,'4. Billing Determinants'!$B$19:$N$41,5,0)/'4. Billing Determinants'!$F$41*$D5,IF($E5=\"Non-RPP kWh\",VLOOKUP(O$4,'4. Billing Determinants'!$B$19:$N$41,6,0)/'4. Billing Determinants'!$G$41*$D5,IF($E5=\"Distribution Rev.\",VLOOKUP(O$4,'4. Billing Determinants'!$B$19:$N$41,8,0)/'4. Billing Determinants'!$I$41*$D5, VLOOKUP(O$4,'4. Billing Determinants'!$B$19:$N$41,3,0)/'4. Billing Determinants'!$D$41*$D5)))))","v":0},{"$f":"IF(P$4=\"\",0,IF($E5=\"kWh\",VLOOKUP(P$4,'4. Billing Determinants'!$B$19:$N$41,4,0)/'4. Billing Determinants'!$E$41*$D5,IF($E5=\"kW\",VLOOKUP(P$4,'4. Billing Determinants'!$B$19:$N$41,5,0)/'4. Billing Determinants'!$F$41*$D5,IF($E5=\"Non-RPP kWh\",VLOOKUP(P$4,'4. Billing Determinants'!$B$19:$N$41,6,0)/'4. Billing Determinants'!$G$41*$D5,IF($E5=\"Distribution Rev.\",VLOOKUP(P$4,'4. Billing Determinants'!$B$19:$N$41,8,0)/'4. Billing Determinants'!$I$41*$D5, VLOOKUP(P$4,'4. Billing Determinants'!$B$19:$N$41,3,0)/'4. Billing Determinants'!$D$41*$D5)))))","v":0},{"$f":"IF(Q$4=\"\",0,IF($E5=\"kWh\",VLOOKUP(Q$4,'4. Billing Determinants'!$B$19:$N$41,4,0)/'4. Billing Determinants'!$E$41*$D5,IF($E5=\"kW\",VLOOKUP(Q$4,'4. Billing Determinants'!$B$19:$N$41,5,0)/'4. Billing Determinants'!$F$41*$D5,IF($E5=\"Non-RPP kWh\",VLOOKUP(Q$4,'4. Billing Determinants'!$B$19:$N$41,6,0)/'4. Billing Determinants'!$G$41*$D5,IF($E5=\"Distribution Rev.\",VLOOKUP(Q$4,'4. Billing Determinants'!$B$19:$N$41,8,0)/'4. Billing Determinants'!$I$41*$D5, VLOOKUP(Q$4,'4. Billing Determinants'!$B$19:$N$41,3,0)/'4. Billing Determinants'!$D$41*$D5)))))","v":0},{"$f":"IF(R$4=\"\",0,IF($E5=\"kWh\",VLOOKUP(R$4,'4. Billing Determinants'!$B$19:$N$41,4,0)/'4. Billing Determinants'!$E$41*$D5,IF($E5=\"kW\",VLOOKUP(R$4,'4. Billing Determinants'!$B$19:$N$41,5,0)/'4. Billing Determinants'!$F$41*$D5,IF($E5=\"Non-RPP kWh\",VLOOKUP(R$4,'4. Billing Determinants'!$B$19:$N$41,6,0)/'4. Billing Determinants'!$G$41*$D5,IF($E5=\"Distribution Rev.\",VLOOKUP(R$4,'4. Billing Determinants'!$B$19:$N$41,8,0)/'4. Billing Determinants'!$I$41*$D5, VLOOKUP(R$4,'4. Billing Determinants'!$B$19:$N$41,3,0)/'4. Billing Determinants'!$D$41*$D5)))))","v":0},{"$f":"IF(S$4=\"\",0,IF($E5=\"kWh\",VLOOKUP(S$4,'4. Billing Determinants'!$B$19:$N$41,4,0)/'4. Billing Determinants'!$E$41*$D5,IF($E5=\"kW\",VLOOKUP(S$4,'4. Billing Determinants'!$B$19:$N$41,5,0)/'4. Billing Determinants'!$F$41*$D5,IF($E5=\"Non-RPP kWh\",VLOOKUP(S$4,'4. Billing Determinants'!$B$19:$N$41,6,0)/'4. Billing Determinants'!$G$41*$D5,IF($E5=\"Distribution Rev.\",VLOOKUP(S$4,'4. Billing Determinants'!$B$19:$N$41,8,0)/'4. Billing Determinants'!$I$41*$D5, VLOOKUP(S$4,'4. Billing Determinants'!$B$19:$N$41,3,0)/'4. Billing Determinants'!$D$41*$D5)))))","v":0},{"$f":"IF(T$4=\"\",0,IF($E5=\"kWh\",VLOOKUP(T$4,'4. Billing Determinants'!$B$19:$N$41,4,0)/'4. Billing Determinants'!$E$41*$D5,IF($E5=\"kW\",VLOOKUP(T$4,'4. Billing Determinants'!$B$19:$N$41,5,0)/'4. Billing Determinants'!$F$41*$D5,IF($E5=\"Non-RPP kWh\",VLOOKUP(T$4,'4. Billing Determinants'!$B$19:$N$41,6,0)/'4. Billing Determinants'!$G$41*$D5,IF($E5=\"Distribution Rev.\",VLOOKUP(T$4,'4. Billing Determinants'!$B$19:$N$41,8,0)/'4. Billing Determinants'!$I$41*$D5, VLOOKUP(T$4,'4. Billing Determinants'!$B$19:$N$41,3,0)/'4. Billing Determinants'!$D$41*$D5)))))","v":0},{"$f":"IF(U$4=\"\",0,IF($E5=\"kWh\",VLOOKUP(U$4,'4. Billing Determinants'!$B$19:$N$41,4,0)/'4. Billing Determinants'!$E$41*$D5,IF($E5=\"kW\",VLOOKUP(U$4,'4. Billing Determinants'!$B$19:$N$41,5,0)/'4. Billing Determinants'!$F$41*$D5,IF($E5=\"Non-RPP kWh\",VLOOKUP(U$4,'4. Billing Determinants'!$B$19:$N$41,6,0)/'4. Billing Determinants'!$G$41*$D5,IF($E5=\"Distribution Rev.\",VLOOKUP(U$4,'4. Billing Determinants'!$B$19:$N$41,8,0)/'4. Billing Determinants'!$I$41*$D5, VLOOKUP(U$4,'4. Billing Determinants'!$B$19:$N$41,3,0)/'4. Billing Determinants'!$D$41*$D5)))))","v":0},{"$f":"IF(V$4=\"\",0,IF($E5=\"kWh\",VLOOKUP(V$4,'4. Billing Determinants'!$B$19:$N$41,4,0)/'4. Billing Determinants'!$E$41*$D5,IF($E5=\"kW\",VLOOKUP(V$4,'4. Billing Determinants'!$B$19:$N$41,5,0)/'4. Billing Determinants'!$F$41*$D5,IF($E5=\"Non-RPP kWh\",VLOOKUP(V$4,'4. Billing Determinants'!$B$19:$N$41,6,0)/'4. Billing Determinants'!$G$41*$D5,IF($E5=\"Distribution Rev.\",VLOOKUP(V$4,'4. Billing Determinants'!$B$19:$N$41,8,0)/'4. Billing Determinants'!$I$41*$D5, VLOOKUP(V$4,'4. Billing Determinants'!$B$19:$N$41,3,0)/'4. Billing Determinants'!$D$41*$D5)))))","v":0},{"$f":"IF(W$4=\"\",0,IF($E5=\"kWh\",VLOOKUP(W$4,'4. Billing Determinants'!$B$19:$N$41,4,0)/'4. Billing Determinants'!$E$41*$D5,IF($E5=\"kW\",VLOOKUP(W$4,'4. Billing Determinants'!$B$19:$N$41,5,0)/'4. Billing Determinants'!$F$41*$D5,IF($E5=\"Non-RPP kWh\",VLOOKUP(W$4,'4. Billing Determinants'!$B$19:$N$41,6,0)/'4. Billing Determinants'!$G$41*$D5,IF($E5=\"Distribution Rev.\",VLOOKUP(W$4,'4. Billing Determinants'!$B$19:$N$41,8,0)/'4. Billing Determinants'!$I$41*$D5, VLOOKUP(W$4,'4. Billing Determinants'!$B$19:$N$41,3,0)/'4. Billing Determinants'!$D$41*$D5)))))","v":0},{"$f":"IF(X$4=\"\",0,IF($E5=\"kWh\",VLOOKUP(X$4,'4. Billing Determinants'!$B$19:$N$41,4,0)/'4. Billing Determinants'!$E$41*$D5,IF($E5=\"kW\",VLOOKUP(X$4,'4. Billing Determinants'!$B$19:$N$41,5,0)/'4. Billing Determinants'!$F$41*$D5,IF($E5=\"Non-RPP kWh\",VLOOKUP(X$4,'4. Billing Determinants'!$B$19:$N$41,6,0)/'4. Billing Determinants'!$G$41*$D5,IF($E5=\"Distribution Rev.\",VLOOKUP(X$4,'4. Billing Determinants'!$B$19:$N$41,8,0)/'4. Billing Determinants'!$I$41*$D5, VLOOKUP(X$4,'4. Billing Determinants'!$B$19:$N$41,3,0)/'4. Billing Determinants'!$D$41*$D5)))))","v":0},{"$f":"IF(Y$4=\"\",0,IF($E5=\"kWh\",VLOOKUP(Y$4,'4. Billing Determinants'!$B$19:$N$41,4,0)/'4. Billing Determinants'!$E$41*$D5,IF($E5=\"kW\",VLOOKUP(Y$4,'4. Billing Determinants'!$B$19:$N$41,5,0)/'4. Billing Determinants'!$F$41*$D5,IF($E5=\"Non-RPP kWh\",VLOOKUP(Y$4,'4. Billing Determinants'!$B$19:$N$41,6,0)/'4. Billing Determinants'!$G$41*$D5,IF($E5=\"Distribution Rev.\",VLOOKUP(Y$4,'4. Billing Determinants'!$B$19:$N$41,8,0)/'4. Billing Determinants'!$I$41*$D5, VLOOKUP(Y$4,'4. Billing Determinants'!$B$19:$N$41,3,0)/'4. Billing Determinants'!$D$41*$D5)))))","v":0}]
[null,"RSVA - Wholesale Market Service Charge",1580,-6807357.7176949997,"kWh",-2451739.8372635967,-908655.79968515364,-3177415.3463778063,-12851.227092883264,-119588.38454188161,-60655.291954078239,-76451.830779600336,{"$f":"IF(M$4=\"\",0,IF($E6=\"kWh\",VLOOKUP(M$4,'4. Billing Determinants'!$B$19:$N$41,4,0)/'4. Billing Determinants'!$E$41*$D6,IF($E6=\"kW\",VLOOKUP(M$4,'4. Billing Determinants'!$B$19:$N$41,5,0)/'4. Billing Determinants'!$F$41*$D6,IF($E6=\"Non-RPP kWh\",VLOOKUP(M$4,'4. Billing Determinants'!$B$19:$N$41,6,0)/'4. Billing Determinants'!$G$41*$D6,IF($E6=\"Distribution Rev.\",VLOOKUP(M$4,'4. Billing Determinants'!$B$19:$N$41,8,0)/'4. Billing Determinants'!$I$41*$D6, VLOOKUP(M$4,'4. Billing Determinants'!$B$19:$N$41,3,0)/'4. Billing Determinants'!$D$41*$D6)))))","v":0},{"$f":"IF(N$4=\"\",0,IF($E6=\"kWh\",VLOOKUP(N$4,'4. Billing Determinants'!$B$19:$N$41,4,0)/'4. Billing Determinants'!$E$41*$D6,IF($E6=\"kW\",VLOOKUP(N$4,'4. Billing Determinants'!$B$19:$N$41,5,0)/'4. Billing Determinants'!$F$41*$D6,IF($E6=\"Non-RPP kWh\",VLOOKUP(N$4,'4. Billing Determinants'!$B$19:$N$41,6,0)/'4. Billing Determinants'!$G$41*$D6,IF($E6=\"Distribution Rev.\",VLOOKUP(N$4,'4. Billing Determinants'!$B$19:$N$41,8,0)/'4. Billing Determinants'!$I$41*$D6, VLOOKUP(N$4,'4. Billing Determinants'!$B$19:$N$41,3,0)/'4. Billing Determinants'!$D$41*$D6)))))","v":0},{"$f":"IF(O$4=\"\",0,IF($E6=\"kWh\",VLOOKUP(O$4,'4. Billing Determinants'!$B$19:$N$41,4,0)/'4. Billing Determinants'!$E$41*$D6,IF($E6=\"kW\",VLOOKUP(O$4,'4. Billing Determinants'!$B$19:$N$41,5,0)/'4. Billing Determinants'!$F$41*$D6,IF($E6=\"Non-RPP kWh\",VLOOKUP(O$4,'4. Billing Determinants'!$B$19:$N$41,6,0)/'4. Billing Determinants'!$G$41*$D6,IF($E6=\"Distribution Rev.\",VLOOKUP(O$4,'4. Billing Determinants'!$B$19:$N$41,8,0)/'4. Billing Determinants'!$I$41*$D6, VLOOKUP(O$4,'4. Billing Determinants'!$B$19:$N$41,3,0)/'4. Billing Determinants'!$D$41*$D6)))))","v":0},{"$f":"IF(P$4=\"\",0,IF($E6=\"kWh\",VLOOKUP(P$4,'4. Billing Determinants'!$B$19:$N$41,4,0)/'4. Billing Determinants'!$E$41*$D6,IF($E6=\"kW\",VLOOKUP(P$4,'4. Billing Determinants'!$B$19:$N$41,5,0)/'4. Billing Determinants'!$F$41*$D6,IF($E6=\"Non-RPP kWh\",VLOOKUP(P$4,'4. Billing Determinants'!$B$19:$N$41,6,0)/'4. Billing Determinants'!$G$41*$D6,IF($E6=\"Distribution Rev.\",VLOOKUP(P$4,'4. Billing Determinants'!$B$19:$N$41,8,0)/'4. Billing Determinants'!$I$41*$D6, VLOOKUP(P$4,'4. Billing Determinants'!$B$19:$N$41,3,0)/'4. Billing Determinants'!$D$41*$D6)))))","v":0},{"$f":"IF(Q$4=\"\",0,IF($E6=\"kWh\",VLOOKUP(Q$4,'4. Billing Determinants'!$B$19:$N$41,4,0)/'4. Billing Determinants'!$E$41*$D6,IF($E6=\"kW\",VLOOKUP(Q$4,'4. Billing Determinants'!$B$19:$N$41,5,0)/'4. Billing Determinants'!$F$41*$D6,IF($E6=\"Non-RPP kWh\",VLOOKUP(Q$4,'4. Billing Determinants'!$B$19:$N$41,6,0)/'4. Billing Determinants'!$G$41*$D6,IF($E6=\"Distribution Rev.\",VLOOKUP(Q$4,'4. Billing Determinants'!$B$19:$N$41,8,0)/'4. Billing Determinants'!$I$41*$D6, VLOOKUP(Q$4,'4. Billing Determinants'!$B$19:$N$41,3,0)/'4. Billing Determinants'!$D$41*$D6)))))","v":0},{"$f":"IF(R$4=\"\",0,IF($E6=\"kWh\",VLOOKUP(R$4,'4. Billing Determinants'!$B$19:$N$41,4,0)/'4. Billing Determinants'!$E$41*$D6,IF($E6=\"kW\",VLOOKUP(R$4,'4. Billing Determinants'!$B$19:$N$41,5,0)/'4. Billing Determinants'!$F$41*$D6,IF($E6=\"Non-RPP kWh\",VLOOKUP(R$4,'4. Billing Determinants'!$B$19:$N$41,6,0)/'4. Billing Determinants'!$G$41*$D6,IF($E6=\"Distribution Rev.\",VLOOKUP(R$4,'4. Billing Determinants'!$B$19:$N$41,8,0)/'4. Billing Determinants'!$I$41*$D6, VLOOKUP(R$4,'4. Billing Determinants'!$B$19:$N$41,3,0)/'4. Billing Determinants'!$D$41*$D6)))))","v":0},{"$f":"IF(S$4=\"\",0,IF($E6=\"kWh\",VLOOKUP(S$4,'4. Billing Determinants'!$B$19:$N$41,4,0)/'4. Billing Determinants'!$E$41*$D6,IF($E6=\"kW\",VLOOKUP(S$4,'4. Billing Determinants'!$B$19:$N$41,5,0)/'4. Billing Determinants'!$F$41*$D6,IF($E6=\"Non-RPP kWh\",VLOOKUP(S$4,'4. Billing Determinants'!$B$19:$N$41,6,0)/'4. Billing Determinants'!$G$41*$D6,IF($E6=\"Distribution Rev.\",VLOOKUP(S$4,'4. Billing Determinants'!$B$19:$N$41,8,0)/'4. Billing Determinants'!$I$41*$D6, VLOOKUP(S$4,'4. Billing Determinants'!$B$19:$N$41,3,0)/'4. Billing Determinants'!$D$41*$D6)))))","v":0},{"$f":"IF(T$4=\"\",0,IF($E6=\"kWh\",VLOOKUP(T$4,'4. Billing Determinants'!$B$19:$N$41,4,0)/'4. Billing Determinants'!$E$41*$D6,IF($E6=\"kW\",VLOOKUP(T$4,'4. Billing Determinants'!$B$19:$N$41,5,0)/'4. Billing Determinants'!$F$41*$D6,IF($E6=\"Non-RPP kWh\",VLOOKUP(T$4,'4. Billing Determinants'!$B$19:$N$41,6,0)/'4. Billing Determinants'!$G$41*$D6,IF($E6=\"Distribution Rev.\",VLOOKUP(T$4,'4. Billing Determinants'!$B$19:$N$41,8,0)/'4. Billing Determinants'!$I$41*$D6, VLOOKUP(T$4,'4. Billing Determinants'!$B$19:$N$41,3,0)/'4. Billing Determinants'!$D$41*$D6)))))","v":0},{"$f":"IF(U$4=\"\",0,IF($E6=\"kWh\",VLOOKUP(U$4,'4. Billing Determinants'!$B$19:$N$41,4,0)/'4. Billing Determinants'!$E$41*$D6,IF($E6=\"kW\",VLOOKUP(U$4,'4. Billing Determinants'!$B$19:$N$41,5,0)/'4. Billing Determinants'!$F$41*$D6,IF($E6=\"Non-RPP kWh\",VLOOKUP(U$4,'4. Billing Determinants'!$B$19:$N$41,6,0)/'4. Billing Determinants'!$G$41*$D6,IF($E6=\"Distribution Rev.\",VLOOKUP(U$4,'4. Billing Determinants'!$B$19:$N$41,8,0)/'4. Billing Determinants'!$I$41*$D6, VLOOKUP(U$4,'4. Billing Determinants'!$B$19:$N$41,3,0)/'4. Billing Determinants'!$D$41*$D6)))))","v":0},{"$f":"IF(V$4=\"\",0,IF($E6=\"kWh\",VLOOKUP(V$4,'4. Billing Determinants'!$B$19:$N$41,4,0)/'4. Billing Determinants'!$E$41*$D6,IF($E6=\"kW\",VLOOKUP(V$4,'4. Billing Determinants'!$B$19:$N$41,5,0)/'4. Billing Determinants'!$F$41*$D6,IF($E6=\"Non-RPP kWh\",VLOOKUP(V$4,'4. Billing Determinants'!$B$19:$N$41,6,0)/'4. Billing Determinants'!$G$41*$D6,IF($E6=\"Distribution Rev.\",VLOOKUP(V$4,'4. Billing Determinants'!$B$19:$N$41,8,0)/'4. Billing Determinants'!$I$41*$D6, VLOOKUP(V$4,'4. Billing Determinants'!$B$19:$N$41,3,0)/'4. Billing Determinants'!$D$41*$D6)))))","v":0},{"$f":"IF(W$4=\"\",0,IF($E6=\"kWh\",VLOOKUP(W$4,'4. Billing Determinants'!$B$19:$N$41,4,0)/'4. Billing Determinants'!$E$41*$D6,IF($E6=\"kW\",VLOOKUP(W$4,'4. Billing Determinants'!$B$19:$N$41,5,0)/'4. Billing Determinants'!$F$41*$D6,IF($E6=\"Non-RPP kWh\",VLOOKUP(W$4,'4. Billing Determinants'!$B$19:$N$41,6,0)/'4. Billing Determinants'!$G$41*$D6,IF($E6=\"Distribution Rev.\",VLOOKUP(W$4,'4. Billing Determinants'!$B$19:$N$41,8,0)/'4. Billing Determinants'!$I$41*$D6, VLOOKUP(W$4,'4. Billing Determinants'!$B$19:$N$41,3,0)/'4. Billing Determinants'!$D$41*$D6)))))","v":0},{"$f":"IF(X$4=\"\",0,IF($E6=\"kWh\",VLOOKUP(X$4,'4. Billing Determinants'!$B$19:$N$41,4,0)/'4. Billing Determinants'!$E$41*$D6,IF($E6=\"kW\",VLOOKUP(X$4,'4. Billing Determinants'!$B$19:$N$41,5,0)/'4. Billing Determinants'!$F$41*$D6,IF($E6=\"Non-RPP kWh\",VLOOKUP(X$4,'4. Billing Determinants'!$B$19:$N$41,6,0)/'4. Billing Determinants'!$G$41*$D6,IF($E6=\"Distribution Rev.\",VLOOKUP(X$4,'4. Billing Determinants'!$B$19:$N$41,8,0)/'4. Billing Determinants'!$I$41*$D6, VLOOKUP(X$4,'4. Billing Determinants'!$B$19:$N$41,3,0)/'4. Billing Determinants'!$D$41*$D6)))))","v":0},{"$f":"IF(Y$4=\"\",0,IF($E6=\"kWh\",VLOOKUP(Y$4,'4. Billing Determinants'!$B$19:$N$41,4,0)/'4. Billing Determinants'!$E$41*$D6,IF($E6=\"kW\",VLOOKUP(Y$4,'4. Billing Determinants'!$B$19:$N$41,5,0)/'4. Billing Determinants'!$F$41*$D6,IF($E6=\"Non-RPP kWh\",VLOOKUP(Y$4,'4. Billing Determinants'!$B$19:$N$41,6,0)/'4. Billing Determinants'!$G$41*$D6,IF($E6=\"Distribution Rev.\",VLOOKUP(Y$4,'4. Billing Determinants'!$B$19:$N$41,8,0)/'4. Billing Determinants'!$I$41*$D6, VLOOKUP(Y$4,'4. Billing Determinants'!$B$19:$N$41,3,0)/'4. Billing Determinants'!$D$41*$D6)))))","v":0}]
{"$rows_left_out":47}
{"sheet":"6. Rate Rider Calculations","index":5,"n_rows":67,"n_cols":7,"rows_kept":67,"cut":false,"hidden":false,"merged":[[44,1,45,1],[44,2,45,2],[17,3,18,3],[17,4,18,4],[17,5,18,5],[44,4,45,4],[44,5,45,5],[44,3,45,3],[17,1,18,1],[17,2,18,2]]}
[]
[]
[]
[]
[]
[]
{"$rows_left_out":61}