{"text_format":"1","workbook":"xlsx","n_sheets":22,"sheets":["1. Info","Table of Contents","A. Data Input Sheet","B. Tax Rates & Exemptions","C. Sch 8 Hist","D. Schedule 10 CEC Hist","E. Sch 13 Tax Reserves Hist","F. Sch 7-1 Loss Cfwd Hist","G. Adj. Taxable Income Historic","H. PILs,Tax Provision Historic","I. Schedule 8 CCA Bridge Year","J. Schedule 10 CEC Bridge Year","K. Sch 13 Tax Reserves Bridge","L. Sch 7-1 Loss Cfwd Bridge","M. Adj. Taxable Income Bridge","N. PILs,Tax Provision Bridge","O. Schedule 8 CCA Test Year  ","P. Schedule 10 CEC Test Year","Q Sch 13 Tax Reserve Test Year","R. Sch 7-1 Loss Cfwd","S. Taxable Income Test Year","T. PILs,Tax Provision "],"not_rendered":{"charts":0,"images":2,"macros":1,"external_links":2,"defined_names":47,"comments":3,"pivot_tables":0},"unopened":[],"bounds":{"document_bytes":16777216,"sheet_cells":100000,"rows_first":2000,"rows_last":500,"rows_between":2000,"halvings":0,"cell_chars":16384,"cell_head_chars":4096},"cells_cut":0,"cells_raw":0,"read":"whole","date_system":"1900"}

{"sheet":"1. Info","index":0,"n_rows":79,"n_cols":28,"rows_kept":79,"cut":false,"hidden":false,"merged":[[18,3,18,4],[1,2,1,9],[2,2,2,9],[3,2,3,9],[4,2,4,9],[14,3,14,4]]}
[null,null,null,null,null,null,null,null,null,null,null,null,null,null,null,null,null,null,null,null,null,null,null,null,null,null,null,"Algoma Power Inc."]
[null,null,null,null,null,null,null,null,null,null,null,null,null,null,null,null,null,null,null,null,null,null,null,null,null,null,null,"Atikokan Hydro Inc."]
[null,null,null,null,null,null,null,null,null,null,null,null,null,null,null,null,null,null,null,null,null,null,null,null,null,null,null,"Attawapiskat Power Corporation"]
[null,null,null,null,null,null,null,null,null,null,null,null,null,null,null,null,null,null,null,null,null,null,null,null,null,null,null,"Bluewater Power Distribution Corp."]
[null,null,null,null,null,null,null,null,null,null,null,null,null,null,null,null,null,null,null,null,null,null,null,null,null,null,null,"Brant County Power"]
[null,null,null,null,null,null,null,null,null,null,null,null,null,null,null,null,null,null,null,null,null,null,null,null,null,null,null,"Brantford Power Inc."]
[null,null,null,null,null,null,null,null,null,null,null,null,null,null,null,null,null,null,null,null,null,null,null,null,null,null,null,"Burlington Hydro Inc."]
[null,null,null,null,null,null,null,null,null,null,null,null,null,null,null,null,null,null,null,null,null,null,null,null,null,null,null,"Cambridge and North Dumfries Hydro"]
[null,null,null,null,null,null,null,null,null,null,null,null,null,null,null,null,null,null,null,null,null,null,null,null,null,null,null,"Canadian Niagara Power Inc. – Eastern Ontario Power/Fort Erie/Port Colborne"]
[null,null,null,null,null,null,null,null,null,null,null,null,null,null,null,null,null,null,null,null,null,null,null,null,null,null,null,"Centre Wellington Hydro Ltd."]
[null,null,null,null,null,null,null,null,null,null,null,null,null,null,null,null,null,null,null,null,null,null,null,null,null,null,null,"Chapleau Public Utilities Corporation"]
[null,null,null,null,null,null,null,null,null,null,null,null,null,null,null,null,null,null,null,null,null,null,null,null,null,null,null,"COLLUS Power Corp."]
[null,null,null,null,null,null,null,null,null,null,null,null,null,null,null,null,null,null,null,null,null,null,null,null,null,null,null,"Cooperative Hydro Embrun Inc."]
[null,null,null,null,null,null,null,null,null,null,null,null,null,null,null,null,null,null,null,null,null,null,null,null,null,null,null,"E.L.K. Energy Inc."]
[null,null,"Utility Name   ","Peterborough Distribution Inc.",null,null,null,null,null,null,null,null,null,null,null,null,null,null,null,null,null,null,null,null,null,null,null,"Enersource Hydro Mississauga Inc."]
{"$rows_left_out":65}
{"sheet":"Table of Contents","index":1,"n_rows":26,"n_cols":27,"rows_kept":26,"cut":false,"hidden":false,"merged":[[83,0,90,6],[0,2,0,4],[1,3,1,6],[3,3,3,4],[8,2,8,4]]}
[null,null,null,null,null,null,null,null,null,null,null,null,null,null,null,null,null,null,null,null,null,null,null,null,null,null,1]
[null,null,null,null,null,null,null,null,null,null,null,null,null,null,null,null,null,null,null,null,null,null,null,null,null,null,2012]
[null,null,null,null,null,null,null,null,null,null,null,null,null,null,null,null,null,null,null,null,null,null,null,null,null,null,2013]
[null,null,null,null,null,null,null,null,null,null,null,null,null,null,null,null,null,null,null,null,null,null,null,null,null,null,2014]
[null,null,null,null,null,null,null,null,null,null,null,null,null,null,null,null,null,null,null,null,null,null,null,null,null,null,2015]
[null,null,null,null,null,null,null,null,null,null,null,null,null,null,null,null,null,null,null,null,null,null,null,null,null,null,2016]
[]
[]
[]
[]
[]
[]
[]
[]
[]
{"$rows_left_out":12}
{"sheet":"A. Data Input Sheet","index":2,"n_rows":41,"n_cols":9,"rows_kept":41,"cut":false,"hidden":false,"merged":[[37,2,37,4],[40,2,40,4],[29,2,29,4],[31,2,31,4],[33,2,33,4],[35,2,35,4],[25,2,25,4],[27,2,27,4],[0,2,0,4],[1,2,1,8],[2,2,2,8],[3,2,3,8]]}
[]
[]
[]
[]
[]
[]
[]
[]
[null,null,"Rate Base",null,null,null,65485610]
[]
[null,null,"Return on Ratebase"]
[null,null,"Deemed ShortTerm Debt %",null,0.04,"T",{"$f":"G9*E12","v":2619424.4},"W = S * T"]
[null,null,"Deemed Long Term Debt %",null,0.56000000000000005,"U",{"$f":"G9*E13","v":36671941.600000001},"X = S * U"]
[null,null,"Deemed Equity %",null,0.4,"V",{"$f":"G9*E14","v":26194244},"Y = S * V"]
[]
{"$rows_left_out":27}
{"sheet":"B. Tax Rates & Exemptions","index":3,"n_rows":31,"n_cols":8,"rows_kept":31,"cut":false,"hidden":false,"merged":[[0,2,0,3],[1,2,1,3],[2,2,2,3],[3,2,3,3]]}
[]
[]
[]
[]
[]
[]
[]
[]
[null,null,"Tax Rates"]
[null,null,"Federal & Provincial",null,"Effective","Effective","Effective","Effective"]
[null,null,"As of June 20, 2012",null,"2011-01-01","2012-01-01","2013-01-01","2014-01-01"]
[]
[null,null,"Federal income tax"]
[null,null,"General corporate rate",null,0.38,0.38,0.38,0.38]
[null,null,"Federal tax abatement",null,-0.1,-0.1,-0.1,-0.1]
{"$rows_left_out":17}
{"sheet":"C. Sch 8 Hist","index":4,"n_rows":44,"n_cols":7,"rows_kept":44,"cut":false,"hidden":false,"merged":[[9,2,9,6],[0,2,0,4],[1,2,1,8],[2,2,2,8],[3,2,3,8]]}
[]
[]
[]
[]
[]
[null,null,"Schedule 8 - Historical Year"]
[]
[]
[]
[]
[null,null,"Class","Class Description","UCC End of Year Historic per tax returns","Less: Non-Distribution Portion","UCC Regulated Historic Year"]
[null,null,1,"Distribution System - post 1987",{"$f":"352162+1231244+13588974+11647252+6501167","v":33320799},null,{"$f":"+E12-F12","v":33320799}]
[null,null,"1 Enhanced","Non-residential Buildings Reg. 1100(1)(a.1) election ",null,null,{"$f":"+E13-F13","v":0}]
[null,null,2,"Distribution System - pre 1988",null,null,{"$f":"+E14-F14","v":0}]
[null,null,8,"General Office/Stores Equip",{"$f":"174174+24296","v":198470},null,198470]
{"$rows_left_out":30}
{"sheet":"D. Schedule 10 CEC Hist","index":5,"n_rows":40,"n_cols":11,"rows_kept":40,"cut":false,"hidden":false,"merged":[[0,2,0,4],[1,2,1,8],[2,2,2,8],[3,2,3,8],[17,8,18,8],[9,2,9,5],[11,2,11,5],[11,6,11,7],[13,2,13,5],[13,6,13,7],[17,9,18,9],[18,2,18,5],[19,2,19,5],[15,2,15,5],[15,6,15,7],[17,2,17,5],[17,6,18,7],[30,2,30,5],[30,6,30,7],[31,2,31,5],[32,6,32,7],[21,2,21,5],[21,6,21,7],[23,6,23,7],[27,2,27,5],[27,6,28,7],[28,2,28,5]]}
[]
[]
[]
[]
[]
[]
[]
[null,null,"Schedule 10 CEC - Historical Year"]
[]
[null,null,"Cumulative Eligible Capital"]
[null,null,"Additions"]
[null,null,"Cost of Eligible Capital Property Acquired during Test Year"]
[]
[null,null,"Other Adjustments",null,null,null,0]
[]
{"$rows_left_out":26}
{"sheet":"E. Sch 13 Tax Reserves Hist","index":6,"n_rows":51,"n_cols":6,"rows_kept":51,"cut":false,"hidden":false,"merged":[[15,2,15,5],[28,2,28,5],[0,2,0,4],[1,2,1,8],[2,2,2,8],[3,2,3,8]]}
[]
[]
[]
[]
[]
[]
[]
[null,null,"Schedule 13 Tax Reserves - Historical"]
[]
[null,null,"Continuity of Reserves"]
[]
[]
[null,null,"Description","Historical Balance as per tax returns","Non-Distribution Eliminations","Utility Only"]
[]
[null,null,"Capital Gains Reserves ss.40(1)",null,null,{"$f":"D15-E15","v":0}]
{"$rows_left_out":37}
{"sheet":"F. Sch 7-1 Loss Cfwd Hist","index":7,"n_rows":17,"n_cols":8,"rows_kept":17,"cut":false,"hidden":false,"merged":[[15,2,15,4],[16,2,16,4],[12,2,12,4],[13,2,13,4],[0,2,0,4],[1,2,1,8],[2,2,2,8],[3,2,3,8]]}
[]
[]
[]
[]
[]
[]
[]
[]
[null,null,"Schedule 7-1 Loss Carry Forward - Historic"]
[]
[null,null,"Corporation Loss Continuity and Application"]
[]
[null,null,"Non-Capital Loss Carry Forward Deduction",null,null,"Total","Non-Distribution Portion","Utility Balance"]
[null,null,"Actual Historic",null,null,null,null,{"$f":"F14-G14","v":0}]
[]
{"$rows_left_out":3}
{"sheet":"G. Adj. Taxable Income Historic","index":8,"n_rows":119,"n_cols":7,"rows_kept":119,"cut":false,"hidden":false,"merged":[[48,2,48,6],[111,2,111,6],[0,2,0,4],[1,2,1,8],[2,2,2,8],[3,2,3,8]]}
[]
[]
[]
[]
[]
[]
[]
[null,null,"Adjusted Taxable Income - Historic Year"]
[]
[]
[null,null,null,"T2S1 line #","Total for Legal Entity","Non-Distribution Eliminations   ","Historic \nWires Only"]
[null,null,"Income before PILs/Taxes","A",{"$f":"1830424+755386+120000","v":2705810},null,{"$f":"+E12-F12","v":2705810}]
[null,null,"Additions:"]
[null,null,"Interest and penalties on taxes",103,13606,null,{"$f":"+E14-F14","v":13606}]
[null,null,"Amortization of tangible assets",104,null,null,0]
{"$rows_left_out":105}
{"sheet":"H. PILs,Tax Provision Historic","index":9,"n_rows":34,"n_cols":10,"rows_kept":34,"cut":false,"hidden":false,"merged":[[42,2,42,5],[0,2,0,6],[1,2,1,11],[2,2,2,11],[3,2,3,11],[38,2,38,5],[7,2,7,5]]}
[]
[]
[]
[]
[]
[null,null,"PILs Tax Provision - Historic Year"]
[]
[null,null,"Note: Input the actual information from the tax returns for the historic year. ",null,null,null,null,null,"Wires Only"]
[]
[null,null,"Regulatory Taxable Income",null,null,null,null,null,{"$f":"'G. Adj. Taxable Income Historic'!G119","v":2651872},"A"]
[]
[null,null,"Ontario Income Taxes"]
[null,null,"Income tax payable","Ontario Income Tax",{"$f":"+G13/I10","v":0.11747927501779874},"B",311540,"C = A * B"]
[]
[null,null,"Small business credit","Ontario Small Business Threshold",{"$f":"'B. Tax Rates & Exemptions'!E27","v":500000},"D"]
{"$rows_left_out":20}
{"sheet":"I. Schedule 8 CCA Bridge Year","index":10,"n_rows":42,"n_cols":13,"rows_kept":42,"cut":false,"hidden":false,"merged":[[0,2,0,4],[1,2,1,8],[2,2,2,8],[3,2,3,8]]}
[]
[]
[]
[]
[]
[]
[null,null,"Schedule 8 CCA - Bridge Year"]
[]
[null,null,"Class","Class Description","UCC Regulated Historic Year","Additions","Disposals (Negative)","UCC Before 1/2 Yr Adjustment","1/2 Year Rule {1/2 Additions Less Disposals}","Reduced UCC","Rate %","Bridge Year CCA","UCC End of Bridge Year"]
[null,null,{"$f":"IF(ISBLANK('C. Sch 8 Hist'!C12), \"\", 'C. Sch 8 Hist'!C12)","v":1},{"$f":"IF(ISBLANK('C. Sch 8 Hist'!D12), \"\", 'C. Sch 8 Hist'!D12)","v":"Distribution System - post 1987"},{"$f":"IF(ISBLANK('C. Sch 8 Hist'!E12), \"\", 'C. Sch 8 Hist'!G12)","v":33320799},91270,null,{"$f":"MAX((SUM(E10:G10)),0)","v":33412069},{"$f":"IF((F10+G10)<=0, 0,(F10+G10)*0.5)","v":45635},{"$f":"+H10-I10","v":33366434},0.04,{"$f":"IF(+J10<0,+J10,+J10*K10)","v":1334657.3600000001},{"$f":"MAX(0,+H10-L10)","v":32077411.640000001}]
[null,null,{"$f":"IF(ISBLANK('C. Sch 8 Hist'!C13), \"\", 'C. Sch 8 Hist'!C13)","v":"1 Enhanced"},{"$f":"IF(ISBLANK('C. Sch 8 Hist'!D13), \"\", 'C. Sch 8 Hist'!D13)","v":"Non-residential Buildings Reg. 1100(1)(a.1) election "},{"$f":"IF(ISBLANK('C. Sch 8 Hist'!E13), \"\", 'C. Sch 8 Hist'!G13)","v":""},null,null,{"$f":"MAX((SUM(E11:G11)),0)","v":0},{"$f":"IF((F11+G11)<=0, 0,(F11+G11)*0.5)","v":0},{"$f":"+H11-I11","v":0},0.06,0,0]
[null,null,{"$f":"IF(ISBLANK('C. Sch 8 Hist'!C14), \"\", 'C. Sch 8 Hist'!C14)","v":2},{"$f":"IF(ISBLANK('C. Sch 8 Hist'!D14), \"\", 'C. Sch 8 Hist'!D14)","v":"Distribution System - pre 1988"},{"$f":"IF(ISBLANK('C. Sch 8 Hist'!E14), \"\", 'C. Sch 8 Hist'!G14)","v":""},null,null,0,0,0,0.06,0,0]
[null,null,{"$f":"IF(ISBLANK('C. Sch 8 Hist'!C15), \"\", 'C. Sch 8 Hist'!C15)","v":8},{"$f":"IF(ISBLANK('C. Sch 8 Hist'!D15), \"\", 'C. Sch 8 Hist'!D15)","v":"General Office/Stores Equip"},{"$f":"IF(ISBLANK('C. Sch 8 Hist'!E15), \"\", 'C. Sch 8 Hist'!G15)","v":198470},null,null,198470,0,198470,0.2,39694,158776]
[null,null,{"$f":"IF(ISBLANK('C. Sch 8 Hist'!C16), \"\", 'C. Sch 8 Hist'!C16)","v":10},{"$f":"IF(ISBLANK('C. Sch 8 Hist'!D16), \"\", 'C. Sch 8 Hist'!D16)","v":"Computer Hardware/  Vehicles"},{"$f":"IF(ISBLANK('C. Sch 8 Hist'!E16), \"\", 'C. Sch 8 Hist'!G16)","v":""},null,null,0,0,0,0.3,0,0]
[null,null,{"$f":"IF(ISBLANK('C. Sch 8 Hist'!C17), \"\", 'C. Sch 8 Hist'!C17)","v":10.1},{"$f":"IF(ISBLANK('C. Sch 8 Hist'!D17), \"\", 'C. Sch 8 Hist'!D17)","v":"Certain Automobiles"},{"$f":"IF(ISBLANK('C. Sch 8 Hist'!E17), \"\", 'C. Sch 8 Hist'!G17)","v":""},null,null,0,0,0,0.3,0,0]
{"$rows_left_out":28}
{"sheet":"J. Schedule 10 CEC Bridge Year","index":11,"n_rows":40,"n_cols":11,"rows_kept":40,"cut":false,"hidden":false,"merged":[[31,2,31,5],[32,6,32,7],[23,6,23,7],[27,2,27,5],[27,6,28,7],[28,2,28,5],[30,2,30,5],[30,6,30,7],[17,8,18,8],[17,9,18,9],[18,2,18,5],[19,2,19,5],[21,2,21,5],[21,6,21,7],[13,2,13,5],[13,6,13,7],[15,2,15,5],[15,6,15,7],[17,2,17,5],[17,6,18,7],[11,2,11,5],[11,6,11,7],[0,2,0,4],[1,2,1,8],[2,2,2,8],[3,2,3,8],[9,2,9,5]]}
[]
[]
[]
[]
[]
[null,null,"Schedule 10 CEC - Bridge Year"]
[]
[]
[]
[null,null,"Cumulative Eligible Capital",null,null,null,null,null,null,null,{"$f":"'D. Schedule 10 CEC Hist'!K40","v":0}]
[null,null,"Additions"]
[null,null,"Cost of Eligible Capital Property Acquired during Test Year"]
[]
[null,null,"Other Adjustments",null,null,null,0]
[]
{"$rows_left_out":26}
{"sheet":"K. Sch 13 Tax Reserves Bridge","index":12,"n_rows":44,"n_cols":11,"rows_kept":44,"cut":false,"hidden":false,"merged":[[9,6,9,7],[1,2,1,8],[2,2,2,8],[3,2,3,8]]}
[]
[]
[]
[]
[]
[]
[null,null,"Schedule 13 Tax Reserves - Bridge Year"]
[]
[null,null,"Continuity of Reserves"]
[null,null,null,null,null,null,"Bridge Year Adjustments"]
[null,null,"Description","Historic Utility Only","Eliminate Amounts Not Relevant for Bridge Year","Adjusted Utility Balance","Additions","Disposals"," Balance for Bridge Year","Change During the Year","Disallowed Expenses"]
[]
[null,null,"Capital Gains Reserves ss.40(1)",{"$f":"'E. Sch 13 Tax Reserves Hist'!F15","v":0},null,{"$f":"SUM(D13:E13)","v":0},null,null,{"$f":"F13+G13-H13","v":0},{"$f":"+I13-F13","v":0}]
[null,null,"Tax Reserves Not Deducted for accounting purposes"]
[null,null,"Reserve for doubtful accounts ss. 20(1)(l)",{"$f":"'E. Sch 13 Tax Reserves Hist'!F17","v":0},null,{"$f":"SUM(D15:E15)","v":0},null,null,{"$f":"F15+G15-H15","v":0},{"$f":"+I15-F15","v":0}]
{"$rows_left_out":30}
{"sheet":"L. Sch 7-1 Loss Cfwd Bridge","index":13,"n_rows":25,"n_cols":6,"rows_kept":25,"cut":false,"hidden":false,"merged":[[21,2,21,4],[19,2,19,4],[0,2,0,4],[12,2,12,4],[13,2,13,4],[18,2,18,4],[10,2,10,4],[11,2,11,4],[1,2,1,8],[2,2,2,8],[3,2,3,8],[20,2,20,4]]}
[]
[]
[]
[]
[]
[]
[null,null,"Corporation Loss Continuity and Application"]
[]
[null,null,"Schedule 7-1 Loss Carry Forward - Bridge Year"]
[]
[null,null,"Non-Capital Loss Carry Forward Deduction",null,null,"Total"]
[null,null,"Actual Historic",null,null,{"$f":"'F. Sch 7-1 Loss Cfwd Hist'!H14","v":0}]
[null,null,"Application of  Loss Carry Forward to reduce taxable income in Bridge Year"]
[null,null,"Other Adjustments Add (+) Deduct (-)"]
[null,null,"Balance available for use in Test Year",null,null,{"$f":"F12-F13+F14","v":0}]
{"$rows_left_out":11}
{"sheet":"M. Adj. Taxable Income Bridge","index":14,"n_rows":114,"n_cols":5,"rows_kept":114,"cut":false,"hidden":false,"merged":[[68,2,68,4],[45,2,45,4],[112,2,112,4],[8,2,8,4],[0,2,0,4],[1,2,1,8],[2,2,2,8],[3,2,3,8],[9,2,9,4]]}
[]
[]
[]
[]
[null,"Adjusted Taxable Income - Bridge Year"]
[]
[null,null,null,"T2S1 line #","Total for Regulated Utility"]
[null,null,"Income before PILs/Taxes","A",1651014]
[]
[null,null,"Additions:"]
[null,null,"Interest and penalties on taxes",103,6584]
[null,null,"Amortization of tangible assets",104,4142848]
[null,null,"Amortization of intangible assets",106]
[null,null,"Recapture of capital cost allowance from Schedule 8",107]
[null,null,"Gain on sale of eligible capital property from Schedule 10",108]
{"$rows_left_out":100}
{"sheet":"N. PILs,Tax Provision Bridge","index":15,"n_rows":39,"n_cols":10,"rows_kept":39,"cut":false,"hidden":false,"merged":[[42,2,42,5],[0,2,0,6],[1,2,1,11],[2,2,2,11],[3,2,3,11],[38,2,38,5]]}
[]
[]
[]
[]
[]
[null,"PILS Tax Provision - Bridge Year"]
[]
[null,null,null,null,null,null,null,null,"Wires Only"]
[]
[null,null,"Regulatory Taxable Income",null,null,null,null,null,{"$f":"'M. Adj. Taxable Income Bridge'!E114","v":1668257.8399999999},"A"]
[]
[null,null,"Ontario Income Taxes"]
[null,null,"Income tax payable","Ontario Income Tax",{"$f":"IF(I10<=500000,'B. Tax Rates & Exemptions'!F31,'B. Tax Rates & Exemptions'!F21)","v":0.115},"B",{"$f":"IF(I10>0,I10*E13,0)","v":191849.65159999998},"C = A * B"]
[]
[null,null,"Small business credit","Ontario Small Business Threshold",{"$f":"IF(I10>'B. Tax Rates & Exemptions'!F27,'B. Tax Rates & Exemptions'!F27,0)","v":500000},"D"]
{"$rows_left_out":25}
{"sheet":"O. Schedule 8 CCA Test Year  ","index":16,"n_rows":43,"n_cols":13,"rows_kept":43,"cut":false,"hidden":false,"merged":[[0,2,0,4],[1,2,1,8],[2,2,2,8],[3,2,3,8]]}
[]
[]
[]
[]
[]
[]
[null,"Schedule 8 CCA - Test Year"]
[]
[]
[null,null,"Class","Class Description","UCC Test Year Opening Balance","Additions","Disposals  (Negative)","UCC Before 1/2 Yr Adjustment","1/2 Year Rule {1/2 Additions Less Disposals}","Reduced UCC","Rate %","Test Year CCA","UCC End of Test Year"]
[null,null,{"$f":"IF(ISBLANK('I. Schedule 8 CCA Bridge Year'!C10), \"\", 'I. Schedule 8 CCA Bridge Year'!C10)","v":1},{"$f":"IF(ISBLANK('I. Schedule 8 CCA Bridge Year'!D10), \"\", 'I. Schedule 8 CCA Bridge Year'!D10)","v":"Distribution System - post 1987"},{"$f":"IF(ISBLANK('I. Schedule 8 CCA Bridge Year'!M10), \"\", 'I. Schedule 8 CCA Bridge Year'!M10)","v":32077411.640000001},35000,null,{"$f":"MAX((SUM(E11:G11)),0)","v":32112411.640000001},{"$f":"IF((F11+G11)<=0, 0,(F11+G11)*0.5)","v":17500},{"$f":"+H11-I11","v":32094911.640000001},{"$f":"'I. Schedule 8 CCA Bridge Year'!K10","v":0.04},{"$f":"IF(+J11<0,+J11,+J11*K11)","v":1283796.4656},{"$f":"MAX(0,+H11-L11)","v":30828615.174400002}]
[null,null,{"$f":"IF(ISBLANK('I. Schedule 8 CCA Bridge Year'!C11), \"\", 'I. Schedule 8 CCA Bridge Year'!C11)","v":"1 Enhanced"},{"$f":"IF(ISBLANK('I. Schedule 8 CCA Bridge Year'!D11), \"\", 'I. Schedule 8 CCA Bridge Year'!D11)","v":"Non-residential Buildings Reg. 1100(1)(a.1) election "},{"$f":"IF(ISBLANK('I. Schedule 8 CCA Bridge Year'!M11), \"\", 'I. Schedule 8 CCA Bridge Year'!M11)","v":0},null,null,0,{"$f":"IF((F12+G12)<=0, 0,(F12+G12)*0.5)","v":0},0,{"$f":"'I. Schedule 8 CCA Bridge Year'!K11","v":0.06},0,0]
[null,null,{"$f":"IF(ISBLANK('I. Schedule 8 CCA Bridge Year'!C12), \"\", 'I. Schedule 8 CCA Bridge Year'!C12)","v":2},{"$f":"IF(ISBLANK('I. Schedule 8 CCA Bridge Year'!D12), \"\", 'I. Schedule 8 CCA Bridge Year'!D12)","v":"Distribution System - pre 1988"},{"$f":"IF(ISBLANK('I. Schedule 8 CCA Bridge Year'!M12), \"\", 'I. Schedule 8 CCA Bridge Year'!M12)","v":0},null,null,0,0,0,{"$f":"'I. Schedule 8 CCA Bridge Year'!K12","v":0.06},0,0]
[null,null,{"$f":"IF(ISBLANK('I. Schedule 8 CCA Bridge Year'!C13), \"\", 'I. Schedule 8 CCA Bridge Year'!C13)","v":8},{"$f":"IF(ISBLANK('I. Schedule 8 CCA Bridge Year'!D13), \"\", 'I. Schedule 8 CCA Bridge Year'!D13)","v":"General Office/Stores Equip"},{"$f":"IF(ISBLANK('I. Schedule 8 CCA Bridge Year'!M13), \"\", 'I. Schedule 8 CCA Bridge Year'!M13)","v":158776},null,null,158776,0,158776,{"$f":"'I. Schedule 8 CCA Bridge Year'!K13","v":0.2},31755.200000000001,127020.8]
[null,null,{"$f":"IF(ISBLANK('I. Schedule 8 CCA Bridge Year'!C14), \"\", 'I. Schedule 8 CCA Bridge Year'!C14)","v":10},{"$f":"IF(ISBLANK('I. Schedule 8 CCA Bridge Year'!D14), \"\", 'I. Schedule 8 CCA Bridge Year'!D14)","v":"Computer Hardware/  Vehicles"},{"$f":"IF(ISBLANK('I. Schedule 8 CCA Bridge Year'!M14), \"\", 'I. Schedule 8 CCA Bridge Year'!M14)","v":0},null,null,0,0,0,{"$f":"'I. Schedule 8 CCA Bridge Year'!K14","v":0.3},0,0]
{"$rows_left_out":29}
{"sheet":"P. Schedule 10 CEC Test Year","index":17,"n_rows":39,"n_cols":11,"rows_kept":39,"cut":false,"hidden":false,"merged":[[0,2,0,4],[1,2,1,8],[2,2,2,8],[3,2,3,8],[15,8,16,8],[6,2,6,5],[9,2,9,5],[9,6,9,7],[11,2,11,5],[11,6,11,7],[15,9,16,9],[16,2,16,5],[17,2,17,5],[13,2,13,5],[13,6,13,7],[15,2,15,5],[15,6,16,7],[28,2,28,5],[28,6,28,7],[29,2,29,5],[30,6,30,7],[19,2,19,5],[19,6,19,7],[21,6,21,7],[25,2,25,5],[25,6,26,7],[26,2,26,5]]}
[]
[]
[]
[]
[null,null,"Schedule 10 CEC - Test Year"]
[]
[null,null,"Cumulative Eligible Capital",null,null,null,null,null,null,null,{"$f":"'J. Schedule 10 CEC Bridge Year'!K40","v":0}]
[]
[null,null,"Additions"]
[null,null,"Cost of Eligible Capital Property Acquired during Test Year",null,null,null,0]
[]
[null,null,"Other Adjustments",null,null,null,0]
[]
[null,null,"Subtotal",null,null,null,{"$f":"SUM(G10,G12)","v":0},null,"x 3/4 =",{"$f":"3/4*G14","v":0}]
[]
{"$rows_left_out":25}
{"sheet":"Q Sch 13 Tax Reserve Test Year","index":18,"n_rows":44,"n_cols":11,"rows_kept":44,"cut":false,"hidden":false,"merged":[[9,6,9,7],[1,2,1,8],[2,2,2,8],[3,2,3,8]]}
[]
[]
[]
[]
[]
[]
[null,null,"Schedule 13 Tax Reserves - Test Year"]
[]
[null,null,"Continuity of Reserves"]
[null,null,null,null,null,null,"Test Year Adjustments"]
[null,null,"Description","Bridge Year","Eliminate Amounts Not Relevant for Bridge Year","Adjusted Utility Balance","Additions","Disposals"," Balance for Test Year","Change During the Year","Disallowed Expenses"]
[]
[null,null,"Capital Gains Reserves ss.40(1)",{"$f":"'K. Sch 13 Tax Reserves Bridge'!I13","v":0},null,{"$f":"SUM(D13:E13)","v":0},null,null,{"$f":"F13+G13-H13","v":0},{"$f":"+I13-F13","v":0}]
[null,null,"Tax Reserves Not Deducted for accounting purposes"]
[null,null,"Reserve for doubtful accounts ss. 20(1)(l)",{"$f":"'K. Sch 13 Tax Reserves Bridge'!I15","v":0},null,{"$f":"SUM(D15:E15)","v":0},null,null,{"$f":"F15+G15-H15","v":0},{"$f":"+I15-F15","v":0}]
{"$rows_left_out":30}
{"sheet":"R. Sch 7-1 Loss Cfwd","index":19,"n_rows":25,"n_cols":8,"rows_kept":25,"cut":false,"hidden":false,"merged":[[20,2,20,4],[21,2,21,4],[12,2,12,4],[13,2,13,4],[18,2,18,4],[19,2,19,4],[11,2,11,4],[0,2,0,4],[1,2,1,8],[2,2,2,8],[3,2,3,8],[10,2,10,4]]}
[]
[]
[]
[]
[]
[]
[null,null,"Schedule 7-1 Loss Carry Forward - Test Year"]
[]
[null,null,"Corporation Loss Continuity and Application"]
[]
[null,null,"Non-Capital Loss Carry Forward Deduction",null,null,"Total","Non-Distribution Portion","Utility Balance"]
[null,null,"Actual/Estimated Bridge Year",null,null,null,null,{"$f":"F12-G12","v":0}]
[null,null,"Application of  Loss Carry Forward to reduce taxable income in 2005",null,null,null,null,{"$f":"F13-G13","v":0}]
[null,null,"Other Adjustments Add (+) Deduct (-)",null,null,null,null,{"$f":"F14-G14","v":0}]
[null,null,"Balance available for use in Test Year",null,null,{"$f":"F12-F13+F14","v":0},{"$f":"G12-G13+G14","v":0},{"$f":"H12-H13+H14","v":0}]
{"$rows_left_out":11}
{"sheet":"S. Taxable Income Test Year","index":20,"n_rows":124,"n_cols":5,"rows_kept":124,"cut":false,"hidden":false,"merged":[[0,2,0,4],[1,2,1,8],[2,2,2,8],[3,2,3,8]]}
[]
[]
[]
[]
[]
[]
[]
[]
[]
[null,null,"Taxable Income - Test Year"]
[null,null,null,null,"Test Year                         Taxable Income"]
[null,null,"Net Income Before Taxes",null,{"$f":"'A. Data Input Sheet'!G18","v":2352243.1112000002}]
[]
[null,null,null,"T2 S1 line #"]
[null,null,"Additions:"]
{"$rows_left_out":110}
{"sheet":"T. PILs,Tax Provision ","index":21,"n_rows":43,"n_cols":10,"rows_kept":43,"cut":false,"hidden":false,"merged":[[42,2,42,5],[0,2,0,6],[1,2,1,11],[2,2,2,11],[3,2,3,11]]}
[]
[]
[]
[]
[]
[null,"PILs Tax Provision - Test Year"]
[]
[null,null,null,null,null,null,null,null,"Wires Only"]
[]
[null,null,"Regulatory Taxable Income",null,null,null,null,null,{"$f":"'S. Taxable Income Test Year'!E124","v":903029.02960000001},"A"]
[]
[null,null,"Ontario Income Taxes"]
[null,null,"Income tax payable","Ontario Income Tax",{"$f":"IF(I10<=500000,'B. Tax Rates & Exemptions'!G31,'B. Tax Rates & Exemptions'!G21)","v":0.115},"B",{"$f":"IF(I10>0,I10*E13,0)","v":103848.33840400001},"C = A * B"]
[]
[null,null,"Small business credit","Ontario Small Business Threshold",{"$f":"IF(I10>'B. Tax Rates & Exemptions'!G27,'B. Tax Rates & Exemptions'!G27,0)","v":500000},"D"]
{"$rows_left_out":28}