{"text_format":"1","workbook":"xlsx","n_sheets":14,"sheets":["1. Info","2. Table of Contents","3. Rate Classes","4. RRR Data","5. UTRs and Sub-Transmission","6. Historical Wholesale","7. Current Wholesale","8. Forecast Wholesale","9. Adj Network to Current WS","10. Adj Conn. to Current WS","11. Adj Network to Forecast WS","12. Adj Conn. to Forecast WS","13. Final 2014 RTS Rates","hidden1"],"not_rendered":{"charts":0,"images":4,"macros":1,"external_links":2,"defined_names":13,"comments":0,"pivot_tables":0},"unopened":[],"bounds":{"document_bytes":16777216,"sheet_cells":100000,"rows_first":2000,"rows_last":500,"rows_between":2000,"halvings":0,"cell_chars":16384,"cell_head_chars":4096},"cells_cut":0,"cells_raw":0,"read":"whole","date_system":"1900"}

{"sheet":"1. Info","index":0,"n_rows":77,"n_cols":28,"rows_kept":77,"cut":false,"hidden":false,"merged":[[24,3,24,4],[20,3,20,4],[1,2,1,9],[2,2,2,9],[3,2,3,9],[4,2,4,9],[14,3,14,4],[16,3,16,4]]}
[null,null,null,null,null,null,null,null,null,null,null,null,null,null,null,null,null,null,null,null,null,null,null,null,null,null,null,"Algoma Power Inc."]
[null,null,null,null,null,null,null,null,null,null,null,null,null,null,null,null,null,null,null,null,null,null,null,null,null,null,null,"Atikokan Hydro Inc."]
[null,null,null,null,null,null,null,null,null,null,null,null,null,null,null,null,null,null,null,null,null,null,null,null,null,null,null,"Attawapiskat Power Corporation"]
[null,null,null,null,null,null,null,null,null,null,null,null,null,null,null,null,null,null,null,null,null,null,null,null,null,null,null,"Bluewater Power Distribution Corp."]
[null,null,null,null,null,null,null,null,null,null,null,null,null,null,null,null,null,null,null,null,null,null,null,null,null,null,null,"Brant County Power"]
[null,null,null,null,null,null,null,null,null,null,null,null,null,null,null,null,null,null,null,null,null,null,null,null,null,null,null,"Brantford Power Inc."]
[null,null,null,null,null,null,null,null,null,null,null,null,null,null,null,null,null,null,null,null,null,null,null,null,null,null,null,"Burlington Hydro Inc."]
[null,null,null,null,null,null,null,null,null,null,null,null,null,null,null,null,null,null,null,null,null,null,null,null,null,null,null,"Cambridge and North Dumfries Hydro"]
[null,null,null,null,null,null,null,null,null,null,null,null,null,null,null,null,null,null,null,null,null,null,null,null,null,null,null,"Canadian Niagara Power Inc. – Eastern Ontario Power/Fort Erie/Port Colborne"]
[null,null,null,null,null,null,null,null,null,null,null,null,null,null,null,null,null,null,null,null,null,null,null,null,null,null,null,"Centre Wellington Hydro Ltd."]
[null,null,null,null,null,null,null,null,null,null,null,null,null,null,null,null,null,null,null,null,null,null,null,null,null,null,null,"Chapleau Public Utilities Corporation"]
[null,null,null,null,null,null,null,null,null,null,null,null,null,null,null,null,null,null,null,null,null,null,null,null,null,null,null,"COLLUS Power Corp."]
[null,null,null,null,null,null,null,null,null,null,null,null,null,null,null,null,null,null,null,null,null,null,null,null,null,null,null,"Cooperative Hydro Embrun Inc."]
[null,null,null,null,null,null,null,null,null,null,null,null,null,null,null,null,null,null,null,null,null,null,null,null,null,null,null,"E.L.K. Energy Inc."]
[null,null,"Utility Name   ","PowerStream Inc.",null,null,null,null,null,null,null,null,null,null,null,null,null,null,null,null,null,null,null,null,null,null,null,"Enersource Hydro Mississauga Inc."]
[null,null,null,null,null,null,null,null,null,null,null,null,null,null,null,null,null,null,null,null,null,null,null,null,null,null,null,"Entegrus Powerlines Inc."]
[null,null,"Service Territory","York Region and Simcoe County",null,null,null,null,null,null,null,null,null,null,null,null,null,null,null,null,null,null,null,null,null,null,null,"ENWIN Utilities Ltd."]
[null,null,null,null,null,null,null,null,null,null,null,null,null,null,null,null,null,null,null,null,null,null,null,null,null,null,null,"Erie Thames Powerlines Corp."]
[null,null,"Assigned EB Number","ED-2004-0420",null,null,null,null,null,null,null,null,null,null,null,null,null,null,null,null,null,null,null,null,null,null,null,"Espanola Regional Hydro Distribution Corporation"]
[null,null,null,null,null,null,null,null,null,null,null,null,null,null,null,null,null,null,null,null,null,null,null,null,null,null,null,"Essex Powerlines Corporation"]
{"$rows_left_out":58}
{"sheet":"2. Table of Contents","index":1,"n_rows":32,"n_cols":9,"rows_kept":32,"cut":false,"hidden":false,"merged":[]}
[]
[]
[]
[]
[]
[]
[]
[]
[]
[]
[]
[]
[]
[]
[]
[]
[]
[]
[]
[null,null,null,"1. Info",null,null,null,null,"7. Current Wholesale"]
{"$rows_left_out":13}
{"sheet":"3. Rate Classes","index":2,"n_rows":115,"n_cols":28,"rows_kept":115,"cut":false,"hidden":false,"merged":[[12,2,12,13],[47,2,47,5],[43,2,43,5],[44,2,44,5],[45,2,45,5],[46,2,46,5],[42,2,42,5],[37,2,37,5],[38,9,38,10],[39,9,39,10],[44,12,44,13],[38,2,38,5],[40,12,40,13],[43,9,43,10],[29,2,29,5],[30,2,30,5],[44,9,44,10],[39,2,39,5],[40,2,40,5],[41,2,41,5],[40,9,40,10],[41,9,41,10],[42,9,42,10],[36,2,36,5],[23,2,23,5],[24,2,24,5],[25,2,25,5],[26,2,26,5],[27,2,27,5],[28,2,28,5],[34,12,34,13],[35,12,35,13],[31,2,31,5],[32,2,32,5],[33,2,33,5],[34,2,34,5],[35,2,35,5],[31,9,31,10],[32,9,32,10],[33,9,33,10],[31,12,31,13],[32,12,32,13],[33,12,33,13],[37,9,37,10],[23,9,23,10],[24,9,24,10],[25,9,25,10],[26,9,26,10],[27,9,27,10],[28,9,28,10],[29,9,29,10],[30,9,30,10],[34,9,34,10],[35,9,35,10],[36,9,36,10],[27,12,27,13],[28,12,28,13],[29,12,29,13],[30,12,30,13],[23,12,23,13],[24,12,24,13],[25,12,25,13],[26,12,26,13],[41,12,41,13],[42,12,42,13],[43,12,43,13],[36,12,36,13],[37,12,37,13],[38,12,38,13],[39,12,39,13]]}
[]
[]
[]
[]
[]
[]
[]
[]
[]
[]
[]
[]
[null,null,"1.  Select the appropriate rate classes that appear on your most recent Board-Approved Tariff of Rates and Charges.\n2.  Enter the RTS Network and Connection Rate as it appears on the Tariff of Rates and Charges"]
[]
[]
[]
[]
[]
[]
[]
{"$rows_left_out":96}
{"sheet":"4. RRR Data","index":3,"n_rows":48,"n_cols":13,"rows_kept":48,"cut":false,"hidden":false,"merged":[[20,9,20,10],[23,9,23,10],[12,1,12,11],[38,9,38,10],[39,9,39,10],[32,9,32,10],[33,9,33,10],[34,9,34,10],[35,9,35,10],[36,9,36,10],[37,9,37,10],[32,7,32,8],[33,7,33,8],[34,7,34,8],[35,7,35,8],[36,7,36,8],[40,9,40,10],[41,9,41,10],[46,9,46,10],[47,9,47,10],[42,9,42,10],[43,9,43,10],[44,9,44,10],[45,9,45,10],[44,7,44,8],[45,7,45,8],[46,7,46,8],[47,7,47,8],[26,9,26,10],[27,9,27,10],[28,9,28,10],[29,9,29,10],[30,9,30,10],[31,9,31,10],[38,7,38,8],[39,7,39,8],[40,7,40,8],[41,7,41,8],[42,7,42,8],[43,7,43,8],[37,7,37,8],[26,7,26,8],[27,7,27,8],[28,7,28,8],[29,7,29,8],[30,7,30,8],[31,7,31,8]]}
[]
[]
[]
[]
[]
[]
[]
[]
[]
[]
[]
[]
[null,"In the green shaded cells, enter the most recent reported RRR billing determinants.  Please ensure that billing determinants are non-loss adjusted."]
[]
[]
[]
[]
[]
[]
[]
{"$rows_left_out":29}
{"sheet":"5. UTRs and Sub-Transmission","index":4,"n_rows":95,"n_cols":9,"rows_kept":95,"cut":false,"hidden":false,"merged":[]}
[]
[]
[]
[]
[]
[]
[]
[]
[]
[]
[]
[]
[]
[]
[]
[]
[]
[null,"Uniform Transmission Rates","Unit",null,"Effective January 1, 2012",null,"Effective January 1, 2013",null,"Effective January 1, 2014"]
[]
[null,"Rate Description",null,null,"Rate",null,"Rate",null,"Rate"]
{"$rows_left_out":76}
{"sheet":"6. Historical Wholesale","index":5,"n_rows":117,"n_cols":16,"rows_kept":117,"cut":false,"hidden":false,"merged":[[20,3,20,5],[20,7,20,9],[20,11,20,13],[96,3,96,5],[38,3,38,5],[38,7,38,9],[38,11,38,13],[95,3,95,5],[57,3,57,5],[57,7,57,9],[57,11,57,13],[76,3,76,5],[76,7,76,9],[76,11,76,13],[95,7,95,9],[95,11,95,13],[96,7,96,9],[96,11,96,13]]}
[]
[]
[]
[]
[]
[]
[]
[]
[]
[]
[]
[]
[]
[]
[]
[]
[]
[]
[]
[]
{"$rows_left_out":98}
{"sheet":"7. Current Wholesale","index":6,"n_rows":117,"n_cols":16,"rows_kept":117,"cut":false,"hidden":false,"merged":[[12,1,12,11],[19,3,19,5],[19,7,19,9],[19,11,19,13],[38,3,38,5],[38,7,38,9],[38,11,38,13],[96,7,96,9],[96,11,96,13],[20,3,20,5],[20,7,20,9],[20,11,20,13],[96,3,96,5],[95,3,95,5],[95,7,95,9],[95,11,95,13],[57,3,57,5],[57,7,57,9],[57,11,57,13],[76,3,76,5],[76,7,76,9],[76,11,76,13]]}
[]
[]
[]
[]
[]
[]
[]
[]
[]
[]
[]
[]
[null,"The purpose of this sheet is to calculate the expected billing when current 2013 Uniform Transmission Rates are applied against historical 2012 transmission units."]
[]
[]
[]
[]
[]
[]
[null,"IESO",null,"Network",null,null,null,"Line Connection",null,null,null,"Transformation Connection",null,null,null,"Total Line"]
{"$rows_left_out":98}
{"sheet":"8. Forecast Wholesale","index":7,"n_rows":117,"n_cols":16,"rows_kept":117,"cut":false,"hidden":false,"merged":[[12,1,12,12],[19,3,19,5],[19,7,19,9],[19,11,19,13],[38,3,38,5],[38,7,38,9],[38,11,38,13],[96,7,96,9],[96,11,96,13],[20,3,20,5],[20,7,20,9],[20,11,20,13],[96,3,96,5],[95,3,95,5],[95,7,95,9],[95,11,95,13],[57,3,57,5],[57,7,57,9],[57,11,57,13],[76,3,76,5],[76,7,76,9],[76,11,76,13]]}
[]
[]
[]
[]
[]
[]
[]
[]
[]
[]
[]
[]
[null,"The purpose of this sheet is to calculate the expected billing when forecasted 2014 Uniform Transmission Rates are applied against historical 2012 transmission units."]
[]
[]
[]
[]
[]
[]
[null,"IESO",null,"Network",null,null,null,"Line Connection",null,null,null,"Transformation Connection",null,null,null,"Total Line"]
{"$rows_left_out":98}
{"sheet":"9. Adj Network to Current WS","index":8,"n_rows":49,"n_cols":18,"rows_kept":49,"cut":false,"hidden":false,"merged":[]}
[]
[]
[]
[]
[]
[]
[]
[]
[]
[]
[]
[]
[null,"The purpose of this sheet is to re-align the current RTS Network Rates to recover current wholesale network costs."]
[]
[]
[]
[]
[]
[]
[]
{"$rows_left_out":30}
{"sheet":"10. Adj Conn. to Current WS","index":9,"n_rows":49,"n_cols":18,"rows_kept":49,"cut":false,"hidden":false,"merged":[]}
[]
[]
[]
[]
[]
[]
[]
[]
[]
[]
[]
[]
[null,"The purpose of this sheet is to re-align the current RTS Connection Rates to recover current wholesale connection costs."]
[]
[]
[]
[]
[]
[]
[]
{"$rows_left_out":30}
{"sheet":"11. Adj Network to Forecast WS","index":10,"n_rows":49,"n_cols":18,"rows_kept":49,"cut":false,"hidden":false,"merged":[]}
[]
[]
[]
[]
[]
[]
[]
[]
[]
[]
[]
[]
[null,"The purpose of this sheet is to update the re-align RTS Network Rates to recover forecast wholesale network costs."]
[]
[]
[]
[]
[]
[]
[]
{"$rows_left_out":30}
{"sheet":"12. Adj Conn. to Forecast WS","index":11,"n_rows":49,"n_cols":18,"rows_kept":49,"cut":false,"hidden":false,"merged":[]}
[]
[]
[]
[]
[]
[]
[]
[]
[]
[]
[]
[]
[null,"The purpose of this sheet is to update the re-aligned RTS Connection Rates to recover forecast wholesale connection costs."]
[]
[]
[]
[]
[]
[null,"Rate Class"]
[]
{"$rows_left_out":30}
{"sheet":"13. Final 2014 RTS Rates","index":12,"n_rows":47,"n_cols":8,"rows_kept":47,"cut":false,"hidden":false,"merged":[[12,1,12,11]]}
[]
[]
[]
[]
[]
[]
[]
[]
[]
[]
[]
[]
[null,"For Cost of Service Applicants, please enter the following Proposed RTS rates into your rates model.\n\nFor IRM applicants, please enter these rates into the 2013 IRM Rate Generator, Sheet 11 \"Proposed Rates\", column I.  \nPlease note that the rate descriptions for the RTSRs are transfered automatically from Sheet 4 to Sheet 11, Column A.\n"]
[]
[]
[]
[]
[]
[]
[]
{"$rows_left_out":28}
{"sheet":"hidden1","index":13,"n_rows":22,"n_cols":2,"rows_kept":22,"cut":false,"hidden":true,"merged":[]}
[{"$f":"IF('3. Rate Classes'!Q24=1, '3. Rate Classes'!C24, \"\")","v":"Residential"},1]
[{"$f":"IF('3. Rate Classes'!Q25=1, '3. Rate Classes'!C25, \"\")","v":"General Service Less Than 50 kW"},2]
[{"$f":"IF('3. Rate Classes'!Q26=1, '3. Rate Classes'!C26, \"\")","v":"General Service 50 to 4,999 kW"},3]
[{"$f":"IF('3. Rate Classes'!Q27=1, '3. Rate Classes'!C27, \"\")","v":"General Service 50 to 4,999 kW – Interval Metered"},4]
[{"$f":"IF('3. Rate Classes'!Q28=1, '3. Rate Classes'!C28, \"\")","v":"Large Use"},5]
[{"$f":"IF('3. Rate Classes'!Q29=1, '3. Rate Classes'!C29, \"\")","v":"Unmetered Scattered Load"},6]
[{"$f":"IF('3. Rate Classes'!Q30=1, '3. Rate Classes'!C30, \"\")","v":"Sentinel Lighting"},7]
[{"$f":"IF('3. Rate Classes'!Q31=1, '3. Rate Classes'!C31, \"\")","v":"Street Lighting"},8]
[{"$f":"IF('3. Rate Classes'!Q32=1, '3. Rate Classes'!C32, \"\")","v":""},9]
[{"$f":"IF('3. Rate Classes'!Q33=1, '3. Rate Classes'!C33, \"\")","v":""},10]
[{"$f":"IF('3. Rate Classes'!Q34=1, '3. Rate Classes'!C34, \"\")","v":""},11]
[{"$f":"IF('3. Rate Classes'!Q35=1, '3. Rate Classes'!C35, \"\")","v":""},12]
[{"$f":"IF('3. Rate Classes'!Q36=1, '3. Rate Classes'!C36, \"\")","v":""},13]
[{"$f":"IF('3. Rate Classes'!Q37=1, '3. Rate Classes'!C37, \"\")","v":""},14]
[{"$f":"IF('3. Rate Classes'!Q38=1, '3. Rate Classes'!C38, \"\")","v":""},15]
[{"$f":"IF('3. Rate Classes'!Q39=1, '3. Rate Classes'!C39, \"\")","v":""},16]
[{"$f":"IF('3. Rate Classes'!Q40=1, '3. Rate Classes'!C40, \"\")","v":""},17]
[{"$f":"IF('3. Rate Classes'!Q41=1, '3. Rate Classes'!C41, \"\")","v":""},18]
[{"$f":"IF('3. Rate Classes'!Q42=1, '3. Rate Classes'!C42, \"\")","v":""},19]
[{"$f":"IF('3. Rate Classes'!Q43=1, '3. Rate Classes'!C43, \"\")","v":""},20]
{"$rows_left_out":2}