{"text_format":"1","workbook":"xlsx","n_sheets":14,"sheets":["1. Info","2. Table of Contents","3. Rate Classes","4. RRR Data","5. UTRs and Sub-Transmission","6. Historical Wholesale","7. Current Wholesale","8. Forecast Wholesale","9. Adj Network to Current WS","10. Adj Conn. to Current WS","11. Adj Network to Forecast WS","12. Adj Conn. to Forecast WS","13. Final 2014 RTS Rates","hidden1"],"not_rendered":{"charts":0,"images":4,"macros":1,"external_links":3,"defined_names":13,"comments":0,"pivot_tables":0},"unopened":[],"bounds":{"document_bytes":16777216,"sheet_cells":100000,"rows_first":2000,"rows_last":500,"rows_between":2000,"halvings":0,"cell_chars":16384,"cell_head_chars":4096},"cells_cut":0,"cells_raw":0,"read":"whole","date_system":"1900"}

{"sheet":"1. Info","index":0,"n_rows":77,"n_cols":28,"rows_kept":77,"cut":false,"hidden":false,"merged":[[24,3,24,4],[20,3,20,4],[1,2,1,9],[2,2,2,9],[3,2,3,9],[4,2,4,9],[14,3,14,4],[16,3,16,4]]}
[null,null,null,null,null,null,null,null,null,null,null,null,null,null,null,null,null,null,null,null,null,null,null,null,null,null,null,"Algoma Power Inc."]
[null,null,null,null,null,null,null,null,null,null,null,null,null,null,null,null,null,null,null,null,null,null,null,null,null,null,null,"Atikokan Hydro Inc."]
[null,null,null,null,null,null,null,null,null,null,null,null,null,null,null,null,null,null,null,null,null,null,null,null,null,null,null,"Attawapiskat Power Corporation"]
[null,null,null,null,null,null,null,null,null,null,null,null,null,null,null,null,null,null,null,null,null,null,null,null,null,null,null,"Bluewater Power Distribution Corp."]
[null,null,null,null,null,null,null,null,null,null,null,null,null,null,null,null,null,null,null,null,null,null,null,null,null,null,null,"Brant County Power"]
[null,null,null,null,null,null,null,null,null,null,null,null,null,null,null,null,null,null,null,null,null,null,null,null,null,null,null,"Brantford Power Inc."]
[null,null,null,null,null,null,null,null,null,null,null,null,null,null,null,null,null,null,null,null,null,null,null,null,null,null,null,"Burlington Hydro Inc."]
[null,null,null,null,null,null,null,null,null,null,null,null,null,null,null,null,null,null,null,null,null,null,null,null,null,null,null,"Cambridge and North Dumfries Hydro"]
[null,null,null,null,null,null,null,null,null,null,null,null,null,null,null,null,null,null,null,null,null,null,null,null,null,null,null,"Canadian Niagara Power Inc. – Eastern Ontario Power/Fort Erie/Port Colborne"]
[null,null,null,null,null,null,null,null,null,null,null,null,null,null,null,null,null,null,null,null,null,null,null,null,null,null,null,"Centre Wellington Hydro Ltd."]
[null,null,null,null,null,null,null,null,null,null,null,null,null,null,null,null,null,null,null,null,null,null,null,null,null,null,null,"Chapleau Public Utilities Corporation"]
[null,null,null,null,null,null,null,null,null,null,null,null,null,null,null,null,null,null,null,null,null,null,null,null,null,null,null,"COLLUS Power Corp."]
[null,null,null,null,null,null,null,null,null,null,null,null,null,null,null,null,null,null,null,null,null,null,null,null,null,null,null,"Cooperative Hydro Embrun Inc."]
[null,null,null,null,null,null,null,null,null,null,null,null,null,null,null,null,null,null,null,null,null,null,null,null,null,null,null,"E.L.K. Energy Inc."]
[null,null,"Utility Name   ","Wellington North Power Inc.",null,null,null,null,null,null,null,null,null,null,null,null,null,null,null,null,null,null,null,null,null,null,null,"Enersource Hydro Mississauga Inc."]
[null,null,null,null,null,null,null,null,null,null,null,null,null,null,null,null,null,null,null,null,null,null,null,null,null,null,null,"Entegrus Powerlines Inc."]
[null,null,"Service Territory",null,null,null,null,null,null,null,null,null,null,null,null,null,null,null,null,null,null,null,null,null,null,null,null,"ENWIN Utilities Ltd."]
[null,null,null,null,null,null,null,null,null,null,null,null,null,null,null,null,null,null,null,null,null,null,null,null,null,null,null,"Erie Thames Powerlines Corp."]
[null,null,"Assigned EB Number","EB-2013-0178",null,null,null,null,null,null,null,null,null,null,null,null,null,null,null,null,null,null,null,null,null,null,null,"Espanola Regional Hydro Distribution Corporation"]
[null,null,null,null,null,null,null,null,null,null,null,null,null,null,null,null,null,null,null,null,null,null,null,null,null,null,null,"Essex Powerlines Corporation"]
[null,null,"Name and Title","Richard Bucknall, Regulatory Compliance Analyst",null,null,null,null,null,null,null,null,null,null,null,null,null,null,null,null,null,null,null,null,null,null,null,"Festival Hydro Inc."]
[null,null,null,null,null,null,null,null,null,null,null,null,null,null,null,null,null,null,null,null,null,null,null,null,null,null,null,"Fort Albany Power Corporation"]
[null,null,"Phone Number","1-519-323-1710",null,null,null,null,null,null,null,null,null,null,null,null,null,null,null,null,null,null,null,null,null,null,null,"Fort Frances Power Corporation"]
[null,null,null,null,null,null,null,null,null,null,null,null,null,null,null,null,null,null,null,null,null,null,null,null,null,null,null,"Greater Sudbury Hydro Inc."]
[null,null,"Email Address","rbucknall@wellingtonnorthpower.com",null,null,null,null,null,null,null,null,null,null,null,null,null,null,null,null,null,null,null,null,null,null,null,"Grimsby Power Inc."]
[null,null,null,null,null,null,null,null,null,null,null,null,null,null,null,null,null,null,null,null,null,null,null,null,null,null,null,"Guelph Hydro Electric Systems Inc."]
[null,null,"Date","2014-03-19",null,null,null,null,null,null,null,null,null,null,null,null,null,null,null,null,null,null,null,null,null,null,null,"Haldimand County Hydro Inc."]
[null,null,null,null,null,null,null,null,null,null,null,null,null,null,null,null,null,null,null,null,null,null,null,null,null,null,null,"Halton Hills Hydro Inc."]
[null,null,"Last COS Re-based Year",2012,null,null,null,null,null,null,null,null,null,null,null,null,null,null,null,null,null,null,null,null,null,null,null,"Hearst Power Distribution Co. Ltd."]
[null,null,null,null,null,null,null,null,null,null,null,null,null,null,null,null,null,null,null,null,null,null,null,null,null,null,null,"Horizon Utilities Corporation"]
[null,null,null,null,null,null,null,null,null,null,null,null,null,null,null,null,null,null,null,null,null,null,null,null,null,null,null,"Hydro 2000 Inc."]
["Note:  Drop-down lists are shaded blue; Input cells are shaded green.",null,null,null,null,null,null,null,null,null,null,null,null,null,null,null,null,null,null,null,null,null,null,null,null,null,null,"Hydro Hawkesbury Inc."]
[null,null,null,null,null,null,null,null,null,null,null,null,null,null,null,null,null,null,null,null,null,null,null,null,null,null,null,"Hydro One Brampton Networks Inc."]
[null,null,null,null,null,null,null,null,null,null,null,null,null,null,null,null,null,null,null,null,null,null,null,null,null,null,null,"Hydro One Networks Inc."]
[null,null,null,null,null,null,null,null,null,null,null,null,null,null,null,null,null,null,null,null,null,null,null,null,null,null,null,"Hydro One Remote Communities Inc."]
[null,null,null,null,null,null,null,null,null,null,null,null,null,null,null,null,null,null,null,null,null,null,null,null,null,null,null,"Hydro Ottawa Limited"]
[null,null,null,null,null,null,null,null,null,null,null,null,null,null,null,null,null,null,null,null,null,null,null,null,null,null,null,"Innisfil Hydro Dist. Systems Limited"]
[null,null,null,null,null,null,null,null,null,null,null,null,null,null,null,null,null,null,null,null,null,null,null,null,null,null,null,"Kashechewan Power Corporation"]
[null,null,null,null,null,null,null,null,null,null,null,null,null,null,null,null,null,null,null,null,null,null,null,null,null,null,null,"Kenora Hydro Electric Corporation Ltd."]
[null,null,null,null,null,null,null,null,null,null,null,null,null,null,null,null,null,null,null,null,null,null,null,null,null,null,null,"Kingston Hydro Corporation"]
[null,null,null,null,null,null,null,null,null,null,null,null,null,null,null,null,null,null,null,null,null,null,null,null,null,null,null,"Kitchener-Wilmot Hydro Inc."]
[null,null,null,null,null,null,null,null,null,null,null,null,null,null,null,null,null,null,null,null,null,null,null,null,null,null,null,"Lakefront Utilities Inc."]
[null,null,null,null,null,null,null,null,null,null,null,null,null,null,null,null,null,null,null,null,null,null,null,null,null,null,null,"Lakeland Power Distribution Ltd."]
[null,null,null,null,null,null,null,null,null,null,null,null,null,null,null,null,null,null,null,null,null,null,null,null,null,null,null,"London Hydro Inc."]
[null,null,null,null,null,null,null,null,null,null,null,null,null,null,null,null,null,null,null,null,null,null,null,null,null,null,null,"Midland Power Utility Corporation"]
[null,null,null,null,null,null,null,null,null,null,null,null,null,null,null,null,null,null,null,null,null,null,null,null,null,null,null,"Milton Hydro Distribution Inc."]
[null,null,null,null,null,null,null,null,null,null,null,null,null,null,null,null,null,null,null,null,null,null,null,null,null,null,null,"Newmarket – Tay Power Distribution Ltd."]
[null,null,null,null,null,null,null,null,null,null,null,null,null,null,null,null,null,null,null,null,null,null,null,null,null,null,null,"Niagara Peninsula Energy Inc."]
[null,null,null,null,null,null,null,null,null,null,null,null,null,null,null,null,null,null,null,null,null,null,null,null,null,null,null,"Niagara-on-the-Lake Hydro Inc."]
[null,null,null,null,null,null,null,null,null,null,null,null,null,null,null,null,null,null,null,null,null,null,null,null,null,null,null,"Norfolk Power Distribution Ltd."]
[null,null,null,null,null,null,null,null,null,null,null,null,null,null,null,null,null,null,null,null,null,null,null,null,null,null,null,"North Bay Hydro Distribution Limited"]
[null,null,null,null,null,null,null,null,null,null,null,null,null,null,null,null,null,null,null,null,null,null,null,null,null,null,null,"Northern Ontario Wires Inc."]
[null,null,null,null,null,null,null,null,null,null,null,null,null,null,null,null,null,null,null,null,null,null,null,null,null,null,null,"Oakville Hydro Distribution Inc."]
[null,null,null,null,null,null,null,null,null,null,null,null,null,null,null,null,null,null,null,null,null,null,null,null,null,null,null,"Orangeville Hydro Limited"]
[null,null,null,null,null,null,null,null,null,null,null,null,null,null,null,null,null,null,null,null,null,null,null,null,null,null,null,"Orillia Power Distribution Corp."]
[null,null,null,null,null,null,null,null,null,null,null,null,null,null,null,null,null,null,null,null,null,null,null,null,null,null,null,"Oshawa PUC Networks Inc."]
[null,null,null,null,null,null,null,null,null,null,null,null,null,null,null,null,null,null,null,null,null,null,null,null,null,null,null,"Ottawa River Power Corporation"]
[null,null,null,null,null,null,null,null,null,null,null,null,null,null,null,null,null,null,null,null,null,null,null,null,null,null,null,"Parry Sound Power Corporation"]
[null,null,null,null,null,null,null,null,null,null,null,null,null,null,null,null,null,null,null,null,null,null,null,null,null,null,null,"Peterborough Distribution Inc."]
[null,null,null,null,null,null,null,null,null,null,null,null,null,null,null,null,null,null,null,null,null,null,null,null,null,null,null,"PowerStream Inc."]
[null,null,null,null,null,null,null,null,null,null,null,null,null,null,null,null,null,null,null,null,null,null,null,null,null,null,null,"PUC Distribution Inc."]
[null,null,null,null,null,null,null,null,null,null,null,null,null,null,null,null,null,null,null,null,null,null,null,null,null,null,null,"Renfrew Hydro Inc."]
[null,null,null,null,null,null,null,null,null,null,null,null,null,null,null,null,null,null,null,null,null,null,null,null,null,null,null,"Rideau St. Lawrence Distribution Inc."]
[null,null,null,null,null,null,null,null,null,null,null,null,null,null,null,null,null,null,null,null,null,null,null,null,null,null,null,"St. Thomas Energy Inc."]
[null,null,null,null,null,null,null,null,null,null,null,null,null,null,null,null,null,null,null,null,null,null,null,null,null,null,null,"Sioux Lookout Hydro Inc."]
[null,null,null,null,null,null,null,null,null,null,null,null,null,null,null,null,null,null,null,null,null,null,null,null,null,null,null,"Thunder Bay Hydro Electricity Distribution"]
[null,null,null,null,null,null,null,null,null,null,null,null,null,null,null,null,null,null,null,null,null,null,null,null,null,null,null,"Tillsonburg Hydro Inc."]
[null,null,null,null,null,null,null,null,null,null,null,null,null,null,null,null,null,null,null,null,null,null,null,null,null,null,null,"Toronto Hydro-Electric System Limited"]
[null,null,null,null,null,null,null,null,null,null,null,null,null,null,null,null,null,null,null,null,null,null,null,null,null,null,null,"Veridian Connections Inc."]
[null,null,null,null,null,null,null,null,null,null,null,null,null,null,null,null,null,null,null,null,null,null,null,null,null,null,null,"Wasaga Distribution Inc."]
[null,null,null,null,null,null,null,null,null,null,null,null,null,null,null,null,null,null,null,null,null,null,null,null,null,null,null,"Waterloo North Hydro Inc."]
[null,null,null,null,null,null,null,null,null,null,null,null,null,null,null,null,null,null,null,null,null,null,null,null,null,null,null,"Welland Hydro Electric System Corp."]
[null,null,null,null,null,null,null,null,null,null,null,null,null,null,null,null,null,null,null,null,null,null,null,null,null,null,null,"Wellington North Power Inc."]
[null,null,null,null,null,null,null,null,null,null,null,null,null,null,null,null,null,null,null,null,null,null,null,null,null,null,null,"West Coast Huron Energy Inc."]
[null,null,null,null,null,null,null,null,null,null,null,null,null,null,null,null,null,null,null,null,null,null,null,null,null,null,null,"Westario Power Inc."]
[null,null,null,null,null,null,null,null,null,null,null,null,null,null,null,null,null,null,null,null,null,null,null,null,null,null,null,"Whitby Hydro Electric Corporation"]
[null,null,null,null,null,null,null,null,null,null,null,null,null,null,null,null,null,null,null,null,null,null,null,null,null,null,null,"Woodstock Hydro Services Inc."]

{"sheet":"2. Table of Contents","index":1,"n_rows":32,"n_cols":9,"rows_kept":32,"cut":false,"hidden":false,"merged":[]}
[]
[]
[]
[]
[]
[]
[]
[]
[]
[]
[]
[]
[]
[]
[]
[]
[]
[]
[]
[null,null,null,"1. Info",null,null,null,null,"7. Current Wholesale"]
[]
[null,null,null,"2. Table of Contents",null,null,null,null,"8. Forecast Wholesale"]
[]
[null,null,null,"3. Rate Classes",null,null,null,null,"9. Adj Network to Current WS"]
[]
[null,null,null,"4. RRR Data",null,null,null,null,"10. Adj Conn. to Current WS"]
[]
[null,null,null,"5. UTRs and Sub-Transmission",null,null,null,null,"11. Adj Network to Forecast WS"]
[]
[null,null,null,"6. Historical Wholesale",null,null,null,null,"12. Adj Conn. to Forecast WS"]
[]
[null,null,null,null,null,null,null,null,"13. Final 2013 RTS Rates"]

{"sheet":"3. Rate Classes","index":2,"n_rows":115,"n_cols":28,"rows_kept":115,"cut":false,"hidden":false,"merged":[[12,2,12,13],[47,2,47,5],[43,2,43,5],[44,2,44,5],[45,2,45,5],[46,2,46,5],[42,2,42,5],[37,2,37,5],[38,9,38,10],[39,9,39,10],[44,12,44,13],[38,2,38,5],[40,12,40,13],[43,9,43,10],[29,2,29,5],[30,2,30,5],[44,9,44,10],[39,2,39,5],[40,2,40,5],[41,2,41,5],[40,9,40,10],[41,9,41,10],[42,9,42,10],[36,2,36,5],[23,2,23,5],[24,2,24,5],[25,2,25,5],[26,2,26,5],[27,2,27,5],[28,2,28,5],[34,12,34,13],[35,12,35,13],[31,2,31,5],[32,2,32,5],[33,2,33,5],[34,2,34,5],[35,2,35,5],[31,9,31,10],[32,9,32,10],[33,9,33,10],[31,12,31,13],[32,12,32,13],[33,12,33,13],[37,9,37,10],[23,9,23,10],[24,9,24,10],[25,9,25,10],[26,9,26,10],[27,9,27,10],[28,9,28,10],[29,9,29,10],[30,9,30,10],[34,9,34,10],[35,9,35,10],[36,9,36,10],[27,12,27,13],[28,12,28,13],[29,12,29,13],[30,12,30,13],[23,12,23,13],[24,12,24,13],[25,12,25,13],[26,12,26,13],[41,12,41,13],[42,12,42,13],[43,12,43,13],[36,12,36,13],[37,12,37,13],[38,12,38,13],[39,12,39,13]]}
[]
[]
[]
[]
[]
[]
[]
[]
[]
[]
[]
[]
[null,null,"1.  Select the appropriate rate classes that appear on your most recent Board-Approved Tariff of Rates and Charges.\n2.  Enter the RTS Network and Connection Rate as it appears on the Tariff of Rates and Charges"]
[]
[]
[]
[]
[]
[]
[]
[]
[null,null,"Rate Class",null,null,null,null,"Unit",null,"RTSR-Network",null,null,"RTSR-Connection"]
[]
[null,null,"Residential",null,null,null,null,"kWh",null,6.8999999999999999E-3,null,null,4.4999999999999997E-3,null,null,null,{"$f":"IF(OR(ISBLANK(C24), ISERROR(FIND(\"Choose\", C24))=FALSE), 0, 1)","v":1},{"$f":"\"C\" & ROW(C24)","v":"C24"},{"$f":"IF(OR(C24=\"General Service Intermediate Rate Class 1,000 To 4,999 kW (formerly General Service > 50 kW Customers)\", C24=\"General Service Intermediate Rate Class 1,000 To 4,999 kW (formerly Large Use Customers)\"), \"x\", \"\")","v":""},null,null,null,null,null,null,null,null,"Choose Rate Class"]
[null,null,"General Service Less Than 50 kW",null,null,null,null,"kWh",null,6.4000000000000003E-3,null,null,3.8E-3,null,null,null,1,"C25",{"$f":"IF(OR(C25=\"General Service Intermediate Rate Class 1,000 To 4,999 kW (formerly General Service > 50 kW Customers)\", C25=\"General Service Intermediate Rate Class 1,000 To 4,999 kW (formerly Large Use Customers)\"), \"x\", \"\")","v":""},null,null,null,null,null,null,null,null,"Residential"]
[null,null,"General Service 50 to 999 kW",null,null,null,null,"kW",null,2.6259999999999999,null,null,1.5142,null,null,null,1,"C26","",null,null,null,null,null,null,null,null,"Residential Regular"]
[null,null,"General Service 1,000 to 4,999 kW",null,null,null,null,"kW",null,2.7892000000000001,null,null,1.66,null,null,null,1,"C27","",null,null,null,null,null,null,null,null,"Residential Urban"]
[null,null,"Unmetered Scattered Load",null,null,null,null,"kWh",null,6.4000000000000003E-3,null,null,3.8E-3,null,null,null,1,"C28","",null,null,null,null,null,null,null,null,"Residential Urban Year-Round"]
[null,null,"Sentinel Lighting",null,null,null,null,"kW",null,1.9903999999999999,null,null,1.1951000000000001,null,null,null,1,"C29","",null,null,null,null,null,null,null,null,"Residential Suburban"]
[null,null,"Street Lighting",null,null,null,null,"kW",null,1.9803999999999999,null,null,1.1707000000000001,null,null,null,1,"C30","",null,null,null,null,null,null,null,null,"Residential Suburban Seasonal"]
[null,null,"Choose Rate Class",null,null,null,null,null,null,null,null,null,null,null,null,null,0,"C31","",null,null,null,null,null,null,null,null,"Residential Suburban Year Round"]
[null,null,"Choose Rate Class",null,null,null,null,null,null,null,null,null,null,null,null,null,0,"C32","",null,null,null,null,null,null,null,null,"Residential - Time of Use"]
[null,null,"Choose Rate Class",null,null,null,null,null,null,null,null,null,null,null,null,null,0,"C33","",null,null,null,null,null,null,null,null,"Residential - Hensall"]
[null,null,"Choose Rate Class",null,null,null,null,null,null,null,null,null,null,null,null,null,0,"C34","",null,null,null,null,null,null,null,null,"Residential – High Density [R1]"]
[null,null,"Choose Rate Class",null,null,null,null,null,null,null,null,null,null,null,null,null,0,"C35","",null,null,null,null,null,null,null,null,"Residential – Normal Density [R2]"]
[null,null,"Choose Rate Class",null,null,null,null,null,null,null,null,null,null,null,null,null,0,"C36","",null,null,null,null,null,null,null,null,"Seasonal Residential – High Density [R3]"]
[null,null,"Choose Rate Class",null,null,null,null,null,null,null,null,null,null,null,null,null,0,"C37","",null,null,null,null,null,null,null,null,"Seasonal Residential – Normal Density [R4]"]
[null,null,"Choose Rate Class",null,null,null,null,null,null,null,null,null,null,null,null,null,0,"C38","",null,null,null,null,null,null,null,null,"Residential – Urban [UR]"]
[null,null,"Choose Rate Class",null,null,null,null,null,null,null,null,null,null,null,null,null,0,"C39",""]
[null,null,"Choose Rate Class",null,null,null,null,null,null,null,null,null,null,null,null,null,0,"C40","",null,null,null,null,null,null,null,null,"General Service Less Than 50 kW"]
[null,null,"Choose Rate Class",null,null,null,null,null,null,null,null,null,null,null,null,null,0,"C41","",null,null,null,null,null,null,null,null,"General Service Less Than 50 kW – Single Phase energy-billed [G1]"]
[null,null,"Choose Rate Class",null,null,null,null,null,null,null,null,null,null,null,null,null,0,"C42","",null,null,null,null,null,null,null,null,"General Service Less Than 50 kW – Three Phase energy-billed [G3]"]
[null,null,"Choose Rate Class",null,null,null,null,null,null,null,null,null,null,null,null,null,0,"C43","",null,null,null,null,null,null,null,null,"General Service Less Than 50 kW – Transmission Class energy-billed [T]"]
[null,null,"Choose Rate Class",null,null,null,null,null,null,null,null,null,null,null,null,null,0,"C44","",null,null,null,null,null,null,null,null,"General Service Less Than 50 kW – Urban energy-billed [UG]"]
[null,null,"Choose Rate Class",null,null,null,null,null,null,null,null,null,null,null,null,null,0,"C45","",null,null,null,null,null,null,null,null,"Westport Sewage Treatment Plant"]
[null,null,null,null,null,null,null,null,null,null,null,null,null,null,null,null,null,null,{"$f":"COUNTIF(S24:S45, \"x\")","v":0},null,null,null,null,null,null,null,null,"Small Commercial and USL - per meter"]
[null,null,null,null,null,null,null,null,null,null,null,null,null,null,null,null,null,null,null,null,null,null,null,null,null,null,null,"Small Commercial and USL - per connection"]
[null,null,null,null,null,null,null,null,null,null,null,null,null,null,null,null,null,null,null,null,null,null,null,null,null,null,null,"Farms – Single Phase energy-billed [F1]"]
[]
[null,null,null,null,null,null,null,null,null,null,null,null,null,null,null,null,null,null,null,null,null,null,null,null,null,null,null,"General Service 50 to 499 kW"]
[null,null,null,null,null,null,null,null,null,null,null,null,null,null,null,null,null,null,null,null,null,null,null,null,null,null,null,"General Service 50 to 699 kW"]
[null,null,null,null,null,null,null,null,null,null,null,null,null,null,null,null,null,null,null,null,null,null,null,null,null,null,null,"General Service 50 to 999 kW"]
[null,null,null,null,null,null,null,null,null,null,null,null,null,null,null,null,null,null,null,null,null,null,null,null,null,null,null,"General Service 50 to 999 kW - Interval Metered"]
[null,null,null,null,null,null,null,null,null,null,null,null,null,null,null,null,null,null,null,null,null,null,null,null,null,null,null,"General Service 50 to 1,000 kW"]
[null,null,null,null,null,null,null,null,null,null,null,null,null,null,null,null,null,null,null,null,null,null,null,null,null,null,null,"General Service 50 to 1,000 kW - Interval Meters"]
[null,null,null,null,null,null,null,null,null,null,null,null,null,null,null,null,null,null,null,null,null,null,null,null,null,null,null,"General Service 50 to 1,000 kW - Non Interval Meters"]
[null,null,null,null,null,null,null,null,null,null,null,null,null,null,null,null,null,null,null,null,null,null,null,null,null,null,null,"General Service 50 to 1,499 kW"]
[null,null,null,null,null,null,null,null,null,null,null,null,null,null,null,null,null,null,null,null,null,null,null,null,null,null,null,"General Service 50 to 1,499 kW - Interval Metered"]
[null,null,null,null,null,null,null,null,null,null,null,null,null,null,null,null,null,null,null,null,null,null,null,null,null,null,null,"General Service  50 to 2,499 kW"]
[null,null,null,null,null,null,null,null,null,null,null,null,null,null,null,null,null,null,null,null,null,null,null,null,null,null,null,"General Service 50 to 2,999 kW"]
[null,null,null,null,null,null,null,null,null,null,null,null,null,null,null,null,null,null,null,null,null,null,null,null,null,null,null,"General Service 50 to 2,999 kW - Time of Use"]
[null,null,null,null,null,null,null,null,null,null,null,null,null,null,null,null,null,null,null,null,null,null,null,null,null,null,null,"General Service 50 to 4,999 kW"]
[null,null,null,null,null,null,null,null,null,null,null,null,null,null,null,null,null,null,null,null,null,null,null,null,null,null,null,"General Service 50 to 4,999 kW – Interval Metered"]
[null,null,null,null,null,null,null,null,null,null,null,null,null,null,null,null,null,null,null,null,null,null,null,null,null,null,null,"General Service 50 to 4,999 kW - Time of Use"]
[null,null,null,null,null,null,null,null,null,null,null,null,null,null,null,null,null,null,null,null,null,null,null,null,null,null,null,"General Service 50 to 4,999 kW (CoGeneration)"]
[null,null,null,null,null,null,null,null,null,null,null,null,null,null,null,null,null,null,null,null,null,null,null,null,null,null,null,"General Service 50 to 4,999 kW (formerly Time of Use)"]
[null,null,null,null,null,null,null,null,null,null,null,null,null,null,null,null,null,null,null,null,null,null,null,null,null,null,null,"General Service 500 to 4,999 kW"]
[null,null,null,null,null,null,null,null,null,null,null,null,null,null,null,null,null,null,null,null,null,null,null,null,null,null,null,"General Service 700 to 4,999 kW"]
[null,null,null,null,null,null,null,null,null,null,null,null,null,null,null,null,null,null,null,null,null,null,null,null,null,null,null,"General Service 1,000 to 2,999 kW"]
[null,null,null,null,null,null,null,null,null,null,null,null,null,null,null,null,null,null,null,null,null,null,null,null,null,null,null,"General Service 1,000 to 4,999 kW"]
[null,null,null,null,null,null,null,null,null,null,null,null,null,null,null,null,null,null,null,null,null,null,null,null,null,null,null,"General Service 1,000 to 4,999 kW - Interval Meters"]
[null,null,null,null,null,null,null,null,null,null,null,null,null,null,null,null,null,null,null,null,null,null,null,null,null,null,null,"General Service 1,000 To 4,999 kW (co-generation)"]
[null,null,null,null,null,null,null,null,null,null,null,null,null,null,null,null,null,null,null,null,null,null,null,null,null,null,null,"General Service Greater Than 1,000 kW"]
[null,null,null,null,null,null,null,null,null,null,null,null,null,null,null,null,null,null,null,null,null,null,null,null,null,null,null,"General Service Intermediate Rate Class 1,000 To 4,999 kW (formerly Large Use Customers)"]
[null,null,null,null,null,null,null,null,null,null,null,null,null,null,null,null,null,null,null,null,null,null,null,null,null,null,null,"General Service Intermediate Rate Class 1,000 To 4,999 kW (formerly General Service > 50 kW Customers)"]
[null,null,null,null,null,null,null,null,null,null,null,null,null,null,null,null,null,null,null,null,null,null,null,null,null,null,null,"General Service 1,500 to 4,999 kW"]
[null,null,null,null,null,null,null,null,null,null,null,null,null,null,null,null,null,null,null,null,null,null,null,null,null,null,null,"General Service Equal To Or Greater Than 1,500 kW"]
[null,null,null,null,null,null,null,null,null,null,null,null,null,null,null,null,null,null,null,null,null,null,null,null,null,null,null,"General Service Equal To Or Greater Than 1,500 kW - Interval Metered"]
[null,null,null,null,null,null,null,null,null,null,null,null,null,null,null,null,null,null,null,null,null,null,null,null,null,null,null,"General Service Intermediate 1,000 To 4,999 kW"]
[null,null,null,null,null,null,null,null,null,null,null,null,null,null,null,null,null,null,null,null,null,null,null,null,null,null,null,"General Service 2,500 to 4,999 kW"]
[null,null,null,null,null,null,null,null,null,null,null,null,null,null,null,null,null,null,null,null,null,null,null,null,null,null,null,"General Service 3,000 to 4,999 kW"]
[null,null,null,null,null,null,null,null,null,null,null,null,null,null,null,null,null,null,null,null,null,null,null,null,null,null,null,"General Service 3,000 to 4,999 kW - Interval Metered"]
[null,null,null,null,null,null,null,null,null,null,null,null,null,null,null,null,null,null,null,null,null,null,null,null,null,null,null,"General Service 3,000 to 4,999 kW - Intermediate Use"]
[null,null,null,null,null,null,null,null,null,null,null,null,null,null,null,null,null,null,null,null,null,null,null,null,null,null,null,"General Service 3,000 to 4,999 kW - Time of Use"]
[null,null,null,null,null,null,null,null,null,null,null,null,null,null,null,null,null,null,null,null,null,null,null,null,null,null,null,"Intermediate With Self Generation"]
[null,null,null,null,null,null,null,null,null,null,null,null,null,null,null,null,null,null,null,null,null,null,null,null,null,null,null,"General Service - Commercial"]
[null,null,null,null,null,null,null,null,null,null,null,null,null,null,null,null,null,null,null,null,null,null,null,null,null,null,null,"General Service - Institutional"]
[null,null,null,null,null,null,null,null,null,null,null,null,null,null,null,null,null,null,null,null,null,null,null,null,null,null,null,"Farms – Three Phase energy-billed [F3]"]
[]
[null,null,null,null,null,null,null,null,null,null,null,null,null,null,null,null,null,null,null,null,null,null,null,null,null,null,null,"Large Use"]
[null,null,null,null,null,null,null,null,null,null,null,null,null,null,null,null,null,null,null,null,null,null,null,null,null,null,null,"Large Use - Regular"]
[null,null,null,null,null,null,null,null,null,null,null,null,null,null,null,null,null,null,null,null,null,null,null,null,null,null,null,"Large Use > 5000 kW"]
[null,null,null,null,null,null,null,null,null,null,null,null,null,null,null,null,null,null,null,null,null,null,null,null,null,null,null,"Large Use - 3TS"]
[null,null,null,null,null,null,null,null,null,null,null,null,null,null,null,null,null,null,null,null,null,null,null,null,null,null,null,"Large Use - Ford Annex"]
[]
[null,null,null,null,null,null,null,null,null,null,null,null,null,null,null,null,null,null,null,null,null,null,null,null,null,null,null,"Unmetered Scattered Load"]
[]
[null,null,null,null,null,null,null,null,null,null,null,null,null,null,null,null,null,null,null,null,null,null,null,null,null,null,null,"Sentinel Lighting"]
[]
[null,null,null,null,null,null,null,null,null,null,null,null,null,null,null,null,null,null,null,null,null,null,null,null,null,null,null,"Street Lighting"]
[]
[null,null,null,null,null,null,null,null,null,null,null,null,null,null,null,null,null,null,null,null,null,null,null,null,null,null,null,"Embedded Distributor"]
[null,null,null,null,null,null,null,null,null,null,null,null,null,null,null,null,null,null,null,null,null,null,null,null,null,null,null,"Low Voltage Wheeling Charge Rate"]
[]
[null,null,null,null,null,null,null,null,null,null,null,null,null,null,null,null,null,null,null,null,null,null,null,null,null,null,null,"Stand-By"]
[null,null,null,null,null,null,null,null,null,null,null,null,null,null,null,null,null,null,null,null,null,null,null,null,null,null,null,"Standby Power"]
[null,null,null,null,null,null,null,null,null,null,null,null,null,null,null,null,null,null,null,null,null,null,null,null,null,null,null,"Standby Power – INTERIM APPROVAL"]
[null,null,null,null,null,null,null,null,null,null,null,null,null,null,null,null,null,null,null,null,null,null,null,null,null,null,null,"Standby Power - APPROVED ON AN INTERIM BASIS"]
[null,null,null,null,null,null,null,null,null,null,null,null,null,null,null,null,null,null,null,null,null,null,null,null,null,null,null,"Standby - General Service 50 - 1,000 kW"]
[null,null,null,null,null,null,null,null,null,null,null,null,null,null,null,null,null,null,null,null,null,null,null,null,null,null,null,"Standby Power General Service 50 to 1,499 kW"]
[null,null,null,null,null,null,null,null,null,null,null,null,null,null,null,null,null,null,null,null,null,null,null,null,null,null,null,"Standby - General Service 1,000 - 5,000 kW"]
[null,null,null,null,null,null,null,null,null,null,null,null,null,null,null,null,null,null,null,null,null,null,null,null,null,null,null,"Standby Power General Service 1,500 to 4,999 kW"]
[null,null,null,null,null,null,null,null,null,null,null,null,null,null,null,null,null,null,null,null,null,null,null,null,null,null,null,"Standby - Large Use"]
[null,null,null,null,null,null,null,null,null,null,null,null,null,null,null,null,null,null,null,null,null,null,null,null,null,null,null,"Standby Power General Service Large Use"]
[null,null,null,null,null,null,null,null,null,null,null,null,null,null,null,null,null,null,null,null,null,null,null,null,null,null,null,"Standby Distribution Service"]

{"sheet":"4. RRR Data","index":3,"n_rows":48,"n_cols":13,"rows_kept":48,"cut":false,"hidden":false,"merged":[[20,9,20,10],[23,9,23,10],[12,1,12,11],[38,9,38,10],[39,9,39,10],[32,9,32,10],[33,9,33,10],[34,9,34,10],[35,9,35,10],[36,9,36,10],[37,9,37,10],[32,7,32,8],[33,7,33,8],[34,7,34,8],[35,7,35,8],[36,7,36,8],[40,9,40,10],[41,9,41,10],[46,9,46,10],[47,9,47,10],[42,9,42,10],[43,9,43,10],[44,9,44,10],[45,9,45,10],[44,7,44,8],[45,7,45,8],[46,7,46,8],[47,7,47,8],[26,9,26,10],[27,9,27,10],[28,9,28,10],[29,9,29,10],[30,9,30,10],[31,9,31,10],[38,7,38,8],[39,7,39,8],[40,7,40,8],[41,7,41,8],[42,7,42,8],[43,7,43,8],[37,7,37,8],[26,7,26,8],[27,7,27,8],[28,7,28,8],[29,7,29,8],[30,7,30,8],[31,7,31,8]]}
[]
[]
[]
[]
[]
[]
[]
[]
[]
[]
[]
[]
[null,"In the green shaded cells, enter the most recent reported RRR billing determinants.  Please ensure that billing determinants are non-loss adjusted."]
[]
[]
[]
[]
[]
[]
[]
[]
[]
[]
[null,"Rate Class",null,"Unit",null,"Non-Loss Adjusted Metered kWh","Non-Loss Adjusted Metered kW","Applicable Loss Factor",null,"Load Factor",null,"Loss Adjusted Billed kWh","Billed kW"]
[]
[]
[null,{"$f":"IF('3. Rate Classes'!Q24=1,'3. Rate Classes'!C24, 0)","v":"Residential"},null,{"$f":"IF(OR(VLOOKUP($B27, '3. Rate Classes'!$C$24:$H$45,6,0)=0, ISERROR(VLOOKUP($B27, '3. Rate Classes'!$C$24:$H$45,6,0))), \"\", VLOOKUP($B27, '3. Rate Classes'!$C$24:$H$45,6,0))","v":"kWh"},null,24355909,null,1.0716000000000001,null,{"$f":"IF(ISERROR(F27/(G27*30.4*24)), \"\", IF(D27=\"kW\", F27/(G27*30.4*24), \"\"))","v":""},null,{"$f":"IF(OR(H27=0, OR(ISBLANK(H27), TRIM(H27)=\"\")), F27, F27*H27)","v":26099792.084400002},{"$f":"IF(OR(H27=0, OR(ISBLANK(H27), TRIM(H27)=\"\")), G27, G27)","v":0}]
[null,{"$f":"IF('3. Rate Classes'!Q25=1,'3. Rate Classes'!C25, 0)","v":"General Service Less Than 50 kW"},null,{"$f":"IF(OR(VLOOKUP($B28, '3. Rate Classes'!$C$24:$H$45,6,0)=0, ISERROR(VLOOKUP($B28, '3. Rate Classes'!$C$24:$H$45,6,0))), \"\", VLOOKUP($B28, '3. Rate Classes'!$C$24:$H$45,6,0))","v":"kWh"},null,11598593,null,1.0716000000000001,null,"",null,{"$f":"IF(OR(H28=0, OR(ISBLANK(H28), TRIM(H28)=\"\")), F28, F28*H28)","v":12429052.258800002},{"$f":"IF(OR(H28=0, OR(ISBLANK(H28), TRIM(H28)=\"\")), G28, G28)","v":0}]
[null,{"$f":"IF('3. Rate Classes'!Q26=1,'3. Rate Classes'!C26, 0)","v":"General Service 50 to 999 kW"},null,{"$f":"IF(OR(VLOOKUP($B29, '3. Rate Classes'!$C$24:$H$45,6,0)=0, ISERROR(VLOOKUP($B29, '3. Rate Classes'!$C$24:$H$45,6,0))), \"\", VLOOKUP($B29, '3. Rate Classes'!$C$24:$H$45,6,0))","v":"kW"},null,21787824,67429,null,null,0.44287617150515435,null,21787824,67429]
[null,{"$f":"IF('3. Rate Classes'!Q27=1,'3. Rate Classes'!C27, 0)","v":"General Service 1,000 to 4,999 kW"},null,{"$f":"IF(OR(VLOOKUP($B30, '3. Rate Classes'!$C$24:$H$45,6,0)=0, ISERROR(VLOOKUP($B30, '3. Rate Classes'!$C$24:$H$45,6,0))), \"\", VLOOKUP($B30, '3. Rate Classes'!$C$24:$H$45,6,0))","v":"kW"},null,42759000,89331,null,null,0.65605540659251316,null,42759000,89331]
[null,{"$f":"IF('3. Rate Classes'!Q28=1,'3. Rate Classes'!C28, 0)","v":"Unmetered Scattered Load"},null,{"$f":"IF(OR(VLOOKUP($B31, '3. Rate Classes'!$C$24:$H$45,6,0)=0, ISERROR(VLOOKUP($B31, '3. Rate Classes'!$C$24:$H$45,6,0))), \"\", VLOOKUP($B31, '3. Rate Classes'!$C$24:$H$45,6,0))","v":"kWh"},null,5018,null,1.0716000000000001,null,"",null,5377.2888000000003,0]
[null,{"$f":"IF('3. Rate Classes'!Q29=1,'3. Rate Classes'!C29, 0)","v":"Sentinel Lighting"},null,{"$f":"IF(OR(VLOOKUP($B32, '3. Rate Classes'!$C$24:$H$45,6,0)=0, ISERROR(VLOOKUP($B32, '3. Rate Classes'!$C$24:$H$45,6,0))), \"\", VLOOKUP($B32, '3. Rate Classes'!$C$24:$H$45,6,0))","v":"kW"},null,26097,72,null,null,0.49679047880116961,null,26097,72]
[null,{"$f":"IF('3. Rate Classes'!Q30=1,'3. Rate Classes'!C30, 0)","v":"Street Lighting"},null,{"$f":"IF(OR(VLOOKUP($B33, '3. Rate Classes'!$C$24:$H$45,6,0)=0, ISERROR(VLOOKUP($B33, '3. Rate Classes'!$C$24:$H$45,6,0))), \"\", VLOOKUP($B33, '3. Rate Classes'!$C$24:$H$45,6,0))","v":"kW"},null,707903,1963,null,null,{"$f":"IF(ISERROR(F33/(G33*30.4*24)), \"\", IF(D33=\"kW\", F33/(G33*30.4*24), \"\"))","v":0.49427498078487103},null,707903,1963]
[null,{"$f":"IF('3. Rate Classes'!Q31=1,'3. Rate Classes'!C31, 0)","v":0},null,{"$f":"IF(OR(VLOOKUP($B34, '3. Rate Classes'!$C$24:$H$45,6,0)=0, ISERROR(VLOOKUP($B34, '3. Rate Classes'!$C$24:$H$45,6,0))), \"\", VLOOKUP($B34, '3. Rate Classes'!$C$24:$H$45,6,0))","v":{"$error":"#N/A"}},null,null,null,null,null,"",null,0,0]
[null,{"$f":"IF('3. Rate Classes'!Q32=1,'3. Rate Classes'!C32, 0)","v":0},null,{"$f":"IF(OR(VLOOKUP($B35, '3. Rate Classes'!$C$24:$H$45,6,0)=0, ISERROR(VLOOKUP($B35, '3. Rate Classes'!$C$24:$H$45,6,0))), \"\", VLOOKUP($B35, '3. Rate Classes'!$C$24:$H$45,6,0))","v":{"$error":"#N/A"}},null,null,null,null,null,"",null,0,0]
[null,{"$f":"IF('3. Rate Classes'!Q33=1,'3. Rate Classes'!C33, 0)","v":0},null,{"$f":"IF(OR(VLOOKUP($B36, '3. Rate Classes'!$C$24:$H$45,6,0)=0, ISERROR(VLOOKUP($B36, '3. Rate Classes'!$C$24:$H$45,6,0))), \"\", VLOOKUP($B36, '3. Rate Classes'!$C$24:$H$45,6,0))","v":{"$error":"#N/A"}},null,null,null,null,null,"",null,0,0]
[null,{"$f":"IF('3. Rate Classes'!Q34=1,'3. Rate Classes'!C34, 0)","v":0},null,{"$f":"IF(OR(VLOOKUP($B37, '3. Rate Classes'!$C$24:$H$45,6,0)=0, ISERROR(VLOOKUP($B37, '3. Rate Classes'!$C$24:$H$45,6,0))), \"\", VLOOKUP($B37, '3. Rate Classes'!$C$24:$H$45,6,0))","v":{"$error":"#N/A"}},null,null,null,null,null,"",null,0,0]
[null,{"$f":"IF('3. Rate Classes'!Q35=1,'3. Rate Classes'!C35, 0)","v":0},null,{"$f":"IF(OR(VLOOKUP($B38, '3. Rate Classes'!$C$24:$H$45,6,0)=0, ISERROR(VLOOKUP($B38, '3. Rate Classes'!$C$24:$H$45,6,0))), \"\", VLOOKUP($B38, '3. Rate Classes'!$C$24:$H$45,6,0))","v":{"$error":"#N/A"}},null,null,null,null,null,"",null,0,0]
[null,{"$f":"IF('3. Rate Classes'!Q36=1,'3. Rate Classes'!C36, 0)","v":0},null,{"$f":"IF(OR(VLOOKUP($B39, '3. Rate Classes'!$C$24:$H$45,6,0)=0, ISERROR(VLOOKUP($B39, '3. Rate Classes'!$C$24:$H$45,6,0))), \"\", VLOOKUP($B39, '3. Rate Classes'!$C$24:$H$45,6,0))","v":{"$error":"#N/A"}},null,null,null,null,null,"",null,0,0]
[null,{"$f":"IF('3. Rate Classes'!Q37=1,'3. Rate Classes'!C37, 0)","v":0},null,{"$f":"IF(OR(VLOOKUP($B40, '3. Rate Classes'!$C$24:$H$45,6,0)=0, ISERROR(VLOOKUP($B40, '3. Rate Classes'!$C$24:$H$45,6,0))), \"\", VLOOKUP($B40, '3. Rate Classes'!$C$24:$H$45,6,0))","v":{"$error":"#N/A"}},null,null,null,null,null,"",null,0,0]
[null,{"$f":"IF('3. Rate Classes'!Q38=1,'3. Rate Classes'!C38, 0)","v":0},null,{"$f":"IF(OR(VLOOKUP($B41, '3. Rate Classes'!$C$24:$H$45,6,0)=0, ISERROR(VLOOKUP($B41, '3. Rate Classes'!$C$24:$H$45,6,0))), \"\", VLOOKUP($B41, '3. Rate Classes'!$C$24:$H$45,6,0))","v":{"$error":"#N/A"}},null,null,null,null,null,"",null,0,0]
[null,{"$f":"IF('3. Rate Classes'!Q39=1,'3. Rate Classes'!C39, 0)","v":0},null,{"$f":"IF(OR(VLOOKUP($B42, '3. Rate Classes'!$C$24:$H$45,6,0)=0, ISERROR(VLOOKUP($B42, '3. Rate Classes'!$C$24:$H$45,6,0))), \"\", VLOOKUP($B42, '3. Rate Classes'!$C$24:$H$45,6,0))","v":{"$error":"#N/A"}},null,null,null,null,null,"",null,0,0]
[null,{"$f":"IF('3. Rate Classes'!Q40=1,'3. Rate Classes'!C40, 0)","v":0},null,{"$f":"IF(OR(VLOOKUP($B43, '3. Rate Classes'!$C$24:$H$45,6,0)=0, ISERROR(VLOOKUP($B43, '3. Rate Classes'!$C$24:$H$45,6,0))), \"\", VLOOKUP($B43, '3. Rate Classes'!$C$24:$H$45,6,0))","v":{"$error":"#N/A"}},null,null,null,null,null,"",null,0,0]
[null,{"$f":"IF('3. Rate Classes'!Q41=1,'3. Rate Classes'!C41, 0)","v":0},null,{"$f":"IF(OR(VLOOKUP($B44, '3. Rate Classes'!$C$24:$H$45,6,0)=0, ISERROR(VLOOKUP($B44, '3. Rate Classes'!$C$24:$H$45,6,0))), \"\", VLOOKUP($B44, '3. Rate Classes'!$C$24:$H$45,6,0))","v":{"$error":"#N/A"}},null,null,null,null,null,"",null,0,0]
[null,{"$f":"IF('3. Rate Classes'!Q42=1,'3. Rate Classes'!C42, 0)","v":0},null,{"$f":"IF(OR(VLOOKUP($B45, '3. Rate Classes'!$C$24:$H$45,6,0)=0, ISERROR(VLOOKUP($B45, '3. Rate Classes'!$C$24:$H$45,6,0))), \"\", VLOOKUP($B45, '3. Rate Classes'!$C$24:$H$45,6,0))","v":{"$error":"#N/A"}},null,null,null,null,null,"",null,0,0]
[null,{"$f":"IF('3. Rate Classes'!Q43=1,'3. Rate Classes'!C43, 0)","v":0},null,{"$f":"IF(OR(VLOOKUP($B46, '3. Rate Classes'!$C$24:$H$45,6,0)=0, ISERROR(VLOOKUP($B46, '3. Rate Classes'!$C$24:$H$45,6,0))), \"\", VLOOKUP($B46, '3. Rate Classes'!$C$24:$H$45,6,0))","v":{"$error":"#N/A"}},null,null,null,null,null,"",null,0,0]
[null,{"$f":"IF('3. Rate Classes'!Q44=1,'3. Rate Classes'!C44, 0)","v":0},null,{"$f":"IF(OR(VLOOKUP($B47, '3. Rate Classes'!$C$24:$H$45,6,0)=0, ISERROR(VLOOKUP($B47, '3. Rate Classes'!$C$24:$H$45,6,0))), \"\", VLOOKUP($B47, '3. Rate Classes'!$C$24:$H$45,6,0))","v":{"$error":"#N/A"}},null,null,null,null,null,"",null,0,0]
[null,{"$f":"IF('3. Rate Classes'!Q45=1,'3. Rate Classes'!C45, 0)","v":0},null,{"$f":"IF(OR(VLOOKUP($B48, '3. Rate Classes'!$C$24:$H$45,6,0)=0, ISERROR(VLOOKUP($B48, '3. Rate Classes'!$C$24:$H$45,6,0))), \"\", VLOOKUP($B48, '3. Rate Classes'!$C$24:$H$45,6,0))","v":{"$error":"#N/A"}},null,null,null,null,null,"",null,0,0]

{"sheet":"5. UTRs and Sub-Transmission","index":4,"n_rows":95,"n_cols":9,"rows_kept":95,"cut":false,"hidden":false,"merged":[]}
[]
[]
[]
[]
[]
[]
[]
[]
[]
[]
[]
[]
[]
[]
[]
[]
[]
[null,"Uniform Transmission Rates","Unit",null,"Effective January 1, 2012",null,"Effective January 1, 2013",null,"Effective January 1, 2014"]
[]
[null,"Rate Description",null,null,"Rate",null,"Rate",null,"Rate"]
[]
[null,"Network Service Rate","kW",null,3.57,null,3.63,null,3.82]
[]
[null,"Line Connection Service Rate","kW",null,0.8,null,0.75,null,0.82]
[]
[null,"Transformation Connection Service Rate","kW",null,1.86,null,1.85,null,1.98]
[]
[]
[null,"Hydro One Sub-Transmission Rates","Unit",null,"Effective January 1, 2012",null,"Effective January 1, 2013",null,"Effective January 1, 2014"]
[]
[]
[]
[null,"Rate Description",null,null,"Rate",null,"Rate",null,"Rate"]
[]
[null,"Network Service Rate","kW",null,2.65,null,3.18,null,3.23]
[]
[null,"Line Connection Service Rate","kW",null,0.64,null,0.7,null,0.65]
[]
[null,"Transformation Connection Service Rate","kW",null,1.5,null,1.63,null,1.62]
[]
[null,"Both Line and Transformation Connection Service Rate","kW",null,{"$f":"E39+E37","v":2.14},null,{"$f":"G39+G37","v":2.33},null,{"$f":"I39+I37","v":2.27}]
[]
[]
[null,"If needed , add extra host here (I)","Unit",null,"Effective January 1, 2012",null,"Effective January 1, 2013",null,"Effective January 1, 2014"]
[]
[]
[]
[null,"Rate Description",null,null,"Rate",null,"Rate",null,"Rate"]
[]
[null,"Network Service Rate","kW"]
[]
[null,"Line Connection Service Rate","kW"]
[]
[null,"Transformation Connection Service Rate","kW"]
[]
[null,"Both Line and Transformation Connection Service Rate","kW",null,{"$f":"E54+E52","v":0},null,{"$f":"G54+G52","v":0},null,{"$f":"I54+I52","v":0}]
[]
[]
[null,"If needed , add extra host here (II)","Unit",null,"Effective January 1, 2012",null,"Effective January 1, 2013",null,"Effective January 1, 2014"]
[]
[]
[]
[null,"Rate Description",null,null,"Rate",null,"Rate",null,"Rate"]
[]
[null,"Network Service Rate","kW"]
[]
[null,"Line Connection Service Rate","kW"]
[]
[null,"Transformation Connection Service Rate","kW"]
[]
[null,"Both Line and Transformation Connection Service Rate","kW",null,{"$f":"E69+E67","v":0},null,{"$f":"G69+G67","v":0},null,{"$f":"I69+I67","v":0}]
[]
[]
[]
[null,"Hydro One Sub-Transmission Rate Rider 9A","Unit",null,"Effective January 1, 2012",null,"Effective January 1, 2013",null,"Effective January 1, 2014"]
[]
[null,"Rate Description",null,null,"Rate",null,"Rate",null,"Rate"]
[]
[null,"RSVA Transmission network – 4714 – which affects 1584","kW",null,0,null,0.14649999999999999,null,0.14649999999999999]
[]
[null,"RSVA Transmission connection – 4716 – which affects 1586","kW",null,0,null,6.6699999999999995E-2,null,6.6699999999999995E-2]
[]
[null,"RSVA LV – 4750 – which affects 1550","kW",null,0,null,4.7500000000000001E-2,null,4.7500000000000001E-2]
[]
[null,"RARA 1 – 2252 – which affects 1590 ","kW",null,0,null,4.19E-2,null,4.19E-2]
[]
[null,"RARA 1 – 2252 – which affects 1590 (2008)","kW",null,0,null,-2.7E-2,null,-2.7E-2]
[]
[null,"RARA 1 – 2252 – which affects 1590 (2009)","kW",null,0,null,-5.9999999999999995E-4,null,-5.9999999999999995E-4]
[]
[null,"Hydro One Sub-Transmission Rate Rider 9A","kW",null,{"$f":"SUM(E79:E89)","v":0},null,{"$f":"SUM(G79:G89)","v":0.27499999999999997},null,{"$f":"SUM(I79:I89)","v":0.27499999999999997}]
[]
[]
[null,null,null,null,"Historical 2012",null,"Current 2013",null,"Forecast 2014"]
[null,"Low Voltage Switchgear Credit (if applicable, enter as a negative value)","$"]

{"sheet":"6. Historical Wholesale","index":5,"n_rows":117,"n_cols":16,"rows_kept":117,"cut":false,"hidden":false,"merged":[[95,7,95,9],[95,11,95,13],[96,7,96,9],[96,11,96,13],[20,3,20,5],[20,7,20,9],[20,11,20,13],[96,3,96,5],[38,3,38,5],[38,7,38,9],[38,11,38,13],[95,3,95,5],[57,3,57,5],[57,7,57,9],[57,11,57,13],[76,3,76,5],[76,7,76,9],[76,11,76,13]]}
[]
[]
[]
[]
[]
[]
[]
[]
[]
[]
[]
[]
[]
[]
[]
[]
[]
[]
[]
[]
[null,"IESO",null,"Network",null,null,null,"Line Connection",null,null,null,"Transformation Connection",null,null,null,"Total Line"]
[null,"Month",null,"Units Billed","Rate","Amount",null,"Units Billed","Rate","Amount",null,"Units Billed","Rate","Amount",null,"Amount"]
[]
[null,"January",null,null,{"$f":"IF(D24<>0,F24/D24,0)","v":0},null,null,null,{"$f":"IF(H24<>0,J24/H24,0)","v":0},null,null,null,{"$f":"IF(L24<>0,N24/L24,0)","v":0},null,null,{"$f":"J24+N24","v":0}]
[null,"February",null,null,{"$f":"IF(D25<>0,F25/D25,0)","v":0},null,null,null,{"$f":"IF(H25<>0,J25/H25,0)","v":0},null,null,null,{"$f":"IF(L25<>0,N25/L25,0)","v":0},null,null,0]
[null,"March",null,null,0,null,null,null,0,null,null,null,0,null,null,0]
[null,"April",null,null,0,null,null,null,0,null,null,null,0,null,null,0]
[null,"May",null,null,0,null,null,null,0,null,null,null,0,null,null,0]
[null,"June",null,null,0,null,null,null,0,null,null,null,0,null,null,0]
[null,"July",null,null,0,null,null,null,0,null,null,null,0,null,null,0]
[null,"August",null,null,0,null,null,null,0,null,null,null,0,null,null,0]
[null,"September",null,null,0,null,null,null,0,null,null,null,0,null,null,0]
[null,"October",null,null,0,null,null,null,0,null,null,null,0,null,null,0]
[null,"November",null,null,0,null,null,null,0,null,null,null,0,null,null,0]
[null,"December",null,null,0,null,null,null,0,null,null,null,0,null,null,0]
[]
[null,"Total",null,{"$f":"SUM(D24:D35)","v":0},{"$f":"IF(D37<>0,F37/D37,0)","v":0},{"$f":"SUM(F24:F35)","v":0},null,{"$f":"SUM(H24:H35)","v":0},{"$f":"IF(H37<>0,J37/H37,0)","v":0},{"$f":"SUM(J24:J35)","v":0},null,{"$f":"SUM(L24:L35)","v":0},{"$f":"IF(L37<>0,N37/L37,0)","v":0},{"$f":"SUM(N24:N35)","v":0},null,{"$f":"SUM(P24:P35)","v":0}]
[]
[null,"Hydro One",null,"Network",null,null,null,"Line Connection",null,null,null,"Transformation Connection",null,null,null,"Total Line"]
[]
[null,"Month",null,"Units Billed","Rate","Amount",null,"Units Billed","Rate","Amount",null,"Units Billed","Rate","Amount",null,"Amount"]
[]
[null,"January",null,{"$f":"'[3]2012 Data'!$C$27","v":17146},{"$f":"IF(D43<>0,F43/D43,0)","v":2.65},{"$f":"'[3]2012 Data'!$E$27","v":45436.9},null,{"$f":"'[3]2012 Data'!$G$27","v":7315},{"$f":"IF(H43<>0,J43/H43,0)","v":0.64},{"$f":"'[3]2012 Data'!$I$27","v":4681.6000000000004},null,{"$f":"'[3]2012 Data'!$K$27","v":17146},{"$f":"IF(L43<>0,N43/L43,0)","v":1.5},{"$f":"'[3]2012 Data'!$M$27","v":25719},null,{"$f":"J43+N43","v":30400.6}]
[null,"February",null,{"$f":"'[3]2012 Data'!$C$28","v":16497},{"$f":"IF(D44<>0,F44/D44,0)","v":2.6500000000000004},{"$f":"'[3]2012 Data'!$E$28","v":43717.05},null,{"$f":"'[3]2012 Data'!$G$28","v":7267},{"$f":"IF(H44<>0,J44/H44,0)","v":0.64},{"$f":"'[3]2012 Data'!$I$28","v":4650.88},null,{"$f":"'[3]2012 Data'!$K$28","v":16497},{"$f":"IF(L44<>0,N44/L44,0)","v":1.5009092562284052},{"$f":"'[3]2012 Data'!$M$28","v":24760.5},null,29411.38]
[null,"March",null,{"$f":"'[3]2012 Data'!$C$29","v":15809},2.65,{"$f":"'[3]2012 Data'!$E$29","v":41893.85},null,{"$f":"'[3]2012 Data'!$G$29","v":7020},0.64,{"$f":"'[3]2012 Data'!$I$29","v":4492.8},null,{"$f":"'[3]2012 Data'!$K$29","v":15809},1.5,{"$f":"'[3]2012 Data'!$M$29","v":23713.5},null,28206.3]
[null,"April",null,{"$f":"'[3]2012 Data'!$C$30","v":15107},2.6500000000000004,{"$f":"'[3]2012 Data'!$E$30","v":40033.550000000003},null,{"$f":"'[3]2012 Data'!$G$30","v":6611},0.64,{"$f":"'[3]2012 Data'!$I$30","v":4231.04},null,{"$f":"'[3]2012 Data'!$K$30","v":15107},1.5,{"$f":"'[3]2012 Data'!$M$30","v":22660.5},null,26891.54]
[null,"May",null,{"$f":"'[3]2012 Data'!$C$31","v":15777},2.6500000000000004,{"$f":"'[3]2012 Data'!$E$31","v":41809.050000000003},null,{"$f":"'[3]2012 Data'!$G$31","v":6996},0.64000000000000012,{"$f":"'[3]2012 Data'!$I$31","v":4477.4400000000005},null,{"$f":"'[3]2012 Data'!$K$31","v":15777},1.5,{"$f":"'[3]2012 Data'!$M$31","v":23665.5},null,28142.940000000002]
[null,"June",null,{"$f":"'[3]2012 Data'!$C$32","v":17225},2.65,{"$f":"'[3]2012 Data'!$E$32","v":45646.25},null,{"$f":"'[3]2012 Data'!$G$32","v":7666},0.64,{"$f":"'[3]2012 Data'!$I$32","v":4906.24},null,{"$f":"'[3]2012 Data'!$K$32","v":17225},1.5,{"$f":"'[3]2012 Data'!$M$32","v":25837.5},null,30743.739999999998]
[null,"July",null,{"$f":"'[3]2012 Data'!$C$33","v":16829},2.65,{"$f":"'[3]2012 Data'!$E$33","v":44596.85},null,{"$f":"'[3]2012 Data'!$G$33","v":7210},0.64000000000000012,{"$f":"'[3]2012 Data'!$I$33","v":4614.4000000000005},null,{"$f":"'[3]2012 Data'!$K$33","v":16829},1.5,{"$f":"'[3]2012 Data'!$M$33","v":25243.5},null,29857.9]
[null,"August",null,{"$f":"'[3]2012 Data'!$C$34","v":15914},2.65,{"$f":"'[3]2012 Data'!$E$34","v":42172.1},null,{"$f":"'[3]2012 Data'!$G$34","v":6987},0.64,{"$f":"'[3]2012 Data'!$I$34","v":4471.68},null,{"$f":"'[3]2012 Data'!$K$34","v":15914},1.5,{"$f":"'[3]2012 Data'!$M$34","v":23871},null,28342.68]
[null,"September",null,{"$f":"'[3]2012 Data'!$C$35","v":15538},2.65,{"$f":"'[3]2012 Data'!$E$35","v":41175.699999999997},null,{"$f":"'[3]2012 Data'!$G$35","v":7080},0.64,{"$f":"'[3]2012 Data'!$I$35","v":4531.2},null,{"$f":"'[3]2012 Data'!$K$35","v":15538},1.5,{"$f":"'[3]2012 Data'!$M$35","v":23307},null,27838.2]
[null,"October",null,{"$f":"'[3]2012 Data'!$C$36","v":15871},2.65,{"$f":"'[3]2012 Data'!$E$36","v":42058.15},null,{"$f":"'[3]2012 Data'!$G$36","v":7031},0.64,{"$f":"'[3]2012 Data'!$I$36","v":4499.84},null,{"$f":"'[3]2012 Data'!$K$36","v":15871},1.5,{"$f":"'[3]2012 Data'!$M$36","v":23806.5},null,28306.34]
[null,"November",null,{"$f":"'[3]2012 Data'!$C$37","v":16856},2.65,{"$f":"'[3]2012 Data'!$E$37","v":44668.4},null,{"$f":"'[3]2012 Data'!$G$37","v":7286},0.64,{"$f":"'[3]2012 Data'!$I$37","v":4663.04},null,{"$f":"'[3]2012 Data'!$K$37","v":16856},1.5,{"$f":"'[3]2012 Data'!$M$37","v":25284},null,29947.040000000001]
[null,"December",null,{"$f":"'[3]2012 Data'!$C$38","v":16957},2.8209677419354842,{"$f":"'[3]2012 Data'!$E$38","v":47835.15},null,{"$f":"'[3]2012 Data'!$G$38","v":7362},0.64,{"$f":"'[3]2012 Data'!$I$38","v":4711.68},null,{"$f":"'[3]2012 Data'!$K$38","v":16957},1.5503209588960312,{"$f":"'[3]2012 Data'!$M$38","v":26288.7925},null,31000.4725]
[]
[null,"Total",null,{"$f":"SUM(D43:D54)","v":195526},{"$f":"IF(D56<>0,F56/D56,0)","v":2.6648271841085074},{"$f":"SUM(F43:F54)","v":521043.00000000006},null,{"$f":"SUM(H43:H54)","v":85831},{"$f":"IF(H56<>0,J56/H56,0)","v":0.64},{"$f":"SUM(J43:J54)","v":54931.839999999997},null,{"$f":"SUM(L43:L54)","v":195526},{"$f":"IF(L56<>0,N56/L56,0)","v":1.5044408032691303},{"$f":"SUM(N43:N54)","v":294157.29249999998},null,{"$f":"SUM(P43:P54)","v":349089.13249999995}]
[]
[null,"Add Extra Host Here (I)",null,"Network",null,null,null,"Line Connection",null,null,null,"Transformation Connection",null,null,null,"Total Line"]
[null,"(if needed)"]
[null,"Month",null,"Units Billed","Rate","Amount",null,"Units Billed","Rate","Amount",null,"Units Billed","Rate","Amount",null,"Amount"]
[]
[null,"January",null,null,{"$f":"IF(D62<>0,F62/D62,0)","v":0},null,null,null,{"$f":"IF(H62<>0,J62/H62,0)","v":0},null,null,null,{"$f":"IF(L62<>0,N62/L62,0)","v":0},null,null,{"$f":"J62+N62","v":0}]
[null,"February",null,null,0,null,null,null,0,null,null,null,0,null,null,0]
[null,"March",null,null,0,null,null,null,0,null,null,null,0,null,null,0]
[null,"April",null,null,0,null,null,null,0,null,null,null,0,null,null,0]
[null,"May",null,null,0,null,null,null,0,null,null,null,0,null,null,0]
[null,"June",null,null,0,null,null,null,0,null,null,null,0,null,null,0]
[null,"July",null,null,0,null,null,null,0,null,null,null,0,null,null,0]
[null,"August",null,null,0,null,null,null,0,null,null,null,0,null,null,0]
[null,"September",null,null,0,null,null,null,0,null,null,null,0,null,null,0]
[null,"October",null,null,0,null,null,null,0,null,null,null,0,null,null,0]
[null,"November",null,null,0,null,null,null,0,null,null,null,0,null,null,0]
[null,"December",null,null,0,null,null,null,0,null,null,null,0,null,null,0]
[]
[null,"Total",null,{"$f":"SUM(D62:D73)","v":0},{"$f":"IF(D75<>0,F75/D75,0)","v":0},{"$f":"SUM(F62:F73)","v":0},null,{"$f":"SUM(H62:H73)","v":0},{"$f":"IF(H75<>0,J75/H75,0)","v":0},{"$f":"SUM(J62:J73)","v":0},null,{"$f":"SUM(L62:L73)","v":0},{"$f":"IF(L75<>0,N75/L75,0)","v":0},{"$f":"SUM(N62:N73)","v":0},null,{"$f":"SUM(P62:P73)","v":0}]
[]
[null,"Add Extra Host Here (II)",null,"Network",null,null,null,"Line Connection",null,null,null,"Transformation Connection",null,null,null,"Total Line"]
[null,"(if needed)"]
[null,"Month",null,"Units Billed","Rate","Amount",null,"Units Billed","Rate","Amount",null,"Units Billed","Rate","Amount",null,"Amount"]
[]
[null,"January",null,null,{"$f":"IF(D81<>0,F81/D81,0)","v":0},null,null,null,{"$f":"IF(H81<>0,J81/H81,0)","v":0},null,null,null,{"$f":"IF(L81<>0,N81/L81,0)","v":0},null,null,{"$f":"J81+N81","v":0}]
[null,"February",null,null,0,null,null,null,0,null,null,null,0,null,null,0]
[null,"March",null,null,0,null,null,null,0,null,null,null,0,null,null,0]
[null,"April",null,null,0,null,null,null,0,null,null,null,0,null,null,0]
[null,"May",null,null,0,null,null,null,0,null,null,null,0,null,null,0]
[null,"June",null,null,0,null,null,null,0,null,null,null,0,null,null,0]
[null,"July",null,null,0,null,null,null,0,null,null,null,0,null,null,0]
[null,"August",null,null,0,null,null,null,0,null,null,null,0,null,null,0]
[null,"September",null,null,0,null,null,null,0,null,null,null,0,null,null,0]
[null,"October",null,null,0,null,null,null,0,null,null,null,0,null,null,0]
[null,"November",null,null,0,null,null,null,0,null,null,null,0,null,null,0]
[null,"December",null,null,0,null,null,null,0,null,null,null,0,null,null,0]
[]
[null,"Total",null,{"$f":"SUM(D81:D92)","v":0},{"$f":"IF(D94<>0,F94/D94,0)","v":0},{"$f":"SUM(F81:F92)","v":0},null,{"$f":"SUM(H81:H92)","v":0},{"$f":"IF(H94<>0,J94/H94,0)","v":0},{"$f":"SUM(J81:J92)","v":0},null,{"$f":"SUM(L81:L92)","v":0},{"$f":"IF(L94<>0,N94/L94,0)","v":0},{"$f":"SUM(N81:N92)","v":0},null,{"$f":"SUM(P81:P92)","v":0}]
[]
[null,"Total",null,"Network",null,null,null,"Line Connection",null,null,null,"Transformation Connection",null,null,null,"Total Line"]
[]
[null,"Month",null,"Units Billed","Rate","Amount",null,"Units Billed","Rate","Amount",null,"Units Billed","Rate","Amount",null,"Amount"]
[]
[null,"January",null,{"$f":"D24+D43+D62+D81","v":17146},{"$f":"IF(D100<>0,F100/D100,0)","v":2.65},{"$f":"F24+F43+F62+F81","v":45436.9},null,{"$f":"H24+H43+H62+H81","v":7315},{"$f":"IF(H100<>0,J100/H100,0)","v":0.64},{"$f":"J24+J43+J62+J81","v":4681.6000000000004},null,{"$f":"L24+L43+L62+L81","v":17146},{"$f":"IF(L100<>0,N100/L100,0)","v":1.5},{"$f":"N24+N43+N62+N81","v":25719},null,{"$f":"J100+N100","v":30400.6}]
[null,"February",null,{"$f":"D25+D44+D63+D82","v":16497},2.6500000000000004,{"$f":"F25+F44+F63+F82","v":43717.05},null,{"$f":"H25+H44+H63+H82","v":7267},0.64,{"$f":"J25+J44+J63+J82","v":4650.88},null,{"$f":"L25+L44+L63+L82","v":16497},1.5009092562284052,{"$f":"N25+N44+N63+N82","v":24760.5},null,29411.38]
[null,"March",null,15809,2.65,41893.85,null,7020,0.64,4492.8,null,15809,1.5,23713.5,null,28206.3]
[null,"April",null,15107,2.6500000000000004,40033.550000000003,null,6611,0.64,4231.04,null,15107,1.5,22660.5,null,26891.54]
[null,"May",null,15777,2.6500000000000004,41809.050000000003,null,6996,0.64000000000000012,4477.4400000000005,null,15777,1.5,23665.5,null,28142.940000000002]
[null,"June",null,17225,2.65,45646.25,null,7666,0.64,4906.24,null,17225,1.5,25837.5,null,30743.739999999998]
[null,"July",null,16829,2.65,44596.85,null,7210,0.64000000000000012,4614.4000000000005,null,16829,1.5,25243.5,null,29857.9]
[null,"August",null,15914,2.65,42172.1,null,6987,0.64,4471.68,null,15914,1.5,23871,null,28342.68]
[null,"September",null,15538,2.65,41175.699999999997,null,7080,0.64,4531.2,null,15538,1.5,23307,null,27838.2]
[null,"October",null,15871,2.65,42058.15,null,7031,0.64,4499.84,null,15871,1.5,23806.5,null,28306.34]
[null,"November",null,16856,2.65,44668.4,null,7286,0.64,4663.04,null,16856,1.5,25284,null,29947.040000000001]
[null,"December",null,16957,2.8209677419354842,47835.15,null,7362,0.64,4711.68,null,16957,1.5503209588960312,26288.7925,null,31000.4725]
[]
[null,"Total",null,{"$f":"SUM(D100:D111)","v":195526},{"$f":"IF(D113<>0,F113/D113,0)","v":2.6648271841085074},{"$f":"SUM(F100:F111)","v":521043.00000000006},null,{"$f":"SUM(H100:H111)","v":85831},{"$f":"IF(H113<>0,J113/H113,0)","v":0.64},{"$f":"SUM(J100:J111)","v":54931.839999999997},null,{"$f":"SUM(L100:L111)","v":195526},{"$f":"IF(L113<>0,N113/L113,0)","v":1.5044408032691303},{"$f":"SUM(N100:N111)","v":294157.29249999998},null,{"$f":"SUM(P100:P111)","v":349089.13249999995}]
[]
[null,null,null,null,null,null,null,null,null,null,null,null,null,"Low Voltage Switchgear Credit (if applicable)",null,{"$f":"'5. UTRs and Sub-Transmission'!E95","v":0}]
[]
[null,null,null,null,null,null,null,null,null,null,null,null,null,"Total including deduction for Low Voltage Switchgear Credit",null,{"$f":"P113+P115","v":349089.13249999995}]

{"sheet":"7. Current Wholesale","index":6,"n_rows":117,"n_cols":16,"rows_kept":117,"cut":false,"hidden":false,"merged":[[12,1,12,11],[19,3,19,5],[19,7,19,9],[19,11,19,13],[38,3,38,5],[38,7,38,9],[38,11,38,13],[96,7,96,9],[96,11,96,13],[20,3,20,5],[20,7,20,9],[20,11,20,13],[96,3,96,5],[95,3,95,5],[95,7,95,9],[95,11,95,13],[57,3,57,5],[57,7,57,9],[57,11,57,13],[76,3,76,5],[76,7,76,9],[76,11,76,13]]}
[]
[]
[]
[]
[]
[]
[]
[]
[]
[]
[]
[]
[null,"The purpose of this sheet is to calculate the expected billing when current 2013 Uniform Transmission Rates are applied against historical 2012 transmission units."]
[]
[]
[]
[]
[]
[]
[null,"IESO",null,"Network",null,null,null,"Line Connection",null,null,null,"Transformation Connection",null,null,null,"Total Line"]
[]
[null,"Month",null,"Units Billed","Rate","Amount",null,"Units Billed","Rate","Amount",null,"Units Billed","Rate","Amount",null,"Amount"]
[]
[null,"January",null,{"$f":"'6. Historical Wholesale'!D24","v":0},{"$f":"'5. UTRs and Sub-Transmission'!G22","v":3.63},{"$f":"D24*E24","v":0},null,{"$f":"'6. Historical Wholesale'!H24","v":0},{"$f":"'5. UTRs and Sub-Transmission'!G24","v":0.75},{"$f":"H24*I24","v":0},null,{"$f":"'6. Historical Wholesale'!L24","v":0},{"$f":"'5. UTRs and Sub-Transmission'!G26","v":1.85},{"$f":"L24*M24","v":0},null,{"$f":"J24+N24","v":0}]
[null,"February",null,{"$f":"'6. Historical Wholesale'!D25","v":0},{"$f":"E24","v":3.63},{"$f":"D25*E25","v":0},null,{"$f":"'6. Historical Wholesale'!H25","v":0},{"$f":"I24","v":0.75},{"$f":"H25*I25","v":0},null,{"$f":"'6. Historical Wholesale'!L25","v":0},{"$f":"M24","v":1.85},{"$f":"L25*M25","v":0},null,0]
[null,"March",null,{"$f":"'6. Historical Wholesale'!D26","v":0},{"$f":"E25","v":3.63},0,null,{"$f":"'6. Historical Wholesale'!H26","v":0},{"$f":"I25","v":0.75},0,null,{"$f":"'6. Historical Wholesale'!L26","v":0},{"$f":"M25","v":1.85},0,null,0]
[null,"April",null,{"$f":"'6. Historical Wholesale'!D27","v":0},3.63,0,null,{"$f":"'6. Historical Wholesale'!H27","v":0},0.75,0,null,{"$f":"'6. Historical Wholesale'!L27","v":0},1.85,0,null,0]
[null,"May",null,{"$f":"'6. Historical Wholesale'!D28","v":0},3.63,0,null,{"$f":"'6. Historical Wholesale'!H28","v":0},0.75,0,null,{"$f":"'6. Historical Wholesale'!L28","v":0},1.85,0,null,0]
[null,"June",null,{"$f":"'6. Historical Wholesale'!D29","v":0},3.63,0,null,{"$f":"'6. Historical Wholesale'!H29","v":0},0.75,0,null,{"$f":"'6. Historical Wholesale'!L29","v":0},1.85,0,null,0]
[null,"July",null,{"$f":"'6. Historical Wholesale'!D30","v":0},3.63,0,null,{"$f":"'6. Historical Wholesale'!H30","v":0},0.75,0,null,{"$f":"'6. Historical Wholesale'!L30","v":0},1.85,0,null,0]
[null,"August",null,{"$f":"'6. Historical Wholesale'!D31","v":0},3.63,0,null,{"$f":"'6. Historical Wholesale'!H31","v":0},0.75,0,null,{"$f":"'6. Historical Wholesale'!L31","v":0},1.85,0,null,0]
[null,"September",null,{"$f":"'6. Historical Wholesale'!D32","v":0},3.63,0,null,{"$f":"'6. Historical Wholesale'!H32","v":0},0.75,0,null,{"$f":"'6. Historical Wholesale'!L32","v":0},1.85,0,null,0]
[null,"October",null,{"$f":"'6. Historical Wholesale'!D33","v":0},3.63,0,null,{"$f":"'6. Historical Wholesale'!H33","v":0},0.75,0,null,{"$f":"'6. Historical Wholesale'!L33","v":0},1.85,0,null,0]
[null,"November",null,{"$f":"'6. Historical Wholesale'!D34","v":0},3.63,0,null,{"$f":"'6. Historical Wholesale'!H34","v":0},0.75,0,null,{"$f":"'6. Historical Wholesale'!L34","v":0},1.85,0,null,0]
[null,"December",null,{"$f":"'6. Historical Wholesale'!D35","v":0},3.63,0,null,{"$f":"'6. Historical Wholesale'!H35","v":0},0.75,0,null,{"$f":"'6. Historical Wholesale'!L35","v":0},1.85,0,null,0]
[]
[null,"Total",null,{"$f":"SUM(D24:D35)","v":0},{"$f":"IF(D37<>0,F37/D37,0)","v":0},{"$f":"SUM(F24:F35)","v":0},null,{"$f":"SUM(H24:H35)","v":0},{"$f":"IF(H37<>0,J37/H37,0)","v":0},{"$f":"SUM(J24:J35)","v":0},null,{"$f":"SUM(L24:L35)","v":0},{"$f":"IF(L37<>0,N37/L37,0)","v":0},{"$f":"SUM(N24:N35)","v":0},null,{"$f":"SUM(P24:P35)","v":0}]
[]
[null,"Hydro One",null,"Network",null,null,null,"Line Connection",null,null,null,"Transformation Connection",null,null,null,"Total Line"]
[]
[null,"Month",null,"Units Billed","Rate","Amount",null,"Units Billed","Rate","Amount",null,"Units Billed","Rate","Amount",null,"Amount"]
[]
[null,"January",null,{"$f":"'6. Historical Wholesale'!D43","v":17146},{"$f":"'5. UTRs and Sub-Transmission'!G35+'5. UTRs and Sub-Transmission'!G79","v":3.3265000000000002},{"$f":"D43*E43","v":57036.169000000002},null,{"$f":"'6. Historical Wholesale'!H43","v":7315},{"$f":"'5. UTRs and Sub-Transmission'!G37+'5. UTRs and Sub-Transmission'!G81","v":0.76669999999999994},{"$f":"H43*I43","v":5608.4105},null,{"$f":"'6. Historical Wholesale'!L43","v":17146},{"$f":"'5. UTRs and Sub-Transmission'!G39","v":1.63},{"$f":"L43*M43","v":27947.98},null,{"$f":"J43+N43","v":33556.390500000001}]
[null,"February",null,{"$f":"'6. Historical Wholesale'!D44","v":16497},{"$f":"E43","v":3.3265000000000002},{"$f":"D44*E44","v":54877.270500000006},null,{"$f":"'6. Historical Wholesale'!H44","v":7267},{"$f":"I43","v":0.76669999999999994},{"$f":"H44*I44","v":5571.6088999999993},null,{"$f":"'6. Historical Wholesale'!L44","v":16497},{"$f":"M43","v":1.63},{"$f":"L44*M44","v":26890.109999999997},null,32461.718899999996]
[null,"March",null,{"$f":"'6. Historical Wholesale'!D45","v":15809},{"$f":"E44","v":3.3265000000000002},52588.638500000001,null,{"$f":"'6. Historical Wholesale'!H45","v":7020},{"$f":"I44","v":0.76669999999999994},5382.2339999999995,null,{"$f":"'6. Historical Wholesale'!L45","v":15809},{"$f":"M44","v":1.63},25768.67,null,31150.903999999999]
[null,"April",null,{"$f":"'6. Historical Wholesale'!D46","v":15107},3.3265000000000002,50253.435500000007,null,{"$f":"'6. Historical Wholesale'!H46","v":6611},0.76669999999999994,5068.6536999999998,null,{"$f":"'6. Historical Wholesale'!L46","v":15107},{"$f":"M45","v":1.63},24624.41,null,29693.063699999999]
[null,"May",null,{"$f":"'6. Historical Wholesale'!D47","v":15777},3.3265000000000002,52482.190500000004,null,{"$f":"'6. Historical Wholesale'!H47","v":6996},0.76669999999999994,5363.8331999999991,null,{"$f":"'6. Historical Wholesale'!L47","v":15777},1.63,25716.51,null,31080.343199999996]
[null,"June",null,{"$f":"'6. Historical Wholesale'!D48","v":17225},3.3265000000000002,57298.962500000001,null,{"$f":"'6. Historical Wholesale'!H48","v":7666},0.76669999999999994,5877.5221999999994,null,{"$f":"'6. Historical Wholesale'!L48","v":17225},1.63,28076.749999999996,null,33954.272199999992]
[null,"July",null,{"$f":"'6. Historical Wholesale'!D49","v":16829},3.3265000000000002,55981.668500000007,null,{"$f":"'6. Historical Wholesale'!H49","v":7210},0.76669999999999994,5527.9069999999992,null,{"$f":"'6. Historical Wholesale'!L49","v":16829},1.63,27431.269999999997,null,32959.176999999996]
[null,"August",null,{"$f":"'6. Historical Wholesale'!D50","v":15914},3.3265000000000002,52937.921000000002,null,{"$f":"'6. Historical Wholesale'!H50","v":6987},0.76669999999999994,5356.9328999999998,null,{"$f":"'6. Historical Wholesale'!L50","v":15914},1.63,25939.82,null,31296.752899999999]
[null,"September",null,{"$f":"'6. Historical Wholesale'!D51","v":15538},3.3265000000000002,51687.157000000007,null,{"$f":"'6. Historical Wholesale'!H51","v":7080},0.76669999999999994,5428.2359999999999,null,{"$f":"'6. Historical Wholesale'!L51","v":15538},1.63,25326.94,null,30755.175999999999]
[null,"October",null,{"$f":"'6. Historical Wholesale'!D52","v":15871},3.3265000000000002,52794.881500000003,null,{"$f":"'6. Historical Wholesale'!H52","v":7031},0.76669999999999994,5390.6677,null,{"$f":"'6. Historical Wholesale'!L52","v":15871},1.63,25869.73,null,31260.397700000001]
[null,"November",null,{"$f":"'6. Historical Wholesale'!D53","v":16856},3.3265000000000002,56071.484000000004,null,{"$f":"'6. Historical Wholesale'!H53","v":7286},0.76669999999999994,5586.1761999999999,null,{"$f":"'6. Historical Wholesale'!L53","v":16856},1.63,27475.279999999999,null,33061.456200000001]
[null,"December",null,{"$f":"'6. Historical Wholesale'!D54","v":16957},3.3265000000000002,56407.460500000001,null,{"$f":"'6. Historical Wholesale'!H54","v":7362},0.76669999999999994,5644.4453999999996,null,{"$f":"'6. Historical Wholesale'!L54","v":16957},1.63,27639.91,null,33284.3554]
[]
[null,"Total",null,{"$f":"SUM(D43:D54)","v":195526},{"$f":"IF(D56<>0,F56/D56,0)","v":3.3265000000000007},{"$f":"SUM(F43:F54)","v":650417.23900000018},null,{"$f":"SUM(H43:H54)","v":85831},{"$f":"IF(H56<>0,J56/H56,0)","v":0.76669999999999994},{"$f":"SUM(J43:J54)","v":65806.627699999997},null,{"$f":"SUM(L43:L54)","v":195526},{"$f":"IF(L56<>0,N56/L56,0)","v":1.6299999999999997},{"$f":"SUM(N43:N54)","v":318707.37999999995},null,{"$f":"SUM(P43:P54)","v":384514.00769999996}]
[]
[null,{"$f":"'6. Historical Wholesale'!B58","v":"Add Extra Host Here (I)"},null,"Network",null,null,null,"Line Connection",null,null,null,"Transformation Connection",null,null,null,"Total Line"]
[]
[null,"Month",null,"Units Billed","Rate","Amount",null,"Units Billed","Rate","Amount",null,"Units Billed","Rate","Amount",null,"Amount"]
[]
[null,"January",null,{"$f":"'6. Historical Wholesale'!D62","v":0},{"$f":"'5. UTRs and Sub-Transmission'!G50","v":0},{"$f":"D62*E62","v":0},null,{"$f":"'6. Historical Wholesale'!H62","v":0},{"$f":"'5. UTRs and Sub-Transmission'!G52","v":0},{"$f":"H62*I62","v":0},null,{"$f":"'6. Historical Wholesale'!L62","v":0},{"$f":"'5. UTRs and Sub-Transmission'!G54","v":0},{"$f":"L62*M62","v":0},null,{"$f":"J62+N62","v":0}]
[null,"February",null,{"$f":"'6. Historical Wholesale'!D63","v":0},{"$f":"E62","v":0},{"$f":"D63*E63","v":0},null,{"$f":"'6. Historical Wholesale'!H63","v":0},{"$f":"I62","v":0},{"$f":"H63*I63","v":0},null,{"$f":"'6. Historical Wholesale'!L63","v":0},{"$f":"M62","v":0},{"$f":"L63*M63","v":0},null,0]
[null,"March",null,{"$f":"'6. Historical Wholesale'!D64","v":0},{"$f":"E63","v":0},0,null,{"$f":"'6. Historical Wholesale'!H64","v":0},{"$f":"I63","v":0},0,null,{"$f":"'6. Historical Wholesale'!L64","v":0},{"$f":"M63","v":0},0,null,0]
[null,"April",null,{"$f":"'6. Historical Wholesale'!D65","v":0},0,0,null,{"$f":"'6. Historical Wholesale'!H65","v":0},0,0,null,{"$f":"'6. Historical Wholesale'!L65","v":0},{"$f":"M64","v":0},0,null,0]
[null,"May",null,{"$f":"'6. Historical Wholesale'!D66","v":0},0,0,null,{"$f":"'6. Historical Wholesale'!H66","v":0},0,0,null,{"$f":"'6. Historical Wholesale'!L66","v":0},0,0,null,0]
[null,"June",null,{"$f":"'6. Historical Wholesale'!D67","v":0},0,0,null,{"$f":"'6. Historical Wholesale'!H67","v":0},0,0,null,{"$f":"'6. Historical Wholesale'!L67","v":0},0,0,null,0]
[null,"July",null,{"$f":"'6. Historical Wholesale'!D68","v":0},0,0,null,{"$f":"'6. Historical Wholesale'!H68","v":0},0,0,null,{"$f":"'6. Historical Wholesale'!L68","v":0},0,0,null,0]
[null,"August",null,{"$f":"'6. Historical Wholesale'!D69","v":0},0,0,null,{"$f":"'6. Historical Wholesale'!H69","v":0},0,0,null,{"$f":"'6. Historical Wholesale'!L69","v":0},0,0,null,0]
[null,"September",null,{"$f":"'6. Historical Wholesale'!D70","v":0},0,0,null,{"$f":"'6. Historical Wholesale'!H70","v":0},0,0,null,{"$f":"'6. Historical Wholesale'!L70","v":0},0,0,null,0]
[null,"October",null,{"$f":"'6. Historical Wholesale'!D71","v":0},0,0,null,{"$f":"'6. Historical Wholesale'!H71","v":0},0,0,null,{"$f":"'6. Historical Wholesale'!L71","v":0},0,0,null,0]
[null,"November",null,{"$f":"'6. Historical Wholesale'!D72","v":0},0,0,null,{"$f":"'6. Historical Wholesale'!H72","v":0},0,0,null,{"$f":"'6. Historical Wholesale'!L72","v":0},0,0,null,0]
[null,"December",null,{"$f":"'6. Historical Wholesale'!D73","v":0},0,0,null,{"$f":"'6. Historical Wholesale'!H73","v":0},0,0,null,{"$f":"'6. Historical Wholesale'!L73","v":0},0,0,null,0]
[]
[null,"Total",null,{"$f":"SUM(D62:D73)","v":0},{"$f":"IF(D75<>0,F75/D75,0)","v":0},{"$f":"SUM(F62:F73)","v":0},null,{"$f":"SUM(H62:H73)","v":0},{"$f":"IF(H75<>0,J75/H75,0)","v":0},{"$f":"SUM(J62:J73)","v":0},null,{"$f":"SUM(L62:L73)","v":0},{"$f":"IF(L75<>0,N75/L75,0)","v":0},{"$f":"SUM(N62:N73)","v":0},null,{"$f":"SUM(P62:P73)","v":0}]
[]
[null,{"$f":"'6. Historical Wholesale'!B77","v":"Add Extra Host Here (II)"},null,"Network",null,null,null,"Line Connection",null,null,null,"Transformation Connection",null,null,null,"Total Line"]
[]
[null,"Month",null,"Units Billed","Rate","Amount",null,"Units Billed","Rate","Amount",null,"Units Billed","Rate","Amount",null,"Amount"]
[]
[null,"January",null,{"$f":"'6. Historical Wholesale'!D81","v":0},{"$f":"'5. UTRs and Sub-Transmission'!G65","v":0},{"$f":"D81*E81","v":0},null,{"$f":"'6. Historical Wholesale'!H81","v":0},{"$f":"'5. UTRs and Sub-Transmission'!G67","v":0},{"$f":"H81*I81","v":0},null,{"$f":"'6. Historical Wholesale'!L81","v":0},{"$f":"'5. UTRs and Sub-Transmission'!G69","v":0},{"$f":"L81*M81","v":0},null,{"$f":"J81+N81","v":0}]
[null,"February",null,{"$f":"'6. Historical Wholesale'!D82","v":0},{"$f":"E81","v":0},{"$f":"D82*E82","v":0},null,{"$f":"'6. Historical Wholesale'!H82","v":0},{"$f":"I81","v":0},{"$f":"H82*I82","v":0},null,{"$f":"'6. Historical Wholesale'!L82","v":0},{"$f":"M81","v":0},{"$f":"L82*M82","v":0},null,0]
[null,"March",null,{"$f":"'6. Historical Wholesale'!D83","v":0},{"$f":"E82","v":0},0,null,{"$f":"'6. Historical Wholesale'!H83","v":0},{"$f":"I82","v":0},0,null,{"$f":"'6. Historical Wholesale'!L83","v":0},{"$f":"M82","v":0},0,null,0]
[null,"April",null,{"$f":"'6. Historical Wholesale'!D84","v":0},0,0,null,{"$f":"'6. Historical Wholesale'!H84","v":0},0,0,null,{"$f":"'6. Historical Wholesale'!L84","v":0},{"$f":"M83","v":0},0,null,0]
[null,"May",null,{"$f":"'6. Historical Wholesale'!D85","v":0},0,0,null,{"$f":"'6. Historical Wholesale'!H85","v":0},0,0,null,{"$f":"'6. Historical Wholesale'!L85","v":0},0,0,null,0]
[null,"June",null,{"$f":"'6. Historical Wholesale'!D86","v":0},0,0,null,{"$f":"'6. Historical Wholesale'!H86","v":0},0,0,null,{"$f":"'6. Historical Wholesale'!L86","v":0},0,0,null,0]
[null,"July",null,{"$f":"'6. Historical Wholesale'!D87","v":0},0,0,null,{"$f":"'6. Historical Wholesale'!H87","v":0},0,0,null,{"$f":"'6. Historical Wholesale'!L87","v":0},0,0,null,0]
[null,"August",null,{"$f":"'6. Historical Wholesale'!D88","v":0},0,0,null,{"$f":"'6. Historical Wholesale'!H88","v":0},0,0,null,{"$f":"'6. Historical Wholesale'!L88","v":0},0,0,null,0]
[null,"September",null,{"$f":"'6. Historical Wholesale'!D89","v":0},0,0,null,{"$f":"'6. Historical Wholesale'!H89","v":0},0,0,null,{"$f":"'6. Historical Wholesale'!L89","v":0},0,0,null,0]
[null,"October",null,{"$f":"'6. Historical Wholesale'!D90","v":0},0,0,null,{"$f":"'6. Historical Wholesale'!H90","v":0},0,0,null,{"$f":"'6. Historical Wholesale'!L90","v":0},0,0,null,0]
[null,"November",null,{"$f":"'6. Historical Wholesale'!D91","v":0},0,0,null,{"$f":"'6. Historical Wholesale'!H91","v":0},0,0,null,{"$f":"'6. Historical Wholesale'!L91","v":0},0,0,null,0]
[null,"December",null,{"$f":"'6. Historical Wholesale'!D92","v":0},0,0,null,{"$f":"'6. Historical Wholesale'!H92","v":0},0,0,null,{"$f":"'6. Historical Wholesale'!L92","v":0},0,0,null,0]
[]
[null,"Total",null,{"$f":"SUM(D81:D92)","v":0},{"$f":"IF(D94<>0,F94/D94,0)","v":0},{"$f":"SUM(F81:F92)","v":0},null,{"$f":"SUM(H81:H92)","v":0},{"$f":"IF(H94<>0,J94/H94,0)","v":0},{"$f":"SUM(J81:J92)","v":0},null,{"$f":"SUM(L81:L92)","v":0},{"$f":"IF(L94<>0,N94/L94,0)","v":0},{"$f":"SUM(N81:N92)","v":0},null,{"$f":"SUM(P81:P92)","v":0}]
[]
[null,"Total",null,"Network",null,null,null,"Line Connection",null,null,null,"Transformation Connection",null,null,null,"Total Line"]
[]
[null,"Month",null,"Units Billed","Rate","Amount",null,"Units Billed","Rate","Amount",null,"Units Billed","Rate","Amount",null,"Amount"]
[]
[null,"January",null,{"$f":"D24+D43+D62+D81","v":17146},{"$f":"IF(D100<>0,F100/D100,0)","v":3.3265000000000002},{"$f":"F24+F43+F62+F81","v":57036.169000000002},null,{"$f":"H24+H43+H62+H81","v":7315},{"$f":"IF(H100<>0,J100/H100,0)","v":0.76670000000000005},{"$f":"J24+J43+J62+J81","v":5608.4105},null,{"$f":"L24+L43+L62+L81","v":17146},{"$f":"IF(L100<>0,N100/L100,0)","v":1.63},{"$f":"N24+N43+N62+N81","v":27947.98},null,{"$f":"J100+N100","v":33556.390500000001}]
[null,"February",null,{"$f":"D25+D44+D63+D82","v":16497},3.3265000000000002,{"$f":"F25+F44+F63+F82","v":54877.270500000006},null,{"$f":"H25+H44+H63+H82","v":7267},0.76669999999999994,{"$f":"J25+J44+J63+J82","v":5571.6088999999993},null,{"$f":"L25+L44+L63+L82","v":16497},1.63,{"$f":"N25+N44+N63+N82","v":26890.109999999997},null,32461.718899999996]
[null,"March",null,15809,3.3265000000000002,52588.638500000001,null,7020,0.76669999999999994,5382.2339999999995,null,15809,1.63,25768.67,null,31150.903999999999]
[null,"April",null,15107,3.3265000000000002,50253.435500000007,null,6611,0.76669999999999994,5068.6536999999998,null,15107,1.63,24624.41,null,29693.063699999999]
[null,"May",null,15777,3.3265000000000002,52482.190500000004,null,6996,0.76669999999999983,5363.8331999999991,null,15777,1.63,25716.51,null,31080.343199999996]
[null,"June",null,17225,3.3265000000000002,57298.962500000001,null,7666,0.76669999999999994,5877.5221999999994,null,17225,1.63,28076.749999999996,null,33954.272199999992]
[null,"July",null,16829,3.3265000000000002,55981.668500000007,null,7210,0.76669999999999994,5527.9069999999992,null,16829,1.63,27431.269999999997,null,32959.176999999996]
[null,"August",null,15914,3.3265000000000002,52937.921000000002,null,6987,0.76669999999999994,5356.9328999999998,null,15914,1.63,25939.82,null,31296.752899999999]
[null,"September",null,15538,3.3265000000000002,51687.157000000007,null,7080,0.76669999999999994,5428.2359999999999,null,15538,1.63,25326.94,null,30755.175999999999]
[null,"October",null,15871,3.3265000000000002,52794.881500000003,null,7031,0.76670000000000005,5390.6677,null,15871,1.63,25869.73,null,31260.397700000001]
[null,"November",null,16856,3.3265000000000002,56071.484000000004,null,7286,0.76669999999999994,5586.1761999999999,null,16856,1.63,27475.279999999999,null,33061.456200000001]
[null,"December",null,16957,3.3265000000000002,56407.460500000001,null,7362,0.76669999999999994,5644.4453999999996,null,16957,1.63,27639.91,null,33284.3554]
[]
[null,"Total",null,{"$f":"SUM(D100:D111)","v":195526},{"$f":"IF(D113<>0,F113/D113,0)","v":3.3265000000000007},{"$f":"SUM(F100:F111)","v":650417.23900000018},null,{"$f":"SUM(H100:H111)","v":85831},{"$f":"IF(H113<>0,J113/H113,0)","v":0.76669999999999994},{"$f":"SUM(J100:J111)","v":65806.627699999997},null,{"$f":"SUM(L100:L111)","v":195526},{"$f":"IF(L113<>0,N113/L113,0)","v":1.6299999999999997},{"$f":"SUM(N100:N111)","v":318707.37999999995},null,{"$f":"SUM(P100:P111)","v":384514.00769999996}]
[]
[null,null,null,null,null,null,null,null,null,null,null,null,null,"Low Voltage Switchgear Credit (if applicable)",null,{"$f":"'5. UTRs and Sub-Transmission'!G95","v":0}]
[]
[null,null,null,null,null,null,null,null,null,null,null,null,null,"Total including deduction for Low Voltage Switchgear Credit",null,{"$f":"P113+P115","v":384514.00769999996}]

{"sheet":"8. Forecast Wholesale","index":7,"n_rows":117,"n_cols":16,"rows_kept":117,"cut":false,"hidden":false,"merged":[[12,1,12,12],[19,3,19,5],[19,7,19,9],[19,11,19,13],[38,3,38,5],[38,7,38,9],[38,11,38,13],[96,7,96,9],[96,11,96,13],[20,3,20,5],[20,7,20,9],[20,11,20,13],[96,3,96,5],[95,3,95,5],[95,7,95,9],[95,11,95,13],[57,3,57,5],[57,7,57,9],[57,11,57,13],[76,3,76,5],[76,7,76,9],[76,11,76,13]]}
[]
[]
[]
[]
[]
[]
[]
[]
[]
[]
[]
[]
[null,"The purpose of this sheet is to calculate the expected billing when forecasted 2014 Uniform Transmission Rates are applied against historical 2012 transmission units."]
[]
[]
[]
[]
[]
[]
[null,"IESO",null,"Network",null,null,null,"Line Connection",null,null,null,"Transformation Connection",null,null,null,"Total Line"]
[]
[null,"Month",null,"Units Billed","Rate","Amount",null,"Units Billed","Rate","Amount",null,"Units Billed","Rate","Amount",null,"Amount"]
[]
[null,"January",null,{"$f":"'6. Historical Wholesale'!D24","v":0},{"$f":"'5. UTRs and Sub-Transmission'!I22","v":3.82},{"$f":"D24*E24","v":0},null,{"$f":"'6. Historical Wholesale'!H24","v":0},{"$f":"'5. UTRs and Sub-Transmission'!I24","v":0.82},{"$f":"H24*I24","v":0},null,{"$f":"'6. Historical Wholesale'!L24","v":0},{"$f":"'5. UTRs and Sub-Transmission'!I26","v":1.98},{"$f":"L24*M24","v":0},null,{"$f":"J24+N24","v":0}]
[null,"February",null,{"$f":"'6. Historical Wholesale'!D25","v":0},{"$f":"E24","v":3.82},0,null,{"$f":"'6. Historical Wholesale'!H25","v":0},{"$f":"I24","v":0.82},0,null,{"$f":"'6. Historical Wholesale'!L25","v":0},{"$f":"M24","v":1.98},0,null,0]
[null,"March",null,{"$f":"'6. Historical Wholesale'!D26","v":0},3.82,0,null,{"$f":"'6. Historical Wholesale'!H26","v":0},0.82,0,null,{"$f":"'6. Historical Wholesale'!L26","v":0},1.98,0,null,0]
[null,"April",null,{"$f":"'6. Historical Wholesale'!D27","v":0},3.82,0,null,{"$f":"'6. Historical Wholesale'!H27","v":0},0.82,0,null,{"$f":"'6. Historical Wholesale'!L27","v":0},1.98,0,null,0]
[null,"May",null,{"$f":"'6. Historical Wholesale'!D28","v":0},3.82,0,null,{"$f":"'6. Historical Wholesale'!H28","v":0},0.82,0,null,{"$f":"'6. Historical Wholesale'!L28","v":0},1.98,0,null,0]
[null,"June",null,{"$f":"'6. Historical Wholesale'!D29","v":0},3.82,0,null,{"$f":"'6. Historical Wholesale'!H29","v":0},0.82,0,null,{"$f":"'6. Historical Wholesale'!L29","v":0},1.98,0,null,0]
[null,"July",null,{"$f":"'6. Historical Wholesale'!D30","v":0},3.82,0,null,{"$f":"'6. Historical Wholesale'!H30","v":0},0.82,0,null,{"$f":"'6. Historical Wholesale'!L30","v":0},1.98,0,null,0]
[null,"August",null,{"$f":"'6. Historical Wholesale'!D31","v":0},3.82,0,null,{"$f":"'6. Historical Wholesale'!H31","v":0},0.82,0,null,{"$f":"'6. Historical Wholesale'!L31","v":0},1.98,0,null,0]
[null,"September",null,{"$f":"'6. Historical Wholesale'!D32","v":0},3.82,0,null,{"$f":"'6. Historical Wholesale'!H32","v":0},0.82,0,null,{"$f":"'6. Historical Wholesale'!L32","v":0},1.98,0,null,0]
[null,"October",null,{"$f":"'6. Historical Wholesale'!D33","v":0},3.82,0,null,{"$f":"'6. Historical Wholesale'!H33","v":0},0.82,0,null,{"$f":"'6. Historical Wholesale'!L33","v":0},1.98,0,null,0]
[null,"November",null,{"$f":"'6. Historical Wholesale'!D34","v":0},3.82,0,null,{"$f":"'6. Historical Wholesale'!H34","v":0},0.82,0,null,{"$f":"'6. Historical Wholesale'!L34","v":0},1.98,0,null,0]
[null,"December",null,{"$f":"'6. Historical Wholesale'!D35","v":0},3.82,0,null,{"$f":"'6. Historical Wholesale'!H35","v":0},0.82,0,null,{"$f":"'6. Historical Wholesale'!L35","v":0},1.98,0,null,0]
[]
[null,"Total",null,{"$f":"SUM(D24:D35)","v":0},{"$f":"IF(D37<>0,F37/D37,0)","v":0},{"$f":"SUM(F24:F35)","v":0},null,{"$f":"SUM(H24:H35)","v":0},{"$f":"IF(H37<>0,J37/H37,0)","v":0},{"$f":"SUM(J24:J35)","v":0},null,{"$f":"SUM(L24:L35)","v":0},{"$f":"IF(L37<>0,N37/L37,0)","v":0},{"$f":"SUM(N24:N35)","v":0},null,{"$f":"SUM(P24:P35)","v":0}]
[]
[null,"Hydro One",null,"Network",null,null,null,"Line Connection",null,null,null,"Transformation Connection",null,null,null,"Total Line"]
[]
[null,"Month",null,"Units Billed","Rate","Amount",null,"Units Billed","Rate","Amount",null,"Units Billed","Rate","Amount",null,"Amount"]
[]
[null,"January",null,{"$f":"'6. Historical Wholesale'!D43","v":17146},{"$f":"'5. UTRs and Sub-Transmission'!I35+'5. UTRs and Sub-Transmission'!I79","v":3.3765000000000001},{"$f":"D43*E43","v":57893.469000000005},null,{"$f":"'6. Historical Wholesale'!H43","v":7315},{"$f":"'5. UTRs and Sub-Transmission'!I37+'5. UTRs and Sub-Transmission'!I81","v":0.7167},{"$f":"H43*I43","v":5242.6605},null,{"$f":"'6. Historical Wholesale'!L43","v":17146},{"$f":"'5. UTRs and Sub-Transmission'!I39","v":1.62},{"$f":"L43*M43","v":27776.52},null,{"$f":"J43+N43","v":33019.180500000002}]
[null,"February",null,{"$f":"'6. Historical Wholesale'!D44","v":16497},{"$f":"E43","v":3.3765000000000001},55702.120500000005,null,{"$f":"'6. Historical Wholesale'!H44","v":7267},{"$f":"I43","v":0.7167},5208.2588999999998,null,{"$f":"'6. Historical Wholesale'!L44","v":16497},{"$f":"M43","v":1.62},26725.140000000003,null,31933.398900000004]
[null,"March",null,{"$f":"'6. Historical Wholesale'!D45","v":15809},3.3765000000000001,53379.088499999998,null,{"$f":"'6. Historical Wholesale'!H45","v":7020},0.7167,5031.2340000000004,null,{"$f":"'6. Historical Wholesale'!L45","v":15809},1.62,25610.58,null,30641.814000000002]
[null,"April",null,{"$f":"'6. Historical Wholesale'!D46","v":15107},3.3765000000000001,51008.785499999998,null,{"$f":"'6. Historical Wholesale'!H46","v":6611},0.7167,4738.1036999999997,null,{"$f":"'6. Historical Wholesale'!L46","v":15107},1.62,24473.34,null,29211.4437]
[null,"May",null,{"$f":"'6. Historical Wholesale'!D47","v":15777},3.3765000000000001,53271.040500000003,null,{"$f":"'6. Historical Wholesale'!H47","v":6996},0.7167,5014.0331999999999,null,{"$f":"'6. Historical Wholesale'!L47","v":15777},1.62,25558.74,null,30572.773200000003]
[null,"June",null,{"$f":"'6. Historical Wholesale'!D48","v":17225},3.3765000000000001,58160.212500000001,null,{"$f":"'6. Historical Wholesale'!H48","v":7666},0.7167,5494.2222000000002,null,{"$f":"'6. Historical Wholesale'!L48","v":17225},1.62,27904.500000000004,null,33398.722200000004]
[null,"July",null,{"$f":"'6. Historical Wholesale'!D49","v":16829},3.3765000000000001,56823.118500000004,null,{"$f":"'6. Historical Wholesale'!H49","v":7210},0.7167,5167.4070000000002,null,{"$f":"'6. Historical Wholesale'!L49","v":16829},1.62,27262.980000000003,null,32430.387000000002]
[null,"August",null,{"$f":"'6. Historical Wholesale'!D50","v":15914},3.3765000000000001,53733.620999999999,null,{"$f":"'6. Historical Wholesale'!H50","v":6987},0.7167,5007.5829000000003,null,{"$f":"'6. Historical Wholesale'!L50","v":15914},1.62,25780.68,null,30788.262900000002]
[null,"September",null,{"$f":"'6. Historical Wholesale'!D51","v":15538},3.3765000000000001,52464.057000000001,null,{"$f":"'6. Historical Wholesale'!H51","v":7080},0.7167,5074.2359999999999,null,{"$f":"'6. Historical Wholesale'!L51","v":15538},1.62,25171.56,null,30245.796000000002]
[null,"October",null,{"$f":"'6. Historical Wholesale'!D52","v":15871},3.3765000000000001,53588.431499999999,null,{"$f":"'6. Historical Wholesale'!H52","v":7031},0.7167,5039.1176999999998,null,{"$f":"'6. Historical Wholesale'!L52","v":15871},1.62,25711.02,null,30750.137699999999]
[null,"November",null,{"$f":"'6. Historical Wholesale'!D53","v":16856},3.3765000000000001,56914.284,null,{"$f":"'6. Historical Wholesale'!H53","v":7286},0.7167,5221.8761999999997,null,{"$f":"'6. Historical Wholesale'!L53","v":16856},1.62,27306.720000000001,null,32528.5962]
[null,"December",null,{"$f":"'6. Historical Wholesale'!D54","v":16957},3.3765000000000001,57255.3105,null,{"$f":"'6. Historical Wholesale'!H54","v":7362},0.7167,5276.3454000000002,null,{"$f":"'6. Historical Wholesale'!L54","v":16957},1.62,27470.34,null,32746.685400000002]
[]
[null,"Total",null,{"$f":"SUM(D43:D54)","v":195526},{"$f":"IF(D56<>0,F56/D56,0)","v":3.3765000000000001},{"$f":"SUM(F43:F54)","v":660193.53899999999},null,{"$f":"SUM(H43:H54)","v":85831},{"$f":"IF(H56<>0,J56/H56,0)","v":0.7167},{"$f":"SUM(J43:J54)","v":61515.077700000002},null,{"$f":"SUM(L43:L54)","v":195526},{"$f":"IF(L56<>0,N56/L56,0)","v":1.6200000000000003},{"$f":"SUM(N43:N54)","v":316752.12000000005},null,{"$f":"SUM(P43:P54)","v":378267.19770000008}]
[]
[null,{"$f":"'6. Historical Wholesale'!B58","v":"Add Extra Host Here (I)"},null,"Network",null,null,null,"Line Connection",null,null,null,"Transformation Connection",null,null,null,"Total Line"]
[]
[null,"Month",null,"Units Billed","Rate","Amount",null,"Units Billed","Rate","Amount",null,"Units Billed","Rate","Amount",null,"Amount"]
[]
[null,"January",null,{"$f":"'6. Historical Wholesale'!D62","v":0},{"$f":"'5. UTRs and Sub-Transmission'!I50","v":0},{"$f":"D62*E62","v":0},null,{"$f":"'6. Historical Wholesale'!H62","v":0},{"$f":"'5. UTRs and Sub-Transmission'!I52","v":0},{"$f":"H62*I62","v":0},null,{"$f":"'6. Historical Wholesale'!L62","v":0},{"$f":"'5. UTRs and Sub-Transmission'!I54","v":0},{"$f":"L62*M62","v":0},null,{"$f":"J62+N62","v":0}]
[null,"February",null,{"$f":"'6. Historical Wholesale'!D63","v":0},{"$f":"E62","v":0},0,null,{"$f":"'6. Historical Wholesale'!H63","v":0},{"$f":"I62","v":0},0,null,{"$f":"'6. Historical Wholesale'!L63","v":0},{"$f":"M62","v":0},0,null,0]
[null,"March",null,{"$f":"'6. Historical Wholesale'!D64","v":0},0,0,null,{"$f":"'6. Historical Wholesale'!H64","v":0},0,0,null,{"$f":"'6. Historical Wholesale'!L64","v":0},0,0,null,0]
[null,"April",null,{"$f":"'6. Historical Wholesale'!D65","v":0},0,0,null,{"$f":"'6. Historical Wholesale'!H65","v":0},0,0,null,{"$f":"'6. Historical Wholesale'!L65","v":0},0,0,null,0]
[null,"May",null,{"$f":"'6. Historical Wholesale'!D66","v":0},0,0,null,{"$f":"'6. Historical Wholesale'!H66","v":0},0,0,null,{"$f":"'6. Historical Wholesale'!L66","v":0},0,0,null,0]
[null,"June",null,{"$f":"'6. Historical Wholesale'!D67","v":0},0,0,null,{"$f":"'6. Historical Wholesale'!H67","v":0},0,0,null,{"$f":"'6. Historical Wholesale'!L67","v":0},0,0,null,0]
[null,"July",null,{"$f":"'6. Historical Wholesale'!D68","v":0},0,0,null,{"$f":"'6. Historical Wholesale'!H68","v":0},0,0,null,{"$f":"'6. Historical Wholesale'!L68","v":0},0,0,null,0]
[null,"August",null,{"$f":"'6. Historical Wholesale'!D69","v":0},0,0,null,{"$f":"'6. Historical Wholesale'!H69","v":0},0,0,null,{"$f":"'6. Historical Wholesale'!L69","v":0},0,0,null,0]
[null,"September",null,{"$f":"'6. Historical Wholesale'!D70","v":0},0,0,null,{"$f":"'6. Historical Wholesale'!H70","v":0},0,0,null,{"$f":"'6. Historical Wholesale'!L70","v":0},0,0,null,0]
[null,"October",null,{"$f":"'6. Historical Wholesale'!D71","v":0},0,0,null,{"$f":"'6. Historical Wholesale'!H71","v":0},0,0,null,{"$f":"'6. Historical Wholesale'!L71","v":0},0,0,null,0]
[null,"November",null,{"$f":"'6. Historical Wholesale'!D72","v":0},0,0,null,{"$f":"'6. Historical Wholesale'!H72","v":0},0,0,null,{"$f":"'6. Historical Wholesale'!L72","v":0},0,0,null,0]
[null,"December",null,{"$f":"'6. Historical Wholesale'!D73","v":0},0,0,null,{"$f":"'6. Historical Wholesale'!H73","v":0},0,0,null,{"$f":"'6. Historical Wholesale'!L73","v":0},0,0,null,0]
[]
[null,"Total",null,{"$f":"SUM(D62:D73)","v":0},{"$f":"IF(D75<>0,F75/D75,0)","v":0},{"$f":"SUM(F62:F73)","v":0},null,{"$f":"SUM(H62:H73)","v":0},{"$f":"IF(H75<>0,J75/H75,0)","v":0},{"$f":"SUM(J62:J73)","v":0},null,{"$f":"SUM(L62:L73)","v":0},{"$f":"IF(L75<>0,N75/L75,0)","v":0},{"$f":"SUM(N62:N73)","v":0},null,{"$f":"SUM(P62:P73)","v":0}]
[]
[null,{"$f":"'6. Historical Wholesale'!B77","v":"Add Extra Host Here (II)"},null,"Network",null,null,null,"Line Connection",null,null,null,"Transformation Connection",null,null,null,"Total Line"]
[]
[null,"Month",null,"Units Billed","Rate","Amount",null,"Units Billed","Rate","Amount",null,"Units Billed","Rate","Amount",null,"Amount"]
[]
[null,"January",null,{"$f":"'6. Historical Wholesale'!D81","v":0},{"$f":"'5. UTRs and Sub-Transmission'!I65","v":0},{"$f":"D81*E81","v":0},null,{"$f":"'6. Historical Wholesale'!H81","v":0},{"$f":"'5. UTRs and Sub-Transmission'!I67","v":0},{"$f":"H81*I81","v":0},null,{"$f":"'6. Historical Wholesale'!L81","v":0},{"$f":"'5. UTRs and Sub-Transmission'!I69","v":0},{"$f":"L81*M81","v":0},null,{"$f":"J81+N81","v":0}]
[null,"February",null,{"$f":"'6. Historical Wholesale'!D82","v":0},{"$f":"E81","v":0},0,null,{"$f":"'6. Historical Wholesale'!H82","v":0},{"$f":"I81","v":0},0,null,{"$f":"'6. Historical Wholesale'!L82","v":0},{"$f":"M81","v":0},0,null,0]
[null,"March",null,{"$f":"'6. Historical Wholesale'!D83","v":0},0,0,null,{"$f":"'6. Historical Wholesale'!H83","v":0},0,0,null,{"$f":"'6. Historical Wholesale'!L83","v":0},0,0,null,0]
[null,"April",null,{"$f":"'6. Historical Wholesale'!D84","v":0},0,0,null,{"$f":"'6. Historical Wholesale'!H84","v":0},0,0,null,{"$f":"'6. Historical Wholesale'!L84","v":0},0,0,null,0]
[null,"May",null,{"$f":"'6. Historical Wholesale'!D85","v":0},0,0,null,{"$f":"'6. Historical Wholesale'!H85","v":0},0,0,null,{"$f":"'6. Historical Wholesale'!L85","v":0},0,0,null,0]
[null,"June",null,{"$f":"'6. Historical Wholesale'!D86","v":0},0,0,null,{"$f":"'6. Historical Wholesale'!H86","v":0},0,0,null,{"$f":"'6. Historical Wholesale'!L86","v":0},0,0,null,0]
[null,"July",null,{"$f":"'6. Historical Wholesale'!D87","v":0},0,0,null,{"$f":"'6. Historical Wholesale'!H87","v":0},0,0,null,{"$f":"'6. Historical Wholesale'!L87","v":0},0,0,null,0]
[null,"August",null,{"$f":"'6. Historical Wholesale'!D88","v":0},0,0,null,{"$f":"'6. Historical Wholesale'!H88","v":0},0,0,null,{"$f":"'6. Historical Wholesale'!L88","v":0},0,0,null,0]
[null,"September",null,{"$f":"'6. Historical Wholesale'!D89","v":0},0,0,null,{"$f":"'6. Historical Wholesale'!H89","v":0},0,0,null,{"$f":"'6. Historical Wholesale'!L89","v":0},0,0,null,0]
[null,"October",null,{"$f":"'6. Historical Wholesale'!D90","v":0},0,0,null,{"$f":"'6. Historical Wholesale'!H90","v":0},0,0,null,{"$f":"'6. Historical Wholesale'!L90","v":0},0,0,null,0]
[null,"November",null,{"$f":"'6. Historical Wholesale'!D91","v":0},0,0,null,{"$f":"'6. Historical Wholesale'!H91","v":0},0,0,null,{"$f":"'6. Historical Wholesale'!L91","v":0},0,0,null,0]
[null,"December",null,{"$f":"'6. Historical Wholesale'!D92","v":0},0,0,null,{"$f":"'6. Historical Wholesale'!H92","v":0},0,0,null,{"$f":"'6. Historical Wholesale'!L92","v":0},0,0,null,0]
[]
[null,"Total",null,{"$f":"SUM(D81:D92)","v":0},{"$f":"IF(D94<>0,F94/D94,0)","v":0},{"$f":"SUM(F81:F92)","v":0},null,{"$f":"SUM(H81:H92)","v":0},{"$f":"IF(H94<>0,J94/H94,0)","v":0},{"$f":"SUM(J81:J92)","v":0},null,{"$f":"SUM(L81:L92)","v":0},{"$f":"IF(L94<>0,N94/L94,0)","v":0},{"$f":"SUM(N81:N92)","v":0},null,{"$f":"SUM(P81:P92)","v":0}]
[]
[null,"Total",null,"Network",null,null,null,"Line Connection",null,null,null,"Transformation Connection",null,null,null,"Total Line"]
[]
[null,"Month",null,"Units Billed","Rate","Amount",null,"Units Billed","Rate","Amount",null,"Units Billed","Rate","Amount",null,"Amount"]
[]
[null,"January",null,{"$f":"D24+D43","v":17146},{"$f":"IF(D100<>0,F100/D100,0)","v":3.3765000000000001},{"$f":"F24+F43","v":57893.469000000005},null,{"$f":"H24+H43","v":7315},{"$f":"IF(H100<>0,J100/H100,0)","v":0.7167},{"$f":"J24+J43","v":5242.6605},null,{"$f":"L24+L43","v":17146},{"$f":"IF(L100<>0,N100/L100,0)","v":1.62},{"$f":"N24+N43","v":27776.52},null,{"$f":"J100+N100","v":33019.180500000002}]
[null,"February",null,16497,3.3765000000000001,55702.120500000005,null,7267,0.7167,5208.2588999999998,null,16497,1.62,26725.140000000003,null,31933.398900000004]
[null,"March",null,15809,3.3765000000000001,53379.088499999998,null,7020,0.7167,5031.2340000000004,null,15809,1.62,25610.58,null,30641.814000000002]
[null,"April",null,15107,3.3765000000000001,51008.785499999998,null,6611,0.7167,4738.1036999999997,null,15107,1.62,24473.34,null,29211.4437]
[null,"May",null,15777,3.3765000000000001,53271.040500000003,null,6996,0.7167,5014.0331999999999,null,15777,1.62,25558.74,null,30572.773200000003]
[null,"June",null,17225,3.3765000000000001,58160.212500000001,null,7666,0.7167,5494.2222000000002,null,17225,1.62,27904.500000000004,null,33398.722200000004]
[null,"July",null,16829,3.3765000000000001,56823.118500000004,null,7210,0.7167,5167.4070000000002,null,16829,1.62,27262.980000000003,null,32430.387000000002]
[null,"August",null,15914,3.3765000000000001,53733.620999999999,null,6987,0.7167,5007.5829000000003,null,15914,1.62,25780.68,null,30788.262900000002]
[null,"September",null,15538,3.3765000000000001,52464.057000000001,null,7080,0.7167,5074.2359999999999,null,15538,1.62,25171.56,null,30245.796000000002]
[null,"October",null,15871,3.3765000000000001,53588.431499999999,null,7031,0.7167,5039.1176999999998,null,15871,1.62,25711.02,null,30750.137699999999]
[null,"November",null,16856,3.3765000000000001,56914.284,null,7286,0.7167,5221.8761999999997,null,16856,1.62,27306.720000000001,null,32528.5962]
[null,"December",null,16957,3.3765000000000001,57255.3105,null,7362,0.7167,5276.3454000000002,null,16957,1.62,27470.34,null,32746.685400000002]
[]
[null,"Total",null,{"$f":"SUM(D100:D111)","v":195526},{"$f":"IF(D113<>0,F113/D113,0)","v":3.3765000000000001},{"$f":"SUM(F100:F111)","v":660193.53899999999},null,{"$f":"SUM(H100:H111)","v":85831},{"$f":"IF(H113<>0,J113/H113,0)","v":0.7167},{"$f":"SUM(J100:J111)","v":61515.077700000002},null,{"$f":"SUM(L100:L111)","v":195526},{"$f":"IF(L113<>0,N113/L113,0)","v":1.6200000000000003},{"$f":"SUM(N100:N111)","v":316752.12000000005},null,{"$f":"SUM(P100:P111)","v":378267.19770000008}]
[]
[null,null,null,null,null,null,null,null,null,null,null,null,null,"Low Voltage Switchgear Credit (if applicable)",null,{"$f":"'5. UTRs and Sub-Transmission'!I95","v":0}]
[]
[null,null,null,null,null,null,null,null,null,null,null,null,null,"Total including deduction for Low Voltage Switchgear Credit",null,{"$f":"P113+P115","v":378267.19770000008}]

{"sheet":"9. Adj Network to Current WS","index":8,"n_rows":49,"n_cols":18,"rows_kept":49,"cut":false,"hidden":false,"merged":[]}
[]
[]
[]
[]
[]
[]
[]
[]
[]
[]
[]
[]
[null,"The purpose of this sheet is to re-align the current RTS Network Rates to recover current wholesale network costs."]
[]
[]
[]
[]
[]
[]
[]
[]
[null,"Rate Class",null,"Unit",null,"Current RTSR-Network",null,"Loss Adjusted Billed kWh",null,"Loss Adjusted Billed kW",null,"Billed Amount",null,"Billed Amount %",null,"Current Wholesale Billing",null,"Proposed RTSR Network"]
[]
[]
[null,{"$f":"IF('3. Rate Classes'!Q24=1,'3. Rate Classes'!C24, 0)","v":"Residential"},null,{"$f":"IF(ISERROR(VLOOKUP($B25, '3. Rate Classes'!$C$24:$H$45,6,0)), \"\", VLOOKUP($B25, '3. Rate Classes'!$C$24:$H$45,6,0))","v":"kWh"},null,{"$f":"IF(ISERROR(VLOOKUP($B25,'3. Rate Classes'!$C$24:$N$45, 8,0)), \"\", VLOOKUP($B25,'3. Rate Classes'!$C$24:$N$45, 8,0))","v":6.8999999999999999E-3},null,{"$f":"VLOOKUP('9. Adj Network to Current WS'!$B25, '4. RRR Data'!$B$27:$M$49,11,0)","v":26099792.084400002},null,{"$f":"VLOOKUP('9. Adj Network to Current WS'!$B25, '4. RRR Data'!$B$27:$M$49,12,0)","v":0},null,{"$f":"IF(F25=\"\", \"\", IF(D25=\"kWh\", F25*H25, F25*J25))","v":180088.56538236002},null,{"$f":"IF(ISERROR(L25/$L$49), \"\", L25/$L$49)","v":0.26102427760511582},null,{"$f":"IF(ISERROR('7. Current Wholesale'!$F$113*N25), \"\", '7. Current Wholesale'!$F$113*N25)","v":169774.68995188901},null,{"$f":"IF(D25=\"\",\"\",IF(D25=\"kWh\",IF(H25<>0,P25/H25,),IF(J25<>0,P25/J25,0)))","v":6.5048292110098582E-3}]
[null,{"$f":"IF('3. Rate Classes'!Q25=1,'3. Rate Classes'!C25, 0)","v":"General Service Less Than 50 kW"},null,{"$f":"IF(ISERROR(VLOOKUP($B26, '3. Rate Classes'!$C$24:$H$45,6,0)), \"\", VLOOKUP($B26, '3. Rate Classes'!$C$24:$H$45,6,0))","v":"kWh"},null,{"$f":"IF(ISERROR(VLOOKUP($B26,'3. Rate Classes'!$C$24:$N$45, 8,0)), \"\", VLOOKUP($B26,'3. Rate Classes'!$C$24:$N$45, 8,0))","v":6.4000000000000003E-3},null,{"$f":"VLOOKUP('9. Adj Network to Current WS'!$B26, '4. RRR Data'!$B$27:$M$49,11,0)","v":12429052.258800002},null,{"$f":"VLOOKUP('9. Adj Network to Current WS'!$B26, '4. RRR Data'!$B$27:$M$49,12,0)","v":0},null,{"$f":"IF(F26=\"\", \"\", IF(D26=\"kWh\", F26*H26, F26*J26))","v":79545.934456320014},null,{"$f":"IF(ISERROR(L26/$L$49), \"\", L26/$L$49)","v":0.11529560488085622},null,{"$f":"IF(ISERROR('7. Current Wholesale'!$F$113*N26), \"\", '7. Current Wholesale'!$F$113*N26)","v":74990.248995441449},null,{"$f":"IF(D26=\"\",\"\",IF(D26=\"kWh\",IF(H26<>0,P26/H26,),IF(J26<>0,P26/J26,0)))","v":6.0334647754294339E-3}]
[null,{"$f":"IF('3. Rate Classes'!Q26=1,'3. Rate Classes'!C26, 0)","v":"General Service 50 to 999 kW"},null,{"$f":"IF(ISERROR(VLOOKUP($B27, '3. Rate Classes'!$C$24:$H$45,6,0)), \"\", VLOOKUP($B27, '3. Rate Classes'!$C$24:$H$45,6,0))","v":"kW"},null,{"$f":"IF(ISERROR(VLOOKUP($B27,'3. Rate Classes'!$C$24:$N$45, 8,0)), \"\", VLOOKUP($B27,'3. Rate Classes'!$C$24:$N$45, 8,0))","v":2.6259999999999999},null,{"$f":"VLOOKUP('9. Adj Network to Current WS'!$B27, '4. RRR Data'!$B$27:$M$49,11,0)","v":21787824},null,{"$f":"VLOOKUP('9. Adj Network to Current WS'!$B27, '4. RRR Data'!$B$27:$M$49,12,0)","v":67429},null,177068.554,null,0.25664700752266467,null,{"$f":"IF(ISERROR('7. Current Wholesale'!$F$113*N27), \"\", '7. Current Wholesale'!$F$113*N27)","v":166927.63803050382},null,2.4756060156683892]
[null,{"$f":"IF('3. Rate Classes'!Q27=1,'3. Rate Classes'!C27, 0)","v":"General Service 1,000 to 4,999 kW"},null,{"$f":"IF(ISERROR(VLOOKUP($B28, '3. Rate Classes'!$C$24:$H$45,6,0)), \"\", VLOOKUP($B28, '3. Rate Classes'!$C$24:$H$45,6,0))","v":"kW"},null,{"$f":"IF(ISERROR(VLOOKUP($B28,'3. Rate Classes'!$C$24:$N$45, 8,0)), \"\", VLOOKUP($B28,'3. Rate Classes'!$C$24:$N$45, 8,0))","v":2.7892000000000001},null,{"$f":"VLOOKUP('9. Adj Network to Current WS'!$B28, '4. RRR Data'!$B$27:$M$49,11,0)","v":42759000},null,{"$f":"VLOOKUP('9. Adj Network to Current WS'!$B28, '4. RRR Data'!$B$27:$M$49,12,0)","v":89331},null,249162.0252,null,0.36114085031646426,null,{"$f":"IF(ISERROR('7. Current Wholesale'!$F$113*N28), \"\", '7. Current Wholesale'!$F$113*N28)","v":234892.23475294703},null,2.6294593674418403]
[null,{"$f":"IF('3. Rate Classes'!Q28=1,'3. Rate Classes'!C28, 0)","v":"Unmetered Scattered Load"},null,{"$f":"IF(ISERROR(VLOOKUP($B29, '3. Rate Classes'!$C$24:$H$45,6,0)), \"\", VLOOKUP($B29, '3. Rate Classes'!$C$24:$H$45,6,0))","v":"kWh"},null,{"$f":"IF(ISERROR(VLOOKUP($B29,'3. Rate Classes'!$C$24:$N$45, 8,0)), \"\", VLOOKUP($B29,'3. Rate Classes'!$C$24:$N$45, 8,0))","v":6.4000000000000003E-3},null,{"$f":"VLOOKUP('9. Adj Network to Current WS'!$B29, '4. RRR Data'!$B$27:$M$49,11,0)","v":5377.2888000000003},null,{"$f":"VLOOKUP('9. Adj Network to Current WS'!$B29, '4. RRR Data'!$B$27:$M$49,12,0)","v":0},null,34.414648320000005,null,4.988133864962211E-5,null,{"$f":"IF(ISERROR('7. Current Wholesale'!$F$113*N29), \"\", '7. Current Wholesale'!$F$113*N29)","v":32.443682562111213},null,6.0334647754294339E-3]
[null,{"$f":"IF('3. Rate Classes'!Q29=1,'3. Rate Classes'!C29, 0)","v":"Sentinel Lighting"},null,{"$f":"IF(ISERROR(VLOOKUP($B30, '3. Rate Classes'!$C$24:$H$45,6,0)), \"\", VLOOKUP($B30, '3. Rate Classes'!$C$24:$H$45,6,0))","v":"kW"},null,{"$f":"IF(ISERROR(VLOOKUP($B30,'3. Rate Classes'!$C$24:$N$45, 8,0)), \"\", VLOOKUP($B30,'3. Rate Classes'!$C$24:$N$45, 8,0))","v":1.9903999999999999},null,{"$f":"VLOOKUP('9. Adj Network to Current WS'!$B30, '4. RRR Data'!$B$27:$M$49,11,0)","v":26097},null,{"$f":"VLOOKUP('9. Adj Network to Current WS'!$B30, '4. RRR Data'!$B$27:$M$49,12,0)","v":72},null,143.30879999999999,null,2.0771488692263249E-4,null,{"$f":"IF(ISERROR('7. Current Wholesale'!$F$113*N30), \"\", '7. Current Wholesale'!$F$113*N30)","v":135.10134325141587},null,1.8764075451585538]
[null,{"$f":"IF('3. Rate Classes'!Q30=1,'3. Rate Classes'!C30, 0)","v":"Street Lighting"},null,{"$f":"IF(ISERROR(VLOOKUP($B31, '3. Rate Classes'!$C$24:$H$45,6,0)), \"\", VLOOKUP($B31, '3. Rate Classes'!$C$24:$H$45,6,0))","v":"kW"},null,{"$f":"IF(ISERROR(VLOOKUP($B31,'3. Rate Classes'!$C$24:$N$45, 8,0)), \"\", VLOOKUP($B31,'3. Rate Classes'!$C$24:$N$45, 8,0))","v":1.9803999999999999},null,{"$f":"VLOOKUP('9. Adj Network to Current WS'!$B31, '4. RRR Data'!$B$27:$M$49,11,0)","v":707903},null,{"$f":"VLOOKUP('9. Adj Network to Current WS'!$B31, '4. RRR Data'!$B$27:$M$49,12,0)","v":1963},null,3887.5252,null,5.6346634493267987E-3,null,{"$f":"IF(ISERROR('7. Current Wholesale'!$F$113*N31), \"\", '7. Current Wholesale'!$F$113*N31)","v":3664.8822434053536},null,1.8669802564469453]
[null,{"$f":"IF('3. Rate Classes'!Q31=1,'3. Rate Classes'!C31, 0)","v":0},null,{"$f":"IF(ISERROR(VLOOKUP($B32, '3. Rate Classes'!$C$24:$H$45,6,0)), \"\", VLOOKUP($B32, '3. Rate Classes'!$C$24:$H$45,6,0))","v":""},null,{"$f":"IF(ISERROR(VLOOKUP($B32,'3. Rate Classes'!$C$24:$N$45, 8,0)), \"\", VLOOKUP($B32,'3. Rate Classes'!$C$24:$N$45, 8,0))","v":""},null,{"$f":"VLOOKUP('9. Adj Network to Current WS'!$B32, '4. RRR Data'!$B$27:$M$49,11,0)","v":0},null,{"$f":"VLOOKUP('9. Adj Network to Current WS'!$B32, '4. RRR Data'!$B$27:$M$49,12,0)","v":0},null,"",null,"",null,{"$f":"IF(ISERROR('7. Current Wholesale'!$F$113*N32), \"\", '7. Current Wholesale'!$F$113*N32)","v":""},null,""]
[null,{"$f":"IF('3. Rate Classes'!Q32=1,'3. Rate Classes'!C32, 0)","v":0},null,{"$f":"IF(ISERROR(VLOOKUP($B33, '3. Rate Classes'!$C$24:$H$45,6,0)), \"\", VLOOKUP($B33, '3. Rate Classes'!$C$24:$H$45,6,0))","v":""},null,{"$f":"IF(ISERROR(VLOOKUP($B33,'3. Rate Classes'!$C$24:$N$45, 8,0)), \"\", VLOOKUP($B33,'3. Rate Classes'!$C$24:$N$45, 8,0))","v":""},null,{"$f":"VLOOKUP('9. Adj Network to Current WS'!$B33, '4. RRR Data'!$B$27:$M$49,11,0)","v":0},null,{"$f":"VLOOKUP('9. Adj Network to Current WS'!$B33, '4. RRR Data'!$B$27:$M$49,12,0)","v":0},null,"",null,"",null,{"$f":"IF(ISERROR('7. Current Wholesale'!$F$113*N33), \"\", '7. Current Wholesale'!$F$113*N33)","v":""},null,""]
[null,{"$f":"IF('3. Rate Classes'!Q33=1,'3. Rate Classes'!C33, 0)","v":0},null,{"$f":"IF(ISERROR(VLOOKUP($B34, '3. Rate Classes'!$C$24:$H$45,6,0)), \"\", VLOOKUP($B34, '3. Rate Classes'!$C$24:$H$45,6,0))","v":""},null,{"$f":"IF(ISERROR(VLOOKUP($B34,'3. Rate Classes'!$C$24:$N$45, 8,0)), \"\", VLOOKUP($B34,'3. Rate Classes'!$C$24:$N$45, 8,0))","v":""},null,{"$f":"VLOOKUP('9. Adj Network to Current WS'!$B34, '4. RRR Data'!$B$27:$M$49,11,0)","v":0},null,{"$f":"VLOOKUP('9. Adj Network to Current WS'!$B34, '4. RRR Data'!$B$27:$M$49,12,0)","v":0},null,"",null,"",null,{"$f":"IF(ISERROR('7. Current Wholesale'!$F$113*N34), \"\", '7. Current Wholesale'!$F$113*N34)","v":""},null,""]
[null,{"$f":"IF('3. Rate Classes'!Q34=1,'3. Rate Classes'!C34, 0)","v":0},null,{"$f":"IF(ISERROR(VLOOKUP($B35, '3. Rate Classes'!$C$24:$H$45,6,0)), \"\", VLOOKUP($B35, '3. Rate Classes'!$C$24:$H$45,6,0))","v":""},null,{"$f":"IF(ISERROR(VLOOKUP($B35,'3. Rate Classes'!$C$24:$N$45, 8,0)), \"\", VLOOKUP($B35,'3. Rate Classes'!$C$24:$N$45, 8,0))","v":""},null,{"$f":"VLOOKUP('9. Adj Network to Current WS'!$B35, '4. RRR Data'!$B$27:$M$49,11,0)","v":0},null,{"$f":"VLOOKUP('9. Adj Network to Current WS'!$B35, '4. RRR Data'!$B$27:$M$49,12,0)","v":0},null,"",null,"",null,{"$f":"IF(ISERROR('7. Current Wholesale'!$F$113*N35), \"\", '7. Current Wholesale'!$F$113*N35)","v":""},null,""]
[null,{"$f":"IF('3. Rate Classes'!Q35=1,'3. Rate Classes'!C35, 0)","v":0},null,{"$f":"IF(ISERROR(VLOOKUP($B36, '3. Rate Classes'!$C$24:$H$45,6,0)), \"\", VLOOKUP($B36, '3. Rate Classes'!$C$24:$H$45,6,0))","v":""},null,{"$f":"IF(ISERROR(VLOOKUP($B36,'3. Rate Classes'!$C$24:$N$45, 8,0)), \"\", VLOOKUP($B36,'3. Rate Classes'!$C$24:$N$45, 8,0))","v":""},null,{"$f":"VLOOKUP('9. Adj Network to Current WS'!$B36, '4. RRR Data'!$B$27:$M$49,11,0)","v":0},null,{"$f":"VLOOKUP('9. Adj Network to Current WS'!$B36, '4. RRR Data'!$B$27:$M$49,12,0)","v":0},null,"",null,"",null,{"$f":"IF(ISERROR('7. Current Wholesale'!$F$113*N36), \"\", '7. Current Wholesale'!$F$113*N36)","v":""},null,""]
[null,{"$f":"IF('3. Rate Classes'!Q36=1,'3. Rate Classes'!C36, 0)","v":0},null,{"$f":"IF(ISERROR(VLOOKUP($B37, '3. Rate Classes'!$C$24:$H$45,6,0)), \"\", VLOOKUP($B37, '3. Rate Classes'!$C$24:$H$45,6,0))","v":""},null,{"$f":"IF(ISERROR(VLOOKUP($B37,'3. Rate Classes'!$C$24:$N$45, 8,0)), \"\", VLOOKUP($B37,'3. Rate Classes'!$C$24:$N$45, 8,0))","v":""},null,{"$f":"VLOOKUP('9. Adj Network to Current WS'!$B37, '4. RRR Data'!$B$27:$M$49,11,0)","v":0},null,{"$f":"VLOOKUP('9. Adj Network to Current WS'!$B37, '4. RRR Data'!$B$27:$M$49,12,0)","v":0},null,"",null,"",null,{"$f":"IF(ISERROR('7. Current Wholesale'!$F$113*N37), \"\", '7. Current Wholesale'!$F$113*N37)","v":""},null,""]
[null,{"$f":"IF('3. Rate Classes'!Q37=1,'3. Rate Classes'!C37, 0)","v":0},null,{"$f":"IF(ISERROR(VLOOKUP($B38, '3. Rate Classes'!$C$24:$H$45,6,0)), \"\", VLOOKUP($B38, '3. Rate Classes'!$C$24:$H$45,6,0))","v":""},null,{"$f":"IF(ISERROR(VLOOKUP($B38,'3. Rate Classes'!$C$24:$N$45, 8,0)), \"\", VLOOKUP($B38,'3. Rate Classes'!$C$24:$N$45, 8,0))","v":""},null,{"$f":"VLOOKUP('9. Adj Network to Current WS'!$B38, '4. RRR Data'!$B$27:$M$49,11,0)","v":0},null,{"$f":"VLOOKUP('9. Adj Network to Current WS'!$B38, '4. RRR Data'!$B$27:$M$49,12,0)","v":0},null,"",null,"",null,{"$f":"IF(ISERROR('7. Current Wholesale'!$F$113*N38), \"\", '7. Current Wholesale'!$F$113*N38)","v":""},null,""]
[null,{"$f":"IF('3. Rate Classes'!Q38=1,'3. Rate Classes'!C38, 0)","v":0},null,{"$f":"IF(ISERROR(VLOOKUP($B39, '3. Rate Classes'!$C$24:$H$45,6,0)), \"\", VLOOKUP($B39, '3. Rate Classes'!$C$24:$H$45,6,0))","v":""},null,{"$f":"IF(ISERROR(VLOOKUP($B39,'3. Rate Classes'!$C$24:$N$45, 8,0)), \"\", VLOOKUP($B39,'3. Rate Classes'!$C$24:$N$45, 8,0))","v":""},null,{"$f":"VLOOKUP('9. Adj Network to Current WS'!$B39, '4. RRR Data'!$B$27:$M$49,11,0)","v":0},null,{"$f":"VLOOKUP('9. Adj Network to Current WS'!$B39, '4. RRR Data'!$B$27:$M$49,12,0)","v":0},null,{"$f":"IF(F39=\"\", \"\", IF(D39=\"kWh\", F39*H39, F39*J39))","v":""},null,"",null,{"$f":"IF(ISERROR('7. Current Wholesale'!$F$113*N39), \"\", '7. Current Wholesale'!$F$113*N39)","v":""},null,""]
[null,{"$f":"IF('3. Rate Classes'!Q39=1,'3. Rate Classes'!C39, 0)","v":0},null,{"$f":"IF(ISERROR(VLOOKUP($B40, '3. Rate Classes'!$C$24:$H$45,6,0)), \"\", VLOOKUP($B40, '3. Rate Classes'!$C$24:$H$45,6,0))","v":""},null,{"$f":"IF(ISERROR(VLOOKUP($B40,'3. Rate Classes'!$C$24:$N$45, 8,0)), \"\", VLOOKUP($B40,'3. Rate Classes'!$C$24:$N$45, 8,0))","v":""},null,{"$f":"VLOOKUP('9. Adj Network to Current WS'!$B40, '4. RRR Data'!$B$27:$M$49,11,0)","v":0},null,{"$f":"VLOOKUP('9. Adj Network to Current WS'!$B40, '4. RRR Data'!$B$27:$M$49,12,0)","v":0},null,"",null,"",null,{"$f":"IF(ISERROR('7. Current Wholesale'!$F$113*N40), \"\", '7. Current Wholesale'!$F$113*N40)","v":""},null,""]
[null,{"$f":"IF('3. Rate Classes'!Q40=1,'3. Rate Classes'!C40, 0)","v":0},null,{"$f":"IF(ISERROR(VLOOKUP($B41, '3. Rate Classes'!$C$24:$H$45,6,0)), \"\", VLOOKUP($B41, '3. Rate Classes'!$C$24:$H$45,6,0))","v":""},null,{"$f":"IF(ISERROR(VLOOKUP($B41,'3. Rate Classes'!$C$24:$N$45, 8,0)), \"\", VLOOKUP($B41,'3. Rate Classes'!$C$24:$N$45, 8,0))","v":""},null,{"$f":"VLOOKUP('9. Adj Network to Current WS'!$B41, '4. RRR Data'!$B$27:$M$49,11,0)","v":0},null,{"$f":"VLOOKUP('9. Adj Network to Current WS'!$B41, '4. RRR Data'!$B$27:$M$49,12,0)","v":0},null,"",null,"",null,{"$f":"IF(ISERROR('7. Current Wholesale'!$F$113*N41), \"\", '7. Current Wholesale'!$F$113*N41)","v":""},null,""]
[null,{"$f":"IF('3. Rate Classes'!Q41=1,'3. Rate Classes'!C41, 0)","v":0},null,{"$f":"IF(ISERROR(VLOOKUP($B42, '3. Rate Classes'!$C$24:$H$45,6,0)), \"\", VLOOKUP($B42, '3. Rate Classes'!$C$24:$H$45,6,0))","v":""},null,{"$f":"IF(ISERROR(VLOOKUP($B42,'3. Rate Classes'!$C$24:$N$45, 8,0)), \"\", VLOOKUP($B42,'3. Rate Classes'!$C$24:$N$45, 8,0))","v":""},null,{"$f":"VLOOKUP('9. Adj Network to Current WS'!$B42, '4. RRR Data'!$B$27:$M$49,11,0)","v":0},null,{"$f":"VLOOKUP('9. Adj Network to Current WS'!$B42, '4. RRR Data'!$B$27:$M$49,12,0)","v":0},null,"",null,"",null,{"$f":"IF(ISERROR('7. Current Wholesale'!$F$113*N42), \"\", '7. Current Wholesale'!$F$113*N42)","v":""},null,""]
[null,{"$f":"IF('3. Rate Classes'!Q42=1,'3. Rate Classes'!C42, 0)","v":0},null,{"$f":"IF(ISERROR(VLOOKUP($B43, '3. Rate Classes'!$C$24:$H$45,6,0)), \"\", VLOOKUP($B43, '3. Rate Classes'!$C$24:$H$45,6,0))","v":""},null,{"$f":"IF(ISERROR(VLOOKUP($B43,'3. Rate Classes'!$C$24:$N$45, 8,0)), \"\", VLOOKUP($B43,'3. Rate Classes'!$C$24:$N$45, 8,0))","v":""},null,{"$f":"VLOOKUP('9. Adj Network to Current WS'!$B43, '4. RRR Data'!$B$27:$M$49,11,0)","v":0},null,{"$f":"VLOOKUP('9. Adj Network to Current WS'!$B43, '4. RRR Data'!$B$27:$M$49,12,0)","v":0},null,"",null,"",null,{"$f":"IF(ISERROR('7. Current Wholesale'!$F$113*N43), \"\", '7. Current Wholesale'!$F$113*N43)","v":""},null,""]
[null,{"$f":"IF('3. Rate Classes'!Q43=1,'3. Rate Classes'!C43, 0)","v":0},null,{"$f":"IF(ISERROR(VLOOKUP($B44, '3. Rate Classes'!$C$24:$H$45,6,0)), \"\", VLOOKUP($B44, '3. Rate Classes'!$C$24:$H$45,6,0))","v":""},null,{"$f":"IF(ISERROR(VLOOKUP($B44,'3. Rate Classes'!$C$24:$N$45, 8,0)), \"\", VLOOKUP($B44,'3. Rate Classes'!$C$24:$N$45, 8,0))","v":""},null,{"$f":"VLOOKUP('9. Adj Network to Current WS'!$B44, '4. RRR Data'!$B$27:$M$49,11,0)","v":0},null,{"$f":"VLOOKUP('9. Adj Network to Current WS'!$B44, '4. RRR Data'!$B$27:$M$49,12,0)","v":0},null,"",null,"",null,{"$f":"IF(ISERROR('7. Current Wholesale'!$F$113*N44), \"\", '7. Current Wholesale'!$F$113*N44)","v":""},null,""]
[null,{"$f":"IF('3. Rate Classes'!Q44=1,'3. Rate Classes'!C44, 0)","v":0},null,{"$f":"IF(ISERROR(VLOOKUP($B45, '3. Rate Classes'!$C$24:$H$45,6,0)), \"\", VLOOKUP($B45, '3. Rate Classes'!$C$24:$H$45,6,0))","v":""},null,{"$f":"IF(ISERROR(VLOOKUP($B45,'3. Rate Classes'!$C$24:$N$45, 8,0)), \"\", VLOOKUP($B45,'3. Rate Classes'!$C$24:$N$45, 8,0))","v":""},null,{"$f":"VLOOKUP('9. Adj Network to Current WS'!$B45, '4. RRR Data'!$B$27:$M$49,11,0)","v":0},null,{"$f":"VLOOKUP('9. Adj Network to Current WS'!$B45, '4. RRR Data'!$B$27:$M$49,12,0)","v":0},null,"",null,"",null,{"$f":"IF(ISERROR('7. Current Wholesale'!$F$113*N45), \"\", '7. Current Wholesale'!$F$113*N45)","v":""},null,""]
[null,{"$f":"IF('3. Rate Classes'!Q45=1,'3. Rate Classes'!C45, 0)","v":0},null,{"$f":"IF(ISERROR(VLOOKUP($B46, '3. Rate Classes'!$C$24:$H$45,6,0)), \"\", VLOOKUP($B46, '3. Rate Classes'!$C$24:$H$45,6,0))","v":""},null,{"$f":"IF(ISERROR(VLOOKUP($B46,'3. Rate Classes'!$C$24:$N$45, 8,0)), \"\", VLOOKUP($B46,'3. Rate Classes'!$C$24:$N$45, 8,0))","v":""},null,{"$f":"VLOOKUP('9. Adj Network to Current WS'!$B46, '4. RRR Data'!$B$27:$M$49,11,0)","v":0},null,{"$f":"VLOOKUP('9. Adj Network to Current WS'!$B46, '4. RRR Data'!$B$27:$M$49,12,0)","v":0},null,"",null,"",null,{"$f":"IF(ISERROR('7. Current Wholesale'!$F$113*N46), \"\", '7. Current Wholesale'!$F$113*N46)","v":""},null,""]
[]
[]
[null,null,null,null,null,null,null,null,null,null,null,{"$f":"SUM(L25:L46)","v":689930.32768700004}]

{"sheet":"10. Adj Conn. to Current WS","index":9,"n_rows":49,"n_cols":18,"rows_kept":49,"cut":false,"hidden":false,"merged":[]}
[]
[]
[]
[]
[]
[]
[]
[]
[]
[]
[]
[]
[null,"The purpose of this sheet is to re-align the current RTS Connection Rates to recover current wholesale connection costs."]
[]
[]
[]
[]
[]
[]
[]
[]
[null,"Rate Class",null,"Unit",null,"Current RTSR-Connection",null,"Loss Adjusted Billed kWh",null,"Loss Adjusted Billed kW",null,"Billed Amount",null,"Billed Amount %",null,"Current Wholesale Billing",null,"Proposed RTSR Connection"]
[]
[]
[null,{"$f":"IF('3. Rate Classes'!Q24=1,'3. Rate Classes'!C24, 0)","v":"Residential"},null,{"$f":"IF(ISERROR(VLOOKUP($B25, '3. Rate Classes'!$C$24:$H$45,6,0)), \"\", VLOOKUP($B25, '3. Rate Classes'!$C$24:$H$45,6,0))","v":"kWh"},null,{"$f":"IF(ISERROR(VLOOKUP($B25,'3. Rate Classes'!$C$24:$N$45, 11,0)), \"\", VLOOKUP($B25,'3. Rate Classes'!$C$24:$N$45, 11,0))","v":4.4999999999999997E-3},null,{"$f":"VLOOKUP('9. Adj Network to Current WS'!$B25, '4. RRR Data'!$B$27:$M$49,11,0)","v":26099792.084400002},null,{"$f":"VLOOKUP('9. Adj Network to Current WS'!$B25, '4. RRR Data'!$B$27:$M$49,12,0)","v":0},null,{"$f":"IF(F25=\"\", \"\", IF(D25=\"kWh\", F25*H25, F25*J25))","v":117449.06437979999},null,{"$f":"IF(ISERROR(L25/$L$49), \"\", L25/$L$49)","v":0.28133232107296341},null,{"$f":"IF(ISERROR('7. Current Wholesale'!$P$117*N25), \"\", '7. Current Wholesale'!$P$117*N25)","v":108176.21827130832},null,{"$f":"IF(D25=\"\",\"\",IF(D25=\"kWh\",IF(H25<>0,P25/H25,),IF(J25<>0,P25/J25,0)))","v":4.144715709669039E-3}]
[null,{"$f":"IF('3. Rate Classes'!Q25=1,'3. Rate Classes'!C25, 0)","v":"General Service Less Than 50 kW"},null,{"$f":"IF(ISERROR(VLOOKUP($B26, '3. Rate Classes'!$C$24:$H$45,6,0)), \"\", VLOOKUP($B26, '3. Rate Classes'!$C$24:$H$45,6,0))","v":"kWh"},null,{"$f":"IF(ISERROR(VLOOKUP($B26,'3. Rate Classes'!$C$24:$N$45, 11,0)), \"\", VLOOKUP($B26,'3. Rate Classes'!$C$24:$N$45, 11,0))","v":3.8E-3},null,{"$f":"VLOOKUP('9. Adj Network to Current WS'!$B26, '4. RRR Data'!$B$27:$M$49,11,0)","v":12429052.258800002},null,{"$f":"VLOOKUP('9. Adj Network to Current WS'!$B26, '4. RRR Data'!$B$27:$M$49,12,0)","v":0},null,47230.398583440008,null,0.11313361863583889,null,{"$f":"IF(ISERROR('7. Current Wholesale'!$P$117*N26), \"\", '7. Current Wholesale'!$P$117*N26)","v":43501.46110726981},null,3.4999821548316332E-3]
[null,{"$f":"IF('3. Rate Classes'!Q26=1,'3. Rate Classes'!C26, 0)","v":"General Service 50 to 999 kW"},null,{"$f":"IF(ISERROR(VLOOKUP($B27, '3. Rate Classes'!$C$24:$H$45,6,0)), \"\", VLOOKUP($B27, '3. Rate Classes'!$C$24:$H$45,6,0))","v":"kW"},null,{"$f":"IF(ISERROR(VLOOKUP($B27,'3. Rate Classes'!$C$24:$N$45, 11,0)), \"\", VLOOKUP($B27,'3. Rate Classes'!$C$24:$N$45, 11,0))","v":1.5142},null,{"$f":"VLOOKUP('9. Adj Network to Current WS'!$B27, '4. RRR Data'!$B$27:$M$49,11,0)","v":21787824},null,{"$f":"VLOOKUP('9. Adj Network to Current WS'!$B27, '4. RRR Data'!$B$27:$M$49,12,0)","v":67429},null,102100.9918,null,0.24456822332835787,null,{"$f":"IF(ISERROR('7. Current Wholesale'!$P$117*N27), \"\", '7. Current Wholesale'!$P$117*N27)","v":94039.907708055514},null,1.3946507839068578]
[null,{"$f":"IF('3. Rate Classes'!Q27=1,'3. Rate Classes'!C27, 0)","v":"General Service 1,000 to 4,999 kW"},null,{"$f":"IF(ISERROR(VLOOKUP($B28, '3. Rate Classes'!$C$24:$H$45,6,0)), \"\", VLOOKUP($B28, '3. Rate Classes'!$C$24:$H$45,6,0))","v":"kW"},null,{"$f":"IF(ISERROR(VLOOKUP($B28,'3. Rate Classes'!$C$24:$N$45, 11,0)), \"\", VLOOKUP($B28,'3. Rate Classes'!$C$24:$N$45, 11,0))","v":1.66},null,{"$f":"VLOOKUP('9. Adj Network to Current WS'!$B28, '4. RRR Data'!$B$27:$M$49,11,0)","v":42759000},null,{"$f":"VLOOKUP('9. Adj Network to Current WS'!$B28, '4. RRR Data'!$B$27:$M$49,12,0)","v":89331},null,148289.46,null,0.35520604776849568,null,{"$f":"IF(ISERROR('7. Current Wholesale'!$P$117*N28), \"\", '7. Current Wholesale'!$P$117*N28)","v":136581.7009867419},null,1.5289395729001343]
[null,{"$f":"IF('3. Rate Classes'!Q28=1,'3. Rate Classes'!C28, 0)","v":"Unmetered Scattered Load"},null,{"$f":"IF(ISERROR(VLOOKUP($B29, '3. Rate Classes'!$C$24:$H$45,6,0)), \"\", VLOOKUP($B29, '3. Rate Classes'!$C$24:$H$45,6,0))","v":"kWh"},null,{"$f":"IF(ISERROR(VLOOKUP($B29,'3. Rate Classes'!$C$24:$N$45, 11,0)), \"\", VLOOKUP($B29,'3. Rate Classes'!$C$24:$N$45, 11,0))","v":3.8E-3},null,{"$f":"VLOOKUP('9. Adj Network to Current WS'!$B29, '4. RRR Data'!$B$27:$M$49,11,0)","v":5377.2888000000003},null,{"$f":"VLOOKUP('9. Adj Network to Current WS'!$B29, '4. RRR Data'!$B$27:$M$49,12,0)","v":0},null,20.43369744,null,4.894597976794594E-5,null,{"$f":"IF(ISERROR('7. Current Wholesale'!$P$117*N29), \"\", '7. Current Wholesale'!$P$117*N29)","v":18.820414841376007},null,3.4999821548316328E-3]
[null,{"$f":"IF('3. Rate Classes'!Q29=1,'3. Rate Classes'!C29, 0)","v":"Sentinel Lighting"},null,{"$f":"IF(ISERROR(VLOOKUP($B30, '3. Rate Classes'!$C$24:$H$45,6,0)), \"\", VLOOKUP($B30, '3. Rate Classes'!$C$24:$H$45,6,0))","v":"kW"},null,{"$f":"IF(ISERROR(VLOOKUP($B30,'3. Rate Classes'!$C$24:$N$45, 11,0)), \"\", VLOOKUP($B30,'3. Rate Classes'!$C$24:$N$45, 11,0))","v":1.1951000000000001},null,{"$f":"VLOOKUP('9. Adj Network to Current WS'!$B30, '4. RRR Data'!$B$27:$M$49,11,0)","v":26097},null,{"$f":"VLOOKUP('9. Adj Network to Current WS'!$B30, '4. RRR Data'!$B$27:$M$49,12,0)","v":72},null,86.047200000000004,null,2.0611367681523223E-4,null,{"$f":"IF(ISERROR('7. Current Wholesale'!$P$117*N30), \"\", '7. Current Wholesale'!$P$117*N30)","v":79.253595914007505},null,1.1007443876945486]
[null,{"$f":"IF('3. Rate Classes'!Q30=1,'3. Rate Classes'!C30, 0)","v":"Street Lighting"},null,{"$f":"IF(ISERROR(VLOOKUP($B31, '3. Rate Classes'!$C$24:$H$45,6,0)), \"\", VLOOKUP($B31, '3. Rate Classes'!$C$24:$H$45,6,0))","v":"kW"},null,{"$f":"IF(ISERROR(VLOOKUP($B31,'3. Rate Classes'!$C$24:$N$45, 11,0)), \"\", VLOOKUP($B31,'3. Rate Classes'!$C$24:$N$45, 11,0))","v":1.1707000000000001},null,{"$f":"VLOOKUP('9. Adj Network to Current WS'!$B31, '4. RRR Data'!$B$27:$M$49,11,0)","v":707903},null,{"$f":"VLOOKUP('9. Adj Network to Current WS'!$B31, '4. RRR Data'!$B$27:$M$49,12,0)","v":1963},null,2298.0841,null,5.5047295377609476E-3,null,{"$f":"IF(ISERROR('7. Current Wholesale'!$P$117*N31), \"\", '7. Current Wholesale'!$P$117*N31)","v":2116.6456158690303},null,1.0782708180687877]
[null,{"$f":"IF('3. Rate Classes'!Q31=1,'3. Rate Classes'!C31, 0)","v":0},null,{"$f":"IF(ISERROR(VLOOKUP($B32, '3. Rate Classes'!$C$24:$H$45,6,0)), \"\", VLOOKUP($B32, '3. Rate Classes'!$C$24:$H$45,6,0))","v":""},null,{"$f":"IF(ISERROR(VLOOKUP($B32,'3. Rate Classes'!$C$24:$N$45, 11,0)), \"\", VLOOKUP($B32,'3. Rate Classes'!$C$24:$N$45, 11,0))","v":""},null,{"$f":"VLOOKUP('9. Adj Network to Current WS'!$B32, '4. RRR Data'!$B$27:$M$49,11,0)","v":0},null,{"$f":"VLOOKUP('9. Adj Network to Current WS'!$B32, '4. RRR Data'!$B$27:$M$49,12,0)","v":0},null,"",null,"",null,{"$f":"IF(ISERROR('7. Current Wholesale'!$P$117*N32), \"\", '7. Current Wholesale'!$P$117*N32)","v":""},null,""]
[null,{"$f":"IF('3. Rate Classes'!Q32=1,'3. Rate Classes'!C32, 0)","v":0},null,{"$f":"IF(ISERROR(VLOOKUP($B33, '3. Rate Classes'!$C$24:$H$45,6,0)), \"\", VLOOKUP($B33, '3. Rate Classes'!$C$24:$H$45,6,0))","v":""},null,{"$f":"IF(ISERROR(VLOOKUP($B33,'3. Rate Classes'!$C$24:$N$45, 11,0)), \"\", VLOOKUP($B33,'3. Rate Classes'!$C$24:$N$45, 11,0))","v":""},null,{"$f":"VLOOKUP('9. Adj Network to Current WS'!$B33, '4. RRR Data'!$B$27:$M$49,11,0)","v":0},null,{"$f":"VLOOKUP('9. Adj Network to Current WS'!$B33, '4. RRR Data'!$B$27:$M$49,12,0)","v":0},null,"",null,"",null,{"$f":"IF(ISERROR('7. Current Wholesale'!$P$117*N33), \"\", '7. Current Wholesale'!$P$117*N33)","v":""},null,""]
[null,{"$f":"IF('3. Rate Classes'!Q33=1,'3. Rate Classes'!C33, 0)","v":0},null,{"$f":"IF(ISERROR(VLOOKUP($B34, '3. Rate Classes'!$C$24:$H$45,6,0)), \"\", VLOOKUP($B34, '3. Rate Classes'!$C$24:$H$45,6,0))","v":""},null,{"$f":"IF(ISERROR(VLOOKUP($B34,'3. Rate Classes'!$C$24:$N$45, 11,0)), \"\", VLOOKUP($B34,'3. Rate Classes'!$C$24:$N$45, 11,0))","v":""},null,{"$f":"VLOOKUP('9. Adj Network to Current WS'!$B34, '4. RRR Data'!$B$27:$M$49,11,0)","v":0},null,{"$f":"VLOOKUP('9. Adj Network to Current WS'!$B34, '4. RRR Data'!$B$27:$M$49,12,0)","v":0},null,"",null,"",null,{"$f":"IF(ISERROR('7. Current Wholesale'!$P$117*N34), \"\", '7. Current Wholesale'!$P$117*N34)","v":""},null,""]
[null,{"$f":"IF('3. Rate Classes'!Q34=1,'3. Rate Classes'!C34, 0)","v":0},null,{"$f":"IF(ISERROR(VLOOKUP($B35, '3. Rate Classes'!$C$24:$H$45,6,0)), \"\", VLOOKUP($B35, '3. Rate Classes'!$C$24:$H$45,6,0))","v":""},null,{"$f":"IF(ISERROR(VLOOKUP($B35,'3. Rate Classes'!$C$24:$N$45, 11,0)), \"\", VLOOKUP($B35,'3. Rate Classes'!$C$24:$N$45, 11,0))","v":""},null,{"$f":"VLOOKUP('9. Adj Network to Current WS'!$B35, '4. RRR Data'!$B$27:$M$49,11,0)","v":0},null,{"$f":"VLOOKUP('9. Adj Network to Current WS'!$B35, '4. RRR Data'!$B$27:$M$49,12,0)","v":0},null,"",null,"",null,{"$f":"IF(ISERROR('7. Current Wholesale'!$P$117*N35), \"\", '7. Current Wholesale'!$P$117*N35)","v":""},null,""]
[null,{"$f":"IF('3. Rate Classes'!Q35=1,'3. Rate Classes'!C35, 0)","v":0},null,{"$f":"IF(ISERROR(VLOOKUP($B36, '3. Rate Classes'!$C$24:$H$45,6,0)), \"\", VLOOKUP($B36, '3. Rate Classes'!$C$24:$H$45,6,0))","v":""},null,{"$f":"IF(ISERROR(VLOOKUP($B36,'3. Rate Classes'!$C$24:$N$45, 11,0)), \"\", VLOOKUP($B36,'3. Rate Classes'!$C$24:$N$45, 11,0))","v":""},null,{"$f":"VLOOKUP('9. Adj Network to Current WS'!$B36, '4. RRR Data'!$B$27:$M$49,11,0)","v":0},null,{"$f":"VLOOKUP('9. Adj Network to Current WS'!$B36, '4. RRR Data'!$B$27:$M$49,12,0)","v":0},null,"",null,"",null,{"$f":"IF(ISERROR('7. Current Wholesale'!$P$117*N36), \"\", '7. Current Wholesale'!$P$117*N36)","v":""},null,""]
[null,{"$f":"IF('3. Rate Classes'!Q36=1,'3. Rate Classes'!C36, 0)","v":0},null,{"$f":"IF(ISERROR(VLOOKUP($B37, '3. Rate Classes'!$C$24:$H$45,6,0)), \"\", VLOOKUP($B37, '3. Rate Classes'!$C$24:$H$45,6,0))","v":""},null,{"$f":"IF(ISERROR(VLOOKUP($B37,'3. Rate Classes'!$C$24:$N$45, 11,0)), \"\", VLOOKUP($B37,'3. Rate Classes'!$C$24:$N$45, 11,0))","v":""},null,{"$f":"VLOOKUP('9. Adj Network to Current WS'!$B37, '4. RRR Data'!$B$27:$M$49,11,0)","v":0},null,{"$f":"VLOOKUP('9. Adj Network to Current WS'!$B37, '4. RRR Data'!$B$27:$M$49,12,0)","v":0},null,"",null,"",null,{"$f":"IF(ISERROR('7. Current Wholesale'!$P$117*N37), \"\", '7. Current Wholesale'!$P$117*N37)","v":""},null,""]
[null,{"$f":"IF('3. Rate Classes'!Q37=1,'3. Rate Classes'!C37, 0)","v":0},null,{"$f":"IF(ISERROR(VLOOKUP($B38, '3. Rate Classes'!$C$24:$H$45,6,0)), \"\", VLOOKUP($B38, '3. Rate Classes'!$C$24:$H$45,6,0))","v":""},null,{"$f":"IF(ISERROR(VLOOKUP($B38,'3. Rate Classes'!$C$24:$N$45, 11,0)), \"\", VLOOKUP($B38,'3. Rate Classes'!$C$24:$N$45, 11,0))","v":""},null,{"$f":"VLOOKUP('9. Adj Network to Current WS'!$B38, '4. RRR Data'!$B$27:$M$49,11,0)","v":0},null,{"$f":"VLOOKUP('9. Adj Network to Current WS'!$B38, '4. RRR Data'!$B$27:$M$49,12,0)","v":0},null,"",null,"",null,{"$f":"IF(ISERROR('7. Current Wholesale'!$P$117*N38), \"\", '7. Current Wholesale'!$P$117*N38)","v":""},null,""]
[null,{"$f":"IF('3. Rate Classes'!Q38=1,'3. Rate Classes'!C38, 0)","v":0},null,{"$f":"IF(ISERROR(VLOOKUP($B39, '3. Rate Classes'!$C$24:$H$45,6,0)), \"\", VLOOKUP($B39, '3. Rate Classes'!$C$24:$H$45,6,0))","v":""},null,{"$f":"IF(ISERROR(VLOOKUP($B39,'3. Rate Classes'!$C$24:$N$45, 11,0)), \"\", VLOOKUP($B39,'3. Rate Classes'!$C$24:$N$45, 11,0))","v":""},null,{"$f":"VLOOKUP('9. Adj Network to Current WS'!$B39, '4. RRR Data'!$B$27:$M$49,11,0)","v":0},null,{"$f":"VLOOKUP('9. Adj Network to Current WS'!$B39, '4. RRR Data'!$B$27:$M$49,12,0)","v":0},null,"",null,"",null,{"$f":"IF(ISERROR('7. Current Wholesale'!$P$117*N39), \"\", '7. Current Wholesale'!$P$117*N39)","v":""},null,""]
[null,{"$f":"IF('3. Rate Classes'!Q39=1,'3. Rate Classes'!C39, 0)","v":0},null,{"$f":"IF(ISERROR(VLOOKUP($B40, '3. Rate Classes'!$C$24:$H$45,6,0)), \"\", VLOOKUP($B40, '3. Rate Classes'!$C$24:$H$45,6,0))","v":""},null,{"$f":"IF(ISERROR(VLOOKUP($B40,'3. Rate Classes'!$C$24:$N$45, 11,0)), \"\", VLOOKUP($B40,'3. Rate Classes'!$C$24:$N$45, 11,0))","v":""},null,{"$f":"VLOOKUP('9. Adj Network to Current WS'!$B40, '4. RRR Data'!$B$27:$M$49,11,0)","v":0},null,{"$f":"VLOOKUP('9. Adj Network to Current WS'!$B40, '4. RRR Data'!$B$27:$M$49,12,0)","v":0},null,"",null,"",null,{"$f":"IF(ISERROR('7. Current Wholesale'!$P$117*N40), \"\", '7. Current Wholesale'!$P$117*N40)","v":""},null,""]
[null,{"$f":"IF('3. Rate Classes'!Q40=1,'3. Rate Classes'!C40, 0)","v":0},null,{"$f":"IF(ISERROR(VLOOKUP($B41, '3. Rate Classes'!$C$24:$H$45,6,0)), \"\", VLOOKUP($B41, '3. Rate Classes'!$C$24:$H$45,6,0))","v":""},null,{"$f":"IF(ISERROR(VLOOKUP($B41,'3. Rate Classes'!$C$24:$N$45, 11,0)), \"\", VLOOKUP($B41,'3. Rate Classes'!$C$24:$N$45, 11,0))","v":""},null,{"$f":"VLOOKUP('9. Adj Network to Current WS'!$B41, '4. RRR Data'!$B$27:$M$49,11,0)","v":0},null,{"$f":"VLOOKUP('9. Adj Network to Current WS'!$B41, '4. RRR Data'!$B$27:$M$49,12,0)","v":0},null,"",null,"",null,{"$f":"IF(ISERROR('7. Current Wholesale'!$P$117*N41), \"\", '7. Current Wholesale'!$P$117*N41)","v":""},null,""]
[null,{"$f":"IF('3. Rate Classes'!Q41=1,'3. Rate Classes'!C41, 0)","v":0},null,{"$f":"IF(ISERROR(VLOOKUP($B42, '3. Rate Classes'!$C$24:$H$45,6,0)), \"\", VLOOKUP($B42, '3. Rate Classes'!$C$24:$H$45,6,0))","v":""},null,{"$f":"IF(ISERROR(VLOOKUP($B42,'3. Rate Classes'!$C$24:$N$45, 11,0)), \"\", VLOOKUP($B42,'3. Rate Classes'!$C$24:$N$45, 11,0))","v":""},null,{"$f":"VLOOKUP('9. Adj Network to Current WS'!$B42, '4. RRR Data'!$B$27:$M$49,11,0)","v":0},null,{"$f":"VLOOKUP('9. Adj Network to Current WS'!$B42, '4. RRR Data'!$B$27:$M$49,12,0)","v":0},null,"",null,"",null,{"$f":"IF(ISERROR('7. Current Wholesale'!$P$117*N42), \"\", '7. Current Wholesale'!$P$117*N42)","v":""},null,""]
[null,{"$f":"IF('3. Rate Classes'!Q42=1,'3. Rate Classes'!C42, 0)","v":0},null,{"$f":"IF(ISERROR(VLOOKUP($B43, '3. Rate Classes'!$C$24:$H$45,6,0)), \"\", VLOOKUP($B43, '3. Rate Classes'!$C$24:$H$45,6,0))","v":""},null,{"$f":"IF(ISERROR(VLOOKUP($B43,'3. Rate Classes'!$C$24:$N$45, 11,0)), \"\", VLOOKUP($B43,'3. Rate Classes'!$C$24:$N$45, 11,0))","v":""},null,{"$f":"VLOOKUP('9. Adj Network to Current WS'!$B43, '4. RRR Data'!$B$27:$M$49,11,0)","v":0},null,{"$f":"VLOOKUP('9. Adj Network to Current WS'!$B43, '4. RRR Data'!$B$27:$M$49,12,0)","v":0},null,"",null,"",null,{"$f":"IF(ISERROR('7. Current Wholesale'!$P$117*N43), \"\", '7. Current Wholesale'!$P$117*N43)","v":""},null,""]
[null,{"$f":"IF('3. Rate Classes'!Q43=1,'3. Rate Classes'!C43, 0)","v":0},null,{"$f":"IF(ISERROR(VLOOKUP($B44, '3. Rate Classes'!$C$24:$H$45,6,0)), \"\", VLOOKUP($B44, '3. Rate Classes'!$C$24:$H$45,6,0))","v":""},null,{"$f":"IF(ISERROR(VLOOKUP($B44,'3. Rate Classes'!$C$24:$N$45, 11,0)), \"\", VLOOKUP($B44,'3. Rate Classes'!$C$24:$N$45, 11,0))","v":""},null,{"$f":"VLOOKUP('9. Adj Network to Current WS'!$B44, '4. RRR Data'!$B$27:$M$49,11,0)","v":0},null,{"$f":"VLOOKUP('9. Adj Network to Current WS'!$B44, '4. RRR Data'!$B$27:$M$49,12,0)","v":0},null,"",null,"",null,{"$f":"IF(ISERROR('7. Current Wholesale'!$P$117*N44), \"\", '7. Current Wholesale'!$P$117*N44)","v":""},null,""]
[null,{"$f":"IF('3. Rate Classes'!Q44=1,'3. Rate Classes'!C44, 0)","v":0},null,{"$f":"IF(ISERROR(VLOOKUP($B45, '3. Rate Classes'!$C$24:$H$45,6,0)), \"\", VLOOKUP($B45, '3. Rate Classes'!$C$24:$H$45,6,0))","v":""},null,{"$f":"IF(ISERROR(VLOOKUP($B45,'3. Rate Classes'!$C$24:$N$45, 11,0)), \"\", VLOOKUP($B45,'3. Rate Classes'!$C$24:$N$45, 11,0))","v":""},null,{"$f":"VLOOKUP('9. Adj Network to Current WS'!$B45, '4. RRR Data'!$B$27:$M$49,11,0)","v":0},null,{"$f":"VLOOKUP('9. Adj Network to Current WS'!$B45, '4. RRR Data'!$B$27:$M$49,12,0)","v":0},null,"",null,"",null,{"$f":"IF(ISERROR('7. Current Wholesale'!$P$117*N45), \"\", '7. Current Wholesale'!$P$117*N45)","v":""},null,""]
[null,{"$f":"IF('3. Rate Classes'!Q45=1,'3. Rate Classes'!C45, 0)","v":0},null,{"$f":"IF(ISERROR(VLOOKUP($B46, '3. Rate Classes'!$C$24:$H$45,6,0)), \"\", VLOOKUP($B46, '3. Rate Classes'!$C$24:$H$45,6,0))","v":""},null,{"$f":"IF(ISERROR(VLOOKUP($B46,'3. Rate Classes'!$C$24:$N$45, 11,0)), \"\", VLOOKUP($B46,'3. Rate Classes'!$C$24:$N$45, 11,0))","v":""},null,{"$f":"VLOOKUP('9. Adj Network to Current WS'!$B46, '4. RRR Data'!$B$27:$M$49,11,0)","v":0},null,{"$f":"VLOOKUP('9. Adj Network to Current WS'!$B46, '4. RRR Data'!$B$27:$M$49,12,0)","v":0},null,"",null,"",null,{"$f":"IF(ISERROR('7. Current Wholesale'!$P$117*N46), \"\", '7. Current Wholesale'!$P$117*N46)","v":""},null,""]
[]
[]
[null,null,null,null,null,null,null,null,null,null,null,{"$f":"SUM(L25:L46)","v":417474.47976068}]

{"sheet":"11. Adj Network to Forecast WS","index":10,"n_rows":49,"n_cols":18,"rows_kept":49,"cut":false,"hidden":false,"merged":[]}
[]
[]
[]
[]
[]
[]
[]
[]
[]
[]
[]
[]
[null,"The purpose of this sheet is to update the re-align RTS Network Rates to recover forecast wholesale network costs."]
[]
[]
[]
[]
[]
[]
[]
[]
[null,"Rate Class",null,"Unit",null,"Adjusted RTSR-Network",null,"Loss Adjusted Billed kWh",null,"Loss Adjusted Billed kW",null,"Billed Amount",null,"Billed Amount %",null,"Forecast Wholesale Billing",null,"Proposed RTSR Network"]
[]
[]
[null,{"$f":"IF('3. Rate Classes'!Q24=1,'3. Rate Classes'!C24, 0)","v":"Residential"},null,{"$f":"IF(ISERROR(VLOOKUP($B25, '3. Rate Classes'!$C$24:$H$45,6,0)), \"\", VLOOKUP($B25, '3. Rate Classes'!$C$24:$H$45,6,0))","v":"kWh"},null,{"$f":"VLOOKUP($B25, '9. Adj Network to Current WS'!$B$25:$R$47, 17,0)","v":6.5048292110098582E-3},null,{"$f":"VLOOKUP('9. Adj Network to Current WS'!$B25, '4. RRR Data'!$B$27:$M$49,11,0)","v":26099792.084400002},null,{"$f":"VLOOKUP('9. Adj Network to Current WS'!$B25, '4. RRR Data'!$B$27:$M$49,12,0)","v":0},null,{"$f":"IF(F25=\"\", \"\", IF(D25=\"kWh\", F25*H25, F25*J25))","v":169774.68995188901},null,{"$f":"IF(ISERROR(L25/$L$49), \"\", L25/$L$49)","v":0.26102427760511582},null,{"$f":"IF(ISERROR('8. Forecast Wholesale'!$F$113*N25), \"\", '8. Forecast Wholesale'!$F$113*N25)","v":172326.54159703985},null,{"$f":"IF(D25=\"\",\"\",IF(D25=\"kWh\",IF(H25<>0,P25/H25,),IF(J25<>0,P25/J25,0)))","v":6.6026020835637392E-3}]
[null,{"$f":"IF('3. Rate Classes'!Q25=1,'3. Rate Classes'!C25, 0)","v":"General Service Less Than 50 kW"},null,{"$f":"IF(ISERROR(VLOOKUP($B26, '3. Rate Classes'!$C$24:$H$45,6,0)), \"\", VLOOKUP($B26, '3. Rate Classes'!$C$24:$H$45,6,0))","v":"kWh"},null,{"$f":"VLOOKUP($B26, '9. Adj Network to Current WS'!$B$25:$R$47, 17,0)","v":6.0334647754294339E-3},null,{"$f":"VLOOKUP('9. Adj Network to Current WS'!$B26, '4. RRR Data'!$B$27:$M$49,11,0)","v":12429052.258800002},null,{"$f":"VLOOKUP('9. Adj Network to Current WS'!$B26, '4. RRR Data'!$B$27:$M$49,12,0)","v":0},null,{"$f":"IF(F26=\"\", \"\", IF(D26=\"kWh\", F26*H26, F26*J26))","v":74990.248995441449},null,0.11529560488085622,null,{"$f":"IF(ISERROR('8. Forecast Wholesale'!$F$113*N26), \"\", '8. Forecast Wholesale'!$F$113*N26)","v":76117.413417438132},null,6.1241526572185408E-3]
[null,{"$f":"IF('3. Rate Classes'!Q26=1,'3. Rate Classes'!C26, 0)","v":"General Service 50 to 999 kW"},null,{"$f":"IF(ISERROR(VLOOKUP($B27, '3. Rate Classes'!$C$24:$H$45,6,0)), \"\", VLOOKUP($B27, '3. Rate Classes'!$C$24:$H$45,6,0))","v":"kW"},null,{"$f":"VLOOKUP($B27, '9. Adj Network to Current WS'!$B$25:$R$47, 17,0)","v":2.4756060156683892},null,{"$f":"VLOOKUP('9. Adj Network to Current WS'!$B27, '4. RRR Data'!$B$27:$M$49,11,0)","v":21787824},null,{"$f":"VLOOKUP('9. Adj Network to Current WS'!$B27, '4. RRR Data'!$B$27:$M$49,12,0)","v":67429},null,166927.63803050382,null,0.25664700752266467,null,{"$f":"IF(ISERROR('8. Forecast Wholesale'!$F$113*N27), \"\", '8. Forecast Wholesale'!$F$113*N27)","v":169436.6961701476},null,2.5128163871649822]
[null,{"$f":"IF('3. Rate Classes'!Q27=1,'3. Rate Classes'!C27, 0)","v":"General Service 1,000 to 4,999 kW"},null,{"$f":"IF(ISERROR(VLOOKUP($B28, '3. Rate Classes'!$C$24:$H$45,6,0)), \"\", VLOOKUP($B28, '3. Rate Classes'!$C$24:$H$45,6,0))","v":"kW"},null,{"$f":"VLOOKUP($B28, '9. Adj Network to Current WS'!$B$25:$R$47, 17,0)","v":2.6294593674418403},null,{"$f":"VLOOKUP('9. Adj Network to Current WS'!$B28, '4. RRR Data'!$B$27:$M$49,11,0)","v":42759000},null,{"$f":"VLOOKUP('9. Adj Network to Current WS'!$B28, '4. RRR Data'!$B$27:$M$49,12,0)","v":89331},null,234892.23475294703,null,0.36114085031646426,null,{"$f":"IF(ISERROR('8. Forecast Wholesale'!$F$113*N28), \"\", '8. Forecast Wholesale'!$F$113*N28)","v":238422.8560478958},null,2.6689822799240552]
[null,{"$f":"IF('3. Rate Classes'!Q28=1,'3. Rate Classes'!C28, 0)","v":"Unmetered Scattered Load"},null,{"$f":"IF(ISERROR(VLOOKUP($B29, '3. Rate Classes'!$C$24:$H$45,6,0)), \"\", VLOOKUP($B29, '3. Rate Classes'!$C$24:$H$45,6,0))","v":"kWh"},null,{"$f":"VLOOKUP($B29, '9. Adj Network to Current WS'!$B$25:$R$47, 17,0)","v":6.0334647754294339E-3},null,{"$f":"VLOOKUP('9. Adj Network to Current WS'!$B29, '4. RRR Data'!$B$27:$M$49,11,0)","v":5377.2888000000003},null,{"$f":"VLOOKUP('9. Adj Network to Current WS'!$B29, '4. RRR Data'!$B$27:$M$49,12,0)","v":0},null,32.443682562111213,null,4.9881338649622117E-5,null,{"$f":"IF(ISERROR('8. Forecast Wholesale'!$F$113*N29), \"\", '8. Forecast Wholesale'!$F$113*N29)","v":32.931337493151503},null,6.1241526572185416E-3]
[null,{"$f":"IF('3. Rate Classes'!Q29=1,'3. Rate Classes'!C29, 0)","v":"Sentinel Lighting"},null,{"$f":"IF(ISERROR(VLOOKUP($B30, '3. Rate Classes'!$C$24:$H$45,6,0)), \"\", VLOOKUP($B30, '3. Rate Classes'!$C$24:$H$45,6,0))","v":"kW"},null,{"$f":"VLOOKUP($B30, '9. Adj Network to Current WS'!$B$25:$R$47, 17,0)","v":1.8764075451585538},null,{"$f":"VLOOKUP('9. Adj Network to Current WS'!$B30, '4. RRR Data'!$B$27:$M$49,11,0)","v":26097},null,{"$f":"VLOOKUP('9. Adj Network to Current WS'!$B30, '4. RRR Data'!$B$27:$M$49,12,0)","v":72},null,135.10134325141587,null,2.0771488692263249E-4,null,{"$f":"IF(ISERROR('8. Forecast Wholesale'!$F$113*N30), \"\", '8. Forecast Wholesale'!$F$113*N30)","v":137.13202630043756},null,1.9046114763949662]
[null,{"$f":"IF('3. Rate Classes'!Q30=1,'3. Rate Classes'!C30, 0)","v":"Street Lighting"},null,{"$f":"IF(ISERROR(VLOOKUP($B31, '3. Rate Classes'!$C$24:$H$45,6,0)), \"\", VLOOKUP($B31, '3. Rate Classes'!$C$24:$H$45,6,0))","v":"kW"},null,{"$f":"VLOOKUP($B31, '9. Adj Network to Current WS'!$B$25:$R$47, 17,0)","v":1.8669802564469453},null,{"$f":"VLOOKUP('9. Adj Network to Current WS'!$B31, '4. RRR Data'!$B$27:$M$49,11,0)","v":707903},null,{"$f":"VLOOKUP('9. Adj Network to Current WS'!$B31, '4. RRR Data'!$B$27:$M$49,12,0)","v":1963},null,3664.8822434053536,null,5.6346634493267987E-3,null,{"$f":"IF(ISERROR('8. Forecast Wholesale'!$F$113*N31), \"\", '8. Forecast Wholesale'!$F$113*N31)","v":3719.9684036850063},null,1.8950424878680623]
[null,{"$f":"IF('3. Rate Classes'!Q31=1,'3. Rate Classes'!C31, 0)","v":0},null,{"$f":"IF(ISERROR(VLOOKUP($B32, '3. Rate Classes'!$C$24:$H$45,6,0)), \"\", VLOOKUP($B32, '3. Rate Classes'!$C$24:$H$45,6,0))","v":""},null,{"$f":"VLOOKUP($B32, '9. Adj Network to Current WS'!$B$25:$R$47, 17,0)","v":""},null,{"$f":"VLOOKUP('9. Adj Network to Current WS'!$B32, '4. RRR Data'!$B$27:$M$49,11,0)","v":0},null,{"$f":"VLOOKUP('9. Adj Network to Current WS'!$B32, '4. RRR Data'!$B$27:$M$49,12,0)","v":0},null,"",null,"",null,{"$f":"IF(ISERROR('8. Forecast Wholesale'!$F$113*N32), \"\", '8. Forecast Wholesale'!$F$113*N32)","v":""},null,""]
[null,{"$f":"IF('3. Rate Classes'!Q32=1,'3. Rate Classes'!C32, 0)","v":0},null,{"$f":"IF(ISERROR(VLOOKUP($B33, '3. Rate Classes'!$C$24:$H$45,6,0)), \"\", VLOOKUP($B33, '3. Rate Classes'!$C$24:$H$45,6,0))","v":""},null,{"$f":"VLOOKUP($B33, '9. Adj Network to Current WS'!$B$25:$R$47, 17,0)","v":""},null,{"$f":"VLOOKUP('9. Adj Network to Current WS'!$B33, '4. RRR Data'!$B$27:$M$49,11,0)","v":0},null,{"$f":"VLOOKUP('9. Adj Network to Current WS'!$B33, '4. RRR Data'!$B$27:$M$49,12,0)","v":0},null,"",null,"",null,{"$f":"IF(ISERROR('8. Forecast Wholesale'!$F$113*N33), \"\", '8. Forecast Wholesale'!$F$113*N33)","v":""},null,""]
[null,{"$f":"IF('3. Rate Classes'!Q33=1,'3. Rate Classes'!C33, 0)","v":0},null,{"$f":"IF(ISERROR(VLOOKUP($B34, '3. Rate Classes'!$C$24:$H$45,6,0)), \"\", VLOOKUP($B34, '3. Rate Classes'!$C$24:$H$45,6,0))","v":""},null,{"$f":"VLOOKUP($B34, '9. Adj Network to Current WS'!$B$25:$R$47, 17,0)","v":""},null,{"$f":"VLOOKUP('9. Adj Network to Current WS'!$B34, '4. RRR Data'!$B$27:$M$49,11,0)","v":0},null,{"$f":"VLOOKUP('9. Adj Network to Current WS'!$B34, '4. RRR Data'!$B$27:$M$49,12,0)","v":0},null,"",null,"",null,{"$f":"IF(ISERROR('8. Forecast Wholesale'!$F$113*N34), \"\", '8. Forecast Wholesale'!$F$113*N34)","v":""},null,""]
[null,{"$f":"IF('3. Rate Classes'!Q34=1,'3. Rate Classes'!C34, 0)","v":0},null,{"$f":"IF(ISERROR(VLOOKUP($B35, '3. Rate Classes'!$C$24:$H$45,6,0)), \"\", VLOOKUP($B35, '3. Rate Classes'!$C$24:$H$45,6,0))","v":""},null,{"$f":"VLOOKUP($B35, '9. Adj Network to Current WS'!$B$25:$R$47, 17,0)","v":""},null,{"$f":"VLOOKUP('9. Adj Network to Current WS'!$B35, '4. RRR Data'!$B$27:$M$49,11,0)","v":0},null,{"$f":"VLOOKUP('9. Adj Network to Current WS'!$B35, '4. RRR Data'!$B$27:$M$49,12,0)","v":0},null,"",null,"",null,{"$f":"IF(ISERROR('8. Forecast Wholesale'!$F$113*N35), \"\", '8. Forecast Wholesale'!$F$113*N35)","v":""},null,""]
[null,{"$f":"IF('3. Rate Classes'!Q35=1,'3. Rate Classes'!C35, 0)","v":0},null,{"$f":"IF(ISERROR(VLOOKUP($B36, '3. Rate Classes'!$C$24:$H$45,6,0)), \"\", VLOOKUP($B36, '3. Rate Classes'!$C$24:$H$45,6,0))","v":""},null,{"$f":"VLOOKUP($B36, '9. Adj Network to Current WS'!$B$25:$R$47, 17,0)","v":""},null,{"$f":"VLOOKUP('9. Adj Network to Current WS'!$B36, '4. RRR Data'!$B$27:$M$49,11,0)","v":0},null,{"$f":"VLOOKUP('9. Adj Network to Current WS'!$B36, '4. RRR Data'!$B$27:$M$49,12,0)","v":0},null,"",null,"",null,{"$f":"IF(ISERROR('8. Forecast Wholesale'!$F$113*N36), \"\", '8. Forecast Wholesale'!$F$113*N36)","v":""},null,""]
[null,{"$f":"IF('3. Rate Classes'!Q36=1,'3. Rate Classes'!C36, 0)","v":0},null,{"$f":"IF(ISERROR(VLOOKUP($B37, '3. Rate Classes'!$C$24:$H$45,6,0)), \"\", VLOOKUP($B37, '3. Rate Classes'!$C$24:$H$45,6,0))","v":""},null,{"$f":"VLOOKUP($B37, '9. Adj Network to Current WS'!$B$25:$R$47, 17,0)","v":""},null,{"$f":"VLOOKUP('9. Adj Network to Current WS'!$B37, '4. RRR Data'!$B$27:$M$49,11,0)","v":0},null,{"$f":"VLOOKUP('9. Adj Network to Current WS'!$B37, '4. RRR Data'!$B$27:$M$49,12,0)","v":0},null,"",null,"",null,{"$f":"IF(ISERROR('8. Forecast Wholesale'!$F$113*N37), \"\", '8. Forecast Wholesale'!$F$113*N37)","v":""},null,""]
[null,{"$f":"IF('3. Rate Classes'!Q37=1,'3. Rate Classes'!C37, 0)","v":0},null,{"$f":"IF(ISERROR(VLOOKUP($B38, '3. Rate Classes'!$C$24:$H$45,6,0)), \"\", VLOOKUP($B38, '3. Rate Classes'!$C$24:$H$45,6,0))","v":""},null,{"$f":"VLOOKUP($B38, '9. Adj Network to Current WS'!$B$25:$R$47, 17,0)","v":""},null,{"$f":"VLOOKUP('9. Adj Network to Current WS'!$B38, '4. RRR Data'!$B$27:$M$49,11,0)","v":0},null,{"$f":"VLOOKUP('9. Adj Network to Current WS'!$B38, '4. RRR Data'!$B$27:$M$49,12,0)","v":0},null,"",null,"",null,{"$f":"IF(ISERROR('8. Forecast Wholesale'!$F$113*N38), \"\", '8. Forecast Wholesale'!$F$113*N38)","v":""},null,""]
[null,{"$f":"IF('3. Rate Classes'!Q38=1,'3. Rate Classes'!C38, 0)","v":0},null,{"$f":"IF(ISERROR(VLOOKUP($B39, '3. Rate Classes'!$C$24:$H$45,6,0)), \"\", VLOOKUP($B39, '3. Rate Classes'!$C$24:$H$45,6,0))","v":""},null,{"$f":"VLOOKUP($B39, '9. Adj Network to Current WS'!$B$25:$R$47, 17,0)","v":""},null,{"$f":"VLOOKUP('9. Adj Network to Current WS'!$B39, '4. RRR Data'!$B$27:$M$49,11,0)","v":0},null,{"$f":"VLOOKUP('9. Adj Network to Current WS'!$B39, '4. RRR Data'!$B$27:$M$49,12,0)","v":0},null,"",null,"",null,{"$f":"IF(ISERROR('8. Forecast Wholesale'!$F$113*N39), \"\", '8. Forecast Wholesale'!$F$113*N39)","v":""},null,""]
[null,{"$f":"IF('3. Rate Classes'!Q39=1,'3. Rate Classes'!C39, 0)","v":0},null,{"$f":"IF(ISERROR(VLOOKUP($B40, '3. Rate Classes'!$C$24:$H$45,6,0)), \"\", VLOOKUP($B40, '3. Rate Classes'!$C$24:$H$45,6,0))","v":""},null,{"$f":"VLOOKUP($B40, '9. Adj Network to Current WS'!$B$25:$R$47, 17,0)","v":""},null,{"$f":"VLOOKUP('9. Adj Network to Current WS'!$B40, '4. RRR Data'!$B$27:$M$49,11,0)","v":0},null,{"$f":"VLOOKUP('9. Adj Network to Current WS'!$B40, '4. RRR Data'!$B$27:$M$49,12,0)","v":0},null,"",null,"",null,{"$f":"IF(ISERROR('8. Forecast Wholesale'!$F$113*N40), \"\", '8. Forecast Wholesale'!$F$113*N40)","v":""},null,""]
[null,{"$f":"IF('3. Rate Classes'!Q40=1,'3. Rate Classes'!C40, 0)","v":0},null,{"$f":"IF(ISERROR(VLOOKUP($B41, '3. Rate Classes'!$C$24:$H$45,6,0)), \"\", VLOOKUP($B41, '3. Rate Classes'!$C$24:$H$45,6,0))","v":""},null,{"$f":"VLOOKUP($B41, '9. Adj Network to Current WS'!$B$25:$R$47, 17,0)","v":""},null,{"$f":"VLOOKUP('9. Adj Network to Current WS'!$B41, '4. RRR Data'!$B$27:$M$49,11,0)","v":0},null,{"$f":"VLOOKUP('9. Adj Network to Current WS'!$B41, '4. RRR Data'!$B$27:$M$49,12,0)","v":0},null,"",null,"",null,{"$f":"IF(ISERROR('8. Forecast Wholesale'!$F$113*N41), \"\", '8. Forecast Wholesale'!$F$113*N41)","v":""},null,""]
[null,{"$f":"IF('3. Rate Classes'!Q41=1,'3. Rate Classes'!C41, 0)","v":0},null,{"$f":"IF(ISERROR(VLOOKUP($B42, '3. Rate Classes'!$C$24:$H$45,6,0)), \"\", VLOOKUP($B42, '3. Rate Classes'!$C$24:$H$45,6,0))","v":""},null,{"$f":"VLOOKUP($B42, '9. Adj Network to Current WS'!$B$25:$R$47, 17,0)","v":""},null,{"$f":"VLOOKUP('9. Adj Network to Current WS'!$B42, '4. RRR Data'!$B$27:$M$49,11,0)","v":0},null,{"$f":"VLOOKUP('9. Adj Network to Current WS'!$B42, '4. RRR Data'!$B$27:$M$49,12,0)","v":0},null,"",null,"",null,{"$f":"IF(ISERROR('8. Forecast Wholesale'!$F$113*N42), \"\", '8. Forecast Wholesale'!$F$113*N42)","v":""},null,""]
[null,{"$f":"IF('3. Rate Classes'!Q42=1,'3. Rate Classes'!C42, 0)","v":0},null,{"$f":"IF(ISERROR(VLOOKUP($B43, '3. Rate Classes'!$C$24:$H$45,6,0)), \"\", VLOOKUP($B43, '3. Rate Classes'!$C$24:$H$45,6,0))","v":""},null,{"$f":"VLOOKUP($B43, '9. Adj Network to Current WS'!$B$25:$R$47, 17,0)","v":""},null,{"$f":"VLOOKUP('9. Adj Network to Current WS'!$B43, '4. RRR Data'!$B$27:$M$49,11,0)","v":0},null,{"$f":"VLOOKUP('9. Adj Network to Current WS'!$B43, '4. RRR Data'!$B$27:$M$49,12,0)","v":0},null,"",null,"",null,{"$f":"IF(ISERROR('8. Forecast Wholesale'!$F$113*N43), \"\", '8. Forecast Wholesale'!$F$113*N43)","v":""},null,""]
[null,{"$f":"IF('3. Rate Classes'!Q43=1,'3. Rate Classes'!C43, 0)","v":0},null,{"$f":"IF(ISERROR(VLOOKUP($B44, '3. Rate Classes'!$C$24:$H$45,6,0)), \"\", VLOOKUP($B44, '3. Rate Classes'!$C$24:$H$45,6,0))","v":""},null,{"$f":"VLOOKUP($B44, '9. Adj Network to Current WS'!$B$25:$R$47, 17,0)","v":""},null,{"$f":"VLOOKUP('9. Adj Network to Current WS'!$B44, '4. RRR Data'!$B$27:$M$49,11,0)","v":0},null,{"$f":"VLOOKUP('9. Adj Network to Current WS'!$B44, '4. RRR Data'!$B$27:$M$49,12,0)","v":0},null,"",null,"",null,{"$f":"IF(ISERROR('8. Forecast Wholesale'!$F$113*N44), \"\", '8. Forecast Wholesale'!$F$113*N44)","v":""},null,""]
[null,{"$f":"IF('3. Rate Classes'!Q44=1,'3. Rate Classes'!C44, 0)","v":0},null,{"$f":"IF(ISERROR(VLOOKUP($B45, '3. Rate Classes'!$C$24:$H$45,6,0)), \"\", VLOOKUP($B45, '3. Rate Classes'!$C$24:$H$45,6,0))","v":""},null,{"$f":"VLOOKUP($B45, '9. Adj Network to Current WS'!$B$25:$R$47, 17,0)","v":""},null,{"$f":"VLOOKUP('9. Adj Network to Current WS'!$B45, '4. RRR Data'!$B$27:$M$49,11,0)","v":0},null,{"$f":"VLOOKUP('9. Adj Network to Current WS'!$B45, '4. RRR Data'!$B$27:$M$49,12,0)","v":0},null,"",null,"",null,{"$f":"IF(ISERROR('8. Forecast Wholesale'!$F$113*N45), \"\", '8. Forecast Wholesale'!$F$113*N45)","v":""},null,""]
[null,{"$f":"IF('3. Rate Classes'!Q45=1,'3. Rate Classes'!C45, 0)","v":0},null,{"$f":"IF(ISERROR(VLOOKUP($B46, '3. Rate Classes'!$C$24:$H$45,6,0)), \"\", VLOOKUP($B46, '3. Rate Classes'!$C$24:$H$45,6,0))","v":""},null,{"$f":"VLOOKUP($B46, '9. Adj Network to Current WS'!$B$25:$R$47, 17,0)","v":""},null,{"$f":"VLOOKUP('9. Adj Network to Current WS'!$B46, '4. RRR Data'!$B$27:$M$49,11,0)","v":0},null,{"$f":"VLOOKUP('9. Adj Network to Current WS'!$B46, '4. RRR Data'!$B$27:$M$49,12,0)","v":0},null,"",null,"",null,{"$f":"IF(ISERROR('8. Forecast Wholesale'!$F$113*N46), \"\", '8. Forecast Wholesale'!$F$113*N46)","v":""},null,""]
[]
[]
[null,null,null,null,null,null,null,null,null,null,null,{"$f":"SUM(L25:L46)","v":650417.23900000018}]

{"sheet":"12. Adj Conn. to Forecast WS","index":11,"n_rows":49,"n_cols":18,"rows_kept":49,"cut":false,"hidden":false,"merged":[]}
[]
[]
[]
[]
[]
[]
[]
[]
[]
[]
[]
[]
[null,"The purpose of this sheet is to update the re-aligned RTS Connection Rates to recover forecast wholesale connection costs."]
[]
[]
[]
[]
[]
[null,"Rate Class"]
[]
[]
[null,"Rate Class",null,"Unit",null,"Adjusted RTSR-Connection",null,"Loss Adjusted Billed kWh",null,"Loss Adjusted Billed kW",null,"Billed Amount",null,"Billed Amount %",null,"Forecast Wholesale Billing",null,"Proposed RTSR Connection"]
[]
[]
[null,{"$f":"IF('3. Rate Classes'!Q24=1,'3. Rate Classes'!C24, 0)","v":"Residential"},null,{"$f":"IF(ISERROR(VLOOKUP($B25, '3. Rate Classes'!$C$24:$H$45,6,0)), \"\", VLOOKUP($B25, '3. Rate Classes'!$C$24:$H$45,6,0))","v":"kWh"},null,{"$f":"VLOOKUP($B25, '10. Adj Conn. to Current WS'!$B$25:$R$47, 17,0)","v":4.144715709669039E-3},null,{"$f":"VLOOKUP('9. Adj Network to Current WS'!$B25, '4. RRR Data'!$B$27:$M$49,11,0)","v":26099792.084400002},null,{"$f":"VLOOKUP('9. Adj Network to Current WS'!$B25, '4. RRR Data'!$B$27:$M$49,12,0)","v":0},null,{"$f":"IF(F25=\"\", \"\", IF(D25=\"kWh\", F25*H25, F25*J25))","v":108176.21827130832},null,{"$f":"IF(ISERROR(L25/$L$49), \"\", L25/$L$49)","v":0.28133232107296346},null,{"$f":"IF(ISERROR('8. Forecast Wholesale'!$P$117*N25), \"\", '8. Forecast Wholesale'!$P$117*N25)","v":106418.78871470656},null,{"$f":"IF(D25=\"\",\"\",IF(D25=\"kWh\",IF(H25<>0,P25/H25,),IF(J25<>0,P25/J25,0)))","v":4.0773807075004899E-3}]
[null,{"$f":"IF('3. Rate Classes'!Q25=1,'3. Rate Classes'!C25, 0)","v":"General Service Less Than 50 kW"},null,{"$f":"IF(ISERROR(VLOOKUP($B26, '3. Rate Classes'!$C$24:$H$45,6,0)), \"\", VLOOKUP($B26, '3. Rate Classes'!$C$24:$H$45,6,0))","v":"kWh"},null,{"$f":"VLOOKUP($B26, '10. Adj Conn. to Current WS'!$B$25:$R$47, 17,0)","v":3.4999821548316332E-3},null,{"$f":"VLOOKUP('9. Adj Network to Current WS'!$B26, '4. RRR Data'!$B$27:$M$49,11,0)","v":12429052.258800002},null,{"$f":"VLOOKUP('9. Adj Network to Current WS'!$B26, '4. RRR Data'!$B$27:$M$49,12,0)","v":0},null,43501.46110726981,null,0.1131336186358389,null,{"$f":"IF(ISERROR('8. Forecast Wholesale'!$P$117*N26), \"\", '8. Forecast Wholesale'!$P$117*N26)","v":42794.736887039289},null,3.443121486333748E-3]
[null,{"$f":"IF('3. Rate Classes'!Q26=1,'3. Rate Classes'!C26, 0)","v":"General Service 50 to 999 kW"},null,{"$f":"IF(ISERROR(VLOOKUP($B27, '3. Rate Classes'!$C$24:$H$45,6,0)), \"\", VLOOKUP($B27, '3. Rate Classes'!$C$24:$H$45,6,0))","v":"kW"},null,{"$f":"VLOOKUP($B27, '10. Adj Conn. to Current WS'!$B$25:$R$47, 17,0)","v":1.3946507839068578},null,{"$f":"VLOOKUP('9. Adj Network to Current WS'!$B27, '4. RRR Data'!$B$27:$M$49,11,0)","v":21787824},null,{"$f":"VLOOKUP('9. Adj Network to Current WS'!$B27, '4. RRR Data'!$B$27:$M$49,12,0)","v":67429},null,94039.907708055514,null,0.24456822332835793,null,{"$f":"IF(ISERROR('8. Forecast Wholesale'!$P$117*N27), \"\", '8. Forecast Wholesale'!$P$117*N27)","v":92512.136484885734},null,1.3719933038438319]
[null,{"$f":"IF('3. Rate Classes'!Q27=1,'3. Rate Classes'!C27, 0)","v":"General Service 1,000 to 4,999 kW"},null,{"$f":"IF(ISERROR(VLOOKUP($B28, '3. Rate Classes'!$C$24:$H$45,6,0)), \"\", VLOOKUP($B28, '3. Rate Classes'!$C$24:$H$45,6,0))","v":"kW"},null,{"$f":"VLOOKUP($B28, '10. Adj Conn. to Current WS'!$B$25:$R$47, 17,0)","v":1.5289395729001343},null,{"$f":"VLOOKUP('9. Adj Network to Current WS'!$B28, '4. RRR Data'!$B$27:$M$49,11,0)","v":42759000},null,{"$f":"VLOOKUP('9. Adj Network to Current WS'!$B28, '4. RRR Data'!$B$27:$M$49,12,0)","v":89331},null,136581.7009867419,null,0.35520604776849574,null,{"$f":"IF(ISERROR('8. Forecast Wholesale'!$P$117*N28), \"\", '8. Forecast Wholesale'!$P$117*N28)","v":134362.79629548124},null,1.5041004387668473]
[null,{"$f":"IF('3. Rate Classes'!Q28=1,'3. Rate Classes'!C28, 0)","v":"Unmetered Scattered Load"},null,{"$f":"IF(ISERROR(VLOOKUP($B29, '3. Rate Classes'!$C$24:$H$45,6,0)), \"\", VLOOKUP($B29, '3. Rate Classes'!$C$24:$H$45,6,0))","v":"kWh"},null,{"$f":"VLOOKUP($B29, '10. Adj Conn. to Current WS'!$B$25:$R$47, 17,0)","v":3.4999821548316328E-3},null,{"$f":"VLOOKUP('9. Adj Network to Current WS'!$B29, '4. RRR Data'!$B$27:$M$49,11,0)","v":5377.2888000000003},null,{"$f":"VLOOKUP('9. Adj Network to Current WS'!$B29, '4. RRR Data'!$B$27:$M$49,12,0)","v":0},null,18.820414841376007,null,4.8945979767945946E-5,null,{"$f":"IF(ISERROR('8. Forecast Wholesale'!$P$117*N29), \"\", '8. Forecast Wholesale'!$P$117*N29)","v":18.514658605501815},null,3.4431214863337475E-3]
[null,{"$f":"IF('3. Rate Classes'!Q29=1,'3. Rate Classes'!C29, 0)","v":"Sentinel Lighting"},null,{"$f":"IF(ISERROR(VLOOKUP($B30, '3. Rate Classes'!$C$24:$H$45,6,0)), \"\", VLOOKUP($B30, '3. Rate Classes'!$C$24:$H$45,6,0))","v":"kW"},null,{"$f":"VLOOKUP($B30, '10. Adj Conn. to Current WS'!$B$25:$R$47, 17,0)","v":1.1007443876945486},null,{"$f":"VLOOKUP('9. Adj Network to Current WS'!$B30, '4. RRR Data'!$B$27:$M$49,11,0)","v":26097},null,{"$f":"VLOOKUP('9. Adj Network to Current WS'!$B30, '4. RRR Data'!$B$27:$M$49,12,0)","v":72},null,79.253595914007505,null,2.0611367681523226E-4,null,{"$f":"IF(ISERROR('8. Forecast Wholesale'!$P$117*N30), \"\", '8. Forecast Wholesale'!$P$117*N30)","v":77.966042936541385},null,1.0828617074519638]
[null,{"$f":"IF('3. Rate Classes'!Q30=1,'3. Rate Classes'!C30, 0)","v":"Street Lighting"},null,{"$f":"IF(ISERROR(VLOOKUP($B31, '3. Rate Classes'!$C$24:$H$45,6,0)), \"\", VLOOKUP($B31, '3. Rate Classes'!$C$24:$H$45,6,0))","v":"kW"},null,{"$f":"VLOOKUP($B31, '10. Adj Conn. to Current WS'!$B$25:$R$47, 17,0)","v":1.0782708180687877},null,{"$f":"VLOOKUP('9. Adj Network to Current WS'!$B31, '4. RRR Data'!$B$27:$M$49,11,0)","v":707903},null,{"$f":"VLOOKUP('9. Adj Network to Current WS'!$B31, '4. RRR Data'!$B$27:$M$49,12,0)","v":1963},null,2116.6456158690303,null,5.5047295377609485E-3,null,{"$f":"IF(ISERROR('8. Forecast Wholesale'!$P$117*N31), \"\", '8. Forecast Wholesale'!$P$117*N31)","v":2082.2586163452506},null,1.0607532431712943]
[null,{"$f":"IF('3. Rate Classes'!Q31=1,'3. Rate Classes'!C31, 0)","v":0},null,{"$f":"IF(ISERROR(VLOOKUP($B32, '3. Rate Classes'!$C$24:$H$45,6,0)), \"\", VLOOKUP($B32, '3. Rate Classes'!$C$24:$H$45,6,0))","v":""},null,{"$f":"VLOOKUP($B32, '10. Adj Conn. to Current WS'!$B$25:$R$47, 17,0)","v":""},null,{"$f":"VLOOKUP('9. Adj Network to Current WS'!$B32, '4. RRR Data'!$B$27:$M$49,11,0)","v":0},null,{"$f":"VLOOKUP('9. Adj Network to Current WS'!$B32, '4. RRR Data'!$B$27:$M$49,12,0)","v":0},null,"",null,"",null,{"$f":"IF(ISERROR('8. Forecast Wholesale'!$P$117*N32), \"\", '8. Forecast Wholesale'!$P$117*N32)","v":""},null,""]
[null,{"$f":"IF('3. Rate Classes'!Q32=1,'3. Rate Classes'!C32, 0)","v":0},null,{"$f":"IF(ISERROR(VLOOKUP($B33, '3. Rate Classes'!$C$24:$H$45,6,0)), \"\", VLOOKUP($B33, '3. Rate Classes'!$C$24:$H$45,6,0))","v":""},null,{"$f":"VLOOKUP($B33, '10. Adj Conn. to Current WS'!$B$25:$R$47, 17,0)","v":""},null,{"$f":"VLOOKUP('9. Adj Network to Current WS'!$B33, '4. RRR Data'!$B$27:$M$49,11,0)","v":0},null,{"$f":"VLOOKUP('9. Adj Network to Current WS'!$B33, '4. RRR Data'!$B$27:$M$49,12,0)","v":0},null,"",null,"",null,{"$f":"IF(ISERROR('8. Forecast Wholesale'!$P$117*N33), \"\", '8. Forecast Wholesale'!$P$117*N33)","v":""},null,""]
[null,{"$f":"IF('3. Rate Classes'!Q33=1,'3. Rate Classes'!C33, 0)","v":0},null,{"$f":"IF(ISERROR(VLOOKUP($B34, '3. Rate Classes'!$C$24:$H$45,6,0)), \"\", VLOOKUP($B34, '3. Rate Classes'!$C$24:$H$45,6,0))","v":""},null,{"$f":"VLOOKUP($B34, '10. Adj Conn. to Current WS'!$B$25:$R$47, 17,0)","v":""},null,{"$f":"VLOOKUP('9. Adj Network to Current WS'!$B34, '4. RRR Data'!$B$27:$M$49,11,0)","v":0},null,{"$f":"VLOOKUP('9. Adj Network to Current WS'!$B34, '4. RRR Data'!$B$27:$M$49,12,0)","v":0},null,"",null,"",null,{"$f":"IF(ISERROR('8. Forecast Wholesale'!$P$117*N34), \"\", '8. Forecast Wholesale'!$P$117*N34)","v":""},null,""]
[null,{"$f":"IF('3. Rate Classes'!Q34=1,'3. Rate Classes'!C34, 0)","v":0},null,{"$f":"IF(ISERROR(VLOOKUP($B35, '3. Rate Classes'!$C$24:$H$45,6,0)), \"\", VLOOKUP($B35, '3. Rate Classes'!$C$24:$H$45,6,0))","v":""},null,{"$f":"VLOOKUP($B35, '10. Adj Conn. to Current WS'!$B$25:$R$47, 17,0)","v":""},null,{"$f":"VLOOKUP('9. Adj Network to Current WS'!$B35, '4. RRR Data'!$B$27:$M$49,11,0)","v":0},null,{"$f":"VLOOKUP('9. Adj Network to Current WS'!$B35, '4. RRR Data'!$B$27:$M$49,12,0)","v":0},null,"",null,"",null,{"$f":"IF(ISERROR('8. Forecast Wholesale'!$P$117*N35), \"\", '8. Forecast Wholesale'!$P$117*N35)","v":""},null,""]
[null,{"$f":"IF('3. Rate Classes'!Q35=1,'3. Rate Classes'!C35, 0)","v":0},null,{"$f":"IF(ISERROR(VLOOKUP($B36, '3. Rate Classes'!$C$24:$H$45,6,0)), \"\", VLOOKUP($B36, '3. Rate Classes'!$C$24:$H$45,6,0))","v":""},null,{"$f":"VLOOKUP($B36, '10. Adj Conn. to Current WS'!$B$25:$R$47, 17,0)","v":""},null,{"$f":"VLOOKUP('9. Adj Network to Current WS'!$B36, '4. RRR Data'!$B$27:$M$49,11,0)","v":0},null,{"$f":"VLOOKUP('9. Adj Network to Current WS'!$B36, '4. RRR Data'!$B$27:$M$49,12,0)","v":0},null,"",null,"",null,{"$f":"IF(ISERROR('8. Forecast Wholesale'!$P$117*N36), \"\", '8. Forecast Wholesale'!$P$117*N36)","v":""},null,""]
[null,{"$f":"IF('3. Rate Classes'!Q36=1,'3. Rate Classes'!C36, 0)","v":0},null,{"$f":"IF(ISERROR(VLOOKUP($B37, '3. Rate Classes'!$C$24:$H$45,6,0)), \"\", VLOOKUP($B37, '3. Rate Classes'!$C$24:$H$45,6,0))","v":""},null,{"$f":"VLOOKUP($B37, '10. Adj Conn. to Current WS'!$B$25:$R$47, 17,0)","v":""},null,{"$f":"VLOOKUP('9. Adj Network to Current WS'!$B37, '4. RRR Data'!$B$27:$M$49,11,0)","v":0},null,{"$f":"VLOOKUP('9. Adj Network to Current WS'!$B37, '4. RRR Data'!$B$27:$M$49,12,0)","v":0},null,"",null,"",null,{"$f":"IF(ISERROR('8. Forecast Wholesale'!$P$117*N37), \"\", '8. Forecast Wholesale'!$P$117*N37)","v":""},null,""]
[null,{"$f":"IF('3. Rate Classes'!Q37=1,'3. Rate Classes'!C37, 0)","v":0},null,{"$f":"IF(ISERROR(VLOOKUP($B38, '3. Rate Classes'!$C$24:$H$45,6,0)), \"\", VLOOKUP($B38, '3. Rate Classes'!$C$24:$H$45,6,0))","v":""},null,{"$f":"VLOOKUP($B38, '10. Adj Conn. to Current WS'!$B$25:$R$47, 17,0)","v":""},null,{"$f":"VLOOKUP('9. Adj Network to Current WS'!$B38, '4. RRR Data'!$B$27:$M$49,11,0)","v":0},null,{"$f":"VLOOKUP('9. Adj Network to Current WS'!$B38, '4. RRR Data'!$B$27:$M$49,12,0)","v":0},null,"",null,"",null,{"$f":"IF(ISERROR('8. Forecast Wholesale'!$P$117*N38), \"\", '8. Forecast Wholesale'!$P$117*N38)","v":""},null,""]
[null,{"$f":"IF('3. Rate Classes'!Q38=1,'3. Rate Classes'!C38, 0)","v":0},null,{"$f":"IF(ISERROR(VLOOKUP($B39, '3. Rate Classes'!$C$24:$H$45,6,0)), \"\", VLOOKUP($B39, '3. Rate Classes'!$C$24:$H$45,6,0))","v":""},null,{"$f":"VLOOKUP($B39, '10. Adj Conn. to Current WS'!$B$25:$R$47, 17,0)","v":""},null,{"$f":"VLOOKUP('9. Adj Network to Current WS'!$B39, '4. RRR Data'!$B$27:$M$49,11,0)","v":0},null,{"$f":"VLOOKUP('9. Adj Network to Current WS'!$B39, '4. RRR Data'!$B$27:$M$49,12,0)","v":0},null,"",null,"",null,{"$f":"IF(ISERROR('8. Forecast Wholesale'!$P$117*N39), \"\", '8. Forecast Wholesale'!$P$117*N39)","v":""},null,""]
[null,{"$f":"IF('3. Rate Classes'!Q39=1,'3. Rate Classes'!C39, 0)","v":0},null,{"$f":"IF(ISERROR(VLOOKUP($B40, '3. Rate Classes'!$C$24:$H$45,6,0)), \"\", VLOOKUP($B40, '3. Rate Classes'!$C$24:$H$45,6,0))","v":""},null,{"$f":"VLOOKUP($B40, '10. Adj Conn. to Current WS'!$B$25:$R$47, 17,0)","v":""},null,{"$f":"VLOOKUP('9. Adj Network to Current WS'!$B40, '4. RRR Data'!$B$27:$M$49,11,0)","v":0},null,{"$f":"VLOOKUP('9. Adj Network to Current WS'!$B40, '4. RRR Data'!$B$27:$M$49,12,0)","v":0},null,"",null,"",null,{"$f":"IF(ISERROR('8. Forecast Wholesale'!$P$117*N40), \"\", '8. Forecast Wholesale'!$P$117*N40)","v":""},null,""]
[null,{"$f":"IF('3. Rate Classes'!Q40=1,'3. Rate Classes'!C40, 0)","v":0},null,{"$f":"IF(ISERROR(VLOOKUP($B41, '3. Rate Classes'!$C$24:$H$45,6,0)), \"\", VLOOKUP($B41, '3. Rate Classes'!$C$24:$H$45,6,0))","v":""},null,{"$f":"VLOOKUP($B41, '10. Adj Conn. to Current WS'!$B$25:$R$47, 17,0)","v":""},null,{"$f":"VLOOKUP('9. Adj Network to Current WS'!$B41, '4. RRR Data'!$B$27:$M$49,11,0)","v":0},null,{"$f":"VLOOKUP('9. Adj Network to Current WS'!$B41, '4. RRR Data'!$B$27:$M$49,12,0)","v":0},null,"",null,"",null,{"$f":"IF(ISERROR('8. Forecast Wholesale'!$P$117*N41), \"\", '8. Forecast Wholesale'!$P$117*N41)","v":""},null,""]
[null,{"$f":"IF('3. Rate Classes'!Q41=1,'3. Rate Classes'!C41, 0)","v":0},null,{"$f":"IF(ISERROR(VLOOKUP($B42, '3. Rate Classes'!$C$24:$H$45,6,0)), \"\", VLOOKUP($B42, '3. Rate Classes'!$C$24:$H$45,6,0))","v":""},null,{"$f":"VLOOKUP($B42, '10. Adj Conn. to Current WS'!$B$25:$R$47, 17,0)","v":""},null,{"$f":"VLOOKUP('9. Adj Network to Current WS'!$B42, '4. RRR Data'!$B$27:$M$49,11,0)","v":0},null,{"$f":"VLOOKUP('9. Adj Network to Current WS'!$B42, '4. RRR Data'!$B$27:$M$49,12,0)","v":0},null,"",null,"",null,{"$f":"IF(ISERROR('8. Forecast Wholesale'!$P$117*N42), \"\", '8. Forecast Wholesale'!$P$117*N42)","v":""},null,""]
[null,{"$f":"IF('3. Rate Classes'!Q42=1,'3. Rate Classes'!C42, 0)","v":0},null,{"$f":"IF(ISERROR(VLOOKUP($B43, '3. Rate Classes'!$C$24:$H$45,6,0)), \"\", VLOOKUP($B43, '3. Rate Classes'!$C$24:$H$45,6,0))","v":""},null,{"$f":"VLOOKUP($B43, '10. Adj Conn. to Current WS'!$B$25:$R$47, 17,0)","v":""},null,{"$f":"VLOOKUP('9. Adj Network to Current WS'!$B43, '4. RRR Data'!$B$27:$M$49,11,0)","v":0},null,{"$f":"VLOOKUP('9. Adj Network to Current WS'!$B43, '4. RRR Data'!$B$27:$M$49,12,0)","v":0},null,"",null,"",null,{"$f":"IF(ISERROR('8. Forecast Wholesale'!$P$117*N43), \"\", '8. Forecast Wholesale'!$P$117*N43)","v":""},null,""]
[null,{"$f":"IF('3. Rate Classes'!Q43=1,'3. Rate Classes'!C43, 0)","v":0},null,{"$f":"IF(ISERROR(VLOOKUP($B44, '3. Rate Classes'!$C$24:$H$45,6,0)), \"\", VLOOKUP($B44, '3. Rate Classes'!$C$24:$H$45,6,0))","v":""},null,{"$f":"VLOOKUP($B44, '10. Adj Conn. to Current WS'!$B$25:$R$47, 17,0)","v":""},null,{"$f":"VLOOKUP('9. Adj Network to Current WS'!$B44, '4. RRR Data'!$B$27:$M$49,11,0)","v":0},null,{"$f":"VLOOKUP('9. Adj Network to Current WS'!$B44, '4. RRR Data'!$B$27:$M$49,12,0)","v":0},null,"",null,"",null,{"$f":"IF(ISERROR('8. Forecast Wholesale'!$P$117*N44), \"\", '8. Forecast Wholesale'!$P$117*N44)","v":""},null,""]
[null,{"$f":"IF('3. Rate Classes'!Q44=1,'3. Rate Classes'!C44, 0)","v":0},null,{"$f":"IF(ISERROR(VLOOKUP($B45, '3. Rate Classes'!$C$24:$H$45,6,0)), \"\", VLOOKUP($B45, '3. Rate Classes'!$C$24:$H$45,6,0))","v":""},null,{"$f":"VLOOKUP($B45, '10. Adj Conn. to Current WS'!$B$25:$R$47, 17,0)","v":""},null,{"$f":"VLOOKUP('9. Adj Network to Current WS'!$B45, '4. RRR Data'!$B$27:$M$49,11,0)","v":0},null,{"$f":"VLOOKUP('9. Adj Network to Current WS'!$B45, '4. RRR Data'!$B$27:$M$49,12,0)","v":0},null,"",null,"",null,{"$f":"IF(ISERROR('8. Forecast Wholesale'!$P$117*N45), \"\", '8. Forecast Wholesale'!$P$117*N45)","v":""},null,""]
[null,{"$f":"IF('3. Rate Classes'!Q45=1,'3. Rate Classes'!C45, 0)","v":0},null,{"$f":"IF(ISERROR(VLOOKUP($B46, '3. Rate Classes'!$C$24:$H$45,6,0)), \"\", VLOOKUP($B46, '3. Rate Classes'!$C$24:$H$45,6,0))","v":""},null,{"$f":"VLOOKUP($B46, '10. Adj Conn. to Current WS'!$B$25:$R$47, 17,0)","v":""},null,{"$f":"VLOOKUP('9. Adj Network to Current WS'!$B46, '4. RRR Data'!$B$27:$M$49,11,0)","v":0},null,{"$f":"VLOOKUP('9. Adj Network to Current WS'!$B46, '4. RRR Data'!$B$27:$M$49,12,0)","v":0},null,"",null,"",null,{"$f":"IF(ISERROR('8. Forecast Wholesale'!$P$117*N46), \"\", '8. Forecast Wholesale'!$P$117*N46)","v":""},null,""]
[]
[]
[null,null,null,null,null,null,null,null,null,null,null,{"$f":"SUM(L25:L46)","v":384514.0076999999}]

{"sheet":"13. Final 2014 RTS Rates","index":12,"n_rows":47,"n_cols":8,"rows_kept":47,"cut":false,"hidden":false,"merged":[[12,1,12,11]]}
[]
[]
[]
[]
[]
[]
[]
[]
[]
[]
[]
[]
[null,"For Cost of Service Applicants, please enter the following Proposed RTS rates into your rates model.\n\nFor IRM applicants, please enter these rates into the 2013 IRM Rate Generator, Sheet 11 \"Proposed Rates\", column I.  \nPlease note that the rate descriptions for the RTSRs are transfered automatically from Sheet 4 to Sheet 11, Column A.\n"]
[]
[]
[]
[]
[]
[]
[]
[]
[]
[null,"Rate Class",null,"Unit",null,"Proposed RTSR Network",null,"Proposed RTSR Connection"]
[]
[]
[null,{"$f":"IF('3. Rate Classes'!Q24=1,'3. Rate Classes'!C24, 0)","v":"Residential"},null,{"$f":"IF(ISERROR(VLOOKUP($B26, '3. Rate Classes'!$C$24:$H$45,6,0)), \"\", VLOOKUP($B26, '3. Rate Classes'!$C$24:$H$45,6,0))","v":"kWh"},null,{"$f":"VLOOKUP($B26, '11. Adj Network to Forecast WS'!$B$25:$R$48,17,0)","v":6.6026020835637392E-3},null,{"$f":"VLOOKUP($B26, '12. Adj Conn. to Forecast WS'!$B$25:$R$48,17,0)","v":4.0773807075004899E-3}]
[null,{"$f":"IF('3. Rate Classes'!Q25=1,'3. Rate Classes'!C25, 0)","v":"General Service Less Than 50 kW"},null,{"$f":"IF(ISERROR(VLOOKUP($B27, '3. Rate Classes'!$C$24:$H$45,6,0)), \"\", VLOOKUP($B27, '3. Rate Classes'!$C$24:$H$45,6,0))","v":"kWh"},null,{"$f":"VLOOKUP($B27, '11. Adj Network to Forecast WS'!$B$25:$R$48,17,0)","v":6.1241526572185408E-3},null,{"$f":"VLOOKUP($B27, '12. Adj Conn. to Forecast WS'!$B$25:$R$48,17,0)","v":3.443121486333748E-3}]
[null,{"$f":"IF('3. Rate Classes'!Q26=1,'3. Rate Classes'!C26, 0)","v":"General Service 50 to 999 kW"},null,{"$f":"IF(ISERROR(VLOOKUP($B28, '3. Rate Classes'!$C$24:$H$45,6,0)), \"\", VLOOKUP($B28, '3. Rate Classes'!$C$24:$H$45,6,0))","v":"kW"},null,{"$f":"VLOOKUP($B28, '11. Adj Network to Forecast WS'!$B$25:$R$48,17,0)","v":2.5128163871649822},null,{"$f":"VLOOKUP($B28, '12. Adj Conn. to Forecast WS'!$B$25:$R$48,17,0)","v":1.3719933038438319}]
[null,{"$f":"IF('3. Rate Classes'!Q27=1,'3. Rate Classes'!C27, 0)","v":"General Service 1,000 to 4,999 kW"},null,{"$f":"IF(ISERROR(VLOOKUP($B29, '3. Rate Classes'!$C$24:$H$45,6,0)), \"\", VLOOKUP($B29, '3. Rate Classes'!$C$24:$H$45,6,0))","v":"kW"},null,{"$f":"VLOOKUP($B29, '11. Adj Network to Forecast WS'!$B$25:$R$48,17,0)","v":2.6689822799240552},null,{"$f":"VLOOKUP($B29, '12. Adj Conn. to Forecast WS'!$B$25:$R$48,17,0)","v":1.5041004387668473}]
[null,{"$f":"IF('3. Rate Classes'!Q28=1,'3. Rate Classes'!C28, 0)","v":"Unmetered Scattered Load"},null,{"$f":"IF(ISERROR(VLOOKUP($B30, '3. Rate Classes'!$C$24:$H$45,6,0)), \"\", VLOOKUP($B30, '3. Rate Classes'!$C$24:$H$45,6,0))","v":"kWh"},null,{"$f":"VLOOKUP($B30, '11. Adj Network to Forecast WS'!$B$25:$R$48,17,0)","v":6.1241526572185416E-3},null,{"$f":"VLOOKUP($B30, '12. Adj Conn. to Forecast WS'!$B$25:$R$48,17,0)","v":3.4431214863337475E-3}]
[null,{"$f":"IF('3. Rate Classes'!Q29=1,'3. Rate Classes'!C29, 0)","v":"Sentinel Lighting"},null,{"$f":"IF(ISERROR(VLOOKUP($B31, '3. Rate Classes'!$C$24:$H$45,6,0)), \"\", VLOOKUP($B31, '3. Rate Classes'!$C$24:$H$45,6,0))","v":"kW"},null,{"$f":"VLOOKUP($B31, '11. Adj Network to Forecast WS'!$B$25:$R$48,17,0)","v":1.9046114763949662},null,{"$f":"VLOOKUP($B31, '12. Adj Conn. to Forecast WS'!$B$25:$R$48,17,0)","v":1.0828617074519638}]
[null,{"$f":"IF('3. Rate Classes'!Q30=1,'3. Rate Classes'!C30, 0)","v":"Street Lighting"},null,{"$f":"IF(ISERROR(VLOOKUP($B32, '3. Rate Classes'!$C$24:$H$45,6,0)), \"\", VLOOKUP($B32, '3. Rate Classes'!$C$24:$H$45,6,0))","v":"kW"},null,{"$f":"VLOOKUP($B32, '11. Adj Network to Forecast WS'!$B$25:$R$48,17,0)","v":1.8950424878680623},null,{"$f":"VLOOKUP($B32, '12. Adj Conn. to Forecast WS'!$B$25:$R$48,17,0)","v":1.0607532431712943}]
[null,{"$f":"IF('3. Rate Classes'!Q31=1,'3. Rate Classes'!C31, 0)","v":0},null,{"$f":"IF(ISERROR(VLOOKUP($B33, '3. Rate Classes'!$C$24:$H$45,6,0)), \"\", VLOOKUP($B33, '3. Rate Classes'!$C$24:$H$45,6,0))","v":""},null,{"$f":"VLOOKUP($B33, '11. Adj Network to Forecast WS'!$B$25:$R$48,17,0)","v":""},null,{"$f":"VLOOKUP($B33, '12. Adj Conn. to Forecast WS'!$B$25:$R$48,17,0)","v":""}]
[null,{"$f":"IF('3. Rate Classes'!Q32=1,'3. Rate Classes'!C32, 0)","v":0},null,{"$f":"IF(ISERROR(VLOOKUP($B34, '3. Rate Classes'!$C$24:$H$45,6,0)), \"\", VLOOKUP($B34, '3. Rate Classes'!$C$24:$H$45,6,0))","v":""},null,{"$f":"VLOOKUP($B34, '11. Adj Network to Forecast WS'!$B$25:$R$48,17,0)","v":""},null,{"$f":"VLOOKUP($B34, '12. Adj Conn. to Forecast WS'!$B$25:$R$48,17,0)","v":""}]
[null,{"$f":"IF('3. Rate Classes'!Q33=1,'3. Rate Classes'!C33, 0)","v":0},null,{"$f":"IF(ISERROR(VLOOKUP($B35, '3. Rate Classes'!$C$24:$H$45,6,0)), \"\", VLOOKUP($B35, '3. Rate Classes'!$C$24:$H$45,6,0))","v":""},null,{"$f":"VLOOKUP($B35, '11. Adj Network to Forecast WS'!$B$25:$R$48,17,0)","v":""},null,{"$f":"VLOOKUP($B35, '12. Adj Conn. to Forecast WS'!$B$25:$R$48,17,0)","v":""}]
[null,{"$f":"IF('3. Rate Classes'!Q34=1,'3. Rate Classes'!C34, 0)","v":0},null,{"$f":"IF(ISERROR(VLOOKUP($B36, '3. Rate Classes'!$C$24:$H$45,6,0)), \"\", VLOOKUP($B36, '3. Rate Classes'!$C$24:$H$45,6,0))","v":""},null,{"$f":"VLOOKUP($B36, '11. Adj Network to Forecast WS'!$B$25:$R$48,17,0)","v":""},null,{"$f":"VLOOKUP($B36, '12. Adj Conn. to Forecast WS'!$B$25:$R$48,17,0)","v":""}]
[null,{"$f":"IF('3. Rate Classes'!Q35=1,'3. Rate Classes'!C35, 0)","v":0},null,{"$f":"IF(ISERROR(VLOOKUP($B37, '3. Rate Classes'!$C$24:$H$45,6,0)), \"\", VLOOKUP($B37, '3. Rate Classes'!$C$24:$H$45,6,0))","v":""},null,{"$f":"VLOOKUP($B37, '11. Adj Network to Forecast WS'!$B$25:$R$48,17,0)","v":""},null,{"$f":"VLOOKUP($B37, '12. Adj Conn. to Forecast WS'!$B$25:$R$48,17,0)","v":""}]
[null,{"$f":"IF('3. Rate Classes'!Q36=1,'3. Rate Classes'!C36, 0)","v":0},null,{"$f":"IF(ISERROR(VLOOKUP($B38, '3. Rate Classes'!$C$24:$H$45,6,0)), \"\", VLOOKUP($B38, '3. Rate Classes'!$C$24:$H$45,6,0))","v":""},null,{"$f":"VLOOKUP($B38, '11. Adj Network to Forecast WS'!$B$25:$R$48,17,0)","v":""},null,{"$f":"VLOOKUP($B38, '12. Adj Conn. to Forecast WS'!$B$25:$R$48,17,0)","v":""}]
[null,{"$f":"IF('3. Rate Classes'!Q37=1,'3. Rate Classes'!C37, 0)","v":0},null,{"$f":"IF(ISERROR(VLOOKUP($B39, '3. Rate Classes'!$C$24:$H$45,6,0)), \"\", VLOOKUP($B39, '3. Rate Classes'!$C$24:$H$45,6,0))","v":""},null,{"$f":"VLOOKUP($B39, '11. Adj Network to Forecast WS'!$B$25:$R$48,17,0)","v":""},null,{"$f":"VLOOKUP($B39, '12. Adj Conn. to Forecast WS'!$B$25:$R$48,17,0)","v":""}]
[null,{"$f":"IF('3. Rate Classes'!Q38=1,'3. Rate Classes'!C38, 0)","v":0},null,{"$f":"IF(ISERROR(VLOOKUP($B40, '3. Rate Classes'!$C$24:$H$45,6,0)), \"\", VLOOKUP($B40, '3. Rate Classes'!$C$24:$H$45,6,0))","v":""},null,{"$f":"VLOOKUP($B40, '11. Adj Network to Forecast WS'!$B$25:$R$48,17,0)","v":""},null,{"$f":"VLOOKUP($B40, '12. Adj Conn. to Forecast WS'!$B$25:$R$48,17,0)","v":""}]
[null,{"$f":"IF('3. Rate Classes'!Q39=1,'3. Rate Classes'!C39, 0)","v":0},null,{"$f":"IF(ISERROR(VLOOKUP($B41, '3. Rate Classes'!$C$24:$H$45,6,0)), \"\", VLOOKUP($B41, '3. Rate Classes'!$C$24:$H$45,6,0))","v":""},null,{"$f":"VLOOKUP($B41, '11. Adj Network to Forecast WS'!$B$25:$R$48,17,0)","v":""},null,{"$f":"VLOOKUP($B41, '12. Adj Conn. to Forecast WS'!$B$25:$R$48,17,0)","v":""}]
[null,{"$f":"IF('3. Rate Classes'!Q40=1,'3. Rate Classes'!C40, 0)","v":0},null,{"$f":"IF(ISERROR(VLOOKUP($B42, '3. Rate Classes'!$C$24:$H$45,6,0)), \"\", VLOOKUP($B42, '3. Rate Classes'!$C$24:$H$45,6,0))","v":""},null,{"$f":"VLOOKUP($B42, '11. Adj Network to Forecast WS'!$B$25:$R$48,17,0)","v":""},null,{"$f":"VLOOKUP($B42, '12. Adj Conn. to Forecast WS'!$B$25:$R$48,17,0)","v":""}]
[null,{"$f":"IF('3. Rate Classes'!Q41=1,'3. Rate Classes'!C41, 0)","v":0},null,{"$f":"IF(ISERROR(VLOOKUP($B43, '3. Rate Classes'!$C$24:$H$45,6,0)), \"\", VLOOKUP($B43, '3. Rate Classes'!$C$24:$H$45,6,0))","v":""},null,{"$f":"VLOOKUP($B43, '11. Adj Network to Forecast WS'!$B$25:$R$48,17,0)","v":""},null,{"$f":"VLOOKUP($B43, '12. Adj Conn. to Forecast WS'!$B$25:$R$48,17,0)","v":""}]
[null,{"$f":"IF('3. Rate Classes'!Q42=1,'3. Rate Classes'!C42, 0)","v":0},null,{"$f":"IF(ISERROR(VLOOKUP($B44, '3. Rate Classes'!$C$24:$H$45,6,0)), \"\", VLOOKUP($B44, '3. Rate Classes'!$C$24:$H$45,6,0))","v":""},null,{"$f":"VLOOKUP($B44, '11. Adj Network to Forecast WS'!$B$25:$R$48,17,0)","v":""},null,{"$f":"VLOOKUP($B44, '12. Adj Conn. to Forecast WS'!$B$25:$R$48,17,0)","v":""}]
[null,{"$f":"IF('3. Rate Classes'!Q43=1,'3. Rate Classes'!C43, 0)","v":0},null,{"$f":"IF(ISERROR(VLOOKUP($B45, '3. Rate Classes'!$C$24:$H$45,6,0)), \"\", VLOOKUP($B45, '3. Rate Classes'!$C$24:$H$45,6,0))","v":""},null,{"$f":"VLOOKUP($B45, '11. Adj Network to Forecast WS'!$B$25:$R$48,17,0)","v":""},null,{"$f":"VLOOKUP($B45, '12. Adj Conn. to Forecast WS'!$B$25:$R$48,17,0)","v":""}]
[null,{"$f":"IF('3. Rate Classes'!Q44=1,'3. Rate Classes'!C44, 0)","v":0},null,{"$f":"IF(ISERROR(VLOOKUP($B46, '3. Rate Classes'!$C$24:$H$45,6,0)), \"\", VLOOKUP($B46, '3. Rate Classes'!$C$24:$H$45,6,0))","v":""},null,{"$f":"VLOOKUP($B46, '11. Adj Network to Forecast WS'!$B$25:$R$48,17,0)","v":""},null,{"$f":"VLOOKUP($B46, '12. Adj Conn. to Forecast WS'!$B$25:$R$48,17,0)","v":""}]
[null,{"$f":"IF('3. Rate Classes'!Q45=1,'3. Rate Classes'!C45, 0)","v":0},null,{"$f":"IF(ISERROR(VLOOKUP($B47, '3. Rate Classes'!$C$24:$H$45,6,0)), \"\", VLOOKUP($B47, '3. Rate Classes'!$C$24:$H$45,6,0))","v":""},null,{"$f":"VLOOKUP($B47, '11. Adj Network to Forecast WS'!$B$25:$R$48,17,0)","v":""},null,{"$f":"VLOOKUP($B47, '12. Adj Conn. to Forecast WS'!$B$25:$R$48,17,0)","v":""}]

{"sheet":"hidden1","index":13,"n_rows":22,"n_cols":2,"rows_kept":22,"cut":false,"hidden":true,"merged":[]}
[{"$f":"IF('3. Rate Classes'!Q24=1, '3. Rate Classes'!C24, \"\")","v":"Residential"},1]
[{"$f":"IF('3. Rate Classes'!Q25=1, '3. Rate Classes'!C25, \"\")","v":"General Service Less Than 50 kW"},2]
[{"$f":"IF('3. Rate Classes'!Q26=1, '3. Rate Classes'!C26, \"\")","v":"General Service 50 to 999 kW"},3]
[{"$f":"IF('3. Rate Classes'!Q27=1, '3. Rate Classes'!C27, \"\")","v":"General Service 1,000 to 4,999 kW"},4]
[{"$f":"IF('3. Rate Classes'!Q28=1, '3. Rate Classes'!C28, \"\")","v":"Unmetered Scattered Load"},5]
[{"$f":"IF('3. Rate Classes'!Q29=1, '3. Rate Classes'!C29, \"\")","v":"Sentinel Lighting"},6]
[{"$f":"IF('3. Rate Classes'!Q30=1, '3. Rate Classes'!C30, \"\")","v":"Street Lighting"},7]
[{"$f":"IF('3. Rate Classes'!Q31=1, '3. Rate Classes'!C31, \"\")","v":""},8]
[{"$f":"IF('3. Rate Classes'!Q32=1, '3. Rate Classes'!C32, \"\")","v":""},9]
[{"$f":"IF('3. Rate Classes'!Q33=1, '3. Rate Classes'!C33, \"\")","v":""},10]
[{"$f":"IF('3. Rate Classes'!Q34=1, '3. Rate Classes'!C34, \"\")","v":""},11]
[{"$f":"IF('3. Rate Classes'!Q35=1, '3. Rate Classes'!C35, \"\")","v":""},12]
[{"$f":"IF('3. Rate Classes'!Q36=1, '3. Rate Classes'!C36, \"\")","v":""},13]
[{"$f":"IF('3. Rate Classes'!Q37=1, '3. Rate Classes'!C37, \"\")","v":""},14]
[{"$f":"IF('3. Rate Classes'!Q38=1, '3. Rate Classes'!C38, \"\")","v":""},15]
[{"$f":"IF('3. Rate Classes'!Q39=1, '3. Rate Classes'!C39, \"\")","v":""},16]
[{"$f":"IF('3. Rate Classes'!Q40=1, '3. Rate Classes'!C40, \"\")","v":""},17]
[{"$f":"IF('3. Rate Classes'!Q41=1, '3. Rate Classes'!C41, \"\")","v":""},18]
[{"$f":"IF('3. Rate Classes'!Q42=1, '3. Rate Classes'!C42, \"\")","v":""},19]
[{"$f":"IF('3. Rate Classes'!Q43=1, '3. Rate Classes'!C43, \"\")","v":""},20]
[{"$f":"IF('3. Rate Classes'!Q44=1, '3. Rate Classes'!C44, \"\")","v":""},21]
[{"$f":"IF('3. Rate Classes'!Q45=1, '3. Rate Classes'!C45, \"\")","v":""},22]