{"text_format":"1","workbook":"xlsx","n_sheets":9,"sheets":["1. Info","2. Table of Contents","3. Data_Input_Sheet","4. Rate_Base","5. Utility Income","6. Taxes_PILs","7. Cost_of_Capital","8. Rev_Def_Suff","9. Rev_Reqt"],"not_rendered":{"charts":0,"images":4,"macros":1,"external_links":2,"defined_names":12,"comments":0,"pivot_tables":0},"unopened":[],"bounds":{"document_bytes":16777216,"sheet_cells":100000,"rows_first":2000,"rows_last":500,"rows_between":2000,"halvings":0,"cell_chars":16384,"cell_head_chars":4096},"cells_cut":0,"cells_raw":0,"read":"whole","date_system":"1900"}

{"sheet":"1. Info","index":0,"n_rows":98,"n_cols":29,"rows_kept":98,"cut":false,"hidden":false,"merged":[[27,1,27,3],[34,1,40,11],[0,2,1,12],[2,2,3,12],[27,4,27,9],[25,6,25,10],[21,1,21,2],[15,6,15,12],[17,6,17,10],[19,6,19,10],[21,6,21,10],[23,6,23,10],[23,1,23,2],[25,1,25,3]]}
[null,null,null,null,null,null,null,null,null,null,null,null,null,null,null,null,null,null,null,null,null,null,null,null,null,null,null,null,{"$f":"IF('3. Data_Input_Sheet'!M12=0, \"\", '3. Data_Input_Sheet'!M12)","v":""}]
[]
[]
[]
[]
[]
[]
[]
[]
[]
[null,null,null,null,null,null,null,null,null,null,null,null,null,null,null,"Version",4]
[]
[]
[]
[]
[null,null,null,null,null,"Utility Name   ","Horizon Utilities Corporation"]
[]
[null,null,null,null,null,"Service Territory","Hamilton & St Catharines"]
[]
[null,null,null,null,null,"Assigned EB Number","EB-2014-0002",null,null,null,null,null,null,null,null,null,null,null,null,null,null,null,null,null,null,null,"Company Name"]
{"$rows_left_out":79}
{"sheet":"2. Table of Contents","index":1,"n_rows":29,"n_cols":9,"rows_kept":29,"cut":false,"hidden":false,"merged":[[0,2,0,4],[1,3,1,6],[3,3,3,4],[28,1,28,11],[24,1,24,7],[25,1,25,7],[26,1,26,7],[27,1,27,11]]}
[]
[]
[]
[]
[]
[]
[]
[]
[]
[]
[null,null,null,"1. Info",null,null,null,null,"6. Taxes_PILs"]
[]
[null,null,null,"2. Table of Contents",null,null,null,null,"7. Cost_of_Capital"]
[]
[null,null,null,"3. Data_Input_Sheet",null,null,null,null,"8. Rev_Def_Suff"]
[]
[null,null,null,"4. Rate_Base",null,null,null,null,"9. Rev_Reqt"]
[]
[null,null,null,"5. Utility Income"]
[]
{"$rows_left_out":10}
{"sheet":"3. Data_Input_Sheet","index":2,"n_rows":78,"n_cols":23,"rows_kept":78,"cut":false,"hidden":false,"merged":[[87,2,88,20],[70,2,70,20],[71,2,71,20],[69,2,69,20],[86,2,86,20],[74,2,74,20],[80,2,80,20],[72,2,72,20],[75,2,75,20],[76,2,76,20],[81,2,81,20],[82,2,82,20],[83,2,83,20],[84,2,84,20],[85,2,85,20],[73,2,73,20],[79,2,79,20],[77,2,78,20],[0,2,0,12],[7,4,7,20],[19,24,20,24],[68,2,68,20],[3,2,3,10],[1,2,1,10],[2,2,2,10],[11,14,12,14],[11,6,12,6],[11,16,12,16],[11,4,12,4],[11,8,12,8],[11,20,12,20],[11,12,12,12]]}
[null,null,null,null,null,null,null,null,null,null,null,null,null,null,null,null,null,null,null,null,{"$f":"CONCATENATE('2. Table of Contents'!$F$6,\" \",'2. Table of Contents'!$G$6)","v":" "}]
[]
[]
[]
[]
[]
[]
[]
[null,"Data Input (1)"]
[]
[]
[null,null,null,null,"Initial Application",null,"(2)",null,{"$f":"IF(ISBLANK(M12),\"\",\"Adjustments\")","v":""},null,null,null,null,null,"(6)",null,{"$f":"IF(ISBLANK(M12),\"\",\"Adjustments\")","v":""},null,null,null,"Per Board Decision"]
[]
[]
[null,1,"Rate Base"]
[null,null,"   Gross Fixed Assets (average)",null,535997407.02115536,null,null,null,null,null,null,null,{"$f":"IF(ISBLANK(E16),0,E16+I16)","v":535997407.02115536},null,null,null,null,null,null,null,{"$f":"IF(ISBLANK(E16),\"\",E16+I16+Q16)","v":535997407.02115536}]
[null,null,"   Accumulated Depreciation (average)",null,-110984931.93609791,null,"(5)",null,null,null,null,null,{"$f":"IF(ISBLANK(E17),0,E17+I17)","v":-110984931.93609791},null,null,null,null,null,null,null,{"$f":"IF(ISBLANK(E17),\"\",E17+I17+Q17)","v":-110984931.93609791}]
[null,null,"Allowance for Working Capital:"]
[null,null,"   Controllable Expenses",null,64394130.706022486,null,null,null,null,null,null,null,{"$f":"IF(ISBLANK(E19),0,E19+I19)","v":64394130.706022486},null,null,null,null,null,null,null,{"$f":"IF(ISBLANK(E19),\"\",E19+I19+Q19)","v":64394130.706022486}]
[null,null,"   Cost of Power",null,541395014.58398044,null,null,null,null,null,null,null,{"$f":"IF(ISBLANK(E20),0,E20+I20)","v":541395014.58398044},null,null,null,null,null,null,null,{"$f":"IF(ISBLANK(E20),\"\",E20+I20+Q20)","v":541395014.58398044}]
{"$rows_left_out":59}
{"sheet":"4. Rate_Base","index":3,"n_rows":35,"n_cols":23,"rows_kept":35,"cut":false,"hidden":false,"merged":[[2,2,2,6],[3,2,3,6],[0,2,0,10],[1,2,1,22],[32,1,32,22],[17,6,18,6],[17,10,18,10],[17,22,18,22],[17,3,18,3],[21,3,21,22],[17,14,18,14],[17,18,18,18],[33,3,33,22],[34,3,34,22],[35,3,35,22],[40,3,40,22],[41,3,41,22],[36,3,36,22],[37,3,37,22],[38,3,38,22],[39,3,39,22]]}
[]
[]
[]
[]
[]
[null,"Rate Base and Working Capital"]
[]
[]
[]
[null,null,null,"Rate Base"]
[null,"Line No.",null,"Particulars",null,null,"Initial Application",null,null,null,{"$f":"IF(ISBLANK('3. Data_Input_Sheet'!M12),\"\",'3. Data_Input_Sheet'!I12)","v":""},null,null,null,{"$f":"IF(ISBLANK('3. Data_Input_Sheet'!M12),\" \",'3. Data_Input_Sheet'!M12)","v":" "},null,null,null,{"$f":"IF(ISBLANK('3. Data_Input_Sheet'!Q12),\"\",'3. Data_Input_Sheet'!Q12)","v":""},null,null,null,{"$f":"'3. Data_Input_Sheet'!U12","v":"Per Board Decision"}]
[]
[null,1,null,"Gross Fixed Assets (average)","(3)",null,{"$f":"'3. Data_Input_Sheet'!E16","v":535997407.02115536},null,null,null,{"$f":"'3. Data_Input_Sheet'!I16","v":0},null,null,null,{"$f":"G13+K13","v":535997407.02115536},null,null,null,{"$f":"'3. Data_Input_Sheet'!Q16","v":0},null,null,null,{"$f":"G13+K13+S13","v":535997407.02115536}]
[null,2,null,"Accumulated Depreciation (average)","(3)",null,{"$f":"'3. Data_Input_Sheet'!E17","v":-110984931.93609791},null,null,null,{"$f":"'3. Data_Input_Sheet'!I17","v":0},null,null,null,{"$f":"G14+K14","v":-110984931.93609791},null,null,null,{"$f":"'3. Data_Input_Sheet'!Q17","v":0},null,null,null,{"$f":"G14+K14+S14","v":-110984931.93609791}]
[null,3,null,"Net Fixed Assets (average)","(3)",null,{"$f":"SUM(G13:G14)","v":425012475.08505744},null,null,null,{"$f":"SUM(K13:K14)","v":0},null,null,null,{"$f":"SUM(O13:O14)","v":425012475.08505744},null,null,null,{"$f":"SUM(S13:S14)","v":0},null,null,null,{"$f":"SUM(W13:W14)","v":425012475.08505744}]
[]
[null,4,null,"Allowance for Working Capital","(1)",null,{"$f":"G30","v":76935221.451830372},null,null,null,{"$f":"K30","v":0},null,null,null,{"$f":"O30","v":76935221.451830372},null,null,null,{"$f":"S30","v":0},null,null,null,{"$f":"W30","v":76935221.451830372}]
[null,null,null,"Total Rate Base",null,null,{"$f":"G17+G15","v":501947696.53688782},null,null,null,{"$f":"K17+K15","v":0},null,null,null,{"$f":"O17+O15","v":501947696.53688782},null,null,null,{"$f":"S17+S15","v":0},null,null,null,{"$f":"W15+W17","v":501947696.53688782}]
[null,5]
[null,null,"(1)","Allowance for Working Capital - Derivation"]
{"$rows_left_out":16}
{"sheet":"5. Utility Income","index":4,"n_rows":49,"n_cols":22,"rows_kept":49,"cut":false,"hidden":false,"merged":[[56,3,56,21],[54,3,54,21],[55,3,55,21],[51,3,51,21],[26,5,27,5],[53,3,53,21],[52,3,52,21],[47,5,48,5],[47,21,48,21],[41,1,41,21],[36,13,37,13],[26,21,27,21],[26,13,27,13],[34,13,35,13],[26,17,27,17],[34,17,35,17],[0,2,0,11],[2,2,2,7],[3,2,3,7],[1,2,1,21],[17,21,18,21],[17,13,18,13],[17,17,18,17],[7,5,7,21],[17,5,18,5],[17,9,18,9],[26,9,27,9],[34,21,35,21],[34,5,35,5],[36,21,37,21],[36,5,37,5],[36,17,37,17],[47,9,48,9],[47,13,48,13],[47,17,48,17],[34,9,35,9],[36,9,37,9]]}
[]
[]
[]
[]
[]
[]
[]
[]
[]
[]
[null,"Utility Income"]
[]
[null,"Line No.",null,"Particulars                                ",null,"Initial Application   ",null,null,null,{"$f":"IF(N13=\"\",\"\",\"Adjustments\")","v":""},null,null,null,{"$f":"IF(ISBLANK('3. Data_Input_Sheet'!M12),\"\",'3. Data_Input_Sheet'!M12)","v":""},null,null,null,{"$f":"IF(N13=\"\",\"\",\"Adjustments\")","v":""},null,null,null,{"$f":"'3. Data_Input_Sheet'!U12","v":"Per Board Decision"}]
[]
[null,null,null,"Operating Revenues:"]
[null,1,null,"Distribution Revenue (at Proposed Rates)",null,{"$f":"'3. Data_Input_Sheet'!E26","v":118628500.58247563},null,null,null,{"$f":"N16-F16","v":-118628500.58247563},null,null,null,{"$f":"'3. Data_Input_Sheet'!M26","v":0},null,null,null,{"$f":"V16-N16","v":0},null,null,null,{"$f":"IF(ISBLANK('3. Data_Input_Sheet'!U26),'5. Utility Income'!N16,'3. Data_Input_Sheet'!U26)","v":0}]
[null,2,null,"Other Revenue","(1)",{"$f":"F48","v":5516509.2400000002},null,null,null,{"$f":"N17-F17","v":-5516509.2400000002},null,null,null,{"$f":"N48","v":0},null,null,null,{"$f":"V17-N17","v":0},null,null,null,{"$f":"V48","v":0}]
[null,null,null,null,null,{"$f":"SUM(F16:F17)","v":124145009.82247563},null,null,null,{"$f":"SUM(J16:J17)","v":-124145009.82247563},null,null,null,{"$f":"SUM(N16:N17)","v":0},null,null,null,{"$f":"SUM(R16:R17)","v":0},null,null,null,{"$f":"SUM(V16:V17)","v":0}]
[null,3,null,"Total Operating Revenues"]
[]
{"$rows_left_out":30}
{"sheet":"6. Taxes_PILs","index":5,"n_rows":45,"n_cols":15,"rows_kept":45,"cut":false,"hidden":false,"merged":[[0,3,0,12],[2,2,2,6],[3,2,3,6],[1,2,1,14],[43,1,43,14],[8,1,8,12],[25,6,26,6],[25,14,26,14],[15,3,15,4],[17,3,17,4],[19,3,19,4],[32,3,32,4],[25,10,26,10],[44,3,44,14],[51,3,51,14],[52,3,52,14],[45,3,45,14],[49,3,49,14],[50,3,50,14]]}
[]
[]
[]
[]
[]
[]
[]
[]
[null,"Taxes/PILs"]
[]
[]
[null,"Line No.",null,"Particulars ",null,null,"Application",null,null,null,{"$f":"IF(ISBLANK('3. Data_Input_Sheet'!M12),\"\",'3. Data_Input_Sheet'!M12)","v":""},null,null,null,{"$f":"'3. Data_Input_Sheet'!U12","v":"Per Board Decision"}]
[]
[null,null,null,"Determination of Taxable Income"]
[]
[null,1,null,"Utility net income before taxes",null,null,{"$f":"'7. Cost_of_Capital'!P22","v":18792921.758341081},null,null,null,{"$f":"'7. Cost_of_Capital'!P38","v":0},null,null,null,{"$f":"'7. Cost_of_Capital'!P54","v":0}]
[]
[null,2,null,"Adjustments required to arrive at taxable utility income",null,null,{"$f":"'3. Data_Input_Sheet'!E44","v":-6329306.3325322717},null,null,null,{"$f":"'3. Data_Input_Sheet'!M44","v":0},null,null,null,{"$f":"IF(ISBLANK('3. Data_Input_Sheet'!U44),G18,'3. Data_Input_Sheet'!U44)","v":-6329306.3325322717}]
[]
[null,3,null,"Taxable income",null,null,{"$f":"G16+G18","v":12463615.42580881},null,null,null,{"$f":"K16+K18","v":0},null,null,null,{"$f":"O16+O18","v":-6329306.3325322717}]
{"$rows_left_out":26}
{"sheet":"7. Cost_of_Capital","index":6,"n_rows":62,"n_cols":16,"rows_kept":62,"cut":false,"hidden":false,"merged":[[0,2,0,13],[2,2,2,13],[3,2,3,9],[1,2,1,17],[12,5,12,9],[4,1,4,13],[10,5,10,9],[67,3,67,15],[65,3,65,15],[61,3,61,15],[62,3,62,15],[63,3,63,15],[64,3,64,15],[13,3,13,15],[29,3,29,15],[44,5,44,9],[28,5,28,9],[66,3,66,15],[60,1,60,15],[45,3,45,15]]}
[]
[]
[]
[]
[null,"Capitalization/Cost of Capital"]
[]
[]
[]
[]
[]
[null,"Line No.",null,"Particulars",null,"Capitalization Ratio",null,null,null,null,null,"Cost Rate",null,null,null,"Return"]
[]
[null,null,null,null,null,"Initial Application"]
[]
[null,null,null,null,null,"(%)",null,null,null,"($)",null,"(%)",null,null,null,"($)"]
[null,null,null,"Debt"]
[null,1,null,"  Long-term Debt",null,{"$f":"'3. Data_Input_Sheet'!E55","v":0.56000000000000005},null,null,null,{"$f":"$J$26*F17","v":281090710.0606572},null,{"$f":"'3. Data_Input_Sheet'!E62","v":3.4713157894736842E-2},null,null,null,{"$f":"L17*J17","v":9757546.2010792866}]
[null,2,null,"  Short-term Debt",null,{"$f":"'3. Data_Input_Sheet'!E56","v":0.04},null,null,null,{"$f":"$J$26*F18","v":20077907.861475512},null,{"$f":"'3. Data_Input_Sheet'!E63","v":2.1100000000000001E-2},null,null,null,{"$f":"L18*J18","v":423643.85587713332}]
[null,3,null,"Total Debt",null,{"$f":"SUM(F17:F18)","v":0.60000000000000009},null,null,null,{"$f":"SUM(J17:J18)","v":301168617.92213273},null,{"$f":"IF(F19=0,0,SUMPRODUCT(F17:F18,L17:L18)/F19)","v":3.3805614035087715E-2},null,null,null,{"$f":"SUM(P17:P18)","v":10181190.05695642}]
[]
{"$rows_left_out":43}
{"sheet":"8. Rev_Def_Suff","index":7,"n_rows":56,"n_cols":16,"rows_kept":56,"cut":false,"hidden":false,"merged":[[0,2,0,14],[1,2,1,14],[2,2,2,14],[3,2,3,7],[54,1,54,8],[14,3,15,3],[14,1,15,1],[12,5,12,7],[59,3,59,15],[55,3,55,15],[57,3,57,15],[58,3,58,15],[7,5,7,15],[14,7,15,7],[14,15,15,15],[14,5,15,5],[12,13,12,15],[14,13,15,13],[12,9,12,11],[14,9,15,9],[14,11,15,11],[56,3,56,15]]}
[null,null,null,null,null,null,null,null,null,null,null,null,null,null,null,{"$f":"CONCATENATE('2. Table of Contents'!$F$6,\" \",'2. Table of Contents'!$G$6)","v":" "}]
[]
[]
[]
[]
[]
[]
[]
[]
[null,"Revenue Deficiency/Sufficiency"]
[]
[]
[null,null,null,null,null,"Initial Application",null,null,null,{"$f":"IF(ISBLANK('3. Data_Input_Sheet'!M12),\"\",'3. Data_Input_Sheet'!M12)","v":""},null,null,null,{"$f":"'3. Data_Input_Sheet'!U12","v":"Per Board Decision"}]
[]
[null,"Line No.",null,"Particulars",null,"At Current Approved Rates",null,"At Proposed Rates",null,"At Current Approved Rates",null,"At Proposed Rates",null,"At Current Approved Rates",null,"At Proposed Rates"]
[]
[]
[]
[null,1,null,"Revenue Deficiency from Below",null,null,null,{"$f":"F52","v":5299580.516256311},null,null,null,{"$f":"J52","v":-24836384.602227587},null,null,null,{"$f":"N52","v":90881754.764698654}]
[null,2,null,"Distribution Revenue",null,{"$f":"'3. Data_Input_Sheet'!E25","v":113328920.06621931},null,{"$f":"'3. Data_Input_Sheet'!E26-H19","v":113328920.06621931},null,{"$f":"IF(ISBLANK('3. Data_Input_Sheet'!M25),'3. Data_Input_Sheet'!E25,'3. Data_Input_Sheet'!M25)","v":113328920.06621931},null,{"$f":"IF(ISBLANK('3. Data_Input_Sheet'!M26),'3. Data_Input_Sheet'!E26-L19,'3. Data_Input_Sheet'!M26-L19)","v":143464885.18470323},null,{"$f":"IF(ISBLANK('3. Data_Input_Sheet'!U25),'3. Data_Input_Sheet'!M25,'3. Data_Input_Sheet'!U25)","v":0},null,{"$f":"IF(ISBLANK('3. Data_Input_Sheet'!U26),'3. Data_Input_Sheet'!M26-P19,'3. Data_Input_Sheet'!U26-P19)","v":-90881754.764698654}]
{"$rows_left_out":37}
{"sheet":"9. Rev_Reqt","index":8,"n_rows":39,"n_cols":17,"rows_kept":39,"cut":false,"hidden":false,"merged":[[42,3,42,16],[43,3,43,16],[44,3,44,16],[15,13,15,14],[16,13,16,14],[20,13,20,14],[24,13,24,14],[39,3,39,16],[40,3,40,16],[37,1,37,14],[31,13,31,14],[32,9,33,9],[34,9,35,9],[34,5,35,5],[32,5,33,5],[12,13,12,14],[7,5,7,14],[41,3,41,16],[32,13,33,14],[34,13,35,14],[0,2,0,13],[0,14,0,16],[19,13,19,14],[30,13,30,14],[17,13,17,14],[18,13,18,14],[21,13,21,14],[22,13,22,14],[29,13,29,14],[26,13,26,14],[27,13,27,14],[1,2,1,17],[2,2,2,17],[3,2,3,13],[14,13,14,14],[13,13,13,14]]}
[]
[]
[]
[]
[]
[]
[]
[]
[]
[]
[null,"Revenue Requirement"]
[]
[null,"Line No.",null,"Particulars",null,"Application   ",null,null,null,{"$f":"IF(ISBLANK('3. Data_Input_Sheet'!M12),\"\",'3. Data_Input_Sheet'!M12)","v":""},null,null,null,{"$f":"'3. Data_Input_Sheet'!U12","v":"Per Board Decision"}]
[]
[null,1,null,"OM&A Expenses",null,{"$f":"'5. Utility Income'!F22","v":64089437.490003996},null,null,null,{"$f":"'5. Utility Income'!N22","v":64089437.490003996},null,null,null,{"$f":"'5. Utility Income'!V22","v":64089437.490003996}]
[null,2,null,"Amortization/Depreciation",null,{"$f":"'5. Utility Income'!F23","v":26487624.058676168},null,null,null,{"$f":"'5. Utility Income'!N23","v":26487624.058676168},null,null,null,{"$f":"'5. Utility Income'!V23","v":26487624.058676168}]
[null,3,null,"Property Taxes",null,{"$f":"'5. Utility Income'!F24","v":304693.21601849998},null,null,null,{"$f":"'5. Utility Income'!N24","v":304693.21601849998},null,null,null,{"$f":"'5. Utility Income'!V24","v":304693.21601849998}]
[null,4,null,"Capital Taxes",null,{"$f":"'6. Taxes_PILs'!G25","v":0},null,null,null,{"$f":"'6. Taxes_PILs'!K25","v":0},null,null,null,{"$f":"'6. Taxes_PILs'!O25","v":0}]
[null,5,null,"Income Taxes (Grossed up)",null,{"$f":"'6. Taxes_PILs'!G33-F18","v":4289143.2424794603},null,null,null,{"$f":"'6. Taxes_PILs'!K33-J18","v":4289143.2424794603},null,null,null,{"$f":"'6. Taxes_PILs'!O33-N18","v":4289143.2424794603}]
[null,6,null,"Other Expenses",null,{"$f":"'5. Utility Income'!F26","v":0},null,null,null,{"$f":"'5. Utility Income'!N26","v":""},null,null,null,{"$f":"'5. Utility Income'!V26","v":""}]
{"$rows_left_out":19}