{"text_format":"1","workbook":"xlsx","n_sheets":11,"sheets":["Admin","Load Forecast","OPA Results","CDM Target","OPA Total Results","Net To Gross Calculation","Load Forecast Adjustment","Adjustment To Load Forecast","LRAMVA Allocation","CDM Target By LDC","Sheet1"],"not_rendered":{"charts":0,"images":0,"macros":1,"external_links":2,"defined_names":0,"comments":0,"pivot_tables":0},"unopened":[],"bounds":{"document_bytes":16777216,"sheet_cells":100000,"rows_first":2000,"rows_last":500,"rows_between":2000,"halvings":0,"cell_chars":16384,"cell_head_chars":4096},"cells_cut":0,"cells_raw":0,"read":"whole","date_system":"1900"}

{"sheet":"Admin","index":0,"n_rows":9,"n_cols":3,"rows_kept":9,"cut":false,"hidden":true,"merged":[]}
[]
[]
[]
[null,"Utility"]
[null,"Burlington Hydro Inc.   "]
[]
[null,"2014 Target"]
[null,"kWh",{"$f":"VLOOKUP(B5,'CDM Target By LDC'!B2:D83,3,0)*1000000","v":82370000}]
[null,"kW",{"$f":"VLOOKUP(B5,'CDM Target By LDC'!B2:D83,2,0)*1000","v":21950}]

{"sheet":"Load Forecast","index":1,"n_rows":62,"n_cols":9,"rows_kept":62,"cut":false,"hidden":false,"merged":[[1,1,1,8],[24,1,24,2],[35,1,35,2],[45,1,45,2]]}
[]
[null,"Load Forecast"]
[null,{"$f":"Admin!B5","v":"Burlington Hydro Inc.   "}]
[]
[null,"Customers or Connections"]
[]
[null,"Customer Class Name","2010 Board Appr","2010 Actual","2011 Actual","2012 Actual","2012 Actual Normalized","Bridge Year 2013 Normalized","Test Year 2014 Normalized"]
[null,"Residential",57218,57917,58488,59068,null,59375,59869]
[null,"General Service < 50 kW",4942,4988,5091,5138,null,5164,5224]
[null,"General Service > 50 to 4999 kW",976,996,987,998,null,1008,1012]
[null,"Unmetered Scattered Load",602,604,604,605,null,605,605]
[null,"Street Lighting ",14457,14652,15024,15083,null,15114,15272]
[null,"TOTAL",78195,79157,80194,80892,null,81266,81982]
[null,"  "]
[null,"Metered kWh"]
{"$rows_left_out":48}
{"sheet":"OPA Results","index":2,"n_rows":17,"n_cols":6,"rows_kept":17,"cut":false,"hidden":false,"merged":[]}
[]
["Post 2010 OPA Final Results"]
[{"$f":"Admin!B5","v":"Burlington Hydro Inc.   "}]
[]
["Source: 2011 OPA Final Report",2011,2012,2013,2014,"Total"]
[]
["2011  Final kWh - Net",{"$f":"'[1]3.1.1 Summary - LDC'!$B$21*1000000","v":7350137.626871543},{"$f":"'[1]3.1.1 Summary - LDC'!$C$21*1000000","v":7301303.0768715432},{"$f":"'[1]3.1.1 Summary - LDC'!$D$21*1000000","v":7301303.0768715432},{"$f":"'[1]3.1.1 Summary - LDC'!$E$21*1000000","v":7238674.3407178121},{"$f":"SUM(B7:E7)","v":29191418.121332441}]
[]
["2011  Final kW - Net",{"$f":"'[1]3.1.1 Summary - LDC'!$B$7*1000","v":2932.3500068921639},{"$f":"'[1]3.1.1 Summary - LDC'!$C$7*1000","v":1768.5155068921636},{"$f":"'[1]3.1.1 Summary - LDC'!$D$7* 1000","v":1768.5155068921636},{"$f":"'[1]3.1.1 Summary - LDC'!$E$7*1000","v":1744.9173497003426}]
[]
["Source: 2012 OPA Final Report *",2011,2012,2013,2014]
[]
["2012  Final kWh - Net",0,8414807,{"$f":"8414807-46660","v":8368147},{"$f":"8414807-46660-225899","v":8142248},{"$f":"SUM(B13:E13)","v":24925202}]
[]
["2012  Final kW - Net",0,4739,1947,{"$f":"1947-74","v":1873}]
{"$rows_left_out":3}
{"sheet":"CDM Target","index":3,"n_rows":38,"n_cols":7,"rows_kept":38,"cut":false,"hidden":false,"merged":[[4,1,4,6],[5,1,5,6],[22,1,22,6],[23,1,23,6]]}
[]
[null,"Calculate proportionate CDM savings required to achieve CDMTarget"]
[null,{"$f":"Admin!B5","v":"Burlington Hydro Inc.   "}]
[null,"Schedule to achieve 4 Year kWH CDM Target"]
[null,"4 Year 2011 - 2014 kWh CDM Target"]
[null,{"$f":"Admin!C8","v":82370000}]
[null,"%",2011,2012,2013,2014,"Total"]
[null,"2011 Programs",{"$f":"C15/$G$19","v":8.9233187166098613E-2},{"$f":"D15/$G$19","v":8.8640319010216628E-2},{"$f":"E15/$G$19","v":8.8640319010216628E-2},{"$f":"F15/$G$19","v":8.7879984711883116E-2},{"$f":"SUM(C8:F8)","v":0.35439380989841501}]
[null,"2012 Programs",null,{"$f":"D16/$G$19","v":0.10215863785358748},{"$f":"E16/$G$19","v":0.10159216947917932},{"$f":"F16/$G$19","v":9.8849678280927528E-2},{"$f":"SUM(C9:F9)","v":0.30260048561369435}]
[null,"2013 Programs",null,null,{"$f":"E17/$G$19","v":0.11433523482929692},{"$f":"F17/$G$19","v":0.11433523482929692},0.22867046965859383]
[null,"2014 Programs",null,null,null,{"$f":"F18/$G$19","v":0.11433523482929692},0.11433523482929692]
[null,null,{"$f":"SUM(C8:C11)","v":8.9233187166098613E-2},{"$f":"SUM(D8:D11)","v":0.1907989568638041},0.30456772331869286,0.41540013265140446,1]
[]
[null,"kWh",2011,2012,2013,2014,"Total"]
[null,"2011 Programs",{"$f":"'OPA Results'!B7","v":7350137.626871543},{"$f":"'OPA Results'!C7","v":7301303.0768715432},{"$f":"'OPA Results'!D7","v":7301303.0768715432},{"$f":"'OPA Results'!E7","v":7238674.3407178121},{"$f":"SUM(C15:F15)","v":29191418.121332441}]
{"$rows_left_out":24}
{"sheet":"OPA Total Results","index":4,"n_rows":24,"n_cols":20,"rows_kept":24,"cut":false,"hidden":true,"merged":[[0,0,0,19]]}
["Summary of OPA Final Results 2006 to 2012"]
[{"$f":"Admin!B5 & \" (kWh)\"","v":"Burlington Hydro Inc.    (kWh)"}]
[null,"2006 - 2010 Gross kWh","2011 Gross kWh","2012 Gross kWh","Total Gross kWh",null,"2006 - 2010 Net kWh","2011 Net kWh","2012 Net kWh","Total Net kWh",null,"2006 - 2010 Gross - Net","2011 Gross - Net","2012 Gross - Net","Total  Gross - Net",null,"2006 - 2010",2011,2012,"Total"]
[2006,{"$f":"'[2]Initiative Level - LDC'!$G$331*1000","v":5771014.0808791108},null,null,{"$f":"SUM(B4:D4)","v":5771014.0808791108},null,{"$f":"'[2]Initiative Level - LDC'!$G$167*1000","v":5167438.2766911807},null,null,{"$f":"SUM(G4:I4)","v":5167438.2766911807},null,{"$f":"B4-G4","v":603575.80418793019},null,null,{"$f":"SUM(L4:N4)","v":603575.80418793019},null,{"$f":"L4/G4","v":0.11680367947702174},0,null,{"$f":"O4/J4","v":0.11680367947702174}]
[2007,{"$f":"'[2]Initiative Level - LDC'!$H$331*1000","v":27552093.400315437},null,null,{"$f":"SUM(B5:D5)","v":27552093.400315437},null,{"$f":"'[2]Initiative Level - LDC'!$H$167*1000","v":9935709.405033052},null,null,{"$f":"SUM(G5:I5)","v":9935709.405033052},null,17616383.995282385,null,null,{"$f":"SUM(L5:N5)","v":17616383.995282385},null,{"$f":"L5/G5","v":1.7730373622198126},0,null,1.7730373622198126]
[2008,{"$f":"'[2]Initiative Level - LDC'!$I$331*1000","v":19658220.490221959},null,null,19658220.490221959,null,{"$f":"'[2]Initiative Level - LDC'!$I$167*1000","v":11642922.267121691},null,null,11642922.267121691,null,8015298.2231002674,null,null,8015298.2231002674,null,0.68842667151824688,0,null,0.68842667151824688]
[2009,{"$f":"'[2]Initiative Level - LDC'!$J$331*1000","v":28861543.722327568},null,null,28861543.722327568,null,{"$f":"'[2]Initiative Level - LDC'!$J$167*1000","v":19516778.466147497},null,null,19516778.466147497,null,9344765.2561800703,null,null,9344765.2561800703,null,0.47880674940225804,0,null,0.47880674940225804]
[2010,{"$f":"'[2]Initiative Level - LDC'!$K$331*1000","v":33971532.11663311},null,null,33971532.11663311,null,{"$f":"'[2]Initiative Level - LDC'!$K$167*1000","v":21547449.393191714},null,null,21547449.393191714,null,12424082.723441396,null,null,12424082.723441396,null,0.5765918042887711,0,null,0.5765918042887711]
[2011,{"$f":"'[2]Initiative Level - LDC'!$L$331*1000","v":31877404.276793193},{"$f":"'[1]2.5.2 Results - LDC'!$G$11","v":11420082.567430567},null,43297486.84422376,null,{"$f":"'[2]Initiative Level - LDC'!$L$167*1000","v":19422234.95707427},{"$f":"'[1]3.1.1 Summary - LDC'!$B$21*1000000","v":7350137.626871543},null,26772372.583945811,null,12455169.319718923,{"$f":"C9-H9","v":4069944.940559024},null,16525114.260277947,null,{"$f":"L9/G9","v":0.64128404106152093},0.55372363718464479,null,{"$f":"O9/J9","v":0.61724504275677516}]
[2012,{"$f":"'[2]Initiative Level - LDC'!$M$331*1000","v":30741594.184107628},{"$f":"[1]Sheet1!$C$73","v":11371248.017430568},{"$f":"C9","v":11420082.567430567},53532924.768968761,null,{"$f":"'[2]Initiative Level - LDC'!$M$167*1000","v":18853327.973227594},{"$f":"'[1]3.1.1 Summary - LDC'!$C$21*1000000","v":7301303.0768715432},{"$f":"H9","v":7350137.626871543},33504768.676970683,null,11888266.210880034,{"$f":"C10-H10","v":4069944.9405590249},{"$f":"D10-I10","v":4069944.940559024},20028156.091998085,null,0.63056592596075345,0.55742720137881363,{"$f":"N10/I10","v":0.55372363718464479},0.59777031398412039]
[2013,{"$f":"'[2]Initiative Level - LDC'!$N$331*1000","v":30453612.06899529},{"$f":"[1]Sheet1!$D$73","v":11371248.017430568},{"$f":"C10","v":11371248.017430568},53196108.103856422,null,{"$f":"'[2]Initiative Level - LDC'!$N$167*1000","v":18705307.670763351},{"$f":"'[1]3.1.1 Summary - LDC'!$D$21*1000000","v":7301303.0768715432},{"$f":"H10","v":7301303.0768715432},33307913.824506439,null,11748304.398231938,{"$f":"C11-H11","v":4069944.9405590249},{"$f":"D11-I11","v":4069944.9405590249},19888194.27934999,null,0.62807330438059017,0.55742720137881363,{"$f":"N11/I11","v":0.55742720137881363},0.59710116893352738]
[2014,{"$f":"'[2]Initiative Level - LDC'!$O$331*1000","v":28811951.517806482},{"$f":"[1]Sheet1!$E$73","v":11371248.017430568},11371248.017430568,51554447.552667618,null,{"$f":"'[2]Initiative Level - LDC'!$O$167*1000","v":17865939.839519329},{"$f":"'[1]3.1.1 Summary - LDC'!$E$21*1000000","v":7238674.3407178121},7301303.0768715432,32405917.257108685,null,10946011.678287152,{"$f":"C12-H12","v":4132573.676712756},4069944.9405590249,19148530.295558933,null,0.61267483136121692,0.5709020025209417,{"$f":"N12/I12","v":0.55742720137881363},0.5908961052894881]
[]
[]
[null,"2006 - 2010 Gross kW","2011 Gross kW","2012 Gross kW","Total Gross kW",null,"2006 - 2010 Net kW","2011 Net kW","2012 Net kW","Total Net kW",null,"2006 - 2010 Gross - Net","2011 Gross - Net","2012 Gross - Net","Total  Gross - Net",null,"2006 - 2010",2011,2012,"Total"]
{"$rows_left_out":10}
{"sheet":"Net To Gross Calculation","index":5,"n_rows":26,"n_cols":6,"rows_kept":26,"cut":false,"hidden":true,"merged":[[2,1,3,1],[15,1,16,1],[0,1,0,5]]}
[null,"NET to GROSS Calculation"]
[null,{"$f":"Admin!B5 & \" (kWh)\"","v":"Burlington Hydro Inc.    (kWh)"}]
[null,"Year","OPA 2006-2012 Final CDM Results (Gross)","OPA 2006-2012 Final CDM Results (Net)","Difference","% Difference of Net"]
[null,null,"(a)","(b)","(c) = (a) – (b)","(d) = (c) / (b)"]
[null,2006,{"$f":"'OPA Total Results'!E4","v":5771014.0808791108},{"$f":"'OPA Total Results'!J4","v":5167438.2766911807},{"$f":"C5-D5","v":603575.80418793019},{"$f":"E5/D5","v":0.11680367947702174}]
[null,2007,{"$f":"'OPA Total Results'!E5","v":27552093.400315437},{"$f":"'OPA Total Results'!J5","v":9935709.405033052},{"$f":"C6-D6","v":17616383.995282385},{"$f":"E6/D6","v":1.7730373622198126}]
[null,2008,{"$f":"'OPA Total Results'!E6","v":19658220.490221959},{"$f":"'OPA Total Results'!J6","v":11642922.267121691},8015298.2231002674,0.68842667151824688]
[null,2009,{"$f":"'OPA Total Results'!E7","v":28861543.722327568},{"$f":"'OPA Total Results'!J7","v":19516778.466147497},9344765.2561800703,0.47880674940225804]
[null,2010,{"$f":"'OPA Total Results'!E8","v":33971532.11663311},{"$f":"'OPA Total Results'!J8","v":21547449.393191714},12424082.723441396,0.5765918042887711]
[null,2011,{"$f":"'OPA Total Results'!E9","v":43297486.84422376},{"$f":"'OPA Total Results'!J9","v":26772372.583945811},16525114.260277949,0.61724504275677528]
[null,2012,{"$f":"'OPA Total Results'!E10","v":53532924.768968761},{"$f":"'OPA Total Results'!J10","v":33504768.676970683},20028156.091998078,0.59777031398412006]
[null,2013,{"$f":"'OPA Total Results'!E11","v":53196108.103856422},{"$f":"'OPA Total Results'!J11","v":33307913.824506439},19888194.279349983,0.59710116893352716]
[null,2014,{"$f":"'OPA Total Results'!E12","v":51554447.552667618},{"$f":"'OPA Total Results'!J12","v":32405917.257108685},{"$f":"C13-D13","v":19148530.295558933},{"$f":"E13/D13","v":0.5908961052894881}]
[]
[null,{"$f":"Admin!B5 & \" (kW)\"","v":"Burlington Hydro Inc.    (kW)"}]
{"$rows_left_out":12}
{"sheet":"Load Forecast Adjustment","index":6,"n_rows":22,"n_cols":7,"rows_kept":22,"cut":false,"hidden":false,"merged":[]}
[]
[null,"Load Forecast Adjustment Calculation"]
[null,{"$f":"Admin!B5","v":"Burlington Hydro Inc.   "}]
[]
[null,null,"2014 CDM Threshold \n(kWh of incremental CDM savings needed in 2014)","Application Factor\n1.0 Full Year\n0.5 Half Year","2014 Net kWh Load Forecast CDM Adjustment","2014 Net to Gross Adjustment","2014 Load Forecast CDM Adjustment "]
[null,null,"A","B","C = A * B","D","E = C * (1 + D)"]
[null,"Year"]
[null,2011,{"$f":"'CDM Target'!F15","v":7238674.3407178121},0,{"$f":"C8*D8","v":0},{"$f":"'Net To Gross Calculation'!F13","v":0.5908961052894881},{"$f":"E8*(1+F8)","v":0}]
[null,2012,{"$f":"'CDM Target'!F16","v":8142248},0,{"$f":"C9*D9","v":0},{"$f":"F8","v":0.5908961052894881},{"$f":"E9*(1+F9)","v":0}]
[null,2013,{"$f":"'CDM Target'!F17","v":9417793.2928891871},0,0,{"$f":"F9","v":0.5908961052894881},0]
[null,2014,{"$f":"'CDM Target'!F18","v":9417793.2928891871},0.5,4708896.6464445936,{"$f":"F10","v":0.5908961052894881},7491365.3350394359]
[null,null,{"$f":"SUM(C8:C11)","v":34216508.926496185},null,{"$f":"SUM(E8:E11)","v":4708896.6464445936},null,{"$f":"SUM(G8:G11)","v":7491365.3350394359}]
[]
[]
[null,null,"2014 CDM Threshold \n(kWh of incremental CDM savings needed in 2014)","Application Factor\n1.0 Full Year\n0.5 Half Year","2014 Net kW Load Forecast CDM Adjustment","2014 Net to Gross Adjustment","2014 Load Forecast CDM Adjustment "]
{"$rows_left_out":8}
{"sheet":"Adjustment To Load Forecast","index":7,"n_rows":28,"n_cols":8,"rows_kept":28,"cut":false,"hidden":false,"merged":[[2,4,4,4],[2,6,4,6],[15,4,17,4],[15,6,17,6]]}
[null,"Adjustment To Load Forecast"]
[null,{"$f":"Admin!B5","v":"Burlington Hydro Inc.   "}]
[null,null,"Weather Normalized",null,"CDM Load Forecast Adjustment",null,"2014 CDM Adjusted Load Forecast"]
[null,"Retail","2014F"]
[null,"kWh","(Elenchus)"]
[null,null,"Source: Clarifying Question 7"]
[null,null,"A","C = A / B","E = D * C",null,"F = A - E"]
[null,"Residential (kWh)",555449406.54854131,{"$f":"C8/$C$13","v":0.33789596053105764},{"$f":"$E$13*D8","v":1591117.1553918722},null,{"$f":"C8-E8","v":553858289.39314938}]
[null,"GS<50 (kWh)",174342370.28596878,0.1060575130237187,{"$f":"$E$13*D9","v":499413.86740764277},null,{"$f":"C9-E9","v":173842956.41856113}]
[null,"GS>50 (kW)",899894473.08766222,0.54743187007793226,{"$f":"$E$13*D10","v":2577800.0971668675},null,897316672.99049532]
[null,"Street Lights (kW)",11000298.735369794,6.6918003034926749E-3,{"$f":"$E$13*D11","v":31510.996007793572},null,10968787.739362001]
[null,"USL (kWh)",3160882,1.9228560637988413E-3,{"$f":"$E$13*D12","v":9054.5304704180162},null,3151827.4695295822]
[null,"Total Customer (kWh)",{"$f":"SUM(C8:C12)","v":1643847430.657542},1,{"$f":"'Load Forecast Adjustment'!E12","v":4708896.6464445936},null,{"$f":"SUM(G8:G12)","v":1639138534.0110974},{"$f":"G13/C13-1","v":-2.8645582057216235E-3}]
[null,null,"B",null,"D"]
[]
{"$rows_left_out":14}
{"sheet":"LRAMVA Allocation","index":8,"n_rows":26,"n_cols":7,"rows_kept":26,"cut":false,"hidden":false,"merged":[[2,4,4,4],[14,4,16,4],[14,6,16,6]]}
[null,"LRAMVA Allocation"]
[null,{"$f":"Admin!B5","v":"Burlington Hydro Inc.   "}]
[null,null,"Weather Normalized",null,"LRAMVA (kWh)"]
[null,null,"2014F"]
[null,"kWh","(Elenchus)"]
[null,null,"A","C = A / B","E = D * C"]
[null,"Residential (kWh)",{"$f":"'Adjustment To Load Forecast'!C8","v":555449406.54854131},{"$f":"C7/$C$12","v":0.33789596053105764},{"$f":"$E$12*D7","v":11561620.149737936}]
[null,"GS<50 (kWh)",{"$f":"'Adjustment To Load Forecast'!C9","v":174342370.28596878},0.1060575130237187,{"$f":"$E$12*D8","v":3628917.8410980562}]
[null,"GS>50 (kW)",{"$f":"'Adjustment To Load Forecast'!C10","v":899894473.08766222},0.54743187007793226,{"$f":"$E$12*D9","v":18731207.469170067}]
[null,"Street Lights (kW)",{"$f":"'Adjustment To Load Forecast'!C11","v":11000298.735369794},6.6918003034926749E-3,{"$f":"$E$12*D10","v":228970.04481878699}]
[null,"USL (kWh)",{"$f":"'Adjustment To Load Forecast'!C12","v":3160882},1.9228560637988413E-3,{"$f":"$E$12*D11","v":65793.421671340373}]
[null,"Total Customer (kWh)",{"$f":"SUM(C7:C11)","v":1643847430.657542},1,{"$f":"'Load Forecast Adjustment'!C12","v":34216508.926496185}]
[null,null,"B",null,"D"]
[]
[null,null,"Weather Normalized",null,"Calculated (kW)",null,"LRAMVA (kW) * "]
{"$rows_left_out":12}
{"sheet":"CDM Target By LDC","index":9,"n_rows":84,"n_cols":16,"rows_kept":84,"cut":false,"hidden":true,"merged":[[0,2,0,3]]}
[null,null,"Target",null,null,0.1,0.1,null,0.2,0.2,null,0.3,0.3,null,0.4,0.4]
[null,"Distributor","MW","MWh",null,"MW","MWh",null,"MW","MWh",null,"MW","MWh",null,"MW","MWh"]
[1,"Algoma Power Inc.   ",1.28,7.37,null,{"$f":"$C3*F$1","v":0.128},{"$f":"$D3*G$1","v":0.7370000000000001},null,{"$f":"$C3*I$1","v":0.25600000000000001},{"$f":"$D3*J$1","v":1.4740000000000002},null,{"$f":"$C3*L$1","v":0.38400000000000001},{"$f":"$D3*M$1","v":2.2109999999999999},null,{"$f":"$C3*O$1","v":0.51200000000000001},{"$f":"$D3*P$1","v":2.9480000000000004}]
[2,"Atikokan Hydro Inc.   ",0.2,1.1599999999999999,null,{"$f":"$C4*F$1","v":2.0000000000000004E-2},{"$f":"$D4*G$1","v":0.11599999999999999},null,{"$f":"$C4*I$1","v":4.0000000000000008E-2},{"$f":"$D4*J$1","v":0.23199999999999998},null,{"$f":"$C4*L$1","v":0.06},{"$f":"$D4*M$1","v":0.34799999999999998},null,{"$f":"$C4*O$1","v":8.0000000000000016E-2},{"$f":"$D4*P$1","v":0.46399999999999997}]
[3,"Attawapiskat Power Corporation   ",7.0000000000000007E-2,0.28999999999999998,null,7.000000000000001E-3,2.8999999999999998E-2,null,1.4000000000000002E-2,5.7999999999999996E-2,null,2.1000000000000001E-2,8.6999999999999994E-2,null,2.8000000000000004E-2,0.11599999999999999]
[4,"Bluewater Power Distribution Corporation  ",10.65,53.73,null,1.0650000000000002,5.3730000000000002,null,2.1300000000000003,10.746,null,3.1949999999999998,16.119,null,4.2600000000000007,21.492000000000001]
[5,"Brant County Power Inc.  ",3.3,9.85,null,0.33,0.98499999999999999,null,0.66,1.97,null,0.98999999999999988,2.9549999999999996,null,1.32,3.94]
[6,"Brantford Power Inc.   ",11.38,48.92,null,1.1380000000000001,4.8920000000000003,null,2.2760000000000002,9.7840000000000007,null,3.4140000000000001,14.676,null,4.5520000000000005,19.568000000000001]
[7,"Elenchus Hydro Inc.   ",21.95,82.37,null,2.1949999999999998,8.2370000000000001,null,4.3899999999999997,16.474,null,6.585,24.711000000000002,null,8.7799999999999994,32.948]
[7,"Burlington Hydro Inc.   ",21.95,82.37,null,2.1949999999999998,8.2370000000000001,null,4.3899999999999997,16.474,null,6.585,24.711000000000002,null,8.7799999999999994,32.948]
[8,"COLLUS Power Corporation   ",3.14,14.97,null,0.31400000000000006,1.4970000000000001,null,0.62800000000000011,2.9940000000000002,null,0.94199999999999995,4.4909999999999997,null,1.2560000000000002,5.9880000000000004]
[9,"Cambridge and North Dumfries Hydro Inc.",17.68,73.66,null,1.768,7.3659999999999997,null,3.536,14.731999999999999,null,5.3039999999999994,22.097999999999999,null,7.0720000000000001,29.463999999999999]
[10,"Canadian Niagara Power Inc.  ",4.07,15.81,null,0.40700000000000003,1.5810000000000002,null,0.81400000000000006,3.1620000000000004,null,1.2210000000000001,4.7430000000000003,null,1.6280000000000001,6.3240000000000007]
[11,"Centre Wellington Hydro Ltd.  ",1.64,7.81,null,0.16400000000000001,0.78100000000000003,null,0.32800000000000001,1.5620000000000001,null,0.49199999999999994,2.343,null,0.65600000000000003,3.1240000000000001]
[12,"Chapleau Public Utilities Corporation  ",0.17,1.21,null,1.7000000000000001E-2,0.121,null,3.4000000000000002E-2,0.24199999999999999,null,5.1000000000000004E-2,0.36299999999999999,null,6.8000000000000005E-2,0.48399999999999999]
{"$rows_left_out":70}
{"sheet":"Sheet1","index":10,"n_rows":33,"n_cols":10,"rows_kept":33,"cut":false,"hidden":true,"merged":[]}
[]
["Table 16 – Burlington Hydro Forecast Summary"]
[null,"Residential Class",null,null,null,null,"GS<50 kW Class"]
["Year","Actual kWh","%","Normalized kWh","%",null,"Actual kWh","%","Normalized kWh","%"]
[2010,556896336,6.3E-2,543050505,1.0999999999999999E-2,null,172200325,-1E-3,174251015,3.0000000000000001E-3]
[2011,551353006,-0.01,546837854,7.0000000000000001E-3,null,174484065,1.2999999999999999E-2,174045762,-1E-3]
[2012,551839571,1E-3,552064145,0.01,null,174704767,1E-3,174672454,4.0000000000000001E-3]
[2013,null,null,553523828,3.0000000000000001E-3,null,null,null,173805678,-5.0000000000000001E-3]
[2014,null,null,556904597,6.0000000000000001E-3,null,null,null,174117497,2E-3]
[]
[]
[null,"GS>50 kW Class",null,null,null,null,"GS>50 kW Class"]
["Year","Actual kWh","%","Normalized kWh","%",null,"Actual kW","%","Normalized kW","%"]
[2010,906197008,3.1E-2,900569510,3.0000000000000001E-3,null,2403006,2.1000000000000001E-2,2388083,-6.0000000000000001E-3]
[2011,908229110,2E-3,899364853,-1E-3,null,2396756,-3.0000000000000001E-3,2373364,-6.0000000000000001E-3]
{"$rows_left_out":18}