{"text_format":"1","workbook":"xlsx","n_sheets":24,"sheets":["1. Info","Table of Contents-Corrected","A. Data Input Sheet-Corrected","B. Tax Rates & Exemptions","C. Sch 8 Hist","D. Schedule 10 CEC Hist","E. Sch 13 Tax Reserves Hist","F. Sch 7-1 Loss Cfwd Hist","G. Adj. Taxable Income Historic","H. PILS, Tax Provision Historic","I. Sch 8 CCA Bridge Year-Corr","J. Sch 10 CEC Bridge Year-Corr","K. Sch 13 Tax Reserves Bridge","L. Sch 7-1 Loss Cfwd Bridge","M. AdjTaxableIncomeBridge-Corr","Sch 7-3 Interest Bridge-Corr","N.PILs,TaxProvision Bridge-Corr","O.Sch 8 CCA Test Year-Corrected","P. Sch 10 CEC Test Year-Corr","Q. Sch 13 Tax Reserve Test Year","R. Sch 7-1 Loss Cfwd Test Year","S. TaxableIncome Test Year-Corr","Sch 7-3 InterestTestYear-Corr","T.PILs,TaxProvisionTestYr-Corr"],"not_rendered":{"charts":0,"images":2,"macros":1,"external_links":5,"defined_names":48,"comments":2,"pivot_tables":0},"unopened":[],"bounds":{"document_bytes":16777216,"sheet_cells":100000,"rows_first":2000,"rows_last":500,"rows_between":2000,"halvings":0,"cell_chars":16384,"cell_head_chars":4096},"cells_cut":0,"cells_raw":0,"read":"whole","date_system":"1900"}

{"sheet":"1. Info","index":0,"n_rows":78,"n_cols":28,"rows_kept":78,"cut":false,"hidden":false,"merged":[[21,3,21,4],[1,2,1,9],[2,2,2,9],[3,2,3,9],[4,2,4,9],[13,3,13,4],[17,3,17,4]]}
[null,null,null,null,null,null,null,null,null,null,null,null,null,null,null,null,null,null,null,null,null,null,null,null,null,null,null,"Algoma Power Inc."]
[null,null,null,null,null,null,null,null,null,null,null,null,null,null,null,null,null,null,null,null,null,null,null,null,null,null,null,"Atikokan Hydro Inc."]
[null,null,null,null,null,null,null,null,null,null,null,null,null,null,null,null,null,null,null,null,null,null,null,null,null,null,null,"Attawapiskat Power Corp. "]
[null,null,null,null,null,null,null,null,null,null,null,null,null,null,null,null,null,null,null,null,null,null,null,null,null,null,null,"Bluewater Power Distribution Corporation"]
[null,null,null,null,null,null,null,null,null,null,null,null,null,null,null,null,null,null,null,null,null,null,null,null,null,null,null,"Brant County Power Inc."]
[null,null,null,null,null,null,null,null,null,null,null,null,null,null,null,null,null,null,null,null,null,null,null,null,null,null,null,"Brantford Power Inc."]
[null,null,null,null,null,null,null,null,null,null,null,null,null,null,null,null,null,null,null,null,null,null,null,null,null,null,null,"Burlington Hydro Inc."]
[null,null,null,null,null,null,null,null,null,null,null,null,null,null,null,null,null,null,null,null,null,null,null,null,null,null,null,"Cambridge and North Dumfries Hydro Inc."]
[null,null,null,null,null,null,null,null,null,null,null,null,null,null,null,null,null,null,null,null,null,null,null,null,null,null,null,"Canadian Niagara Power Inc."]
[null,null,null,null,null,null,null,null,null,null,null,null,null,null,null,null,null,null,null,null,null,null,null,null,null,null,null,"Centre Wellington Hydro Ltd."]
[null,null,null,null,null,null,null,null,null,null,null,null,null,null,null,null,null,null,null,null,null,null,null,null,null,null,null,"Chapleau Public Utilities Corporation"]
[null,null,null,null,null,"Version",3,null,null,null,null,null,null,null,null,null,null,null,null,null,null,null,null,null,null,null,null,"Clinton Power Corporation"]
[null,null,null,null,null,null,null,null,null,null,null,null,null,null,null,null,null,null,null,null,null,null,null,null,null,null,null,"COLLUS Power Corporation"]
[null,null,"Utility Name   ","Toronto Hydro-Electric System Limited",null,null,null,null,null,null,null,null,null,null,null,null,null,null,null,null,null,null,null,null,null,null,null,"Cooperative Hydro Embrun Inc."]
[null,null,null,null,null,null,null,null,null,null,null,null,null,null,null,null,null,null,null,null,null,null,null,null,null,null,null,"E.L.K. Energy Inc."]
{"$rows_left_out":64}
{"sheet":"Table of Contents-Corrected","index":1,"n_rows":23,"n_cols":29,"rows_kept":23,"cut":false,"hidden":false,"merged":[[73,0,80,5]]}
[null,null,null,null,null,null,null,null,null,null,null,null,null,null,null,null,null,null,null,null,null,null,null,null,null,null,null,null,"Algoma Power Inc."]
[null,null,null,null,null,null,null,null,null,null,null,null,null,null,null,null,null,null,null,null,null,null,null,null,null,null,null,null,"Atikokan Hydro Inc."]
[null,null,null,null,null,null,null,null,null,null,null,null,null,null,null,null,null,null,null,null,null,null,null,null,null,null,null,null,"Attawapiskat Power Corp. "]
[null,null,null,null,null,null,null,null,null,null,null,null,null,null,null,null,null,null,null,null,null,null,null,null,null,null,null,null,"Bluewater Power Distribution Corporation"]
[null,null,null,null,null,null,null,null,null,null,null,null,null,null,null,null,null,null,null,null,null,null,null,null,null,null,null,null,"Brant County Power Inc."]
[null,null,null,null,null,null,null,null,null,null,null,null,null,null,null,null,null,null,null,null,null,null,null,null,null,null,null,null,"Brantford Power Inc."]
[null,null,null,null,null,null,null,null,null,null,null,null,null,null,null,null,null,null,null,null,null,null,null,null,null,null,null,null,"Burlington Hydro Inc."]
[null,null,null,null,null,null,null,null,null,null,null,null,null,null,null,null,null,null,null,null,null,null,null,null,null,null,null,null,"Cambridge and North Dumfries Hydro Inc."]
[null,null,null,null,null,null,null,null,null,null,null,null,null,null,null,null,null,null,null,null,null,null,null,null,null,null,null,null,"Canadian Niagara Power Inc."]
[null,null,null,null,null,null,null,null,null,null,null,null,null,null,null,null,null,null,null,null,null,null,null,null,null,null,null,null,"Centre Wellington Hydro Ltd."]
[]
[null,"Toronto Hydro-Electric System Limited"]
[null,"Table of Contents"]
[]
[null,"1. Info",null,"I. Schedule 8 CCA Bridge Year","/C","O. Schedule 8 CCA Test Year  ",null,"/C"]
{"$rows_left_out":9}
{"sheet":"A. Data Input Sheet-Corrected","index":2,"n_rows":43,"n_cols":9,"rows_kept":43,"cut":false,"hidden":false,"merged":[[39,2,39,4],[42,2,42,4],[29,2,29,4],[31,2,31,4],[33,2,33,4],[35,2,35,4],[37,2,37,4],[1,2,1,4],[2,2,2,8],[3,2,3,8],[4,2,4,8],[27,2,27,4]]}
[]
[]
[]
[]
[]
[]
[]
[null,null,"Toronto Hydro-Electric System Limited"]
[null,null,"Data Input Sheet - Applicant's Rate Base"]
[]
[null,null,"Rate Base",null,null,null,3247562846]
[]
[null,null,"Return on Ratebase"]
[null,null,"Deemed ShortTerm Debt %",null,0.04,"T",{"$f":"G11*E14","v":129902513.84},"W = S * T"]
[null,null,"Deemed Long Term Debt %",null,0.56000000000000005,"U",{"$f":"G11*E15","v":1818635193.7600002},"X = S * U"]
{"$rows_left_out":29}
{"sheet":"B. Tax Rates & Exemptions","index":3,"n_rows":34,"n_cols":9,"rows_kept":34,"cut":false,"hidden":false,"merged":[[7,2,7,3],[1,2,1,4],[2,2,2,8],[3,2,3,8],[4,2,4,8]]}
[]
[]
[]
[]
[]
[]
[]
[]
[null,null,"Toronto Hydro-Electric System Limited"]
[null,null,"Tax Rates & Exemptions"]
[]
[null,null,"Tax Rates"]
[null,null,"Federal & Provincial",null,"Effective","Effective","Effective","Effective","Effective"]
[null,null,"As of June 20, 2012",null,"2011-01-01","2012-01-01","2013-01-01","2014-01-01","2015-01-01"]
[]
{"$rows_left_out":20}
{"sheet":"C. Sch 8 Hist","index":4,"n_rows":48,"n_cols":7,"rows_kept":48,"cut":false,"hidden":false,"merged":[[1,2,1,4],[2,2,2,8],[3,2,3,8],[4,2,4,8],[10,2,10,6]]}
[]
[]
[]
[]
[]
[]
[]
[]
[null,null,"Toronto Hydro-Electric System Limited"]
[null,null,"Schedule 8 - Historical Year"]
[]
[null,null,"Class","Class Description","UCC End of Year Historic per tax returns","Less: Non-Distribution Portion","UCC Regulated Historic Year"]
[null,null,1,"Distribution System - post 1987",{"$f":"1023638334+39676106","v":1063314440},39676106,{"$f":"+E13-F13","v":1023638334}]
[null,null,"1 Enhanced","Non-residential Buildings Reg. 1100(1)(a.1) election ",null,null,{"$f":"+E14-F14","v":0}]
[null,null,2,"Distribution System - pre 1988",309715644,null,{"$f":"+E15-F15","v":309715644}]
{"$rows_left_out":34}
{"sheet":"D. Schedule 10 CEC Hist","index":5,"n_rows":42,"n_cols":11,"rows_kept":42,"cut":false,"hidden":false,"merged":[[1,2,1,4],[2,2,2,8],[3,2,3,8],[4,2,4,8],[32,2,32,5],[32,6,32,7],[11,2,11,5],[13,2,13,5],[13,6,13,7],[15,2,15,5],[15,6,15,7],[33,2,33,5],[34,6,34,7],[23,2,23,5],[23,6,23,7],[25,6,25,7],[29,2,29,5],[29,6,30,7],[30,2,30,5],[19,9,20,9],[20,2,20,5],[21,2,21,5],[17,2,17,5],[17,6,17,7],[19,2,19,5],[19,6,20,7],[19,8,20,8]]}
[]
[]
[]
[]
[]
[]
[]
[null,null,"Toronto Hydro-Electric System Limited"]
[null,null,"Schedule 10 CEC - Historical Year"]
[]
[]
[null,null,"Cumulative Eligible Capital - Beginning of Year",null,null,null,null,null,null,null,21595209]
[null,null,"Additions"]
[null,null,"Cost of Eligible Capital Property Acquired during Historical Year",null,null,null,2489752]
[]
{"$rows_left_out":28}
{"sheet":"E. Sch 13 Tax Reserves Hist","index":6,"n_rows":51,"n_cols":6,"rows_kept":51,"cut":false,"hidden":false,"merged":[[15,2,15,5],[1,2,1,4],[2,2,2,8],[3,2,3,8],[4,2,4,8]]}
[]
[]
[]
[]
[]
[]
[]
[null,null,"Toronto Hydro-Electric System Limited"]
[null,null,"Schedule 13 Tax Reserves - Historical Year"]
[]
[null,null,"Continuity of Reserves"]
[]
[null,null,"Description","Historical Balance as per tax returns","Non-Distribution Eliminations","Utility Only"]
[]
[null,null,"Capital Gains Reserves ss.40(1)",null,null,{"$f":"D15-E15","v":0}]
{"$rows_left_out":37}
{"sheet":"F. Sch 7-1 Loss Cfwd Hist","index":7,"n_rows":17,"n_cols":8,"rows_kept":17,"cut":false,"hidden":false,"merged":[[16,2,16,4],[12,2,12,4],[13,2,13,4],[1,2,1,4],[2,2,2,8],[3,2,3,8],[4,2,4,8],[15,2,15,4]]}
[]
[]
[]
[]
[]
[]
[]
[null,null,"Toronto Hydro-Electric System Limited"]
[null,null,"Schedule 7-1 Loss Carry Forward - Historical"]
[]
[null,null,"Corporation Loss Continuity and Application"]
[]
[null,null,"Non-Capital Loss Carry Forward Deduction",null,null,"Total","Non-Distribution Portion","Utility Balance"]
[null,null,"Actual Historic",null,null,null,null,{"$f":"F14-G14","v":0}]
[]
{"$rows_left_out":3}
{"sheet":"G. Adj. Taxable Income Historic","index":8,"n_rows":122,"n_cols":7,"rows_kept":122,"cut":false,"hidden":false,"merged":[[51,2,51,6],[114,2,114,6]]}
[]
[]
[]
[]
[]
[]
[]
[]
[null,null,"Toronto Hydro-Electric System Limited"]
[null,null,"Adjusted Taxable Income - Historical Year"]
[]
[null,null,"See Exhibit 4B, Tab 2, Schedule 3 for copy of 2013 tax return."]
[]
[null,null,null,"T2S1 line #","Total for Legal Entity","Non-Distribution Eliminations   ","Historic \nWires Only"]
[null,null,"Income before PILs/Taxes","A",{"$f":"115739021+3122853","v":118861874},231840,{"$f":"+E15-F15","v":118630034}]
{"$rows_left_out":108}
{"sheet":"H. PILS, Tax Provision Historic","index":9,"n_rows":10,"n_cols":2,"rows_kept":10,"cut":false,"hidden":false,"merged":[[0,2,0,6],[1,2,1,11],[2,2,2,11],[3,2,3,11]]}
[]
[]
[]
[]
[]
[null,"Toronto Hydro-Electric System Limited"]
[null,"PILs Tax Provision - Historical Year"]
[]
[]
[null,"See Exhibit 4B, Tab 2, Schedule 3 for copy of 2013 tax return."]

{"sheet":"I. Sch 8 CCA Bridge Year-Corr","index":10,"n_rows":46,"n_cols":13,"rows_kept":46,"cut":false,"hidden":false,"merged":[]}
[]
[]
[]
[]
[]
[]
[]
[null,null,"Toronto Hydro-Electric System Limited"]
[null,null,"Schedule 8 CCA - Bridge Year"]
[]
[null,null,"Class","Class Description","UCC Regulated Historic Year","Additions","Disposals (Negative)","UCC Before 1/2 Yr Adjustment","1/2 Year Rule {1/2 Additions Less Disposals}","Reduced UCC","Rate %","Bridge Year CCA","UCC End of Bridge Year"]
[null,null,{"$f":"IF(ISBLANK('C. Sch 8 Hist'!C13), \"\", 'C. Sch 8 Hist'!C13)","v":1},{"$f":"IF(ISBLANK('C. Sch 8 Hist'!D13), \"\", 'C. Sch 8 Hist'!D13)","v":"Distribution System - post 1987"},{"$f":"IF(ISBLANK('C. Sch 8 Hist'!E13), \"\", 'C. Sch 8 Hist'!G13)","v":1023638334},{"$f":"30847016-1287968","v":29559048},-169047,{"$f":"MAX((SUM(E12:G12)),0)","v":1053028335},{"$f":"IF((F12+G12)<=0, 0,(F12+G12)*0.5)","v":14695000.5},{"$f":"+H12-I12","v":1038333334.5},0.04,{"$f":"IF(+J12<0,+J12,+J12*K12)","v":41533333.380000003},{"$f":"MAX(0,+H12-L12)","v":1011495001.62}]
[null,null,{"$f":"IF(ISBLANK('C. Sch 8 Hist'!C14), \"\", 'C. Sch 8 Hist'!C14)","v":"1 Enhanced"},{"$f":"IF(ISBLANK('C. Sch 8 Hist'!D14), \"\", 'C. Sch 8 Hist'!D14)","v":"Non-residential Buildings Reg. 1100(1)(a.1) election "},{"$f":"IF(ISBLANK('C. Sch 8 Hist'!E14), \"\", 'C. Sch 8 Hist'!G14)","v":""},null,null,{"$f":"MAX((SUM(E13:G13)),0)","v":0},{"$f":"IF((F13+G13)<=0, 0,(F13+G13)*0.5)","v":0},{"$f":"+H13-I13","v":0},0.06,0,0]
[null,null,{"$f":"IF(ISBLANK('C. Sch 8 Hist'!C15), \"\", 'C. Sch 8 Hist'!C15)","v":2},{"$f":"IF(ISBLANK('C. Sch 8 Hist'!D15), \"\", 'C. Sch 8 Hist'!D15)","v":"Distribution System - pre 1988"},{"$f":"IF(ISBLANK('C. Sch 8 Hist'!E15), \"\", 'C. Sch 8 Hist'!G15)","v":309715644},null,null,309715644,0,309715644,0.06,18582938.640000001,291132705.36000001]
[null,null,{"$f":"IF(ISBLANK('C. Sch 8 Hist'!C16), \"\", 'C. Sch 8 Hist'!C16)","v":8},{"$f":"IF(ISBLANK('C. Sch 8 Hist'!D16), \"\", 'C. Sch 8 Hist'!D16)","v":"General Office/Stores Equip"},{"$f":"IF(ISBLANK('C. Sch 8 Hist'!E16), \"\", 'C. Sch 8 Hist'!G16)","v":29422905},3601232,null,33024137,1800616,31223521,0.2,6244704.2000000002,26779432.800000001]
{"$rows_left_out":32}
{"sheet":"J. Sch 10 CEC Bridge Year-Corr","index":11,"n_rows":42,"n_cols":14,"rows_kept":42,"cut":false,"hidden":false,"merged":[[13,2,13,5],[13,6,13,7],[11,2,11,5],[15,2,15,5],[15,6,15,7],[17,2,17,5],[17,6,17,7],[19,2,19,5],[19,6,20,7],[19,8,20,8],[19,9,20,9],[20,2,20,5],[21,2,21,5],[23,2,23,5],[23,6,23,7],[33,2,33,5],[34,6,34,7],[25,6,25,7],[29,2,29,5],[29,6,30,7],[30,2,30,5],[32,2,32,5],[32,6,32,7]]}
[]
[]
[]
[]
[]
[]
[]
[]
[null,null,"Toronto Hydro-Electric System Limited"]
[null,null,"Schedule 10 CEC - Bridge Year"]
[]
[null,null,"Cumulative Eligible Capital",null,null,null,null,null,null,null,{"$f":"'D. Schedule 10 CEC Hist'!K42","v":21820146.390000001}]
[null,null,"Additions"]
[null,null,"Cost of Eligible Capital Property Acquired during Test Year",null,null,null,{"$f":"3370623-1665442","v":1705181}]
[]
{"$rows_left_out":28}
{"sheet":"K. Sch 13 Tax Reserves Bridge","index":12,"n_rows":46,"n_cols":11,"rows_kept":46,"cut":false,"hidden":false,"merged":[[10,6,10,7],[1,2,1,8],[2,2,2,8],[3,2,3,8]]}
[]
[]
[]
[]
[]
[]
[null,null,"Toronto Hydro-Electric System Limited"]
[null,null,"Schedule 13 Tax Reserves - Bridge Year"]
[]
[null,null,"Continuity of Reserves"]
[null,null,null,null,null,null,"Bridge Year Adjustments"]
[null,null,"Description","Historic Utility Only","Eliminate Amounts Not Relevant for Bridge Year","Adjusted Utility Balance","Additions","Disposals"," Balance for Bridge Year","Change During the Year","Disallowed Expenses"]
[]
[null,null,"Capital Gains Reserves ss.40(1)",{"$f":"'E. Sch 13 Tax Reserves Hist'!F15","v":0},null,{"$f":"SUM(D14:E14)","v":0},null,null,{"$f":"F14+G14-H14","v":0},{"$f":"+I14-F14","v":0}]
[null,null,"Tax Reserves Not Deducted for accounting purposes"]
{"$rows_left_out":32}
{"sheet":"L. Sch 7-1 Loss Cfwd Bridge","index":13,"n_rows":26,"n_cols":6,"rows_kept":26,"cut":false,"hidden":false,"merged":[[11,2,11,4],[12,2,12,4],[21,2,21,4],[22,2,22,4],[20,2,20,4],[13,2,13,4],[14,2,14,4],[19,2,19,4]]}
[]
[]
[]
[]
[]
[]
[null,null,"Toronto Hydro-Electric System Limited"]
[null,null,"Corporation Loss Continuity and Application"]
[]
[null,null,"Schedule 7-1 Loss Carry Forward - Bridge Year"]
[]
[null,null,"Non-Capital Loss Carry Forward Deduction",null,null,"Total"]
[null,null,"Actual Historic",null,null,{"$f":"'F. Sch 7-1 Loss Cfwd Hist'!H14","v":0}]
[null,null,"Application of  Loss Carry Forward to reduce taxable income in Bridge Year"]
[null,null,"Other Adjustments Add (+) Deduct (-)"]
{"$rows_left_out":12}
{"sheet":"M. AdjTaxableIncomeBridge-Corr","index":14,"n_rows":109,"n_cols":5,"rows_kept":109,"cut":false,"hidden":false,"merged":[[108,2,108,4],[62,2,62,4],[47,2,47,4],[103,2,103,4],[10,2,10,4],[11,2,11,4]]}
[]
[]
[]
[]
[]
[null,null,"Toronto Hydro-Electric System Limited"]
[null,null,"Adjusted Taxable Income - Bridge Year"]
[]
[null,null,null,"T2S1 line #","Total for Regulated Utility"]
[null,null,"Income before PILs/Taxes","A",108739493]
[]
[null,null,"Additions:"]
[null,null,"Interest and penalties on taxes",103]
[null,null,"Amortization of tangible assets",104,{"$f":"150535804-129408","v":150406396}]
[null,null,"Amortization of intangible assets",106]
{"$rows_left_out":95}
{"sheet":"Sch 7-3 Interest Bridge-Corr","index":15,"n_rows":30,"n_cols":6,"rows_kept":30,"cut":false,"hidden":false,"merged":[[9,1,9,3],[11,1,11,3],[13,1,13,3],[14,1,14,3],[15,1,15,2],[16,1,16,3],[19,1,19,3],[21,1,21,3],[24,1,24,3],[30,1,31,8]]}
[]
[]
[]
[]
[]
[null,"Toronto Hydro-Electric System Limited"]
[null,"Excess Interest Expense - Bridge Year"]
[]
[]
[null,"Calculated Deemed Interest Expense",null,null,null,88126662]
[]
[null,"Bridge Year Actual Interest Expense",null,null,null,{"$f":"63994542+3270000+3099781","v":70364323}]
[]
[null,"Bridge Year Capitalized Interest (USoA 6040)"]
[null,"Bridge Year Capitalized Interest (USoA 6042)",null,null,null,0]
{"$rows_left_out":16}
{"sheet":"N.PILs,TaxProvision Bridge-Corr","index":16,"n_rows":46,"n_cols":10,"rows_kept":46,"cut":false,"hidden":false,"merged":[[45,2,45,5]]}
[]
[]
[]
[]
[]
[]
[null,null,"Toronto Hydro-Electric System Limited"]
[null,null,"PILS Tax Provision - Bridge Year"]
[null,null,null,null,null,null,null,null,"Wires Only"]
[]
[null,null,"Regulatory Taxable Income",null,null,null,null,null,{"$f":"'M. AdjTaxableIncomeBridge-Corr'!E105","v":33157035.155200005},"A"]
[]
[null,null,"Ontario Income Taxes"]
[null,null,"Income tax payable","Ontario Income Tax",{"$f":"IF(I11<=500000,'B. Tax Rates & Exemptions'!H34,'B. Tax Rates & Exemptions'!H24)","v":0.115},"B",{"$f":"IF(I11>0,I11*E14,0)","v":3813059.0428480008},"C = A * B"]
[]
{"$rows_left_out":32}
{"sheet":"O.Sch 8 CCA Test Year-Corrected","index":17,"n_rows":51,"n_cols":13,"rows_kept":51,"cut":false,"hidden":false,"merged":[[1,2,1,8],[2,2,2,8],[3,2,3,8],[0,2,0,4]]}
[]
[]
[]
[]
[]
[]
[null,"Toronto Hydro-Electric System Limited"]
[null,"Schedule 8 CCA - Test Year"]
[]
[null,null,"Class","Class Description","UCC Test Year Opening Balance (note 1)","Additions","Disposals  (Negative)","UCC Before 1/2 Yr Adjustment","1/2 Year Rule {1/2 Additions Less Disposals}","Reduced UCC","Rate %","Test Year CCA","UCC End of Test Year"]
[null,null,{"$f":"IF(ISBLANK('I. Sch 8 CCA Bridge Year-Corr'!C12), \"\", 'I. Sch 8 CCA Bridge Year-Corr'!C12)","v":1},{"$f":"IF(ISBLANK('I. Sch 8 CCA Bridge Year-Corr'!D12), \"\", 'I. Sch 8 CCA Bridge Year-Corr'!D12)","v":"Distribution System - post 1987"},{"$f":"IF(ISBLANK('I. Sch 8 CCA Bridge Year-Corr'!M12), \"\", 'I. Sch 8 CCA Bridge Year-Corr'!M12)+F50","v":1051152699.62},{"$f":"89388645+7467267-36967415","v":59888497},-16318959,{"$f":"MAX((SUM(E11:G11)),0)","v":1094722237.6199999},{"$f":"IF((F11+G11)<=0, 0,(F11+G11)*0.5)","v":21784769},{"$f":"+H11-I11","v":1072937468.6199999},{"$f":"'I. Sch 8 CCA Bridge Year-Corr'!K12","v":0.04},{"$f":"IF(+J11<0,+J11,+J11*K11)","v":42917498.744799994},{"$f":"MAX(0,+H11-L11)","v":1051804738.8751999}]
[null,null,{"$f":"IF(ISBLANK('I. Sch 8 CCA Bridge Year-Corr'!C13), \"\", 'I. Sch 8 CCA Bridge Year-Corr'!C13)","v":"1 Enhanced"},{"$f":"IF(ISBLANK('I. Sch 8 CCA Bridge Year-Corr'!D13), \"\", 'I. Sch 8 CCA Bridge Year-Corr'!D13)","v":"Non-residential Buildings Reg. 1100(1)(a.1) election "},{"$f":"IF(ISBLANK('I. Sch 8 CCA Bridge Year-Corr'!M13), \"\", 'I. Sch 8 CCA Bridge Year-Corr'!M13)","v":0},null,null,0,{"$f":"IF((F12+G12)<=0, 0,(F12+G12)*0.5)","v":0},0,{"$f":"'I. Sch 8 CCA Bridge Year-Corr'!K13","v":0.06},0,0]
[null,null,{"$f":"IF(ISBLANK('I. Sch 8 CCA Bridge Year-Corr'!C14), \"\", 'I. Sch 8 CCA Bridge Year-Corr'!C14)","v":2},{"$f":"IF(ISBLANK('I. Sch 8 CCA Bridge Year-Corr'!D14), \"\", 'I. Sch 8 CCA Bridge Year-Corr'!D14)","v":"Distribution System - pre 1988"},{"$f":"IF(ISBLANK('I. Sch 8 CCA Bridge Year-Corr'!M14), \"\", 'I. Sch 8 CCA Bridge Year-Corr'!M14)","v":291132705.36000001},null,null,291132705.36000001,0,291132705.36000001,{"$f":"'I. Sch 8 CCA Bridge Year-Corr'!K14","v":0.06},17467962.321600001,273664743.03839999]
[null,null,{"$f":"IF(ISBLANK('I. Sch 8 CCA Bridge Year-Corr'!C15), \"\", 'I. Sch 8 CCA Bridge Year-Corr'!C15)","v":8},{"$f":"IF(ISBLANK('I. Sch 8 CCA Bridge Year-Corr'!D15), \"\", 'I. Sch 8 CCA Bridge Year-Corr'!D15)","v":"General Office/Stores Equip"},{"$f":"IF(ISBLANK('I. Sch 8 CCA Bridge Year-Corr'!M15), \"\", 'I. Sch 8 CCA Bridge Year-Corr'!M15)","v":26779432.800000001},{"$f":"5588993-1314331-859599","v":3415063},null,30194495.800000001,1707531.5,28486964.300000001,{"$f":"'I. Sch 8 CCA Bridge Year-Corr'!K15","v":0.2},5697392.8600000003,24497102.940000001]
[null,null,{"$f":"IF(ISBLANK('I. Sch 8 CCA Bridge Year-Corr'!C16), \"\", 'I. Sch 8 CCA Bridge Year-Corr'!C16)","v":10},{"$f":"IF(ISBLANK('I. Sch 8 CCA Bridge Year-Corr'!D16), \"\", 'I. Sch 8 CCA Bridge Year-Corr'!D16)","v":"Computer Hardware/  Vehicles"},{"$f":"IF(ISBLANK('I. Sch 8 CCA Bridge Year-Corr'!M16), \"\", 'I. Sch 8 CCA Bridge Year-Corr'!M16)","v":13390915.65},3876736,null,17267651.649999999,1938368,15329283.649999999,{"$f":"'I. Sch 8 CCA Bridge Year-Corr'!K16","v":0.3},4598785.0949999997,12668866.555]
{"$rows_left_out":37}
{"sheet":"P. Sch 10 CEC Test Year-Corr","index":18,"n_rows":40,"n_cols":11,"rows_kept":40,"cut":false,"hidden":false,"merged":[[29,2,29,5],[29,6,29,7],[30,2,30,5],[31,6,31,7],[20,2,20,5],[20,6,20,7],[22,6,22,7],[26,2,26,5],[26,6,27,7],[27,2,27,5],[18,2,18,5],[14,2,14,5],[14,6,14,7],[16,2,16,5],[16,6,17,7],[10,2,10,5],[10,6,10,7],[12,2,12,5],[12,6,12,7],[16,9,17,9],[17,2,17,5],[16,8,17,8],[0,2,0,4],[1,2,1,8],[2,2,2,8],[4,2,4,8],[7,2,7,5]]}
[]
[]
[]
[]
[null,null,"Toronto Hydro-Electric System Limited"]
[null,null,"Schedule 10 CEC - Test Year"]
[]
[null,null,"Cumulative Eligible Capital - Beginning of Year",null,null,null,null,null,null,null,{"$f":"'J. Sch 10 CEC Bridge Year-Corr'!K42","v":21482099.8902}]
[]
[null,null,"Additions"]
[null,null,"Cost of Eligible Capital Property Acquired during Test Year",null,null,null,{"$f":"84096612+500000-38305110","v":46291502}]
[]
[null,null,"Other Adjustments",null,null,null,0]
[]
[null,null,"Subtotal",null,null,null,{"$f":"SUM(G11,G13)","v":46291502},null,"x 3/4 =",{"$f":"3/4*G15","v":34718626.5}]
{"$rows_left_out":26}
{"sheet":"Q. Sch 13 Tax Reserve Test Year","index":19,"n_rows":48,"n_cols":11,"rows_kept":48,"cut":false,"hidden":false,"merged":[[12,6,12,7],[2,2,2,8],[3,2,3,8],[4,2,4,8],[7,2,7,8]]}
[]
[]
[]
[]
[]
[]
[]
[null,null,"Toronto Hydro-Electric System Limited"]
[null,null,"Schedule 13 Tax Reserves - Test Year"]
[]
[null,null,"Continuity of Reserves"]
[]
[null,null,null,null,null,null,"Test Year Adjustments"]
[null,null,"Description","Bridge Year","Eliminate Amounts Not Relevant for Bridge Year","Adjusted Utility Balance","Additions","Disposals"," Balance for Test Year","Change During the Year","Disallowed Expenses"]
[]
{"$rows_left_out":34}
{"sheet":"R. Sch 7-1 Loss Cfwd Test Year","index":20,"n_rows":26,"n_cols":8,"rows_kept":26,"cut":false,"hidden":false,"merged":[[12,2,12,4],[11,2,11,4],[1,2,1,4],[2,2,2,8],[3,2,3,8],[4,2,4,8],[21,2,21,4],[22,2,22,4],[13,2,13,4],[14,2,14,4],[19,2,19,4],[20,2,20,4]]}
[]
[]
[]
[]
[]
[]
[null,null,"Toronto Hydro-Electric System Limited"]
[null,null,"Schedule 7-1 Loss Carry Forward - Test Year"]
[]
[null,null,"Corporation Loss Continuity and Application"]
[]
[null,null,"Non-Capital Loss Carry Forward Deduction",null,null,"Total","Non-Distribution Portion","Utility Balance"]
[null,null,"Actual/Estimated Bridge Year",null,null,null,null,{"$f":"F13-G13","v":0}]
[null,null,"Application of  Loss Carry Forward to reduce taxable income in 2005",null,null,null,null,{"$f":"F14-G14","v":0}]
[null,null,"Other Adjustments Add (+) Deduct (-)",null,null,null,null,{"$f":"F15-G15","v":0}]
{"$rows_left_out":12}
{"sheet":"S. TaxableIncome Test Year-Corr","index":21,"n_rows":115,"n_cols":5,"rows_kept":115,"cut":false,"hidden":false,"merged":[[18,5,18,6],[59,5,59,6],[92,5,92,6]]}
[]
[]
[]
[]
[]
[]
[]
[]
[]
[null,null,"Toronto Hydro-Electric System Limited"]
[null,null,"Taxable Income - Test Year"]
[]
[null,null,null,"T2 S1 line #","Test Year                         Taxable Income"]
[null,null,"Net Income Before Taxes",null,{"$f":"+'A. Data Input Sheet-Corrected'!G20","v":120809337.87120001}]
[]
{"$rows_left_out":101}
{"sheet":"Sch 7-3 InterestTestYear-Corr","index":22,"n_rows":25,"n_cols":6,"rows_kept":25,"cut":false,"hidden":false,"merged":[[30,1,31,8],[9,1,9,3],[11,1,11,3],[13,1,13,3],[14,1,14,3],[15,1,15,2],[9,7,9,9],[16,1,16,3],[19,1,19,3],[21,1,21,3],[24,1,24,3],[11,7,11,9]]}
[]
[]
[]
[]
[]
[]
[null,"Toronto Hydro-Electric System Limited"]
[null,"Excess Interest Expense - Test Year"]
[]
[null,"Calculated Deemed Interest Expense",null,null,null,{"$f":"+'A. Data Input Sheet-Corrected'!G18+'A. Data Input Sheet-Corrected'!G19","v":80175831.542048007}]
[]
[null,"Test Year Actual Interest Expense",null,null,null,83213651]
[]
[null,"Test Year Capitalized Interest (USoA 6040)"]
[null,"Test Year Capitalized Interest (USoA 6042)",null,null,null,0]
{"$rows_left_out":11}
{"sheet":"T.PILs,TaxProvisionTestYr-Corr","index":23,"n_rows":46,"n_cols":10,"rows_kept":46,"cut":false,"hidden":false,"merged":[[45,2,45,5]]}
[]
[]
[]
[]
[]
[]
[]
[null,null,"Toronto Hydro-Electric System Limited"]
[null,null,"PILS Tax Provision - Test Year"]
[null,null,null,null,null,null,null,null,"Wires Only"]
[]
[null,null,"Regulatory Taxable Income",null,null,null,null,null,{"$f":"'S. TaxableIncome Test Year-Corr'!E115","v":69858341.17128396},"A"]
[]
[null,null,"Ontario Income Taxes"]
[null,null,"Income tax payable","Ontario Income Tax",{"$f":"IF(I12<=500000,'B. Tax Rates & Exemptions'!I34,'B. Tax Rates & Exemptions'!I24)","v":0.115},"B",{"$f":"IF(I12>0,I12*E15,0)","v":8033709.2346976558},"C = A * B"]
{"$rows_left_out":31}