{"text_format":"1","workbook":"xlsx","n_sheets":14,"sheets":["1. Info","2. Table of Contents","3. Rate Classes","4. RRR Data","5. UTRs and Sub-Transmission","6. Historical Wholesale","7. Current Wholesale","8. Forecast Wholesale","9. Adj Network to Current WS","10. Adj Conn. to Current WS","11. Adj Network to Forecast WS","12. Adj Conn. to Forecast WS","13. Final 2014 RTS Rates","hidden1"],"not_rendered":{"charts":0,"images":5,"macros":1,"external_links":2,"defined_names":12,"comments":0,"pivot_tables":0},"unopened":[],"bounds":{"document_bytes":16777216,"sheet_cells":100000,"rows_first":2000,"rows_last":500,"rows_between":2000,"halvings":0,"cell_chars":16384,"cell_head_chars":4096},"cells_cut":0,"cells_raw":0,"read":"whole","date_system":"1900"}

{"sheet":"1. Info","index":0,"n_rows":77,"n_cols":28,"rows_kept":77,"cut":false,"hidden":false,"merged":[[24,3,24,4],[20,3,20,4],[1,2,1,9],[2,2,2,9],[3,2,3,9],[4,2,4,9],[14,3,14,4],[16,3,16,4]]}
[null,null,null,null,null,null,null,null,null,null,null,null,null,null,null,null,null,null,null,null,null,null,null,null,null,null,null,"Algoma Power Inc."]
[null,null,null,null,null,null,null,null,null,null,null,null,null,null,null,null,null,null,null,null,null,null,null,null,null,null,null,"Atikokan Hydro Inc."]
[null,null,null,null,null,null,null,null,null,null,null,null,null,null,null,null,null,null,null,null,null,null,null,null,null,null,null,"Attawapiskat Power Corporation"]
[null,null,null,null,null,null,null,null,null,null,null,null,null,null,null,null,null,null,null,null,null,null,null,null,null,null,null,"Bluewater Power Distribution Corp."]
[null,null,null,null,null,null,null,null,null,null,null,null,null,null,null,null,null,null,null,null,null,null,null,null,null,null,null,"Brant County Power"]
[null,null,null,null,null,null,null,null,null,null,null,null,null,null,null,null,null,null,null,null,null,null,null,null,null,null,null,"Brantford Power Inc."]
[null,null,null,null,null,null,null,null,null,null,null,null,null,null,null,null,null,null,null,null,null,null,null,null,null,null,null,"Burlington Hydro Inc."]
[null,null,null,null,null,null,null,null,null,null,null,null,null,null,null,null,null,null,null,null,null,null,null,null,null,null,null,"Cambridge and North Dumfries Hydro"]
[null,null,null,null,null,null,null,null,null,null,null,null,null,null,null,null,null,null,null,null,null,null,null,null,null,null,null,"Canadian Niagara Power Inc. – Eastern Ontario Power/Fort Erie/Port Colborne"]
[null,null,null,null,null,null,null,null,null,null,null,null,null,null,null,null,null,null,null,null,null,null,null,null,null,null,null,"Centre Wellington Hydro Ltd."]
[null,null,null,null,null,null,null,null,null,null,null,null,null,null,null,null,null,null,null,null,null,null,null,null,null,null,null,"Chapleau Public Utilities Corporation"]
[null,null,null,null,null,null,null,null,null,null,null,null,null,null,null,null,null,null,null,null,null,null,null,null,null,null,null,"COLLUS Power Corp."]
[null,null,null,null,null,null,null,null,null,null,null,null,null,null,null,null,null,null,null,null,null,null,null,null,null,null,null,"Cooperative Hydro Embrun Inc."]
[null,null,null,null,null,null,null,null,null,null,null,null,null,null,null,null,null,null,null,null,null,null,null,null,null,null,null,"E.L.K. Energy Inc."]
[null,null,"Utility Name   ","Hearst Power Distribution Co. Ltd.",null,null,null,null,null,null,null,null,null,null,null,null,null,null,null,null,null,null,null,null,null,null,null,"Enersource Hydro Mississauga Inc."]
[null,null,null,null,null,null,null,null,null,null,null,null,null,null,null,null,null,null,null,null,null,null,null,null,null,null,null,"Entegrus Powerlines Inc."]
[null,null,"Service Territory","Hearst",null,null,null,null,null,null,null,null,null,null,null,null,null,null,null,null,null,null,null,null,null,null,null,"ENWIN Utilities Ltd."]
[null,null,null,null,null,null,null,null,null,null,null,null,null,null,null,null,null,null,null,null,null,null,null,null,null,null,null,"Erie Thames Powerlines Corp."]
[null,null,"Assigned EB Number","EB-2014-0080",null,null,null,null,null,null,null,null,null,null,null,null,null,null,null,null,null,null,null,null,null,null,null,"Espanola Regional Hydro Distribution Corporation"]
[null,null,null,null,null,null,null,null,null,null,null,null,null,null,null,null,null,null,null,null,null,null,null,null,null,null,null,"Essex Powerlines Corporation"]
[null,null,"Name and Title","Jessy Richard, General Manager",null,null,null,null,null,null,null,null,null,null,null,null,null,null,null,null,null,null,null,null,null,null,null,"Festival Hydro Inc."]
[null,null,null,null,null,null,null,null,null,null,null,null,null,null,null,null,null,null,null,null,null,null,null,null,null,null,null,"Fort Albany Power Corporation"]
[null,null,"Phone Number","705-372-2820",null,null,null,null,null,null,null,null,null,null,null,null,null,null,null,null,null,null,null,null,null,null,null,"Fort Frances Power Corporation"]
[null,null,null,null,null,null,null,null,null,null,null,null,null,null,null,null,null,null,null,null,null,null,null,null,null,null,null,"Greater Sudbury Hydro Inc."]
[null,null,"Email Address","jrichard@hearstpower.com",null,null,null,null,null,null,null,null,null,null,null,null,null,null,null,null,null,null,null,null,null,null,null,"Grimsby Power Inc."]
[null,null,null,null,null,null,null,null,null,null,null,null,null,null,null,null,null,null,null,null,null,null,null,null,null,null,null,"Guelph Hydro Electric Systems Inc."]
[null,null,"Date","March 5 2015",null,null,null,null,null,null,null,null,null,null,null,null,null,null,null,null,null,null,null,null,null,null,null,"Haldimand County Hydro Inc."]
[null,null,null,null,null,null,null,null,null,null,null,null,null,null,null,null,null,null,null,null,null,null,null,null,null,null,null,"Halton Hills Hydro Inc."]
[null,null,"Last COS Re-based Year",2010,null,null,null,null,null,null,null,null,null,null,null,null,null,null,null,null,null,null,null,null,null,null,null,"Hearst Power Distribution Co. Ltd."]
[null,null,null,null,null,null,null,null,null,null,null,null,null,null,null,null,null,null,null,null,null,null,null,null,null,null,null,"Horizon Utilities Corporation"]
[null,null,null,null,null,null,null,null,null,null,null,null,null,null,null,null,null,null,null,null,null,null,null,null,null,null,null,"Hydro 2000 Inc."]
["Note:  Drop-down lists are shaded blue; Input cells are shaded green.",null,null,null,null,null,null,null,null,null,null,null,null,null,null,null,null,null,null,null,null,null,null,null,null,null,null,"Hydro Hawkesbury Inc."]
[null,null,null,null,null,null,null,null,null,null,null,null,null,null,null,null,null,null,null,null,null,null,null,null,null,null,null,"Hydro One Brampton Networks Inc."]
[null,null,null,null,null,null,null,null,null,null,null,null,null,null,null,null,null,null,null,null,null,null,null,null,null,null,null,"Hydro One Networks Inc."]
[null,null,null,null,null,null,null,null,null,null,null,null,null,null,null,null,null,null,null,null,null,null,null,null,null,null,null,"Hydro One Remote Communities Inc."]
[null,null,null,null,null,null,null,null,null,null,null,null,null,null,null,null,null,null,null,null,null,null,null,null,null,null,null,"Hydro Ottawa Limited"]
[null,null,null,null,null,null,null,null,null,null,null,null,null,null,null,null,null,null,null,null,null,null,null,null,null,null,null,"Innisfil Hydro Dist. Systems Limited"]
[null,null,null,null,null,null,null,null,null,null,null,null,null,null,null,null,null,null,null,null,null,null,null,null,null,null,null,"Kashechewan Power Corporation"]
[null,null,null,null,null,null,null,null,null,null,null,null,null,null,null,null,null,null,null,null,null,null,null,null,null,null,null,"Kenora Hydro Electric Corporation Ltd."]
[null,null,null,null,null,null,null,null,null,null,null,null,null,null,null,null,null,null,null,null,null,null,null,null,null,null,null,"Kingston Hydro Corporation"]
[null,null,null,null,null,null,null,null,null,null,null,null,null,null,null,null,null,null,null,null,null,null,null,null,null,null,null,"Kitchener-Wilmot Hydro Inc."]
[null,null,null,null,null,null,null,null,null,null,null,null,null,null,null,null,null,null,null,null,null,null,null,null,null,null,null,"Lakefront Utilities Inc."]
[null,null,null,null,null,null,null,null,null,null,null,null,null,null,null,null,null,null,null,null,null,null,null,null,null,null,null,"Lakeland Power Distribution Ltd."]
[null,null,null,null,null,null,null,null,null,null,null,null,null,null,null,null,null,null,null,null,null,null,null,null,null,null,null,"London Hydro Inc."]
[null,null,null,null,null,null,null,null,null,null,null,null,null,null,null,null,null,null,null,null,null,null,null,null,null,null,null,"Midland Power Utility Corporation"]
[null,null,null,null,null,null,null,null,null,null,null,null,null,null,null,null,null,null,null,null,null,null,null,null,null,null,null,"Milton Hydro Distribution Inc."]
[null,null,null,null,null,null,null,null,null,null,null,null,null,null,null,null,null,null,null,null,null,null,null,null,null,null,null,"Newmarket – Tay Power Distribution Ltd."]
[null,null,null,null,null,null,null,null,null,null,null,null,null,null,null,null,null,null,null,null,null,null,null,null,null,null,null,"Niagara Peninsula Energy Inc."]
[null,null,null,null,null,null,null,null,null,null,null,null,null,null,null,null,null,null,null,null,null,null,null,null,null,null,null,"Niagara-on-the-Lake Hydro Inc."]
[null,null,null,null,null,null,null,null,null,null,null,null,null,null,null,null,null,null,null,null,null,null,null,null,null,null,null,"Norfolk Power Distribution Ltd."]
[null,null,null,null,null,null,null,null,null,null,null,null,null,null,null,null,null,null,null,null,null,null,null,null,null,null,null,"North Bay Hydro Distribution Limited"]
[null,null,null,null,null,null,null,null,null,null,null,null,null,null,null,null,null,null,null,null,null,null,null,null,null,null,null,"Northern Ontario Wires Inc."]
[null,null,null,null,null,null,null,null,null,null,null,null,null,null,null,null,null,null,null,null,null,null,null,null,null,null,null,"Oakville Hydro Distribution Inc."]
[null,null,null,null,null,null,null,null,null,null,null,null,null,null,null,null,null,null,null,null,null,null,null,null,null,null,null,"Orangeville Hydro Limited"]
[null,null,null,null,null,null,null,null,null,null,null,null,null,null,null,null,null,null,null,null,null,null,null,null,null,null,null,"Orillia Power Distribution Corp."]
[null,null,null,null,null,null,null,null,null,null,null,null,null,null,null,null,null,null,null,null,null,null,null,null,null,null,null,"Oshawa PUC Networks Inc."]
[null,null,null,null,null,null,null,null,null,null,null,null,null,null,null,null,null,null,null,null,null,null,null,null,null,null,null,"Ottawa River Power Corporation"]
[null,null,null,null,null,null,null,null,null,null,null,null,null,null,null,null,null,null,null,null,null,null,null,null,null,null,null,"Parry Sound Power Corporation"]
[null,null,null,null,null,null,null,null,null,null,null,null,null,null,null,null,null,null,null,null,null,null,null,null,null,null,null,"Peterborough Distribution Inc."]
[null,null,null,null,null,null,null,null,null,null,null,null,null,null,null,null,null,null,null,null,null,null,null,null,null,null,null,"PowerStream Inc."]
[null,null,null,null,null,null,null,null,null,null,null,null,null,null,null,null,null,null,null,null,null,null,null,null,null,null,null,"PUC Distribution Inc."]
[null,null,null,null,null,null,null,null,null,null,null,null,null,null,null,null,null,null,null,null,null,null,null,null,null,null,null,"Renfrew Hydro Inc."]
[null,null,null,null,null,null,null,null,null,null,null,null,null,null,null,null,null,null,null,null,null,null,null,null,null,null,null,"Rideau St. Lawrence Distribution Inc."]
[null,null,null,null,null,null,null,null,null,null,null,null,null,null,null,null,null,null,null,null,null,null,null,null,null,null,null,"St. Thomas Energy Inc."]
[null,null,null,null,null,null,null,null,null,null,null,null,null,null,null,null,null,null,null,null,null,null,null,null,null,null,null,"Sioux Lookout Hydro Inc."]
[null,null,null,null,null,null,null,null,null,null,null,null,null,null,null,null,null,null,null,null,null,null,null,null,null,null,null,"Thunder Bay Hydro Electricity Distribution"]
[null,null,null,null,null,null,null,null,null,null,null,null,null,null,null,null,null,null,null,null,null,null,null,null,null,null,null,"Tillsonburg Hydro Inc."]
[null,null,null,null,null,null,null,null,null,null,null,null,null,null,null,null,null,null,null,null,null,null,null,null,null,null,null,"Toronto Hydro-Electric System Limited"]
[null,null,null,null,null,null,null,null,null,null,null,null,null,null,null,null,null,null,null,null,null,null,null,null,null,null,null,"Veridian Connections Inc."]
[null,null,null,null,null,null,null,null,null,null,null,null,null,null,null,null,null,null,null,null,null,null,null,null,null,null,null,"Wasaga Distribution Inc."]
[null,null,null,null,null,null,null,null,null,null,null,null,null,null,null,null,null,null,null,null,null,null,null,null,null,null,null,"Waterloo North Hydro Inc."]
[null,null,null,null,null,null,null,null,null,null,null,null,null,null,null,null,null,null,null,null,null,null,null,null,null,null,null,"Welland Hydro Electric System Corp."]
[null,null,null,null,null,null,null,null,null,null,null,null,null,null,null,null,null,null,null,null,null,null,null,null,null,null,null,"Wellington North Power Inc."]
[null,null,null,null,null,null,null,null,null,null,null,null,null,null,null,null,null,null,null,null,null,null,null,null,null,null,null,"West Coast Huron Energy Inc."]
[null,null,null,null,null,null,null,null,null,null,null,null,null,null,null,null,null,null,null,null,null,null,null,null,null,null,null,"Westario Power Inc."]
[null,null,null,null,null,null,null,null,null,null,null,null,null,null,null,null,null,null,null,null,null,null,null,null,null,null,null,"Whitby Hydro Electric Corporation"]
[null,null,null,null,null,null,null,null,null,null,null,null,null,null,null,null,null,null,null,null,null,null,null,null,null,null,null,"Woodstock Hydro Services Inc."]

{"sheet":"2. Table of Contents","index":1,"n_rows":32,"n_cols":9,"rows_kept":32,"cut":false,"hidden":false,"merged":[]}
[]
[]
[]
[]
[]
[]
[]
[]
[]
[]
[]
[]
[]
[]
[]
[]
[]
[]
[]
[null,null,null,"1. Info",null,null,null,null,"7. Current Wholesale"]
[]
[null,null,null,"2. Table of Contents",null,null,null,null,"8. Forecast Wholesale"]
[]
[null,null,null,"3. Rate Classes",null,null,null,null,"9. Adj Network to Current WS"]
[]
[null,null,null,"4. RRR Data",null,null,null,null,"10. Adj Conn. to Current WS"]
[]
[null,null,null,"5. UTRs and Sub-Transmission",null,null,null,null,"11. Adj Network to Forecast WS"]
[]
[null,null,null,"6. Historical Wholesale",null,null,null,null,"12. Adj Conn. to Forecast WS"]
[]
[null,null,null,null,null,null,null,null,"13. Final 2013 RTS Rates"]

{"sheet":"3. Rate Classes","index":2,"n_rows":115,"n_cols":28,"rows_kept":115,"cut":false,"hidden":false,"merged":[[41,12,41,13],[42,12,42,13],[43,12,43,13],[36,12,36,13],[37,12,37,13],[38,12,38,13],[39,12,39,13],[27,12,27,13],[28,12,28,13],[29,12,29,13],[30,12,30,13],[23,12,23,13],[24,12,24,13],[25,12,25,13],[26,12,26,13],[37,9,37,10],[23,9,23,10],[24,9,24,10],[25,9,25,10],[26,9,26,10],[27,9,27,10],[28,9,28,10],[29,9,29,10],[30,9,30,10],[34,9,34,10],[35,9,35,10],[36,9,36,10],[34,12,34,13],[35,12,35,13],[31,2,31,5],[32,2,32,5],[33,2,33,5],[34,2,34,5],[35,2,35,5],[31,9,31,10],[32,9,32,10],[33,9,33,10],[31,12,31,13],[32,12,32,13],[33,12,33,13],[36,2,36,5],[23,2,23,5],[24,2,24,5],[25,2,25,5],[26,2,26,5],[27,2,27,5],[28,2,28,5],[44,9,44,10],[39,2,39,5],[40,2,40,5],[41,2,41,5],[40,9,40,10],[41,9,41,10],[42,9,42,10],[12,2,12,13],[47,2,47,5],[43,2,43,5],[44,2,44,5],[45,2,45,5],[46,2,46,5],[42,2,42,5],[37,2,37,5],[38,9,38,10],[39,9,39,10],[44,12,44,13],[38,2,38,5],[40,12,40,13],[43,9,43,10],[29,2,29,5],[30,2,30,5]]}
[]
[]
[]
[]
[]
[]
[]
[]
[]
[]
[]
[]
[null,null,"1.  Select the appropriate rate classes that appear on your most recent Board-Approved Tariff of Rates and Charges.\n2.  Enter the RTS Network and Connection Rate as it appears on the Tariff of Rates and Charges"]
[]
[]
[]
[]
[]
[]
[]
[]
[null,null,"Rate Class",null,null,null,null,"Unit",null,"RTSR-Network",null,null,"RTSR-Connection"]
[]
[null,null,"Residential",null,null,null,null,"kWh",null,6.1000000000000004E-3,null,null,4.7999999999999996E-3,null,null,null,{"$f":"IF(OR(ISBLANK(C24), ISERROR(FIND(\"Choose\", C24))=FALSE), 0, 1)","v":1},{"$f":"\"C\" & ROW(C24)","v":"C24"},{"$f":"IF(OR(C24=\"General Service Intermediate Rate Class 1,000 To 4,999 kW (formerly General Service > 50 kW Customers)\", C24=\"General Service Intermediate Rate Class 1,000 To 4,999 kW (formerly Large Use Customers)\"), \"x\", \"\")","v":""},null,null,null,null,null,null,null,null,"Choose Rate Class"]
[null,null,"General Service Less Than 50 kW",null,null,null,null,"kWh",null,5.5999999999999999E-3,null,null,4.1999999999999997E-3,null,null,null,1,"C25",{"$f":"IF(OR(C25=\"General Service Intermediate Rate Class 1,000 To 4,999 kW (formerly General Service > 50 kW Customers)\", C25=\"General Service Intermediate Rate Class 1,000 To 4,999 kW (formerly Large Use Customers)\"), \"x\", \"\")","v":""},null,null,null,null,null,null,null,null,"Residential"]
[null,null,"General Service 50 to 1,499 kW",null,null,null,null,"kW",null,2.3025000000000002,null,null,1.7024999999999999,null,null,null,1,"C26","",null,null,null,null,null,null,null,null,"Residential Regular"]
[null,null,"General Service Intermediate 1,000 To 4,999 kW",null,null,null,null,"kW",null,2.5752999999999999,null,null,2.0081000000000002,null,null,null,1,"C27","",null,null,null,null,null,null,null,null,"Residential Urban"]
[null,null,"Sentinel Lighting",null,null,null,null,"kW",null,1.7453000000000001,null,null,1.3313999999999999,null,null,null,1,"C28","",null,null,null,null,null,null,null,null,"Residential Urban Year-Round"]
[null,null,"Street Lighting",null,null,null,null,"kW",null,1.7363999999999999,null,null,1.3043,null,null,null,1,"C29","",null,null,null,null,null,null,null,null,"Residential Suburban"]
[null,null,"Choose Rate Class",null,null,null,null,null,null,null,null,null,null,null,null,null,0,"C30","",null,null,null,null,null,null,null,null,"Residential Suburban Seasonal"]
[null,null,"Choose Rate Class",null,null,null,null,null,null,null,null,null,null,null,null,null,0,"C31","",null,null,null,null,null,null,null,null,"Residential Suburban Year Round"]
[null,null,"Choose Rate Class",null,null,null,null,null,null,null,null,null,null,null,null,null,0,"C32","",null,null,null,null,null,null,null,null,"Residential - Time of Use"]
[null,null,"Choose Rate Class",null,null,null,null,null,null,null,null,null,null,null,null,null,0,"C33","",null,null,null,null,null,null,null,null,"Residential - Hensall"]
[null,null,"Choose Rate Class",null,null,null,null,null,null,null,null,null,null,null,null,null,0,"C34","",null,null,null,null,null,null,null,null,"Residential – High Density [R1]"]
[null,null,"Choose Rate Class",null,null,null,null,null,null,null,null,null,null,null,null,null,0,"C35","",null,null,null,null,null,null,null,null,"Residential – Normal Density [R2]"]
[null,null,"Choose Rate Class",null,null,null,null,null,null,null,null,null,null,null,null,null,0,"C36","",null,null,null,null,null,null,null,null,"Seasonal Residential – High Density [R3]"]
[null,null,"Choose Rate Class",null,null,null,null,null,null,null,null,null,null,null,null,null,0,"C37","",null,null,null,null,null,null,null,null,"Seasonal Residential – Normal Density [R4]"]
[null,null,"Choose Rate Class",null,null,null,null,null,null,null,null,null,null,null,null,null,0,"C38","",null,null,null,null,null,null,null,null,"Residential – Urban [UR]"]
[null,null,"Choose Rate Class",null,null,null,null,null,null,null,null,null,null,null,null,null,0,"C39",""]
[null,null,"Choose Rate Class",null,null,null,null,null,null,null,null,null,null,null,null,null,0,"C40","",null,null,null,null,null,null,null,null,"General Service Less Than 50 kW"]
[null,null,"Choose Rate Class",null,null,null,null,null,null,null,null,null,null,null,null,null,0,"C41","",null,null,null,null,null,null,null,null,"General Service Less Than 50 kW – Single Phase energy-billed [G1]"]
[null,null,"Choose Rate Class",null,null,null,null,null,null,null,null,null,null,null,null,null,0,"C42","",null,null,null,null,null,null,null,null,"General Service Less Than 50 kW – Three Phase energy-billed [G3]"]
[null,null,"Choose Rate Class",null,null,null,null,null,null,null,null,null,null,null,null,null,0,"C43","",null,null,null,null,null,null,null,null,"General Service Less Than 50 kW – Transmission Class energy-billed [T]"]
[null,null,"Choose Rate Class",null,null,null,null,null,null,null,null,null,null,null,null,null,0,"C44","",null,null,null,null,null,null,null,null,"General Service Less Than 50 kW – Urban energy-billed [UG]"]
[null,null,"Choose Rate Class",null,null,null,null,null,null,null,null,null,null,null,null,null,0,"C45","",null,null,null,null,null,null,null,null,"Westport Sewage Treatment Plant"]
[null,null,null,null,null,null,null,null,null,null,null,null,null,null,null,null,null,null,{"$f":"COUNTIF(S24:S45, \"x\")","v":0},null,null,null,null,null,null,null,null,"Small Commercial and USL - per meter"]
[null,null,null,null,null,null,null,null,null,null,null,null,null,null,null,null,null,null,null,null,null,null,null,null,null,null,null,"Small Commercial and USL - per connection"]
[null,null,null,null,null,null,null,null,null,null,null,null,null,null,null,null,null,null,null,null,null,null,null,null,null,null,null,"Farms – Single Phase energy-billed [F1]"]
[]
[null,null,null,null,null,null,null,null,null,null,null,null,null,null,null,null,null,null,null,null,null,null,null,null,null,null,null,"General Service 50 to 499 kW"]
[null,null,null,null,null,null,null,null,null,null,null,null,null,null,null,null,null,null,null,null,null,null,null,null,null,null,null,"General Service 50 to 699 kW"]
[null,null,null,null,null,null,null,null,null,null,null,null,null,null,null,null,null,null,null,null,null,null,null,null,null,null,null,"General Service 50 to 999 kW"]
[null,null,null,null,null,null,null,null,null,null,null,null,null,null,null,null,null,null,null,null,null,null,null,null,null,null,null,"General Service 50 to 999 kW - Interval Metered"]
[null,null,null,null,null,null,null,null,null,null,null,null,null,null,null,null,null,null,null,null,null,null,null,null,null,null,null,"General Service 50 to 1,000 kW"]
[null,null,null,null,null,null,null,null,null,null,null,null,null,null,null,null,null,null,null,null,null,null,null,null,null,null,null,"General Service 50 to 1,000 kW - Interval Meters"]
[null,null,null,null,null,null,null,null,null,null,null,null,null,null,null,null,null,null,null,null,null,null,null,null,null,null,null,"General Service 50 to 1,000 kW - Non Interval Meters"]
[null,null,null,null,null,null,null,null,null,null,null,null,null,null,null,null,null,null,null,null,null,null,null,null,null,null,null,"General Service 50 to 1,499 kW"]
[null,null,null,null,null,null,null,null,null,null,null,null,null,null,null,null,null,null,null,null,null,null,null,null,null,null,null,"General Service 50 to 1,499 kW - Interval Metered"]
[null,null,null,null,null,null,null,null,null,null,null,null,null,null,null,null,null,null,null,null,null,null,null,null,null,null,null,"General Service  50 to 2,499 kW"]
[null,null,null,null,null,null,null,null,null,null,null,null,null,null,null,null,null,null,null,null,null,null,null,null,null,null,null,"General Service 50 to 2,999 kW"]
[null,null,null,null,null,null,null,null,null,null,null,null,null,null,null,null,null,null,null,null,null,null,null,null,null,null,null,"General Service 50 to 2,999 kW - Time of Use"]
[null,null,null,null,null,null,null,null,null,null,null,null,null,null,null,null,null,null,null,null,null,null,null,null,null,null,null,"General Service 50 to 4,999 kW"]
[null,null,null,null,null,null,null,null,null,null,null,null,null,null,null,null,null,null,null,null,null,null,null,null,null,null,null,"General Service 50 to 4,999 kW – Interval Metered"]
[null,null,null,null,null,null,null,null,null,null,null,null,null,null,null,null,null,null,null,null,null,null,null,null,null,null,null,"General Service 50 to 4,999 kW - Time of Use"]
[null,null,null,null,null,null,null,null,null,null,null,null,null,null,null,null,null,null,null,null,null,null,null,null,null,null,null,"General Service 50 to 4,999 kW (CoGeneration)"]
[null,null,null,null,null,null,null,null,null,null,null,null,null,null,null,null,null,null,null,null,null,null,null,null,null,null,null,"General Service 50 to 4,999 kW (formerly Time of Use)"]
[null,null,null,null,null,null,null,null,null,null,null,null,null,null,null,null,null,null,null,null,null,null,null,null,null,null,null,"General Service 500 to 4,999 kW"]
[null,null,null,null,null,null,null,null,null,null,null,null,null,null,null,null,null,null,null,null,null,null,null,null,null,null,null,"General Service 700 to 4,999 kW"]
[null,null,null,null,null,null,null,null,null,null,null,null,null,null,null,null,null,null,null,null,null,null,null,null,null,null,null,"General Service 1,000 to 2,999 kW"]
[null,null,null,null,null,null,null,null,null,null,null,null,null,null,null,null,null,null,null,null,null,null,null,null,null,null,null,"General Service 1,000 to 4,999 kW"]
[null,null,null,null,null,null,null,null,null,null,null,null,null,null,null,null,null,null,null,null,null,null,null,null,null,null,null,"General Service 1,000 to 4,999 kW - Interval Meters"]
[null,null,null,null,null,null,null,null,null,null,null,null,null,null,null,null,null,null,null,null,null,null,null,null,null,null,null,"General Service 1,000 To 4,999 kW (co-generation)"]
[null,null,null,null,null,null,null,null,null,null,null,null,null,null,null,null,null,null,null,null,null,null,null,null,null,null,null,"General Service Greater Than 1,000 kW"]
[null,null,null,null,null,null,null,null,null,null,null,null,null,null,null,null,null,null,null,null,null,null,null,null,null,null,null,"General Service Intermediate Rate Class 1,000 To 4,999 kW (formerly Large Use Customers)"]
[null,null,null,null,null,null,null,null,null,null,null,null,null,null,null,null,null,null,null,null,null,null,null,null,null,null,null,"General Service Intermediate Rate Class 1,000 To 4,999 kW (formerly General Service > 50 kW Customers)"]
[null,null,null,null,null,null,null,null,null,null,null,null,null,null,null,null,null,null,null,null,null,null,null,null,null,null,null,"General Service 1,500 to 4,999 kW"]
[null,null,null,null,null,null,null,null,null,null,null,null,null,null,null,null,null,null,null,null,null,null,null,null,null,null,null,"General Service Equal To Or Greater Than 1,500 kW"]
[null,null,null,null,null,null,null,null,null,null,null,null,null,null,null,null,null,null,null,null,null,null,null,null,null,null,null,"General Service Equal To Or Greater Than 1,500 kW - Interval Metered"]
[null,null,null,null,null,null,null,null,null,null,null,null,null,null,null,null,null,null,null,null,null,null,null,null,null,null,null,"General Service Intermediate 1,000 To 4,999 kW"]
[null,null,null,null,null,null,null,null,null,null,null,null,null,null,null,null,null,null,null,null,null,null,null,null,null,null,null,"General Service 2,500 to 4,999 kW"]
[null,null,null,null,null,null,null,null,null,null,null,null,null,null,null,null,null,null,null,null,null,null,null,null,null,null,null,"General Service 3,000 to 4,999 kW"]
[null,null,null,null,null,null,null,null,null,null,null,null,null,null,null,null,null,null,null,null,null,null,null,null,null,null,null,"General Service 3,000 to 4,999 kW - Interval Metered"]
[null,null,null,null,null,null,null,null,null,null,null,null,null,null,null,null,null,null,null,null,null,null,null,null,null,null,null,"General Service 3,000 to 4,999 kW - Intermediate Use"]
[null,null,null,null,null,null,null,null,null,null,null,null,null,null,null,null,null,null,null,null,null,null,null,null,null,null,null,"General Service 3,000 to 4,999 kW - Time of Use"]
[null,null,null,null,null,null,null,null,null,null,null,null,null,null,null,null,null,null,null,null,null,null,null,null,null,null,null,"Intermediate With Self Generation"]
[null,null,null,null,null,null,null,null,null,null,null,null,null,null,null,null,null,null,null,null,null,null,null,null,null,null,null,"General Service - Commercial"]
[null,null,null,null,null,null,null,null,null,null,null,null,null,null,null,null,null,null,null,null,null,null,null,null,null,null,null,"General Service - Institutional"]
[null,null,null,null,null,null,null,null,null,null,null,null,null,null,null,null,null,null,null,null,null,null,null,null,null,null,null,"Farms – Three Phase energy-billed [F3]"]
[]
[null,null,null,null,null,null,null,null,null,null,null,null,null,null,null,null,null,null,null,null,null,null,null,null,null,null,null,"Large Use"]
[null,null,null,null,null,null,null,null,null,null,null,null,null,null,null,null,null,null,null,null,null,null,null,null,null,null,null,"Large Use - Regular"]
[null,null,null,null,null,null,null,null,null,null,null,null,null,null,null,null,null,null,null,null,null,null,null,null,null,null,null,"Large Use > 5000 kW"]
[null,null,null,null,null,null,null,null,null,null,null,null,null,null,null,null,null,null,null,null,null,null,null,null,null,null,null,"Large Use - 3TS"]
[null,null,null,null,null,null,null,null,null,null,null,null,null,null,null,null,null,null,null,null,null,null,null,null,null,null,null,"Large Use - Ford Annex"]
[]
[null,null,null,null,null,null,null,null,null,null,null,null,null,null,null,null,null,null,null,null,null,null,null,null,null,null,null,"Unmetered Scattered Load"]
[]
[null,null,null,null,null,null,null,null,null,null,null,null,null,null,null,null,null,null,null,null,null,null,null,null,null,null,null,"Sentinel Lighting"]
[]
[null,null,null,null,null,null,null,null,null,null,null,null,null,null,null,null,null,null,null,null,null,null,null,null,null,null,null,"Street Lighting"]
[]
[null,null,null,null,null,null,null,null,null,null,null,null,null,null,null,null,null,null,null,null,null,null,null,null,null,null,null,"Embedded Distributor"]
[null,null,null,null,null,null,null,null,null,null,null,null,null,null,null,null,null,null,null,null,null,null,null,null,null,null,null,"Low Voltage Wheeling Charge Rate"]
[]
[null,null,null,null,null,null,null,null,null,null,null,null,null,null,null,null,null,null,null,null,null,null,null,null,null,null,null,"Stand-By"]
[null,null,null,null,null,null,null,null,null,null,null,null,null,null,null,null,null,null,null,null,null,null,null,null,null,null,null,"Standby Power"]
[null,null,null,null,null,null,null,null,null,null,null,null,null,null,null,null,null,null,null,null,null,null,null,null,null,null,null,"Standby Power – INTERIM APPROVAL"]
[null,null,null,null,null,null,null,null,null,null,null,null,null,null,null,null,null,null,null,null,null,null,null,null,null,null,null,"Standby Power - APPROVED ON AN INTERIM BASIS"]
[null,null,null,null,null,null,null,null,null,null,null,null,null,null,null,null,null,null,null,null,null,null,null,null,null,null,null,"Standby - General Service 50 - 1,000 kW"]
[null,null,null,null,null,null,null,null,null,null,null,null,null,null,null,null,null,null,null,null,null,null,null,null,null,null,null,"Standby Power General Service 50 to 1,499 kW"]
[null,null,null,null,null,null,null,null,null,null,null,null,null,null,null,null,null,null,null,null,null,null,null,null,null,null,null,"Standby - General Service 1,000 - 5,000 kW"]
[null,null,null,null,null,null,null,null,null,null,null,null,null,null,null,null,null,null,null,null,null,null,null,null,null,null,null,"Standby Power General Service 1,500 to 4,999 kW"]
[null,null,null,null,null,null,null,null,null,null,null,null,null,null,null,null,null,null,null,null,null,null,null,null,null,null,null,"Standby - Large Use"]
[null,null,null,null,null,null,null,null,null,null,null,null,null,null,null,null,null,null,null,null,null,null,null,null,null,null,null,"Standby Power General Service Large Use"]
[null,null,null,null,null,null,null,null,null,null,null,null,null,null,null,null,null,null,null,null,null,null,null,null,null,null,null,"Standby Distribution Service"]

{"sheet":"4. RRR Data","index":3,"n_rows":48,"n_cols":13,"rows_kept":48,"cut":false,"hidden":false,"merged":[[37,7,37,8],[26,7,26,8],[27,7,27,8],[28,7,28,8],[29,7,29,8],[30,7,30,8],[31,7,31,8],[44,7,44,8],[45,7,45,8],[46,7,46,8],[47,7,47,8],[26,9,26,10],[27,9,27,10],[28,9,28,10],[29,9,29,10],[30,9,30,10],[31,9,31,10],[38,7,38,8],[39,7,39,8],[40,7,40,8],[41,7,41,8],[42,7,42,8],[43,7,43,8],[40,9,40,10],[41,9,41,10],[46,9,46,10],[47,9,47,10],[42,9,42,10],[43,9,43,10],[44,9,44,10],[45,9,45,10],[20,9,20,10],[23,9,23,10],[12,1,12,11],[38,9,38,10],[39,9,39,10],[32,9,32,10],[33,9,33,10],[34,9,34,10],[35,9,35,10],[36,9,36,10],[37,9,37,10],[32,7,32,8],[33,7,33,8],[34,7,34,8],[35,7,35,8],[36,7,36,8]]}
[]
[]
[]
[]
[]
[]
[]
[]
[]
[]
[]
[]
[null,"In the green shaded cells, enter the most recent reported RRR billing determinants.  Please ensure that billing determinants are non-loss adjusted."]
[]
[]
[]
[]
[]
[]
[]
[]
[]
[]
[null,"Rate Class",null,"Unit",null,"Non-Loss Adjusted Metered kWh","Non-Loss Adjusted Metered kW","Applicable Loss Factor",null,"Load Factor",null,"Loss Adjusted Billed kWh","Billed kW"]
[]
[]
[null,{"$f":"IF('3. Rate Classes'!Q24=1,'3. Rate Classes'!C24, 0)","v":"Residential"},null,{"$f":"IF(OR(VLOOKUP($B27, '3. Rate Classes'!$C$24:$H$45,6,0)=0, ISERROR(VLOOKUP($B27, '3. Rate Classes'!$C$24:$H$45,6,0))), \"\", VLOOKUP($B27, '3. Rate Classes'!$C$24:$H$45,6,0))","v":"kWh"},null,25241629,null,1.046,null,{"$f":"IF(ISERROR(F27/(G27*30.4*24)), \"\", IF(D27=\"kW\", F27/(G27*30.4*24), \"\"))","v":""},null,{"$f":"IF(OR(H27=0, OR(ISBLANK(H27), TRIM(H27)=\"\")), F27, F27*H27)","v":26402743.934},{"$f":"IF(OR(H27=0, OR(ISBLANK(H27), TRIM(H27)=\"\")), G27, G27)","v":0}]
[null,{"$f":"IF('3. Rate Classes'!Q25=1,'3. Rate Classes'!C25, 0)","v":"General Service Less Than 50 kW"},null,{"$f":"IF(OR(VLOOKUP($B28, '3. Rate Classes'!$C$24:$H$45,6,0)=0, ISERROR(VLOOKUP($B28, '3. Rate Classes'!$C$24:$H$45,6,0))), \"\", VLOOKUP($B28, '3. Rate Classes'!$C$24:$H$45,6,0))","v":"kWh"},null,11110938,null,1.046,null,"",null,{"$f":"IF(OR(H28=0, OR(ISBLANK(H28), TRIM(H28)=\"\")), F28, F28*H28)","v":11622041.148},{"$f":"IF(OR(H28=0, OR(ISBLANK(H28), TRIM(H28)=\"\")), G28, G28)","v":0}]
[null,{"$f":"IF('3. Rate Classes'!Q26=1,'3. Rate Classes'!C26, 0)","v":"General Service 50 to 1,499 kW"},null,{"$f":"IF(OR(VLOOKUP($B29, '3. Rate Classes'!$C$24:$H$45,6,0)=0, ISERROR(VLOOKUP($B29, '3. Rate Classes'!$C$24:$H$45,6,0))), \"\", VLOOKUP($B29, '3. Rate Classes'!$C$24:$H$45,6,0))","v":"kW"},null,23609369,66539,null,null,0.48632129294045467,null,23609369,66539]
[null,{"$f":"IF('3. Rate Classes'!Q27=1,'3. Rate Classes'!C27, 0)","v":"General Service Intermediate 1,000 To 4,999 kW"},null,{"$f":"IF(OR(VLOOKUP($B30, '3. Rate Classes'!$C$24:$H$45,6,0)=0, ISERROR(VLOOKUP($B30, '3. Rate Classes'!$C$24:$H$45,6,0))), \"\", VLOOKUP($B30, '3. Rate Classes'!$C$24:$H$45,6,0))","v":"kW"},null,23201291,62667,null,null,0.50744434992507048,null,23201291,62667]
[null,{"$f":"IF('3. Rate Classes'!Q28=1,'3. Rate Classes'!C28, 0)","v":"Sentinel Lighting"},null,{"$f":"IF(OR(VLOOKUP($B31, '3. Rate Classes'!$C$24:$H$45,6,0)=0, ISERROR(VLOOKUP($B31, '3. Rate Classes'!$C$24:$H$45,6,0))), \"\", VLOOKUP($B31, '3. Rate Classes'!$C$24:$H$45,6,0))","v":"kW"},null,21288,72,null,null,0.4052448830409357,null,21288,72]
[null,{"$f":"IF('3. Rate Classes'!Q29=1,'3. Rate Classes'!C29, 0)","v":"Street Lighting"},null,{"$f":"IF(OR(VLOOKUP($B32, '3. Rate Classes'!$C$24:$H$45,6,0)=0, ISERROR(VLOOKUP($B32, '3. Rate Classes'!$C$24:$H$45,6,0))), \"\", VLOOKUP($B32, '3. Rate Classes'!$C$24:$H$45,6,0))","v":"kW"},null,1030212,11311,null,null,0.12483626790874278,null,1030212,11311]
[null,{"$f":"IF('3. Rate Classes'!Q30=1,'3. Rate Classes'!C30, 0)","v":0},null,{"$f":"IF(OR(VLOOKUP($B33, '3. Rate Classes'!$C$24:$H$45,6,0)=0, ISERROR(VLOOKUP($B33, '3. Rate Classes'!$C$24:$H$45,6,0))), \"\", VLOOKUP($B33, '3. Rate Classes'!$C$24:$H$45,6,0))","v":{"$error":"#N/A"}},null,null,null,null,null,{"$f":"IF(ISERROR(F33/(G33*30.4*24)), \"\", IF(D33=\"kW\", F33/(G33*30.4*24), \"\"))","v":""},null,0,0]
[null,{"$f":"IF('3. Rate Classes'!Q31=1,'3. Rate Classes'!C31, 0)","v":0},null,{"$f":"IF(OR(VLOOKUP($B34, '3. Rate Classes'!$C$24:$H$45,6,0)=0, ISERROR(VLOOKUP($B34, '3. Rate Classes'!$C$24:$H$45,6,0))), \"\", VLOOKUP($B34, '3. Rate Classes'!$C$24:$H$45,6,0))","v":{"$error":"#N/A"}},null,null,null,null,null,"",null,0,0]
[null,{"$f":"IF('3. Rate Classes'!Q32=1,'3. Rate Classes'!C32, 0)","v":0},null,{"$f":"IF(OR(VLOOKUP($B35, '3. Rate Classes'!$C$24:$H$45,6,0)=0, ISERROR(VLOOKUP($B35, '3. Rate Classes'!$C$24:$H$45,6,0))), \"\", VLOOKUP($B35, '3. Rate Classes'!$C$24:$H$45,6,0))","v":{"$error":"#N/A"}},null,null,null,null,null,"",null,0,0]
[null,{"$f":"IF('3. Rate Classes'!Q33=1,'3. Rate Classes'!C33, 0)","v":0},null,{"$f":"IF(OR(VLOOKUP($B36, '3. Rate Classes'!$C$24:$H$45,6,0)=0, ISERROR(VLOOKUP($B36, '3. Rate Classes'!$C$24:$H$45,6,0))), \"\", VLOOKUP($B36, '3. Rate Classes'!$C$24:$H$45,6,0))","v":{"$error":"#N/A"}},null,null,null,null,null,"",null,0,0]
[null,{"$f":"IF('3. Rate Classes'!Q34=1,'3. Rate Classes'!C34, 0)","v":0},null,{"$f":"IF(OR(VLOOKUP($B37, '3. Rate Classes'!$C$24:$H$45,6,0)=0, ISERROR(VLOOKUP($B37, '3. Rate Classes'!$C$24:$H$45,6,0))), \"\", VLOOKUP($B37, '3. Rate Classes'!$C$24:$H$45,6,0))","v":{"$error":"#N/A"}},null,null,null,null,null,"",null,0,0]
[null,{"$f":"IF('3. Rate Classes'!Q35=1,'3. Rate Classes'!C35, 0)","v":0},null,{"$f":"IF(OR(VLOOKUP($B38, '3. Rate Classes'!$C$24:$H$45,6,0)=0, ISERROR(VLOOKUP($B38, '3. Rate Classes'!$C$24:$H$45,6,0))), \"\", VLOOKUP($B38, '3. Rate Classes'!$C$24:$H$45,6,0))","v":{"$error":"#N/A"}},null,null,null,null,null,"",null,0,0]
[null,{"$f":"IF('3. Rate Classes'!Q36=1,'3. Rate Classes'!C36, 0)","v":0},null,{"$f":"IF(OR(VLOOKUP($B39, '3. Rate Classes'!$C$24:$H$45,6,0)=0, ISERROR(VLOOKUP($B39, '3. Rate Classes'!$C$24:$H$45,6,0))), \"\", VLOOKUP($B39, '3. Rate Classes'!$C$24:$H$45,6,0))","v":{"$error":"#N/A"}},null,null,null,null,null,"",null,0,0]
[null,{"$f":"IF('3. Rate Classes'!Q37=1,'3. Rate Classes'!C37, 0)","v":0},null,{"$f":"IF(OR(VLOOKUP($B40, '3. Rate Classes'!$C$24:$H$45,6,0)=0, ISERROR(VLOOKUP($B40, '3. Rate Classes'!$C$24:$H$45,6,0))), \"\", VLOOKUP($B40, '3. Rate Classes'!$C$24:$H$45,6,0))","v":{"$error":"#N/A"}},null,null,null,null,null,"",null,0,0]
[null,{"$f":"IF('3. Rate Classes'!Q38=1,'3. Rate Classes'!C38, 0)","v":0},null,{"$f":"IF(OR(VLOOKUP($B41, '3. Rate Classes'!$C$24:$H$45,6,0)=0, ISERROR(VLOOKUP($B41, '3. Rate Classes'!$C$24:$H$45,6,0))), \"\", VLOOKUP($B41, '3. Rate Classes'!$C$24:$H$45,6,0))","v":{"$error":"#N/A"}},null,null,null,null,null,"",null,0,0]
[null,{"$f":"IF('3. Rate Classes'!Q39=1,'3. Rate Classes'!C39, 0)","v":0},null,{"$f":"IF(OR(VLOOKUP($B42, '3. Rate Classes'!$C$24:$H$45,6,0)=0, ISERROR(VLOOKUP($B42, '3. Rate Classes'!$C$24:$H$45,6,0))), \"\", VLOOKUP($B42, '3. Rate Classes'!$C$24:$H$45,6,0))","v":{"$error":"#N/A"}},null,null,null,null,null,"",null,0,0]
[null,{"$f":"IF('3. Rate Classes'!Q40=1,'3. Rate Classes'!C40, 0)","v":0},null,{"$f":"IF(OR(VLOOKUP($B43, '3. Rate Classes'!$C$24:$H$45,6,0)=0, ISERROR(VLOOKUP($B43, '3. Rate Classes'!$C$24:$H$45,6,0))), \"\", VLOOKUP($B43, '3. Rate Classes'!$C$24:$H$45,6,0))","v":{"$error":"#N/A"}},null,null,null,null,null,"",null,0,0]
[null,{"$f":"IF('3. Rate Classes'!Q41=1,'3. Rate Classes'!C41, 0)","v":0},null,{"$f":"IF(OR(VLOOKUP($B44, '3. Rate Classes'!$C$24:$H$45,6,0)=0, ISERROR(VLOOKUP($B44, '3. Rate Classes'!$C$24:$H$45,6,0))), \"\", VLOOKUP($B44, '3. Rate Classes'!$C$24:$H$45,6,0))","v":{"$error":"#N/A"}},null,null,null,null,null,"",null,0,0]
[null,{"$f":"IF('3. Rate Classes'!Q42=1,'3. Rate Classes'!C42, 0)","v":0},null,{"$f":"IF(OR(VLOOKUP($B45, '3. Rate Classes'!$C$24:$H$45,6,0)=0, ISERROR(VLOOKUP($B45, '3. Rate Classes'!$C$24:$H$45,6,0))), \"\", VLOOKUP($B45, '3. Rate Classes'!$C$24:$H$45,6,0))","v":{"$error":"#N/A"}},null,null,null,null,null,"",null,0,0]
[null,{"$f":"IF('3. Rate Classes'!Q43=1,'3. Rate Classes'!C43, 0)","v":0},null,{"$f":"IF(OR(VLOOKUP($B46, '3. Rate Classes'!$C$24:$H$45,6,0)=0, ISERROR(VLOOKUP($B46, '3. Rate Classes'!$C$24:$H$45,6,0))), \"\", VLOOKUP($B46, '3. Rate Classes'!$C$24:$H$45,6,0))","v":{"$error":"#N/A"}},null,null,null,null,null,"",null,0,0]
[null,{"$f":"IF('3. Rate Classes'!Q44=1,'3. Rate Classes'!C44, 0)","v":0},null,{"$f":"IF(OR(VLOOKUP($B47, '3. Rate Classes'!$C$24:$H$45,6,0)=0, ISERROR(VLOOKUP($B47, '3. Rate Classes'!$C$24:$H$45,6,0))), \"\", VLOOKUP($B47, '3. Rate Classes'!$C$24:$H$45,6,0))","v":{"$error":"#N/A"}},null,null,null,null,null,"",null,0,0]
[null,{"$f":"IF('3. Rate Classes'!Q45=1,'3. Rate Classes'!C45, 0)","v":0},null,{"$f":"IF(OR(VLOOKUP($B48, '3. Rate Classes'!$C$24:$H$45,6,0)=0, ISERROR(VLOOKUP($B48, '3. Rate Classes'!$C$24:$H$45,6,0))), \"\", VLOOKUP($B48, '3. Rate Classes'!$C$24:$H$45,6,0))","v":{"$error":"#N/A"}},null,null,null,null,null,"",null,0,0]

{"sheet":"5. UTRs and Sub-Transmission","index":4,"n_rows":95,"n_cols":9,"rows_kept":95,"cut":false,"hidden":false,"merged":[]}
[]
[]
[]
[]
[]
[]
[]
[]
[]
[]
[]
[]
[]
[]
[]
[]
[]
[null,"Uniform Transmission Rates","Unit",null,"Effective January 1, 2013",null,"Effective January 1, 2014",null,"Effective January 1, 2015"]
[]
[null,"Rate Description",null,null,"Rate",null,"Rate",null,"Rate"]
[]
[null,"Network Service Rate","kW",null,3.63,null,3.82,null,3.78]
[null,null,null,null,null,null,null,null,"      "]
[null,"Line Connection Service Rate","kW",null,0.75,null,0.82,null,0.86]
[null,null,null,null,null,null,null,null,"     "]
[null,"Transformation Connection Service Rate","kW",null,1.85,null,1.98,null,2]
[null,null,null,null,null,null,null,null," "]
[]
[null,"Hydro One Sub-Transmission Rates","Unit",null,"Effective January 1, 2013",null,"Effective January 1, 2014",null,"Effective January 1, 2015"]
[]
[]
[]
[null,"Rate Description",null,null,"Rate",null,"Rate",null,"Rate"]
[]
[null,"Network Service Rate","kW",null,3.18,null,3.23,null,3.4121000000000001]
[]
[null,"Line Connection Service Rate","kW",null,0.7,null,0.65,null,0.78790000000000004]
[]
[null,"Transformation Connection Service Rate","kW",null,1.63,null,1.62,null,1.8018000000000001]
[]
[null,"Both Line and Transformation Connection Service Rate","kW",null,{"$f":"E39+E37","v":2.33},null,{"$f":"G39+G37","v":2.27},null,2.5897000000000001]
[]
[]
[null,"If needed , add extra host here (I)","Unit",null,"Effective January 1, 2013",null,"Effective January 1, 2014",null,"Effective January 1, 2015"]
[]
[]
[]
[null,"Rate Description",null,null,"Rate",null,"Rate",null,"Rate"]
[]
[null,"Network Service Rate","kW"]
[]
[null,"Line Connection Service Rate","kW"]
[]
[null,"Transformation Connection Service Rate","kW"]
[]
[null,"Both Line and Transformation Connection Service Rate","kW",null,{"$f":"E54+E52","v":0},null,{"$f":"G54+G52","v":0},null,{"$f":"I54+I52","v":0}]
[]
[]
[null,"If needed , add extra host here (II)","Unit",null,"Effective January 1, 2013",null,"Effective January 1, 2014",null,"Effective January 1, 2015"]
[]
[]
[]
[null,"Rate Description",null,null,"Rate",null,"Rate",null,"Rate"]
[]
[null,"Network Service Rate","kW"]
[]
[null,"Line Connection Service Rate","kW"]
[]
[null,"Transformation Connection Service Rate","kW"]
[]
[null,"Both Line and Transformation Connection Service Rate","kW",null,{"$f":"E69+E67","v":0},null,{"$f":"G69+G67","v":0},null,{"$f":"I69+I67","v":0}]
[]
[]
[]
[null,"Hydro One Sub-Transmission Rate Rider 9A","Unit",null,"Effective January 1, 2013",null,"Effective January 1, 2014",null,"Effective January 1, 2015"]
[]
[null,"Rate Description",null,null,"Rate",null,"Rate",null,"Rate"]
[]
[null,"RSVA Transmission network – 4714 – which affects 1584","kW",null,0,null,0.14649999999999999,null,0.14649999999999999]
[]
[null,"RSVA Transmission connection – 4716 – which affects 1586","kW",null,0,null,6.6699999999999995E-2,null,6.6699999999999995E-2]
[]
[null,"RSVA LV – 4750 – which affects 1550","kW",null,0,null,4.7500000000000001E-2,null,4.7500000000000001E-2]
[]
[null,"RARA 1 – 2252 – which affects 1590 ","kW",null,0,null,4.19E-2,null,4.19E-2]
[]
[null,"RARA 1 – 2252 – which affects 1590 (2008)","kW",null,0,null,-2.7E-2,null,-2.7E-2]
[]
[null,"RARA 1 – 2252 – which affects 1590 (2009)","kW",null,0,null,-5.9999999999999995E-4,null,-5.9999999999999995E-4]
[]
[null,"Hydro One Sub-Transmission Rate Rider 9A","kW",null,{"$f":"SUM(E79:E89)","v":0},null,{"$f":"SUM(G79:G89)","v":0.27499999999999997},null,{"$f":"SUM(I79:I89)","v":0.27499999999999997}]
[]
[]
[null,null,null,null,"Historical 2013",null,"Current 2014",null,"Forecast 2015"]
[null,"Low Voltage Switchgear Credit (if applicable, enter as a negative value)","$"]

{"sheet":"6. Historical Wholesale","index":5,"n_rows":117,"n_cols":16,"rows_kept":117,"cut":false,"hidden":false,"merged":[[96,7,96,9],[96,11,96,13],[20,3,20,5],[20,7,20,9],[20,11,20,13],[96,3,96,5],[38,3,38,5],[38,7,38,9],[38,11,38,13],[95,3,95,5],[57,3,57,5],[57,7,57,9],[57,11,57,13],[76,3,76,5],[76,7,76,9],[76,11,76,13],[95,7,95,9],[95,11,95,13]]}
[]
[]
[]
[]
[]
[]
[]
[]
[]
[]
[]
[]
[]
[]
[]
[]
[]
[]
[]
[]
[null,"IESO",null,"Network",null,null,null,"Line Connection",null,null,null,"Transformation Connection",null,null,null,"Total Line"]
[null,"Month",null,"Units Billed","Rate","Amount",null,"Units Billed","Rate","Amount",null,"Units Billed","Rate","Amount",null,"Amount"]
[null,"2014 billed"]
[null,"January",null,{"$f":"F24/E24","v":4442.9862258953171},3.63,16128.04,null,{"$f":"J24/I24","v":5430.586666666667},0.75,4072.94,null,{"$f":"N24/M24","v":5316.032432432432},1.85,9834.66,null,{"$f":"J24+N24","v":13907.6}]
[null,"February",null,{"$f":"F25/E25","v":4195},3.82,16024.9,null,{"$f":"J25/I25","v":4852},0.82,3978.64,null,{"$f":"N25/M25","v":4852},1.98,9606.9599999999991,null,13585.599999999999]
[null,"March",null,4247,3.82,16223.54,null,4783,0.82,3922.06,null,4783,1.98,9470.34,null,13392.4]
[null,"April",null,3935.0000000000005,3.82,15031.7,null,4475,0.82,3669.5,null,4475,1.98,8860.5,null,12530]
[null,"May",null,3892.0000000000005,3.82,14867.44,null,4233,0.82,3471.06,null,4233,1.98,8381.34,null,11852.4]
[null,"June",null,3484,3.82,13308.88,null,4099,0.82,3361.18,null,4099,1.98,8116.02,null,11477.2]
[null,"July",null,3472.0000000000005,3.82,13263.04,null,4085,0.82,3349.7,null,4085,1.98,8088.3,null,11438]
[null,"August",null,3579.0000000000005,3.82,13671.78,null,3948.0000000000005,0.82,3237.36,null,3948,1.98,7817.04,null,11054.4]
[null,"September",null,3505.0000000000005,3.82,13389.1,null,4123,0.82,3380.86,null,4123,1.98,8163.54,null,11544.4]
[null,"October",null,3625,3.82,13847.5,null,4200,0.82,3444,null,4200,1.98,8316,null,11760]
[null,"November",null,4514,3.82,17243.48,null,4759,0.82,3902.38,null,4759,1.98,9422.82,null,13325.2]
[null,"December",null,{"$f":"F35/E35","v":4634.0000000000009},3.82,17701.88,null,{"$f":"J35/I35","v":4787.0000000000009},0.82,3925.34,null,{"$f":"N35/M35","v":4787},1.98,9478.26,null,13403.6]
[null,null,null,null,"."]
[null,"Total",null,{"$f":"SUM(D24:D35)","v":47524.986225895322},{"$f":"IF(D37<>0,F37/D37,0)","v":3.8022373986831344},{"$f":"SUM(F24:F35)","v":180701.28000000003},null,{"$f":"SUM(H24:H35)","v":53774.58666666667},{"$f":"IF(H37<>0,J37/H37,0)","v":0.81293084168134944},{"$f":"SUM(J24:J35)","v":43715.020000000004},null,{"$f":"SUM(L24:L35)","v":53660.032432432432},{"$f":"IF(L37<>0,N37/L37,0)","v":1.9671210622713202},{"$f":"SUM(N24:N35)","v":105555.77999999998},null,{"$f":"SUM(P24:P35)","v":149270.79999999999}]
[]
[null,"Hydro One",null,"Network",null,null,null,"Line Connection",null,null,null,"Transformation Connection",null,null,null,"Total Line"]
[]
[null,"Month",null,"Units Billed","Rate","Amount",null,"Units Billed","Rate","Amount",null,"Units Billed","Rate","Amount",null,"Amount"]
[null,"2014 billed"]
[null,"January",null,12304.45,3.23,{"$f":"E43*D43","v":39743.373500000002},null,12319.26,0.65,{"$f":"I43*H43","v":8007.5190000000002},null,{"$f":"H43","v":12319.26},1.62,{"$f":"M43*L43","v":19957.201200000003},null,{"$f":"J43+N43","v":27964.720200000003}]
[null,"February",null,11339.11,3.23,{"$f":"E44*D44","v":36625.325300000004},null,11684.6,0.65,{"$f":"I44*H44","v":7594.9900000000007},null,{"$f":"H44","v":11684.6},1.62,{"$f":"M44*L44","v":18929.052000000003},null,26524.042000000005]
[null,"March",null,10315.68,3.23,33319.646399999998,null,10569.25,0.65,6870.0124999999998,null,{"$f":"H45","v":10569.25},1.62,17122.185000000001,null,23992.197500000002]
[null,"April",null,9368.4,3.23,30259.931999999997,null,9368.4,0.65,6089.46,null,{"$f":"H46","v":9368.4},1.62,15176.808000000001,null,21266.268]
[null,"May",null,7787.5,3.23,25153.625,null,8119.9,0.65,5277.9349999999995,null,{"$f":"H47","v":8119.9},1.62,13154.237999999999,null,18432.172999999999]
[null,"June",null,7744.3,3.23,25014.089,null,7744.3,0.65,5033.7950000000001,null,7744.3,1.62,12545.766000000001,null,17579.561000000002]
[null,"July",null,7588.97,3.23,24512.373100000001,null,7588.97,0.65,4932.8305,null,7588.97,1.62,12294.131400000002,null,17226.961900000002]
[null,"August",null,7269.7,3.23,23481.130999999998,null,7693.99,0.65,5001.0934999999999,null,7693.99,1.62,12464.263800000001,null,17465.3573]
[null,"September",null,8060.34,3.23,26034.8982,null,8341.66,0.65,5422.0789999999997,null,8341.66,1.62,13513.4892,null,18935.568200000002]
[null,"October",null,9007.09,3.23,29092.900700000002,null,9007.09,0.65,5854.6085000000003,null,9007.09,1.62,14591.4858,null,20446.094300000001]
[null,"November",null,10755.03,3.23,{"$f":"E53*D53","v":34738.746900000006},null,10759.82,0.65,{"$f":"I53*H53","v":6993.8829999999998},null,{"$f":"H53","v":10759.82},1.62,{"$f":"M53*L53","v":17430.9084},null,24424.791400000002]
[null,"December",null,11677.22,3.23,{"$f":"E54*D54","v":37717.420599999998},null,11677.22,0.65,{"$f":"I54*H54","v":7590.1930000000002},null,{"$f":"H54","v":11677.22},1.62,{"$f":"M54*L54","v":18917.096399999999},null,26507.289399999998]
[]
[null,"Total",null,{"$f":"SUM(D43:D54)","v":113217.79},{"$f":"IF(D56<>0,F56/D56,0)","v":3.2300000000000004},{"$f":"SUM(F43:F54)","v":365693.46170000004},null,{"$f":"SUM(H43:H54)","v":114874.46000000002},{"$f":"IF(H56<>0,J56/H56,0)","v":0.64999999999999991},{"$f":"SUM(J43:J54)","v":74668.399000000005},null,{"$f":"SUM(L43:L54)","v":114874.46000000002},{"$f":"IF(L56<>0,N56/L56,0)","v":1.62},{"$f":"SUM(N43:N54)","v":186096.62520000004},null,{"$f":"SUM(P43:P54)","v":260765.02419999999}]
[]
[null,"Add Extra Host Here (I)",null,"Network",null,null,null,"Line Connection",null,null,null,"Transformation Connection",null,null,null,"Total Line"]
[null,"(if needed)"]
[null,"Month",null,"Units Billed","Rate","Amount",null,"Units Billed","Rate","Amount",null,"Units Billed","Rate","Amount",null,"Amount"]
[]
[null,"January",null,null,{"$f":"IF(D62<>0,F62/D62,0)","v":0},null,null,null,{"$f":"IF(H62<>0,J62/H62,0)","v":0},null,null,null,{"$f":"IF(L62<>0,N62/L62,0)","v":0},null,null,{"$f":"J62+N62","v":0}]
[null,"February",null,null,0,null,null,null,0,null,null,null,0,null,null,0]
[null,"March",null,null,0,null,null,null,0,null,null,null,0,null,null,0]
[null,"April",null,null,0,null,null,null,0,null,null,null,0,null,null,0]
[null,"May",null,null,0,null,null,null,0,null,null,null,0,null,null,0]
[null,"June",null,null,0,null,null,null,0,null,null,null,0,null,null,0]
[null,"July",null,null,0,null,null,null,0,null,null,null,0,null,null,0]
[null,"August",null,null,0,null,null,null,0,null,null,null,0,null,null,0]
[null,"September",null,null,0,null,null,null,0,null,null,null,0,null,null,0]
[null,"October",null,null,0,null,null,null,0,null,null,null,0,null,null,0]
[null,"November",null,null,0,null,null,null,0,null,null,null,0,null,null,0]
[null,"December",null,null,0,null,null,null,0,null,null,null,0,null,null,0]
[]
[null,"Total",null,{"$f":"SUM(D62:D73)","v":0},{"$f":"IF(D75<>0,F75/D75,0)","v":0},{"$f":"SUM(F62:F73)","v":0},null,{"$f":"SUM(H62:H73)","v":0},{"$f":"IF(H75<>0,J75/H75,0)","v":0},{"$f":"SUM(J62:J73)","v":0},null,{"$f":"SUM(L62:L73)","v":0},{"$f":"IF(L75<>0,N75/L75,0)","v":0},{"$f":"SUM(N62:N73)","v":0},null,{"$f":"SUM(P62:P73)","v":0}]
[]
[null,"Add Extra Host Here (II)",null,"Network",null,null,null,"Line Connection",null,null,null,"Transformation Connection",null,null,null,"Total Line"]
[null,"(if needed)"]
[null,"Month",null,"Units Billed","Rate","Amount",null,"Units Billed","Rate","Amount",null,"Units Billed","Rate","Amount",null,"Amount"]
[]
[null,"January",null,null,{"$f":"IF(D81<>0,F81/D81,0)","v":0},null,null,null,{"$f":"IF(H81<>0,J81/H81,0)","v":0},null,null,null,{"$f":"IF(L81<>0,N81/L81,0)","v":0},null,null,{"$f":"J81+N81","v":0}]
[null,"February",null,null,0,null,null,null,0,null,null,null,0,null,null,0]
[null,"March",null,null,0,null,null,null,0,null,null,null,0,null,null,0]
[null,"April",null,null,0,null,null,null,0,null,null,null,0,null,null,0]
[null,"May",null,null,0,null,null,null,0,null,null,null,0,null,null,0]
[null,"June",null,null,0,null,null,null,0,null,null,null,0,null,null,0]
[null,"July",null,null,0,null,null,null,0,null,null,null,0,null,null,0]
[null,"August",null,null,0,null,null,null,0,null,null,null,0,null,null,0]
[null,"September",null,null,0,null,null,null,0,null,null,null,0,null,null,0]
[null,"October",null,null,0,null,null,null,0,null,null,null,0,null,null,0]
[null,"November",null,null,0,null,null,null,0,null,null,null,0,null,null,0]
[null,"December",null,null,0,null,null,null,0,null,null,null,0,null,null,0]
[]
[null,"Total",null,{"$f":"SUM(D81:D92)","v":0},{"$f":"IF(D94<>0,F94/D94,0)","v":0},{"$f":"SUM(F81:F92)","v":0},null,{"$f":"SUM(H81:H92)","v":0},{"$f":"IF(H94<>0,J94/H94,0)","v":0},{"$f":"SUM(J81:J92)","v":0},null,{"$f":"SUM(L81:L92)","v":0},{"$f":"IF(L94<>0,N94/L94,0)","v":0},{"$f":"SUM(N81:N92)","v":0},null,{"$f":"SUM(P81:P92)","v":0}]
[]
[null,"Total",null,"Network",null,null,null,"Line Connection",null,null,null,"Transformation Connection",null,null,null,"Total Line"]
[]
[null,"Month",null,"Units Billed","Rate","Amount",null,"Units Billed","Rate","Amount",null,"Units Billed","Rate","Amount",null,"Amount"]
[]
[null,"January",null,{"$f":"D24+D43+D62+D81","v":16747.436225895319},{"$f":"IF(D100<>0,F100/D100,0)","v":3.3361174060546759},{"$f":"F24+F43+F62+F81","v":55871.413500000002},null,{"$f":"H24+H43+H62+H81","v":17749.846666666668},{"$f":"IF(H100<>0,J100/H100,0)","v":0.68059511875595546},{"$f":"J24+J43+J62+J81","v":12080.459000000001},null,{"$f":"L24+L43+L62+L81","v":17635.292432432434},{"$f":"IF(L100<>0,N100/L100,0)","v":1.689331850557287},{"$f":"N24+N43+N62+N81","v":29791.861200000003},null,{"$f":"J100+N100","v":41872.320200000002}]
[null,"February",null,{"$f":"D25+D44+D63+D82","v":15534.11},3.3893300163318019,{"$f":"F25+F44+F63+F82","v":52650.225300000006},null,{"$f":"H25+H44+H63+H82","v":16536.599999999999},0.69987966087345654,{"$f":"J25+J44+J63+J82","v":11573.630000000001},null,{"$f":"L25+L44+L63+L82","v":16536.599999999999},1.7256275171437905,{"$f":"N25+N44+N63+N82","v":28536.012000000002},null,40109.642000000007]
[null,"March",null,14562.68,3.4020651693232287,49543.186399999999,null,15352.25,0.70296357211483662,10792.0725,null,15352.25,1.7321581527137717,26592.525000000001,null,37384.597500000003]
[null,"April",null,13303.4,3.4045155373814211,45291.631999999998,null,13843.4,0.70495398529263043,9758.9599999999991,null,13843.4,1.7363731453255704,24037.308000000001,null,33796.267999999996]
[null,"May",null,11679.5,3.4266077314953551,40021.065000000002,null,12352.9,0.70825433703826624,8748.994999999999,null,12352.9,1.7433621254927993,21535.578000000001,null,30284.573]
[null,"June",null,11228.3,3.4130695652948355,38322.968999999997,null,11843.3,0.70883748617361719,8394.9750000000004,null,11843.3,1.7445970295441307,20661.786,null,29056.760999999999]
[null,"July",null,11060.970000000001,3.4151989472894333,37775.413100000005,null,11673.970000000001,0.70948704682297448,8282.5305000000008,null,11673.970000000001,1.7459725697427695,20382.431400000001,null,28664.961900000002]
[null,"August",null,10848.7,3.4246417543115761,37152.911,null,11641.99,0.70764993785426711,8238.4534999999996,null,11641.99,1.7420822213384484,20281.303800000002,null,28519.757300000001]
[null,"September",null,11565.34,3.4088058111564381,39423.998200000002,null,12464.66,0.70623177848413032,8802.9390000000003,null,12464.66,1.7390790603193349,21677.029200000001,null,30479.968200000003]
[null,"October",null,12632.09,3.399310858298191,42940.400699999998,null,13207.09,0.70406187131305986,9298.6085000000003,null,13207.09,1.7344839627805975,22907.485800000002,null,32206.094300000004]
[null,"November",null,15269.03,3.4044223437900119,51982.226900000009,null,15518.82,0.70213218530790356,10896.262999999999,null,15518.82,1.7303975688873252,26853.7284,null,37749.991399999999]
[null,"December",null,16311.220000000001,3.3976183633106536,55419.300600000002,null,16464.22,0.69942778947317263,11515.532999999999,null,16464.22,1.7246706130020126,28395.356399999997,null,39910.8894]
[]
[null,"Total",null,{"$f":"SUM(D100:D111)","v":160742.77622589533},{"$f":"IF(D113<>0,F113/D113,0)","v":3.3991869154489378},{"$f":"SUM(F100:F111)","v":546394.74170000001},null,{"$f":"SUM(H100:H111)","v":168649.04666666669},{"$f":"IF(H113<>0,J113/H113,0)","v":0.70195130858927268},{"$f":"SUM(J100:J111)","v":118383.41899999999},null,{"$f":"SUM(L100:L111)","v":168534.49243243245},{"$f":"IF(L113<>0,N113/L113,0)","v":1.7305205657941327},{"$f":"SUM(N100:N111)","v":291652.40519999998},null,{"$f":"SUM(P100:P111)","v":410035.82420000003}]
[]
[null,null,null,null,null,null,null,null,null,null,null,null,null,"Low Voltage Switchgear Credit (if applicable)",null,{"$f":"'5. UTRs and Sub-Transmission'!E95","v":0}]
[]
[null,null,null,null,null,null,null,null,null,null,null,null,null,"Total including deduction for Low Voltage Switchgear Credit",null,{"$f":"P113+P115","v":410035.82420000003}]

{"sheet":"7. Current Wholesale","index":6,"n_rows":117,"n_cols":16,"rows_kept":117,"cut":false,"hidden":false,"merged":[[96,7,96,9],[96,11,96,13],[20,3,20,5],[20,7,20,9],[20,11,20,13],[96,3,96,5],[95,3,95,5],[95,7,95,9],[95,11,95,13],[57,3,57,5],[57,7,57,9],[57,11,57,13],[76,3,76,5],[76,7,76,9],[76,11,76,13],[12,1,12,11],[19,3,19,5],[19,7,19,9],[19,11,19,13],[38,3,38,5],[38,7,38,9],[38,11,38,13]]}
[]
[]
[]
[]
[]
[]
[]
[]
[]
[]
[]
[]
[null,"The purpose of this sheet is to calculate the expected billing when current 2014 Uniform Transmission Rates are applied against historical 2013 transmission units."]
[]
[]
[]
[]
[]
[]
[null,"IESO",null,"Network",null,null,null,"Line Connection",null,null,null,"Transformation Connection",null,null,null,"Total Line"]
[]
[null,"Month",null,"Units Billed","Rate","Amount",null,"Units Billed","Rate","Amount",null,"Units Billed","Rate","Amount",null,"Amount"]
[]
[null,"January",null,{"$f":"'6. Historical Wholesale'!D24","v":4442.9862258953171},{"$f":"'5. UTRs and Sub-Transmission'!G22","v":3.82},{"$f":"D24*E24","v":16972.207382920111},null,{"$f":"'6. Historical Wholesale'!H24","v":5430.586666666667},{"$f":"'5. UTRs and Sub-Transmission'!G24","v":0.82},{"$f":"H24*I24","v":4453.0810666666666},null,{"$f":"'6. Historical Wholesale'!L24","v":5316.032432432432},{"$f":"'5. UTRs and Sub-Transmission'!G26","v":1.98},{"$f":"L24*M24","v":10525.744216216215},null,{"$f":"J24+N24","v":14978.825282882881}]
[null,"February",null,{"$f":"'6. Historical Wholesale'!D25","v":4195},{"$f":"E24","v":3.82},{"$f":"D25*E25","v":16024.9},null,{"$f":"'6. Historical Wholesale'!H25","v":4852},{"$f":"I24","v":0.82},{"$f":"H25*I25","v":3978.64},null,{"$f":"'6. Historical Wholesale'!L25","v":4852},{"$f":"M24","v":1.98},{"$f":"L25*M25","v":9606.9599999999991},null,13585.599999999999]
[null,"March",null,{"$f":"'6. Historical Wholesale'!D26","v":4247},{"$f":"E25","v":3.82},16223.539999999999,null,{"$f":"'6. Historical Wholesale'!H26","v":4783},{"$f":"I25","v":0.82},3922.06,null,{"$f":"'6. Historical Wholesale'!L26","v":4783},{"$f":"M25","v":1.98},9470.34,null,13392.4]
[null,"April",null,{"$f":"'6. Historical Wholesale'!D27","v":3935.0000000000005},3.82,15031.7,null,{"$f":"'6. Historical Wholesale'!H27","v":4475},0.82,3669.5,null,{"$f":"'6. Historical Wholesale'!L27","v":4475},1.98,8860.5,null,12530]
[null,"May",null,{"$f":"'6. Historical Wholesale'!D28","v":3892.0000000000005},3.82,14867.44,null,{"$f":"'6. Historical Wholesale'!H28","v":4233},0.82,3471.06,null,{"$f":"'6. Historical Wholesale'!L28","v":4233},1.98,8381.34,null,11852.4]
[null,"June",null,{"$f":"'6. Historical Wholesale'!D29","v":3484},3.82,13308.88,null,{"$f":"'6. Historical Wholesale'!H29","v":4099},0.82,3361.18,null,{"$f":"'6. Historical Wholesale'!L29","v":4099},1.98,8116.0199999999995,null,11477.199999999999]
[null,"July",null,{"$f":"'6. Historical Wholesale'!D30","v":3472.0000000000005},3.82,13263.04,null,{"$f":"'6. Historical Wholesale'!H30","v":4085},0.82,3349.7,null,{"$f":"'6. Historical Wholesale'!L30","v":4085},1.98,8088.3,null,11438]
[null,"August",null,{"$f":"'6. Historical Wholesale'!D31","v":3579.0000000000005},3.82,13671.78,null,{"$f":"'6. Historical Wholesale'!H31","v":3948.0000000000005},0.82,3237.36,null,{"$f":"'6. Historical Wholesale'!L31","v":3948},1.98,7817.04,null,11054.4]
[null,"September",null,{"$f":"'6. Historical Wholesale'!D32","v":3505.0000000000005},3.82,13389.1,null,{"$f":"'6. Historical Wholesale'!H32","v":4123},0.82,3380.8599999999997,null,{"$f":"'6. Historical Wholesale'!L32","v":4123},1.98,8163.54,null,11544.4]
[null,"October",null,{"$f":"'6. Historical Wholesale'!D33","v":3625},3.82,13847.5,null,{"$f":"'6. Historical Wholesale'!H33","v":4200},0.82,3444,null,{"$f":"'6. Historical Wholesale'!L33","v":4200},1.98,8316,null,11760]
[null,"November",null,{"$f":"'6. Historical Wholesale'!D34","v":4514},3.82,17243.48,null,{"$f":"'6. Historical Wholesale'!H34","v":4759},0.82,3902.3799999999997,null,{"$f":"'6. Historical Wholesale'!L34","v":4759},1.98,9422.82,null,13325.199999999999]
[null,"December",null,{"$f":"'6. Historical Wholesale'!D35","v":4634.0000000000009},3.82,17701.88,null,{"$f":"'6. Historical Wholesale'!H35","v":4787.0000000000009},0.82,3925.3400000000006,null,{"$f":"'6. Historical Wholesale'!L35","v":4787},1.98,9478.26,null,13403.6]
[]
[null,"Total",null,{"$f":"SUM(D24:D35)","v":47524.986225895322},{"$f":"IF(D37<>0,F37/D37,0)","v":3.82},{"$f":"SUM(F24:F35)","v":181545.44738292013},null,{"$f":"SUM(H24:H35)","v":53774.58666666667},{"$f":"IF(H37<>0,J37/H37,0)","v":0.82},{"$f":"SUM(J24:J35)","v":44095.161066666667},null,{"$f":"SUM(L24:L35)","v":53660.032432432432},{"$f":"IF(L37<>0,N37/L37,0)","v":1.98},{"$f":"SUM(N24:N35)","v":106246.86421621621},null,{"$f":"SUM(P24:P35)","v":150342.02528288288}]
[]
[null,"Hydro One",null,"Network",null,null,null,"Line Connection",null,null,null,"Transformation Connection",null,null,null,"Total Line"]
[]
[null,"Month",null,"Units Billed","Rate","Amount",null,"Units Billed","Rate","Amount",null,"Units Billed","Rate","Amount",null,"Amount"]
[]
[null,"January",null,{"$f":"'6. Historical Wholesale'!D43","v":12304.45},{"$f":"'5. UTRs and Sub-Transmission'!G35+'5. UTRs and Sub-Transmission'!G79","v":3.3765000000000001},{"$f":"D43*E43","v":41545.975425000004},null,{"$f":"'6. Historical Wholesale'!H43","v":12319.26},{"$f":"'5. UTRs and Sub-Transmission'!G37+'5. UTRs and Sub-Transmission'!G81","v":0.7167},{"$f":"H43*I43","v":8829.2136420000006},null,{"$f":"'6. Historical Wholesale'!L43","v":12319.26},{"$f":"'5. UTRs and Sub-Transmission'!G39","v":1.62},{"$f":"L43*M43","v":19957.201200000003},null,{"$f":"J43+N43","v":28786.414842000006}]
[null,"February",null,{"$f":"'6. Historical Wholesale'!D44","v":11339.11},{"$f":"E43","v":3.3765000000000001},{"$f":"D44*E44","v":38286.504915000005},null,{"$f":"'6. Historical Wholesale'!H44","v":11684.6},{"$f":"I43","v":0.7167},{"$f":"H44*I44","v":8374.3528200000001},null,{"$f":"'6. Historical Wholesale'!L44","v":11684.6},{"$f":"M43","v":1.62},{"$f":"L44*M44","v":18929.052000000003},null,27303.404820000003]
[null,"March",null,{"$f":"'6. Historical Wholesale'!D45","v":10315.68},{"$f":"E44","v":3.3765000000000001},34830.893520000005,null,{"$f":"'6. Historical Wholesale'!H45","v":10569.25},{"$f":"I44","v":0.7167},7574.9814749999996,null,{"$f":"'6. Historical Wholesale'!L45","v":10569.25},{"$f":"M44","v":1.62},17122.185000000001,null,24697.166475000002]
[null,"April",null,{"$f":"'6. Historical Wholesale'!D46","v":9368.4},3.3765000000000001,31632.402599999998,null,{"$f":"'6. Historical Wholesale'!H46","v":9368.4},0.7167,6714.3322799999996,null,{"$f":"'6. Historical Wholesale'!L46","v":9368.4},{"$f":"M45","v":1.62},15176.808000000001,null,21891.14028]
[null,"May",null,{"$f":"'6. Historical Wholesale'!D47","v":7787.5},3.3765000000000001,26294.493750000001,null,{"$f":"'6. Historical Wholesale'!H47","v":8119.9},0.7167,5819.53233,null,{"$f":"'6. Historical Wholesale'!L47","v":8119.9},1.62,13154.237999999999,null,18973.770329999999]
[null,"June",null,{"$f":"'6. Historical Wholesale'!D48","v":7744.3},3.3765000000000001,26148.628950000002,null,{"$f":"'6. Historical Wholesale'!H48","v":7744.3},0.7167,5550.3398100000004,null,{"$f":"'6. Historical Wholesale'!L48","v":7744.3},1.62,12545.766000000001,null,18096.105810000001]
[null,"July",null,{"$f":"'6. Historical Wholesale'!D49","v":7588.97},3.3765000000000001,25624.157205,null,{"$f":"'6. Historical Wholesale'!H49","v":7588.97},0.7167,5439.0147990000005,null,{"$f":"'6. Historical Wholesale'!L49","v":7588.97},1.62,12294.131400000002,null,17733.146199000003]
[null,"August",null,{"$f":"'6. Historical Wholesale'!D50","v":7269.7},3.3765000000000001,24546.142049999999,null,{"$f":"'6. Historical Wholesale'!H50","v":7693.99},0.7167,5514.2826329999998,null,{"$f":"'6. Historical Wholesale'!L50","v":7693.99},1.62,12464.263800000001,null,17978.546433]
[null,"September",null,{"$f":"'6. Historical Wholesale'!D51","v":8060.34},3.3765000000000001,27215.738010000001,null,{"$f":"'6. Historical Wholesale'!H51","v":8341.66},0.7167,5978.4677220000003,null,{"$f":"'6. Historical Wholesale'!L51","v":8341.66},1.62,13513.4892,null,19491.956922000001]
[null,"October",null,{"$f":"'6. Historical Wholesale'!D52","v":9007.09},3.3765000000000001,30412.439385000001,null,{"$f":"'6. Historical Wholesale'!H52","v":9007.09},0.7167,6455.3814030000003,null,{"$f":"'6. Historical Wholesale'!L52","v":9007.09},1.62,14591.4858,null,21046.867203000002]
[null,"November",null,{"$f":"'6. Historical Wholesale'!D53","v":10755.03},3.3765000000000001,36314.358795,null,{"$f":"'6. Historical Wholesale'!H53","v":10759.82},0.7167,7711.5629939999999,null,{"$f":"'6. Historical Wholesale'!L53","v":10759.82},1.62,17430.9084,null,25142.471394]
[null,"December",null,{"$f":"'6. Historical Wholesale'!D54","v":11677.22},3.3765000000000001,39428.133329999997,null,{"$f":"'6. Historical Wholesale'!H54","v":11677.22},0.7167,8369.0635739999998,null,{"$f":"'6. Historical Wholesale'!L54","v":11677.22},1.62,18917.096399999999,null,27286.159973999998]
[]
[null,"Total",null,{"$f":"SUM(D43:D54)","v":113217.79},{"$f":"IF(D56<>0,F56/D56,0)","v":3.3765000000000001},{"$f":"SUM(F43:F54)","v":382279.86793499999},null,{"$f":"SUM(H43:H54)","v":114874.46000000002},{"$f":"IF(H56<>0,J56/H56,0)","v":0.71669999999999989},{"$f":"SUM(J43:J54)","v":82330.525481999997},null,{"$f":"SUM(L43:L54)","v":114874.46000000002},{"$f":"IF(L56<>0,N56/L56,0)","v":1.62},{"$f":"SUM(N43:N54)","v":186096.62520000004},null,{"$f":"SUM(P43:P54)","v":268427.15068200004}]
[]
[null,{"$f":"'6. Historical Wholesale'!B58","v":"Add Extra Host Here (I)"},null,"Network",null,null,null,"Line Connection",null,null,null,"Transformation Connection",null,null,null,"Total Line"]
[]
[null,"Month",null,"Units Billed","Rate","Amount",null,"Units Billed","Rate","Amount",null,"Units Billed","Rate","Amount",null,"Amount"]
[]
[null,"January",null,{"$f":"'6. Historical Wholesale'!D62","v":0},{"$f":"'5. UTRs and Sub-Transmission'!G50","v":0},{"$f":"D62*E62","v":0},null,{"$f":"'6. Historical Wholesale'!H62","v":0},{"$f":"'5. UTRs and Sub-Transmission'!G52","v":0},{"$f":"H62*I62","v":0},null,{"$f":"'6. Historical Wholesale'!L62","v":0},{"$f":"'5. UTRs and Sub-Transmission'!G54","v":0},{"$f":"L62*M62","v":0},null,{"$f":"J62+N62","v":0}]
[null,"February",null,{"$f":"'6. Historical Wholesale'!D63","v":0},{"$f":"E62","v":0},{"$f":"D63*E63","v":0},null,{"$f":"'6. Historical Wholesale'!H63","v":0},{"$f":"I62","v":0},{"$f":"H63*I63","v":0},null,{"$f":"'6. Historical Wholesale'!L63","v":0},{"$f":"M62","v":0},{"$f":"L63*M63","v":0},null,0]
[null,"March",null,{"$f":"'6. Historical Wholesale'!D64","v":0},{"$f":"E63","v":0},0,null,{"$f":"'6. Historical Wholesale'!H64","v":0},{"$f":"I63","v":0},0,null,{"$f":"'6. Historical Wholesale'!L64","v":0},{"$f":"M63","v":0},0,null,0]
[null,"April",null,{"$f":"'6. Historical Wholesale'!D65","v":0},0,0,null,{"$f":"'6. Historical Wholesale'!H65","v":0},0,0,null,{"$f":"'6. Historical Wholesale'!L65","v":0},{"$f":"M64","v":0},0,null,0]
[null,"May",null,{"$f":"'6. Historical Wholesale'!D66","v":0},0,0,null,{"$f":"'6. Historical Wholesale'!H66","v":0},0,0,null,{"$f":"'6. Historical Wholesale'!L66","v":0},0,0,null,0]
[null,"June",null,{"$f":"'6. Historical Wholesale'!D67","v":0},0,0,null,{"$f":"'6. Historical Wholesale'!H67","v":0},0,0,null,{"$f":"'6. Historical Wholesale'!L67","v":0},0,0,null,0]
[null,"July",null,{"$f":"'6. Historical Wholesale'!D68","v":0},0,0,null,{"$f":"'6. Historical Wholesale'!H68","v":0},0,0,null,{"$f":"'6. Historical Wholesale'!L68","v":0},0,0,null,0]
[null,"August",null,{"$f":"'6. Historical Wholesale'!D69","v":0},0,0,null,{"$f":"'6. Historical Wholesale'!H69","v":0},0,0,null,{"$f":"'6. Historical Wholesale'!L69","v":0},0,0,null,0]
[null,"September",null,{"$f":"'6. Historical Wholesale'!D70","v":0},0,0,null,{"$f":"'6. Historical Wholesale'!H70","v":0},0,0,null,{"$f":"'6. Historical Wholesale'!L70","v":0},0,0,null,0]
[null,"October",null,{"$f":"'6. Historical Wholesale'!D71","v":0},0,0,null,{"$f":"'6. Historical Wholesale'!H71","v":0},0,0,null,{"$f":"'6. Historical Wholesale'!L71","v":0},0,0,null,0]
[null,"November",null,{"$f":"'6. Historical Wholesale'!D72","v":0},0,0,null,{"$f":"'6. Historical Wholesale'!H72","v":0},0,0,null,{"$f":"'6. Historical Wholesale'!L72","v":0},0,0,null,0]
[null,"December",null,{"$f":"'6. Historical Wholesale'!D73","v":0},0,0,null,{"$f":"'6. Historical Wholesale'!H73","v":0},0,0,null,{"$f":"'6. Historical Wholesale'!L73","v":0},0,0,null,0]
[]
[null,"Total",null,{"$f":"SUM(D62:D73)","v":0},{"$f":"IF(D75<>0,F75/D75,0)","v":0},{"$f":"SUM(F62:F73)","v":0},null,{"$f":"SUM(H62:H73)","v":0},{"$f":"IF(H75<>0,J75/H75,0)","v":0},{"$f":"SUM(J62:J73)","v":0},null,{"$f":"SUM(L62:L73)","v":0},{"$f":"IF(L75<>0,N75/L75,0)","v":0},{"$f":"SUM(N62:N73)","v":0},null,{"$f":"SUM(P62:P73)","v":0}]
[]
[null,{"$f":"'6. Historical Wholesale'!B77","v":"Add Extra Host Here (II)"},null,"Network",null,null,null,"Line Connection",null,null,null,"Transformation Connection",null,null,null,"Total Line"]
[]
[null,"Month",null,"Units Billed","Rate","Amount",null,"Units Billed","Rate","Amount",null,"Units Billed","Rate","Amount",null,"Amount"]
[]
[null,"January",null,{"$f":"'6. Historical Wholesale'!D81","v":0},{"$f":"'5. UTRs and Sub-Transmission'!G65","v":0},{"$f":"D81*E81","v":0},null,{"$f":"'6. Historical Wholesale'!H81","v":0},{"$f":"'5. UTRs and Sub-Transmission'!G67","v":0},{"$f":"H81*I81","v":0},null,{"$f":"'6. Historical Wholesale'!L81","v":0},{"$f":"'5. UTRs and Sub-Transmission'!G69","v":0},{"$f":"L81*M81","v":0},null,{"$f":"J81+N81","v":0}]
[null,"February",null,{"$f":"'6. Historical Wholesale'!D82","v":0},{"$f":"E81","v":0},{"$f":"D82*E82","v":0},null,{"$f":"'6. Historical Wholesale'!H82","v":0},{"$f":"I81","v":0},{"$f":"H82*I82","v":0},null,{"$f":"'6. Historical Wholesale'!L82","v":0},{"$f":"M81","v":0},{"$f":"L82*M82","v":0},null,0]
[null,"March",null,{"$f":"'6. Historical Wholesale'!D83","v":0},{"$f":"E82","v":0},0,null,{"$f":"'6. Historical Wholesale'!H83","v":0},{"$f":"I82","v":0},0,null,{"$f":"'6. Historical Wholesale'!L83","v":0},{"$f":"M82","v":0},0,null,0]
[null,"April",null,{"$f":"'6. Historical Wholesale'!D84","v":0},0,0,null,{"$f":"'6. Historical Wholesale'!H84","v":0},0,0,null,{"$f":"'6. Historical Wholesale'!L84","v":0},{"$f":"M83","v":0},0,null,0]
[null,"May",null,{"$f":"'6. Historical Wholesale'!D85","v":0},0,0,null,{"$f":"'6. Historical Wholesale'!H85","v":0},0,0,null,{"$f":"'6. Historical Wholesale'!L85","v":0},0,0,null,0]
[null,"June",null,{"$f":"'6. Historical Wholesale'!D86","v":0},0,0,null,{"$f":"'6. Historical Wholesale'!H86","v":0},0,0,null,{"$f":"'6. Historical Wholesale'!L86","v":0},0,0,null,0]
[null,"July",null,{"$f":"'6. Historical Wholesale'!D87","v":0},0,0,null,{"$f":"'6. Historical Wholesale'!H87","v":0},0,0,null,{"$f":"'6. Historical Wholesale'!L87","v":0},0,0,null,0]
[null,"August",null,{"$f":"'6. Historical Wholesale'!D88","v":0},0,0,null,{"$f":"'6. Historical Wholesale'!H88","v":0},0,0,null,{"$f":"'6. Historical Wholesale'!L88","v":0},0,0,null,0]
[null,"September",null,{"$f":"'6. Historical Wholesale'!D89","v":0},0,0,null,{"$f":"'6. Historical Wholesale'!H89","v":0},0,0,null,{"$f":"'6. Historical Wholesale'!L89","v":0},0,0,null,0]
[null,"October",null,{"$f":"'6. Historical Wholesale'!D90","v":0},0,0,null,{"$f":"'6. Historical Wholesale'!H90","v":0},0,0,null,{"$f":"'6. Historical Wholesale'!L90","v":0},0,0,null,0]
[null,"November",null,{"$f":"'6. Historical Wholesale'!D91","v":0},0,0,null,{"$f":"'6. Historical Wholesale'!H91","v":0},0,0,null,{"$f":"'6. Historical Wholesale'!L91","v":0},0,0,null,0]
[null,"December",null,{"$f":"'6. Historical Wholesale'!D92","v":0},0,0,null,{"$f":"'6. Historical Wholesale'!H92","v":0},0,0,null,{"$f":"'6. Historical Wholesale'!L92","v":0},0,0,null,0]
[]
[null,"Total",null,{"$f":"SUM(D81:D92)","v":0},{"$f":"IF(D94<>0,F94/D94,0)","v":0},{"$f":"SUM(F81:F92)","v":0},null,{"$f":"SUM(H81:H92)","v":0},{"$f":"IF(H94<>0,J94/H94,0)","v":0},{"$f":"SUM(J81:J92)","v":0},null,{"$f":"SUM(L81:L92)","v":0},{"$f":"IF(L94<>0,N94/L94,0)","v":0},{"$f":"SUM(N81:N92)","v":0},null,{"$f":"SUM(P81:P92)","v":0}]
[]
[null,"Total",null,"Network",null,null,null,"Line Connection",null,null,null,"Transformation Connection",null,null,null,"Total Line"]
[]
[null,"Month",null,"Units Billed","Rate","Amount",null,"Units Billed","Rate","Amount",null,"Units Billed","Rate","Amount",null,"Amount"]
[]
[null,"January",null,{"$f":"D24+D43+D62+D81","v":16747.436225895319},{"$f":"IF(D100<>0,F100/D100,0)","v":3.4941576739631222},{"$f":"F24+F43+F62+F81","v":58518.182807920115},null,{"$f":"H24+H43+H62+H81","v":17749.846666666668},{"$f":"IF(H100<>0,J100/H100,0)","v":0.74830475767490201},{"$f":"J24+J43+J62+J81","v":13282.294708666668},null,{"$f":"L24+L43+L62+L81","v":17635.292432432434},{"$f":"IF(L100<>0,N100/L100,0)","v":1.7285194182635797},{"$f":"N24+N43+N62+N81","v":30482.945416216218},null,{"$f":"J100+N100","v":43765.240124882883}]
[null,"February",null,{"$f":"D25+D44+D63+D82","v":15534.11},3.4962675631239901,{"$f":"F25+F44+F63+F82","v":54311.404915000006},null,{"$f":"H25+H44+H63+H82","v":16536.599999999999},0.7470092292248709,{"$f":"J25+J44+J63+J82","v":12352.992819999999},null,{"$f":"L25+L44+L63+L82","v":16536.599999999999},1.7256275171437905,{"$f":"N25+N44+N63+N82","v":28536.012000000002},null,40889.004820000002]
[null,"March",null,14562.68,3.5058405128726311,51054.433520000006,null,15352.25,0.74888315882036838,11497.041475,null,15352.25,1.7321581527137717,26592.525000000001,null,38089.566475]
[null,"April",null,13303.4,3.507682442082475,46664.102599999998,null,13843.4,0.75009262753369832,10383.832279999999,null,13843.4,1.7363731453255704,24037.308000000001,null,34421.14028]
[null,"May",null,11679.5,3.5242890320647291,41161.933750000004,null,12352.9,0.75209807656501715,9290.5923299999995,null,12352.9,1.7433621254927993,21535.578000000001,null,30826.170330000001]
[null,"June",null,11228.3,3.5141124613699319,39457.508950000003,null,11843.3,0.75245242542196855,8911.5198099999998,null,11843.3,1.7445970295441307,20661.786,null,29573.305809999998]
[null,"July",null,11060.970000000001,3.5157131069879042,38887.197205000004,null,11673.970000000001,0.75284712904007811,8788.7147990000012,null,11673.970000000001,1.7459725697427695,20382.431400000001,null,29171.146199000003]
[null,"August",null,10848.7,3.5228112170121766,38217.922050000001,null,11641.99,0.75173081517850471,8751.6426329999995,null,11641.99,1.7420822213384484,20281.303800000002,null,29032.946433000001]
[null,"September",null,11565.34,3.5109074190642038,40604.838009999999,null,12464.66,0.75086907480829801,9359.327722,null,12464.66,1.7390790603193349,21677.029200000001,null,31036.356921999999]
[null,"October",null,12632.09,3.5037701112800814,44259.939385000005,null,13207.09,0.74955053709787689,9899.3814029999994,null,13207.09,1.7344839627805975,22907.485800000002,null,32806.867203000002]
[null,"November",null,15269.03,3.5076123889336781,53557.838795000003,null,15518.82,0.74837796907239074,11613.942993999999,null,15518.82,1.7303975688873252,26853.7284,null,38467.671393999997]
[null,"December",null,16311.220000000001,3.5024978714038557,57130.013330000002,null,16464.22,0.746734650897522,12294.403574,null,16464.22,1.7246706130020126,28395.356399999997,null,40689.759974000001]
[]
[null,"Total",null,{"$f":"SUM(D100:D111)","v":160742.77622589533},{"$f":"IF(D113<>0,F113/D113,0)","v":3.5076245947473508},{"$f":"SUM(F100:F111)","v":563825.31531792018},null,{"$f":"SUM(H100:H111)","v":168649.04666666669},{"$f":"IF(H113<>0,J113/H113,0)","v":0.74963771837113247},{"$f":"SUM(J100:J111)","v":126425.68654866666},null,{"$f":"SUM(L100:L111)","v":168534.49243243245},{"$f":"IF(L113<>0,N113/L113,0)","v":1.7346211164068999},{"$f":"SUM(N100:N111)","v":292343.48941621621},null,{"$f":"SUM(P100:P111)","v":418769.17596488289}]
[]
[null,null,null,null,null,null,null,null,null,null,null,null,null,"Low Voltage Switchgear Credit (if applicable)",null,{"$f":"'5. UTRs and Sub-Transmission'!G95","v":0}]
[]
[null,null,null,null,null,null,null,null,null,null,null,null,null,"Total including deduction for Low Voltage Switchgear Credit",null,{"$f":"P113+P115","v":418769.17596488289}]

{"sheet":"8. Forecast Wholesale","index":7,"n_rows":117,"n_cols":16,"rows_kept":117,"cut":false,"hidden":false,"merged":[[96,7,96,9],[96,11,96,13],[20,3,20,5],[20,7,20,9],[20,11,20,13],[96,3,96,5],[95,3,95,5],[95,7,95,9],[95,11,95,13],[57,3,57,5],[57,7,57,9],[57,11,57,13],[76,3,76,5],[76,7,76,9],[76,11,76,13],[12,1,12,12],[19,3,19,5],[19,7,19,9],[19,11,19,13],[38,3,38,5],[38,7,38,9],[38,11,38,13]]}
[]
[]
[]
[]
[]
[]
[]
[]
[]
[]
[]
[]
[null,"The purpose of this sheet is to calculate the expected billing when forecasted 2015 Uniform Transmission Rates are applied against historical 2013 transmission units."]
[]
[]
[]
[]
[]
[]
[null,"IESO",null,"Network",null,null,null,"Line Connection",null,null,null,"Transformation Connection",null,null,null,"Total Line"]
[]
[null,"Month",null,"Units Billed","Rate","Amount",null,"Units Billed","Rate","Amount",null,"Units Billed","Rate","Amount",null,"Amount"]
[]
[null,"January",null,{"$f":"'6. Historical Wholesale'!D24","v":4442.9862258953171},{"$f":"'5. UTRs and Sub-Transmission'!I22","v":3.78},{"$f":"D24*E24","v":16794.487933884298},null,{"$f":"'6. Historical Wholesale'!H24","v":5430.586666666667},{"$f":"'5. UTRs and Sub-Transmission'!I24","v":0.86},{"$f":"H24*I24","v":4670.3045333333339},null,{"$f":"'6. Historical Wholesale'!L24","v":5316.032432432432},{"$f":"'5. UTRs and Sub-Transmission'!I26","v":2},{"$f":"L24*M24","v":10632.064864864864},null,{"$f":"J24+N24","v":15302.369398198198}]
[null,"February",null,{"$f":"'6. Historical Wholesale'!D25","v":4195},{"$f":"E24","v":3.78},15857.099999999999,null,{"$f":"'6. Historical Wholesale'!H25","v":4852},{"$f":"I24","v":0.86},4172.72,null,{"$f":"'6. Historical Wholesale'!L25","v":4852},{"$f":"M24","v":2},9704,null,13876.720000000001]
[null,"March",null,{"$f":"'6. Historical Wholesale'!D26","v":4247},3.78,16053.66,null,{"$f":"'6. Historical Wholesale'!H26","v":4783},0.86,4113.38,null,{"$f":"'6. Historical Wholesale'!L26","v":4783},2,9566,null,13679.380000000001]
[null,"April",null,{"$f":"'6. Historical Wholesale'!D27","v":3935.0000000000005},3.78,14874.300000000001,null,{"$f":"'6. Historical Wholesale'!H27","v":4475},0.86,3848.5,null,{"$f":"'6. Historical Wholesale'!L27","v":4475},2,8950,null,12798.5]
[null,"May",null,{"$f":"'6. Historical Wholesale'!D28","v":3892.0000000000005},3.78,14711.76,null,{"$f":"'6. Historical Wholesale'!H28","v":4233},0.86,3640.38,null,{"$f":"'6. Historical Wholesale'!L28","v":4233},2,8466,null,12106.380000000001]
[null,"June",null,{"$f":"'6. Historical Wholesale'!D29","v":3484},3.78,13169.519999999999,null,{"$f":"'6. Historical Wholesale'!H29","v":4099},0.86,3525.14,null,{"$f":"'6. Historical Wholesale'!L29","v":4099},2,8198,null,11723.14]
[null,"July",null,{"$f":"'6. Historical Wholesale'!D30","v":3472.0000000000005},3.78,13124.160000000002,null,{"$f":"'6. Historical Wholesale'!H30","v":4085},0.86,3513.1,null,{"$f":"'6. Historical Wholesale'!L30","v":4085},2,8170,null,11683.1]
[null,"August",null,{"$f":"'6. Historical Wholesale'!D31","v":3579.0000000000005},3.78,13528.62,null,{"$f":"'6. Historical Wholesale'!H31","v":3948.0000000000005},0.86,3395.28,null,{"$f":"'6. Historical Wholesale'!L31","v":3948},2,7896,null,11291.28]
[null,"September",null,{"$f":"'6. Historical Wholesale'!D32","v":3505.0000000000005},3.78,13248.900000000001,null,{"$f":"'6. Historical Wholesale'!H32","v":4123},0.86,3545.7799999999997,null,{"$f":"'6. Historical Wholesale'!L32","v":4123},2,8246,null,11791.779999999999]
[null,"October",null,{"$f":"'6. Historical Wholesale'!D33","v":3625},3.78,13702.5,null,{"$f":"'6. Historical Wholesale'!H33","v":4200},0.86,3612,null,{"$f":"'6. Historical Wholesale'!L33","v":4200},2,8400,null,12012]
[null,"November",null,{"$f":"'6. Historical Wholesale'!D34","v":4514},3.78,17062.919999999998,null,{"$f":"'6. Historical Wholesale'!H34","v":4759},0.86,4092.74,null,{"$f":"'6. Historical Wholesale'!L34","v":4759},2,9518,null,13610.74]
[null,"December",null,{"$f":"'6. Historical Wholesale'!D35","v":4634.0000000000009},3.78,17516.520000000004,null,{"$f":"'6. Historical Wholesale'!H35","v":4787.0000000000009},0.86,4116.8200000000006,null,{"$f":"'6. Historical Wholesale'!L35","v":4787},2,9574,null,13690.82]
[]
[null,"Total",null,{"$f":"SUM(D24:D35)","v":47524.986225895322},{"$f":"IF(D37<>0,F37/D37,0)","v":3.7800000000000002},{"$f":"SUM(F24:F35)","v":179644.44793388434},null,{"$f":"SUM(H24:H35)","v":53774.58666666667},{"$f":"IF(H37<>0,J37/H37,0)","v":0.85999999999999988},{"$f":"SUM(J24:J35)","v":46246.144533333332},null,{"$f":"SUM(L24:L35)","v":53660.032432432432},{"$f":"IF(L37<>0,N37/L37,0)","v":2},{"$f":"SUM(N24:N35)","v":107320.06486486486},null,{"$f":"SUM(P24:P35)","v":153566.2093981982}]
[]
[null,"Hydro One",null,"Network",null,null,null,"Line Connection",null,null,null,"Transformation Connection",null,null,null,"Total Line"]
[]
[null,"Month",null,"Units Billed","Rate","Amount",null,"Units Billed","Rate","Amount",null,"Units Billed","Rate","Amount",null,"Amount"]
[]
[null,"January",null,{"$f":"'6. Historical Wholesale'!D43","v":12304.45},{"$f":"'5. UTRs and Sub-Transmission'!I35+'5. UTRs and Sub-Transmission'!I79","v":3.5586000000000002},{"$f":"D43*E43","v":43786.615770000004},null,{"$f":"'6. Historical Wholesale'!H43","v":12319.26},{"$f":"'5. UTRs and Sub-Transmission'!I37+'5. UTRs and Sub-Transmission'!I81","v":0.85460000000000003},{"$f":"H43*I43","v":10528.039596000001},null,{"$f":"'6. Historical Wholesale'!L43","v":12319.26},{"$f":"'5. UTRs and Sub-Transmission'!I39","v":1.8018000000000001},{"$f":"L43*M43","v":22196.842668000001},null,{"$f":"J43+N43","v":32724.882264}]
[null,"February",null,{"$f":"'6. Historical Wholesale'!D44","v":11339.11},{"$f":"E43","v":3.5586000000000002},40351.356846000002,null,{"$f":"'6. Historical Wholesale'!H44","v":11684.6},{"$f":"I43","v":0.85460000000000003},9985.6591600000011,null,{"$f":"'6. Historical Wholesale'!L44","v":11684.6},{"$f":"M43","v":1.8018000000000001},21053.312280000002,null,31038.971440000001]
[null,"March",null,{"$f":"'6. Historical Wholesale'!D45","v":10315.68},3.5586000000000002,36709.378848,null,{"$f":"'6. Historical Wholesale'!H45","v":10569.25},0.85460000000000003,9032.4810500000003,null,{"$f":"'6. Historical Wholesale'!L45","v":10569.25},1.8018000000000001,19043.674650000001,null,28076.155700000003]
[null,"April",null,{"$f":"'6. Historical Wholesale'!D46","v":9368.4},3.5586000000000002,33338.38824,null,{"$f":"'6. Historical Wholesale'!H46","v":9368.4},0.85460000000000003,8006.2346399999997,null,{"$f":"'6. Historical Wholesale'!L46","v":9368.4},1.8018000000000001,16879.983120000001,null,24886.21776]
[null,"May",null,{"$f":"'6. Historical Wholesale'!D47","v":7787.5},3.5586000000000002,27712.5975,null,{"$f":"'6. Historical Wholesale'!H47","v":8119.9},0.85460000000000003,6939.2665399999996,null,{"$f":"'6. Historical Wholesale'!L47","v":8119.9},1.8018000000000001,14630.435820000001,null,21569.702359999999]
[null,"June",null,{"$f":"'6. Historical Wholesale'!D48","v":7744.3},3.5586000000000002,27558.865980000002,null,{"$f":"'6. Historical Wholesale'!H48","v":7744.3},0.85460000000000003,6618.2787800000006,null,{"$f":"'6. Historical Wholesale'!L48","v":7744.3},1.8018000000000001,13953.679740000001,null,20571.95852]
[null,"July",null,{"$f":"'6. Historical Wholesale'!D49","v":7588.97},3.5586000000000002,27006.108642000003,null,{"$f":"'6. Historical Wholesale'!H49","v":7588.97},0.85460000000000003,6485.533762,null,{"$f":"'6. Historical Wholesale'!L49","v":7588.97},1.8018000000000001,13673.806146000001,null,20159.339908000002]
[null,"August",null,{"$f":"'6. Historical Wholesale'!D50","v":7269.7},3.5586000000000002,25869.954420000002,null,{"$f":"'6. Historical Wholesale'!H50","v":7693.99},0.85460000000000003,6575.2838540000002,null,{"$f":"'6. Historical Wholesale'!L50","v":7693.99},1.8018000000000001,13863.031182000001,null,20438.315036]
[null,"September",null,{"$f":"'6. Historical Wholesale'!D51","v":8060.34},3.5586000000000002,28683.525924000001,null,{"$f":"'6. Historical Wholesale'!H51","v":8341.66},0.85460000000000003,7128.7826359999999,null,{"$f":"'6. Historical Wholesale'!L51","v":8341.66},1.8018000000000001,15030.002988,null,22158.785624]
[null,"October",null,{"$f":"'6. Historical Wholesale'!D52","v":9007.09},3.5586000000000002,32052.630474000001,null,{"$f":"'6. Historical Wholesale'!H52","v":9007.09},0.85460000000000003,7697.4591140000002,null,{"$f":"'6. Historical Wholesale'!L52","v":9007.09},1.8018000000000001,16228.974762000002,null,23926.433876000003]
[null,"November",null,{"$f":"'6. Historical Wholesale'!D53","v":10755.03},3.5586000000000002,38272.849758000004,null,{"$f":"'6. Historical Wholesale'!H53","v":10759.82},0.85460000000000003,9195.3421720000006,null,{"$f":"'6. Historical Wholesale'!L53","v":10759.82},1.8018000000000001,19387.043676000001,null,28582.385848000002]
[null,"December",null,{"$f":"'6. Historical Wholesale'!D54","v":11677.22},3.5586000000000002,41554.555092000002,null,{"$f":"'6. Historical Wholesale'!H54","v":11677.22},0.85460000000000003,9979.3522119999998,null,{"$f":"'6. Historical Wholesale'!L54","v":11677.22},1.8018000000000001,21040.014995999998,null,31019.367207999996]
[]
[null,"Total",null,{"$f":"SUM(D43:D54)","v":113217.79},{"$f":"IF(D56<>0,F56/D56,0)","v":3.5586000000000007},{"$f":"SUM(F43:F54)","v":402896.82749400003},null,{"$f":"SUM(H43:H54)","v":114874.46000000002},{"$f":"IF(H56<>0,J56/H56,0)","v":0.85459999999999992},{"$f":"SUM(J43:J54)","v":98171.713516000003},null,{"$f":"SUM(L43:L54)","v":114874.46000000002},{"$f":"IF(L56<>0,N56/L56,0)","v":1.8017999999999996},{"$f":"SUM(N43:N54)","v":206980.80202800001},null,{"$f":"SUM(P43:P54)","v":305152.51554400002}]
[]
[null,{"$f":"'6. Historical Wholesale'!B58","v":"Add Extra Host Here (I)"},null,"Network",null,null,null,"Line Connection",null,null,null,"Transformation Connection",null,null,null,"Total Line"]
[]
[null,"Month",null,"Units Billed","Rate","Amount",null,"Units Billed","Rate","Amount",null,"Units Billed","Rate","Amount",null,"Amount"]
[]
[null,"January",null,{"$f":"'6. Historical Wholesale'!D62","v":0},{"$f":"'5. UTRs and Sub-Transmission'!I50","v":0},{"$f":"D62*E62","v":0},null,{"$f":"'6. Historical Wholesale'!H62","v":0},{"$f":"'5. UTRs and Sub-Transmission'!I52","v":0},{"$f":"H62*I62","v":0},null,{"$f":"'6. Historical Wholesale'!L62","v":0},{"$f":"'5. UTRs and Sub-Transmission'!I54","v":0},{"$f":"L62*M62","v":0},null,{"$f":"J62+N62","v":0}]
[null,"February",null,{"$f":"'6. Historical Wholesale'!D63","v":0},{"$f":"E62","v":0},0,null,{"$f":"'6. Historical Wholesale'!H63","v":0},{"$f":"I62","v":0},0,null,{"$f":"'6. Historical Wholesale'!L63","v":0},{"$f":"M62","v":0},0,null,0]
[null,"March",null,{"$f":"'6. Historical Wholesale'!D64","v":0},0,0,null,{"$f":"'6. Historical Wholesale'!H64","v":0},0,0,null,{"$f":"'6. Historical Wholesale'!L64","v":0},0,0,null,0]
[null,"April",null,{"$f":"'6. Historical Wholesale'!D65","v":0},0,0,null,{"$f":"'6. Historical Wholesale'!H65","v":0},0,0,null,{"$f":"'6. Historical Wholesale'!L65","v":0},0,0,null,0]
[null,"May",null,{"$f":"'6. Historical Wholesale'!D66","v":0},0,0,null,{"$f":"'6. Historical Wholesale'!H66","v":0},0,0,null,{"$f":"'6. Historical Wholesale'!L66","v":0},0,0,null,0]
[null,"June",null,{"$f":"'6. Historical Wholesale'!D67","v":0},0,0,null,{"$f":"'6. Historical Wholesale'!H67","v":0},0,0,null,{"$f":"'6. Historical Wholesale'!L67","v":0},0,0,null,0]
[null,"July",null,{"$f":"'6. Historical Wholesale'!D68","v":0},0,0,null,{"$f":"'6. Historical Wholesale'!H68","v":0},0,0,null,{"$f":"'6. Historical Wholesale'!L68","v":0},0,0,null,0]
[null,"August",null,{"$f":"'6. Historical Wholesale'!D69","v":0},0,0,null,{"$f":"'6. Historical Wholesale'!H69","v":0},0,0,null,{"$f":"'6. Historical Wholesale'!L69","v":0},0,0,null,0]
[null,"September",null,{"$f":"'6. Historical Wholesale'!D70","v":0},0,0,null,{"$f":"'6. Historical Wholesale'!H70","v":0},0,0,null,{"$f":"'6. Historical Wholesale'!L70","v":0},0,0,null,0]
[null,"October",null,{"$f":"'6. Historical Wholesale'!D71","v":0},0,0,null,{"$f":"'6. Historical Wholesale'!H71","v":0},0,0,null,{"$f":"'6. Historical Wholesale'!L71","v":0},0,0,null,0]
[null,"November",null,{"$f":"'6. Historical Wholesale'!D72","v":0},0,0,null,{"$f":"'6. Historical Wholesale'!H72","v":0},0,0,null,{"$f":"'6. Historical Wholesale'!L72","v":0},0,0,null,0]
[null,"December",null,{"$f":"'6. Historical Wholesale'!D73","v":0},0,0,null,{"$f":"'6. Historical Wholesale'!H73","v":0},0,0,null,{"$f":"'6. Historical Wholesale'!L73","v":0},0,0,null,0]
[]
[null,"Total",null,{"$f":"SUM(D62:D73)","v":0},{"$f":"IF(D75<>0,F75/D75,0)","v":0},{"$f":"SUM(F62:F73)","v":0},null,{"$f":"SUM(H62:H73)","v":0},{"$f":"IF(H75<>0,J75/H75,0)","v":0},{"$f":"SUM(J62:J73)","v":0},null,{"$f":"SUM(L62:L73)","v":0},{"$f":"IF(L75<>0,N75/L75,0)","v":0},{"$f":"SUM(N62:N73)","v":0},null,{"$f":"SUM(P62:P73)","v":0}]
[]
[null,{"$f":"'6. Historical Wholesale'!B77","v":"Add Extra Host Here (II)"},null,"Network",null,null,null,"Line Connection",null,null,null,"Transformation Connection",null,null,null,"Total Line"]
[]
[null,"Month",null,"Units Billed","Rate","Amount",null,"Units Billed","Rate","Amount",null,"Units Billed","Rate","Amount",null,"Amount"]
[]
[null,"January",null,{"$f":"'6. Historical Wholesale'!D81","v":0},{"$f":"'5. UTRs and Sub-Transmission'!I65","v":0},{"$f":"D81*E81","v":0},null,{"$f":"'6. Historical Wholesale'!H81","v":0},{"$f":"'5. UTRs and Sub-Transmission'!I67","v":0},{"$f":"H81*I81","v":0},null,{"$f":"'6. Historical Wholesale'!L81","v":0},{"$f":"'5. UTRs and Sub-Transmission'!I69","v":0},{"$f":"L81*M81","v":0},null,{"$f":"J81+N81","v":0}]
[null,"February",null,{"$f":"'6. Historical Wholesale'!D82","v":0},{"$f":"E81","v":0},0,null,{"$f":"'6. Historical Wholesale'!H82","v":0},{"$f":"I81","v":0},0,null,{"$f":"'6. Historical Wholesale'!L82","v":0},{"$f":"M81","v":0},0,null,0]
[null,"March",null,{"$f":"'6. Historical Wholesale'!D83","v":0},0,0,null,{"$f":"'6. Historical Wholesale'!H83","v":0},0,0,null,{"$f":"'6. Historical Wholesale'!L83","v":0},0,0,null,0]
[null,"April",null,{"$f":"'6. Historical Wholesale'!D84","v":0},0,0,null,{"$f":"'6. Historical Wholesale'!H84","v":0},0,0,null,{"$f":"'6. Historical Wholesale'!L84","v":0},0,0,null,0]
[null,"May",null,{"$f":"'6. Historical Wholesale'!D85","v":0},0,0,null,{"$f":"'6. Historical Wholesale'!H85","v":0},0,0,null,{"$f":"'6. Historical Wholesale'!L85","v":0},0,0,null,0]
[null,"June",null,{"$f":"'6. Historical Wholesale'!D86","v":0},0,0,null,{"$f":"'6. Historical Wholesale'!H86","v":0},0,0,null,{"$f":"'6. Historical Wholesale'!L86","v":0},0,0,null,0]
[null,"July",null,{"$f":"'6. Historical Wholesale'!D87","v":0},0,0,null,{"$f":"'6. Historical Wholesale'!H87","v":0},0,0,null,{"$f":"'6. Historical Wholesale'!L87","v":0},0,0,null,0]
[null,"August",null,{"$f":"'6. Historical Wholesale'!D88","v":0},0,0,null,{"$f":"'6. Historical Wholesale'!H88","v":0},0,0,null,{"$f":"'6. Historical Wholesale'!L88","v":0},0,0,null,0]
[null,"September",null,{"$f":"'6. Historical Wholesale'!D89","v":0},0,0,null,{"$f":"'6. Historical Wholesale'!H89","v":0},0,0,null,{"$f":"'6. Historical Wholesale'!L89","v":0},0,0,null,0]
[null,"October",null,{"$f":"'6. Historical Wholesale'!D90","v":0},0,0,null,{"$f":"'6. Historical Wholesale'!H90","v":0},0,0,null,{"$f":"'6. Historical Wholesale'!L90","v":0},0,0,null,0]
[null,"November",null,{"$f":"'6. Historical Wholesale'!D91","v":0},0,0,null,{"$f":"'6. Historical Wholesale'!H91","v":0},0,0,null,{"$f":"'6. Historical Wholesale'!L91","v":0},0,0,null,0]
[null,"December",null,{"$f":"'6. Historical Wholesale'!D92","v":0},0,0,null,{"$f":"'6. Historical Wholesale'!H92","v":0},0,0,null,{"$f":"'6. Historical Wholesale'!L92","v":0},0,0,null,0]
[]
[null,"Total",null,{"$f":"SUM(D81:D92)","v":0},{"$f":"IF(D94<>0,F94/D94,0)","v":0},{"$f":"SUM(F81:F92)","v":0},null,{"$f":"SUM(H81:H92)","v":0},{"$f":"IF(H94<>0,J94/H94,0)","v":0},{"$f":"SUM(J81:J92)","v":0},null,{"$f":"SUM(L81:L92)","v":0},{"$f":"IF(L94<>0,N94/L94,0)","v":0},{"$f":"SUM(N81:N92)","v":0},null,{"$f":"SUM(P81:P92)","v":0}]
[]
[null,"Total",null,"Network",null,null,null,"Line Connection",null,null,null,"Transformation Connection",null,null,null,"Total Line"]
[]
[null,"Month",null,"Units Billed","Rate","Amount",null,"Units Billed","Rate","Amount",null,"Units Billed","Rate","Amount",null,"Amount"]
[]
[null,"January",null,{"$f":"D24+D43","v":16747.436225895319},{"$f":"IF(D100<>0,F100/D100,0)","v":3.6173359842512633},{"$f":"F24+F43","v":60581.103703884306},null,{"$f":"H24+H43","v":17749.846666666668},{"$f":"IF(H100<>0,J100/H100,0)","v":0.85625213641282161},{"$f":"J24+J43","v":15198.344129333334},null,{"$f":"L24+L43","v":17635.292432432434},{"$f":"IF(L100<>0,N100/L100,0)","v":1.8615459686106703},{"$f":"N24+N43","v":32828.907532864861},null,{"$f":"J100+N100","v":48027.251662198192}]
[null,"February",null,15534.11,3.6183892637556965,56208.456846000001,null,16536.599999999999,0.85618441275715695,14158.37916,null,16536.599999999999,1.8599538163830536,30757.312280000002,null,44915.691440000002]
[null,"March",null,14562.68,3.6231681838782417,52763.038847999997,null,15352.25,0.85628237229070658,13145.86105,null,15352.25,1.8635492940774154,28609.674650000001,null,41755.5357]
[null,"April",null,13303.4,3.6240876948749947,48212.688240000003,null,13843.4,0.85634559717988346,11854.734639999999,null,13843.4,1.8658698816764669,25829.983120000001,null,37684.71776]
[null,"May",null,11679.5,3.6323778843272398,42424.357499999998,null,12352.9,0.856450431882392,10579.64654,null,12352.9,1.8697177035352022,23096.435819999999,null,33676.08236]
[null,"June",null,11228.3,3.6272976300953843,40728.385979999999,null,11843.3,0.85646895544316204,10143.41878,null,11843.3,1.8703975868212408,22151.67974,null,32295.09852]
[null,"July",null,11060.970000000001,3.6280966897116618,40130.268642000003,null,11673.970000000001,0.85648958854614143,9998.6337619999995,null,11673.970000000001,1.8711548981194914,21843.806146000003,null,31842.439908]
[null,"August",null,10848.7,3.6316401430586156,39398.574420000004,null,11641.99,0.85643123332007676,9970.563854,null,11641.99,1.8690130451924456,21759.031181999999,null,31729.595035999999]
[null,"September",null,11565.34,3.6256976382881958,41932.425924000003,null,12464.66,0.85638618590478999,10674.562635999999,null,12464.66,1.8673596382091449,23276.002988,null,33950.565623999995]
[null,"October",null,12632.09,3.6221346169952877,45755.130474000005,null,13207.09,0.856317259441709,11309.459114000001,null,13207.09,1.8648297817308734,24628.974762000002,null,35938.433876000003]
[null,"November",null,15269.03,3.6240527235849296,55335.769758000002,null,15518.82,0.85625596353330991,13288.082172,null,15518.82,1.8625799948707442,28905.043676000001,null,42193.125848000003]
[null,"December",null,16311.220000000001,3.6214995010796249,59071.075092000006,null,16464.22,0.8561700591950302,14096.172212000001,null,16464.22,1.8594269874916636,30614.014995999998,null,44710.187208000003]
[]
[null,"Total",null,{"$f":"SUM(D100:D111)","v":160742.77622589533},{"$f":"IF(D113<>0,F113/D113,0)","v":3.6240588168592183},{"$f":"SUM(F100:F111)","v":582541.27542788431},null,{"$f":"SUM(H100:H111)","v":168649.04666666669},{"$f":"IF(H113<>0,J113/H113,0)","v":0.85632181683643838},{"$f":"SUM(J100:J111)","v":144417.8580493333},null,{"$f":"SUM(L100:L111)","v":168534.49243243245},{"$f":"IF(L113<>0,N113/L113,0)","v":1.8649052924217984},{"$f":"SUM(N100:N111)","v":314300.86689286481},null,{"$f":"SUM(P100:P111)","v":458718.72494219814}]
[]
[null,null,null,null,null,null,null,null,null,null,null,null,null,"Low Voltage Switchgear Credit (if applicable)",null,{"$f":"'5. UTRs and Sub-Transmission'!I95","v":0}]
[]
[null,null,null,null,null,null,null,null,null,null,null,null,null,"Total including deduction for Low Voltage Switchgear Credit",null,{"$f":"P113+P115","v":458718.72494219814}]

{"sheet":"9. Adj Network to Current WS","index":8,"n_rows":49,"n_cols":18,"rows_kept":49,"cut":false,"hidden":false,"merged":[]}
[]
[]
[]
[]
[]
[]
[]
[]
[]
[]
[]
[]
[null,"The purpose of this sheet is to re-align the current RTS Network Rates to recover current wholesale network costs."]
[]
[]
[]
[]
[]
[]
[]
[]
[null,"Rate Class",null,"Unit",null,"Current RTSR-Network",null,"Loss Adjusted Billed kWh",null,"Loss Adjusted Billed kW",null,"Billed Amount",null,"Billed Amount %",null,"Current Wholesale Billing",null,"Proposed RTSR Network"]
[]
[]
[null,{"$f":"IF('3. Rate Classes'!Q24=1,'3. Rate Classes'!C24, 0)","v":"Residential"},null,{"$f":"IF(ISERROR(VLOOKUP($B25, '3. Rate Classes'!$C$24:$H$45,6,0)), \"\", VLOOKUP($B25, '3. Rate Classes'!$C$24:$H$45,6,0))","v":"kWh"},null,{"$f":"IF(ISERROR(VLOOKUP($B25,'3. Rate Classes'!$C$24:$N$45, 8,0)), \"\", VLOOKUP($B25,'3. Rate Classes'!$C$24:$N$45, 8,0))","v":6.1000000000000004E-3},null,{"$f":"VLOOKUP('9. Adj Network to Current WS'!$B25, '4. RRR Data'!$B$27:$M$49,11,0)","v":26402743.934},null,{"$f":"VLOOKUP('9. Adj Network to Current WS'!$B25, '4. RRR Data'!$B$27:$M$49,12,0)","v":0},null,{"$f":"IF(F25=\"\", \"\", IF(D25=\"kWh\", F25*H25, F25*J25))","v":161056.73799740002},null,{"$f":"IF(ISERROR(L25/$L$49), \"\", L25/$L$49)","v":0.28734546594929206},null,{"$f":"IF(ISERROR('7. Current Wholesale'!$F$113*N25), \"\", '7. Current Wholesale'!$F$113*N25)","v":162012.64794403428},null,{"$f":"IF(D25=\"\",\"\",IF(D25=\"kWh\",IF(H25<>0,P25/H25,),IF(J25<>0,P25/J25,0)))","v":6.1362049470700397E-3}]
[null,{"$f":"IF('3. Rate Classes'!Q25=1,'3. Rate Classes'!C25, 0)","v":"General Service Less Than 50 kW"},null,{"$f":"IF(ISERROR(VLOOKUP($B26, '3. Rate Classes'!$C$24:$H$45,6,0)), \"\", VLOOKUP($B26, '3. Rate Classes'!$C$24:$H$45,6,0))","v":"kWh"},null,{"$f":"IF(ISERROR(VLOOKUP($B26,'3. Rate Classes'!$C$24:$N$45, 8,0)), \"\", VLOOKUP($B26,'3. Rate Classes'!$C$24:$N$45, 8,0))","v":5.5999999999999999E-3},null,{"$f":"VLOOKUP('9. Adj Network to Current WS'!$B26, '4. RRR Data'!$B$27:$M$49,11,0)","v":11622041.148},null,{"$f":"VLOOKUP('9. Adj Network to Current WS'!$B26, '4. RRR Data'!$B$27:$M$49,12,0)","v":0},null,{"$f":"IF(F26=\"\", \"\", IF(D26=\"kWh\", F26*H26, F26*J26))","v":65083.430428799998},null,{"$f":"IF(ISERROR(L26/$L$49), \"\", L26/$L$49)","v":0.11611702108634392},null,{"$f":"IF(ISERROR('7. Current Wholesale'!$F$113*N26), \"\", '7. Current Wholesale'!$F$113*N26)","v":65469.716027785449},null,{"$f":"IF(D26=\"\",\"\",IF(D26=\"kWh\",IF(H26<>0,P26/H26,),IF(J26<>0,P26/J26,0)))","v":5.6332373284577403E-3}]
[null,{"$f":"IF('3. Rate Classes'!Q26=1,'3. Rate Classes'!C26, 0)","v":"General Service 50 to 1,499 kW"},null,{"$f":"IF(ISERROR(VLOOKUP($B27, '3. Rate Classes'!$C$24:$H$45,6,0)), \"\", VLOOKUP($B27, '3. Rate Classes'!$C$24:$H$45,6,0))","v":"kW"},null,{"$f":"IF(ISERROR(VLOOKUP($B27,'3. Rate Classes'!$C$24:$N$45, 8,0)), \"\", VLOOKUP($B27,'3. Rate Classes'!$C$24:$N$45, 8,0))","v":2.3025000000000002},null,{"$f":"VLOOKUP('9. Adj Network to Current WS'!$B27, '4. RRR Data'!$B$27:$M$49,11,0)","v":23609369},null,{"$f":"VLOOKUP('9. Adj Network to Current WS'!$B27, '4. RRR Data'!$B$27:$M$49,12,0)","v":66539},null,153206.04750000002,null,0.27333884724430185,null,{"$f":"IF(ISERROR('7. Current Wholesale'!$F$113*N27), \"\", '7. Current Wholesale'!$F$113*N27)","v":154115.36173615532},null,2.3161658837096337]
[null,{"$f":"IF('3. Rate Classes'!Q27=1,'3. Rate Classes'!C27, 0)","v":"General Service Intermediate 1,000 To 4,999 kW"},null,{"$f":"IF(ISERROR(VLOOKUP($B28, '3. Rate Classes'!$C$24:$H$45,6,0)), \"\", VLOOKUP($B28, '3. Rate Classes'!$C$24:$H$45,6,0))","v":"kW"},null,{"$f":"IF(ISERROR(VLOOKUP($B28,'3. Rate Classes'!$C$24:$N$45, 8,0)), \"\", VLOOKUP($B28,'3. Rate Classes'!$C$24:$N$45, 8,0))","v":2.5752999999999999},null,{"$f":"VLOOKUP('9. Adj Network to Current WS'!$B28, '4. RRR Data'!$B$27:$M$49,11,0)","v":23201291},null,{"$f":"VLOOKUP('9. Adj Network to Current WS'!$B28, '4. RRR Data'!$B$27:$M$49,12,0)","v":62667},null,161386.32509999999,null,0.28793349077051367,null,{"$f":"IF(ISERROR('7. Current Wholesale'!$F$113*N28), \"\", '7. Current Wholesale'!$F$113*N28)","v":162344.19122427431},null,2.5905850164245026]
[null,{"$f":"IF('3. Rate Classes'!Q28=1,'3. Rate Classes'!C28, 0)","v":"Sentinel Lighting"},null,{"$f":"IF(ISERROR(VLOOKUP($B29, '3. Rate Classes'!$C$24:$H$45,6,0)), \"\", VLOOKUP($B29, '3. Rate Classes'!$C$24:$H$45,6,0))","v":"kW"},null,{"$f":"IF(ISERROR(VLOOKUP($B29,'3. Rate Classes'!$C$24:$N$45, 8,0)), \"\", VLOOKUP($B29,'3. Rate Classes'!$C$24:$N$45, 8,0))","v":1.7453000000000001},null,{"$f":"VLOOKUP('9. Adj Network to Current WS'!$B29, '4. RRR Data'!$B$27:$M$49,11,0)","v":21288},null,{"$f":"VLOOKUP('9. Adj Network to Current WS'!$B29, '4. RRR Data'!$B$27:$M$49,12,0)","v":72},null,125.66160000000001,null,2.2419609047661491E-4,null,{"$f":"IF(ISERROR('7. Current Wholesale'!$F$113*N29), \"\", '7. Current Wholesale'!$F$113*N29)","v":126.40743140602235},null,1.7556587695280883]
[null,{"$f":"IF('3. Rate Classes'!Q29=1,'3. Rate Classes'!C29, 0)","v":"Street Lighting"},null,{"$f":"IF(ISERROR(VLOOKUP($B30, '3. Rate Classes'!$C$24:$H$45,6,0)), \"\", VLOOKUP($B30, '3. Rate Classes'!$C$24:$H$45,6,0))","v":"kW"},null,{"$f":"IF(ISERROR(VLOOKUP($B30,'3. Rate Classes'!$C$24:$N$45, 8,0)), \"\", VLOOKUP($B30,'3. Rate Classes'!$C$24:$N$45, 8,0))","v":1.7363999999999999},null,{"$f":"VLOOKUP('9. Adj Network to Current WS'!$B30, '4. RRR Data'!$B$27:$M$49,11,0)","v":1030212},null,{"$f":"VLOOKUP('9. Adj Network to Current WS'!$B30, '4. RRR Data'!$B$27:$M$49,12,0)","v":11311},null,19640.420399999999,null,3.5040978859071925E-2,null,{"$f":"IF(ISERROR('7. Current Wholesale'!$F$113*N30), \"\", '7. Current Wholesale'!$F$113*N30)","v":19756.990954264802},null,1.7467059459167891]
[null,{"$f":"IF('3. Rate Classes'!Q30=1,'3. Rate Classes'!C30, 0)","v":0},null,{"$f":"IF(ISERROR(VLOOKUP($B31, '3. Rate Classes'!$C$24:$H$45,6,0)), \"\", VLOOKUP($B31, '3. Rate Classes'!$C$24:$H$45,6,0))","v":""},null,{"$f":"IF(ISERROR(VLOOKUP($B31,'3. Rate Classes'!$C$24:$N$45, 8,0)), \"\", VLOOKUP($B31,'3. Rate Classes'!$C$24:$N$45, 8,0))","v":""},null,{"$f":"VLOOKUP('9. Adj Network to Current WS'!$B31, '4. RRR Data'!$B$27:$M$49,11,0)","v":0},null,{"$f":"VLOOKUP('9. Adj Network to Current WS'!$B31, '4. RRR Data'!$B$27:$M$49,12,0)","v":0},null,"",null,"",null,{"$f":"IF(ISERROR('7. Current Wholesale'!$F$113*N31), \"\", '7. Current Wholesale'!$F$113*N31)","v":""},null,""]
[null,{"$f":"IF('3. Rate Classes'!Q31=1,'3. Rate Classes'!C31, 0)","v":0},null,{"$f":"IF(ISERROR(VLOOKUP($B32, '3. Rate Classes'!$C$24:$H$45,6,0)), \"\", VLOOKUP($B32, '3. Rate Classes'!$C$24:$H$45,6,0))","v":""},null,{"$f":"IF(ISERROR(VLOOKUP($B32,'3. Rate Classes'!$C$24:$N$45, 8,0)), \"\", VLOOKUP($B32,'3. Rate Classes'!$C$24:$N$45, 8,0))","v":""},null,{"$f":"VLOOKUP('9. Adj Network to Current WS'!$B32, '4. RRR Data'!$B$27:$M$49,11,0)","v":0},null,{"$f":"VLOOKUP('9. Adj Network to Current WS'!$B32, '4. RRR Data'!$B$27:$M$49,12,0)","v":0},null,"",null,"",null,{"$f":"IF(ISERROR('7. Current Wholesale'!$F$113*N32), \"\", '7. Current Wholesale'!$F$113*N32)","v":""},null,""]
[null,{"$f":"IF('3. Rate Classes'!Q32=1,'3. Rate Classes'!C32, 0)","v":0},null,{"$f":"IF(ISERROR(VLOOKUP($B33, '3. Rate Classes'!$C$24:$H$45,6,0)), \"\", VLOOKUP($B33, '3. Rate Classes'!$C$24:$H$45,6,0))","v":""},null,{"$f":"IF(ISERROR(VLOOKUP($B33,'3. Rate Classes'!$C$24:$N$45, 8,0)), \"\", VLOOKUP($B33,'3. Rate Classes'!$C$24:$N$45, 8,0))","v":""},null,{"$f":"VLOOKUP('9. Adj Network to Current WS'!$B33, '4. RRR Data'!$B$27:$M$49,11,0)","v":0},null,{"$f":"VLOOKUP('9. Adj Network to Current WS'!$B33, '4. RRR Data'!$B$27:$M$49,12,0)","v":0},null,"",null,"",null,{"$f":"IF(ISERROR('7. Current Wholesale'!$F$113*N33), \"\", '7. Current Wholesale'!$F$113*N33)","v":""},null,""]
[null,{"$f":"IF('3. Rate Classes'!Q33=1,'3. Rate Classes'!C33, 0)","v":0},null,{"$f":"IF(ISERROR(VLOOKUP($B34, '3. Rate Classes'!$C$24:$H$45,6,0)), \"\", VLOOKUP($B34, '3. Rate Classes'!$C$24:$H$45,6,0))","v":""},null,{"$f":"IF(ISERROR(VLOOKUP($B34,'3. Rate Classes'!$C$24:$N$45, 8,0)), \"\", VLOOKUP($B34,'3. Rate Classes'!$C$24:$N$45, 8,0))","v":""},null,{"$f":"VLOOKUP('9. Adj Network to Current WS'!$B34, '4. RRR Data'!$B$27:$M$49,11,0)","v":0},null,{"$f":"VLOOKUP('9. Adj Network to Current WS'!$B34, '4. RRR Data'!$B$27:$M$49,12,0)","v":0},null,"",null,"",null,{"$f":"IF(ISERROR('7. Current Wholesale'!$F$113*N34), \"\", '7. Current Wholesale'!$F$113*N34)","v":""},null,""]
[null,{"$f":"IF('3. Rate Classes'!Q34=1,'3. Rate Classes'!C34, 0)","v":0},null,{"$f":"IF(ISERROR(VLOOKUP($B35, '3. Rate Classes'!$C$24:$H$45,6,0)), \"\", VLOOKUP($B35, '3. Rate Classes'!$C$24:$H$45,6,0))","v":""},null,{"$f":"IF(ISERROR(VLOOKUP($B35,'3. Rate Classes'!$C$24:$N$45, 8,0)), \"\", VLOOKUP($B35,'3. Rate Classes'!$C$24:$N$45, 8,0))","v":""},null,{"$f":"VLOOKUP('9. Adj Network to Current WS'!$B35, '4. RRR Data'!$B$27:$M$49,11,0)","v":0},null,{"$f":"VLOOKUP('9. Adj Network to Current WS'!$B35, '4. RRR Data'!$B$27:$M$49,12,0)","v":0},null,"",null,"",null,{"$f":"IF(ISERROR('7. Current Wholesale'!$F$113*N35), \"\", '7. Current Wholesale'!$F$113*N35)","v":""},null,""]
[null,{"$f":"IF('3. Rate Classes'!Q35=1,'3. Rate Classes'!C35, 0)","v":0},null,{"$f":"IF(ISERROR(VLOOKUP($B36, '3. Rate Classes'!$C$24:$H$45,6,0)), \"\", VLOOKUP($B36, '3. Rate Classes'!$C$24:$H$45,6,0))","v":""},null,{"$f":"IF(ISERROR(VLOOKUP($B36,'3. Rate Classes'!$C$24:$N$45, 8,0)), \"\", VLOOKUP($B36,'3. Rate Classes'!$C$24:$N$45, 8,0))","v":""},null,{"$f":"VLOOKUP('9. Adj Network to Current WS'!$B36, '4. RRR Data'!$B$27:$M$49,11,0)","v":0},null,{"$f":"VLOOKUP('9. Adj Network to Current WS'!$B36, '4. RRR Data'!$B$27:$M$49,12,0)","v":0},null,"",null,"",null,{"$f":"IF(ISERROR('7. Current Wholesale'!$F$113*N36), \"\", '7. Current Wholesale'!$F$113*N36)","v":""},null,""]
[null,{"$f":"IF('3. Rate Classes'!Q36=1,'3. Rate Classes'!C36, 0)","v":0},null,{"$f":"IF(ISERROR(VLOOKUP($B37, '3. Rate Classes'!$C$24:$H$45,6,0)), \"\", VLOOKUP($B37, '3. Rate Classes'!$C$24:$H$45,6,0))","v":""},null,{"$f":"IF(ISERROR(VLOOKUP($B37,'3. Rate Classes'!$C$24:$N$45, 8,0)), \"\", VLOOKUP($B37,'3. Rate Classes'!$C$24:$N$45, 8,0))","v":""},null,{"$f":"VLOOKUP('9. Adj Network to Current WS'!$B37, '4. RRR Data'!$B$27:$M$49,11,0)","v":0},null,{"$f":"VLOOKUP('9. Adj Network to Current WS'!$B37, '4. RRR Data'!$B$27:$M$49,12,0)","v":0},null,"",null,"",null,{"$f":"IF(ISERROR('7. Current Wholesale'!$F$113*N37), \"\", '7. Current Wholesale'!$F$113*N37)","v":""},null,""]
[null,{"$f":"IF('3. Rate Classes'!Q37=1,'3. Rate Classes'!C37, 0)","v":0},null,{"$f":"IF(ISERROR(VLOOKUP($B38, '3. Rate Classes'!$C$24:$H$45,6,0)), \"\", VLOOKUP($B38, '3. Rate Classes'!$C$24:$H$45,6,0))","v":""},null,{"$f":"IF(ISERROR(VLOOKUP($B38,'3. Rate Classes'!$C$24:$N$45, 8,0)), \"\", VLOOKUP($B38,'3. Rate Classes'!$C$24:$N$45, 8,0))","v":""},null,{"$f":"VLOOKUP('9. Adj Network to Current WS'!$B38, '4. RRR Data'!$B$27:$M$49,11,0)","v":0},null,{"$f":"VLOOKUP('9. Adj Network to Current WS'!$B38, '4. RRR Data'!$B$27:$M$49,12,0)","v":0},null,"",null,"",null,{"$f":"IF(ISERROR('7. Current Wholesale'!$F$113*N38), \"\", '7. Current Wholesale'!$F$113*N38)","v":""},null,""]
[null,{"$f":"IF('3. Rate Classes'!Q38=1,'3. Rate Classes'!C38, 0)","v":0},null,{"$f":"IF(ISERROR(VLOOKUP($B39, '3. Rate Classes'!$C$24:$H$45,6,0)), \"\", VLOOKUP($B39, '3. Rate Classes'!$C$24:$H$45,6,0))","v":""},null,{"$f":"IF(ISERROR(VLOOKUP($B39,'3. Rate Classes'!$C$24:$N$45, 8,0)), \"\", VLOOKUP($B39,'3. Rate Classes'!$C$24:$N$45, 8,0))","v":""},null,{"$f":"VLOOKUP('9. Adj Network to Current WS'!$B39, '4. RRR Data'!$B$27:$M$49,11,0)","v":0},null,{"$f":"VLOOKUP('9. Adj Network to Current WS'!$B39, '4. RRR Data'!$B$27:$M$49,12,0)","v":0},null,{"$f":"IF(F39=\"\", \"\", IF(D39=\"kWh\", F39*H39, F39*J39))","v":""},null,"",null,{"$f":"IF(ISERROR('7. Current Wholesale'!$F$113*N39), \"\", '7. Current Wholesale'!$F$113*N39)","v":""},null,""]
[null,{"$f":"IF('3. Rate Classes'!Q39=1,'3. Rate Classes'!C39, 0)","v":0},null,{"$f":"IF(ISERROR(VLOOKUP($B40, '3. Rate Classes'!$C$24:$H$45,6,0)), \"\", VLOOKUP($B40, '3. Rate Classes'!$C$24:$H$45,6,0))","v":""},null,{"$f":"IF(ISERROR(VLOOKUP($B40,'3. Rate Classes'!$C$24:$N$45, 8,0)), \"\", VLOOKUP($B40,'3. Rate Classes'!$C$24:$N$45, 8,0))","v":""},null,{"$f":"VLOOKUP('9. Adj Network to Current WS'!$B40, '4. RRR Data'!$B$27:$M$49,11,0)","v":0},null,{"$f":"VLOOKUP('9. Adj Network to Current WS'!$B40, '4. RRR Data'!$B$27:$M$49,12,0)","v":0},null,"",null,"",null,{"$f":"IF(ISERROR('7. Current Wholesale'!$F$113*N40), \"\", '7. Current Wholesale'!$F$113*N40)","v":""},null,""]
[null,{"$f":"IF('3. Rate Classes'!Q40=1,'3. Rate Classes'!C40, 0)","v":0},null,{"$f":"IF(ISERROR(VLOOKUP($B41, '3. Rate Classes'!$C$24:$H$45,6,0)), \"\", VLOOKUP($B41, '3. Rate Classes'!$C$24:$H$45,6,0))","v":""},null,{"$f":"IF(ISERROR(VLOOKUP($B41,'3. Rate Classes'!$C$24:$N$45, 8,0)), \"\", VLOOKUP($B41,'3. Rate Classes'!$C$24:$N$45, 8,0))","v":""},null,{"$f":"VLOOKUP('9. Adj Network to Current WS'!$B41, '4. RRR Data'!$B$27:$M$49,11,0)","v":0},null,{"$f":"VLOOKUP('9. Adj Network to Current WS'!$B41, '4. RRR Data'!$B$27:$M$49,12,0)","v":0},null,"",null,"",null,{"$f":"IF(ISERROR('7. Current Wholesale'!$F$113*N41), \"\", '7. Current Wholesale'!$F$113*N41)","v":""},null,""]
[null,{"$f":"IF('3. Rate Classes'!Q41=1,'3. Rate Classes'!C41, 0)","v":0},null,{"$f":"IF(ISERROR(VLOOKUP($B42, '3. Rate Classes'!$C$24:$H$45,6,0)), \"\", VLOOKUP($B42, '3. Rate Classes'!$C$24:$H$45,6,0))","v":""},null,{"$f":"IF(ISERROR(VLOOKUP($B42,'3. Rate Classes'!$C$24:$N$45, 8,0)), \"\", VLOOKUP($B42,'3. Rate Classes'!$C$24:$N$45, 8,0))","v":""},null,{"$f":"VLOOKUP('9. Adj Network to Current WS'!$B42, '4. RRR Data'!$B$27:$M$49,11,0)","v":0},null,{"$f":"VLOOKUP('9. Adj Network to Current WS'!$B42, '4. RRR Data'!$B$27:$M$49,12,0)","v":0},null,"",null,"",null,{"$f":"IF(ISERROR('7. Current Wholesale'!$F$113*N42), \"\", '7. Current Wholesale'!$F$113*N42)","v":""},null,""]
[null,{"$f":"IF('3. Rate Classes'!Q42=1,'3. Rate Classes'!C42, 0)","v":0},null,{"$f":"IF(ISERROR(VLOOKUP($B43, '3. Rate Classes'!$C$24:$H$45,6,0)), \"\", VLOOKUP($B43, '3. Rate Classes'!$C$24:$H$45,6,0))","v":""},null,{"$f":"IF(ISERROR(VLOOKUP($B43,'3. Rate Classes'!$C$24:$N$45, 8,0)), \"\", VLOOKUP($B43,'3. Rate Classes'!$C$24:$N$45, 8,0))","v":""},null,{"$f":"VLOOKUP('9. Adj Network to Current WS'!$B43, '4. RRR Data'!$B$27:$M$49,11,0)","v":0},null,{"$f":"VLOOKUP('9. Adj Network to Current WS'!$B43, '4. RRR Data'!$B$27:$M$49,12,0)","v":0},null,"",null,"",null,{"$f":"IF(ISERROR('7. Current Wholesale'!$F$113*N43), \"\", '7. Current Wholesale'!$F$113*N43)","v":""},null,""]
[null,{"$f":"IF('3. Rate Classes'!Q43=1,'3. Rate Classes'!C43, 0)","v":0},null,{"$f":"IF(ISERROR(VLOOKUP($B44, '3. Rate Classes'!$C$24:$H$45,6,0)), \"\", VLOOKUP($B44, '3. Rate Classes'!$C$24:$H$45,6,0))","v":""},null,{"$f":"IF(ISERROR(VLOOKUP($B44,'3. Rate Classes'!$C$24:$N$45, 8,0)), \"\", VLOOKUP($B44,'3. Rate Classes'!$C$24:$N$45, 8,0))","v":""},null,{"$f":"VLOOKUP('9. Adj Network to Current WS'!$B44, '4. RRR Data'!$B$27:$M$49,11,0)","v":0},null,{"$f":"VLOOKUP('9. Adj Network to Current WS'!$B44, '4. RRR Data'!$B$27:$M$49,12,0)","v":0},null,"",null,"",null,{"$f":"IF(ISERROR('7. Current Wholesale'!$F$113*N44), \"\", '7. Current Wholesale'!$F$113*N44)","v":""},null,""]
[null,{"$f":"IF('3. Rate Classes'!Q44=1,'3. Rate Classes'!C44, 0)","v":0},null,{"$f":"IF(ISERROR(VLOOKUP($B45, '3. Rate Classes'!$C$24:$H$45,6,0)), \"\", VLOOKUP($B45, '3. Rate Classes'!$C$24:$H$45,6,0))","v":""},null,{"$f":"IF(ISERROR(VLOOKUP($B45,'3. Rate Classes'!$C$24:$N$45, 8,0)), \"\", VLOOKUP($B45,'3. Rate Classes'!$C$24:$N$45, 8,0))","v":""},null,{"$f":"VLOOKUP('9. Adj Network to Current WS'!$B45, '4. RRR Data'!$B$27:$M$49,11,0)","v":0},null,{"$f":"VLOOKUP('9. Adj Network to Current WS'!$B45, '4. RRR Data'!$B$27:$M$49,12,0)","v":0},null,"",null,"",null,{"$f":"IF(ISERROR('7. Current Wholesale'!$F$113*N45), \"\", '7. Current Wholesale'!$F$113*N45)","v":""},null,""]
[null,{"$f":"IF('3. Rate Classes'!Q45=1,'3. Rate Classes'!C45, 0)","v":0},null,{"$f":"IF(ISERROR(VLOOKUP($B46, '3. Rate Classes'!$C$24:$H$45,6,0)), \"\", VLOOKUP($B46, '3. Rate Classes'!$C$24:$H$45,6,0))","v":""},null,{"$f":"IF(ISERROR(VLOOKUP($B46,'3. Rate Classes'!$C$24:$N$45, 8,0)), \"\", VLOOKUP($B46,'3. Rate Classes'!$C$24:$N$45, 8,0))","v":""},null,{"$f":"VLOOKUP('9. Adj Network to Current WS'!$B46, '4. RRR Data'!$B$27:$M$49,11,0)","v":0},null,{"$f":"VLOOKUP('9. Adj Network to Current WS'!$B46, '4. RRR Data'!$B$27:$M$49,12,0)","v":0},null,"",null,"",null,{"$f":"IF(ISERROR('7. Current Wholesale'!$F$113*N46), \"\", '7. Current Wholesale'!$F$113*N46)","v":""},null,""]
[]
[]
[null,null,null,null,null,null,null,null,null,null,null,{"$f":"SUM(L25:L46)","v":560498.62302619999}]

{"sheet":"10. Adj Conn. to Current WS","index":9,"n_rows":49,"n_cols":18,"rows_kept":49,"cut":false,"hidden":false,"merged":[]}
[]
[]
[]
[]
[]
[]
[]
[]
[]
[]
[]
[]
[null,"The purpose of this sheet is to re-align the current RTS Connection Rates to recover current wholesale connection costs."]
[]
[]
[]
[]
[]
[]
[]
[]
[null,"Rate Class",null,"Unit",null,"Current RTSR-Connection",null,"Loss Adjusted Billed kWh",null,"Loss Adjusted Billed kW",null,"Billed Amount",null,"Billed Amount %",null,"Current Wholesale Billing",null,"Proposed RTSR Connection"]
[]
[]
[null,{"$f":"IF('3. Rate Classes'!Q24=1,'3. Rate Classes'!C24, 0)","v":"Residential"},null,{"$f":"IF(ISERROR(VLOOKUP($B25, '3. Rate Classes'!$C$24:$H$45,6,0)), \"\", VLOOKUP($B25, '3. Rate Classes'!$C$24:$H$45,6,0))","v":"kWh"},null,{"$f":"IF(ISERROR(VLOOKUP($B25,'3. Rate Classes'!$C$24:$N$45, 11,0)), \"\", VLOOKUP($B25,'3. Rate Classes'!$C$24:$N$45, 11,0))","v":4.7999999999999996E-3},null,{"$f":"VLOOKUP('9. Adj Network to Current WS'!$B25, '4. RRR Data'!$B$27:$M$49,11,0)","v":26402743.934},null,{"$f":"VLOOKUP('9. Adj Network to Current WS'!$B25, '4. RRR Data'!$B$27:$M$49,12,0)","v":0},null,{"$f":"IF(F25=\"\", \"\", IF(D25=\"kWh\", F25*H25, F25*J25))","v":126733.17088319999},null,{"$f":"IF(ISERROR(L25/$L$49), \"\", L25/$L$49)","v":0.29505850091370084},null,{"$f":"IF(ISERROR('7. Current Wholesale'!$P$117*N25), \"\", '7. Current Wholesale'!$P$117*N25)","v":123561.40528906415},null,{"$f":"IF(D25=\"\",\"\",IF(D25=\"kWh\",IF(H25<>0,P25/H25,),IF(J25<>0,P25/J25,0)))","v":4.6798698498131692E-3}]
[null,{"$f":"IF('3. Rate Classes'!Q25=1,'3. Rate Classes'!C25, 0)","v":"General Service Less Than 50 kW"},null,{"$f":"IF(ISERROR(VLOOKUP($B26, '3. Rate Classes'!$C$24:$H$45,6,0)), \"\", VLOOKUP($B26, '3. Rate Classes'!$C$24:$H$45,6,0))","v":"kWh"},null,{"$f":"IF(ISERROR(VLOOKUP($B26,'3. Rate Classes'!$C$24:$N$45, 11,0)), \"\", VLOOKUP($B26,'3. Rate Classes'!$C$24:$N$45, 11,0))","v":4.1999999999999997E-3},null,{"$f":"VLOOKUP('9. Adj Network to Current WS'!$B26, '4. RRR Data'!$B$27:$M$49,11,0)","v":11622041.148},null,{"$f":"VLOOKUP('9. Adj Network to Current WS'!$B26, '4. RRR Data'!$B$27:$M$49,12,0)","v":0},null,48812.572821599999,null,0.11364478977454029,null,{"$f":"IF(ISERROR('7. Current Wholesale'!$P$117*N26), \"\", '7. Current Wholesale'!$P$117*N26)","v":47590.934966586588},null,4.0948861185865241E-3]
[null,{"$f":"IF('3. Rate Classes'!Q26=1,'3. Rate Classes'!C26, 0)","v":"General Service 50 to 1,499 kW"},null,{"$f":"IF(ISERROR(VLOOKUP($B27, '3. Rate Classes'!$C$24:$H$45,6,0)), \"\", VLOOKUP($B27, '3. Rate Classes'!$C$24:$H$45,6,0))","v":"kW"},null,{"$f":"IF(ISERROR(VLOOKUP($B27,'3. Rate Classes'!$C$24:$N$45, 11,0)), \"\", VLOOKUP($B27,'3. Rate Classes'!$C$24:$N$45, 11,0))","v":1.7024999999999999},null,{"$f":"VLOOKUP('9. Adj Network to Current WS'!$B27, '4. RRR Data'!$B$27:$M$49,11,0)","v":23609369},null,{"$f":"VLOOKUP('9. Adj Network to Current WS'!$B27, '4. RRR Data'!$B$27:$M$49,12,0)","v":66539},null,113282.64749999999,null,0.26374316935295816,null,{"$f":"IF(ISERROR('7. Current Wholesale'!$P$117*N27), \"\", '7. Current Wholesale'!$P$117*N27)","v":110447.50969630484},null,1.6598913373556086]
[null,{"$f":"IF('3. Rate Classes'!Q27=1,'3. Rate Classes'!C27, 0)","v":"General Service Intermediate 1,000 To 4,999 kW"},null,{"$f":"IF(ISERROR(VLOOKUP($B28, '3. Rate Classes'!$C$24:$H$45,6,0)), \"\", VLOOKUP($B28, '3. Rate Classes'!$C$24:$H$45,6,0))","v":"kW"},null,{"$f":"IF(ISERROR(VLOOKUP($B28,'3. Rate Classes'!$C$24:$N$45, 11,0)), \"\", VLOOKUP($B28,'3. Rate Classes'!$C$24:$N$45, 11,0))","v":2.0081000000000002},null,{"$f":"VLOOKUP('9. Adj Network to Current WS'!$B28, '4. RRR Data'!$B$27:$M$49,11,0)","v":23201291},null,{"$f":"VLOOKUP('9. Adj Network to Current WS'!$B28, '4. RRR Data'!$B$27:$M$49,12,0)","v":62667},null,125841.60270000002,null,0.29298276360069875,null,{"$f":"IF(ISERROR('7. Current Wholesale'!$P$117*N28), \"\", '7. Current Wholesale'!$P$117*N28)","v":122692.1504849787},null,1.9578430511270477]
[null,{"$f":"IF('3. Rate Classes'!Q28=1,'3. Rate Classes'!C28, 0)","v":"Sentinel Lighting"},null,{"$f":"IF(ISERROR(VLOOKUP($B29, '3. Rate Classes'!$C$24:$H$45,6,0)), \"\", VLOOKUP($B29, '3. Rate Classes'!$C$24:$H$45,6,0))","v":"kW"},null,{"$f":"IF(ISERROR(VLOOKUP($B29,'3. Rate Classes'!$C$24:$N$45, 11,0)), \"\", VLOOKUP($B29,'3. Rate Classes'!$C$24:$N$45, 11,0))","v":1.3313999999999999},null,{"$f":"VLOOKUP('9. Adj Network to Current WS'!$B29, '4. RRR Data'!$B$27:$M$49,11,0)","v":21288},null,{"$f":"VLOOKUP('9. Adj Network to Current WS'!$B29, '4. RRR Data'!$B$27:$M$49,12,0)","v":72},null,95.860799999999998,null,2.2318185323758481E-4,null,{"$f":"IF(ISERROR('7. Current Wholesale'!$P$117*N29), \"\", '7. Current Wholesale'!$P$117*N29)","v":93.461680770618827},null,1.2980788995919281]
[null,{"$f":"IF('3. Rate Classes'!Q29=1,'3. Rate Classes'!C29, 0)","v":"Street Lighting"},null,{"$f":"IF(ISERROR(VLOOKUP($B30, '3. Rate Classes'!$C$24:$H$45,6,0)), \"\", VLOOKUP($B30, '3. Rate Classes'!$C$24:$H$45,6,0))","v":"kW"},null,{"$f":"IF(ISERROR(VLOOKUP($B30,'3. Rate Classes'!$C$24:$N$45, 11,0)), \"\", VLOOKUP($B30,'3. Rate Classes'!$C$24:$N$45, 11,0))","v":1.3043},null,{"$f":"VLOOKUP('9. Adj Network to Current WS'!$B30, '4. RRR Data'!$B$27:$M$49,11,0)","v":1030212},null,{"$f":"VLOOKUP('9. Adj Network to Current WS'!$B30, '4. RRR Data'!$B$27:$M$49,12,0)","v":11311},null,14752.9373,null,3.434759450486425E-2,null,{"$f":"IF(ISERROR('7. Current Wholesale'!$P$117*N30), \"\", '7. Current Wholesale'!$P$117*N30)","v":14383.713847177942},null,1.2716571343981913]
[null,{"$f":"IF('3. Rate Classes'!Q30=1,'3. Rate Classes'!C30, 0)","v":0},null,{"$f":"IF(ISERROR(VLOOKUP($B31, '3. Rate Classes'!$C$24:$H$45,6,0)), \"\", VLOOKUP($B31, '3. Rate Classes'!$C$24:$H$45,6,0))","v":""},null,{"$f":"IF(ISERROR(VLOOKUP($B31,'3. Rate Classes'!$C$24:$N$45, 11,0)), \"\", VLOOKUP($B31,'3. Rate Classes'!$C$24:$N$45, 11,0))","v":""},null,{"$f":"VLOOKUP('9. Adj Network to Current WS'!$B31, '4. RRR Data'!$B$27:$M$49,11,0)","v":0},null,{"$f":"VLOOKUP('9. Adj Network to Current WS'!$B31, '4. RRR Data'!$B$27:$M$49,12,0)","v":0},null,"",null,"",null,{"$f":"IF(ISERROR('7. Current Wholesale'!$P$117*N31), \"\", '7. Current Wholesale'!$P$117*N31)","v":""},null,""]
[null,{"$f":"IF('3. Rate Classes'!Q31=1,'3. Rate Classes'!C31, 0)","v":0},null,{"$f":"IF(ISERROR(VLOOKUP($B32, '3. Rate Classes'!$C$24:$H$45,6,0)), \"\", VLOOKUP($B32, '3. Rate Classes'!$C$24:$H$45,6,0))","v":""},null,{"$f":"IF(ISERROR(VLOOKUP($B32,'3. Rate Classes'!$C$24:$N$45, 11,0)), \"\", VLOOKUP($B32,'3. Rate Classes'!$C$24:$N$45, 11,0))","v":""},null,{"$f":"VLOOKUP('9. Adj Network to Current WS'!$B32, '4. RRR Data'!$B$27:$M$49,11,0)","v":0},null,{"$f":"VLOOKUP('9. Adj Network to Current WS'!$B32, '4. RRR Data'!$B$27:$M$49,12,0)","v":0},null,"",null,"",null,{"$f":"IF(ISERROR('7. Current Wholesale'!$P$117*N32), \"\", '7. Current Wholesale'!$P$117*N32)","v":""},null,""]
[null,{"$f":"IF('3. Rate Classes'!Q32=1,'3. Rate Classes'!C32, 0)","v":0},null,{"$f":"IF(ISERROR(VLOOKUP($B33, '3. Rate Classes'!$C$24:$H$45,6,0)), \"\", VLOOKUP($B33, '3. Rate Classes'!$C$24:$H$45,6,0))","v":""},null,{"$f":"IF(ISERROR(VLOOKUP($B33,'3. Rate Classes'!$C$24:$N$45, 11,0)), \"\", VLOOKUP($B33,'3. Rate Classes'!$C$24:$N$45, 11,0))","v":""},null,{"$f":"VLOOKUP('9. Adj Network to Current WS'!$B33, '4. RRR Data'!$B$27:$M$49,11,0)","v":0},null,{"$f":"VLOOKUP('9. Adj Network to Current WS'!$B33, '4. RRR Data'!$B$27:$M$49,12,0)","v":0},null,"",null,"",null,{"$f":"IF(ISERROR('7. Current Wholesale'!$P$117*N33), \"\", '7. Current Wholesale'!$P$117*N33)","v":""},null,""]
[null,{"$f":"IF('3. Rate Classes'!Q33=1,'3. Rate Classes'!C33, 0)","v":0},null,{"$f":"IF(ISERROR(VLOOKUP($B34, '3. Rate Classes'!$C$24:$H$45,6,0)), \"\", VLOOKUP($B34, '3. Rate Classes'!$C$24:$H$45,6,0))","v":""},null,{"$f":"IF(ISERROR(VLOOKUP($B34,'3. Rate Classes'!$C$24:$N$45, 11,0)), \"\", VLOOKUP($B34,'3. Rate Classes'!$C$24:$N$45, 11,0))","v":""},null,{"$f":"VLOOKUP('9. Adj Network to Current WS'!$B34, '4. RRR Data'!$B$27:$M$49,11,0)","v":0},null,{"$f":"VLOOKUP('9. Adj Network to Current WS'!$B34, '4. RRR Data'!$B$27:$M$49,12,0)","v":0},null,"",null,"",null,{"$f":"IF(ISERROR('7. Current Wholesale'!$P$117*N34), \"\", '7. Current Wholesale'!$P$117*N34)","v":""},null,""]
[null,{"$f":"IF('3. Rate Classes'!Q34=1,'3. Rate Classes'!C34, 0)","v":0},null,{"$f":"IF(ISERROR(VLOOKUP($B35, '3. Rate Classes'!$C$24:$H$45,6,0)), \"\", VLOOKUP($B35, '3. Rate Classes'!$C$24:$H$45,6,0))","v":""},null,{"$f":"IF(ISERROR(VLOOKUP($B35,'3. Rate Classes'!$C$24:$N$45, 11,0)), \"\", VLOOKUP($B35,'3. Rate Classes'!$C$24:$N$45, 11,0))","v":""},null,{"$f":"VLOOKUP('9. Adj Network to Current WS'!$B35, '4. RRR Data'!$B$27:$M$49,11,0)","v":0},null,{"$f":"VLOOKUP('9. Adj Network to Current WS'!$B35, '4. RRR Data'!$B$27:$M$49,12,0)","v":0},null,"",null,"",null,{"$f":"IF(ISERROR('7. Current Wholesale'!$P$117*N35), \"\", '7. Current Wholesale'!$P$117*N35)","v":""},null,""]
[null,{"$f":"IF('3. Rate Classes'!Q35=1,'3. Rate Classes'!C35, 0)","v":0},null,{"$f":"IF(ISERROR(VLOOKUP($B36, '3. Rate Classes'!$C$24:$H$45,6,0)), \"\", VLOOKUP($B36, '3. Rate Classes'!$C$24:$H$45,6,0))","v":""},null,{"$f":"IF(ISERROR(VLOOKUP($B36,'3. Rate Classes'!$C$24:$N$45, 11,0)), \"\", VLOOKUP($B36,'3. Rate Classes'!$C$24:$N$45, 11,0))","v":""},null,{"$f":"VLOOKUP('9. Adj Network to Current WS'!$B36, '4. RRR Data'!$B$27:$M$49,11,0)","v":0},null,{"$f":"VLOOKUP('9. Adj Network to Current WS'!$B36, '4. RRR Data'!$B$27:$M$49,12,0)","v":0},null,"",null,"",null,{"$f":"IF(ISERROR('7. Current Wholesale'!$P$117*N36), \"\", '7. Current Wholesale'!$P$117*N36)","v":""},null,""]
[null,{"$f":"IF('3. Rate Classes'!Q36=1,'3. Rate Classes'!C36, 0)","v":0},null,{"$f":"IF(ISERROR(VLOOKUP($B37, '3. Rate Classes'!$C$24:$H$45,6,0)), \"\", VLOOKUP($B37, '3. Rate Classes'!$C$24:$H$45,6,0))","v":""},null,{"$f":"IF(ISERROR(VLOOKUP($B37,'3. Rate Classes'!$C$24:$N$45, 11,0)), \"\", VLOOKUP($B37,'3. Rate Classes'!$C$24:$N$45, 11,0))","v":""},null,{"$f":"VLOOKUP('9. Adj Network to Current WS'!$B37, '4. RRR Data'!$B$27:$M$49,11,0)","v":0},null,{"$f":"VLOOKUP('9. Adj Network to Current WS'!$B37, '4. RRR Data'!$B$27:$M$49,12,0)","v":0},null,"",null,"",null,{"$f":"IF(ISERROR('7. Current Wholesale'!$P$117*N37), \"\", '7. Current Wholesale'!$P$117*N37)","v":""},null,""]
[null,{"$f":"IF('3. Rate Classes'!Q37=1,'3. Rate Classes'!C37, 0)","v":0},null,{"$f":"IF(ISERROR(VLOOKUP($B38, '3. Rate Classes'!$C$24:$H$45,6,0)), \"\", VLOOKUP($B38, '3. Rate Classes'!$C$24:$H$45,6,0))","v":""},null,{"$f":"IF(ISERROR(VLOOKUP($B38,'3. Rate Classes'!$C$24:$N$45, 11,0)), \"\", VLOOKUP($B38,'3. Rate Classes'!$C$24:$N$45, 11,0))","v":""},null,{"$f":"VLOOKUP('9. Adj Network to Current WS'!$B38, '4. RRR Data'!$B$27:$M$49,11,0)","v":0},null,{"$f":"VLOOKUP('9. Adj Network to Current WS'!$B38, '4. RRR Data'!$B$27:$M$49,12,0)","v":0},null,"",null,"",null,{"$f":"IF(ISERROR('7. Current Wholesale'!$P$117*N38), \"\", '7. Current Wholesale'!$P$117*N38)","v":""},null,""]
[null,{"$f":"IF('3. Rate Classes'!Q38=1,'3. Rate Classes'!C38, 0)","v":0},null,{"$f":"IF(ISERROR(VLOOKUP($B39, '3. Rate Classes'!$C$24:$H$45,6,0)), \"\", VLOOKUP($B39, '3. Rate Classes'!$C$24:$H$45,6,0))","v":""},null,{"$f":"IF(ISERROR(VLOOKUP($B39,'3. Rate Classes'!$C$24:$N$45, 11,0)), \"\", VLOOKUP($B39,'3. Rate Classes'!$C$24:$N$45, 11,0))","v":""},null,{"$f":"VLOOKUP('9. Adj Network to Current WS'!$B39, '4. RRR Data'!$B$27:$M$49,11,0)","v":0},null,{"$f":"VLOOKUP('9. Adj Network to Current WS'!$B39, '4. RRR Data'!$B$27:$M$49,12,0)","v":0},null,"",null,"",null,{"$f":"IF(ISERROR('7. Current Wholesale'!$P$117*N39), \"\", '7. Current Wholesale'!$P$117*N39)","v":""},null,""]
[null,{"$f":"IF('3. Rate Classes'!Q39=1,'3. Rate Classes'!C39, 0)","v":0},null,{"$f":"IF(ISERROR(VLOOKUP($B40, '3. Rate Classes'!$C$24:$H$45,6,0)), \"\", VLOOKUP($B40, '3. Rate Classes'!$C$24:$H$45,6,0))","v":""},null,{"$f":"IF(ISERROR(VLOOKUP($B40,'3. Rate Classes'!$C$24:$N$45, 11,0)), \"\", VLOOKUP($B40,'3. Rate Classes'!$C$24:$N$45, 11,0))","v":""},null,{"$f":"VLOOKUP('9. Adj Network to Current WS'!$B40, '4. RRR Data'!$B$27:$M$49,11,0)","v":0},null,{"$f":"VLOOKUP('9. Adj Network to Current WS'!$B40, '4. RRR Data'!$B$27:$M$49,12,0)","v":0},null,"",null,"",null,{"$f":"IF(ISERROR('7. Current Wholesale'!$P$117*N40), \"\", '7. Current Wholesale'!$P$117*N40)","v":""},null,""]
[null,{"$f":"IF('3. Rate Classes'!Q40=1,'3. Rate Classes'!C40, 0)","v":0},null,{"$f":"IF(ISERROR(VLOOKUP($B41, '3. Rate Classes'!$C$24:$H$45,6,0)), \"\", VLOOKUP($B41, '3. Rate Classes'!$C$24:$H$45,6,0))","v":""},null,{"$f":"IF(ISERROR(VLOOKUP($B41,'3. Rate Classes'!$C$24:$N$45, 11,0)), \"\", VLOOKUP($B41,'3. Rate Classes'!$C$24:$N$45, 11,0))","v":""},null,{"$f":"VLOOKUP('9. Adj Network to Current WS'!$B41, '4. RRR Data'!$B$27:$M$49,11,0)","v":0},null,{"$f":"VLOOKUP('9. Adj Network to Current WS'!$B41, '4. RRR Data'!$B$27:$M$49,12,0)","v":0},null,"",null,"",null,{"$f":"IF(ISERROR('7. Current Wholesale'!$P$117*N41), \"\", '7. Current Wholesale'!$P$117*N41)","v":""},null,""]
[null,{"$f":"IF('3. Rate Classes'!Q41=1,'3. Rate Classes'!C41, 0)","v":0},null,{"$f":"IF(ISERROR(VLOOKUP($B42, '3. Rate Classes'!$C$24:$H$45,6,0)), \"\", VLOOKUP($B42, '3. Rate Classes'!$C$24:$H$45,6,0))","v":""},null,{"$f":"IF(ISERROR(VLOOKUP($B42,'3. Rate Classes'!$C$24:$N$45, 11,0)), \"\", VLOOKUP($B42,'3. Rate Classes'!$C$24:$N$45, 11,0))","v":""},null,{"$f":"VLOOKUP('9. Adj Network to Current WS'!$B42, '4. RRR Data'!$B$27:$M$49,11,0)","v":0},null,{"$f":"VLOOKUP('9. Adj Network to Current WS'!$B42, '4. RRR Data'!$B$27:$M$49,12,0)","v":0},null,"",null,"",null,{"$f":"IF(ISERROR('7. Current Wholesale'!$P$117*N42), \"\", '7. Current Wholesale'!$P$117*N42)","v":""},null,""]
[null,{"$f":"IF('3. Rate Classes'!Q42=1,'3. Rate Classes'!C42, 0)","v":0},null,{"$f":"IF(ISERROR(VLOOKUP($B43, '3. Rate Classes'!$C$24:$H$45,6,0)), \"\", VLOOKUP($B43, '3. Rate Classes'!$C$24:$H$45,6,0))","v":""},null,{"$f":"IF(ISERROR(VLOOKUP($B43,'3. Rate Classes'!$C$24:$N$45, 11,0)), \"\", VLOOKUP($B43,'3. Rate Classes'!$C$24:$N$45, 11,0))","v":""},null,{"$f":"VLOOKUP('9. Adj Network to Current WS'!$B43, '4. RRR Data'!$B$27:$M$49,11,0)","v":0},null,{"$f":"VLOOKUP('9. Adj Network to Current WS'!$B43, '4. RRR Data'!$B$27:$M$49,12,0)","v":0},null,"",null,"",null,{"$f":"IF(ISERROR('7. Current Wholesale'!$P$117*N43), \"\", '7. Current Wholesale'!$P$117*N43)","v":""},null,""]
[null,{"$f":"IF('3. Rate Classes'!Q43=1,'3. Rate Classes'!C43, 0)","v":0},null,{"$f":"IF(ISERROR(VLOOKUP($B44, '3. Rate Classes'!$C$24:$H$45,6,0)), \"\", VLOOKUP($B44, '3. Rate Classes'!$C$24:$H$45,6,0))","v":""},null,{"$f":"IF(ISERROR(VLOOKUP($B44,'3. Rate Classes'!$C$24:$N$45, 11,0)), \"\", VLOOKUP($B44,'3. Rate Classes'!$C$24:$N$45, 11,0))","v":""},null,{"$f":"VLOOKUP('9. Adj Network to Current WS'!$B44, '4. RRR Data'!$B$27:$M$49,11,0)","v":0},null,{"$f":"VLOOKUP('9. Adj Network to Current WS'!$B44, '4. RRR Data'!$B$27:$M$49,12,0)","v":0},null,"",null,"",null,{"$f":"IF(ISERROR('7. Current Wholesale'!$P$117*N44), \"\", '7. Current Wholesale'!$P$117*N44)","v":""},null,""]
[null,{"$f":"IF('3. Rate Classes'!Q44=1,'3. Rate Classes'!C44, 0)","v":0},null,{"$f":"IF(ISERROR(VLOOKUP($B45, '3. Rate Classes'!$C$24:$H$45,6,0)), \"\", VLOOKUP($B45, '3. Rate Classes'!$C$24:$H$45,6,0))","v":""},null,{"$f":"IF(ISERROR(VLOOKUP($B45,'3. Rate Classes'!$C$24:$N$45, 11,0)), \"\", VLOOKUP($B45,'3. Rate Classes'!$C$24:$N$45, 11,0))","v":""},null,{"$f":"VLOOKUP('9. Adj Network to Current WS'!$B45, '4. RRR Data'!$B$27:$M$49,11,0)","v":0},null,{"$f":"VLOOKUP('9. Adj Network to Current WS'!$B45, '4. RRR Data'!$B$27:$M$49,12,0)","v":0},null,"",null,"",null,{"$f":"IF(ISERROR('7. Current Wholesale'!$P$117*N45), \"\", '7. Current Wholesale'!$P$117*N45)","v":""},null,""]
[null,{"$f":"IF('3. Rate Classes'!Q45=1,'3. Rate Classes'!C45, 0)","v":0},null,{"$f":"IF(ISERROR(VLOOKUP($B46, '3. Rate Classes'!$C$24:$H$45,6,0)), \"\", VLOOKUP($B46, '3. Rate Classes'!$C$24:$H$45,6,0))","v":""},null,{"$f":"IF(ISERROR(VLOOKUP($B46,'3. Rate Classes'!$C$24:$N$45, 11,0)), \"\", VLOOKUP($B46,'3. Rate Classes'!$C$24:$N$45, 11,0))","v":""},null,{"$f":"VLOOKUP('9. Adj Network to Current WS'!$B46, '4. RRR Data'!$B$27:$M$49,11,0)","v":0},null,{"$f":"VLOOKUP('9. Adj Network to Current WS'!$B46, '4. RRR Data'!$B$27:$M$49,12,0)","v":0},null,"",null,"",null,{"$f":"IF(ISERROR('7. Current Wholesale'!$P$117*N46), \"\", '7. Current Wholesale'!$P$117*N46)","v":""},null,""]
[]
[]
[null,null,null,null,null,null,null,null,null,null,null,{"$f":"SUM(L25:L46)","v":429518.79200480005}]

{"sheet":"11. Adj Network to Forecast WS","index":10,"n_rows":49,"n_cols":18,"rows_kept":49,"cut":false,"hidden":false,"merged":[]}
[]
[]
[]
[]
[]
[]
[]
[]
[]
[]
[]
[]
[null,"The purpose of this sheet is to update the re-align RTS Network Rates to recover forecast wholesale network costs."]
[]
[]
[]
[]
[]
[]
[]
[]
[null,"Rate Class",null,"Unit",null,"Adjusted RTSR-Network",null,"Loss Adjusted Billed kWh",null,"Loss Adjusted Billed kW",null,"Billed Amount",null,"Billed Amount %",null,"Forecast Wholesale Billing",null,"Proposed RTSR Network"]
[]
[]
[null,{"$f":"IF('3. Rate Classes'!Q24=1,'3. Rate Classes'!C24, 0)","v":"Residential"},null,{"$f":"IF(ISERROR(VLOOKUP($B25, '3. Rate Classes'!$C$24:$H$45,6,0)), \"\", VLOOKUP($B25, '3. Rate Classes'!$C$24:$H$45,6,0))","v":"kWh"},null,{"$f":"VLOOKUP($B25, '9. Adj Network to Current WS'!$B$25:$R$47, 17,0)","v":6.1362049470700397E-3},null,{"$f":"VLOOKUP('9. Adj Network to Current WS'!$B25, '4. RRR Data'!$B$27:$M$49,11,0)","v":26402743.934},null,{"$f":"VLOOKUP('9. Adj Network to Current WS'!$B25, '4. RRR Data'!$B$27:$M$49,12,0)","v":0},null,{"$f":"IF(F25=\"\", \"\", IF(D25=\"kWh\", F25*H25, F25*J25))","v":162012.64794403428},null,{"$f":"IF(ISERROR(L25/$L$49), \"\", L25/$L$49)","v":0.28734546594929211},null,{"$f":"IF(ISERROR('8. Forecast Wholesale'!$F$113*N25), \"\", '8. Forecast Wholesale'!$F$113*N25)","v":167390.59422252033},null,{"$f":"IF(D25=\"\",\"\",IF(D25=\"kWh\",IF(H25<>0,P25/H25,),IF(J25<>0,P25/J25,0)))","v":6.3398938625831213E-3}]
[null,{"$f":"IF('3. Rate Classes'!Q25=1,'3. Rate Classes'!C25, 0)","v":"General Service Less Than 50 kW"},null,{"$f":"IF(ISERROR(VLOOKUP($B26, '3. Rate Classes'!$C$24:$H$45,6,0)), \"\", VLOOKUP($B26, '3. Rate Classes'!$C$24:$H$45,6,0))","v":"kWh"},null,{"$f":"VLOOKUP($B26, '9. Adj Network to Current WS'!$B$25:$R$47, 17,0)","v":5.6332373284577403E-3},null,{"$f":"VLOOKUP('9. Adj Network to Current WS'!$B26, '4. RRR Data'!$B$27:$M$49,11,0)","v":11622041.148},null,{"$f":"VLOOKUP('9. Adj Network to Current WS'!$B26, '4. RRR Data'!$B$27:$M$49,12,0)","v":0},null,{"$f":"IF(F26=\"\", \"\", IF(D26=\"kWh\", F26*H26, F26*J26))","v":65469.716027785449},null,0.11611702108634395,null,{"$f":"IF(ISERROR('8. Forecast Wholesale'!$F$113*N26), \"\", '8. Forecast Wholesale'!$F$113*N26)","v":67642.957562525335},null,5.8202304312238475E-3]
[null,{"$f":"IF('3. Rate Classes'!Q26=1,'3. Rate Classes'!C26, 0)","v":"General Service 50 to 1,499 kW"},null,{"$f":"IF(ISERROR(VLOOKUP($B27, '3. Rate Classes'!$C$24:$H$45,6,0)), \"\", VLOOKUP($B27, '3. Rate Classes'!$C$24:$H$45,6,0))","v":"kW"},null,{"$f":"VLOOKUP($B27, '9. Adj Network to Current WS'!$B$25:$R$47, 17,0)","v":2.3161658837096337},null,{"$f":"VLOOKUP('9. Adj Network to Current WS'!$B27, '4. RRR Data'!$B$27:$M$49,11,0)","v":23609369},null,{"$f":"VLOOKUP('9. Adj Network to Current WS'!$B27, '4. RRR Data'!$B$27:$M$49,12,0)","v":66539},null,154115.36173615532,null,0.27333884724430191,null,{"$f":"IF(ISERROR('8. Forecast Wholesale'!$F$113*N27), \"\", '8. Forecast Wholesale'!$F$113*N27)","v":159231.16069768328},null,2.3930501014094485]
[null,{"$f":"IF('3. Rate Classes'!Q27=1,'3. Rate Classes'!C27, 0)","v":"General Service Intermediate 1,000 To 4,999 kW"},null,{"$f":"IF(ISERROR(VLOOKUP($B28, '3. Rate Classes'!$C$24:$H$45,6,0)), \"\", VLOOKUP($B28, '3. Rate Classes'!$C$24:$H$45,6,0))","v":"kW"},null,{"$f":"VLOOKUP($B28, '9. Adj Network to Current WS'!$B$25:$R$47, 17,0)","v":2.5905850164245026},null,{"$f":"VLOOKUP('9. Adj Network to Current WS'!$B28, '4. RRR Data'!$B$27:$M$49,11,0)","v":23201291},null,{"$f":"VLOOKUP('9. Adj Network to Current WS'!$B28, '4. RRR Data'!$B$27:$M$49,12,0)","v":62667},null,162344.19122427431,null,0.28793349077051372,null,{"$f":"IF(ISERROR('8. Forecast Wholesale'!$F$113*N28), \"\", '8. Forecast Wholesale'!$F$113*N28)","v":167733.14295185803},null,2.6765784695590664]
[null,{"$f":"IF('3. Rate Classes'!Q28=1,'3. Rate Classes'!C28, 0)","v":"Sentinel Lighting"},null,{"$f":"IF(ISERROR(VLOOKUP($B29, '3. Rate Classes'!$C$24:$H$45,6,0)), \"\", VLOOKUP($B29, '3. Rate Classes'!$C$24:$H$45,6,0))","v":"kW"},null,{"$f":"VLOOKUP($B29, '9. Adj Network to Current WS'!$B$25:$R$47, 17,0)","v":1.7556587695280883},null,{"$f":"VLOOKUP('9. Adj Network to Current WS'!$B29, '4. RRR Data'!$B$27:$M$49,11,0)","v":21288},null,{"$f":"VLOOKUP('9. Adj Network to Current WS'!$B29, '4. RRR Data'!$B$27:$M$49,12,0)","v":72},null,126.40743140602235,null,2.2419609047661494E-4,null,{"$f":"IF(ISERROR('8. Forecast Wholesale'!$F$113*N29), \"\", '8. Forecast Wholesale'!$F$113*N29)","v":130.60347649219261},null,1.8139371735026752]
[null,{"$f":"IF('3. Rate Classes'!Q29=1,'3. Rate Classes'!C29, 0)","v":"Street Lighting"},null,{"$f":"IF(ISERROR(VLOOKUP($B30, '3. Rate Classes'!$C$24:$H$45,6,0)), \"\", VLOOKUP($B30, '3. Rate Classes'!$C$24:$H$45,6,0))","v":"kW"},null,{"$f":"VLOOKUP($B30, '9. Adj Network to Current WS'!$B$25:$R$47, 17,0)","v":1.7467059459167891},null,{"$f":"VLOOKUP('9. Adj Network to Current WS'!$B30, '4. RRR Data'!$B$27:$M$49,11,0)","v":1030212},null,{"$f":"VLOOKUP('9. Adj Network to Current WS'!$B30, '4. RRR Data'!$B$27:$M$49,12,0)","v":11311},null,19756.990954264802,null,3.5040978859071932E-2,null,{"$f":"IF(ISERROR('8. Forecast Wholesale'!$F$113*N30), \"\", '8. Forecast Wholesale'!$F$113*N30)","v":20412.816516805295},null,1.8046871644244802]
[null,{"$f":"IF('3. Rate Classes'!Q30=1,'3. Rate Classes'!C30, 0)","v":0},null,{"$f":"IF(ISERROR(VLOOKUP($B31, '3. Rate Classes'!$C$24:$H$45,6,0)), \"\", VLOOKUP($B31, '3. Rate Classes'!$C$24:$H$45,6,0))","v":""},null,{"$f":"VLOOKUP($B31, '9. Adj Network to Current WS'!$B$25:$R$47, 17,0)","v":""},null,{"$f":"VLOOKUP('9. Adj Network to Current WS'!$B31, '4. RRR Data'!$B$27:$M$49,11,0)","v":0},null,{"$f":"VLOOKUP('9. Adj Network to Current WS'!$B31, '4. RRR Data'!$B$27:$M$49,12,0)","v":0},null,"",null,"",null,{"$f":"IF(ISERROR('8. Forecast Wholesale'!$F$113*N31), \"\", '8. Forecast Wholesale'!$F$113*N31)","v":""},null,""]
[null,{"$f":"IF('3. Rate Classes'!Q31=1,'3. Rate Classes'!C31, 0)","v":0},null,{"$f":"IF(ISERROR(VLOOKUP($B32, '3. Rate Classes'!$C$24:$H$45,6,0)), \"\", VLOOKUP($B32, '3. Rate Classes'!$C$24:$H$45,6,0))","v":""},null,{"$f":"VLOOKUP($B32, '9. Adj Network to Current WS'!$B$25:$R$47, 17,0)","v":""},null,{"$f":"VLOOKUP('9. Adj Network to Current WS'!$B32, '4. RRR Data'!$B$27:$M$49,11,0)","v":0},null,{"$f":"VLOOKUP('9. Adj Network to Current WS'!$B32, '4. RRR Data'!$B$27:$M$49,12,0)","v":0},null,"",null,"",null,{"$f":"IF(ISERROR('8. Forecast Wholesale'!$F$113*N32), \"\", '8. Forecast Wholesale'!$F$113*N32)","v":""},null,""]
[null,{"$f":"IF('3. Rate Classes'!Q32=1,'3. Rate Classes'!C32, 0)","v":0},null,{"$f":"IF(ISERROR(VLOOKUP($B33, '3. Rate Classes'!$C$24:$H$45,6,0)), \"\", VLOOKUP($B33, '3. Rate Classes'!$C$24:$H$45,6,0))","v":""},null,{"$f":"VLOOKUP($B33, '9. Adj Network to Current WS'!$B$25:$R$47, 17,0)","v":""},null,{"$f":"VLOOKUP('9. Adj Network to Current WS'!$B33, '4. RRR Data'!$B$27:$M$49,11,0)","v":0},null,{"$f":"VLOOKUP('9. Adj Network to Current WS'!$B33, '4. RRR Data'!$B$27:$M$49,12,0)","v":0},null,"",null,"",null,{"$f":"IF(ISERROR('8. Forecast Wholesale'!$F$113*N33), \"\", '8. Forecast Wholesale'!$F$113*N33)","v":""},null,""]
[null,{"$f":"IF('3. Rate Classes'!Q33=1,'3. Rate Classes'!C33, 0)","v":0},null,{"$f":"IF(ISERROR(VLOOKUP($B34, '3. Rate Classes'!$C$24:$H$45,6,0)), \"\", VLOOKUP($B34, '3. Rate Classes'!$C$24:$H$45,6,0))","v":""},null,{"$f":"VLOOKUP($B34, '9. Adj Network to Current WS'!$B$25:$R$47, 17,0)","v":""},null,{"$f":"VLOOKUP('9. Adj Network to Current WS'!$B34, '4. RRR Data'!$B$27:$M$49,11,0)","v":0},null,{"$f":"VLOOKUP('9. Adj Network to Current WS'!$B34, '4. RRR Data'!$B$27:$M$49,12,0)","v":0},null,"",null,"",null,{"$f":"IF(ISERROR('8. Forecast Wholesale'!$F$113*N34), \"\", '8. Forecast Wholesale'!$F$113*N34)","v":""},null,""]
[null,{"$f":"IF('3. Rate Classes'!Q34=1,'3. Rate Classes'!C34, 0)","v":0},null,{"$f":"IF(ISERROR(VLOOKUP($B35, '3. Rate Classes'!$C$24:$H$45,6,0)), \"\", VLOOKUP($B35, '3. Rate Classes'!$C$24:$H$45,6,0))","v":""},null,{"$f":"VLOOKUP($B35, '9. Adj Network to Current WS'!$B$25:$R$47, 17,0)","v":""},null,{"$f":"VLOOKUP('9. Adj Network to Current WS'!$B35, '4. RRR Data'!$B$27:$M$49,11,0)","v":0},null,{"$f":"VLOOKUP('9. Adj Network to Current WS'!$B35, '4. RRR Data'!$B$27:$M$49,12,0)","v":0},null,"",null,"",null,{"$f":"IF(ISERROR('8. Forecast Wholesale'!$F$113*N35), \"\", '8. Forecast Wholesale'!$F$113*N35)","v":""},null,""]
[null,{"$f":"IF('3. Rate Classes'!Q35=1,'3. Rate Classes'!C35, 0)","v":0},null,{"$f":"IF(ISERROR(VLOOKUP($B36, '3. Rate Classes'!$C$24:$H$45,6,0)), \"\", VLOOKUP($B36, '3. Rate Classes'!$C$24:$H$45,6,0))","v":""},null,{"$f":"VLOOKUP($B36, '9. Adj Network to Current WS'!$B$25:$R$47, 17,0)","v":""},null,{"$f":"VLOOKUP('9. Adj Network to Current WS'!$B36, '4. RRR Data'!$B$27:$M$49,11,0)","v":0},null,{"$f":"VLOOKUP('9. Adj Network to Current WS'!$B36, '4. RRR Data'!$B$27:$M$49,12,0)","v":0},null,"",null,"",null,{"$f":"IF(ISERROR('8. Forecast Wholesale'!$F$113*N36), \"\", '8. Forecast Wholesale'!$F$113*N36)","v":""},null,""]
[null,{"$f":"IF('3. Rate Classes'!Q36=1,'3. Rate Classes'!C36, 0)","v":0},null,{"$f":"IF(ISERROR(VLOOKUP($B37, '3. Rate Classes'!$C$24:$H$45,6,0)), \"\", VLOOKUP($B37, '3. Rate Classes'!$C$24:$H$45,6,0))","v":""},null,{"$f":"VLOOKUP($B37, '9. Adj Network to Current WS'!$B$25:$R$47, 17,0)","v":""},null,{"$f":"VLOOKUP('9. Adj Network to Current WS'!$B37, '4. RRR Data'!$B$27:$M$49,11,0)","v":0},null,{"$f":"VLOOKUP('9. Adj Network to Current WS'!$B37, '4. RRR Data'!$B$27:$M$49,12,0)","v":0},null,"",null,"",null,{"$f":"IF(ISERROR('8. Forecast Wholesale'!$F$113*N37), \"\", '8. Forecast Wholesale'!$F$113*N37)","v":""},null,""]
[null,{"$f":"IF('3. Rate Classes'!Q37=1,'3. Rate Classes'!C37, 0)","v":0},null,{"$f":"IF(ISERROR(VLOOKUP($B38, '3. Rate Classes'!$C$24:$H$45,6,0)), \"\", VLOOKUP($B38, '3. Rate Classes'!$C$24:$H$45,6,0))","v":""},null,{"$f":"VLOOKUP($B38, '9. Adj Network to Current WS'!$B$25:$R$47, 17,0)","v":""},null,{"$f":"VLOOKUP('9. Adj Network to Current WS'!$B38, '4. RRR Data'!$B$27:$M$49,11,0)","v":0},null,{"$f":"VLOOKUP('9. Adj Network to Current WS'!$B38, '4. RRR Data'!$B$27:$M$49,12,0)","v":0},null,"",null,"",null,{"$f":"IF(ISERROR('8. Forecast Wholesale'!$F$113*N38), \"\", '8. Forecast Wholesale'!$F$113*N38)","v":""},null,""]
[null,{"$f":"IF('3. Rate Classes'!Q38=1,'3. Rate Classes'!C38, 0)","v":0},null,{"$f":"IF(ISERROR(VLOOKUP($B39, '3. Rate Classes'!$C$24:$H$45,6,0)), \"\", VLOOKUP($B39, '3. Rate Classes'!$C$24:$H$45,6,0))","v":""},null,{"$f":"VLOOKUP($B39, '9. Adj Network to Current WS'!$B$25:$R$47, 17,0)","v":""},null,{"$f":"VLOOKUP('9. Adj Network to Current WS'!$B39, '4. RRR Data'!$B$27:$M$49,11,0)","v":0},null,{"$f":"VLOOKUP('9. Adj Network to Current WS'!$B39, '4. RRR Data'!$B$27:$M$49,12,0)","v":0},null,"",null,"",null,{"$f":"IF(ISERROR('8. Forecast Wholesale'!$F$113*N39), \"\", '8. Forecast Wholesale'!$F$113*N39)","v":""},null,""]
[null,{"$f":"IF('3. Rate Classes'!Q39=1,'3. Rate Classes'!C39, 0)","v":0},null,{"$f":"IF(ISERROR(VLOOKUP($B40, '3. Rate Classes'!$C$24:$H$45,6,0)), \"\", VLOOKUP($B40, '3. Rate Classes'!$C$24:$H$45,6,0))","v":""},null,{"$f":"VLOOKUP($B40, '9. Adj Network to Current WS'!$B$25:$R$47, 17,0)","v":""},null,{"$f":"VLOOKUP('9. Adj Network to Current WS'!$B40, '4. RRR Data'!$B$27:$M$49,11,0)","v":0},null,{"$f":"VLOOKUP('9. Adj Network to Current WS'!$B40, '4. RRR Data'!$B$27:$M$49,12,0)","v":0},null,"",null,"",null,{"$f":"IF(ISERROR('8. Forecast Wholesale'!$F$113*N40), \"\", '8. Forecast Wholesale'!$F$113*N40)","v":""},null,""]
[null,{"$f":"IF('3. Rate Classes'!Q40=1,'3. Rate Classes'!C40, 0)","v":0},null,{"$f":"IF(ISERROR(VLOOKUP($B41, '3. Rate Classes'!$C$24:$H$45,6,0)), \"\", VLOOKUP($B41, '3. Rate Classes'!$C$24:$H$45,6,0))","v":""},null,{"$f":"VLOOKUP($B41, '9. Adj Network to Current WS'!$B$25:$R$47, 17,0)","v":""},null,{"$f":"VLOOKUP('9. Adj Network to Current WS'!$B41, '4. RRR Data'!$B$27:$M$49,11,0)","v":0},null,{"$f":"VLOOKUP('9. Adj Network to Current WS'!$B41, '4. RRR Data'!$B$27:$M$49,12,0)","v":0},null,"",null,"",null,{"$f":"IF(ISERROR('8. Forecast Wholesale'!$F$113*N41), \"\", '8. Forecast Wholesale'!$F$113*N41)","v":""},null,""]
[null,{"$f":"IF('3. Rate Classes'!Q41=1,'3. Rate Classes'!C41, 0)","v":0},null,{"$f":"IF(ISERROR(VLOOKUP($B42, '3. Rate Classes'!$C$24:$H$45,6,0)), \"\", VLOOKUP($B42, '3. Rate Classes'!$C$24:$H$45,6,0))","v":""},null,{"$f":"VLOOKUP($B42, '9. Adj Network to Current WS'!$B$25:$R$47, 17,0)","v":""},null,{"$f":"VLOOKUP('9. Adj Network to Current WS'!$B42, '4. RRR Data'!$B$27:$M$49,11,0)","v":0},null,{"$f":"VLOOKUP('9. Adj Network to Current WS'!$B42, '4. RRR Data'!$B$27:$M$49,12,0)","v":0},null,"",null,"",null,{"$f":"IF(ISERROR('8. Forecast Wholesale'!$F$113*N42), \"\", '8. Forecast Wholesale'!$F$113*N42)","v":""},null,""]
[null,{"$f":"IF('3. Rate Classes'!Q42=1,'3. Rate Classes'!C42, 0)","v":0},null,{"$f":"IF(ISERROR(VLOOKUP($B43, '3. Rate Classes'!$C$24:$H$45,6,0)), \"\", VLOOKUP($B43, '3. Rate Classes'!$C$24:$H$45,6,0))","v":""},null,{"$f":"VLOOKUP($B43, '9. Adj Network to Current WS'!$B$25:$R$47, 17,0)","v":""},null,{"$f":"VLOOKUP('9. Adj Network to Current WS'!$B43, '4. RRR Data'!$B$27:$M$49,11,0)","v":0},null,{"$f":"VLOOKUP('9. Adj Network to Current WS'!$B43, '4. RRR Data'!$B$27:$M$49,12,0)","v":0},null,"",null,"",null,{"$f":"IF(ISERROR('8. Forecast Wholesale'!$F$113*N43), \"\", '8. Forecast Wholesale'!$F$113*N43)","v":""},null,""]
[null,{"$f":"IF('3. Rate Classes'!Q43=1,'3. Rate Classes'!C43, 0)","v":0},null,{"$f":"IF(ISERROR(VLOOKUP($B44, '3. Rate Classes'!$C$24:$H$45,6,0)), \"\", VLOOKUP($B44, '3. Rate Classes'!$C$24:$H$45,6,0))","v":""},null,{"$f":"VLOOKUP($B44, '9. Adj Network to Current WS'!$B$25:$R$47, 17,0)","v":""},null,{"$f":"VLOOKUP('9. Adj Network to Current WS'!$B44, '4. RRR Data'!$B$27:$M$49,11,0)","v":0},null,{"$f":"VLOOKUP('9. Adj Network to Current WS'!$B44, '4. RRR Data'!$B$27:$M$49,12,0)","v":0},null,"",null,"",null,{"$f":"IF(ISERROR('8. Forecast Wholesale'!$F$113*N44), \"\", '8. Forecast Wholesale'!$F$113*N44)","v":""},null,""]
[null,{"$f":"IF('3. Rate Classes'!Q44=1,'3. Rate Classes'!C44, 0)","v":0},null,{"$f":"IF(ISERROR(VLOOKUP($B45, '3. Rate Classes'!$C$24:$H$45,6,0)), \"\", VLOOKUP($B45, '3. Rate Classes'!$C$24:$H$45,6,0))","v":""},null,{"$f":"VLOOKUP($B45, '9. Adj Network to Current WS'!$B$25:$R$47, 17,0)","v":""},null,{"$f":"VLOOKUP('9. Adj Network to Current WS'!$B45, '4. RRR Data'!$B$27:$M$49,11,0)","v":0},null,{"$f":"VLOOKUP('9. Adj Network to Current WS'!$B45, '4. RRR Data'!$B$27:$M$49,12,0)","v":0},null,"",null,"",null,{"$f":"IF(ISERROR('8. Forecast Wholesale'!$F$113*N45), \"\", '8. Forecast Wholesale'!$F$113*N45)","v":""},null,""]
[null,{"$f":"IF('3. Rate Classes'!Q45=1,'3. Rate Classes'!C45, 0)","v":0},null,{"$f":"IF(ISERROR(VLOOKUP($B46, '3. Rate Classes'!$C$24:$H$45,6,0)), \"\", VLOOKUP($B46, '3. Rate Classes'!$C$24:$H$45,6,0))","v":""},null,{"$f":"VLOOKUP($B46, '9. Adj Network to Current WS'!$B$25:$R$47, 17,0)","v":""},null,{"$f":"VLOOKUP('9. Adj Network to Current WS'!$B46, '4. RRR Data'!$B$27:$M$49,11,0)","v":0},null,{"$f":"VLOOKUP('9. Adj Network to Current WS'!$B46, '4. RRR Data'!$B$27:$M$49,12,0)","v":0},null,"",null,"",null,{"$f":"IF(ISERROR('8. Forecast Wholesale'!$F$113*N46), \"\", '8. Forecast Wholesale'!$F$113*N46)","v":""},null,""]
[]
[]
[null,null,null,null,null,null,null,null,null,null,null,{"$f":"SUM(L25:L46)","v":563825.31531792006}]

{"sheet":"12. Adj Conn. to Forecast WS","index":11,"n_rows":49,"n_cols":18,"rows_kept":49,"cut":false,"hidden":false,"merged":[]}
[]
[]
[]
[]
[]
[]
[]
[]
[]
[]
[]
[]
[null,"The purpose of this sheet is to update the re-aligned RTS Connection Rates to recover forecast wholesale connection costs."]
[]
[]
[]
[]
[]
[null,"Rate Class"]
[]
[]
[null,"Rate Class",null,"Unit",null,"Adjusted RTSR-Connection",null,"Loss Adjusted Billed kWh",null,"Loss Adjusted Billed kW",null,"Billed Amount",null,"Billed Amount %",null,"Forecast Wholesale Billing",null,"Proposed RTSR Connection"]
[]
[]
[null,{"$f":"IF('3. Rate Classes'!Q24=1,'3. Rate Classes'!C24, 0)","v":"Residential"},null,{"$f":"IF(ISERROR(VLOOKUP($B25, '3. Rate Classes'!$C$24:$H$45,6,0)), \"\", VLOOKUP($B25, '3. Rate Classes'!$C$24:$H$45,6,0))","v":"kWh"},null,{"$f":"VLOOKUP($B25, '10. Adj Conn. to Current WS'!$B$25:$R$47, 17,0)","v":4.6798698498131692E-3},null,{"$f":"VLOOKUP('9. Adj Network to Current WS'!$B25, '4. RRR Data'!$B$27:$M$49,11,0)","v":26402743.934},null,{"$f":"VLOOKUP('9. Adj Network to Current WS'!$B25, '4. RRR Data'!$B$27:$M$49,12,0)","v":0},null,{"$f":"IF(F25=\"\", \"\", IF(D25=\"kWh\", F25*H25, F25*J25))","v":123561.40528906415},null,{"$f":"IF(ISERROR(L25/$L$49), \"\", L25/$L$49)","v":0.29505850091370089},null,{"$f":"IF(ISERROR('8. Forecast Wholesale'!$P$117*N25), \"\", '8. Forecast Wholesale'!$P$117*N25)","v":135348.85932248927},null,{"$f":"IF(D25=\"\",\"\",IF(D25=\"kWh\",IF(H25<>0,P25/H25,),IF(J25<>0,P25/J25,0)))","v":5.1263179183506933E-3}]
[null,{"$f":"IF('3. Rate Classes'!Q25=1,'3. Rate Classes'!C25, 0)","v":"General Service Less Than 50 kW"},null,{"$f":"IF(ISERROR(VLOOKUP($B26, '3. Rate Classes'!$C$24:$H$45,6,0)), \"\", VLOOKUP($B26, '3. Rate Classes'!$C$24:$H$45,6,0))","v":"kWh"},null,{"$f":"VLOOKUP($B26, '10. Adj Conn. to Current WS'!$B$25:$R$47, 17,0)","v":4.0948861185865241E-3},null,{"$f":"VLOOKUP('9. Adj Network to Current WS'!$B26, '4. RRR Data'!$B$27:$M$49,11,0)","v":11622041.148},null,{"$f":"VLOOKUP('9. Adj Network to Current WS'!$B26, '4. RRR Data'!$B$27:$M$49,12,0)","v":0},null,47590.934966586588,null,0.11364478977454032,null,{"$f":"IF(ISERROR('8. Forecast Wholesale'!$P$117*N26), \"\", '8. Forecast Wholesale'!$P$117*N26)","v":52130.993061701294},null,4.4855281785568576E-3]
[null,{"$f":"IF('3. Rate Classes'!Q26=1,'3. Rate Classes'!C26, 0)","v":"General Service 50 to 1,499 kW"},null,{"$f":"IF(ISERROR(VLOOKUP($B27, '3. Rate Classes'!$C$24:$H$45,6,0)), \"\", VLOOKUP($B27, '3. Rate Classes'!$C$24:$H$45,6,0))","v":"kW"},null,{"$f":"VLOOKUP($B27, '10. Adj Conn. to Current WS'!$B$25:$R$47, 17,0)","v":1.6598913373556086},null,{"$f":"VLOOKUP('9. Adj Network to Current WS'!$B27, '4. RRR Data'!$B$27:$M$49,11,0)","v":23609369},null,{"$f":"VLOOKUP('9. Adj Network to Current WS'!$B27, '4. RRR Data'!$B$27:$M$49,12,0)","v":66539},null,110447.50969630484,null,0.26374316935295822,null,{"$f":"IF(ISERROR('8. Forecast Wholesale'!$P$117*N27), \"\", '8. Forecast Wholesale'!$P$117*N27)","v":120983.93035780323},null,1.8182408866650119]
[null,{"$f":"IF('3. Rate Classes'!Q27=1,'3. Rate Classes'!C27, 0)","v":"General Service Intermediate 1,000 To 4,999 kW"},null,{"$f":"IF(ISERROR(VLOOKUP($B28, '3. Rate Classes'!$C$24:$H$45,6,0)), \"\", VLOOKUP($B28, '3. Rate Classes'!$C$24:$H$45,6,0))","v":"kW"},null,{"$f":"VLOOKUP($B28, '10. Adj Conn. to Current WS'!$B$25:$R$47, 17,0)","v":1.9578430511270477},null,{"$f":"VLOOKUP('9. Adj Network to Current WS'!$B28, '4. RRR Data'!$B$27:$M$49,11,0)","v":23201291},null,{"$f":"VLOOKUP('9. Adj Network to Current WS'!$B28, '4. RRR Data'!$B$27:$M$49,12,0)","v":62667},null,122692.1504849787,null,0.2929827636006988,null,{"$f":"IF(ISERROR('8. Forecast Wholesale'!$P$117*N28), \"\", '8. Forecast Wholesale'!$P$117*N28)","v":134396.67974895402},null,2.1446164608000067]
[null,{"$f":"IF('3. Rate Classes'!Q28=1,'3. Rate Classes'!C28, 0)","v":"Sentinel Lighting"},null,{"$f":"IF(ISERROR(VLOOKUP($B29, '3. Rate Classes'!$C$24:$H$45,6,0)), \"\", VLOOKUP($B29, '3. Rate Classes'!$C$24:$H$45,6,0))","v":"kW"},null,{"$f":"VLOOKUP($B29, '10. Adj Conn. to Current WS'!$B$25:$R$47, 17,0)","v":1.2980788995919281},null,{"$f":"VLOOKUP('9. Adj Network to Current WS'!$B29, '4. RRR Data'!$B$27:$M$49,11,0)","v":21288},null,{"$f":"VLOOKUP('9. Adj Network to Current WS'!$B29, '4. RRR Data'!$B$27:$M$49,12,0)","v":72},null,93.461680770618827,null,2.2318185323758486E-4,null,{"$f":"IF(ISERROR('8. Forecast Wholesale'!$P$117*N29), \"\", '8. Forecast Wholesale'!$P$117*N29)","v":102.37769514738173},null,1.4219124326025241]
[null,{"$f":"IF('3. Rate Classes'!Q29=1,'3. Rate Classes'!C29, 0)","v":"Street Lighting"},null,{"$f":"IF(ISERROR(VLOOKUP($B30, '3. Rate Classes'!$C$24:$H$45,6,0)), \"\", VLOOKUP($B30, '3. Rate Classes'!$C$24:$H$45,6,0))","v":"kW"},null,{"$f":"VLOOKUP($B30, '10. Adj Conn. to Current WS'!$B$25:$R$47, 17,0)","v":1.2716571343981913},null,{"$f":"VLOOKUP('9. Adj Network to Current WS'!$B30, '4. RRR Data'!$B$27:$M$49,11,0)","v":1030212},null,{"$f":"VLOOKUP('9. Adj Network to Current WS'!$B30, '4. RRR Data'!$B$27:$M$49,12,0)","v":11311},null,14383.713847177942,null,3.4347594504864257E-2,null,{"$f":"IF(ISERROR('8. Forecast Wholesale'!$P$117*N30), \"\", '8. Forecast Wholesale'!$P$117*N30)","v":15755.884756102983},null,1.3929700960218356]
[null,{"$f":"IF('3. Rate Classes'!Q30=1,'3. Rate Classes'!C30, 0)","v":0},null,{"$f":"IF(ISERROR(VLOOKUP($B31, '3. Rate Classes'!$C$24:$H$45,6,0)), \"\", VLOOKUP($B31, '3. Rate Classes'!$C$24:$H$45,6,0))","v":""},null,{"$f":"VLOOKUP($B31, '10. Adj Conn. to Current WS'!$B$25:$R$47, 17,0)","v":""},null,{"$f":"VLOOKUP('9. Adj Network to Current WS'!$B31, '4. RRR Data'!$B$27:$M$49,11,0)","v":0},null,{"$f":"VLOOKUP('9. Adj Network to Current WS'!$B31, '4. RRR Data'!$B$27:$M$49,12,0)","v":0},null,"",null,"",null,{"$f":"IF(ISERROR('8. Forecast Wholesale'!$P$117*N31), \"\", '8. Forecast Wholesale'!$P$117*N31)","v":""},null,""]
[null,{"$f":"IF('3. Rate Classes'!Q31=1,'3. Rate Classes'!C31, 0)","v":0},null,{"$f":"IF(ISERROR(VLOOKUP($B32, '3. Rate Classes'!$C$24:$H$45,6,0)), \"\", VLOOKUP($B32, '3. Rate Classes'!$C$24:$H$45,6,0))","v":""},null,{"$f":"VLOOKUP($B32, '10. Adj Conn. to Current WS'!$B$25:$R$47, 17,0)","v":""},null,{"$f":"VLOOKUP('9. Adj Network to Current WS'!$B32, '4. RRR Data'!$B$27:$M$49,11,0)","v":0},null,{"$f":"VLOOKUP('9. Adj Network to Current WS'!$B32, '4. RRR Data'!$B$27:$M$49,12,0)","v":0},null,"",null,"",null,{"$f":"IF(ISERROR('8. Forecast Wholesale'!$P$117*N32), \"\", '8. Forecast Wholesale'!$P$117*N32)","v":""},null,""]
[null,{"$f":"IF('3. Rate Classes'!Q32=1,'3. Rate Classes'!C32, 0)","v":0},null,{"$f":"IF(ISERROR(VLOOKUP($B33, '3. Rate Classes'!$C$24:$H$45,6,0)), \"\", VLOOKUP($B33, '3. Rate Classes'!$C$24:$H$45,6,0))","v":""},null,{"$f":"VLOOKUP($B33, '10. Adj Conn. to Current WS'!$B$25:$R$47, 17,0)","v":""},null,{"$f":"VLOOKUP('9. Adj Network to Current WS'!$B33, '4. RRR Data'!$B$27:$M$49,11,0)","v":0},null,{"$f":"VLOOKUP('9. Adj Network to Current WS'!$B33, '4. RRR Data'!$B$27:$M$49,12,0)","v":0},null,"",null,"",null,{"$f":"IF(ISERROR('8. Forecast Wholesale'!$P$117*N33), \"\", '8. Forecast Wholesale'!$P$117*N33)","v":""},null,""]
[null,{"$f":"IF('3. Rate Classes'!Q33=1,'3. Rate Classes'!C33, 0)","v":0},null,{"$f":"IF(ISERROR(VLOOKUP($B34, '3. Rate Classes'!$C$24:$H$45,6,0)), \"\", VLOOKUP($B34, '3. Rate Classes'!$C$24:$H$45,6,0))","v":""},null,{"$f":"VLOOKUP($B34, '10. Adj Conn. to Current WS'!$B$25:$R$47, 17,0)","v":""},null,{"$f":"VLOOKUP('9. Adj Network to Current WS'!$B34, '4. RRR Data'!$B$27:$M$49,11,0)","v":0},null,{"$f":"VLOOKUP('9. Adj Network to Current WS'!$B34, '4. RRR Data'!$B$27:$M$49,12,0)","v":0},null,"",null,"",null,{"$f":"IF(ISERROR('8. Forecast Wholesale'!$P$117*N34), \"\", '8. Forecast Wholesale'!$P$117*N34)","v":""},null,""]
[null,{"$f":"IF('3. Rate Classes'!Q34=1,'3. Rate Classes'!C34, 0)","v":0},null,{"$f":"IF(ISERROR(VLOOKUP($B35, '3. Rate Classes'!$C$24:$H$45,6,0)), \"\", VLOOKUP($B35, '3. Rate Classes'!$C$24:$H$45,6,0))","v":""},null,{"$f":"VLOOKUP($B35, '10. Adj Conn. to Current WS'!$B$25:$R$47, 17,0)","v":""},null,{"$f":"VLOOKUP('9. Adj Network to Current WS'!$B35, '4. RRR Data'!$B$27:$M$49,11,0)","v":0},null,{"$f":"VLOOKUP('9. Adj Network to Current WS'!$B35, '4. RRR Data'!$B$27:$M$49,12,0)","v":0},null,"",null,"",null,{"$f":"IF(ISERROR('8. Forecast Wholesale'!$P$117*N35), \"\", '8. Forecast Wholesale'!$P$117*N35)","v":""},null,""]
[null,{"$f":"IF('3. Rate Classes'!Q35=1,'3. Rate Classes'!C35, 0)","v":0},null,{"$f":"IF(ISERROR(VLOOKUP($B36, '3. Rate Classes'!$C$24:$H$45,6,0)), \"\", VLOOKUP($B36, '3. Rate Classes'!$C$24:$H$45,6,0))","v":""},null,{"$f":"VLOOKUP($B36, '10. Adj Conn. to Current WS'!$B$25:$R$47, 17,0)","v":""},null,{"$f":"VLOOKUP('9. Adj Network to Current WS'!$B36, '4. RRR Data'!$B$27:$M$49,11,0)","v":0},null,{"$f":"VLOOKUP('9. Adj Network to Current WS'!$B36, '4. RRR Data'!$B$27:$M$49,12,0)","v":0},null,"",null,"",null,{"$f":"IF(ISERROR('8. Forecast Wholesale'!$P$117*N36), \"\", '8. Forecast Wholesale'!$P$117*N36)","v":""},null,""]
[null,{"$f":"IF('3. Rate Classes'!Q36=1,'3. Rate Classes'!C36, 0)","v":0},null,{"$f":"IF(ISERROR(VLOOKUP($B37, '3. Rate Classes'!$C$24:$H$45,6,0)), \"\", VLOOKUP($B37, '3. Rate Classes'!$C$24:$H$45,6,0))","v":""},null,{"$f":"VLOOKUP($B37, '10. Adj Conn. to Current WS'!$B$25:$R$47, 17,0)","v":""},null,{"$f":"VLOOKUP('9. Adj Network to Current WS'!$B37, '4. RRR Data'!$B$27:$M$49,11,0)","v":0},null,{"$f":"VLOOKUP('9. Adj Network to Current WS'!$B37, '4. RRR Data'!$B$27:$M$49,12,0)","v":0},null,"",null,"",null,{"$f":"IF(ISERROR('8. Forecast Wholesale'!$P$117*N37), \"\", '8. Forecast Wholesale'!$P$117*N37)","v":""},null,""]
[null,{"$f":"IF('3. Rate Classes'!Q37=1,'3. Rate Classes'!C37, 0)","v":0},null,{"$f":"IF(ISERROR(VLOOKUP($B38, '3. Rate Classes'!$C$24:$H$45,6,0)), \"\", VLOOKUP($B38, '3. Rate Classes'!$C$24:$H$45,6,0))","v":""},null,{"$f":"VLOOKUP($B38, '10. Adj Conn. to Current WS'!$B$25:$R$47, 17,0)","v":""},null,{"$f":"VLOOKUP('9. Adj Network to Current WS'!$B38, '4. RRR Data'!$B$27:$M$49,11,0)","v":0},null,{"$f":"VLOOKUP('9. Adj Network to Current WS'!$B38, '4. RRR Data'!$B$27:$M$49,12,0)","v":0},null,"",null,"",null,{"$f":"IF(ISERROR('8. Forecast Wholesale'!$P$117*N38), \"\", '8. Forecast Wholesale'!$P$117*N38)","v":""},null,""]
[null,{"$f":"IF('3. Rate Classes'!Q38=1,'3. Rate Classes'!C38, 0)","v":0},null,{"$f":"IF(ISERROR(VLOOKUP($B39, '3. Rate Classes'!$C$24:$H$45,6,0)), \"\", VLOOKUP($B39, '3. Rate Classes'!$C$24:$H$45,6,0))","v":""},null,{"$f":"VLOOKUP($B39, '10. Adj Conn. to Current WS'!$B$25:$R$47, 17,0)","v":""},null,{"$f":"VLOOKUP('9. Adj Network to Current WS'!$B39, '4. RRR Data'!$B$27:$M$49,11,0)","v":0},null,{"$f":"VLOOKUP('9. Adj Network to Current WS'!$B39, '4. RRR Data'!$B$27:$M$49,12,0)","v":0},null,"",null,"",null,{"$f":"IF(ISERROR('8. Forecast Wholesale'!$P$117*N39), \"\", '8. Forecast Wholesale'!$P$117*N39)","v":""},null,""]
[null,{"$f":"IF('3. Rate Classes'!Q39=1,'3. Rate Classes'!C39, 0)","v":0},null,{"$f":"IF(ISERROR(VLOOKUP($B40, '3. Rate Classes'!$C$24:$H$45,6,0)), \"\", VLOOKUP($B40, '3. Rate Classes'!$C$24:$H$45,6,0))","v":""},null,{"$f":"VLOOKUP($B40, '10. Adj Conn. to Current WS'!$B$25:$R$47, 17,0)","v":""},null,{"$f":"VLOOKUP('9. Adj Network to Current WS'!$B40, '4. RRR Data'!$B$27:$M$49,11,0)","v":0},null,{"$f":"VLOOKUP('9. Adj Network to Current WS'!$B40, '4. RRR Data'!$B$27:$M$49,12,0)","v":0},null,"",null,"",null,{"$f":"IF(ISERROR('8. Forecast Wholesale'!$P$117*N40), \"\", '8. Forecast Wholesale'!$P$117*N40)","v":""},null,""]
[null,{"$f":"IF('3. Rate Classes'!Q40=1,'3. Rate Classes'!C40, 0)","v":0},null,{"$f":"IF(ISERROR(VLOOKUP($B41, '3. Rate Classes'!$C$24:$H$45,6,0)), \"\", VLOOKUP($B41, '3. Rate Classes'!$C$24:$H$45,6,0))","v":""},null,{"$f":"VLOOKUP($B41, '10. Adj Conn. to Current WS'!$B$25:$R$47, 17,0)","v":""},null,{"$f":"VLOOKUP('9. Adj Network to Current WS'!$B41, '4. RRR Data'!$B$27:$M$49,11,0)","v":0},null,{"$f":"VLOOKUP('9. Adj Network to Current WS'!$B41, '4. RRR Data'!$B$27:$M$49,12,0)","v":0},null,"",null,"",null,{"$f":"IF(ISERROR('8. Forecast Wholesale'!$P$117*N41), \"\", '8. Forecast Wholesale'!$P$117*N41)","v":""},null,""]
[null,{"$f":"IF('3. Rate Classes'!Q41=1,'3. Rate Classes'!C41, 0)","v":0},null,{"$f":"IF(ISERROR(VLOOKUP($B42, '3. Rate Classes'!$C$24:$H$45,6,0)), \"\", VLOOKUP($B42, '3. Rate Classes'!$C$24:$H$45,6,0))","v":""},null,{"$f":"VLOOKUP($B42, '10. Adj Conn. to Current WS'!$B$25:$R$47, 17,0)","v":""},null,{"$f":"VLOOKUP('9. Adj Network to Current WS'!$B42, '4. RRR Data'!$B$27:$M$49,11,0)","v":0},null,{"$f":"VLOOKUP('9. Adj Network to Current WS'!$B42, '4. RRR Data'!$B$27:$M$49,12,0)","v":0},null,"",null,"",null,{"$f":"IF(ISERROR('8. Forecast Wholesale'!$P$117*N42), \"\", '8. Forecast Wholesale'!$P$117*N42)","v":""},null,""]
[null,{"$f":"IF('3. Rate Classes'!Q42=1,'3. Rate Classes'!C42, 0)","v":0},null,{"$f":"IF(ISERROR(VLOOKUP($B43, '3. Rate Classes'!$C$24:$H$45,6,0)), \"\", VLOOKUP($B43, '3. Rate Classes'!$C$24:$H$45,6,0))","v":""},null,{"$f":"VLOOKUP($B43, '10. Adj Conn. to Current WS'!$B$25:$R$47, 17,0)","v":""},null,{"$f":"VLOOKUP('9. Adj Network to Current WS'!$B43, '4. RRR Data'!$B$27:$M$49,11,0)","v":0},null,{"$f":"VLOOKUP('9. Adj Network to Current WS'!$B43, '4. RRR Data'!$B$27:$M$49,12,0)","v":0},null,"",null,"",null,{"$f":"IF(ISERROR('8. Forecast Wholesale'!$P$117*N43), \"\", '8. Forecast Wholesale'!$P$117*N43)","v":""},null,""]
[null,{"$f":"IF('3. Rate Classes'!Q43=1,'3. Rate Classes'!C43, 0)","v":0},null,{"$f":"IF(ISERROR(VLOOKUP($B44, '3. Rate Classes'!$C$24:$H$45,6,0)), \"\", VLOOKUP($B44, '3. Rate Classes'!$C$24:$H$45,6,0))","v":""},null,{"$f":"VLOOKUP($B44, '10. Adj Conn. to Current WS'!$B$25:$R$47, 17,0)","v":""},null,{"$f":"VLOOKUP('9. Adj Network to Current WS'!$B44, '4. RRR Data'!$B$27:$M$49,11,0)","v":0},null,{"$f":"VLOOKUP('9. Adj Network to Current WS'!$B44, '4. RRR Data'!$B$27:$M$49,12,0)","v":0},null,"",null,"",null,{"$f":"IF(ISERROR('8. Forecast Wholesale'!$P$117*N44), \"\", '8. Forecast Wholesale'!$P$117*N44)","v":""},null,""]
[null,{"$f":"IF('3. Rate Classes'!Q44=1,'3. Rate Classes'!C44, 0)","v":0},null,{"$f":"IF(ISERROR(VLOOKUP($B45, '3. Rate Classes'!$C$24:$H$45,6,0)), \"\", VLOOKUP($B45, '3. Rate Classes'!$C$24:$H$45,6,0))","v":""},null,{"$f":"VLOOKUP($B45, '10. Adj Conn. to Current WS'!$B$25:$R$47, 17,0)","v":""},null,{"$f":"VLOOKUP('9. Adj Network to Current WS'!$B45, '4. RRR Data'!$B$27:$M$49,11,0)","v":0},null,{"$f":"VLOOKUP('9. Adj Network to Current WS'!$B45, '4. RRR Data'!$B$27:$M$49,12,0)","v":0},null,"",null,"",null,{"$f":"IF(ISERROR('8. Forecast Wholesale'!$P$117*N45), \"\", '8. Forecast Wholesale'!$P$117*N45)","v":""},null,""]
[null,{"$f":"IF('3. Rate Classes'!Q45=1,'3. Rate Classes'!C45, 0)","v":0},null,{"$f":"IF(ISERROR(VLOOKUP($B46, '3. Rate Classes'!$C$24:$H$45,6,0)), \"\", VLOOKUP($B46, '3. Rate Classes'!$C$24:$H$45,6,0))","v":""},null,{"$f":"VLOOKUP($B46, '10. Adj Conn. to Current WS'!$B$25:$R$47, 17,0)","v":""},null,{"$f":"VLOOKUP('9. Adj Network to Current WS'!$B46, '4. RRR Data'!$B$27:$M$49,11,0)","v":0},null,{"$f":"VLOOKUP('9. Adj Network to Current WS'!$B46, '4. RRR Data'!$B$27:$M$49,12,0)","v":0},null,"",null,"",null,{"$f":"IF(ISERROR('8. Forecast Wholesale'!$P$117*N46), \"\", '8. Forecast Wholesale'!$P$117*N46)","v":""},null,""]
[]
[]
[null,null,null,null,null,null,null,null,null,null,null,{"$f":"SUM(L25:L46)","v":418769.17596488283}]

{"sheet":"13. Final 2014 RTS Rates","index":12,"n_rows":47,"n_cols":8,"rows_kept":47,"cut":false,"hidden":false,"merged":[[12,1,12,11]]}
[]
[]
[]
[]
[]
[]
[]
[]
[]
[]
[]
[]
[null,"Please enter the following Proposed RTS rates into your rates model."]
[]
[]
[]
[]
[]
[]
[]
[]
[]
[null,"Rate Class",null,"Unit",null,"Proposed RTSR Network",null,"Proposed RTSR Connection"]
[]
[]
[null,{"$f":"IF('3. Rate Classes'!Q24=1,'3. Rate Classes'!C24, 0)","v":"Residential"},null,{"$f":"IF(ISERROR(VLOOKUP($B26, '3. Rate Classes'!$C$24:$H$45,6,0)), \"\", VLOOKUP($B26, '3. Rate Classes'!$C$24:$H$45,6,0))","v":"kWh"},null,{"$f":"VLOOKUP($B26, '11. Adj Network to Forecast WS'!$B$25:$R$48,17,0)","v":6.3398938625831213E-3},null,{"$f":"VLOOKUP($B26, '12. Adj Conn. to Forecast WS'!$B$25:$R$48,17,0)","v":5.1263179183506933E-3}]
[null,{"$f":"IF('3. Rate Classes'!Q25=1,'3. Rate Classes'!C25, 0)","v":"General Service Less Than 50 kW"},null,{"$f":"IF(ISERROR(VLOOKUP($B27, '3. Rate Classes'!$C$24:$H$45,6,0)), \"\", VLOOKUP($B27, '3. Rate Classes'!$C$24:$H$45,6,0))","v":"kWh"},null,{"$f":"VLOOKUP($B27, '11. Adj Network to Forecast WS'!$B$25:$R$48,17,0)","v":5.8202304312238475E-3},null,{"$f":"VLOOKUP($B27, '12. Adj Conn. to Forecast WS'!$B$25:$R$48,17,0)","v":4.4855281785568576E-3}]
[null,{"$f":"IF('3. Rate Classes'!Q26=1,'3. Rate Classes'!C26, 0)","v":"General Service 50 to 1,499 kW"},null,{"$f":"IF(ISERROR(VLOOKUP($B28, '3. Rate Classes'!$C$24:$H$45,6,0)), \"\", VLOOKUP($B28, '3. Rate Classes'!$C$24:$H$45,6,0))","v":"kW"},null,{"$f":"VLOOKUP($B28, '11. Adj Network to Forecast WS'!$B$25:$R$48,17,0)","v":2.3930501014094485},null,{"$f":"VLOOKUP($B28, '12. Adj Conn. to Forecast WS'!$B$25:$R$48,17,0)","v":1.8182408866650119}]
[null,{"$f":"IF('3. Rate Classes'!Q27=1,'3. Rate Classes'!C27, 0)","v":"General Service Intermediate 1,000 To 4,999 kW"},null,{"$f":"IF(ISERROR(VLOOKUP($B29, '3. Rate Classes'!$C$24:$H$45,6,0)), \"\", VLOOKUP($B29, '3. Rate Classes'!$C$24:$H$45,6,0))","v":"kW"},null,{"$f":"VLOOKUP($B29, '11. Adj Network to Forecast WS'!$B$25:$R$48,17,0)","v":2.6765784695590664},null,{"$f":"VLOOKUP($B29, '12. Adj Conn. to Forecast WS'!$B$25:$R$48,17,0)","v":2.1446164608000067}]
[null,{"$f":"IF('3. Rate Classes'!Q28=1,'3. Rate Classes'!C28, 0)","v":"Sentinel Lighting"},null,{"$f":"IF(ISERROR(VLOOKUP($B30, '3. Rate Classes'!$C$24:$H$45,6,0)), \"\", VLOOKUP($B30, '3. Rate Classes'!$C$24:$H$45,6,0))","v":"kW"},null,{"$f":"VLOOKUP($B30, '11. Adj Network to Forecast WS'!$B$25:$R$48,17,0)","v":1.8139371735026752},null,{"$f":"VLOOKUP($B30, '12. Adj Conn. to Forecast WS'!$B$25:$R$48,17,0)","v":1.4219124326025241}]
[null,{"$f":"IF('3. Rate Classes'!Q29=1,'3. Rate Classes'!C29, 0)","v":"Street Lighting"},null,{"$f":"IF(ISERROR(VLOOKUP($B31, '3. Rate Classes'!$C$24:$H$45,6,0)), \"\", VLOOKUP($B31, '3. Rate Classes'!$C$24:$H$45,6,0))","v":"kW"},null,{"$f":"VLOOKUP($B31, '11. Adj Network to Forecast WS'!$B$25:$R$48,17,0)","v":1.8046871644244802},null,{"$f":"VLOOKUP($B31, '12. Adj Conn. to Forecast WS'!$B$25:$R$48,17,0)","v":1.3929700960218356}]
[null,{"$f":"IF('3. Rate Classes'!Q30=1,'3. Rate Classes'!C30, 0)","v":0},null,{"$f":"IF(ISERROR(VLOOKUP($B32, '3. Rate Classes'!$C$24:$H$45,6,0)), \"\", VLOOKUP($B32, '3. Rate Classes'!$C$24:$H$45,6,0))","v":""},null,{"$f":"VLOOKUP($B32, '11. Adj Network to Forecast WS'!$B$25:$R$48,17,0)","v":""},null,{"$f":"VLOOKUP($B32, '12. Adj Conn. to Forecast WS'!$B$25:$R$48,17,0)","v":""}]
[null,{"$f":"IF('3. Rate Classes'!Q31=1,'3. Rate Classes'!C31, 0)","v":0},null,{"$f":"IF(ISERROR(VLOOKUP($B33, '3. Rate Classes'!$C$24:$H$45,6,0)), \"\", VLOOKUP($B33, '3. Rate Classes'!$C$24:$H$45,6,0))","v":""},null,{"$f":"VLOOKUP($B33, '11. Adj Network to Forecast WS'!$B$25:$R$48,17,0)","v":""},null,{"$f":"VLOOKUP($B33, '12. Adj Conn. to Forecast WS'!$B$25:$R$48,17,0)","v":""}]
[null,{"$f":"IF('3. Rate Classes'!Q32=1,'3. Rate Classes'!C32, 0)","v":0},null,{"$f":"IF(ISERROR(VLOOKUP($B34, '3. Rate Classes'!$C$24:$H$45,6,0)), \"\", VLOOKUP($B34, '3. Rate Classes'!$C$24:$H$45,6,0))","v":""},null,{"$f":"VLOOKUP($B34, '11. Adj Network to Forecast WS'!$B$25:$R$48,17,0)","v":""},null,{"$f":"VLOOKUP($B34, '12. Adj Conn. to Forecast WS'!$B$25:$R$48,17,0)","v":""}]
[null,{"$f":"IF('3. Rate Classes'!Q33=1,'3. Rate Classes'!C33, 0)","v":0},null,{"$f":"IF(ISERROR(VLOOKUP($B35, '3. Rate Classes'!$C$24:$H$45,6,0)), \"\", VLOOKUP($B35, '3. Rate Classes'!$C$24:$H$45,6,0))","v":""},null,{"$f":"VLOOKUP($B35, '11. Adj Network to Forecast WS'!$B$25:$R$48,17,0)","v":""},null,{"$f":"VLOOKUP($B35, '12. Adj Conn. to Forecast WS'!$B$25:$R$48,17,0)","v":""}]
[null,{"$f":"IF('3. Rate Classes'!Q34=1,'3. Rate Classes'!C34, 0)","v":0},null,{"$f":"IF(ISERROR(VLOOKUP($B36, '3. Rate Classes'!$C$24:$H$45,6,0)), \"\", VLOOKUP($B36, '3. Rate Classes'!$C$24:$H$45,6,0))","v":""},null,{"$f":"VLOOKUP($B36, '11. Adj Network to Forecast WS'!$B$25:$R$48,17,0)","v":""},null,{"$f":"VLOOKUP($B36, '12. Adj Conn. to Forecast WS'!$B$25:$R$48,17,0)","v":""}]
[null,{"$f":"IF('3. Rate Classes'!Q35=1,'3. Rate Classes'!C35, 0)","v":0},null,{"$f":"IF(ISERROR(VLOOKUP($B37, '3. Rate Classes'!$C$24:$H$45,6,0)), \"\", VLOOKUP($B37, '3. Rate Classes'!$C$24:$H$45,6,0))","v":""},null,{"$f":"VLOOKUP($B37, '11. Adj Network to Forecast WS'!$B$25:$R$48,17,0)","v":""},null,{"$f":"VLOOKUP($B37, '12. Adj Conn. to Forecast WS'!$B$25:$R$48,17,0)","v":""}]
[null,{"$f":"IF('3. Rate Classes'!Q36=1,'3. Rate Classes'!C36, 0)","v":0},null,{"$f":"IF(ISERROR(VLOOKUP($B38, '3. Rate Classes'!$C$24:$H$45,6,0)), \"\", VLOOKUP($B38, '3. Rate Classes'!$C$24:$H$45,6,0))","v":""},null,{"$f":"VLOOKUP($B38, '11. Adj Network to Forecast WS'!$B$25:$R$48,17,0)","v":""},null,{"$f":"VLOOKUP($B38, '12. Adj Conn. to Forecast WS'!$B$25:$R$48,17,0)","v":""}]
[null,{"$f":"IF('3. Rate Classes'!Q37=1,'3. Rate Classes'!C37, 0)","v":0},null,{"$f":"IF(ISERROR(VLOOKUP($B39, '3. Rate Classes'!$C$24:$H$45,6,0)), \"\", VLOOKUP($B39, '3. Rate Classes'!$C$24:$H$45,6,0))","v":""},null,{"$f":"VLOOKUP($B39, '11. Adj Network to Forecast WS'!$B$25:$R$48,17,0)","v":""},null,{"$f":"VLOOKUP($B39, '12. Adj Conn. to Forecast WS'!$B$25:$R$48,17,0)","v":""}]
[null,{"$f":"IF('3. Rate Classes'!Q38=1,'3. Rate Classes'!C38, 0)","v":0},null,{"$f":"IF(ISERROR(VLOOKUP($B40, '3. Rate Classes'!$C$24:$H$45,6,0)), \"\", VLOOKUP($B40, '3. Rate Classes'!$C$24:$H$45,6,0))","v":""},null,{"$f":"VLOOKUP($B40, '11. Adj Network to Forecast WS'!$B$25:$R$48,17,0)","v":""},null,{"$f":"VLOOKUP($B40, '12. Adj Conn. to Forecast WS'!$B$25:$R$48,17,0)","v":""}]
[null,{"$f":"IF('3. Rate Classes'!Q39=1,'3. Rate Classes'!C39, 0)","v":0},null,{"$f":"IF(ISERROR(VLOOKUP($B41, '3. Rate Classes'!$C$24:$H$45,6,0)), \"\", VLOOKUP($B41, '3. Rate Classes'!$C$24:$H$45,6,0))","v":""},null,{"$f":"VLOOKUP($B41, '11. Adj Network to Forecast WS'!$B$25:$R$48,17,0)","v":""},null,{"$f":"VLOOKUP($B41, '12. Adj Conn. to Forecast WS'!$B$25:$R$48,17,0)","v":""}]
[null,{"$f":"IF('3. Rate Classes'!Q40=1,'3. Rate Classes'!C40, 0)","v":0},null,{"$f":"IF(ISERROR(VLOOKUP($B42, '3. Rate Classes'!$C$24:$H$45,6,0)), \"\", VLOOKUP($B42, '3. Rate Classes'!$C$24:$H$45,6,0))","v":""},null,{"$f":"VLOOKUP($B42, '11. Adj Network to Forecast WS'!$B$25:$R$48,17,0)","v":""},null,{"$f":"VLOOKUP($B42, '12. Adj Conn. to Forecast WS'!$B$25:$R$48,17,0)","v":""}]
[null,{"$f":"IF('3. Rate Classes'!Q41=1,'3. Rate Classes'!C41, 0)","v":0},null,{"$f":"IF(ISERROR(VLOOKUP($B43, '3. Rate Classes'!$C$24:$H$45,6,0)), \"\", VLOOKUP($B43, '3. Rate Classes'!$C$24:$H$45,6,0))","v":""},null,{"$f":"VLOOKUP($B43, '11. Adj Network to Forecast WS'!$B$25:$R$48,17,0)","v":""},null,{"$f":"VLOOKUP($B43, '12. Adj Conn. to Forecast WS'!$B$25:$R$48,17,0)","v":""}]
[null,{"$f":"IF('3. Rate Classes'!Q42=1,'3. Rate Classes'!C42, 0)","v":0},null,{"$f":"IF(ISERROR(VLOOKUP($B44, '3. Rate Classes'!$C$24:$H$45,6,0)), \"\", VLOOKUP($B44, '3. Rate Classes'!$C$24:$H$45,6,0))","v":""},null,{"$f":"VLOOKUP($B44, '11. Adj Network to Forecast WS'!$B$25:$R$48,17,0)","v":""},null,{"$f":"VLOOKUP($B44, '12. Adj Conn. to Forecast WS'!$B$25:$R$48,17,0)","v":""}]
[null,{"$f":"IF('3. Rate Classes'!Q43=1,'3. Rate Classes'!C43, 0)","v":0},null,{"$f":"IF(ISERROR(VLOOKUP($B45, '3. Rate Classes'!$C$24:$H$45,6,0)), \"\", VLOOKUP($B45, '3. Rate Classes'!$C$24:$H$45,6,0))","v":""},null,{"$f":"VLOOKUP($B45, '11. Adj Network to Forecast WS'!$B$25:$R$48,17,0)","v":""},null,{"$f":"VLOOKUP($B45, '12. Adj Conn. to Forecast WS'!$B$25:$R$48,17,0)","v":""}]
[null,{"$f":"IF('3. Rate Classes'!Q44=1,'3. Rate Classes'!C44, 0)","v":0},null,{"$f":"IF(ISERROR(VLOOKUP($B46, '3. Rate Classes'!$C$24:$H$45,6,0)), \"\", VLOOKUP($B46, '3. Rate Classes'!$C$24:$H$45,6,0))","v":""},null,{"$f":"VLOOKUP($B46, '11. Adj Network to Forecast WS'!$B$25:$R$48,17,0)","v":""},null,{"$f":"VLOOKUP($B46, '12. Adj Conn. to Forecast WS'!$B$25:$R$48,17,0)","v":""}]
[null,{"$f":"IF('3. Rate Classes'!Q45=1,'3. Rate Classes'!C45, 0)","v":0},null,{"$f":"IF(ISERROR(VLOOKUP($B47, '3. Rate Classes'!$C$24:$H$45,6,0)), \"\", VLOOKUP($B47, '3. Rate Classes'!$C$24:$H$45,6,0))","v":""},null,{"$f":"VLOOKUP($B47, '11. Adj Network to Forecast WS'!$B$25:$R$48,17,0)","v":""},null,{"$f":"VLOOKUP($B47, '12. Adj Conn. to Forecast WS'!$B$25:$R$48,17,0)","v":""}]

{"sheet":"hidden1","index":13,"n_rows":22,"n_cols":2,"rows_kept":22,"cut":false,"hidden":true,"merged":[]}
[{"$f":"IF('3. Rate Classes'!Q24=1, '3. Rate Classes'!C24, \"\")","v":"Residential"},1]
[{"$f":"IF('3. Rate Classes'!Q25=1, '3. Rate Classes'!C25, \"\")","v":"General Service Less Than 50 kW"},2]
[{"$f":"IF('3. Rate Classes'!Q26=1, '3. Rate Classes'!C26, \"\")","v":"General Service 50 to 1,499 kW"},3]
[{"$f":"IF('3. Rate Classes'!Q27=1, '3. Rate Classes'!C27, \"\")","v":"General Service Intermediate 1,000 To 4,999 kW"},4]
[{"$f":"IF('3. Rate Classes'!Q28=1, '3. Rate Classes'!C28, \"\")","v":"Sentinel Lighting"},5]
[{"$f":"IF('3. Rate Classes'!Q29=1, '3. Rate Classes'!C29, \"\")","v":"Street Lighting"},6]
[{"$f":"IF('3. Rate Classes'!Q30=1, '3. Rate Classes'!C30, \"\")","v":""},7]
[{"$f":"IF('3. Rate Classes'!Q31=1, '3. Rate Classes'!C31, \"\")","v":""},8]
[{"$f":"IF('3. Rate Classes'!Q32=1, '3. Rate Classes'!C32, \"\")","v":""},9]
[{"$f":"IF('3. Rate Classes'!Q33=1, '3. Rate Classes'!C33, \"\")","v":""},10]
[{"$f":"IF('3. Rate Classes'!Q34=1, '3. Rate Classes'!C34, \"\")","v":""},11]
[{"$f":"IF('3. Rate Classes'!Q35=1, '3. Rate Classes'!C35, \"\")","v":""},12]
[{"$f":"IF('3. Rate Classes'!Q36=1, '3. Rate Classes'!C36, \"\")","v":""},13]
[{"$f":"IF('3. Rate Classes'!Q37=1, '3. Rate Classes'!C37, \"\")","v":""},14]
[{"$f":"IF('3. Rate Classes'!Q38=1, '3. Rate Classes'!C38, \"\")","v":""},15]
[{"$f":"IF('3. Rate Classes'!Q39=1, '3. Rate Classes'!C39, \"\")","v":""},16]
[{"$f":"IF('3. Rate Classes'!Q40=1, '3. Rate Classes'!C40, \"\")","v":""},17]
[{"$f":"IF('3. Rate Classes'!Q41=1, '3. Rate Classes'!C41, \"\")","v":""},18]
[{"$f":"IF('3. Rate Classes'!Q42=1, '3. Rate Classes'!C42, \"\")","v":""},19]
[{"$f":"IF('3. Rate Classes'!Q43=1, '3. Rate Classes'!C43, \"\")","v":""},20]
[{"$f":"IF('3. Rate Classes'!Q44=1, '3. Rate Classes'!C44, \"\")","v":""},21]
[{"$f":"IF('3. Rate Classes'!Q45=1, '3. Rate Classes'!C45, \"\")","v":""},22]