{"text_format":"1","workbook":"xlsx","n_sheets":14,"sheets":["1. Information Sheet","4. Hidden","5. 2014 Continuity Schedule","6. Billing Det. for Def-Var","6. hidden","7. Allocating Def-Var Balances","8. Calculation of Def-Var RR","9. STS - Billing Det & Rate HID","14. RTSR RRR Data Copy","24. hidden","26. Hidden","14. Bill Impacts","lists","Sheet1"],"not_rendered":{"charts":0,"images":3,"macros":1,"external_links":4,"defined_names":228,"comments":0,"pivot_tables":0},"unopened":[],"bounds":{"document_bytes":16777216,"sheet_cells":100000,"rows_first":2000,"rows_last":500,"rows_between":2000,"halvings":0,"cell_chars":16384,"cell_head_chars":4096},"cells_cut":0,"cells_raw":0,"read":"whole","date_system":"1900"}

{"sheet":"1. Information Sheet","index":0,"n_rows":44,"n_cols":27,"rows_kept":44,"cut":false,"hidden":false,"merged":[[43,0,43,6],[21,5,21,9],[19,5,19,9],[13,5,13,11],[15,5,15,9],[17,5,17,9],[36,2,36,11],[38,2,38,13],[40,2,40,12],[23,5,23,9],[27,5,27,7],[29,5,29,7],[29,0,29,4],[25,5,25,9],[31,0,31,4],[31,5,31,7]]}
[null,null,null,null,null,null,null,null,null,null,null,null,null,null,null,null,null,null,null,null,"a",null,null,null,null,null,{"$f":"IF(OR(F16=\"\", F16=\"(if applicable)\"), F14, F14 & \" - \" & F16)","v":"Essex Powerlines Corporation - Amherstburg, LaSalle, Leamington, Tecumseh"}]
[]
[]
[]
[]
[]
[]
[]
[]
[]
[]
[null,null,null,null,null,null,null,null,null,null,null,null,"Version",1.1000000000000001]
[]
[null,null,null,null,"Utility Name   ","Essex Powerlines Corporation"]
[]
{"$rows_left_out":30}
{"sheet":"4. Hidden","index":1,"n_rows":210,"n_cols":18,"rows_kept":210,"cut":false,"hidden":true,"merged":[[43,1,46,8],[48,1,48,6],[49,1,49,6],[50,1,50,6],[51,1,51,6],[23,1,23,8],[25,1,30,8],[33,1,35,8],[36,1,39,8],[40,1,42,8],[52,1,52,6],[58,1,58,6],[53,1,53,6],[54,1,54,6],[55,1,55,6],[56,1,56,6],[71,1,71,6],[72,1,72,6],[65,1,65,6],[63,1,63,6],[57,1,57,6],[59,1,59,6],[62,1,62,6],[64,1,64,6],[66,1,66,6],[60,1,60,6],[61,1,61,6],[75,1,75,6],[76,1,76,6],[67,1,67,6],[68,1,68,6],[69,1,69,6],[70,1,70,6],[106,1,109,8],[111,1,111,6],[112,1,112,6],[83,1,83,6],[80,1,80,6],[81,1,81,6],[82,1,82,6],[77,1,77,6],[73,1,73,6],[74,1,74,6],[113,1,113,6],[114,1,114,6],[86,1,86,8],[88,1,93,8],[96,1,98,8],[99,1,102,8],[103,1,105,8],[120,1,120,6],[121,1,121,6],[122,1,122,6],[123,1,123,6],[124,1,124,6],[115,1,115,6],[116,1,116,6],[117,1,117,6],[118,1,118,6],[119,1,119,6],[130,1,130,6],[131,1,131,6],[132,1,132,6],[133,1,133,6],[134,1,134,6],[125,1,125,6],[126,1,126,6],[127,1,127,6],[128,1,128,6],[129,1,129,6],[140,1,140,6],[143,1,143,6],[144,1,144,6],[145,1,145,6],[146,1,146,6],[135,1,135,6],[136,1,136,6],[137,1,137,6],[138,1,138,6],[139,1,139,6],[169,1,172,8],[174,1,174,6],[175,1,175,6],[176,1,176,6],[177,1,177,6],[149,1,149,8],[151,1,156,8],[159,1,161,8],[162,1,165,8],[166,1,168,8],[183,1,183,6],[184,1,184,6],[185,1,185,6],[186,1,186,6],[187,1,187,6],[178,1,178,6],[179,1,179,6],[180,1,180,6],[181,1,181,6],[182,1,182,6],[193,1,193,6],[194,1,194,6],[195,1,195,6],[196,1,196,6],[197,1,197,6],[188,1,188,6],[189,1,189,6],[190,1,190,6],[191,1,191,6],[192,1,192,6],[203,1,203,6],[206,1,206,6],[207,1,207,6],[208,1,208,6],[209,1,209,6],[198,1,198,6],[199,1,199,6],[200,1,200,6],[201,1,201,6],[202,1,202,6]]}
[null,null,null,null,null,null,null,null,null,null,null,null,"Current Rate Classes","Changed to Rate Classes","Values in A that are NOT in B","Values in B that are Not in A","Count of A","Count of B"]
[null,null,null,null,null,null,null,null,null,null,null,null,"RESIDENTIAL","RESIDENTIAL",null,null,8,8]
[null,null,null,null,null,null,null,null,null,null,null,null,"GENERAL SERVICE LESS THAN 50 KW","GENERAL SERVICE LESS THAN 50 KW"]
[null,null,null,null,null,null,null,null,null,null,null,null,"GENERAL SERVICE 50 TO 2,999 KW","GENERAL SERVICE 50 TO 2,999 KW"]
[null,null,null,null,null,null,null,null,null,null,null,null,"GENERAL SERVICE 3,000 TO 4,999 KW","GENERAL SERVICE 3,000 TO 4,999 KW"]
[null,null,null,null,null,null,null,null,null,null,null,null,"UNMETERED SCATTERED LOAD","UNMETERED SCATTERED LOAD"]
[null,null,null,null,null,null,null,null,null,null,null,null,"SENTINEL LIGHTING","SENTINEL LIGHTING"]
[null,null,null,null,null,null,null,null,null,null,null,null,"STREET LIGHTING","STREET LIGHTING"]
[null,null,null,null,null,null,null,null,null,null,null,null,"microFIT","microFIT"]
[]
[]
[]
[]
[]
[]
{"$rows_left_out":196}
{"sheet":"5. 2014 Continuity Schedule","index":2,"n_rows":53,"n_cols":59,"rows_kept":53,"cut":false,"hidden":false,"merged":[[18,50,18,53],[18,54,18,56],[18,14,18,23],[18,4,18,13],[18,24,18,36],[18,37,18,49],[19,34,21,34],[19,54,21,54],[19,55,21,55],[19,56,21,56],[19,57,21,57],[19,44,21,44],[19,47,21,47],[19,48,21,48],[19,49,21,49],[19,29,21,29],[19,30,21,30],[19,31,21,31],[19,32,21,32],[19,33,21,33],[19,58,21,58],[19,35,21,35],[19,36,21,36],[19,50,21,50],[19,51,21,51],[19,52,21,52],[19,53,21,53],[19,37,21,37],[19,38,21,38],[19,39,21,39],[19,40,21,40],[19,41,21,41],[19,42,21,42],[19,43,21,43],[19,45,21,45],[19,46,21,46],[19,25,21,25],[19,26,21,26],[19,27,21,27],[19,28,21,28],[19,7,21,7],[19,13,21,13],[19,24,21,24],[19,12,21,12],[19,8,21,8],[19,9,21,9],[19,10,21,10],[19,11,21,11],[19,14,21,14],[19,15,21,15],[19,19,21,19],[19,20,21,20],[19,23,21,23],[14,2,14,3],[46,2,47,3],[19,16,21,16],[19,17,21,17],[19,18,21,18],[19,4,21,4],[19,5,21,5],[19,6,21,6],[19,21,21,21],[19,22,21,22],[19,2,21,2],[19,3,21,3]]}
[]
[]
[]
[]
[]
[]
[]
[]
[]
[]
[]
[]
[]
[]
[null,null,"Please complete the following continuity schedule for the following Deferral / Variance Accounts.  Enter information into green cells only.  \n\nIf you have received approval to dispose of balances from prior years, the starting point for entries in the 2015 DVA schedule below will be the balance sheet date as per your G/L for which you received approval.  For example, if in the 2014 EDR process (CoS or IRM) you received approval for the December 31, 2012 balances, the starting point for your entries below should be the 2011 year.  This will allow for the correct starting point for the 2012 opening balance columns for both principal and interest.\n\nPlease refer to the footnotes for further instructions.\n"]
{"$rows_left_out":39}
{"sheet":"6. Billing Det. for Def-Var","index":3,"n_rows":41,"n_cols":45,"rows_kept":41,"cut":false,"hidden":false,"merged":[[32,1,32,2],[12,0,12,7],[14,4,15,4],[14,5,15,5],[14,7,15,7],[38,0,38,7],[39,0,39,7],[40,0,40,7],[32,3,32,8],[14,15,15,15],[14,13,15,13],[14,11,15,11],[14,12,15,12],[36,0,37,7],[14,8,15,8],[14,6,15,6],[14,10,15,10],[14,9,15,9],[14,14,15,14],[30,1,30,2],[31,1,31,2]]}
[null,null,null,null,null,null,null,null,null,null,null,null,null,null,null,null,null,null,null,null,null,null,null,null,null,null,null,null,null,null,null,null,null,null,null,null,null,null,null,null,null,null,null,null,"As per Section 3.2.3 of the 2015 Filing Requirements for Electricity Distribution Rate Applications, an applicant may elect to dispose of the Group 1 account balances below the threshold.  If doing so, please select YES from the adjacent drop-down cell and also indicate so in the Manager's Summary.  If not, please select NO."]
[]
[]
[]
[]
[]
[]
[]
[]
[]
[]
[]
["In the green shaded cells, enter the most recent Board Approved volumetric forecast.  If there is a material difference between the latest Board-approved volumetric forecast and the most recent 12-month actual volumetric data, use the most recent 12-month actual data.  Do not enter data for the MicroFit class."]
[]
[null,null,null,null,"Billed kWh for Non-RPP Customers","Estimated kW for Non-RPP Customers",null,"1590 Recovery Share Proportion*","1595 Recovery Share Proportion (2008) 1","1595 Recovery Share Proportion (2009) 1","1595 Recovery Share Proportion (2010) 1","1595 Recovery Share Proportion (2011) 1","1595 Recovery Share Proportion (2012) 1","1568 LRAM Variance Account Class Allocation                           ($ amounts)","Number of Customers for Residential and GS<50 classes3"]
{"$rows_left_out":27}
{"sheet":"6. hidden","index":4,"n_rows":10,"n_cols":15,"rows_kept":10,"cut":false,"hidden":true,"merged":[[0,10,1,10],[0,12,1,12],[0,4,1,4],[0,5,1,5],[0,6,1,6],[0,7,1,7],[0,8,1,8],[0,9,1,9],[0,11,1,11]]}
[null,null,null,null,"Billed kWh for Non-RPP Customers","Estimated kW for Non-RPP Customers","Distribution Revenue 1","1590 Recovery Share Proportion*","1595 Recovery Share Proportion (2008) 2","1595 Recovery Share Proportion (2009) 2","1595 Recovery Share Proportion (2010) 2","1595 Recovery Share Proportion (2011) 2","1568 LRAM Variance Account Class Allocation"]
["Rate Class","Unit","Metered kWh","Metered kW"]
["RESIDENTIAL","$/kWh",251655122,0,49171885,null,0,0,0,0,0,0,0,0,26303]
["GENERAL SERVICE LESS THAN 50 KW","$/kWh",65841765,0,11417536,null,0,0,0,0,0,0,0,0,1891]
["GENERAL SERVICE 50 TO 2,999 KW","$/kW",170033148,445345,163068096,null,0,0,0,0,0,0,0,0,0]
["GENERAL SERVICE 3,000 TO 4,999 KW","$/kW",0,0,0,null,0,0,0,0,0,0,0,0,0]
["UNMETERED SCATTERED LOAD","$/kWh",1581327,0,309879,null,0,0,0,0,0,0,0,0,0]
["SENTINEL LIGHTING","$/kW",323368,903,45825,null,0,0,0,0,0,0,0,0,0]
["STREET LIGHTING","$/kW",6259173,18995,2238192,null,0,0,0,0,0,0,0,0,0]
["microFIT",0,0,0,0,null,0,0,0,0,0,0,0,0,0]

{"sheet":"7. Allocating Def-Var Balances","index":5,"n_rows":32,"n_cols":19,"rows_kept":32,"cut":false,"hidden":false,"merged":[[15,18,16,18],[12,0,13,8],[15,13,16,13],[15,14,16,14],[15,15,16,15],[15,3,16,3],[15,4,16,4],[15,2,16,2],[15,16,16,16],[15,17,16,17]]}
[]
[]
[]
[]
[]
[]
[]
[]
[]
[]
[]
[]
["No input required.  This workshseet allocates the deferral/variance account balances (Group 1, 1589, and 1568) to the appropriate classes as per the EDDVAR Report dated July 31, 2009"]
[]
["Allocation of Group 1 Accounts (including Account 1568)"]
{"$rows_left_out":18}
{"sheet":"8. Calculation of Def-Var RR","index":6,"n_rows":32,"n_cols":11,"rows_kept":32,"cut":false,"hidden":false,"merged":[[31,0,31,10],[16,11,17,11],[16,9,17,9],[16,10,17,10],[11,0,12,6],[16,4,17,4],[16,5,17,5],[16,8,17,8],[16,7,17,7],[16,6,17,6]]}
[]
[]
[]
[]
[]
[]
[]
[]
[]
[]
[]
["Input required at cell C15 only.  This workshseet calculates rate riders related to the Deferral/Variance Account Disposition (if applicable), associated rate riders for the global adjustment account (1589) and Account 1568.  Rate Riders will not be generated for the microFIT class."]
[]
[]
[" Please indicate the Rate Rider Recovery Period (in years)",null,4]
{"$rows_left_out":18}
{"sheet":"9. STS - Billing Det & Rate HID","index":7,"n_rows":24,"n_cols":9,"rows_kept":24,"cut":false,"hidden":true,"merged":[]}
[]
[]
[]
[]
[]
[]
[]
[]
[]
[]
["Shared Tax Savings"]
[{"$f":"\"Enter your \" & '1. Information Sheet'!F32 & \" Board-Approved Billing Determinents into columns B, C and D.\"","v":"Enter your 2010 Board-Approved Billing Determinents into columns B, C and D."}]
[]
[]
[]
{"$rows_left_out":10}
{"sheet":"14. RTSR RRR Data Copy","index":8,"n_rows":30,"n_cols":10,"rows_kept":30,"cut":false,"hidden":true,"merged":[[11,0,11,11]]}
[]
[]
[]
[]
[]
[]
[]
[]
[]
[]
[]
["In the green shaded cells, enter the most recent reported RRR billing determinants.  Please ensure that billing determinants are non-loss adjusted."]
[]
["Rate Class","Rate Description","Unit","Non-Loss Adjusted Metered kWh","Non-Loss Adjusted Metered kW","Applicable Loss Factor",null,"Load Factor","Loss Adjusted Billed kWh","Billed kW"]
["RESIDENTIAL","Retail Transmission Rate - Network Service Rate","$/kWh",251655122.40000001,0,1.0602]
{"$rows_left_out":16}
{"sheet":"24. hidden","index":9,"n_rows":9,"n_cols":4,"rows_kept":9,"cut":false,"hidden":true,"merged":[]}
["Rate Class","MFC Adjustment from R/C Model","DVR Adjustment from R/C Model"]
["RESIDENTIAL",12.94,null,1.52E-2]
["GENERAL SERVICE LESS THAN 50 KW",33.869999999999997,null,1.1599999999999999E-2]
["GENERAL SERVICE 50 TO 2,999 KW",224.32,null,2.1305999999999998]
["GENERAL SERVICE 3,000 TO 4,999 KW",1473.7,null,1.3666]
["UNMETERED SCATTERED LOAD",9.19,null,2.86E-2]
["SENTINEL LIGHTING",3.29,null,9.4397000000000002]
["STREET LIGHTING",3.18,null,8.6188000000000002]
["microFIT",5.4]

{"sheet":"26. Hidden","index":10,"n_rows":103,"n_cols":4,"rows_kept":103,"cut":false,"hidden":true,"merged":[]}
["RESIDENTIAL","RESIDENTIAL SERVICE CLASSIFICATION","Unit","Rate"]
["RESIDENTIAL"]
["RESIDENTIAL"]
["RESIDENTIAL"]
["RESIDENTIAL"]
["RESIDENTIAL"]
["RESIDENTIAL"]
["RESIDENTIAL"]
["RESIDENTIAL"]
["RESIDENTIAL"]
["RESIDENTIAL"]
[]
["GENERAL SERVICE LESS THAN 50 KW","GENERAL SERVICE LESS THAN 50 KW SERVICE CLASSIFICATION","Unit","Rate"]
["GENERAL SERVICE LESS THAN 50 KW"]
["GENERAL SERVICE LESS THAN 50 KW"]
{"$rows_left_out":89}
{"sheet":"14. Bill Impacts","index":11,"n_rows":57,"n_cols":27,"rows_kept":57,"cut":false,"hidden":true,"merged":[[41,6,41,7],[12,0,12,2],[21,6,21,7],[20,1,20,3],[20,4,20,7],[29,6,29,7],[30,6,30,7],[35,6,35,7],[36,6,36,7],[37,6,37,7],[38,6,38,7],[39,6,39,7],[40,6,40,7],[10,0,10,9],[34,6,34,7],[31,6,31,7],[32,6,32,7],[33,6,33,7],[23,6,23,7],[22,6,22,7],[25,6,25,7],[26,6,26,7],[27,6,27,7],[56,0,56,8],[42,6,42,7],[43,6,43,7],[44,6,44,7],[50,6,50,7],[45,6,45,7],[46,6,46,7],[47,6,47,7],[48,6,48,7],[49,6,49,7],[51,6,51,7],[52,6,52,7],[53,6,53,7]]}
[null,null,null,null,null,null,null,null,null,null,null,null,null,null,null,null,null,null,null,null,null,null,null,null,null,{"$f":"MATCH(A13,#REF!, 0)","v":{"$error":"#REF!"}},{"$f":"VLOOKUP(A13, lists!AO:AP,2,0)","v":"kWh"}]
[]
[]
[]
[]
[]
[]
[]
[]
[]
["Choose a Rate Class from the drop-down menu below and click UPDATE.\nFor Street Lighting and USL classes, please ensure that the number of customers is manually entered into cells B30 and B31.  \nClick the UPDATE button to refresh the sheet."]
[]
["RESIDENTIAL",null,null,null,null,{"$f":"IF(ISERROR(SEARCH(\"MicroFit\",A13,1))=FALSE,\"Bill impact presentation for this class does not exist.\", \"\")","v":""}]
[]
["Consumption",{"$f":"730*D15*B17","v":3650000},"kWh",10000,{"$f":"IF(AA1 = \"kWh\", \"\", \"kW\")","v":""}]
{"$rows_left_out":43}
{"sheet":"lists","index":12,"n_rows":214,"n_cols":55,"rows_kept":214,"cut":false,"hidden":true,"merged":[[12,51,12,52],[1,51,1,52],[0,51,0,52],[11,51,11,52],[10,51,10,52],[9,51,9,52],[8,51,8,52],[7,51,7,52],[5,51,5,52],[4,51,4,52],[3,51,3,52],[2,51,2,52],[6,51,6,52],[13,51,13,52],[14,51,14,52],[15,51,15,52],[16,51,16,52],[17,51,17,52]]}
["DISTRIBUTED GENERATION [DGEN]","Embedded Distributor",{"$f":"COUNTA(B1:B17)","v":4},null,null,null,null,null,"A Standby Service Charge will be applied for a month where standby power is not provided. The applicable rate is the approved Distribution Volumetric Rate of the applicable service class and is applied to gross metered demand or contracted amount, whichever is greater. A monthly administration charge of $200, for simple metering arrangements, or $500, for complex metering arrangements, will also be applied.",null,null,"Loss Factors",null,"Units","Units1","Units2",null,null,null,null,null,null,null,null,null,"Account History","Account set up charge/change of occupancy charge (plus credit agency costs if applicable)","Total Loss Factor – Embedded Distributor – Hydro One Networks Inc.",null,null,null,null,null,null,null,null,null,"Algoma Power Inc.","Algoma Power Inc.",null,"DISTRIBUTED GENERATION [DGEN]","kW",null,null,null,"Sub-Total:  Delivery (Distribution and Retail Transmission)"]
["EMBEDDED DISTRIBUTOR","General Service 3,000 to 4,999 kW",null,null,null,null,null,null,"Distribution Volumetric Rate",null,null,"Total Loss Factor – Primary Metered Customer",null,"$","$/kWh","$",null,null,null,null,null,null,null,null,null,"Account set up charge/change of occupancy charge","Administrative Billing Charge","Total Loss Factor – Primary Metered Customer",null,null,null,null,null,null,null,null,null,"Atikokan Hydro Inc.","Atikokan Hydro Inc.",null,"EMBEDDED DISTRIBUTOR","kW",null,null,null,"Wholesale Market Service Rate ",null,null,{"$f":"AU2*AV2","v":0},{"$f":"AU2","v":0},0,{"$f":"AX2*AY2","v":0},null,{"$f":"AZ2-AW2","v":0},{"$f":"BB2/AW2","v":{"$error":"#DIV/0!"}}]
["EMBEDDED DISTRIBUTOR","General Service 1,000 to 4,999 kW",null,null,null,null,null,null,"Distribution Volumetric Rate - $/kW of contracted amount",null,null,"Total Loss Factor – Primary Metered Customer < 5,000 kW",null,"$/kWh","$/kW","%",null,null,null,null,null,null,"MSC",null,null,"Account set up charge/change of occupancy charge (plus credit agency costs if applicable – Residential)","Bell Canada Pole Rentals","Total Loss Factor – Primary Metered Customer < 5,000 kW",null,null,null,null,null,null,null,null,null,"Bluewater Power Distribution Corporation","Bluewater Power Distribution Corporation",null,"EMBEDDED DISTRIBUTOR","kW",null,null,null,"Rural or Remote Electricity Rate Protection Charge (RRRP)",null,null,{"$f":"AU3*AV3","v":0},0,0,{"$f":"AX3*AY3","v":0},null,{"$f":"AZ3-AW3","v":0},{"$f":"BB3/AW3","v":{"$error":"#DIV/0!"}}]
["FARMS - SINGLE PHASE ENERGY-BILLED [F1]","General Service Equal To Or Greater Than 1,500 kW - Interval Metered",null,null,null,null,null,null,"Distribution Wheeling Service Rate",null,null,"Total Loss Factor – Primary Metered Customer > 5,000 kW",null,"$/kW","$/kVA",null,null,null,null,null,null,null,"SM_Rate_Adder",null,null,"Account set up charge/change of occupancy charge (plus credit agency costs if applicable)","Clearance Pole Attachment charge $/pole/year","Total Loss Factor – Primary Metered Customer > 5,000 kW",null,null,null,null,null,null,null,null,null,"Brant County Power Inc.","Brant County Power Inc.",null,"FARMS - SINGLE PHASE ENERGY-BILLED [F1]","kWh",null,null,null,"Standard Supply Service – Administration Charge (if applicable)",null,null,{"$f":"AU4*AV4","v":0},0,0,{"$f":"AX4*AY4","v":0},null,{"$f":"AZ4-AW4","v":0},{"$f":"BB4/AW4","v":{"$error":"#DIV/0!"}}]
["FARMS - THREE PHASE ENERGY-BILLED [F3]",null,null,null,null,null,null,null,"Electricity Rate",null,null,"Total Loss Factor – Secondary Metered Customer",null,"$/kVA",null,null,null,null,null,null,null,null,"MSC_Rate_Rider_",null,null,"Arrears certificate","Collection of account charge – no disconnection","Total Loss Factor – Secondary Metered Customer",null,null,null,null,null,null,null,null,null,"Brantford Power Inc.","Brantford Power Inc.",null,"FARMS - THREE PHASE ENERGY-BILLED [F3]","kWh",null,null,null,"Sub-Total:  Regulatory",null,null,{"$f":"SUM(AW2:AW4)","v":0},null,null,{"$f":"SUM(AZ2:BA4)","v":0},null,{"$f":"AZ5-AW5","v":0},{"$f":"BB5/AW5","v":{"$error":"#DIV/0!"}}]
["GENERAL SERVICE - COMMERCIAL",null,null,null,null,null,null,null,"Electricity Rate - All Additional kWh",null,null,"Total Loss Factor – Secondary Metered Customer < 5,000 kW",null,null,null,null,null,null,null,null,null,null,"VC",null,null,"Arrears certificate (credit reference)","Collection of account charge – no disconnection – after regular hours","Total Loss Factor – Secondary Metered Customer < 5,000 kW",null,null,null,null,null,null,null,null,null,"Burlington Hydro Inc.","Burlington Hydro Inc.",null,"GENERAL SERVICE - COMMERCIAL","kW",null,null,null,"Debt Retirement Charge (DRC)",null,null,{"$f":"AU6*AV6","v":0},{"$f":"AU6","v":0},{"$f":"AV6","v":0},{"$f":"AX6*AY6","v":0},null,{"$f":"AZ6-AW6","v":0},{"$f":"BB6/AW6","v":{"$error":"#DIV/0!"}}]
["GENERAL SERVICE - INSTITUTIONAL",null,null,null,null,null,null,null,"Electricity Rate - First 250 kWh",null,null,null,null,null,null,null,null,null,null,null,null,null,null,null,null,null,null,null,null,null,null,null,null,null,null,null,null,"Cambridge and North Dumfries Hydro Inc.","Cambridge and North Dumfries Hydro Inc.",null,"GENERAL SERVICE - INSTITUTIONAL","kW"]
["GENERAL SERVICE 1,000 TO 2,999 KW",null,null,null,null,null,null,null,"Electricity Rate -All Additional kWh",null,null,"Total Loss Factor – Secondary Metered Customer > 5,000 kW",null,null,null,null,null,null,null,null,null,null,"VC_Rate_Rider_",null,null,"Charge to certify cheque","Collection of account charge – no disconnection - during regular business hours","Total Loss Factor – Secondary Metered Customer > 5,000 kW",null,null,null,null,null,null,null,null,null,"Canadian Niagara Power Inc.","Canadian Niagara Power Inc.",null,"GENERAL SERVICE 1,000 TO 2,999 KW","kW",null,null,null,"Total Bill on RPP (before taxes)",null,null,null,null,null,null,null,{"$f":"AZ8-AW8","v":0}]
["GENERAL SERVICE 1,000 TO 4,999 KW",null,null,null,null,null,null,null,"Electricity Rate First 1,000 kWh",null,null,"Distribution Loss Factor - Secondary Metered Customer < 5,000 kW",null,null,null,null,null,null,null,null,null,null,"VC_GA_Rate_Rider_kW_",null,null,"Collection of Account Charge – No Disconnection","Collection of account charge – no disconnection – during regular hours",null,null,null,null,null,null,null,null,null,null,"Centre Wellington Hydro Ltd.","Centre Wellington Hydro Ltd.",null,"GENERAL SERVICE 1,000 TO 4,999 KW","kW",null,null,null,"HST",null,null,{"$f":"AV9*AW8","v":0},null,{"$f":"AV9","v":0},{"$f":"AY9*AZ8","v":0},null,{"$f":"AZ9-AW9","v":0},{"$f":"BB9/AW9","v":{"$error":"#DIV/0!"}}]
["GENERAL SERVICE 1,000 TO 4,999 KW - INTERVAL METERS",null,null,null,null,null,null,null,"Electricity Rate First 25,000 kWh",null,null,"Distribution Loss Factor - Secondary Metered Customer > 5,000 kW",null,null,null,null,null,null,null,null,null,null,"VC_LV_Rate",null,null,"Credit Card Convenience Charge","Collection/Disconnection/Load Limiter/Reconnection – if in Community",null,null,null,null,null,null,null,null,null,null,"Chapleau Public Utilities Corporation","Chapleau Public Utilities Corporation",null,"GENERAL SERVICE 1,000 TO 4,999 KW - INTERVAL METERS","kW",null,null,null,"Total Bill (including HST)",null,null,{"$f":"AW9+AW8","v":0},null,null,{"$f":"AZ9+AZ8","v":0},null,{"$f":"AZ10-AW10","v":0},{"$f":"BB10/AW10","v":{"$error":"#DIV/0!"}}]
["GENERAL SERVICE 1,000 TO 4,999 KW (CO-GENERATION)",null,null,null,null,null,null,null,"Electricity Rate First 6,000 kWh",null,null,"Distribution Loss Factor - Primary Metered Customer < 5,000 kW",null,null,null,null,null,null,null,null,null,null,"RTSR_Network",null,null,"Credit check (plus credit agency costs)","Credit Card Convenience Charge",null,null,null,null,null,null,null,null,null,null,"Collus PowerStream Corporation","Collus PowerStream Corporation",null,"GENERAL SERVICE 1,000 TO 4,999 KW (CO-GENERATION)","kW",null,null,null,"Ontario Clean Energy Benefit (OCEB)",null,null,{"$f":"-0.1*AW10","v":0},null,{"$f":"AV11","v":0},{"$f":"-0.1*AZ10","v":0},null,{"$f":"AZ11-AW11","v":0},{"$f":"BB11/AW11","v":{"$error":"#DIV/0!"}}]
["GENERAL SERVICE 1,500 TO 4,999 KW",null,null,null,null,null,null,null,"Electricity Rate Next 1,500 kWh",null,null,"Distribution Loss Factor - Primary Metered Customer > 5,000 kW",null,null,null,null,null,null,null,null,null,null,"RTSR_Connection",null,null,"Credit reference Letter","Disconnect/Reconnect at meter – after regular hours",null,null,null,null,null,null,null,null,null,null,"Cooperative Hydro Embrun Inc.","Cooperative Hydro Embrun Inc.",null,"GENERAL SERVICE 1,500 TO 4,999 KW","kW",null,null,null,"Total Bill on RPP (including OCEB)",null,null,{"$f":"AW10+AW11","v":0},null,null,{"$f":"AZ10+AZ11","v":0},null,{"$f":"AZ12-AW12","v":0},{"$f":"BB12/AW12","v":{"$error":"#DIV/0!"}}]
["GENERAL SERVICE 2,500 TO 4,999 KW",null,null,null,null,null,null,null,"General Service 1,500 to 4,999 kW customer",null,null,null,null,null,null,null,null,null,null,null,null,null,null,null,null,null,null,null,null,null,null,null,null,null,null,null,null,"E.L.K. Energy Inc.","E.L.K. Energy Inc.",null,"GENERAL SERVICE 2,500 TO 4,999 KW","kW"]
["GENERAL SERVICE 3,000 TO 4,999 KW",null,null,null,null,null,null,null,"General Service 50 to 1,499 kW customer",null,null,"Total Loss Factor - Embedded Distributor",null,null,null,null,null,null,null,null,null,null,"RTSR_Network_Interval",null,null,"Credit reference/credit check (plus credit agency costs – General Service)","Disconnect/Reconnect at meter – during regular hours",null,null,null,null,null,null,null,null,null,null,"Enersource Hydro Mississauga Inc.","Enersource Hydro Mississauga Inc.",null,"GENERAL SERVICE 3,000 TO 4,999 KW","kW",null,null,null,"Total Bill on TOU (before taxes)",null,null,null,null,null,null,null,{"$f":"AZ14-AW14","v":0}]
["GENERAL SERVICE 3,000 TO 4,999 KW - INTERMEDIATE USE",null,null,null,null,null,null,null,"General Service Large Use customer",null,null,"Total Loss Factor – Embedded Distributor – Hydro One Networks Inc.",null,null,null,null,null,null,null,null,null,null,"RTSR_Connection_Interval",null,null,"Credit Reference/credit check (plus credit agency costs)","Disconnect/Reconnect at pole – after regular hours",null,null,null,null,null,null,null,null,null,null,"Entegrus Powerlines Inc.","Entegrus Powerlines Inc.",null,"GENERAL SERVICE 3,000 TO 4,999 KW - INTERMEDIATE USE","kW",null,null,null,"HST",null,null,{"$f":"AV15*AW14","v":0},null,{"$f":"AV15","v":0},{"$f":"AY15*AZ14","v":0},null,{"$f":"AZ15-AW15","v":0},{"$f":"BB15/AW15","v":{"$error":"#DIV/0!"}}]
{"$rows_left_out":200}
{"sheet":"Sheet1","index":13,"n_rows":0,"n_cols":0,"rows_kept":0,"cut":false,"hidden":true,"merged":[]}