{"text_format":"1","workbook":"xlsx","n_sheets":10,"sheets":["1. Info","2. Table of Contents","3. Data_Input_Sheet","4. Rate_Base","5. Utility Income","6. Taxes_PILs","7. Cost_of_Capital","8. Rev_Def_Suff","9. Rev_Reqt","10. Tracking_Sheet"],"not_rendered":{"charts":0,"images":4,"macros":1,"external_links":10,"defined_names":14,"comments":0,"pivot_tables":0},"unopened":[],"bounds":{"document_bytes":16777216,"sheet_cells":100000,"rows_first":2000,"rows_last":500,"rows_between":2000,"halvings":0,"cell_chars":16384,"cell_head_chars":4096},"cells_cut":0,"cells_raw":0,"read":"whole","date_system":"1900"}

{"sheet":"1. Info","index":0,"n_rows":99,"n_cols":29,"rows_kept":99,"cut":false,"hidden":false,"merged":[[27,1,27,3],[34,1,40,11],[0,2,1,12],[2,2,3,12],[27,4,27,9],[25,6,25,10],[21,1,21,2],[15,6,15,12],[17,6,17,10],[19,6,19,10],[21,6,21,10],[23,6,23,10],[23,1,23,2],[25,1,25,3]]}
[null,null,null,null,null,null,null,null,null,null,null,null,null,null,null,null,null,null,null,null,null,null,null,null,null,null,null,null,{"$f":"IF('3. Data_Input_Sheet'!M12=0, \"\", '3. Data_Input_Sheet'!M12)","v":"Technical Conference"}]
[]
[]
[]
[]
[]
[]
[]
[]
[]
[null,null,null,null,null,null,null,null,null,null,null,null,null,null,null,"Version",5]
[]
[]
[]
[]
[null,null,null,null,null,"Utility Name   ","North Bay Hydro Distribution Limited"]
[]
[null,null,null,null,null,"Service Territory","North Bay "]
[]
[null,null,null,null,null,"Assigned EB Number","EB-2014-0099",null,null,null,null,null,null,null,null,null,null,null,null,null,null,null,null,null,null,null,"Company Name"]
[null,null,null,null,null,null,null,null,null,null,null,null,null,null,null,null,null,null,null,null,null,null,null,null,null,1,"Algoma Power Inc."]
[null,null,null,null,null,"Name and Title","Melissa Casson, Regulatory Manager",null,null,null,null,null,null,null,null,null,null,null,null,null,null,null,null,null,null,2,"Atikokan Hydro Inc."]
[null,null,null,null,null,null,null,null,null,null,null,null,null,null,null,null,null,null,null,null,null,null,null,null,null,3,"Attawapiskat Power Corp. "]
[null,null,null,null,null,"Phone Number   ","705-474-8100 xt: 300",null,null,null,null,null,null,null,null,null,null,null,null,null,null,null,null,null,null,4,"Bluewater Power Distribution Corporation"]
[null,null,null,null,null,null,null,null,null,null,null,null,null,null,null,null,null,null,null,null,null,null,null,null,null,5,"Brant County Power Inc."]
[null,null,null,null,null,"Email Address   ","mcasson@northbayhydro.com",null,null,null,null,null,null,null,null,null,null,null,null,null,null,null,null,null,null,6,"Brantford Power Inc."]
[null,null,null,null,null,null,null,null,null,null,null,null,null,null,null,null,null,null,null,null,null,null,null,null,null,7,"Burlington Hydro Inc."]
[null,null,null,null,null,null,null,null,null,null,null,null,null,null,null,null,null,null,null,null,null,null,null,null,null,8,"Cambridge and North Dumfries Hydro Inc."]
[null,null,null,null,null,null,null,null,null,null,null,null,null,null,null,null,null,null,null,null,null,null,null,null,null,9,"Canadian Niagara Power Inc."]
[null,null,null,null,null,null,null,null,null,null,null,null,null,null,null,null,null,null,null,null,null,null,null,null,null,10,"Centre Wellington Hydro Ltd."]
[null,null,null,null,null,null,null,null,null,null,null,null,null,null,null,null,null,null,null,null,null,null,null,null,null,11,"Chapleau Public Utilities Corporation"]
[null,null,null,null,null,null,null,null,null,null,null,null,null,null,null,null,null,null,null,null,null,null,null,null,null,12,"Clinton Power Corporation"]
[null,null,null,null,null,null,null,null,null,null,null,null,null,null,null,null,null,null,null,null,null,null,null,null,null,13,"COLLUS Power Corporation"]
[null,null,null,null,null,null,null,null,null,null,null,null,null,null,null,null,null,null,null,null,null,null,null,null,null,14,"Cooperative Hydro Embrun Inc."]
[null,null,null,null,null,null,null,null,null,null,null,null,null,null,null,null,null,null,null,null,null,null,null,null,null,15,"E.L.K. Energy Inc."]
[null,null,null,null,null,null,null,null,null,null,null,null,null,null,null,null,null,null,null,null,null,null,null,null,null,16,"Enersource Hydro Mississauga Inc."]
[null,null,null,null,null,null,null,null,null,null,null,null,null,null,null,null,null,null,null,null,null,null,null,null,null,17,"Entegrus Powerlines Inc."]
[null,null,null,null,null,null,null,null,null,null,null,null,null,null,null,null,null,null,null,null,null,null,null,null,null,18,"ENWIN Utilities Ltd."]
[null,null,null,null,null,null,null,null,null,null,null,null,null,null,null,null,null,null,null,null,null,null,null,null,null,19,"Erie Thames Powerlines Corporation"]
[null,null,null,null,null,null,null,null,null,null,null,null,null,null,null,null,null,null,null,null,null,null,null,null,null,20,"Espanola Regional Hydro Distribution Corporation"]
[null,null,null,null,null,null,null,null,null,null,null,null,null,null,null,null,null,null,null,null,null,null,null,null,null,21,"Essex Powerlines Corporation"]
[null,null,null,null,null,null,null,null,null,null,null,null,null,null,null,null,null,null,null,null,null,null,null,null,null,22,"Festival Hydro Inc."]
[null,null,null,null,null,null,null,null,null,null,null,null,null,null,null,null,null,null,null,null,null,null,null,null,null,23,"Festival Hydro Inc. - Hensall"]
[null,null,null,null,null,null,null,null,null,null,null,null,null,null,null,null,null,null,null,null,null,null,null,null,null,24,"Fort Albany Power Corporation"]
[null,null,null,null,null,null,null,null,null,null,null,null,null,null,null,null,null,null,null,null,null,null,null,null,null,25,"Fort Frances Power Corporation"]
[null,null,null,null,null,null,null,null,null,null,null,null,null,null,null,null,null,null,null,null,null,null,null,null,null,26,"Greater Sudbury Hydro Inc."]
[null,null,null,null,null,null,null,null,null,null,null,null,null,null,null,null,null,null,null,null,null,null,null,null,null,27,"Grimsby Power Inc."]
[null,null,null,null,null,null,null,null,null,null,null,null,null,null,null,null,null,null,null,null,null,null,null,null,null,28,"Guelph Hydro Electric Systems Inc."]
[null,null,null,null,null,null,null,null,null,null,null,null,null,null,null,null,null,null,null,null,null,null,null,null,null,29,"Haldimand County Hydro Inc."]
[null,null,null,null,null,null,null,null,null,null,null,null,null,null,null,null,null,null,null,null,null,null,null,null,null,30,"Halton Hills Hydro Inc."]
[null,null,null,null,null,null,null,null,null,null,null,null,null,null,null,null,null,null,null,null,null,null,null,null,null,31,"Hearst Power Distribution Company Limited"]
[null,null,null,null,null,null,null,null,null,null,null,null,null,null,null,null,null,null,null,null,null,null,null,null,null,32,"Horizon Utilities Corporation"]
[null,null,null,null,null,null,null,null,null,null,null,null,null,null,null,null,null,null,null,null,null,null,null,null,null,33,"Hydro 2000 Inc."]
[null,null,null,null,null,null,null,null,null,null,null,null,null,null,null,null,null,null,null,null,null,null,null,null,null,34,"Hydro Hawkesbury Inc."]
[null,null,null,null,null,null,null,null,null,null,null,null,null,null,null,null,null,null,null,null,null,null,null,null,null,35,"Hydro One Brampton Networks Inc."]
[null,null,null,null,null,null,null,null,null,null,null,null,null,null,null,null,null,null,null,null,null,null,null,null,null,36,"Hydro One Networks Inc."]
[null,null,null,null,null,null,null,null,null,null,null,null,null,null,null,null,null,null,null,null,null,null,null,null,null,37,"Hydro Ottawa Limited"]
[null,null,null,null,null,null,null,null,null,null,null,null,null,null,null,null,null,null,null,null,null,null,null,null,null,38,"Innisfil Hydro Distribution Systems Limited"]
[null,null,null,null,null,null,null,null,null,null,null,null,null,null,null,null,null,null,null,null,null,null,null,null,null,39,"Kashechewan Power Corporation"]
[null,null,null,null,null,null,null,null,null,null,null,null,null,null,null,null,null,null,null,null,null,null,null,null,null,40,"Kenora Hydro Electric Corporation Ltd."]
[null,null,null,null,null,null,null,null,null,null,null,null,null,null,null,null,null,null,null,null,null,null,null,null,null,41,"Kingston Hydro Corporation"]
[null,null,null,null,null,null,null,null,null,null,null,null,null,null,null,null,null,null,null,null,null,null,null,null,null,42,"Kitchener-Wilmot Hydro Inc."]
[null,null,null,null,null,null,null,null,null,null,null,null,null,null,null,null,null,null,null,null,null,null,null,null,null,43,"Lakefront Utilities Inc."]
[null,null,null,null,null,null,null,null,null,null,null,null,null,null,null,null,null,null,null,null,null,null,null,null,null,44,"Lakeland Power Distribution Ltd."]
[null,null,null,null,null,null,null,null,null,null,null,null,null,null,null,null,null,null,null,null,null,null,null,null,null,45,"London Hydro Inc."]
[null,null,null,null,null,null,null,null,null,null,null,null,null,null,null,null,null,null,null,null,null,null,null,null,null,46,"Midland Power Utility Corporation"]
[null,null,null,null,null,null,null,null,null,null,null,null,null,null,null,null,null,null,null,null,null,null,null,null,null,47,"Milton Hydro Distribution inc."]
[null,null,null,null,null,null,null,null,null,null,null,null,null,null,null,null,null,null,null,null,null,null,null,null,null,48,"Newmarket - Tay Power Distribution Ltd."]
[null,null,null,null,null,null,null,null,null,null,null,null,null,null,null,null,null,null,null,null,null,null,null,null,null,49,"Niagara Peninsula Energy Inc."]
[null,null,null,null,null,null,null,null,null,null,null,null,null,null,null,null,null,null,null,null,null,null,null,null,null,50,"Niagara-on-the-Lake Hydro Inc."]
[null,null,null,null,null,null,null,null,null,null,null,null,null,null,null,null,null,null,null,null,null,null,null,null,null,51,"Norfolk Power Distribution Inc."]
[null,null,null,null,null,null,null,null,null,null,null,null,null,null,null,null,null,null,null,null,null,null,null,null,null,52,"North Bay Hydro Distribution Limited"]
[null,null,null,null,null,null,null,null,null,null,null,null,null,null,null,null,null,null,null,null,null,null,null,null,null,53,"Northern Ontario Wires Inc."]
[null,null,null,null,null,null,null,null,null,null,null,null,null,null,null,null,null,null,null,null,null,null,null,null,null,54,"Oakville Hydro Electricity Distribution Inc."]
[null,null,null,null,null,null,null,null,null,null,null,null,null,null,null,null,null,null,null,null,null,null,null,null,null,55,"Orangeville Hydro Limited"]
[null,null,null,null,null,null,null,null,null,null,null,null,null,null,null,null,null,null,null,null,null,null,null,null,null,56,"Orillia Power Distribution Corporation"]
[null,null,null,null,null,null,null,null,null,null,null,null,null,null,null,null,null,null,null,null,null,null,null,null,null,57,"Oshawa PUC Networks Inc."]
[null,null,null,null,null,null,null,null,null,null,null,null,null,null,null,null,null,null,null,null,null,null,null,null,null,58,"Ottawa River Power Corporation"]
[null,null,null,null,null,null,null,null,null,null,null,null,null,null,null,null,null,null,null,null,null,null,null,null,null,59,"Parry Sound Power Corporation"]
[null,null,null,null,null,null,null,null,null,null,null,null,null,null,null,null,null,null,null,null,null,null,null,null,null,60,"Peterborough Distribution Incorporated"]
[null,null,null,null,null,null,null,null,null,null,null,null,null,null,null,null,null,null,null,null,null,null,null,null,null,61,"PowerStream Inc."]
[null,null,null,null,null,null,null,null,null,null,null,null,null,null,null,null,null,null,null,null,null,null,null,null,null,62,"PUC Distribution Inc."]
[null,null,null,null,null,null,null,null,null,null,null,null,null,null,null,null,null,null,null,null,null,null,null,null,null,63,"Renfrew Hydro Inc."]
[null,null,null,null,null,null,null,null,null,null,null,null,null,null,null,null,null,null,null,null,null,null,null,null,null,64,"Rideau St. Lawrence Distribution Inc."]
[null,null,null,null,null,null,null,null,null,null,null,null,null,null,null,null,null,null,null,null,null,null,null,null,null,65,"Sioux Lookout Hydro Inc."]
[null,null,null,null,null,null,null,null,null,null,null,null,null,null,null,null,null,null,null,null,null,null,null,null,null,66,"St. Thomas Energy Inc."]
[null,null,null,null,null,null,null,null,null,null,null,null,null,null,null,null,null,null,null,null,null,null,null,null,null,67,"Thunder Bay Hydro Electricity Distribution Inc."]
[null,null,null,null,null,null,null,null,null,null,null,null,null,null,null,null,null,null,null,null,null,null,null,null,null,68,"Tillsonburg Hydro Inc."]
[null,null,null,null,null,null,null,null,null,null,null,null,null,null,null,null,null,null,null,null,null,null,null,null,null,69,"Toronto Hydro-Electric System Limited"]
[null,null,null,null,null,null,null,null,null,null,null,null,null,null,null,null,null,null,null,null,null,null,null,null,null,70,"Veridian Connections Inc."]
[null,null,null,null,null,null,null,null,null,null,null,null,null,null,null,null,null,null,null,null,null,null,null,null,null,71,"Wasaga Distribution Inc."]
[null,null,null,null,null,null,null,null,null,null,null,null,null,null,null,null,null,null,null,null,null,null,null,null,null,72,"Waterloo North Hydro Inc."]
[null,null,null,null,null,null,null,null,null,null,null,null,null,null,null,null,null,null,null,null,null,null,null,null,null,73,"Welland Hydro-Electric System Corp."]
[null,null,null,null,null,null,null,null,null,null,null,null,null,null,null,null,null,null,null,null,null,null,null,null,null,74,"Wellington North Power Inc."]
[null,null,null,null,null,null,null,null,null,null,null,null,null,null,null,null,null,null,null,null,null,null,null,null,null,75,"West Coast Huron Energy Inc."]
[null,null,null,null,null,null,null,null,null,null,null,null,null,null,null,null,null,null,null,null,null,null,null,null,null,76,"West Perth Power Inc."]
[null,null,null,null,null,null,null,null,null,null,null,null,null,null,null,null,null,null,null,null,null,null,null,null,null,77,"Westario Power Inc."]
[null,null,null,null,null,null,null,null,null,null,null,null,null,null,null,null,null,null,null,null,null,null,null,null,null,78,"Whitby Hydro Electric Corporation"]
[null,null,null,null,null,null,null,null,null,null,null,null,null,null,null,null,null,null,null,null,null,null,null,null,null,79,"Woodstock Hydro Services Inc."]

{"sheet":"2. Table of Contents","index":1,"n_rows":29,"n_cols":9,"rows_kept":29,"cut":false,"hidden":false,"merged":[[0,2,0,4],[1,3,1,6],[3,3,3,4],[28,1,28,11],[24,1,24,7],[25,1,25,7],[26,1,26,7],[27,1,27,11]]}
[]
[]
[]
[]
[]
[]
[]
[]
[]
[]
[null,null,null,"1. Info",null,null,null,null,"6. Taxes_PILs"]
[]
[null,null,null,"2. Table of Contents",null,null,null,null,"7. Cost_of_Capital"]
[]
[null,null,null,"3. Data_Input_Sheet",null,null,null,null,"8. Rev_Def_Suff"]
[]
[null,null,null,"4. Rate_Base",null,null,null,null,"9. Rev_Reqt"]
[]
[null,null,null,"5. Utility Income",null,null,null,null,"10. Tracking Sheet"]
[]
[]
[]
[]
["Notes:"]
["(1)","Pale green cells represent inputs"]
["(2)","Pale green boxes at the bottom of each page are for additional notes"]
["(3)","Pale yellow cells represent drop-down lists"]
["(4)","Please note that this model uses MACROS.  Before starting, please ensure that macros have been enabled."]
["(5)","Completed versions of the Revenue Requirement Work Form are required to be filed in working Microsoft Excel format."]

{"sheet":"3. Data_Input_Sheet","index":2,"n_rows":78,"n_cols":23,"rows_kept":78,"cut":false,"hidden":false,"merged":[[87,2,88,20],[70,2,70,20],[71,2,71,20],[69,2,69,20],[86,2,86,20],[74,2,74,20],[80,2,80,20],[72,2,72,20],[75,2,75,20],[76,2,76,20],[81,2,81,20],[82,2,82,20],[83,2,83,20],[84,2,84,20],[85,2,85,20],[73,2,73,20],[79,2,79,20],[77,2,78,20],[0,2,0,12],[7,4,7,20],[19,24,20,24],[68,2,68,20],[3,2,3,10],[1,2,1,10],[2,2,2,10],[11,14,12,14],[11,6,12,6],[11,16,12,16],[11,4,12,4],[11,8,12,8],[11,20,12,20],[11,12,12,12]]}
[null,null,null,null,null,null,null,null,null,null,null,null,null,null,null,null,null,null,null,null,{"$f":"CONCATENATE('2. Table of Contents'!$F$6,\" \",'2. Table of Contents'!$G$6)","v":" "}]
[]
[]
[]
[]
[]
[]
[]
[null,"Data Input (1)"]
[]
[]
[null,null,null,null,"Initial Application",null,"(2)",null,{"$f":"IF(ISBLANK(M12),\"\",\"Adjustments\")","v":"Adjustments"},null,null,null,"Technical Conference",null,"(6)",null,{"$f":"IF(ISBLANK(M12),\"\",\"Adjustments\")","v":"Adjustments"},null,null,null,"Per Board Decision"]
[]
[]
[null,1,"Rate Base"]
[null,null,"   Gross Fixed Assets (average)",null,{"$f":"('[3]FA Continuity 2015'!$D$46+'[3]FA Continuity 2015'!$G$46)/2","v":112135566.35778388},null,null,null,-1138619.9624615908,null,null,null,{"$f":"IF(ISBLANK(E16),0,E16+I16)","v":110996946.39532229},null,null,null,null,null,null,null,{"$f":"IF(ISBLANK(E16),\"\",E16+I16+Q16)","v":110996946.39532229}]
[null,null,"   Accumulated Depreciation (average)",null,{"$f":"-('[3]FA Continuity 2015'!$I$46+'[3]FA Continuity 2015'!$L$46)/2","v":-56947420.078200713},null,"(5)",null,154300.64361115545,null,null,null,{"$f":"IF(ISBLANK(E17),0,E17+I17)","v":-56793119.434589557},null,null,null,null,null,null,null,{"$f":"IF(ISBLANK(E17),\"\",E17+I17+Q17)","v":-56793119.434589557}]
[null,null,"Allowance for Working Capital:"]
[null,null,"   Controllable Expenses",null,{"$f":"'[3]Return on Capital'!$AK$26","v":7091420.0577740688},null,null,null,-7465,null,null,null,{"$f":"IF(ISBLANK(E19),0,E19+I19)","v":7083955.0577740688},null,null,null,null,null,null,null,{"$f":"IF(ISBLANK(E19),\"\",E19+I19+Q19)","v":7083955.0577740688}]
[null,null,"   Cost of Power",null,{"$f":"'[3]Return on Capital'!$AK$27","v":61164704.678000011},null,null,null,3748136.865708597,null,null,null,{"$f":"IF(ISBLANK(E20),0,E20+I20)","v":64912841.543708608},null,null,null,null,null,null,null,{"$f":"IF(ISBLANK(E20),\"\",E20+I20+Q20)","v":64912841.543708608}]
[null,null,"   Working Capital Rate (%)",null,{"$f":"'[3]Return on Capital'!$AJ$30","v":0.13},null,"(9)",null,null,null,null,null,{"$f":"IF(ISBLANK(E21),0,E21)","v":0.13},null,"(9)",null,null,null,null,null,{"$f":"IF(ISBLANK(M21),IF(ISBLANK(E21),0,E21),M21)","v":0.13},null,"(9)"]
[]
[null,2,"Utility Income"]
[null,null,"Operating Revenues:"]
[null,null,"   Distribution Revenue at Current Rates",null,{"$f":"'[3]2015 Rev Deficiency'!$D$8","v":11031905.665980808},null,null,null,{"$f":"IF(ISBLANK(M25),\"\",IF(ISBLANK(E25),\"\",M25-E25))","v":-55050.775170238689},null,null,null,{"$f":"'[4]2015 Rev Deficiency'!$D$8","v":10976854.89081057},null,null,null,{"$f":"IF(ISBLANK(U25),\"\",IF(ISBLANK(M25),\"\",U25-M25))","v":""}]
[null,null,"   Distribution Revenue at Proposed Rates",null,{"$f":"'[3]2015 Rev Deficiency'!$D$7+'[3]2015 Rev Deficiency'!$D$8","v":12695006.36585268},null,null,null,{"$f":"IF(ISBLANK(M26),\"\",IF(ISBLANK(E26),\"\",M26-E26))","v":-104763.55431864969},null,null,null,{"$f":"M25+'[4]2015 Rev Deficiency'!$D$7","v":12590242.81153403},null,null,null,{"$f":"IF(ISBLANK(U26),\"\",IF(ISBLANK(M26),\"\",U26-M26))","v":""}]
[null,null,"   Other Revenue:"]
[null,null,"      Specific Service Charges",null,{"$f":"-'[3]Revenue Requirement'!$F$25","v":578856},null,null,null,{"$f":"IF(ISBLANK(M28),\"\",IF(ISBLANK(E28),\"\",M28-E28))","v":0},null,null,null,{"$f":"E28","v":578856},null,null,null,{"$f":"IF(ISBLANK(U28),\"\",IF(ISBLANK(M28),\"\",U28-M28))","v":""}]
[null,null,"      Late Payment Charges",null,{"$f":"-'[3]Revenue Requirement'!$D$23","v":136983},null,null,null,{"$f":"IF(ISBLANK(M29),\"\",IF(ISBLANK(E29),\"\",M29-E29))","v":0},null,null,null,{"$f":"E29","v":136983},null,null,null,{"$f":"IF(ISBLANK(U29),\"\",IF(ISBLANK(M29),\"\",U29-M29))","v":""}]
[null,null,"      Other Distribution Revenue",null,{"$f":"-'[3]Revenue Requirement'!$F$49- SUM(E28,E29,E31)","v":338372.31999999983},null,null,null,{"$f":"IF(ISBLANK(M30),\"\",IF(ISBLANK(E30),\"\",M30-E30))","v":0},null,null,null,338372.31999999983,null,null,null,{"$f":"IF(ISBLANK(U30),\"\",IF(ISBLANK(M30),\"\",U30-M30))","v":""}]
[null,null,"      Other Income and Deductions",null,{"$f":"-SUM('[3]Revenue Requirement'!$D$45+'[3]Revenue Requirement'!$D$48)","v":99723},null,null,null,{"$f":"IF(ISBLANK(M31),\"\",IF(ISBLANK(E31),\"\",M31-E31))","v":0},null,null,null,99723,null,null,null,{"$f":"IF(ISBLANK(U31),\"\",IF(ISBLANK(M31),\"\",U31-M31))","v":""}]
[]
[null,null,null,"Total Revenue Offsets",{"$f":"SUM(E28:E31)","v":1153934.3199999998},null,"(7)",null,{"$f":"IF(ISBLANK(M33),\"\",IF(ISBLANK(E33),\"\",M33-E33))","v":0},null,null,null,{"$f":"SUM(M28:M31)","v":1153934.3199999998},null,null,null,{"$f":"IF(ISBLANK(U33),\"\",IF(ISBLANK(M33),\"\",U33-M33))","v":""}]
[]
[null,null,"Operating Expenses:"]
[null,null,"   OM+A Expenses",null,{"$f":"'[3]2015 Rev Deficiency'!$D$13+'[3]2015 Rev Deficiency'!$D$14","v":7004843.8077740688},null,null,null,-7465,null,null,null,{"$f":"IF(ISBLANK(E36),\"\",E36+I36)","v":6997378.8077740688},null,null,null,null,null,null,null,{"$f":"IF(ISBLANK(E36),\"\",E36+I36+Q36)","v":6997378.8077740688}]
[null,null,"   Depreciation/Amortization",null,{"$f":"'[3]2015 Rev Deficiency'!$D$16","v":2569662.1967412103},null,null,null,-57411.436587295961,null,null,null,{"$f":"IF(ISBLANK(E37),\"\",E37+I37)","v":2512250.7601539143},null,null,null,null,null,null,null,{"$f":"IF(ISBLANK(E37),\"\",E37+I37+Q37)","v":2512250.7601539143}]
[null,null,"   Property taxes",null,{"$f":"'[3]2015 Rev Deficiency'!$D$17","v":69876.25},null,null,null,0,null,null,null,{"$f":"IF(ISBLANK(E38),\"\",E38+I38)","v":69876.25},null,null,null,null,null,null,null,{"$f":"IF(ISBLANK(E38),\"\",E38+I38+Q38)","v":69876.25}]
[null,null,"   Capital taxes",null,{"$f":"IF(ISBLANK(E48),\"\",E48)","v":""},null,null,null,null,null,null,null,{"$f":"IF(ISBLANK(M48),\"\",M48)","v":""},null,null,null,null,null,null,null,{"$f":"IF(ISBLANK(U48),\"\",U48)","v":""}]
[null,null,"   Other expenses",null,{"$f":"'[3]2015 Rev Deficiency'!$D$15","v":16700},null,null,null,0,null,null,null,{"$f":"IF(ISBLANK(E40),\"\",E40+I40)","v":16700},null,null,null,null,null,null,null,{"$f":"IF(ISBLANK(E40),\"\",E40+I40+Q40)","v":16700}]
[]
[null,3,"Taxes/PILs"]
[null,null,"Taxable Income:"]
[null,null,null,"Adjustments required to arrive at taxable income",{"$f":"'[3]2015 Rev Deficiency'!$D$32","v":-1706426.1854383964},null,"(3)",null,null,null,null,null,{"$f":"'[4]2015 Rev Deficiency'!$D$32","v":-1679482.8424853701}]
[null,null,"Utility Income Taxes and Rates:"]
[null,null,"   Income taxes (not grossed up)",null,{"$f":"'[3]2015 Rev Deficiency'!$D$73+E51","v":127664.06871953694},null,null,null,null,null,null,null,{"$f":"'[4]2015 Rev Deficiency'!$D$76","v":160820.14763694428}]
[null,null,"   Income taxes (grossed up)",null,{"$f":"IF(ISBLANK(E46),\"\",E46/(1-SUM(E49:E50)))","v":162510.24028283116},null,null,null,null,null,null,null,{"$f":"IF(ISBLANK(M46),\"\",M46/(1-SUM(M49:M50)))","v":218802.92195502625},null,null,null,null,null,null,null,{"$f":"IF(ISBLANK(U46),\"\",U46/(1-SUM(U49:U50)))","v":""}]
[null,null,"   Capital Taxes"]
[null,null,"   Federal tax (%)",null,0.15,null,null,null,null,null,null,null,{"$f":"E49","v":0.15}]
[null,null,"   Provincial tax (%)",null,{"$f":"'[3]2015 Rev Deficiency'!$D$74-E49","v":6.4424466437612127E-2},null,null,null,null,null,null,null,0.115]
[null,null,"Income Tax Credits",null,{"$f":"-'[3]2015 Rev Deficiency'!$D$75","v":-20725},null,null,null,null,null,null,null,{"$f":"-'[5]2015 Rev Deficiency'!$D$75","v":-20725}]
[null,null,"   "]
[null,4,"Capitalization/Cost of Capital"]
[null,null,"Capital Structure:"]
[null,null,"   Long-term debt Capitalization Ratio (%)",null,0.56000000000000005,null,null,null,null,null,null,null,{"$f":"E55","v":0.56000000000000005}]
[null,null,"   Short-term debt Capitalization Ratio (%)",null,0.04,null,"(8)",null,null,null,null,null,{"$f":"E56","v":0.04},null,"(8)",null,null,null,null,null,null,null,"(8)"]
[null,null,"   Common Equity Capitalization Ratio (%)",null,0.4,null,null,null,null,null,null,null,0.4]
[null,null,"   Prefered Shares Capitalization Ratio (%)"]
[null,null,null,null,{"$f":"SUM(E55:E58)","v":1},null,null,null,null,null,null,null,{"$f":"SUM(M55:M58)","v":1},null,null,null,null,null,null,null,{"$f":"SUM(U55:U58)","v":0}]
[null,null,null,null,{"$f":"IF(ISBLANK(E57),\"\",IF(SUM(E55:E58)=100%,\"\",\"Capital Structure must total 100%\"))","v":""},null,null,null,null,null,null,null,{"$f":"IF(ISBLANK(M57),\"\",IF(SUM(M55:M58)=100%,\"\",\"Capital Structure must total 100%\"))","v":""},null,null,null,null,null,null,null,{"$f":"IF(ISBLANK(U57),\"\",IF(SUM(U55:U58)=100%,\"\",\"Capital Structure must total 100%\"))","v":""}]
[null,null,"Cost of Capital"]
[null,null,"   Long-term debt Cost Rate (%)",null,{"$f":"'[3]Return on Capital'!$AK$8","v":4.3842394150519062E-2},null,null,null,null,null,null,null,{"$f":"'[5]Return on Capital'!$AK$8","v":4.2412392414060966E-2}]
[null,null,"   Short-term debt Cost Rate (%)",null,{"$f":"'[3]Return on Capital'!$AK$9","v":2.1100000000000001E-2},null,null,null,null,null,null,null,{"$f":"'[5]Return on Capital'!$AK$9","v":2.1600000000000001E-2}]
[null,null,"   Common Equity Cost Rate (%)",null,{"$f":"'[3]Return on Capital'!$AK$10","v":9.3600000000000003E-2},null,null,null,null,null,null,null,{"$f":"'[5]Return on Capital'!$AK$10","v":9.2999999999999999E-2}]
[null,null,"   Prefered Shares Cost Rate (%)"]
[]
[]
["Notes:"]
[null,"General","Data inputs are required on Sheets 3. Data from Sheet 3 will automatically complete calculations on sheets 4 through 9 (Rate Base through Revenue Requirement).  Sheets 4 through 9 do not require any inputs except for notes that the Applicant may wish to enter to support the results.  Pale green cells are available on sheets 4 through 9 to enter both footnotes beside key cells and the related text for the notes at the bottom of each sheet."]
[null,"(1)","All inputs are in dollars ($) except where inputs are individually identified as percentages (%)"]
[null,"(2)","Data in column E is for Application as originally filed.  For updated revenue requirement as a result of interrogatory responses, technical or settlement conferences, etc., use colimn M and Adjustments in column I"]
[null,"(3)","Net of addbacks and deductions to arrive at taxable income."]
[null,"(4)","Average of Gross Fixed Assets at beginning and end of the Test Year"]
[null,"(5)","Average of Accumulated Depreciation at the beginning and end of the Test Year.  Enter as a negative amount."]
[null,"(6)","Select option from drop-down list by clicking on cell M10.  This column allows for the application update reflecting the end of discovery or Argument-in-Chief.  Also, the outcome of any Settlement Process can be reflected."]
[null,"(7)","Input total revenue offsets for deriving the base revenue requirement from the service revenue requirement"]
[null,"(8)","4.0% unless an Applicant has proposed or been approved for another amount."]
[null,"(9)","Starting with 2013, default Working Capital Allowance factor is 13% (of Cost of Power plus controllable expenses).  Alternatively, WCA factor based on lead-lag study or approved WCA factor for another distributor, with supporting rationale."]

{"sheet":"4. Rate_Base","index":3,"n_rows":35,"n_cols":23,"rows_kept":35,"cut":false,"hidden":false,"merged":[[2,2,2,6],[3,2,3,6],[0,2,0,10],[1,2,1,22],[32,1,32,22],[17,6,18,6],[17,10,18,10],[17,22,18,22],[17,3,18,3],[21,3,21,22],[17,14,18,14],[17,18,18,18],[33,3,33,22],[34,3,34,22],[35,3,35,22],[40,3,40,22],[41,3,41,22],[36,3,36,22],[37,3,37,22],[38,3,38,22],[39,3,39,22]]}
[]
[]
[]
[]
[]
[null,"Rate Base and Working Capital"]
[]
[]
[]
[null,null,null,"Rate Base"]
[null,"Line No.",null,"Particulars",null,null,"Initial Application",null,null,null,{"$f":"IF(ISBLANK('3. Data_Input_Sheet'!M12),\"\",'3. Data_Input_Sheet'!I12)","v":"Adjustments"},null,null,null,{"$f":"IF(ISBLANK('3. Data_Input_Sheet'!M12),\" \",'3. Data_Input_Sheet'!M12)","v":"Technical Conference"},null,null,null,{"$f":"IF(ISBLANK('3. Data_Input_Sheet'!Q12),\"\",'3. Data_Input_Sheet'!Q12)","v":"Adjustments"},null,null,null,{"$f":"'3. Data_Input_Sheet'!U12","v":"Per Board Decision"}]
[]
[null,1,null,"Gross Fixed Assets (average)","(3)",null,{"$f":"'3. Data_Input_Sheet'!E16","v":112135566.35778388},null,null,null,{"$f":"'3. Data_Input_Sheet'!I16","v":-1138619.9624615908},null,null,null,{"$f":"G13+K13","v":110996946.39532229},null,null,null,{"$f":"'3. Data_Input_Sheet'!Q16","v":0},null,null,null,{"$f":"G13+K13+S13","v":110996946.39532229}]
[null,2,null,"Accumulated Depreciation (average)","(3)",null,{"$f":"'3. Data_Input_Sheet'!E17","v":-56947420.078200713},null,null,null,{"$f":"'3. Data_Input_Sheet'!I17","v":154300.64361115545},null,null,null,{"$f":"G14+K14","v":-56793119.434589557},null,null,null,{"$f":"'3. Data_Input_Sheet'!Q17","v":0},null,null,null,{"$f":"G14+K14+S14","v":-56793119.434589557}]
[null,3,null,"Net Fixed Assets (average)","(3)",null,{"$f":"SUM(G13:G14)","v":55188146.279583171},null,null,null,{"$f":"SUM(K13:K14)","v":-984319.31885043532},null,null,null,{"$f":"SUM(O13:O14)","v":54203826.960732736},null,null,null,{"$f":"SUM(S13:S14)","v":0},null,null,null,{"$f":"SUM(W13:W14)","v":54203826.960732736}]
[]
[null,4,null,"Allowance for Working Capital","(1)",null,{"$f":"G30","v":8873296.2156506311},null,null,null,{"$f":"K30","v":486287.34254211746},null,null,null,{"$f":"O30","v":9359583.5581927486},null,null,null,{"$f":"S30","v":0},null,null,null,{"$f":"W30","v":9359583.5581927486}]
[null,null,null,"Total Rate Base",null,null,{"$f":"G17+G15","v":64061442.495233804},null,null,null,{"$f":"K17+K15","v":-498031.97630831786},null,null,null,{"$f":"O17+O15","v":63563410.518925488},null,null,null,{"$f":"S17+S15","v":0},null,null,null,{"$f":"W15+W17","v":63563410.518925488}]
[null,5]
[null,null,"(1)","Allowance for Working Capital - Derivation"]
[]
[]
[]
[null,6,null,"Controllable Expenses",null,null,{"$f":"'3. Data_Input_Sheet'!E19","v":7091420.0577740688},null,null,null,{"$f":"'3. Data_Input_Sheet'!I19","v":-7465},null,null,null,{"$f":"G24+K24","v":7083955.0577740688},null,null,null,{"$f":"'3. Data_Input_Sheet'!Q19","v":0},null,null,null,{"$f":"G24+K24+S24","v":7083955.0577740688}]
[null,7,null,"Cost of Power",null,null,{"$f":"'3. Data_Input_Sheet'!E20","v":61164704.678000011},null,null,null,{"$f":"'3. Data_Input_Sheet'!I20","v":3748136.865708597},null,null,null,{"$f":"G25+K25","v":64912841.543708608},null,null,null,{"$f":"'3. Data_Input_Sheet'!Q20","v":0},null,null,null,{"$f":"G25+K25+S25","v":64912841.543708608}]
[null,8,null,"Working Capital Base",null,null,{"$f":"SUM(G24:G25)","v":68256124.735774085},null,null,null,{"$f":"K24+K25","v":3740671.865708597},null,null,null,{"$f":"SUM(O24:O25)","v":71996796.601482674},null,null,null,{"$f":"S24+S25","v":0},null,null,null,{"$f":"SUM(W24:W25)","v":71996796.601482674}]
[]
[null,9,null,"Working Capital Rate % ","(2)",null,{"$f":"'3. Data_Input_Sheet'!E21","v":0.13},null,null,null,{"$f":"O28-G28","v":0},null,null,null,{"$f":"'3. Data_Input_Sheet'!M21","v":0.13},null,null,null,{"$f":"W28-O28","v":0},null,null,null,{"$f":"'3. Data_Input_Sheet'!U21","v":0.13}]
[]
[null,10,null,"Working Capital Allowance",null,null,{"$f":"G26*G28","v":8873296.2156506311},null,null,null,{"$f":"O30-G30","v":486287.34254211746},null,null,null,{"$f":"O26*O28","v":9359583.5581927486},null,null,null,{"$f":"W30-O30","v":0},null,null,null,{"$f":"W26*W28","v":9359583.5581927486}]
[]
[]
[null,"Notes"]
[null,"(2)",null,"Some Applicants may have a unique rate as a result of a lead-lag study.  The default rate for 2014 cost of service applications is 13%."]
[null,"(3)",null,"Average of opening and closing balances for the year."]

{"sheet":"5. Utility Income","index":4,"n_rows":49,"n_cols":22,"rows_kept":49,"cut":false,"hidden":false,"merged":[[56,3,56,21],[54,3,54,21],[55,3,55,21],[51,3,51,21],[26,5,27,5],[53,3,53,21],[52,3,52,21],[47,5,48,5],[47,21,48,21],[41,1,41,21],[36,13,37,13],[26,21,27,21],[26,13,27,13],[34,13,35,13],[26,17,27,17],[34,17,35,17],[0,2,0,11],[2,2,2,7],[3,2,3,7],[1,2,1,21],[17,21,18,21],[17,13,18,13],[17,17,18,17],[7,5,7,21],[17,5,18,5],[17,9,18,9],[26,9,27,9],[34,21,35,21],[34,5,35,5],[36,21,37,21],[36,5,37,5],[36,17,37,17],[47,9,48,9],[47,13,48,13],[47,17,48,17],[34,9,35,9],[36,9,37,9]]}
[]
[]
[]
[]
[]
[]
[]
[]
[]
[]
[null,"Utility Income"]
[]
[null,"Line No.",null,"Particulars                                ",null,"Initial Application   ",null,null,null,{"$f":"IF(N13=\"\",\"\",\"Adjustments\")","v":"Adjustments"},null,null,null,{"$f":"IF(ISBLANK('3. Data_Input_Sheet'!M12),\"\",'3. Data_Input_Sheet'!M12)","v":"Technical Conference"},null,null,null,{"$f":"IF(N13=\"\",\"\",\"Adjustments\")","v":"Adjustments"},null,null,null,{"$f":"'3. Data_Input_Sheet'!U12","v":"Per Board Decision"}]
[]
[null,null,null,"Operating Revenues:"]
[null,1,null,"Distribution Revenue (at Proposed Rates)",null,{"$f":"'3. Data_Input_Sheet'!E26","v":12695006.36585268},null,null,null,{"$f":"N16-F16","v":-104763.55431864969},null,null,null,{"$f":"'3. Data_Input_Sheet'!M26","v":12590242.81153403},null,null,null,{"$f":"V16-N16","v":0},null,null,null,{"$f":"IF(ISBLANK('3. Data_Input_Sheet'!U26),'5. Utility Income'!N16,'3. Data_Input_Sheet'!U26)","v":12590242.81153403}]
[null,2,null,"Other Revenue","(1)",{"$f":"F48","v":1153934.3199999998},null,null,null,{"$f":"N17-F17","v":0},null,null,null,{"$f":"N48","v":1153934.3199999998},null,null,null,{"$f":"V17-N17","v":0},null,null,null,{"$f":"V48","v":1153934.3199999998}]
[null,null,null,null,null,{"$f":"SUM(F16:F17)","v":13848940.68585268},null,null,null,{"$f":"SUM(J16:J17)","v":-104763.55431864969},null,null,null,{"$f":"SUM(N16:N17)","v":13744177.131534031},null,null,null,{"$f":"SUM(R16:R17)","v":0},null,null,null,{"$f":"SUM(V16:V17)","v":13744177.131534031}]
[null,3,null,"Total Operating Revenues"]
[]
[null,null,null,"Operating Expenses:"]
[null,4,null,"OM+A Expenses",null,{"$f":"'3. Data_Input_Sheet'!E36","v":7004843.8077740688},null,null,null,{"$f":"'3. Data_Input_Sheet'!I36","v":-7465},null,null,null,{"$f":"'3. Data_Input_Sheet'!M36","v":6997378.8077740688},null,null,null,{"$f":"'3. Data_Input_Sheet'!Q36","v":0},null,null,null,{"$f":"'3. Data_Input_Sheet'!U36","v":6997378.8077740688}]
[null,5,null,"Depreciation/Amortization",null,{"$f":"'3. Data_Input_Sheet'!E37","v":2569662.1967412103},null,null,null,{"$f":"'3. Data_Input_Sheet'!I37","v":-57411.436587295961},null,null,null,{"$f":"'3. Data_Input_Sheet'!M37","v":2512250.7601539143},null,null,null,{"$f":"'3. Data_Input_Sheet'!Q37","v":0},null,null,null,{"$f":"'3. Data_Input_Sheet'!U37","v":2512250.7601539143}]
[null,6,null,"Property taxes",null,{"$f":"'3. Data_Input_Sheet'!E38","v":69876.25},null,null,null,{"$f":"'3. Data_Input_Sheet'!I38","v":0},null,null,null,{"$f":"'3. Data_Input_Sheet'!M38","v":69876.25},null,null,null,{"$f":"'3. Data_Input_Sheet'!Q38","v":0},null,null,null,{"$f":"'3. Data_Input_Sheet'!U38","v":69876.25}]
[null,7,null,"Capital taxes",null,{"$f":"'6. Taxes_PILs'!G25","v":0},null,null,null,{"$f":"N25-F25","v":0},null,null,null,{"$f":"'6. Taxes_PILs'!K25","v":0},null,null,null,{"$f":"V25-N25","v":0},null,null,null,{"$f":"'6. Taxes_PILs'!O25","v":0}]
[null,8,null,"Other expense",null,{"$f":"'3. Data_Input_Sheet'!E40","v":16700},null,null,null,{"$f":"'3. Data_Input_Sheet'!I40","v":0},null,null,null,{"$f":"'3. Data_Input_Sheet'!M40","v":16700},null,null,null,{"$f":"'3. Data_Input_Sheet'!Q40","v":0},null,null,null,{"$f":"'3. Data_Input_Sheet'!U40","v":16700}]
[null,null,null,null,null,{"$f":"SUM(F22:F26)","v":9661082.2545152791},null,null,null,{"$f":"SUM(J22:J26)","v":-64876.436587295961},null,null,null,{"$f":"SUM(N22:N26)","v":9596205.8179279827},null,null,null,{"$f":"SUM(R22:R26)","v":0},null,null,null,{"$f":"SUM(V22:V26)","v":9596205.8179279827}]
[null,9,null,"Subtotal (lines 4 to 8)"]
[]
[null,10,null,"Deemed Interest Expense",null,{"$f":"'7. Cost_of_Capital'!P19","v":1626887.7840330144},null,null,null,{"$f":"N30-F30","v":-62278.263686020626},null,null,null,{"$f":"'7. Cost_of_Capital'!P35","v":1564609.5203469938},null,null,null,{"$f":"V30-N30","v":49630.372743288521},null,null,null,{"$f":"'7. Cost_of_Capital'!P51","v":1614239.8930902823}]
[]
[null,11,null,"Total Expenses (lines 9 to 10)",null,{"$f":"F27+F30","v":11287970.038548294},null,null,null,{"$f":"J30+J27","v":-127154.70027331659},null,null,null,{"$f":"N30+N27","v":11160815.338274976},null,null,null,{"$f":"R30+R27","v":49630.372743288521},null,null,null,{"$f":"V27+V30","v":11210445.711018264}]
[]
[null,12,null,"Utility income before income taxes",null,{"$f":"F18-(F32)","v":2560970.6473043859},null,null,null,{"$f":"J18-(J32)","v":22391.145954666892},null,null,null,{"$f":"N18-(N32)","v":2583361.7932590544},null,null,null,{"$f":"R18-(R32)","v":-49630.372743288521},null,null,null,{"$f":"V18-(V32)","v":2533731.4205157664}]
[null,null,null,null,null,{"$f":"'6. Taxes_PILs'!G31","v":162510.24028283116},null,null,null,{"$f":"N35-F35","v":56292.681672195089},null,null,null,{"$f":"'6. Taxes_PILs'!K31","v":218802.92195502625},null,null,null,{"$f":"V35-N35","v":0},null,null,null,{"$f":"IF('6. Taxes_PILs'!O31=0,N35,'6. Taxes_PILs'!O31)","v":218802.92195502625}]
[null,13,null,"Income taxes (grossed-up)"]
[null,null,null,null,null,{"$f":"F34-F35","v":2398460.4070215547},null,null,null,{"$f":"J34-J35","v":-33901.535717528197},null,null,null,{"$f":"N34-N35","v":2364558.8713040282},null,null,null,{"$f":"R34-R35","v":-49630.372743288521},null,null,null,{"$f":"V34-V35","v":2314928.4985607401}]
[null,14,null,"Utility net income"]
[]
[]
[]
[null,"Notes"]
[]
[null,"(1)",null,"  Specific Service Charges",null,{"$f":"'3. Data_Input_Sheet'!E28","v":578856},null,null,null,{"$f":"'3. Data_Input_Sheet'!I28","v":0},null,null,null,{"$f":"'3. Data_Input_Sheet'!M28","v":578856},null,null,null,{"$f":"'3. Data_Input_Sheet'!Q28","v":""},null,null,null,{"$f":"IF(ISBLANK('3. Data_Input_Sheet'!U28),N44,'3. Data_Input_Sheet'!U28)","v":578856}]
[null,null,null,"  Late Payment Charges",null,{"$f":"'3. Data_Input_Sheet'!E29","v":136983},null,null,null,{"$f":"'3. Data_Input_Sheet'!I29","v":0},null,null,null,{"$f":"'3. Data_Input_Sheet'!M29","v":136983},null,null,null,{"$f":"'3. Data_Input_Sheet'!Q29","v":""},null,null,null,{"$f":"IF(ISBLANK('3. Data_Input_Sheet'!U29),N45,'3. Data_Input_Sheet'!U29)","v":136983}]
[null,null,null,"  Other Distribution Revenue",null,{"$f":"'3. Data_Input_Sheet'!E30","v":338372.31999999983},null,null,null,{"$f":"'3. Data_Input_Sheet'!I30","v":0},null,null,null,{"$f":"'3. Data_Input_Sheet'!M30","v":338372.31999999983},null,null,null,{"$f":"'3. Data_Input_Sheet'!Q30","v":""},null,null,null,{"$f":"IF(ISBLANK('3. Data_Input_Sheet'!U30),N46,'3. Data_Input_Sheet'!U30)","v":338372.31999999983}]
[null,null,null,"  Other Income and Deductions",null,{"$f":"'3. Data_Input_Sheet'!E31","v":99723},null,null,null,{"$f":"'3. Data_Input_Sheet'!I31","v":0},null,null,null,{"$f":"'3. Data_Input_Sheet'!M31","v":99723},null,null,null,{"$f":"'3. Data_Input_Sheet'!Q31","v":""},null,null,null,{"$f":"IF(ISBLANK('3. Data_Input_Sheet'!U31),N47,'3. Data_Input_Sheet'!U31)","v":99723}]
[null,null,null,null,null,{"$f":"SUM(F44:F47)","v":1153934.3199999998},null,null,null,{"$f":"SUM(J44:J47)","v":0},null,null,null,{"$f":"SUM(N44:N47)","v":1153934.3199999998},null,null,null,{"$f":"SUM(R44:R47)","v":0},null,null,null,{"$f":"SUM(V44:V47)","v":1153934.3199999998}]
[null,null,null,"Total Revenue Offsets"]

{"sheet":"6. Taxes_PILs","index":5,"n_rows":45,"n_cols":15,"rows_kept":45,"cut":false,"hidden":false,"merged":[[0,3,0,12],[2,2,2,6],[3,2,3,6],[1,2,1,14],[43,1,43,14],[8,1,8,12],[25,6,26,6],[25,14,26,14],[15,3,15,4],[17,3,17,4],[19,3,19,4],[32,3,32,4],[25,10,26,10],[44,3,44,14],[51,3,51,14],[52,3,52,14],[45,3,45,14],[49,3,49,14],[50,3,50,14]]}
[]
[]
[]
[]
[]
[]
[]
[]
[null,"Taxes/PILs"]
[]
[]
[null,"Line No.",null,"Particulars ",null,null,"Application",null,null,null,{"$f":"IF(ISBLANK('3. Data_Input_Sheet'!M12),\"\",'3. Data_Input_Sheet'!M12)","v":"Technical Conference"},null,null,null,{"$f":"'3. Data_Input_Sheet'!U12","v":"Per Board Decision"}]
[]
[null,null,null,"Determination of Taxable Income"]
[]
[null,1,null,"Utility net income before taxes",null,null,{"$f":"'7. Cost_of_Capital'!P22","v":2398460.4070215537},null,null,null,{"$f":"'7. Cost_of_Capital'!P38","v":2364558.8713040282},null,null,null,{"$f":"'7. Cost_of_Capital'!P54","v":2379814.0898285704}]
[]
[null,2,null,"Adjustments required to arrive at taxable utility income",null,null,{"$f":"'3. Data_Input_Sheet'!E44","v":-1706426.1854383964},null,null,null,{"$f":"'3. Data_Input_Sheet'!M44","v":-1679482.8424853701},null,null,null,{"$f":"IF(ISBLANK('3. Data_Input_Sheet'!U44),G18,'3. Data_Input_Sheet'!U44)","v":-1706426.1854383964}]
[]
[null,3,null,"Taxable income",null,null,{"$f":"G16+G18","v":692034.22158315731},null,null,null,{"$f":"K16+K18","v":685076.02881865809},null,null,null,{"$f":"O16+O18","v":673387.90439017396}]
[]
[null,null,null,"Calculation of Utility income Taxes"]
[]
[null,4,null,"Income taxes",null,null,{"$f":"'3. Data_Input_Sheet'!E46","v":127664.06871953694},null,null,null,{"$f":"IF(ISBLANK('3. Data_Input_Sheet'!M46),'6. Taxes_PILs'!G24,'3. Data_Input_Sheet'!M46)","v":160820.14763694428},null,null,null,{"$f":"IF(ISBLANK('3. Data_Input_Sheet'!U46),'6. Taxes_PILs'!K24,'3. Data_Input_Sheet'!U46)","v":160820.14763694428}]
[null,5,null,"Capital taxes",null,null,{"$f":"'3. Data_Input_Sheet'!E48","v":0},null,null,null,{"$f":"IF(ISBLANK('3. Data_Input_Sheet'!M48),'6. Taxes_PILs'!G25,'3. Data_Input_Sheet'!M48)","v":0},null,null,null,{"$f":"IF(ISBLANK('3. Data_Input_Sheet'!U48),'6. Taxes_PILs'!K25,'3. Data_Input_Sheet'!U48)","v":0}]
[null,null,null,null,null,null,{"$f":"SUM(G24:G25)","v":127664.06871953694},null,null,null,{"$f":"SUM(K24:K25)","v":160820.14763694428},null,null,null,{"$f":"SUM(O24:O25)","v":160820.14763694428}]
[null,6,null,"Total taxes"]
[]
[null,7,null,"Gross-up of Income Taxes",null,null,{"$f":"(G24/(1-G41))-G24","v":34846.171563294221},null,null,null,{"$f":"(K24/(1-K41))-K24","v":57982.774318081967},null,null,null,{"$f":"(O24/(1-O41))-O24","v":57982.774318081967}]
[]
[null,8,null,"Grossed-up Income Taxes",null,null,{"$f":"G24+G29","v":162510.24028283116},null,null,null,{"$f":"K24+K29","v":218802.92195502625},null,null,null,{"$f":"O24+O29","v":218802.92195502625}]
[]
[null,9,null,"PILs / tax Allowance (Grossed-up Income taxes + Capital taxes)",null,null,{"$f":"G26+G29","v":162510.24028283116},null,null,null,{"$f":"K29+K26","v":218802.92195502625},null,null,null,{"$f":"O29+O26","v":218802.92195502625}]
[]
[null,10,null,"Other tax Credits",null,null,{"$f":"'3. Data_Input_Sheet'!E51","v":-20725},null,null,null,{"$f":"IF(ISBLANK('3. Data_Input_Sheet'!M51),G35,'3. Data_Input_Sheet'!M51)","v":-20725},null,null,null,{"$f":"IF(ISBLANK('3. Data_Input_Sheet'!U51),K35,'3. Data_Input_Sheet'!U51)","v":-20725}]
[]
[null,null,null,"Tax Rates"]
[]
[null,11,null,"Federal tax (%)",null,null,{"$f":"'3. Data_Input_Sheet'!E49","v":0.15},null,null,null,{"$f":"IF(ISBLANK('3. Data_Input_Sheet'!M49),G39,'3. Data_Input_Sheet'!M49)","v":0.15},null,null,null,{"$f":"IF(ISBLANK('3. Data_Input_Sheet'!U49),K39,'3. Data_Input_Sheet'!U49)","v":0.15}]
[null,12,null,"Provincial tax (%)",null,null,{"$f":"'3. Data_Input_Sheet'!E50","v":6.4424466437612127E-2},null,null,null,{"$f":"IF(ISBLANK('3. Data_Input_Sheet'!M50),G40,'3. Data_Input_Sheet'!M50)","v":0.115},null,null,null,{"$f":"IF(ISBLANK('3. Data_Input_Sheet'!U50),K40,'3. Data_Input_Sheet'!U50)","v":0.115}]
[null,13,null,"Total tax rate (%)",null,null,{"$f":"G39+G40","v":0.21442446643761212},null,null,null,{"$f":"K39+K40","v":0.26500000000000001},null,null,null,{"$f":"O39+O40","v":0.26500000000000001}]
[]
[]
[null,"Notes"]
[null,null,null,"Capital Taxes not applicable after July 1, 2010 (i.e. for 2011 and later test years)"]

{"sheet":"7. Cost_of_Capital","index":6,"n_rows":62,"n_cols":16,"rows_kept":62,"cut":false,"hidden":false,"merged":[[0,2,0,13],[2,2,2,13],[3,2,3,9],[1,2,1,17],[12,5,12,9],[4,1,4,13],[10,5,10,9],[67,3,67,15],[65,3,65,15],[61,3,61,15],[62,3,62,15],[63,3,63,15],[64,3,64,15],[13,3,13,15],[29,3,29,15],[44,5,44,9],[28,5,28,9],[66,3,66,15],[60,1,60,15],[45,3,45,15]]}
[]
[]
[]
[]
[null,"Capitalization/Cost of Capital"]
[]
[]
[]
[]
[]
[null,"Line No.",null,"Particulars",null,"Capitalization Ratio",null,null,null,null,null,"Cost Rate",null,null,null,"Return"]
[]
[null,null,null,null,null,"Initial Application"]
[]
[null,null,null,null,null,"(%)",null,null,null,"($)",null,"(%)",null,null,null,"($)"]
[null,null,null,"Debt"]
[null,1,null,"  Long-term Debt",null,{"$f":"'3. Data_Input_Sheet'!E55","v":0.56000000000000005},null,null,null,{"$f":"$J$26*F17","v":35874407.797330931},null,{"$f":"'3. Data_Input_Sheet'!E62","v":4.3842394150519062E-2},null,null,null,{"$f":"L17*J17","v":1572819.9265670371}]
[null,2,null,"  Short-term Debt",null,{"$f":"'3. Data_Input_Sheet'!E56","v":0.04},null,null,null,{"$f":"$J$26*F18","v":2562457.6998093524},null,{"$f":"'3. Data_Input_Sheet'!E63","v":2.1100000000000001E-2},null,null,null,{"$f":"L18*J18","v":54067.857465977337}]
[null,3,null,"Total Debt",null,{"$f":"SUM(F17:F18)","v":0.60000000000000009},null,null,null,{"$f":"SUM(J17:J18)","v":38436865.497140281},null,{"$f":"IF(F19=0,0,SUMPRODUCT(F17:F18,L17:L18)/F19)","v":4.232623454048446E-2},null,null,null,{"$f":"SUM(P17:P18)","v":1626887.7840330144}]
[]
[null,null,null,"Equity"]
[null,4,null,"  Common Equity",null,{"$f":"'3. Data_Input_Sheet'!E57","v":0.4},null,null,null,{"$f":"$J$26*F22","v":25624576.998093523},null,{"$f":"'3. Data_Input_Sheet'!E64","v":9.3600000000000003E-2},null,null,null,{"$f":"L22*J22","v":2398460.4070215537}]
[null,5,null,"  Preferred Shares",null,{"$f":"'3. Data_Input_Sheet'!E58","v":0},null,null,null,{"$f":"$J$26*F23","v":0},null,{"$f":"'3. Data_Input_Sheet'!E65","v":0},null,null,null,{"$f":"L23*J23","v":0}]
[null,6,null,"Total Equity",null,{"$f":"SUM(F22:F23)","v":0.4},null,null,null,{"$f":"SUM(J22:J23)","v":25624576.998093523},null,{"$f":"IF(F24=0,0,SUMPRODUCT(F22:F23,L22:L23)/F24)","v":9.3600000000000003E-2},null,null,null,{"$f":"SUM(P22:P23)","v":2398460.4070215537}]
[]
[null,7,null,"Total",null,{"$f":"SUM(F19,F24)","v":1},null,null,null,{"$f":"'4. Rate_Base'!G18","v":64061442.495233804},null,{"$f":"(L19*F19)+(L24*F24)","v":6.2835740724290684E-2},null,null,null,{"$f":"P19+P24","v":4025348.1910545682}]
[]
[]
[null,null,null,null,null,{"$f":"'1. Info'!AC1","v":"Technical Conference"}]
[]
[null,null,null,null,null,"(%)",null,null,null,"($)",null,"(%)",null,null,null,"($)"]
[null,null,null,"Debt"]
[null,1,null,"  Long-term Debt",null,{"$f":"'3. Data_Input_Sheet'!M55","v":0.56000000000000005},null,null,null,{"$f":"$J$42*F33","v":35595509.890598275},null,{"$f":"'3. Data_Input_Sheet'!M62","v":4.2412392414060966E-2},null,null,null,{"$f":"L33*J33","v":1509690.7336586423}]
[null,2,null,"  Short-term Debt",null,{"$f":"'3. Data_Input_Sheet'!M56","v":0.04},null,null,null,{"$f":"$J$42*F34","v":2542536.4207570194},null,{"$f":"'3. Data_Input_Sheet'!M63","v":2.1600000000000001E-2},null,null,null,{"$f":"L34*J34","v":54918.786688351625}]
[null,3,null,"Total Debt",null,{"$f":"SUM(F33:F34)","v":0.60000000000000009},null,null,null,{"$f":"SUM(J33:J34)","v":38138046.311355293},null,{"$f":"IF(F35=0,0,SUMPRODUCT(F33:F34,L33:L34)/F35)","v":4.10248995864569E-2},null,null,null,{"$f":"SUM(P33:P34)","v":1564609.5203469938}]
[]
[null,null,null,"Equity"]
[null,4,null,"  Common Equity",null,{"$f":"'3. Data_Input_Sheet'!M57","v":0.4},null,null,null,{"$f":"$J$42*F38","v":25425364.207570195},null,{"$f":"'3. Data_Input_Sheet'!M64","v":9.2999999999999999E-2},null,null,null,{"$f":"L38*J38","v":2364558.8713040282}]
[null,5,null,"  Preferred Shares",null,{"$f":"'3. Data_Input_Sheet'!M58","v":0},null,null,null,{"$f":"$J$42*F39","v":0},null,{"$f":"'3. Data_Input_Sheet'!M65","v":0},null,null,null,{"$f":"L39*J39","v":0}]
[null,6,null,"Total Equity",null,{"$f":"SUM(F38:F39)","v":0.4},null,null,null,{"$f":"SUM(J38:J39)","v":25425364.207570195},null,{"$f":"IF(F40=0,0,SUMPRODUCT(F38:F39,L38:L39)/F40)","v":9.2999999999999999E-2},null,null,null,{"$f":"SUM(P38:P39)","v":2364558.8713040282}]
[]
[null,7,null,"Total",null,{"$f":"F35+F40","v":1},null,null,null,{"$f":"'4. Rate_Base'!O18","v":63563410.518925488},null,{"$f":"(L35*F35)+(L40*F40)","v":6.1814939751874146E-2},null,null,null,{"$f":"P35+P40","v":3929168.3916510222}]
[]
[]
[null,null,null,null,null,"Per Board Decision"]
[]
[null,null,null,null,null,"(%)",null,null,null,"($)",null,"(%)",null,null,null,"($)"]
[null,null,null,"Debt"]
[null,8,null,"  Long-term Debt",null,{"$f":"IF(ISBLANK('3. Data_Input_Sheet'!U55),F33,'3. Data_Input_Sheet'!U55)","v":0.56000000000000005},null,null,null,{"$f":"$J$58*F49","v":35595509.890598275},null,{"$f":"IF(ISBLANK('3. Data_Input_Sheet'!U62),L17,'3. Data_Input_Sheet'!U62)","v":4.3842394150519062E-2},null,null,null,{"$f":"L49*J49","v":1560592.3746123093}]
[null,9,null,"  Short-term Debt",null,{"$f":"IF(ISBLANK('3. Data_Input_Sheet'!U56),F34,'3. Data_Input_Sheet'!U56)","v":0.04},null,null,null,{"$f":"$J$58*F50","v":2542536.4207570194},null,{"$f":"IF(ISBLANK('3. Data_Input_Sheet'!U63),L18,'3. Data_Input_Sheet'!U63)","v":2.1100000000000001E-2},null,null,null,{"$f":"L50*J50","v":53647.518477973113}]
[null,10,null,"Total Debt",null,{"$f":"SUM(F49:F50)","v":0.60000000000000009},null,null,null,{"$f":"SUM(J49:J50)","v":38138046.311355293},null,{"$f":"IF(F51=0,0,SUMPRODUCT(F49:F50,L49:L50)/F51)","v":4.232623454048446E-2},null,null,null,{"$f":"SUM(P49:P50)","v":1614239.8930902823}]
[]
[null,null,null,"Equity"]
[null,11,null,"  Common Equity",null,{"$f":"IF(ISBLANK('3. Data_Input_Sheet'!U57),F38,'3. Data_Input_Sheet'!U57)","v":0.4},null,null,null,{"$f":"$J$58*F54","v":25425364.207570195},null,{"$f":"IF(ISBLANK('3. Data_Input_Sheet'!U64),L22,'3. Data_Input_Sheet'!U64)","v":9.3600000000000003E-2},null,null,null,{"$f":"L54*J54","v":2379814.0898285704}]
[null,12,null,"  Preferred Shares",null,{"$f":"IF(ISBLANK('3. Data_Input_Sheet'!U58),F39,'3. Data_Input_Sheet'!U58)","v":0},null,null,null,{"$f":"$J$58*F55","v":0},null,{"$f":"IF(ISBLANK('3. Data_Input_Sheet'!U65),L23,'3. Data_Input_Sheet'!U65)","v":0},null,null,null,{"$f":"L55*J55","v":0}]
[null,13,null,"Total Equity",null,{"$f":"SUM(F54:F55)","v":0.4},null,null,null,{"$f":"SUM(J54:J55)","v":25425364.207570195},null,{"$f":"IF(F56=0,0,SUMPRODUCT(F54:F55,L54:L55)/F56)","v":9.3600000000000003E-2},null,null,null,{"$f":"SUM(P54:P55)","v":2379814.0898285704}]
[]
[null,14,null,"Total",null,{"$f":"F51+F56","v":1},null,null,null,{"$f":"'4. Rate_Base'!W18","v":63563410.518925488},null,{"$f":"(L51*F51)+(L56*F56)","v":6.2835740724290684E-2},null,null,null,{"$f":"P51+P56","v":3994053.9829188529}]
[]
[]
[null,"Notes"]
[null,"(1)",null,{"$f":"'3. Data_Input_Sheet'!C71","v":"Data in column E is for Application as originally filed.  For updated revenue requirement as a result of interrogatory responses, technical or settlement conferences, etc., use colimn M and Adjustments in column I"}]

{"sheet":"8. Rev_Def_Suff","index":7,"n_rows":56,"n_cols":16,"rows_kept":56,"cut":false,"hidden":false,"merged":[[0,2,0,14],[1,2,1,14],[2,2,2,14],[3,2,3,7],[54,1,54,8],[14,3,15,3],[14,1,15,1],[12,5,12,7],[59,3,59,15],[55,3,55,15],[57,3,57,15],[58,3,58,15],[7,5,7,15],[14,7,15,7],[14,15,15,15],[14,5,15,5],[12,13,12,15],[14,13,15,13],[12,9,12,11],[14,9,15,9],[14,11,15,11],[56,3,56,15]]}
[null,null,null,null,null,null,null,null,null,null,null,null,null,null,null,{"$f":"CONCATENATE('2. Table of Contents'!$F$6,\" \",'2. Table of Contents'!$G$6)","v":" "}]
[]
[]
[]
[]
[]
[]
[]
[]
[null,"Revenue Deficiency/Sufficiency"]
[]
[]
[null,null,null,null,null,"Initial Application",null,null,null,{"$f":"IF(ISBLANK('3. Data_Input_Sheet'!M12),\"\",'3. Data_Input_Sheet'!M12)","v":"Technical Conference"},null,null,null,{"$f":"'3. Data_Input_Sheet'!U12","v":"Per Board Decision"}]
[]
[null,"Line No.",null,"Particulars",null,"At Current Approved Rates",null,"At Proposed Rates",null,"At Current Approved Rates",null,"At Proposed Rates",null,"At Current Approved Rates",null,"At Proposed Rates"]
[]
[]
[]
[null,1,null,"Revenue Deficiency from Below",null,null,null,{"$f":"F52","v":1663100.6998718702},null,null,null,{"$f":"J52","v":1613387.9207234608},null,null,null,{"$f":"N52","v":1683773.6928198673}]
[null,2,null,"Distribution Revenue",null,{"$f":"'3. Data_Input_Sheet'!E25","v":11031905.665980808},null,{"$f":"'3. Data_Input_Sheet'!E26-H19","v":11031905.66598081},null,{"$f":"IF(ISBLANK('3. Data_Input_Sheet'!M25),'3. Data_Input_Sheet'!E25,'3. Data_Input_Sheet'!M25)","v":10976854.89081057},null,{"$f":"IF(ISBLANK('3. Data_Input_Sheet'!M26),'3. Data_Input_Sheet'!E26-L19,'3. Data_Input_Sheet'!M26-L19)","v":10976854.89081057},null,{"$f":"IF(ISBLANK('3. Data_Input_Sheet'!U25),'3. Data_Input_Sheet'!M25,'3. Data_Input_Sheet'!U25)","v":10976854.89081057},null,{"$f":"IF(ISBLANK('3. Data_Input_Sheet'!U26),'3. Data_Input_Sheet'!M26-P19,'3. Data_Input_Sheet'!U26-P19)","v":10906469.118714163}]
[null,3,null,"Other Operating Revenue Offsets - net",null,{"$f":"'5. Utility Income'!F48","v":1153934.3199999998},null,{"$f":"'5. Utility Income'!F48","v":1153934.3199999998},null,{"$f":"'5. Utility Income'!N48","v":1153934.3199999998},null,{"$f":"J21","v":1153934.3199999998},null,{"$f":"'5. Utility Income'!V48","v":1153934.3199999998},null,{"$f":"'5. Utility Income'!V48","v":1153934.3199999998}]
[null,4,null,"Total Revenue",null,{"$f":"SUM(F20:F21)","v":12185839.985980809},null,{"$f":"SUM(H19:H21)","v":13848940.68585268},null,{"$f":"SUM(J20:J21)","v":12130789.21081057},null,{"$f":"SUM(L19:L21)","v":13744177.131534031},null,{"$f":"SUM(N20:N21)","v":12130789.21081057},null,{"$f":"SUM(P19:P21)","v":13744177.131534031}]
[]
[null,5,null,"Operating Expenses",null,{"$f":"'5. Utility Income'!F27","v":9661082.2545152791},null,{"$f":"'5. Utility Income'!F27","v":9661082.2545152791},null,{"$f":"'5. Utility Income'!N27","v":9596205.8179279827},null,{"$f":"'5. Utility Income'!N27","v":9596205.8179279827},null,{"$f":"'5. Utility Income'!V27","v":9596205.8179279827},null,{"$f":"'5. Utility Income'!V27","v":9596205.8179279827}]
[null,6,null,"Deemed Interest Expense",null,{"$f":"'5. Utility Income'!F30","v":1626887.7840330144},null,{"$f":"'5. Utility Income'!F30","v":1626887.7840330144},null,{"$f":"'5. Utility Income'!N30","v":1564609.5203469938},null,{"$f":"'5. Utility Income'!N30","v":1564609.5203469938},null,{"$f":"'5. Utility Income'!V30","v":1614239.8930902823},null,{"$f":"'5. Utility Income'!V30","v":1614239.8930902823}]
[null,8,null,"Total Cost and Expenses",null,{"$f":"SUM(F24:F25)","v":11287970.038548294},null,{"$f":"SUM(H24:H25)","v":11287970.038548294},null,{"$f":"SUM(J24:J25)","v":11160815.338274976},null,{"$f":"SUM(L24:L25)","v":11160815.338274976},null,{"$f":"SUM(N24:N25)","v":11210445.711018264},null,{"$f":"SUM(P24:P25)","v":11210445.711018264}]
[]
[null,9,null,"Utility Income Before Income Taxes",null,{"$f":"F22-F26","v":897869.94743251428},null,{"$f":"H22-H26","v":2560970.6473043859},null,{"$f":"J22-J26","v":969973.87253559381},null,{"$f":"L22-L26","v":2583361.7932590544},null,{"$f":"N22-N26","v":920343.49979230575},null,{"$f":"P22-P26","v":2533731.4205157664}]
[null,null,null,"   "]
[null,10,null,"Tax Adjustments to Accounting               Income per 2013 PILs model",null,{"$f":"'3. Data_Input_Sheet'!E44","v":-1706426.1854383964},null,{"$f":"'3. Data_Input_Sheet'!E44","v":-1706426.1854383964},null,{"$f":"IF(ISBLANK('3. Data_Input_Sheet'!M44),'3. Data_Input_Sheet'!E44,'3. Data_Input_Sheet'!M44)","v":-1679482.8424853701},null,{"$f":"IF(ISBLANK('3. Data_Input_Sheet'!M44),'3. Data_Input_Sheet'!E44,'3. Data_Input_Sheet'!M44)","v":-1679482.8424853701},null,{"$f":"IF(ISBLANK('3. Data_Input_Sheet'!U44),'3. Data_Input_Sheet'!M44,'3. Data_Input_Sheet'!U44)","v":-1679482.8424853701},null,{"$f":"IF(ISBLANK('3. Data_Input_Sheet'!U44),'3. Data_Input_Sheet'!M44,'3. Data_Input_Sheet'!U44)","v":-1679482.8424853701}]
[null,11,null,"Taxable Income",null,{"$f":"SUM(F28:F30)","v":-808556.23800588213},null,{"$f":"SUM(H28:H30)","v":854544.46186598949},null,{"$f":"SUM(J28+J30)","v":-709508.96994977631},null,{"$f":"L28+L30","v":903878.95077368431},null,{"$f":"SUM(N28+N30)","v":-759139.34269306436},null,{"$f":"P28+P30","v":854248.57803039625}]
[]
[null,12,null,"Income Tax Rate",null,{"$f":"'6. Taxes_PILs'!G41","v":0.21442446643761212},null,{"$f":"'6. Taxes_PILs'!G41","v":0.21442446643761212},null,{"$f":"'6. Taxes_PILs'!K41","v":0.26500000000000001},null,{"$f":"'6. Taxes_PILs'!K41","v":0.26500000000000001},null,{"$f":"'6. Taxes_PILs'!O41","v":0.26500000000000001},null,{"$f":"'6. Taxes_PILs'!O41","v":0.26500000000000001}]
[null,13,null,"Income Tax on Taxable Income",null,{"$f":"F31*F33","v":-173374.23991921419},null,{"$f":"H31*H33","v":183235.24028283116},null,{"$f":"J31*J33","v":-188019.87703669074},null,{"$f":"L31*L33","v":239527.92195502637},null,{"$f":"N31*N33","v":-201171.92581366206},null,{"$f":"P31*P33","v":226375.87317805502}]
[null,14,null,"Income Tax Credits",null,{"$f":"'3. Data_Input_Sheet'!E51","v":-20725},null,{"$f":"'3. Data_Input_Sheet'!E51","v":-20725},null,{"$f":"IF(ISBLANK('3. Data_Input_Sheet'!M51),'3. Data_Input_Sheet'!E51,'3. Data_Input_Sheet'!M51)","v":-20725},null,{"$f":"IF(ISBLANK('3. Data_Input_Sheet'!M51),'3. Data_Input_Sheet'!E51,'3. Data_Input_Sheet'!M51)","v":-20725},null,{"$f":"IF(ISBLANK('3. Data_Input_Sheet'!U51),'3. Data_Input_Sheet'!M51,'3. Data_Input_Sheet'!U51)","v":-20725},null,{"$f":"IF(ISBLANK('3. Data_Input_Sheet'!U51),'3. Data_Input_Sheet'!M51,'3. Data_Input_Sheet'!U51)","v":-20725}]
[null,15,null,"Utility Net Income ",null,{"$f":"F28-SUM(F34:F35)","v":1091969.1873517286},null,{"$f":"'5. Utility Income'!F37","v":2398460.4070215547},null,{"$f":"J28-SUM(J34:J35)","v":1178718.7495722845},null,{"$f":"'5. Utility Income'!N37","v":2364558.8713040282},null,{"$f":"N28-SUM(N34:N35)","v":1142240.4256059679},null,{"$f":"'5. Utility Income'!V37","v":2314928.4985607401}]
[]
[null,16,null,"Utility Rate Base",null,{"$f":"'4. Rate_Base'!G18","v":64061442.495233804},null,{"$f":"'4. Rate_Base'!G18","v":64061442.495233804},null,{"$f":"'4. Rate_Base'!O18","v":63563410.518925488},null,{"$f":"'4. Rate_Base'!O18","v":63563410.518925488},null,{"$f":"'4. Rate_Base'!W18","v":63563410.518925488},null,{"$f":"'4. Rate_Base'!W18","v":63563410.518925488}]
[]
[null,17,null,"Deemed Equity Portion of Rate Base ",null,{"$f":"'7. Cost_of_Capital'!J24","v":25624576.998093523},null,{"$f":"F40","v":25624576.998093523},null,{"$f":"'7. Cost_of_Capital'!J40","v":25425364.207570195},null,{"$f":"J40","v":25425364.207570195},null,{"$f":"'7. Cost_of_Capital'!J56","v":25425364.207570195},null,{"$f":"N40","v":25425364.207570195}]
[]
[null,18,null,"Income/(Equity Portion of Rate Base)",null,{"$f":"IF(F40=0,0,F36/F40)","v":4.2614135149742043E-2},null,{"$f":"IF(H40=0,0,H36/H40)","v":9.360000000000003E-2},null,{"$f":"IF(J40=0,0,J36/J40)","v":4.6359955355972073E-2},null,{"$f":"IF(L40=0,0,L36/L40)","v":9.2999999999999999E-2},null,{"$f":"IF(N40=0,0,N36/N40)","v":4.4925233569156703E-2},null,{"$f":"IF(P40=0,0,P36/P40)","v":9.1047997568958677E-2}]
[null,19,null,"Target Return - Equity on Rate Base",null,{"$f":"'7. Cost_of_Capital'!L24","v":9.3600000000000003E-2},null,{"$f":"'7. Cost_of_Capital'!L24","v":9.3600000000000003E-2},null,{"$f":"'7. Cost_of_Capital'!L40","v":9.2999999999999999E-2},null,{"$f":"'7. Cost_of_Capital'!L40","v":9.2999999999999999E-2},null,{"$f":"'7. Cost_of_Capital'!L56","v":9.3600000000000003E-2},null,{"$f":"'7. Cost_of_Capital'!L56","v":9.3600000000000003E-2}]
[null,20,null,"Deficiency/Sufficiency in Return on Equity",null,{"$f":"F42-F43","v":-5.098586485025796E-2},null,{"$f":"H42-H43","v":0},null,{"$f":"J42-J43","v":-4.6640044644027927E-2},null,{"$f":"L42-L43","v":0},null,{"$f":"N42-N43","v":-4.86747664308433E-2},null,{"$f":"P42-P43","v":-2.5520024310413253E-3}]
[]
[null,21,null,"Indicated Rate of Return",null,{"$f":"IF(F38=0,0,(F36+F25)/F38)","v":4.24413947841875E-2},null,{"$f":"IF(H38=0,0,(H36+H25)/H38)","v":6.2835740724290698E-2},null,{"$f":"IF(J38=0,0,(J36+J25)/J38)","v":4.3158921894262965E-2},null,{"$f":"IF(L40=0,0,(L36+L25)/L38)","v":6.1814939751874146E-2},null,{"$f":"IF(N38=0,0,(N36+N25)/N38)","v":4.3365834151953359E-2},null,{"$f":"IF(P40=0,0,(P36+P25)/P38)","v":6.1814939751874146E-2}]
[null,22,null,"Requested Rate of Return on Rate Base",null,{"$f":"'7. Cost_of_Capital'!L26","v":6.2835740724290684E-2},null,{"$f":"'7. Cost_of_Capital'!L26","v":6.2835740724290684E-2},null,{"$f":"'7. Cost_of_Capital'!L42","v":6.1814939751874146E-2},null,{"$f":"'7. Cost_of_Capital'!L42","v":6.1814939751874146E-2},null,{"$f":"'7. Cost_of_Capital'!L58","v":6.2835740724290684E-2},null,{"$f":"'7. Cost_of_Capital'!L58","v":6.2835740724290684E-2}]
[null,23,null,"Deficiency/Sufficiency in Rate of Return",null,{"$f":"F46-F47","v":-2.0394345940103184E-2},null,{"$f":"H46-H47","v":0},null,{"$f":"J46-J47","v":-1.865601785761118E-2},null,{"$f":"L46-L47","v":0},null,{"$f":"N46-N47","v":-1.9469906572337325E-2},null,{"$f":"P46-P47","v":-1.0208009724165384E-3}]
[]
[null,24,null,"Target Return on Equity",null,{"$f":"H50","v":2398460.4070215537},null,{"$f":"'7. Cost_of_Capital'!P24","v":2398460.4070215537},null,{"$f":"L50","v":2364558.8713040282},null,{"$f":"'7. Cost_of_Capital'!P40","v":2364558.8713040282},null,{"$f":"P50","v":2379814.0898285704},null,{"$f":"'7. Cost_of_Capital'!P56","v":2379814.0898285704}]
[null,25,null,"Revenue Deficiency/(Sufficiency)",null,{"$f":"F50-F36","v":1306491.2196698252}," ",{"$f":"H38*H48","v":0},null,{"$f":"J50-J36","v":1185840.1217317437},null,{"$f":"L38*L48","v":0},null,{"$f":"N50-N36","v":1237573.6642226025},null,{"$f":"P38*P48","v":-64885.591267830765}]
[null,26,null,"Gross Revenue Deficiency/(Sufficiency)",null,{"$f":"F51/(1-F33)","v":1663100.6998718702},"(1)",null,null,{"$f":"J51/(1-J33)","v":1613387.9207234608},"(1)",null,null,{"$f":"N51/(1-N33)","v":1683773.6928198673},"(1)"]
[]
[]
[null,"Notes:"]
[null,"(1)",null,"Revenue Deficiency/Sufficiency divided by (1 - Tax Rate)"]

{"sheet":"9. Rev_Reqt","index":8,"n_rows":39,"n_cols":17,"rows_kept":39,"cut":false,"hidden":false,"merged":[[42,3,42,16],[43,3,43,16],[44,3,44,16],[15,13,15,14],[16,13,16,14],[20,13,20,14],[24,13,24,14],[39,3,39,16],[40,3,40,16],[37,1,37,14],[31,13,31,14],[32,9,33,9],[34,9,35,9],[34,5,35,5],[32,5,33,5],[12,13,12,14],[7,5,7,14],[41,3,41,16],[32,13,33,14],[34,13,35,14],[0,2,0,13],[0,14,0,16],[19,13,19,14],[30,13,30,14],[17,13,17,14],[18,13,18,14],[21,13,21,14],[22,13,22,14],[29,13,29,14],[26,13,26,14],[27,13,27,14],[1,2,1,17],[2,2,2,17],[3,2,3,13],[14,13,14,14],[13,13,13,14]]}
[]
[]
[]
[]
[]
[]
[]
[]
[]
[]
[null,"Revenue Requirement"]
[]
[null,"Line No.",null,"Particulars",null,"Application   ",null,null,null,{"$f":"IF(ISBLANK('3. Data_Input_Sheet'!M12),\"\",'3. Data_Input_Sheet'!M12)","v":"Technical Conference"},null,null,null,{"$f":"'3. Data_Input_Sheet'!U12","v":"Per Board Decision"}]
[]
[null,1,null,"OM&A Expenses",null,{"$f":"'5. Utility Income'!F22","v":7004843.8077740688},null,null,null,{"$f":"'5. Utility Income'!N22","v":6997378.8077740688},null,null,null,{"$f":"'5. Utility Income'!V22","v":6997378.8077740688}]
[null,2,null,"Amortization/Depreciation",null,{"$f":"'5. Utility Income'!F23","v":2569662.1967412103},null,null,null,{"$f":"'5. Utility Income'!N23","v":2512250.7601539143},null,null,null,{"$f":"'5. Utility Income'!V23","v":2512250.7601539143}]
[null,3,null,"Property Taxes",null,{"$f":"'5. Utility Income'!F24","v":69876.25},null,null,null,{"$f":"'5. Utility Income'!N24","v":69876.25},null,null,null,{"$f":"'5. Utility Income'!V24","v":69876.25}]
[null,4,null,"Capital Taxes",null,{"$f":"'6. Taxes_PILs'!G25","v":0},null,null,null,{"$f":"'6. Taxes_PILs'!K25","v":0},null,null,null,{"$f":"'6. Taxes_PILs'!O25","v":0}]
[null,5,null,"Income Taxes (Grossed up)",null,{"$f":"'6. Taxes_PILs'!G33-F18","v":162510.24028283116},null,null,null,{"$f":"'6. Taxes_PILs'!K33-J18","v":218802.92195502625},null,null,null,{"$f":"'6. Taxes_PILs'!O33-N18","v":218802.92195502625}]
[null,6,null,"Other Expenses",null,{"$f":"'5. Utility Income'!F26","v":16700},null,null,null,{"$f":"'5. Utility Income'!N26","v":16700},null,null,null,{"$f":"'5. Utility Income'!V26","v":16700}]
[null,7,null,"Return"]
[null,null,null,"Deemed Interest Expense",null,{"$f":"'8. Rev_Def_Suff'!F25","v":1626887.7840330144},null,null,null,{"$f":"'8. Rev_Def_Suff'!L25","v":1564609.5203469938},null,null,null,{"$f":"'8. Rev_Def_Suff'!P25","v":1614239.8930902823}]
[null,null,null,"Return on Deemed Equity",null,{"$f":"'8. Rev_Def_Suff'!F50","v":2398460.4070215537},null,null,null,{"$f":"'8. Rev_Def_Suff'!L50","v":2364558.8713040282},null,null,null,{"$f":"'8. Rev_Def_Suff'!P50","v":2379814.0898285704}]
[]
[null,8,null,"Service Revenue Requirement (before Revenues)",null,{"$f":"SUM(F15:F23)","v":13848940.685852678},null,null,null,{"$f":"SUM(J15:J23)","v":13744177.131534031},null,null,null,{"$f":"SUM(N15:O23)","v":13809062.72280186}]
[]
[null,9,null,"Revenue Offsets",null,{"$f":"'3. Data_Input_Sheet'!E33","v":1153934.3199999998},null,null,null,{"$f":"'3. Data_Input_Sheet'!M33","v":1153934.3199999998},null,null,null,{"$f":"'3. Data_Input_Sheet'!U33","v":0}]
[null,10,null,"Base Revenue Requirement",null,{"$f":"F25-F27","v":12695006.365852678},null,null,null,{"$f":"J25-J27","v":12590242.81153403},null,null,null,{"$f":"N25-N27","v":13809062.72280186}]
[null,null,null,"(excluding Tranformer Owership Allowance credit adjustment)"]
[]
[null,11,null,"Distribution revenue",null,{"$f":"'5. Utility Income'!F16","v":12695006.36585268},null,null,null,{"$f":"'5. Utility Income'!N16","v":12590242.81153403},null,null,null,{"$f":"'5. Utility Income'!V16","v":12590242.81153403}]
[null,12,null,"Other revenue",null,{"$f":"'5. Utility Income'!F17","v":1153934.3199999998},null,null,null,{"$f":"'5. Utility Income'!N17","v":1153934.3199999998},null,null,null,{"$f":"'5. Utility Income'!V17","v":1153934.3199999998}]
[null,null,null,null,null,{"$f":"SUM(F31:F32)","v":13848940.68585268},null,null,null,{"$f":"SUM(J31:J32)","v":13744177.131534031},null,null,null,{"$f":"SUM(N31:N32)","v":13744177.131534031}]
[null,13,null,"Total revenue"]
[null,null,null,null,null,{"$f":"F33-F25","v":0},null,null,null,{"$f":"J33-J25","v":0},null,null,null,{"$f":"N33-N25","v":-64885.591267829761}]
[null,14,null,"Difference (Total Revenue Less Distribution Revenue Requirement before Revenues)",null,null,null,"(1)",null,null,null,"(1)",null,null,null,null,"(1)"]
[]
[null,"Notes"]
[null,"(1)",null,"Line 11 - Line 8"]

{"sheet":"10. Tracking_Sheet","index":9,"n_rows":203,"n_cols":18,"rows_kept":203,"cut":false,"hidden":false,"merged":[[14,1,14,14],[199,0,201,0],[199,1,200,1],[190,0,192,0],[190,1,191,1],[193,0,195,0],[193,1,194,1],[196,0,198,0],[196,1,197,1],[181,0,183,0],[181,1,182,1],[184,0,186,0],[184,1,185,1],[187,0,189,0],[187,1,188,1],[172,0,174,0],[172,1,173,1],[175,0,177,0],[175,1,176,1],[178,0,180,0],[178,1,179,1],[163,0,165,0],[163,1,164,1],[166,0,168,0],[166,1,167,1],[169,0,171,0],[169,1,170,1],[154,0,156,0],[154,1,155,1],[157,0,159,0],[157,1,158,1],[160,0,162,0],[160,1,161,1],[145,0,147,0],[145,1,146,1],[148,0,150,0],[148,1,149,1],[151,0,153,0],[151,1,152,1],[136,0,138,0],[136,1,137,1],[139,0,141,0],[139,1,140,1],[142,0,144,0],[142,1,143,1],[127,0,129,0],[127,1,128,1],[130,0,132,0],[130,1,131,1],[133,0,135,0],[133,1,134,1],[118,0,120,0],[118,1,119,1],[121,0,123,0],[121,1,122,1],[124,0,126,0],[124,1,125,1],[109,0,111,0],[109,1,110,1],[112,0,114,0],[112,1,113,1],[115,0,117,0],[115,1,116,1],[100,0,102,0],[100,1,101,1],[103,0,105,0],[103,1,104,1],[106,0,108,0],[106,1,107,1],[91,0,93,0],[91,1,92,1],[94,0,96,0],[94,1,95,1],[97,0,99,0],[97,1,98,1],[82,0,84,0],[82,1,83,1],[85,0,87,0],[85,1,86,1],[88,0,90,0],[88,1,89,1],[17,3,17,4],[17,8,17,10],[17,5,17,7],[17,11,17,14],[22,1,23,1],[25,1,26,1],[22,0,24,0],[25,0,27,0],[28,0,30,0],[28,1,29,1],[55,0,57,0],[55,1,56,1],[58,0,60,0],[58,1,59,1],[37,0,39,0],[37,1,38,1],[40,0,42,0],[40,1,41,1],[31,0,33,0],[31,1,32,1],[34,0,36,0],[34,1,35,1],[49,0,51,0],[49,1,50,1],[210,1,210,14],[211,1,211,14],[15,1,15,14],[73,0,75,0],[73,1,74,1],[208,1,208,14],[76,0,78,0],[76,1,77,1],[79,0,81,0],[79,1,80,1],[67,0,69,0],[67,1,68,1],[70,0,72,0],[70,1,71,1],[61,0,63,0],[52,0,54,0],[52,1,53,1],[43,0,45,0],[43,1,44,1],[46,0,48,0],[46,1,47,1],[61,1,62,1],[64,0,66,0],[64,1,65,1]]}
[]
[]
[]
[]
[]
[]
[]
[]
[]
[]
[]
[]
[]
[null,"Tracking Form"]
[null,"The last row shown is the most current estimate of the cost of service data reflecting the original application and any updates provided by the applicant distributor (for updated evidence, responses to interrogatories, undertakings, etc.)\nPlease ensure a Reference (Column B) and/or Item Description (Column C) is entered.  Please note that unused rows will automatically be hidden and the PRINT AREA set when the PRINT BUTTON on Sheet 1 is activated.\n(1) Short reference to evidence material (interrogatory response, undertaking, exhibit number, Board Decision, Code, Guideline, Report of the Board, etc.)\n(2) Short description of change, issue, etc.\n\n60 Tracking Rows have been provided below.  If you require more, please contact Industry Relations @ IndustryRelations@ontarioenergyboard.ca. "]
[null,"Summary of Proposed Changes"]
[]
[null,null,null,"Cost of Capital",null,"Rate Base and Capital Expenditures",null,null,"Operating Expenses",null,null,"Revenue Requirement"]
[null,"Reference (1)","Item / Description (2)","Regulated Return on Capital","Regulated Rate of Return","Rate Base","Working Capital","Working Capital Allowance ($)","Amortization / Depreciation","Taxes/PILs","OM&A","Service Revenue Requirement","Other Revenues","Base Revenue Requirement","Grossed up Revenue Deficiency / Sufficiency"]
[]
[null,null,"Original Application",{"$f":"'7. Cost_of_Capital'!P26","v":4025348.1910545682},{"$f":"'7. Cost_of_Capital'!L26","v":6.2835740724290684E-2},{"$f":"'4. Rate_Base'!G18","v":64061442.495233804},{"$f":"'4. Rate_Base'!G26","v":68256124.735774085},{"$f":"'4. Rate_Base'!G30","v":8873296.2156506311},{"$f":"'9. Rev_Reqt'!F16","v":2569662.1967412103},{"$f":"'9. Rev_Reqt'!F19","v":162510.24028283116},{"$f":"'9. Rev_Reqt'!F15","v":7004843.8077740688},{"$f":"'9. Rev_Reqt'!F25","v":13848940.685852678},{"$f":"'9. Rev_Reqt'!F32","v":1153934.3199999998},{"$f":"'9. Rev_Reqt'!F28","v":12695006.365852678},{"$f":"'8. Rev_Def_Suff'!F52","v":1663100.6998718702}]
[]
[1,"2-Energy Probe-28","Original Application with 2014 actual capital ",{"$f":"'[6]2015 Rev Deficiency'!$D$57","v":3963497.7575453715},{"$f":"'[6]2015 Rev Deficiency'!$D$59","v":6.2835740724290684E-2},{"$f":"'[6]2015 Rev Deficiency'!$D$49","v":63077123.176383361},{"$f":"'[6]Return on Capital'!$AK$28","v":68256124.735774085},{"$f":"'[6]Return on Capital'!$AK$30","v":8873296.2156506311},{"$f":"'[6]2015 Rev Deficiency'!$D$16","v":2512250.7601539143},{"$f":"'[6]2015 Rev Deficiency'!$D$77","v":165072.15448772185},{"$f":"'[6]2015 Rev Deficiency'!$D$13+'[6]2015 Rev Deficiency'!$D$14","v":7004843.8077740688},{"$f":"'[6]2015 Rev Deficiency'!$D$10","v":13732240.729961075},{"$f":"'[6]2015 Rev Deficiency'!$D$9","v":1153934.3199999998},{"$f":"'[6]2015 Rev Deficiency'!$D$7+'[6]2015 Rev Deficiency'!$D$8","v":12578306.409961075},{"$f":"'[6]2015 Rev Deficiency'!$D$7","v":1546400.7439802666},null,{"$f":"IF(AND(ISBLANK(B23), ISBLANK(C23)), \"X\", \"\")","v":""}]
[null,null,"          Change",{"$f":"IF(D23=\"\",\"\",D23-D21)","v":-61850.43350919662},{"$f":"IF(E23=\"\",\"\",E23-E21)","v":0},-984319.31885044277,0,0,-57411.436587295961,2561.9142048906942,0,-116699.9558916036,0,-116699.9558916036,-116699.9558916036]
[]
[2,"5-Staff-18","#1 with Nov 20-14 cost of capital parameters and new rate on 2015 SWAP ",{"$f":"'[7]2015 Rev Deficiency'!$D$57","v":3899108.568869682},{"$f":"'[7]2015 Rev Deficiency'!$D$59","v":6.1814939751874153E-2},{"$f":"'[7]2015 Rev Deficiency'!$D$49","v":63077123.176383361},{"$f":"'[7]Return on Capital'!$AK$28","v":68256124.735774085},{"$f":"'[7]Return on Capital'!$AK$30","v":8873296.2156506311},{"$f":"'[7]Revenue Requirement'!$C$6","v":2512250.7601539143},{"$f":"'[7]2015 Rev Deficiency'!$D$77","v":159736.68927710011},{"$f":"'[7]2015 Rev Deficiency'!$D$13+'[7]2015 Rev Deficiency'!$D$14","v":7004843.8077740688},{"$f":"'[7]2015 Rev Deficiency'!$D$10","v":13662516.076074766},{"$f":"'[7]2015 Rev Deficiency'!$D$9","v":1153934.3199999998},{"$f":"'[7]2015 Rev Deficiency'!$D$7+'[7]2015 Rev Deficiency'!$D$8","v":12508581.756074766},{"$f":"'[7]2015 Rev Deficiency'!$D$7","v":1476676.0900939573},null,{"$f":"IF(AND(ISBLANK(B26), ISBLANK(C26)), \"X\", \"\")","v":""}]
[null,null,"          Change",{"$f":"IF(D26=\"\",\"\",D26-D23)","v":-64389.188675689511},-1.0208009724165315E-3,0,0,0,0,-5335.46521062174,0,-69724.653886308894,0,-69724.653886308894,{"$f":"IF(O26=\"\",\"\",O26-O23)","v":-69724.653886309359}]
[]
[3,"3-Energy Probe-34","#2 with updated load forecast",{"$f":"'[5]2015 Rev Deficiency'!$D$57","v":3897011.0381092662},{"$f":"'[5]2015 Rev Deficiency'!$D$59","v":6.1814939751874139E-2},{"$f":"'[5]2015 Rev Deficiency'!$D$49","v":63043190.752137139},{"$f":"'[5]Return on Capital'!$AK$28","v":67995106.08772625},{"$f":"'[5]Return on Capital'!$AK$30","v":8839363.7914044131},{"$f":"'[5]Revenue Requirement'!$C$6","v":2512250.7601539143},{"$f":"'[5]2015 Rev Deficiency'!$D$77","v":159292.03463489757},{"$f":"'[5]2015 Rev Deficiency'!$D$13+'[5]2015 Rev Deficiency'!$D$14","v":7004843.8077740688},{"$f":"'[5]2015 Rev Deficiency'!$D$10","v":13659973.890672147},{"$f":"'[5]2015 Rev Deficiency'!$D$9","v":1153934.3199999998},{"$f":"'[5]2015 Rev Deficiency'!$D$7+'[5]2015 Rev Deficiency'!$D$8","v":12506039.570672147},{"$f":"'[5]2015 Rev Deficiency'!$D$7","v":1562539.1193921315},null,{"$f":"IF(AND(ISBLANK(B29), ISBLANK(C29)), \"X\", \"\")","v":""}]
[null,null,"          Change",{"$f":"IF(D29=\"\",\"\",D29-D26)","v":-2097.5307604158297},-1.3877787807814457E-17,-33932.424246221781,-261018.64804783463,-33932.424246218055,0,-444.65464220254216,0,-2542.1854026187211,0,-2542.1854026187211,{"$f":"IF(O29=\"\",\"\",O29-O26)","v":85863.029298174195}]
[]
[4,"JT1.8 and JT1.14","#3 with updated load forecast_V2 plus COP price changes",{"$f":"'[8]2015 Rev Deficiency'!$D$57","v":3929228.3799593039},{"$f":"'[8]2015 Rev Deficiency'!$D$59","v":6.1814939751874146E-2},{"$f":"'[8]2015 Rev Deficiency'!$D$49","v":63564380.968925476},{"$f":"'[8]Return on Capital'!$AK$28","v":72004261.601482674},{"$f":"'[8]Return on Capital'!$AK$30","v":9360554.0081927478},{"$f":"'[8]2015 Rev Deficiency'!$D$16","v":2512250.7601539143},{"$f":"'[8]2015 Rev Deficiency'!$D$25","v":166125.6566762338},{"$f":"'[8]2015 Rev Deficiency'!$D$13+'[8]2015 Rev Deficiency'!$D$14","v":7004843.8077740688},{"$f":"'[8]2015 Rev Deficiency'!$D$10","v":13699024.854563519},{"$f":"'[8]2015 Rev Deficiency'!$D$9","v":1153934.3199999998},{"$f":"'[8]2015 Rev Deficiency'!$D$7+'[8]2015 Rev Deficiency'!$D$8","v":12545090.534563519},{"$f":"'[8]2015 Rev Deficiency'!$D$7","v":1568235.6437529502},null,{"$f":"IF(AND(ISBLANK(B32), ISBLANK(C32)), \"X\", \"\")","v":""}]
[null,null,"          Change",{"$f":"IF(D32=\"\",\"\",D32-D29)","v":32217.341850037687},{"$f":"IF(E32=\"\",\"\",E32-E29)","v":6.9388939039072284E-18},{"$f":"IF(F32=\"\",\"\",F32-F29)","v":521190.21678833663},{"$f":"IF(G32=\"\",\"\",G32-G29)","v":4009155.5137564242},{"$f":"IF(H32=\"\",\"\",H32-H29)","v":521190.21678833477},{"$f":"IF(I32=\"\",\"\",I32-I29)","v":0},{"$f":"IF(J32=\"\",\"\",J32-J29)","v":6833.6220413362316},{"$f":"IF(K32=\"\",\"\",K32-K29)","v":0},{"$f":"IF(L32=\"\",\"\",L32-L29)","v":39050.963891372085},{"$f":"IF(M32=\"\",\"\",M32-M29)","v":0},{"$f":"IF(N32=\"\",\"\",N32-N29)","v":39050.963891372085},{"$f":"IF(O32=\"\",\"\",O32-O29)","v":5696.5243608187884}]
[]
[5," 1-Energy Probe-15","#4 with reduced OM&A shown in reference",{"$f":"'[9]2015 Rev Deficiency'!$D$57","v":3929168.3916510213},{"$f":"'[9]2015 Rev Deficiency'!$D$59","v":6.1814939751874146E-2},{"$f":"'[9]2015 Rev Deficiency'!$D$49","v":63563410.518925473},{"$f":"'[9]Return on Capital'!$AK$28","v":71996796.601482674},{"$f":"'[9]Return on Capital'!$AK$30","v":9359583.5581927486},{"$f":"'[9]2015 Rev Deficiency'!$D$16","v":2512250.7601539143},{"$f":"'[9]2015 Rev Deficiency'!$D$25","v":166112.92502275843},{"$f":"'[9]2015 Rev Deficiency'!$D$13+'[9]2015 Rev Deficiency'!$D$14","v":6997378.8077740688},{"$f":"'[9]2015 Rev Deficiency'!$D$10","v":13691487.134601763},{"$f":"'[9]2015 Rev Deficiency'!$D$9","v":1153934.3199999998},{"$f":"'[9]2015 Rev Deficiency'!$D$7+'[9]2015 Rev Deficiency'!$D$8","v":12537552.814601762},{"$f":"'[9]2015 Rev Deficiency'!$D$7","v":1560697.9237911927},null,{"$f":"IF(AND(ISBLANK(B35), ISBLANK(C35)), \"X\", \"\")","v":""}]
[null,null,"          Change",{"$f":"IF(D35=\"\",\"\",D35-D32)","v":-59.988308282569051},{"$f":"IF(E35=\"\",\"\",E35-E32)","v":0},{"$f":"IF(F35=\"\",\"\",F35-F32)","v":-970.45000000298023},{"$f":"IF(G35=\"\",\"\",G35-G32)","v":-7465},{"$f":"IF(H35=\"\",\"\",H35-H32)","v":-970.44999999925494},{"$f":"IF(I35=\"\",\"\",I35-I32)","v":0},{"$f":"IF(J35=\"\",\"\",J35-J32)","v":-12.731653475377243},{"$f":"IF(K35=\"\",\"\",K35-K32)","v":-7465},{"$f":"IF(L35=\"\",\"\",L35-L32)","v":-7537.7199617568403},{"$f":"IF(M35=\"\",\"\",M35-M32)","v":0},{"$f":"IF(N35=\"\",\"\",N35-N32)","v":-7537.7199617568403},{"$f":"IF(O35=\"\",\"\",O35-O32)","v":-7537.7199617575388}]
[]
[6,"4-Energy Probe-59","#5 with small business tax credit eliminated",{"$f":"'[10]2015 Rev Deficiency'!$D$57","v":3929168.3916510213},{"$f":"'[10]2015 Rev Deficiency'!$D$59","v":6.1814939751874146E-2},{"$f":"'[10]2015 Rev Deficiency'!$D$49","v":63563410.518925473},{"$f":"'[10]Return on Capital'!$AK$28","v":71996796.601482674},{"$f":"'[10]Return on Capital'!$AK$30","v":9359583.5581927486},{"$f":"'[10]2015 Rev Deficiency'!$D$16","v":2512250.7601539143},{"$f":"'[10]2015 Rev Deficiency'!$D$25","v":224995.92044227142},{"$f":"'[10]2015 Rev Deficiency'!$D$13+'[10]2015 Rev Deficiency'!$D$14","v":6997378.8077740688},{"$f":"'[10]2015 Rev Deficiency'!$D$10","v":13750370.130021276},{"$f":"'[10]2015 Rev Deficiency'!$D$9","v":1153934.3199999998},{"$f":"'[10]2015 Rev Deficiency'!$D$7+'[10]2015 Rev Deficiency'!$D$8","v":12596435.810021276},{"$f":"'[10]2015 Rev Deficiency'!$D$7","v":1619580.9192107052},null,{"$f":"IF(AND(ISBLANK(B38), ISBLANK(C38)), \"X\", \"\")","v":""}]
[null,null,"          Change",{"$f":"IF(D38=\"\",\"\",D38-D35)","v":0},{"$f":"IF(E38=\"\",\"\",E38-E35)","v":0},{"$f":"IF(F38=\"\",\"\",F38-F35)","v":0},{"$f":"IF(G38=\"\",\"\",G38-G35)","v":0},{"$f":"IF(H38=\"\",\"\",H38-H35)","v":0},{"$f":"IF(I38=\"\",\"\",I38-I35)","v":0},{"$f":"IF(J38=\"\",\"\",J38-J35)","v":58882.995419512998},{"$f":"IF(K38=\"\",\"\",K38-K35)","v":0},{"$f":"IF(L38=\"\",\"\",L38-L35)","v":58882.995419513434},{"$f":"IF(M38=\"\",\"\",M38-M35)","v":0},{"$f":"IF(N38=\"\",\"\",N38-N35)","v":58882.995419513434},{"$f":"IF(O38=\"\",\"\",O38-O35)","v":58882.995419512503}]
[]
[7,"JT1.9","#6 with CCA reclassification",{"$f":"'[4]2015 Rev Deficiency'!$D$57","v":3929168.3916510213},{"$f":"'[4]2015 Rev Deficiency'!$D$59","v":6.1814939751874146E-2},{"$f":"'[4]2015 Rev Deficiency'!$D$49","v":63563410.518925473},{"$f":"'[4]Return on Capital'!$AK$28","v":71996796.601482674},{"$f":"'[4]Return on Capital'!$AK$30","v":9359583.5581927486},{"$f":"'[4]2015 Rev Deficiency'!$D$16","v":2512250.7601539143},{"$f":"'[4]2015 Rev Deficiency'!$D$25","v":218802.92195502637},{"$f":"'[4]2015 Rev Deficiency'!$D$13+'[4]2015 Rev Deficiency'!$D$14","v":6997378.8077740688},{"$f":"'[4]2015 Rev Deficiency'!$D$10","v":13744177.131534031},{"$f":"'[4]2015 Rev Deficiency'!$D$9","v":1153934.3199999998},{"$f":"'[4]2015 Rev Deficiency'!$D$7+'[4]2015 Rev Deficiency'!$D$8","v":12590242.81153403},{"$f":"'[4]2015 Rev Deficiency'!$D$7","v":1613387.9207234601},null,{"$f":"IF(AND(ISBLANK(B41), ISBLANK(C41)), \"X\", \"\")","v":""}]
[null,null,"          Change",{"$f":"IF(D41=\"\",\"\",D41-D38)","v":0},{"$f":"IF(E41=\"\",\"\",E41-E38)","v":0},{"$f":"IF(F41=\"\",\"\",F41-F38)","v":0},{"$f":"IF(G41=\"\",\"\",G41-G38)","v":0},{"$f":"IF(H41=\"\",\"\",H41-H38)","v":0},{"$f":"IF(I41=\"\",\"\",I41-I38)","v":0},{"$f":"IF(J41=\"\",\"\",J41-J38)","v":-6192.9984872450586},{"$f":"IF(K41=\"\",\"\",K41-K38)","v":0},{"$f":"IF(L41=\"\",\"\",L41-L38)","v":-6192.9984872452915},{"$f":"IF(M41=\"\",\"\",M41-M38)","v":0},{"$f":"IF(N41=\"\",\"\",N41-N38)","v":-6192.9984872452915},{"$f":"IF(O41=\"\",\"\",O41-O38)","v":-6192.9984872450586}]
[]
[8,null,null,null,null,null,null,null,null,null,null,null,null,null,null,null,{"$f":"IF(AND(ISBLANK(B44), ISBLANK(C44)), \"X\", \"\")","v":"X"}]
[null,null,"          Change",{"$f":"IF(D44=\"\",\"\",D44-D41)","v":""},{"$f":"IF(E44=\"\",\"\",E44-E41)","v":""},{"$f":"IF(F44=\"\",\"\",F44-F41)","v":""},{"$f":"IF(G44=\"\",\"\",G44-G41)","v":""},{"$f":"IF(H44=\"\",\"\",H44-H41)","v":""},{"$f":"IF(I44=\"\",\"\",I44-I41)","v":""},{"$f":"IF(J44=\"\",\"\",J44-J41)","v":""},{"$f":"IF(K44=\"\",\"\",K44-K41)","v":""},{"$f":"IF(L44=\"\",\"\",L44-L41)","v":""},{"$f":"IF(M44=\"\",\"\",M44-M41)","v":""},{"$f":"IF(N44=\"\",\"\",N44-N41)","v":""},{"$f":"IF(O44=\"\",\"\",O44-O41)","v":""}]
[]
[9,null,null,null,null,null,null,null,null,null,null,null,null,null,null,null,{"$f":"IF(AND(ISBLANK(B47), ISBLANK(C47)), \"X\", \"\")","v":"X"}]
[null,null,"          Change",{"$f":"IF(D47=\"\",\"\",D47-D44)","v":""},{"$f":"IF(E47=\"\",\"\",E47-E44)","v":""},{"$f":"IF(F47=\"\",\"\",F47-F44)","v":""},{"$f":"IF(G47=\"\",\"\",G47-G44)","v":""},{"$f":"IF(H47=\"\",\"\",H47-H44)","v":""},{"$f":"IF(I47=\"\",\"\",I47-I44)","v":""},{"$f":"IF(J47=\"\",\"\",J47-J44)","v":""},{"$f":"IF(K47=\"\",\"\",K47-K44)","v":""},{"$f":"IF(L47=\"\",\"\",L47-L44)","v":""},{"$f":"IF(M47=\"\",\"\",M47-M44)","v":""},{"$f":"IF(N47=\"\",\"\",N47-N44)","v":""},{"$f":"IF(O47=\"\",\"\",O47-O44)","v":""}]
[]
[10,null,null,null,null,null,null,null,null,null,null,null,null,null,null,null,{"$f":"IF(AND(ISBLANK(B50), ISBLANK(C50)), \"X\", \"\")","v":"X"}]
[null,null,"          Change",{"$f":"IF(D50=\"\",\"\",D50-D47)","v":""},{"$f":"IF(E50=\"\",\"\",E50-E47)","v":""},{"$f":"IF(F50=\"\",\"\",F50-F47)","v":""},{"$f":"IF(G50=\"\",\"\",G50-G47)","v":""},{"$f":"IF(H50=\"\",\"\",H50-H47)","v":""},{"$f":"IF(I50=\"\",\"\",I50-I47)","v":""},{"$f":"IF(J50=\"\",\"\",J50-J47)","v":""},{"$f":"IF(K50=\"\",\"\",K50-K47)","v":""},{"$f":"IF(L50=\"\",\"\",L50-L47)","v":""},{"$f":"IF(M50=\"\",\"\",M50-M47)","v":""},{"$f":"IF(N50=\"\",\"\",N50-N47)","v":""},{"$f":"IF(O50=\"\",\"\",O50-O47)","v":""}]
[]
[11,null,null,null,null,null,null,null,null,null,null,null,null,null,null,null,{"$f":"IF(AND(ISBLANK(B53), ISBLANK(C53)), \"X\", \"\")","v":"X"}]
[null,null,"          Change",{"$f":"IF(D53=\"\",\"\",D53-D50)","v":""},{"$f":"IF(E53=\"\",\"\",E53-E50)","v":""},{"$f":"IF(F53=\"\",\"\",F53-F50)","v":""},{"$f":"IF(G53=\"\",\"\",G53-G50)","v":""},{"$f":"IF(H53=\"\",\"\",H53-H50)","v":""},{"$f":"IF(I53=\"\",\"\",I53-I50)","v":""},{"$f":"IF(J53=\"\",\"\",J53-J50)","v":""},{"$f":"IF(K53=\"\",\"\",K53-K50)","v":""},{"$f":"IF(L53=\"\",\"\",L53-L50)","v":""},{"$f":"IF(M53=\"\",\"\",M53-M50)","v":""},{"$f":"IF(N53=\"\",\"\",N53-N50)","v":""},{"$f":"IF(O53=\"\",\"\",O53-O50)","v":""}]
[]
[12,null,null,null,null,null,null,null,null,null,null,null,null,null,null,null,{"$f":"IF(AND(ISBLANK(B56), ISBLANK(C56)), \"X\", \"\")","v":"X"}]
[null,null,"          Change",{"$f":"IF(D56=\"\",\"\",D56-D53)","v":""},{"$f":"IF(E56=\"\",\"\",E56-E53)","v":""},{"$f":"IF(F56=\"\",\"\",F56-F53)","v":""},{"$f":"IF(G56=\"\",\"\",G56-G53)","v":""},{"$f":"IF(H56=\"\",\"\",H56-H53)","v":""},{"$f":"IF(I56=\"\",\"\",I56-I53)","v":""},{"$f":"IF(J56=\"\",\"\",J56-J53)","v":""},{"$f":"IF(K56=\"\",\"\",K56-K53)","v":""},{"$f":"IF(L56=\"\",\"\",L56-L53)","v":""},{"$f":"IF(M56=\"\",\"\",M56-M53)","v":""},{"$f":"IF(N56=\"\",\"\",N56-N53)","v":""},{"$f":"IF(O56=\"\",\"\",O56-O53)","v":""}]
[]
[13,null,null,null,null,null,null,null,null,null,null,null,null,null,null,null,{"$f":"IF(AND(ISBLANK(B59), ISBLANK(C59)), \"X\", \"\")","v":"X"}]
[null,null,"          Change",{"$f":"IF(D59=\"\",\"\",D59-D56)","v":""},{"$f":"IF(E59=\"\",\"\",E59-E56)","v":""},{"$f":"IF(F59=\"\",\"\",F59-F56)","v":""},{"$f":"IF(G59=\"\",\"\",G59-G56)","v":""},{"$f":"IF(H59=\"\",\"\",H59-H56)","v":""},{"$f":"IF(I59=\"\",\"\",I59-I56)","v":""},{"$f":"IF(J59=\"\",\"\",J59-J56)","v":""},{"$f":"IF(K59=\"\",\"\",K59-K56)","v":""},{"$f":"IF(L59=\"\",\"\",L59-L56)","v":""},{"$f":"IF(M59=\"\",\"\",M59-M56)","v":""},{"$f":"IF(N59=\"\",\"\",N59-N56)","v":""},{"$f":"IF(O59=\"\",\"\",O59-O56)","v":""}]
[]
[14,null,null,null,null,null,null,null,null,null,null,null,null,null,null,null,{"$f":"IF(AND(ISBLANK(B62), ISBLANK(C62)), \"X\", \"\")","v":"X"}]
[null,null,"          Change",{"$f":"IF(D62=\"\",\"\",D62-D59)","v":""},{"$f":"IF(E62=\"\",\"\",E62-E59)","v":""},{"$f":"IF(F62=\"\",\"\",F62-F59)","v":""},{"$f":"IF(G62=\"\",\"\",G62-G59)","v":""},{"$f":"IF(H62=\"\",\"\",H62-H59)","v":""},{"$f":"IF(I62=\"\",\"\",I62-I59)","v":""},{"$f":"IF(J62=\"\",\"\",J62-J59)","v":""},{"$f":"IF(K62=\"\",\"\",K62-K59)","v":""},{"$f":"IF(L62=\"\",\"\",L62-L59)","v":""},{"$f":"IF(M62=\"\",\"\",M62-M59)","v":""},{"$f":"IF(N62=\"\",\"\",N62-N59)","v":""},{"$f":"IF(O62=\"\",\"\",O62-O59)","v":""}]
[]
[15,null,null,null,null,null,null,null,null,null,null,null,null,null,null,null,{"$f":"IF(AND(ISBLANK(B65), ISBLANK(C65)), \"X\", \"\")","v":"X"}]
[null,null,"          Change",{"$f":"IF(D65=\"\",\"\",D65-D62)","v":""},{"$f":"IF(E65=\"\",\"\",E65-E62)","v":""},{"$f":"IF(F65=\"\",\"\",F65-F62)","v":""},{"$f":"IF(G65=\"\",\"\",G65-G62)","v":""},{"$f":"IF(H65=\"\",\"\",H65-H62)","v":""},{"$f":"IF(I65=\"\",\"\",I65-I62)","v":""},{"$f":"IF(J65=\"\",\"\",J65-J62)","v":""},{"$f":"IF(K65=\"\",\"\",K65-K62)","v":""},{"$f":"IF(L65=\"\",\"\",L65-L62)","v":""},{"$f":"IF(M65=\"\",\"\",M65-M62)","v":""},{"$f":"IF(N65=\"\",\"\",N65-N62)","v":""},{"$f":"IF(O65=\"\",\"\",O65-O62)","v":""}]
[]
[16,null,null,null,null,null,null,null,null,null,null,null,null,null,null,null,{"$f":"IF(AND(ISBLANK(B68), ISBLANK(C68)), \"X\", \"\")","v":"X"}]
[null,null,"          Change",{"$f":"IF(D68=\"\",\"\",D68-D65)","v":""},{"$f":"IF(E68=\"\",\"\",E68-E65)","v":""},{"$f":"IF(F68=\"\",\"\",F68-F65)","v":""},{"$f":"IF(G68=\"\",\"\",G68-G65)","v":""},{"$f":"IF(H68=\"\",\"\",H68-H65)","v":""},{"$f":"IF(I68=\"\",\"\",I68-I65)","v":""},{"$f":"IF(J68=\"\",\"\",J68-J65)","v":""},{"$f":"IF(K68=\"\",\"\",K68-K65)","v":""},{"$f":"IF(L68=\"\",\"\",L68-L65)","v":""},{"$f":"IF(M68=\"\",\"\",M68-M65)","v":""},{"$f":"IF(N68=\"\",\"\",N68-N65)","v":""},{"$f":"IF(O68=\"\",\"\",O68-O65)","v":""}]
[]
[17,null,null,null,null,null,null,null,null,null,null,null,null,null,null,null,{"$f":"IF(AND(ISBLANK(B71), ISBLANK(C71)), \"X\", \"\")","v":"X"}]
[null,null,"          Change",{"$f":"IF(D71=\"\",\"\",D71-D68)","v":""},{"$f":"IF(E71=\"\",\"\",E71-E68)","v":""},{"$f":"IF(F71=\"\",\"\",F71-F68)","v":""},{"$f":"IF(G71=\"\",\"\",G71-G68)","v":""},{"$f":"IF(H71=\"\",\"\",H71-H68)","v":""},{"$f":"IF(I71=\"\",\"\",I71-I68)","v":""},{"$f":"IF(J71=\"\",\"\",J71-J68)","v":""},{"$f":"IF(K71=\"\",\"\",K71-K68)","v":""},{"$f":"IF(L71=\"\",\"\",L71-L68)","v":""},{"$f":"IF(M71=\"\",\"\",M71-M68)","v":""},{"$f":"IF(N71=\"\",\"\",N71-N68)","v":""},{"$f":"IF(O71=\"\",\"\",O71-O68)","v":""}]
[]
[18,null,null,null,null,null,null,null,null,null,null,null,null,null,null,null,{"$f":"IF(AND(ISBLANK(B74), ISBLANK(C74)), \"X\", \"\")","v":"X"}]
[null,null,"          Change",{"$f":"IF(D74=\"\",\"\",D74-D71)","v":""},{"$f":"IF(E74=\"\",\"\",E74-E71)","v":""},{"$f":"IF(F74=\"\",\"\",F74-F71)","v":""},{"$f":"IF(G74=\"\",\"\",G74-G71)","v":""},{"$f":"IF(H74=\"\",\"\",H74-H71)","v":""},{"$f":"IF(I74=\"\",\"\",I74-I71)","v":""},{"$f":"IF(J74=\"\",\"\",J74-J71)","v":""},{"$f":"IF(K74=\"\",\"\",K74-K71)","v":""},{"$f":"IF(L74=\"\",\"\",L74-L71)","v":""},{"$f":"IF(M74=\"\",\"\",M74-M71)","v":""},{"$f":"IF(N74=\"\",\"\",N74-N71)","v":""},{"$f":"IF(O74=\"\",\"\",O74-O71)","v":""}]
[null,null,null,null,null,null,null,null,null,null,null,null,null,null,null,null,null,"Page Break 1"]
[19,null,null,null,null,null,null,null,null,null,null,null,null,null,null,null,{"$f":"IF(AND(ISBLANK(B77), ISBLANK(C77)), \"X\", \"\")","v":"X"}]
[null,null,"          Change",{"$f":"IF(D77=\"\",\"\",D77-D74)","v":""},{"$f":"IF(E77=\"\",\"\",E77-E74)","v":""},{"$f":"IF(F77=\"\",\"\",F77-F74)","v":""},{"$f":"IF(G77=\"\",\"\",G77-G74)","v":""},{"$f":"IF(H77=\"\",\"\",H77-H74)","v":""},{"$f":"IF(I77=\"\",\"\",I77-I74)","v":""},{"$f":"IF(J77=\"\",\"\",J77-J74)","v":""},{"$f":"IF(K77=\"\",\"\",K77-K74)","v":""},{"$f":"IF(L77=\"\",\"\",L77-L74)","v":""},{"$f":"IF(M77=\"\",\"\",M77-M74)","v":""},{"$f":"IF(N77=\"\",\"\",N77-N74)","v":""},{"$f":"IF(O77=\"\",\"\",O77-O74)","v":""}]
[]
[20,null,null,null,null,null,null,null,null,null,null,null,null,null,null,null,{"$f":"IF(AND(ISBLANK(B80), ISBLANK(C80)), \"X\", \"\")","v":"X"}]
[null,null,"          Change",{"$f":"IF(D80=\"\",\"\",D80-D77)","v":""},{"$f":"IF(E80=\"\",\"\",E80-E77)","v":""},{"$f":"IF(F80=\"\",\"\",F80-F77)","v":""},{"$f":"IF(G80=\"\",\"\",G80-G77)","v":""},{"$f":"IF(H80=\"\",\"\",H80-H77)","v":""},{"$f":"IF(I80=\"\",\"\",I80-I77)","v":""},{"$f":"IF(J80=\"\",\"\",J80-J77)","v":""},{"$f":"IF(K80=\"\",\"\",K80-K77)","v":""},{"$f":"IF(L80=\"\",\"\",L80-L77)","v":""},{"$f":"IF(M80=\"\",\"\",M80-M77)","v":""},{"$f":"IF(N80=\"\",\"\",N80-N77)","v":""},{"$f":"IF(O80=\"\",\"\",O80-O77)","v":""}]
[]
[21,null,null,null,null,null,null,null,null,null,null,null,null,null,null,null,{"$f":"IF(AND(ISBLANK(B83), ISBLANK(C83)), \"X\", \"\")","v":"X"}]
[null,null,"          Change",{"$f":"IF(D83=\"\",\"\",D83-D80)","v":""},{"$f":"IF(E83=\"\",\"\",E83-E80)","v":""},{"$f":"IF(F83=\"\",\"\",F83-F80)","v":""},{"$f":"IF(G83=\"\",\"\",G83-G80)","v":""},{"$f":"IF(H83=\"\",\"\",H83-H80)","v":""},{"$f":"IF(I83=\"\",\"\",I83-I80)","v":""},{"$f":"IF(J83=\"\",\"\",J83-J80)","v":""},{"$f":"IF(K83=\"\",\"\",K83-K80)","v":""},{"$f":"IF(L83=\"\",\"\",L83-L80)","v":""},{"$f":"IF(M83=\"\",\"\",M83-M80)","v":""},{"$f":"IF(N83=\"\",\"\",N83-N80)","v":""},{"$f":"IF(O83=\"\",\"\",O83-O80)","v":""}]
[]
[22,null,null,null,null,null,null,null,null,null,null,null,null,null,null,null,{"$f":"IF(AND(ISBLANK(B86), ISBLANK(C86)), \"X\", \"\")","v":"X"}]
[null,null,"          Change",{"$f":"IF(D86=\"\",\"\",D86-D83)","v":""},{"$f":"IF(E86=\"\",\"\",E86-E83)","v":""},{"$f":"IF(F86=\"\",\"\",F86-F83)","v":""},{"$f":"IF(G86=\"\",\"\",G86-G83)","v":""},{"$f":"IF(H86=\"\",\"\",H86-H83)","v":""},{"$f":"IF(I86=\"\",\"\",I86-I83)","v":""},{"$f":"IF(J86=\"\",\"\",J86-J83)","v":""},{"$f":"IF(K86=\"\",\"\",K86-K83)","v":""},{"$f":"IF(L86=\"\",\"\",L86-L83)","v":""},{"$f":"IF(M86=\"\",\"\",M86-M83)","v":""},{"$f":"IF(N86=\"\",\"\",N86-N83)","v":""},{"$f":"IF(O86=\"\",\"\",O86-O83)","v":""}]
[]
[23,null,null,null,null,null,null,null,null,null,null,null,null,null,null,null,{"$f":"IF(AND(ISBLANK(B89), ISBLANK(C89)), \"X\", \"\")","v":"X"}]
[null,null,"          Change",{"$f":"IF(D89=\"\",\"\",D89-D86)","v":""},{"$f":"IF(E89=\"\",\"\",E89-E86)","v":""},{"$f":"IF(F89=\"\",\"\",F89-F86)","v":""},{"$f":"IF(G89=\"\",\"\",G89-G86)","v":""},{"$f":"IF(H89=\"\",\"\",H89-H86)","v":""},{"$f":"IF(I89=\"\",\"\",I89-I86)","v":""},{"$f":"IF(J89=\"\",\"\",J89-J86)","v":""},{"$f":"IF(K89=\"\",\"\",K89-K86)","v":""},{"$f":"IF(L89=\"\",\"\",L89-L86)","v":""},{"$f":"IF(M89=\"\",\"\",M89-M86)","v":""},{"$f":"IF(N89=\"\",\"\",N89-N86)","v":""},{"$f":"IF(O89=\"\",\"\",O89-O86)","v":""}]
[]
[24,null,null,null,null,null,null,null,null,null,null,null,null,null,null,null,{"$f":"IF(AND(ISBLANK(B92), ISBLANK(C92)), \"X\", \"\")","v":"X"}]
[null,null,"          Change",{"$f":"IF(D92=\"\",\"\",D92-D89)","v":""},{"$f":"IF(E92=\"\",\"\",E92-E89)","v":""},{"$f":"IF(F92=\"\",\"\",F92-F89)","v":""},{"$f":"IF(G92=\"\",\"\",G92-G89)","v":""},{"$f":"IF(H92=\"\",\"\",H92-H89)","v":""},{"$f":"IF(I92=\"\",\"\",I92-I89)","v":""},{"$f":"IF(J92=\"\",\"\",J92-J89)","v":""},{"$f":"IF(K92=\"\",\"\",K92-K89)","v":""},{"$f":"IF(L92=\"\",\"\",L92-L89)","v":""},{"$f":"IF(M92=\"\",\"\",M92-M89)","v":""},{"$f":"IF(N92=\"\",\"\",N92-N89)","v":""},{"$f":"IF(O92=\"\",\"\",O92-O89)","v":""}]
[]
[25,null,null,null,null,null,null,null,null,null,null,null,null,null,null,null,{"$f":"IF(AND(ISBLANK(B95), ISBLANK(C95)), \"X\", \"\")","v":"X"}]
[null,null,"          Change",{"$f":"IF(D95=\"\",\"\",D95-D92)","v":""},{"$f":"IF(E95=\"\",\"\",E95-E92)","v":""},{"$f":"IF(F95=\"\",\"\",F95-F92)","v":""},{"$f":"IF(G95=\"\",\"\",G95-G92)","v":""},{"$f":"IF(H95=\"\",\"\",H95-H92)","v":""},{"$f":"IF(I95=\"\",\"\",I95-I92)","v":""},{"$f":"IF(J95=\"\",\"\",J95-J92)","v":""},{"$f":"IF(K95=\"\",\"\",K95-K92)","v":""},{"$f":"IF(L95=\"\",\"\",L95-L92)","v":""},{"$f":"IF(M95=\"\",\"\",M95-M92)","v":""},{"$f":"IF(N95=\"\",\"\",N95-N92)","v":""},{"$f":"IF(O95=\"\",\"\",O95-O92)","v":""}]
[]
[26,null,null,null,null,null,null,null,null,null,null,null,null,null,null,null,{"$f":"IF(AND(ISBLANK(B98), ISBLANK(C98)), \"X\", \"\")","v":"X"}]
[null,null,"          Change",{"$f":"IF(D98=\"\",\"\",D98-D95)","v":""},{"$f":"IF(E98=\"\",\"\",E98-E95)","v":""},{"$f":"IF(F98=\"\",\"\",F98-F95)","v":""},{"$f":"IF(G98=\"\",\"\",G98-G95)","v":""},{"$f":"IF(H98=\"\",\"\",H98-H95)","v":""},{"$f":"IF(I98=\"\",\"\",I98-I95)","v":""},{"$f":"IF(J98=\"\",\"\",J98-J95)","v":""},{"$f":"IF(K98=\"\",\"\",K98-K95)","v":""},{"$f":"IF(L98=\"\",\"\",L98-L95)","v":""},{"$f":"IF(M98=\"\",\"\",M98-M95)","v":""},{"$f":"IF(N98=\"\",\"\",N98-N95)","v":""},{"$f":"IF(O98=\"\",\"\",O98-O95)","v":""}]
[]
[27,null,null,null,null,null,null,null,null,null,null,null,null,null,null,null,{"$f":"IF(AND(ISBLANK(B101), ISBLANK(C101)), \"X\", \"\")","v":"X"}]
[null,null,"          Change",{"$f":"IF(D101=\"\",\"\",D101-D98)","v":""},{"$f":"IF(E101=\"\",\"\",E101-E98)","v":""},{"$f":"IF(F101=\"\",\"\",F101-F98)","v":""},{"$f":"IF(G101=\"\",\"\",G101-G98)","v":""},{"$f":"IF(H101=\"\",\"\",H101-H98)","v":""},{"$f":"IF(I101=\"\",\"\",I101-I98)","v":""},{"$f":"IF(J101=\"\",\"\",J101-J98)","v":""},{"$f":"IF(K101=\"\",\"\",K101-K98)","v":""},{"$f":"IF(L101=\"\",\"\",L101-L98)","v":""},{"$f":"IF(M101=\"\",\"\",M101-M98)","v":""},{"$f":"IF(N101=\"\",\"\",N101-N98)","v":""},{"$f":"IF(O101=\"\",\"\",O101-O98)","v":""}]
[]
[28,null,null,null,null,null,null,null,null,null,null,null,null,null,null,null,{"$f":"IF(AND(ISBLANK(B104), ISBLANK(C104)), \"X\", \"\")","v":"X"}]
[null,null,"          Change",{"$f":"IF(D104=\"\",\"\",D104-D101)","v":""},{"$f":"IF(E104=\"\",\"\",E104-E101)","v":""},{"$f":"IF(F104=\"\",\"\",F104-F101)","v":""},{"$f":"IF(G104=\"\",\"\",G104-G101)","v":""},{"$f":"IF(H104=\"\",\"\",H104-H101)","v":""},{"$f":"IF(I104=\"\",\"\",I104-I101)","v":""},{"$f":"IF(J104=\"\",\"\",J104-J101)","v":""},{"$f":"IF(K104=\"\",\"\",K104-K101)","v":""},{"$f":"IF(L104=\"\",\"\",L104-L101)","v":""},{"$f":"IF(M104=\"\",\"\",M104-M101)","v":""},{"$f":"IF(N104=\"\",\"\",N104-N101)","v":""},{"$f":"IF(O104=\"\",\"\",O104-O101)","v":""}]
[]
[29,null,null,null,null,null,null,null,null,null,null,null,null,null,null,null,{"$f":"IF(AND(ISBLANK(B107), ISBLANK(C107)), \"X\", \"\")","v":"X"}]
[null,null,"          Change",{"$f":"IF(D107=\"\",\"\",D107-D104)","v":""},{"$f":"IF(E107=\"\",\"\",E107-E104)","v":""},{"$f":"IF(F107=\"\",\"\",F107-F104)","v":""},{"$f":"IF(G107=\"\",\"\",G107-G104)","v":""},{"$f":"IF(H107=\"\",\"\",H107-H104)","v":""},{"$f":"IF(I107=\"\",\"\",I107-I104)","v":""},{"$f":"IF(J107=\"\",\"\",J107-J104)","v":""},{"$f":"IF(K107=\"\",\"\",K107-K104)","v":""},{"$f":"IF(L107=\"\",\"\",L107-L104)","v":""},{"$f":"IF(M107=\"\",\"\",M107-M104)","v":""},{"$f":"IF(N107=\"\",\"\",N107-N104)","v":""},{"$f":"IF(O107=\"\",\"\",O107-O104)","v":""}]
[]
[30,null,null,null,null,null,null,null,null,null,null,null,null,null,null,null,{"$f":"IF(AND(ISBLANK(B110), ISBLANK(C110)), \"X\", \"\")","v":"X"}]
[null,null,"          Change",{"$f":"IF(D110=\"\",\"\",D110-D107)","v":""},{"$f":"IF(E110=\"\",\"\",E110-E107)","v":""},{"$f":"IF(F110=\"\",\"\",F110-F107)","v":""},{"$f":"IF(G110=\"\",\"\",G110-G107)","v":""},{"$f":"IF(H110=\"\",\"\",H110-H107)","v":""},{"$f":"IF(I110=\"\",\"\",I110-I107)","v":""},{"$f":"IF(J110=\"\",\"\",J110-J107)","v":""},{"$f":"IF(K110=\"\",\"\",K110-K107)","v":""},{"$f":"IF(L110=\"\",\"\",L110-L107)","v":""},{"$f":"IF(M110=\"\",\"\",M110-M107)","v":""},{"$f":"IF(N110=\"\",\"\",N110-N107)","v":""},{"$f":"IF(O110=\"\",\"\",O110-O107)","v":""}]
[]
[31,null,null,null,null,null,null,null,null,null,null,null,null,null,null,null,{"$f":"IF(AND(ISBLANK(B113), ISBLANK(C113)), \"X\", \"\")","v":"X"}]
[null,null,"          Change",{"$f":"IF(D113=\"\",\"\",D113-D110)","v":""},{"$f":"IF(E113=\"\",\"\",E113-E110)","v":""},{"$f":"IF(F113=\"\",\"\",F113-F110)","v":""},{"$f":"IF(G113=\"\",\"\",G113-G110)","v":""},{"$f":"IF(H113=\"\",\"\",H113-H110)","v":""},{"$f":"IF(I113=\"\",\"\",I113-I110)","v":""},{"$f":"IF(J113=\"\",\"\",J113-J110)","v":""},{"$f":"IF(K113=\"\",\"\",K113-K110)","v":""},{"$f":"IF(L113=\"\",\"\",L113-L110)","v":""},{"$f":"IF(M113=\"\",\"\",M113-M110)","v":""},{"$f":"IF(N113=\"\",\"\",N113-N110)","v":""},{"$f":"IF(O113=\"\",\"\",O113-O110)","v":""}]
[]
[32,null,null,null,null,null,null,null,null,null,null,null,null,null,null,null,{"$f":"IF(AND(ISBLANK(B116), ISBLANK(C116)), \"X\", \"\")","v":"X"}]
[null,null,"          Change",{"$f":"IF(D116=\"\",\"\",D116-D113)","v":""},{"$f":"IF(E116=\"\",\"\",E116-E113)","v":""},{"$f":"IF(F116=\"\",\"\",F116-F113)","v":""},{"$f":"IF(G116=\"\",\"\",G116-G113)","v":""},{"$f":"IF(H116=\"\",\"\",H116-H113)","v":""},{"$f":"IF(I116=\"\",\"\",I116-I113)","v":""},{"$f":"IF(J116=\"\",\"\",J116-J113)","v":""},{"$f":"IF(K116=\"\",\"\",K116-K113)","v":""},{"$f":"IF(L116=\"\",\"\",L116-L113)","v":""},{"$f":"IF(M116=\"\",\"\",M116-M113)","v":""},{"$f":"IF(N116=\"\",\"\",N116-N113)","v":""},{"$f":"IF(O116=\"\",\"\",O116-O113)","v":""}]
[]
[33,null,null,null,null,null,null,null,null,null,null,null,null,null,null,null,{"$f":"IF(AND(ISBLANK(B119), ISBLANK(C119)), \"X\", \"\")","v":"X"}]
[null,null,"          Change",{"$f":"IF(D119=\"\",\"\",D119-D116)","v":""},{"$f":"IF(E119=\"\",\"\",E119-E116)","v":""},{"$f":"IF(F119=\"\",\"\",F119-F116)","v":""},{"$f":"IF(G119=\"\",\"\",G119-G116)","v":""},{"$f":"IF(H119=\"\",\"\",H119-H116)","v":""},{"$f":"IF(I119=\"\",\"\",I119-I116)","v":""},{"$f":"IF(J119=\"\",\"\",J119-J116)","v":""},{"$f":"IF(K119=\"\",\"\",K119-K116)","v":""},{"$f":"IF(L119=\"\",\"\",L119-L116)","v":""},{"$f":"IF(M119=\"\",\"\",M119-M116)","v":""},{"$f":"IF(N119=\"\",\"\",N119-N116)","v":""},{"$f":"IF(O119=\"\",\"\",O119-O116)","v":""}]
[]
[34,null,null,null,null,null,null,null,null,null,null,null,null,null,null,null,{"$f":"IF(AND(ISBLANK(B122), ISBLANK(C122)), \"X\", \"\")","v":"X"}]
[null,null,"          Change",{"$f":"IF(D122=\"\",\"\",D122-D119)","v":""},{"$f":"IF(E122=\"\",\"\",E122-E119)","v":""},{"$f":"IF(F122=\"\",\"\",F122-F119)","v":""},{"$f":"IF(G122=\"\",\"\",G122-G119)","v":""},{"$f":"IF(H122=\"\",\"\",H122-H119)","v":""},{"$f":"IF(I122=\"\",\"\",I122-I119)","v":""},{"$f":"IF(J122=\"\",\"\",J122-J119)","v":""},{"$f":"IF(K122=\"\",\"\",K122-K119)","v":""},{"$f":"IF(L122=\"\",\"\",L122-L119)","v":""},{"$f":"IF(M122=\"\",\"\",M122-M119)","v":""},{"$f":"IF(N122=\"\",\"\",N122-N119)","v":""},{"$f":"IF(O122=\"\",\"\",O122-O119)","v":""}]
[]
[35,null,null,null,null,null,null,null,null,null,null,null,null,null,null,null,{"$f":"IF(AND(ISBLANK(B125), ISBLANK(C125)), \"X\", \"\")","v":"X"}]
[null,null,"          Change",{"$f":"IF(D125=\"\",\"\",D125-D122)","v":""},{"$f":"IF(E125=\"\",\"\",E125-E122)","v":""},{"$f":"IF(F125=\"\",\"\",F125-F122)","v":""},{"$f":"IF(G125=\"\",\"\",G125-G122)","v":""},{"$f":"IF(H125=\"\",\"\",H125-H122)","v":""},{"$f":"IF(I125=\"\",\"\",I125-I122)","v":""},{"$f":"IF(J125=\"\",\"\",J125-J122)","v":""},{"$f":"IF(K125=\"\",\"\",K125-K122)","v":""},{"$f":"IF(L125=\"\",\"\",L125-L122)","v":""},{"$f":"IF(M125=\"\",\"\",M125-M122)","v":""},{"$f":"IF(N125=\"\",\"\",N125-N122)","v":""},{"$f":"IF(O125=\"\",\"\",O125-O122)","v":""}]
[]
[36,null,null,null,null,null,null,null,null,null,null,null,null,null,null,null,{"$f":"IF(AND(ISBLANK(B128), ISBLANK(C128)), \"X\", \"\")","v":"X"}]
[null,null,"          Change",{"$f":"IF(D128=\"\",\"\",D128-D125)","v":""},{"$f":"IF(E128=\"\",\"\",E128-E125)","v":""},{"$f":"IF(F128=\"\",\"\",F128-F125)","v":""},{"$f":"IF(G128=\"\",\"\",G128-G125)","v":""},{"$f":"IF(H128=\"\",\"\",H128-H125)","v":""},{"$f":"IF(I128=\"\",\"\",I128-I125)","v":""},{"$f":"IF(J128=\"\",\"\",J128-J125)","v":""},{"$f":"IF(K128=\"\",\"\",K128-K125)","v":""},{"$f":"IF(L128=\"\",\"\",L128-L125)","v":""},{"$f":"IF(M128=\"\",\"\",M128-M125)","v":""},{"$f":"IF(N128=\"\",\"\",N128-N125)","v":""},{"$f":"IF(O128=\"\",\"\",O128-O125)","v":""}]
[null,null,null,null,null,null,null,null,null,null,null,null,null,null,null,null,null,"Page Break 2"]
[37,null,null,null,null,null,null,null,null,null,null,null,null,null,null,null,{"$f":"IF(AND(ISBLANK(B131), ISBLANK(C131)), \"X\", \"\")","v":"X"}]
[null,null,"          Change",{"$f":"IF(D131=\"\",\"\",D131-D128)","v":""},{"$f":"IF(E131=\"\",\"\",E131-E128)","v":""},{"$f":"IF(F131=\"\",\"\",F131-F128)","v":""},{"$f":"IF(G131=\"\",\"\",G131-G128)","v":""},{"$f":"IF(H131=\"\",\"\",H131-H128)","v":""},{"$f":"IF(I131=\"\",\"\",I131-I128)","v":""},{"$f":"IF(J131=\"\",\"\",J131-J128)","v":""},{"$f":"IF(K131=\"\",\"\",K131-K128)","v":""},{"$f":"IF(L131=\"\",\"\",L131-L128)","v":""},{"$f":"IF(M131=\"\",\"\",M131-M128)","v":""},{"$f":"IF(N131=\"\",\"\",N131-N128)","v":""},{"$f":"IF(O131=\"\",\"\",O131-O128)","v":""}]
[]
[38,null,null,null,null,null,null,null,null,null,null,null,null,null,null,null,{"$f":"IF(AND(ISBLANK(B134), ISBLANK(C134)), \"X\", \"\")","v":"X"}]
[null,null,"          Change",{"$f":"IF(D134=\"\",\"\",D134-D131)","v":""},{"$f":"IF(E134=\"\",\"\",E134-E131)","v":""},{"$f":"IF(F134=\"\",\"\",F134-F131)","v":""},{"$f":"IF(G134=\"\",\"\",G134-G131)","v":""},{"$f":"IF(H134=\"\",\"\",H134-H131)","v":""},{"$f":"IF(I134=\"\",\"\",I134-I131)","v":""},{"$f":"IF(J134=\"\",\"\",J134-J131)","v":""},{"$f":"IF(K134=\"\",\"\",K134-K131)","v":""},{"$f":"IF(L134=\"\",\"\",L134-L131)","v":""},{"$f":"IF(M134=\"\",\"\",M134-M131)","v":""},{"$f":"IF(N134=\"\",\"\",N134-N131)","v":""},{"$f":"IF(O134=\"\",\"\",O134-O131)","v":""}]
[]
[39,null,null,null,null,null,null,null,null,null,null,null,null,null,null,null,{"$f":"IF(AND(ISBLANK(B137), ISBLANK(C137)), \"X\", \"\")","v":"X"}]
[null,null,"          Change",{"$f":"IF(D137=\"\",\"\",D137-D134)","v":""},{"$f":"IF(E137=\"\",\"\",E137-E134)","v":""},{"$f":"IF(F137=\"\",\"\",F137-F134)","v":""},{"$f":"IF(G137=\"\",\"\",G137-G134)","v":""},{"$f":"IF(H137=\"\",\"\",H137-H134)","v":""},{"$f":"IF(I137=\"\",\"\",I137-I134)","v":""},{"$f":"IF(J137=\"\",\"\",J137-J134)","v":""},{"$f":"IF(K137=\"\",\"\",K137-K134)","v":""},{"$f":"IF(L137=\"\",\"\",L137-L134)","v":""},{"$f":"IF(M137=\"\",\"\",M137-M134)","v":""},{"$f":"IF(N137=\"\",\"\",N137-N134)","v":""},{"$f":"IF(O137=\"\",\"\",O137-O134)","v":""}]
[]
[40,null,null,null,null,null,null,null,null,null,null,null,null,null,null,null,{"$f":"IF(AND(ISBLANK(B140), ISBLANK(C140)), \"X\", \"\")","v":"X"}]
[null,null,"          Change",{"$f":"IF(D140=\"\",\"\",D140-D137)","v":""},{"$f":"IF(E140=\"\",\"\",E140-E137)","v":""},{"$f":"IF(F140=\"\",\"\",F140-F137)","v":""},{"$f":"IF(G140=\"\",\"\",G140-G137)","v":""},{"$f":"IF(H140=\"\",\"\",H140-H137)","v":""},{"$f":"IF(I140=\"\",\"\",I140-I137)","v":""},{"$f":"IF(J140=\"\",\"\",J140-J137)","v":""},{"$f":"IF(K140=\"\",\"\",K140-K137)","v":""},{"$f":"IF(L140=\"\",\"\",L140-L137)","v":""},{"$f":"IF(M140=\"\",\"\",M140-M137)","v":""},{"$f":"IF(N140=\"\",\"\",N140-N137)","v":""},{"$f":"IF(O140=\"\",\"\",O140-O137)","v":""}]
[]
[41,null,null,null,null,null,null,null,null,null,null,null,null,null,null,null,{"$f":"IF(AND(ISBLANK(B143), ISBLANK(C143)), \"X\", \"\")","v":"X"}]
[null,null,"          Change",{"$f":"IF(D143=\"\",\"\",D143-D140)","v":""},{"$f":"IF(E143=\"\",\"\",E143-E140)","v":""},{"$f":"IF(F143=\"\",\"\",F143-F140)","v":""},{"$f":"IF(G143=\"\",\"\",G143-G140)","v":""},{"$f":"IF(H143=\"\",\"\",H143-H140)","v":""},{"$f":"IF(I143=\"\",\"\",I143-I140)","v":""},{"$f":"IF(J143=\"\",\"\",J143-J140)","v":""},{"$f":"IF(K143=\"\",\"\",K143-K140)","v":""},{"$f":"IF(L143=\"\",\"\",L143-L140)","v":""},{"$f":"IF(M143=\"\",\"\",M143-M140)","v":""},{"$f":"IF(N143=\"\",\"\",N143-N140)","v":""},{"$f":"IF(O143=\"\",\"\",O143-O140)","v":""}]
[]
[42,null,null,null,null,null,null,null,null,null,null,null,null,null,null,null,{"$f":"IF(AND(ISBLANK(B146), ISBLANK(C146)), \"X\", \"\")","v":"X"}]
[null,null,"          Change",{"$f":"IF(D146=\"\",\"\",D146-D143)","v":""},{"$f":"IF(E146=\"\",\"\",E146-E143)","v":""},{"$f":"IF(F146=\"\",\"\",F146-F143)","v":""},{"$f":"IF(G146=\"\",\"\",G146-G143)","v":""},{"$f":"IF(H146=\"\",\"\",H146-H143)","v":""},{"$f":"IF(I146=\"\",\"\",I146-I143)","v":""},{"$f":"IF(J146=\"\",\"\",J146-J143)","v":""},{"$f":"IF(K146=\"\",\"\",K146-K143)","v":""},{"$f":"IF(L146=\"\",\"\",L146-L143)","v":""},{"$f":"IF(M146=\"\",\"\",M146-M143)","v":""},{"$f":"IF(N146=\"\",\"\",N146-N143)","v":""},{"$f":"IF(O146=\"\",\"\",O146-O143)","v":""}]
[]
[43,null,null,null,null,null,null,null,null,null,null,null,null,null,null,null,{"$f":"IF(AND(ISBLANK(B149), ISBLANK(C149)), \"X\", \"\")","v":"X"}]
[null,null,"          Change",{"$f":"IF(D149=\"\",\"\",D149-D146)","v":""},{"$f":"IF(E149=\"\",\"\",E149-E146)","v":""},{"$f":"IF(F149=\"\",\"\",F149-F146)","v":""},{"$f":"IF(G149=\"\",\"\",G149-G146)","v":""},{"$f":"IF(H149=\"\",\"\",H149-H146)","v":""},{"$f":"IF(I149=\"\",\"\",I149-I146)","v":""},{"$f":"IF(J149=\"\",\"\",J149-J146)","v":""},{"$f":"IF(K149=\"\",\"\",K149-K146)","v":""},{"$f":"IF(L149=\"\",\"\",L149-L146)","v":""},{"$f":"IF(M149=\"\",\"\",M149-M146)","v":""},{"$f":"IF(N149=\"\",\"\",N149-N146)","v":""},{"$f":"IF(O149=\"\",\"\",O149-O146)","v":""}]
[]
[44,null,null,null,null,null,null,null,null,null,null,null,null,null,null,null,{"$f":"IF(AND(ISBLANK(B152), ISBLANK(C152)), \"X\", \"\")","v":"X"}]
[null,null,"          Change",{"$f":"IF(D152=\"\",\"\",D152-D149)","v":""},{"$f":"IF(E152=\"\",\"\",E152-E149)","v":""},{"$f":"IF(F152=\"\",\"\",F152-F149)","v":""},{"$f":"IF(G152=\"\",\"\",G152-G149)","v":""},{"$f":"IF(H152=\"\",\"\",H152-H149)","v":""},{"$f":"IF(I152=\"\",\"\",I152-I149)","v":""},{"$f":"IF(J152=\"\",\"\",J152-J149)","v":""},{"$f":"IF(K152=\"\",\"\",K152-K149)","v":""},{"$f":"IF(L152=\"\",\"\",L152-L149)","v":""},{"$f":"IF(M152=\"\",\"\",M152-M149)","v":""},{"$f":"IF(N152=\"\",\"\",N152-N149)","v":""},{"$f":"IF(O152=\"\",\"\",O152-O149)","v":""}]
[]
[45,null,null,null,null,null,null,null,null,null,null,null,null,null,null,null,{"$f":"IF(AND(ISBLANK(B155), ISBLANK(C155)), \"X\", \"\")","v":"X"}]
[null,null,"          Change",{"$f":"IF(D155=\"\",\"\",D155-D152)","v":""},{"$f":"IF(E155=\"\",\"\",E155-E152)","v":""},{"$f":"IF(F155=\"\",\"\",F155-F152)","v":""},{"$f":"IF(G155=\"\",\"\",G155-G152)","v":""},{"$f":"IF(H155=\"\",\"\",H155-H152)","v":""},{"$f":"IF(I155=\"\",\"\",I155-I152)","v":""},{"$f":"IF(J155=\"\",\"\",J155-J152)","v":""},{"$f":"IF(K155=\"\",\"\",K155-K152)","v":""},{"$f":"IF(L155=\"\",\"\",L155-L152)","v":""},{"$f":"IF(M155=\"\",\"\",M155-M152)","v":""},{"$f":"IF(N155=\"\",\"\",N155-N152)","v":""},{"$f":"IF(O155=\"\",\"\",O155-O152)","v":""}]
[]
[46,null,null,null,null,null,null,null,null,null,null,null,null,null,null,null,{"$f":"IF(AND(ISBLANK(B158), ISBLANK(C158)), \"X\", \"\")","v":"X"}]
[null,null,"          Change",{"$f":"IF(D158=\"\",\"\",D158-D155)","v":""},{"$f":"IF(E158=\"\",\"\",E158-E155)","v":""},{"$f":"IF(F158=\"\",\"\",F158-F155)","v":""},{"$f":"IF(G158=\"\",\"\",G158-G155)","v":""},{"$f":"IF(H158=\"\",\"\",H158-H155)","v":""},{"$f":"IF(I158=\"\",\"\",I158-I155)","v":""},{"$f":"IF(J158=\"\",\"\",J158-J155)","v":""},{"$f":"IF(K158=\"\",\"\",K158-K155)","v":""},{"$f":"IF(L158=\"\",\"\",L158-L155)","v":""},{"$f":"IF(M158=\"\",\"\",M158-M155)","v":""},{"$f":"IF(N158=\"\",\"\",N158-N155)","v":""},{"$f":"IF(O158=\"\",\"\",O158-O155)","v":""}]
[]
[47,null,null,null,null,null,null,null,null,null,null,null,null,null,null,null,{"$f":"IF(AND(ISBLANK(B161), ISBLANK(C161)), \"X\", \"\")","v":"X"}]
[null,null,"          Change",{"$f":"IF(D161=\"\",\"\",D161-D158)","v":""},{"$f":"IF(E161=\"\",\"\",E161-E158)","v":""},{"$f":"IF(F161=\"\",\"\",F161-F158)","v":""},{"$f":"IF(G161=\"\",\"\",G161-G158)","v":""},{"$f":"IF(H161=\"\",\"\",H161-H158)","v":""},{"$f":"IF(I161=\"\",\"\",I161-I158)","v":""},{"$f":"IF(J161=\"\",\"\",J161-J158)","v":""},{"$f":"IF(K161=\"\",\"\",K161-K158)","v":""},{"$f":"IF(L161=\"\",\"\",L161-L158)","v":""},{"$f":"IF(M161=\"\",\"\",M161-M158)","v":""},{"$f":"IF(N161=\"\",\"\",N161-N158)","v":""},{"$f":"IF(O161=\"\",\"\",O161-O158)","v":""}]
[]
[48,null,null,null,null,null,null,null,null,null,null,null,null,null,null,null,{"$f":"IF(AND(ISBLANK(B164), ISBLANK(C164)), \"X\", \"\")","v":"X"}]
[null,null,"          Change",{"$f":"IF(D164=\"\",\"\",D164-D161)","v":""},{"$f":"IF(E164=\"\",\"\",E164-E161)","v":""},{"$f":"IF(F164=\"\",\"\",F164-F161)","v":""},{"$f":"IF(G164=\"\",\"\",G164-G161)","v":""},{"$f":"IF(H164=\"\",\"\",H164-H161)","v":""},{"$f":"IF(I164=\"\",\"\",I164-I161)","v":""},{"$f":"IF(J164=\"\",\"\",J164-J161)","v":""},{"$f":"IF(K164=\"\",\"\",K164-K161)","v":""},{"$f":"IF(L164=\"\",\"\",L164-L161)","v":""},{"$f":"IF(M164=\"\",\"\",M164-M161)","v":""},{"$f":"IF(N164=\"\",\"\",N164-N161)","v":""},{"$f":"IF(O164=\"\",\"\",O164-O161)","v":""}]
[]
[49,null,null,null,null,null,null,null,null,null,null,null,null,null,null,null,{"$f":"IF(AND(ISBLANK(B167), ISBLANK(C167)), \"X\", \"\")","v":"X"}]
[null,null,"          Change",{"$f":"IF(D167=\"\",\"\",D167-D164)","v":""},{"$f":"IF(E167=\"\",\"\",E167-E164)","v":""},{"$f":"IF(F167=\"\",\"\",F167-F164)","v":""},{"$f":"IF(G167=\"\",\"\",G167-G164)","v":""},{"$f":"IF(H167=\"\",\"\",H167-H164)","v":""},{"$f":"IF(I167=\"\",\"\",I167-I164)","v":""},{"$f":"IF(J167=\"\",\"\",J167-J164)","v":""},{"$f":"IF(K167=\"\",\"\",K167-K164)","v":""},{"$f":"IF(L167=\"\",\"\",L167-L164)","v":""},{"$f":"IF(M167=\"\",\"\",M167-M164)","v":""},{"$f":"IF(N167=\"\",\"\",N167-N164)","v":""},{"$f":"IF(O167=\"\",\"\",O167-O164)","v":""}]
[]
[50,null,null,null,null,null,null,null,null,null,null,null,null,null,null,null,{"$f":"IF(AND(ISBLANK(B170), ISBLANK(C170)), \"X\", \"\")","v":"X"}]
[null,null,"          Change",{"$f":"IF(D170=\"\",\"\",D170-D167)","v":""},{"$f":"IF(E170=\"\",\"\",E170-E167)","v":""},{"$f":"IF(F170=\"\",\"\",F170-F167)","v":""},{"$f":"IF(G170=\"\",\"\",G170-G167)","v":""},{"$f":"IF(H170=\"\",\"\",H170-H167)","v":""},{"$f":"IF(I170=\"\",\"\",I170-I167)","v":""},{"$f":"IF(J170=\"\",\"\",J170-J167)","v":""},{"$f":"IF(K170=\"\",\"\",K170-K167)","v":""},{"$f":"IF(L170=\"\",\"\",L170-L167)","v":""},{"$f":"IF(M170=\"\",\"\",M170-M167)","v":""},{"$f":"IF(N170=\"\",\"\",N170-N167)","v":""},{"$f":"IF(O170=\"\",\"\",O170-O167)","v":""}]
[]
[51,null,null,null,null,null,null,null,null,null,null,null,null,null,null,null,{"$f":"IF(AND(ISBLANK(B173), ISBLANK(C173)), \"X\", \"\")","v":"X"}]
[null,null,"          Change",{"$f":"IF(D173=\"\",\"\",D173-D170)","v":""},{"$f":"IF(E173=\"\",\"\",E173-E170)","v":""},{"$f":"IF(F173=\"\",\"\",F173-F170)","v":""},{"$f":"IF(G173=\"\",\"\",G173-G170)","v":""},{"$f":"IF(H173=\"\",\"\",H173-H170)","v":""},{"$f":"IF(I173=\"\",\"\",I173-I170)","v":""},{"$f":"IF(J173=\"\",\"\",J173-J170)","v":""},{"$f":"IF(K173=\"\",\"\",K173-K170)","v":""},{"$f":"IF(L173=\"\",\"\",L173-L170)","v":""},{"$f":"IF(M173=\"\",\"\",M173-M170)","v":""},{"$f":"IF(N173=\"\",\"\",N173-N170)","v":""},{"$f":"IF(O173=\"\",\"\",O173-O170)","v":""}]
[]
[52,null,null,null,null,null,null,null,null,null,null,null,null,null,null,null,{"$f":"IF(AND(ISBLANK(B176), ISBLANK(C176)), \"X\", \"\")","v":"X"}]
[null,null,"          Change",{"$f":"IF(D176=\"\",\"\",D176-D173)","v":""},{"$f":"IF(E176=\"\",\"\",E176-E173)","v":""},{"$f":"IF(F176=\"\",\"\",F176-F173)","v":""},{"$f":"IF(G176=\"\",\"\",G176-G173)","v":""},{"$f":"IF(H176=\"\",\"\",H176-H173)","v":""},{"$f":"IF(I176=\"\",\"\",I176-I173)","v":""},{"$f":"IF(J176=\"\",\"\",J176-J173)","v":""},{"$f":"IF(K176=\"\",\"\",K176-K173)","v":""},{"$f":"IF(L176=\"\",\"\",L176-L173)","v":""},{"$f":"IF(M176=\"\",\"\",M176-M173)","v":""},{"$f":"IF(N176=\"\",\"\",N176-N173)","v":""},{"$f":"IF(O176=\"\",\"\",O176-O173)","v":""}]
[]
[53,null,null,null,null,null,null,null,null,null,null,null,null,null,null,null,{"$f":"IF(AND(ISBLANK(B179), ISBLANK(C179)), \"X\", \"\")","v":"X"}]
[null,null,"          Change",{"$f":"IF(D179=\"\",\"\",D179-D176)","v":""},{"$f":"IF(E179=\"\",\"\",E179-E176)","v":""},{"$f":"IF(F179=\"\",\"\",F179-F176)","v":""},{"$f":"IF(G179=\"\",\"\",G179-G176)","v":""},{"$f":"IF(H179=\"\",\"\",H179-H176)","v":""},{"$f":"IF(I179=\"\",\"\",I179-I176)","v":""},{"$f":"IF(J179=\"\",\"\",J179-J176)","v":""},{"$f":"IF(K179=\"\",\"\",K179-K176)","v":""},{"$f":"IF(L179=\"\",\"\",L179-L176)","v":""},{"$f":"IF(M179=\"\",\"\",M179-M176)","v":""},{"$f":"IF(N179=\"\",\"\",N179-N176)","v":""},{"$f":"IF(O179=\"\",\"\",O179-O176)","v":""}]
[null,null,null,null,null,null,null,null,null,null,null,null,null,null,null,null,null,"Page Break 3"]
[54,null,null,null,null,null,null,null,null,null,null,null,null,null,null,null,{"$f":"IF(AND(ISBLANK(B182), ISBLANK(C182)), \"X\", \"\")","v":"X"}]
[null,null,"          Change",{"$f":"IF(D182=\"\",\"\",D182-D179)","v":""},{"$f":"IF(E182=\"\",\"\",E182-E179)","v":""},{"$f":"IF(F182=\"\",\"\",F182-F179)","v":""},{"$f":"IF(G182=\"\",\"\",G182-G179)","v":""},{"$f":"IF(H182=\"\",\"\",H182-H179)","v":""},{"$f":"IF(I182=\"\",\"\",I182-I179)","v":""},{"$f":"IF(J182=\"\",\"\",J182-J179)","v":""},{"$f":"IF(K182=\"\",\"\",K182-K179)","v":""},{"$f":"IF(L182=\"\",\"\",L182-L179)","v":""},{"$f":"IF(M182=\"\",\"\",M182-M179)","v":""},{"$f":"IF(N182=\"\",\"\",N182-N179)","v":""},{"$f":"IF(O182=\"\",\"\",O182-O179)","v":""}]
[]
[55,null,null,null,null,null,null,null,null,null,null,null,null,null,null,null,{"$f":"IF(AND(ISBLANK(B185), ISBLANK(C185)), \"X\", \"\")","v":"X"}]
[null,null,"          Change",{"$f":"IF(D185=\"\",\"\",D185-D182)","v":""},{"$f":"IF(E185=\"\",\"\",E185-E182)","v":""},{"$f":"IF(F185=\"\",\"\",F185-F182)","v":""},{"$f":"IF(G185=\"\",\"\",G185-G182)","v":""},{"$f":"IF(H185=\"\",\"\",H185-H182)","v":""},{"$f":"IF(I185=\"\",\"\",I185-I182)","v":""},{"$f":"IF(J185=\"\",\"\",J185-J182)","v":""},{"$f":"IF(K185=\"\",\"\",K185-K182)","v":""},{"$f":"IF(L185=\"\",\"\",L185-L182)","v":""},{"$f":"IF(M185=\"\",\"\",M185-M182)","v":""},{"$f":"IF(N185=\"\",\"\",N185-N182)","v":""},{"$f":"IF(O185=\"\",\"\",O185-O182)","v":""}]
[]
[56,null,null,null,null,null,null,null,null,null,null,null,null,null,null,null,{"$f":"IF(AND(ISBLANK(B188), ISBLANK(C188)), \"X\", \"\")","v":"X"}]
[null,null,"          Change",{"$f":"IF(D188=\"\",\"\",D188-D185)","v":""},{"$f":"IF(E188=\"\",\"\",E188-E185)","v":""},{"$f":"IF(F188=\"\",\"\",F188-F185)","v":""},{"$f":"IF(G188=\"\",\"\",G188-G185)","v":""},{"$f":"IF(H188=\"\",\"\",H188-H185)","v":""},{"$f":"IF(I188=\"\",\"\",I188-I185)","v":""},{"$f":"IF(J188=\"\",\"\",J188-J185)","v":""},{"$f":"IF(K188=\"\",\"\",K188-K185)","v":""},{"$f":"IF(L188=\"\",\"\",L188-L185)","v":""},{"$f":"IF(M188=\"\",\"\",M188-M185)","v":""},{"$f":"IF(N188=\"\",\"\",N188-N185)","v":""},{"$f":"IF(O188=\"\",\"\",O188-O185)","v":""}]
[]
[57,null,null,null,null,null,null,null,null,null,null,null,null,null,null,null,{"$f":"IF(AND(ISBLANK(B191), ISBLANK(C191)), \"X\", \"\")","v":"X"}]
[null,null,"          Change",{"$f":"IF(D191=\"\",\"\",D191-D188)","v":""},{"$f":"IF(E191=\"\",\"\",E191-E188)","v":""},{"$f":"IF(F191=\"\",\"\",F191-F188)","v":""},{"$f":"IF(G191=\"\",\"\",G191-G188)","v":""},{"$f":"IF(H191=\"\",\"\",H191-H188)","v":""},{"$f":"IF(I191=\"\",\"\",I191-I188)","v":""},{"$f":"IF(J191=\"\",\"\",J191-J188)","v":""},{"$f":"IF(K191=\"\",\"\",K191-K188)","v":""},{"$f":"IF(L191=\"\",\"\",L191-L188)","v":""},{"$f":"IF(M191=\"\",\"\",M191-M188)","v":""},{"$f":"IF(N191=\"\",\"\",N191-N188)","v":""},{"$f":"IF(O191=\"\",\"\",O191-O188)","v":""}]
[]
[58,null,null,null,null,null,null,null,null,null,null,null,null,null,null,null,{"$f":"IF(AND(ISBLANK(B194), ISBLANK(C194)), \"X\", \"\")","v":"X"}]
[null,null,"          Change",{"$f":"IF(D194=\"\",\"\",D194-D191)","v":""},{"$f":"IF(E194=\"\",\"\",E194-E191)","v":""},{"$f":"IF(F194=\"\",\"\",F194-F191)","v":""},{"$f":"IF(G194=\"\",\"\",G194-G191)","v":""},{"$f":"IF(H194=\"\",\"\",H194-H191)","v":""},{"$f":"IF(I194=\"\",\"\",I194-I191)","v":""},{"$f":"IF(J194=\"\",\"\",J194-J191)","v":""},{"$f":"IF(K194=\"\",\"\",K194-K191)","v":""},{"$f":"IF(L194=\"\",\"\",L194-L191)","v":""},{"$f":"IF(M194=\"\",\"\",M194-M191)","v":""},{"$f":"IF(N194=\"\",\"\",N194-N191)","v":""},{"$f":"IF(O194=\"\",\"\",O194-O191)","v":""}]
[]
[59,null,null,null,null,null,null,null,null,null,null,null,null,null,null,null,{"$f":"IF(AND(ISBLANK(B197), ISBLANK(C197)), \"X\", \"\")","v":"X"}]
[null,null,"          Change",{"$f":"IF(D197=\"\",\"\",D197-D194)","v":""},{"$f":"IF(E197=\"\",\"\",E197-E194)","v":""},{"$f":"IF(F197=\"\",\"\",F197-F194)","v":""},{"$f":"IF(G197=\"\",\"\",G197-G194)","v":""},{"$f":"IF(H197=\"\",\"\",H197-H194)","v":""},{"$f":"IF(I197=\"\",\"\",I197-I194)","v":""},{"$f":"IF(J197=\"\",\"\",J197-J194)","v":""},{"$f":"IF(K197=\"\",\"\",K197-K194)","v":""},{"$f":"IF(L197=\"\",\"\",L197-L194)","v":""},{"$f":"IF(M197=\"\",\"\",M197-M194)","v":""},{"$f":"IF(N197=\"\",\"\",N197-N194)","v":""},{"$f":"IF(O197=\"\",\"\",O197-O194)","v":""}]
[]
[60,null,null,null,null,null,null,null,null,null,null,null,null,null,null,null,{"$f":"IF(AND(ISBLANK(B200), ISBLANK(C200)), \"X\", \"\")","v":"X"}]
[null,null,"          Change",{"$f":"IF(D200=\"\",\"\",D200-D197)","v":""},{"$f":"IF(E200=\"\",\"\",E200-E197)","v":""},{"$f":"IF(F200=\"\",\"\",F200-F197)","v":""},{"$f":"IF(G200=\"\",\"\",G200-G197)","v":""},{"$f":"IF(H200=\"\",\"\",H200-H197)","v":""},{"$f":"IF(I200=\"\",\"\",I200-I197)","v":""},{"$f":"IF(J200=\"\",\"\",J200-J197)","v":""},{"$f":"IF(K200=\"\",\"\",K200-K197)","v":""},{"$f":"IF(L200=\"\",\"\",L200-L197)","v":""},{"$f":"IF(M200=\"\",\"\",M200-M197)","v":""},{"$f":"IF(N200=\"\",\"\",N200-N197)","v":""},{"$f":"IF(O200=\"\",\"\",O200-O197)","v":""}]
[]
[null,null,null,null,null,null,null,null,null,null,null,null,null,null,null,null,null,"Page Break 4"]