{"text_format":"1","workbook":"xlsx","n_sheets":12,"sheets":["1. Info","2. Table of Contents","3. Data_Input_Sheet","4. Rate_Base","5. Utility Income","6. Taxes_PILs","7. Cost_of_Capital","8. Rev_Def_Suff","9. Rev_Reqt","10. Tracking_Sheet","Not part of Model ==>","Data"],"not_rendered":{"charts":0,"images":5,"macros":1,"external_links":2,"defined_names":13,"comments":0,"pivot_tables":0},"unopened":[],"bounds":{"document_bytes":16777216,"sheet_cells":100000,"rows_first":2000,"rows_last":500,"rows_between":2000,"halvings":0,"cell_chars":16384,"cell_head_chars":4096},"cells_cut":0,"cells_raw":0,"read":"whole","date_system":"1900"}

{"sheet":"1. Info","index":0,"n_rows":98,"n_cols":29,"rows_kept":98,"cut":false,"hidden":false,"merged":[[27,1,27,3],[34,1,40,11],[0,2,1,12],[2,2,3,12],[27,4,27,9],[25,6,25,10],[21,1,21,2],[15,6,15,12],[17,6,17,10],[19,6,19,10],[21,6,21,10],[23,6,23,10],[23,1,23,2],[25,1,25,3]]}
[null,null,null,null,null,null,null,null,null,null,null,null,null,null,null,null,null,null,null,null,null,null,null,null,null,null,null,null,{"$f":"IF('3. Data_Input_Sheet'!M12=0, \"\", '3. Data_Input_Sheet'!M12)","v":"Close of Discovery"}]
[]
[]
[]
[]
[]
[]
[]
[]
[]
[null,null,null,null,null,null,null,null,null,null,null,null,null,null,null,"Version",4]
[]
[]
[]
[]
[null,null,null,null,null,"Utility Name   ","Oshawa PUC Networks Inc."]
[]
[null,null,null,null,null,"Service Territory","Oshawa"]
[]
[null,null,null,null,null,"Assigned EB Number","EB-2014-0101",null,null,null,null,null,null,null,null,null,null,null,null,null,null,null,null,null,null,null,"Company Name"]
[null,null,null,null,null,null,null,null,null,null,null,null,null,null,null,null,null,null,null,null,null,null,null,null,null,1,"Algoma Power Inc."]
[null,null,null,null,null,"Name and Title","David Savage, Corporate Controller",null,null,null,null,null,null,null,null,null,null,null,null,null,null,null,null,null,null,2,"Atikokan Hydro Inc."]
[null,null,null,null,null,null,null,null,null,null,null,null,null,null,null,null,null,null,null,null,null,null,null,null,null,3,"Attawapiskat Power Corporation"]
[null,null,null,null,null,"Phone Number   ","905-743 5219",null,null,null,null,null,null,null,null,null,null,null,null,null,null,null,null,null,null,4,"Bluewater Power Distribution Corp."]
[null,null,null,null,null,null,null,null,null,null,null,null,null,null,null,null,null,null,null,null,null,null,null,null,null,5,"Brant County Power"]
[null,null,null,null,null,"Email Address   ","dsavage@opuc.on.ca",null,null,null,null,null,null,null,null,null,null,null,null,null,null,null,null,null,null,6,"Brantford Power Inc."]
[null,null,null,null,null,null,null,null,null,null,null,null,null,null,null,null,null,null,null,null,null,null,null,null,null,7,"Burlington Hydro Inc."]
[null,null,null,null,null,null,null,null,null,null,null,null,null,null,null,null,null,null,null,null,null,null,null,null,null,8,"Cambridge and North Dumfries Hydro"]
[null,null,null,null,null,null,null,null,null,null,null,null,null,null,null,null,null,null,null,null,null,null,null,null,null,9,"Canadian Niagara Power Inc. – Eastern Ontario Power/Fort Erie/Port Colborne"]
[null,null,null,null,null,null,null,null,null,null,null,null,null,null,null,null,null,null,null,null,null,null,null,null,null,10,"Centre Wellington Hydro Ltd."]
[null,null,null,null,null,null,null,null,null,null,null,null,null,null,null,null,null,null,null,null,null,null,null,null,null,11,"Chapleau Public Utilities Corporation"]
[null,null,null,null,null,null,null,null,null,null,null,null,null,null,null,null,null,null,null,null,null,null,null,null,null,12,"COLLUS Power Corp."]
[null,null,null,null,null,null,null,null,null,null,null,null,null,null,null,null,null,null,null,null,null,null,null,null,null,13,"Cooperative Hydro Embrun Inc."]
[null,null,null,null,null,null,null,null,null,null,null,null,null,null,null,null,null,null,null,null,null,null,null,null,null,14,"E.L.K. Energy Inc."]
[null,null,null,null,null,null,null,null,null,null,null,null,null,null,null,null,null,null,null,null,null,null,null,null,null,15,"Enersource Hydro Mississauga Inc."]
[null,null,null,null,null,null,null,null,null,null,null,null,null,null,null,null,null,null,null,null,null,null,null,null,null,16,"Entegrus Powerlines Inc."]
[null,null,null,null,null,null,null,null,null,null,null,null,null,null,null,null,null,null,null,null,null,null,null,null,null,17,"ENWIN Utilities Ltd."]
[null,null,null,null,null,null,null,null,null,null,null,null,null,null,null,null,null,null,null,null,null,null,null,null,null,18,"Erie Thames Powerlines Corp."]
[null,null,null,null,null,null,null,null,null,null,null,null,null,null,null,null,null,null,null,null,null,null,null,null,null,19,"Espanola Regional Hydro Distribution Corporation"]
[null,null,null,null,null,null,null,null,null,null,null,null,null,null,null,null,null,null,null,null,null,null,null,null,null,20,"Essex Powerlines Corporation"]
[null,null,null,null,null,null,null,null,null,null,null,null,null,null,null,null,null,null,null,null,null,null,null,null,null,21,"Festival Hydro Inc."]
[null,null,null,null,null,null,null,null,null,null,null,null,null,null,null,null,null,null,null,null,null,null,null,null,null,22,"Fort Albany Power Corporation"]
[null,null,null,null,null,null,null,null,null,null,null,null,null,null,null,null,null,null,null,null,null,null,null,null,null,23,"Fort Frances Power Corporation"]
[null,null,null,null,null,null,null,null,null,null,null,null,null,null,null,null,null,null,null,null,null,null,null,null,null,24,"Greater Sudbury Hydro Inc."]
[null,null,null,null,null,null,null,null,null,null,null,null,null,null,null,null,null,null,null,null,null,null,null,null,null,25,"Grimsby Power Inc."]
[null,null,null,null,null,null,null,null,null,null,null,null,null,null,null,null,null,null,null,null,null,null,null,null,null,26,"Guelph Hydro Electric Systems Inc."]
[null,null,null,null,null,null,null,null,null,null,null,null,null,null,null,null,null,null,null,null,null,null,null,null,null,27,"Haldimand County Hydro Inc."]
[null,null,null,null,null,null,null,null,null,null,null,null,null,null,null,null,null,null,null,null,null,null,null,null,null,28,"Halton Hills Hydro Inc."]
[null,null,null,null,null,null,null,null,null,null,null,null,null,null,null,null,null,null,null,null,null,null,null,null,null,29,"Hearst Power Distribution Co. Ltd."]
[null,null,null,null,null,null,null,null,null,null,null,null,null,null,null,null,null,null,null,null,null,null,null,null,null,30,"Horizon Utilities Corporation"]
[null,null,null,null,null,null,null,null,null,null,null,null,null,null,null,null,null,null,null,null,null,null,null,null,null,31,"Hydro 2000 Inc."]
[null,null,null,null,null,null,null,null,null,null,null,null,null,null,null,null,null,null,null,null,null,null,null,null,null,32,"Hydro Hawkesbury Inc."]
[null,null,null,null,null,null,null,null,null,null,null,null,null,null,null,null,null,null,null,null,null,null,null,null,null,33,"Hydro One Brampton Networks Inc."]
[null,null,null,null,null,null,null,null,null,null,null,null,null,null,null,null,null,null,null,null,null,null,null,null,null,34,"Hydro One Networks Inc."]
[null,null,null,null,null,null,null,null,null,null,null,null,null,null,null,null,null,null,null,null,null,null,null,null,null,35,"Hydro One Remote Communities Inc."]
[null,null,null,null,null,null,null,null,null,null,null,null,null,null,null,null,null,null,null,null,null,null,null,null,null,36,"Hydro Ottawa Limited"]
[null,null,null,null,null,null,null,null,null,null,null,null,null,null,null,null,null,null,null,null,null,null,null,null,null,37,"Innisfil Hydro Dist. Systems Limited"]
[null,null,null,null,null,null,null,null,null,null,null,null,null,null,null,null,null,null,null,null,null,null,null,null,null,38,"Kashechewan Power Corporation"]
[null,null,null,null,null,null,null,null,null,null,null,null,null,null,null,null,null,null,null,null,null,null,null,null,null,39,"Kenora Hydro Electric Corporation Ltd."]
[null,null,null,null,null,null,null,null,null,null,null,null,null,null,null,null,null,null,null,null,null,null,null,null,null,40,"Kingston Hydro Corporation"]
[null,null,null,null,null,null,null,null,null,null,null,null,null,null,null,null,null,null,null,null,null,null,null,null,null,41,"Kitchener-Wilmot Hydro Inc."]
[null,null,null,null,null,null,null,null,null,null,null,null,null,null,null,null,null,null,null,null,null,null,null,null,null,42,"Lakefront Utilities Inc."]
[null,null,null,null,null,null,null,null,null,null,null,null,null,null,null,null,null,null,null,null,null,null,null,null,null,43,"Lakeland Power Distribution Ltd."]
[null,null,null,null,null,null,null,null,null,null,null,null,null,null,null,null,null,null,null,null,null,null,null,null,null,44,"London Hydro Inc."]
[null,null,null,null,null,null,null,null,null,null,null,null,null,null,null,null,null,null,null,null,null,null,null,null,null,45,"Midland Power Utility Corporation"]
[null,null,null,null,null,null,null,null,null,null,null,null,null,null,null,null,null,null,null,null,null,null,null,null,null,46,"Milton Hydro Distribution Inc."]
[null,null,null,null,null,null,null,null,null,null,null,null,null,null,null,null,null,null,null,null,null,null,null,null,null,47,"Newmarket – Tay Power Distribution Ltd."]
[null,null,null,null,null,null,null,null,null,null,null,null,null,null,null,null,null,null,null,null,null,null,null,null,null,48,"Niagara Peninsula Energy Inc."]
[null,null,null,null,null,null,null,null,null,null,null,null,null,null,null,null,null,null,null,null,null,null,null,null,null,49,"Niagara-on-the-Lake Hydro Inc."]
[null,null,null,null,null,null,null,null,null,null,null,null,null,null,null,null,null,null,null,null,null,null,null,null,null,50,"Norfolk Power Distribution Ltd."]
[null,null,null,null,null,null,null,null,null,null,null,null,null,null,null,null,null,null,null,null,null,null,null,null,null,51,"North Bay Hydro Distribution Limited"]
[null,null,null,null,null,null,null,null,null,null,null,null,null,null,null,null,null,null,null,null,null,null,null,null,null,52,"Northern Ontario Wires Inc."]
[null,null,null,null,null,null,null,null,null,null,null,null,null,null,null,null,null,null,null,null,null,null,null,null,null,53,"Oakville Hydro Distribution Inc."]
[null,null,null,null,null,null,null,null,null,null,null,null,null,null,null,null,null,null,null,null,null,null,null,null,null,54,"Orangeville Hydro Limited"]
[null,null,null,null,null,null,null,null,null,null,null,null,null,null,null,null,null,null,null,null,null,null,null,null,null,55,"Orillia Power Distribution Corp."]
[null,null,null,null,null,null,null,null,null,null,null,null,null,null,null,null,null,null,null,null,null,null,null,null,null,56,"Oshawa PUC Networks Inc."]
[null,null,null,null,null,null,null,null,null,null,null,null,null,null,null,null,null,null,null,null,null,null,null,null,null,57,"Ottawa River Power Corporation"]
[null,null,null,null,null,null,null,null,null,null,null,null,null,null,null,null,null,null,null,null,null,null,null,null,null,58,"Parry Sound Power Corporation"]
[null,null,null,null,null,null,null,null,null,null,null,null,null,null,null,null,null,null,null,null,null,null,null,null,null,59,"Peterborough Distribution Inc."]
[null,null,null,null,null,null,null,null,null,null,null,null,null,null,null,null,null,null,null,null,null,null,null,null,null,60,"PowerStream Inc. - Barrie"]
[null,null,null,null,null,null,null,null,null,null,null,null,null,null,null,null,null,null,null,null,null,null,null,null,null,61,"PowerStream Inc. - South"]
[null,null,null,null,null,null,null,null,null,null,null,null,null,null,null,null,null,null,null,null,null,null,null,null,null,62,"PUC Distribution Inc."]
[null,null,null,null,null,null,null,null,null,null,null,null,null,null,null,null,null,null,null,null,null,null,null,null,null,63,"Renfrew Hydro Inc."]
[null,null,null,null,null,null,null,null,null,null,null,null,null,null,null,null,null,null,null,null,null,null,null,null,null,64,"Rideau St. Lawrence Distribution Inc."]
[null,null,null,null,null,null,null,null,null,null,null,null,null,null,null,null,null,null,null,null,null,null,null,null,null,65,"St. Thomas Energy Inc."]
[null,null,null,null,null,null,null,null,null,null,null,null,null,null,null,null,null,null,null,null,null,null,null,null,null,66,"Sioux Lookout Hydro Inc."]
[null,null,null,null,null,null,null,null,null,null,null,null,null,null,null,null,null,null,null,null,null,null,null,null,null,67,"Thunder Bay Hydro Electricity Distribution Inc."]
[null,null,null,null,null,null,null,null,null,null,null,null,null,null,null,null,null,null,null,null,null,null,null,null,null,68,"Tillsonburg Hydro Inc."]
[null,null,null,null,null,null,null,null,null,null,null,null,null,null,null,null,null,null,null,null,null,null,null,null,null,69,"Toronto Hydro-Electric System Limited"]
[null,null,null,null,null,null,null,null,null,null,null,null,null,null,null,null,null,null,null,null,null,null,null,null,null,70,"Veridian Connections Inc."]
[null,null,null,null,null,null,null,null,null,null,null,null,null,null,null,null,null,null,null,null,null,null,null,null,null,71,"Wasaga Distribution Inc."]
[null,null,null,null,null,null,null,null,null,null,null,null,null,null,null,null,null,null,null,null,null,null,null,null,null,72,"Waterloo North Hydro Inc."]
[null,null,null,null,null,null,null,null,null,null,null,null,null,null,null,null,null,null,null,null,null,null,null,null,null,73,"Welland Hydro-Electric System Corp."]
[null,null,null,null,null,null,null,null,null,null,null,null,null,null,null,null,null,null,null,null,null,null,null,null,null,74,"Wellington North Power Inc."]
[null,null,null,null,null,null,null,null,null,null,null,null,null,null,null,null,null,null,null,null,null,null,null,null,null,75,"West Coast Huron Energy Inc."]
[null,null,null,null,null,null,null,null,null,null,null,null,null,null,null,null,null,null,null,null,null,null,null,null,null,76,"Westario Power Inc."]
[null,null,null,null,null,null,null,null,null,null,null,null,null,null,null,null,null,null,null,null,null,null,null,null,null,77,"Whitby Hydro Electric Corporation"]
[null,null,null,null,null,null,null,null,null,null,null,null,null,null,null,null,null,null,null,null,null,null,null,null,null,78,"Woodstock Hydro Services Inc."]

{"sheet":"2. Table of Contents","index":1,"n_rows":29,"n_cols":9,"rows_kept":29,"cut":false,"hidden":false,"merged":[[0,2,0,4],[1,3,1,6],[3,3,3,4],[28,1,28,11],[24,1,24,7],[25,1,25,7],[26,1,26,7],[27,1,27,11]]}
[]
[]
[]
[]
[]
[]
[]
[]
[]
[]
[null,null,null,"1. Info",null,null,null,null,"6. Taxes_PILs"]
[]
[null,null,null,"2. Table of Contents",null,null,null,null,"7. Cost_of_Capital"]
[]
[null,null,null,"3. Data_Input_Sheet",null,null,null,null,"8. Rev_Def_Suff"]
[]
[null,null,null,"4. Rate_Base",null,null,null,null,"9. Rev_Reqt"]
[]
[null,null,null,"5. Utility Income"]
[]
[]
[]
[]
["Notes:"]
["(1)","Pale green cells represent inputs"]
["(2)","Pale green boxes at the bottom of each page are for additional notes"]
["(3)","Pale yellow cells represent drop-down lists"]
["(4)","Please note that this model uses MACROS.  Before starting, please ensure that macros have been enabled."]
["(5)","Completed versions of the Revenue Requirement Work Form are required to be filed in working Microsoft Excel format."]

{"sheet":"3. Data_Input_Sheet","index":2,"n_rows":78,"n_cols":23,"rows_kept":78,"cut":false,"hidden":false,"merged":[[79,2,79,20],[77,2,78,20],[0,2,0,12],[7,4,7,20],[19,24,20,24],[68,2,68,20],[3,2,3,10],[1,2,1,10],[2,2,2,10],[11,14,12,14],[11,6,12,6],[11,16,12,16],[11,4,12,4],[11,8,12,8],[11,20,12,20],[11,12,12,12],[87,2,88,20],[70,2,70,20],[71,2,71,20],[69,2,69,20],[86,2,86,20],[74,2,74,20],[80,2,80,20],[72,2,72,20],[75,2,75,20],[76,2,76,20],[81,2,81,20],[82,2,82,20],[83,2,83,20],[84,2,84,20],[85,2,85,20],[73,2,73,20]]}
[null,null,null,null,null,null,null,null,null,null,null,null,null,null,null,null,null,null,null,null,{"$f":"CONCATENATE('2. Table of Contents'!$F$6,\" \",'2. Table of Contents'!$G$6)","v":" "}]
[]
[]
[]
[]
[]
[]
[]
[null,"Data Input (1)"]
[]
[]
[null,null,null,null,"Initial Application",null,"(2)",null,{"$f":"IF(ISBLANK(M12),\"\",\"Adjustments\")","v":"Adjustments"},null,null,null,"Close of Discovery",null,"(6)",null,{"$f":"IF(ISBLANK(M12),\"\",\"Adjustments\")","v":"Adjustments"},null,null,null,"Per Board Decision"]
[]
[]
[null,1,"Rate Base"]
[null,null,"   Gross Fixed Assets (average)",null,173131.86289987928,null,null,null,{"$f":"Data!C5-E16","v":-163.30553610174684},null,null,null,{"$f":"IF(ISBLANK(E16),0,E16+I16)","v":172968.55736377754},null,null,null,null,null,null,null,{"$f":"IF(ISBLANK(E16),\"\",E16+I16+Q16)","v":172968.55736377754}]
[null,null,"   Accumulated Depreciation (average)",null,-85402.755390932507,null,"(5)",null,{"$f":"Data!C6-E17","v":-202.5904278234957},null,null,null,{"$f":"IF(ISBLANK(E17),0,E17+I17)","v":-85605.345818756003},null,null,null,null,null,null,null,{"$f":"IF(ISBLANK(E17),\"\",E17+I17+Q17)","v":-85605.345818756003}]
[null,null,"Allowance for Working Capital:"]
[null,null,"   Controllable Expenses",null,12145.701562388,null,null,null,{"$f":"Data!C8-E19","v":59.04700000000048},null,null,null,{"$f":"IF(ISBLANK(E19),0,E19+I19)","v":12204.748562388},null,null,null,null,null,null,null,{"$f":"IF(ISBLANK(E19),\"\",E19+I19+Q19)","v":12204.748562388}]
[null,null,"   Cost of Power",null,120634.81720539794,null,null,null,{"$f":"Data!C9-E20","v":1118.1869902212347},null,null,null,{"$f":"IF(ISBLANK(E20),0,E20+I20)","v":121753.00419561917},null,null,null,null,null,null,null,{"$f":"IF(ISBLANK(E20),\"\",E20+I20+Q20)","v":121753.00419561917}]
[null,null,"   Working Capital Rate (%)",null,0.13,null,"(9)",null,null,null,null,null,{"$f":"IF(ISBLANK(E21),0,E21)","v":0.13},null,"(9)",null,null,null,null,null,{"$f":"IF(ISBLANK(M21),IF(ISBLANK(E21),0,E21),M21)","v":0.13},null,"(9)"]
[]
[null,2,"Utility Income"]
[null,null,"Operating Revenues:"]
[null,null,"   Distribution Revenue at Current Rates",null,18703.17355302893,null,null,null,{"$f":"IF(ISBLANK(M25),\"\",IF(ISBLANK(E25),\"\",M25-E25))","v":52.893792820512317},null,null,null,{"$f":"Data!C14","v":18756.067345849442},null,null,null,{"$f":"IF(ISBLANK(U25),\"\",IF(ISBLANK(M25),\"\",U25-M25))","v":""}]
[null,null,"   Distribution Revenue at Proposed Rates",null,21565.263578318034,null,null,null,{"$f":"IF(ISBLANK(M26),\"\",IF(ISBLANK(E26),\"\",M26-E26))","v":81.288445727546787},null,null,null,{"$f":"Data!C15","v":21646.552024045581},null,null,null,{"$f":"IF(ISBLANK(U26),\"\",IF(ISBLANK(M26),\"\",U26-M26))","v":""}]
[null,null,"   Other Revenue:"]
[null,null,"      Specific Service Charges",null,758.16909850032698,null,null,null,{"$f":"IF(ISBLANK(M28),\"\",IF(ISBLANK(E28),\"\",M28-E28))","v":-0.57832501961229354},null,null,null,{"$f":"Data!C17","v":757.59077348071469},null,null,null,{"$f":"IF(ISBLANK(U28),\"\",IF(ISBLANK(M28),\"\",U28-M28))","v":""}]
[null,null,"      Late Payment Charges",null,290.25637180784378,null,null,null,{"$f":"IF(ISBLANK(M29),\"\",IF(ISBLANK(E29),\"\",M29-E29))","v":-0.23728167812663514},null,null,null,{"$f":"Data!C18","v":290.01909012971714},null,null,null,{"$f":"IF(ISBLANK(U29),\"\",IF(ISBLANK(M29),\"\",U29-M29))","v":""}]
[null,null,"      Other Distribution Revenue",null,159.89349867980459,null,null,null,{"$f":"IF(ISBLANK(M30),\"\",IF(ISBLANK(E30),\"\",M30-E30))","v":-1.0872800662821192},null,null,null,{"$f":"Data!C19","v":158.80621861352247},null,null,null,{"$f":"IF(ISBLANK(U30),\"\",IF(ISBLANK(M30),\"\",U30-M30))","v":""}]
[null,null,"      Other Income and Deductions",null,128,null,null,null,{"$f":"IF(ISBLANK(M31),\"\",IF(ISBLANK(E31),\"\",M31-E31))","v":0},null,null,null,{"$f":"Data!C20","v":128},null,null,null,{"$f":"IF(ISBLANK(U31),\"\",IF(ISBLANK(M31),\"\",U31-M31))","v":""}]
[]
[null,null,null,"Total Revenue Offsets",1336.3189689879755,null,"(7)",null,{"$f":"IF(ISBLANK(M33),\"\",IF(ISBLANK(E33),\"\",M33-E33))","v":-1.9028867640211047},null,null,null,{"$f":"Data!C22","v":1334.4160822239544},null,null,null,{"$f":"IF(ISBLANK(U33),\"\",IF(ISBLANK(M33),\"\",U33-M33))","v":""}]
[]
[null,null,"Operating Expenses:"]
[null,null,"   OM+A Expenses",null,11959.797188661209,null,null,null,{"$f":"Data!C25-E36","v":59.04700000000048},null,null,null,{"$f":"IF(ISBLANK(E36),\"\",E36+I36)","v":12018.844188661209},null,null,null,null,null,null,null,{"$f":"IF(ISBLANK(E36),\"\",E36+I36+Q36)","v":12018.844188661209}]
[null,null,"   Depreciation/Amortization",null,3896.4625476849869,null,null,null,{"$f":"Data!C26-E37","v":-35.8514642682876},null,null,null,{"$f":"IF(ISBLANK(E37),\"\",E37+I37)","v":3860.6110834166993},null,null,null,null,null,null,null,{"$f":"IF(ISBLANK(E37),\"\",E37+I37+Q37)","v":3860.6110834166993}]
[null,null,"   Property taxes",null,158.4445968,null,null,null,{"$f":"Data!C27-E38","v":0},null,null,null,{"$f":"IF(ISBLANK(E38),\"\",E38+I38)","v":158.4445968},null,null,null,null,null,null,null,{"$f":"IF(ISBLANK(E38),\"\",E38+I38+Q38)","v":158.4445968}]
[null,null,"   Capital taxes",null,{"$f":"IF(ISBLANK(E48),\"\",E48)","v":""},null,null,null,null,null,null,null,{"$f":"IF(ISBLANK(M48),\"\",M48)","v":""},null,null,null,null,null,null,null,{"$f":"IF(ISBLANK(U48),\"\",U48)","v":""}]
[null,null,"   Other expenses",null,27.459776926790777,null,null,null,{"$f":"Data!C29-E40","v":0},null,null,null,{"$f":"IF(ISBLANK(E40),\"\",E40+I40)","v":27.459776926790777},null,null,null,null,null,null,null,{"$f":"IF(ISBLANK(E40),\"\",E40+I40+Q40)","v":27.459776926790777}]
[]
[null,3,"Taxes/PILs"]
[null,null,"Taxable Income:"]
[null,null,null,"Adjustments required to arrive at taxable income",-3176.429719169917,null,"(3)",null,null,null,null,null,{"$f":"Data!C33","v":-2868.9477143680997}]
[null,null,"Utility Income Taxes and Rates:"]
[null,null,"   Income taxes (not grossed up)",null,148.24321226483733,null,null,null,null,null,null,null,{"$f":"Data!C35","v":200.62761357277233}]
[null,null,"   Income taxes (grossed up)",null,{"$f":"IF(ISBLANK(E46),\"\",E46/(1-SUM(E49:E50)))","v":189.32806231716228},null,null,null,null,null,null,null,{"$f":"IF(ISBLANK(M46),\"\",M46/(1-SUM(M49:M50)))","v":260.88712123107325},null,null,null,null,null,null,null,{"$f":"IF(ISBLANK(U46),\"\",U46/(1-SUM(U49:U50)))","v":""}]
[null,null,"   Capital Taxes"]
[null,null,"   Federal tax (%)",null,0.15000000000000002,null,null,null,null,null,null,null,{"$f":"Data!C38","v":0.15000000000000002}]
[null,null,"   Provincial tax (%)",null,6.7003488809279713E-2,null,null,null,null,null,null,null,{"$f":"Data!C39","v":8.0979234904155331E-2}]
[null,null,"Income Tax Credits",null,-10,null,null,null,null,null,null,null,{"$f":"Data!C40","v":-37}]
[null,null,"   "]
[null,4,"Capitalization/Cost of Capital"]
[null,null,"Capital Structure:"]
[null,null,"   Long-term debt Capitalization Ratio (%)",null,0.56000000000000005,null,null,null,null,null,null,null,{"$f":"Data!C44","v":0.56000000000000005}]
[null,null,"   Short-term debt Capitalization Ratio (%)",null,0.04,null,"(8)",null,null,null,null,null,{"$f":"Data!C45","v":0.04},null,"(8)",null,null,null,null,null,null,null,"(8)"]
[null,null,"   Common Equity Capitalization Ratio (%)",null,0.39999999999999991,null,null,null,null,null,null,null,{"$f":"Data!C46","v":0.39999999999999991}]
[null,null,"   Prefered Shares Capitalization Ratio (%)",null,0,null,null,null,null,null,null,null,{"$f":"Data!C47","v":0}]
[null,null,null,null,{"$f":"SUM(E55:E58)","v":1},null,null,null,null,null,null,null,{"$f":"SUM(M55:M58)","v":1},null,null,null,null,null,null,null,{"$f":"SUM(U55:U58)","v":0}]
[null,null,null,null,{"$f":"IF(ISBLANK(E57),\"\",IF(SUM(E55:E58)=100%,\"\",\"Capital Structure must total 100%\"))","v":""},null,null,null,null,null,null,null,{"$f":"IF(ISBLANK(M57),\"\",IF(SUM(M55:M58)=100%,\"\",\"Capital Structure must total 100%\"))","v":""},null,null,null,null,null,null,null,{"$f":"IF(ISBLANK(U57),\"\",IF(SUM(U55:U58)=100%,\"\",\"Capital Structure must total 100%\"))","v":""}]
[null,null,"Cost of Capital"]
[null,null,"   Long-term debt Cost Rate (%)",null,4.5475665849244541E-2,null,null,null,null,null,null,null,{"$f":"Data!C51","v":4.5444200539061445E-2}]
[null,null,"   Short-term debt Cost Rate (%)",null,2.1600000000000001E-2,null,null,null,null,null,null,null,{"$f":"Data!C52","v":2.1600000000000001E-2}]
[null,null,"   Common Equity Cost Rate (%)",null,9.2999999999999999E-2,null,null,null,null,null,null,null,{"$f":"Data!C53","v":9.2999999999999999E-2}]
[null,null,"   Prefered Shares Cost Rate (%)",null,0,null,null,null,null,null,null,null,{"$f":"Data!C54","v":0}]
[]
[]
["Notes:"]
[null,"General","Data inputs are required on Sheets 3. Data from Sheet 3 will automatically complete calculations on sheets 4 through 9 (Rate Base through Revenue Requirement).  Sheets 4 through 9 do not require any inputs except for notes that the Applicant may wish to enter to support the results.  Pale green cells are available on sheets 4 through 9 to enter both footnotes beside key cells and the related text for the notes at the bottom of each sheet."]
[null,"(1)","All inputs are in dollars ($) except where inputs are individually identified as percentages (%)"]
[null,"(2)","Data in column E is for Application as originally filed.  For updated revenue requirement as a result of interrogatory responses, technical or settlement conferences, etc., use colimn M and Adjustments in column I"]
[null,"(3)","Net of addbacks and deductions to arrive at taxable income."]
[null,"(4)","Average of Gross Fixed Assets at beginning and end of the Test Year"]
[null,"(5)","Average of Accumulated Depreciation at the beginning and end of the Test Year.  Enter as a negative amount."]
[null,"(6)","Select option from drop-down list by clicking on cell M10.  This column allows for the application update reflecting the end of discovery or Argument-in-Chief.  Also, the outcome of any Settlement Process can be reflected."]
[null,"(7)","Input total revenue offsets for deriving the base revenue requirement from the service revenue requirement"]
[null,"(8)","4.0% unless an Applicant has proposed or been approved for another amount."]
[null,"(9)","Starting with 2013, default Working Capital Allowance factor is 13% (of Cost of Power plus controllable expenses).  Alternatively, WCA factor based on lead-lag study or approved WCA factor for another distributor, with supporting rationale."]

{"sheet":"4. Rate_Base","index":3,"n_rows":35,"n_cols":23,"rows_kept":35,"cut":false,"hidden":false,"merged":[[33,3,33,22],[34,3,34,22],[35,3,35,22],[40,3,40,22],[41,3,41,22],[36,3,36,22],[37,3,37,22],[38,3,38,22],[39,3,39,22],[2,2,2,6],[3,2,3,6],[0,2,0,10],[1,2,1,22],[32,1,32,22],[17,6,18,6],[17,10,18,10],[17,22,18,22],[17,3,18,3],[21,3,21,22],[17,14,18,14],[17,18,18,18]]}
[]
[]
[]
[]
[]
[null,"Rate Base and Working Capital"]
[]
[]
[]
[null,null,null,"Rate Base"]
[null,"Line No.",null,"Particulars",null,null,"Initial Application",null,null,null,{"$f":"IF(ISBLANK('3. Data_Input_Sheet'!M12),\"\",'3. Data_Input_Sheet'!I12)","v":"Adjustments"},null,null,null,{"$f":"IF(ISBLANK('3. Data_Input_Sheet'!M12),\" \",'3. Data_Input_Sheet'!M12)","v":"Close of Discovery"},null,null,null,{"$f":"IF(ISBLANK('3. Data_Input_Sheet'!Q12),\"\",'3. Data_Input_Sheet'!Q12)","v":"Adjustments"},null,null,null,{"$f":"'3. Data_Input_Sheet'!U12","v":"Per Board Decision"}]
[]
[null,1,null,"Gross Fixed Assets (average)","(3)",null,{"$f":"'3. Data_Input_Sheet'!E16","v":173131.86289987928},null,null,null,{"$f":"'3. Data_Input_Sheet'!I16","v":-163.30553610174684},null,null,null,{"$f":"G13+K13","v":172968.55736377754},null,null,null,{"$f":"'3. Data_Input_Sheet'!Q16","v":0},null,null,null,{"$f":"G13+K13+S13","v":172968.55736377754}]
[null,2,null,"Accumulated Depreciation (average)","(3)",null,{"$f":"'3. Data_Input_Sheet'!E17","v":-85402.755390932507},null,null,null,{"$f":"'3. Data_Input_Sheet'!I17","v":-202.5904278234957},null,null,null,{"$f":"G14+K14","v":-85605.345818756003},null,null,null,{"$f":"'3. Data_Input_Sheet'!Q17","v":0},null,null,null,{"$f":"G14+K14+S14","v":-85605.345818756003}]
[null,3,null,"Net Fixed Assets (average)","(3)",null,{"$f":"SUM(G13:G14)","v":87729.107508946778},null,null,null,{"$f":"SUM(K13:K14)","v":-365.89596392524254},null,null,null,{"$f":"SUM(O13:O14)","v":87363.211545021535},null,null,null,{"$f":"SUM(S13:S14)","v":0},null,null,null,{"$f":"SUM(W13:W14)","v":87363.211545021535}]
[]
[null,4,null,"Allowance for Working Capital","(1)",null,{"$f":"G30","v":17261.467439812172},null,null,null,{"$f":"K30","v":153.04041872876041},null,null,null,{"$f":"O30","v":17414.507858540932},null,null,null,{"$f":"S30","v":0},null,null,null,{"$f":"W30","v":17414.507858540932}]
[null,null,null,"Total Rate Base",null,null,{"$f":"G17+G15","v":104990.57494875895},null,null,null,{"$f":"K17+K15","v":-212.85554519648213},null,null,null,{"$f":"O17+O15","v":104777.71940356247},null,null,null,{"$f":"S17+S15","v":0},null,null,null,{"$f":"W15+W17","v":104777.71940356247}]
[null,5]
[null,null,"(1)","Allowance for Working Capital - Derivation"]
[]
[]
[]
[null,6,null,"Controllable Expenses",null,null,{"$f":"'3. Data_Input_Sheet'!E19","v":12145.701562388},null,null,null,{"$f":"'3. Data_Input_Sheet'!I19","v":59.04700000000048},null,null,null,{"$f":"G24+K24","v":12204.748562388},null,null,null,{"$f":"'3. Data_Input_Sheet'!Q19","v":0},null,null,null,{"$f":"G24+K24+S24","v":12204.748562388}]
[null,7,null,"Cost of Power",null,null,{"$f":"'3. Data_Input_Sheet'!E20","v":120634.81720539794},null,null,null,{"$f":"'3. Data_Input_Sheet'!I20","v":1118.1869902212347},null,null,null,{"$f":"G25+K25","v":121753.00419561917},null,null,null,{"$f":"'3. Data_Input_Sheet'!Q20","v":0},null,null,null,{"$f":"G25+K25+S25","v":121753.00419561917}]
[null,8,null,"Working Capital Base",null,null,{"$f":"SUM(G24:G25)","v":132780.51876778592},null,null,null,{"$f":"K24+K25","v":1177.2339902212352},null,null,null,{"$f":"SUM(O24:O25)","v":133957.75275800718},null,null,null,{"$f":"S24+S25","v":0},null,null,null,{"$f":"SUM(W24:W25)","v":133957.75275800718}]
[]
[null,9,null,"Working Capital Rate % ","(2)",null,{"$f":"'3. Data_Input_Sheet'!E21","v":0.13},null,null,null,{"$f":"O28-G28","v":0},null,null,null,{"$f":"'3. Data_Input_Sheet'!M21","v":0.13},null,null,null,{"$f":"W28-O28","v":0},null,null,null,{"$f":"'3. Data_Input_Sheet'!U21","v":0.13}]
[]
[null,10,null,"Working Capital Allowance",null,null,{"$f":"G26*G28","v":17261.467439812172},null,null,null,{"$f":"O30-G30","v":153.04041872876041},null,null,null,{"$f":"O26*O28","v":17414.507858540932},null,null,null,{"$f":"W30-O30","v":0},null,null,null,{"$f":"W26*W28","v":17414.507858540932}]
[]
[]
[null,"Notes"]
[null,"(2)",null,"Some Applicants may have a unique rate as a result of a lead-lag study.  The default rate for 2014 cost of service applications is 13%."]
[null,"(3)",null,"Average of opening and closing balances for the year."]

{"sheet":"5. Utility Income","index":4,"n_rows":49,"n_cols":22,"rows_kept":49,"cut":false,"hidden":false,"merged":[[47,9,48,9],[47,13,48,13],[47,17,48,17],[34,9,35,9],[36,9,37,9],[26,9,27,9],[34,21,35,21],[34,5,35,5],[36,21,37,21],[36,5,37,5],[36,17,37,17],[0,2,0,11],[2,2,2,7],[3,2,3,7],[1,2,1,21],[17,21,18,21],[17,13,18,13],[17,17,18,17],[7,5,7,21],[17,5,18,5],[17,9,18,9],[56,3,56,21],[54,3,54,21],[55,3,55,21],[51,3,51,21],[26,5,27,5],[53,3,53,21],[52,3,52,21],[47,5,48,5],[47,21,48,21],[41,1,41,21],[36,13,37,13],[26,21,27,21],[26,13,27,13],[34,13,35,13],[26,17,27,17],[34,17,35,17]]}
[]
[]
[]
[]
[]
[]
[]
[]
[]
[]
[null,"Utility Income"]
[]
[null,"Line No.",null,"Particulars                                ",null,"Initial Application   ",null,null,null,{"$f":"IF(N13=\"\",\"\",\"Adjustments\")","v":"Adjustments"},null,null,null,{"$f":"IF(ISBLANK('3. Data_Input_Sheet'!M12),\"\",'3. Data_Input_Sheet'!M12)","v":"Close of Discovery"},null,null,null,{"$f":"IF(N13=\"\",\"\",\"Adjustments\")","v":"Adjustments"},null,null,null,{"$f":"'3. Data_Input_Sheet'!U12","v":"Per Board Decision"}]
[]
[null,null,null,"Operating Revenues:"]
[null,1,null,"Distribution Revenue (at Proposed Rates)",null,{"$f":"'3. Data_Input_Sheet'!E26","v":21565.263578318034},null,null,null,{"$f":"N16-F16","v":81.288445727546787},null,null,null,{"$f":"'3. Data_Input_Sheet'!M26","v":21646.552024045581},null,null,null,{"$f":"V16-N16","v":0},null,null,null,{"$f":"IF(ISBLANK('3. Data_Input_Sheet'!U26),'5. Utility Income'!N16,'3. Data_Input_Sheet'!U26)","v":21646.552024045581}]
[null,2,null,"Other Revenue","(1)",{"$f":"F48","v":1336.3189689879755},null,null,null,{"$f":"N17-F17","v":-1.9028867640211047},null,null,null,{"$f":"N48","v":1334.4160822239544},null,null,null,{"$f":"V17-N17","v":0},null,null,null,{"$f":"V48","v":1334.4160822239544}]
[null,null,null,null,null,{"$f":"SUM(F16:F17)","v":22901.58254730601},null,null,null,{"$f":"SUM(J16:J17)","v":79.385558963525682},null,null,null,{"$f":"SUM(N16:N17)","v":22980.968106269534},null,null,null,{"$f":"SUM(R16:R17)","v":0},null,null,null,{"$f":"SUM(V16:V17)","v":22980.968106269534}]
[null,3,null,"Total Operating Revenues"]
[]
[null,null,null,"Operating Expenses:"]
[null,4,null,"OM+A Expenses",null,{"$f":"'3. Data_Input_Sheet'!E36","v":11959.797188661209},null,null,null,{"$f":"'3. Data_Input_Sheet'!I36","v":59.04700000000048},null,null,null,{"$f":"'3. Data_Input_Sheet'!M36","v":12018.844188661209},null,null,null,{"$f":"'3. Data_Input_Sheet'!Q36","v":0},null,null,null,{"$f":"'3. Data_Input_Sheet'!U36","v":12018.844188661209}]
[null,5,null,"Depreciation/Amortization",null,{"$f":"'3. Data_Input_Sheet'!E37","v":3896.4625476849869},null,null,null,{"$f":"'3. Data_Input_Sheet'!I37","v":-35.8514642682876},null,null,null,{"$f":"'3. Data_Input_Sheet'!M37","v":3860.6110834166993},null,null,null,{"$f":"'3. Data_Input_Sheet'!Q37","v":0},null,null,null,{"$f":"'3. Data_Input_Sheet'!U37","v":3860.6110834166993}]
[null,6,null,"Property taxes",null,{"$f":"'3. Data_Input_Sheet'!E38","v":158.4445968},null,null,null,{"$f":"'3. Data_Input_Sheet'!I38","v":0},null,null,null,{"$f":"'3. Data_Input_Sheet'!M38","v":158.4445968},null,null,null,{"$f":"'3. Data_Input_Sheet'!Q38","v":0},null,null,null,{"$f":"'3. Data_Input_Sheet'!U38","v":158.4445968}]
[null,7,null,"Capital taxes",null,{"$f":"'6. Taxes_PILs'!G25","v":0},null,null,null,{"$f":"N25-F25","v":0},null,null,null,{"$f":"'6. Taxes_PILs'!K25","v":0},null,null,null,{"$f":"V25-N25","v":0},null,null,null,{"$f":"'6. Taxes_PILs'!O25","v":0}]
[null,8,null,"Other expense",null,{"$f":"'3. Data_Input_Sheet'!E40","v":27.459776926790777},null,null,null,{"$f":"'3. Data_Input_Sheet'!I40","v":0},null,null,null,{"$f":"'3. Data_Input_Sheet'!M40","v":27.459776926790777},null,null,null,{"$f":"'3. Data_Input_Sheet'!Q40","v":0},null,null,null,{"$f":"'3. Data_Input_Sheet'!U40","v":27.459776926790777}]
[null,null,null,null,null,{"$f":"SUM(F22:F26)","v":16042.164110072987},null,null,null,{"$f":"SUM(J22:J26)","v":23.19553573171288},null,null,null,{"$f":"SUM(N22:N26)","v":16065.3596458047},null,null,null,{"$f":"SUM(R22:R26)","v":0},null,null,null,{"$f":"SUM(V22:V26)","v":16065.3596458047}]
[null,9,null,"Subtotal (lines 4 to 8)"]
[]
[null,10,null,"Deemed Interest Expense",null,{"$f":"'7. Cost_of_Capital'!P19","v":2764.4409868220309},null,null,null,{"$f":"N30-F30","v":-7.4508094007915133},null,null,null,{"$f":"'7. Cost_of_Capital'!P35","v":2756.9901774212394},null,null,null,{"$f":"V30-N30","v":1.846243527133538},null,null,null,{"$f":"'7. Cost_of_Capital'!P51","v":2758.836420948373}]
[]
[null,11,null,"Total Expenses (lines 9 to 10)",null,{"$f":"F27+F30","v":18806.605096895019},null,null,null,{"$f":"J30+J27","v":15.744726330921367},null,null,null,{"$f":"N30+N27","v":18822.349823225937},null,null,null,{"$f":"R30+R27","v":1.846243527133538},null,null,null,{"$f":"V27+V30","v":18824.196066753073}]
[]
[null,12,null,"Utility income before income taxes",null,{"$f":"F18-(F32)","v":4094.9774504109919},null,null,null,{"$f":"J18-(J32)","v":63.640832632604315},null,null,null,{"$f":"N18-(N32)","v":4158.6182830435973},null,null,null,{"$f":"R18-(R32)","v":-1.846243527133538},null,null,null,{"$f":"V18-(V32)","v":4156.7720395164615}]
[null,null,null,null,null,{"$f":"'6. Taxes_PILs'!G31","v":189.32806231716228},null,null,null,{"$f":"N35-F35","v":71.559058913910974},null,null,null,{"$f":"'6. Taxes_PILs'!K31","v":260.88712123107325},null,null,null,{"$f":"V35-N35","v":0},null,null,null,{"$f":"IF('6. Taxes_PILs'!O31=0,N35,'6. Taxes_PILs'!O31)","v":260.88712123107325}]
[null,13,null,"Income taxes (grossed-up)"]
[null,null,null,null,null,{"$f":"F34-F35","v":3905.6493880938297},null,null,null,{"$f":"J34-J35","v":-7.9182262813066586},null,null,null,{"$f":"N34-N35","v":3897.7311618125241},null,null,null,{"$f":"R34-R35","v":-1.846243527133538},null,null,null,{"$f":"V34-V35","v":3895.8849182853883}]
[null,14,null,"Utility net income"]
[]
[]
[]
[null,"Notes"]
[]
[null,"(1)",null,"  Specific Service Charges",null,{"$f":"'3. Data_Input_Sheet'!E28","v":758.16909850032698},null,null,null,{"$f":"'3. Data_Input_Sheet'!I28","v":-0.57832501961229354},null,null,null,{"$f":"'3. Data_Input_Sheet'!M28","v":757.59077348071469},null,null,null,{"$f":"'3. Data_Input_Sheet'!Q28","v":""},null,null,null,{"$f":"IF(ISBLANK('3. Data_Input_Sheet'!U28),N44,'3. Data_Input_Sheet'!U28)","v":757.59077348071469}]
[null,null,null,"  Late Payment Charges",null,{"$f":"'3. Data_Input_Sheet'!E29","v":290.25637180784378},null,null,null,{"$f":"'3. Data_Input_Sheet'!I29","v":-0.23728167812663514},null,null,null,{"$f":"'3. Data_Input_Sheet'!M29","v":290.01909012971714},null,null,null,{"$f":"'3. Data_Input_Sheet'!Q29","v":""},null,null,null,{"$f":"IF(ISBLANK('3. Data_Input_Sheet'!U29),N45,'3. Data_Input_Sheet'!U29)","v":290.01909012971714}]
[null,null,null,"  Other Distribution Revenue",null,{"$f":"'3. Data_Input_Sheet'!E30","v":159.89349867980459},null,null,null,{"$f":"'3. Data_Input_Sheet'!I30","v":-1.0872800662821192},null,null,null,{"$f":"'3. Data_Input_Sheet'!M30","v":158.80621861352247},null,null,null,{"$f":"'3. Data_Input_Sheet'!Q30","v":""},null,null,null,{"$f":"IF(ISBLANK('3. Data_Input_Sheet'!U30),N46,'3. Data_Input_Sheet'!U30)","v":158.80621861352247}]
[null,null,null,"  Other Income and Deductions",null,{"$f":"'3. Data_Input_Sheet'!E31","v":128},null,null,null,{"$f":"'3. Data_Input_Sheet'!I31","v":0},null,null,null,{"$f":"'3. Data_Input_Sheet'!M31","v":128},null,null,null,{"$f":"'3. Data_Input_Sheet'!Q31","v":""},null,null,null,{"$f":"IF(ISBLANK('3. Data_Input_Sheet'!U31),N47,'3. Data_Input_Sheet'!U31)","v":128}]
[null,null,null,null,null,{"$f":"SUM(F44:F47)","v":1336.3189689879755},null,null,null,{"$f":"SUM(J44:J47)","v":-1.9028867640210478},null,null,null,{"$f":"SUM(N44:N47)","v":1334.4160822239544},null,null,null,{"$f":"SUM(R44:R47)","v":0},null,null,null,{"$f":"SUM(V44:V47)","v":1334.4160822239544}]
[null,null,null,"Total Revenue Offsets"]

{"sheet":"6. Taxes_PILs","index":5,"n_rows":45,"n_cols":15,"rows_kept":45,"cut":false,"hidden":false,"merged":[[44,3,44,14],[51,3,51,14],[52,3,52,14],[45,3,45,14],[49,3,49,14],[50,3,50,14],[0,3,0,12],[2,2,2,6],[3,2,3,6],[1,2,1,14],[43,1,43,14],[8,1,8,12],[25,6,26,6],[25,14,26,14],[15,3,15,4],[17,3,17,4],[19,3,19,4],[32,3,32,4],[25,10,26,10]]}
[]
[]
[]
[]
[]
[]
[]
[]
[null,"Taxes/PILs"]
[]
[]
[null,"Line No.",null,"Particulars ",null,null,"Application",null,null,null,{"$f":"IF(ISBLANK('3. Data_Input_Sheet'!M12),\"\",'3. Data_Input_Sheet'!M12)","v":"Close of Discovery"},null,null,null,{"$f":"'3. Data_Input_Sheet'!U12","v":"Per Board Decision"}]
[]
[null,null,null,"Determination of Taxable Income"]
[]
[null,1,null,"Utility net income before taxes",null,null,{"$f":"'7. Cost_of_Capital'!P22","v":3905.6493880938324},null,null,null,{"$f":"'7. Cost_of_Capital'!P38","v":3897.7311618125227},null,null,null,{"$f":"'7. Cost_of_Capital'!P54","v":3897.7311618125227}]
[]
[null,2,null,"Adjustments required to arrive at taxable utility income",null,null,{"$f":"'3. Data_Input_Sheet'!E44","v":-3176.429719169917},null,null,null,{"$f":"'3. Data_Input_Sheet'!M44","v":-2868.9477143680997},null,null,null,{"$f":"IF(ISBLANK('3. Data_Input_Sheet'!U44),G18,'3. Data_Input_Sheet'!U44)","v":-3176.429719169917}]
[]
[null,3,null,"Taxable income",null,null,{"$f":"G16+G18","v":729.21966892391538},null,null,null,{"$f":"K16+K18","v":1028.783447444423},null,null,null,{"$f":"O16+O18","v":721.30144264260571}]
[]
[null,null,null,"Calculation of Utility income Taxes"]
[]
[null,4,null,"Income taxes",null,null,{"$f":"'3. Data_Input_Sheet'!E46","v":148.24321226483733},null,null,null,{"$f":"IF(ISBLANK('3. Data_Input_Sheet'!M46),'6. Taxes_PILs'!G24,'3. Data_Input_Sheet'!M46)","v":200.62761357277233},null,null,null,{"$f":"IF(ISBLANK('3. Data_Input_Sheet'!U46),'6. Taxes_PILs'!K24,'3. Data_Input_Sheet'!U46)","v":200.62761357277233}]
[null,5,null,"Capital taxes",null,null,{"$f":"'3. Data_Input_Sheet'!E48","v":0},null,null,null,{"$f":"IF(ISBLANK('3. Data_Input_Sheet'!M48),'6. Taxes_PILs'!G25,'3. Data_Input_Sheet'!M48)","v":0},null,null,null,{"$f":"IF(ISBLANK('3. Data_Input_Sheet'!U48),'6. Taxes_PILs'!K25,'3. Data_Input_Sheet'!U48)","v":0}]
[null,null,null,null,null,null,{"$f":"SUM(G24:G25)","v":148.24321226483733},null,null,null,{"$f":"SUM(K24:K25)","v":200.62761357277233},null,null,null,{"$f":"SUM(O24:O25)","v":200.62761357277233}]
[null,6,null,"Total taxes"]
[]
[null,7,null,"Gross-up of Income Taxes",null,null,{"$f":"(G24/(1-G41))-G24","v":41.084850052324953},null,null,null,{"$f":"(K24/(1-K41))-K24","v":60.259507658300919},null,null,null,{"$f":"(O24/(1-O41))-O24","v":60.259507658300919}]
[]
[null,8,null,"Grossed-up Income Taxes",null,null,{"$f":"G24+G29","v":189.32806231716228},null,null,null,{"$f":"K24+K29","v":260.88712123107325},null,null,null,{"$f":"O24+O29","v":260.88712123107325}]
[]
[null,9,null,"PILs / tax Allowance (Grossed-up Income taxes + Capital taxes)",null,null,{"$f":"G26+G29","v":189.32806231716228},null,null,null,{"$f":"K29+K26","v":260.88712123107325},null,null,null,{"$f":"O29+O26","v":260.88712123107325}]
[]
[null,10,null,"Other tax Credits",null,null,{"$f":"'3. Data_Input_Sheet'!E51","v":-10},null,null,null,{"$f":"IF(ISBLANK('3. Data_Input_Sheet'!M51),G35,'3. Data_Input_Sheet'!M51)","v":-37},null,null,null,{"$f":"IF(ISBLANK('3. Data_Input_Sheet'!U51),K35,'3. Data_Input_Sheet'!U51)","v":-37}]
[]
[null,null,null,"Tax Rates"]
[]
[null,11,null,"Federal tax (%)",null,null,{"$f":"'3. Data_Input_Sheet'!E49","v":0.15000000000000002},null,null,null,{"$f":"IF(ISBLANK('3. Data_Input_Sheet'!M49),G39,'3. Data_Input_Sheet'!M49)","v":0.15000000000000002},null,null,null,{"$f":"IF(ISBLANK('3. Data_Input_Sheet'!U49),K39,'3. Data_Input_Sheet'!U49)","v":0.15000000000000002}]
[null,12,null,"Provincial tax (%)",null,null,{"$f":"'3. Data_Input_Sheet'!E50","v":6.7003488809279713E-2},null,null,null,{"$f":"IF(ISBLANK('3. Data_Input_Sheet'!M50),G40,'3. Data_Input_Sheet'!M50)","v":8.0979234904155331E-2},null,null,null,{"$f":"IF(ISBLANK('3. Data_Input_Sheet'!U50),K40,'3. Data_Input_Sheet'!U50)","v":8.0979234904155331E-2}]
[null,13,null,"Total tax rate (%)",null,null,{"$f":"G39+G40","v":0.21700348880927972},null,null,null,{"$f":"K39+K40","v":0.23097923490415534},null,null,null,{"$f":"O39+O40","v":0.23097923490415534}]
[]
[]
[null,"Notes"]
[null,null,null,"Capital Taxes not applicable after July 1, 2010 (i.e. for 2011 and later test years)"]

{"sheet":"7. Cost_of_Capital","index":6,"n_rows":62,"n_cols":16,"rows_kept":62,"cut":false,"hidden":false,"merged":[[13,3,13,15],[29,3,29,15],[44,5,44,9],[28,5,28,9],[66,3,66,15],[60,1,60,15],[45,3,45,15],[67,3,67,15],[65,3,65,15],[61,3,61,15],[62,3,62,15],[63,3,63,15],[64,3,64,15],[0,2,0,13],[2,2,2,13],[3,2,3,9],[1,2,1,17],[12,5,12,9],[4,1,4,13],[10,5,10,9]]}
[]
[]
[]
[]
[null,"Capitalization/Cost of Capital"]
[]
[]
[]
[]
[]
[null,"Line No.",null,"Particulars",null,"Capitalization Ratio",null,null,null,null,null,"Cost Rate",null,null,null,"Return"]
[]
[null,null,null,null,null,"Initial Application"]
[]
[null,null,null,null,null,"(%)",null,null,null,"($)",null,"(%)",null,null,null,"($)"]
[null,null,null,"Debt"]
[null,1,null,"  Long-term Debt",null,{"$f":"'3. Data_Input_Sheet'!E55","v":0.56000000000000005},null,null,null,{"$f":"$J$26*F17","v":58794.721971305014},null,{"$f":"'3. Data_Input_Sheet'!E62","v":4.5475665849244541E-2},null,null,null,{"$f":"L17*J17","v":2673.7291300663032}]
[null,2,null,"  Short-term Debt",null,{"$f":"'3. Data_Input_Sheet'!E56","v":0.04},null,null,null,{"$f":"$J$26*F18","v":4199.6229979503578},null,{"$f":"'3. Data_Input_Sheet'!E63","v":2.1600000000000001E-2},null,null,null,{"$f":"L18*J18","v":90.711856755727737}]
[null,3,null,"Total Debt",null,{"$f":"SUM(F17:F18)","v":0.60000000000000009},null,null,null,{"$f":"SUM(J17:J18)","v":62994.34496925537},null,{"$f":"IF(F19=0,0,SUMPRODUCT(F17:F18,L17:L18)/F19)","v":4.3883954792628237E-2},null,null,null,{"$f":"SUM(P17:P18)","v":2764.4409868220309}]
[]
[null,null,null,"Equity"]
[null,4,null,"  Common Equity",null,{"$f":"'3. Data_Input_Sheet'!E57","v":0.39999999999999991},null,null,null,{"$f":"$J$26*F22","v":41996.229979503572},null,{"$f":"'3. Data_Input_Sheet'!E64","v":9.2999999999999999E-2},null,null,null,{"$f":"L22*J22","v":3905.6493880938324}]
[null,5,null,"  Preferred Shares",null,{"$f":"'3. Data_Input_Sheet'!E58","v":0},null,null,null,{"$f":"$J$26*F23","v":0},null,{"$f":"'3. Data_Input_Sheet'!E65","v":0},null,null,null,{"$f":"L23*J23","v":0}]
[null,6,null,"Total Equity",null,{"$f":"SUM(F22:F23)","v":0.39999999999999991},null,null,null,{"$f":"SUM(J22:J23)","v":41996.229979503572},null,{"$f":"IF(F24=0,0,SUMPRODUCT(F22:F23,L22:L23)/F24)","v":9.2999999999999999E-2},null,null,null,{"$f":"SUM(P22:P23)","v":3905.6493880938324}]
[]
[null,7,null,"Total",null,{"$f":"SUM(F19,F24)","v":1},null,null,null,{"$f":"'4. Rate_Base'!G18","v":104990.57494875895},null,{"$f":"(L19*F19)+(L24*F24)","v":6.3530372875576932E-2},null,null,null,{"$f":"P19+P24","v":6670.0903749158633}]
[]
[]
[null,null,null,null,null,{"$f":"'1. Info'!AC1","v":"Close of Discovery"}]
[]
[null,null,null,null,null,"(%)",null,null,null,"($)",null,"(%)",null,null,null,"($)"]
[null,null,null,"Debt"]
[null,1,null,"  Long-term Debt",null,{"$f":"'3. Data_Input_Sheet'!M55","v":0.56000000000000005},null,null,null,{"$f":"$J$42*F33","v":58675.522865994986},null,{"$f":"'3. Data_Input_Sheet'!M62","v":4.5444200539061445E-2},null,null,null,{"$f":"L33*J33","v":2666.4622278565616}]
[null,2,null,"  Short-term Debt",null,{"$f":"'3. Data_Input_Sheet'!M56","v":0.04},null,null,null,{"$f":"$J$42*F34","v":4191.1087761424988},null,{"$f":"'3. Data_Input_Sheet'!M63","v":2.1600000000000001E-2},null,null,null,{"$f":"L34*J34","v":90.527949564677982}]
[null,3,null,"Total Debt",null,{"$f":"SUM(F33:F34)","v":0.60000000000000009},null,null,null,{"$f":"SUM(J33:J34)","v":62866.631642137487},null,{"$f":"IF(F35=0,0,SUMPRODUCT(F33:F34,L33:L34)/F35)","v":4.3854587169790682E-2},null,null,null,{"$f":"SUM(P33:P34)","v":2756.9901774212394}]
[]
[null,null,null,"Equity"]
[null,4,null,"  Common Equity",null,{"$f":"'3. Data_Input_Sheet'!M57","v":0.39999999999999991},null,null,null,{"$f":"$J$42*F38","v":41911.087761424977},null,{"$f":"'3. Data_Input_Sheet'!M64","v":9.2999999999999999E-2},null,null,null,{"$f":"L38*J38","v":3897.7311618125227}]
[null,5,null,"  Preferred Shares",null,{"$f":"'3. Data_Input_Sheet'!M58","v":0},null,null,null,{"$f":"$J$42*F39","v":0},null,{"$f":"'3. Data_Input_Sheet'!M65","v":0},null,null,null,{"$f":"L39*J39","v":0}]
[null,6,null,"Total Equity",null,{"$f":"SUM(F38:F39)","v":0.39999999999999991},null,null,null,{"$f":"SUM(J38:J39)","v":41911.087761424977},null,{"$f":"IF(F40=0,0,SUMPRODUCT(F38:F39,L38:L39)/F40)","v":9.2999999999999999E-2},null,null,null,{"$f":"SUM(P38:P39)","v":3897.7311618125227}]
[]
[null,7,null,"Total",null,{"$f":"F35+F40","v":1},null,null,null,{"$f":"'4. Rate_Base'!O18","v":104777.71940356247},null,{"$f":"(L35*F35)+(L40*F40)","v":6.3512752301874406E-2},null,null,null,{"$f":"P35+P40","v":6654.7213392337617}]
[]
[]
[null,null,null,null,null,"Per Board Decision"]
[]
[null,null,null,null,null,"(%)",null,null,null,"($)",null,"(%)",null,null,null,"($)"]
[null,null,null,"Debt"]
[null,8,null,"  Long-term Debt",null,{"$f":"IF(ISBLANK('3. Data_Input_Sheet'!U55),F33,'3. Data_Input_Sheet'!U55)","v":0.56000000000000005},null,null,null,{"$f":"$J$58*F49","v":58675.522865994986},null,{"$f":"IF(ISBLANK('3. Data_Input_Sheet'!U62),L17,'3. Data_Input_Sheet'!U62)","v":4.5475665849244541E-2},null,null,null,{"$f":"L49*J49","v":2668.3084713836952}]
[null,9,null,"  Short-term Debt",null,{"$f":"IF(ISBLANK('3. Data_Input_Sheet'!U56),F34,'3. Data_Input_Sheet'!U56)","v":0.04},null,null,null,{"$f":"$J$58*F50","v":4191.1087761424988},null,{"$f":"IF(ISBLANK('3. Data_Input_Sheet'!U63),L18,'3. Data_Input_Sheet'!U63)","v":2.1600000000000001E-2},null,null,null,{"$f":"L50*J50","v":90.527949564677982}]
[null,10,null,"Total Debt",null,{"$f":"SUM(F49:F50)","v":0.60000000000000009},null,null,null,{"$f":"SUM(J49:J50)","v":62866.631642137487},null,{"$f":"IF(F51=0,0,SUMPRODUCT(F49:F50,L49:L50)/F51)","v":4.3883954792628237E-2},null,null,null,{"$f":"SUM(P49:P50)","v":2758.836420948373}]
[]
[null,null,null,"Equity"]
[null,11,null,"  Common Equity",null,{"$f":"IF(ISBLANK('3. Data_Input_Sheet'!U57),F38,'3. Data_Input_Sheet'!U57)","v":0.39999999999999991},null,null,null,{"$f":"$J$58*F54","v":41911.087761424977},null,{"$f":"IF(ISBLANK('3. Data_Input_Sheet'!U64),L22,'3. Data_Input_Sheet'!U64)","v":9.2999999999999999E-2},null,null,null,{"$f":"L54*J54","v":3897.7311618125227}]
[null,12,null,"  Preferred Shares",null,{"$f":"IF(ISBLANK('3. Data_Input_Sheet'!U58),F39,'3. Data_Input_Sheet'!U58)","v":0},null,null,null,{"$f":"$J$58*F55","v":0},null,{"$f":"IF(ISBLANK('3. Data_Input_Sheet'!U65),L23,'3. Data_Input_Sheet'!U65)","v":0},null,null,null,{"$f":"L55*J55","v":0}]
[null,13,null,"Total Equity",null,{"$f":"SUM(F54:F55)","v":0.39999999999999991},null,null,null,{"$f":"SUM(J54:J55)","v":41911.087761424977},null,{"$f":"IF(F56=0,0,SUMPRODUCT(F54:F55,L54:L55)/F56)","v":9.2999999999999999E-2},null,null,null,{"$f":"SUM(P54:P55)","v":3897.7311618125227}]
[]
[null,14,null,"Total",null,{"$f":"F51+F56","v":1},null,null,null,{"$f":"'4. Rate_Base'!W18","v":104777.71940356247},null,{"$f":"(L51*F51)+(L56*F56)","v":6.3530372875576932E-2},null,null,null,{"$f":"P51+P56","v":6656.5675827608957}]
[]
[]
[null,"Notes"]
[null,"(1)",null,{"$f":"'3. Data_Input_Sheet'!C71","v":"Data in column E is for Application as originally filed.  For updated revenue requirement as a result of interrogatory responses, technical or settlement conferences, etc., use colimn M and Adjustments in column I"}]

{"sheet":"8. Rev_Def_Suff","index":7,"n_rows":56,"n_cols":16,"rows_kept":56,"cut":false,"hidden":false,"merged":[[59,3,59,15],[55,3,55,15],[57,3,57,15],[58,3,58,15],[7,5,7,15],[14,7,15,7],[14,15,15,15],[14,5,15,5],[12,13,12,15],[14,13,15,13],[12,9,12,11],[14,9,15,9],[14,11,15,11],[56,3,56,15],[0,2,0,14],[1,2,1,14],[2,2,2,14],[3,2,3,7],[54,1,54,8],[14,3,15,3],[14,1,15,1],[12,5,12,7]]}
[null,null,null,null,null,null,null,null,null,null,null,null,null,null,null,{"$f":"CONCATENATE('2. Table of Contents'!$F$6,\" \",'2. Table of Contents'!$G$6)","v":" "}]
[]
[]
[]
[]
[]
[]
[]
[]
[null,"Revenue Deficiency/Sufficiency"]
[]
[]
[null,null,null,null,null,"Initial Application",null,null,null,{"$f":"IF(ISBLANK('3. Data_Input_Sheet'!M12),\"\",'3. Data_Input_Sheet'!M12)","v":"Close of Discovery"},null,null,null,{"$f":"'3. Data_Input_Sheet'!U12","v":"Per Board Decision"}]
[]
[null,"Line No.",null,"Particulars",null,"At Current Approved Rates",null,"At Proposed Rates",null,"At Current Approved Rates",null,"At Proposed Rates",null,"At Current Approved Rates",null,"At Proposed Rates"]
[]
[]
[]
[null,1,null,"Revenue Deficiency from Below",null,null,null,{"$f":"F52","v":2862.0900252891074},null,null,null,{"$f":"J52","v":2890.4846781961369},null,null,null,{"$f":"N52","v":2892.3309217232727}]
[null,2,null,"Distribution Revenue",null,{"$f":"'3. Data_Input_Sheet'!E25","v":18703.17355302893},null,{"$f":"'3. Data_Input_Sheet'!E26-H19","v":18703.173553028926},null,{"$f":"IF(ISBLANK('3. Data_Input_Sheet'!M25),'3. Data_Input_Sheet'!E25,'3. Data_Input_Sheet'!M25)","v":18756.067345849442},null,{"$f":"IF(ISBLANK('3. Data_Input_Sheet'!M26),'3. Data_Input_Sheet'!E26-L19,'3. Data_Input_Sheet'!M26-L19)","v":18756.067345849442},null,{"$f":"IF(ISBLANK('3. Data_Input_Sheet'!U25),'3. Data_Input_Sheet'!M25,'3. Data_Input_Sheet'!U25)","v":18756.067345849442},null,{"$f":"IF(ISBLANK('3. Data_Input_Sheet'!U26),'3. Data_Input_Sheet'!M26-P19,'3. Data_Input_Sheet'!U26-P19)","v":18754.221102322306}]
[null,3,null,"Other Operating Revenue Offsets - net",null,{"$f":"'5. Utility Income'!F48","v":1336.3189689879755},null,{"$f":"'5. Utility Income'!F48","v":1336.3189689879755},null,{"$f":"'5. Utility Income'!N48","v":1334.4160822239544},null,{"$f":"J21","v":1334.4160822239544},null,{"$f":"'5. Utility Income'!V48","v":1334.4160822239544},null,{"$f":"'5. Utility Income'!V48","v":1334.4160822239544}]
[null,4,null,"Total Revenue",null,{"$f":"SUM(F20:F21)","v":20039.492522016906},null,{"$f":"SUM(H19:H21)","v":22901.58254730601},null,{"$f":"SUM(J20:J21)","v":20090.483428073396},null,{"$f":"SUM(L19:L21)","v":22980.968106269534},null,{"$f":"SUM(N20:N21)","v":20090.483428073396},null,{"$f":"SUM(P19:P21)","v":22980.968106269534}]
[]
[null,5,null,"Operating Expenses",null,{"$f":"'5. Utility Income'!F27","v":16042.164110072987},null,{"$f":"'5. Utility Income'!F27","v":16042.164110072987},null,{"$f":"'5. Utility Income'!N27","v":16065.3596458047},null,{"$f":"'5. Utility Income'!N27","v":16065.3596458047},null,{"$f":"'5. Utility Income'!V27","v":16065.3596458047},null,{"$f":"'5. Utility Income'!V27","v":16065.3596458047}]
[null,6,null,"Deemed Interest Expense",null,{"$f":"'5. Utility Income'!F30","v":2764.4409868220309},null,{"$f":"'5. Utility Income'!F30","v":2764.4409868220309},null,{"$f":"'5. Utility Income'!N30","v":2756.9901774212394},null,{"$f":"'5. Utility Income'!N30","v":2756.9901774212394},null,{"$f":"'5. Utility Income'!V30","v":2758.836420948373},null,{"$f":"'5. Utility Income'!V30","v":2758.836420948373}]
[null,8,null,"Total Cost and Expenses",null,{"$f":"SUM(F24:F25)","v":18806.605096895019},null,{"$f":"SUM(H24:H25)","v":18806.605096895019},null,{"$f":"SUM(J24:J25)","v":18822.349823225937},null,{"$f":"SUM(L24:L25)","v":18822.349823225937},null,{"$f":"SUM(N24:N25)","v":18824.196066753073},null,{"$f":"SUM(P24:P25)","v":18824.196066753073}]
[]
[null,9,null,"Utility Income Before Income Taxes",null,{"$f":"F22-F26","v":1232.8874251218876},null,{"$f":"H22-H26","v":4094.9774504109919},null,{"$f":"J22-J26","v":1268.1336048474586},null,{"$f":"L22-L26","v":4158.6182830435973},null,{"$f":"N22-N26","v":1266.2873613203228},null,{"$f":"P22-P26","v":4156.7720395164615}]
[null,null,null,"   "]
[null,10,null,"Tax Adjustments to Accounting               Income per 2013 PILs model",null,{"$f":"'3. Data_Input_Sheet'!E44","v":-3176.429719169917},null,{"$f":"'3. Data_Input_Sheet'!E44","v":-3176.429719169917},null,{"$f":"IF(ISBLANK('3. Data_Input_Sheet'!M44),'3. Data_Input_Sheet'!E44,'3. Data_Input_Sheet'!M44)","v":-2868.9477143680997},null,{"$f":"IF(ISBLANK('3. Data_Input_Sheet'!M44),'3. Data_Input_Sheet'!E44,'3. Data_Input_Sheet'!M44)","v":-2868.9477143680997},null,{"$f":"IF(ISBLANK('3. Data_Input_Sheet'!U44),'3. Data_Input_Sheet'!M44,'3. Data_Input_Sheet'!U44)","v":-2868.9477143680997},null,{"$f":"IF(ISBLANK('3. Data_Input_Sheet'!U44),'3. Data_Input_Sheet'!M44,'3. Data_Input_Sheet'!U44)","v":-2868.9477143680997}]
[null,11,null,"Taxable Income",null,{"$f":"SUM(F28:F30)","v":-1943.5422940480294},null,{"$f":"SUM(H28:H30)","v":918.54773124107487},null,{"$f":"SUM(J28+J30)","v":-1600.8141095206411},null,{"$f":"L28+L30","v":1289.6705686754976},null,{"$f":"SUM(N28+N30)","v":-1602.6603530477769},null,{"$f":"P28+P30","v":1287.8243251483618}]
[]
[null,12,null,"Income Tax Rate",null,{"$f":"'6. Taxes_PILs'!G41","v":0.21700348880927972},null,{"$f":"'6. Taxes_PILs'!G41","v":0.21700348880927972},null,{"$f":"'6. Taxes_PILs'!K41","v":0.23097923490415534},null,{"$f":"'6. Taxes_PILs'!K41","v":0.23097923490415534},null,{"$f":"'6. Taxes_PILs'!O41","v":0.23097923490415534},null,{"$f":"'6. Taxes_PILs'!O41","v":0.23097923490415534}]
[null,13,null,"Income Tax on Taxable Income",null,{"$f":"F31*F33","v":-421.75545845681336},null,{"$f":"H31*H33","v":199.32806231716188},null,{"$f":"J31*J33","v":-369.75481824085443},null,{"$f":"L31*L33","v":297.88712123107337},null,{"$f":"N31*N33","v":-370.18126215819899},null,{"$f":"P31*P33","v":297.46067731372881}]
[null,14,null,"Income Tax Credits",null,{"$f":"'3. Data_Input_Sheet'!E51","v":-10},null,{"$f":"'3. Data_Input_Sheet'!E51","v":-10},null,{"$f":"IF(ISBLANK('3. Data_Input_Sheet'!M51),'3. Data_Input_Sheet'!E51,'3. Data_Input_Sheet'!M51)","v":-37},null,{"$f":"IF(ISBLANK('3. Data_Input_Sheet'!M51),'3. Data_Input_Sheet'!E51,'3. Data_Input_Sheet'!M51)","v":-37},null,{"$f":"IF(ISBLANK('3. Data_Input_Sheet'!U51),'3. Data_Input_Sheet'!M51,'3. Data_Input_Sheet'!U51)","v":-37},null,{"$f":"IF(ISBLANK('3. Data_Input_Sheet'!U51),'3. Data_Input_Sheet'!M51,'3. Data_Input_Sheet'!U51)","v":-37}]
[null,15,null,"Utility Net Income ",null,{"$f":"F28-SUM(F34:F35)","v":1664.642883578701},null,{"$f":"'5. Utility Income'!F37","v":3905.6493880938297},null,{"$f":"J28-SUM(J34:J35)","v":1674.8884230883132},null,{"$f":"'5. Utility Income'!N37","v":3897.7311618125241},null,{"$f":"N28-SUM(N34:N35)","v":1673.4686234785217},null,{"$f":"'5. Utility Income'!V37","v":3895.8849182853883}]
[]
[null,16,null,"Utility Rate Base",null,{"$f":"'4. Rate_Base'!G18","v":104990.57494875895},null,{"$f":"'4. Rate_Base'!G18","v":104990.57494875895},null,{"$f":"'4. Rate_Base'!O18","v":104777.71940356247},null,{"$f":"'4. Rate_Base'!O18","v":104777.71940356247},null,{"$f":"'4. Rate_Base'!W18","v":104777.71940356247},null,{"$f":"'4. Rate_Base'!W18","v":104777.71940356247}]
[]
[null,17,null,"Deemed Equity Portion of Rate Base ",null,{"$f":"'7. Cost_of_Capital'!J24","v":41996.229979503572},null,{"$f":"F40","v":41996.229979503572},null,{"$f":"'7. Cost_of_Capital'!J40","v":41911.087761424977},null,{"$f":"J40","v":41911.087761424977},null,{"$f":"'7. Cost_of_Capital'!J56","v":41911.087761424977},null,{"$f":"N40","v":41911.087761424977}]
[]
[null,18,null,"Income/(Equity Portion of Rate Base)",null,{"$f":"IF(F40=0,0,F36/F40)","v":3.9637912364779808E-2},null,{"$f":"IF(H40=0,0,H36/H40)","v":9.2999999999999944E-2},null,{"$f":"IF(J40=0,0,J36/J40)","v":3.9962895561729675E-2},null,{"$f":"IF(L40=0,0,L36/L40)","v":9.3000000000000027E-2},null,{"$f":"IF(N40=0,0,N36/N40)","v":3.9929019094054261E-2},null,{"$f":"IF(P40=0,0,P36/P40)","v":9.2955948565743643E-2}]
[null,19,null,"Target Return - Equity on Rate Base",null,{"$f":"'7. Cost_of_Capital'!L24","v":9.2999999999999999E-2},null,{"$f":"'7. Cost_of_Capital'!L24","v":9.2999999999999999E-2},null,{"$f":"'7. Cost_of_Capital'!L40","v":9.2999999999999999E-2},null,{"$f":"'7. Cost_of_Capital'!L40","v":9.2999999999999999E-2},null,{"$f":"'7. Cost_of_Capital'!L56","v":9.2999999999999999E-2},null,{"$f":"'7. Cost_of_Capital'!L56","v":9.2999999999999999E-2}]
[null,20,null,"Deficiency/Sufficiency in Return on Equity",null,{"$f":"F42-F43","v":-5.3362087635220191E-2},null,{"$f":"H42-H43","v":0},null,{"$f":"J42-J43","v":-5.3037104438270324E-2},null,{"$f":"L42-L43","v":0},null,{"$f":"N42-N43","v":-5.3070980905945739E-2},null,{"$f":"P42-P43","v":-4.4051434256356381E-5}]
[]
[null,21,null,"Indicated Rate of Return",null,{"$f":"IF(F38=0,0,(F36+F25)/F38)","v":4.2185537821488865E-2},null,{"$f":"IF(H38=0,0,(H36+H25)/H38)","v":6.3530372875576918E-2},null,{"$f":"IF(J38=0,0,(J36+J25)/J38)","v":4.2297910526566278E-2},null,{"$f":"IF(L40=0,0,(L36+L25)/L38)","v":6.3512752301874406E-2},null,{"$f":"IF(N38=0,0,(N36+N25)/N38)","v":4.2301980513198639E-2},null,{"$f":"IF(P40=0,0,(P36+P25)/P38)","v":6.3512752301874392E-2}]
[null,22,null,"Requested Rate of Return on Rate Base",null,{"$f":"'7. Cost_of_Capital'!L26","v":6.3530372875576932E-2},null,{"$f":"'7. Cost_of_Capital'!L26","v":6.3530372875576932E-2},null,{"$f":"'7. Cost_of_Capital'!L42","v":6.3512752301874406E-2},null,{"$f":"'7. Cost_of_Capital'!L42","v":6.3512752301874406E-2},null,{"$f":"'7. Cost_of_Capital'!L58","v":6.3530372875576932E-2},null,{"$f":"'7. Cost_of_Capital'!L58","v":6.3530372875576932E-2}]
[null,23,null,"Deficiency/Sufficiency in Rate of Return",null,{"$f":"F46-F47","v":-2.1344835054088067E-2},null,{"$f":"H46-H47","v":0},null,{"$f":"J46-J47","v":-2.1214841775308128E-2},null,{"$f":"L46-L47","v":0},null,{"$f":"N46-N47","v":-2.1228392362378293E-2},null,{"$f":"P46-P47","v":-1.7620573702539777E-5}]
[]
[null,24,null,"Target Return on Equity",null,{"$f":"H50","v":3905.6493880938324},null,{"$f":"'7. Cost_of_Capital'!P24","v":3905.6493880938324},null,{"$f":"L50","v":3897.7311618125227},null,{"$f":"'7. Cost_of_Capital'!P40","v":3897.7311618125227},null,{"$f":"P50","v":3897.7311618125227},null,{"$f":"'7. Cost_of_Capital'!P56","v":3897.7311618125227}]
[null,25,null,"Revenue Deficiency/(Sufficiency)",null,{"$f":"F50-F36","v":2241.0065045151314}," ",{"$f":"H38*H48","v":0},null,{"$f":"J50-J36","v":2222.8427387242095},null,{"$f":"L38*L48","v":0},null,{"$f":"N50-N36","v":2224.262538334001},null,{"$f":"P38*P48","v":-1.8462435271345046}]
[null,26,null,"Gross Revenue Deficiency/(Sufficiency)",null,{"$f":"F51/(1-F33)","v":2862.0900252891074},"(1)",null,null,{"$f":"J51/(1-J33)","v":2890.4846781961369},"(1)",null,null,{"$f":"N51/(1-N33)","v":2892.3309217232727},"(1)"]
[]
[]
[null,"Notes:"]
[null,"(1)",null,"Revenue Deficiency/Sufficiency divided by (1 - Tax Rate)"]

{"sheet":"9. Rev_Reqt","index":8,"n_rows":39,"n_cols":17,"rows_kept":39,"cut":false,"hidden":false,"merged":[[0,2,0,13],[0,14,0,16],[19,13,19,14],[30,13,30,14],[17,13,17,14],[18,13,18,14],[21,13,21,14],[22,13,22,14],[29,13,29,14],[26,13,26,14],[27,13,27,14],[1,2,1,17],[2,2,2,17],[3,2,3,13],[14,13,14,14],[13,13,13,14],[12,13,12,14],[7,5,7,14],[41,3,41,16],[32,13,33,14],[34,13,35,14],[42,3,42,16],[43,3,43,16],[44,3,44,16],[15,13,15,14],[16,13,16,14],[20,13,20,14],[24,13,24,14],[39,3,39,16],[40,3,40,16],[37,1,37,14],[31,13,31,14],[32,9,33,9],[34,9,35,9],[34,5,35,5],[32,5,33,5]]}
[]
[]
[]
[]
[]
[]
[]
[]
[]
[]
[null,"Revenue Requirement"]
[]
[null,"Line No.",null,"Particulars",null,"Application   ",null,null,null,{"$f":"IF(ISBLANK('3. Data_Input_Sheet'!M12),\"\",'3. Data_Input_Sheet'!M12)","v":"Close of Discovery"},null,null,null,{"$f":"'3. Data_Input_Sheet'!U12","v":"Per Board Decision"}]
[]
[null,1,null,"OM&A Expenses",null,{"$f":"'5. Utility Income'!F22","v":11959.797188661209},null,null,null,{"$f":"'5. Utility Income'!N22","v":12018.844188661209},null,null,null,{"$f":"'5. Utility Income'!V22","v":12018.844188661209}]
[null,2,null,"Amortization/Depreciation",null,{"$f":"'5. Utility Income'!F23","v":3896.4625476849869},null,null,null,{"$f":"'5. Utility Income'!N23","v":3860.6110834166993},null,null,null,{"$f":"'5. Utility Income'!V23","v":3860.6110834166993}]
[null,3,null,"Property Taxes",null,{"$f":"'5. Utility Income'!F24","v":158.4445968},null,null,null,{"$f":"'5. Utility Income'!N24","v":158.4445968},null,null,null,{"$f":"'5. Utility Income'!V24","v":158.4445968}]
[null,4,null,"Capital Taxes",null,{"$f":"'6. Taxes_PILs'!G25","v":0},null,null,null,{"$f":"'6. Taxes_PILs'!K25","v":0},null,null,null,{"$f":"'6. Taxes_PILs'!O25","v":0}]
[null,5,null,"Income Taxes (Grossed up)",null,{"$f":"'6. Taxes_PILs'!G33-F18","v":189.32806231716228},null,null,null,{"$f":"'6. Taxes_PILs'!K33-J18","v":260.88712123107325},null,null,null,{"$f":"'6. Taxes_PILs'!O33-N18","v":260.88712123107325}]
[null,6,null,"Other Expenses",null,{"$f":"'5. Utility Income'!F26","v":27.459776926790777},null,null,null,{"$f":"'5. Utility Income'!N26","v":27.459776926790777},null,null,null,{"$f":"'5. Utility Income'!V26","v":27.459776926790777}]
[null,7,null,"Return"]
[null,null,null,"Deemed Interest Expense",null,{"$f":"'8. Rev_Def_Suff'!F25","v":2764.4409868220309},null,null,null,{"$f":"'8. Rev_Def_Suff'!L25","v":2756.9901774212394},null,null,null,{"$f":"'8. Rev_Def_Suff'!P25","v":2758.836420948373}]
[null,null,null,"Return on Deemed Equity",null,{"$f":"'8. Rev_Def_Suff'!F50","v":3905.6493880938324},null,null,null,{"$f":"'8. Rev_Def_Suff'!L50","v":3897.7311618125227},null,null,null,{"$f":"'8. Rev_Def_Suff'!P50","v":3897.7311618125227}]
[]
[null,8,null,"Service Revenue Requirement (before Revenues)",null,{"$f":"SUM(F15:F23)","v":22901.582547306014},null,null,null,{"$f":"SUM(J15:J23)","v":22980.968106269538},null,null,null,{"$f":"SUM(N15:O23)","v":22982.81434979667}]
[]
[null,9,null,"Revenue Offsets",null,{"$f":"'3. Data_Input_Sheet'!E33","v":1336.3189689879755},null,null,null,{"$f":"'3. Data_Input_Sheet'!M33","v":1334.4160822239544},null,null,null,{"$f":"'3. Data_Input_Sheet'!U33","v":0}]
[null,10,null,"Base Revenue Requirement",null,{"$f":"F25-F27","v":21565.263578318038},null,null,null,{"$f":"J25-J27","v":21646.552024045584},null,null,null,{"$f":"N25-N27","v":22982.81434979667}]
[null,null,null,"(excluding Tranformer Owership Allowance credit adjustment)"]
[]
[null,11,null,"Distribution revenue",null,{"$f":"'5. Utility Income'!F16","v":21565.263578318034},null,null,null,{"$f":"'5. Utility Income'!N16","v":21646.552024045581},null,null,null,{"$f":"'5. Utility Income'!V16","v":21646.552024045581}]
[null,12,null,"Other revenue",null,{"$f":"'5. Utility Income'!F17","v":1336.3189689879755},null,null,null,{"$f":"'5. Utility Income'!N17","v":1334.4160822239544},null,null,null,{"$f":"'5. Utility Income'!V17","v":1334.4160822239544}]
[null,null,null,null,null,{"$f":"SUM(F31:F32)","v":22901.58254730601},null,null,null,{"$f":"SUM(J31:J32)","v":22980.968106269534},null,null,null,{"$f":"SUM(N31:N32)","v":22980.968106269534}]
[null,13,null,"Total revenue"]
[null,null,null,null,null,{"$f":"F33-F25","v":0},null,null,null,{"$f":"J33-J25","v":0},null,null,null,{"$f":"N33-N25","v":-1.8462435271358117}]
[null,14,null,"Difference (Total Revenue Less Distribution Revenue Requirement before Revenues)",null,null,null,"(1)",null,null,null,"(1)",null,null,null,null,"(1)"]
[]
[null,"Notes"]
[null,"(1)",null,"Line 11 - Line 8"]

{"sheet":"10. Tracking_Sheet","index":9,"n_rows":203,"n_cols":18,"rows_kept":203,"cut":false,"hidden":false,"merged":[[207,1,207,14],[209,1,209,14],[210,1,210,14],[193,0,195,0],[193,1,194,1],[196,0,198,0],[196,1,197,1],[199,0,201,0],[199,1,200,1],[184,0,186,0],[184,1,185,1],[187,0,189,0],[187,1,188,1],[190,0,192,0],[190,1,191,1],[175,0,177,0],[175,1,176,1],[178,0,180,0],[178,1,179,1],[181,0,183,0],[181,1,182,1],[166,0,168,0],[166,1,167,1],[169,0,171,0],[169,1,170,1],[172,0,174,0],[172,1,173,1],[157,0,159,0],[157,1,158,1],[160,0,162,0],[160,1,161,1],[163,0,165,0],[163,1,164,1],[148,0,150,0],[148,1,149,1],[151,0,153,0],[151,1,152,1],[154,0,156,0],[154,1,155,1],[139,0,141,0],[139,1,140,1],[142,0,144,0],[142,1,143,1],[145,0,147,0],[145,1,146,1],[130,0,132,0],[130,1,131,1],[133,0,135,0],[133,1,134,1],[136,0,138,0],[136,1,137,1],[121,0,123,0],[121,1,122,1],[124,0,126,0],[124,1,125,1],[127,0,129,0],[127,1,128,1],[112,0,114,0],[112,1,113,1],[115,0,117,0],[115,1,116,1],[118,0,120,0],[118,1,119,1],[103,0,105,0],[103,1,104,1],[106,0,108,0],[106,1,107,1],[109,0,111,0],[109,1,110,1],[94,0,96,0],[94,1,95,1],[97,0,99,0],[97,1,98,1],[100,0,102,0],[100,1,101,1],[85,0,87,0],[85,1,86,1],[88,0,90,0],[88,1,89,1],[91,0,93,0],[91,1,92,1],[76,0,78,0],[76,1,77,1],[79,0,81,0],[79,1,80,1],[82,0,84,0],[82,1,83,1],[67,0,69,0],[67,1,68,1],[70,0,72,0],[70,1,71,1],[73,0,75,0],[73,1,74,1],[58,0,60,0],[58,1,59,1],[61,0,63,0],[61,1,62,1],[64,0,66,0],[64,1,65,1],[49,0,51,0],[49,1,50,1],[52,0,54,0],[52,1,53,1],[55,0,57,0],[55,1,56,1],[40,0,42,0],[40,1,41,1],[43,0,45,0],[43,1,44,1],[46,0,48,0],[46,1,47,1],[31,0,33,0],[31,1,32,1],[34,0,36,0],[34,1,35,1],[37,0,39,0],[37,1,38,1],[22,0,24,0],[22,1,23,1],[25,0,27,0],[25,1,26,1],[28,0,30,0],[28,1,29,1],[14,1,14,14],[15,1,15,14],[17,3,17,4],[17,5,17,7],[17,8,17,10],[17,11,17,14]]}
[]
[]
[]
[]
[]
[]
[]
[]
[]
[]
[]
[]
[]
[null,"Tracking Form"]
[null,"The last row shown is the most current estimate of the cost of service data reflecting the original application and any updates provided by the applicant distributor (for updated evidence, responses to interrogatories, undertakings, etc.)\nPlease ensure a Reference (Column B) and/or Item Description (Column C) is entered.  Please note that unused rows will automatically be hidden and the PRINT AREA set when the PRINT BUTTON on Sheet 1 is activated.\n(1) Short reference to evidence material (interrogatory response, undertaking, exhibit number, Board Decision, Code, Guideline, Report of the Board, etc.)\n(2) Short description of change, issue, etc.\n\n60 Tracking Rows have been provided below.  If you require more, please contact Industry Relations @ IndustryRelations@ontarioenergyboard.ca. "]
[null,"Summary of Proposed Changes 2015"]
[]
[null,null,null,"Cost of Capital",null,"Rate Base and Capital Expenditures",null,null,"Operating Expenses",null,null,"Revenue Requirement"]
[null,"Reference (1)","Item / Description (2)","Regulated Return on Capital","Regulated Rate of Return","Rate Base","Working Capital","Working Capital Allowance ($)","Amortization / Depreciation","Taxes/PILs","OM&A","Service Revenue Requirement","Other Revenues","Base Revenue Requirement","Grossed up Revenue Deficiency / Sufficiency"]
[]
[null,null,"Original Application",6670.0903749158633,6.3530372875576932E-2,104990.57494875895,132780.51876778592,17261.467439812172,3896.4625476849869,189.32806231716228,11959.797188661209,22901.582547306014,1336.3189689879755,21565.263578318038,2862.0900252891074]
[]
[1,"Multiple Interrogatories","2014 Actuals Updated",6662.1792667003974,6.3520900697157975E-2,104881.68765841311,132780.51876778592,17261.467439812172,3796.5937362578911,180.53004272760089,11959.797188661209,22785.00460807389,1335.0559689879753,21449.948639085917,2746.7750860569849,null,{"$f":"IF(AND(ISBLANK(B23), ISBLANK(C23)), \"X\", \"\")","v":""}]
[null,null,"          Change",{"$f":"IF(D23=\"\",\"\",D23-D21)","v":-7.9111082154659016},{"$f":"IF(E23=\"\",\"\",E23-E21)","v":-9.4721784189566449E-6},-108.88729034583957,0,0,-99.868811427095807,-8.7980195895613917,0,-116.57793923212375,-1.2630000000001473,-115.31493923212111,-115.31493923212247]
[]
[2,"4-Energy Probe-50 & 54","Tax Updates (CCA Class 10 to 50, Adjusted Tax Credits)",6662.192337185169,6.3521025318386548E-2,104881.68765841311,132780.51876778592,17261.467439812172,3796.5937362578911,132.60090752980884,11959.797188661209,22737.088543360867,1335.0559689879753,21402.032574372894,2698.8590213439652,null,{"$f":"IF(AND(ISBLANK(B26), ISBLANK(C26)), \"X\", \"\")","v":""}]
[null,null,"          Change",{"$f":"IF(D26=\"\",\"\",D26-D23)","v":1.3070484771560587E-2},{"$f":"IF(E26=\"\",\"\",E26-E23)","v":1.2462122857270774E-7},0,0,0,0,-47.92913519779205,0,-47.916064713022934,0,-47.916064713022934,-47.91606471301975]
[]
[3,"4.0-Staff-31","Updated Post-Retirement Benefits Actuarial Valuation",6662.4547231990973,6.351887821447022E-2,104889.36376841311,132839.56576778594,17269.143549812172,3796.5937362578911,192.38792345130409,12018.844188661209,22856.184945296292,1335.0559689879753,21521.128976308319,2817.9554232793885,null,{"$f":"IF(AND(ISBLANK(B29), ISBLANK(C29)), \"X\", \"\")","v":""}]
[null,null,"          Change",{"$f":"IF(D29=\"\",\"\",D29-D26)","v":0.26238601392833516},{"$f":"IF(E29=\"\",\"\",E29-E26)","v":-2.147103916327886E-6},{"$f":"IF(F29=\"\",\"\",F29-F26)","v":7.6761100000003353},{"$f":"IF(G29=\"\",\"\",G29-G26)","v":59.047000000020489},{"$f":"IF(H29=\"\",\"\",H29-H26)","v":7.6761100000003353},{"$f":"IF(I29=\"\",\"\",I29-I26)","v":0},{"$f":"IF(J29=\"\",\"\",J29-J26)","v":59.787015921495254},{"$f":"IF(K29=\"\",\"\",K29-K26)","v":59.04700000000048},{"$f":"IF(L29=\"\",\"\",L29-L26)","v":119.09640193542509},{"$f":"IF(M29=\"\",\"\",M29-M26)","v":0},{"$f":"IF(N29=\"\",\"\",N29-N26)","v":119.09640193542509},{"$f":"IF(O29=\"\",\"\",O29-O26)","v":119.09640193542327}]
[]
[4,"3.0-Staff-25; 3.0-Energy Probe-33/34; 3.0-VECC-26/27/31;1.0-CCC-17; ","Updated Load Forecast",6663.9633726068478,6.3518957335328391E-2,104912.98428320454,133021.26203541225,17292.764064603594,3796.5937362578911,192.77032725561111,12018.844188661209,22858.07599850835,1334.4160822239544,21523.659916284396,2857.6905198067484,null,{"$f":"IF(AND(ISBLANK(B32), ISBLANK(C32)), \"X\", \"\")","v":""}]
[null,null,"          Change",{"$f":"IF(D32=\"\",\"\",D32-D29)","v":1.508649407750454},{"$f":"IF(E32=\"\",\"\",E32-E29)","v":7.9120858170744768E-8},{"$f":"IF(F32=\"\",\"\",F32-F29)","v":23.620514791429741},{"$f":"IF(G32=\"\",\"\",G32-G29)","v":181.69626762630651},{"$f":"IF(H32=\"\",\"\",H32-H29)","v":23.620514791422465},{"$f":"IF(I32=\"\",\"\",I32-I29)","v":0},{"$f":"IF(J32=\"\",\"\",J32-J29)","v":0.38240380430701748},{"$f":"IF(K32=\"\",\"\",K32-K29)","v":0},{"$f":"IF(L32=\"\",\"\",L32-L29)","v":1.8910532120571588},{"$f":"IF(M32=\"\",\"\",M32-M29)","v":-0.63988676402095734},{"$f":"IF(N32=\"\",\"\",N32-N29)","v":2.5309399760772067},{"$f":"IF(O32=\"\",\"\",O32-O29)","v":39.735096527359929}]
[]
[5,"2.0-Staff-6 & Multiple Others","DSP/Capital Updates to capacity solutions (HONI TS contributions & new MS9 substation) and changes to timing of In Service dates",6646.9986197515045,6.3512843686492626E-2,104655.97560962514,133021.26203541225,17292.764064603594,3860.6110834166993,259.27578319229605,12018.844188661209,22971.634048748499,1334.4160822239544,21637.217966524546,2971.2485700468978,null,{"$f":"IF(AND(ISBLANK(B35), ISBLANK(C35)), \"X\", \"\")","v":""}]
[null,null,"          Change",{"$f":"IF(D35=\"\",\"\",D35-D32)","v":-16.964752855343249},{"$f":"IF(E35=\"\",\"\",E35-E32)","v":-6.1136488357649288E-6},{"$f":"IF(F35=\"\",\"\",F35-F32)","v":-257.00867357940297},{"$f":"IF(G35=\"\",\"\",G35-G32)","v":0},{"$f":"IF(H35=\"\",\"\",H35-H32)","v":0},{"$f":"IF(I35=\"\",\"\",I35-I32)","v":64.017347158808207},{"$f":"IF(J35=\"\",\"\",J35-J32)","v":66.505455936684939},{"$f":"IF(K35=\"\",\"\",K35-K32)","v":0},{"$f":"IF(L35=\"\",\"\",L35-L32)","v":113.5580502401499},{"$f":"IF(M35=\"\",\"\",M35-M32)","v":0},{"$f":"IF(N35=\"\",\"\",N35-N32)","v":113.5580502401499},{"$f":"IF(O35=\"\",\"\",O35-O32)","v":113.55805024014944}]
[]
[6,null,"Adjustment for CDM Activities",{"$f":"IF($C38=\"\",\"\",'7. Cost_of_Capital'!$P$42)","v":6654.7213392337617},{"$f":"IF($C38=\"\",\"\",'7. Cost_of_Capital'!$L$42)","v":6.3512752301874406E-2},{"$f":"IF($C38=\"\",\"\",'4. Rate_Base'!$W$18)","v":104777.71940356247},{"$f":"IF($C38=\"\",\"\",'4. Rate_Base'!$W$26)","v":133957.75275800718},{"$f":"IF($C38=\"\",\"\",'4. Rate_Base'!$W$30)","v":17414.507858540932},{"$f":"IF($C38=\"\",\"\",'9. Rev_Reqt'!$J$16)","v":3860.6110834166993},{"$f":"IF($C38=\"\",\"\",'9. Rev_Reqt'!$J$19)","v":260.88712123107325},{"$f":"IF($C38=\"\",\"\",'9. Rev_Reqt'!$J$15)","v":12018.844188661209},{"$f":"IF($C38=\"\",\"\",'9. Rev_Reqt'!$J$25)","v":22980.968106269538},{"$f":"IF($C38=\"\",\"\",'9. Rev_Reqt'!$J$32)","v":1334.4160822239544},{"$f":"IF($C38=\"\",\"\",'9. Rev_Reqt'!$J$28)","v":21646.552024045584},{"$f":"IF($C38=\"\",\"\",'8. Rev_Def_Suff'!$J$52)","v":2890.4846781961369},null,{"$f":"IF(AND(ISBLANK(B38), ISBLANK(C38)), \"X\", \"\")","v":""}]
[null,null,"          Change",{"$f":"IF(D38=\"\",\"\",D38-D35)","v":7.7227194822571619},{"$f":"IF(E38=\"\",\"\",E38-E35)","v":-9.1384618219891856E-8},{"$f":"IF(F38=\"\",\"\",F38-F35)","v":121.74379393733398},{"$f":"IF(G38=\"\",\"\",G38-G35)","v":936.49072259492823},{"$f":"IF(H38=\"\",\"\",H38-H35)","v":121.74379393733761},{"$f":"IF(I38=\"\",\"\",I38-I35)","v":0},{"$f":"IF(J38=\"\",\"\",J38-J35)","v":1.6113380387772054},{"$f":"IF(K38=\"\",\"\",K38-K35)","v":0},{"$f":"IF(L38=\"\",\"\",L38-L35)","v":9.3340575210386305},{"$f":"IF(M38=\"\",\"\",M38-M35)","v":0},{"$f":"IF(N38=\"\",\"\",N38-N35)","v":9.3340575210386305},{"$f":"IF(O38=\"\",\"\",O38-O35)","v":-80.763891850760956}]
[]
[7,null,null,{"$f":"IF($C41=\"\",\"\",'7. Cost_of_Capital'!$P$42)","v":""},{"$f":"IF($C41=\"\",\"\",'7. Cost_of_Capital'!$L$26)","v":""},{"$f":"IF($C41=\"\",\"\",'4. Rate_Base'!$G$18)","v":""},{"$f":"IF($C41=\"\",\"\",'4. Rate_Base'!$G$26)","v":""},{"$f":"IF($C41=\"\",\"\",'4. Rate_Base'!$G$30)","v":""},{"$f":"IF($C41=\"\",\"\",'9. Rev_Reqt'!$F$16)","v":""},{"$f":"IF($C41=\"\",\"\",'9. Rev_Reqt'!$F$19)","v":""},{"$f":"IF($C41=\"\",\"\",'9. Rev_Reqt'!$F$15)","v":""},{"$f":"IF($C41=\"\",\"\",'9. Rev_Reqt'!$F$25)","v":""},{"$f":"IF($C41=\"\",\"\",'9. Rev_Reqt'!$F$32)","v":""},{"$f":"IF($C41=\"\",\"\",'9. Rev_Reqt'!$F$28)","v":""},{"$f":"IF($C41=\"\",\"\",'8. Rev_Def_Suff'!$F$52)","v":""},null,{"$f":"IF(AND(ISBLANK(B41), ISBLANK(C41)), \"X\", \"\")","v":"X"}]
[null,null,"          Change",{"$f":"IF(D41=\"\",\"\",D41-D38)","v":""},{"$f":"IF(E41=\"\",\"\",E41-E38)","v":""},{"$f":"IF(F41=\"\",\"\",F41-F38)","v":""},{"$f":"IF(G41=\"\",\"\",G41-G38)","v":""},{"$f":"IF(H41=\"\",\"\",H41-H38)","v":""},{"$f":"IF(I41=\"\",\"\",I41-I38)","v":""},{"$f":"IF(J41=\"\",\"\",J41-J38)","v":""},{"$f":"IF(K41=\"\",\"\",K41-K38)","v":""},{"$f":"IF(L41=\"\",\"\",L41-L38)","v":""},{"$f":"IF(M41=\"\",\"\",M41-M38)","v":""},{"$f":"IF(N41=\"\",\"\",N41-N38)","v":""},{"$f":"IF(O41=\"\",\"\",O41-O38)","v":""}]
[]
[8,null,null,{"$f":"IF($C44=\"\",\"\",'7. Cost_of_Capital'!$P$26)","v":""},{"$f":"IF($C44=\"\",\"\",'7. Cost_of_Capital'!$L$26)","v":""},{"$f":"IF($C44=\"\",\"\",'4. Rate_Base'!$G$18)","v":""},{"$f":"IF($C44=\"\",\"\",'4. Rate_Base'!$G$26)","v":""},{"$f":"IF($C44=\"\",\"\",'4. Rate_Base'!$G$30)","v":""},{"$f":"IF($C44=\"\",\"\",'9. Rev_Reqt'!$F$16)","v":""},{"$f":"IF($C44=\"\",\"\",'9. Rev_Reqt'!$F$19)","v":""},{"$f":"IF($C44=\"\",\"\",'9. Rev_Reqt'!$F$15)","v":""},{"$f":"IF($C44=\"\",\"\",'9. Rev_Reqt'!$F$25)","v":""},{"$f":"IF($C44=\"\",\"\",'9. Rev_Reqt'!$F$32)","v":""},{"$f":"IF($C44=\"\",\"\",'9. Rev_Reqt'!$F$28)","v":""},{"$f":"IF($C44=\"\",\"\",'8. Rev_Def_Suff'!$F$52)","v":""},null,{"$f":"IF(AND(ISBLANK(B44), ISBLANK(C44)), \"X\", \"\")","v":"X"}]
[null,null,"          Change",{"$f":"IF(D44=\"\",\"\",D44-D41)","v":""},{"$f":"IF(E44=\"\",\"\",E44-E41)","v":""},{"$f":"IF(F44=\"\",\"\",F44-F41)","v":""},{"$f":"IF(G44=\"\",\"\",G44-G41)","v":""},{"$f":"IF(H44=\"\",\"\",H44-H41)","v":""},{"$f":"IF(I44=\"\",\"\",I44-I41)","v":""},{"$f":"IF(J44=\"\",\"\",J44-J41)","v":""},{"$f":"IF(K44=\"\",\"\",K44-K41)","v":""},{"$f":"IF(L44=\"\",\"\",L44-L41)","v":""},{"$f":"IF(M44=\"\",\"\",M44-M41)","v":""},{"$f":"IF(N44=\"\",\"\",N44-N41)","v":""},{"$f":"IF(O44=\"\",\"\",O44-O41)","v":""}]
[]
[9,null,null,{"$f":"IF($C47=\"\",\"\",'7. Cost_of_Capital'!$P$26)","v":""},{"$f":"IF($C47=\"\",\"\",'7. Cost_of_Capital'!$L$26)","v":""},{"$f":"IF($C47=\"\",\"\",'4. Rate_Base'!$G$18)","v":""},{"$f":"IF($C47=\"\",\"\",'4. Rate_Base'!$G$26)","v":""},{"$f":"IF($C47=\"\",\"\",'4. Rate_Base'!$G$30)","v":""},{"$f":"IF($C47=\"\",\"\",'9. Rev_Reqt'!$F$16)","v":""},{"$f":"IF($C47=\"\",\"\",'9. Rev_Reqt'!$F$19)","v":""},{"$f":"IF($C47=\"\",\"\",'9. Rev_Reqt'!$F$15)","v":""},{"$f":"IF($C47=\"\",\"\",'9. Rev_Reqt'!$F$25)","v":""},{"$f":"IF($C47=\"\",\"\",'9. Rev_Reqt'!$F$32)","v":""},{"$f":"IF($C47=\"\",\"\",'9. Rev_Reqt'!$F$28)","v":""},{"$f":"IF($C47=\"\",\"\",'8. Rev_Def_Suff'!$F$52)","v":""},null,{"$f":"IF(AND(ISBLANK(B47), ISBLANK(C47)), \"X\", \"\")","v":"X"}]
[null,null,"          Change",{"$f":"IF(D47=\"\",\"\",D47-D44)","v":""},{"$f":"IF(E47=\"\",\"\",E47-E44)","v":""},{"$f":"IF(F47=\"\",\"\",F47-F44)","v":""},{"$f":"IF(G47=\"\",\"\",G47-G44)","v":""},{"$f":"IF(H47=\"\",\"\",H47-H44)","v":""},{"$f":"IF(I47=\"\",\"\",I47-I44)","v":""},{"$f":"IF(J47=\"\",\"\",J47-J44)","v":""},{"$f":"IF(K47=\"\",\"\",K47-K44)","v":""},{"$f":"IF(L47=\"\",\"\",L47-L44)","v":""},{"$f":"IF(M47=\"\",\"\",M47-M44)","v":""},{"$f":"IF(N47=\"\",\"\",N47-N44)","v":""},{"$f":"IF(O47=\"\",\"\",O47-O44)","v":""}]
[]
[10,null,null,{"$f":"IF($C50=\"\",\"\",'7. Cost_of_Capital'!$P$26)","v":""},{"$f":"IF($C50=\"\",\"\",'7. Cost_of_Capital'!$L$26)","v":""},{"$f":"IF($C50=\"\",\"\",'4. Rate_Base'!$G$18)","v":""},{"$f":"IF($C50=\"\",\"\",'4. Rate_Base'!$G$26)","v":""},{"$f":"IF($C50=\"\",\"\",'4. Rate_Base'!$G$30)","v":""},{"$f":"IF($C50=\"\",\"\",'9. Rev_Reqt'!$F$16)","v":""},{"$f":"IF($C50=\"\",\"\",'9. Rev_Reqt'!$F$19)","v":""},{"$f":"IF($C50=\"\",\"\",'9. Rev_Reqt'!$F$15)","v":""},{"$f":"IF($C50=\"\",\"\",'9. Rev_Reqt'!$F$25)","v":""},{"$f":"IF($C50=\"\",\"\",'9. Rev_Reqt'!$F$32)","v":""},{"$f":"IF($C50=\"\",\"\",'9. Rev_Reqt'!$F$28)","v":""},{"$f":"IF($C50=\"\",\"\",'8. Rev_Def_Suff'!$F$52)","v":""},null,{"$f":"IF(AND(ISBLANK(B50), ISBLANK(C50)), \"X\", \"\")","v":"X"}]
[null,null,"          Change",{"$f":"IF(D50=\"\",\"\",D50-D47)","v":""},{"$f":"IF(E50=\"\",\"\",E50-E47)","v":""},{"$f":"IF(F50=\"\",\"\",F50-F47)","v":""},{"$f":"IF(G50=\"\",\"\",G50-G47)","v":""},{"$f":"IF(H50=\"\",\"\",H50-H47)","v":""},{"$f":"IF(I50=\"\",\"\",I50-I47)","v":""},{"$f":"IF(J50=\"\",\"\",J50-J47)","v":""},{"$f":"IF(K50=\"\",\"\",K50-K47)","v":""},{"$f":"IF(L50=\"\",\"\",L50-L47)","v":""},{"$f":"IF(M50=\"\",\"\",M50-M47)","v":""},{"$f":"IF(N50=\"\",\"\",N50-N47)","v":""},{"$f":"IF(O50=\"\",\"\",O50-O47)","v":""}]
[]
[11,null,null,{"$f":"IF($C53=\"\",\"\",'7. Cost_of_Capital'!$P$26)","v":""},{"$f":"IF($C53=\"\",\"\",'7. Cost_of_Capital'!$L$26)","v":""},{"$f":"IF($C53=\"\",\"\",'4. Rate_Base'!$G$18)","v":""},{"$f":"IF($C53=\"\",\"\",'4. Rate_Base'!$G$26)","v":""},{"$f":"IF($C53=\"\",\"\",'4. Rate_Base'!$G$30)","v":""},{"$f":"IF($C53=\"\",\"\",'9. Rev_Reqt'!$F$16)","v":""},{"$f":"IF($C53=\"\",\"\",'9. Rev_Reqt'!$F$19)","v":""},{"$f":"IF($C53=\"\",\"\",'9. Rev_Reqt'!$F$15)","v":""},{"$f":"IF($C53=\"\",\"\",'9. Rev_Reqt'!$F$25)","v":""},{"$f":"IF($C53=\"\",\"\",'9. Rev_Reqt'!$F$32)","v":""},{"$f":"IF($C53=\"\",\"\",'9. Rev_Reqt'!$F$28)","v":""},{"$f":"IF($C53=\"\",\"\",'8. Rev_Def_Suff'!$F$52)","v":""},null,{"$f":"IF(AND(ISBLANK(B53), ISBLANK(C53)), \"X\", \"\")","v":"X"}]
[null,null,"          Change",{"$f":"IF(D53=\"\",\"\",D53-D50)","v":""},{"$f":"IF(E53=\"\",\"\",E53-E50)","v":""},{"$f":"IF(F53=\"\",\"\",F53-F50)","v":""},{"$f":"IF(G53=\"\",\"\",G53-G50)","v":""},{"$f":"IF(H53=\"\",\"\",H53-H50)","v":""},{"$f":"IF(I53=\"\",\"\",I53-I50)","v":""},{"$f":"IF(J53=\"\",\"\",J53-J50)","v":""},{"$f":"IF(K53=\"\",\"\",K53-K50)","v":""},{"$f":"IF(L53=\"\",\"\",L53-L50)","v":""},{"$f":"IF(M53=\"\",\"\",M53-M50)","v":""},{"$f":"IF(N53=\"\",\"\",N53-N50)","v":""},{"$f":"IF(O53=\"\",\"\",O53-O50)","v":""}]
[]
[12,null,null,{"$f":"IF($C56=\"\",\"\",'7. Cost_of_Capital'!$P$26)","v":""},{"$f":"IF($C56=\"\",\"\",'7. Cost_of_Capital'!$L$26)","v":""},{"$f":"IF($C56=\"\",\"\",'4. Rate_Base'!$G$18)","v":""},{"$f":"IF($C56=\"\",\"\",'4. Rate_Base'!$G$26)","v":""},{"$f":"IF($C56=\"\",\"\",'4. Rate_Base'!$G$30)","v":""},{"$f":"IF($C56=\"\",\"\",'9. Rev_Reqt'!$F$16)","v":""},{"$f":"IF($C56=\"\",\"\",'9. Rev_Reqt'!$F$19)","v":""},{"$f":"IF($C56=\"\",\"\",'9. Rev_Reqt'!$F$15)","v":""},{"$f":"IF($C56=\"\",\"\",'9. Rev_Reqt'!$F$25)","v":""},{"$f":"IF($C56=\"\",\"\",'9. Rev_Reqt'!$F$32)","v":""},{"$f":"IF($C56=\"\",\"\",'9. Rev_Reqt'!$F$28)","v":""},{"$f":"IF($C56=\"\",\"\",'8. Rev_Def_Suff'!$F$52)","v":""},null,{"$f":"IF(AND(ISBLANK(B56), ISBLANK(C56)), \"X\", \"\")","v":"X"}]
[null,null,"          Change",{"$f":"IF(D56=\"\",\"\",D56-D53)","v":""},{"$f":"IF(E56=\"\",\"\",E56-E53)","v":""},{"$f":"IF(F56=\"\",\"\",F56-F53)","v":""},{"$f":"IF(G56=\"\",\"\",G56-G53)","v":""},{"$f":"IF(H56=\"\",\"\",H56-H53)","v":""},{"$f":"IF(I56=\"\",\"\",I56-I53)","v":""},{"$f":"IF(J56=\"\",\"\",J56-J53)","v":""},{"$f":"IF(K56=\"\",\"\",K56-K53)","v":""},{"$f":"IF(L56=\"\",\"\",L56-L53)","v":""},{"$f":"IF(M56=\"\",\"\",M56-M53)","v":""},{"$f":"IF(N56=\"\",\"\",N56-N53)","v":""},{"$f":"IF(O56=\"\",\"\",O56-O53)","v":""}]
[]
[13,null,null,{"$f":"IF($C59=\"\",\"\",'7. Cost_of_Capital'!$P$26)","v":""},{"$f":"IF($C59=\"\",\"\",'7. Cost_of_Capital'!$L$26)","v":""},{"$f":"IF($C59=\"\",\"\",'4. Rate_Base'!$G$18)","v":""},{"$f":"IF($C59=\"\",\"\",'4. Rate_Base'!$G$26)","v":""},{"$f":"IF($C59=\"\",\"\",'4. Rate_Base'!$G$30)","v":""},{"$f":"IF($C59=\"\",\"\",'9. Rev_Reqt'!$F$16)","v":""},{"$f":"IF($C59=\"\",\"\",'9. Rev_Reqt'!$F$19)","v":""},{"$f":"IF($C59=\"\",\"\",'9. Rev_Reqt'!$F$15)","v":""},{"$f":"IF($C59=\"\",\"\",'9. Rev_Reqt'!$F$25)","v":""},{"$f":"IF($C59=\"\",\"\",'9. Rev_Reqt'!$F$32)","v":""},{"$f":"IF($C59=\"\",\"\",'9. Rev_Reqt'!$F$28)","v":""},{"$f":"IF($C59=\"\",\"\",'8. Rev_Def_Suff'!$F$52)","v":""},null,{"$f":"IF(AND(ISBLANK(B59), ISBLANK(C59)), \"X\", \"\")","v":"X"}]
[null,null,"          Change",{"$f":"IF(D59=\"\",\"\",D59-D56)","v":""},{"$f":"IF(E59=\"\",\"\",E59-E56)","v":""},{"$f":"IF(F59=\"\",\"\",F59-F56)","v":""},{"$f":"IF(G59=\"\",\"\",G59-G56)","v":""},{"$f":"IF(H59=\"\",\"\",H59-H56)","v":""},{"$f":"IF(I59=\"\",\"\",I59-I56)","v":""},{"$f":"IF(J59=\"\",\"\",J59-J56)","v":""},{"$f":"IF(K59=\"\",\"\",K59-K56)","v":""},{"$f":"IF(L59=\"\",\"\",L59-L56)","v":""},{"$f":"IF(M59=\"\",\"\",M59-M56)","v":""},{"$f":"IF(N59=\"\",\"\",N59-N56)","v":""},{"$f":"IF(O59=\"\",\"\",O59-O56)","v":""}]
[]
[14,null,null,{"$f":"IF($C62=\"\",\"\",'7. Cost_of_Capital'!$P$26)","v":""},{"$f":"IF($C62=\"\",\"\",'7. Cost_of_Capital'!$L$26)","v":""},{"$f":"IF($C62=\"\",\"\",'4. Rate_Base'!$G$18)","v":""},{"$f":"IF($C62=\"\",\"\",'4. Rate_Base'!$G$26)","v":""},{"$f":"IF($C62=\"\",\"\",'4. Rate_Base'!$G$30)","v":""},{"$f":"IF($C62=\"\",\"\",'9. Rev_Reqt'!$F$16)","v":""},{"$f":"IF($C62=\"\",\"\",'9. Rev_Reqt'!$F$19)","v":""},{"$f":"IF($C62=\"\",\"\",'9. Rev_Reqt'!$F$15)","v":""},{"$f":"IF($C62=\"\",\"\",'9. Rev_Reqt'!$F$25)","v":""},{"$f":"IF($C62=\"\",\"\",'9. Rev_Reqt'!$F$32)","v":""},{"$f":"IF($C62=\"\",\"\",'9. Rev_Reqt'!$F$28)","v":""},{"$f":"IF($C62=\"\",\"\",'8. Rev_Def_Suff'!$F$52)","v":""},null,{"$f":"IF(AND(ISBLANK(B62), ISBLANK(C62)), \"X\", \"\")","v":"X"}]
[null,null,"          Change",{"$f":"IF(D62=\"\",\"\",D62-D59)","v":""},{"$f":"IF(E62=\"\",\"\",E62-E59)","v":""},{"$f":"IF(F62=\"\",\"\",F62-F59)","v":""},{"$f":"IF(G62=\"\",\"\",G62-G59)","v":""},{"$f":"IF(H62=\"\",\"\",H62-H59)","v":""},{"$f":"IF(I62=\"\",\"\",I62-I59)","v":""},{"$f":"IF(J62=\"\",\"\",J62-J59)","v":""},{"$f":"IF(K62=\"\",\"\",K62-K59)","v":""},{"$f":"IF(L62=\"\",\"\",L62-L59)","v":""},{"$f":"IF(M62=\"\",\"\",M62-M59)","v":""},{"$f":"IF(N62=\"\",\"\",N62-N59)","v":""},{"$f":"IF(O62=\"\",\"\",O62-O59)","v":""}]
[]
[15,null,null,{"$f":"IF($C65=\"\",\"\",'7. Cost_of_Capital'!$P$26)","v":""},{"$f":"IF($C65=\"\",\"\",'7. Cost_of_Capital'!$L$26)","v":""},{"$f":"IF($C65=\"\",\"\",'4. Rate_Base'!$G$18)","v":""},{"$f":"IF($C65=\"\",\"\",'4. Rate_Base'!$G$26)","v":""},{"$f":"IF($C65=\"\",\"\",'4. Rate_Base'!$G$30)","v":""},{"$f":"IF($C65=\"\",\"\",'9. Rev_Reqt'!$F$16)","v":""},{"$f":"IF($C65=\"\",\"\",'9. Rev_Reqt'!$F$19)","v":""},{"$f":"IF($C65=\"\",\"\",'9. Rev_Reqt'!$F$15)","v":""},{"$f":"IF($C65=\"\",\"\",'9. Rev_Reqt'!$F$25)","v":""},{"$f":"IF($C65=\"\",\"\",'9. Rev_Reqt'!$F$32)","v":""},{"$f":"IF($C65=\"\",\"\",'9. Rev_Reqt'!$F$28)","v":""},{"$f":"IF($C65=\"\",\"\",'8. Rev_Def_Suff'!$F$52)","v":""},null,{"$f":"IF(AND(ISBLANK(B65), ISBLANK(C65)), \"X\", \"\")","v":"X"}]
[null,null,"          Change",{"$f":"IF(D65=\"\",\"\",D65-D62)","v":""},{"$f":"IF(E65=\"\",\"\",E65-E62)","v":""},{"$f":"IF(F65=\"\",\"\",F65-F62)","v":""},{"$f":"IF(G65=\"\",\"\",G65-G62)","v":""},{"$f":"IF(H65=\"\",\"\",H65-H62)","v":""},{"$f":"IF(I65=\"\",\"\",I65-I62)","v":""},{"$f":"IF(J65=\"\",\"\",J65-J62)","v":""},{"$f":"IF(K65=\"\",\"\",K65-K62)","v":""},{"$f":"IF(L65=\"\",\"\",L65-L62)","v":""},{"$f":"IF(M65=\"\",\"\",M65-M62)","v":""},{"$f":"IF(N65=\"\",\"\",N65-N62)","v":""},{"$f":"IF(O65=\"\",\"\",O65-O62)","v":""}]
[]
[16,null,null,null,null,null,null,null,null,null,null,null,null,null,null,null,{"$f":"IF(AND(ISBLANK(B68), ISBLANK(C68)), \"X\", \"\")","v":"X"}]
[null,null,"          Change"]
[]
[17,null,null,null,null,null,null,null,null,null,null,null,null,null,null,null,{"$f":"IF(AND(ISBLANK(B71), ISBLANK(C71)), \"X\", \"\")","v":"X"}]
[null,null,"          Change"]
[]
[18,null,null,null,null,null,null,null,null,null,null,null,null,null,null,null,{"$f":"IF(AND(ISBLANK(B74), ISBLANK(C74)), \"X\", \"\")","v":"X"}]
[null,null,"          Change"]
[null,null,null,null,null,null,null,null,null,null,null,null,null,null,null,null,null,"Page Break 1"]
[19,null,null,null,null,null,null,null,null,null,null,null,null,null,null,null,{"$f":"IF(AND(ISBLANK(B77), ISBLANK(C77)), \"X\", \"\")","v":"X"}]
[null,null,"          Change"]
[]
[20,null,null,null,null,null,null,null,null,null,null,null,null,null,null,null,{"$f":"IF(AND(ISBLANK(B80), ISBLANK(C80)), \"X\", \"\")","v":"X"}]
[null,null,"          Change"]
[]
[21,null,null,null,null,null,null,null,null,null,null,null,null,null,null,null,{"$f":"IF(AND(ISBLANK(B83), ISBLANK(C83)), \"X\", \"\")","v":"X"}]
[null,null,"          Change"]
[]
[22,null,null,null,null,null,null,null,null,null,null,null,null,null,null,null,{"$f":"IF(AND(ISBLANK(B86), ISBLANK(C86)), \"X\", \"\")","v":"X"}]
[null,null,"          Change"]
[]
[23,null,null,null,null,null,null,null,null,null,null,null,null,null,null,null,{"$f":"IF(AND(ISBLANK(B89), ISBLANK(C89)), \"X\", \"\")","v":"X"}]
[null,null,"          Change"]
[]
[24,null,null,null,null,null,null,null,null,null,null,null,null,null,null,null,{"$f":"IF(AND(ISBLANK(B92), ISBLANK(C92)), \"X\", \"\")","v":"X"}]
[null,null,"          Change"]
[]
[25,null,null,null,null,null,null,null,null,null,null,null,null,null,null,null,{"$f":"IF(AND(ISBLANK(B95), ISBLANK(C95)), \"X\", \"\")","v":"X"}]
[null,null,"          Change"]
[]
[26,null,null,null,null,null,null,null,null,null,null,null,null,null,null,null,{"$f":"IF(AND(ISBLANK(B98), ISBLANK(C98)), \"X\", \"\")","v":"X"}]
[null,null,"          Change"]
[]
[27,null,null,null,null,null,null,null,null,null,null,null,null,null,null,null,{"$f":"IF(AND(ISBLANK(B101), ISBLANK(C101)), \"X\", \"\")","v":"X"}]
[null,null,"          Change"]
[]
[28,null,null,null,null,null,null,null,null,null,null,null,null,null,null,null,{"$f":"IF(AND(ISBLANK(B104), ISBLANK(C104)), \"X\", \"\")","v":"X"}]
[null,null,"          Change"]
[]
[29,null,null,null,null,null,null,null,null,null,null,null,null,null,null,null,{"$f":"IF(AND(ISBLANK(B107), ISBLANK(C107)), \"X\", \"\")","v":"X"}]
[null,null,"          Change"]
[]
[30,null,null,null,null,null,null,null,null,null,null,null,null,null,null,null,{"$f":"IF(AND(ISBLANK(B110), ISBLANK(C110)), \"X\", \"\")","v":"X"}]
[null,null,"          Change"]
[]
[31,null,null,null,null,null,null,null,null,null,null,null,null,null,null,null,{"$f":"IF(AND(ISBLANK(B113), ISBLANK(C113)), \"X\", \"\")","v":"X"}]
[null,null,"          Change"]
[]
[32,null,null,null,null,null,null,null,null,null,null,null,null,null,null,null,{"$f":"IF(AND(ISBLANK(B116), ISBLANK(C116)), \"X\", \"\")","v":"X"}]
[null,null,"          Change"]
[]
[33,null,null,null,null,null,null,null,null,null,null,null,null,null,null,null,{"$f":"IF(AND(ISBLANK(B119), ISBLANK(C119)), \"X\", \"\")","v":"X"}]
[null,null,"          Change"]
[]
[34,null,null,null,null,null,null,null,null,null,null,null,null,null,null,null,{"$f":"IF(AND(ISBLANK(B122), ISBLANK(C122)), \"X\", \"\")","v":"X"}]
[null,null,"          Change"]
[]
[35,null,null,null,null,null,null,null,null,null,null,null,null,null,null,null,{"$f":"IF(AND(ISBLANK(B125), ISBLANK(C125)), \"X\", \"\")","v":"X"}]
[null,null,"          Change"]
[]
[36,null,null,null,null,null,null,null,null,null,null,null,null,null,null,null,{"$f":"IF(AND(ISBLANK(B128), ISBLANK(C128)), \"X\", \"\")","v":"X"}]
[null,null,"          Change"]
[null,null,null,null,null,null,null,null,null,null,null,null,null,null,null,null,null,"Page Break 2"]
[37,null,null,null,null,null,null,null,null,null,null,null,null,null,null,null,{"$f":"IF(AND(ISBLANK(B131), ISBLANK(C131)), \"X\", \"\")","v":"X"}]
[null,null,"          Change"]
[]
[38,null,null,null,null,null,null,null,null,null,null,null,null,null,null,null,{"$f":"IF(AND(ISBLANK(B134), ISBLANK(C134)), \"X\", \"\")","v":"X"}]
[null,null,"          Change"]
[]
[39,null,null,null,null,null,null,null,null,null,null,null,null,null,null,null,{"$f":"IF(AND(ISBLANK(B137), ISBLANK(C137)), \"X\", \"\")","v":"X"}]
[null,null,"          Change"]
[]
[40,null,null,null,null,null,null,null,null,null,null,null,null,null,null,null,{"$f":"IF(AND(ISBLANK(B140), ISBLANK(C140)), \"X\", \"\")","v":"X"}]
[null,null,"          Change"]
[]
[41,null,null,null,null,null,null,null,null,null,null,null,null,null,null,null,{"$f":"IF(AND(ISBLANK(B143), ISBLANK(C143)), \"X\", \"\")","v":"X"}]
[null,null,"          Change"]
[]
[42,null,null,null,null,null,null,null,null,null,null,null,null,null,null,null,{"$f":"IF(AND(ISBLANK(B146), ISBLANK(C146)), \"X\", \"\")","v":"X"}]
[null,null,"          Change"]
[]
[43,null,null,null,null,null,null,null,null,null,null,null,null,null,null,null,{"$f":"IF(AND(ISBLANK(B149), ISBLANK(C149)), \"X\", \"\")","v":"X"}]
[null,null,"          Change"]
[]
[44,null,null,null,null,null,null,null,null,null,null,null,null,null,null,null,{"$f":"IF(AND(ISBLANK(B152), ISBLANK(C152)), \"X\", \"\")","v":"X"}]
[null,null,"          Change"]
[]
[45,null,null,null,null,null,null,null,null,null,null,null,null,null,null,null,{"$f":"IF(AND(ISBLANK(B155), ISBLANK(C155)), \"X\", \"\")","v":"X"}]
[null,null,"          Change"]
[]
[46,null,null,null,null,null,null,null,null,null,null,null,null,null,null,null,{"$f":"IF(AND(ISBLANK(B158), ISBLANK(C158)), \"X\", \"\")","v":"X"}]
[null,null,"          Change"]
[]
[47,null,null,null,null,null,null,null,null,null,null,null,null,null,null,null,{"$f":"IF(AND(ISBLANK(B161), ISBLANK(C161)), \"X\", \"\")","v":"X"}]
[null,null,"          Change"]
[]
[48,null,null,null,null,null,null,null,null,null,null,null,null,null,null,null,{"$f":"IF(AND(ISBLANK(B164), ISBLANK(C164)), \"X\", \"\")","v":"X"}]
[null,null,"          Change"]
[]
[49,null,null,null,null,null,null,null,null,null,null,null,null,null,null,null,{"$f":"IF(AND(ISBLANK(B167), ISBLANK(C167)), \"X\", \"\")","v":"X"}]
[null,null,"          Change"]
[]
[50,null,null,null,null,null,null,null,null,null,null,null,null,null,null,null,{"$f":"IF(AND(ISBLANK(B170), ISBLANK(C170)), \"X\", \"\")","v":"X"}]
[null,null,"          Change"]
[]
[51,null,null,null,null,null,null,null,null,null,null,null,null,null,null,null,{"$f":"IF(AND(ISBLANK(B173), ISBLANK(C173)), \"X\", \"\")","v":"X"}]
[null,null,"          Change"]
[]
[52,null,null,null,null,null,null,null,null,null,null,null,null,null,null,null,{"$f":"IF(AND(ISBLANK(B176), ISBLANK(C176)), \"X\", \"\")","v":"X"}]
[null,null,"          Change"]
[]
[53,null,null,null,null,null,null,null,null,null,null,null,null,null,null,null,{"$f":"IF(AND(ISBLANK(B179), ISBLANK(C179)), \"X\", \"\")","v":"X"}]
[null,null,"          Change"]
[null,null,null,null,null,null,null,null,null,null,null,null,null,null,null,null,null,"Page Break 3"]
[54,null,null,null,null,null,null,null,null,null,null,null,null,null,null,null,{"$f":"IF(AND(ISBLANK(B182), ISBLANK(C182)), \"X\", \"\")","v":"X"}]
[null,null,"          Change"]
[]
[55,null,null,null,null,null,null,null,null,null,null,null,null,null,null,null,{"$f":"IF(AND(ISBLANK(B185), ISBLANK(C185)), \"X\", \"\")","v":"X"}]
[null,null,"          Change"]
[]
[56,null,null,null,null,null,null,null,null,null,null,null,null,null,null,null,{"$f":"IF(AND(ISBLANK(B188), ISBLANK(C188)), \"X\", \"\")","v":"X"}]
[null,null,"          Change"]
[]
[57,null,null,null,null,null,null,null,null,null,null,null,null,null,null,null,{"$f":"IF(AND(ISBLANK(B191), ISBLANK(C191)), \"X\", \"\")","v":"X"}]
[null,null,"          Change"]
[]
[58,null,null,null,null,null,null,null,null,null,null,null,null,null,null,null,{"$f":"IF(AND(ISBLANK(B194), ISBLANK(C194)), \"X\", \"\")","v":"X"}]
[null,null,"          Change"]
[]
[59,null,null,null,null,null,null,null,null,null,null,null,null,null,null,null,{"$f":"IF(AND(ISBLANK(B197), ISBLANK(C197)), \"X\", \"\")","v":"X"}]
[null,null,"          Change"]
[]
[60,null,null,null,null,null,null,null,null,null,null,null,null,null,null,null,{"$f":"IF(AND(ISBLANK(B200), ISBLANK(C200)), \"X\", \"\")","v":"X"}]
[null,null,"          Change"]
[]
[null,null,null,null,null,null,null,null,null,null,null,null,null,null,null,null,null,"Page Break 4"]

{"sheet":"Not part of Model ==>","index":10,"n_rows":0,"n_cols":0,"rows_kept":0,"cut":false,"hidden":false,"merged":[]}

{"sheet":"Data","index":11,"n_rows":54,"n_cols":6,"rows_kept":54,"cut":false,"hidden":false,"merged":[]}
[null,"LINKED DIRECTLY TO \"Data for OEB RRWF' TAB in MASTER WORKING FILE - NO ACTION REQUIRED"]
[]
[]
[null,"Rate Base"]
[null,"   Gross Fixed Assets (average)",172968.55736377754]
[null,"   Accumulated Depreciation (average)",-85605.345818756003]
[null,"Allowance for Working Capital:"]
[null,"   Controllable Expenses",12204.748562388]
[null,"   Cost of Power",121753.00419561917]
[null,"   Working Capital Rate (%)",0.13]
[]
[null,"Utility Income"]
[null,"Operating Revenues:",null,null,null,"Deficiency"]
[null,"   Distribution Revenue at Current Rates",18756.067345849442,null,null,{"$f":"C15-C14","v":2890.4846781961387}]
[null,"   Distribution Revenue at Proposed Rates",21646.552024045581]
[null,"   Other Revenue:"]
[null,"      Specific Service Charges",757.59077348071469]
[null,"      Late Payment Charges",290.01909012971714]
[null,"      Other Distribution Revenue",158.80621861352247]
[null,"      Other Income and Deductions",128]
[]
[null,"Total Revenue Offsets",1334.4160822239544]
[]
[null,"Operating Expenses:"]
[null,"   OM+A Expenses",12018.844188661209]
[null,"   Depreciation/Amortization",3860.6110834166993]
[null,"   Property taxes",158.4445968]
[null,"   Capital taxes"]
[null,"   Other expenses",27.459776926790777]
[]
[null,"Taxes/PILs"]
[null,"Taxable Income:"]
[null,"Adjustments required to arrive at taxable income",-2868.9477143680997]
[null,"Utility Income Taxes and Rates:"]
[null,"   Income taxes (not grossed up)",200.62761357277233]
[null,"   Income taxes (grossed up)",260.88712123107325]
[null,"   Capital Taxes"]
[null,"   Federal tax (%)",0.15000000000000002]
[null,"   Provincial tax (%)",8.0979234904155331E-2]
[null,"Income Tax Credits",-37]
[null,"   "]
[null,"Capitalization/Cost of Capital"]
[null,"Capital Structure:"]
[null,"   Long-term debt Capitalization Ratio (%)",0.56000000000000005]
[null,"   Short-term debt Capitalization Ratio (%)",0.04]
[null,"   Common Equity Capitalization Ratio (%)",0.39999999999999991]
[null,"   Prefered Shares Capitalization Ratio (%)",0]
[null,null,1]
[null,null,""]
[null,"Cost of Capital"]
[null,"   Long-term debt Cost Rate (%)",4.5444200539061445E-2]
[null,"   Short-term debt Cost Rate (%)",2.1600000000000001E-2]
[null,"   Common Equity Cost Rate (%)",9.2999999999999999E-2]
[null,"   Prefered Shares Cost Rate (%)"]