{"text_format":"1","workbook":"xlsx","n_sheets":14,"sheets":["1. Info","2. Table of Contents","3. Rate Classes","4. RRR Data","5. UTRs and Sub-Transmission","6. Historical Wholesale","7. Current Wholesale","8. Forecast Wholesale","9. Adj Network to Current WS","10. Adj Conn. to Current WS","11. Adj Network to Forecast WS","12. Adj Conn. to Forecast WS","13. Final 2014 RTS Rates","hidden1"],"not_rendered":{"charts":0,"images":5,"macros":1,"external_links":2,"defined_names":12,"comments":0,"pivot_tables":0},"unopened":[],"bounds":{"document_bytes":16777216,"sheet_cells":100000,"rows_first":2000,"rows_last":500,"rows_between":2000,"halvings":0,"cell_chars":16384,"cell_head_chars":4096},"cells_cut":0,"cells_raw":0,"read":"whole","date_system":"1900"}

{"sheet":"1. Info","index":0,"n_rows":77,"n_cols":28,"rows_kept":77,"cut":false,"hidden":false,"merged":[[24,3,24,4],[20,3,20,4],[1,2,1,9],[2,2,2,9],[3,2,3,9],[4,2,4,9],[14,3,14,4],[16,3,16,4]]}
[null,null,null,null,null,null,null,null,null,null,null,null,null,null,null,null,null,null,null,null,null,null,null,null,null,null,null,"Algoma Power Inc."]
[null,null,null,null,null,null,null,null,null,null,null,null,null,null,null,null,null,null,null,null,null,null,null,null,null,null,null,"Atikokan Hydro Inc."]
[null,null,null,null,null,null,null,null,null,null,null,null,null,null,null,null,null,null,null,null,null,null,null,null,null,null,null,"Attawapiskat Power Corporation"]
[null,null,null,null,null,null,null,null,null,null,null,null,null,null,null,null,null,null,null,null,null,null,null,null,null,null,null,"Bluewater Power Distribution Corp."]
[null,null,null,null,null,null,null,null,null,null,null,null,null,null,null,null,null,null,null,null,null,null,null,null,null,null,null,"Brant County Power"]
[null,null,null,null,null,null,null,null,null,null,null,null,null,null,null,null,null,null,null,null,null,null,null,null,null,null,null,"Brantford Power Inc."]
[null,null,null,null,null,null,null,null,null,null,null,null,null,null,null,null,null,null,null,null,null,null,null,null,null,null,null,"Burlington Hydro Inc."]
[null,null,null,null,null,null,null,null,null,null,null,null,null,null,null,null,null,null,null,null,null,null,null,null,null,null,null,"Cambridge and North Dumfries Hydro"]
[null,null,null,null,null,null,null,null,null,null,null,null,null,null,null,null,null,null,null,null,null,null,null,null,null,null,null,"Canadian Niagara Power Inc. – Eastern Ontario Power/Fort Erie/Port Colborne"]
[null,null,null,null,null,null,null,null,null,null,null,null,null,null,null,null,null,null,null,null,null,null,null,null,null,null,null,"Centre Wellington Hydro Ltd."]
[null,null,null,null,null,null,null,null,null,null,null,null,null,null,null,null,null,null,null,null,null,null,null,null,null,null,null,"Chapleau Public Utilities Corporation"]
[null,null,null,null,null,null,null,null,null,null,null,null,null,null,null,null,null,null,null,null,null,null,null,null,null,null,null,"COLLUS Power Corp."]
[null,null,null,null,null,null,null,null,null,null,null,null,null,null,null,null,null,null,null,null,null,null,null,null,null,null,null,"Cooperative Hydro Embrun Inc."]
[null,null,null,null,null,null,null,null,null,null,null,null,null,null,null,null,null,null,null,null,null,null,null,null,null,null,null,"E.L.K. Energy Inc."]
[null,null,"Utility Name   ","Hearst Power Distribution Co. Ltd.",null,null,null,null,null,null,null,null,null,null,null,null,null,null,null,null,null,null,null,null,null,null,null,"Enersource Hydro Mississauga Inc."]
[null,null,null,null,null,null,null,null,null,null,null,null,null,null,null,null,null,null,null,null,null,null,null,null,null,null,null,"Entegrus Powerlines Inc."]
[null,null,"Service Territory","Hearst",null,null,null,null,null,null,null,null,null,null,null,null,null,null,null,null,null,null,null,null,null,null,null,"ENWIN Utilities Ltd."]
[null,null,null,null,null,null,null,null,null,null,null,null,null,null,null,null,null,null,null,null,null,null,null,null,null,null,null,"Erie Thames Powerlines Corp."]
[null,null,"Assigned EB Number","EB-2014-0080",null,null,null,null,null,null,null,null,null,null,null,null,null,null,null,null,null,null,null,null,null,null,null,"Espanola Regional Hydro Distribution Corporation"]
[null,null,null,null,null,null,null,null,null,null,null,null,null,null,null,null,null,null,null,null,null,null,null,null,null,null,null,"Essex Powerlines Corporation"]
[null,null,"Name and Title","Jessy Richard, General Manager",null,null,null,null,null,null,null,null,null,null,null,null,null,null,null,null,null,null,null,null,null,null,null,"Festival Hydro Inc."]
[null,null,null,null,null,null,null,null,null,null,null,null,null,null,null,null,null,null,null,null,null,null,null,null,null,null,null,"Fort Albany Power Corporation"]
[null,null,"Phone Number","705-372-2820",null,null,null,null,null,null,null,null,null,null,null,null,null,null,null,null,null,null,null,null,null,null,null,"Fort Frances Power Corporation"]
[null,null,null,null,null,null,null,null,null,null,null,null,null,null,null,null,null,null,null,null,null,null,null,null,null,null,null,"Greater Sudbury Hydro Inc."]
[null,null,"Email Address","jrichard@hearstpower.com",null,null,null,null,null,null,null,null,null,null,null,null,null,null,null,null,null,null,null,null,null,null,null,"Grimsby Power Inc."]
[null,null,null,null,null,null,null,null,null,null,null,null,null,null,null,null,null,null,null,null,null,null,null,null,null,null,null,"Guelph Hydro Electric Systems Inc."]
[null,null,"Date","March 5 2015",null,null,null,null,null,null,null,null,null,null,null,null,null,null,null,null,null,null,null,null,null,null,null,"Haldimand County Hydro Inc."]
[null,null,null,null,null,null,null,null,null,null,null,null,null,null,null,null,null,null,null,null,null,null,null,null,null,null,null,"Halton Hills Hydro Inc."]
[null,null,"Last COS Re-based Year",2010,null,null,null,null,null,null,null,null,null,null,null,null,null,null,null,null,null,null,null,null,null,null,null,"Hearst Power Distribution Co. Ltd."]
[null,null,null,null,null,null,null,null,null,null,null,null,null,null,null,null,null,null,null,null,null,null,null,null,null,null,null,"Horizon Utilities Corporation"]
[null,null,null,null,null,null,null,null,null,null,null,null,null,null,null,null,null,null,null,null,null,null,null,null,null,null,null,"Hydro 2000 Inc."]
["Note:  Drop-down lists are shaded blue; Input cells are shaded green.",null,null,null,null,null,null,null,null,null,null,null,null,null,null,null,null,null,null,null,null,null,null,null,null,null,null,"Hydro Hawkesbury Inc."]
[null,null,null,null,null,null,null,null,null,null,null,null,null,null,null,null,null,null,null,null,null,null,null,null,null,null,null,"Hydro One Brampton Networks Inc."]
[null,null,null,null,null,null,null,null,null,null,null,null,null,null,null,null,null,null,null,null,null,null,null,null,null,null,null,"Hydro One Networks Inc."]
[null,null,null,null,null,null,null,null,null,null,null,null,null,null,null,null,null,null,null,null,null,null,null,null,null,null,null,"Hydro One Remote Communities Inc."]
[null,null,null,null,null,null,null,null,null,null,null,null,null,null,null,null,null,null,null,null,null,null,null,null,null,null,null,"Hydro Ottawa Limited"]
[null,null,null,null,null,null,null,null,null,null,null,null,null,null,null,null,null,null,null,null,null,null,null,null,null,null,null,"Innisfil Hydro Dist. Systems Limited"]
[null,null,null,null,null,null,null,null,null,null,null,null,null,null,null,null,null,null,null,null,null,null,null,null,null,null,null,"Kashechewan Power Corporation"]
[null,null,null,null,null,null,null,null,null,null,null,null,null,null,null,null,null,null,null,null,null,null,null,null,null,null,null,"Kenora Hydro Electric Corporation Ltd."]
[null,null,null,null,null,null,null,null,null,null,null,null,null,null,null,null,null,null,null,null,null,null,null,null,null,null,null,"Kingston Hydro Corporation"]
[null,null,null,null,null,null,null,null,null,null,null,null,null,null,null,null,null,null,null,null,null,null,null,null,null,null,null,"Kitchener-Wilmot Hydro Inc."]
[null,null,null,null,null,null,null,null,null,null,null,null,null,null,null,null,null,null,null,null,null,null,null,null,null,null,null,"Lakefront Utilities Inc."]
[null,null,null,null,null,null,null,null,null,null,null,null,null,null,null,null,null,null,null,null,null,null,null,null,null,null,null,"Lakeland Power Distribution Ltd."]
[null,null,null,null,null,null,null,null,null,null,null,null,null,null,null,null,null,null,null,null,null,null,null,null,null,null,null,"London Hydro Inc."]
[null,null,null,null,null,null,null,null,null,null,null,null,null,null,null,null,null,null,null,null,null,null,null,null,null,null,null,"Midland Power Utility Corporation"]
[null,null,null,null,null,null,null,null,null,null,null,null,null,null,null,null,null,null,null,null,null,null,null,null,null,null,null,"Milton Hydro Distribution Inc."]
[null,null,null,null,null,null,null,null,null,null,null,null,null,null,null,null,null,null,null,null,null,null,null,null,null,null,null,"Newmarket – Tay Power Distribution Ltd."]
[null,null,null,null,null,null,null,null,null,null,null,null,null,null,null,null,null,null,null,null,null,null,null,null,null,null,null,"Niagara Peninsula Energy Inc."]
[null,null,null,null,null,null,null,null,null,null,null,null,null,null,null,null,null,null,null,null,null,null,null,null,null,null,null,"Niagara-on-the-Lake Hydro Inc."]
[null,null,null,null,null,null,null,null,null,null,null,null,null,null,null,null,null,null,null,null,null,null,null,null,null,null,null,"Norfolk Power Distribution Ltd."]
[null,null,null,null,null,null,null,null,null,null,null,null,null,null,null,null,null,null,null,null,null,null,null,null,null,null,null,"North Bay Hydro Distribution Limited"]
[null,null,null,null,null,null,null,null,null,null,null,null,null,null,null,null,null,null,null,null,null,null,null,null,null,null,null,"Northern Ontario Wires Inc."]
[null,null,null,null,null,null,null,null,null,null,null,null,null,null,null,null,null,null,null,null,null,null,null,null,null,null,null,"Oakville Hydro Distribution Inc."]
[null,null,null,null,null,null,null,null,null,null,null,null,null,null,null,null,null,null,null,null,null,null,null,null,null,null,null,"Orangeville Hydro Limited"]
[null,null,null,null,null,null,null,null,null,null,null,null,null,null,null,null,null,null,null,null,null,null,null,null,null,null,null,"Orillia Power Distribution Corp."]
[null,null,null,null,null,null,null,null,null,null,null,null,null,null,null,null,null,null,null,null,null,null,null,null,null,null,null,"Oshawa PUC Networks Inc."]
[null,null,null,null,null,null,null,null,null,null,null,null,null,null,null,null,null,null,null,null,null,null,null,null,null,null,null,"Ottawa River Power Corporation"]
[null,null,null,null,null,null,null,null,null,null,null,null,null,null,null,null,null,null,null,null,null,null,null,null,null,null,null,"Parry Sound Power Corporation"]
[null,null,null,null,null,null,null,null,null,null,null,null,null,null,null,null,null,null,null,null,null,null,null,null,null,null,null,"Peterborough Distribution Inc."]
[null,null,null,null,null,null,null,null,null,null,null,null,null,null,null,null,null,null,null,null,null,null,null,null,null,null,null,"PowerStream Inc."]
[null,null,null,null,null,null,null,null,null,null,null,null,null,null,null,null,null,null,null,null,null,null,null,null,null,null,null,"PUC Distribution Inc."]
[null,null,null,null,null,null,null,null,null,null,null,null,null,null,null,null,null,null,null,null,null,null,null,null,null,null,null,"Renfrew Hydro Inc."]
[null,null,null,null,null,null,null,null,null,null,null,null,null,null,null,null,null,null,null,null,null,null,null,null,null,null,null,"Rideau St. Lawrence Distribution Inc."]
[null,null,null,null,null,null,null,null,null,null,null,null,null,null,null,null,null,null,null,null,null,null,null,null,null,null,null,"St. Thomas Energy Inc."]
[null,null,null,null,null,null,null,null,null,null,null,null,null,null,null,null,null,null,null,null,null,null,null,null,null,null,null,"Sioux Lookout Hydro Inc."]
[null,null,null,null,null,null,null,null,null,null,null,null,null,null,null,null,null,null,null,null,null,null,null,null,null,null,null,"Thunder Bay Hydro Electricity Distribution"]
[null,null,null,null,null,null,null,null,null,null,null,null,null,null,null,null,null,null,null,null,null,null,null,null,null,null,null,"Tillsonburg Hydro Inc."]
[null,null,null,null,null,null,null,null,null,null,null,null,null,null,null,null,null,null,null,null,null,null,null,null,null,null,null,"Toronto Hydro-Electric System Limited"]
[null,null,null,null,null,null,null,null,null,null,null,null,null,null,null,null,null,null,null,null,null,null,null,null,null,null,null,"Veridian Connections Inc."]
[null,null,null,null,null,null,null,null,null,null,null,null,null,null,null,null,null,null,null,null,null,null,null,null,null,null,null,"Wasaga Distribution Inc."]
[null,null,null,null,null,null,null,null,null,null,null,null,null,null,null,null,null,null,null,null,null,null,null,null,null,null,null,"Waterloo North Hydro Inc."]
[null,null,null,null,null,null,null,null,null,null,null,null,null,null,null,null,null,null,null,null,null,null,null,null,null,null,null,"Welland Hydro Electric System Corp."]
[null,null,null,null,null,null,null,null,null,null,null,null,null,null,null,null,null,null,null,null,null,null,null,null,null,null,null,"Wellington North Power Inc."]
[null,null,null,null,null,null,null,null,null,null,null,null,null,null,null,null,null,null,null,null,null,null,null,null,null,null,null,"West Coast Huron Energy Inc."]
[null,null,null,null,null,null,null,null,null,null,null,null,null,null,null,null,null,null,null,null,null,null,null,null,null,null,null,"Westario Power Inc."]
[null,null,null,null,null,null,null,null,null,null,null,null,null,null,null,null,null,null,null,null,null,null,null,null,null,null,null,"Whitby Hydro Electric Corporation"]
[null,null,null,null,null,null,null,null,null,null,null,null,null,null,null,null,null,null,null,null,null,null,null,null,null,null,null,"Woodstock Hydro Services Inc."]

{"sheet":"2. Table of Contents","index":1,"n_rows":32,"n_cols":9,"rows_kept":32,"cut":false,"hidden":false,"merged":[]}
[]
[]
[]
[]
[]
[]
[]
[]
[]
[]
[]
[]
[]
[]
[]
[]
[]
[]
[]
[null,null,null,"1. Info",null,null,null,null,"7. Current Wholesale"]
[]
[null,null,null,"2. Table of Contents",null,null,null,null,"8. Forecast Wholesale"]
[]
[null,null,null,"3. Rate Classes",null,null,null,null,"9. Adj Network to Current WS"]
[]
[null,null,null,"4. RRR Data",null,null,null,null,"10. Adj Conn. to Current WS"]
[]
[null,null,null,"5. UTRs and Sub-Transmission",null,null,null,null,"11. Adj Network to Forecast WS"]
[]
[null,null,null,"6. Historical Wholesale",null,null,null,null,"12. Adj Conn. to Forecast WS"]
[]
[null,null,null,null,null,null,null,null,"13. Final 2013 RTS Rates"]

{"sheet":"3. Rate Classes","index":2,"n_rows":115,"n_cols":28,"rows_kept":115,"cut":false,"hidden":false,"merged":[[41,12,41,13],[42,12,42,13],[43,12,43,13],[36,12,36,13],[37,12,37,13],[38,12,38,13],[39,12,39,13],[27,12,27,13],[28,12,28,13],[29,12,29,13],[30,12,30,13],[23,12,23,13],[24,12,24,13],[25,12,25,13],[26,12,26,13],[37,9,37,10],[23,9,23,10],[24,9,24,10],[25,9,25,10],[26,9,26,10],[27,9,27,10],[28,9,28,10],[29,9,29,10],[30,9,30,10],[34,9,34,10],[35,9,35,10],[36,9,36,10],[34,12,34,13],[35,12,35,13],[31,2,31,5],[32,2,32,5],[33,2,33,5],[34,2,34,5],[35,2,35,5],[31,9,31,10],[32,9,32,10],[33,9,33,10],[31,12,31,13],[32,12,32,13],[33,12,33,13],[36,2,36,5],[23,2,23,5],[24,2,24,5],[25,2,25,5],[26,2,26,5],[27,2,27,5],[28,2,28,5],[44,9,44,10],[39,2,39,5],[40,2,40,5],[41,2,41,5],[40,9,40,10],[41,9,41,10],[42,9,42,10],[12,2,12,13],[47,2,47,5],[43,2,43,5],[44,2,44,5],[45,2,45,5],[46,2,46,5],[42,2,42,5],[37,2,37,5],[38,9,38,10],[39,9,39,10],[44,12,44,13],[38,2,38,5],[40,12,40,13],[43,9,43,10],[29,2,29,5],[30,2,30,5]]}
[]
[]
[]
[]
[]
[]
[]
[]
[]
[]
[]
[]
[null,null,"1.  Select the appropriate rate classes that appear on your most recent Board-Approved Tariff of Rates and Charges.\n2.  Enter the RTS Network and Connection Rate as it appears on the Tariff of Rates and Charges"]
[]
[]
[]
[]
[]
[]
[]
[]
[null,null,"Rate Class",null,null,null,null,"Unit",null,"RTSR-Network",null,null,"RTSR-Connection"]
[]
[null,null,"Residential",null,null,null,null,"kWh",null,6.1000000000000004E-3,null,null,4.7999999999999996E-3,null,null,null,{"$f":"IF(OR(ISBLANK(C24), ISERROR(FIND(\"Choose\", C24))=FALSE), 0, 1)","v":1},{"$f":"\"C\" & ROW(C24)","v":"C24"},{"$f":"IF(OR(C24=\"General Service Intermediate Rate Class 1,000 To 4,999 kW (formerly General Service > 50 kW Customers)\", C24=\"General Service Intermediate Rate Class 1,000 To 4,999 kW (formerly Large Use Customers)\"), \"x\", \"\")","v":""},null,null,null,null,null,null,null,null,"Choose Rate Class"]
[null,null,"General Service Less Than 50 kW",null,null,null,null,"kWh",null,5.5999999999999999E-3,null,null,4.1999999999999997E-3,null,null,null,1,"C25",{"$f":"IF(OR(C25=\"General Service Intermediate Rate Class 1,000 To 4,999 kW (formerly General Service > 50 kW Customers)\", C25=\"General Service Intermediate Rate Class 1,000 To 4,999 kW (formerly Large Use Customers)\"), \"x\", \"\")","v":""},null,null,null,null,null,null,null,null,"Residential"]
[null,null,"General Service 50 to 1,499 kW",null,null,null,null,"kW",null,2.3025000000000002,null,null,1.7024999999999999,null,null,null,1,"C26","",null,null,null,null,null,null,null,null,"Residential Regular"]
[null,null,"General Service Intermediate 1,000 To 4,999 kW",null,null,null,null,"kW",null,2.5752999999999999,null,null,2.0081000000000002,null,null,null,1,"C27","",null,null,null,null,null,null,null,null,"Residential Urban"]
[null,null,"Sentinel Lighting",null,null,null,null,"kW",null,1.7453000000000001,null,null,1.3313999999999999,null,null,null,1,"C28","",null,null,null,null,null,null,null,null,"Residential Urban Year-Round"]
[null,null,"Street Lighting",null,null,null,null,"kW",null,1.7363999999999999,null,null,1.3043,null,null,null,1,"C29","",null,null,null,null,null,null,null,null,"Residential Suburban"]
[null,null,"Choose Rate Class",null,null,null,null,null,null,null,null,null,null,null,null,null,0,"C30","",null,null,null,null,null,null,null,null,"Residential Suburban Seasonal"]
[null,null,"Choose Rate Class",null,null,null,null,null,null,null,null,null,null,null,null,null,0,"C31","",null,null,null,null,null,null,null,null,"Residential Suburban Year Round"]
[null,null,"Choose Rate Class",null,null,null,null,null,null,null,null,null,null,null,null,null,0,"C32","",null,null,null,null,null,null,null,null,"Residential - Time of Use"]
[null,null,"Choose Rate Class",null,null,null,null,null,null,null,null,null,null,null,null,null,0,"C33","",null,null,null,null,null,null,null,null,"Residential - Hensall"]
[null,null,"Choose Rate Class",null,null,null,null,null,null,null,null,null,null,null,null,null,0,"C34","",null,null,null,null,null,null,null,null,"Residential – High Density [R1]"]
[null,null,"Choose Rate Class",null,null,null,null,null,null,null,null,null,null,null,null,null,0,"C35","",null,null,null,null,null,null,null,null,"Residential – Normal Density [R2]"]
[null,null,"Choose Rate Class",null,null,null,null,null,null,null,null,null,null,null,null,null,0,"C36","",null,null,null,null,null,null,null,null,"Seasonal Residential – High Density [R3]"]
[null,null,"Choose Rate Class",null,null,null,null,null,null,null,null,null,null,null,null,null,0,"C37","",null,null,null,null,null,null,null,null,"Seasonal Residential – Normal Density [R4]"]
[null,null,"Choose Rate Class",null,null,null,null,null,null,null,null,null,null,null,null,null,0,"C38","",null,null,null,null,null,null,null,null,"Residential – Urban [UR]"]
[null,null,"Choose Rate Class",null,null,null,null,null,null,null,null,null,null,null,null,null,0,"C39",""]
[null,null,"Choose Rate Class",null,null,null,null,null,null,null,null,null,null,null,null,null,0,"C40","",null,null,null,null,null,null,null,null,"General Service Less Than 50 kW"]
[null,null,"Choose Rate Class",null,null,null,null,null,null,null,null,null,null,null,null,null,0,"C41","",null,null,null,null,null,null,null,null,"General Service Less Than 50 kW – Single Phase energy-billed [G1]"]
[null,null,"Choose Rate Class",null,null,null,null,null,null,null,null,null,null,null,null,null,0,"C42","",null,null,null,null,null,null,null,null,"General Service Less Than 50 kW – Three Phase energy-billed [G3]"]
[null,null,"Choose Rate Class",null,null,null,null,null,null,null,null,null,null,null,null,null,0,"C43","",null,null,null,null,null,null,null,null,"General Service Less Than 50 kW – Transmission Class energy-billed [T]"]
[null,null,"Choose Rate Class",null,null,null,null,null,null,null,null,null,null,null,null,null,0,"C44","",null,null,null,null,null,null,null,null,"General Service Less Than 50 kW – Urban energy-billed [UG]"]
[null,null,"Choose Rate Class",null,null,null,null,null,null,null,null,null,null,null,null,null,0,"C45","",null,null,null,null,null,null,null,null,"Westport Sewage Treatment Plant"]
[null,null,null,null,null,null,null,null,null,null,null,null,null,null,null,null,null,null,{"$f":"COUNTIF(S24:S45, \"x\")","v":0},null,null,null,null,null,null,null,null,"Small Commercial and USL - per meter"]
[null,null,null,null,null,null,null,null,null,null,null,null,null,null,null,null,null,null,null,null,null,null,null,null,null,null,null,"Small Commercial and USL - per connection"]
[null,null,null,null,null,null,null,null,null,null,null,null,null,null,null,null,null,null,null,null,null,null,null,null,null,null,null,"Farms – Single Phase energy-billed [F1]"]
[]
[null,null,null,null,null,null,null,null,null,null,null,null,null,null,null,null,null,null,null,null,null,null,null,null,null,null,null,"General Service 50 to 499 kW"]
[null,null,null,null,null,null,null,null,null,null,null,null,null,null,null,null,null,null,null,null,null,null,null,null,null,null,null,"General Service 50 to 699 kW"]
[null,null,null,null,null,null,null,null,null,null,null,null,null,null,null,null,null,null,null,null,null,null,null,null,null,null,null,"General Service 50 to 999 kW"]
[null,null,null,null,null,null,null,null,null,null,null,null,null,null,null,null,null,null,null,null,null,null,null,null,null,null,null,"General Service 50 to 999 kW - Interval Metered"]
[null,null,null,null,null,null,null,null,null,null,null,null,null,null,null,null,null,null,null,null,null,null,null,null,null,null,null,"General Service 50 to 1,000 kW"]
[null,null,null,null,null,null,null,null,null,null,null,null,null,null,null,null,null,null,null,null,null,null,null,null,null,null,null,"General Service 50 to 1,000 kW - Interval Meters"]
[null,null,null,null,null,null,null,null,null,null,null,null,null,null,null,null,null,null,null,null,null,null,null,null,null,null,null,"General Service 50 to 1,000 kW - Non Interval Meters"]
[null,null,null,null,null,null,null,null,null,null,null,null,null,null,null,null,null,null,null,null,null,null,null,null,null,null,null,"General Service 50 to 1,499 kW"]
[null,null,null,null,null,null,null,null,null,null,null,null,null,null,null,null,null,null,null,null,null,null,null,null,null,null,null,"General Service 50 to 1,499 kW - Interval Metered"]
[null,null,null,null,null,null,null,null,null,null,null,null,null,null,null,null,null,null,null,null,null,null,null,null,null,null,null,"General Service  50 to 2,499 kW"]
[null,null,null,null,null,null,null,null,null,null,null,null,null,null,null,null,null,null,null,null,null,null,null,null,null,null,null,"General Service 50 to 2,999 kW"]
[null,null,null,null,null,null,null,null,null,null,null,null,null,null,null,null,null,null,null,null,null,null,null,null,null,null,null,"General Service 50 to 2,999 kW - Time of Use"]
[null,null,null,null,null,null,null,null,null,null,null,null,null,null,null,null,null,null,null,null,null,null,null,null,null,null,null,"General Service 50 to 4,999 kW"]
[null,null,null,null,null,null,null,null,null,null,null,null,null,null,null,null,null,null,null,null,null,null,null,null,null,null,null,"General Service 50 to 4,999 kW – Interval Metered"]
[null,null,null,null,null,null,null,null,null,null,null,null,null,null,null,null,null,null,null,null,null,null,null,null,null,null,null,"General Service 50 to 4,999 kW - Time of Use"]
[null,null,null,null,null,null,null,null,null,null,null,null,null,null,null,null,null,null,null,null,null,null,null,null,null,null,null,"General Service 50 to 4,999 kW (CoGeneration)"]
[null,null,null,null,null,null,null,null,null,null,null,null,null,null,null,null,null,null,null,null,null,null,null,null,null,null,null,"General Service 50 to 4,999 kW (formerly Time of Use)"]
[null,null,null,null,null,null,null,null,null,null,null,null,null,null,null,null,null,null,null,null,null,null,null,null,null,null,null,"General Service 500 to 4,999 kW"]
[null,null,null,null,null,null,null,null,null,null,null,null,null,null,null,null,null,null,null,null,null,null,null,null,null,null,null,"General Service 700 to 4,999 kW"]
[null,null,null,null,null,null,null,null,null,null,null,null,null,null,null,null,null,null,null,null,null,null,null,null,null,null,null,"General Service 1,000 to 2,999 kW"]
[null,null,null,null,null,null,null,null,null,null,null,null,null,null,null,null,null,null,null,null,null,null,null,null,null,null,null,"General Service 1,000 to 4,999 kW"]
[null,null,null,null,null,null,null,null,null,null,null,null,null,null,null,null,null,null,null,null,null,null,null,null,null,null,null,"General Service 1,000 to 4,999 kW - Interval Meters"]
[null,null,null,null,null,null,null,null,null,null,null,null,null,null,null,null,null,null,null,null,null,null,null,null,null,null,null,"General Service 1,000 To 4,999 kW (co-generation)"]
[null,null,null,null,null,null,null,null,null,null,null,null,null,null,null,null,null,null,null,null,null,null,null,null,null,null,null,"General Service Greater Than 1,000 kW"]
[null,null,null,null,null,null,null,null,null,null,null,null,null,null,null,null,null,null,null,null,null,null,null,null,null,null,null,"General Service Intermediate Rate Class 1,000 To 4,999 kW (formerly Large Use Customers)"]
[null,null,null,null,null,null,null,null,null,null,null,null,null,null,null,null,null,null,null,null,null,null,null,null,null,null,null,"General Service Intermediate Rate Class 1,000 To 4,999 kW (formerly General Service > 50 kW Customers)"]
[null,null,null,null,null,null,null,null,null,null,null,null,null,null,null,null,null,null,null,null,null,null,null,null,null,null,null,"General Service 1,500 to 4,999 kW"]
[null,null,null,null,null,null,null,null,null,null,null,null,null,null,null,null,null,null,null,null,null,null,null,null,null,null,null,"General Service Equal To Or Greater Than 1,500 kW"]
[null,null,null,null,null,null,null,null,null,null,null,null,null,null,null,null,null,null,null,null,null,null,null,null,null,null,null,"General Service Equal To Or Greater Than 1,500 kW - Interval Metered"]
[null,null,null,null,null,null,null,null,null,null,null,null,null,null,null,null,null,null,null,null,null,null,null,null,null,null,null,"General Service Intermediate 1,000 To 4,999 kW"]
[null,null,null,null,null,null,null,null,null,null,null,null,null,null,null,null,null,null,null,null,null,null,null,null,null,null,null,"General Service 2,500 to 4,999 kW"]
[null,null,null,null,null,null,null,null,null,null,null,null,null,null,null,null,null,null,null,null,null,null,null,null,null,null,null,"General Service 3,000 to 4,999 kW"]
[null,null,null,null,null,null,null,null,null,null,null,null,null,null,null,null,null,null,null,null,null,null,null,null,null,null,null,"General Service 3,000 to 4,999 kW - Interval Metered"]
[null,null,null,null,null,null,null,null,null,null,null,null,null,null,null,null,null,null,null,null,null,null,null,null,null,null,null,"General Service 3,000 to 4,999 kW - Intermediate Use"]
[null,null,null,null,null,null,null,null,null,null,null,null,null,null,null,null,null,null,null,null,null,null,null,null,null,null,null,"General Service 3,000 to 4,999 kW - Time of Use"]
[null,null,null,null,null,null,null,null,null,null,null,null,null,null,null,null,null,null,null,null,null,null,null,null,null,null,null,"Intermediate With Self Generation"]
[null,null,null,null,null,null,null,null,null,null,null,null,null,null,null,null,null,null,null,null,null,null,null,null,null,null,null,"General Service - Commercial"]
[null,null,null,null,null,null,null,null,null,null,null,null,null,null,null,null,null,null,null,null,null,null,null,null,null,null,null,"General Service - Institutional"]
[null,null,null,null,null,null,null,null,null,null,null,null,null,null,null,null,null,null,null,null,null,null,null,null,null,null,null,"Farms – Three Phase energy-billed [F3]"]
[]
[null,null,null,null,null,null,null,null,null,null,null,null,null,null,null,null,null,null,null,null,null,null,null,null,null,null,null,"Large Use"]
[null,null,null,null,null,null,null,null,null,null,null,null,null,null,null,null,null,null,null,null,null,null,null,null,null,null,null,"Large Use - Regular"]
[null,null,null,null,null,null,null,null,null,null,null,null,null,null,null,null,null,null,null,null,null,null,null,null,null,null,null,"Large Use > 5000 kW"]
[null,null,null,null,null,null,null,null,null,null,null,null,null,null,null,null,null,null,null,null,null,null,null,null,null,null,null,"Large Use - 3TS"]
[null,null,null,null,null,null,null,null,null,null,null,null,null,null,null,null,null,null,null,null,null,null,null,null,null,null,null,"Large Use - Ford Annex"]
[]
[null,null,null,null,null,null,null,null,null,null,null,null,null,null,null,null,null,null,null,null,null,null,null,null,null,null,null,"Unmetered Scattered Load"]
[]
[null,null,null,null,null,null,null,null,null,null,null,null,null,null,null,null,null,null,null,null,null,null,null,null,null,null,null,"Sentinel Lighting"]
[]
[null,null,null,null,null,null,null,null,null,null,null,null,null,null,null,null,null,null,null,null,null,null,null,null,null,null,null,"Street Lighting"]
[]
[null,null,null,null,null,null,null,null,null,null,null,null,null,null,null,null,null,null,null,null,null,null,null,null,null,null,null,"Embedded Distributor"]
[null,null,null,null,null,null,null,null,null,null,null,null,null,null,null,null,null,null,null,null,null,null,null,null,null,null,null,"Low Voltage Wheeling Charge Rate"]
[]
[null,null,null,null,null,null,null,null,null,null,null,null,null,null,null,null,null,null,null,null,null,null,null,null,null,null,null,"Stand-By"]
[null,null,null,null,null,null,null,null,null,null,null,null,null,null,null,null,null,null,null,null,null,null,null,null,null,null,null,"Standby Power"]
[null,null,null,null,null,null,null,null,null,null,null,null,null,null,null,null,null,null,null,null,null,null,null,null,null,null,null,"Standby Power – INTERIM APPROVAL"]
[null,null,null,null,null,null,null,null,null,null,null,null,null,null,null,null,null,null,null,null,null,null,null,null,null,null,null,"Standby Power - APPROVED ON AN INTERIM BASIS"]
[null,null,null,null,null,null,null,null,null,null,null,null,null,null,null,null,null,null,null,null,null,null,null,null,null,null,null,"Standby - General Service 50 - 1,000 kW"]
[null,null,null,null,null,null,null,null,null,null,null,null,null,null,null,null,null,null,null,null,null,null,null,null,null,null,null,"Standby Power General Service 50 to 1,499 kW"]
[null,null,null,null,null,null,null,null,null,null,null,null,null,null,null,null,null,null,null,null,null,null,null,null,null,null,null,"Standby - General Service 1,000 - 5,000 kW"]
[null,null,null,null,null,null,null,null,null,null,null,null,null,null,null,null,null,null,null,null,null,null,null,null,null,null,null,"Standby Power General Service 1,500 to 4,999 kW"]
[null,null,null,null,null,null,null,null,null,null,null,null,null,null,null,null,null,null,null,null,null,null,null,null,null,null,null,"Standby - Large Use"]
[null,null,null,null,null,null,null,null,null,null,null,null,null,null,null,null,null,null,null,null,null,null,null,null,null,null,null,"Standby Power General Service Large Use"]
[null,null,null,null,null,null,null,null,null,null,null,null,null,null,null,null,null,null,null,null,null,null,null,null,null,null,null,"Standby Distribution Service"]

{"sheet":"4. RRR Data","index":3,"n_rows":48,"n_cols":13,"rows_kept":48,"cut":false,"hidden":false,"merged":[[37,7,37,8],[26,7,26,8],[27,7,27,8],[28,7,28,8],[29,7,29,8],[30,7,30,8],[31,7,31,8],[44,7,44,8],[45,7,45,8],[46,7,46,8],[47,7,47,8],[26,9,26,10],[27,9,27,10],[28,9,28,10],[29,9,29,10],[30,9,30,10],[31,9,31,10],[38,7,38,8],[39,7,39,8],[40,7,40,8],[41,7,41,8],[42,7,42,8],[43,7,43,8],[40,9,40,10],[41,9,41,10],[46,9,46,10],[47,9,47,10],[42,9,42,10],[43,9,43,10],[44,9,44,10],[45,9,45,10],[20,9,20,10],[23,9,23,10],[12,1,12,11],[38,9,38,10],[39,9,39,10],[32,9,32,10],[33,9,33,10],[34,9,34,10],[35,9,35,10],[36,9,36,10],[37,9,37,10],[32,7,32,8],[33,7,33,8],[34,7,34,8],[35,7,35,8],[36,7,36,8]]}
[]
[]
[]
[]
[]
[]
[]
[]
[]
[]
[]
[]
[null,"In the green shaded cells, enter the most recent reported RRR billing determinants.  Please ensure that billing determinants are non-loss adjusted."]
[]
[]
[]
[]
[]
[]
[]
[]
[]
[]
[null,"Rate Class",null,"Unit",null,"Non-Loss Adjusted Metered kWh","Non-Loss Adjusted Metered kW","Applicable Loss Factor",null,"Load Factor",null,"Loss Adjusted Billed kWh","Billed kW"]
[]
[]
[null,{"$f":"IF('3. Rate Classes'!Q24=1,'3. Rate Classes'!C24, 0)","v":"Residential"},null,{"$f":"IF(OR(VLOOKUP($B27, '3. Rate Classes'!$C$24:$H$45,6,0)=0, ISERROR(VLOOKUP($B27, '3. Rate Classes'!$C$24:$H$45,6,0))), \"\", VLOOKUP($B27, '3. Rate Classes'!$C$24:$H$45,6,0))","v":"kWh"},null,24798980.530251931,null,1.046,null,{"$f":"IF(ISERROR(F27/(G27*30.4*24)), \"\", IF(D27=\"kW\", F27/(G27*30.4*24), \"\"))","v":""},null,{"$f":"IF(OR(H27=0, OR(ISBLANK(H27), TRIM(H27)=\"\")), F27, F27*H27)","v":25939733.634643521},{"$f":"IF(OR(H27=0, OR(ISBLANK(H27), TRIM(H27)=\"\")), G27, G27)","v":0}]
[null,{"$f":"IF('3. Rate Classes'!Q25=1,'3. Rate Classes'!C25, 0)","v":"General Service Less Than 50 kW"},null,{"$f":"IF(OR(VLOOKUP($B28, '3. Rate Classes'!$C$24:$H$45,6,0)=0, ISERROR(VLOOKUP($B28, '3. Rate Classes'!$C$24:$H$45,6,0))), \"\", VLOOKUP($B28, '3. Rate Classes'!$C$24:$H$45,6,0))","v":"kWh"},null,11134727.047617922,null,1.046,null,"",null,{"$f":"IF(OR(H28=0, OR(ISBLANK(H28), TRIM(H28)=\"\")), F28, F28*H28)","v":11646924.491808346},{"$f":"IF(OR(H28=0, OR(ISBLANK(H28), TRIM(H28)=\"\")), G28, G28)","v":0}]
[null,{"$f":"IF('3. Rate Classes'!Q26=1,'3. Rate Classes'!C26, 0)","v":"General Service 50 to 1,499 kW"},null,{"$f":"IF(OR(VLOOKUP($B29, '3. Rate Classes'!$C$24:$H$45,6,0)=0, ISERROR(VLOOKUP($B29, '3. Rate Classes'!$C$24:$H$45,6,0))), \"\", VLOOKUP($B29, '3. Rate Classes'!$C$24:$H$45,6,0))","v":"kW"},null,22758006.239060923,65159.5,null,null,0.47870905642110184,null,22758006.239060923,65159.5]
[null,{"$f":"IF('3. Rate Classes'!Q27=1,'3. Rate Classes'!C27, 0)","v":"General Service Intermediate 1,000 To 4,999 kW"},null,{"$f":"IF(OR(VLOOKUP($B30, '3. Rate Classes'!$C$24:$H$45,6,0)=0, ISERROR(VLOOKUP($B30, '3. Rate Classes'!$C$24:$H$45,6,0))), \"\", VLOOKUP($B30, '3. Rate Classes'!$C$24:$H$45,6,0))","v":"kW"},null,21805339,61715.849999999991,null,null,0.48426301627937751,null,21805339,61715.849999999991]
[null,{"$f":"IF('3. Rate Classes'!Q28=1,'3. Rate Classes'!C28, 0)","v":"Sentinel Lighting"},null,{"$f":"IF(OR(VLOOKUP($B31, '3. Rate Classes'!$C$24:$H$45,6,0)=0, ISERROR(VLOOKUP($B31, '3. Rate Classes'!$C$24:$H$45,6,0))), \"\", VLOOKUP($B31, '3. Rate Classes'!$C$24:$H$45,6,0))","v":"kW"},null,21276,72,null,null,0.40501644736842107,null,21276,72]
[null,{"$f":"IF('3. Rate Classes'!Q29=1,'3. Rate Classes'!C29, 0)","v":"Street Lighting"},null,{"$f":"IF(OR(VLOOKUP($B32, '3. Rate Classes'!$C$24:$H$45,6,0)=0, ISERROR(VLOOKUP($B32, '3. Rate Classes'!$C$24:$H$45,6,0))), \"\", VLOOKUP($B32, '3. Rate Classes'!$C$24:$H$45,6,0))","v":"kW"},null,1026377,11288,null,null,0.1246249753270046,null,1026377,11288]
[null,{"$f":"IF('3. Rate Classes'!Q30=1,'3. Rate Classes'!C30, 0)","v":0},null,{"$f":"IF(OR(VLOOKUP($B33, '3. Rate Classes'!$C$24:$H$45,6,0)=0, ISERROR(VLOOKUP($B33, '3. Rate Classes'!$C$24:$H$45,6,0))), \"\", VLOOKUP($B33, '3. Rate Classes'!$C$24:$H$45,6,0))","v":{"$error":"#N/A"}},null,null,null,null,null,{"$f":"IF(ISERROR(F33/(G33*30.4*24)), \"\", IF(D33=\"kW\", F33/(G33*30.4*24), \"\"))","v":""},null,0,0]
[null,{"$f":"IF('3. Rate Classes'!Q31=1,'3. Rate Classes'!C31, 0)","v":0},null,{"$f":"IF(OR(VLOOKUP($B34, '3. Rate Classes'!$C$24:$H$45,6,0)=0, ISERROR(VLOOKUP($B34, '3. Rate Classes'!$C$24:$H$45,6,0))), \"\", VLOOKUP($B34, '3. Rate Classes'!$C$24:$H$45,6,0))","v":{"$error":"#N/A"}},null,null,null,null,null,"",null,0,0]
[null,{"$f":"IF('3. Rate Classes'!Q32=1,'3. Rate Classes'!C32, 0)","v":0},null,{"$f":"IF(OR(VLOOKUP($B35, '3. Rate Classes'!$C$24:$H$45,6,0)=0, ISERROR(VLOOKUP($B35, '3. Rate Classes'!$C$24:$H$45,6,0))), \"\", VLOOKUP($B35, '3. Rate Classes'!$C$24:$H$45,6,0))","v":{"$error":"#N/A"}},null,null,null,null,null,"",null,0,0]
[null,{"$f":"IF('3. Rate Classes'!Q33=1,'3. Rate Classes'!C33, 0)","v":0},null,{"$f":"IF(OR(VLOOKUP($B36, '3. Rate Classes'!$C$24:$H$45,6,0)=0, ISERROR(VLOOKUP($B36, '3. Rate Classes'!$C$24:$H$45,6,0))), \"\", VLOOKUP($B36, '3. Rate Classes'!$C$24:$H$45,6,0))","v":{"$error":"#N/A"}},null,null,null,null,null,"",null,0,0]
[null,{"$f":"IF('3. Rate Classes'!Q34=1,'3. Rate Classes'!C34, 0)","v":0},null,{"$f":"IF(OR(VLOOKUP($B37, '3. Rate Classes'!$C$24:$H$45,6,0)=0, ISERROR(VLOOKUP($B37, '3. Rate Classes'!$C$24:$H$45,6,0))), \"\", VLOOKUP($B37, '3. Rate Classes'!$C$24:$H$45,6,0))","v":{"$error":"#N/A"}},null,null,null,null,null,"",null,0,0]
[null,{"$f":"IF('3. Rate Classes'!Q35=1,'3. Rate Classes'!C35, 0)","v":0},null,{"$f":"IF(OR(VLOOKUP($B38, '3. Rate Classes'!$C$24:$H$45,6,0)=0, ISERROR(VLOOKUP($B38, '3. Rate Classes'!$C$24:$H$45,6,0))), \"\", VLOOKUP($B38, '3. Rate Classes'!$C$24:$H$45,6,0))","v":{"$error":"#N/A"}},null,null,null,null,null,"",null,0,0]
[null,{"$f":"IF('3. Rate Classes'!Q36=1,'3. Rate Classes'!C36, 0)","v":0},null,{"$f":"IF(OR(VLOOKUP($B39, '3. Rate Classes'!$C$24:$H$45,6,0)=0, ISERROR(VLOOKUP($B39, '3. Rate Classes'!$C$24:$H$45,6,0))), \"\", VLOOKUP($B39, '3. Rate Classes'!$C$24:$H$45,6,0))","v":{"$error":"#N/A"}},null,null,null,null,null,"",null,0,0]
[null,{"$f":"IF('3. Rate Classes'!Q37=1,'3. Rate Classes'!C37, 0)","v":0},null,{"$f":"IF(OR(VLOOKUP($B40, '3. Rate Classes'!$C$24:$H$45,6,0)=0, ISERROR(VLOOKUP($B40, '3. Rate Classes'!$C$24:$H$45,6,0))), \"\", VLOOKUP($B40, '3. Rate Classes'!$C$24:$H$45,6,0))","v":{"$error":"#N/A"}},null,null,null,null,null,"",null,0,0]
[null,{"$f":"IF('3. Rate Classes'!Q38=1,'3. Rate Classes'!C38, 0)","v":0},null,{"$f":"IF(OR(VLOOKUP($B41, '3. Rate Classes'!$C$24:$H$45,6,0)=0, ISERROR(VLOOKUP($B41, '3. Rate Classes'!$C$24:$H$45,6,0))), \"\", VLOOKUP($B41, '3. Rate Classes'!$C$24:$H$45,6,0))","v":{"$error":"#N/A"}},null,null,null,null,null,"",null,0,0]
[null,{"$f":"IF('3. Rate Classes'!Q39=1,'3. Rate Classes'!C39, 0)","v":0},null,{"$f":"IF(OR(VLOOKUP($B42, '3. Rate Classes'!$C$24:$H$45,6,0)=0, ISERROR(VLOOKUP($B42, '3. Rate Classes'!$C$24:$H$45,6,0))), \"\", VLOOKUP($B42, '3. Rate Classes'!$C$24:$H$45,6,0))","v":{"$error":"#N/A"}},null,null,null,null,null,"",null,0,0]
[null,{"$f":"IF('3. Rate Classes'!Q40=1,'3. Rate Classes'!C40, 0)","v":0},null,{"$f":"IF(OR(VLOOKUP($B43, '3. Rate Classes'!$C$24:$H$45,6,0)=0, ISERROR(VLOOKUP($B43, '3. Rate Classes'!$C$24:$H$45,6,0))), \"\", VLOOKUP($B43, '3. Rate Classes'!$C$24:$H$45,6,0))","v":{"$error":"#N/A"}},null,null,null,null,null,"",null,0,0]
[null,{"$f":"IF('3. Rate Classes'!Q41=1,'3. Rate Classes'!C41, 0)","v":0},null,{"$f":"IF(OR(VLOOKUP($B44, '3. Rate Classes'!$C$24:$H$45,6,0)=0, ISERROR(VLOOKUP($B44, '3. Rate Classes'!$C$24:$H$45,6,0))), \"\", VLOOKUP($B44, '3. Rate Classes'!$C$24:$H$45,6,0))","v":{"$error":"#N/A"}},null,null,null,null,null,"",null,0,0]
[null,{"$f":"IF('3. Rate Classes'!Q42=1,'3. Rate Classes'!C42, 0)","v":0},null,{"$f":"IF(OR(VLOOKUP($B45, '3. Rate Classes'!$C$24:$H$45,6,0)=0, ISERROR(VLOOKUP($B45, '3. Rate Classes'!$C$24:$H$45,6,0))), \"\", VLOOKUP($B45, '3. Rate Classes'!$C$24:$H$45,6,0))","v":{"$error":"#N/A"}},null,null,null,null,null,"",null,0,0]
[null,{"$f":"IF('3. Rate Classes'!Q43=1,'3. Rate Classes'!C43, 0)","v":0},null,{"$f":"IF(OR(VLOOKUP($B46, '3. Rate Classes'!$C$24:$H$45,6,0)=0, ISERROR(VLOOKUP($B46, '3. Rate Classes'!$C$24:$H$45,6,0))), \"\", VLOOKUP($B46, '3. Rate Classes'!$C$24:$H$45,6,0))","v":{"$error":"#N/A"}},null,null,null,null,null,"",null,0,0]
[null,{"$f":"IF('3. Rate Classes'!Q44=1,'3. Rate Classes'!C44, 0)","v":0},null,{"$f":"IF(OR(VLOOKUP($B47, '3. Rate Classes'!$C$24:$H$45,6,0)=0, ISERROR(VLOOKUP($B47, '3. Rate Classes'!$C$24:$H$45,6,0))), \"\", VLOOKUP($B47, '3. Rate Classes'!$C$24:$H$45,6,0))","v":{"$error":"#N/A"}},null,null,null,null,null,"",null,0,0]
[null,{"$f":"IF('3. Rate Classes'!Q45=1,'3. Rate Classes'!C45, 0)","v":0},null,{"$f":"IF(OR(VLOOKUP($B48, '3. Rate Classes'!$C$24:$H$45,6,0)=0, ISERROR(VLOOKUP($B48, '3. Rate Classes'!$C$24:$H$45,6,0))), \"\", VLOOKUP($B48, '3. Rate Classes'!$C$24:$H$45,6,0))","v":{"$error":"#N/A"}},null,null,null,null,null,"",null,0,0]

{"sheet":"5. UTRs and Sub-Transmission","index":4,"n_rows":95,"n_cols":9,"rows_kept":95,"cut":false,"hidden":false,"merged":[]}
[]
[]
[]
[]
[]
[]
[]
[]
[]
[]
[]
[]
[]
[]
[]
[]
[]
[null,"Uniform Transmission Rates","Unit",null,"Effective January 1, 2013",null,"Effective January 1, 2014",null,"Effective January 1, 2015"]
[]
[null,"Rate Description",null,null,"Rate",null,"Rate",null,"Rate"]
[]
[null,"Network Service Rate","kW",null,3.63,null,3.82,null,3.82]
[]
[null,"Line Connection Service Rate","kW",null,0.75,null,0.82,null,0.82]
[]
[null,"Transformation Connection Service Rate","kW",null,1.85,null,1.98,null,1.98]
[]
[]
[null,"Hydro One Sub-Transmission Rates","Unit",null,"Effective January 1, 2013",null,"Effective January 1, 2014",null,"Effective January 1, 2015"]
[]
[]
[]
[null,"Rate Description",null,null,"Rate",null,"Rate",null,"Rate"]
[]
[null,"Network Service Rate","kW",null,3.18,null,3.23,null,3.18]
[]
[null,"Line Connection Service Rate","kW",null,0.7,null,0.65,null,0.7]
[]
[null,"Transformation Connection Service Rate","kW",null,1.63,null,1.62,null,1.63]
[]
[null,"Both Line and Transformation Connection Service Rate","kW",null,{"$f":"E39+E37","v":2.33},null,{"$f":"G39+G37","v":2.27},null,{"$f":"I39+I37","v":2.33}]
[]
[]
[null,"If needed , add extra host here (I)","Unit",null,"Effective January 1, 2013",null,"Effective January 1, 2014",null,"Effective January 1, 2015"]
[]
[]
[]
[null,"Rate Description",null,null,"Rate",null,"Rate",null,"Rate"]
[]
[null,"Network Service Rate","kW"]
[]
[null,"Line Connection Service Rate","kW"]
[]
[null,"Transformation Connection Service Rate","kW"]
[]
[null,"Both Line and Transformation Connection Service Rate","kW",null,{"$f":"E54+E52","v":0},null,{"$f":"G54+G52","v":0},null,{"$f":"I54+I52","v":0}]
[]
[]
[null,"If needed , add extra host here (II)","Unit",null,"Effective January 1, 2013",null,"Effective January 1, 2014",null,"Effective January 1, 2015"]
[]
[]
[]
[null,"Rate Description",null,null,"Rate",null,"Rate",null,"Rate"]
[]
[null,"Network Service Rate","kW"]
[]
[null,"Line Connection Service Rate","kW"]
[]
[null,"Transformation Connection Service Rate","kW"]
[]
[null,"Both Line and Transformation Connection Service Rate","kW",null,{"$f":"E69+E67","v":0},null,{"$f":"G69+G67","v":0},null,{"$f":"I69+I67","v":0}]
[]
[]
[]
[null,"Hydro One Sub-Transmission Rate Rider 9A","Unit",null,"Effective January 1, 2013",null,"Effective January 1, 2014",null,"Effective January 1, 2015"]
[]
[null,"Rate Description",null,null,"Rate",null,"Rate",null,"Rate"]
[]
[null,"RSVA Transmission network – 4714 – which affects 1584","kW",null,0,null,0.14649999999999999,null,0.14649999999999999]
[]
[null,"RSVA Transmission connection – 4716 – which affects 1586","kW",null,0,null,6.6699999999999995E-2,null,6.6699999999999995E-2]
[]
[null,"RSVA LV – 4750 – which affects 1550","kW",null,0,null,4.7500000000000001E-2,null,4.7500000000000001E-2]
[]
[null,"RARA 1 – 2252 – which affects 1590 ","kW",null,0,null,4.19E-2,null,4.19E-2]
[]
[null,"RARA 1 – 2252 – which affects 1590 (2008)","kW",null,0,null,-2.7E-2,null,-2.7E-2]
[]
[null,"RARA 1 – 2252 – which affects 1590 (2009)","kW",null,0,null,-5.9999999999999995E-4,null,-5.9999999999999995E-4]
[]
[null,"Hydro One Sub-Transmission Rate Rider 9A","kW",null,{"$f":"SUM(E79:E89)","v":0},null,{"$f":"SUM(G79:G89)","v":0.27499999999999997},null,{"$f":"SUM(I79:I89)","v":0.27499999999999997}]
[]
[]
[null,null,null,null,"Historical 2013",null,"Current 2014",null,"Forecast 2015"]
[null,"Low Voltage Switchgear Credit (if applicable, enter as a negative value)","$"]

{"sheet":"6. Historical Wholesale","index":5,"n_rows":117,"n_cols":16,"rows_kept":117,"cut":false,"hidden":false,"merged":[[96,7,96,9],[96,11,96,13],[20,3,20,5],[20,7,20,9],[20,11,20,13],[96,3,96,5],[38,3,38,5],[38,7,38,9],[38,11,38,13],[95,3,95,5],[57,3,57,5],[57,7,57,9],[57,11,57,13],[76,3,76,5],[76,7,76,9],[76,11,76,13],[95,7,95,9],[95,11,95,13]]}
[]
[]
[]
[]
[]
[]
[]
[]
[]
[]
[]
[]
[]
[]
[]
[]
[]
[]
[]
[]
[null,"IESO",null,"Network",null,null,null,"Line Connection",null,null,null,"Transformation Connection",null,null,null,"Total Line"]
[null,"Month",null,"Units Billed","Rate","Amount",null,"Units Billed","Rate","Amount",null,"Units Billed","Rate","Amount",null,"Amount"]
[null,"2013 billed"]
[null,"January",null,{"$f":"F24/E24","v":3993.0000000000005},3.57,14255.01,null,{"$f":"J24/I24","v":4698},0.8,3758.4,null,{"$f":"N24/M24","v":4698},1.86,8738.2800000000007,null,{"$f":"J24+N24","v":12496.68}]
[null,"February",null,{"$f":"F25/E25","v":4245},3.63,15409.35,null,{"$f":"J25/I25","v":4994},0.75,3745.5,null,{"$f":"N25/M25","v":4994},1.85,9238.9,null,12984.4]
[null,"March",null,4261,3.63,15467.43,null,5013,0.75,3759.75,null,5012.9999999999991,1.85,9274.0499999999993,null,13033.8]
[null,"April",null,3975,3.63,14429.25,null,4676,0.75,3507,null,4676,1.85,8650.6,null,12157.6]
[null,"May",null,3870,3.63,14048.1,null,4381,0.75,3285.75,null,4381,1.85,8104.85,null,11390.6]
[null,"June",null,3561,3.63,12926.43,null,4189,0.75,3141.75,null,4189,1.85,7749.65,null,10891.4]
[null,"July",null,3680,3.63,13358.4,null,3979,0.75,2984.25,null,3978.9999999999995,1.85,7361.15,null,10345.4]
[null,"August",null,9447,3.63,34292.61,null,10066,0.75,7549.5,null,10065.999999999998,1.85,18622.099999999999,null,26171.599999999999]
[null,"September",null,3869,3.63,14044.47,null,4012,0.75,3009,null,4011.9999999999995,1.85,7422.2,null,10431.200000000001]
[null,"October",null,3778,3.63,13714.14,null,3878,0.75,2908.5,null,3878,1.85,7174.3,null,10082.799999999999]
[null,"November",null,3657,3.63,13274.91,null,4249,0.75,3186.75,null,4249,1.85,7860.65,null,11047.4]
[null,"December",null,{"$f":"F35/E35","v":4179},3.63,15169.77,null,{"$f":"J35/I35","v":4606},0.75,3454.5,null,{"$f":"N35/M35","v":4606},1.85,8521.1,null,11975.6]
[null,null,null,null,"."]
[null,"Total",null,{"$f":"SUM(D24:D35)","v":52515},{"$f":"IF(D37<>0,F37/D37,0)","v":3.6254378748928877},{"$f":"SUM(F24:F35)","v":190389.87},null,{"$f":"SUM(H24:H35)","v":58741},{"$f":"IF(H37<>0,J37/H37,0)","v":0.75399891047139134},{"$f":"SUM(J24:J35)","v":44290.65},null,{"$f":"SUM(L24:L35)","v":58741},{"$f":"IF(L37<>0,N37/L37,0)","v":1.8507997820942783},{"$f":"SUM(N24:N35)","v":108717.83},null,{"$f":"SUM(P24:P35)","v":153008.47999999998}]
[]
[null,"Hydro One",null,"Network",null,null,null,"Line Connection",null,null,null,"Transformation Connection",null,null,null,"Total Line"]
[]
[null,"Month",null,"Units Billed","Rate","Amount",null,"Units Billed","Rate","Amount",null,"Units Billed","Rate","Amount",null,"Amount"]
[null,"2013 billed"]
[null,"January",null,11154,{"$f":"0.875*2.14+0.125*2.33","v":2.1637500000000003},{"$f":"E43*D43","v":24134.467500000002},null,11154,{"$f":"0.875*2.65+0.125*3.18","v":2.7162500000000001},{"$f":"I43*H43","v":30297.052500000002},null,{"$f":"H43","v":11154},null,{"$f":"M43*L43","v":0},null,{"$f":"J43+N43","v":30297.052500000002}]
[null,"February",null,12104,3.18,{"$f":"E44*D44","v":38490.720000000001},null,12333,2.33,{"$f":"I44*H44","v":28735.89},null,{"$f":"H44","v":12333},null,{"$f":"M44*L44","v":0},null,28735.89]
[null,"March",null,10612,3.18,33746.160000000003,null,11617,2.33,27067.61,null,11617,null,0,null,27067.61]
[null,"April",null,10068,3.18,32016.240000000002,null,10147,2.33,23642.510000000002,null,10147,null,0,null,23642.510000000002]
[null,"May",null,9263.68,3.18,29458.502400000001,null,9263.68,0.7,6484.576,null,9263.68,1.63,15099.7984,null,21584.374400000001]
[null,"June",null,11613.62,3.18,36931.311600000001,null,11613.62,0.7,8129.5339999999997,null,11613.62,1.63,18930.2006,null,27059.7346]
[null,"July",null,7450.04,3.18,23691.127200000003,null,7450.04,0.7,5215.0279999999993,null,7450.04,1.63,12143.565199999999,null,17358.593199999999]
[null,"August",null,7464.1,3.18,23735.838000000003,null,7464.1,0.7,5224.87,null,7464.1,1.63,12166.483,null,17391.352999999999]
[null,"September",null,8074.6,3.18,25677.228000000003,null,8074.6,0.7,5652.22,null,8074.6,1.63,13161.598,null,18813.817999999999]
[null,"October",null,7535.9,3.18,23964.162,null,7614.43,0.7,5330.1009999999997,null,7614.43,1.63,12411.5209,null,17741.621899999998]
[null,"November",null,8950.5,3.18,{"$f":"E53*D53","v":28462.59},null,9188.76,0.7,{"$f":"I53*H53","v":6432.1319999999996},null,{"$f":"H53","v":9188.76},1.63,{"$f":"M53*L53","v":14977.6788},null,21409.810799999999]
[null,"December",null,10518.06,3.18,{"$f":"E54*D54","v":33447.430800000002},null,10518,0.7,{"$f":"I54*H54","v":7362.5999999999995},null,{"$f":"H54","v":10518},1.63,{"$f":"M54*L54","v":17144.34},null,24506.94]
[]
[null,"Total",null,{"$f":"SUM(D43:D54)","v":114808.5},{"$f":"IF(D56<>0,F56/D56,0)","v":3.0812681770078005},{"$f":"SUM(F43:F54)","v":353755.77750000008},null,{"$f":"SUM(H43:H54)","v":116438.23},{"$f":"IF(H56<>0,J56/H56,0)","v":1.3704616044060445},{"$f":"SUM(J43:J54)","v":159574.12350000002},null,{"$f":"SUM(L43:L54)","v":116438.23},{"$f":"IF(L56<>0,N56/L56,0)","v":0.99653855009647607},{"$f":"SUM(N43:N54)","v":116035.18489999999},null,{"$f":"SUM(P43:P54)","v":275609.30839999998}]
[]
[null,"Add Extra Host Here (I)",null,"Network",null,null,null,"Line Connection",null,null,null,"Transformation Connection",null,null,null,"Total Line"]
[null,"(if needed)"]
[null,"Month",null,"Units Billed","Rate","Amount",null,"Units Billed","Rate","Amount",null,"Units Billed","Rate","Amount",null,"Amount"]
[]
[null,"January",null,null,{"$f":"IF(D62<>0,F62/D62,0)","v":0},null,null,null,{"$f":"IF(H62<>0,J62/H62,0)","v":0},null,null,null,{"$f":"IF(L62<>0,N62/L62,0)","v":0},null,null,{"$f":"J62+N62","v":0}]
[null,"February",null,null,0,null,null,null,0,null,null,null,0,null,null,0]
[null,"March",null,null,0,null,null,null,0,null,null,null,0,null,null,0]
[null,"April",null,null,0,null,null,null,0,null,null,null,0,null,null,0]
[null,"May",null,null,0,null,null,null,0,null,null,null,0,null,null,0]
[null,"June",null,null,0,null,null,null,0,null,null,null,0,null,null,0]
[null,"July",null,null,0,null,null,null,0,null,null,null,0,null,null,0]
[null,"August",null,null,0,null,null,null,0,null,null,null,0,null,null,0]
[null,"September",null,null,0,null,null,null,0,null,null,null,0,null,null,0]
[null,"October",null,null,0,null,null,null,0,null,null,null,0,null,null,0]
[null,"November",null,null,0,null,null,null,0,null,null,null,0,null,null,0]
[null,"December",null,null,0,null,null,null,0,null,null,null,0,null,null,0]
[]
[null,"Total",null,{"$f":"SUM(D62:D73)","v":0},{"$f":"IF(D75<>0,F75/D75,0)","v":0},{"$f":"SUM(F62:F73)","v":0},null,{"$f":"SUM(H62:H73)","v":0},{"$f":"IF(H75<>0,J75/H75,0)","v":0},{"$f":"SUM(J62:J73)","v":0},null,{"$f":"SUM(L62:L73)","v":0},{"$f":"IF(L75<>0,N75/L75,0)","v":0},{"$f":"SUM(N62:N73)","v":0},null,{"$f":"SUM(P62:P73)","v":0}]
[]
[null,"Add Extra Host Here (II)",null,"Network",null,null,null,"Line Connection",null,null,null,"Transformation Connection",null,null,null,"Total Line"]
[null,"(if needed)"]
[null,"Month",null,"Units Billed","Rate","Amount",null,"Units Billed","Rate","Amount",null,"Units Billed","Rate","Amount",null,"Amount"]
[]
[null,"January",null,null,{"$f":"IF(D81<>0,F81/D81,0)","v":0},null,null,null,{"$f":"IF(H81<>0,J81/H81,0)","v":0},null,null,null,{"$f":"IF(L81<>0,N81/L81,0)","v":0},null,null,{"$f":"J81+N81","v":0}]
[null,"February",null,null,0,null,null,null,0,null,null,null,0,null,null,0]
[null,"March",null,null,0,null,null,null,0,null,null,null,0,null,null,0]
[null,"April",null,null,0,null,null,null,0,null,null,null,0,null,null,0]
[null,"May",null,null,0,null,null,null,0,null,null,null,0,null,null,0]
[null,"June",null,null,0,null,null,null,0,null,null,null,0,null,null,0]
[null,"July",null,null,0,null,null,null,0,null,null,null,0,null,null,0]
[null,"August",null,null,0,null,null,null,0,null,null,null,0,null,null,0]
[null,"September",null,null,0,null,null,null,0,null,null,null,0,null,null,0]
[null,"October",null,null,0,null,null,null,0,null,null,null,0,null,null,0]
[null,"November",null,null,0,null,null,null,0,null,null,null,0,null,null,0]
[null,"December",null,null,0,null,null,null,0,null,null,null,0,null,null,0]
[]
[null,"Total",null,{"$f":"SUM(D81:D92)","v":0},{"$f":"IF(D94<>0,F94/D94,0)","v":0},{"$f":"SUM(F81:F92)","v":0},null,{"$f":"SUM(H81:H92)","v":0},{"$f":"IF(H94<>0,J94/H94,0)","v":0},{"$f":"SUM(J81:J92)","v":0},null,{"$f":"SUM(L81:L92)","v":0},{"$f":"IF(L94<>0,N94/L94,0)","v":0},{"$f":"SUM(N81:N92)","v":0},null,{"$f":"SUM(P81:P92)","v":0}]
[]
[null,"Total",null,"Network",null,null,null,"Line Connection",null,null,null,"Transformation Connection",null,null,null,"Total Line"]
[]
[null,"Month",null,"Units Billed","Rate","Amount",null,"Units Billed","Rate","Amount",null,"Units Billed","Rate","Amount",null,"Amount"]
[]
[null,"January",null,{"$f":"D24+D43+D62+D81","v":15147},{"$f":"IF(D100<>0,F100/D100,0)","v":2.5344607843137257},{"$f":"F24+F43+F62+F81","v":38389.477500000001},null,{"$f":"H24+H43+H62+H81","v":15852},{"$f":"IF(H100<>0,J100/H100,0)","v":2.1483379068887207},{"$f":"J24+J43+J62+J81","v":34055.452499999999},null,{"$f":"L24+L43+L62+L81","v":15852},{"$f":"IF(L100<>0,N100/L100,0)","v":0.55124148372445125},{"$f":"N24+N43+N62+N81","v":8738.2800000000007},null,{"$f":"J100+N100","v":42793.732499999998}]
[null,"February",null,{"$f":"D25+D44+D63+D82","v":16349},3.2968420086855463,{"$f":"F25+F44+F63+F82","v":53900.07},null,{"$f":"H25+H44+H63+H82","v":17327},1.8746113002827955,{"$f":"J25+J44+J63+J82","v":32481.39},null,{"$f":"L25+L44+L63+L82","v":17327},0.5332082876435621,{"$f":"N25+N44+N63+N82","v":9238.9},null,41720.29]
[null,"March",null,14873,3.3089215356686617,49213.590000000004,null,16630,1.8537197835237522,30827.360000000001,null,16630,0.55766987372218879,9274.0499999999993,null,40101.410000000003]
[null,"April",null,14043,3.3073766289254438,46445.490000000005,null,14823,1.8315799770626731,27149.510000000002,null,14823,0.5835930648316805,8650.6,null,35800.11]
[null,"May",null,13133.68,3.3125980227933072,43506.602400000003,null,13644.68,0.71605387594285841,9770.3260000000009,null,13644.68,1.7006370541485765,23204.648399999998,null,32974.974399999999]
[null,"June",null,15174.62,3.2856006674302223,49857.741600000001,null,15802.62,0.71325413127696535,11271.284,null,15802.62,1.6883181776186478,26679.850599999998,null,37951.134599999998]
[null,"July",null,11130.04,3.3287865272721393,37049.527200000004,null,11429.04,0.71740741129613672,8199.2779999999984,null,11429.039999999999,1.7065926097030022,19504.715199999999,null,27703.993199999997]
[null,"August",null,16911.099999999999,3.4313822282406234,58028.448000000004,null,17530.099999999999,0.72871061773749146,12774.369999999999,null,17530.099999999999,1.7563267180449627,30788.582999999999,null,43562.952999999994]
[null,"September",null,11943.6,3.325772631367427,39721.698000000004,null,12086.6,0.71659689242632341,8661.2200000000012,null,12086.6,1.7030263266758228,20583.797999999999,null,29245.018]
[null,"October",null,11313.9,3.3302664863574893,37678.301999999996,null,11492.43,0.71687197572663031,8238.6009999999987,null,11492.43,1.704236693197174,19585.820899999999,null,27824.421899999998]
[null,"November",null,12607.5,3.3105294467578821,41737.5,null,13437.76,0.71580992665444232,9618.8819999999996,null,13437.76,1.6995636772795466,22838.328799999999,null,32457.210800000001]
[null,"December",null,14697.06,3.3079541622610242,48617.200800000006,null,15124,0.71522745305474733,10817.099999999999,null,15124,1.6970007934408888,25665.440000000002,null,36482.54]
[]
[null,"Total",null,{"$f":"SUM(D100:D111)","v":167323.5},{"$f":"IF(D113<>0,F113/D113,0)","v":3.2520575262888953},{"$f":"SUM(F100:F111)","v":544145.64749999996},null,{"$f":"SUM(H100:H111)","v":175179.23},{"$f":"IF(H113<>0,J113/H113,0)","v":1.1637496836811076},{"$f":"SUM(J100:J111)","v":203864.77350000001},null,{"$f":"SUM(L100:L111)","v":175179.22999999998},{"$f":"IF(L113<>0,N113/L113,0)","v":1.2829889416684843},{"$f":"SUM(N100:N111)","v":224753.01489999998},null,{"$f":"SUM(P100:P111)","v":428617.78839999996}]
[]
[null,null,null,null,null,null,null,null,null,null,null,null,null,"Low Voltage Switchgear Credit (if applicable)",null,{"$f":"'5. UTRs and Sub-Transmission'!E95","v":0}]
[]
[null,null,null,null,null,null,null,null,null,null,null,null,null,"Total including deduction for Low Voltage Switchgear Credit",null,{"$f":"P113+P115","v":428617.78839999996}]

{"sheet":"7. Current Wholesale","index":6,"n_rows":117,"n_cols":16,"rows_kept":117,"cut":false,"hidden":false,"merged":[[96,7,96,9],[96,11,96,13],[20,3,20,5],[20,7,20,9],[20,11,20,13],[96,3,96,5],[95,3,95,5],[95,7,95,9],[95,11,95,13],[57,3,57,5],[57,7,57,9],[57,11,57,13],[76,3,76,5],[76,7,76,9],[76,11,76,13],[12,1,12,11],[19,3,19,5],[19,7,19,9],[19,11,19,13],[38,3,38,5],[38,7,38,9],[38,11,38,13]]}
[]
[]
[]
[]
[]
[]
[]
[]
[]
[]
[]
[]
[null,"The purpose of this sheet is to calculate the expected billing when current 2014 Uniform Transmission Rates are applied against historical 2013 transmission units."]
[]
[]
[]
[]
[]
[]
[null,"IESO",null,"Network",null,null,null,"Line Connection",null,null,null,"Transformation Connection",null,null,null,"Total Line"]
[]
[null,"Month",null,"Units Billed","Rate","Amount",null,"Units Billed","Rate","Amount",null,"Units Billed","Rate","Amount",null,"Amount"]
[]
[null,"January",null,{"$f":"'6. Historical Wholesale'!D24","v":3993.0000000000005},{"$f":"'5. UTRs and Sub-Transmission'!G22","v":3.82},{"$f":"D24*E24","v":15253.26},null,{"$f":"'6. Historical Wholesale'!H24","v":4698},{"$f":"'5. UTRs and Sub-Transmission'!G24","v":0.82},{"$f":"H24*I24","v":3852.3599999999997},null,{"$f":"'6. Historical Wholesale'!L24","v":4698},{"$f":"'5. UTRs and Sub-Transmission'!G26","v":1.98},{"$f":"L24*M24","v":9302.0399999999991},null,{"$f":"J24+N24","v":13154.399999999998}]
[null,"February",null,{"$f":"'6. Historical Wholesale'!D25","v":4245},{"$f":"E24","v":3.82},{"$f":"D25*E25","v":16215.9},null,{"$f":"'6. Historical Wholesale'!H25","v":4994},{"$f":"I24","v":0.82},{"$f":"H25*I25","v":4095.08},null,{"$f":"'6. Historical Wholesale'!L25","v":4994},{"$f":"M24","v":1.98},{"$f":"L25*M25","v":9888.1200000000008},null,13983.2]
[null,"March",null,{"$f":"'6. Historical Wholesale'!D26","v":4261},{"$f":"E25","v":3.82},16277.019999999999,null,{"$f":"'6. Historical Wholesale'!H26","v":5013},{"$f":"I25","v":0.82},4110.66,null,{"$f":"'6. Historical Wholesale'!L26","v":5012.9999999999991},{"$f":"M25","v":1.98},9925.739999999998,null,14036.399999999998]
[null,"April",null,{"$f":"'6. Historical Wholesale'!D27","v":3975},3.82,15184.5,null,{"$f":"'6. Historical Wholesale'!H27","v":4676},0.82,3834.3199999999997,null,{"$f":"'6. Historical Wholesale'!L27","v":4676},1.98,9258.48,null,13092.8]
[null,"May",null,{"$f":"'6. Historical Wholesale'!D28","v":3870},3.82,14783.4,null,{"$f":"'6. Historical Wholesale'!H28","v":4381},0.82,3592.4199999999996,null,{"$f":"'6. Historical Wholesale'!L28","v":4381},1.98,8674.3799999999992,null,12266.8]
[null,"June",null,{"$f":"'6. Historical Wholesale'!D29","v":3561},3.82,13603.019999999999,null,{"$f":"'6. Historical Wholesale'!H29","v":4189},0.82,3434.98,null,{"$f":"'6. Historical Wholesale'!L29","v":4189},1.98,8294.2199999999993,null,11729.199999999999]
[null,"July",null,{"$f":"'6. Historical Wholesale'!D30","v":3680},3.82,14057.599999999999,null,{"$f":"'6. Historical Wholesale'!H30","v":3979},0.82,3262.7799999999997,null,{"$f":"'6. Historical Wholesale'!L30","v":3978.9999999999995},1.98,7878.4199999999992,null,11141.199999999999]
[null,"August",null,{"$f":"'6. Historical Wholesale'!D31","v":9447},3.82,36087.54,null,{"$f":"'6. Historical Wholesale'!H31","v":10066},0.82,8254.119999999999,null,{"$f":"'6. Historical Wholesale'!L31","v":10065.999999999998},1.98,19930.679999999997,null,28184.799999999996]
[null,"September",null,{"$f":"'6. Historical Wholesale'!D32","v":3869},3.82,14779.58,null,{"$f":"'6. Historical Wholesale'!H32","v":4012},0.82,3289.8399999999997,null,{"$f":"'6. Historical Wholesale'!L32","v":4011.9999999999995},1.98,7943.7599999999993,null,11233.599999999999]
[null,"October",null,{"$f":"'6. Historical Wholesale'!D33","v":3778},3.82,14431.96,null,{"$f":"'6. Historical Wholesale'!H33","v":3878},0.82,3179.96,null,{"$f":"'6. Historical Wholesale'!L33","v":3878},1.98,7678.44,null,10858.4]
[null,"November",null,{"$f":"'6. Historical Wholesale'!D34","v":3657},3.82,13969.74,null,{"$f":"'6. Historical Wholesale'!H34","v":4249},0.82,3484.18,null,{"$f":"'6. Historical Wholesale'!L34","v":4249},1.98,8413.02,null,11897.2]
[null,"December",null,{"$f":"'6. Historical Wholesale'!D35","v":4179},3.82,15963.779999999999,null,{"$f":"'6. Historical Wholesale'!H35","v":4606},0.82,3776.9199999999996,null,{"$f":"'6. Historical Wholesale'!L35","v":4606},1.98,9119.8799999999992,null,12896.8]
[]
[null,"Total",null,{"$f":"SUM(D24:D35)","v":52515},{"$f":"IF(D37<>0,F37/D37,0)","v":3.82},{"$f":"SUM(F24:F35)","v":200607.3},null,{"$f":"SUM(H24:H35)","v":58741},{"$f":"IF(H37<>0,J37/H37,0)","v":0.81999999999999984},{"$f":"SUM(J24:J35)","v":48167.619999999988},null,{"$f":"SUM(L24:L35)","v":58741},{"$f":"IF(L37<>0,N37/L37,0)","v":1.98},{"$f":"SUM(N24:N35)","v":116307.18},null,{"$f":"SUM(P24:P35)","v":164474.79999999999}]
[]
[null,"Hydro One",null,"Network",null,null,null,"Line Connection",null,null,null,"Transformation Connection",null,null,null,"Total Line"]
[]
[null,"Month",null,"Units Billed","Rate","Amount",null,"Units Billed","Rate","Amount",null,"Units Billed","Rate","Amount",null,"Amount"]
[]
[null,"January",null,{"$f":"'6. Historical Wholesale'!D43","v":11154},{"$f":"'5. UTRs and Sub-Transmission'!G35+'5. UTRs and Sub-Transmission'!G79","v":3.3765000000000001},{"$f":"D43*E43","v":37661.481},null,{"$f":"'6. Historical Wholesale'!H43","v":11154},{"$f":"'5. UTRs and Sub-Transmission'!G37+'5. UTRs and Sub-Transmission'!G81","v":0.7167},{"$f":"H43*I43","v":7994.0717999999997},null,{"$f":"'6. Historical Wholesale'!L43","v":11154},{"$f":"'5. UTRs and Sub-Transmission'!G39","v":1.62},{"$f":"L43*M43","v":18069.48},null,{"$f":"J43+N43","v":26063.551800000001}]
[null,"February",null,{"$f":"'6. Historical Wholesale'!D44","v":12104},{"$f":"E43","v":3.3765000000000001},{"$f":"D44*E44","v":40869.156000000003},null,{"$f":"'6. Historical Wholesale'!H44","v":12333},{"$f":"I43","v":0.7167},{"$f":"H44*I44","v":8839.0611000000008},null,{"$f":"'6. Historical Wholesale'!L44","v":12333},{"$f":"M43","v":1.62},{"$f":"L44*M44","v":19979.460000000003},null,28818.521100000005]
[null,"March",null,{"$f":"'6. Historical Wholesale'!D45","v":10612},{"$f":"E44","v":3.3765000000000001},35831.417999999998,null,{"$f":"'6. Historical Wholesale'!H45","v":11617},{"$f":"I44","v":0.7167},8325.9038999999993,null,{"$f":"'6. Historical Wholesale'!L45","v":11617},{"$f":"M44","v":1.62},18819.54,null,27145.443899999998]
[null,"April",null,{"$f":"'6. Historical Wholesale'!D46","v":10068},3.3765000000000001,33994.601999999999,null,{"$f":"'6. Historical Wholesale'!H46","v":10147},0.7167,7272.3549000000003,null,{"$f":"'6. Historical Wholesale'!L46","v":10147},{"$f":"M45","v":1.62},16438.14,null,23710.494899999998]
[null,"May",null,{"$f":"'6. Historical Wholesale'!D47","v":9263.68},3.3765000000000001,31278.81552,null,{"$f":"'6. Historical Wholesale'!H47","v":9263.68},0.7167,6639.2794560000002,null,{"$f":"'6. Historical Wholesale'!L47","v":9263.68},1.62,15007.161600000001,null,21646.441056000003]
[null,"June",null,{"$f":"'6. Historical Wholesale'!D48","v":11613.62},3.3765000000000001,39213.387930000004,null,{"$f":"'6. Historical Wholesale'!H48","v":11613.62},0.7167,8323.4814540000007,null,{"$f":"'6. Historical Wholesale'!L48","v":11613.62},1.62,18814.064400000003,null,27137.545854000004]
[null,"July",null,{"$f":"'6. Historical Wholesale'!D49","v":7450.04},3.3765000000000001,25155.06006,null,{"$f":"'6. Historical Wholesale'!H49","v":7450.04},0.7167,5339.4436679999999,null,{"$f":"'6. Historical Wholesale'!L49","v":7450.04},1.62,12069.0648,null,17408.508468]
[null,"August",null,{"$f":"'6. Historical Wholesale'!D50","v":7464.1},3.3765000000000001,25202.533650000001,null,{"$f":"'6. Historical Wholesale'!H50","v":7464.1},0.7167,5349.5204700000004,null,{"$f":"'6. Historical Wholesale'!L50","v":7464.1},1.62,12091.842000000001,null,17441.36247]
[null,"September",null,{"$f":"'6. Historical Wholesale'!D51","v":8074.6},3.3765000000000001,27263.886900000001,null,{"$f":"'6. Historical Wholesale'!H51","v":8074.6},0.7167,5787.0658200000007,null,{"$f":"'6. Historical Wholesale'!L51","v":8074.6},1.62,13080.852000000001,null,18867.917820000002]
[null,"October",null,{"$f":"'6. Historical Wholesale'!D52","v":7535.9},3.3765000000000001,25444.966349999999,null,{"$f":"'6. Historical Wholesale'!H52","v":7614.43},0.7167,5457.2619810000006,null,{"$f":"'6. Historical Wholesale'!L52","v":7614.43},1.62,12335.376600000001,null,17792.638581000003]
[null,"November",null,{"$f":"'6. Historical Wholesale'!D53","v":8950.5},3.3765000000000001,30221.363250000002,null,{"$f":"'6. Historical Wholesale'!H53","v":9188.76},0.7167,6585.5842920000005,null,{"$f":"'6. Historical Wholesale'!L53","v":9188.76},1.62,14885.791200000001,null,21471.375492000003]
[null,"December",null,{"$f":"'6. Historical Wholesale'!D54","v":10518.06},3.3765000000000001,35514.229589999995,null,{"$f":"'6. Historical Wholesale'!H54","v":10518},0.7167,7538.2506000000003,null,{"$f":"'6. Historical Wholesale'!L54","v":10518},1.62,17039.16,null,24577.410599999999]
[]
[null,"Total",null,{"$f":"SUM(D43:D54)","v":114808.5},{"$f":"IF(D56<>0,F56/D56,0)","v":3.3765000000000001},{"$f":"SUM(F43:F54)","v":387650.90025000001},null,{"$f":"SUM(H43:H54)","v":116438.23},{"$f":"IF(H56<>0,J56/H56,0)","v":0.71670000000000011},{"$f":"SUM(J43:J54)","v":83451.279441000006},null,{"$f":"SUM(L43:L54)","v":116438.23},{"$f":"IF(L56<>0,N56/L56,0)","v":1.6200000000000003},{"$f":"SUM(N43:N54)","v":188629.93260000003},null,{"$f":"SUM(P43:P54)","v":272081.21204099996}]
[]
[null,{"$f":"'6. Historical Wholesale'!B58","v":"Add Extra Host Here (I)"},null,"Network",null,null,null,"Line Connection",null,null,null,"Transformation Connection",null,null,null,"Total Line"]
[]
[null,"Month",null,"Units Billed","Rate","Amount",null,"Units Billed","Rate","Amount",null,"Units Billed","Rate","Amount",null,"Amount"]
[]
[null,"January",null,{"$f":"'6. Historical Wholesale'!D62","v":0},{"$f":"'5. UTRs and Sub-Transmission'!G50","v":0},{"$f":"D62*E62","v":0},null,{"$f":"'6. Historical Wholesale'!H62","v":0},{"$f":"'5. UTRs and Sub-Transmission'!G52","v":0},{"$f":"H62*I62","v":0},null,{"$f":"'6. Historical Wholesale'!L62","v":0},{"$f":"'5. UTRs and Sub-Transmission'!G54","v":0},{"$f":"L62*M62","v":0},null,{"$f":"J62+N62","v":0}]
[null,"February",null,{"$f":"'6. Historical Wholesale'!D63","v":0},{"$f":"E62","v":0},{"$f":"D63*E63","v":0},null,{"$f":"'6. Historical Wholesale'!H63","v":0},{"$f":"I62","v":0},{"$f":"H63*I63","v":0},null,{"$f":"'6. Historical Wholesale'!L63","v":0},{"$f":"M62","v":0},{"$f":"L63*M63","v":0},null,0]
[null,"March",null,{"$f":"'6. Historical Wholesale'!D64","v":0},{"$f":"E63","v":0},0,null,{"$f":"'6. Historical Wholesale'!H64","v":0},{"$f":"I63","v":0},0,null,{"$f":"'6. Historical Wholesale'!L64","v":0},{"$f":"M63","v":0},0,null,0]
[null,"April",null,{"$f":"'6. Historical Wholesale'!D65","v":0},0,0,null,{"$f":"'6. Historical Wholesale'!H65","v":0},0,0,null,{"$f":"'6. Historical Wholesale'!L65","v":0},{"$f":"M64","v":0},0,null,0]
[null,"May",null,{"$f":"'6. Historical Wholesale'!D66","v":0},0,0,null,{"$f":"'6. Historical Wholesale'!H66","v":0},0,0,null,{"$f":"'6. Historical Wholesale'!L66","v":0},0,0,null,0]
[null,"June",null,{"$f":"'6. Historical Wholesale'!D67","v":0},0,0,null,{"$f":"'6. Historical Wholesale'!H67","v":0},0,0,null,{"$f":"'6. Historical Wholesale'!L67","v":0},0,0,null,0]
[null,"July",null,{"$f":"'6. Historical Wholesale'!D68","v":0},0,0,null,{"$f":"'6. Historical Wholesale'!H68","v":0},0,0,null,{"$f":"'6. Historical Wholesale'!L68","v":0},0,0,null,0]
[null,"August",null,{"$f":"'6. Historical Wholesale'!D69","v":0},0,0,null,{"$f":"'6. Historical Wholesale'!H69","v":0},0,0,null,{"$f":"'6. Historical Wholesale'!L69","v":0},0,0,null,0]
[null,"September",null,{"$f":"'6. Historical Wholesale'!D70","v":0},0,0,null,{"$f":"'6. Historical Wholesale'!H70","v":0},0,0,null,{"$f":"'6. Historical Wholesale'!L70","v":0},0,0,null,0]
[null,"October",null,{"$f":"'6. Historical Wholesale'!D71","v":0},0,0,null,{"$f":"'6. Historical Wholesale'!H71","v":0},0,0,null,{"$f":"'6. Historical Wholesale'!L71","v":0},0,0,null,0]
[null,"November",null,{"$f":"'6. Historical Wholesale'!D72","v":0},0,0,null,{"$f":"'6. Historical Wholesale'!H72","v":0},0,0,null,{"$f":"'6. Historical Wholesale'!L72","v":0},0,0,null,0]
[null,"December",null,{"$f":"'6. Historical Wholesale'!D73","v":0},0,0,null,{"$f":"'6. Historical Wholesale'!H73","v":0},0,0,null,{"$f":"'6. Historical Wholesale'!L73","v":0},0,0,null,0]
[]
[null,"Total",null,{"$f":"SUM(D62:D73)","v":0},{"$f":"IF(D75<>0,F75/D75,0)","v":0},{"$f":"SUM(F62:F73)","v":0},null,{"$f":"SUM(H62:H73)","v":0},{"$f":"IF(H75<>0,J75/H75,0)","v":0},{"$f":"SUM(J62:J73)","v":0},null,{"$f":"SUM(L62:L73)","v":0},{"$f":"IF(L75<>0,N75/L75,0)","v":0},{"$f":"SUM(N62:N73)","v":0},null,{"$f":"SUM(P62:P73)","v":0}]
[]
[null,{"$f":"'6. Historical Wholesale'!B77","v":"Add Extra Host Here (II)"},null,"Network",null,null,null,"Line Connection",null,null,null,"Transformation Connection",null,null,null,"Total Line"]
[]
[null,"Month",null,"Units Billed","Rate","Amount",null,"Units Billed","Rate","Amount",null,"Units Billed","Rate","Amount",null,"Amount"]
[]
[null,"January",null,{"$f":"'6. Historical Wholesale'!D81","v":0},{"$f":"'5. UTRs and Sub-Transmission'!G65","v":0},{"$f":"D81*E81","v":0},null,{"$f":"'6. Historical Wholesale'!H81","v":0},{"$f":"'5. UTRs and Sub-Transmission'!G67","v":0},{"$f":"H81*I81","v":0},null,{"$f":"'6. Historical Wholesale'!L81","v":0},{"$f":"'5. UTRs and Sub-Transmission'!G69","v":0},{"$f":"L81*M81","v":0},null,{"$f":"J81+N81","v":0}]
[null,"February",null,{"$f":"'6. Historical Wholesale'!D82","v":0},{"$f":"E81","v":0},{"$f":"D82*E82","v":0},null,{"$f":"'6. Historical Wholesale'!H82","v":0},{"$f":"I81","v":0},{"$f":"H82*I82","v":0},null,{"$f":"'6. Historical Wholesale'!L82","v":0},{"$f":"M81","v":0},{"$f":"L82*M82","v":0},null,0]
[null,"March",null,{"$f":"'6. Historical Wholesale'!D83","v":0},{"$f":"E82","v":0},0,null,{"$f":"'6. Historical Wholesale'!H83","v":0},{"$f":"I82","v":0},0,null,{"$f":"'6. Historical Wholesale'!L83","v":0},{"$f":"M82","v":0},0,null,0]
[null,"April",null,{"$f":"'6. Historical Wholesale'!D84","v":0},0,0,null,{"$f":"'6. Historical Wholesale'!H84","v":0},0,0,null,{"$f":"'6. Historical Wholesale'!L84","v":0},{"$f":"M83","v":0},0,null,0]
[null,"May",null,{"$f":"'6. Historical Wholesale'!D85","v":0},0,0,null,{"$f":"'6. Historical Wholesale'!H85","v":0},0,0,null,{"$f":"'6. Historical Wholesale'!L85","v":0},0,0,null,0]
[null,"June",null,{"$f":"'6. Historical Wholesale'!D86","v":0},0,0,null,{"$f":"'6. Historical Wholesale'!H86","v":0},0,0,null,{"$f":"'6. Historical Wholesale'!L86","v":0},0,0,null,0]
[null,"July",null,{"$f":"'6. Historical Wholesale'!D87","v":0},0,0,null,{"$f":"'6. Historical Wholesale'!H87","v":0},0,0,null,{"$f":"'6. Historical Wholesale'!L87","v":0},0,0,null,0]
[null,"August",null,{"$f":"'6. Historical Wholesale'!D88","v":0},0,0,null,{"$f":"'6. Historical Wholesale'!H88","v":0},0,0,null,{"$f":"'6. Historical Wholesale'!L88","v":0},0,0,null,0]
[null,"September",null,{"$f":"'6. Historical Wholesale'!D89","v":0},0,0,null,{"$f":"'6. Historical Wholesale'!H89","v":0},0,0,null,{"$f":"'6. Historical Wholesale'!L89","v":0},0,0,null,0]
[null,"October",null,{"$f":"'6. Historical Wholesale'!D90","v":0},0,0,null,{"$f":"'6. Historical Wholesale'!H90","v":0},0,0,null,{"$f":"'6. Historical Wholesale'!L90","v":0},0,0,null,0]
[null,"November",null,{"$f":"'6. Historical Wholesale'!D91","v":0},0,0,null,{"$f":"'6. Historical Wholesale'!H91","v":0},0,0,null,{"$f":"'6. Historical Wholesale'!L91","v":0},0,0,null,0]
[null,"December",null,{"$f":"'6. Historical Wholesale'!D92","v":0},0,0,null,{"$f":"'6. Historical Wholesale'!H92","v":0},0,0,null,{"$f":"'6. Historical Wholesale'!L92","v":0},0,0,null,0]
[]
[null,"Total",null,{"$f":"SUM(D81:D92)","v":0},{"$f":"IF(D94<>0,F94/D94,0)","v":0},{"$f":"SUM(F81:F92)","v":0},null,{"$f":"SUM(H81:H92)","v":0},{"$f":"IF(H94<>0,J94/H94,0)","v":0},{"$f":"SUM(J81:J92)","v":0},null,{"$f":"SUM(L81:L92)","v":0},{"$f":"IF(L94<>0,N94/L94,0)","v":0},{"$f":"SUM(N81:N92)","v":0},null,{"$f":"SUM(P81:P92)","v":0}]
[]
[null,"Total",null,"Network",null,null,null,"Line Connection",null,null,null,"Transformation Connection",null,null,null,"Total Line"]
[]
[null,"Month",null,"Units Billed","Rate","Amount",null,"Units Billed","Rate","Amount",null,"Units Billed","Rate","Amount",null,"Amount"]
[]
[null,"January",null,{"$f":"D24+D43+D62+D81","v":15147},{"$f":"IF(D100<>0,F100/D100,0)","v":3.4934139433551201},{"$f":"F24+F43+F62+F81","v":52914.741000000002},null,{"$f":"H24+H43+H62+H81","v":15852},{"$f":"IF(H100<>0,J100/H100,0)","v":0.74731464799394387},{"$f":"J24+J43+J62+J81","v":11846.431799999998},null,{"$f":"L24+L43+L62+L81","v":15852},{"$f":"IF(L100<>0,N100/L100,0)","v":1.7266919000756999},{"$f":"N24+N43+N62+N81","v":27371.519999999997},null,{"$f":"J100+N100","v":39217.951799999995}]
[null,"February",null,{"$f":"D25+D44+D63+D82","v":16349},3.4916542907823112,{"$f":"F25+F44+F63+F82","v":57085.056000000004},null,{"$f":"H25+H44+H63+H82","v":17327},0.7464731978992325,{"$f":"J25+J44+J63+J82","v":12934.141100000001},null,{"$f":"L25+L44+L63+L82","v":17327},1.723759450568477,{"$f":"N25+N44+N63+N82","v":29867.58},null,42801.721100000002]
[null,"March",null,14873,3.5035593357090025,52108.437999999995,null,16630,0.74783907997594701,12436.563899999999,null,16630,1.7285195429945881,28745.279999999999,null,41181.8439]
[null,"April",null,14043,3.5020367442854092,49179.101999999999,null,14823,0.74928657491735817,11106.6749,null,14823,1.7335640558591379,25696.62,null,36803.294900000001]
[null,"May",null,13133.68,3.5071827180196258,46062.215519999998,null,13644.68,0.7498673076979453,10231.699456,null,13644.68,1.7355879067885798,23681.5416,null,33913.241055999999]
[null,"June",null,15174.62,3.4805753244562303,52816.407930000001,null,15802.62,0.74408303521821062,11758.461454,null,15802.62,1.7154297451941516,27108.284400000004,null,38866.745854000008]
[null,"July",null,11130.04,3.5231373885448742,39212.660059999995,null,11429.04,0.75266371173781854,8602.2236679999987,null,11429.039999999999,1.7453333613321853,19947.484799999998,null,28549.708467999997]
[null,"August",null,16911.099999999999,3.6242511516104812,61290.073650000006,null,17530.099999999999,0.77601613624565746,13603.640469999998,null,17530.099999999999,1.8267164477099389,32022.521999999997,null,45626.162469999996]
[null,"September",null,11943.6,3.5201670266921194,42043.466899999999,null,12086.6,0.75098917975278401,9076.9058199999999,null,12086.6,1.7394976254695282,21024.612000000001,null,30101.517820000001]
[null,"October",null,11313.9,3.5245959704434364,39876.926349999994,null,11492.43,0.75155750185121861,8637.2219810000006,null,11492.43,1.7414782252317396,20013.816600000002,null,28651.038581000001]
[null,"November",null,12607.5,3.5051440214158238,44191.10325,null,13437.76,0.74936330846807797,10069.764292,null,13437.76,1.7338314719119856,23298.811200000004,null,33368.575492000004]
[null,"December",null,14697.06,3.5026059354728085,51478.009589999994,null,15124,0.74815991801110815,11315.170599999999,null,15124,1.7296376619941816,26159.040000000001,null,37474.210599999999]
[]
[null,"Total",null,{"$f":"SUM(D100:D111)","v":167323.5},{"$f":"IF(D113<>0,F113/D113,0)","v":3.5156938520291536},{"$f":"SUM(F100:F111)","v":588258.20025000011},null,{"$f":"SUM(H100:H111)","v":175179.23},{"$f":"IF(H113<>0,J113/H113,0)","v":0.75133849738350822},{"$f":"SUM(J100:J111)","v":131618.89944099999},null,{"$f":"SUM(L100:L111)","v":175179.22999999998},{"$f":"IF(L113<>0,N113/L113,0)","v":1.7407149957218102},{"$f":"SUM(N100:N111)","v":304937.11259999999},null,{"$f":"SUM(P100:P111)","v":436556.01204100007}]
[]
[null,null,null,null,null,null,null,null,null,null,null,null,null,"Low Voltage Switchgear Credit (if applicable)",null,{"$f":"'5. UTRs and Sub-Transmission'!G95","v":0}]
[]
[null,null,null,null,null,null,null,null,null,null,null,null,null,"Total including deduction for Low Voltage Switchgear Credit",null,{"$f":"P113+P115","v":436556.01204100007}]

{"sheet":"8. Forecast Wholesale","index":7,"n_rows":117,"n_cols":16,"rows_kept":117,"cut":false,"hidden":false,"merged":[[96,7,96,9],[96,11,96,13],[20,3,20,5],[20,7,20,9],[20,11,20,13],[96,3,96,5],[95,3,95,5],[95,7,95,9],[95,11,95,13],[57,3,57,5],[57,7,57,9],[57,11,57,13],[76,3,76,5],[76,7,76,9],[76,11,76,13],[12,1,12,12],[19,3,19,5],[19,7,19,9],[19,11,19,13],[38,3,38,5],[38,7,38,9],[38,11,38,13]]}
[]
[]
[]
[]
[]
[]
[]
[]
[]
[]
[]
[]
[null,"The purpose of this sheet is to calculate the expected billing when forecasted 2015 Uniform Transmission Rates are applied against historical 2013 transmission units."]
[]
[]
[]
[]
[]
[]
[null,"IESO",null,"Network",null,null,null,"Line Connection",null,null,null,"Transformation Connection",null,null,null,"Total Line"]
[]
[null,"Month",null,"Units Billed","Rate","Amount",null,"Units Billed","Rate","Amount",null,"Units Billed","Rate","Amount",null,"Amount"]
[]
[null,"January",null,{"$f":"'6. Historical Wholesale'!D24","v":3993.0000000000005},{"$f":"'5. UTRs and Sub-Transmission'!I22","v":3.82},{"$f":"D24*E24","v":15253.26},null,{"$f":"'6. Historical Wholesale'!H24","v":4698},{"$f":"'5. UTRs and Sub-Transmission'!I24","v":0.82},{"$f":"H24*I24","v":3852.3599999999997},null,{"$f":"'6. Historical Wholesale'!L24","v":4698},{"$f":"'5. UTRs and Sub-Transmission'!I26","v":1.98},{"$f":"L24*M24","v":9302.0399999999991},null,{"$f":"J24+N24","v":13154.399999999998}]
[null,"February",null,{"$f":"'6. Historical Wholesale'!D25","v":4245},{"$f":"E24","v":3.82},16215.9,null,{"$f":"'6. Historical Wholesale'!H25","v":4994},{"$f":"I24","v":0.82},4095.08,null,{"$f":"'6. Historical Wholesale'!L25","v":4994},{"$f":"M24","v":1.98},9888.1200000000008,null,13983.2]
[null,"March",null,{"$f":"'6. Historical Wholesale'!D26","v":4261},3.82,16277.019999999999,null,{"$f":"'6. Historical Wholesale'!H26","v":5013},0.82,4110.66,null,{"$f":"'6. Historical Wholesale'!L26","v":5012.9999999999991},1.98,9925.739999999998,null,14036.399999999998]
[null,"April",null,{"$f":"'6. Historical Wholesale'!D27","v":3975},3.82,15184.5,null,{"$f":"'6. Historical Wholesale'!H27","v":4676},0.82,3834.3199999999997,null,{"$f":"'6. Historical Wholesale'!L27","v":4676},1.98,9258.48,null,13092.8]
[null,"May",null,{"$f":"'6. Historical Wholesale'!D28","v":3870},3.82,14783.4,null,{"$f":"'6. Historical Wholesale'!H28","v":4381},0.82,3592.4199999999996,null,{"$f":"'6. Historical Wholesale'!L28","v":4381},1.98,8674.3799999999992,null,12266.8]
[null,"June",null,{"$f":"'6. Historical Wholesale'!D29","v":3561},3.82,13603.019999999999,null,{"$f":"'6. Historical Wholesale'!H29","v":4189},0.82,3434.98,null,{"$f":"'6. Historical Wholesale'!L29","v":4189},1.98,8294.2199999999993,null,11729.199999999999]
[null,"July",null,{"$f":"'6. Historical Wholesale'!D30","v":3680},3.82,14057.599999999999,null,{"$f":"'6. Historical Wholesale'!H30","v":3979},0.82,3262.7799999999997,null,{"$f":"'6. Historical Wholesale'!L30","v":3978.9999999999995},1.98,7878.4199999999992,null,11141.199999999999]
[null,"August",null,{"$f":"'6. Historical Wholesale'!D31","v":9447},3.82,36087.54,null,{"$f":"'6. Historical Wholesale'!H31","v":10066},0.82,8254.119999999999,null,{"$f":"'6. Historical Wholesale'!L31","v":10065.999999999998},1.98,19930.679999999997,null,28184.799999999996]
[null,"September",null,{"$f":"'6. Historical Wholesale'!D32","v":3869},3.82,14779.58,null,{"$f":"'6. Historical Wholesale'!H32","v":4012},0.82,3289.8399999999997,null,{"$f":"'6. Historical Wholesale'!L32","v":4011.9999999999995},1.98,7943.7599999999993,null,11233.599999999999]
[null,"October",null,{"$f":"'6. Historical Wholesale'!D33","v":3778},3.82,14431.96,null,{"$f":"'6. Historical Wholesale'!H33","v":3878},0.82,3179.96,null,{"$f":"'6. Historical Wholesale'!L33","v":3878},1.98,7678.44,null,10858.4]
[null,"November",null,{"$f":"'6. Historical Wholesale'!D34","v":3657},3.82,13969.74,null,{"$f":"'6. Historical Wholesale'!H34","v":4249},0.82,3484.18,null,{"$f":"'6. Historical Wholesale'!L34","v":4249},1.98,8413.02,null,11897.2]
[null,"December",null,{"$f":"'6. Historical Wholesale'!D35","v":4179},3.82,15963.779999999999,null,{"$f":"'6. Historical Wholesale'!H35","v":4606},0.82,3776.9199999999996,null,{"$f":"'6. Historical Wholesale'!L35","v":4606},1.98,9119.8799999999992,null,12896.8]
[]
[null,"Total",null,{"$f":"SUM(D24:D35)","v":52515},{"$f":"IF(D37<>0,F37/D37,0)","v":3.82},{"$f":"SUM(F24:F35)","v":200607.3},null,{"$f":"SUM(H24:H35)","v":58741},{"$f":"IF(H37<>0,J37/H37,0)","v":0.81999999999999984},{"$f":"SUM(J24:J35)","v":48167.619999999988},null,{"$f":"SUM(L24:L35)","v":58741},{"$f":"IF(L37<>0,N37/L37,0)","v":1.98},{"$f":"SUM(N24:N35)","v":116307.18},null,{"$f":"SUM(P24:P35)","v":164474.79999999999}]
[]
[null,"Hydro One",null,"Network",null,null,null,"Line Connection",null,null,null,"Transformation Connection",null,null,null,"Total Line"]
[]
[null,"Month",null,"Units Billed","Rate","Amount",null,"Units Billed","Rate","Amount",null,"Units Billed","Rate","Amount",null,"Amount"]
[]
[null,"January",null,{"$f":"'6. Historical Wholesale'!D43","v":11154},{"$f":"'5. UTRs and Sub-Transmission'!I35+'5. UTRs and Sub-Transmission'!I79","v":3.3265000000000002},{"$f":"D43*E43","v":37103.781000000003},null,{"$f":"'6. Historical Wholesale'!H43","v":11154},{"$f":"'5. UTRs and Sub-Transmission'!I37+'5. UTRs and Sub-Transmission'!I81","v":0.76669999999999994},{"$f":"H43*I43","v":8551.7717999999986},null,{"$f":"'6. Historical Wholesale'!L43","v":11154},{"$f":"'5. UTRs and Sub-Transmission'!I39","v":1.63},{"$f":"L43*M43","v":18181.02},null,{"$f":"J43+N43","v":26732.791799999999}]
[null,"February",null,{"$f":"'6. Historical Wholesale'!D44","v":12104},{"$f":"E43","v":3.3265000000000002},40263.956000000006,null,{"$f":"'6. Historical Wholesale'!H44","v":12333},{"$f":"I43","v":0.76669999999999994},9455.7110999999986,null,{"$f":"'6. Historical Wholesale'!L44","v":12333},{"$f":"M43","v":1.63},20102.789999999997,null,29558.501099999994]
[null,"March",null,{"$f":"'6. Historical Wholesale'!D45","v":10612},3.3265000000000002,35300.817999999999,null,{"$f":"'6. Historical Wholesale'!H45","v":11617},0.76669999999999994,8906.7538999999997,null,{"$f":"'6. Historical Wholesale'!L45","v":11617},1.63,18935.71,null,27842.463899999999]
[null,"April",null,{"$f":"'6. Historical Wholesale'!D46","v":10068},3.3265000000000002,33491.202000000005,null,{"$f":"'6. Historical Wholesale'!H46","v":10147},0.76669999999999994,7779.7048999999997,null,{"$f":"'6. Historical Wholesale'!L46","v":10147},1.63,16539.61,null,24319.314900000001]
[null,"May",null,{"$f":"'6. Historical Wholesale'!D47","v":9263.68},3.3265000000000002,30815.631520000003,null,{"$f":"'6. Historical Wholesale'!H47","v":9263.68},0.76669999999999994,7102.4634559999995,null,{"$f":"'6. Historical Wholesale'!L47","v":9263.68},1.63,15099.7984,null,22202.261855999997]
[null,"June",null,{"$f":"'6. Historical Wholesale'!D48","v":11613.62},3.3265000000000002,38632.706930000008,null,{"$f":"'6. Historical Wholesale'!H48","v":11613.62},0.76669999999999994,8904.1624539999993,null,{"$f":"'6. Historical Wholesale'!L48","v":11613.62},1.63,18930.2006,null,27834.363054000001]
[null,"July",null,{"$f":"'6. Historical Wholesale'!D49","v":7450.04},3.3265000000000002,24782.558060000003,null,{"$f":"'6. Historical Wholesale'!H49","v":7450.04},0.76669999999999994,5711.9456679999994,null,{"$f":"'6. Historical Wholesale'!L49","v":7450.04},1.63,12143.565199999999,null,17855.510867999998]
[null,"August",null,{"$f":"'6. Historical Wholesale'!D50","v":7464.1},3.3265000000000002,24829.328650000003,null,{"$f":"'6. Historical Wholesale'!H50","v":7464.1},0.76669999999999994,5722.7254699999994,null,{"$f":"'6. Historical Wholesale'!L50","v":7464.1},1.63,12166.483,null,17889.208469999998]
[null,"September",null,{"$f":"'6. Historical Wholesale'!D51","v":8074.6},3.3265000000000002,26860.156900000002,null,{"$f":"'6. Historical Wholesale'!H51","v":8074.6},0.76669999999999994,6190.7958199999994,null,{"$f":"'6. Historical Wholesale'!L51","v":8074.6},1.63,13161.598,null,19352.393819999998]
[null,"October",null,{"$f":"'6. Historical Wholesale'!D52","v":7535.9},3.3265000000000002,25068.171350000001,null,{"$f":"'6. Historical Wholesale'!H52","v":7614.43},0.76669999999999994,5837.9834809999993,null,{"$f":"'6. Historical Wholesale'!L52","v":7614.43},1.63,12411.5209,null,18249.504380999999]
[null,"November",null,{"$f":"'6. Historical Wholesale'!D53","v":8950.5},3.3265000000000002,29773.838250000001,null,{"$f":"'6. Historical Wholesale'!H53","v":9188.76},0.76669999999999994,7045.0222919999997,null,{"$f":"'6. Historical Wholesale'!L53","v":9188.76},1.63,14977.6788,null,22022.701091999999]
[null,"December",null,{"$f":"'6. Historical Wholesale'!D54","v":10518.06},3.3265000000000002,34988.326590000004,null,{"$f":"'6. Historical Wholesale'!H54","v":10518},0.76669999999999994,8064.150599999999,null,{"$f":"'6. Historical Wholesale'!L54","v":10518},1.63,17144.34,null,25208.490599999997]
[]
[null,"Total",null,{"$f":"SUM(D43:D54)","v":114808.5},{"$f":"IF(D56<>0,F56/D56,0)","v":3.3265000000000007},{"$f":"SUM(F43:F54)","v":381910.47525000008},null,{"$f":"SUM(H43:H54)","v":116438.23},{"$f":"IF(H56<>0,J56/H56,0)","v":0.76669999999999983},{"$f":"SUM(J43:J54)","v":89273.190940999979},null,{"$f":"SUM(L43:L54)","v":116438.23},{"$f":"IF(L56<>0,N56/L56,0)","v":1.6300000000000001},{"$f":"SUM(N43:N54)","v":189794.3149},null,{"$f":"SUM(P43:P54)","v":279067.50584100001}]
[]
[null,{"$f":"'6. Historical Wholesale'!B58","v":"Add Extra Host Here (I)"},null,"Network",null,null,null,"Line Connection",null,null,null,"Transformation Connection",null,null,null,"Total Line"]
[]
[null,"Month",null,"Units Billed","Rate","Amount",null,"Units Billed","Rate","Amount",null,"Units Billed","Rate","Amount",null,"Amount"]
[]
[null,"January",null,{"$f":"'6. Historical Wholesale'!D62","v":0},{"$f":"'5. UTRs and Sub-Transmission'!I50","v":0},{"$f":"D62*E62","v":0},null,{"$f":"'6. Historical Wholesale'!H62","v":0},{"$f":"'5. UTRs and Sub-Transmission'!I52","v":0},{"$f":"H62*I62","v":0},null,{"$f":"'6. Historical Wholesale'!L62","v":0},{"$f":"'5. UTRs and Sub-Transmission'!I54","v":0},{"$f":"L62*M62","v":0},null,{"$f":"J62+N62","v":0}]
[null,"February",null,{"$f":"'6. Historical Wholesale'!D63","v":0},{"$f":"E62","v":0},0,null,{"$f":"'6. Historical Wholesale'!H63","v":0},{"$f":"I62","v":0},0,null,{"$f":"'6. Historical Wholesale'!L63","v":0},{"$f":"M62","v":0},0,null,0]
[null,"March",null,{"$f":"'6. Historical Wholesale'!D64","v":0},0,0,null,{"$f":"'6. Historical Wholesale'!H64","v":0},0,0,null,{"$f":"'6. Historical Wholesale'!L64","v":0},0,0,null,0]
[null,"April",null,{"$f":"'6. Historical Wholesale'!D65","v":0},0,0,null,{"$f":"'6. Historical Wholesale'!H65","v":0},0,0,null,{"$f":"'6. Historical Wholesale'!L65","v":0},0,0,null,0]
[null,"May",null,{"$f":"'6. Historical Wholesale'!D66","v":0},0,0,null,{"$f":"'6. Historical Wholesale'!H66","v":0},0,0,null,{"$f":"'6. Historical Wholesale'!L66","v":0},0,0,null,0]
[null,"June",null,{"$f":"'6. Historical Wholesale'!D67","v":0},0,0,null,{"$f":"'6. Historical Wholesale'!H67","v":0},0,0,null,{"$f":"'6. Historical Wholesale'!L67","v":0},0,0,null,0]
[null,"July",null,{"$f":"'6. Historical Wholesale'!D68","v":0},0,0,null,{"$f":"'6. Historical Wholesale'!H68","v":0},0,0,null,{"$f":"'6. Historical Wholesale'!L68","v":0},0,0,null,0]
[null,"August",null,{"$f":"'6. Historical Wholesale'!D69","v":0},0,0,null,{"$f":"'6. Historical Wholesale'!H69","v":0},0,0,null,{"$f":"'6. Historical Wholesale'!L69","v":0},0,0,null,0]
[null,"September",null,{"$f":"'6. Historical Wholesale'!D70","v":0},0,0,null,{"$f":"'6. Historical Wholesale'!H70","v":0},0,0,null,{"$f":"'6. Historical Wholesale'!L70","v":0},0,0,null,0]
[null,"October",null,{"$f":"'6. Historical Wholesale'!D71","v":0},0,0,null,{"$f":"'6. Historical Wholesale'!H71","v":0},0,0,null,{"$f":"'6. Historical Wholesale'!L71","v":0},0,0,null,0]
[null,"November",null,{"$f":"'6. Historical Wholesale'!D72","v":0},0,0,null,{"$f":"'6. Historical Wholesale'!H72","v":0},0,0,null,{"$f":"'6. Historical Wholesale'!L72","v":0},0,0,null,0]
[null,"December",null,{"$f":"'6. Historical Wholesale'!D73","v":0},0,0,null,{"$f":"'6. Historical Wholesale'!H73","v":0},0,0,null,{"$f":"'6. Historical Wholesale'!L73","v":0},0,0,null,0]
[]
[null,"Total",null,{"$f":"SUM(D62:D73)","v":0},{"$f":"IF(D75<>0,F75/D75,0)","v":0},{"$f":"SUM(F62:F73)","v":0},null,{"$f":"SUM(H62:H73)","v":0},{"$f":"IF(H75<>0,J75/H75,0)","v":0},{"$f":"SUM(J62:J73)","v":0},null,{"$f":"SUM(L62:L73)","v":0},{"$f":"IF(L75<>0,N75/L75,0)","v":0},{"$f":"SUM(N62:N73)","v":0},null,{"$f":"SUM(P62:P73)","v":0}]
[]
[null,{"$f":"'6. Historical Wholesale'!B77","v":"Add Extra Host Here (II)"},null,"Network",null,null,null,"Line Connection",null,null,null,"Transformation Connection",null,null,null,"Total Line"]
[]
[null,"Month",null,"Units Billed","Rate","Amount",null,"Units Billed","Rate","Amount",null,"Units Billed","Rate","Amount",null,"Amount"]
[]
[null,"January",null,{"$f":"'6. Historical Wholesale'!D81","v":0},{"$f":"'5. UTRs and Sub-Transmission'!I65","v":0},{"$f":"D81*E81","v":0},null,{"$f":"'6. Historical Wholesale'!H81","v":0},{"$f":"'5. UTRs and Sub-Transmission'!I67","v":0},{"$f":"H81*I81","v":0},null,{"$f":"'6. Historical Wholesale'!L81","v":0},{"$f":"'5. UTRs and Sub-Transmission'!I69","v":0},{"$f":"L81*M81","v":0},null,{"$f":"J81+N81","v":0}]
[null,"February",null,{"$f":"'6. Historical Wholesale'!D82","v":0},{"$f":"E81","v":0},0,null,{"$f":"'6. Historical Wholesale'!H82","v":0},{"$f":"I81","v":0},0,null,{"$f":"'6. Historical Wholesale'!L82","v":0},{"$f":"M81","v":0},0,null,0]
[null,"March",null,{"$f":"'6. Historical Wholesale'!D83","v":0},0,0,null,{"$f":"'6. Historical Wholesale'!H83","v":0},0,0,null,{"$f":"'6. Historical Wholesale'!L83","v":0},0,0,null,0]
[null,"April",null,{"$f":"'6. Historical Wholesale'!D84","v":0},0,0,null,{"$f":"'6. Historical Wholesale'!H84","v":0},0,0,null,{"$f":"'6. Historical Wholesale'!L84","v":0},0,0,null,0]
[null,"May",null,{"$f":"'6. Historical Wholesale'!D85","v":0},0,0,null,{"$f":"'6. Historical Wholesale'!H85","v":0},0,0,null,{"$f":"'6. Historical Wholesale'!L85","v":0},0,0,null,0]
[null,"June",null,{"$f":"'6. Historical Wholesale'!D86","v":0},0,0,null,{"$f":"'6. Historical Wholesale'!H86","v":0},0,0,null,{"$f":"'6. Historical Wholesale'!L86","v":0},0,0,null,0]
[null,"July",null,{"$f":"'6. Historical Wholesale'!D87","v":0},0,0,null,{"$f":"'6. Historical Wholesale'!H87","v":0},0,0,null,{"$f":"'6. Historical Wholesale'!L87","v":0},0,0,null,0]
[null,"August",null,{"$f":"'6. Historical Wholesale'!D88","v":0},0,0,null,{"$f":"'6. Historical Wholesale'!H88","v":0},0,0,null,{"$f":"'6. Historical Wholesale'!L88","v":0},0,0,null,0]
[null,"September",null,{"$f":"'6. Historical Wholesale'!D89","v":0},0,0,null,{"$f":"'6. Historical Wholesale'!H89","v":0},0,0,null,{"$f":"'6. Historical Wholesale'!L89","v":0},0,0,null,0]
[null,"October",null,{"$f":"'6. Historical Wholesale'!D90","v":0},0,0,null,{"$f":"'6. Historical Wholesale'!H90","v":0},0,0,null,{"$f":"'6. Historical Wholesale'!L90","v":0},0,0,null,0]
[null,"November",null,{"$f":"'6. Historical Wholesale'!D91","v":0},0,0,null,{"$f":"'6. Historical Wholesale'!H91","v":0},0,0,null,{"$f":"'6. Historical Wholesale'!L91","v":0},0,0,null,0]
[null,"December",null,{"$f":"'6. Historical Wholesale'!D92","v":0},0,0,null,{"$f":"'6. Historical Wholesale'!H92","v":0},0,0,null,{"$f":"'6. Historical Wholesale'!L92","v":0},0,0,null,0]
[]
[null,"Total",null,{"$f":"SUM(D81:D92)","v":0},{"$f":"IF(D94<>0,F94/D94,0)","v":0},{"$f":"SUM(F81:F92)","v":0},null,{"$f":"SUM(H81:H92)","v":0},{"$f":"IF(H94<>0,J94/H94,0)","v":0},{"$f":"SUM(J81:J92)","v":0},null,{"$f":"SUM(L81:L92)","v":0},{"$f":"IF(L94<>0,N94/L94,0)","v":0},{"$f":"SUM(N81:N92)","v":0},null,{"$f":"SUM(P81:P92)","v":0}]
[]
[null,"Total",null,"Network",null,null,null,"Line Connection",null,null,null,"Transformation Connection",null,null,null,"Total Line"]
[]
[null,"Month",null,"Units Billed","Rate","Amount",null,"Units Billed","Rate","Amount",null,"Units Billed","Rate","Amount",null,"Amount"]
[]
[null,"January",null,{"$f":"D24+D43","v":15147},{"$f":"IF(D100<>0,F100/D100,0)","v":3.4565947712418303},{"$f":"F24+F43","v":52357.041000000005},null,{"$f":"H24+H43","v":15852},{"$f":"IF(H100<>0,J100/H100,0)","v":0.78249632853898554},{"$f":"J24+J43","v":12404.131799999999},null,{"$f":"L24+L43","v":15852},{"$f":"IF(L100<>0,N100/L100,0)","v":1.7337282361847084},{"$f":"N24+N43","v":27483.059999999998},null,{"$f":"J100+N100","v":39887.191800000001}]
[null,"February",null,16349,3.4546367361918167,56479.856000000007,null,17327,0.78206216309805499,13550.791099999999,null,17327,1.7308772436082414,29990.909999999996,null,43541.701099999991]
[null,"March",null,14873,3.4678839507832984,51577.837999999996,null,16630,0.78276692122669866,13017.4139,null,16630,1.7355051112447382,28861.449999999997,null,41878.863899999997]
[null,"April",null,14043,3.4661897030549031,48675.702000000005,null,14823,0.78351378938136684,11614.0249,null,14823,1.7404094987519396,25798.09,null,37412.1149]
[null,"May",null,13133.68,3.4719158316633267,45599.031520000004,null,13644.68,0.78381343175508689,10694.883456,null,13644.68,1.7423771316000078,23774.178399999997,null,34469.061856]
[null,"June",null,15174.62,3.4423087319484771,52235.726930000004,null,15802.62,0.78082890394124504,12339.142453999999,null,15802.62,1.7227789189387581,27224.420599999998,null,39563.563053999998]
[null,"July",null,11130.04,3.4896692249084458,38840.158060000002,null,11429.04,0.78525630044168171,8974.7256679999991,null,11429.039999999999,1.751851879072958,20021.985199999999,null,28996.710867999998]
[null,"August",null,16911.099999999999,3.6021825103038836,60916.868650000004,null,17530.099999999999,0.79730551850816589,13976.845469999998,null,17530.099999999999,1.8309743241624405,32097.162999999997,null,46074.008469999993]
[null,"September",null,11943.6,3.4863639857329449,41639.736900000004,null,12086.6,0.7843922873264606,9480.6358199999995,null,12086.6,1.7461782469842635,21105.358,null,30585.99382]
[null,"October",null,11313.9,3.4912922467053797,39500.131349999996,null,11492.43,0.78468552612458797,9017.9434809999984,null,11492.43,1.7481038300864131,20089.960899999998,null,29107.904380999997]
[null,"November",null,12607.5,3.4696472932778106,43743.578249999999,null,13437.76,0.78355338181363554,10529.202292,null,13437.76,1.7406694865810968,23390.698799999998,null,33919.901092]
[null,"December",null,14697.06,3.4668230646129228,50952.106590000003,null,15124,0.78293246495636071,11841.070599999999,null,15124,1.736592171383232,26264.22,null,38105.2906]
[]
[null,"Total",null,{"$f":"SUM(D100:D111)","v":167323.5},{"$f":"IF(D113<>0,F113/D113,0)","v":3.4813865072748302},{"$f":"SUM(F100:F111)","v":582517.77525000006},null,{"$f":"SUM(H100:H111)","v":175179.23},{"$f":"IF(H113<>0,J113/H113,0)","v":0.78457252575547898},{"$f":"SUM(J100:J111)","v":137440.81094099997},null,{"$f":"SUM(L100:L111)","v":175179.22999999998},{"$f":"IF(L113<>0,N113/L113,0)","v":1.7473618013962049},{"$f":"SUM(N100:N111)","v":306101.49490000005},null,{"$f":"SUM(P100:P111)","v":443542.30584099999}]
[]
[null,null,null,null,null,null,null,null,null,null,null,null,null,"Low Voltage Switchgear Credit (if applicable)",null,{"$f":"'5. UTRs and Sub-Transmission'!I95","v":0}]
[]
[null,null,null,null,null,null,null,null,null,null,null,null,null,"Total including deduction for Low Voltage Switchgear Credit",null,{"$f":"P113+P115","v":443542.30584099999}]

{"sheet":"9. Adj Network to Current WS","index":8,"n_rows":49,"n_cols":18,"rows_kept":49,"cut":false,"hidden":false,"merged":[]}
[]
[]
[]
[]
[]
[]
[]
[]
[]
[]
[]
[]
[null,"The purpose of this sheet is to re-align the current RTS Network Rates to recover current wholesale network costs."]
[]
[]
[]
[]
[]
[]
[]
[]
[null,"Rate Class",null,"Unit",null,"Current RTSR-Network",null,"Loss Adjusted Billed kWh",null,"Loss Adjusted Billed kW",null,"Billed Amount",null,"Billed Amount %",null,"Current Wholesale Billing",null,"Proposed RTSR Network"]
[]
[]
[null,{"$f":"IF('3. Rate Classes'!Q24=1,'3. Rate Classes'!C24, 0)","v":"Residential"},null,{"$f":"IF(ISERROR(VLOOKUP($B25, '3. Rate Classes'!$C$24:$H$45,6,0)), \"\", VLOOKUP($B25, '3. Rate Classes'!$C$24:$H$45,6,0))","v":"kWh"},null,{"$f":"IF(ISERROR(VLOOKUP($B25,'3. Rate Classes'!$C$24:$N$45, 8,0)), \"\", VLOOKUP($B25,'3. Rate Classes'!$C$24:$N$45, 8,0))","v":6.1000000000000004E-3},null,{"$f":"VLOOKUP('9. Adj Network to Current WS'!$B25, '4. RRR Data'!$B$27:$M$49,11,0)","v":25939733.634643521},null,{"$f":"VLOOKUP('9. Adj Network to Current WS'!$B25, '4. RRR Data'!$B$27:$M$49,12,0)","v":0},null,{"$f":"IF(F25=\"\", \"\", IF(D25=\"kWh\", F25*H25, F25*J25))","v":158232.37517132549},null,{"$f":"IF(ISERROR(L25/$L$49), \"\", L25/$L$49)","v":0.28657608317132993},null,{"$f":"IF(ISERROR('7. Current Wholesale'!$F$113*N25), \"\", '7. Current Wholesale'!$F$113*N25)","v":168580.73092106089},null,{"$f":"IF(D25=\"\",\"\",IF(D25=\"kWh\",IF(H25<>0,P25/H25,),IF(J25<>0,P25/J25,0)))","v":6.4989383968043057E-3}]
[null,{"$f":"IF('3. Rate Classes'!Q25=1,'3. Rate Classes'!C25, 0)","v":"General Service Less Than 50 kW"},null,{"$f":"IF(ISERROR(VLOOKUP($B26, '3. Rate Classes'!$C$24:$H$45,6,0)), \"\", VLOOKUP($B26, '3. Rate Classes'!$C$24:$H$45,6,0))","v":"kWh"},null,{"$f":"IF(ISERROR(VLOOKUP($B26,'3. Rate Classes'!$C$24:$N$45, 8,0)), \"\", VLOOKUP($B26,'3. Rate Classes'!$C$24:$N$45, 8,0))","v":5.5999999999999999E-3},null,{"$f":"VLOOKUP('9. Adj Network to Current WS'!$B26, '4. RRR Data'!$B$27:$M$49,11,0)","v":11646924.491808346},null,{"$f":"VLOOKUP('9. Adj Network to Current WS'!$B26, '4. RRR Data'!$B$27:$M$49,12,0)","v":0},null,{"$f":"IF(F26=\"\", \"\", IF(D26=\"kWh\", F26*H26, F26*J26))","v":65222.777154126736},null,{"$f":"IF(ISERROR(L26/$L$49), \"\", L26/$L$49)","v":0.11812556052545012},null,{"$f":"IF(ISERROR('7. Current Wholesale'!$F$113*N26), \"\", '7. Current Wholesale'!$F$113*N26)","v":69488.329638223746},null,{"$f":"IF(D26=\"\",\"\",IF(D26=\"kWh\",IF(H26<>0,P26/H26,),IF(J26<>0,P26/J26,0)))","v":5.9662385282137883E-3}]
[null,{"$f":"IF('3. Rate Classes'!Q26=1,'3. Rate Classes'!C26, 0)","v":"General Service 50 to 1,499 kW"},null,{"$f":"IF(ISERROR(VLOOKUP($B27, '3. Rate Classes'!$C$24:$H$45,6,0)), \"\", VLOOKUP($B27, '3. Rate Classes'!$C$24:$H$45,6,0))","v":"kW"},null,{"$f":"IF(ISERROR(VLOOKUP($B27,'3. Rate Classes'!$C$24:$N$45, 8,0)), \"\", VLOOKUP($B27,'3. Rate Classes'!$C$24:$N$45, 8,0))","v":2.3025000000000002},null,{"$f":"VLOOKUP('9. Adj Network to Current WS'!$B27, '4. RRR Data'!$B$27:$M$49,11,0)","v":22758006.239060923},null,{"$f":"VLOOKUP('9. Adj Network to Current WS'!$B27, '4. RRR Data'!$B$27:$M$49,12,0)","v":65159.5},null,150029.74875000003,null,0.27172023240756599,null,{"$f":"IF(ISERROR('7. Current Wholesale'!$F$113*N27), \"\", '7. Current Wholesale'!$F$113*N27)","v":159841.65488758651},null,2.45308289485933]
[null,{"$f":"IF('3. Rate Classes'!Q27=1,'3. Rate Classes'!C27, 0)","v":"General Service Intermediate 1,000 To 4,999 kW"},null,{"$f":"IF(ISERROR(VLOOKUP($B28, '3. Rate Classes'!$C$24:$H$45,6,0)), \"\", VLOOKUP($B28, '3. Rate Classes'!$C$24:$H$45,6,0))","v":"kW"},null,{"$f":"IF(ISERROR(VLOOKUP($B28,'3. Rate Classes'!$C$24:$N$45, 8,0)), \"\", VLOOKUP($B28,'3. Rate Classes'!$C$24:$N$45, 8,0))","v":2.5752999999999999},null,{"$f":"VLOOKUP('9. Adj Network to Current WS'!$B28, '4. RRR Data'!$B$27:$M$49,11,0)","v":21805339},null,{"$f":"VLOOKUP('9. Adj Network to Current WS'!$B28, '4. RRR Data'!$B$27:$M$49,12,0)","v":61715.849999999991},null,158936.82850499998,null,0.28785192496364859,null,{"$f":"IF(ISERROR('7. Current Wholesale'!$F$113*N28), \"\", '7. Current Wholesale'!$F$113*N28)","v":169331.25531761401},null,2.7437239431623164]
[null,{"$f":"IF('3. Rate Classes'!Q28=1,'3. Rate Classes'!C28, 0)","v":"Sentinel Lighting"},null,{"$f":"IF(ISERROR(VLOOKUP($B29, '3. Rate Classes'!$C$24:$H$45,6,0)), \"\", VLOOKUP($B29, '3. Rate Classes'!$C$24:$H$45,6,0))","v":"kW"},null,{"$f":"IF(ISERROR(VLOOKUP($B29,'3. Rate Classes'!$C$24:$N$45, 8,0)), \"\", VLOOKUP($B29,'3. Rate Classes'!$C$24:$N$45, 8,0))","v":1.7453000000000001},null,{"$f":"VLOOKUP('9. Adj Network to Current WS'!$B29, '4. RRR Data'!$B$27:$M$49,11,0)","v":21276},null,{"$f":"VLOOKUP('9. Adj Network to Current WS'!$B29, '4. RRR Data'!$B$27:$M$49,12,0)","v":72},null,125.66160000000001,null,2.2758685821438858E-4,null,{"$f":"IF(ISERROR('7. Current Wholesale'!$F$113*N29), \"\", '7. Current Wholesale'!$F$113*N29)","v":133.87983561374818},null,1.8594421613020582]
[null,{"$f":"IF('3. Rate Classes'!Q29=1,'3. Rate Classes'!C29, 0)","v":"Street Lighting"},null,{"$f":"IF(ISERROR(VLOOKUP($B30, '3. Rate Classes'!$C$24:$H$45,6,0)), \"\", VLOOKUP($B30, '3. Rate Classes'!$C$24:$H$45,6,0))","v":"kW"},null,{"$f":"IF(ISERROR(VLOOKUP($B30,'3. Rate Classes'!$C$24:$N$45, 8,0)), \"\", VLOOKUP($B30,'3. Rate Classes'!$C$24:$N$45, 8,0))","v":1.7363999999999999},null,{"$f":"VLOOKUP('9. Adj Network to Current WS'!$B30, '4. RRR Data'!$B$27:$M$49,11,0)","v":1026377},null,{"$f":"VLOOKUP('9. Adj Network to Current WS'!$B30, '4. RRR Data'!$B$27:$M$49,12,0)","v":11288},null,19600.483199999999,null,3.5498612073791076E-2,null,{"$f":"IF(ISERROR('7. Current Wholesale'!$F$113*N30), \"\", '7. Current Wholesale'!$F$113*N30)","v":20882.349649901262},null,1.8499601036411466]
[null,{"$f":"IF('3. Rate Classes'!Q30=1,'3. Rate Classes'!C30, 0)","v":0},null,{"$f":"IF(ISERROR(VLOOKUP($B31, '3. Rate Classes'!$C$24:$H$45,6,0)), \"\", VLOOKUP($B31, '3. Rate Classes'!$C$24:$H$45,6,0))","v":""},null,{"$f":"IF(ISERROR(VLOOKUP($B31,'3. Rate Classes'!$C$24:$N$45, 8,0)), \"\", VLOOKUP($B31,'3. Rate Classes'!$C$24:$N$45, 8,0))","v":""},null,{"$f":"VLOOKUP('9. Adj Network to Current WS'!$B31, '4. RRR Data'!$B$27:$M$49,11,0)","v":0},null,{"$f":"VLOOKUP('9. Adj Network to Current WS'!$B31, '4. RRR Data'!$B$27:$M$49,12,0)","v":0},null,"",null,"",null,{"$f":"IF(ISERROR('7. Current Wholesale'!$F$113*N31), \"\", '7. Current Wholesale'!$F$113*N31)","v":""},null,""]
[null,{"$f":"IF('3. Rate Classes'!Q31=1,'3. Rate Classes'!C31, 0)","v":0},null,{"$f":"IF(ISERROR(VLOOKUP($B32, '3. Rate Classes'!$C$24:$H$45,6,0)), \"\", VLOOKUP($B32, '3. Rate Classes'!$C$24:$H$45,6,0))","v":""},null,{"$f":"IF(ISERROR(VLOOKUP($B32,'3. Rate Classes'!$C$24:$N$45, 8,0)), \"\", VLOOKUP($B32,'3. Rate Classes'!$C$24:$N$45, 8,0))","v":""},null,{"$f":"VLOOKUP('9. Adj Network to Current WS'!$B32, '4. RRR Data'!$B$27:$M$49,11,0)","v":0},null,{"$f":"VLOOKUP('9. Adj Network to Current WS'!$B32, '4. RRR Data'!$B$27:$M$49,12,0)","v":0},null,"",null,"",null,{"$f":"IF(ISERROR('7. Current Wholesale'!$F$113*N32), \"\", '7. Current Wholesale'!$F$113*N32)","v":""},null,""]
[null,{"$f":"IF('3. Rate Classes'!Q32=1,'3. Rate Classes'!C32, 0)","v":0},null,{"$f":"IF(ISERROR(VLOOKUP($B33, '3. Rate Classes'!$C$24:$H$45,6,0)), \"\", VLOOKUP($B33, '3. Rate Classes'!$C$24:$H$45,6,0))","v":""},null,{"$f":"IF(ISERROR(VLOOKUP($B33,'3. Rate Classes'!$C$24:$N$45, 8,0)), \"\", VLOOKUP($B33,'3. Rate Classes'!$C$24:$N$45, 8,0))","v":""},null,{"$f":"VLOOKUP('9. Adj Network to Current WS'!$B33, '4. RRR Data'!$B$27:$M$49,11,0)","v":0},null,{"$f":"VLOOKUP('9. Adj Network to Current WS'!$B33, '4. RRR Data'!$B$27:$M$49,12,0)","v":0},null,"",null,"",null,{"$f":"IF(ISERROR('7. Current Wholesale'!$F$113*N33), \"\", '7. Current Wholesale'!$F$113*N33)","v":""},null,""]
[null,{"$f":"IF('3. Rate Classes'!Q33=1,'3. Rate Classes'!C33, 0)","v":0},null,{"$f":"IF(ISERROR(VLOOKUP($B34, '3. Rate Classes'!$C$24:$H$45,6,0)), \"\", VLOOKUP($B34, '3. Rate Classes'!$C$24:$H$45,6,0))","v":""},null,{"$f":"IF(ISERROR(VLOOKUP($B34,'3. Rate Classes'!$C$24:$N$45, 8,0)), \"\", VLOOKUP($B34,'3. Rate Classes'!$C$24:$N$45, 8,0))","v":""},null,{"$f":"VLOOKUP('9. Adj Network to Current WS'!$B34, '4. RRR Data'!$B$27:$M$49,11,0)","v":0},null,{"$f":"VLOOKUP('9. Adj Network to Current WS'!$B34, '4. RRR Data'!$B$27:$M$49,12,0)","v":0},null,"",null,"",null,{"$f":"IF(ISERROR('7. Current Wholesale'!$F$113*N34), \"\", '7. Current Wholesale'!$F$113*N34)","v":""},null,""]
[null,{"$f":"IF('3. Rate Classes'!Q34=1,'3. Rate Classes'!C34, 0)","v":0},null,{"$f":"IF(ISERROR(VLOOKUP($B35, '3. Rate Classes'!$C$24:$H$45,6,0)), \"\", VLOOKUP($B35, '3. Rate Classes'!$C$24:$H$45,6,0))","v":""},null,{"$f":"IF(ISERROR(VLOOKUP($B35,'3. Rate Classes'!$C$24:$N$45, 8,0)), \"\", VLOOKUP($B35,'3. Rate Classes'!$C$24:$N$45, 8,0))","v":""},null,{"$f":"VLOOKUP('9. Adj Network to Current WS'!$B35, '4. RRR Data'!$B$27:$M$49,11,0)","v":0},null,{"$f":"VLOOKUP('9. Adj Network to Current WS'!$B35, '4. RRR Data'!$B$27:$M$49,12,0)","v":0},null,"",null,"",null,{"$f":"IF(ISERROR('7. Current Wholesale'!$F$113*N35), \"\", '7. Current Wholesale'!$F$113*N35)","v":""},null,""]
[null,{"$f":"IF('3. Rate Classes'!Q35=1,'3. Rate Classes'!C35, 0)","v":0},null,{"$f":"IF(ISERROR(VLOOKUP($B36, '3. Rate Classes'!$C$24:$H$45,6,0)), \"\", VLOOKUP($B36, '3. Rate Classes'!$C$24:$H$45,6,0))","v":""},null,{"$f":"IF(ISERROR(VLOOKUP($B36,'3. Rate Classes'!$C$24:$N$45, 8,0)), \"\", VLOOKUP($B36,'3. Rate Classes'!$C$24:$N$45, 8,0))","v":""},null,{"$f":"VLOOKUP('9. Adj Network to Current WS'!$B36, '4. RRR Data'!$B$27:$M$49,11,0)","v":0},null,{"$f":"VLOOKUP('9. Adj Network to Current WS'!$B36, '4. RRR Data'!$B$27:$M$49,12,0)","v":0},null,"",null,"",null,{"$f":"IF(ISERROR('7. Current Wholesale'!$F$113*N36), \"\", '7. Current Wholesale'!$F$113*N36)","v":""},null,""]
[null,{"$f":"IF('3. Rate Classes'!Q36=1,'3. Rate Classes'!C36, 0)","v":0},null,{"$f":"IF(ISERROR(VLOOKUP($B37, '3. Rate Classes'!$C$24:$H$45,6,0)), \"\", VLOOKUP($B37, '3. Rate Classes'!$C$24:$H$45,6,0))","v":""},null,{"$f":"IF(ISERROR(VLOOKUP($B37,'3. Rate Classes'!$C$24:$N$45, 8,0)), \"\", VLOOKUP($B37,'3. Rate Classes'!$C$24:$N$45, 8,0))","v":""},null,{"$f":"VLOOKUP('9. Adj Network to Current WS'!$B37, '4. RRR Data'!$B$27:$M$49,11,0)","v":0},null,{"$f":"VLOOKUP('9. Adj Network to Current WS'!$B37, '4. RRR Data'!$B$27:$M$49,12,0)","v":0},null,"",null,"",null,{"$f":"IF(ISERROR('7. Current Wholesale'!$F$113*N37), \"\", '7. Current Wholesale'!$F$113*N37)","v":""},null,""]
[null,{"$f":"IF('3. Rate Classes'!Q37=1,'3. Rate Classes'!C37, 0)","v":0},null,{"$f":"IF(ISERROR(VLOOKUP($B38, '3. Rate Classes'!$C$24:$H$45,6,0)), \"\", VLOOKUP($B38, '3. Rate Classes'!$C$24:$H$45,6,0))","v":""},null,{"$f":"IF(ISERROR(VLOOKUP($B38,'3. Rate Classes'!$C$24:$N$45, 8,0)), \"\", VLOOKUP($B38,'3. Rate Classes'!$C$24:$N$45, 8,0))","v":""},null,{"$f":"VLOOKUP('9. Adj Network to Current WS'!$B38, '4. RRR Data'!$B$27:$M$49,11,0)","v":0},null,{"$f":"VLOOKUP('9. Adj Network to Current WS'!$B38, '4. RRR Data'!$B$27:$M$49,12,0)","v":0},null,"",null,"",null,{"$f":"IF(ISERROR('7. Current Wholesale'!$F$113*N38), \"\", '7. Current Wholesale'!$F$113*N38)","v":""},null,""]
[null,{"$f":"IF('3. Rate Classes'!Q38=1,'3. Rate Classes'!C38, 0)","v":0},null,{"$f":"IF(ISERROR(VLOOKUP($B39, '3. Rate Classes'!$C$24:$H$45,6,0)), \"\", VLOOKUP($B39, '3. Rate Classes'!$C$24:$H$45,6,0))","v":""},null,{"$f":"IF(ISERROR(VLOOKUP($B39,'3. Rate Classes'!$C$24:$N$45, 8,0)), \"\", VLOOKUP($B39,'3. Rate Classes'!$C$24:$N$45, 8,0))","v":""},null,{"$f":"VLOOKUP('9. Adj Network to Current WS'!$B39, '4. RRR Data'!$B$27:$M$49,11,0)","v":0},null,{"$f":"VLOOKUP('9. Adj Network to Current WS'!$B39, '4. RRR Data'!$B$27:$M$49,12,0)","v":0},null,{"$f":"IF(F39=\"\", \"\", IF(D39=\"kWh\", F39*H39, F39*J39))","v":""},null,"",null,{"$f":"IF(ISERROR('7. Current Wholesale'!$F$113*N39), \"\", '7. Current Wholesale'!$F$113*N39)","v":""},null,""]
[null,{"$f":"IF('3. Rate Classes'!Q39=1,'3. Rate Classes'!C39, 0)","v":0},null,{"$f":"IF(ISERROR(VLOOKUP($B40, '3. Rate Classes'!$C$24:$H$45,6,0)), \"\", VLOOKUP($B40, '3. Rate Classes'!$C$24:$H$45,6,0))","v":""},null,{"$f":"IF(ISERROR(VLOOKUP($B40,'3. Rate Classes'!$C$24:$N$45, 8,0)), \"\", VLOOKUP($B40,'3. Rate Classes'!$C$24:$N$45, 8,0))","v":""},null,{"$f":"VLOOKUP('9. Adj Network to Current WS'!$B40, '4. RRR Data'!$B$27:$M$49,11,0)","v":0},null,{"$f":"VLOOKUP('9. Adj Network to Current WS'!$B40, '4. RRR Data'!$B$27:$M$49,12,0)","v":0},null,"",null,"",null,{"$f":"IF(ISERROR('7. Current Wholesale'!$F$113*N40), \"\", '7. Current Wholesale'!$F$113*N40)","v":""},null,""]
[null,{"$f":"IF('3. Rate Classes'!Q40=1,'3. Rate Classes'!C40, 0)","v":0},null,{"$f":"IF(ISERROR(VLOOKUP($B41, '3. Rate Classes'!$C$24:$H$45,6,0)), \"\", VLOOKUP($B41, '3. Rate Classes'!$C$24:$H$45,6,0))","v":""},null,{"$f":"IF(ISERROR(VLOOKUP($B41,'3. Rate Classes'!$C$24:$N$45, 8,0)), \"\", VLOOKUP($B41,'3. Rate Classes'!$C$24:$N$45, 8,0))","v":""},null,{"$f":"VLOOKUP('9. Adj Network to Current WS'!$B41, '4. RRR Data'!$B$27:$M$49,11,0)","v":0},null,{"$f":"VLOOKUP('9. Adj Network to Current WS'!$B41, '4. RRR Data'!$B$27:$M$49,12,0)","v":0},null,"",null,"",null,{"$f":"IF(ISERROR('7. Current Wholesale'!$F$113*N41), \"\", '7. Current Wholesale'!$F$113*N41)","v":""},null,""]
[null,{"$f":"IF('3. Rate Classes'!Q41=1,'3. Rate Classes'!C41, 0)","v":0},null,{"$f":"IF(ISERROR(VLOOKUP($B42, '3. Rate Classes'!$C$24:$H$45,6,0)), \"\", VLOOKUP($B42, '3. Rate Classes'!$C$24:$H$45,6,0))","v":""},null,{"$f":"IF(ISERROR(VLOOKUP($B42,'3. Rate Classes'!$C$24:$N$45, 8,0)), \"\", VLOOKUP($B42,'3. Rate Classes'!$C$24:$N$45, 8,0))","v":""},null,{"$f":"VLOOKUP('9. Adj Network to Current WS'!$B42, '4. RRR Data'!$B$27:$M$49,11,0)","v":0},null,{"$f":"VLOOKUP('9. Adj Network to Current WS'!$B42, '4. RRR Data'!$B$27:$M$49,12,0)","v":0},null,"",null,"",null,{"$f":"IF(ISERROR('7. Current Wholesale'!$F$113*N42), \"\", '7. Current Wholesale'!$F$113*N42)","v":""},null,""]
[null,{"$f":"IF('3. Rate Classes'!Q42=1,'3. Rate Classes'!C42, 0)","v":0},null,{"$f":"IF(ISERROR(VLOOKUP($B43, '3. Rate Classes'!$C$24:$H$45,6,0)), \"\", VLOOKUP($B43, '3. Rate Classes'!$C$24:$H$45,6,0))","v":""},null,{"$f":"IF(ISERROR(VLOOKUP($B43,'3. Rate Classes'!$C$24:$N$45, 8,0)), \"\", VLOOKUP($B43,'3. Rate Classes'!$C$24:$N$45, 8,0))","v":""},null,{"$f":"VLOOKUP('9. Adj Network to Current WS'!$B43, '4. RRR Data'!$B$27:$M$49,11,0)","v":0},null,{"$f":"VLOOKUP('9. Adj Network to Current WS'!$B43, '4. RRR Data'!$B$27:$M$49,12,0)","v":0},null,"",null,"",null,{"$f":"IF(ISERROR('7. Current Wholesale'!$F$113*N43), \"\", '7. Current Wholesale'!$F$113*N43)","v":""},null,""]
[null,{"$f":"IF('3. Rate Classes'!Q43=1,'3. Rate Classes'!C43, 0)","v":0},null,{"$f":"IF(ISERROR(VLOOKUP($B44, '3. Rate Classes'!$C$24:$H$45,6,0)), \"\", VLOOKUP($B44, '3. Rate Classes'!$C$24:$H$45,6,0))","v":""},null,{"$f":"IF(ISERROR(VLOOKUP($B44,'3. Rate Classes'!$C$24:$N$45, 8,0)), \"\", VLOOKUP($B44,'3. Rate Classes'!$C$24:$N$45, 8,0))","v":""},null,{"$f":"VLOOKUP('9. Adj Network to Current WS'!$B44, '4. RRR Data'!$B$27:$M$49,11,0)","v":0},null,{"$f":"VLOOKUP('9. Adj Network to Current WS'!$B44, '4. RRR Data'!$B$27:$M$49,12,0)","v":0},null,"",null,"",null,{"$f":"IF(ISERROR('7. Current Wholesale'!$F$113*N44), \"\", '7. Current Wholesale'!$F$113*N44)","v":""},null,""]
[null,{"$f":"IF('3. Rate Classes'!Q44=1,'3. Rate Classes'!C44, 0)","v":0},null,{"$f":"IF(ISERROR(VLOOKUP($B45, '3. Rate Classes'!$C$24:$H$45,6,0)), \"\", VLOOKUP($B45, '3. Rate Classes'!$C$24:$H$45,6,0))","v":""},null,{"$f":"IF(ISERROR(VLOOKUP($B45,'3. Rate Classes'!$C$24:$N$45, 8,0)), \"\", VLOOKUP($B45,'3. Rate Classes'!$C$24:$N$45, 8,0))","v":""},null,{"$f":"VLOOKUP('9. Adj Network to Current WS'!$B45, '4. RRR Data'!$B$27:$M$49,11,0)","v":0},null,{"$f":"VLOOKUP('9. Adj Network to Current WS'!$B45, '4. RRR Data'!$B$27:$M$49,12,0)","v":0},null,"",null,"",null,{"$f":"IF(ISERROR('7. Current Wholesale'!$F$113*N45), \"\", '7. Current Wholesale'!$F$113*N45)","v":""},null,""]
[null,{"$f":"IF('3. Rate Classes'!Q45=1,'3. Rate Classes'!C45, 0)","v":0},null,{"$f":"IF(ISERROR(VLOOKUP($B46, '3. Rate Classes'!$C$24:$H$45,6,0)), \"\", VLOOKUP($B46, '3. Rate Classes'!$C$24:$H$45,6,0))","v":""},null,{"$f":"IF(ISERROR(VLOOKUP($B46,'3. Rate Classes'!$C$24:$N$45, 8,0)), \"\", VLOOKUP($B46,'3. Rate Classes'!$C$24:$N$45, 8,0))","v":""},null,{"$f":"VLOOKUP('9. Adj Network to Current WS'!$B46, '4. RRR Data'!$B$27:$M$49,11,0)","v":0},null,{"$f":"VLOOKUP('9. Adj Network to Current WS'!$B46, '4. RRR Data'!$B$27:$M$49,12,0)","v":0},null,"",null,"",null,{"$f":"IF(ISERROR('7. Current Wholesale'!$F$113*N46), \"\", '7. Current Wholesale'!$F$113*N46)","v":""},null,""]
[]
[]
[null,null,null,null,null,null,null,null,null,null,null,{"$f":"SUM(L25:L46)","v":552147.87438045221}]

{"sheet":"10. Adj Conn. to Current WS","index":9,"n_rows":49,"n_cols":18,"rows_kept":49,"cut":false,"hidden":false,"merged":[]}
[]
[]
[]
[]
[]
[]
[]
[]
[]
[]
[]
[]
[null,"The purpose of this sheet is to re-align the current RTS Connection Rates to recover current wholesale connection costs."]
[]
[]
[]
[]
[]
[]
[]
[]
[null,"Rate Class",null,"Unit",null,"Current RTSR-Connection",null,"Loss Adjusted Billed kWh",null,"Loss Adjusted Billed kW",null,"Billed Amount",null,"Billed Amount %",null,"Current Wholesale Billing",null,"Proposed RTSR Connection"]
[]
[]
[null,{"$f":"IF('3. Rate Classes'!Q24=1,'3. Rate Classes'!C24, 0)","v":"Residential"},null,{"$f":"IF(ISERROR(VLOOKUP($B25, '3. Rate Classes'!$C$24:$H$45,6,0)), \"\", VLOOKUP($B25, '3. Rate Classes'!$C$24:$H$45,6,0))","v":"kWh"},null,{"$f":"IF(ISERROR(VLOOKUP($B25,'3. Rate Classes'!$C$24:$N$45, 11,0)), \"\", VLOOKUP($B25,'3. Rate Classes'!$C$24:$N$45, 11,0))","v":4.7999999999999996E-3},null,{"$f":"VLOOKUP('9. Adj Network to Current WS'!$B25, '4. RRR Data'!$B$27:$M$49,11,0)","v":25939733.634643521},null,{"$f":"VLOOKUP('9. Adj Network to Current WS'!$B25, '4. RRR Data'!$B$27:$M$49,12,0)","v":0},null,{"$f":"IF(F25=\"\", \"\", IF(D25=\"kWh\", F25*H25, F25*J25))","v":124510.7214462889},null,{"$f":"IF(ISERROR(L25/$L$49), \"\", L25/$L$49)","v":0.29427349658613783},null,{"$f":"IF(ISERROR('7. Current Wholesale'!$P$117*N25), \"\", '7. Current Wholesale'!$P$117*N25)","v":128466.86411900517},null,{"$f":"IF(D25=\"\",\"\",IF(D25=\"kWh\",IF(H25<>0,P25/H25,),IF(J25<>0,P25/J25,0)))","v":4.9525128487608169E-3}]
[null,{"$f":"IF('3. Rate Classes'!Q25=1,'3. Rate Classes'!C25, 0)","v":"General Service Less Than 50 kW"},null,{"$f":"IF(ISERROR(VLOOKUP($B26, '3. Rate Classes'!$C$24:$H$45,6,0)), \"\", VLOOKUP($B26, '3. Rate Classes'!$C$24:$H$45,6,0))","v":"kWh"},null,{"$f":"IF(ISERROR(VLOOKUP($B26,'3. Rate Classes'!$C$24:$N$45, 11,0)), \"\", VLOOKUP($B26,'3. Rate Classes'!$C$24:$N$45, 11,0))","v":4.1999999999999997E-3},null,{"$f":"VLOOKUP('9. Adj Network to Current WS'!$B26, '4. RRR Data'!$B$27:$M$49,11,0)","v":11646924.491808346},null,{"$f":"VLOOKUP('9. Adj Network to Current WS'!$B26, '4. RRR Data'!$B$27:$M$49,12,0)","v":0},null,48917.082865595046,null,0.11561254204010199,null,{"$f":"IF(ISERROR('7. Current Wholesale'!$P$117*N26), \"\", '7. Current Wholesale'!$P$117*N26)","v":50471.350294949392},null,4.3334487426657147E-3]
[null,{"$f":"IF('3. Rate Classes'!Q26=1,'3. Rate Classes'!C26, 0)","v":"General Service 50 to 1,499 kW"},null,{"$f":"IF(ISERROR(VLOOKUP($B27, '3. Rate Classes'!$C$24:$H$45,6,0)), \"\", VLOOKUP($B27, '3. Rate Classes'!$C$24:$H$45,6,0))","v":"kW"},null,{"$f":"IF(ISERROR(VLOOKUP($B27,'3. Rate Classes'!$C$24:$N$45, 11,0)), \"\", VLOOKUP($B27,'3. Rate Classes'!$C$24:$N$45, 11,0))","v":1.7024999999999999},null,{"$f":"VLOOKUP('9. Adj Network to Current WS'!$B27, '4. RRR Data'!$B$27:$M$49,11,0)","v":22758006.239060923},null,{"$f":"VLOOKUP('9. Adj Network to Current WS'!$B27, '4. RRR Data'!$B$27:$M$49,12,0)","v":65159.5},null,110934.04874999999,null,0.26218585867082828,null,{"$f":"IF(ISERROR('7. Current Wholesale'!$P$117*N27), \"\", '7. Current Wholesale'!$P$117*N27)","v":114458.81287488205},null,1.7565944010448522]
[null,{"$f":"IF('3. Rate Classes'!Q27=1,'3. Rate Classes'!C27, 0)","v":"General Service Intermediate 1,000 To 4,999 kW"},null,{"$f":"IF(ISERROR(VLOOKUP($B28, '3. Rate Classes'!$C$24:$H$45,6,0)), \"\", VLOOKUP($B28, '3. Rate Classes'!$C$24:$H$45,6,0))","v":"kW"},null,{"$f":"IF(ISERROR(VLOOKUP($B28,'3. Rate Classes'!$C$24:$N$45, 11,0)), \"\", VLOOKUP($B28,'3. Rate Classes'!$C$24:$N$45, 11,0))","v":2.0081000000000002},null,{"$f":"VLOOKUP('9. Adj Network to Current WS'!$B28, '4. RRR Data'!$B$27:$M$49,11,0)","v":21805339},null,{"$f":"VLOOKUP('9. Adj Network to Current WS'!$B28, '4. RRR Data'!$B$27:$M$49,12,0)","v":61715.849999999991},null,123931.59838499999,null,0.29290477454983777,null,{"$f":"IF(ISERROR('7. Current Wholesale'!$P$117*N28), \"\", '7. Current Wholesale'!$P$117*N28)","v":127869.34028524539},null,2.0719043857492916]
[null,{"$f":"IF('3. Rate Classes'!Q28=1,'3. Rate Classes'!C28, 0)","v":"Sentinel Lighting"},null,{"$f":"IF(ISERROR(VLOOKUP($B29, '3. Rate Classes'!$C$24:$H$45,6,0)), \"\", VLOOKUP($B29, '3. Rate Classes'!$C$24:$H$45,6,0))","v":"kW"},null,{"$f":"IF(ISERROR(VLOOKUP($B29,'3. Rate Classes'!$C$24:$N$45, 11,0)), \"\", VLOOKUP($B29,'3. Rate Classes'!$C$24:$N$45, 11,0))","v":1.3313999999999999},null,{"$f":"VLOOKUP('9. Adj Network to Current WS'!$B29, '4. RRR Data'!$B$27:$M$49,11,0)","v":21276},null,{"$f":"VLOOKUP('9. Adj Network to Current WS'!$B29, '4. RRR Data'!$B$27:$M$49,12,0)","v":72},null,95.860799999999998,null,2.2656115452445827E-4,null,{"$f":"IF(ISERROR('7. Current Wholesale'!$P$117*N29), \"\", '7. Current Wholesale'!$P$117*N29)","v":98.906634102602283},null,1.3737032514250318]
[null,{"$f":"IF('3. Rate Classes'!Q29=1,'3. Rate Classes'!C29, 0)","v":"Street Lighting"},null,{"$f":"IF(ISERROR(VLOOKUP($B30, '3. Rate Classes'!$C$24:$H$45,6,0)), \"\", VLOOKUP($B30, '3. Rate Classes'!$C$24:$H$45,6,0))","v":"kW"},null,{"$f":"IF(ISERROR(VLOOKUP($B30,'3. Rate Classes'!$C$24:$N$45, 11,0)), \"\", VLOOKUP($B30,'3. Rate Classes'!$C$24:$N$45, 11,0))","v":1.3043},null,{"$f":"VLOOKUP('9. Adj Network to Current WS'!$B30, '4. RRR Data'!$B$27:$M$49,11,0)","v":1026377},null,{"$f":"VLOOKUP('9. Adj Network to Current WS'!$B30, '4. RRR Data'!$B$27:$M$49,12,0)","v":11288},null,14722.938400000001,null,3.4796766998569602E-2,null,{"$f":"IF(ISERROR('7. Current Wholesale'!$P$117*N30), \"\", '7. Current Wholesale'!$P$117*N30)","v":15190.737832815425},null,1.3457421892997363]
[null,{"$f":"IF('3. Rate Classes'!Q30=1,'3. Rate Classes'!C30, 0)","v":0},null,{"$f":"IF(ISERROR(VLOOKUP($B31, '3. Rate Classes'!$C$24:$H$45,6,0)), \"\", VLOOKUP($B31, '3. Rate Classes'!$C$24:$H$45,6,0))","v":""},null,{"$f":"IF(ISERROR(VLOOKUP($B31,'3. Rate Classes'!$C$24:$N$45, 11,0)), \"\", VLOOKUP($B31,'3. Rate Classes'!$C$24:$N$45, 11,0))","v":""},null,{"$f":"VLOOKUP('9. Adj Network to Current WS'!$B31, '4. RRR Data'!$B$27:$M$49,11,0)","v":0},null,{"$f":"VLOOKUP('9. Adj Network to Current WS'!$B31, '4. RRR Data'!$B$27:$M$49,12,0)","v":0},null,"",null,"",null,{"$f":"IF(ISERROR('7. Current Wholesale'!$P$117*N31), \"\", '7. Current Wholesale'!$P$117*N31)","v":""},null,""]
[null,{"$f":"IF('3. Rate Classes'!Q31=1,'3. Rate Classes'!C31, 0)","v":0},null,{"$f":"IF(ISERROR(VLOOKUP($B32, '3. Rate Classes'!$C$24:$H$45,6,0)), \"\", VLOOKUP($B32, '3. Rate Classes'!$C$24:$H$45,6,0))","v":""},null,{"$f":"IF(ISERROR(VLOOKUP($B32,'3. Rate Classes'!$C$24:$N$45, 11,0)), \"\", VLOOKUP($B32,'3. Rate Classes'!$C$24:$N$45, 11,0))","v":""},null,{"$f":"VLOOKUP('9. Adj Network to Current WS'!$B32, '4. RRR Data'!$B$27:$M$49,11,0)","v":0},null,{"$f":"VLOOKUP('9. Adj Network to Current WS'!$B32, '4. RRR Data'!$B$27:$M$49,12,0)","v":0},null,"",null,"",null,{"$f":"IF(ISERROR('7. Current Wholesale'!$P$117*N32), \"\", '7. Current Wholesale'!$P$117*N32)","v":""},null,""]
[null,{"$f":"IF('3. Rate Classes'!Q32=1,'3. Rate Classes'!C32, 0)","v":0},null,{"$f":"IF(ISERROR(VLOOKUP($B33, '3. Rate Classes'!$C$24:$H$45,6,0)), \"\", VLOOKUP($B33, '3. Rate Classes'!$C$24:$H$45,6,0))","v":""},null,{"$f":"IF(ISERROR(VLOOKUP($B33,'3. Rate Classes'!$C$24:$N$45, 11,0)), \"\", VLOOKUP($B33,'3. Rate Classes'!$C$24:$N$45, 11,0))","v":""},null,{"$f":"VLOOKUP('9. Adj Network to Current WS'!$B33, '4. RRR Data'!$B$27:$M$49,11,0)","v":0},null,{"$f":"VLOOKUP('9. Adj Network to Current WS'!$B33, '4. RRR Data'!$B$27:$M$49,12,0)","v":0},null,"",null,"",null,{"$f":"IF(ISERROR('7. Current Wholesale'!$P$117*N33), \"\", '7. Current Wholesale'!$P$117*N33)","v":""},null,""]
[null,{"$f":"IF('3. Rate Classes'!Q33=1,'3. Rate Classes'!C33, 0)","v":0},null,{"$f":"IF(ISERROR(VLOOKUP($B34, '3. Rate Classes'!$C$24:$H$45,6,0)), \"\", VLOOKUP($B34, '3. Rate Classes'!$C$24:$H$45,6,0))","v":""},null,{"$f":"IF(ISERROR(VLOOKUP($B34,'3. Rate Classes'!$C$24:$N$45, 11,0)), \"\", VLOOKUP($B34,'3. Rate Classes'!$C$24:$N$45, 11,0))","v":""},null,{"$f":"VLOOKUP('9. Adj Network to Current WS'!$B34, '4. RRR Data'!$B$27:$M$49,11,0)","v":0},null,{"$f":"VLOOKUP('9. Adj Network to Current WS'!$B34, '4. RRR Data'!$B$27:$M$49,12,0)","v":0},null,"",null,"",null,{"$f":"IF(ISERROR('7. Current Wholesale'!$P$117*N34), \"\", '7. Current Wholesale'!$P$117*N34)","v":""},null,""]
[null,{"$f":"IF('3. Rate Classes'!Q34=1,'3. Rate Classes'!C34, 0)","v":0},null,{"$f":"IF(ISERROR(VLOOKUP($B35, '3. Rate Classes'!$C$24:$H$45,6,0)), \"\", VLOOKUP($B35, '3. Rate Classes'!$C$24:$H$45,6,0))","v":""},null,{"$f":"IF(ISERROR(VLOOKUP($B35,'3. Rate Classes'!$C$24:$N$45, 11,0)), \"\", VLOOKUP($B35,'3. Rate Classes'!$C$24:$N$45, 11,0))","v":""},null,{"$f":"VLOOKUP('9. Adj Network to Current WS'!$B35, '4. RRR Data'!$B$27:$M$49,11,0)","v":0},null,{"$f":"VLOOKUP('9. Adj Network to Current WS'!$B35, '4. RRR Data'!$B$27:$M$49,12,0)","v":0},null,"",null,"",null,{"$f":"IF(ISERROR('7. Current Wholesale'!$P$117*N35), \"\", '7. Current Wholesale'!$P$117*N35)","v":""},null,""]
[null,{"$f":"IF('3. Rate Classes'!Q35=1,'3. Rate Classes'!C35, 0)","v":0},null,{"$f":"IF(ISERROR(VLOOKUP($B36, '3. Rate Classes'!$C$24:$H$45,6,0)), \"\", VLOOKUP($B36, '3. Rate Classes'!$C$24:$H$45,6,0))","v":""},null,{"$f":"IF(ISERROR(VLOOKUP($B36,'3. Rate Classes'!$C$24:$N$45, 11,0)), \"\", VLOOKUP($B36,'3. Rate Classes'!$C$24:$N$45, 11,0))","v":""},null,{"$f":"VLOOKUP('9. Adj Network to Current WS'!$B36, '4. RRR Data'!$B$27:$M$49,11,0)","v":0},null,{"$f":"VLOOKUP('9. Adj Network to Current WS'!$B36, '4. RRR Data'!$B$27:$M$49,12,0)","v":0},null,"",null,"",null,{"$f":"IF(ISERROR('7. Current Wholesale'!$P$117*N36), \"\", '7. Current Wholesale'!$P$117*N36)","v":""},null,""]
[null,{"$f":"IF('3. Rate Classes'!Q36=1,'3. Rate Classes'!C36, 0)","v":0},null,{"$f":"IF(ISERROR(VLOOKUP($B37, '3. Rate Classes'!$C$24:$H$45,6,0)), \"\", VLOOKUP($B37, '3. Rate Classes'!$C$24:$H$45,6,0))","v":""},null,{"$f":"IF(ISERROR(VLOOKUP($B37,'3. Rate Classes'!$C$24:$N$45, 11,0)), \"\", VLOOKUP($B37,'3. Rate Classes'!$C$24:$N$45, 11,0))","v":""},null,{"$f":"VLOOKUP('9. Adj Network to Current WS'!$B37, '4. RRR Data'!$B$27:$M$49,11,0)","v":0},null,{"$f":"VLOOKUP('9. Adj Network to Current WS'!$B37, '4. RRR Data'!$B$27:$M$49,12,0)","v":0},null,"",null,"",null,{"$f":"IF(ISERROR('7. Current Wholesale'!$P$117*N37), \"\", '7. Current Wholesale'!$P$117*N37)","v":""},null,""]
[null,{"$f":"IF('3. Rate Classes'!Q37=1,'3. Rate Classes'!C37, 0)","v":0},null,{"$f":"IF(ISERROR(VLOOKUP($B38, '3. Rate Classes'!$C$24:$H$45,6,0)), \"\", VLOOKUP($B38, '3. Rate Classes'!$C$24:$H$45,6,0))","v":""},null,{"$f":"IF(ISERROR(VLOOKUP($B38,'3. Rate Classes'!$C$24:$N$45, 11,0)), \"\", VLOOKUP($B38,'3. Rate Classes'!$C$24:$N$45, 11,0))","v":""},null,{"$f":"VLOOKUP('9. Adj Network to Current WS'!$B38, '4. RRR Data'!$B$27:$M$49,11,0)","v":0},null,{"$f":"VLOOKUP('9. Adj Network to Current WS'!$B38, '4. RRR Data'!$B$27:$M$49,12,0)","v":0},null,"",null,"",null,{"$f":"IF(ISERROR('7. Current Wholesale'!$P$117*N38), \"\", '7. Current Wholesale'!$P$117*N38)","v":""},null,""]
[null,{"$f":"IF('3. Rate Classes'!Q38=1,'3. Rate Classes'!C38, 0)","v":0},null,{"$f":"IF(ISERROR(VLOOKUP($B39, '3. Rate Classes'!$C$24:$H$45,6,0)), \"\", VLOOKUP($B39, '3. Rate Classes'!$C$24:$H$45,6,0))","v":""},null,{"$f":"IF(ISERROR(VLOOKUP($B39,'3. Rate Classes'!$C$24:$N$45, 11,0)), \"\", VLOOKUP($B39,'3. Rate Classes'!$C$24:$N$45, 11,0))","v":""},null,{"$f":"VLOOKUP('9. Adj Network to Current WS'!$B39, '4. RRR Data'!$B$27:$M$49,11,0)","v":0},null,{"$f":"VLOOKUP('9. Adj Network to Current WS'!$B39, '4. RRR Data'!$B$27:$M$49,12,0)","v":0},null,"",null,"",null,{"$f":"IF(ISERROR('7. Current Wholesale'!$P$117*N39), \"\", '7. Current Wholesale'!$P$117*N39)","v":""},null,""]
[null,{"$f":"IF('3. Rate Classes'!Q39=1,'3. Rate Classes'!C39, 0)","v":0},null,{"$f":"IF(ISERROR(VLOOKUP($B40, '3. Rate Classes'!$C$24:$H$45,6,0)), \"\", VLOOKUP($B40, '3. Rate Classes'!$C$24:$H$45,6,0))","v":""},null,{"$f":"IF(ISERROR(VLOOKUP($B40,'3. Rate Classes'!$C$24:$N$45, 11,0)), \"\", VLOOKUP($B40,'3. Rate Classes'!$C$24:$N$45, 11,0))","v":""},null,{"$f":"VLOOKUP('9. Adj Network to Current WS'!$B40, '4. RRR Data'!$B$27:$M$49,11,0)","v":0},null,{"$f":"VLOOKUP('9. Adj Network to Current WS'!$B40, '4. RRR Data'!$B$27:$M$49,12,0)","v":0},null,"",null,"",null,{"$f":"IF(ISERROR('7. Current Wholesale'!$P$117*N40), \"\", '7. Current Wholesale'!$P$117*N40)","v":""},null,""]
[null,{"$f":"IF('3. Rate Classes'!Q40=1,'3. Rate Classes'!C40, 0)","v":0},null,{"$f":"IF(ISERROR(VLOOKUP($B41, '3. Rate Classes'!$C$24:$H$45,6,0)), \"\", VLOOKUP($B41, '3. Rate Classes'!$C$24:$H$45,6,0))","v":""},null,{"$f":"IF(ISERROR(VLOOKUP($B41,'3. Rate Classes'!$C$24:$N$45, 11,0)), \"\", VLOOKUP($B41,'3. Rate Classes'!$C$24:$N$45, 11,0))","v":""},null,{"$f":"VLOOKUP('9. Adj Network to Current WS'!$B41, '4. RRR Data'!$B$27:$M$49,11,0)","v":0},null,{"$f":"VLOOKUP('9. Adj Network to Current WS'!$B41, '4. RRR Data'!$B$27:$M$49,12,0)","v":0},null,"",null,"",null,{"$f":"IF(ISERROR('7. Current Wholesale'!$P$117*N41), \"\", '7. Current Wholesale'!$P$117*N41)","v":""},null,""]
[null,{"$f":"IF('3. Rate Classes'!Q41=1,'3. Rate Classes'!C41, 0)","v":0},null,{"$f":"IF(ISERROR(VLOOKUP($B42, '3. Rate Classes'!$C$24:$H$45,6,0)), \"\", VLOOKUP($B42, '3. Rate Classes'!$C$24:$H$45,6,0))","v":""},null,{"$f":"IF(ISERROR(VLOOKUP($B42,'3. Rate Classes'!$C$24:$N$45, 11,0)), \"\", VLOOKUP($B42,'3. Rate Classes'!$C$24:$N$45, 11,0))","v":""},null,{"$f":"VLOOKUP('9. Adj Network to Current WS'!$B42, '4. RRR Data'!$B$27:$M$49,11,0)","v":0},null,{"$f":"VLOOKUP('9. Adj Network to Current WS'!$B42, '4. RRR Data'!$B$27:$M$49,12,0)","v":0},null,"",null,"",null,{"$f":"IF(ISERROR('7. Current Wholesale'!$P$117*N42), \"\", '7. Current Wholesale'!$P$117*N42)","v":""},null,""]
[null,{"$f":"IF('3. Rate Classes'!Q42=1,'3. Rate Classes'!C42, 0)","v":0},null,{"$f":"IF(ISERROR(VLOOKUP($B43, '3. Rate Classes'!$C$24:$H$45,6,0)), \"\", VLOOKUP($B43, '3. Rate Classes'!$C$24:$H$45,6,0))","v":""},null,{"$f":"IF(ISERROR(VLOOKUP($B43,'3. Rate Classes'!$C$24:$N$45, 11,0)), \"\", VLOOKUP($B43,'3. Rate Classes'!$C$24:$N$45, 11,0))","v":""},null,{"$f":"VLOOKUP('9. Adj Network to Current WS'!$B43, '4. RRR Data'!$B$27:$M$49,11,0)","v":0},null,{"$f":"VLOOKUP('9. Adj Network to Current WS'!$B43, '4. RRR Data'!$B$27:$M$49,12,0)","v":0},null,"",null,"",null,{"$f":"IF(ISERROR('7. Current Wholesale'!$P$117*N43), \"\", '7. Current Wholesale'!$P$117*N43)","v":""},null,""]
[null,{"$f":"IF('3. Rate Classes'!Q43=1,'3. Rate Classes'!C43, 0)","v":0},null,{"$f":"IF(ISERROR(VLOOKUP($B44, '3. Rate Classes'!$C$24:$H$45,6,0)), \"\", VLOOKUP($B44, '3. Rate Classes'!$C$24:$H$45,6,0))","v":""},null,{"$f":"IF(ISERROR(VLOOKUP($B44,'3. Rate Classes'!$C$24:$N$45, 11,0)), \"\", VLOOKUP($B44,'3. Rate Classes'!$C$24:$N$45, 11,0))","v":""},null,{"$f":"VLOOKUP('9. Adj Network to Current WS'!$B44, '4. RRR Data'!$B$27:$M$49,11,0)","v":0},null,{"$f":"VLOOKUP('9. Adj Network to Current WS'!$B44, '4. RRR Data'!$B$27:$M$49,12,0)","v":0},null,"",null,"",null,{"$f":"IF(ISERROR('7. Current Wholesale'!$P$117*N44), \"\", '7. Current Wholesale'!$P$117*N44)","v":""},null,""]
[null,{"$f":"IF('3. Rate Classes'!Q44=1,'3. Rate Classes'!C44, 0)","v":0},null,{"$f":"IF(ISERROR(VLOOKUP($B45, '3. Rate Classes'!$C$24:$H$45,6,0)), \"\", VLOOKUP($B45, '3. Rate Classes'!$C$24:$H$45,6,0))","v":""},null,{"$f":"IF(ISERROR(VLOOKUP($B45,'3. Rate Classes'!$C$24:$N$45, 11,0)), \"\", VLOOKUP($B45,'3. Rate Classes'!$C$24:$N$45, 11,0))","v":""},null,{"$f":"VLOOKUP('9. Adj Network to Current WS'!$B45, '4. RRR Data'!$B$27:$M$49,11,0)","v":0},null,{"$f":"VLOOKUP('9. Adj Network to Current WS'!$B45, '4. RRR Data'!$B$27:$M$49,12,0)","v":0},null,"",null,"",null,{"$f":"IF(ISERROR('7. Current Wholesale'!$P$117*N45), \"\", '7. Current Wholesale'!$P$117*N45)","v":""},null,""]
[null,{"$f":"IF('3. Rate Classes'!Q45=1,'3. Rate Classes'!C45, 0)","v":0},null,{"$f":"IF(ISERROR(VLOOKUP($B46, '3. Rate Classes'!$C$24:$H$45,6,0)), \"\", VLOOKUP($B46, '3. Rate Classes'!$C$24:$H$45,6,0))","v":""},null,{"$f":"IF(ISERROR(VLOOKUP($B46,'3. Rate Classes'!$C$24:$N$45, 11,0)), \"\", VLOOKUP($B46,'3. Rate Classes'!$C$24:$N$45, 11,0))","v":""},null,{"$f":"VLOOKUP('9. Adj Network to Current WS'!$B46, '4. RRR Data'!$B$27:$M$49,11,0)","v":0},null,{"$f":"VLOOKUP('9. Adj Network to Current WS'!$B46, '4. RRR Data'!$B$27:$M$49,12,0)","v":0},null,"",null,"",null,{"$f":"IF(ISERROR('7. Current Wholesale'!$P$117*N46), \"\", '7. Current Wholesale'!$P$117*N46)","v":""},null,""]
[]
[]
[null,null,null,null,null,null,null,null,null,null,null,{"$f":"SUM(L25:L46)","v":423112.25064688397}]

{"sheet":"11. Adj Network to Forecast WS","index":10,"n_rows":49,"n_cols":18,"rows_kept":49,"cut":false,"hidden":false,"merged":[]}
[]
[]
[]
[]
[]
[]
[]
[]
[]
[]
[]
[]
[null,"The purpose of this sheet is to update the re-align RTS Network Rates to recover forecast wholesale network costs."]
[]
[]
[]
[]
[]
[]
[]
[]
[null,"Rate Class",null,"Unit",null,"Adjusted RTSR-Network",null,"Loss Adjusted Billed kWh",null,"Loss Adjusted Billed kW",null,"Billed Amount",null,"Billed Amount %",null,"Forecast Wholesale Billing",null,"Proposed RTSR Network"]
[]
[]
[null,{"$f":"IF('3. Rate Classes'!Q24=1,'3. Rate Classes'!C24, 0)","v":"Residential"},null,{"$f":"IF(ISERROR(VLOOKUP($B25, '3. Rate Classes'!$C$24:$H$45,6,0)), \"\", VLOOKUP($B25, '3. Rate Classes'!$C$24:$H$45,6,0))","v":"kWh"},null,{"$f":"VLOOKUP($B25, '9. Adj Network to Current WS'!$B$25:$R$47, 17,0)","v":6.4989383968043057E-3},null,{"$f":"VLOOKUP('9. Adj Network to Current WS'!$B25, '4. RRR Data'!$B$27:$M$49,11,0)","v":25939733.634643521},null,{"$f":"VLOOKUP('9. Adj Network to Current WS'!$B25, '4. RRR Data'!$B$27:$M$49,12,0)","v":0},null,{"$f":"IF(F25=\"\", \"\", IF(D25=\"kWh\", F25*H25, F25*J25))","v":168580.73092106089},null,{"$f":"IF(ISERROR(L25/$L$49), \"\", L25/$L$49)","v":0.28657608317132988},null,{"$f":"IF(ISERROR('8. Forecast Wholesale'!$F$113*N25), \"\", '8. Forecast Wholesale'!$F$113*N25)","v":166935.66240882207},null,{"$f":"IF(D25=\"\",\"\",IF(D25=\"kWh\",IF(H25<>0,P25/H25,),IF(J25<>0,P25/J25,0)))","v":6.4355195300029224E-3}]
[null,{"$f":"IF('3. Rate Classes'!Q25=1,'3. Rate Classes'!C25, 0)","v":"General Service Less Than 50 kW"},null,{"$f":"IF(ISERROR(VLOOKUP($B26, '3. Rate Classes'!$C$24:$H$45,6,0)), \"\", VLOOKUP($B26, '3. Rate Classes'!$C$24:$H$45,6,0))","v":"kWh"},null,{"$f":"VLOOKUP($B26, '9. Adj Network to Current WS'!$B$25:$R$47, 17,0)","v":5.9662385282137883E-3},null,{"$f":"VLOOKUP('9. Adj Network to Current WS'!$B26, '4. RRR Data'!$B$27:$M$49,11,0)","v":11646924.491808346},null,{"$f":"VLOOKUP('9. Adj Network to Current WS'!$B26, '4. RRR Data'!$B$27:$M$49,12,0)","v":0},null,{"$f":"IF(F26=\"\", \"\", IF(D26=\"kWh\", F26*H26, F26*J26))","v":69488.329638223746},null,0.1181255605254501,null,{"$f":"IF(ISERROR('8. Forecast Wholesale'!$F$113*N26), \"\", '8. Forecast Wholesale'!$F$113*N26)","v":68810.23871744443},null,5.9080179291830107E-3]
[null,{"$f":"IF('3. Rate Classes'!Q26=1,'3. Rate Classes'!C26, 0)","v":"General Service 50 to 1,499 kW"},null,{"$f":"IF(ISERROR(VLOOKUP($B27, '3. Rate Classes'!$C$24:$H$45,6,0)), \"\", VLOOKUP($B27, '3. Rate Classes'!$C$24:$H$45,6,0))","v":"kW"},null,{"$f":"VLOOKUP($B27, '9. Adj Network to Current WS'!$B$25:$R$47, 17,0)","v":2.45308289485933},null,{"$f":"VLOOKUP('9. Adj Network to Current WS'!$B27, '4. RRR Data'!$B$27:$M$49,11,0)","v":22758006.239060923},null,{"$f":"VLOOKUP('9. Adj Network to Current WS'!$B27, '4. RRR Data'!$B$27:$M$49,12,0)","v":65159.5},null,159841.65488758651,null,0.27172023240756593,null,{"$f":"IF(ISERROR('8. Forecast Wholesale'!$F$113*N27), \"\", '8. Forecast Wholesale'!$F$113*N27)","v":158281.86527246828},null,2.4291448717756929]
[null,{"$f":"IF('3. Rate Classes'!Q27=1,'3. Rate Classes'!C27, 0)","v":"General Service Intermediate 1,000 To 4,999 kW"},null,{"$f":"IF(ISERROR(VLOOKUP($B28, '3. Rate Classes'!$C$24:$H$45,6,0)), \"\", VLOOKUP($B28, '3. Rate Classes'!$C$24:$H$45,6,0))","v":"kW"},null,{"$f":"VLOOKUP($B28, '9. Adj Network to Current WS'!$B$25:$R$47, 17,0)","v":2.7437239431623164},null,{"$f":"VLOOKUP('9. Adj Network to Current WS'!$B28, '4. RRR Data'!$B$27:$M$49,11,0)","v":21805339},null,{"$f":"VLOOKUP('9. Adj Network to Current WS'!$B28, '4. RRR Data'!$B$27:$M$49,12,0)","v":61715.849999999991},null,169331.25531761401,null,0.28785192496364853,null,{"$f":"IF(ISERROR('8. Forecast Wholesale'!$F$113*N28), \"\", '8. Forecast Wholesale'!$F$113*N28)","v":167678.86293125449},null,2.7169497451830367]
[null,{"$f":"IF('3. Rate Classes'!Q28=1,'3. Rate Classes'!C28, 0)","v":"Sentinel Lighting"},null,{"$f":"IF(ISERROR(VLOOKUP($B29, '3. Rate Classes'!$C$24:$H$45,6,0)), \"\", VLOOKUP($B29, '3. Rate Classes'!$C$24:$H$45,6,0))","v":"kW"},null,{"$f":"VLOOKUP($B29, '9. Adj Network to Current WS'!$B$25:$R$47, 17,0)","v":1.8594421613020582},null,{"$f":"VLOOKUP('9. Adj Network to Current WS'!$B29, '4. RRR Data'!$B$27:$M$49,11,0)","v":21276},null,{"$f":"VLOOKUP('9. Adj Network to Current WS'!$B29, '4. RRR Data'!$B$27:$M$49,12,0)","v":72},null,133.87983561374818,null,2.2758685821438855E-4,null,{"$f":"IF(ISERROR('8. Forecast Wholesale'!$F$113*N29), \"\", '8. Forecast Wholesale'!$F$113*N29)","v":132.57339032318282},null,1.8412970878219836]
[null,{"$f":"IF('3. Rate Classes'!Q29=1,'3. Rate Classes'!C29, 0)","v":"Street Lighting"},null,{"$f":"IF(ISERROR(VLOOKUP($B30, '3. Rate Classes'!$C$24:$H$45,6,0)), \"\", VLOOKUP($B30, '3. Rate Classes'!$C$24:$H$45,6,0))","v":"kW"},null,{"$f":"VLOOKUP($B30, '9. Adj Network to Current WS'!$B$25:$R$47, 17,0)","v":1.8499601036411466},null,{"$f":"VLOOKUP('9. Adj Network to Current WS'!$B30, '4. RRR Data'!$B$27:$M$49,11,0)","v":1026377},null,{"$f":"VLOOKUP('9. Adj Network to Current WS'!$B30, '4. RRR Data'!$B$27:$M$49,12,0)","v":11288},null,20882.349649901262,null,3.5498612073791069E-2,null,{"$f":"IF(ISERROR('8. Forecast Wholesale'!$F$113*N30), \"\", '8. Forecast Wholesale'!$F$113*N30)","v":20678.572529687564},null,1.8319075593273888]
[null,{"$f":"IF('3. Rate Classes'!Q30=1,'3. Rate Classes'!C30, 0)","v":0},null,{"$f":"IF(ISERROR(VLOOKUP($B31, '3. Rate Classes'!$C$24:$H$45,6,0)), \"\", VLOOKUP($B31, '3. Rate Classes'!$C$24:$H$45,6,0))","v":""},null,{"$f":"VLOOKUP($B31, '9. Adj Network to Current WS'!$B$25:$R$47, 17,0)","v":""},null,{"$f":"VLOOKUP('9. Adj Network to Current WS'!$B31, '4. RRR Data'!$B$27:$M$49,11,0)","v":0},null,{"$f":"VLOOKUP('9. Adj Network to Current WS'!$B31, '4. RRR Data'!$B$27:$M$49,12,0)","v":0},null,"",null,"",null,{"$f":"IF(ISERROR('8. Forecast Wholesale'!$F$113*N31), \"\", '8. Forecast Wholesale'!$F$113*N31)","v":""},null,""]
[null,{"$f":"IF('3. Rate Classes'!Q31=1,'3. Rate Classes'!C31, 0)","v":0},null,{"$f":"IF(ISERROR(VLOOKUP($B32, '3. Rate Classes'!$C$24:$H$45,6,0)), \"\", VLOOKUP($B32, '3. Rate Classes'!$C$24:$H$45,6,0))","v":""},null,{"$f":"VLOOKUP($B32, '9. Adj Network to Current WS'!$B$25:$R$47, 17,0)","v":""},null,{"$f":"VLOOKUP('9. Adj Network to Current WS'!$B32, '4. RRR Data'!$B$27:$M$49,11,0)","v":0},null,{"$f":"VLOOKUP('9. Adj Network to Current WS'!$B32, '4. RRR Data'!$B$27:$M$49,12,0)","v":0},null,"",null,"",null,{"$f":"IF(ISERROR('8. Forecast Wholesale'!$F$113*N32), \"\", '8. Forecast Wholesale'!$F$113*N32)","v":""},null,""]
[null,{"$f":"IF('3. Rate Classes'!Q32=1,'3. Rate Classes'!C32, 0)","v":0},null,{"$f":"IF(ISERROR(VLOOKUP($B33, '3. Rate Classes'!$C$24:$H$45,6,0)), \"\", VLOOKUP($B33, '3. Rate Classes'!$C$24:$H$45,6,0))","v":""},null,{"$f":"VLOOKUP($B33, '9. Adj Network to Current WS'!$B$25:$R$47, 17,0)","v":""},null,{"$f":"VLOOKUP('9. Adj Network to Current WS'!$B33, '4. RRR Data'!$B$27:$M$49,11,0)","v":0},null,{"$f":"VLOOKUP('9. Adj Network to Current WS'!$B33, '4. RRR Data'!$B$27:$M$49,12,0)","v":0},null,"",null,"",null,{"$f":"IF(ISERROR('8. Forecast Wholesale'!$F$113*N33), \"\", '8. Forecast Wholesale'!$F$113*N33)","v":""},null,""]
[null,{"$f":"IF('3. Rate Classes'!Q33=1,'3. Rate Classes'!C33, 0)","v":0},null,{"$f":"IF(ISERROR(VLOOKUP($B34, '3. Rate Classes'!$C$24:$H$45,6,0)), \"\", VLOOKUP($B34, '3. Rate Classes'!$C$24:$H$45,6,0))","v":""},null,{"$f":"VLOOKUP($B34, '9. Adj Network to Current WS'!$B$25:$R$47, 17,0)","v":""},null,{"$f":"VLOOKUP('9. Adj Network to Current WS'!$B34, '4. RRR Data'!$B$27:$M$49,11,0)","v":0},null,{"$f":"VLOOKUP('9. Adj Network to Current WS'!$B34, '4. RRR Data'!$B$27:$M$49,12,0)","v":0},null,"",null,"",null,{"$f":"IF(ISERROR('8. Forecast Wholesale'!$F$113*N34), \"\", '8. Forecast Wholesale'!$F$113*N34)","v":""},null,""]
[null,{"$f":"IF('3. Rate Classes'!Q34=1,'3. Rate Classes'!C34, 0)","v":0},null,{"$f":"IF(ISERROR(VLOOKUP($B35, '3. Rate Classes'!$C$24:$H$45,6,0)), \"\", VLOOKUP($B35, '3. Rate Classes'!$C$24:$H$45,6,0))","v":""},null,{"$f":"VLOOKUP($B35, '9. Adj Network to Current WS'!$B$25:$R$47, 17,0)","v":""},null,{"$f":"VLOOKUP('9. Adj Network to Current WS'!$B35, '4. RRR Data'!$B$27:$M$49,11,0)","v":0},null,{"$f":"VLOOKUP('9. Adj Network to Current WS'!$B35, '4. RRR Data'!$B$27:$M$49,12,0)","v":0},null,"",null,"",null,{"$f":"IF(ISERROR('8. Forecast Wholesale'!$F$113*N35), \"\", '8. Forecast Wholesale'!$F$113*N35)","v":""},null,""]
[null,{"$f":"IF('3. Rate Classes'!Q35=1,'3. Rate Classes'!C35, 0)","v":0},null,{"$f":"IF(ISERROR(VLOOKUP($B36, '3. Rate Classes'!$C$24:$H$45,6,0)), \"\", VLOOKUP($B36, '3. Rate Classes'!$C$24:$H$45,6,0))","v":""},null,{"$f":"VLOOKUP($B36, '9. Adj Network to Current WS'!$B$25:$R$47, 17,0)","v":""},null,{"$f":"VLOOKUP('9. Adj Network to Current WS'!$B36, '4. RRR Data'!$B$27:$M$49,11,0)","v":0},null,{"$f":"VLOOKUP('9. Adj Network to Current WS'!$B36, '4. RRR Data'!$B$27:$M$49,12,0)","v":0},null,"",null,"",null,{"$f":"IF(ISERROR('8. Forecast Wholesale'!$F$113*N36), \"\", '8. Forecast Wholesale'!$F$113*N36)","v":""},null,""]
[null,{"$f":"IF('3. Rate Classes'!Q36=1,'3. Rate Classes'!C36, 0)","v":0},null,{"$f":"IF(ISERROR(VLOOKUP($B37, '3. Rate Classes'!$C$24:$H$45,6,0)), \"\", VLOOKUP($B37, '3. Rate Classes'!$C$24:$H$45,6,0))","v":""},null,{"$f":"VLOOKUP($B37, '9. Adj Network to Current WS'!$B$25:$R$47, 17,0)","v":""},null,{"$f":"VLOOKUP('9. Adj Network to Current WS'!$B37, '4. RRR Data'!$B$27:$M$49,11,0)","v":0},null,{"$f":"VLOOKUP('9. Adj Network to Current WS'!$B37, '4. RRR Data'!$B$27:$M$49,12,0)","v":0},null,"",null,"",null,{"$f":"IF(ISERROR('8. Forecast Wholesale'!$F$113*N37), \"\", '8. Forecast Wholesale'!$F$113*N37)","v":""},null,""]
[null,{"$f":"IF('3. Rate Classes'!Q37=1,'3. Rate Classes'!C37, 0)","v":0},null,{"$f":"IF(ISERROR(VLOOKUP($B38, '3. Rate Classes'!$C$24:$H$45,6,0)), \"\", VLOOKUP($B38, '3. Rate Classes'!$C$24:$H$45,6,0))","v":""},null,{"$f":"VLOOKUP($B38, '9. Adj Network to Current WS'!$B$25:$R$47, 17,0)","v":""},null,{"$f":"VLOOKUP('9. Adj Network to Current WS'!$B38, '4. RRR Data'!$B$27:$M$49,11,0)","v":0},null,{"$f":"VLOOKUP('9. Adj Network to Current WS'!$B38, '4. RRR Data'!$B$27:$M$49,12,0)","v":0},null,"",null,"",null,{"$f":"IF(ISERROR('8. Forecast Wholesale'!$F$113*N38), \"\", '8. Forecast Wholesale'!$F$113*N38)","v":""},null,""]
[null,{"$f":"IF('3. Rate Classes'!Q38=1,'3. Rate Classes'!C38, 0)","v":0},null,{"$f":"IF(ISERROR(VLOOKUP($B39, '3. Rate Classes'!$C$24:$H$45,6,0)), \"\", VLOOKUP($B39, '3. Rate Classes'!$C$24:$H$45,6,0))","v":""},null,{"$f":"VLOOKUP($B39, '9. Adj Network to Current WS'!$B$25:$R$47, 17,0)","v":""},null,{"$f":"VLOOKUP('9. Adj Network to Current WS'!$B39, '4. RRR Data'!$B$27:$M$49,11,0)","v":0},null,{"$f":"VLOOKUP('9. Adj Network to Current WS'!$B39, '4. RRR Data'!$B$27:$M$49,12,0)","v":0},null,"",null,"",null,{"$f":"IF(ISERROR('8. Forecast Wholesale'!$F$113*N39), \"\", '8. Forecast Wholesale'!$F$113*N39)","v":""},null,""]
[null,{"$f":"IF('3. Rate Classes'!Q39=1,'3. Rate Classes'!C39, 0)","v":0},null,{"$f":"IF(ISERROR(VLOOKUP($B40, '3. Rate Classes'!$C$24:$H$45,6,0)), \"\", VLOOKUP($B40, '3. Rate Classes'!$C$24:$H$45,6,0))","v":""},null,{"$f":"VLOOKUP($B40, '9. Adj Network to Current WS'!$B$25:$R$47, 17,0)","v":""},null,{"$f":"VLOOKUP('9. Adj Network to Current WS'!$B40, '4. RRR Data'!$B$27:$M$49,11,0)","v":0},null,{"$f":"VLOOKUP('9. Adj Network to Current WS'!$B40, '4. RRR Data'!$B$27:$M$49,12,0)","v":0},null,"",null,"",null,{"$f":"IF(ISERROR('8. Forecast Wholesale'!$F$113*N40), \"\", '8. Forecast Wholesale'!$F$113*N40)","v":""},null,""]
[null,{"$f":"IF('3. Rate Classes'!Q40=1,'3. Rate Classes'!C40, 0)","v":0},null,{"$f":"IF(ISERROR(VLOOKUP($B41, '3. Rate Classes'!$C$24:$H$45,6,0)), \"\", VLOOKUP($B41, '3. Rate Classes'!$C$24:$H$45,6,0))","v":""},null,{"$f":"VLOOKUP($B41, '9. Adj Network to Current WS'!$B$25:$R$47, 17,0)","v":""},null,{"$f":"VLOOKUP('9. Adj Network to Current WS'!$B41, '4. RRR Data'!$B$27:$M$49,11,0)","v":0},null,{"$f":"VLOOKUP('9. Adj Network to Current WS'!$B41, '4. RRR Data'!$B$27:$M$49,12,0)","v":0},null,"",null,"",null,{"$f":"IF(ISERROR('8. Forecast Wholesale'!$F$113*N41), \"\", '8. Forecast Wholesale'!$F$113*N41)","v":""},null,""]
[null,{"$f":"IF('3. Rate Classes'!Q41=1,'3. Rate Classes'!C41, 0)","v":0},null,{"$f":"IF(ISERROR(VLOOKUP($B42, '3. Rate Classes'!$C$24:$H$45,6,0)), \"\", VLOOKUP($B42, '3. Rate Classes'!$C$24:$H$45,6,0))","v":""},null,{"$f":"VLOOKUP($B42, '9. Adj Network to Current WS'!$B$25:$R$47, 17,0)","v":""},null,{"$f":"VLOOKUP('9. Adj Network to Current WS'!$B42, '4. RRR Data'!$B$27:$M$49,11,0)","v":0},null,{"$f":"VLOOKUP('9. Adj Network to Current WS'!$B42, '4. RRR Data'!$B$27:$M$49,12,0)","v":0},null,"",null,"",null,{"$f":"IF(ISERROR('8. Forecast Wholesale'!$F$113*N42), \"\", '8. Forecast Wholesale'!$F$113*N42)","v":""},null,""]
[null,{"$f":"IF('3. Rate Classes'!Q42=1,'3. Rate Classes'!C42, 0)","v":0},null,{"$f":"IF(ISERROR(VLOOKUP($B43, '3. Rate Classes'!$C$24:$H$45,6,0)), \"\", VLOOKUP($B43, '3. Rate Classes'!$C$24:$H$45,6,0))","v":""},null,{"$f":"VLOOKUP($B43, '9. Adj Network to Current WS'!$B$25:$R$47, 17,0)","v":""},null,{"$f":"VLOOKUP('9. Adj Network to Current WS'!$B43, '4. RRR Data'!$B$27:$M$49,11,0)","v":0},null,{"$f":"VLOOKUP('9. Adj Network to Current WS'!$B43, '4. RRR Data'!$B$27:$M$49,12,0)","v":0},null,"",null,"",null,{"$f":"IF(ISERROR('8. Forecast Wholesale'!$F$113*N43), \"\", '8. Forecast Wholesale'!$F$113*N43)","v":""},null,""]
[null,{"$f":"IF('3. Rate Classes'!Q43=1,'3. Rate Classes'!C43, 0)","v":0},null,{"$f":"IF(ISERROR(VLOOKUP($B44, '3. Rate Classes'!$C$24:$H$45,6,0)), \"\", VLOOKUP($B44, '3. Rate Classes'!$C$24:$H$45,6,0))","v":""},null,{"$f":"VLOOKUP($B44, '9. Adj Network to Current WS'!$B$25:$R$47, 17,0)","v":""},null,{"$f":"VLOOKUP('9. Adj Network to Current WS'!$B44, '4. RRR Data'!$B$27:$M$49,11,0)","v":0},null,{"$f":"VLOOKUP('9. Adj Network to Current WS'!$B44, '4. RRR Data'!$B$27:$M$49,12,0)","v":0},null,"",null,"",null,{"$f":"IF(ISERROR('8. Forecast Wholesale'!$F$113*N44), \"\", '8. Forecast Wholesale'!$F$113*N44)","v":""},null,""]
[null,{"$f":"IF('3. Rate Classes'!Q44=1,'3. Rate Classes'!C44, 0)","v":0},null,{"$f":"IF(ISERROR(VLOOKUP($B45, '3. Rate Classes'!$C$24:$H$45,6,0)), \"\", VLOOKUP($B45, '3. Rate Classes'!$C$24:$H$45,6,0))","v":""},null,{"$f":"VLOOKUP($B45, '9. Adj Network to Current WS'!$B$25:$R$47, 17,0)","v":""},null,{"$f":"VLOOKUP('9. Adj Network to Current WS'!$B45, '4. RRR Data'!$B$27:$M$49,11,0)","v":0},null,{"$f":"VLOOKUP('9. Adj Network to Current WS'!$B45, '4. RRR Data'!$B$27:$M$49,12,0)","v":0},null,"",null,"",null,{"$f":"IF(ISERROR('8. Forecast Wholesale'!$F$113*N45), \"\", '8. Forecast Wholesale'!$F$113*N45)","v":""},null,""]
[null,{"$f":"IF('3. Rate Classes'!Q45=1,'3. Rate Classes'!C45, 0)","v":0},null,{"$f":"IF(ISERROR(VLOOKUP($B46, '3. Rate Classes'!$C$24:$H$45,6,0)), \"\", VLOOKUP($B46, '3. Rate Classes'!$C$24:$H$45,6,0))","v":""},null,{"$f":"VLOOKUP($B46, '9. Adj Network to Current WS'!$B$25:$R$47, 17,0)","v":""},null,{"$f":"VLOOKUP('9. Adj Network to Current WS'!$B46, '4. RRR Data'!$B$27:$M$49,11,0)","v":0},null,{"$f":"VLOOKUP('9. Adj Network to Current WS'!$B46, '4. RRR Data'!$B$27:$M$49,12,0)","v":0},null,"",null,"",null,{"$f":"IF(ISERROR('8. Forecast Wholesale'!$F$113*N46), \"\", '8. Forecast Wholesale'!$F$113*N46)","v":""},null,""]
[]
[]
[null,null,null,null,null,null,null,null,null,null,null,{"$f":"SUM(L25:L46)","v":588258.20025000023}]

{"sheet":"12. Adj Conn. to Forecast WS","index":11,"n_rows":49,"n_cols":18,"rows_kept":49,"cut":false,"hidden":false,"merged":[]}
[]
[]
[]
[]
[]
[]
[]
[]
[]
[]
[]
[]
[null,"The purpose of this sheet is to update the re-aligned RTS Connection Rates to recover forecast wholesale connection costs."]
[]
[]
[]
[]
[]
[null,"Rate Class"]
[]
[]
[null,"Rate Class",null,"Unit",null,"Adjusted RTSR-Connection",null,"Loss Adjusted Billed kWh",null,"Loss Adjusted Billed kW",null,"Billed Amount",null,"Billed Amount %",null,"Forecast Wholesale Billing",null,"Proposed RTSR Connection"]
[]
[]
[null,{"$f":"IF('3. Rate Classes'!Q24=1,'3. Rate Classes'!C24, 0)","v":"Residential"},null,{"$f":"IF(ISERROR(VLOOKUP($B25, '3. Rate Classes'!$C$24:$H$45,6,0)), \"\", VLOOKUP($B25, '3. Rate Classes'!$C$24:$H$45,6,0))","v":"kWh"},null,{"$f":"VLOOKUP($B25, '10. Adj Conn. to Current WS'!$B$25:$R$47, 17,0)","v":4.9525128487608169E-3},null,{"$f":"VLOOKUP('9. Adj Network to Current WS'!$B25, '4. RRR Data'!$B$27:$M$49,11,0)","v":25939733.634643521},null,{"$f":"VLOOKUP('9. Adj Network to Current WS'!$B25, '4. RRR Data'!$B$27:$M$49,12,0)","v":0},null,{"$f":"IF(F25=\"\", \"\", IF(D25=\"kWh\", F25*H25, F25*J25))","v":128466.86411900517},null,{"$f":"IF(ISERROR(L25/$L$49), \"\", L25/$L$49)","v":0.29427349658613783},null,{"$f":"IF(ISERROR('8. Forecast Wholesale'!$P$117*N25), \"\", '8. Forecast Wholesale'!$P$117*N25)","v":130522.74522370921},null,{"$f":"IF(D25=\"\",\"\",IF(D25=\"kWh\",IF(H25<>0,P25/H25,),IF(J25<>0,P25/J25,0)))","v":5.0317689095076522E-3}]
[null,{"$f":"IF('3. Rate Classes'!Q25=1,'3. Rate Classes'!C25, 0)","v":"General Service Less Than 50 kW"},null,{"$f":"IF(ISERROR(VLOOKUP($B26, '3. Rate Classes'!$C$24:$H$45,6,0)), \"\", VLOOKUP($B26, '3. Rate Classes'!$C$24:$H$45,6,0))","v":"kWh"},null,{"$f":"VLOOKUP($B26, '10. Adj Conn. to Current WS'!$B$25:$R$47, 17,0)","v":4.3334487426657147E-3},null,{"$f":"VLOOKUP('9. Adj Network to Current WS'!$B26, '4. RRR Data'!$B$27:$M$49,11,0)","v":11646924.491808346},null,{"$f":"VLOOKUP('9. Adj Network to Current WS'!$B26, '4. RRR Data'!$B$27:$M$49,12,0)","v":0},null,50471.350294949392,null,0.115612542040102,null,{"$f":"IF(ISERROR('8. Forecast Wholesale'!$P$117*N26), \"\", '8. Forecast Wholesale'!$P$117*N26)","v":51279.053480606395},null,4.4027977958191961E-3]
[null,{"$f":"IF('3. Rate Classes'!Q26=1,'3. Rate Classes'!C26, 0)","v":"General Service 50 to 1,499 kW"},null,{"$f":"IF(ISERROR(VLOOKUP($B27, '3. Rate Classes'!$C$24:$H$45,6,0)), \"\", VLOOKUP($B27, '3. Rate Classes'!$C$24:$H$45,6,0))","v":"kW"},null,{"$f":"VLOOKUP($B27, '10. Adj Conn. to Current WS'!$B$25:$R$47, 17,0)","v":1.7565944010448522},null,{"$f":"VLOOKUP('9. Adj Network to Current WS'!$B27, '4. RRR Data'!$B$27:$M$49,11,0)","v":22758006.239060923},null,{"$f":"VLOOKUP('9. Adj Network to Current WS'!$B27, '4. RRR Data'!$B$27:$M$49,12,0)","v":65159.5},null,114458.81287488205,null,0.26218585867082828,null,{"$f":"IF(ISERROR('8. Forecast Wholesale'!$P$117*N27), \"\", '8. Forecast Wholesale'!$P$117*N27)","v":116290.52031376172},null,1.7847055350909955]
[null,{"$f":"IF('3. Rate Classes'!Q27=1,'3. Rate Classes'!C27, 0)","v":"General Service Intermediate 1,000 To 4,999 kW"},null,{"$f":"IF(ISERROR(VLOOKUP($B28, '3. Rate Classes'!$C$24:$H$45,6,0)), \"\", VLOOKUP($B28, '3. Rate Classes'!$C$24:$H$45,6,0))","v":"kW"},null,{"$f":"VLOOKUP($B28, '10. Adj Conn. to Current WS'!$B$25:$R$47, 17,0)","v":2.0719043857492916},null,{"$f":"VLOOKUP('9. Adj Network to Current WS'!$B28, '4. RRR Data'!$B$27:$M$49,11,0)","v":21805339},null,{"$f":"VLOOKUP('9. Adj Network to Current WS'!$B28, '4. RRR Data'!$B$27:$M$49,12,0)","v":61715.849999999991},null,127869.3402852454,null,0.29290477454983782,null,{"$f":"IF(ISERROR('8. Forecast Wholesale'!$P$117*N28), \"\", '8. Forecast Wholesale'!$P$117*N28)","v":129915.65909567331},null,2.1050614889963168]
[null,{"$f":"IF('3. Rate Classes'!Q28=1,'3. Rate Classes'!C28, 0)","v":"Sentinel Lighting"},null,{"$f":"IF(ISERROR(VLOOKUP($B29, '3. Rate Classes'!$C$24:$H$45,6,0)), \"\", VLOOKUP($B29, '3. Rate Classes'!$C$24:$H$45,6,0))","v":"kW"},null,{"$f":"VLOOKUP($B29, '10. Adj Conn. to Current WS'!$B$25:$R$47, 17,0)","v":1.3737032514250318},null,{"$f":"VLOOKUP('9. Adj Network to Current WS'!$B29, '4. RRR Data'!$B$27:$M$49,11,0)","v":21276},null,{"$f":"VLOOKUP('9. Adj Network to Current WS'!$B29, '4. RRR Data'!$B$27:$M$49,12,0)","v":72},null,98.906634102602283,null,2.2656115452445829E-4,null,{"$f":"IF(ISERROR('8. Forecast Wholesale'!$P$117*N29), \"\", '8. Forecast Wholesale'!$P$117*N29)","v":100.48945689177734},null,1.3956869012746853]
[null,{"$f":"IF('3. Rate Classes'!Q29=1,'3. Rate Classes'!C29, 0)","v":"Street Lighting"},null,{"$f":"IF(ISERROR(VLOOKUP($B30, '3. Rate Classes'!$C$24:$H$45,6,0)), \"\", VLOOKUP($B30, '3. Rate Classes'!$C$24:$H$45,6,0))","v":"kW"},null,{"$f":"VLOOKUP($B30, '10. Adj Conn. to Current WS'!$B$25:$R$47, 17,0)","v":1.3457421892997363},null,{"$f":"VLOOKUP('9. Adj Network to Current WS'!$B30, '4. RRR Data'!$B$27:$M$49,11,0)","v":1026377},null,{"$f":"VLOOKUP('9. Adj Network to Current WS'!$B30, '4. RRR Data'!$B$27:$M$49,12,0)","v":11288},null,15190.737832815423,null,3.4796766998569602E-2,null,{"$f":"IF(ISERROR('8. Forecast Wholesale'!$P$117*N30), \"\", '8. Forecast Wholesale'!$P$117*N30)","v":15433.838270357573},null,1.3672783726397566]
[null,{"$f":"IF('3. Rate Classes'!Q30=1,'3. Rate Classes'!C30, 0)","v":0},null,{"$f":"IF(ISERROR(VLOOKUP($B31, '3. Rate Classes'!$C$24:$H$45,6,0)), \"\", VLOOKUP($B31, '3. Rate Classes'!$C$24:$H$45,6,0))","v":""},null,{"$f":"VLOOKUP($B31, '10. Adj Conn. to Current WS'!$B$25:$R$47, 17,0)","v":""},null,{"$f":"VLOOKUP('9. Adj Network to Current WS'!$B31, '4. RRR Data'!$B$27:$M$49,11,0)","v":0},null,{"$f":"VLOOKUP('9. Adj Network to Current WS'!$B31, '4. RRR Data'!$B$27:$M$49,12,0)","v":0},null,"",null,"",null,{"$f":"IF(ISERROR('8. Forecast Wholesale'!$P$117*N31), \"\", '8. Forecast Wholesale'!$P$117*N31)","v":""},null,""]
[null,{"$f":"IF('3. Rate Classes'!Q31=1,'3. Rate Classes'!C31, 0)","v":0},null,{"$f":"IF(ISERROR(VLOOKUP($B32, '3. Rate Classes'!$C$24:$H$45,6,0)), \"\", VLOOKUP($B32, '3. Rate Classes'!$C$24:$H$45,6,0))","v":""},null,{"$f":"VLOOKUP($B32, '10. Adj Conn. to Current WS'!$B$25:$R$47, 17,0)","v":""},null,{"$f":"VLOOKUP('9. Adj Network to Current WS'!$B32, '4. RRR Data'!$B$27:$M$49,11,0)","v":0},null,{"$f":"VLOOKUP('9. Adj Network to Current WS'!$B32, '4. RRR Data'!$B$27:$M$49,12,0)","v":0},null,"",null,"",null,{"$f":"IF(ISERROR('8. Forecast Wholesale'!$P$117*N32), \"\", '8. Forecast Wholesale'!$P$117*N32)","v":""},null,""]
[null,{"$f":"IF('3. Rate Classes'!Q32=1,'3. Rate Classes'!C32, 0)","v":0},null,{"$f":"IF(ISERROR(VLOOKUP($B33, '3. Rate Classes'!$C$24:$H$45,6,0)), \"\", VLOOKUP($B33, '3. Rate Classes'!$C$24:$H$45,6,0))","v":""},null,{"$f":"VLOOKUP($B33, '10. Adj Conn. to Current WS'!$B$25:$R$47, 17,0)","v":""},null,{"$f":"VLOOKUP('9. Adj Network to Current WS'!$B33, '4. RRR Data'!$B$27:$M$49,11,0)","v":0},null,{"$f":"VLOOKUP('9. Adj Network to Current WS'!$B33, '4. RRR Data'!$B$27:$M$49,12,0)","v":0},null,"",null,"",null,{"$f":"IF(ISERROR('8. Forecast Wholesale'!$P$117*N33), \"\", '8. Forecast Wholesale'!$P$117*N33)","v":""},null,""]
[null,{"$f":"IF('3. Rate Classes'!Q33=1,'3. Rate Classes'!C33, 0)","v":0},null,{"$f":"IF(ISERROR(VLOOKUP($B34, '3. Rate Classes'!$C$24:$H$45,6,0)), \"\", VLOOKUP($B34, '3. Rate Classes'!$C$24:$H$45,6,0))","v":""},null,{"$f":"VLOOKUP($B34, '10. Adj Conn. to Current WS'!$B$25:$R$47, 17,0)","v":""},null,{"$f":"VLOOKUP('9. Adj Network to Current WS'!$B34, '4. RRR Data'!$B$27:$M$49,11,0)","v":0},null,{"$f":"VLOOKUP('9. Adj Network to Current WS'!$B34, '4. RRR Data'!$B$27:$M$49,12,0)","v":0},null,"",null,"",null,{"$f":"IF(ISERROR('8. Forecast Wholesale'!$P$117*N34), \"\", '8. Forecast Wholesale'!$P$117*N34)","v":""},null,""]
[null,{"$f":"IF('3. Rate Classes'!Q34=1,'3. Rate Classes'!C34, 0)","v":0},null,{"$f":"IF(ISERROR(VLOOKUP($B35, '3. Rate Classes'!$C$24:$H$45,6,0)), \"\", VLOOKUP($B35, '3. Rate Classes'!$C$24:$H$45,6,0))","v":""},null,{"$f":"VLOOKUP($B35, '10. Adj Conn. to Current WS'!$B$25:$R$47, 17,0)","v":""},null,{"$f":"VLOOKUP('9. Adj Network to Current WS'!$B35, '4. RRR Data'!$B$27:$M$49,11,0)","v":0},null,{"$f":"VLOOKUP('9. Adj Network to Current WS'!$B35, '4. RRR Data'!$B$27:$M$49,12,0)","v":0},null,"",null,"",null,{"$f":"IF(ISERROR('8. Forecast Wholesale'!$P$117*N35), \"\", '8. Forecast Wholesale'!$P$117*N35)","v":""},null,""]
[null,{"$f":"IF('3. Rate Classes'!Q35=1,'3. Rate Classes'!C35, 0)","v":0},null,{"$f":"IF(ISERROR(VLOOKUP($B36, '3. Rate Classes'!$C$24:$H$45,6,0)), \"\", VLOOKUP($B36, '3. Rate Classes'!$C$24:$H$45,6,0))","v":""},null,{"$f":"VLOOKUP($B36, '10. Adj Conn. to Current WS'!$B$25:$R$47, 17,0)","v":""},null,{"$f":"VLOOKUP('9. Adj Network to Current WS'!$B36, '4. RRR Data'!$B$27:$M$49,11,0)","v":0},null,{"$f":"VLOOKUP('9. Adj Network to Current WS'!$B36, '4. RRR Data'!$B$27:$M$49,12,0)","v":0},null,"",null,"",null,{"$f":"IF(ISERROR('8. Forecast Wholesale'!$P$117*N36), \"\", '8. Forecast Wholesale'!$P$117*N36)","v":""},null,""]
[null,{"$f":"IF('3. Rate Classes'!Q36=1,'3. Rate Classes'!C36, 0)","v":0},null,{"$f":"IF(ISERROR(VLOOKUP($B37, '3. Rate Classes'!$C$24:$H$45,6,0)), \"\", VLOOKUP($B37, '3. Rate Classes'!$C$24:$H$45,6,0))","v":""},null,{"$f":"VLOOKUP($B37, '10. Adj Conn. to Current WS'!$B$25:$R$47, 17,0)","v":""},null,{"$f":"VLOOKUP('9. Adj Network to Current WS'!$B37, '4. RRR Data'!$B$27:$M$49,11,0)","v":0},null,{"$f":"VLOOKUP('9. Adj Network to Current WS'!$B37, '4. RRR Data'!$B$27:$M$49,12,0)","v":0},null,"",null,"",null,{"$f":"IF(ISERROR('8. Forecast Wholesale'!$P$117*N37), \"\", '8. Forecast Wholesale'!$P$117*N37)","v":""},null,""]
[null,{"$f":"IF('3. Rate Classes'!Q37=1,'3. Rate Classes'!C37, 0)","v":0},null,{"$f":"IF(ISERROR(VLOOKUP($B38, '3. Rate Classes'!$C$24:$H$45,6,0)), \"\", VLOOKUP($B38, '3. Rate Classes'!$C$24:$H$45,6,0))","v":""},null,{"$f":"VLOOKUP($B38, '10. Adj Conn. to Current WS'!$B$25:$R$47, 17,0)","v":""},null,{"$f":"VLOOKUP('9. Adj Network to Current WS'!$B38, '4. RRR Data'!$B$27:$M$49,11,0)","v":0},null,{"$f":"VLOOKUP('9. Adj Network to Current WS'!$B38, '4. RRR Data'!$B$27:$M$49,12,0)","v":0},null,"",null,"",null,{"$f":"IF(ISERROR('8. Forecast Wholesale'!$P$117*N38), \"\", '8. Forecast Wholesale'!$P$117*N38)","v":""},null,""]
[null,{"$f":"IF('3. Rate Classes'!Q38=1,'3. Rate Classes'!C38, 0)","v":0},null,{"$f":"IF(ISERROR(VLOOKUP($B39, '3. Rate Classes'!$C$24:$H$45,6,0)), \"\", VLOOKUP($B39, '3. Rate Classes'!$C$24:$H$45,6,0))","v":""},null,{"$f":"VLOOKUP($B39, '10. Adj Conn. to Current WS'!$B$25:$R$47, 17,0)","v":""},null,{"$f":"VLOOKUP('9. Adj Network to Current WS'!$B39, '4. RRR Data'!$B$27:$M$49,11,0)","v":0},null,{"$f":"VLOOKUP('9. Adj Network to Current WS'!$B39, '4. RRR Data'!$B$27:$M$49,12,0)","v":0},null,"",null,"",null,{"$f":"IF(ISERROR('8. Forecast Wholesale'!$P$117*N39), \"\", '8. Forecast Wholesale'!$P$117*N39)","v":""},null,""]
[null,{"$f":"IF('3. Rate Classes'!Q39=1,'3. Rate Classes'!C39, 0)","v":0},null,{"$f":"IF(ISERROR(VLOOKUP($B40, '3. Rate Classes'!$C$24:$H$45,6,0)), \"\", VLOOKUP($B40, '3. Rate Classes'!$C$24:$H$45,6,0))","v":""},null,{"$f":"VLOOKUP($B40, '10. Adj Conn. to Current WS'!$B$25:$R$47, 17,0)","v":""},null,{"$f":"VLOOKUP('9. Adj Network to Current WS'!$B40, '4. RRR Data'!$B$27:$M$49,11,0)","v":0},null,{"$f":"VLOOKUP('9. Adj Network to Current WS'!$B40, '4. RRR Data'!$B$27:$M$49,12,0)","v":0},null,"",null,"",null,{"$f":"IF(ISERROR('8. Forecast Wholesale'!$P$117*N40), \"\", '8. Forecast Wholesale'!$P$117*N40)","v":""},null,""]
[null,{"$f":"IF('3. Rate Classes'!Q40=1,'3. Rate Classes'!C40, 0)","v":0},null,{"$f":"IF(ISERROR(VLOOKUP($B41, '3. Rate Classes'!$C$24:$H$45,6,0)), \"\", VLOOKUP($B41, '3. Rate Classes'!$C$24:$H$45,6,0))","v":""},null,{"$f":"VLOOKUP($B41, '10. Adj Conn. to Current WS'!$B$25:$R$47, 17,0)","v":""},null,{"$f":"VLOOKUP('9. Adj Network to Current WS'!$B41, '4. RRR Data'!$B$27:$M$49,11,0)","v":0},null,{"$f":"VLOOKUP('9. Adj Network to Current WS'!$B41, '4. RRR Data'!$B$27:$M$49,12,0)","v":0},null,"",null,"",null,{"$f":"IF(ISERROR('8. Forecast Wholesale'!$P$117*N41), \"\", '8. Forecast Wholesale'!$P$117*N41)","v":""},null,""]
[null,{"$f":"IF('3. Rate Classes'!Q41=1,'3. Rate Classes'!C41, 0)","v":0},null,{"$f":"IF(ISERROR(VLOOKUP($B42, '3. Rate Classes'!$C$24:$H$45,6,0)), \"\", VLOOKUP($B42, '3. Rate Classes'!$C$24:$H$45,6,0))","v":""},null,{"$f":"VLOOKUP($B42, '10. Adj Conn. to Current WS'!$B$25:$R$47, 17,0)","v":""},null,{"$f":"VLOOKUP('9. Adj Network to Current WS'!$B42, '4. RRR Data'!$B$27:$M$49,11,0)","v":0},null,{"$f":"VLOOKUP('9. Adj Network to Current WS'!$B42, '4. RRR Data'!$B$27:$M$49,12,0)","v":0},null,"",null,"",null,{"$f":"IF(ISERROR('8. Forecast Wholesale'!$P$117*N42), \"\", '8. Forecast Wholesale'!$P$117*N42)","v":""},null,""]
[null,{"$f":"IF('3. Rate Classes'!Q42=1,'3. Rate Classes'!C42, 0)","v":0},null,{"$f":"IF(ISERROR(VLOOKUP($B43, '3. Rate Classes'!$C$24:$H$45,6,0)), \"\", VLOOKUP($B43, '3. Rate Classes'!$C$24:$H$45,6,0))","v":""},null,{"$f":"VLOOKUP($B43, '10. Adj Conn. to Current WS'!$B$25:$R$47, 17,0)","v":""},null,{"$f":"VLOOKUP('9. Adj Network to Current WS'!$B43, '4. RRR Data'!$B$27:$M$49,11,0)","v":0},null,{"$f":"VLOOKUP('9. Adj Network to Current WS'!$B43, '4. RRR Data'!$B$27:$M$49,12,0)","v":0},null,"",null,"",null,{"$f":"IF(ISERROR('8. Forecast Wholesale'!$P$117*N43), \"\", '8. Forecast Wholesale'!$P$117*N43)","v":""},null,""]
[null,{"$f":"IF('3. Rate Classes'!Q43=1,'3. Rate Classes'!C43, 0)","v":0},null,{"$f":"IF(ISERROR(VLOOKUP($B44, '3. Rate Classes'!$C$24:$H$45,6,0)), \"\", VLOOKUP($B44, '3. Rate Classes'!$C$24:$H$45,6,0))","v":""},null,{"$f":"VLOOKUP($B44, '10. Adj Conn. to Current WS'!$B$25:$R$47, 17,0)","v":""},null,{"$f":"VLOOKUP('9. Adj Network to Current WS'!$B44, '4. RRR Data'!$B$27:$M$49,11,0)","v":0},null,{"$f":"VLOOKUP('9. Adj Network to Current WS'!$B44, '4. RRR Data'!$B$27:$M$49,12,0)","v":0},null,"",null,"",null,{"$f":"IF(ISERROR('8. Forecast Wholesale'!$P$117*N44), \"\", '8. Forecast Wholesale'!$P$117*N44)","v":""},null,""]
[null,{"$f":"IF('3. Rate Classes'!Q44=1,'3. Rate Classes'!C44, 0)","v":0},null,{"$f":"IF(ISERROR(VLOOKUP($B45, '3. Rate Classes'!$C$24:$H$45,6,0)), \"\", VLOOKUP($B45, '3. Rate Classes'!$C$24:$H$45,6,0))","v":""},null,{"$f":"VLOOKUP($B45, '10. Adj Conn. to Current WS'!$B$25:$R$47, 17,0)","v":""},null,{"$f":"VLOOKUP('9. Adj Network to Current WS'!$B45, '4. RRR Data'!$B$27:$M$49,11,0)","v":0},null,{"$f":"VLOOKUP('9. Adj Network to Current WS'!$B45, '4. RRR Data'!$B$27:$M$49,12,0)","v":0},null,"",null,"",null,{"$f":"IF(ISERROR('8. Forecast Wholesale'!$P$117*N45), \"\", '8. Forecast Wholesale'!$P$117*N45)","v":""},null,""]
[null,{"$f":"IF('3. Rate Classes'!Q45=1,'3. Rate Classes'!C45, 0)","v":0},null,{"$f":"IF(ISERROR(VLOOKUP($B46, '3. Rate Classes'!$C$24:$H$45,6,0)), \"\", VLOOKUP($B46, '3. Rate Classes'!$C$24:$H$45,6,0))","v":""},null,{"$f":"VLOOKUP($B46, '10. Adj Conn. to Current WS'!$B$25:$R$47, 17,0)","v":""},null,{"$f":"VLOOKUP('9. Adj Network to Current WS'!$B46, '4. RRR Data'!$B$27:$M$49,11,0)","v":0},null,{"$f":"VLOOKUP('9. Adj Network to Current WS'!$B46, '4. RRR Data'!$B$27:$M$49,12,0)","v":0},null,"",null,"",null,{"$f":"IF(ISERROR('8. Forecast Wholesale'!$P$117*N46), \"\", '8. Forecast Wholesale'!$P$117*N46)","v":""},null,""]
[]
[]
[null,null,null,null,null,null,null,null,null,null,null,{"$f":"SUM(L25:L46)","v":436556.01204100001}]

{"sheet":"13. Final 2014 RTS Rates","index":12,"n_rows":47,"n_cols":8,"rows_kept":47,"cut":false,"hidden":false,"merged":[[12,1,12,11]]}
[]
[]
[]
[]
[]
[]
[]
[]
[]
[]
[]
[]
[null,"Please enter the following Proposed RTS rates into your rates model."]
[]
[]
[]
[]
[]
[]
[]
[]
[]
[null,"Rate Class",null,"Unit",null,"Proposed RTSR Network",null,"Proposed RTSR Connection"]
[]
[]
[null,{"$f":"IF('3. Rate Classes'!Q24=1,'3. Rate Classes'!C24, 0)","v":"Residential"},null,{"$f":"IF(ISERROR(VLOOKUP($B26, '3. Rate Classes'!$C$24:$H$45,6,0)), \"\", VLOOKUP($B26, '3. Rate Classes'!$C$24:$H$45,6,0))","v":"kWh"},null,{"$f":"VLOOKUP($B26, '11. Adj Network to Forecast WS'!$B$25:$R$48,17,0)","v":6.4355195300029224E-3},null,{"$f":"VLOOKUP($B26, '12. Adj Conn. to Forecast WS'!$B$25:$R$48,17,0)","v":5.0317689095076522E-3}]
[null,{"$f":"IF('3. Rate Classes'!Q25=1,'3. Rate Classes'!C25, 0)","v":"General Service Less Than 50 kW"},null,{"$f":"IF(ISERROR(VLOOKUP($B27, '3. Rate Classes'!$C$24:$H$45,6,0)), \"\", VLOOKUP($B27, '3. Rate Classes'!$C$24:$H$45,6,0))","v":"kWh"},null,{"$f":"VLOOKUP($B27, '11. Adj Network to Forecast WS'!$B$25:$R$48,17,0)","v":5.9080179291830107E-3},null,{"$f":"VLOOKUP($B27, '12. Adj Conn. to Forecast WS'!$B$25:$R$48,17,0)","v":4.4027977958191961E-3}]
[null,{"$f":"IF('3. Rate Classes'!Q26=1,'3. Rate Classes'!C26, 0)","v":"General Service 50 to 1,499 kW"},null,{"$f":"IF(ISERROR(VLOOKUP($B28, '3. Rate Classes'!$C$24:$H$45,6,0)), \"\", VLOOKUP($B28, '3. Rate Classes'!$C$24:$H$45,6,0))","v":"kW"},null,{"$f":"VLOOKUP($B28, '11. Adj Network to Forecast WS'!$B$25:$R$48,17,0)","v":2.4291448717756929},null,{"$f":"VLOOKUP($B28, '12. Adj Conn. to Forecast WS'!$B$25:$R$48,17,0)","v":1.7847055350909955}]
[null,{"$f":"IF('3. Rate Classes'!Q27=1,'3. Rate Classes'!C27, 0)","v":"General Service Intermediate 1,000 To 4,999 kW"},null,{"$f":"IF(ISERROR(VLOOKUP($B29, '3. Rate Classes'!$C$24:$H$45,6,0)), \"\", VLOOKUP($B29, '3. Rate Classes'!$C$24:$H$45,6,0))","v":"kW"},null,{"$f":"VLOOKUP($B29, '11. Adj Network to Forecast WS'!$B$25:$R$48,17,0)","v":2.7169497451830367},null,{"$f":"VLOOKUP($B29, '12. Adj Conn. to Forecast WS'!$B$25:$R$48,17,0)","v":2.1050614889963168}]
[null,{"$f":"IF('3. Rate Classes'!Q28=1,'3. Rate Classes'!C28, 0)","v":"Sentinel Lighting"},null,{"$f":"IF(ISERROR(VLOOKUP($B30, '3. Rate Classes'!$C$24:$H$45,6,0)), \"\", VLOOKUP($B30, '3. Rate Classes'!$C$24:$H$45,6,0))","v":"kW"},null,{"$f":"VLOOKUP($B30, '11. Adj Network to Forecast WS'!$B$25:$R$48,17,0)","v":1.8412970878219836},null,{"$f":"VLOOKUP($B30, '12. Adj Conn. to Forecast WS'!$B$25:$R$48,17,0)","v":1.3956869012746853}]
[null,{"$f":"IF('3. Rate Classes'!Q29=1,'3. Rate Classes'!C29, 0)","v":"Street Lighting"},null,{"$f":"IF(ISERROR(VLOOKUP($B31, '3. Rate Classes'!$C$24:$H$45,6,0)), \"\", VLOOKUP($B31, '3. Rate Classes'!$C$24:$H$45,6,0))","v":"kW"},null,{"$f":"VLOOKUP($B31, '11. Adj Network to Forecast WS'!$B$25:$R$48,17,0)","v":1.8319075593273888},null,{"$f":"VLOOKUP($B31, '12. Adj Conn. to Forecast WS'!$B$25:$R$48,17,0)","v":1.3672783726397566}]
[null,{"$f":"IF('3. Rate Classes'!Q30=1,'3. Rate Classes'!C30, 0)","v":0},null,{"$f":"IF(ISERROR(VLOOKUP($B32, '3. Rate Classes'!$C$24:$H$45,6,0)), \"\", VLOOKUP($B32, '3. Rate Classes'!$C$24:$H$45,6,0))","v":""},null,{"$f":"VLOOKUP($B32, '11. Adj Network to Forecast WS'!$B$25:$R$48,17,0)","v":""},null,{"$f":"VLOOKUP($B32, '12. Adj Conn. to Forecast WS'!$B$25:$R$48,17,0)","v":""}]
[null,{"$f":"IF('3. Rate Classes'!Q31=1,'3. Rate Classes'!C31, 0)","v":0},null,{"$f":"IF(ISERROR(VLOOKUP($B33, '3. Rate Classes'!$C$24:$H$45,6,0)), \"\", VLOOKUP($B33, '3. Rate Classes'!$C$24:$H$45,6,0))","v":""},null,{"$f":"VLOOKUP($B33, '11. Adj Network to Forecast WS'!$B$25:$R$48,17,0)","v":""},null,{"$f":"VLOOKUP($B33, '12. Adj Conn. to Forecast WS'!$B$25:$R$48,17,0)","v":""}]
[null,{"$f":"IF('3. Rate Classes'!Q32=1,'3. Rate Classes'!C32, 0)","v":0},null,{"$f":"IF(ISERROR(VLOOKUP($B34, '3. Rate Classes'!$C$24:$H$45,6,0)), \"\", VLOOKUP($B34, '3. Rate Classes'!$C$24:$H$45,6,0))","v":""},null,{"$f":"VLOOKUP($B34, '11. Adj Network to Forecast WS'!$B$25:$R$48,17,0)","v":""},null,{"$f":"VLOOKUP($B34, '12. Adj Conn. to Forecast WS'!$B$25:$R$48,17,0)","v":""}]
[null,{"$f":"IF('3. Rate Classes'!Q33=1,'3. Rate Classes'!C33, 0)","v":0},null,{"$f":"IF(ISERROR(VLOOKUP($B35, '3. Rate Classes'!$C$24:$H$45,6,0)), \"\", VLOOKUP($B35, '3. Rate Classes'!$C$24:$H$45,6,0))","v":""},null,{"$f":"VLOOKUP($B35, '11. Adj Network to Forecast WS'!$B$25:$R$48,17,0)","v":""},null,{"$f":"VLOOKUP($B35, '12. Adj Conn. to Forecast WS'!$B$25:$R$48,17,0)","v":""}]
[null,{"$f":"IF('3. Rate Classes'!Q34=1,'3. Rate Classes'!C34, 0)","v":0},null,{"$f":"IF(ISERROR(VLOOKUP($B36, '3. Rate Classes'!$C$24:$H$45,6,0)), \"\", VLOOKUP($B36, '3. Rate Classes'!$C$24:$H$45,6,0))","v":""},null,{"$f":"VLOOKUP($B36, '11. Adj Network to Forecast WS'!$B$25:$R$48,17,0)","v":""},null,{"$f":"VLOOKUP($B36, '12. Adj Conn. to Forecast WS'!$B$25:$R$48,17,0)","v":""}]
[null,{"$f":"IF('3. Rate Classes'!Q35=1,'3. Rate Classes'!C35, 0)","v":0},null,{"$f":"IF(ISERROR(VLOOKUP($B37, '3. Rate Classes'!$C$24:$H$45,6,0)), \"\", VLOOKUP($B37, '3. Rate Classes'!$C$24:$H$45,6,0))","v":""},null,{"$f":"VLOOKUP($B37, '11. Adj Network to Forecast WS'!$B$25:$R$48,17,0)","v":""},null,{"$f":"VLOOKUP($B37, '12. Adj Conn. to Forecast WS'!$B$25:$R$48,17,0)","v":""}]
[null,{"$f":"IF('3. Rate Classes'!Q36=1,'3. Rate Classes'!C36, 0)","v":0},null,{"$f":"IF(ISERROR(VLOOKUP($B38, '3. Rate Classes'!$C$24:$H$45,6,0)), \"\", VLOOKUP($B38, '3. Rate Classes'!$C$24:$H$45,6,0))","v":""},null,{"$f":"VLOOKUP($B38, '11. Adj Network to Forecast WS'!$B$25:$R$48,17,0)","v":""},null,{"$f":"VLOOKUP($B38, '12. Adj Conn. to Forecast WS'!$B$25:$R$48,17,0)","v":""}]
[null,{"$f":"IF('3. Rate Classes'!Q37=1,'3. Rate Classes'!C37, 0)","v":0},null,{"$f":"IF(ISERROR(VLOOKUP($B39, '3. Rate Classes'!$C$24:$H$45,6,0)), \"\", VLOOKUP($B39, '3. Rate Classes'!$C$24:$H$45,6,0))","v":""},null,{"$f":"VLOOKUP($B39, '11. Adj Network to Forecast WS'!$B$25:$R$48,17,0)","v":""},null,{"$f":"VLOOKUP($B39, '12. Adj Conn. to Forecast WS'!$B$25:$R$48,17,0)","v":""}]
[null,{"$f":"IF('3. Rate Classes'!Q38=1,'3. Rate Classes'!C38, 0)","v":0},null,{"$f":"IF(ISERROR(VLOOKUP($B40, '3. Rate Classes'!$C$24:$H$45,6,0)), \"\", VLOOKUP($B40, '3. Rate Classes'!$C$24:$H$45,6,0))","v":""},null,{"$f":"VLOOKUP($B40, '11. Adj Network to Forecast WS'!$B$25:$R$48,17,0)","v":""},null,{"$f":"VLOOKUP($B40, '12. Adj Conn. to Forecast WS'!$B$25:$R$48,17,0)","v":""}]
[null,{"$f":"IF('3. Rate Classes'!Q39=1,'3. Rate Classes'!C39, 0)","v":0},null,{"$f":"IF(ISERROR(VLOOKUP($B41, '3. Rate Classes'!$C$24:$H$45,6,0)), \"\", VLOOKUP($B41, '3. Rate Classes'!$C$24:$H$45,6,0))","v":""},null,{"$f":"VLOOKUP($B41, '11. Adj Network to Forecast WS'!$B$25:$R$48,17,0)","v":""},null,{"$f":"VLOOKUP($B41, '12. Adj Conn. to Forecast WS'!$B$25:$R$48,17,0)","v":""}]
[null,{"$f":"IF('3. Rate Classes'!Q40=1,'3. Rate Classes'!C40, 0)","v":0},null,{"$f":"IF(ISERROR(VLOOKUP($B42, '3. Rate Classes'!$C$24:$H$45,6,0)), \"\", VLOOKUP($B42, '3. Rate Classes'!$C$24:$H$45,6,0))","v":""},null,{"$f":"VLOOKUP($B42, '11. Adj Network to Forecast WS'!$B$25:$R$48,17,0)","v":""},null,{"$f":"VLOOKUP($B42, '12. Adj Conn. to Forecast WS'!$B$25:$R$48,17,0)","v":""}]
[null,{"$f":"IF('3. Rate Classes'!Q41=1,'3. Rate Classes'!C41, 0)","v":0},null,{"$f":"IF(ISERROR(VLOOKUP($B43, '3. Rate Classes'!$C$24:$H$45,6,0)), \"\", VLOOKUP($B43, '3. Rate Classes'!$C$24:$H$45,6,0))","v":""},null,{"$f":"VLOOKUP($B43, '11. Adj Network to Forecast WS'!$B$25:$R$48,17,0)","v":""},null,{"$f":"VLOOKUP($B43, '12. Adj Conn. to Forecast WS'!$B$25:$R$48,17,0)","v":""}]
[null,{"$f":"IF('3. Rate Classes'!Q42=1,'3. Rate Classes'!C42, 0)","v":0},null,{"$f":"IF(ISERROR(VLOOKUP($B44, '3. Rate Classes'!$C$24:$H$45,6,0)), \"\", VLOOKUP($B44, '3. Rate Classes'!$C$24:$H$45,6,0))","v":""},null,{"$f":"VLOOKUP($B44, '11. Adj Network to Forecast WS'!$B$25:$R$48,17,0)","v":""},null,{"$f":"VLOOKUP($B44, '12. Adj Conn. to Forecast WS'!$B$25:$R$48,17,0)","v":""}]
[null,{"$f":"IF('3. Rate Classes'!Q43=1,'3. Rate Classes'!C43, 0)","v":0},null,{"$f":"IF(ISERROR(VLOOKUP($B45, '3. Rate Classes'!$C$24:$H$45,6,0)), \"\", VLOOKUP($B45, '3. Rate Classes'!$C$24:$H$45,6,0))","v":""},null,{"$f":"VLOOKUP($B45, '11. Adj Network to Forecast WS'!$B$25:$R$48,17,0)","v":""},null,{"$f":"VLOOKUP($B45, '12. Adj Conn. to Forecast WS'!$B$25:$R$48,17,0)","v":""}]
[null,{"$f":"IF('3. Rate Classes'!Q44=1,'3. Rate Classes'!C44, 0)","v":0},null,{"$f":"IF(ISERROR(VLOOKUP($B46, '3. Rate Classes'!$C$24:$H$45,6,0)), \"\", VLOOKUP($B46, '3. Rate Classes'!$C$24:$H$45,6,0))","v":""},null,{"$f":"VLOOKUP($B46, '11. Adj Network to Forecast WS'!$B$25:$R$48,17,0)","v":""},null,{"$f":"VLOOKUP($B46, '12. Adj Conn. to Forecast WS'!$B$25:$R$48,17,0)","v":""}]
[null,{"$f":"IF('3. Rate Classes'!Q45=1,'3. Rate Classes'!C45, 0)","v":0},null,{"$f":"IF(ISERROR(VLOOKUP($B47, '3. Rate Classes'!$C$24:$H$45,6,0)), \"\", VLOOKUP($B47, '3. Rate Classes'!$C$24:$H$45,6,0))","v":""},null,{"$f":"VLOOKUP($B47, '11. Adj Network to Forecast WS'!$B$25:$R$48,17,0)","v":""},null,{"$f":"VLOOKUP($B47, '12. Adj Conn. to Forecast WS'!$B$25:$R$48,17,0)","v":""}]

{"sheet":"hidden1","index":13,"n_rows":22,"n_cols":2,"rows_kept":22,"cut":false,"hidden":true,"merged":[]}
[{"$f":"IF('3. Rate Classes'!Q24=1, '3. Rate Classes'!C24, \"\")","v":"Residential"},1]
[{"$f":"IF('3. Rate Classes'!Q25=1, '3. Rate Classes'!C25, \"\")","v":"General Service Less Than 50 kW"},2]
[{"$f":"IF('3. Rate Classes'!Q26=1, '3. Rate Classes'!C26, \"\")","v":"General Service 50 to 1,499 kW"},3]
[{"$f":"IF('3. Rate Classes'!Q27=1, '3. Rate Classes'!C27, \"\")","v":"General Service Intermediate 1,000 To 4,999 kW"},4]
[{"$f":"IF('3. Rate Classes'!Q28=1, '3. Rate Classes'!C28, \"\")","v":"Sentinel Lighting"},5]
[{"$f":"IF('3. Rate Classes'!Q29=1, '3. Rate Classes'!C29, \"\")","v":"Street Lighting"},6]
[{"$f":"IF('3. Rate Classes'!Q30=1, '3. Rate Classes'!C30, \"\")","v":""},7]
[{"$f":"IF('3. Rate Classes'!Q31=1, '3. Rate Classes'!C31, \"\")","v":""},8]
[{"$f":"IF('3. Rate Classes'!Q32=1, '3. Rate Classes'!C32, \"\")","v":""},9]
[{"$f":"IF('3. Rate Classes'!Q33=1, '3. Rate Classes'!C33, \"\")","v":""},10]
[{"$f":"IF('3. Rate Classes'!Q34=1, '3. Rate Classes'!C34, \"\")","v":""},11]
[{"$f":"IF('3. Rate Classes'!Q35=1, '3. Rate Classes'!C35, \"\")","v":""},12]
[{"$f":"IF('3. Rate Classes'!Q36=1, '3. Rate Classes'!C36, \"\")","v":""},13]
[{"$f":"IF('3. Rate Classes'!Q37=1, '3. Rate Classes'!C37, \"\")","v":""},14]
[{"$f":"IF('3. Rate Classes'!Q38=1, '3. Rate Classes'!C38, \"\")","v":""},15]
[{"$f":"IF('3. Rate Classes'!Q39=1, '3. Rate Classes'!C39, \"\")","v":""},16]
[{"$f":"IF('3. Rate Classes'!Q40=1, '3. Rate Classes'!C40, \"\")","v":""},17]
[{"$f":"IF('3. Rate Classes'!Q41=1, '3. Rate Classes'!C41, \"\")","v":""},18]
[{"$f":"IF('3. Rate Classes'!Q42=1, '3. Rate Classes'!C42, \"\")","v":""},19]
[{"$f":"IF('3. Rate Classes'!Q43=1, '3. Rate Classes'!C43, \"\")","v":""},20]
[{"$f":"IF('3. Rate Classes'!Q44=1, '3. Rate Classes'!C44, \"\")","v":""},21]
[{"$f":"IF('3. Rate Classes'!Q45=1, '3. Rate Classes'!C45, \"\")","v":""},22]