{"text_format":"1","workbook":"xlsx","n_sheets":8,"sheets":["1. Information Sheet","2. 2016-20 Continuity Schedule","3. Appendix A","4. Billing Determinants","5. Allocation of Balances","6. Rate Rider Calculations","RR Summary","Sheet1"],"not_rendered":{"charts":0,"images":4,"macros":0,"external_links":4,"defined_names":144,"comments":0,"pivot_tables":0},"unopened":[],"bounds":{"document_bytes":16777216,"sheet_cells":100000,"rows_first":2000,"rows_last":500,"rows_between":2000,"halvings":0,"cell_chars":16384,"cell_head_chars":4096},"cells_cut":0,"cells_raw":0,"read":"whole","date_system":"1900"}

{"sheet":"1. Information Sheet","index":0,"n_rows":78,"n_cols":22,"rows_kept":78,"cut":false,"hidden":false,"merged":[[30,2,30,11],[32,2,32,13],[34,2,34,12],[26,1,26,12],[13,5,13,11],[15,5,15,9],[17,5,17,9],[19,5,19,9],[21,5,21,9],[23,5,23,9]]}
[null,null,null,null,null,null,null,null,null,null,null,null,null,null,null,null,null,null,null,null,null,"Algoma Power Inc."]
[null,null,null,null,null,null,null,null,null,null,null,null,null,null,null,null,null,null,null,null,null,"Atikokan Hydro Inc."]
[null,null,null,null,null,null,null,null,null,null,null,null,null,null,null,null,null,null,null,null,null,"Attawapiskat Power Corp. "]
[null,null,null,null,null,null,null,null,null,null,null,null,null,null,null,null,null,null,null,null,null,"Bluewater Power Distribution Corporation"]
[null,null,null,null,null,null,null,null,null,null,null,null,null,null,null,null,null,null,null,null,null,"Brant County Power Inc."]
[null,null,null,null,null,null,null,null,null,null,null,null,null,null,null,null,null,null,null,null,null,"Brantford Power Inc."]
{"$rows_left_out":73}
{"sheet":"2. 2016-20 Continuity Schedule","index":1,"n_rows":106,"n_cols":56,"rows_kept":106,"cut":false,"hidden":false,"merged":[[14,53,16,53],[14,46,16,46],[14,49,16,49],[14,50,16,50],[14,45,16,45],[14,43,16,43],[14,52,16,52],[14,47,16,47],[14,48,16,48],[14,44,16,44],[14,51,16,51],[14,38,16,38],[14,39,16,39],[14,40,16,40],[14,41,16,41],[14,42,16,42],[13,54,13,55],[14,55,16,55],[14,54,16,54],[14,25,16,25],[14,26,16,26],[14,27,16,27],[14,28,16,28],[14,29,16,29],[14,30,16,30],[14,31,16,31],[14,32,16,32],[14,33,16,33],[14,34,16,34],[14,35,16,35],[14,36,16,36],[14,37,16,37],[14,11,16,11],[14,12,16,12],[13,24,13,33],[13,34,13,43],[14,24,16,24],[13,14,13,23],[14,15,16,15],[14,16,16,16],[14,17,16,17],[14,18,16,18],[14,19,16,19],[14,23,16,23],[14,20,16,20],[14,21,16,21],[14,22,16,22],[14,14,16,14],[14,10,16,10],[91,2,91,3],[13,44,13,53],[103,2,103,3],[13,4,13,13],[14,4,16,4],[14,5,16,5],[14,6,16,6],[14,7,16,7],[14,8,16,8],[14,9,16,9],[95,2,97,3],[14,2,16,2],[14,3,16,3],[88,2,88,3],[14,13,16,13]]}
[]
[]
[]
[]
[]
[]
{"$rows_left_out":101}
{"sheet":"3. Appendix A","index":2,"n_rows":69,"n_cols":6,"rows_kept":69,"cut":false,"hidden":false,"merged":[[15,1,15,4],[19,2,21,2],[19,3,21,3],[19,4,21,4],[19,5,21,5]]}
[]
[]
[]
[]
[]
[]
{"$rows_left_out":64}
{"sheet":"4. Billing Determinants","index":3,"n_rows":47,"n_cols":18,"rows_kept":47,"cut":false,"hidden":false,"merged":[[15,1,16,8],[18,3,19,3],[18,12,19,12],[18,17,19,17],[44,0,45,7],[18,8,19,8],[18,9,19,9],[18,10,19,10],[18,11,19,11],[18,13,19,13],[18,14,19,14],[18,15,19,15],[18,16,19,16],[46,0,46,7],[18,5,19,5],[18,4,19,4],[18,2,19,2],[18,1,19,1],[18,6,19,6],[18,7,19,7]]}
[]
[]
[]
[]
[]
[]
{"$rows_left_out":42}
{"sheet":"5. Allocation of Balances","index":4,"n_rows":62,"n_cols":25,"rows_kept":62,"cut":false,"hidden":false,"merged":[[47,1,47,2],[48,1,48,2],[50,1,50,2],[51,1,51,2],[52,1,52,2]]}
[]
[]
[]
[null,null,null,"Amounts from Sheet 2","Allocator",{"$f":"IF(LEN(TRIM('4. Billing Determinants'!$B21))=0, \"\", '4. Billing Determinants'!$B21)","v":"RESIDENTIAL"},{"$f":"IF(LEN(TRIM('4. Billing Determinants'!$B22))=0, \"\", '4. Billing Determinants'!$B22)","v":"GENERAL SERVICE LESS THAN 50 KW"},{"$f":"IF(LEN(TRIM('4. Billing Determinants'!$B23))=0, \"\", '4. Billing Determinants'!$B23)","v":"GENERAL SERVICE 50 TO 4,999 KW"},{"$f":"IF(LEN(TRIM('4. Billing Determinants'!$B24))=0, \"\", '4. Billing Determinants'!$B24)","v":"LARGE USER"},{"$f":"IF(LEN(TRIM('4. Billing Determinants'!$B25))=0, \"\", '4. Billing Determinants'!$B25)","v":"STANDBY POWER"},{"$f":"IF(LEN(TRIM('4. Billing Determinants'!$B26))=0, \"\", '4. Billing Determinants'!$B26)","v":"UNMETERED SCATTERED LOAD"},{"$f":"IF(LEN(TRIM('4. Billing Determinants'!$B27))=0, \"\", '4. Billing Determinants'!$B27)","v":"SENTINEL LIGHTING"},{"$f":"IF(LEN(TRIM('4. Billing Determinants'!$B28))=0, \"\", '4. Billing Determinants'!$B28)","v":"STREET LIGHTING"},{"$f":"IF(LEN(TRIM('4. Billing Determinants'!$B29))=0, \"\", '4. Billing Determinants'!$B29)","v":""},{"$f":"IF(LEN(TRIM('4. Billing Determinants'!$B30))=0, \"\", '4. Billing Determinants'!$B30)","v":""},{"$f":"IF(LEN(TRIM('4. Billing Determinants'!$B31))=0, \"\", '4. Billing Determinants'!$B31)","v":""},{"$f":"IF(LEN(TRIM('4. Billing Determinants'!$B32))=0, \"\", '4. Billing Determinants'!$B32)","v":""},{"$f":"IF(LEN(TRIM('4. Billing Determinants'!$B33))=0, \"\", '4. Billing Determinants'!$B33)","v":""},{"$f":"IF(LEN(TRIM('4. Billing Determinants'!$B34))=0, \"\", '4. Billing Determinants'!$B34)","v":""},{"$f":"IF(LEN(TRIM('4. Billing Determinants'!$B35))=0, \"\", '4. Billing Determinants'!$B35)","v":""},{"$f":"IF(LEN(TRIM('4. Billing Determinants'!$B36))=0, \"\", '4. Billing Determinants'!$B36)","v":""},{"$f":"IF(LEN(TRIM('4. Billing Determinants'!$B37))=0, \"\", '4. Billing Determinants'!$B37)","v":""},{"$f":"IF(LEN(TRIM('4. Billing Determinants'!$B38))=0, \"\", '4. Billing Determinants'!$B38)","v":""},{"$f":"IF(LEN(TRIM('4. Billing Determinants'!$B39))=0, \"\", '4. Billing Determinants'!$B39)","v":""},{"$f":"IF(LEN(TRIM('4. Billing Determinants'!$B40))=0, \"\", '4. Billing Determinants'!$B40)","v":""}]
[null,"LV Variance Account",1550,{"$f":"'2. 2016-20 Continuity Schedule'!BD19","v":-251134.54930000001},"kWh",{"$f":"IFERROR(IF(F$4=\"\",0,IF($E5=\"kWh\",VLOOKUP(F$4,'4. Billing Determinants'!$B$19:$R$41,4,0)/'4. Billing Determinants'!$E$41*$D5,IF($E5=\"kW\",VLOOKUP(F$4,'4. Billing Determinants'!$B$19:$R$41,5,0)/'4. Billing Determinants'!$F$41*$D5,IF($E5=\"Non-RPP kWh\",VLOOKUP(F$4,'4. Billing Determinants'!$B$19:$R$41,6,0)/'4. Billing Determinants'!$G$41*$D5,IF($E5=\"Distribution Rev.\",VLOOKUP(F$4,'4. Billing Determinants'!$B$19:$R$41,8,0)/'4. Billing Determinants'!$I$41*$D5, VLOOKUP(F$4,'4. Billing Determinants'!$B$19:$R$41,3,0)/'4. Billing Determinants'!$D$41*$D5))))),0)","v":-81181.626335490655},{"$f":"IFERROR(IF(G$4=\"\",0,IF($E5=\"kWh\",VLOOKUP(G$4,'4. Billing Determinants'!$B$19:$R$41,4,0)/'4. Billing Determinants'!$E$41*$D5,IF($E5=\"kW\",VLOOKUP(G$4,'4. Billing Determinants'!$B$19:$R$41,5,0)/'4. Billing Determinants'!$F$41*$D5,IF($E5=\"Non-RPP kWh\",VLOOKUP(G$4,'4. Billing Determinants'!$B$19:$R$41,6,0)/'4. Billing Determinants'!$G$41*$D5,IF($E5=\"Distribution Rev.\",VLOOKUP(G$4,'4. Billing Determinants'!$B$19:$R$41,8,0)/'4. Billing Determinants'!$I$41*$D5, VLOOKUP(G$4,'4. Billing Determinants'!$B$19:$R$41,3,0)/'4. Billing Determinants'!$D$41*$D5))))),0)","v":-30701.079579378104},{"$f":"IFERROR(IF(H$4=\"\",0,IF($E5=\"kWh\",VLOOKUP(H$4,'4. Billing Determinants'!$B$19:$R$41,4,0)/'4. Billing Determinants'!$E$41*$D5,IF($E5=\"kW\",VLOOKUP(H$4,'4. Billing Determinants'!$B$19:$R$41,5,0)/'4. Billing Determinants'!$F$41*$D5,IF($E5=\"Non-RPP kWh\",VLOOKUP(H$4,'4. Billing Determinants'!$B$19:$R$41,6,0)/'4. Billing Determinants'!$G$41*$D5,IF($E5=\"Distribution Rev.\",VLOOKUP(H$4,'4. Billing Determinants'!$B$19:$R$41,8,0)/'4. Billing Determinants'!$I$41*$D5, VLOOKUP(H$4,'4. Billing Determinants'!$B$19:$R$41,3,0)/'4. Billing Determinants'!$D$41*$D5))))),0)","v":-134999.10420956759},{"$f":"IFERROR(IF(I$4=\"\",0,IF($E5=\"kWh\",VLOOKUP(I$4,'4. Billing Determinants'!$B$19:$R$41,4,0)/'4. Billing Determinants'!$E$41*$D5,IF($E5=\"kW\",VLOOKUP(I$4,'4. Billing Determinants'!$B$19:$R$41,5,0)/'4. Billing Determinants'!$F$41*$D5,IF($E5=\"Non-RPP kWh\",VLOOKUP(I$4,'4. Billing Determinants'!$B$19:$R$41,6,0)/'4. Billing Determinants'!$G$41*$D5,IF($E5=\"Distribution Rev.\",VLOOKUP(I$4,'4. Billing Determinants'!$B$19:$R$41,8,0)/'4. Billing Determinants'!$I$41*$D5, VLOOKUP(I$4,'4. Billing Determinants'!$B$19:$R$41,3,0)/'4. Billing Determinants'!$D$41*$D5))))),0)","v":-2258.9090703719203},{"$f":"IFERROR(IF(J$4=\"\",0,IF($E5=\"kWh\",VLOOKUP(J$4,'4. Billing Determinants'!$B$19:$R$41,4,0)/'4. Billing Determinants'!$E$41*$D5,IF($E5=\"kW\",VLOOKUP(J$4,'4. Billing Determinants'!$B$19:$R$41,5,0)/'4. Billing Determinants'!$F$41*$D5,IF($E5=\"Non-RPP kWh\",VLOOKUP(J$4,'4. Billing Determinants'!$B$19:$R$41,6,0)/'4. Billing Determinants'!$G$41*$D5,IF($E5=\"Distribution Rev.\",VLOOKUP(J$4,'4. Billing Determinants'!$B$19:$R$41,8,0)/'4. Billing Determinants'!$I$41*$D5, VLOOKUP(J$4,'4. Billing Determinants'!$B$19:$R$41,3,0)/'4. Billing Determinants'!$D$41*$D5))))),0)","v":0},{"$f":"IFERROR(IF(K$4=\"\",0,IF($E5=\"kWh\",VLOOKUP(K$4,'4. Billing Determinants'!$B$19:$R$41,4,0)/'4. Billing Determinants'!$E$41*$D5,IF($E5=\"kW\",VLOOKUP(K$4,'4. Billing Determinants'!$B$19:$R$41,5,0)/'4. Billing Determinants'!$F$41*$D5,IF($E5=\"Non-RPP kWh\",VLOOKUP(K$4,'4. Billing Determinants'!$B$19:$R$41,6,0)/'4. Billing Determinants'!$G$41*$D5,IF($E5=\"Distribution Rev.\",VLOOKUP(K$4,'4. Billing Determinants'!$B$19:$R$41,8,0)/'4. Billing Determinants'!$I$41*$D5, VLOOKUP(K$4,'4. Billing Determinants'!$B$19:$R$41,3,0)/'4. Billing Determinants'!$D$41*$D5))))),0)","v":-418.20457651609502},{"$f":"IFERROR(IF(L$4=\"\",0,IF($E5=\"kWh\",VLOOKUP(L$4,'4. Billing Determinants'!$B$19:$R$41,4,0)/'4. Billing Determinants'!$E$41*$D5,IF($E5=\"kW\",VLOOKUP(L$4,'4. Billing Determinants'!$B$19:$R$41,5,0)/'4. Billing Determinants'!$F$41*$D5,IF($E5=\"Non-RPP kWh\",VLOOKUP(L$4,'4. Billing Determinants'!$B$19:$R$41,6,0)/'4. Billing Determinants'!$G$41*$D5,IF($E5=\"Distribution Rev.\",VLOOKUP(L$4,'4. Billing Determinants'!$B$19:$R$41,8,0)/'4. Billing Determinants'!$I$41*$D5, VLOOKUP(L$4,'4. Billing Determinants'!$B$19:$R$41,3,0)/'4. Billing Determinants'!$D$41*$D5))))),0)","v":-11.15863478572839},{"$f":"IFERROR(IF(M$4=\"\",0,IF($E5=\"kWh\",VLOOKUP(M$4,'4. Billing Determinants'!$B$19:$R$41,4,0)/'4. Billing Determinants'!$E$41*$D5,IF($E5=\"kW\",VLOOKUP(M$4,'4. Billing Determinants'!$B$19:$R$41,5,0)/'4. Billing Determinants'!$F$41*$D5,IF($E5=\"Non-RPP kWh\",VLOOKUP(M$4,'4. Billing Determinants'!$B$19:$R$41,6,0)/'4. Billing Determinants'!$G$41*$D5,IF($E5=\"Distribution Rev.\",VLOOKUP(M$4,'4. Billing Determinants'!$B$19:$R$41,8,0)/'4. Billing Determinants'!$I$41*$D5, VLOOKUP(M$4,'4. Billing Determinants'!$B$19:$R$41,3,0)/'4. Billing Determinants'!$D$41*$D5))))),0)","v":-1564.4668938899129},{"$f":"IFERROR(IF(N$4=\"\",0,IF($E5=\"kWh\",VLOOKUP(N$4,'4. Billing Determinants'!$B$19:$R$41,4,0)/'4. Billing Determinants'!$E$41*$D5,IF($E5=\"kW\",VLOOKUP(N$4,'4. Billing Determinants'!$B$19:$R$41,5,0)/'4. Billing Determinants'!$F$41*$D5,IF($E5=\"Non-RPP kWh\",VLOOKUP(N$4,'4. Billing Determinants'!$B$19:$R$41,6,0)/'4. Billing Determinants'!$G$41*$D5,IF($E5=\"Distribution Rev.\",VLOOKUP(N$4,'4. Billing Determinants'!$B$19:$R$41,8,0)/'4. Billing Determinants'!$I$41*$D5, VLOOKUP(N$4,'4. Billing Determinants'!$B$19:$R$41,3,0)/'4. Billing Determinants'!$D$41*$D5))))),0)","v":0},{"$f":"IFERROR(IF(O$4=\"\",0,IF($E5=\"kWh\",VLOOKUP(O$4,'4. Billing Determinants'!$B$19:$R$41,4,0)/'4. Billing Determinants'!$E$41*$D5,IF($E5=\"kW\",VLOOKUP(O$4,'4. Billing Determinants'!$B$19:$R$41,5,0)/'4. Billing Determinants'!$F$41*$D5,IF($E5=\"Non-RPP kWh\",VLOOKUP(O$4,'4. Billing Determinants'!$B$19:$R$41,6,0)/'4. Billing Determinants'!$G$41*$D5,IF($E5=\"Distribution Rev.\",VLOOKUP(O$4,'4. Billing Determinants'!$B$19:$R$41,8,0)/'4. Billing Determinants'!$I$41*$D5, VLOOKUP(O$4,'4. Billing Determinants'!$B$19:$R$41,3,0)/'4. Billing Determinants'!$D$41*$D5))))),0)","v":0},{"$f":"IFERROR(IF(P$4=\"\",0,IF($E5=\"kWh\",VLOOKUP(P$4,'4. Billing Determinants'!$B$19:$R$41,4,0)/'4. Billing Determinants'!$E$41*$D5,IF($E5=\"kW\",VLOOKUP(P$4,'4. Billing Determinants'!$B$19:$R$41,5,0)/'4. Billing Determinants'!$F$41*$D5,IF($E5=\"Non-RPP kWh\",VLOOKUP(P$4,'4. Billing Determinants'!$B$19:$R$41,6,0)/'4. Billing Determinants'!$G$41*$D5,IF($E5=\"Distribution Rev.\",VLOOKUP(P$4,'4. Billing Determinants'!$B$19:$R$41,8,0)/'4. Billing Determinants'!$I$41*$D5, VLOOKUP(P$4,'4. Billing Determinants'!$B$19:$R$41,3,0)/'4. Billing Determinants'!$D$41*$D5))))),0)","v":0},{"$f":"IFERROR(IF(Q$4=\"\",0,IF($E5=\"kWh\",VLOOKUP(Q$4,'4. Billing Determinants'!$B$19:$R$41,4,0)/'4. Billing Determinants'!$E$41*$D5,IF($E5=\"kW\",VLOOKUP(Q$4,'4. Billing Determinants'!$B$19:$R$41,5,0)/'4. Billing Determinants'!$F$41*$D5,IF($E5=\"Non-RPP kWh\",VLOOKUP(Q$4,'4. Billing Determinants'!$B$19:$R$41,6,0)/'4. Billing Determinants'!$G$41*$D5,IF($E5=\"Distribution Rev.\",VLOOKUP(Q$4,'4. Billing Determinants'!$B$19:$R$41,8,0)/'4. Billing Determinants'!$I$41*$D5, VLOOKUP(Q$4,'4. Billing Determinants'!$B$19:$R$41,3,0)/'4. Billing Determinants'!$D$41*$D5))))),0)","v":0},{"$f":"IFERROR(IF(R$4=\"\",0,IF($E5=\"kWh\",VLOOKUP(R$4,'4. Billing Determinants'!$B$19:$R$41,4,0)/'4. Billing Determinants'!$E$41*$D5,IF($E5=\"kW\",VLOOKUP(R$4,'4. Billing Determinants'!$B$19:$R$41,5,0)/'4. Billing Determinants'!$F$41*$D5,IF($E5=\"Non-RPP kWh\",VLOOKUP(R$4,'4. Billing Determinants'!$B$19:$R$41,6,0)/'4. Billing Determinants'!$G$41*$D5,IF($E5=\"Distribution Rev.\",VLOOKUP(R$4,'4. Billing Determinants'!$B$19:$R$41,8,0)/'4. Billing Determinants'!$I$41*$D5, VLOOKUP(R$4,'4. Billing Determinants'!$B$19:$R$41,3,0)/'4. Billing Determinants'!$D$41*$D5))))),0)","v":0},{"$f":"IFERROR(IF(S$4=\"\",0,IF($E5=\"kWh\",VLOOKUP(S$4,'4. Billing Determinants'!$B$19:$R$41,4,0)/'4. Billing Determinants'!$E$41*$D5,IF($E5=\"kW\",VLOOKUP(S$4,'4. Billing Determinants'!$B$19:$R$41,5,0)/'4. Billing Determinants'!$F$41*$D5,IF($E5=\"Non-RPP kWh\",VLOOKUP(S$4,'4. Billing Determinants'!$B$19:$R$41,6,0)/'4. Billing Determinants'!$G$41*$D5,IF($E5=\"Distribution Rev.\",VLOOKUP(S$4,'4. Billing Determinants'!$B$19:$R$41,8,0)/'4. Billing Determinants'!$I$41*$D5, VLOOKUP(S$4,'4. Billing Determinants'!$B$19:$R$41,3,0)/'4. Billing Determinants'!$D$41*$D5))))),0)","v":0},{"$f":"IFERROR(IF(T$4=\"\",0,IF($E5=\"kWh\",VLOOKUP(T$4,'4. Billing Determinants'!$B$19:$R$41,4,0)/'4. Billing Determinants'!$E$41*$D5,IF($E5=\"kW\",VLOOKUP(T$4,'4. Billing Determinants'!$B$19:$R$41,5,0)/'4. Billing Determinants'!$F$41*$D5,IF($E5=\"Non-RPP kWh\",VLOOKUP(T$4,'4. Billing Determinants'!$B$19:$R$41,6,0)/'4. Billing Determinants'!$G$41*$D5,IF($E5=\"Distribution Rev.\",VLOOKUP(T$4,'4. Billing Determinants'!$B$19:$R$41,8,0)/'4. Billing Determinants'!$I$41*$D5, VLOOKUP(T$4,'4. Billing Determinants'!$B$19:$R$41,3,0)/'4. Billing Determinants'!$D$41*$D5))))),0)","v":0},{"$f":"IFERROR(IF(U$4=\"\",0,IF($E5=\"kWh\",VLOOKUP(U$4,'4. Billing Determinants'!$B$19:$R$41,4,0)/'4. Billing Determinants'!$E$41*$D5,IF($E5=\"kW\",VLOOKUP(U$4,'4. Billing Determinants'!$B$19:$R$41,5,0)/'4. Billing Determinants'!$F$41*$D5,IF($E5=\"Non-RPP kWh\",VLOOKUP(U$4,'4. Billing Determinants'!$B$19:$R$41,6,0)/'4. Billing Determinants'!$G$41*$D5,IF($E5=\"Distribution Rev.\",VLOOKUP(U$4,'4. Billing Determinants'!$B$19:$R$41,8,0)/'4. Billing Determinants'!$I$41*$D5, VLOOKUP(U$4,'4. Billing Determinants'!$B$19:$R$41,3,0)/'4. Billing Determinants'!$D$41*$D5))))),0)","v":0},{"$f":"IFERROR(IF(V$4=\"\",0,IF($E5=\"kWh\",VLOOKUP(V$4,'4. Billing Determinants'!$B$19:$R$41,4,0)/'4. Billing Determinants'!$E$41*$D5,IF($E5=\"kW\",VLOOKUP(V$4,'4. Billing Determinants'!$B$19:$R$41,5,0)/'4. Billing Determinants'!$F$41*$D5,IF($E5=\"Non-RPP kWh\",VLOOKUP(V$4,'4. Billing Determinants'!$B$19:$R$41,6,0)/'4. Billing Determinants'!$G$41*$D5,IF($E5=\"Distribution Rev.\",VLOOKUP(V$4,'4. Billing Determinants'!$B$19:$R$41,8,0)/'4. Billing Determinants'!$I$41*$D5, VLOOKUP(V$4,'4. Billing Determinants'!$B$19:$R$41,3,0)/'4. Billing Determinants'!$D$41*$D5))))),0)","v":0},{"$f":"IFERROR(IF(W$4=\"\",0,IF($E5=\"kWh\",VLOOKUP(W$4,'4. Billing Determinants'!$B$19:$R$41,4,0)/'4. Billing Determinants'!$E$41*$D5,IF($E5=\"kW\",VLOOKUP(W$4,'4. Billing Determinants'!$B$19:$R$41,5,0)/'4. Billing Determinants'!$F$41*$D5,IF($E5=\"Non-RPP kWh\",VLOOKUP(W$4,'4. Billing Determinants'!$B$19:$R$41,6,0)/'4. Billing Determinants'!$G$41*$D5,IF($E5=\"Distribution Rev.\",VLOOKUP(W$4,'4. Billing Determinants'!$B$19:$R$41,8,0)/'4. Billing Determinants'!$I$41*$D5, VLOOKUP(W$4,'4. Billing Determinants'!$B$19:$R$41,3,0)/'4. Billing Determinants'!$D$41*$D5))))),0)","v":0},{"$f":"IFERROR(IF(X$4=\"\",0,IF($E5=\"kWh\",VLOOKUP(X$4,'4. Billing Determinants'!$B$19:$R$41,4,0)/'4. Billing Determinants'!$E$41*$D5,IF($E5=\"kW\",VLOOKUP(X$4,'4. Billing Determinants'!$B$19:$R$41,5,0)/'4. Billing Determinants'!$F$41*$D5,IF($E5=\"Non-RPP kWh\",VLOOKUP(X$4,'4. Billing Determinants'!$B$19:$R$41,6,0)/'4. Billing Determinants'!$G$41*$D5,IF($E5=\"Distribution Rev.\",VLOOKUP(X$4,'4. Billing Determinants'!$B$19:$R$41,8,0)/'4. Billing Determinants'!$I$41*$D5, VLOOKUP(X$4,'4. Billing Determinants'!$B$19:$R$41,3,0)/'4. Billing Determinants'!$D$41*$D5))))),0)","v":0},{"$f":"IFERROR(IF(Y$4=\"\",0,IF($E5=\"kWh\",VLOOKUP(Y$4,'4. Billing Determinants'!$B$19:$R$41,4,0)/'4. Billing Determinants'!$E$41*$D5,IF($E5=\"kW\",VLOOKUP(Y$4,'4. Billing Determinants'!$B$19:$R$41,5,0)/'4. Billing Determinants'!$F$41*$D5,IF($E5=\"Non-RPP kWh\",VLOOKUP(Y$4,'4. Billing Determinants'!$B$19:$R$41,6,0)/'4. Billing Determinants'!$G$41*$D5,IF($E5=\"Distribution Rev.\",VLOOKUP(Y$4,'4. Billing Determinants'!$B$19:$R$41,8,0)/'4. Billing Determinants'!$I$41*$D5, VLOOKUP(Y$4,'4. Billing Determinants'!$B$19:$R$41,3,0)/'4. Billing Determinants'!$D$41*$D5))))),0)","v":0}]
[null,"SME - Smart meter entity",1551,{"$f":"'2. 2016-20 Continuity Schedule'!BD20","v":96857.255000000005},"kWh",{"$f":"IFERROR(IF(F$4=\"\",0,IF($E6=\"kWh\",VLOOKUP(F$4,'4. Billing Determinants'!$B$19:$R$41,4,0)/'4. Billing Determinants'!$E$41*$D6,IF($E6=\"kW\",VLOOKUP(F$4,'4. Billing Determinants'!$B$19:$R$41,5,0)/'4. Billing Determinants'!$F$41*$D6,IF($E6=\"Non-RPP kWh\",VLOOKUP(F$4,'4. Billing Determinants'!$B$19:$R$41,6,0)/'4. Billing Determinants'!$G$41*$D6,IF($E6=\"Distribution Rev.\",VLOOKUP(F$4,'4. Billing Determinants'!$B$19:$R$41,8,0)/'4. Billing Determinants'!$I$41*$D6, VLOOKUP(F$4,'4. Billing Determinants'!$B$19:$R$41,3,0)/'4. Billing Determinants'!$D$41*$D6))))),0)","v":31310.026856951197},{"$f":"IFERROR(IF(G$4=\"\",0,IF($E6=\"kWh\",VLOOKUP(G$4,'4. Billing Determinants'!$B$19:$R$41,4,0)/'4. Billing Determinants'!$E$41*$D6,IF($E6=\"kW\",VLOOKUP(G$4,'4. Billing Determinants'!$B$19:$R$41,5,0)/'4. Billing Determinants'!$F$41*$D6,IF($E6=\"Non-RPP kWh\",VLOOKUP(G$4,'4. Billing Determinants'!$B$19:$R$41,6,0)/'4. Billing Determinants'!$G$41*$D6,IF($E6=\"Distribution Rev.\",VLOOKUP(G$4,'4. Billing Determinants'!$B$19:$R$41,8,0)/'4. Billing Determinants'!$I$41*$D6, VLOOKUP(G$4,'4. Billing Determinants'!$B$19:$R$41,3,0)/'4. Billing Determinants'!$D$41*$D6))))),0)","v":11840.753500000876},{"$f":"IFERROR(IF(H$4=\"\",0,IF($E6=\"kWh\",VLOOKUP(H$4,'4. Billing Determinants'!$B$19:$R$41,4,0)/'4. Billing Determinants'!$E$41*$D6,IF($E6=\"kW\",VLOOKUP(H$4,'4. Billing Determinants'!$B$19:$R$41,5,0)/'4. Billing Determinants'!$F$41*$D6,IF($E6=\"Non-RPP kWh\",VLOOKUP(H$4,'4. Billing Determinants'!$B$19:$R$41,6,0)/'4. Billing Determinants'!$G$41*$D6,IF($E6=\"Distribution Rev.\",VLOOKUP(H$4,'4. Billing Determinants'!$B$19:$R$41,8,0)/'4. Billing Determinants'!$I$41*$D6, VLOOKUP(H$4,'4. Billing Determinants'!$B$19:$R$41,3,0)/'4. Billing Determinants'!$D$41*$D6))))),0)","v":52066.283582422497},{"$f":"IFERROR(IF(I$4=\"\",0,IF($E6=\"kWh\",VLOOKUP(I$4,'4. Billing Determinants'!$B$19:$R$41,4,0)/'4. Billing Determinants'!$E$41*$D6,IF($E6=\"kW\",VLOOKUP(I$4,'4. Billing Determinants'!$B$19:$R$41,5,0)/'4. Billing Determinants'!$F$41*$D6,IF($E6=\"Non-RPP kWh\",VLOOKUP(I$4,'4. Billing Determinants'!$B$19:$R$41,6,0)/'4. Billing Determinants'!$G$41*$D6,IF($E6=\"Distribution Rev.\",VLOOKUP(I$4,'4. Billing Determinants'!$B$19:$R$41,8,0)/'4. Billing Determinants'!$I$41*$D6, VLOOKUP(I$4,'4. Billing Determinants'!$B$19:$R$41,3,0)/'4. Billing Determinants'!$D$41*$D6))))),0)","v":871.21319014319317},{"$f":"IFERROR(IF(J$4=\"\",0,IF($E6=\"kWh\",VLOOKUP(J$4,'4. Billing Determinants'!$B$19:$R$41,4,0)/'4. Billing Determinants'!$E$41*$D6,IF($E6=\"kW\",VLOOKUP(J$4,'4. Billing Determinants'!$B$19:$R$41,5,0)/'4. Billing Determinants'!$F$41*$D6,IF($E6=\"Non-RPP kWh\",VLOOKUP(J$4,'4. Billing Determinants'!$B$19:$R$41,6,0)/'4. Billing Determinants'!$G$41*$D6,IF($E6=\"Distribution Rev.\",VLOOKUP(J$4,'4. Billing Determinants'!$B$19:$R$41,8,0)/'4. Billing Determinants'!$I$41*$D6, VLOOKUP(J$4,'4. Billing Determinants'!$B$19:$R$41,3,0)/'4. Billing Determinants'!$D$41*$D6))))),0)","v":0},{"$f":"IFERROR(IF(K$4=\"\",0,IF($E6=\"kWh\",VLOOKUP(K$4,'4. Billing Determinants'!$B$19:$R$41,4,0)/'4. Billing Determinants'!$E$41*$D6,IF($E6=\"kW\",VLOOKUP(K$4,'4. Billing Determinants'!$B$19:$R$41,5,0)/'4. Billing Determinants'!$F$41*$D6,IF($E6=\"Non-RPP kWh\",VLOOKUP(K$4,'4. Billing Determinants'!$B$19:$R$41,6,0)/'4. Billing Determinants'!$G$41*$D6,IF($E6=\"Distribution Rev.\",VLOOKUP(K$4,'4. Billing Determinants'!$B$19:$R$41,8,0)/'4. Billing Determinants'!$I$41*$D6, VLOOKUP(K$4,'4. Billing Determinants'!$B$19:$R$41,3,0)/'4. Billing Determinants'!$D$41*$D6))))),0)","v":161.292611560979},{"$f":"IFERROR(IF(L$4=\"\",0,IF($E6=\"kWh\",VLOOKUP(L$4,'4. Billing Determinants'!$B$19:$R$41,4,0)/'4. Billing Determinants'!$E$41*$D6,IF($E6=\"kW\",VLOOKUP(L$4,'4. Billing Determinants'!$B$19:$R$41,5,0)/'4. Billing Determinants'!$F$41*$D6,IF($E6=\"Non-RPP kWh\",VLOOKUP(L$4,'4. Billing Determinants'!$B$19:$R$41,6,0)/'4. Billing Determinants'!$G$41*$D6,IF($E6=\"Distribution Rev.\",VLOOKUP(L$4,'4. Billing Determinants'!$B$19:$R$41,8,0)/'4. Billing Determinants'!$I$41*$D6, VLOOKUP(L$4,'4. Billing Determinants'!$B$19:$R$41,3,0)/'4. Billing Determinants'!$D$41*$D6))))),0)","v":4.3036481356536518},{"$f":"IFERROR(IF(M$4=\"\",0,IF($E6=\"kWh\",VLOOKUP(M$4,'4. Billing Determinants'!$B$19:$R$41,4,0)/'4. Billing Determinants'!$E$41*$D6,IF($E6=\"kW\",VLOOKUP(M$4,'4. Billing Determinants'!$B$19:$R$41,5,0)/'4. Billing Determinants'!$F$41*$D6,IF($E6=\"Non-RPP kWh\",VLOOKUP(M$4,'4. Billing Determinants'!$B$19:$R$41,6,0)/'4. Billing Determinants'!$G$41*$D6,IF($E6=\"Distribution Rev.\",VLOOKUP(M$4,'4. Billing Determinants'!$B$19:$R$41,8,0)/'4. Billing Determinants'!$I$41*$D6, VLOOKUP(M$4,'4. Billing Determinants'!$B$19:$R$41,3,0)/'4. Billing Determinants'!$D$41*$D6))))),0)","v":603.38161078561416}]
{"$rows_left_out":57}
{"sheet":"6. Rate Rider Calculations","index":5,"n_rows":160,"n_cols":7,"rows_kept":160,"cut":false,"hidden":false,"merged":[[128,1,129,1],[128,2,129,2],[128,3,129,3],[128,4,129,4],[128,5,129,5],[100,1,101,1],[100,2,101,2],[100,3,101,3],[100,4,101,4],[100,5,101,5],[15,1,15,5],[72,1,73,1],[72,2,73,2],[72,3,73,3],[72,4,73,4],[72,5,73,5],[44,1,45,1],[44,2,45,2],[17,3,18,3],[17,4,18,4],[17,5,18,5],[44,4,45,4],[44,5,45,5],[44,3,45,3],[17,1,18,1],[17,2,18,2]]}
[]
[]
[]
[]
[]
[]
{"$rows_left_out":155}
{"sheet":"RR Summary","index":6,"n_rows":8,"n_cols":10,"rows_kept":8,"cut":false,"hidden":false,"merged":[]}
[]
[null,"Res","GS<50","GS>50","LU",null,"USL","Sentinel","S/L"]
[null,{"$f":"TRANSPOSE('6. Rate Rider Calculations'!B20:B27)","v":"RESIDENTIAL"},"GENERAL SERVICE LESS THAN 50 KW","GENERAL SERVICE 50 TO 4,999 KW","LARGE USER","STANDBY POWER","UNMETERED SCATTERED LOAD","SENTINEL LIGHTING","STREET LIGHTING"]
["Disposition of Deferral/Variance Accounts (2016) ",{"$f":"TRANSPOSE('6. Rate Rider Calculations'!F20:F27)","v":2.4041188894250579E-4},2.0832406866207691E-4,3.4663501019577894E-2,1.6860156178429127E-2,0,2.0311160606555119E-4,3.9656351830863315E-2,-0.19203104161012116,"2 years"]
["Disposition of Global Adjustment Sub-Account (2016) ",{"$f":"TRANSPOSE('6. Rate Rider Calculations'!F47:F54)","v":1.1147692772602161E-3},1.1147692772602159E-3,0.41751679410702769,0,0,1.1147692772602159E-3,0.43227894189388971,0.39871369536527979,"2 years"]
["Lost Revenue Adjustment Mechanism Variance Account (LRAMVA) (2013 balance)",{"$f":"TRANSPOSE('6. Rate Rider Calculations'!F103:F110)","v":-1.3740617801664897E-4},5.3613524282884579E-5,-1.2612606416179901E-2,-3.5276877068040606E-2,0,-2.3599611142770943E-4,-0.16615384615384615,-0.12964474882763741]
{"$rows_left_out":3}
{"sheet":"Sheet1","index":7,"n_rows":0,"n_cols":0,"rows_kept":0,"cut":false,"hidden":false,"merged":[]}