{"text_format":"1","workbook":"xlsx","n_sheets":10,"sheets":["1. Info","2. Table of Contents","3. Rate Classes","4. RRR Data","5. UTRs and Sub-Transmission","6. Historical Wholesale","7. Current Wholesale","8. Forecast Wholesale","9. RTSR Rates to Forecast","hidden1"],"not_rendered":{"charts":0,"images":3,"macros":1,"external_links":2,"defined_names":20,"comments":0,"pivot_tables":0},"unopened":[],"bounds":{"document_bytes":16777216,"sheet_cells":100000,"rows_first":2000,"rows_last":500,"rows_between":2000,"halvings":0,"cell_chars":16384,"cell_head_chars":4096},"cells_cut":0,"cells_raw":0,"read":"whole","date_system":"1900"}

{"sheet":"1. Info","index":0,"n_rows":76,"n_cols":28,"rows_kept":76,"cut":false,"hidden":false,"merged":[[24,3,24,4],[20,3,20,4],[1,2,1,9],[2,2,2,9],[3,2,3,9],[4,2,4,9],[14,3,14,4],[16,3,16,4]]}
[null,null,null,null,null,null,null,null,null,null,null,null,null,null,null,null,null,null,null,null,null,null,null,null,null,null,null,"Algoma Power Inc."]
[null,null,null,null,null,null,null,null,null,null,null,null,null,null,null,null,null,null,null,null,null,null,null,null,null,null,null,"Atikokan Hydro Inc."]
[null,null,null,null,null,null,null,null,null,null,null,null,null,null,null,null,null,null,null,null,null,null,null,null,null,null,null,"Attawapiskat Power Corporation"]
[null,null,null,null,null,null,null,null,null,null,null,null,null,null,null,null,null,null,null,null,null,null,null,null,null,null,null,"Bluewater Power Distribution Corporation"]
[null,null,null,null,null,null,null,null,null,null,null,null,null,null,null,null,null,null,null,null,null,null,null,null,null,null,null,"Brant County Power Inc."]
[null,null,null,null,null,null,null,null,null,null,null,null,null,null,null,null,null,null,null,null,null,null,null,null,null,null,null,"Brantford Power Inc."]
[null,null,null,null,null,null,null,null,null,null,null,null,null,null,null,null,null,null,null,null,null,null,null,null,null,null,null,"Burlington Hydro Inc."]
[null,null,null,null,null,null,null,null,null,null,null,null,null,null,null,null,null,null,null,null,null,null,null,null,null,null,null,"Cambridge and North Dumfries Hydro Inc."]
[null,null,null,null,null,null,null,null,null,null,null,null,null,null,null,null,null,null,null,null,null,null,null,null,null,null,null,"Canadian Niagara Power Inc."]
[null,null,null,null,null,null,null,null,null,null,null,null,null,null,null,null,null,null,null,null,null,null,null,null,null,null,null,"Centre Wellington Hydro Ltd."]
[null,null,null,null,null,null,null,null,null,null,null,null,null,null,null,null,null,null,null,null,null,null,null,null,null,null,null,"Chapleau Public Utilities Corporation"]
[null,null,null,null,null,null,null,null,null,null,null,null,null,null,null,null,null,null,null,null,null,null,null,null,null,null,null,"COLLUS PowerStream Corp."]
["Drop-down lists are shaded blue; Input cells are shaded green.",null,null,null,null,null,null,null,null,null,null,null,null,null,null,null,null,null,null,null,null,null,null,null,null,null,null,"Cooperative Hydro Embrun Inc."]
[null,null,null,null,null,null,null,null,null,null,null,null,null,null,null,null,null,null,null,null,null,null,null,null,null,null,null,"E.L.K. Energy Inc."]
[null,null,"Utility Name   ","Halton Hills Hydro Inc.",null,null,null,null,null,null,null,null,null,null,null,null,null,null,null,null,null,null,null,null,null,null,null,"Enersource Hydro Mississauga Inc."]
[null,null,null,null,null,null,null,null,null,null,null,null,null,null,null,null,null,null,null,null,null,null,null,null,null,null,null,"Entegrus Powerlines Inc."]
[null,null,"Service Territory","The Town of Halton Hills",null,null,null,null,null,null,null,null,null,null,null,null,null,null,null,null,null,null,null,null,null,null,null,"EnWin Utilities Ltd."]
[null,null,null,null,null,null,null,null,null,null,null,null,null,null,null,null,null,null,null,null,null,null,null,null,null,null,null,"Erie Thames Powerlines Corporation"]
[null,null,"Assigned EB Number","EB-2015-0074",null,null,null,null,null,null,null,null,null,null,null,null,null,null,null,null,null,null,null,null,null,null,null,"Espanola Regional Hydro Distribution Corporation"]
[null,null,null,null,null,null,null,null,null,null,null,null,null,null,null,null,null,null,null,null,null,null,null,null,null,null,null,"Essex Powerlines Corporation"]
[null,null,"Name and Title","David J. Smelsky, Chief Financial Officer",null,null,null,null,null,null,null,null,null,null,null,null,null,null,null,null,null,null,null,null,null,null,null,"Festival Hydro Inc."]
[null,null,null,null,null,null,null,null,null,null,null,null,null,null,null,null,null,null,null,null,null,null,null,null,null,null,null,"Fort Albany Power Corporation"]
[null,null,"Phone Number","519-853-3700 extension 208",null,null,null,null,null,null,null,null,null,null,null,null,null,null,null,null,null,null,null,null,null,null,null,"Fort Frances Power Corporation"]
[null,null,null,null,null,null,null,null,null,null,null,null,null,null,null,null,null,null,null,null,null,null,null,null,null,null,null,"Greater Sudbury Hydro Inc."]
[null,null,"Email Address","dsmelsky@haltonhillshydro.com",null,null,null,null,null,null,null,null,null,null,null,null,null,null,null,null,null,null,null,null,null,null,null,"Grimsby Power Inc."]
[null,null,null,null,null,null,null,null,null,null,null,null,null,null,null,null,null,null,null,null,null,null,null,null,null,null,null,"Guelph Hydro Electric Systems Inc."]
[null,null,"Date",null,null,null,null,null,null,null,null,null,null,null,null,null,null,null,null,null,null,null,null,null,null,null,null,"Haldimand County Hydro Inc."]
[null,null,null,null,null,null,null,null,null,null,null,null,null,null,null,null,null,null,null,null,null,null,null,null,null,null,null,"Halton Hills Hydro Inc."]
[null,null,"Last COS Re-based Year",2012,null,null,null,null,null,null,null,null,null,null,null,null,null,null,null,null,null,null,null,null,null,null,null,"Hearst Power Distribution Company Limited"]
[null,null,null,null,null,null,null,null,null,null,null,null,null,null,null,null,null,null,null,null,null,null,null,null,null,null,null,"Horizon Utilities Corporation"]
{"$rows_left_out":47}
{"sheet":"2. Table of Contents","index":1,"n_rows":28,"n_cols":9,"rows_kept":28,"cut":false,"hidden":false,"merged":[]}
[]
[]
[]
[]
[]
[]
[]
[]
[]
[]
[]
[]
[]
[]
[]
[]
[]
[]
[]
[null,null,null,"1. Info",null,null,null,null,"6. Historical Wholesale"]
[]
[null,null,null,"2. Table of Contents",null,null,null,null,"7. Current Wholesale"]
[]
[null,null,null,"3. Rate Classes",null,null,null,null,"8. Forecast Wholesale"]
[]
[null,null,null,"4. RRR Data",null,null,null,null,"9. RTSR Rates to Forecast"]
[]
[null,null,null,"5. UTRs and Sub-Transmission"]

{"sheet":"3. Rate Classes","index":2,"n_rows":100,"n_cols":23,"rows_kept":100,"cut":false,"hidden":false,"merged":[[12,2,12,8]]}
[]
[]
[]
[]
[]
[]
[]
[]
[]
[]
[]
[]
[null,null,"1.  Select the appropriate rate classes that appear on your most recent Board-Approved Tariff of Rates and Charges.\n2.  Enter the RTS Network and Connection Rate as it appears on the Tariff of Rates and Charges"]
[]
[null,null,"Rate Class",null,"Unit",null,"RTSR-Network",null,"RTSR-Connection"]
[]
[null,null,"Residential - Time of Use",null,"kWh",null,7.4000000000000003E-3,null,5.1000000000000004E-3,null,null,{"$f":"IF(OR(ISBLANK(C17), ISERROR(FIND(\"Choose\", C17))=FALSE), 0, 1)","v":1},{"$f":"\"C\" & ROW(C17)","v":"C17"},{"$f":"IF(OR(C17=\"General Service Intermediate Rate Class 1,000 To 4,999 kW (formerly General Service > 50 kW Customers)\", C17=\"General Service Intermediate Rate Class 1,000 To 4,999 kW (formerly Large Use Customers)\"), \"x\", \"\")","v":""},null,null,null,null,null,null,null,null,"Choose Rate Class"]
[null,null,"General Service Less Than 50 kW",null,"kWh",null,6.6E-3,null,4.7999999999999996E-3,null,null,1,"C18",{"$f":"IF(OR(C18=\"General Service Intermediate Rate Class 1,000 To 4,999 kW (formerly General Service > 50 kW Customers)\", C18=\"General Service Intermediate Rate Class 1,000 To 4,999 kW (formerly Large Use Customers)\"), \"x\", \"\")","v":""},null,null,null,null,null,null,null,null,"Residential"]
[null,null,"General Service 50 to 999 kW",null,"kW",null,2.8647,null,2.0573999999999999,null,null,1,"C19","",null,null,null,null,null,null,null,null,"Residential Regular"]
[null,null,"General Service 1,000 to 4,999 kW",null,"kW",null,2.8647,null,2.0573999999999999,null,null,1,"C20","",null,null,null,null,null,null,null,null,"Residential Urban"]
[null,null,"Unmetered Scattered Load",null,"kWh",null,6.6E-3,null,4.7999999999999996E-3,null,null,1,"C21","",null,null,null,null,null,null,null,null,"Residential Urban Year-Round"]
[null,null,"Sentinel Lighting",null,"kW",null,2.0436999999999999,null,1.4811000000000001,null,null,1,"C22","",null,null,null,null,null,null,null,null,"Residential Suburban"]
[null,null,"Street Lighting",null,"kW",null,2.0343,null,1.4509000000000001,null,null,1,"C23","",null,null,null,null,null,null,null,null,"Residential Suburban Seasonal"]
[null,null,"Choose Rate Class",null,null,null,null,null,null,null,null,0,"C24","",null,null,null,null,null,null,null,null,"Residential Suburban Year Round"]
[null,null,"Choose Rate Class",null,null,null,null,null,null,null,null,0,"C25","",null,null,null,null,null,null,null,null,"Residential - Time of Use"]
[null,null,"Choose Rate Class",null,null,null,null,null,null,null,null,0,"C26","",null,null,null,null,null,null,null,null,"Residential - Hensall"]
[null,null,"Choose Rate Class",null,null,null,null,null,null,null,null,0,"C27","",null,null,null,null,null,null,null,null,"Residential – High Density [R1]"]
[null,null,"Choose Rate Class",null,null,null,null,null,null,null,null,0,"C28","",null,null,null,null,null,null,null,null,"Residential – Normal Density [R2]"]
[null,null,"Choose Rate Class",null,null,null,null,null,null,null,null,0,"C29","",null,null,null,null,null,null,null,null,"Seasonal Residential – High Density [R3]"]
[null,null,"Choose Rate Class",null,null,null,null,null,null,null,null,0,"C30","",null,null,null,null,null,null,null,null,"Seasonal Residential – Normal Density [R4]"]
{"$rows_left_out":71}
{"sheet":"4. RRR Data","index":3,"n_rows":30,"n_cols":9,"rows_kept":30,"cut":false,"hidden":false,"merged":[[12,1,12,8]]}
[]
[]
[]
[]
[]
[]
[]
[]
[]
[]
[]
[]
[]
[]
[null,"Rate Class","Rate Description","Unit","Rate","Non-Loss Adjusted Metered kWh","Non-Loss Adjusted Metered kW","Applicable \nLoss Factor\neg: (1.0325)","Loss Adjusted Billed kWh"]
[]
[null,"Residential - Time of Use","RTSR - Network","kWh",7.4000000000000003E-3,204505080.00000468,0,1.0602,{"$f":"F17*H17","v":216816285.81600496}]
[null,"Residential - Time of Use","RTSR - Connection","kWh",5.1000000000000004E-3,204505080.00000468,0,1.0602,{"$f":"F18*H18","v":216816285.81600496}]
[null,"General Service Less Than 50 kW","RTSR - Network","kWh",6.6E-3,51530040.759999998,0,1.0602,{"$f":"F19*H19","v":54632149.213752002}]
[null,"General Service Less Than 50 kW","RTSR - Connection","kWh",4.7999999999999996E-3,51530040.759999998,0,1.0602,{"$f":"F20*H20","v":54632149.213752002}]
[null,"General Service 50 to 999 kW","RTSR - Network","kW",2.8647,133375026.56000002,380752.12000000011]
[null,"General Service 50 to 999 kW","RTSR - Connection","kW",2.0573999999999999,133375026.56000002,380752.12000000011]
[null,"General Service 1,000 to 4,999 kW","RTSR - Network","kW",2.8647,116677999.95000002,307814.96999999991]
[null,"General Service 1,000 to 4,999 kW","RTSR - Connection","kW",2.0573999999999999,116677999.95000002,307814.96999999991]
[null,"Unmetered Scattered Load","RTSR - Network","kWh",6.6E-3,923011.21,0,1.0602,{"$f":"F25*H25","v":978576.48484199995}]
[null,"Unmetered Scattered Load","RTSR - Connection","kWh",4.7999999999999996E-3,923011.21,0,1.0602,{"$f":"F26*H26","v":978576.48484199995}]
[null,"Sentinel Lighting","RTSR - Network","kW",2.0436999999999999,279260.10000000003,671.39]
[null,"Sentinel Lighting","RTSR - Connection","kW",1.4811000000000001,279260.10000000003,671.39]
[null,"Street Lighting","RTSR - Network","kW",2.0343,2782603.35,7764.2099999999982]
[null,"Street Lighting","RTSR - Connection","kW",1.4509000000000001,2782603.35,7764.2099999999982]
{"$rows_left_out":1}
{"sheet":"5. UTRs and Sub-Transmission","index":4,"n_rows":95,"n_cols":9,"rows_kept":95,"cut":false,"hidden":false,"merged":[]}
[]
[]
[]
[]
[]
[]
[]
[]
[]
[]
[]
[]
[]
[]
[]
[]
[]
[null,"Uniform Transmission Rates","Unit",null,"Effective \nJanuary 1, 2014",null,"Effective \nJanuary 1, 2015",null,"Effective \nJanuary 1, 2016"]
[]
[null,"Rate Description",null,null,"Rate",null,"Rate",null,"Rate"]
[]
[null,"Network Service Rate","kW",null,3.82,null,3.78,null,3.78]
[]
[null,"Line Connection Service Rate","kW",null,0.82,null,0.86,null,0.86]
[]
[null,"Transformation Connection Service Rate","kW",null,1.98,null,2,null,2]
[]
[]
[null,"Hydro One Sub-Transmission Rates","Unit",null,"Effective \nJanuary 1, 2014 to April 30, 2015",null,"Effective \nMay 1, 2015",null,"Effective \nJanuary 1, 2016"]
[]
{"$rows_left_out":66}
{"sheet":"6. Historical Wholesale","index":5,"n_rows":117,"n_cols":16,"rows_kept":117,"cut":false,"hidden":false,"merged":[[95,7,95,9],[95,11,95,13],[96,7,96,9],[96,11,96,13],[20,3,20,5],[20,7,20,9],[20,11,20,13],[96,3,96,5],[38,3,38,5],[38,7,38,9],[38,11,38,13],[95,3,95,5],[57,3,57,5],[57,7,57,9],[57,11,57,13],[76,3,76,5],[76,7,76,9],[76,11,76,13]]}
[]
[]
[]
[]
[]
[]
[]
[]
[]
[]
[]
[]
[]
[]
[]
[]
[]
[]
[]
[]
[null,"IESO",null,"Network",null,null,null,"Line Connection",null,null,null,"Transformation Connection",null,null,null,"Total Line"]
[null,"Month",null,"Units Billed","Rate","Amount",null,"Units Billed","Rate","Amount",null,"Units Billed","Rate","Amount",null,"Amount"]
[]
[null,"January",null,15294.000000000002,3.82,58423.08,null,17993,0.82,14754.26,null,17993,1.98,35626.14,null,{"$f":"J24+N24","v":50380.4}]
[null,"February",null,9725,3.82,37149.5,null,10384,0.82,8514.8799999999992,null,10384,1.98,20560.32,null,29075.199999999997]
[null,"March",null,10894.000000000002,3.82,41615.08,null,13418.000000000002,0.82,11002.76,null,13418,1.98,26567.64,null,37570.400000000001]
[null,"April",null,12725,3.82,48609.5,null,13017.000000000002,0.82,10673.94,null,13017,1.98,25773.66,null,36447.599999999999]
[null,"May",null,14175,3.82,54148.5,null,14175,0.82,11623.5,null,14175,1.98,28066.5,null,39690]
[null,"June",null,12762,3.82,48750.84,null,15014,0.82,12311.48,null,15014,1.98,29727.72,null,42039.199999999997]
[null,"July",null,16037,3.82,61261.34,null,16037.000000000002,0.82,13150.34,null,16037,1.98,31753.26,null,44903.6]
{"$rows_left_out":88}
{"sheet":"7. Current Wholesale","index":6,"n_rows":117,"n_cols":16,"rows_kept":117,"cut":false,"hidden":false,"merged":[[12,1,12,11],[19,3,19,5],[19,7,19,9],[19,11,19,13],[38,3,38,5],[38,7,38,9],[38,11,38,13],[96,7,96,9],[96,11,96,13],[20,3,20,5],[20,7,20,9],[20,11,20,13],[96,3,96,5],[95,3,95,5],[95,7,95,9],[95,11,95,13],[57,3,57,5],[57,7,57,9],[57,11,57,13],[76,3,76,5],[76,7,76,9],[76,11,76,13]]}
[]
[]
[]
[]
[]
[]
[]
[]
[]
[]
[]
[]
[null,"The purpose of this sheet is to calculate the expected billing when current 2015 Uniform Transmission Rates are applied against historical 2014 transmission units."]
[]
[]
[]
[]
[]
[]
[null,"IESO",null,"Network",null,null,null,"Line Connection",null,null,null,"Transformation Connection",null,null,null,"Total Line"]
[]
[null,"Month",null,"Units Billed","Rate","Amount",null,"Units Billed","Rate","Amount",null,"Units Billed","Rate","Amount",null,"Amount"]
[]
[null,"January",null,{"$f":"'6. Historical Wholesale'!D24","v":15294.000000000002},{"$f":"'5. UTRs and Sub-Transmission'!G22","v":3.78},{"$f":"D24*E24","v":57811.320000000007},null,{"$f":"'6. Historical Wholesale'!H24","v":17993},{"$f":"'5. UTRs and Sub-Transmission'!G24","v":0.86},{"$f":"H24*I24","v":15473.98},null,{"$f":"'6. Historical Wholesale'!L24","v":17993},{"$f":"'5. UTRs and Sub-Transmission'!G26","v":2},{"$f":"L24*M24","v":35986},null,{"$f":"J24+N24","v":51459.979999999996}]
[null,"February",null,{"$f":"'6. Historical Wholesale'!D25","v":9725},{"$f":"E24","v":3.78},{"$f":"D25*E25","v":36760.5},null,{"$f":"'6. Historical Wholesale'!H25","v":10384},{"$f":"I24","v":0.86},{"$f":"H25*I25","v":8930.24},null,{"$f":"'6. Historical Wholesale'!L25","v":10384},{"$f":"M24","v":2},{"$f":"L25*M25","v":20768},null,29698.239999999998]
[null,"March",null,{"$f":"'6. Historical Wholesale'!D26","v":10894.000000000002},{"$f":"E25","v":3.78},41179.320000000007,null,{"$f":"'6. Historical Wholesale'!H26","v":13418.000000000002},{"$f":"I25","v":0.86},11539.480000000001,null,{"$f":"'6. Historical Wholesale'!L26","v":13418},{"$f":"M25","v":2},26836,null,38375.480000000003]
[null,"April",null,{"$f":"'6. Historical Wholesale'!D27","v":12725},3.78,48100.5,null,{"$f":"'6. Historical Wholesale'!H27","v":13017.000000000002},0.86,11194.62,null,{"$f":"'6. Historical Wholesale'!L27","v":13017},2,26034,null,37228.620000000003]
[null,"May",null,{"$f":"'6. Historical Wholesale'!D28","v":14175},3.78,53581.5,null,{"$f":"'6. Historical Wholesale'!H28","v":14175},0.86,12190.5,null,{"$f":"'6. Historical Wholesale'!L28","v":14175},2,28350,null,40540.5]
[null,"June",null,{"$f":"'6. Historical Wholesale'!D29","v":12762},3.78,48240.36,null,{"$f":"'6. Historical Wholesale'!H29","v":15014},0.86,12912.039999999999,null,{"$f":"'6. Historical Wholesale'!L29","v":15014},2,30028,null,42940.04]
[null,"July",null,{"$f":"'6. Historical Wholesale'!D30","v":16037},3.78,60619.859999999993,null,{"$f":"'6. Historical Wholesale'!H30","v":16037.000000000002},0.86,13791.820000000002,null,{"$f":"'6. Historical Wholesale'!L30","v":16037},2,32074,null,45865.82]
{"$rows_left_out":88}
{"sheet":"8. Forecast Wholesale","index":7,"n_rows":117,"n_cols":16,"rows_kept":117,"cut":false,"hidden":false,"merged":[[12,1,12,12],[19,3,19,5],[19,7,19,9],[19,11,19,13],[38,3,38,5],[38,7,38,9],[38,11,38,13],[96,7,96,9],[96,11,96,13],[20,3,20,5],[20,7,20,9],[20,11,20,13],[96,3,96,5],[95,3,95,5],[95,7,95,9],[95,11,95,13],[57,3,57,5],[57,7,57,9],[57,11,57,13],[76,3,76,5],[76,7,76,9],[76,11,76,13]]}
[]
[]
[]
[]
[]
[]
[]
[]
[]
[]
[]
[]
[null,"The purpose of this sheet is to calculate the expected billing when forecasted 2016 Uniform Transmission Rates are applied against historical 2014 transmission units."]
[]
[]
[]
[]
[]
[]
[null,"IESO",null,"Network",null,null,null,"Line Connection",null,null,null,"Transformation Connection",null,null,null,"Total Line"]
[]
[null,"Month",null,"Units Billed","Rate","Amount",null,"Units Billed","Rate","Amount",null,"Units Billed","Rate","Amount",null,"Amount"]
[]
[null,"January",null,{"$f":"'6. Historical Wholesale'!D24","v":15294.000000000002},{"$f":"'5. UTRs and Sub-Transmission'!I22","v":3.78},{"$f":"D24*E24","v":57811.320000000007},null,{"$f":"'6. Historical Wholesale'!H24","v":17993},{"$f":"'5. UTRs and Sub-Transmission'!I24","v":0.86},{"$f":"H24*I24","v":15473.98},null,{"$f":"'6. Historical Wholesale'!L24","v":17993},{"$f":"'5. UTRs and Sub-Transmission'!I26","v":2},{"$f":"L24*M24","v":35986},null,{"$f":"J24+N24","v":51459.979999999996}]
[null,"February",null,{"$f":"'6. Historical Wholesale'!D25","v":9725},{"$f":"E24","v":3.78},36760.5,null,{"$f":"'6. Historical Wholesale'!H25","v":10384},{"$f":"I24","v":0.86},8930.24,null,{"$f":"'6. Historical Wholesale'!L25","v":10384},{"$f":"M24","v":2},20768,null,29698.239999999998]
[null,"March",null,{"$f":"'6. Historical Wholesale'!D26","v":10894.000000000002},3.78,41179.320000000007,null,{"$f":"'6. Historical Wholesale'!H26","v":13418.000000000002},0.86,11539.480000000001,null,{"$f":"'6. Historical Wholesale'!L26","v":13418},2,26836,null,38375.480000000003]
[null,"April",null,{"$f":"'6. Historical Wholesale'!D27","v":12725},3.78,48100.5,null,{"$f":"'6. Historical Wholesale'!H27","v":13017.000000000002},0.86,11194.62,null,{"$f":"'6. Historical Wholesale'!L27","v":13017},2,26034,null,37228.620000000003]
[null,"May",null,{"$f":"'6. Historical Wholesale'!D28","v":14175},3.78,53581.5,null,{"$f":"'6. Historical Wholesale'!H28","v":14175},0.86,12190.5,null,{"$f":"'6. Historical Wholesale'!L28","v":14175},2,28350,null,40540.5]
[null,"June",null,{"$f":"'6. Historical Wholesale'!D29","v":12762},3.78,48240.36,null,{"$f":"'6. Historical Wholesale'!H29","v":15014},0.86,12912.039999999999,null,{"$f":"'6. Historical Wholesale'!L29","v":15014},2,30028,null,42940.04]
[null,"July",null,{"$f":"'6. Historical Wholesale'!D30","v":16037},3.78,60619.859999999993,null,{"$f":"'6. Historical Wholesale'!H30","v":16037.000000000002},0.86,13791.820000000002,null,{"$f":"'6. Historical Wholesale'!L30","v":16037},2,32074,null,45865.82]
{"$rows_left_out":88}
{"sheet":"9. RTSR Rates to Forecast","index":8,"n_rows":56,"n_cols":10,"rows_kept":56,"cut":false,"hidden":false,"merged":[]}
[]
[]
[]
[]
[]
[]
[]
[]
[]
[]
[]
[]
["The purpose of this sheet is to re-align the current RTS Network Rates to recover current wholesale network costs."]
[]
["Rate Class","Rate Description","Unit","Current RTSR-Network","Loss Adjusted Billed kWh","Billed kW","Billed Amount","Billed Amount %","Current Wholesale Billing","Adjusted RTSR Network"]
[]
["Residential - Time of Use","RTSR - Network","kWh",7.4000000000000003E-3,216816285.81600496,0,{"$f":"ROUND(D17*E17, 2)","v":1604440.52},{"$f":"G17/3961176.29","v":0.40504143278106919},{"$f":"H17*total_current_wholesale_network","v":1480043.3341235551},{"$f":"IF(ISERROR(I17/E17), 0, I17/E17)","v":6.8262553643205206E-3}]
["General Service Less Than 50 kW","RTSR - Network","kWh",6.6E-3,54632149.213752002,0,{"$f":"ROUND(D18*E18, 2)","v":360572.18},9.1026542017396558E-2,332615.91491057497,{"$f":"IF(ISERROR(I18/E18), 0, I18/E18)","v":6.0882817113636252E-3}]
["General Service 50 to 999 kW","RTSR - Network","kW",2.8647,null,380752.12000000011,{"$f":"ROUND(D19*F19, 2)","v":1090740.6000000001},0.27535775238117466,1006172.1417307056,{"$f":"IF(ISERROR(I19/F19), 0, I19/F19)","v":2.6425910425152863}]
["General Service 1,000 to 4,999 kW","RTSR - Network","kW",2.8647,null,307814.96999999991,{"$f":"ROUND(D20*F20, 2)","v":881797.54},0.22261002173170133,813429.07689937239,{"$f":"IF(ISERROR(I20/F20), 0, I20/F20)","v":2.6425910244046045}]
["Unmetered Scattered Load","RTSR - Network","kWh",6.6E-3,978576.48484199995,0,{"$f":"ROUND(D21*E21, 2)","v":6458.6},1.6304752748078275E-3,5957.8449675220081,{"$f":"IF(ISERROR(I21/E21), 0, I21/E21)","v":6.0882772678560286E-3}]
["Sentinel Lighting","RTSR - Network","kW",2.0436999999999999,null,671.39,{"$f":"ROUND(D22*F22, 2)","v":1372.12},3.4639205618389678E-4,1265.735335341451,{"$f":"IF(ISERROR(I22/F22), 0, I22/F22)","v":1.8852460348552273}]
["Street Lighting","RTSR - Network","kW",2.0343,null,7764.2099999999982,{"$f":"ROUND(D23*F23, 2)","v":15794.73},3.9873837576665889E-3,14570.116223929159,{"$f":"IF(ISERROR(I23/F23), 0, I23/F23)","v":1.8765742070254621}]
[]
["The purpose of this table is to re-align the current RTS Connection Rates to recover current wholesale connection costs."]
["Rate Class","Rate Description","Unit","Current RTSR-Connection","Loss Adjusted Billed kWh","Billed kW","Billed Amount","Billed Amount %","Current Wholesale Billing","Adjusted RTSR-Connection"]
[]
["Residential - Time of Use","RTSR - Connection","kWh",5.1000000000000004E-3,216816285.81600496,0,{"$f":"ROUND(D28*E28, 2)","v":1105763.06},{"$f":"G28/2801611.97","v":0.39468815519088463},{"$f":"H28*Total_Current_Wholesale_Lineplus","v":1132418.6949886749},{"$f":"IF(ISERROR(I28/E28), 0, I28/E28)","v":5.2229411214509518E-3}]
["General Service Less Than 50 kW","RTSR - Connection","kWh",4.7999999999999996E-3,54632149.213752002,0,{"$f":"ROUND(D29*E29, 2)","v":262234.32},9.3601227724623121E-2,268555.7667622235,{"$f":"IF(ISERROR(I29/E29), 0, I29/E29)","v":4.9157093511273146E-3}]
["General Service 50 to 999 kW","RTSR - Connection","kW",2.0573999999999999,null,380752.12000000011,{"$f":"ROUND(D30*F30, 2)","v":783359.41},0.27961024524034994,802243.15033574938,{"$f":"IF(ISERROR(I30/F30), 0, I30/F30)","v":2.1069958857635491}]
{"$rows_left_out":27}
{"sheet":"hidden1","index":9,"n_rows":22,"n_cols":2,"rows_kept":22,"cut":false,"hidden":true,"merged":[]}
[{"$f":"IF('3. Rate Classes'!L17=1, '3. Rate Classes'!C17, \"\")","v":"Residential - Time of Use"},1]
[{"$f":"IF('3. Rate Classes'!L18=1, '3. Rate Classes'!C18, \"\")","v":"General Service Less Than 50 kW"},2]
[{"$f":"IF('3. Rate Classes'!L19=1, '3. Rate Classes'!C19, \"\")","v":"General Service 50 to 999 kW"},3]
[{"$f":"IF('3. Rate Classes'!L20=1, '3. Rate Classes'!C20, \"\")","v":"General Service 1,000 to 4,999 kW"},4]
[{"$f":"IF('3. Rate Classes'!L21=1, '3. Rate Classes'!C21, \"\")","v":"Unmetered Scattered Load"},5]
[{"$f":"IF('3. Rate Classes'!L22=1, '3. Rate Classes'!C22, \"\")","v":"Sentinel Lighting"},6]
[{"$f":"IF('3. Rate Classes'!L23=1, '3. Rate Classes'!C23, \"\")","v":"Street Lighting"},7]
[{"$f":"IF('3. Rate Classes'!L24=1, '3. Rate Classes'!C24, \"\")","v":""},8]
[{"$f":"IF('3. Rate Classes'!L25=1, '3. Rate Classes'!C25, \"\")","v":""},9]
[{"$f":"IF('3. Rate Classes'!L26=1, '3. Rate Classes'!C26, \"\")","v":""},10]
[{"$f":"IF('3. Rate Classes'!L27=1, '3. Rate Classes'!C27, \"\")","v":""},11]
[{"$f":"IF('3. Rate Classes'!L28=1, '3. Rate Classes'!C28, \"\")","v":""},12]
[{"$f":"IF('3. Rate Classes'!L29=1, '3. Rate Classes'!C29, \"\")","v":""},13]
[{"$f":"IF('3. Rate Classes'!L30=1, '3. Rate Classes'!C30, \"\")","v":""},14]
[{"$f":"IF('3. Rate Classes'!L31=1, '3. Rate Classes'!C31, \"\")","v":""},15]
[{"$f":"IF('3. Rate Classes'!L32=1, '3. Rate Classes'!C32, \"\")","v":""},16]
[{"$f":"IF('3. Rate Classes'!L33=1, '3. Rate Classes'!C33, \"\")","v":""},17]
[{"$f":"IF('3. Rate Classes'!L34=1, '3. Rate Classes'!C34, \"\")","v":""},18]
[{"$f":"IF('3. Rate Classes'!L35=1, '3. Rate Classes'!C35, \"\")","v":""},19]
[{"$f":"IF('3. Rate Classes'!L36=1, '3. Rate Classes'!C36, \"\")","v":""},20]
[{"$f":"IF('3. Rate Classes'!L37=1, '3. Rate Classes'!C37, \"\")","v":""},21]
[{"$f":"IF('3. Rate Classes'!L38=1, '3. Rate Classes'!C38, \"\")","v":""},22]