{"text_format":"1","workbook":"xlsx","n_sheets":7,"sheets":["1. Information Sheet","2. 2015 Continuity Schedule","3. Appendix A","4. Billing Determinants","5. Allocation of Balances","6. Rate Rider Calculations","Summary Sheet"],"not_rendered":{"charts":0,"images":2,"macros":1,"external_links":3,"defined_names":143,"comments":1,"pivot_tables":0},"unopened":[],"bounds":{"document_bytes":16777216,"sheet_cells":100000,"rows_first":2000,"rows_last":500,"rows_between":2000,"halvings":0,"cell_chars":16384,"cell_head_chars":4096},"cells_cut":0,"cells_raw":0,"read":"whole","date_system":"1900"}

{"sheet":"1. Information Sheet","index":0,"n_rows":76,"n_cols":22,"rows_kept":76,"cut":false,"hidden":false,"merged":[[30,2,30,11],[32,2,32,13],[34,2,34,12],[26,1,26,12],[13,5,13,11],[15,5,15,9],[17,5,17,9],[19,5,19,9],[21,5,21,9],[23,5,23,9]]}
[null,null,null,null,null,null,null,null,null,null,null,null,null,null,null,null,null,null,null,null,null,"Algoma Power Inc."]
[null,null,null,null,null,null,null,null,null,null,null,null,null,null,null,null,null,null,null,null,null,"Atikokan Hydro Inc."]
[null,null,null,null,null,null,null,null,null,null,null,null,null,null,null,null,null,null,null,null,null,"Attawapiskat Power Corporation"]
[null,null,null,null,null,null,null,null,null,null,null,null,null,null,null,null,null,null,null,null,null,"Bluewater Power Distribution Corporation"]
[null,null,null,null,null,null,null,null,null,null,null,null,null,null,null,null,null,null,null,null,null,"Brant County Power Inc."]
[null,null,null,null,null,null,null,null,null,null,null,null,null,null,null,null,null,null,null,null,null,"Brantford Power Inc."]
[null,null,null,null,null,null,null,null,null,null,null,null,null,null,null,null,null,null,null,null,null,"Burlington Hydro Inc."]
[null,null,null,null,null,null,null,null,null,null,null,null,null,null,null,null,null,null,null,null,null,"Cambridge and North Dumfries Hydro Inc."]
[null,null,null,null,null,null,null,null,null,null,null,null,null,null,null,null,null,null,null,null,null,"Canadian Niagara Power Inc."]
[null,null,null,null,null,null,null,null,null,null,null,null,null,null,null,null,null,null,null,null,null,"Centre Wellington Hydro Ltd."]
[null,null,null,null,null,null,null,null,null,null,null,null,null,null,null,null,null,null,null,null,null,"Chapleau Public Utilities Corporation"]
[null,null,null,null,null,null,null,null,null,null,null,null,"Version",1,null,null,null,null,null,null,null,"COLLUS PowerStream Corp."]
[null,null,null,null,null,null,null,null,null,null,null,null,null,null,null,null,null,null,null,null,null,"Cooperative Hydro Embrun Inc."]
[null,null,null,null,"Utility Name   ","Horizon Utilities Corporation",null,null,null,null,null,null,null,null,null,null,null,null,null,null,null,"E.L.K. Energy Inc."]
[null,null,null,null,null,null,null,null,null,null,null,null,null,null,null,null,null,null,null,null,null,"Enersource Hydro Mississauga Inc."]
[null,null,null,null,"Service Territory","(if applicable)",null,null,null,null,null,null,null,null,null,null,null,null,null,null,null,"Entegrus Powerlines Inc."]
[null,null,null,null,null,null,null,null,null,null,null,null,null,null,null,null,null,null,null,null,null,"EnWin Utilities Ltd."]
[null,null,null,null,"Assigned EB Number",null,null,null,null,null,null,null,null,null,null,null,null,null,null,null,null,"Erie Thames Powerlines Corporation"]
[null,null,null,null,null,null,null,null,null,null,null,null,null,null,null,null,null,null,null,null,null,"Espanola Regional Hydro Distribution Corporation"]
[null,null,null,null,"Name of Contact and Title","Indy J. Butany-DeSouza, Vice President-Regulatory Services",null,null,null,null,null,null,null,null,null,null,null,null,null,null,null,"Essex Powerlines Corporation"]
[null,null,null,null,null,null,null,null,null,null,null,null,null,null,null,null,null,null,null,null,null,"Festival Hydro Inc."]
[null,null,null,null,"Phone Number   ","905-317-4765",null,null,null,null,null,null,null,null,null,null,null,null,null,null,null,"Fort Albany Power Corporation"]
[null,null,null,null,null,null,null,null,null,null,null,null,null,null,null,null,null,null,null,null,null,"Fort Frances Power Corporation"]
[null,null,null,null,"Email Address   ","indy.butany@horizonutilities.com",null,null,null,null,null,null,null,null,null,null,null,null,null,null,null,"Greater Sudbury Hydro Inc."]
[null,null,null,null,null,null,null,null,null,null,null,null,null,null,null,null,null,null,null,null,null,"Grimsby Power Inc."]
[null,null,null,null,null,null,null,null,null,null,null,null,null,null,null,null,null,null,null,null,null,"Guelph Hydro Electric Systems Inc."]
[null,"General Notes\n\n1.  Please ensure that your macros have been enabled.  (Tools -> Macro -> Security)\n\n2.  Due to the time lag of deferral/variance account dispositions, this model assumes that all opening balances include previously disposed of amounts.  Accordingly, all \"Board Approved Dispositions\" are deducted from the opening balance.\n\n3.  Please provide information in this model since the last time your balances were disposed.\n\n4.  For all Board-Approved dispositions, please ensure that the disposition amount has the same sign (e.g: debit balances are to have a positive figure and credit balance are to have a negative figure) as per the related Board decision.\n",null,null,null,null,null,null,null,null,null,null,null,null,null,null,null,null,null,null,null,"Haldimand County Hydro Inc."]
[null,null,null,null,null,null,null,null,null,null,null,null,null,null,null,null,null,null,null,null,null,"Halton Hills Hydro Inc."]
[null,"Notes",null,null,null,null,null,null,null,null,null,null,null,null,null,null,null,null,null,null,null,"Hearst Power Distribution Company Limited"]
[null,null,null,null,null,null,null,null,null,null,null,null,null,null,null,null,null,null,null,null,null,"Horizon Utilities Corporation"]
[null,null,"Pale green cells represent input cells.",null,null,null,null,null,null,null,null,null,null,null,null,null,null,null,null,null,null,"Hydro 2000 Inc."]
[null,null,null,null,null,null,null,null,null,null,null,null,null,null,null,null,null,null,null,null,null,"Hydro Hawkesbury Inc."]
[null,null,"Pale blue cells represent drop-down lists.  The applicant should select the appropriate item from the drop-down list.",null,null,null,null,null,null,null,null,null,null,null,null,null,null,null,null,null,null,"Hydro One Brampton Networks Inc."]
[null,null,null,null,null,null,null,null,null,null,null,null,null,null,null,null,null,null,null,null,null,"Hydro One Networks Inc."]
[null,null,"White cells contain fixed values, automatically generated values or formulae. ",null,null,null,null,null,null,null,null,null,null,null,null,null,null,null,null,null,null,"Hydro One Remote Communities Inc."]
[null,null,null,null,null,null,null,null,null,null,null,null,null,null,null,null,null,null,null,null,null,"Hydro Ottawa Limited"]
[null,null,null,null,null,null,null,null,null,null,null,null,null,null,null,null,null,null,null,null,null,"Innpower Corporation"]
[null,null,null,null,null,null,null,null,null,null,null,null,null,null,null,null,null,null,null,null,null,"Kashechewan Power Corporation"]
[null,null,null,null,null,null,null,null,null,null,null,null,null,null,null,null,null,null,null,null,null,"Kenora Hydro Electric Corporation Ltd."]
[null,null,null,null,null,null,null,null,null,null,null,null,null,null,null,null,null,null,null,null,null,"Kingston Hydro Corporation"]
[null,null,null,null,null,null,null,null,null,null,null,null,null,null,null,null,null,null,null,null,null,"Kitchener-Wilmot Hydro Inc."]
[null,null,null,null,null,null,null,null,null,null,null,null,null,null,null,null,null,null,null,null,null,"Lakefront Utilities Inc."]
[null,null,null,null,null,null,null,null,null,null,null,null,null,null,null,null,null,null,null,null,null,"Lakeland Power Distribution Ltd."]
[null,null,null,null,null,null,null,null,null,null,null,null,null,null,null,null,null,null,null,null,null,"London Hydro Inc."]
[null,null,null,null,null,null,null,null,null,null,null,null,null,null,null,null,null,null,null,null,null,"Midland Power Utility Corporation"]
[null,null,null,null,null,null,null,null,null,null,null,null,null,null,null,null,null,null,null,null,null,"Milton Hydro Distribution Inc."]
[null,null,null,null,null,null,null,null,null,null,null,null,null,null,null,null,null,null,null,null,null,"Newmarket-Tay Power Distribution Ltd."]
[null,null,null,null,null,null,null,null,null,null,null,null,null,null,null,null,null,null,null,null,null,"Niagara Peninsula Energy Inc."]
[null,null,null,null,null,null,null,null,null,null,null,null,null,null,null,null,null,null,null,null,null,"Niagara-on-the-Lake Hydro Inc."]
[null,null,null,null,null,null,null,null,null,null,null,null,null,null,null,null,null,null,null,null,null,"Norfolk Power Distribution Inc."]
[null,null,null,null,null,null,null,null,null,null,null,null,null,null,null,null,null,null,null,null,null,"North Bay Hydro Distribution Limited"]
[null,null,null,null,null,null,null,null,null,null,null,null,null,null,null,null,null,null,null,null,null,"Northern Ontario Wires Inc."]
[null,null,null,null,null,null,null,null,null,null,null,null,null,null,null,null,null,null,null,null,null,"Oakville Hydro Electricity Distribution Inc."]
[null,null,null,null,null,null,null,null,null,null,null,null,null,null,null,null,null,null,null,null,null,"Orangeville Hydro Limited"]
[null,null,null,null,null,null,null,null,null,null,null,null,null,null,null,null,null,null,null,null,null,"Orillia Power Distribution Corporation"]
[null,null,null,null,null,null,null,null,null,null,null,null,null,null,null,null,null,null,null,null,null,"Oshawa PUC Networks Inc."]
[null,null,null,null,null,null,null,null,null,null,null,null,null,null,null,null,null,null,null,null,null,"Ottawa River Power Corporation"]
[null,null,null,null,null,null,null,null,null,null,null,null,null,null,null,null,null,null,null,null,null,"Peterborough Distribution Incorporated"]
[null,null,null,null,null,null,null,null,null,null,null,null,null,null,null,null,null,null,null,null,null,"PowerStream Inc."]
[null,null,null,null,null,null,null,null,null,null,null,null,null,null,null,null,null,null,null,null,null,"PUC Distribution Inc."]
[null,null,null,null,null,null,null,null,null,null,null,null,null,null,null,null,null,null,null,null,null,"Renfrew Hydro Inc."]
[null,null,null,null,null,null,null,null,null,null,null,null,null,null,null,null,null,null,null,null,null,"Rideau St. Lawrence Distribution Inc."]
[null,null,null,null,null,null,null,null,null,null,null,null,null,null,null,null,null,null,null,null,null,"Sioux Lookout Hydro Inc."]
[null,null,null,null,null,null,null,null,null,null,null,null,null,null,null,null,null,null,null,null,null,"St. Thomas Energy Inc."]
[null,null,null,null,null,null,null,null,null,null,null,null,null,null,null,null,null,null,null,null,null,"Thunder Bay Hydro Electricity Distribution Inc."]
[null,null,null,null,null,null,null,null,null,null,null,null,null,null,null,null,null,null,null,null,null,"Tillsonburg Hydro Inc."]
[null,null,null,null,null,null,null,null,null,null,null,null,null,null,null,null,null,null,null,null,null,"Toronto Hydro-Electric System Limited"]
[null,null,null,null,null,null,null,null,null,null,null,null,null,null,null,null,null,null,null,null,null,"Veridian Connections Inc."]
[null,null,null,null,null,null,null,null,null,null,null,null,null,null,null,null,null,null,null,null,null,"Wasaga Distribution Inc."]
[null,null,null,null,null,null,null,null,null,null,null,null,null,null,null,null,null,null,null,null,null,"Waterloo North Hydro Inc."]
[null,null,null,null,null,null,null,null,null,null,null,null,null,null,null,null,null,null,null,null,null,"Welland Hydro-Electric System Corp."]
[null,null,null,null,null,null,null,null,null,null,null,null,null,null,null,null,null,null,null,null,null,"Wellington North Power Inc."]
[null,null,null,null,null,null,null,null,null,null,null,null,null,null,null,null,null,null,null,null,null,"West Coast Huron Energy Inc."]
[null,null,null,null,null,null,null,null,null,null,null,null,null,null,null,null,null,null,null,null,null,"Westario Power Inc."]
[null,null,null,null,null,null,null,null,null,null,null,null,null,null,null,null,null,null,null,null,null,"Whitby Hydro Electric Corporation"]
[null,null,null,null,null,null,null,null,null,null,null,null,null,null,null,null,null,null,null,null,null,"Woodstock Hydro Services Inc."]

{"sheet":"2. 2015 Continuity Schedule","index":1,"n_rows":96,"n_cols":73,"rows_kept":96,"cut":false,"hidden":false,"merged":[[18,54,18,63],[19,54,21,54],[19,55,21,55],[19,56,21,56],[19,57,21,57],[19,58,21,58],[19,59,21,59],[19,60,21,60],[19,61,21,61],[19,62,21,62],[19,63,21,63],[19,43,21,43],[19,40,21,40],[19,41,21,41],[19,42,21,42],[19,10,21,10],[19,29,21,29],[19,13,21,13],[19,15,21,15],[19,16,21,16],[19,24,21,24],[19,25,21,25],[19,26,21,26],[19,27,21,27],[19,28,21,28],[19,22,21,22],[19,33,21,33],[18,4,18,13],[19,4,21,4],[19,5,21,5],[18,34,18,43],[19,34,21,34],[19,35,21,35],[19,36,21,36],[19,37,21,37],[19,38,21,38],[19,39,21,39],[19,17,21,17],[19,18,21,18],[19,19,21,19],[18,14,18,23],[19,31,21,31],[19,32,21,32],[19,72,21,72],[18,68,18,70],[19,70,21,70],[19,69,21,69],[19,68,21,68],[19,71,21,71],[19,65,21,65],[18,64,18,67],[19,66,21,66],[19,67,21,67],[19,64,21,64],[19,20,21,20],[19,30,21,30],[19,23,21,23],[19,21,21,21],[19,14,21,14],[19,2,21,2],[19,3,21,3],[19,12,21,12],[19,8,21,8],[19,11,21,11],[19,9,21,9],[19,6,21,6],[19,7,21,7],[89,1,91,1],[95,2,95,8],[86,2,86,5],[99,2,99,8],[18,44,18,53],[19,44,21,44],[19,45,21,45],[19,46,21,46],[19,47,21,47],[19,48,21,48],[19,49,21,49],[19,50,21,50],[19,51,21,51],[19,52,21,52],[19,53,21,53],[18,24,18,33]]}
[]
[]
[]
[]
[]
[]
[]
[]
[]
[]
[]
[]
[]
[]
[]
[]
[]
[]
[null,null,null,null,2009,null,null,null,null,null,null,null,null,null,2010,null,null,null,null,null,null,null,null,null,2011,null,null,null,null,null,null,null,null,null,2012,null,null,null,null,null,null,null,null,null,2013,null,null,null,null,null,null,null,null,null,2014,null,null,null,null,null,null,null,null,null,2015,null,null,null,"Projected Interest on Dec-31-14 Balances",null,null,"2.1.7 RRR"]
[null,null,"Account Descriptions","Account Number","Opening Principal Amounts as of Jan-1-09","Transactions1 Debit / (Credit) during 2009 ","Board-Approved Disposition during 2009","Principal Adjustments2 during 2009","Closing Principal Balance as of Dec-31-09","Opening Interest Amounts as of Jan-1-09","Interest Jan-1 to Dec-31-09","Board-Approved Disposition during 2009","Interest Adjustments1 during 2009","Closing Interest Amounts as of Dec-31-09","Opening Principal Amounts as of Jan-1-10","Transactions2 Debit / (Credit) during 2010 ","Board-Approved Disposition during 2010","Principal Adjustments2 during 2010 ","Closing Principal Balance as of Dec-31-10","Opening Interest Amounts as of Jan-1-10","Interest Jan-1 to Dec-31-10","Board-Approved Disposition during 2010","Interest Adjustments1 during 2010","Closing Interest Amounts as of Dec-31-10","Opening Principal Amounts as of Jan-1-11","Transactions2 Debit / (Credit) during 2011","Board-Approved Disposition during 2011","Principal Adjustments2 during 2011","Closing Principal Balance as of Dec-31-11","Opening Interest Amounts as of Jan-1-11","Interest Jan-1 to Dec-31-11","Board-Approved Disposition during 2011","Interest Adjustments1 during 2011","Closing Interest Amounts as of Dec-31-11","Opening Principal Amounts as of Jan-1-12","Transactions2 Debit / (Credit) during 2012","Board-Approved Disposition during 2012","Principal Adjustments2 during 2012","Closing Principal Balance as of Dec-31-12","Opening Interest Amounts as of Jan-1-12","Interest Jan-1 to Dec-31-12","Board-Approved Disposition during 2012","Interest Adjustments1 during 2012","Closing Interest Amounts as of Dec-31-12","Opening Principal Amounts as of Jan-1-13","Transactions2 Debit / (Credit) during 2013","Board-Approved Disposition during 2013","Principal Adjustments2 during 2013","Closing Principal Balance as of Dec-31-13","Opening Interest Amounts as of Jan-1-13","Interest Jan-1 to Dec-31-13","Board-Approved Disposition during 2013","Interest Adjustments1 during 2013","Closing Interest Amounts as of Dec-31-13","Opening Principal Amounts as of Jan-1-14","Transactions2 Debit / (Credit) during 2014","Board-Approved Disposition during 2014","Principal Adjustments2 during 2014 ","Closing Principal Balance as of Dec-31-14","Opening Interest Amounts as of Jan-1-14","Interest Jan-1 to Dec-31-14","Board-Approved Disposition during 2014","Interest Adjustments1 during 2014","Closing Interest Amounts as of Dec-31-14","Principal Disposition during 2015 - instructed by Board","Interest Disposition during 2015 - instructed by Board","Closing Principal Balances as of Dec 31-14 Adjusted for Dispositions during 2015","Closing Interest Balances as of Dec 31-13 Adjusted for Dispositions during 2014","Projected Interest from Jan 1, 2015 to December 31, 2015 on                        Dec 31 -14 balance adjusted for disposition during 2014 5","Projected Interest from January 1, 2016 to April 30, 2016 on Dec 31 -14 balance adjusted for disposition during 2015  5","Total Claim","As of Dec 31-14","Variance                           RRR vs. 2014 Balance                        (Principal + Interest)"]
[]
[null,null,null,null,null,null,null,null,null,null,null,null,null,null,null,null,null,null,null,null,null,null,null,null,null,null,null,null,null,null,null,null,null,null,null,null,null,null,null,null,null,null,null,null,null,null,null,null,null,null,null,null,null,null,null,null,null,null,null,null,null,null,null,null,null,null,null,null,null,null,"Claim before Forecasted Transactions"]
[null,null,"Group 1 Accounts"]
[1,null,"LV Variance Account",1550,null,null,null,null,{"$f":"E24+F24-G24+H24","v":0},null,null,null,null,{"$f":"J24+K24-L24+M24","v":0},{"$f":"I24","v":0},163809.88,null,null,{"$f":"O24+P24-Q24+R24","v":163809.88},{"$f":"N24","v":0},1161.49,null,null,{"$f":"T24+U24-V24+W24","v":1161.49},{"$f":"S24","v":163809.88},115767.79999999999,163809.88,null,{"$f":"Y24+Z24-AA24+SUM(AB24:AB24)","v":115767.79999999999},{"$f":"X24","v":1161.49},2969.7000000000003,2506.4899999999998,-53.34,{"$f":"AD24+AE24-AF24+AG24","v":1571.3600000000008},{"$f":"AC24","v":115767.79999999999},16682.929999999993,null,null,{"$f":"AI24+AJ24-AK24+SUM(AL24:AL24)","v":132450.72999999998},{"$f":"AH24","v":1571.3600000000008},1800.8000000000002,null,null,{"$f":"AN24+AO24-AP24+AQ24","v":3372.1600000000008},{"$f":"AM24","v":132450.72999999998},288057.23,117339.16,null,{"$f":"AS24+AT24-AU24+SUM(AV24:AV24)","v":303168.79999999993},{"$f":"AR24","v":3372.1600000000008},2247.7599999999998,1702,null,{"$f":"AX24+AY24-AZ24+BA24","v":3917.92},{"$f":"AW24","v":303168.79999999993},287709.56999999995,15111.23,null,{"$f":"BC24+BD24-BE24+SUM(BF24:BF24)","v":575767.1399999999},{"$f":"BB24","v":3917.92},6269.8600000000006,1892.3000000000002,null,{"$f":"BH24+BI24-BJ24+BK24","v":8295.48},288057.57,6482.2013599999937,{"$f":"BG24-BM24","v":287709.56999999989},{"$f":"BL24-BN24","v":1813.2786400000059},{"$f":"(BO24*0.0147*3/12)+(BO24*0.011*9/12)","v":3430.9366222499984},null,{"$f":"SUM(BO24:BR24)","v":292953.78526224993},584063,{"$f":"BT24-SUM(BG24,BL24)","v":0.38000000012107193}]
[2,null,"Smart Metering Entity Charge Variance Account",1551,null,null,null,null,{"$f":"E25+F25-G25+H25","v":0},null,null,null,null,{"$f":"J25+K25-L25+M25","v":0},{"$f":"I25","v":0},null,null,null,{"$f":"O25+P25-Q25+SUM(R25:R25)","v":0},{"$f":"N25","v":0},null,null,null,{"$f":"T25+U25-V25+W25","v":0},0,null,null,null,{"$f":"Y25+Z25-AA25+SUM(AB25:AB25)","v":0},{"$f":"X25","v":0},null,null,null,{"$f":"AD25+AE25-AF25+AG25","v":0},0,null,null,null,0,0,null,null,null,{"$f":"AN25+AO25-AP25+AQ25","v":0},0,-17910.510000000431,null,null,-17910.510000000431,0,-71.11,null,null,{"$f":"AX25+AY25-AZ25+BA25","v":-71.11},-17910.510000000431,-18781.050000000076,0,null,-36691.560000000507,-71.11,-365.06,0,null,{"$f":"BH25+BI25-BJ25+BK25","v":-436.17},-17910.510000000431,-334.39449700000625,{"$f":"BG25-BM25","v":-18781.050000000076},{"$f":"BL25-BN25","v":-101.77550299999376},{"$f":"(BO25*0.0147*3/12)+(BO25*0.011*9/12)","v":-223.96402125000088},null,{"$f":"SUM(BO25:BR25)","v":-19106.789524250071},-37128,{"$f":"BT25-SUM(BG25,BL25)","v":-0.2699999994947575}]
[3,null,"RSVA - Wholesale Market Service Charge",1580,null,null,null,null,{"$f":"E26+F26-G26+H26","v":0},null,null,null,null,{"$f":"J26+K26-L26+M26","v":0},{"$f":"I26","v":0},-7481034.5599999996,null,null,{"$f":"O26+P26-Q26+SUM(R26:R26)","v":-7481034.5599999996},{"$f":"N26","v":0},-46837.33,null,null,{"$f":"T26+U26-V26+W26","v":-46837.33},-7481034.5599999996,-5518757.6099999957,-7481034.5599999996,null,-5518757.6099999947,-46837.33,-138885.18,-125932.1,1546.42,{"$f":"AD26+AE26-AF26+AG26","v":-58243.990000000005},-5518757.6099999947,-6544300.1500000022,null,null,-12063057.759999998,-58243.990000000005,-125746.44,null,null,{"$f":"AN26+AO26-AP26+AQ26","v":-183990.43},-12063057.759999998,-3416930.3099999949,-5577001.5999999996,16968,-9886018.4699999932,-183990.43,-134976.81,-81126,null,{"$f":"AX26+AY26-AZ26+BA26","v":-237841.24},-9886018.4699999932,-750596.12999999523,-6486055.7400000002,-428586,-4579144.8599999882,-237841.24,-28008.970000000005,-198209.45,null,{"$f":"BH26+BI26-BJ26+BK26","v":-67640.760000000009},-3399962.7300000004,-184956.261509,-1179182.1299999878,117315.50150899999,-14061.746900249853,null,{"$f":"SUM(BO26:BR26)","v":-1075928.3753912374},-4646786,-0.38000001199543476]
[4,null,"RSVA - Retail Transmission Network Charge",1584,null,null,null,null,0,null,null,null,null,0,0,2617940.4500000002,null,null,2617940.4500000002,0,24392.41,null,null,24392.41,2617940.4500000002,631982.63999999687,2617940.5,null,631982.58999999706,24392.41,51266.22,48837.3,-703.05,26118.280000000002,631982.58999999706,177337.63000000268,null,null,809320.21999999974,26118.280000000002,12236.08,null,null,38354.36,809320.21999999974,3378169.1599999964,658101,null,3529388.3799999962,38354.36,24797.879999999997,9290,null,53862.239999999998,3529388.3799999962,3491680.4500000104,151219.22,null,6869849.6100000069,53862.239999999998,73256.38,31287.010000000002,null,95831.609999999986,3378169.2099999995,74457.239920999986,3491680.4000000074,21374.370079,41638.288770000087,null,3554693.0588490074,6965681,-0.22000000718981028]
[5,null,"RSVA - Retail Transmission Connection Charge",1586,null,null,null,null,0,null,null,null,null,0,0,617402.68000000005,null,null,617402.68000000005,0,2854.68,null,null,2854.68,617402.68000000005,-390342.61000001058,617402.41,219999.67,-170342.67000001055,2854.68,14540.06,16946.059999999998,251.27,699.95000000000027,-170342.67000001055,-76744.958999998868,null,null,-247087.62900000942,699.95000000000027,-2601.08,null,null,-1901.1299999999997,-247087.62900000942,1314693.9300000034,-169642.72,null,1237249.0209999939,-1901.1299999999997,5832.1399999999994,-2504,null,6435.01,1237249.0209999939,2601535.59,-77444.91,null,3916229.5209999941,6435.01,35834.119999999995,-536.0100000000001,null,42805.14,1314693.9299999992,25158.580593999988,2601535.5909999949,17646.559406000011,31023.31192267494,null,2650205.4623286701,3959035,0.33900000574067235]
[6,null,"RSVA - Power (excluding Global Adjustment)",1588,null,null,null,null,0,null,null,null,null,0,0,-5631735.2800000003,null,null,-5631735.2800000003,0,-15930.17,null,null,-15930.17,-5631735.2800000003,-1031401.6699999869,-5631735.6400000006,-0.36000000010244548,-1031401.6699999867,-15930.17,-81689.709999999992,-76954.960000000006,1090.3599999999999,-19574.559999999983,-1031401.6699999867,-541508.42000001669,null,null,-1572910.0900000033,-19574.559999999983,-3471.5899999999997,null,null,-23046.149999999983,-1572910.0900000033,924467.16000005603,-1050976.23,-4668526.9869420975,-4265993.6869420446,-23046.149999999983,11467.690000000002,-15162,-60232.101746408574,-56648.561746408552,-4265993.6869420446,-552173.06000000238,-521933.17,-2337699.4944851007,-6633933.0714271478,-56648.561746408552,-82951.48,-15556.57,null,-124043.47174640856,-3744060.5233259667,-103602.66903830027,-2889872.5481011812,-20440.802708108284,-34461.730136106584,null,-2944775.0809453963,-6757977,-0.45682644378393888]
[7,null,"RSVA - Global Adjustment",1589,null,null,null,null,0,null,null,null,null,0,0,3077268.18,null,null,3077268.18,0,46607.71,null,null,46607.71,3077268.18,1058062.9899999946,3077270.14,1.9599999999627471,1058062.9899999946,46607.71,37611.769999999997,10548.580000000002,-4072.96,69597.939999999988,1058062.9899999946,-3235246.1200000048,null,null,-2177183.1300000101,69597.939999999988,495.22,null,null,70093.159999999989,-2177183.1300000101,-1669046.0400000215,1127660.93,4668526.9869420975,-305363.11305793375,70093.159999999989,-16958.78,15553,60232.101746408574,97813.481746408565,-305363.11305793375,1473743.9699999839,-3304844.06,5344769.4944851007,9817994.4114271514,97813.481746408565,92778.54,5958.9500000000044,null,184633.07174640853,2999480.9533259743,87365.69407830041,6818513.4581011776,97267.377668108122,81310.77298785653,null,6997091.608757142,10002627,-0.48317356035113335]
[8,null,"Disposition and Recovery/Refund of Regulatory Balances (2008)",1595,null,null,null,null,0,null,null,null,null,0,{"$f":"I31","v":0},-1066622.6599999999,null,null,-1066622.6599999999,{"$f":"N31","v":0},-1112112.75,null,null,-1112112.75,{"$f":"S31","v":-1066622.6599999999},801572.39,null,null,-265050.2699999999,-1112112.75,-6332.1999999999971,null,null,-1118444.95,-265050.2699999999,null,null,null,-265050.2699999999,-1118444.95,-3896.28,null,null,-1122341.23,{"$f":"AM31","v":-265050.2699999999},null,null,null,-265050.2699999999,-1122341.23,-3896.28,null,null,-1126237.51,{"$f":"AW31","v":-265050.2699999999},null,null,null,-265050.2699999999,-1126237.51,-3896.28,null,null,-1130133.79,-265050.27,-1130133.79,0,0,0,null,0,-1395184,6.0000000055879354E-2]
[9,null,"Disposition and Recovery/Refund of Regulatory Balances (2009)",1595,null,null,null,null,0,null,null,null,null,0,0,-11612352.77,null,null,-11612352.77,0,-1262779.78,null,null,-1262779.78,-11612352.77,8963507.1899999995,null,null,-2648845.58,-1262779.78,-110856.83,null,null,-1373636.61,-2648845.58,2840650.07,null,null,191804.48999999976,-1373636.61,-5706.6399999999994,null,null,-1379343.25,191804.48999999976,null,null,null,191804.48999999976,-1379343.25,2819.52,null,null,-1376523.73,191804.48999999976,null,null,null,191804.48999999976,-1376523.73,2819.52,null,null,-1373704.21,191804.48999999976,-1373704.2039969999,0,-6.0030000749975443E-3,0,null,-6.0030000749975443E-3,-1181900,-0.27999999979510903]
[10,null,"Disposition and Recovery/Refund of Regulatory Balances (2010)",1595,null,null,null,null,{"$f":"E33+F33-G33+H33","v":0},null,null,null,null,{"$f":"J33+K33-L33+M33","v":0},{"$f":"I33","v":0},null,null,null,0,{"$f":"N33","v":0},null,null,null,{"$f":"T33+U33-V33+W33","v":0},0,-939598.96,-2867040.53,null,1927441.5699999998,0,11686.82,33242.71,null,{"$f":"AD33+AE33-AF33+AG33","v":-21555.89},1927441.5699999998,-2230636.5699999998,null,null,-303195,-21555.89,13368.490000000003,null,null,{"$f":"AN33+AO33-AP33+AQ33","v":-8187.399999999996},-303195,null,null,null,-303195,-8187.399999999996,-4456.9199999999992,null,null,{"$f":"AX33+AY33-AZ33+BA33","v":-12644.319999999996},-303195,null,null,null,-303195,-12644.319999999996,-4456.9199999999992,null,null,{"$f":"BH33+BI33-BJ33+BK33","v":-17101.239999999994},-303195,-17101.286499999998,0,4.6500000004016329E-2,0,null,4.6500000004016329E-2,-320296,0.23999999999068677]
[11,null,"Disposition and Recovery/Refund of Regulatory Balances (2011)",1595,null,null,null,null,{"$f":"E34+F34-G34+H34","v":0},null,null,null,null,{"$f":"J34+K34-L34+M34","v":0},{"$f":"I34","v":0},null,null,null,{"$f":"O34+P34-Q34+SUM(R34:R34)","v":0},{"$f":"N34","v":0},null,null,null,{"$f":"T34+U34-V34+W34","v":0},0,null,8695917.6799999997,null,{"$f":"Y34+Z34-AA34+SUM(AB34:AB34)","v":-8695917.6799999997},{"$f":"X34","v":0},null,154326.92000000001,null,{"$f":"AD34+AE34-AF34+AG34","v":-154326.92000000001},-8695917.6799999997,9300673.2400000002,null,null,604755.56000000052,-154326.92000000001,-65930.35000000002,null,null,{"$f":"AN34+AO34-AP34+AQ34","v":-220257.27000000002},604755.56000000052,null,null,null,604755.56000000052,-220257.27000000002,8889.9600000000009,null,null,{"$f":"AX34+AY34-AZ34+BA34","v":-211367.31000000003},604755.56000000052,null,null,null,604755.56000000052,-211367.31000000003,8889.9600000000009,null,null,{"$f":"BH34+BI34-BJ34+BK34","v":-202477.35000000003},604755.56000000052,-202477.40326800002,0,5.3267999988747761E-2,0,null,5.3267999988747761E-2,402278,-0.21000000048661605]
[12,null,"Disposition and Recovery/Refund of Regulatory Balances (2012)",1595,null,null,null,null,{"$f":"E35+F35-G35+H35","v":0},null,null,null,null,{"$f":"J35+K35-L35+M35","v":0},{"$f":"I35","v":0},null,null,null,{"$f":"O35+P35-Q35+SUM(R35:R35)","v":0},{"$f":"N35","v":0},null,null,null,{"$f":"T35+U35-V35+W35","v":0},0,null,null,null,{"$f":"Y35+Z35-AA35+SUM(AB35:AB35)","v":0},{"$f":"X35","v":0},null,null,null,{"$f":"AD35+AE35-AF35+AG35","v":0},0,null,-2039038,-493721.79000000004,1545316.21,0,null,-1284828,2206.5,{"$f":"AN35+AO35-AP35+AQ35","v":1287034.5},1545316.21,-2940696.3899999997,null,null,-1395380.1799999997,1287034.5,1788.8500000000006,null,1306.01415,{"$f":"AX35+AY35-AZ35+BA35","v":1290129.36415},-1395380.1799999997,null,null,null,-1395380.1799999997,1290129.36415,-20512.079999999998,null,null,{"$f":"BH35+BI35-BJ35+BK35","v":1269617.28415},-1395380.1800000002,1269617.28,0,4.1499999351799488E-3,0,null,4.1499999351799488E-3,-125763,-0.10415000026114285]
[13,null,"Disposition and Recovery/Refund of Regulatory Balances (2013)",1595,null,null,null,null,{"$f":"E36+F36-G36+H36","v":0},null,null,null,null,{"$f":"J36+K36-L36+M36","v":0},{"$f":"I36","v":0},null,null,null,{"$f":"O36+P36-Q36+SUM(R36:R36)","v":0},{"$f":"N36","v":0},null,null,null,{"$f":"T36+U36-V36+W36","v":0},0,null,null,null,{"$f":"Y36+Z36-AA36+SUM(AB36:AB36)","v":0},{"$f":"X36","v":0},null,null,null,{"$f":"AD36+AE36-AF36+AG36","v":0},0,null,null,null,0,0,null,null,null,{"$f":"AN36+AO36-AP36+AQ36","v":0},0,5370488.5799999982,4894519.459999999,null,475969.11999999918,0,-30180.3035065,72247,null,{"$f":"AX36+AY36-AZ36+BA36","v":-102427.3035065},475969.11999999918,null,null,null,475969.11999999918,-102427.3035065,6996.722171999998,null,null,{"$f":"BH36+BI36-BJ36+BK36","v":-95430.581334500006},475969.12000000011,-95430.553935999997,-9.3132257461547852E-10,-2.7398500009439886E-2,-1.110602170228958E-11,null,{"$f":"SUM(BO36:BR36)","v":-2.7398500951868483E-2},380539,0.46133450081106275]
[14,null,"Disposition and Recovery/Refund of Regulatory Balances (2014)",1595,null,null,null,null,{"$f":"E37+F37-G37+H37","v":0},null,null,null,null,{"$f":"J37+K37-L37+M37","v":0},{"$f":"I37","v":0},null,null,null,{"$f":"O37+P37-Q37+SUM(R37:R37)","v":0},{"$f":"N37","v":0},null,null,null,{"$f":"T37+U37-V37+W37","v":0},0,null,null,null,{"$f":"Y37+Z37-AA37+SUM(AB37:AB37)","v":0},{"$f":"X37","v":0},null,null,null,{"$f":"AD37+AE37-AF37+AG37","v":0},0,null,null,null,0,0,null,null,null,{"$f":"AN37+AO37-AP37+AQ37","v":0},0,null,null,null,0,0,null,null,null,{"$f":"AX37+AY37-AZ37+BA37","v":0},0,10296123.939841045,10223947.43,null,72176.509841045365,0,174450.57,175163.77000000002,null,{"$f":"BH37+BI37-BJ37+BK37","v":-713.20000000001164},null,null,72176.509841045365,-713.20000000001164,860.70487985446596,null,{"$f":"SUM(BO37:BR37)","v":72324.014720899824},71463,-0.30984104535309598]
[]
[null,null,"Group 1 Sub-Total (including Account 1589 - Global Adjustment)",null,{"$f":"SUM(E24:E37)","v":0},0,0,0,0,0,0,0,0,0,0,-19315324.079999998,0,0,-19315324.079999998,0,-2362643.7400000002,0,0,-2362643.7400000002,-19315324.079999998,3690792.1599999974,-807470.11999999918,220001.26999999987,-14597060.529999999,-2362643.7400000002,-219689.34999999998,63521,-1941.3000000000002,-2647795.39,-14597060.529999999,-293092.34900001995,{"$f":"SUM(AK24:AK37)","v":-2039038},-493721.79000000004,-13344836.669000022,-2647795.39,-179451.79,-1284828,2206.5,-1540212.6799999997,-13344836.669000022,3231292.8100000378,0,16968,-10096575.858999981,-1540212.6799999997,-132696.40350649998,0,1306.01415,-1671603.0693564999,-10096575.858999981,16829243.279841043,0,2578484,9311151.4208410606,-1671603.0693564999,261104.88217200001,0,0,-1410498.1871845005,127371.6200000057,-1644659.5667919999,9183779.8008410539,234161.37960749969,109516.57412502958,0,{"$f":"SUM(BS24:BS37)","v":9527457.7545735836},{"$f":"SUM(BT24:BT37)","v":7900652},{"$f":"BT39-SUM(AW39,BB39)","v":19668830.92835648}]
[null,null,"Group 1 Sub-Total (excluding Account 1589 - Global Adjustment)",null,{"$f":"E39-E41","v":0},0,0,0,0,0,0,0,0,0,0,-22392592.259999998,0,0,-22392592.259999998,0,-2409251.4500000002,0,0,-2409251.4500000002,-22392592.259999998,2632729.1700000027,-3884740.2599999993,219999.30999999991,-15655123.519999994,-2409251.4500000002,-257301.11999999997,52972.42,2131.66,-2717393.33,{"$f":"AI39-AI41","v":-15655123.519999994},2942153.7709999848,-2039038,-493721.79000000004,-11167653.539000012,-2717393.33,-179947.01,-1284828,2206.5,-1610305.8399999996,{"$f":"AS39-AS41","v":-11167653.539000012},4900338.8500000592,-1127660.93,-4651558.9869420975,-9791212.7459420469,-1610305.8399999996,-115737.62350649998,-15553,-58926.087596408572,-1769416.5511029086,{"$f":"BC39-BC41","v":-9791212.7459420469},15355499.309841059,3304844.06,-2766285.4944851007,-506842.99058609083,-1769416.5511029086,168326.34217200003,-5958.9500000000044,0,-1595131.258930909,{"$f":"BM39-BM41","v":-2872109.3333259686},-1732025.2608703002,2365266.3427398764,136894.00193939157,28205.801137173054,0,2530366.1458164412,{"$f":"BT39-BT41","v":-2101975},9458654.2970449552]
[null,null,{"$f":"C30","v":"RSVA - Global Adjustment"},1589,{"$f":"E30","v":0},0,0,0,0,0,0,0,0,0,0,3077268.18,0,0,3077268.18,0,46607.71,0,0,46607.71,3077268.18,1058062.9899999946,3077270.14,1.9599999999627471,1058062.9899999946,46607.71,37611.769999999997,10548.580000000002,-4072.96,69597.939999999988,1058062.9899999946,-3235246.1200000048,{"$f":"AK30","v":0},0,-2177183.1300000101,69597.939999999988,495.22,0,0,70093.159999999989,-2177183.1300000101,-1669046.0400000215,1127660.93,4668526.9869420975,-305363.11305793375,70093.159999999989,-16958.78,15553,60232.101746408574,97813.481746408565,{"$f":"BC30","v":-305363.11305793375},1473743.9699999839,-3304844.06,5344769.4944851007,9817994.4114271514,97813.481746408565,92778.54,5958.9500000000044,0,184633.07174640853,2999480.9533259743,87365.69407830041,6818513.4581011776,97267.377668108122,81310.77298785653,0,6997091.608757142,{"$f":"BT30","v":10002627},10210176.631311525]
[]
[null,null,"Group 2 Accounts"]
[15,null,"Other Regulatory Assets - Sub-Account - Deferred IFRS Transition Costs",1508,null,null,null,null,{"$f":"E44+F44-G44+H44","v":0},null,null,null,null,{"$f":"J44+K44-L44+M44","v":0},{"$f":"I44","v":0},null,null,null,{"$f":"O44+P44-Q44+SUM(R44:R44)","v":0},{"$f":"N44","v":0},null,null,null,{"$f":"T44+U44-V44+W44","v":0},{"$f":"S44","v":0},null,null,null,{"$f":"Y44+Z44-AA44+SUM(AB44:AB44)","v":0},{"$f":"X44","v":0},null,null,null,{"$f":"AD44+AE44-AF44+AG44","v":0},{"$f":"AC44","v":0},null,null,null,{"$f":"AI44+AJ44-AK44+SUM(AL44:AL44)","v":0},{"$f":"AH44","v":0},null,null,null,{"$f":"AN44+AO44-AP44+AQ44","v":0},{"$f":"AM44","v":0},null,null,null,{"$f":"AS44+AT44-AU44+SUM(AV44:AV44)","v":0},{"$f":"AR44","v":0},null,null,null,{"$f":"AX44+AY44-AZ44+BA44","v":0},{"$f":"AW44","v":0},null,null,null,{"$f":"BC44+BD44-BE44+SUM(BF44:BF44)","v":0},{"$f":"BB44","v":0},null,null,null,{"$f":"BH44+BI44-BJ44+BK44","v":0},null,null,{"$f":"BG44-BM44","v":0},{"$f":"BL44-BN44","v":0},null,null,0,null,{"$f":"BT44-SUM(BG44,BL44)","v":0}]
[16,null,"Other Regulatory Assets - Sub-Account - Incremental Capital Charges",1508,null,null,null,null,{"$f":"E45+F45-G45+H45","v":0},null,null,null,null,{"$f":"J45+K45-L45+M45","v":0},{"$f":"I45","v":0},null,null,null,0,0,null,null,null,{"$f":"T45+U45-V45+W45","v":0},0,null,null,null,0,0,null,null,null,0,0,null,null,null,0,0,null,null,null,0,0,null,null,null,0,0,null,null,null,0,0,null,null,null,0,0,null,null,null,0,null,null,{"$f":"BG45-BM45","v":0},{"$f":"BL45-BN45","v":0},null,null,0,null,{"$f":"BT45-SUM(BG45,BL45)","v":0}]
[17,null,"Other Regulatory Assets - Sub-Account - Financial Assistance Payment and Recovery Variance - Ontario Clean Energy Benefit Act8",1508,null,null,null,null,null,null,null,null,null,null,null,null,null,null,null,null,null,null,null,null,0,null,null,null,0,0,null,null,null,0,0,null,null,null,0,0,null,null,null,0,0,null,null,null,0,0,null,null,null,0,0,null,null,null,0,0,null,null,null,0,null,null,0,0,null,null,0,null,0]
[18,null,"Other Regulatory Assets - Sub-Account - Financial Assistance Payment and Recovery Carrying Charges",1508,null,null,null,null,null,null,null,null,null,null,null,null,null,null,null,null,null,null,null,null,0,null,null,null,0,0,null,null,null,0,0,null,null,null,0,0,null,null,null,0,0,null,null,null,0,0,null,null,null,0,0,null,null,null,0,0,null,null,null,0,null,null,0,0,null,null,0,null,0]
[19,null,"Other Regulatory Assets - Sub-Account - Other 4",1508,null,null,null,null,0,null,null,null,null,0,0,null,null,null,0,0,null,null,null,0,0,null,null,null,0,0,null,null,null,0,0,null,null,null,0,0,null,null,null,0,0,null,null,null,0,0,null,null,null,0,0,null,null,null,0,0,null,null,null,0,null,null,0,0,null,null,0,null,0]
[20,null,"Retail Cost Variance Account - Retail",1518,null,null,null,null,0,null,null,null,null,0,0,null,null,null,0,0,null,null,null,0,0,null,null,null,0,0,null,null,null,0,0,null,null,null,0,0,null,null,null,0,0,null,null,null,0,0,null,null,null,0,0,null,null,null,0,0,null,null,null,0,null,null,0,0,null,null,0,null,0]
[21,null,"Misc. Deferred Debits",1525,null,null,null,null,0,null,null,null,null,0,0,null,null,null,0,0,null,null,null,0,0,null,null,null,0,0,null,null,null,0,0,null,null,null,0,0,null,null,null,0,0,null,null,null,0,0,null,null,null,0,0,null,null,null,0,0,null,null,null,0,null,null,0,0,null,null,0,null,0]
[22,null,"Board-Approved CDM Variance Account",1567,null,null,null,null,null,null,null,null,null,0,null,null,null,null,0,0,null,null,null,{"$f":"T51+U51-V51+W51","v":0},0,null,null,null,0,0,null,null,null,0,0,null,null,null,0,0,null,null,null,{"$f":"AN51+AO51-AP51+AQ51","v":0},0,null,null,null,0,0,null,null,null,{"$f":"AX51+AY51-AZ51+BA51","v":0},0,null,null,null,0,0,null,null,null,{"$f":"BH51+BI51-BJ51+BK51","v":0},null,null,0,0,null,null,0,null,0]
[23,null,"Extra-Ordinary Event Costs",1572,null,null,null,null,0,null,null,null,null,0,{"$f":"I52","v":0},null,null,null,0,0,null,null,null,0,0,null,null,null,0,0,null,null,null,0,{"$f":"AC52","v":0},null,null,null,0,0,null,null,null,{"$f":"AN52+AO52-AP52+AQ52","v":0},{"$f":"AM52","v":0},null,null,null,0,0,null,null,null,{"$f":"AX52+AY52-AZ52+BA52","v":0},{"$f":"AW52","v":0},null,null,null,0,0,null,null,null,{"$f":"BH52+BI52-BJ52+BK52","v":0},null,null,0,0,null,null,0,null,0]
[24,null,"Deferred Rate Impact Amounts",1574,null,null,null,null,0,null,null,null,null,0,{"$f":"I53","v":0},null,null,null,0,0,null,null,null,0,0,null,null,null,0,0,null,null,null,0,{"$f":"AC53","v":0},null,null,null,0,0,null,null,null,{"$f":"AN53+AO53-AP53+AQ53","v":0},{"$f":"AM53","v":0},null,null,null,0,0,null,null,null,{"$f":"AX53+AY53-AZ53+BA53","v":0},{"$f":"AW53","v":0},null,null,null,0,0,null,null,null,{"$f":"BH53+BI53-BJ53+BK53","v":0},null,null,0,0,null,null,0,null,0]
[25,null,"RSVA - One-time",1582,null,null,null,null,0,null,null,null,null,0,{"$f":"I54","v":0},null,null,null,0,0,null,null,null,0,0,null,null,null,0,0,null,null,null,0,{"$f":"AC54","v":0},null,null,null,0,0,null,null,null,{"$f":"AN54+AO54-AP54+AQ54","v":0},{"$f":"AM54","v":0},null,null,null,0,0,null,null,null,{"$f":"AX54+AY54-AZ54+BA54","v":0},{"$f":"AW54","v":0},null,null,null,0,0,null,null,null,{"$f":"BH54+BI54-BJ54+BK54","v":0},null,null,0,0,null,null,0,null,0]
[26,null,"Other Deferred Credits",2425,null,null,null,null,0,null,null,null,null,0,{"$f":"I55","v":0},null,null,null,0,0,null,null,null,0,0,null,null,null,0,0,null,null,null,0,{"$f":"AC55","v":0},null,null,null,0,0,null,null,null,{"$f":"AN55+AO55-AP55+AQ55","v":0},{"$f":"AM55","v":0},null,null,null,0,0,null,null,null,{"$f":"AX55+AY55-AZ55+BA55","v":0},{"$f":"AW55","v":0},null,null,null,0,0,null,null,null,{"$f":"BH55+BI55-BJ55+BK55","v":0},null,null,0,0,null,null,0,null,0]
[]
[null,null,"Group 2 Sub-Total",null,{"$f":"SUM(E44:E55)","v":0},0,0,0,0,0,0,0,0,0,0,0,0,0,0,0,0,0,0,0,0,0,0,0,0,0,0,0,0,0,0,0,{"$f":"SUM(AK44:AK55)","v":0},0,0,0,0,0,0,0,0,0,0,0,0,0,0,0,0,0,0,0,0,0,0,0,0,0,0,0,0,0,0,0,0,0,0,{"$f":"SUM(BT44:BT55)","v":0},0]
[]
[27,null,"PILs and Tax Variance for 2006 and Subsequent Years                                                                          (excludes sub-account and contra account below)",1592,null,null,null,null,{"$f":"E59+F59-G59+H59","v":0},null,null,null,null,{"$f":"J59+K59-L59+M59","v":0},{"$f":"I59","v":0},null,null,null,{"$f":"O59+P59-Q59+SUM(R59:R59)","v":0},{"$f":"N59","v":0},null,null,null,{"$f":"T59+U59-V59+W59","v":0},{"$f":"S59","v":0},null,null,null,{"$f":"Y59+Z59-AA59+SUM(AB59:AB59)","v":0},{"$f":"X59","v":0},null,null,null,{"$f":"AD59+AE59-AF59+AG59","v":0},{"$f":"AC59","v":0},null,null,null,{"$f":"AI59+AJ59-AK59+SUM(AL59:AL59)","v":0},{"$f":"AH59","v":0},null,null,null,{"$f":"AN59+AO59-AP59+AQ59","v":0},{"$f":"AM59","v":0},null,null,null,{"$f":"AS59+AT59-AU59+SUM(AV59:AV59)","v":0},{"$f":"AR59","v":0},null,null,null,{"$f":"AX59+AY59-AZ59+BA59","v":0},{"$f":"AW59","v":0},null,null,null,{"$f":"BC59+BD59-BE59+SUM(BF59:BF59)","v":0},{"$f":"BB59","v":0},null,null,null,{"$f":"BH59+BI59-BJ59+BK59","v":0},null,null,{"$f":"BG59-BM59","v":0},{"$f":"BL59-BN59","v":0},null,null,0,null,0]
[28,null,"PILs and Tax Variance for 2006 and Subsequent Years - Sub-Account HST/OVAT                          Input Tax Credits (ITCs)",1592,null,null,null,null,{"$f":"E60+F60-G60+H60","v":0},null,null,null,null,{"$f":"J60+K60-L60+M60","v":0},{"$f":"I60","v":0},null,null,null,{"$f":"O60+P60-Q60+SUM(R60:R60)","v":0},{"$f":"N60","v":0},null,null,null,{"$f":"T60+U60-V60+W60","v":0},{"$f":"S60","v":0},null,null,null,{"$f":"Y60+Z60-AA60+SUM(AB60:AB60)","v":0},{"$f":"X60","v":0},null,null,null,{"$f":"AD60+AE60-AF60+AG60","v":0},{"$f":"AC60","v":0},null,null,null,{"$f":"AI60+AJ60-AK60+SUM(AL60:AL60)","v":0},{"$f":"AH60","v":0},null,null,null,{"$f":"AN60+AO60-AP60+AQ60","v":0},{"$f":"AM60","v":0},null,null,null,{"$f":"AS60+AT60-AU60+SUM(AV60:AV60)","v":0},{"$f":"AR60","v":0},null,null,null,{"$f":"AX60+AY60-AZ60+BA60","v":0},{"$f":"AW60","v":0},null,null,null,{"$f":"BC60+BD60-BE60+SUM(BF60:BF60)","v":0},{"$f":"BB60","v":0},null,null,null,{"$f":"BH60+BI60-BJ60+BK60","v":0},null,null,0,0,null,null,0,null,0]
[]
[null,null,"Total of Group 1 and Group 2 Accounts (including 1562 and 1592)",null,{"$f":"SUM(E59:E60,E57, E39)","v":0},{"$f":"SUM(F59:F60,F57, F39)","v":0},0,0,0,0,0,0,0,0,0,-19315324.079999998,0,0,-19315324.079999998,0,-2362643.7400000002,0,0,-2362643.7400000002,-19315324.079999998,3690792.1599999974,-807470.11999999918,220001.26999999987,-14597060.529999999,-2362643.7400000002,-219689.34999999998,63521,-1941.3000000000002,-2647795.39,-14597060.529999999,-293092.34900001995,-2039038,-493721.79000000004,-13344836.669000022,-2647795.39,-179451.79,-1284828,2206.5,-1540212.6799999997,-13344836.669000022,3231292.8100000378,0,16968,-10096575.858999981,-1540212.6799999997,-132696.40350649998,0,1306.01415,-1671603.0693564999,-10096575.858999981,16829243.279841043,0,2578484,9311151.4208410606,-1671603.0693564999,261104.88217200001,0,0,-1410498.1871845005,127371.6200000057,-1644659.5667919999,9183779.8008410539,234161.37960749969,109516.57412502958,{"$f":"SUM(BR59:BR60,BR57, BR39)","v":0},{"$f":"SUM(BS59:BS60,BS57, BS39)","v":9527457.7545735836},{"$f":"SUM(BT59:BT60,BT57, BT39)","v":7900652},-1.2336565600708127]
[]
[]
[29,null,"LRAM Variance Account",1568,null,null,null,null,null,null,null,null,null,null,null,null,null,null,{"$f":"O65+P65-Q65+SUM(R65:R65)","v":0},null,null,null,null,{"$f":"T65+U65-V65+W65","v":0},{"$f":"S65","v":0},null,null,null,{"$f":"Y65+Z65-AA65+SUM(AB65:AB65)","v":0},{"$f":"X65","v":0},null,null,null,{"$f":"AD65+AE65-AF65+AG65","v":0},{"$f":"AC65","v":0},null,null,null,{"$f":"AI65+AJ65-AK65+SUM(AL65:AL65)","v":0},{"$f":"AH65","v":0},null,null,null,{"$f":"AN65+AO65-AP65+AQ65","v":0},{"$f":"AM65","v":0},null,null,null,{"$f":"AS65+AT65-AU65+SUM(AV65:AV65)","v":0},{"$f":"AR65","v":0},null,null,null,{"$f":"AX65+AY65-AZ65+BA65","v":0},{"$f":"AW65","v":0},null,null,null,{"$f":"BC65+BD65-BE65+SUM(BF65:BF65)","v":0},{"$f":"BB65","v":0},null,null,null,{"$f":"BH65+BI65-BJ65+BK65","v":0},null,null,{"$f":"BG65-BM65","v":0},{"$f":"BL65-BN65","v":0},null,null,{"$f":"SUM(BO65:BR65)","v":0},null,{"$f":"BT65-SUM(AW65,BB65)","v":0}]
[]
[]
[null,null,"Total including Account 1568",null,{"$f":"E62+E65","v":0},0,0,0,0,0,0,0,0,0,0,-19315324.079999998,0,0,-19315324.079999998,0,-2362643.7400000002,0,0,-2362643.7400000002,-19315324.079999998,3690792.1599999974,-807470.11999999918,220001.26999999987,{"$f":"AC62+AC65","v":-14597060.529999999},-2362643.7400000002,-219689.34999999998,63521,-1941.3000000000002,-2647795.39,-14597060.529999999,-293092.34900001995,-2039038,-493721.79000000004,-13344836.669000022,-2647795.39,-179451.79,-1284828,2206.5,-1540212.6799999997,{"$f":"AS62+AS65","v":-13344836.669000022},3231292.8100000378,0,16968,-10096575.858999981,-1540212.6799999997,-132696.40350649998,0,1306.01415,-1671603.0693564999,{"$f":"BC62+BC65","v":-10096575.858999981},16829243.279841043,0,2578484,9311151.4208410606,-1671603.0693564999,261104.88217200001,0,0,-1410498.1871845005,127371.6200000057,-1644659.5667919999,9183779.8008410539,234161.37960749969,109516.57412502958,0,9527457.7545735836,7900652,{"$f":"BT68-SUM(BG68,BL68)","v":-1.2336565600708127}]
[]
[30,null,"Renewable Generation Connection Capital Deferral Account",1531,null,null,null,null,{"$f":"E70+F70-G70+H70","v":0},null,null,null,null,{"$f":"J70+K70-L70+M70","v":0},{"$f":"I70","v":0},null,null,null,{"$f":"O70+P70-Q70+SUM(R70:R70)","v":0},{"$f":"N70","v":0},null,null,null,{"$f":"T70+U70-V70+W70","v":0},{"$f":"S70","v":0},null,null,null,{"$f":"Y70+Z70-AA70+SUM(AB70:AB70)","v":0},{"$f":"X70","v":0},null,null,null,{"$f":"AD70+AE70-AF70+AG70","v":0},{"$f":"AC70","v":0},null,null,null,{"$f":"AI70+AJ70-AK70+SUM(AL70:AL70)","v":0},{"$f":"AH70","v":0},null,null,null,{"$f":"AN70+AO70-AP70+AQ70","v":0},{"$f":"AM70","v":0},null,null,null,{"$f":"AS70+AT70-AU70+SUM(AV70:AV70)","v":0},{"$f":"AR70","v":0},null,null,null,{"$f":"AX70+AY70-AZ70+BA70","v":0},{"$f":"AW70","v":0},null,null,null,{"$f":"BC70+BD70-BE70+SUM(BF70:BF70)","v":0},{"$f":"BB70","v":0},null,null,null,{"$f":"BH70+BI70-BJ70+BK70","v":0},null,null,{"$f":"BG70-BM70","v":0},{"$f":"BL70-BN70","v":0},null,null,{"$f":"SUM(BO70:BR70)","v":0},null,{"$f":"BT70-SUM(BG70,BL70)","v":0}]
[31,null,"Renewable Generation Connection OM&A Deferral Account",1532,null,null,null,null,0,null,null,null,null,0,0,null,null,null,0,0,null,null,null,0,0,null,null,null,0,0,null,null,null,0,0,null,null,null,0,0,null,null,null,0,0,null,null,null,0,0,null,null,null,0,0,null,null,null,0,0,null,null,null,0,null,null,0,0,null,null,0,null,0]
[32,null,"Renewable Generation Connection Funding Adder Deferral Account ",1533,null,null,null,null,0,null,null,null,null,0,0,null,null,null,0,0,null,null,null,0,0,null,null,null,0,0,null,null,null,0,0,null,null,null,0,0,null,null,null,0,0,null,null,null,0,0,null,null,null,0,0,null,null,null,0,0,null,null,null,0,null,null,0,0,null,null,0,null,0]
[33,null,"Smart Grid Capital Deferral Account",1534,null,null,null,null,0,null,null,null,null,0,0,null,null,null,0,0,null,null,null,0,0,null,null,null,0,0,null,null,null,0,0,null,null,null,0,0,null,null,null,0,0,null,null,null,0,0,null,null,null,0,0,null,null,null,0,0,null,null,null,0,null,null,0,0,null,null,0,null,0]
[34,null,"Smart Grid OM&A Deferral Account",1535,null,null,null,null,0,null,null,null,null,0,0,null,null,null,0,0,null,null,null,0,0,null,null,null,0,0,null,null,null,0,0,null,null,null,0,0,null,null,null,0,0,null,null,null,0,0,null,null,null,0,0,null,null,null,0,0,null,null,null,0,null,null,0,0,null,null,0,null,0]
[35,null,"Smart Grid Funding Adder Deferral Account",1536,null,null,null,null,0,null,null,null,null,0,0,null,null,null,0,0,null,null,null,0,0,null,null,null,0,0,null,null,null,0,0,null,null,null,0,0,null,null,null,0,0,null,null,null,0,0,null,null,null,0,0,null,null,null,0,0,null,null,null,0,null,null,0,0,null,null,0,null,0]
[36,null,"Retail Cost Variance Account - STR",1548,null,null,null,null,0,null,null,null,null,0,0,null,null,null,0,0,null,null,null,0,0,null,null,null,0,0,null,null,null,0,0,null,null,null,0,0,null,null,null,0,0,null,null,null,0,0,null,null,null,0,0,null,null,null,0,0,null,null,null,0,null,null,0,0,null,null,0,null,0]
[37,null,"Smart Meter Capital and Recovery Offset Variance - Sub-Account - Capital5",1555,null,null,null,null,0,null,null,null,null,0,0,null,null,null,0,0,null,null,null,0,0,null,null,null,0,0,null,null,null,0,0,null,null,null,0,0,null,null,null,0,0,null,null,null,0,0,null,null,null,0,0,null,null,null,0,0,null,null,null,0,null,null,0,0,null,null,0,null,0]
[38,null,"Smart Meter Capital and Recovery Offset Variance - Sub-Account - Recoveries5",1555,null,null,null,null,0,null,null,null,null,0,0,null,null,null,0,0,null,null,null,0,0,null,null,null,0,0,null,null,null,0,0,null,null,null,0,0,null,null,null,0,0,null,null,null,0,0,null,null,null,0,0,null,null,null,0,0,null,null,null,0,null,null,0,0,null,null,0,null,0]
[39,null,"Smart Meter Capital and Recovery Offset Variance - Sub-Account - Stranded Meter Costs5",1555,null,null,null,null,0,null,null,null,null,0,0,null,null,null,0,0,null,null,null,0,0,null,null,null,0,0,null,null,null,0,0,null,null,null,0,0,null,null,null,0,0,null,null,null,0,0,null,null,null,0,0,null,null,null,0,0,null,null,null,0,null,null,0,0,null,null,0,null,0]
[40,null,"Smart Meter OM&A Variance5",1556,null,null,null,null,0,null,null,null,null,0,0,null,null,null,0,0,null,null,null,0,0,null,null,null,0,0,null,null,null,0,0,null,null,null,0,0,null,null,null,0,0,null,null,null,0,0,null,null,null,0,0,null,null,null,0,0,null,null,null,0,null,null,0,0,null,null,0,null,0]
[]
[41,null,"IFRS-CGAAP Transition PP&E Amounts Balance + Return Component6",1575,null,null,null,null,null,null,null,null,null,null,null,null,null,null,null,null,null,null,null,null,null,null,null,null,null,null,null,null,null,null,null,null,null,null,{"$f":"AI82+AJ82-AK82+SUM(AL82:AL82)","v":0},{"$f":"AH82","v":0},null,null,null,{"$f":"AN82+AO82-AP82+AQ82","v":0},null,null,null,null,{"$f":"AS82+AT82-AU82+SUM(AV82:AV82)","v":0},{"$f":"AR82","v":0},null,null,null,{"$f":"AX82+AY82-AZ82+BA82","v":0},null,null,null,null,{"$f":"BC82+BD82-BE82+SUM(BF82:BF82)","v":0},{"$f":"BB82","v":0},null,null,null,{"$f":"BH82+BI82-BJ82+BK82","v":0},null,null,{"$f":"BG82-BM82","v":0},{"$f":"BL82-BN82","v":0},null,null,{"$f":"SUM(BO82:BR82)","v":0},null,0]
[42,null,"Accounting Changes Under CGAAP Balance + Return Component6",1576,null,null,null,null,null,null,null,null,null,null,null,null,null,null,null,null,null,null,null,null,null,null,null,null,null,null,null,null,null,null,null,null,null,null,{"$f":"AI83+AJ83-AK83+SUM(AL83:AL83)","v":0},{"$f":"AH83","v":0},null,null,null,{"$f":"AN83+AO83-AP83+AQ83","v":0},null,null,null,null,{"$f":"AS83+AT83-AU83+SUM(AV83:AV83)","v":0},{"$f":"AR83","v":0},null,null,null,{"$f":"AX83+AY83-AZ83+BA83","v":0},null,null,null,null,{"$f":"BC83+BD83-BE83+SUM(BF83:BF83)","v":0},{"$f":"BB83","v":0},null,null,null,{"$f":"BH83+BI83-BJ83+BK83","v":0},null,null,0,0,null,null,{"$f":"SUM(BO83:BR83)","v":0},null,0]
[]
[]
[]
[null,null,"For all Board-Approved dispositions, please ensure that the disposition amount has the same sign (e.g: debit balances are to have a positive figure and credit balance are to have a negative figure) as per the related Board decision."]
[null,1,"Do not include interest, adjustments, or OEB approved dispositions in this column"]
[null,2,"Please provide explanations for the nature of the adjustments.  If the adjustment relates to previously OEB Approved disposed balances, please provide amounts for adjustments and include supporting documentations."]
[null,3,"As per the January 6, 2011 Letter from the Board, regarding the implementation of the Ontario Clean Energy Benefit:"]
[null,null,"\"By way of exception... The Board does acticipate that licensed distributors that cannot adapt their invoices as of January 1, 2011 will require a variance account for OCEB purposes... The Board expects that any principal"]
[null,null,"balances in \"Sub account Financial Assistance Payment and Recovery Variance - Ontario Clean Energy Benefit Act\" will be addressed through the monthly settlement process with the IESO or the host distributor, as applicable."]
[null,4,"Please describe \"other\" components of 1508 and add more component lines if necessary."]
[null,5,"Deferral accounts related to Smart Meter deployment are not to be recovered/refunded through the Deferral and Variance Account rate rider. For details on how to dispose of balances in Smart Meter accounts see the Board's "]
[null,null,"Guideline: Smart Meter Disposition and Cost Recovery (G-2011-0001)"]
[null,6,"The Board requires that disposition of Account 1575 and Account 1576 shall require the use of separate rate riders. In the \"Adjustments during 2015\" column of the continuity schedule, please enter the amounts to be included in the Account 1575 and 1576 rate rider calculation from the applicable Chapter 2 appendices. For Account 1575, please provide the value in cell F39 from the relevant Chapter 2 Appendix (i.e. 2-EA, 2-EB or 2-EC). For Account 1576, please provide the value in cell F39 from the relevant Chapter 2 Appendix (i.e. 2-ED or 2-EE)."]

{"sheet":"3. Appendix A","index":2,"n_rows":66,"n_cols":6,"rows_kept":66,"cut":false,"hidden":false,"merged":[[19,4,21,4],[19,5,21,5],[19,2,21,2],[19,3,21,3],[15,1,15,4]]}
[]
[]
[]
[]
[]
[]
[]
[]
[]
[]
[]
[]
[]
[]
[]
[null,"Accounts that produced a variance on the 2014 continuity schedule are listed below.  \nPlease provide a detailed explanation for each variance below.\n"]
[]
[]
[]
[null,null,"Account Descriptions","Account Number","Variance                           RRR vs. 2014 Balance                        (Principal + Interest)","Explanation"]
[]
[]
[null,null,"Group 1 Accounts"]
[1,null,"LV Variance Account",1550,{"$f":"IF(ISERROR(VLOOKUP($A24, '2. 2015 Continuity Schedule'!$A$20:$BU$86, MATCH('3. Appendix A'!$E$20, '2. 2015 Continuity Schedule'!$A$20:$BU$20,0),FALSE)), 0, VLOOKUP($A24, '2. 2015 Continuity Schedule'!$A$20:$BU$86, MATCH('3. Appendix A'!$E$20, '2. 2015 Continuity Schedule'!$A$20:$BU$20,0),FALSE))","v":0.38000000012107193}]
[2,null,"Smart Metering Entity Charge Variance Account",1551,{"$f":"IF(ISERROR(VLOOKUP($A25, '2. 2015 Continuity Schedule'!$A$20:$BU$86, MATCH('3. Appendix A'!$E$20, '2. 2015 Continuity Schedule'!$A$20:$BU$20,0),FALSE)), 0, VLOOKUP($A25, '2. 2015 Continuity Schedule'!$A$20:$BU$86, MATCH('3. Appendix A'!$E$20, '2. 2015 Continuity Schedule'!$A$20:$BU$20,0),FALSE))","v":-0.2699999994947575}]
[3,null,"RSVA - Wholesale Market Service Charge",1580,{"$f":"IF(ISERROR(VLOOKUP($A26, '2. 2015 Continuity Schedule'!$A$20:$BU$86, MATCH('3. Appendix A'!$E$20, '2. 2015 Continuity Schedule'!$A$20:$BU$20,0),FALSE)), 0, VLOOKUP($A26, '2. 2015 Continuity Schedule'!$A$20:$BU$86, MATCH('3. Appendix A'!$E$20, '2. 2015 Continuity Schedule'!$A$20:$BU$20,0),FALSE))","v":-0.38000001199543476}]
[4,null,"RSVA - Retail Transmission Network Charge",1584,{"$f":"IF(ISERROR(VLOOKUP($A27, '2. 2015 Continuity Schedule'!$A$20:$BU$86, MATCH('3. Appendix A'!$E$20, '2. 2015 Continuity Schedule'!$A$20:$BU$20,0),FALSE)), 0, VLOOKUP($A27, '2. 2015 Continuity Schedule'!$A$20:$BU$86, MATCH('3. Appendix A'!$E$20, '2. 2015 Continuity Schedule'!$A$20:$BU$20,0),FALSE))","v":-0.22000000718981028}]
[5,null,"RSVA - Retail Transmission Connection Charge",1586,{"$f":"IF(ISERROR(VLOOKUP($A28, '2. 2015 Continuity Schedule'!$A$20:$BU$86, MATCH('3. Appendix A'!$E$20, '2. 2015 Continuity Schedule'!$A$20:$BU$20,0),FALSE)), 0, VLOOKUP($A28, '2. 2015 Continuity Schedule'!$A$20:$BU$86, MATCH('3. Appendix A'!$E$20, '2. 2015 Continuity Schedule'!$A$20:$BU$20,0),FALSE))","v":0.33900000574067235}]
[6,null,"RSVA - Power (excluding Global Adjustment)",1588,{"$f":"IF(ISERROR(VLOOKUP($A29, '2. 2015 Continuity Schedule'!$A$20:$BU$86, MATCH('3. Appendix A'!$E$20, '2. 2015 Continuity Schedule'!$A$20:$BU$20,0),FALSE)), 0, VLOOKUP($A29, '2. 2015 Continuity Schedule'!$A$20:$BU$86, MATCH('3. Appendix A'!$E$20, '2. 2015 Continuity Schedule'!$A$20:$BU$20,0),FALSE))","v":-0.45682644378393888}]
[7,null,"RSVA - Global Adjustment",1589,{"$f":"IF(ISERROR(VLOOKUP($A30, '2. 2015 Continuity Schedule'!$A$20:$BU$86, MATCH('3. Appendix A'!$E$20, '2. 2015 Continuity Schedule'!$A$20:$BU$20,0),FALSE)), 0, VLOOKUP($A30, '2. 2015 Continuity Schedule'!$A$20:$BU$86, MATCH('3. Appendix A'!$E$20, '2. 2015 Continuity Schedule'!$A$20:$BU$20,0),FALSE))","v":-0.48317356035113335}]
[8,null,"Disposition and Recovery/Refund of Regulatory Balances (2008)",1595,{"$f":"IF(ISERROR(VLOOKUP($A31, '2. 2015 Continuity Schedule'!$A$20:$BU$86, MATCH('3. Appendix A'!$E$20, '2. 2015 Continuity Schedule'!$A$20:$BU$20,0),FALSE)), 0, VLOOKUP($A31, '2. 2015 Continuity Schedule'!$A$20:$BU$86, MATCH('3. Appendix A'!$E$20, '2. 2015 Continuity Schedule'!$A$20:$BU$20,0),FALSE))","v":6.0000000055879354E-2}]
[9,null,"Disposition and Recovery/Refund of Regulatory Balances (2009)",1595,{"$f":"IF(ISERROR(VLOOKUP($A32, '2. 2015 Continuity Schedule'!$A$20:$BU$86, MATCH('3. Appendix A'!$E$20, '2. 2015 Continuity Schedule'!$A$20:$BU$20,0),FALSE)), 0, VLOOKUP($A32, '2. 2015 Continuity Schedule'!$A$20:$BU$86, MATCH('3. Appendix A'!$E$20, '2. 2015 Continuity Schedule'!$A$20:$BU$20,0),FALSE))","v":-0.27999999979510903}]
[10,null,"Disposition and Recovery/Refund of Regulatory Balances (2010)",1595,{"$f":"IF(ISERROR(VLOOKUP($A33, '2. 2015 Continuity Schedule'!$A$20:$BU$86, MATCH('3. Appendix A'!$E$20, '2. 2015 Continuity Schedule'!$A$20:$BU$20,0),FALSE)), 0, VLOOKUP($A33, '2. 2015 Continuity Schedule'!$A$20:$BU$86, MATCH('3. Appendix A'!$E$20, '2. 2015 Continuity Schedule'!$A$20:$BU$20,0),FALSE))","v":0.23999999999068677}]
[11,null,"Disposition and Recovery/Refund of Regulatory Balances (2011)",1595,{"$f":"IF(ISERROR(VLOOKUP($A34, '2. 2015 Continuity Schedule'!$A$20:$BU$86, MATCH('3. Appendix A'!$E$20, '2. 2015 Continuity Schedule'!$A$20:$BU$20,0),FALSE)), 0, VLOOKUP($A34, '2. 2015 Continuity Schedule'!$A$20:$BU$86, MATCH('3. Appendix A'!$E$20, '2. 2015 Continuity Schedule'!$A$20:$BU$20,0),FALSE))","v":-0.21000000048661605}]
[12,null,"Disposition and Recovery/Refund of Regulatory Balances (2012)",1595,{"$f":"IF(ISERROR(VLOOKUP($A35, '2. 2015 Continuity Schedule'!$A$20:$BU$86, MATCH('3. Appendix A'!$E$20, '2. 2015 Continuity Schedule'!$A$20:$BU$20,0),FALSE)), 0, VLOOKUP($A35, '2. 2015 Continuity Schedule'!$A$20:$BU$86, MATCH('3. Appendix A'!$E$20, '2. 2015 Continuity Schedule'!$A$20:$BU$20,0),FALSE))","v":-0.10415000026114285}]
[13,null,"Disposition and Recovery/Refund of Regulatory Balances (2013)",1595,{"$f":"IF(ISERROR(VLOOKUP($A36, '2. 2015 Continuity Schedule'!$A$20:$BU$86, MATCH('3. Appendix A'!$E$20, '2. 2015 Continuity Schedule'!$A$20:$BU$20,0),FALSE)), 0, VLOOKUP($A36, '2. 2015 Continuity Schedule'!$A$20:$BU$86, MATCH('3. Appendix A'!$E$20, '2. 2015 Continuity Schedule'!$A$20:$BU$20,0),FALSE))","v":0.46133450081106275}]
[14,null,"Disposition and Recovery/Refund of Regulatory Balances (2014)",1595,{"$f":"IF(ISERROR(VLOOKUP($A37, '2. 2015 Continuity Schedule'!$A$20:$BU$86, MATCH('3. Appendix A'!$E$20, '2. 2015 Continuity Schedule'!$A$20:$BU$20,0),FALSE)), 0, VLOOKUP($A37, '2. 2015 Continuity Schedule'!$A$20:$BU$86, MATCH('3. Appendix A'!$E$20, '2. 2015 Continuity Schedule'!$A$20:$BU$20,0),FALSE))","v":-0.30984104535309598}]
[]
[null,null,"Group 2 Accounts"]
[15,null,"Other Regulatory Assets - Sub-Account - Deferred IFRS Transition Costs",1508,{"$f":"IF(ISERROR(VLOOKUP($A40, '2. 2015 Continuity Schedule'!$A$20:$BU$86, MATCH('3. Appendix A'!$E$20, '2. 2015 Continuity Schedule'!$A$20:$BU$20,0),FALSE)), 0, VLOOKUP($A40, '2. 2015 Continuity Schedule'!$A$20:$BU$86, MATCH('3. Appendix A'!$E$20, '2. 2015 Continuity Schedule'!$A$20:$BU$20,0),FALSE))","v":0}]
[16,null,"Other Regulatory Assets - Sub-Account - Incremental Capital Charges",1508,{"$f":"IF(ISERROR(VLOOKUP($A41, '2. 2015 Continuity Schedule'!$A$20:$BU$86, MATCH('3. Appendix A'!$E$20, '2. 2015 Continuity Schedule'!$A$20:$BU$20,0),FALSE)), 0, VLOOKUP($A41, '2. 2015 Continuity Schedule'!$A$20:$BU$86, MATCH('3. Appendix A'!$E$20, '2. 2015 Continuity Schedule'!$A$20:$BU$20,0),FALSE))","v":0}]
[17,null,"Other Regulatory Assets - Sub-Account - Financial Assistance Payment and Recovery Variance - Ontario Clean Energy Benefit Act8",1508,{"$f":"IF(ISERROR(VLOOKUP($A42, '2. 2015 Continuity Schedule'!$A$20:$BU$86, MATCH('3. Appendix A'!$E$20, '2. 2015 Continuity Schedule'!$A$20:$BU$20,0),FALSE)), 0, VLOOKUP($A42, '2. 2015 Continuity Schedule'!$A$20:$BU$86, MATCH('3. Appendix A'!$E$20, '2. 2015 Continuity Schedule'!$A$20:$BU$20,0),FALSE))","v":0}]
[18,null,"Other Regulatory Assets - Sub-Account - Financial Assistance Payment and Recovery Carrying Charges",1508,{"$f":"IF(ISERROR(VLOOKUP($A43, '2. 2015 Continuity Schedule'!$A$20:$BU$86, MATCH('3. Appendix A'!$E$20, '2. 2015 Continuity Schedule'!$A$20:$BU$20,0),FALSE)), 0, VLOOKUP($A43, '2. 2015 Continuity Schedule'!$A$20:$BU$86, MATCH('3. Appendix A'!$E$20, '2. 2015 Continuity Schedule'!$A$20:$BU$20,0),FALSE))","v":0}]
[19,null,"Other Regulatory Assets - Sub-Account - Other 4",1508,{"$f":"IF(ISERROR(VLOOKUP($A44, '2. 2015 Continuity Schedule'!$A$20:$BU$86, MATCH('3. Appendix A'!$E$20, '2. 2015 Continuity Schedule'!$A$20:$BU$20,0),FALSE)), 0, VLOOKUP($A44, '2. 2015 Continuity Schedule'!$A$20:$BU$86, MATCH('3. Appendix A'!$E$20, '2. 2015 Continuity Schedule'!$A$20:$BU$20,0),FALSE))","v":0}]
[20,null,"Retail Cost Variance Account - Retail",1518,{"$f":"IF(ISERROR(VLOOKUP($A45, '2. 2015 Continuity Schedule'!$A$20:$BU$86, MATCH('3. Appendix A'!$E$20, '2. 2015 Continuity Schedule'!$A$20:$BU$20,0),FALSE)), 0, VLOOKUP($A45, '2. 2015 Continuity Schedule'!$A$20:$BU$86, MATCH('3. Appendix A'!$E$20, '2. 2015 Continuity Schedule'!$A$20:$BU$20,0),FALSE))","v":0}]
[21,null,"Misc. Deferred Debits",1525,{"$f":"IF(ISERROR(VLOOKUP($A46, '2. 2015 Continuity Schedule'!$A$20:$BU$86, MATCH('3. Appendix A'!$E$20, '2. 2015 Continuity Schedule'!$A$20:$BU$20,0),FALSE)), 0, VLOOKUP($A46, '2. 2015 Continuity Schedule'!$A$20:$BU$86, MATCH('3. Appendix A'!$E$20, '2. 2015 Continuity Schedule'!$A$20:$BU$20,0),FALSE))","v":0}]
[22,null,"Board-Approved CDM Variance Account",1567,{"$f":"IF(ISERROR(VLOOKUP($A47, '2. 2015 Continuity Schedule'!$A$20:$BU$86, MATCH('3. Appendix A'!$E$20, '2. 2015 Continuity Schedule'!$A$20:$BU$20,0),FALSE)), 0, VLOOKUP($A47, '2. 2015 Continuity Schedule'!$A$20:$BU$86, MATCH('3. Appendix A'!$E$20, '2. 2015 Continuity Schedule'!$A$20:$BU$20,0),FALSE))","v":0}]
[23,null,"Extra-Ordinary Event Costs",1572,{"$f":"IF(ISERROR(VLOOKUP($A48, '2. 2015 Continuity Schedule'!$A$20:$BU$86, MATCH('3. Appendix A'!$E$20, '2. 2015 Continuity Schedule'!$A$20:$BU$20,0),FALSE)), 0, VLOOKUP($A48, '2. 2015 Continuity Schedule'!$A$20:$BU$86, MATCH('3. Appendix A'!$E$20, '2. 2015 Continuity Schedule'!$A$20:$BU$20,0),FALSE))","v":0}]
[24,null,"Deferred Rate Impact Amounts",1574,{"$f":"IF(ISERROR(VLOOKUP($A49, '2. 2015 Continuity Schedule'!$A$20:$BU$86, MATCH('3. Appendix A'!$E$20, '2. 2015 Continuity Schedule'!$A$20:$BU$20,0),FALSE)), 0, VLOOKUP($A49, '2. 2015 Continuity Schedule'!$A$20:$BU$86, MATCH('3. Appendix A'!$E$20, '2. 2015 Continuity Schedule'!$A$20:$BU$20,0),FALSE))","v":0}]
[25,null,"RSVA - One-time",1582,{"$f":"IF(ISERROR(VLOOKUP($A50, '2. 2015 Continuity Schedule'!$A$20:$BU$86, MATCH('3. Appendix A'!$E$20, '2. 2015 Continuity Schedule'!$A$20:$BU$20,0),FALSE)), 0, VLOOKUP($A50, '2. 2015 Continuity Schedule'!$A$20:$BU$86, MATCH('3. Appendix A'!$E$20, '2. 2015 Continuity Schedule'!$A$20:$BU$20,0),FALSE))","v":0}]
[26,null,"Other Deferred Credits",2425,{"$f":"IF(ISERROR(VLOOKUP($A51, '2. 2015 Continuity Schedule'!$A$20:$BU$86, MATCH('3. Appendix A'!$E$20, '2. 2015 Continuity Schedule'!$A$20:$BU$20,0),FALSE)), 0, VLOOKUP($A51, '2. 2015 Continuity Schedule'!$A$20:$BU$86, MATCH('3. Appendix A'!$E$20, '2. 2015 Continuity Schedule'!$A$20:$BU$20,0),FALSE))","v":0}]
[27,null,"PILs and Tax Variance for 2006 and Subsequent Years                                                                          (excludes sub-account and contra account below)",1592,{"$f":"IF(ISERROR(VLOOKUP($A52, '2. 2015 Continuity Schedule'!$A$20:$BU$86, MATCH('3. Appendix A'!$E$20, '2. 2015 Continuity Schedule'!$A$20:$BU$20,0),FALSE)), 0, VLOOKUP($A52, '2. 2015 Continuity Schedule'!$A$20:$BU$86, MATCH('3. Appendix A'!$E$20, '2. 2015 Continuity Schedule'!$A$20:$BU$20,0),FALSE))","v":0}]
[28,null,"PILs and Tax Variance for 2006 and Subsequent Years - Sub-Account HST/OVAT                          Input Tax Credits (ITCs)",1592,{"$f":"IF(ISERROR(VLOOKUP($A53, '2. 2015 Continuity Schedule'!$A$20:$BU$86, MATCH('3. Appendix A'!$E$20, '2. 2015 Continuity Schedule'!$A$20:$BU$20,0),FALSE)), 0, VLOOKUP($A53, '2. 2015 Continuity Schedule'!$A$20:$BU$86, MATCH('3. Appendix A'!$E$20, '2. 2015 Continuity Schedule'!$A$20:$BU$20,0),FALSE))","v":0}]
[29,null,"Renewable Generation Connection Capital Deferral Account",1531,{"$f":"IF(ISERROR(VLOOKUP($A54, '2. 2015 Continuity Schedule'!$A$20:$BU$86, MATCH('3. Appendix A'!$E$20, '2. 2015 Continuity Schedule'!$A$20:$BU$20,0),FALSE)), 0, VLOOKUP($A54, '2. 2015 Continuity Schedule'!$A$20:$BU$86, MATCH('3. Appendix A'!$E$20, '2. 2015 Continuity Schedule'!$A$20:$BU$20,0),FALSE))","v":0}]
[30,null,"Renewable Generation Connection OM&A Deferral Account",1532,{"$f":"IF(ISERROR(VLOOKUP($A55, '2. 2015 Continuity Schedule'!$A$20:$BU$86, MATCH('3. Appendix A'!$E$20, '2. 2015 Continuity Schedule'!$A$20:$BU$20,0),FALSE)), 0, VLOOKUP($A55, '2. 2015 Continuity Schedule'!$A$20:$BU$86, MATCH('3. Appendix A'!$E$20, '2. 2015 Continuity Schedule'!$A$20:$BU$20,0),FALSE))","v":0}]
[31,null,"Renewable Generation Connection Funding Adder Deferral Account ",1533,{"$f":"IF(ISERROR(VLOOKUP($A56, '2. 2015 Continuity Schedule'!$A$20:$BU$86, MATCH('3. Appendix A'!$E$20, '2. 2015 Continuity Schedule'!$A$20:$BU$20,0),FALSE)), 0, VLOOKUP($A56, '2. 2015 Continuity Schedule'!$A$20:$BU$86, MATCH('3. Appendix A'!$E$20, '2. 2015 Continuity Schedule'!$A$20:$BU$20,0),FALSE))","v":0}]
[32,null,"Smart Grid Capital Deferral Account",1534,{"$f":"IF(ISERROR(VLOOKUP($A57, '2. 2015 Continuity Schedule'!$A$20:$BU$86, MATCH('3. Appendix A'!$E$20, '2. 2015 Continuity Schedule'!$A$20:$BU$20,0),FALSE)), 0, VLOOKUP($A57, '2. 2015 Continuity Schedule'!$A$20:$BU$86, MATCH('3. Appendix A'!$E$20, '2. 2015 Continuity Schedule'!$A$20:$BU$20,0),FALSE))","v":0}]
[33,null,"Smart Grid OM&A Deferral Account",1535,{"$f":"IF(ISERROR(VLOOKUP($A58, '2. 2015 Continuity Schedule'!$A$20:$BU$86, MATCH('3. Appendix A'!$E$20, '2. 2015 Continuity Schedule'!$A$20:$BU$20,0),FALSE)), 0, VLOOKUP($A58, '2. 2015 Continuity Schedule'!$A$20:$BU$86, MATCH('3. Appendix A'!$E$20, '2. 2015 Continuity Schedule'!$A$20:$BU$20,0),FALSE))","v":0}]
[34,null,"Smart Grid Funding Adder Deferral Account",1536,{"$f":"IF(ISERROR(VLOOKUP($A59, '2. 2015 Continuity Schedule'!$A$20:$BU$86, MATCH('3. Appendix A'!$E$20, '2. 2015 Continuity Schedule'!$A$20:$BU$20,0),FALSE)), 0, VLOOKUP($A59, '2. 2015 Continuity Schedule'!$A$20:$BU$86, MATCH('3. Appendix A'!$E$20, '2. 2015 Continuity Schedule'!$A$20:$BU$20,0),FALSE))","v":0}]
[35,null,"Retail Cost Variance Account - STR",1548,{"$f":"IF(ISERROR(VLOOKUP($A60, '2. 2015 Continuity Schedule'!$A$20:$BU$86, MATCH('3. Appendix A'!$E$20, '2. 2015 Continuity Schedule'!$A$20:$BU$20,0),FALSE)), 0, VLOOKUP($A60, '2. 2015 Continuity Schedule'!$A$20:$BU$86, MATCH('3. Appendix A'!$E$20, '2. 2015 Continuity Schedule'!$A$20:$BU$20,0),FALSE))","v":0}]
[36,null,"Smart Meter Capital and Recovery Offset Variance - Sub-Account - Capital10",1555,{"$f":"IF(ISERROR(VLOOKUP($A61, '2. 2015 Continuity Schedule'!$A$20:$BU$86, MATCH('3. Appendix A'!$E$20, '2. 2015 Continuity Schedule'!$A$20:$BU$20,0),FALSE)), 0, VLOOKUP($A61, '2. 2015 Continuity Schedule'!$A$20:$BU$86, MATCH('3. Appendix A'!$E$20, '2. 2015 Continuity Schedule'!$A$20:$BU$20,0),FALSE))","v":0}]
[37,null,"Smart Meter Capital and Recovery Offset Variance - Sub-Account - Recoveries10",1555,{"$f":"IF(ISERROR(VLOOKUP($A62, '2. 2015 Continuity Schedule'!$A$20:$BU$86, MATCH('3. Appendix A'!$E$20, '2. 2015 Continuity Schedule'!$A$20:$BU$20,0),FALSE)), 0, VLOOKUP($A62, '2. 2015 Continuity Schedule'!$A$20:$BU$86, MATCH('3. Appendix A'!$E$20, '2. 2015 Continuity Schedule'!$A$20:$BU$20,0),FALSE))","v":0}]
[38,null,"Smart Meter Capital and Recovery Offset Variance - Sub-Account - Stranded Meter Costs10",1555,{"$f":"IF(ISERROR(VLOOKUP($A63, '2. 2015 Continuity Schedule'!$A$20:$BU$86, MATCH('3. Appendix A'!$E$20, '2. 2015 Continuity Schedule'!$A$20:$BU$20,0),FALSE)), 0, VLOOKUP($A63, '2. 2015 Continuity Schedule'!$A$20:$BU$86, MATCH('3. Appendix A'!$E$20, '2. 2015 Continuity Schedule'!$A$20:$BU$20,0),FALSE))","v":0}]
[39,null,"Smart Meter OM&A Variance10",1556,{"$f":"IF(ISERROR(VLOOKUP($A64, '2. 2015 Continuity Schedule'!$A$20:$BU$86, MATCH('3. Appendix A'!$E$20, '2. 2015 Continuity Schedule'!$A$20:$BU$20,0),FALSE)), 0, VLOOKUP($A64, '2. 2015 Continuity Schedule'!$A$20:$BU$86, MATCH('3. Appendix A'!$E$20, '2. 2015 Continuity Schedule'!$A$20:$BU$20,0),FALSE))","v":0}]
[40,null,"IFRS-CGAAP Transition PP&E Amounts Balance + Return Component9",1575,{"$f":"IF(ISERROR(VLOOKUP($A65, '2. 2015 Continuity Schedule'!$A$20:$BU$86, MATCH('3. Appendix A'!$E$20, '2. 2015 Continuity Schedule'!$A$20:$BU$20,0),FALSE)), 0, VLOOKUP($A65, '2. 2015 Continuity Schedule'!$A$20:$BU$86, MATCH('3. Appendix A'!$E$20, '2. 2015 Continuity Schedule'!$A$20:$BU$20,0),FALSE))","v":0}]
[41,null,"Accounting Changes Under CGAAP Balance + Return Component9",1576,{"$f":"IF(ISERROR(VLOOKUP($A66, '2. 2015 Continuity Schedule'!$A$20:$BU$86, MATCH('3. Appendix A'!$E$20, '2. 2015 Continuity Schedule'!$A$20:$BU$20,0),FALSE)), 0, VLOOKUP($A66, '2. 2015 Continuity Schedule'!$A$20:$BU$86, MATCH('3. Appendix A'!$E$20, '2. 2015 Continuity Schedule'!$A$20:$BU$20,0),FALSE))","v":0}]

{"sheet":"4. Billing Determinants","index":3,"n_rows":48,"n_cols":26,"rows_kept":48,"cut":false,"hidden":false,"merged":[[47,0,47,7],[18,9,19,9],[18,10,19,10],[18,11,19,11],[18,12,19,12],[44,0,45,7],[46,0,46,7],[18,5,19,5],[18,4,19,4],[18,2,19,2],[18,1,19,1],[18,6,19,6],[18,7,19,7],[18,13,19,13],[15,1,16,8],[18,3,19,3],[18,20,19,20],[18,25,19,25],[18,8,19,8],[18,14,19,14],[18,18,19,18],[18,19,19,19],[18,21,19,21],[18,22,19,22],[18,24,19,24],[18,23,19,23],[18,15,19,15],[18,16,19,16],[18,17,19,17]]}
[]
[]
[]
[]
[]
[]
[]
[]
[]
[]
[]
[]
[]
[]
[]
[null,"In the green shaded cells, enter the data related to the proposed load forecast.  Do not enter data for the MicroFit class."]
[]
[]
[null,"Rate Class \n(Enter Rate Classes in cells below as they appear on your current tariff of rates and charges)","Units","# of Customers","Total \nMetered kWh","Total \nMetered kW","Billed kWh for \nNon-RPP Customers","Billed kW for \nNon-RPP Customers","Distribution Revenue 1","Billed kWh for Wholesale Market Participants (WMP)","Billed kW for Wholesale Market Participants (WMP)","Total Metered kWh less WMP consumption \n(if applicable) ","Total Metered kW less WMP Demand  \n(if applicable)","GA Allocator for Class A, \nNon-WMP Customers \n(if applicable)3","Billed kWh for Class A, Non-WMPs Customers \n(if applicable)","Billed kW for \nClass A Non-WMP Customers\n (if applicable)","Billed kWh for\nNon-RPP Customers LESS \nClass A Consumption","Billed kW for\nNon-RPP Customers LESS \nClass A Demand","1595 Recovery Share Proportion (2008) 2","1595 Recovery Share Proportion (2009) 2","1595 Recovery Share Proportion (2010) 2","1595 Recovery Share Proportion (2011) 2","1595 Recovery Share Proportion (2012) 2","1595 Recovery Share Proportion (2013) 2","1595 Recovery Share Proportion (2014) 2","1568 LRAM Variance Account Class Allocation \n($ amounts)"]
[]
[null,"RESIDENTIAL","kWh",222271.92383365458,1637504595.5259821,0,145300486.43423963,{"$f":"IF(ISERROR(F21/E21*G21), 0, F21/E21*G21)","v":0},null,0,0,{"$f":"E21-J21","v":1637504595.5259821},{"$f":"F21-K21","v":0},null,0,0,{"$f":"IF(OR(G21=0, ISBLANK(G21)), 0, G21-J21-O21)","v":145300486.43423963},{"$f":"IF(OR(H21=0, ISBLANK(H21)), 0, H21-K21-P21)","v":0}]
[null,"GENERAL SERVICE LESS THAN 50 KW","kWh",18493.73399893145,591826168.94057333,0,85507586.787769735,{"$f":"IF(ISERROR(F22/E22*G22), 0, F22/E22*G22)","v":0},null,0,0,{"$f":"E22-J22","v":591826168.94057333},{"$f":"F22-K22","v":0},null,0,0,{"$f":"IF(OR(G22=0, ISBLANK(G22)), 0, G22-J22-O22)","v":85507586.787769735},{"$f":"IF(OR(H22=0, ISBLANK(H22)), 0, H22-K22-P22)","v":0}]
[null,"GENERAL SERVICE 50 TO 4,999 KW","kW",2229.9023482723678,1857725645.1142704,5099311.3147127545,1643027830.2200074,4509982.6376749361,null,7677762.1299849534,21074.855377095864,1850047882.9842856,5078236.4593356587,null,35137716.047029637,79009.255978036555,1600212352.0429928,4409898.5263198037]
[null,"LARGE USE (1)","kW",6,268114275.11066759,538661.30172098242,268114275.11066759,538661.30172098242,null,39177869.747935869,106757.93555642229,228936405.36273172,431903.36616456014,null,201978064.79199192,383601.73023429373,26958340.570739806,48301.635930266406]
[null,"LARGE USE (2)","kW",5,1129733027.202991,2021163.209658579,1129733027.202991,2021163.209658579,null,747835381.31972432,1211580.0849699662,381897645.88326669,809583.12468861276,null,381897645.88326657,809583.12468861288,1.1920928955078125E-7,{"$f":"IF(OR(H25=0, ISBLANK(H25)), 0, ROUND(H25-K25-P25,0))","v":0}]
[null,"UNMETERED SCATTERED LOAD","kWh",1857,11174330.720076239,0,2198262.2786688833,0,null,0,0,11174330.720076239,0,null,0,0,{"$f":"IF(OR(G26=0, ISBLANK(G26)), 0, G26-J26-O26)","v":2198262.2786688833},{"$f":"IF(OR(H26=0, ISBLANK(H26)), 0, H26-K26-P26)","v":0}]
[null,"SENTINEL LIGHTING","kW",248,418980.38651127217,1185.4190801856691,3853.2450391875091,10.901966624542128,null,0,0,418980.38651127217,1185.4190801856691,null,0,0,3853.2450391875091,10.901966624542128]
[null,"STREET LIGHTING","kW",4,39602538.463260598,109947.98480445624,39374387.381713919,109314.57208344377,null,0,0,39602538.463260598,109947.98480445624,null,0,0,39374387.381713919,109314.57208344377]
[null,"STANDBY POWER","kW",0,0,300137.41770060419,0,0,null,0,0,0,300137.41770060419,null,0,0,0,0]
[null,null,null,null,null,null,null,0,null,null,null,0,0,null,null,null,0,0]
[null,null,null,null,null,null,null,0,null,null,null,0,0,null,null,null,0,0]
[null,null,null,null,null,null,null,0,null,null,null,0,0,null,null,null,0,0]
[null,null,null,null,null,null,null,0,null,null,null,0,0,null,null,null,0,0]
[null,null,null,null,null,null,null,0,null,null,null,0,0,null,null,null,0,0]
[null,null,null,null,null,null,null,0,null,null,null,0,0,null,null,null,0,0]
[null,null,null,null,null,null,null,0,null,null,null,0,0,null,null,null,0,0]
[null,null,null,null,null,null,null,0,null,null,null,0,0,null,null,null,0,0]
[null,null,null,null,null,null,null,0,null,null,null,0,0,null,null,null,0,0]
[null,null,null,null,null,null,null,0,null,null,null,0,0,null,null,null,0,0]
[null,null,null,null,null,null,null,0,null,null,null,0,0,null,null,null,0,0]
[null,"Total",null,{"$f":"SUM(D21:D40)","v":245115.56018085839},5536099561.4643316,8070406.6476775622,3313259708.661097,7179132.6231045658,0,794691013.19764519,{"$f":"SUM(K21:K40)","v":1339412.8759034844},4741408548.2666874,6730993.7717740787,0,619013426.72228813,1272194.1109009432,1899555268.741164,4567525.6363001382,{"$f":"SUM(S21:S40)","v":0},{"$f":"SUM(T21:T40)","v":0},{"$f":"SUM(U21:U40)","v":0},{"$f":"SUM(V21:V40)","v":0},{"$f":"SUM(W21:W40)","v":0},null,{"$f":"SUM(Y21:Y40)","v":0},{"$f":"SUM(Z21:Z40)","v":0}]
[null,null,null,null,null,null,null,null,null,null,null,null,null,null,null,null,null,null,null,null,null,null,null,null,"Balance as per Sheet 2",{"$f":"'2. 2015 Continuity Schedule'!BS65","v":0}]
[null,null,null,null,null,null,null,null,null,null,null,null,null,null,null,null,null,null,null,null,null,null,null,null,"Variance",{"$f":"Z41-Z42","v":0}]
[]
["1 For Account 1562, the allocation to customer classes should be performed on the basis of the test year distribution revenue allocation to customer classes found in the Applicant’s Cost of Service application that was most recently approved at the time of disposition of the 1562 account balances"]
[]
["2 Residual Account balance to be allocated to rate classes in proportion to the recovery share as established when rate riders were implemented."]
["3  Enter the percentage of the balance in account 1589 allocated to Class A customers. Distributors typically settle GA costs with Class A customers on the basis of actual (i.e. non-estimated) costs. If this is the case, no amount of the balance in 1589 should be allocated to a distributor’s Class A customers. "]

{"sheet":"5. Allocation of Balances","index":4,"n_rows":57,"n_cols":27,"rows_kept":57,"cut":false,"hidden":false,"merged":[[48,1,48,2],[46,1,46,2],[39,1,39,2],[40,1,40,2],[44,1,44,2],[42,1,42,2],[43,1,43,2]]}
[null,null,null,null,null,null,null,null,null,null,null,null,null,null,null,null,null,null,null,null,null,null,null,null,null,null,21]
[null,null,null,null,null,null,null,null,null,null,null,null,null,null,null,null,null,null,null,null,null,null,null,null,null,null,22]
[]
[null,null,null,"Amounts from Sheet 2","Allocator",{"$f":"IF(LEN(TRIM('4. Billing Determinants'!$B21))=0, \"\", UPPER('4. Billing Determinants'!$B21))","v":"RESIDENTIAL"},{"$f":"IF(LEN(TRIM('4. Billing Determinants'!$B22))=0, \"\", '4. Billing Determinants'!$B22)","v":"GENERAL SERVICE LESS THAN 50 KW"},{"$f":"IF(LEN(TRIM('4. Billing Determinants'!$B23))=0, \"\", '4. Billing Determinants'!$B23)","v":"GENERAL SERVICE 50 TO 4,999 KW"},{"$f":"IF(LEN(TRIM('4. Billing Determinants'!$B24))=0, \"\", '4. Billing Determinants'!$B24)","v":"LARGE USE (1)"},{"$f":"IF(LEN(TRIM('4. Billing Determinants'!$B25))=0, \"\", '4. Billing Determinants'!$B25)","v":"LARGE USE (2)"},{"$f":"IF(LEN(TRIM('4. Billing Determinants'!$B26))=0, \"\", '4. Billing Determinants'!$B26)","v":"UNMETERED SCATTERED LOAD"},{"$f":"IF(LEN(TRIM('4. Billing Determinants'!$B27))=0, \"\", '4. Billing Determinants'!$B27)","v":"SENTINEL LIGHTING"},{"$f":"IF(LEN(TRIM('4. Billing Determinants'!$B28))=0, \"\", '4. Billing Determinants'!$B28)","v":"STREET LIGHTING"},{"$f":"IF(LEN(TRIM('4. Billing Determinants'!$B29))=0, \"\", '4. Billing Determinants'!$B29)","v":"STANDBY POWER"},{"$f":"IF(LEN(TRIM('4. Billing Determinants'!$B30))=0, \"\", '4. Billing Determinants'!$B30)","v":""},{"$f":"IF(LEN(TRIM('4. Billing Determinants'!$B31))=0, \"\", '4. Billing Determinants'!$B31)","v":""},{"$f":"IF(LEN(TRIM('4. Billing Determinants'!$B32))=0, \"\", '4. Billing Determinants'!$B32)","v":""},{"$f":"IF(LEN(TRIM('4. Billing Determinants'!$B33))=0, \"\", '4. Billing Determinants'!$B33)","v":""},{"$f":"IF(LEN(TRIM('4. Billing Determinants'!$B34))=0, \"\", '4. Billing Determinants'!$B34)","v":""},{"$f":"IF(LEN(TRIM('4. Billing Determinants'!$B35))=0, \"\", '4. Billing Determinants'!$B35)","v":""},{"$f":"IF(LEN(TRIM('4. Billing Determinants'!$B36))=0, \"\", '4. Billing Determinants'!$B36)","v":""},{"$f":"IF(LEN(TRIM('4. Billing Determinants'!$B37))=0, \"\", '4. Billing Determinants'!$B37)","v":""},{"$f":"IF(LEN(TRIM('4. Billing Determinants'!$B38))=0, \"\", '4. Billing Determinants'!$B38)","v":""},{"$f":"IF(LEN(TRIM('4. Billing Determinants'!$B39))=0, \"\", '4. Billing Determinants'!$B39)","v":""},{"$f":"IF(LEN(TRIM('4. Billing Determinants'!$B40))=0, \"\", '4. Billing Determinants'!$B40)","v":""}]
[null,"LV Variance Account",1550,{"$f":"'2. 2015 Continuity Schedule'!BS24","v":292953.78526224993},"kWh",{"$f":"IFERROR(IF(F$4=\"\",0,IF($E5=\"kWh\",VLOOKUP(F$4,'4. Billing Determinants'!$B$19:$Z$41,4,0)/'4. Billing Determinants'!$E$41*$D5,IF($E5=\"kW\",VLOOKUP(F$4,'4. Billing Determinants'!$B$19:$Z$41,5,0)/'4. Billing Determinants'!$F$41*$D5,IF($E5=\"Non-RPP kWh\",VLOOKUP(F$4,'4. Billing Determinants'!$B$19:$Z$41,6,0)/'4. Billing Determinants'!$G$41*$D5,IF($E5=\"Distribution Rev.\",VLOOKUP(F$4,'4. Billing Determinants'!$B$19:$Z$41,8,0)/'4. Billing Determinants'!$I$41*$D5, VLOOKUP(F$4,'4. Billing Determinants'!$B$19:$Z$41,3,0)/'4. Billing Determinants'!$D$41*$D5))))),0)","v":86651.832091830918},{"$f":"IFERROR(IF(G$4=\"\",0,IF($E5=\"kWh\",VLOOKUP(G$4,'4. Billing Determinants'!$B$19:$Z$41,4,0)/'4. Billing Determinants'!$E$41*$D5,IF($E5=\"kW\",VLOOKUP(G$4,'4. Billing Determinants'!$B$19:$Z$41,5,0)/'4. Billing Determinants'!$F$41*$D5,IF($E5=\"Non-RPP kWh\",VLOOKUP(G$4,'4. Billing Determinants'!$B$19:$Z$41,6,0)/'4. Billing Determinants'!$G$41*$D5,IF($E5=\"Distribution Rev.\",VLOOKUP(G$4,'4. Billing Determinants'!$B$19:$Z$41,8,0)/'4. Billing Determinants'!$I$41*$D5, VLOOKUP(G$4,'4. Billing Determinants'!$B$19:$Z$41,3,0)/'4. Billing Determinants'!$D$41*$D5))))),0)","v":31317.665891568129},{"$f":"IFERROR(IF(H$4=\"\",0,IF($E5=\"kWh\",VLOOKUP(H$4,'4. Billing Determinants'!$B$19:$Z$41,4,0)/'4. Billing Determinants'!$E$41*$D5,IF($E5=\"kW\",VLOOKUP(H$4,'4. Billing Determinants'!$B$19:$Z$41,5,0)/'4. Billing Determinants'!$F$41*$D5,IF($E5=\"Non-RPP kWh\",VLOOKUP(H$4,'4. Billing Determinants'!$B$19:$Z$41,6,0)/'4. Billing Determinants'!$G$41*$D5,IF($E5=\"Distribution Rev.\",VLOOKUP(H$4,'4. Billing Determinants'!$B$19:$Z$41,8,0)/'4. Billing Determinants'!$I$41*$D5, VLOOKUP(H$4,'4. Billing Determinants'!$B$19:$Z$41,3,0)/'4. Billing Determinants'!$D$41*$D5))))),0)","v":98305.269562570742},{"$f":"IFERROR(IF(I$4=\"\",0,IF($E5=\"kWh\",VLOOKUP(I$4,'4. Billing Determinants'!$B$19:$Z$41,4,0)/'4. Billing Determinants'!$E$41*$D5,IF($E5=\"kW\",VLOOKUP(I$4,'4. Billing Determinants'!$B$19:$Z$41,5,0)/'4. Billing Determinants'!$F$41*$D5,IF($E5=\"Non-RPP kWh\",VLOOKUP(I$4,'4. Billing Determinants'!$B$19:$Z$41,6,0)/'4. Billing Determinants'!$G$41*$D5,IF($E5=\"Distribution Rev.\",VLOOKUP(I$4,'4. Billing Determinants'!$B$19:$Z$41,8,0)/'4. Billing Determinants'!$I$41*$D5, VLOOKUP(I$4,'4. Billing Determinants'!$B$19:$Z$41,3,0)/'4. Billing Determinants'!$D$41*$D5))))),0)","v":14187.80332695799},{"$f":"IFERROR(IF(J$4=\"\",0,IF($E5=\"kWh\",VLOOKUP(J$4,'4. Billing Determinants'!$B$19:$Z$41,4,0)/'4. Billing Determinants'!$E$41*$D5,IF($E5=\"kW\",VLOOKUP(J$4,'4. Billing Determinants'!$B$19:$Z$41,5,0)/'4. Billing Determinants'!$F$41*$D5,IF($E5=\"Non-RPP kWh\",VLOOKUP(J$4,'4. Billing Determinants'!$B$19:$Z$41,6,0)/'4. Billing Determinants'!$G$41*$D5,IF($E5=\"Distribution Rev.\",VLOOKUP(J$4,'4. Billing Determinants'!$B$19:$Z$41,8,0)/'4. Billing Determinants'!$I$41*$D5, VLOOKUP(J$4,'4. Billing Determinants'!$B$19:$Z$41,3,0)/'4. Billing Determinants'!$D$41*$D5))))),0)","v":59782.083573539596},{"$f":"IFERROR(IF(K$4=\"\",0,IF($E5=\"kWh\",VLOOKUP(K$4,'4. Billing Determinants'!$B$19:$Z$41,4,0)/'4. Billing Determinants'!$E$41*$D5,IF($E5=\"kW\",VLOOKUP(K$4,'4. Billing Determinants'!$B$19:$Z$41,5,0)/'4. Billing Determinants'!$F$41*$D5,IF($E5=\"Non-RPP kWh\",VLOOKUP(K$4,'4. Billing Determinants'!$B$19:$Z$41,6,0)/'4. Billing Determinants'!$G$41*$D5,IF($E5=\"Distribution Rev.\",VLOOKUP(K$4,'4. Billing Determinants'!$B$19:$Z$41,8,0)/'4. Billing Determinants'!$I$41*$D5, VLOOKUP(K$4,'4. Billing Determinants'!$B$19:$Z$41,3,0)/'4. Billing Determinants'!$D$41*$D5))))),0)","v":591.31206833872409},{"$f":"IFERROR(IF(L$4=\"\",0,IF($E5=\"kWh\",VLOOKUP(L$4,'4. Billing Determinants'!$B$19:$Z$41,4,0)/'4. Billing Determinants'!$E$41*$D5,IF($E5=\"kW\",VLOOKUP(L$4,'4. Billing Determinants'!$B$19:$Z$41,5,0)/'4. Billing Determinants'!$F$41*$D5,IF($E5=\"Non-RPP kWh\",VLOOKUP(L$4,'4. Billing Determinants'!$B$19:$Z$41,6,0)/'4. Billing Determinants'!$G$41*$D5,IF($E5=\"Distribution Rev.\",VLOOKUP(L$4,'4. Billing Determinants'!$B$19:$Z$41,8,0)/'4. Billing Determinants'!$I$41*$D5, VLOOKUP(L$4,'4. Billing Determinants'!$B$19:$Z$41,3,0)/'4. Billing Determinants'!$D$41*$D5))))),0)","v":22.171185473884744},{"$f":"IFERROR(IF(M$4=\"\",0,IF($E5=\"kWh\",VLOOKUP(M$4,'4. Billing Determinants'!$B$19:$Z$41,4,0)/'4. Billing Determinants'!$E$41*$D5,IF($E5=\"kW\",VLOOKUP(M$4,'4. Billing Determinants'!$B$19:$Z$41,5,0)/'4. Billing Determinants'!$F$41*$D5,IF($E5=\"Non-RPP kWh\",VLOOKUP(M$4,'4. Billing Determinants'!$B$19:$Z$41,6,0)/'4. Billing Determinants'!$G$41*$D5,IF($E5=\"Distribution Rev.\",VLOOKUP(M$4,'4. Billing Determinants'!$B$19:$Z$41,8,0)/'4. Billing Determinants'!$I$41*$D5, VLOOKUP(M$4,'4. Billing Determinants'!$B$19:$Z$41,3,0)/'4. Billing Determinants'!$D$41*$D5))))),0)","v":2095.6475619700227},{"$f":"IFERROR(IF(N$4=\"\",0,IF($E5=\"kWh\",VLOOKUP(N$4,'4. Billing Determinants'!$B$19:$Z$41,4,0)/'4. Billing Determinants'!$E$41*$D5,IF($E5=\"kW\",VLOOKUP(N$4,'4. Billing Determinants'!$B$19:$Z$41,5,0)/'4. Billing Determinants'!$F$41*$D5,IF($E5=\"Non-RPP kWh\",VLOOKUP(N$4,'4. Billing Determinants'!$B$19:$Z$41,6,0)/'4. Billing Determinants'!$G$41*$D5,IF($E5=\"Distribution Rev.\",VLOOKUP(N$4,'4. Billing Determinants'!$B$19:$Z$41,8,0)/'4. Billing Determinants'!$I$41*$D5, VLOOKUP(N$4,'4. Billing Determinants'!$B$19:$Z$41,3,0)/'4. Billing Determinants'!$D$41*$D5))))),0)","v":0},{"$f":"IFERROR(IF(O$4=\"\",0,IF($E5=\"kWh\",VLOOKUP(O$4,'4. Billing Determinants'!$B$19:$Z$41,4,0)/'4. Billing Determinants'!$E$41*$D5,IF($E5=\"kW\",VLOOKUP(O$4,'4. Billing Determinants'!$B$19:$Z$41,5,0)/'4. Billing Determinants'!$F$41*$D5,IF($E5=\"Non-RPP kWh\",VLOOKUP(O$4,'4. Billing Determinants'!$B$19:$Z$41,6,0)/'4. Billing Determinants'!$G$41*$D5,IF($E5=\"Distribution Rev.\",VLOOKUP(O$4,'4. Billing Determinants'!$B$19:$Z$41,8,0)/'4. Billing Determinants'!$I$41*$D5, VLOOKUP(O$4,'4. Billing Determinants'!$B$19:$Z$41,3,0)/'4. Billing Determinants'!$D$41*$D5))))),0)","v":0},{"$f":"IFERROR(IF(P$4=\"\",0,IF($E5=\"kWh\",VLOOKUP(P$4,'4. Billing Determinants'!$B$19:$Z$41,4,0)/'4. Billing Determinants'!$E$41*$D5,IF($E5=\"kW\",VLOOKUP(P$4,'4. Billing Determinants'!$B$19:$Z$41,5,0)/'4. Billing Determinants'!$F$41*$D5,IF($E5=\"Non-RPP kWh\",VLOOKUP(P$4,'4. Billing Determinants'!$B$19:$Z$41,6,0)/'4. Billing Determinants'!$G$41*$D5,IF($E5=\"Distribution Rev.\",VLOOKUP(P$4,'4. Billing Determinants'!$B$19:$Z$41,8,0)/'4. Billing Determinants'!$I$41*$D5, VLOOKUP(P$4,'4. Billing Determinants'!$B$19:$Z$41,3,0)/'4. Billing Determinants'!$D$41*$D5))))),0)","v":0},{"$f":"IFERROR(IF(Q$4=\"\",0,IF($E5=\"kWh\",VLOOKUP(Q$4,'4. Billing Determinants'!$B$19:$Z$41,4,0)/'4. Billing Determinants'!$E$41*$D5,IF($E5=\"kW\",VLOOKUP(Q$4,'4. Billing Determinants'!$B$19:$Z$41,5,0)/'4. Billing Determinants'!$F$41*$D5,IF($E5=\"Non-RPP kWh\",VLOOKUP(Q$4,'4. Billing Determinants'!$B$19:$Z$41,6,0)/'4. Billing Determinants'!$G$41*$D5,IF($E5=\"Distribution Rev.\",VLOOKUP(Q$4,'4. Billing Determinants'!$B$19:$Z$41,8,0)/'4. Billing Determinants'!$I$41*$D5, VLOOKUP(Q$4,'4. Billing Determinants'!$B$19:$Z$41,3,0)/'4. Billing Determinants'!$D$41*$D5))))),0)","v":0},{"$f":"IFERROR(IF(R$4=\"\",0,IF($E5=\"kWh\",VLOOKUP(R$4,'4. Billing Determinants'!$B$19:$Z$41,4,0)/'4. Billing Determinants'!$E$41*$D5,IF($E5=\"kW\",VLOOKUP(R$4,'4. Billing Determinants'!$B$19:$Z$41,5,0)/'4. Billing Determinants'!$F$41*$D5,IF($E5=\"Non-RPP kWh\",VLOOKUP(R$4,'4. Billing Determinants'!$B$19:$Z$41,6,0)/'4. Billing Determinants'!$G$41*$D5,IF($E5=\"Distribution Rev.\",VLOOKUP(R$4,'4. Billing Determinants'!$B$19:$Z$41,8,0)/'4. Billing Determinants'!$I$41*$D5, VLOOKUP(R$4,'4. Billing Determinants'!$B$19:$Z$41,3,0)/'4. Billing Determinants'!$D$41*$D5))))),0)","v":0},{"$f":"IFERROR(IF(S$4=\"\",0,IF($E5=\"kWh\",VLOOKUP(S$4,'4. Billing Determinants'!$B$19:$Z$41,4,0)/'4. Billing Determinants'!$E$41*$D5,IF($E5=\"kW\",VLOOKUP(S$4,'4. Billing Determinants'!$B$19:$Z$41,5,0)/'4. Billing Determinants'!$F$41*$D5,IF($E5=\"Non-RPP kWh\",VLOOKUP(S$4,'4. Billing Determinants'!$B$19:$Z$41,6,0)/'4. Billing Determinants'!$G$41*$D5,IF($E5=\"Distribution Rev.\",VLOOKUP(S$4,'4. Billing Determinants'!$B$19:$Z$41,8,0)/'4. Billing Determinants'!$I$41*$D5, VLOOKUP(S$4,'4. Billing Determinants'!$B$19:$Z$41,3,0)/'4. Billing Determinants'!$D$41*$D5))))),0)","v":0},{"$f":"IFERROR(IF(T$4=\"\",0,IF($E5=\"kWh\",VLOOKUP(T$4,'4. Billing Determinants'!$B$19:$Z$41,4,0)/'4. Billing Determinants'!$E$41*$D5,IF($E5=\"kW\",VLOOKUP(T$4,'4. Billing Determinants'!$B$19:$Z$41,5,0)/'4. Billing Determinants'!$F$41*$D5,IF($E5=\"Non-RPP kWh\",VLOOKUP(T$4,'4. Billing Determinants'!$B$19:$Z$41,6,0)/'4. Billing Determinants'!$G$41*$D5,IF($E5=\"Distribution Rev.\",VLOOKUP(T$4,'4. Billing Determinants'!$B$19:$Z$41,8,0)/'4. Billing Determinants'!$I$41*$D5, VLOOKUP(T$4,'4. Billing Determinants'!$B$19:$Z$41,3,0)/'4. Billing Determinants'!$D$41*$D5))))),0)","v":0},{"$f":"IFERROR(IF(U$4=\"\",0,IF($E5=\"kWh\",VLOOKUP(U$4,'4. Billing Determinants'!$B$19:$Z$41,4,0)/'4. Billing Determinants'!$E$41*$D5,IF($E5=\"kW\",VLOOKUP(U$4,'4. Billing Determinants'!$B$19:$Z$41,5,0)/'4. Billing Determinants'!$F$41*$D5,IF($E5=\"Non-RPP kWh\",VLOOKUP(U$4,'4. Billing Determinants'!$B$19:$Z$41,6,0)/'4. Billing Determinants'!$G$41*$D5,IF($E5=\"Distribution Rev.\",VLOOKUP(U$4,'4. Billing Determinants'!$B$19:$Z$41,8,0)/'4. Billing Determinants'!$I$41*$D5, VLOOKUP(U$4,'4. Billing Determinants'!$B$19:$Z$41,3,0)/'4. Billing Determinants'!$D$41*$D5))))),0)","v":0},{"$f":"IFERROR(IF(V$4=\"\",0,IF($E5=\"kWh\",VLOOKUP(V$4,'4. Billing Determinants'!$B$19:$Z$41,4,0)/'4. Billing Determinants'!$E$41*$D5,IF($E5=\"kW\",VLOOKUP(V$4,'4. Billing Determinants'!$B$19:$Z$41,5,0)/'4. Billing Determinants'!$F$41*$D5,IF($E5=\"Non-RPP kWh\",VLOOKUP(V$4,'4. Billing Determinants'!$B$19:$Z$41,6,0)/'4. Billing Determinants'!$G$41*$D5,IF($E5=\"Distribution Rev.\",VLOOKUP(V$4,'4. Billing Determinants'!$B$19:$Z$41,8,0)/'4. Billing Determinants'!$I$41*$D5, VLOOKUP(V$4,'4. Billing Determinants'!$B$19:$Z$41,3,0)/'4. Billing Determinants'!$D$41*$D5))))),0)","v":0},{"$f":"IFERROR(IF(W$4=\"\",0,IF($E5=\"kWh\",VLOOKUP(W$4,'4. Billing Determinants'!$B$19:$Z$41,4,0)/'4. Billing Determinants'!$E$41*$D5,IF($E5=\"kW\",VLOOKUP(W$4,'4. Billing Determinants'!$B$19:$Z$41,5,0)/'4. Billing Determinants'!$F$41*$D5,IF($E5=\"Non-RPP kWh\",VLOOKUP(W$4,'4. Billing Determinants'!$B$19:$Z$41,6,0)/'4. Billing Determinants'!$G$41*$D5,IF($E5=\"Distribution Rev.\",VLOOKUP(W$4,'4. Billing Determinants'!$B$19:$Z$41,8,0)/'4. Billing Determinants'!$I$41*$D5, VLOOKUP(W$4,'4. Billing Determinants'!$B$19:$Z$41,3,0)/'4. Billing Determinants'!$D$41*$D5))))),0)","v":0},{"$f":"IFERROR(IF(X$4=\"\",0,IF($E5=\"kWh\",VLOOKUP(X$4,'4. Billing Determinants'!$B$19:$Z$41,4,0)/'4. Billing Determinants'!$E$41*$D5,IF($E5=\"kW\",VLOOKUP(X$4,'4. Billing Determinants'!$B$19:$Z$41,5,0)/'4. Billing Determinants'!$F$41*$D5,IF($E5=\"Non-RPP kWh\",VLOOKUP(X$4,'4. Billing Determinants'!$B$19:$Z$41,6,0)/'4. Billing Determinants'!$G$41*$D5,IF($E5=\"Distribution Rev.\",VLOOKUP(X$4,'4. Billing Determinants'!$B$19:$Z$41,8,0)/'4. Billing Determinants'!$I$41*$D5, VLOOKUP(X$4,'4. Billing Determinants'!$B$19:$Z$41,3,0)/'4. Billing Determinants'!$D$41*$D5))))),0)","v":0},{"$f":"IFERROR(IF(Y$4=\"\",0,IF($E5=\"kWh\",VLOOKUP(Y$4,'4. Billing Determinants'!$B$19:$Z$41,4,0)/'4. Billing Determinants'!$E$41*$D5,IF($E5=\"kW\",VLOOKUP(Y$4,'4. Billing Determinants'!$B$19:$Z$41,5,0)/'4. Billing Determinants'!$F$41*$D5,IF($E5=\"Non-RPP kWh\",VLOOKUP(Y$4,'4. Billing Determinants'!$B$19:$Z$41,6,0)/'4. Billing Determinants'!$G$41*$D5,IF($E5=\"Distribution Rev.\",VLOOKUP(Y$4,'4. Billing Determinants'!$B$19:$Z$41,8,0)/'4. Billing Determinants'!$I$41*$D5, VLOOKUP(Y$4,'4. Billing Determinants'!$B$19:$Z$41,3,0)/'4. Billing Determinants'!$D$41*$D5))))),0)","v":0}]
[null,"Smart Metering Entity Charge Variance Account",1551,{"$f":"'2. 2015 Continuity Schedule'!BS25","v":-19106.789524250071},"# of Customers",{"$f":"(222271.923833655/(222271.923833655+18493.7339989315))*D6","v":-17639.155451284591},{"$f":"(18493.7339989315/(222271.923833655+18493.7339989315))*D6","v":-1467.6340729654789},0,0,0,0,0,0,0,0,0,0,0,0,0,0,0,0,0,0]
[null,"RSVA - Wholesale Market Service Charge",1580,{"$f":"'2. 2015 Continuity Schedule'!BS26","v":-1075928.3753912374},"kWh",{"$f":"IFERROR(IF(F$4=\"\",0,IF($E7=\"kWh\",VLOOKUP(F$4,'4. Billing Determinants'!$B$19:$Z$41,11,0)/'4. Billing Determinants'!$L$41*$D7,IF($E7=\"kW\",VLOOKUP(F$4,'4. Billing Determinants'!$B$19:$Z$41,12,0)/'4. Billing Determinants'!$M$41*$D7,))),0)","v":-371585.28762597957},{"$f":"IFERROR(IF(G$4=\"\",0,IF($E7=\"kWh\",VLOOKUP(G$4,'4. Billing Determinants'!$B$19:$Z$41,11,0)/'4. Billing Determinants'!$L$41*$D7,IF($E7=\"kW\",VLOOKUP(G$4,'4. Billing Determinants'!$B$19:$Z$41,12,0)/'4. Billing Determinants'!$M$41*$D7,))),0)","v":-134298.18628370084},{"$f":"IFERROR(IF(H$4=\"\",0,IF($E7=\"kWh\",VLOOKUP(H$4,'4. Billing Determinants'!$B$19:$Z$41,11,0)/'4. Billing Determinants'!$L$41*$D7,IF($E7=\"kW\",VLOOKUP(H$4,'4. Billing Determinants'!$B$19:$Z$41,12,0)/'4. Billing Determinants'!$M$41*$D7,))),0)","v":-419815.96668419405},{"$f":"IFERROR(IF(I$4=\"\",0,IF($E7=\"kWh\",VLOOKUP(I$4,'4. Billing Determinants'!$B$19:$Z$41,11,0)/'4. Billing Determinants'!$L$41*$D7,IF($E7=\"kW\",VLOOKUP(I$4,'4. Billing Determinants'!$B$19:$Z$41,12,0)/'4. Billing Determinants'!$M$41*$D7,))),0)","v":-51950.632851472037},{"$f":"IFERROR(IF(J$4=\"\",0,IF($E7=\"kWh\",VLOOKUP(J$4,'4. Billing Determinants'!$B$19:$Z$41,11,0)/'4. Billing Determinants'!$L$41*$D7,IF($E7=\"kW\",VLOOKUP(J$4,'4. Billing Determinants'!$B$19:$Z$41,12,0)/'4. Billing Determinants'!$M$41*$D7,))),0)","v":-86660.853946267001},{"$f":"IFERROR(IF(K$4=\"\",0,IF($E7=\"kWh\",VLOOKUP(K$4,'4. Billing Determinants'!$B$19:$Z$41,11,0)/'4. Billing Determinants'!$L$41*$D7,IF($E7=\"kW\",VLOOKUP(K$4,'4. Billing Determinants'!$B$19:$Z$41,12,0)/'4. Billing Determinants'!$M$41*$D7,))),0)","v":-2535.6978575767703},{"$f":"IFERROR(IF(L$4=\"\",0,IF($E7=\"kWh\",VLOOKUP(L$4,'4. Billing Determinants'!$B$19:$Z$41,11,0)/'4. Billing Determinants'!$L$41*$D7,IF($E7=\"kW\",VLOOKUP(L$4,'4. Billing Determinants'!$B$19:$Z$41,12,0)/'4. Billing Determinants'!$M$41*$D7,))),0)","v":-95.075731608207818},{"$f":"IFERROR(IF(M$4=\"\",0,IF($E7=\"kWh\",VLOOKUP(M$4,'4. Billing Determinants'!$B$19:$Z$41,11,0)/'4. Billing Determinants'!$L$41*$D7,IF($E7=\"kW\",VLOOKUP(M$4,'4. Billing Determinants'!$B$19:$Z$41,12,0)/'4. Billing Determinants'!$M$41*$D7,))),0)","v":-8986.674410439},{"$f":"IFERROR(IF(N$4=\"\",0,IF($E7=\"kWh\",VLOOKUP(N$4,'4. Billing Determinants'!$B$19:$Z$41,11,0)/'4. Billing Determinants'!$L$41*$D7,IF($E7=\"kW\",VLOOKUP(N$4,'4. Billing Determinants'!$B$19:$Z$41,12,0)/'4. Billing Determinants'!$M$41*$D7,))),0)","v":0},{"$f":"IFERROR(IF(O$4=\"\",0,IF($E7=\"kWh\",VLOOKUP(O$4,'4. Billing Determinants'!$B$19:$Z$41,11,0)/'4. Billing Determinants'!$L$41*$D7,IF($E7=\"kW\",VLOOKUP(O$4,'4. Billing Determinants'!$B$19:$Z$41,12,0)/'4. Billing Determinants'!$M$41*$D7,))),0)","v":0},{"$f":"IFERROR(IF(P$4=\"\",0,IF($E7=\"kWh\",VLOOKUP(P$4,'4. Billing Determinants'!$B$19:$Z$41,11,0)/'4. Billing Determinants'!$L$41*$D7,IF($E7=\"kW\",VLOOKUP(P$4,'4. Billing Determinants'!$B$19:$Z$41,12,0)/'4. Billing Determinants'!$M$41*$D7,))),0)","v":0},{"$f":"IFERROR(IF(Q$4=\"\",0,IF($E7=\"kWh\",VLOOKUP(Q$4,'4. Billing Determinants'!$B$19:$Z$41,11,0)/'4. Billing Determinants'!$L$41*$D7,IF($E7=\"kW\",VLOOKUP(Q$4,'4. Billing Determinants'!$B$19:$Z$41,12,0)/'4. Billing Determinants'!$M$41*$D7,))),0)","v":0},{"$f":"IFERROR(IF(R$4=\"\",0,IF($E7=\"kWh\",VLOOKUP(R$4,'4. Billing Determinants'!$B$19:$Z$41,11,0)/'4. Billing Determinants'!$L$41*$D7,IF($E7=\"kW\",VLOOKUP(R$4,'4. Billing Determinants'!$B$19:$Z$41,12,0)/'4. Billing Determinants'!$M$41*$D7,))),0)","v":0},{"$f":"IFERROR(IF(S$4=\"\",0,IF($E7=\"kWh\",VLOOKUP(S$4,'4. Billing Determinants'!$B$19:$Z$41,11,0)/'4. Billing Determinants'!$L$41*$D7,IF($E7=\"kW\",VLOOKUP(S$4,'4. Billing Determinants'!$B$19:$Z$41,12,0)/'4. Billing Determinants'!$M$41*$D7,))),0)","v":0},{"$f":"IFERROR(IF(T$4=\"\",0,IF($E7=\"kWh\",VLOOKUP(T$4,'4. Billing Determinants'!$B$19:$Z$41,11,0)/'4. Billing Determinants'!$L$41*$D7,IF($E7=\"kW\",VLOOKUP(T$4,'4. Billing Determinants'!$B$19:$Z$41,12,0)/'4. Billing Determinants'!$M$41*$D7,))),0)","v":0},{"$f":"IFERROR(IF(U$4=\"\",0,IF($E7=\"kWh\",VLOOKUP(U$4,'4. Billing Determinants'!$B$19:$Z$41,11,0)/'4. Billing Determinants'!$L$41*$D7,IF($E7=\"kW\",VLOOKUP(U$4,'4. Billing Determinants'!$B$19:$Z$41,12,0)/'4. Billing Determinants'!$M$41*$D7,))),0)","v":0},{"$f":"IFERROR(IF(V$4=\"\",0,IF($E7=\"kWh\",VLOOKUP(V$4,'4. Billing Determinants'!$B$19:$Z$41,11,0)/'4. Billing Determinants'!$L$41*$D7,IF($E7=\"kW\",VLOOKUP(V$4,'4. Billing Determinants'!$B$19:$Z$41,12,0)/'4. Billing Determinants'!$M$41*$D7,))),0)","v":0},{"$f":"IFERROR(IF(W$4=\"\",0,IF($E7=\"kWh\",VLOOKUP(W$4,'4. Billing Determinants'!$B$19:$Z$41,11,0)/'4. Billing Determinants'!$L$41*$D7,IF($E7=\"kW\",VLOOKUP(W$4,'4. Billing Determinants'!$B$19:$Z$41,12,0)/'4. Billing Determinants'!$M$41*$D7,))),0)","v":0},{"$f":"IFERROR(IF(X$4=\"\",0,IF($E7=\"kWh\",VLOOKUP(X$4,'4. Billing Determinants'!$B$19:$Z$41,11,0)/'4. Billing Determinants'!$L$41*$D7,IF($E7=\"kW\",VLOOKUP(X$4,'4. Billing Determinants'!$B$19:$Z$41,12,0)/'4. Billing Determinants'!$M$41*$D7,))),0)","v":0},{"$f":"IFERROR(IF(Y$4=\"\",0,IF($E7=\"kWh\",VLOOKUP(Y$4,'4. Billing Determinants'!$B$19:$Z$41,11,0)/'4. Billing Determinants'!$L$41*$D7,IF($E7=\"kW\",VLOOKUP(Y$4,'4. Billing Determinants'!$B$19:$Z$41,12,0)/'4. Billing Determinants'!$M$41*$D7,))),0)","v":0}]
[null,"RSVA - Retail Transmission Network Charge",1584,{"$f":"'2. 2015 Continuity Schedule'!BS27","v":3554693.0588490074},"kWh",{"$f":"IFERROR(IF(F$4=\"\",0,IF($E8=\"kWh\",VLOOKUP(F$4,'4. Billing Determinants'!$B$19:$Z$41,4,0)/'4. Billing Determinants'!$E$41*$D8,IF($E8=\"kW\",VLOOKUP(F$4,'4. Billing Determinants'!$B$19:$Z$41,5,0)/'4. Billing Determinants'!$F$41*$D8,IF($E8=\"Non-RPP kWh\",VLOOKUP(F$4,'4. Billing Determinants'!$B$19:$Z$41,6,0)/'4. Billing Determinants'!$G$41*$D8,IF($E8=\"Distribution Rev.\",VLOOKUP(F$4,'4. Billing Determinants'!$B$19:$Z$41,8,0)/'4. Billing Determinants'!$I$41*$D8, VLOOKUP(F$4,'4. Billing Determinants'!$B$19:$Z$41,3,0)/'4. Billing Determinants'!$D$41*$D8))))),0)","v":1051430.9135744511},{"$f":"IFERROR(IF(G$4=\"\",0,IF($E8=\"kWh\",VLOOKUP(G$4,'4. Billing Determinants'!$B$19:$Z$41,4,0)/'4. Billing Determinants'!$E$41*$D8,IF($E8=\"kW\",VLOOKUP(G$4,'4. Billing Determinants'!$B$19:$Z$41,5,0)/'4. Billing Determinants'!$F$41*$D8,IF($E8=\"Non-RPP kWh\",VLOOKUP(G$4,'4. Billing Determinants'!$B$19:$Z$41,6,0)/'4. Billing Determinants'!$G$41*$D8,IF($E8=\"Distribution Rev.\",VLOOKUP(G$4,'4. Billing Determinants'!$B$19:$Z$41,8,0)/'4. Billing Determinants'!$I$41*$D8, VLOOKUP(G$4,'4. Billing Determinants'!$B$19:$Z$41,3,0)/'4. Billing Determinants'!$D$41*$D8))))),0)","v":380007.68436718627},{"$f":"IFERROR(IF(H$4=\"\",0,IF($E8=\"kWh\",VLOOKUP(H$4,'4. Billing Determinants'!$B$19:$Z$41,4,0)/'4. Billing Determinants'!$E$41*$D8,IF($E8=\"kW\",VLOOKUP(H$4,'4. Billing Determinants'!$B$19:$Z$41,5,0)/'4. Billing Determinants'!$F$41*$D8,IF($E8=\"Non-RPP kWh\",VLOOKUP(H$4,'4. Billing Determinants'!$B$19:$Z$41,6,0)/'4. Billing Determinants'!$G$41*$D8,IF($E8=\"Distribution Rev.\",VLOOKUP(H$4,'4. Billing Determinants'!$B$19:$Z$41,8,0)/'4. Billing Determinants'!$I$41*$D8, VLOOKUP(H$4,'4. Billing Determinants'!$B$19:$Z$41,3,0)/'4. Billing Determinants'!$D$41*$D8))))),0)","v":1192833.3987885846},{"$f":"IFERROR(IF(I$4=\"\",0,IF($E8=\"kWh\",VLOOKUP(I$4,'4. Billing Determinants'!$B$19:$Z$41,4,0)/'4. Billing Determinants'!$E$41*$D8,IF($E8=\"kW\",VLOOKUP(I$4,'4. Billing Determinants'!$B$19:$Z$41,5,0)/'4. Billing Determinants'!$F$41*$D8,IF($E8=\"Non-RPP kWh\",VLOOKUP(I$4,'4. Billing Determinants'!$B$19:$Z$41,6,0)/'4. Billing Determinants'!$G$41*$D8,IF($E8=\"Distribution Rev.\",VLOOKUP(I$4,'4. Billing Determinants'!$B$19:$Z$41,8,0)/'4. Billing Determinants'!$I$41*$D8, VLOOKUP(I$4,'4. Billing Determinants'!$B$19:$Z$41,3,0)/'4. Billing Determinants'!$D$41*$D8))))),0)","v":172154.40982100621},{"$f":"IFERROR(IF(J$4=\"\",0,IF($E8=\"kWh\",VLOOKUP(J$4,'4. Billing Determinants'!$B$19:$Z$41,4,0)/'4. Billing Determinants'!$E$41*$D8,IF($E8=\"kW\",VLOOKUP(J$4,'4. Billing Determinants'!$B$19:$Z$41,5,0)/'4. Billing Determinants'!$F$41*$D8,IF($E8=\"Non-RPP kWh\",VLOOKUP(J$4,'4. Billing Determinants'!$B$19:$Z$41,6,0)/'4. Billing Determinants'!$G$41*$D8,IF($E8=\"Distribution Rev.\",VLOOKUP(J$4,'4. Billing Determinants'!$B$19:$Z$41,8,0)/'4. Billing Determinants'!$I$41*$D8, VLOOKUP(J$4,'4. Billing Determinants'!$B$19:$Z$41,3,0)/'4. Billing Determinants'!$D$41*$D8))))),0)","v":725394.1345463685},{"$f":"IFERROR(IF(K$4=\"\",0,IF($E8=\"kWh\",VLOOKUP(K$4,'4. Billing Determinants'!$B$19:$Z$41,4,0)/'4. Billing Determinants'!$E$41*$D8,IF($E8=\"kW\",VLOOKUP(K$4,'4. Billing Determinants'!$B$19:$Z$41,5,0)/'4. Billing Determinants'!$F$41*$D8,IF($E8=\"Non-RPP kWh\",VLOOKUP(K$4,'4. Billing Determinants'!$B$19:$Z$41,6,0)/'4. Billing Determinants'!$G$41*$D8,IF($E8=\"Distribution Rev.\",VLOOKUP(K$4,'4. Billing Determinants'!$B$19:$Z$41,8,0)/'4. Billing Determinants'!$I$41*$D8, VLOOKUP(K$4,'4. Billing Determinants'!$B$19:$Z$41,3,0)/'4. Billing Determinants'!$D$41*$D8))))),0)","v":7174.9641434251425},{"$f":"IFERROR(IF(L$4=\"\",0,IF($E8=\"kWh\",VLOOKUP(L$4,'4. Billing Determinants'!$B$19:$Z$41,4,0)/'4. Billing Determinants'!$E$41*$D8,IF($E8=\"kW\",VLOOKUP(L$4,'4. Billing Determinants'!$B$19:$Z$41,5,0)/'4. Billing Determinants'!$F$41*$D8,IF($E8=\"Non-RPP kWh\",VLOOKUP(L$4,'4. Billing Determinants'!$B$19:$Z$41,6,0)/'4. Billing Determinants'!$G$41*$D8,IF($E8=\"Distribution Rev.\",VLOOKUP(L$4,'4. Billing Determinants'!$B$19:$Z$41,8,0)/'4. Billing Determinants'!$I$41*$D8, VLOOKUP(L$4,'4. Billing Determinants'!$B$19:$Z$41,3,0)/'4. Billing Determinants'!$D$41*$D8))))),0)","v":269.02454610688977},{"$f":"IFERROR(IF(M$4=\"\",0,IF($E8=\"kWh\",VLOOKUP(M$4,'4. Billing Determinants'!$B$19:$Z$41,4,0)/'4. Billing Determinants'!$E$41*$D8,IF($E8=\"kW\",VLOOKUP(M$4,'4. Billing Determinants'!$B$19:$Z$41,5,0)/'4. Billing Determinants'!$F$41*$D8,IF($E8=\"Non-RPP kWh\",VLOOKUP(M$4,'4. Billing Determinants'!$B$19:$Z$41,6,0)/'4. Billing Determinants'!$G$41*$D8,IF($E8=\"Distribution Rev.\",VLOOKUP(M$4,'4. Billing Determinants'!$B$19:$Z$41,8,0)/'4. Billing Determinants'!$I$41*$D8, VLOOKUP(M$4,'4. Billing Determinants'!$B$19:$Z$41,3,0)/'4. Billing Determinants'!$D$41*$D8))))),0)","v":25428.529061879352},{"$f":"IFERROR(IF(N$4=\"\",0,IF($E8=\"kWh\",VLOOKUP(N$4,'4. Billing Determinants'!$B$19:$Z$41,4,0)/'4. Billing Determinants'!$E$41*$D8,IF($E8=\"kW\",VLOOKUP(N$4,'4. Billing Determinants'!$B$19:$Z$41,5,0)/'4. Billing Determinants'!$F$41*$D8,IF($E8=\"Non-RPP kWh\",VLOOKUP(N$4,'4. Billing Determinants'!$B$19:$Z$41,6,0)/'4. Billing Determinants'!$G$41*$D8,IF($E8=\"Distribution Rev.\",VLOOKUP(N$4,'4. Billing Determinants'!$B$19:$Z$41,8,0)/'4. Billing Determinants'!$I$41*$D8, VLOOKUP(N$4,'4. Billing Determinants'!$B$19:$Z$41,3,0)/'4. Billing Determinants'!$D$41*$D8))))),0)","v":0},{"$f":"IFERROR(IF(O$4=\"\",0,IF($E8=\"kWh\",VLOOKUP(O$4,'4. Billing Determinants'!$B$19:$Z$41,4,0)/'4. Billing Determinants'!$E$41*$D8,IF($E8=\"kW\",VLOOKUP(O$4,'4. Billing Determinants'!$B$19:$Z$41,5,0)/'4. Billing Determinants'!$F$41*$D8,IF($E8=\"Non-RPP kWh\",VLOOKUP(O$4,'4. Billing Determinants'!$B$19:$Z$41,6,0)/'4. Billing Determinants'!$G$41*$D8,IF($E8=\"Distribution Rev.\",VLOOKUP(O$4,'4. Billing Determinants'!$B$19:$Z$41,8,0)/'4. Billing Determinants'!$I$41*$D8, VLOOKUP(O$4,'4. Billing Determinants'!$B$19:$Z$41,3,0)/'4. Billing Determinants'!$D$41*$D8))))),0)","v":0},{"$f":"IFERROR(IF(P$4=\"\",0,IF($E8=\"kWh\",VLOOKUP(P$4,'4. Billing Determinants'!$B$19:$Z$41,4,0)/'4. Billing Determinants'!$E$41*$D8,IF($E8=\"kW\",VLOOKUP(P$4,'4. Billing Determinants'!$B$19:$Z$41,5,0)/'4. Billing Determinants'!$F$41*$D8,IF($E8=\"Non-RPP kWh\",VLOOKUP(P$4,'4. Billing Determinants'!$B$19:$Z$41,6,0)/'4. Billing Determinants'!$G$41*$D8,IF($E8=\"Distribution Rev.\",VLOOKUP(P$4,'4. Billing Determinants'!$B$19:$Z$41,8,0)/'4. Billing Determinants'!$I$41*$D8, VLOOKUP(P$4,'4. Billing Determinants'!$B$19:$Z$41,3,0)/'4. Billing Determinants'!$D$41*$D8))))),0)","v":0},{"$f":"IFERROR(IF(Q$4=\"\",0,IF($E8=\"kWh\",VLOOKUP(Q$4,'4. Billing Determinants'!$B$19:$Z$41,4,0)/'4. Billing Determinants'!$E$41*$D8,IF($E8=\"kW\",VLOOKUP(Q$4,'4. Billing Determinants'!$B$19:$Z$41,5,0)/'4. Billing Determinants'!$F$41*$D8,IF($E8=\"Non-RPP kWh\",VLOOKUP(Q$4,'4. Billing Determinants'!$B$19:$Z$41,6,0)/'4. Billing Determinants'!$G$41*$D8,IF($E8=\"Distribution Rev.\",VLOOKUP(Q$4,'4. Billing Determinants'!$B$19:$Z$41,8,0)/'4. Billing Determinants'!$I$41*$D8, VLOOKUP(Q$4,'4. Billing Determinants'!$B$19:$Z$41,3,0)/'4. Billing Determinants'!$D$41*$D8))))),0)","v":0},{"$f":"IFERROR(IF(R$4=\"\",0,IF($E8=\"kWh\",VLOOKUP(R$4,'4. Billing Determinants'!$B$19:$Z$41,4,0)/'4. Billing Determinants'!$E$41*$D8,IF($E8=\"kW\",VLOOKUP(R$4,'4. Billing Determinants'!$B$19:$Z$41,5,0)/'4. Billing Determinants'!$F$41*$D8,IF($E8=\"Non-RPP kWh\",VLOOKUP(R$4,'4. Billing Determinants'!$B$19:$Z$41,6,0)/'4. Billing Determinants'!$G$41*$D8,IF($E8=\"Distribution Rev.\",VLOOKUP(R$4,'4. Billing Determinants'!$B$19:$Z$41,8,0)/'4. Billing Determinants'!$I$41*$D8, VLOOKUP(R$4,'4. Billing Determinants'!$B$19:$Z$41,3,0)/'4. Billing Determinants'!$D$41*$D8))))),0)","v":0},{"$f":"IFERROR(IF(S$4=\"\",0,IF($E8=\"kWh\",VLOOKUP(S$4,'4. Billing Determinants'!$B$19:$Z$41,4,0)/'4. Billing Determinants'!$E$41*$D8,IF($E8=\"kW\",VLOOKUP(S$4,'4. Billing Determinants'!$B$19:$Z$41,5,0)/'4. Billing Determinants'!$F$41*$D8,IF($E8=\"Non-RPP kWh\",VLOOKUP(S$4,'4. Billing Determinants'!$B$19:$Z$41,6,0)/'4. Billing Determinants'!$G$41*$D8,IF($E8=\"Distribution Rev.\",VLOOKUP(S$4,'4. Billing Determinants'!$B$19:$Z$41,8,0)/'4. Billing Determinants'!$I$41*$D8, VLOOKUP(S$4,'4. Billing Determinants'!$B$19:$Z$41,3,0)/'4. Billing Determinants'!$D$41*$D8))))),0)","v":0},{"$f":"IFERROR(IF(T$4=\"\",0,IF($E8=\"kWh\",VLOOKUP(T$4,'4. Billing Determinants'!$B$19:$Z$41,4,0)/'4. Billing Determinants'!$E$41*$D8,IF($E8=\"kW\",VLOOKUP(T$4,'4. Billing Determinants'!$B$19:$Z$41,5,0)/'4. Billing Determinants'!$F$41*$D8,IF($E8=\"Non-RPP kWh\",VLOOKUP(T$4,'4. Billing Determinants'!$B$19:$Z$41,6,0)/'4. Billing Determinants'!$G$41*$D8,IF($E8=\"Distribution Rev.\",VLOOKUP(T$4,'4. Billing Determinants'!$B$19:$Z$41,8,0)/'4. Billing Determinants'!$I$41*$D8, VLOOKUP(T$4,'4. Billing Determinants'!$B$19:$Z$41,3,0)/'4. Billing Determinants'!$D$41*$D8))))),0)","v":0},{"$f":"IFERROR(IF(U$4=\"\",0,IF($E8=\"kWh\",VLOOKUP(U$4,'4. Billing Determinants'!$B$19:$Z$41,4,0)/'4. Billing Determinants'!$E$41*$D8,IF($E8=\"kW\",VLOOKUP(U$4,'4. Billing Determinants'!$B$19:$Z$41,5,0)/'4. Billing Determinants'!$F$41*$D8,IF($E8=\"Non-RPP kWh\",VLOOKUP(U$4,'4. Billing Determinants'!$B$19:$Z$41,6,0)/'4. Billing Determinants'!$G$41*$D8,IF($E8=\"Distribution Rev.\",VLOOKUP(U$4,'4. Billing Determinants'!$B$19:$Z$41,8,0)/'4. Billing Determinants'!$I$41*$D8, VLOOKUP(U$4,'4. Billing Determinants'!$B$19:$Z$41,3,0)/'4. Billing Determinants'!$D$41*$D8))))),0)","v":0},{"$f":"IFERROR(IF(V$4=\"\",0,IF($E8=\"kWh\",VLOOKUP(V$4,'4. Billing Determinants'!$B$19:$Z$41,4,0)/'4. Billing Determinants'!$E$41*$D8,IF($E8=\"kW\",VLOOKUP(V$4,'4. Billing Determinants'!$B$19:$Z$41,5,0)/'4. Billing Determinants'!$F$41*$D8,IF($E8=\"Non-RPP kWh\",VLOOKUP(V$4,'4. Billing Determinants'!$B$19:$Z$41,6,0)/'4. Billing Determinants'!$G$41*$D8,IF($E8=\"Distribution Rev.\",VLOOKUP(V$4,'4. Billing Determinants'!$B$19:$Z$41,8,0)/'4. Billing Determinants'!$I$41*$D8, VLOOKUP(V$4,'4. Billing Determinants'!$B$19:$Z$41,3,0)/'4. Billing Determinants'!$D$41*$D8))))),0)","v":0},{"$f":"IFERROR(IF(W$4=\"\",0,IF($E8=\"kWh\",VLOOKUP(W$4,'4. Billing Determinants'!$B$19:$Z$41,4,0)/'4. Billing Determinants'!$E$41*$D8,IF($E8=\"kW\",VLOOKUP(W$4,'4. Billing Determinants'!$B$19:$Z$41,5,0)/'4. Billing Determinants'!$F$41*$D8,IF($E8=\"Non-RPP kWh\",VLOOKUP(W$4,'4. Billing Determinants'!$B$19:$Z$41,6,0)/'4. Billing Determinants'!$G$41*$D8,IF($E8=\"Distribution Rev.\",VLOOKUP(W$4,'4. Billing Determinants'!$B$19:$Z$41,8,0)/'4. Billing Determinants'!$I$41*$D8, VLOOKUP(W$4,'4. Billing Determinants'!$B$19:$Z$41,3,0)/'4. Billing Determinants'!$D$41*$D8))))),0)","v":0},{"$f":"IFERROR(IF(X$4=\"\",0,IF($E8=\"kWh\",VLOOKUP(X$4,'4. Billing Determinants'!$B$19:$Z$41,4,0)/'4. Billing Determinants'!$E$41*$D8,IF($E8=\"kW\",VLOOKUP(X$4,'4. Billing Determinants'!$B$19:$Z$41,5,0)/'4. Billing Determinants'!$F$41*$D8,IF($E8=\"Non-RPP kWh\",VLOOKUP(X$4,'4. Billing Determinants'!$B$19:$Z$41,6,0)/'4. Billing Determinants'!$G$41*$D8,IF($E8=\"Distribution Rev.\",VLOOKUP(X$4,'4. Billing Determinants'!$B$19:$Z$41,8,0)/'4. Billing Determinants'!$I$41*$D8, VLOOKUP(X$4,'4. Billing Determinants'!$B$19:$Z$41,3,0)/'4. Billing Determinants'!$D$41*$D8))))),0)","v":0},{"$f":"IFERROR(IF(Y$4=\"\",0,IF($E8=\"kWh\",VLOOKUP(Y$4,'4. Billing Determinants'!$B$19:$Z$41,4,0)/'4. Billing Determinants'!$E$41*$D8,IF($E8=\"kW\",VLOOKUP(Y$4,'4. Billing Determinants'!$B$19:$Z$41,5,0)/'4. Billing Determinants'!$F$41*$D8,IF($E8=\"Non-RPP kWh\",VLOOKUP(Y$4,'4. Billing Determinants'!$B$19:$Z$41,6,0)/'4. Billing Determinants'!$G$41*$D8,IF($E8=\"Distribution Rev.\",VLOOKUP(Y$4,'4. Billing Determinants'!$B$19:$Z$41,8,0)/'4. Billing Determinants'!$I$41*$D8, VLOOKUP(Y$4,'4. Billing Determinants'!$B$19:$Z$41,3,0)/'4. Billing Determinants'!$D$41*$D8))))),0)","v":0}]
[null,"RSVA - Retail Transmission Connection Charge",1586,{"$f":"'2. 2015 Continuity Schedule'!BS28","v":2650205.4623286701},"kWh",{"$f":"IFERROR(IF(F$4=\"\",0,IF($E9=\"kWh\",VLOOKUP(F$4,'4. Billing Determinants'!$B$19:$Z$41,4,0)/'4. Billing Determinants'!$E$41*$D9,IF($E9=\"kW\",VLOOKUP(F$4,'4. Billing Determinants'!$B$19:$Z$41,5,0)/'4. Billing Determinants'!$F$41*$D9,IF($E9=\"Non-RPP kWh\",VLOOKUP(F$4,'4. Billing Determinants'!$B$19:$Z$41,6,0)/'4. Billing Determinants'!$G$41*$D9,IF($E9=\"Distribution Rev.\",VLOOKUP(F$4,'4. Billing Determinants'!$B$19:$Z$41,8,0)/'4. Billing Determinants'!$I$41*$D9, VLOOKUP(F$4,'4. Billing Determinants'!$B$19:$Z$41,3,0)/'4. Billing Determinants'!$D$41*$D9))))),0)","v":783895.51623298018},{"$f":"IFERROR(IF(G$4=\"\",0,IF($E9=\"kWh\",VLOOKUP(G$4,'4. Billing Determinants'!$B$19:$Z$41,4,0)/'4. Billing Determinants'!$E$41*$D9,IF($E9=\"kW\",VLOOKUP(G$4,'4. Billing Determinants'!$B$19:$Z$41,5,0)/'4. Billing Determinants'!$F$41*$D9,IF($E9=\"Non-RPP kWh\",VLOOKUP(G$4,'4. Billing Determinants'!$B$19:$Z$41,6,0)/'4. Billing Determinants'!$G$41*$D9,IF($E9=\"Distribution Rev.\",VLOOKUP(G$4,'4. Billing Determinants'!$B$19:$Z$41,8,0)/'4. Billing Determinants'!$I$41*$D9, VLOOKUP(G$4,'4. Billing Determinants'!$B$19:$Z$41,3,0)/'4. Billing Determinants'!$D$41*$D9))))),0)","v":283315.1622837669},{"$f":"IFERROR(IF(H$4=\"\",0,IF($E9=\"kWh\",VLOOKUP(H$4,'4. Billing Determinants'!$B$19:$Z$41,4,0)/'4. Billing Determinants'!$E$41*$D9,IF($E9=\"kW\",VLOOKUP(H$4,'4. Billing Determinants'!$B$19:$Z$41,5,0)/'4. Billing Determinants'!$F$41*$D9,IF($E9=\"Non-RPP kWh\",VLOOKUP(H$4,'4. Billing Determinants'!$B$19:$Z$41,6,0)/'4. Billing Determinants'!$G$41*$D9,IF($E9=\"Distribution Rev.\",VLOOKUP(H$4,'4. Billing Determinants'!$B$19:$Z$41,8,0)/'4. Billing Determinants'!$I$41*$D9, VLOOKUP(H$4,'4. Billing Determinants'!$B$19:$Z$41,3,0)/'4. Billing Determinants'!$D$41*$D9))))),0)","v":889318.30028136913},{"$f":"IFERROR(IF(I$4=\"\",0,IF($E9=\"kWh\",VLOOKUP(I$4,'4. Billing Determinants'!$B$19:$Z$41,4,0)/'4. Billing Determinants'!$E$41*$D9,IF($E9=\"kW\",VLOOKUP(I$4,'4. Billing Determinants'!$B$19:$Z$41,5,0)/'4. Billing Determinants'!$F$41*$D9,IF($E9=\"Non-RPP kWh\",VLOOKUP(I$4,'4. Billing Determinants'!$B$19:$Z$41,6,0)/'4. Billing Determinants'!$G$41*$D9,IF($E9=\"Distribution Rev.\",VLOOKUP(I$4,'4. Billing Determinants'!$B$19:$Z$41,8,0)/'4. Billing Determinants'!$I$41*$D9, VLOOKUP(I$4,'4. Billing Determinants'!$B$19:$Z$41,3,0)/'4. Billing Determinants'!$D$41*$D9))))),0)","v":128349.91649583633},{"$f":"IFERROR(IF(J$4=\"\",0,IF($E9=\"kWh\",VLOOKUP(J$4,'4. Billing Determinants'!$B$19:$Z$41,4,0)/'4. Billing Determinants'!$E$41*$D9,IF($E9=\"kW\",VLOOKUP(J$4,'4. Billing Determinants'!$B$19:$Z$41,5,0)/'4. Billing Determinants'!$F$41*$D9,IF($E9=\"Non-RPP kWh\",VLOOKUP(J$4,'4. Billing Determinants'!$B$19:$Z$41,6,0)/'4. Billing Determinants'!$G$41*$D9,IF($E9=\"Distribution Rev.\",VLOOKUP(J$4,'4. Billing Determinants'!$B$19:$Z$41,8,0)/'4. Billing Determinants'!$I$41*$D9, VLOOKUP(J$4,'4. Billing Determinants'!$B$19:$Z$41,3,0)/'4. Billing Determinants'!$D$41*$D9))))),0)","v":540818.42395091127},{"$f":"IFERROR(IF(K$4=\"\",0,IF($E9=\"kWh\",VLOOKUP(K$4,'4. Billing Determinants'!$B$19:$Z$41,4,0)/'4. Billing Determinants'!$E$41*$D9,IF($E9=\"kW\",VLOOKUP(K$4,'4. Billing Determinants'!$B$19:$Z$41,5,0)/'4. Billing Determinants'!$F$41*$D9,IF($E9=\"Non-RPP kWh\",VLOOKUP(K$4,'4. Billing Determinants'!$B$19:$Z$41,6,0)/'4. Billing Determinants'!$G$41*$D9,IF($E9=\"Distribution Rev.\",VLOOKUP(K$4,'4. Billing Determinants'!$B$19:$Z$41,8,0)/'4. Billing Determinants'!$I$41*$D9, VLOOKUP(K$4,'4. Billing Determinants'!$B$19:$Z$41,3,0)/'4. Billing Determinants'!$D$41*$D9))))),0)","v":5349.3026964962955},{"$f":"IFERROR(IF(L$4=\"\",0,IF($E9=\"kWh\",VLOOKUP(L$4,'4. Billing Determinants'!$B$19:$Z$41,4,0)/'4. Billing Determinants'!$E$41*$D9,IF($E9=\"kW\",VLOOKUP(L$4,'4. Billing Determinants'!$B$19:$Z$41,5,0)/'4. Billing Determinants'!$F$41*$D9,IF($E9=\"Non-RPP kWh\",VLOOKUP(L$4,'4. Billing Determinants'!$B$19:$Z$41,6,0)/'4. Billing Determinants'!$G$41*$D9,IF($E9=\"Distribution Rev.\",VLOOKUP(L$4,'4. Billing Determinants'!$B$19:$Z$41,8,0)/'4. Billing Determinants'!$I$41*$D9, VLOOKUP(L$4,'4. Billing Determinants'!$B$19:$Z$41,3,0)/'4. Billing Determinants'!$D$41*$D9))))),0)","v":200.5715570344706},{"$f":"IFERROR(IF(M$4=\"\",0,IF($E9=\"kWh\",VLOOKUP(M$4,'4. Billing Determinants'!$B$19:$Z$41,4,0)/'4. Billing Determinants'!$E$41*$D9,IF($E9=\"kW\",VLOOKUP(M$4,'4. Billing Determinants'!$B$19:$Z$41,5,0)/'4. Billing Determinants'!$F$41*$D9,IF($E9=\"Non-RPP kWh\",VLOOKUP(M$4,'4. Billing Determinants'!$B$19:$Z$41,6,0)/'4. Billing Determinants'!$G$41*$D9,IF($E9=\"Distribution Rev.\",VLOOKUP(M$4,'4. Billing Determinants'!$B$19:$Z$41,8,0)/'4. Billing Determinants'!$I$41*$D9, VLOOKUP(M$4,'4. Billing Determinants'!$B$19:$Z$41,3,0)/'4. Billing Determinants'!$D$41*$D9))))),0)","v":18958.268830276113},{"$f":"IFERROR(IF(N$4=\"\",0,IF($E9=\"kWh\",VLOOKUP(N$4,'4. Billing Determinants'!$B$19:$Z$41,4,0)/'4. Billing Determinants'!$E$41*$D9,IF($E9=\"kW\",VLOOKUP(N$4,'4. Billing Determinants'!$B$19:$Z$41,5,0)/'4. Billing Determinants'!$F$41*$D9,IF($E9=\"Non-RPP kWh\",VLOOKUP(N$4,'4. Billing Determinants'!$B$19:$Z$41,6,0)/'4. Billing Determinants'!$G$41*$D9,IF($E9=\"Distribution Rev.\",VLOOKUP(N$4,'4. Billing Determinants'!$B$19:$Z$41,8,0)/'4. Billing Determinants'!$I$41*$D9, VLOOKUP(N$4,'4. Billing Determinants'!$B$19:$Z$41,3,0)/'4. Billing Determinants'!$D$41*$D9))))),0)","v":0},{"$f":"IFERROR(IF(O$4=\"\",0,IF($E9=\"kWh\",VLOOKUP(O$4,'4. Billing Determinants'!$B$19:$Z$41,4,0)/'4. Billing Determinants'!$E$41*$D9,IF($E9=\"kW\",VLOOKUP(O$4,'4. Billing Determinants'!$B$19:$Z$41,5,0)/'4. Billing Determinants'!$F$41*$D9,IF($E9=\"Non-RPP kWh\",VLOOKUP(O$4,'4. Billing Determinants'!$B$19:$Z$41,6,0)/'4. Billing Determinants'!$G$41*$D9,IF($E9=\"Distribution Rev.\",VLOOKUP(O$4,'4. Billing Determinants'!$B$19:$Z$41,8,0)/'4. Billing Determinants'!$I$41*$D9, VLOOKUP(O$4,'4. Billing Determinants'!$B$19:$Z$41,3,0)/'4. Billing Determinants'!$D$41*$D9))))),0)","v":0},{"$f":"IFERROR(IF(P$4=\"\",0,IF($E9=\"kWh\",VLOOKUP(P$4,'4. Billing Determinants'!$B$19:$Z$41,4,0)/'4. Billing Determinants'!$E$41*$D9,IF($E9=\"kW\",VLOOKUP(P$4,'4. Billing Determinants'!$B$19:$Z$41,5,0)/'4. Billing Determinants'!$F$41*$D9,IF($E9=\"Non-RPP kWh\",VLOOKUP(P$4,'4. Billing Determinants'!$B$19:$Z$41,6,0)/'4. Billing Determinants'!$G$41*$D9,IF($E9=\"Distribution Rev.\",VLOOKUP(P$4,'4. Billing Determinants'!$B$19:$Z$41,8,0)/'4. Billing Determinants'!$I$41*$D9, VLOOKUP(P$4,'4. Billing Determinants'!$B$19:$Z$41,3,0)/'4. Billing Determinants'!$D$41*$D9))))),0)","v":0},{"$f":"IFERROR(IF(Q$4=\"\",0,IF($E9=\"kWh\",VLOOKUP(Q$4,'4. Billing Determinants'!$B$19:$Z$41,4,0)/'4. Billing Determinants'!$E$41*$D9,IF($E9=\"kW\",VLOOKUP(Q$4,'4. Billing Determinants'!$B$19:$Z$41,5,0)/'4. Billing Determinants'!$F$41*$D9,IF($E9=\"Non-RPP kWh\",VLOOKUP(Q$4,'4. Billing Determinants'!$B$19:$Z$41,6,0)/'4. Billing Determinants'!$G$41*$D9,IF($E9=\"Distribution Rev.\",VLOOKUP(Q$4,'4. Billing Determinants'!$B$19:$Z$41,8,0)/'4. Billing Determinants'!$I$41*$D9, VLOOKUP(Q$4,'4. Billing Determinants'!$B$19:$Z$41,3,0)/'4. Billing Determinants'!$D$41*$D9))))),0)","v":0},{"$f":"IFERROR(IF(R$4=\"\",0,IF($E9=\"kWh\",VLOOKUP(R$4,'4. Billing Determinants'!$B$19:$Z$41,4,0)/'4. Billing Determinants'!$E$41*$D9,IF($E9=\"kW\",VLOOKUP(R$4,'4. Billing Determinants'!$B$19:$Z$41,5,0)/'4. Billing Determinants'!$F$41*$D9,IF($E9=\"Non-RPP kWh\",VLOOKUP(R$4,'4. Billing Determinants'!$B$19:$Z$41,6,0)/'4. Billing Determinants'!$G$41*$D9,IF($E9=\"Distribution Rev.\",VLOOKUP(R$4,'4. Billing Determinants'!$B$19:$Z$41,8,0)/'4. Billing Determinants'!$I$41*$D9, VLOOKUP(R$4,'4. Billing Determinants'!$B$19:$Z$41,3,0)/'4. Billing Determinants'!$D$41*$D9))))),0)","v":0},{"$f":"IFERROR(IF(S$4=\"\",0,IF($E9=\"kWh\",VLOOKUP(S$4,'4. Billing Determinants'!$B$19:$Z$41,4,0)/'4. Billing Determinants'!$E$41*$D9,IF($E9=\"kW\",VLOOKUP(S$4,'4. Billing Determinants'!$B$19:$Z$41,5,0)/'4. Billing Determinants'!$F$41*$D9,IF($E9=\"Non-RPP kWh\",VLOOKUP(S$4,'4. Billing Determinants'!$B$19:$Z$41,6,0)/'4. Billing Determinants'!$G$41*$D9,IF($E9=\"Distribution Rev.\",VLOOKUP(S$4,'4. Billing Determinants'!$B$19:$Z$41,8,0)/'4. Billing Determinants'!$I$41*$D9, VLOOKUP(S$4,'4. Billing Determinants'!$B$19:$Z$41,3,0)/'4. Billing Determinants'!$D$41*$D9))))),0)","v":0},{"$f":"IFERROR(IF(T$4=\"\",0,IF($E9=\"kWh\",VLOOKUP(T$4,'4. Billing Determinants'!$B$19:$Z$41,4,0)/'4. Billing Determinants'!$E$41*$D9,IF($E9=\"kW\",VLOOKUP(T$4,'4. Billing Determinants'!$B$19:$Z$41,5,0)/'4. Billing Determinants'!$F$41*$D9,IF($E9=\"Non-RPP kWh\",VLOOKUP(T$4,'4. Billing Determinants'!$B$19:$Z$41,6,0)/'4. Billing Determinants'!$G$41*$D9,IF($E9=\"Distribution Rev.\",VLOOKUP(T$4,'4. Billing Determinants'!$B$19:$Z$41,8,0)/'4. Billing Determinants'!$I$41*$D9, VLOOKUP(T$4,'4. Billing Determinants'!$B$19:$Z$41,3,0)/'4. Billing Determinants'!$D$41*$D9))))),0)","v":0},{"$f":"IFERROR(IF(U$4=\"\",0,IF($E9=\"kWh\",VLOOKUP(U$4,'4. Billing Determinants'!$B$19:$Z$41,4,0)/'4. Billing Determinants'!$E$41*$D9,IF($E9=\"kW\",VLOOKUP(U$4,'4. Billing Determinants'!$B$19:$Z$41,5,0)/'4. Billing Determinants'!$F$41*$D9,IF($E9=\"Non-RPP kWh\",VLOOKUP(U$4,'4. Billing Determinants'!$B$19:$Z$41,6,0)/'4. Billing Determinants'!$G$41*$D9,IF($E9=\"Distribution Rev.\",VLOOKUP(U$4,'4. Billing Determinants'!$B$19:$Z$41,8,0)/'4. Billing Determinants'!$I$41*$D9, VLOOKUP(U$4,'4. Billing Determinants'!$B$19:$Z$41,3,0)/'4. Billing Determinants'!$D$41*$D9))))),0)","v":0},{"$f":"IFERROR(IF(V$4=\"\",0,IF($E9=\"kWh\",VLOOKUP(V$4,'4. Billing Determinants'!$B$19:$Z$41,4,0)/'4. Billing Determinants'!$E$41*$D9,IF($E9=\"kW\",VLOOKUP(V$4,'4. Billing Determinants'!$B$19:$Z$41,5,0)/'4. Billing Determinants'!$F$41*$D9,IF($E9=\"Non-RPP kWh\",VLOOKUP(V$4,'4. Billing Determinants'!$B$19:$Z$41,6,0)/'4. Billing Determinants'!$G$41*$D9,IF($E9=\"Distribution Rev.\",VLOOKUP(V$4,'4. Billing Determinants'!$B$19:$Z$41,8,0)/'4. Billing Determinants'!$I$41*$D9, VLOOKUP(V$4,'4. Billing Determinants'!$B$19:$Z$41,3,0)/'4. Billing Determinants'!$D$41*$D9))))),0)","v":0},{"$f":"IFERROR(IF(W$4=\"\",0,IF($E9=\"kWh\",VLOOKUP(W$4,'4. Billing Determinants'!$B$19:$Z$41,4,0)/'4. Billing Determinants'!$E$41*$D9,IF($E9=\"kW\",VLOOKUP(W$4,'4. Billing Determinants'!$B$19:$Z$41,5,0)/'4. Billing Determinants'!$F$41*$D9,IF($E9=\"Non-RPP kWh\",VLOOKUP(W$4,'4. Billing Determinants'!$B$19:$Z$41,6,0)/'4. Billing Determinants'!$G$41*$D9,IF($E9=\"Distribution Rev.\",VLOOKUP(W$4,'4. Billing Determinants'!$B$19:$Z$41,8,0)/'4. Billing Determinants'!$I$41*$D9, VLOOKUP(W$4,'4. Billing Determinants'!$B$19:$Z$41,3,0)/'4. Billing Determinants'!$D$41*$D9))))),0)","v":0},{"$f":"IFERROR(IF(X$4=\"\",0,IF($E9=\"kWh\",VLOOKUP(X$4,'4. Billing Determinants'!$B$19:$Z$41,4,0)/'4. Billing Determinants'!$E$41*$D9,IF($E9=\"kW\",VLOOKUP(X$4,'4. Billing Determinants'!$B$19:$Z$41,5,0)/'4. Billing Determinants'!$F$41*$D9,IF($E9=\"Non-RPP kWh\",VLOOKUP(X$4,'4. Billing Determinants'!$B$19:$Z$41,6,0)/'4. Billing Determinants'!$G$41*$D9,IF($E9=\"Distribution Rev.\",VLOOKUP(X$4,'4. Billing Determinants'!$B$19:$Z$41,8,0)/'4. Billing Determinants'!$I$41*$D9, VLOOKUP(X$4,'4. Billing Determinants'!$B$19:$Z$41,3,0)/'4. Billing Determinants'!$D$41*$D9))))),0)","v":0},{"$f":"IFERROR(IF(Y$4=\"\",0,IF($E9=\"kWh\",VLOOKUP(Y$4,'4. Billing Determinants'!$B$19:$Z$41,4,0)/'4. Billing Determinants'!$E$41*$D9,IF($E9=\"kW\",VLOOKUP(Y$4,'4. Billing Determinants'!$B$19:$Z$41,5,0)/'4. Billing Determinants'!$F$41*$D9,IF($E9=\"Non-RPP kWh\",VLOOKUP(Y$4,'4. Billing Determinants'!$B$19:$Z$41,6,0)/'4. Billing Determinants'!$G$41*$D9,IF($E9=\"Distribution Rev.\",VLOOKUP(Y$4,'4. Billing Determinants'!$B$19:$Z$41,8,0)/'4. Billing Determinants'!$I$41*$D9, VLOOKUP(Y$4,'4. Billing Determinants'!$B$19:$Z$41,3,0)/'4. Billing Determinants'!$D$41*$D9))))),0)","v":0}]
[null,"RSVA - Power (excluding Global Adjustment)",1588,{"$f":"'2. 2015 Continuity Schedule'!BS29","v":-2944775.0809453963},"kWh",{"$f":"IFERROR(IF(F$4=\"\",0,IF($E10=\"kWh\",VLOOKUP(F$4,'4. Billing Determinants'!$B$19:$Z$41,11,0)/'4. Billing Determinants'!$L$41*$D10,IF($E10=\"kW\",VLOOKUP(F$4,'4. Billing Determinants'!$B$19:$Z$41,12,0)/'4. Billing Determinants'!$M$41*$D10,))),0)","v":-1017014.8129507395},{"$f":"IFERROR(IF(G$4=\"\",0,IF($E10=\"kWh\",VLOOKUP(G$4,'4. Billing Determinants'!$B$19:$Z$41,11,0)/'4. Billing Determinants'!$L$41*$D10,IF($E10=\"kW\",VLOOKUP(G$4,'4. Billing Determinants'!$B$19:$Z$41,12,0)/'4. Billing Determinants'!$M$41*$D10,))),0)","v":-367569.03287414298},{"$f":"IFERROR(IF(H$4=\"\",0,IF($E10=\"kWh\",VLOOKUP(H$4,'4. Billing Determinants'!$B$19:$Z$41,11,0)/'4. Billing Determinants'!$L$41*$D10,IF($E10=\"kW\",VLOOKUP(H$4,'4. Billing Determinants'!$B$19:$Z$41,12,0)/'4. Billing Determinants'!$M$41*$D10,))),0)","v":-1149020.348891791},{"$f":"IFERROR(IF(I$4=\"\",0,IF($E10=\"kWh\",VLOOKUP(I$4,'4. Billing Determinants'!$B$19:$Z$41,11,0)/'4. Billing Determinants'!$L$41*$D10,IF($E10=\"kW\",VLOOKUP(I$4,'4. Billing Determinants'!$B$19:$Z$41,12,0)/'4. Billing Determinants'!$M$41*$D10,))),0)","v":-142186.90812455738},{"$f":"IFERROR(IF(J$4=\"\",0,IF($E10=\"kWh\",VLOOKUP(J$4,'4. Billing Determinants'!$B$19:$Z$41,11,0)/'4. Billing Determinants'!$L$41*$D10,IF($E10=\"kW\",VLOOKUP(J$4,'4. Billing Determinants'!$B$19:$Z$41,12,0)/'4. Billing Determinants'!$M$41*$D10,))),0)","v":-237187.46436222483},{"$f":"IFERROR(IF(K$4=\"\",0,IF($E10=\"kWh\",VLOOKUP(K$4,'4. Billing Determinants'!$B$19:$Z$41,11,0)/'4. Billing Determinants'!$L$41*$D10,IF($E10=\"kW\",VLOOKUP(K$4,'4. Billing Determinants'!$B$19:$Z$41,12,0)/'4. Billing Determinants'!$M$41*$D10,))),0)","v":-6940.1086862157272},{"$f":"IFERROR(IF(L$4=\"\",0,IF($E10=\"kWh\",VLOOKUP(L$4,'4. Billing Determinants'!$B$19:$Z$41,11,0)/'4. Billing Determinants'!$L$41*$D10,IF($E10=\"kW\",VLOOKUP(L$4,'4. Billing Determinants'!$B$19:$Z$41,12,0)/'4. Billing Determinants'!$M$41*$D10,))),0)","v":-260.21866477933128},{"$f":"IFERROR(IF(M$4=\"\",0,IF($E10=\"kWh\",VLOOKUP(M$4,'4. Billing Determinants'!$B$19:$Z$41,11,0)/'4. Billing Determinants'!$L$41*$D10,IF($E10=\"kW\",VLOOKUP(M$4,'4. Billing Determinants'!$B$19:$Z$41,12,0)/'4. Billing Determinants'!$M$41*$D10,))),0)","v":-24596.186390945848},{"$f":"IFERROR(IF(N$4=\"\",0,IF($E10=\"kWh\",VLOOKUP(N$4,'4. Billing Determinants'!$B$19:$Z$41,11,0)/'4. Billing Determinants'!$L$41*$D10,IF($E10=\"kW\",VLOOKUP(N$4,'4. Billing Determinants'!$B$19:$Z$41,12,0)/'4. Billing Determinants'!$M$41*$D10,))),0)","v":0},{"$f":"IFERROR(IF(O$4=\"\",0,IF($E10=\"kWh\",VLOOKUP(O$4,'4. Billing Determinants'!$B$19:$Z$41,11,0)/'4. Billing Determinants'!$L$41*$D10,IF($E10=\"kW\",VLOOKUP(O$4,'4. Billing Determinants'!$B$19:$Z$41,12,0)/'4. Billing Determinants'!$M$41*$D10,))),0)","v":0},{"$f":"IFERROR(IF(P$4=\"\",0,IF($E10=\"kWh\",VLOOKUP(P$4,'4. Billing Determinants'!$B$19:$Z$41,11,0)/'4. Billing Determinants'!$L$41*$D10,IF($E10=\"kW\",VLOOKUP(P$4,'4. Billing Determinants'!$B$19:$Z$41,12,0)/'4. Billing Determinants'!$M$41*$D10,))),0)","v":0},{"$f":"IFERROR(IF(Q$4=\"\",0,IF($E10=\"kWh\",VLOOKUP(Q$4,'4. Billing Determinants'!$B$19:$Z$41,11,0)/'4. Billing Determinants'!$L$41*$D10,IF($E10=\"kW\",VLOOKUP(Q$4,'4. Billing Determinants'!$B$19:$Z$41,12,0)/'4. Billing Determinants'!$M$41*$D10,))),0)","v":0},{"$f":"IFERROR(IF(R$4=\"\",0,IF($E10=\"kWh\",VLOOKUP(R$4,'4. Billing Determinants'!$B$19:$Z$41,11,0)/'4. Billing Determinants'!$L$41*$D10,IF($E10=\"kW\",VLOOKUP(R$4,'4. Billing Determinants'!$B$19:$Z$41,12,0)/'4. Billing Determinants'!$M$41*$D10,))),0)","v":0},{"$f":"IFERROR(IF(S$4=\"\",0,IF($E10=\"kWh\",VLOOKUP(S$4,'4. Billing Determinants'!$B$19:$Z$41,11,0)/'4. Billing Determinants'!$L$41*$D10,IF($E10=\"kW\",VLOOKUP(S$4,'4. Billing Determinants'!$B$19:$Z$41,12,0)/'4. Billing Determinants'!$M$41*$D10,))),0)","v":0},{"$f":"IFERROR(IF(T$4=\"\",0,IF($E10=\"kWh\",VLOOKUP(T$4,'4. Billing Determinants'!$B$19:$Z$41,11,0)/'4. Billing Determinants'!$L$41*$D10,IF($E10=\"kW\",VLOOKUP(T$4,'4. Billing Determinants'!$B$19:$Z$41,12,0)/'4. Billing Determinants'!$M$41*$D10,))),0)","v":0},{"$f":"IFERROR(IF(U$4=\"\",0,IF($E10=\"kWh\",VLOOKUP(U$4,'4. Billing Determinants'!$B$19:$Z$41,11,0)/'4. Billing Determinants'!$L$41*$D10,IF($E10=\"kW\",VLOOKUP(U$4,'4. Billing Determinants'!$B$19:$Z$41,12,0)/'4. Billing Determinants'!$M$41*$D10,))),0)","v":0},{"$f":"IFERROR(IF(V$4=\"\",0,IF($E10=\"kWh\",VLOOKUP(V$4,'4. Billing Determinants'!$B$19:$Z$41,11,0)/'4. Billing Determinants'!$L$41*$D10,IF($E10=\"kW\",VLOOKUP(V$4,'4. Billing Determinants'!$B$19:$Z$41,12,0)/'4. Billing Determinants'!$M$41*$D10,))),0)","v":0},{"$f":"IFERROR(IF(W$4=\"\",0,IF($E10=\"kWh\",VLOOKUP(W$4,'4. Billing Determinants'!$B$19:$Z$41,11,0)/'4. Billing Determinants'!$L$41*$D10,IF($E10=\"kW\",VLOOKUP(W$4,'4. Billing Determinants'!$B$19:$Z$41,12,0)/'4. Billing Determinants'!$M$41*$D10,))),0)","v":0},{"$f":"IFERROR(IF(X$4=\"\",0,IF($E10=\"kWh\",VLOOKUP(X$4,'4. Billing Determinants'!$B$19:$Z$41,11,0)/'4. Billing Determinants'!$L$41*$D10,IF($E10=\"kW\",VLOOKUP(X$4,'4. Billing Determinants'!$B$19:$Z$41,12,0)/'4. Billing Determinants'!$M$41*$D10,))),0)","v":0},{"$f":"IFERROR(IF(Y$4=\"\",0,IF($E10=\"kWh\",VLOOKUP(Y$4,'4. Billing Determinants'!$B$19:$Z$41,11,0)/'4. Billing Determinants'!$L$41*$D10,IF($E10=\"kW\",VLOOKUP(Y$4,'4. Billing Determinants'!$B$19:$Z$41,12,0)/'4. Billing Determinants'!$M$41*$D10,))),0)","v":0}]
[null,"RSVA - Global Adjustment",1589,{"$f":"IF('4. Billing Determinants'!N41>0, '2. 2015 Continuity Schedule'!BS30-('2. 2015 Continuity Schedule'!BS30*'4. Billing Determinants'!N41), '2. 2015 Continuity Schedule'!BS30)","v":6997091.608757142},"Non-RPP kWh",{"$f":"IFERROR(IF(F$4=\"\",0,IF($E11=\"kWh\",VLOOKUP(F$4,'4. Billing Determinants'!$B$19:$Z$41,4,0)/'4. Billing Determinants'!$E$41*$D11,IF($E11=\"kW\",VLOOKUP(F$4,'4. Billing Determinants'!$B$19:$Z$41,5,0)/'4. Billing Determinants'!$F$41*$D11,IF($E11=\"Non-RPP kWh\",VLOOKUP(F$4,'4. Billing Determinants'!$B$19:$Z$41,16,0)/'4. Billing Determinants'!$Q$41*$D11,IF($E11=\"Distribution Rev.\",VLOOKUP(F$4,'4. Billing Determinants'!$B$19:$Z$41,8,0)/'4. Billing Determinants'!$I$41*$D11, VLOOKUP(F$4,'4. Billing Determinants'!$B$19:$Z$41,3,0)/'4. Billing Determinants'!$D$41*$D11))))),0)","v":535220.4440206174},{"$f":"IFERROR(IF(G$4=\"\",0,IF($E11=\"kWh\",VLOOKUP(G$4,'4. Billing Determinants'!$B$19:$Z$41,4,0)/'4. Billing Determinants'!$E$41*$D11,IF($E11=\"kW\",VLOOKUP(G$4,'4. Billing Determinants'!$B$19:$Z$41,5,0)/'4. Billing Determinants'!$F$41*$D11,IF($E11=\"Non-RPP kWh\",VLOOKUP(G$4,'4. Billing Determinants'!$B$19:$Z$41,16,0)/'4. Billing Determinants'!$Q$41*$D11,IF($E11=\"Distribution Rev.\",VLOOKUP(G$4,'4. Billing Determinants'!$B$19:$Z$41,8,0)/'4. Billing Determinants'!$I$41*$D11, VLOOKUP(G$4,'4. Billing Determinants'!$B$19:$Z$41,3,0)/'4. Billing Determinants'!$D$41*$D11))))),0)","v":314970.78702757269},{"$f":"IFERROR(IF(H$4=\"\",0,IF($E11=\"kWh\",VLOOKUP(H$4,'4. Billing Determinants'!$B$19:$Z$41,4,0)/'4. Billing Determinants'!$E$41*$D11,IF($E11=\"kW\",VLOOKUP(H$4,'4. Billing Determinants'!$B$19:$Z$41,5,0)/'4. Billing Determinants'!$F$41*$D11,IF($E11=\"Non-RPP kWh\",VLOOKUP(H$4,'4. Billing Determinants'!$B$19:$Z$41,16,0)/'4. Billing Determinants'!$Q$41*$D11,IF($E11=\"Distribution Rev.\",VLOOKUP(H$4,'4. Billing Determinants'!$B$19:$Z$41,8,0)/'4. Billing Determinants'!$I$41*$D11, VLOOKUP(H$4,'4. Billing Determinants'!$B$19:$Z$41,3,0)/'4. Billing Determinants'!$D$41*$D11))))),0)","v":5894449.4034804786},{"$f":"IFERROR(IF(I$4=\"\",0,IF($E11=\"kWh\",VLOOKUP(I$4,'4. Billing Determinants'!$B$19:$Z$41,4,0)/'4. Billing Determinants'!$E$41*$D11,IF($E11=\"kW\",VLOOKUP(I$4,'4. Billing Determinants'!$B$19:$Z$41,5,0)/'4. Billing Determinants'!$F$41*$D11,IF($E11=\"Non-RPP kWh\",VLOOKUP(I$4,'4. Billing Determinants'!$B$19:$Z$41,16,0)/'4. Billing Determinants'!$Q$41*$D11,IF($E11=\"Distribution Rev.\",VLOOKUP(I$4,'4. Billing Determinants'!$B$19:$Z$41,8,0)/'4. Billing Determinants'!$I$41*$D11, VLOOKUP(I$4,'4. Billing Determinants'!$B$19:$Z$41,3,0)/'4. Billing Determinants'!$D$41*$D11))))),0)","v":99302.179672058657},{"$f":"IFERROR(IF(J$4=\"\",0,IF($E11=\"kWh\",VLOOKUP(J$4,'4. Billing Determinants'!$B$19:$Z$41,4,0)/'4. Billing Determinants'!$E$41*$D11,IF($E11=\"kW\",VLOOKUP(J$4,'4. Billing Determinants'!$B$19:$Z$41,5,0)/'4. Billing Determinants'!$F$41*$D11,IF($E11=\"Non-RPP kWh\",VLOOKUP(J$4,'4. Billing Determinants'!$B$19:$Z$41,16,0)/'4. Billing Determinants'!$Q$41*$D11,IF($E11=\"Distribution Rev.\",VLOOKUP(J$4,'4. Billing Determinants'!$B$19:$Z$41,8,0)/'4. Billing Determinants'!$I$41*$D11, VLOOKUP(J$4,'4. Billing Determinants'!$B$19:$Z$41,3,0)/'4. Billing Determinants'!$D$41*$D11))))),0)","v":4.3911242453842499E-10},{"$f":"IFERROR(IF(K$4=\"\",0,IF($E11=\"kWh\",VLOOKUP(K$4,'4. Billing Determinants'!$B$19:$Z$41,4,0)/'4. Billing Determinants'!$E$41*$D11,IF($E11=\"kW\",VLOOKUP(K$4,'4. Billing Determinants'!$B$19:$Z$41,5,0)/'4. Billing Determinants'!$F$41*$D11,IF($E11=\"Non-RPP kWh\",VLOOKUP(K$4,'4. Billing Determinants'!$B$19:$Z$41,16,0)/'4. Billing Determinants'!$Q$41*$D11,IF($E11=\"Distribution Rev.\",VLOOKUP(K$4,'4. Billing Determinants'!$B$19:$Z$41,8,0)/'4. Billing Determinants'!$I$41*$D11, VLOOKUP(K$4,'4. Billing Determinants'!$B$19:$Z$41,3,0)/'4. Billing Determinants'!$D$41*$D11))))),0)","v":8097.3914247384264},{"$f":"IFERROR(IF(L$4=\"\",0,IF($E11=\"kWh\",VLOOKUP(L$4,'4. Billing Determinants'!$B$19:$Z$41,4,0)/'4. Billing Determinants'!$E$41*$D11,IF($E11=\"kW\",VLOOKUP(L$4,'4. Billing Determinants'!$B$19:$Z$41,5,0)/'4. Billing Determinants'!$F$41*$D11,IF($E11=\"Non-RPP kWh\",VLOOKUP(L$4,'4. Billing Determinants'!$B$19:$Z$41,16,0)/'4. Billing Determinants'!$Q$41*$D11,IF($E11=\"Distribution Rev.\",VLOOKUP(L$4,'4. Billing Determinants'!$B$19:$Z$41,8,0)/'4. Billing Determinants'!$I$41*$D11, VLOOKUP(L$4,'4. Billing Determinants'!$B$19:$Z$41,3,0)/'4. Billing Determinants'!$D$41*$D11))))),0)","v":14.193589928052688},{"$f":"IFERROR(IF(M$4=\"\",0,IF($E11=\"kWh\",VLOOKUP(M$4,'4. Billing Determinants'!$B$19:$Z$41,4,0)/'4. Billing Determinants'!$E$41*$D11,IF($E11=\"kW\",VLOOKUP(M$4,'4. Billing Determinants'!$B$19:$Z$41,5,0)/'4. Billing Determinants'!$F$41*$D11,IF($E11=\"Non-RPP kWh\",VLOOKUP(M$4,'4. Billing Determinants'!$B$19:$Z$41,16,0)/'4. Billing Determinants'!$Q$41*$D11,IF($E11=\"Distribution Rev.\",VLOOKUP(M$4,'4. Billing Determinants'!$B$19:$Z$41,8,0)/'4. Billing Determinants'!$I$41*$D11, VLOOKUP(M$4,'4. Billing Determinants'!$B$19:$Z$41,3,0)/'4. Billing Determinants'!$D$41*$D11))))),0)","v":145037.20954174799},{"$f":"IFERROR(IF(N$4=\"\",0,IF($E11=\"kWh\",VLOOKUP(N$4,'4. Billing Determinants'!$B$19:$Z$41,4,0)/'4. Billing Determinants'!$E$41*$D11,IF($E11=\"kW\",VLOOKUP(N$4,'4. Billing Determinants'!$B$19:$Z$41,5,0)/'4. Billing Determinants'!$F$41*$D11,IF($E11=\"Non-RPP kWh\",VLOOKUP(N$4,'4. Billing Determinants'!$B$19:$Z$41,16,0)/'4. Billing Determinants'!$Q$41*$D11,IF($E11=\"Distribution Rev.\",VLOOKUP(N$4,'4. Billing Determinants'!$B$19:$Z$41,8,0)/'4. Billing Determinants'!$I$41*$D11, VLOOKUP(N$4,'4. Billing Determinants'!$B$19:$Z$41,3,0)/'4. Billing Determinants'!$D$41*$D11))))),0)","v":0},{"$f":"IFERROR(IF(O$4=\"\",0,IF($E11=\"kWh\",VLOOKUP(O$4,'4. Billing Determinants'!$B$19:$Z$41,4,0)/'4. Billing Determinants'!$E$41*$D11,IF($E11=\"kW\",VLOOKUP(O$4,'4. Billing Determinants'!$B$19:$Z$41,5,0)/'4. Billing Determinants'!$F$41*$D11,IF($E11=\"Non-RPP kWh\",VLOOKUP(O$4,'4. Billing Determinants'!$B$19:$Z$41,16,0)/'4. Billing Determinants'!$G$41*$D11,IF($E11=\"Distribution Rev.\",VLOOKUP(O$4,'4. Billing Determinants'!$B$19:$Z$41,8,0)/'4. Billing Determinants'!$I$41*$D11, VLOOKUP(O$4,'4. Billing Determinants'!$B$19:$Z$41,3,0)/'4. Billing Determinants'!$D$41*$D11))))),0)","v":0},{"$f":"IFERROR(IF(P$4=\"\",0,IF($E11=\"kWh\",VLOOKUP(P$4,'4. Billing Determinants'!$B$19:$Z$41,4,0)/'4. Billing Determinants'!$E$41*$D11,IF($E11=\"kW\",VLOOKUP(P$4,'4. Billing Determinants'!$B$19:$Z$41,5,0)/'4. Billing Determinants'!$F$41*$D11,IF($E11=\"Non-RPP kWh\",VLOOKUP(P$4,'4. Billing Determinants'!$B$19:$Z$41,16,0)/'4. Billing Determinants'!$G$41*$D11,IF($E11=\"Distribution Rev.\",VLOOKUP(P$4,'4. Billing Determinants'!$B$19:$Z$41,8,0)/'4. Billing Determinants'!$I$41*$D11, VLOOKUP(P$4,'4. Billing Determinants'!$B$19:$Z$41,3,0)/'4. Billing Determinants'!$D$41*$D11))))),0)","v":0},{"$f":"IFERROR(IF(Q$4=\"\",0,IF($E11=\"kWh\",VLOOKUP(Q$4,'4. Billing Determinants'!$B$19:$Z$41,4,0)/'4. Billing Determinants'!$E$41*$D11,IF($E11=\"kW\",VLOOKUP(Q$4,'4. Billing Determinants'!$B$19:$Z$41,5,0)/'4. Billing Determinants'!$F$41*$D11,IF($E11=\"Non-RPP kWh\",VLOOKUP(Q$4,'4. Billing Determinants'!$B$19:$Z$41,16,0)/'4. Billing Determinants'!$G$41*$D11,IF($E11=\"Distribution Rev.\",VLOOKUP(Q$4,'4. Billing Determinants'!$B$19:$Z$41,8,0)/'4. Billing Determinants'!$I$41*$D11, VLOOKUP(Q$4,'4. Billing Determinants'!$B$19:$Z$41,3,0)/'4. Billing Determinants'!$D$41*$D11))))),0)","v":0},{"$f":"IFERROR(IF(R$4=\"\",0,IF($E11=\"kWh\",VLOOKUP(R$4,'4. Billing Determinants'!$B$19:$Z$41,4,0)/'4. Billing Determinants'!$E$41*$D11,IF($E11=\"kW\",VLOOKUP(R$4,'4. Billing Determinants'!$B$19:$Z$41,5,0)/'4. Billing Determinants'!$F$41*$D11,IF($E11=\"Non-RPP kWh\",VLOOKUP(R$4,'4. Billing Determinants'!$B$19:$Z$41,16,0)/'4. Billing Determinants'!$G$41*$D11,IF($E11=\"Distribution Rev.\",VLOOKUP(R$4,'4. Billing Determinants'!$B$19:$Z$41,8,0)/'4. Billing Determinants'!$I$41*$D11, VLOOKUP(R$4,'4. Billing Determinants'!$B$19:$Z$41,3,0)/'4. Billing Determinants'!$D$41*$D11))))),0)","v":0},{"$f":"IFERROR(IF(S$4=\"\",0,IF($E11=\"kWh\",VLOOKUP(S$4,'4. Billing Determinants'!$B$19:$Z$41,4,0)/'4. Billing Determinants'!$E$41*$D11,IF($E11=\"kW\",VLOOKUP(S$4,'4. Billing Determinants'!$B$19:$Z$41,5,0)/'4. Billing Determinants'!$F$41*$D11,IF($E11=\"Non-RPP kWh\",VLOOKUP(S$4,'4. Billing Determinants'!$B$19:$Z$41,16,0)/'4. Billing Determinants'!$G$41*$D11,IF($E11=\"Distribution Rev.\",VLOOKUP(S$4,'4. Billing Determinants'!$B$19:$Z$41,8,0)/'4. Billing Determinants'!$I$41*$D11, VLOOKUP(S$4,'4. Billing Determinants'!$B$19:$Z$41,3,0)/'4. Billing Determinants'!$D$41*$D11))))),0)","v":0},{"$f":"IFERROR(IF(T$4=\"\",0,IF($E11=\"kWh\",VLOOKUP(T$4,'4. Billing Determinants'!$B$19:$Z$41,4,0)/'4. Billing Determinants'!$E$41*$D11,IF($E11=\"kW\",VLOOKUP(T$4,'4. Billing Determinants'!$B$19:$Z$41,5,0)/'4. Billing Determinants'!$F$41*$D11,IF($E11=\"Non-RPP kWh\",VLOOKUP(T$4,'4. Billing Determinants'!$B$19:$Z$41,16,0)/'4. Billing Determinants'!$G$41*$D11,IF($E11=\"Distribution Rev.\",VLOOKUP(T$4,'4. Billing Determinants'!$B$19:$Z$41,8,0)/'4. Billing Determinants'!$I$41*$D11, VLOOKUP(T$4,'4. Billing Determinants'!$B$19:$Z$41,3,0)/'4. Billing Determinants'!$D$41*$D11))))),0)","v":0},{"$f":"IFERROR(IF(U$4=\"\",0,IF($E11=\"kWh\",VLOOKUP(U$4,'4. Billing Determinants'!$B$19:$Z$41,4,0)/'4. Billing Determinants'!$E$41*$D11,IF($E11=\"kW\",VLOOKUP(U$4,'4. Billing Determinants'!$B$19:$Z$41,5,0)/'4. Billing Determinants'!$F$41*$D11,IF($E11=\"Non-RPP kWh\",VLOOKUP(U$4,'4. Billing Determinants'!$B$19:$Z$41,16,0)/'4. Billing Determinants'!$G$41*$D11,IF($E11=\"Distribution Rev.\",VLOOKUP(U$4,'4. Billing Determinants'!$B$19:$Z$41,8,0)/'4. Billing Determinants'!$I$41*$D11, VLOOKUP(U$4,'4. Billing Determinants'!$B$19:$Z$41,3,0)/'4. Billing Determinants'!$D$41*$D11))))),0)","v":0},{"$f":"IFERROR(IF(V$4=\"\",0,IF($E11=\"kWh\",VLOOKUP(V$4,'4. Billing Determinants'!$B$19:$Z$41,4,0)/'4. Billing Determinants'!$E$41*$D11,IF($E11=\"kW\",VLOOKUP(V$4,'4. Billing Determinants'!$B$19:$Z$41,5,0)/'4. Billing Determinants'!$F$41*$D11,IF($E11=\"Non-RPP kWh\",VLOOKUP(V$4,'4. Billing Determinants'!$B$19:$Z$41,16,0)/'4. Billing Determinants'!$G$41*$D11,IF($E11=\"Distribution Rev.\",VLOOKUP(V$4,'4. Billing Determinants'!$B$19:$Z$41,8,0)/'4. Billing Determinants'!$I$41*$D11, VLOOKUP(V$4,'4. Billing Determinants'!$B$19:$Z$41,3,0)/'4. Billing Determinants'!$D$41*$D11))))),0)","v":0},{"$f":"IFERROR(IF(W$4=\"\",0,IF($E11=\"kWh\",VLOOKUP(W$4,'4. Billing Determinants'!$B$19:$Z$41,4,0)/'4. Billing Determinants'!$E$41*$D11,IF($E11=\"kW\",VLOOKUP(W$4,'4. Billing Determinants'!$B$19:$Z$41,5,0)/'4. Billing Determinants'!$F$41*$D11,IF($E11=\"Non-RPP kWh\",VLOOKUP(W$4,'4. Billing Determinants'!$B$19:$Z$41,16,0)/'4. Billing Determinants'!$G$41*$D11,IF($E11=\"Distribution Rev.\",VLOOKUP(W$4,'4. Billing Determinants'!$B$19:$Z$41,8,0)/'4. Billing Determinants'!$I$41*$D11, VLOOKUP(W$4,'4. Billing Determinants'!$B$19:$Z$41,3,0)/'4. Billing Determinants'!$D$41*$D11))))),0)","v":0},{"$f":"IFERROR(IF(X$4=\"\",0,IF($E11=\"kWh\",VLOOKUP(X$4,'4. Billing Determinants'!$B$19:$Z$41,4,0)/'4. Billing Determinants'!$E$41*$D11,IF($E11=\"kW\",VLOOKUP(X$4,'4. Billing Determinants'!$B$19:$Z$41,5,0)/'4. Billing Determinants'!$F$41*$D11,IF($E11=\"Non-RPP kWh\",VLOOKUP(X$4,'4. Billing Determinants'!$B$19:$Z$41,16,0)/'4. Billing Determinants'!$G$41*$D11,IF($E11=\"Distribution Rev.\",VLOOKUP(X$4,'4. Billing Determinants'!$B$19:$Z$41,8,0)/'4. Billing Determinants'!$I$41*$D11, VLOOKUP(X$4,'4. Billing Determinants'!$B$19:$Z$41,3,0)/'4. Billing Determinants'!$D$41*$D11))))),0)","v":0},{"$f":"IFERROR(IF(Y$4=\"\",0,IF($E11=\"kWh\",VLOOKUP(Y$4,'4. Billing Determinants'!$B$19:$Z$41,4,0)/'4. Billing Determinants'!$E$41*$D11,IF($E11=\"kW\",VLOOKUP(Y$4,'4. Billing Determinants'!$B$19:$Z$41,5,0)/'4. Billing Determinants'!$F$41*$D11,IF($E11=\"Non-RPP kWh\",VLOOKUP(Y$4,'4. Billing Determinants'!$B$19:$Z$41,16,0)/'4. Billing Determinants'!$G$41*$D11,IF($E11=\"Distribution Rev.\",VLOOKUP(Y$4,'4. Billing Determinants'!$B$19:$Z$41,8,0)/'4. Billing Determinants'!$I$41*$D11, VLOOKUP(Y$4,'4. Billing Determinants'!$B$19:$Z$41,3,0)/'4. Billing Determinants'!$D$41*$D11))))),0)","v":0}]
[null,"Disposition and Recovery/Refund of Regulatory Balances (2008)",1595,{"$f":"'2. 2015 Continuity Schedule'!BS31","v":0},"%",{"$f":"IFERROR(IF(F$4=\"\",0,IF($E12=\"kWh\",VLOOKUP(F$4,'4. Billing Determinants'!$B$19:$Z$41,4,0)/'4. Billing Determinants'!$E$41*$D12,IF($E12=\"kW\",VLOOKUP(F$4,'4. Billing Determinants'!$B$19:$Z$41,5,0)/'4. Billing Determinants'!$F$41*$D12,IF($E12=\"Non-RPP kWh\",VLOOKUP(F$4,'4. Billing Determinants'!$B$19:$Z$41,6,0)/'4. Billing Determinants'!$G$41*$D12, VLOOKUP(F$4,'4. Billing Determinants'!$B$19:$Z$41,18,0)*$D12)))),0)","v":0},{"$f":"IFERROR(IF(G$4=\"\",0,IF($E12=\"kWh\",VLOOKUP(G$4,'4. Billing Determinants'!$B$19:$Z$41,4,0)/'4. Billing Determinants'!$E$41*$D12,IF($E12=\"kW\",VLOOKUP(G$4,'4. Billing Determinants'!$B$19:$Z$41,5,0)/'4. Billing Determinants'!$F$41*$D12,IF($E12=\"Non-RPP kWh\",VLOOKUP(G$4,'4. Billing Determinants'!$B$19:$Z$41,6,0)/'4. Billing Determinants'!$G$41*$D12, VLOOKUP(G$4,'4. Billing Determinants'!$B$19:$Z$41,18,0)*$D12)))),0)","v":0},{"$f":"IFERROR(IF(H$4=\"\",0,IF($E12=\"kWh\",VLOOKUP(H$4,'4. Billing Determinants'!$B$19:$Z$41,4,0)/'4. Billing Determinants'!$E$41*$D12,IF($E12=\"kW\",VLOOKUP(H$4,'4. Billing Determinants'!$B$19:$Z$41,5,0)/'4. Billing Determinants'!$F$41*$D12,IF($E12=\"Non-RPP kWh\",VLOOKUP(H$4,'4. Billing Determinants'!$B$19:$Z$41,6,0)/'4. Billing Determinants'!$G$41*$D12, VLOOKUP(H$4,'4. Billing Determinants'!$B$19:$Z$41,18,0)*$D12)))),0)","v":0},{"$f":"IFERROR(IF(I$4=\"\",0,IF($E12=\"kWh\",VLOOKUP(I$4,'4. Billing Determinants'!$B$19:$Z$41,4,0)/'4. Billing Determinants'!$E$41*$D12,IF($E12=\"kW\",VLOOKUP(I$4,'4. Billing Determinants'!$B$19:$Z$41,5,0)/'4. Billing Determinants'!$F$41*$D12,IF($E12=\"Non-RPP kWh\",VLOOKUP(I$4,'4. Billing Determinants'!$B$19:$Z$41,6,0)/'4. Billing Determinants'!$G$41*$D12, VLOOKUP(I$4,'4. Billing Determinants'!$B$19:$Z$41,18,0)*$D12)))),0)","v":0},{"$f":"IFERROR(IF(J$4=\"\",0,IF($E12=\"kWh\",VLOOKUP(J$4,'4. Billing Determinants'!$B$19:$Z$41,4,0)/'4. Billing Determinants'!$E$41*$D12,IF($E12=\"kW\",VLOOKUP(J$4,'4. Billing Determinants'!$B$19:$Z$41,5,0)/'4. Billing Determinants'!$F$41*$D12,IF($E12=\"Non-RPP kWh\",VLOOKUP(J$4,'4. Billing Determinants'!$B$19:$Z$41,6,0)/'4. Billing Determinants'!$G$41*$D12, VLOOKUP(J$4,'4. Billing Determinants'!$B$19:$Z$41,18,0)*$D12)))),0)","v":0},{"$f":"IFERROR(IF(K$4=\"\",0,IF($E12=\"kWh\",VLOOKUP(K$4,'4. Billing Determinants'!$B$19:$Z$41,4,0)/'4. Billing Determinants'!$E$41*$D12,IF($E12=\"kW\",VLOOKUP(K$4,'4. Billing Determinants'!$B$19:$Z$41,5,0)/'4. Billing Determinants'!$F$41*$D12,IF($E12=\"Non-RPP kWh\",VLOOKUP(K$4,'4. Billing Determinants'!$B$19:$Z$41,6,0)/'4. Billing Determinants'!$G$41*$D12, VLOOKUP(K$4,'4. Billing Determinants'!$B$19:$Z$41,18,0)*$D12)))),0)","v":0},{"$f":"IFERROR(IF(L$4=\"\",0,IF($E12=\"kWh\",VLOOKUP(L$4,'4. Billing Determinants'!$B$19:$Z$41,4,0)/'4. Billing Determinants'!$E$41*$D12,IF($E12=\"kW\",VLOOKUP(L$4,'4. Billing Determinants'!$B$19:$Z$41,5,0)/'4. Billing Determinants'!$F$41*$D12,IF($E12=\"Non-RPP kWh\",VLOOKUP(L$4,'4. Billing Determinants'!$B$19:$Z$41,6,0)/'4. Billing Determinants'!$G$41*$D12, VLOOKUP(L$4,'4. Billing Determinants'!$B$19:$Z$41,18,0)*$D12)))),0)","v":0},{"$f":"IFERROR(IF(M$4=\"\",0,IF($E12=\"kWh\",VLOOKUP(M$4,'4. Billing Determinants'!$B$19:$Z$41,4,0)/'4. Billing Determinants'!$E$41*$D12,IF($E12=\"kW\",VLOOKUP(M$4,'4. Billing Determinants'!$B$19:$Z$41,5,0)/'4. Billing Determinants'!$F$41*$D12,IF($E12=\"Non-RPP kWh\",VLOOKUP(M$4,'4. Billing Determinants'!$B$19:$Z$41,6,0)/'4. Billing Determinants'!$G$41*$D12, VLOOKUP(M$4,'4. Billing Determinants'!$B$19:$Z$41,18,0)*$D12)))),0)","v":0},{"$f":"IFERROR(IF(N$4=\"\",0,IF($E12=\"kWh\",VLOOKUP(N$4,'4. Billing Determinants'!$B$19:$Z$41,4,0)/'4. Billing Determinants'!$E$41*$D12,IF($E12=\"kW\",VLOOKUP(N$4,'4. Billing Determinants'!$B$19:$Z$41,5,0)/'4. Billing Determinants'!$F$41*$D12,IF($E12=\"Non-RPP kWh\",VLOOKUP(N$4,'4. Billing Determinants'!$B$19:$Z$41,6,0)/'4. Billing Determinants'!$G$41*$D12, VLOOKUP(N$4,'4. Billing Determinants'!$B$19:$Z$41,18,0)*$D12)))),0)","v":0},{"$f":"IFERROR(IF(O$4=\"\",0,IF($E12=\"kWh\",VLOOKUP(O$4,'4. Billing Determinants'!$B$19:$Z$41,4,0)/'4. Billing Determinants'!$E$41*$D12,IF($E12=\"kW\",VLOOKUP(O$4,'4. Billing Determinants'!$B$19:$Z$41,5,0)/'4. Billing Determinants'!$F$41*$D12,IF($E12=\"Non-RPP kWh\",VLOOKUP(O$4,'4. Billing Determinants'!$B$19:$Z$41,6,0)/'4. Billing Determinants'!$G$41*$D12, VLOOKUP(O$4,'4. Billing Determinants'!$B$19:$Z$41,18,0)*$D12)))),0)","v":0},{"$f":"IFERROR(IF(P$4=\"\",0,IF($E12=\"kWh\",VLOOKUP(P$4,'4. Billing Determinants'!$B$19:$Z$41,4,0)/'4. Billing Determinants'!$E$41*$D12,IF($E12=\"kW\",VLOOKUP(P$4,'4. Billing Determinants'!$B$19:$Z$41,5,0)/'4. Billing Determinants'!$F$41*$D12,IF($E12=\"Non-RPP kWh\",VLOOKUP(P$4,'4. Billing Determinants'!$B$19:$Z$41,6,0)/'4. Billing Determinants'!$G$41*$D12, VLOOKUP(P$4,'4. Billing Determinants'!$B$19:$Z$41,18,0)*$D12)))),0)","v":0},{"$f":"IFERROR(IF(Q$4=\"\",0,IF($E12=\"kWh\",VLOOKUP(Q$4,'4. Billing Determinants'!$B$19:$Z$41,4,0)/'4. Billing Determinants'!$E$41*$D12,IF($E12=\"kW\",VLOOKUP(Q$4,'4. Billing Determinants'!$B$19:$Z$41,5,0)/'4. Billing Determinants'!$F$41*$D12,IF($E12=\"Non-RPP kWh\",VLOOKUP(Q$4,'4. Billing Determinants'!$B$19:$Z$41,6,0)/'4. Billing Determinants'!$G$41*$D12, VLOOKUP(Q$4,'4. Billing Determinants'!$B$19:$Z$41,18,0)*$D12)))),0)","v":0},{"$f":"IFERROR(IF(R$4=\"\",0,IF($E12=\"kWh\",VLOOKUP(R$4,'4. Billing Determinants'!$B$19:$Z$41,4,0)/'4. Billing Determinants'!$E$41*$D12,IF($E12=\"kW\",VLOOKUP(R$4,'4. Billing Determinants'!$B$19:$Z$41,5,0)/'4. Billing Determinants'!$F$41*$D12,IF($E12=\"Non-RPP kWh\",VLOOKUP(R$4,'4. Billing Determinants'!$B$19:$Z$41,6,0)/'4. Billing Determinants'!$G$41*$D12, VLOOKUP(R$4,'4. Billing Determinants'!$B$19:$Z$41,18,0)*$D12)))),0)","v":0},{"$f":"IFERROR(IF(S$4=\"\",0,IF($E12=\"kWh\",VLOOKUP(S$4,'4. Billing Determinants'!$B$19:$Z$41,4,0)/'4. Billing Determinants'!$E$41*$D12,IF($E12=\"kW\",VLOOKUP(S$4,'4. Billing Determinants'!$B$19:$Z$41,5,0)/'4. Billing Determinants'!$F$41*$D12,IF($E12=\"Non-RPP kWh\",VLOOKUP(S$4,'4. Billing Determinants'!$B$19:$Z$41,6,0)/'4. Billing Determinants'!$G$41*$D12, VLOOKUP(S$4,'4. Billing Determinants'!$B$19:$Z$41,18,0)*$D12)))),0)","v":0},{"$f":"IFERROR(IF(T$4=\"\",0,IF($E12=\"kWh\",VLOOKUP(T$4,'4. Billing Determinants'!$B$19:$Z$41,4,0)/'4. Billing Determinants'!$E$41*$D12,IF($E12=\"kW\",VLOOKUP(T$4,'4. Billing Determinants'!$B$19:$Z$41,5,0)/'4. Billing Determinants'!$F$41*$D12,IF($E12=\"Non-RPP kWh\",VLOOKUP(T$4,'4. Billing Determinants'!$B$19:$Z$41,6,0)/'4. Billing Determinants'!$G$41*$D12, VLOOKUP(T$4,'4. Billing Determinants'!$B$19:$Z$41,18,0)*$D12)))),0)","v":0},{"$f":"IFERROR(IF(U$4=\"\",0,IF($E12=\"kWh\",VLOOKUP(U$4,'4. Billing Determinants'!$B$19:$Z$41,4,0)/'4. Billing Determinants'!$E$41*$D12,IF($E12=\"kW\",VLOOKUP(U$4,'4. Billing Determinants'!$B$19:$Z$41,5,0)/'4. Billing Determinants'!$F$41*$D12,IF($E12=\"Non-RPP kWh\",VLOOKUP(U$4,'4. Billing Determinants'!$B$19:$Z$41,6,0)/'4. Billing Determinants'!$G$41*$D12, VLOOKUP(U$4,'4. Billing Determinants'!$B$19:$Z$41,18,0)*$D12)))),0)","v":0},{"$f":"IFERROR(IF(V$4=\"\",0,IF($E12=\"kWh\",VLOOKUP(V$4,'4. Billing Determinants'!$B$19:$Z$41,4,0)/'4. Billing Determinants'!$E$41*$D12,IF($E12=\"kW\",VLOOKUP(V$4,'4. Billing Determinants'!$B$19:$Z$41,5,0)/'4. Billing Determinants'!$F$41*$D12,IF($E12=\"Non-RPP kWh\",VLOOKUP(V$4,'4. Billing Determinants'!$B$19:$Z$41,6,0)/'4. Billing Determinants'!$G$41*$D12, VLOOKUP(V$4,'4. Billing Determinants'!$B$19:$Z$41,18,0)*$D12)))),0)","v":0},{"$f":"IFERROR(IF(W$4=\"\",0,IF($E12=\"kWh\",VLOOKUP(W$4,'4. Billing Determinants'!$B$19:$Z$41,4,0)/'4. Billing Determinants'!$E$41*$D12,IF($E12=\"kW\",VLOOKUP(W$4,'4. Billing Determinants'!$B$19:$Z$41,5,0)/'4. Billing Determinants'!$F$41*$D12,IF($E12=\"Non-RPP kWh\",VLOOKUP(W$4,'4. Billing Determinants'!$B$19:$Z$41,6,0)/'4. Billing Determinants'!$G$41*$D12, VLOOKUP(W$4,'4. Billing Determinants'!$B$19:$Z$41,18,0)*$D12)))),0)","v":0},{"$f":"IFERROR(IF(X$4=\"\",0,IF($E12=\"kWh\",VLOOKUP(X$4,'4. Billing Determinants'!$B$19:$Z$41,4,0)/'4. Billing Determinants'!$E$41*$D12,IF($E12=\"kW\",VLOOKUP(X$4,'4. Billing Determinants'!$B$19:$Z$41,5,0)/'4. Billing Determinants'!$F$41*$D12,IF($E12=\"Non-RPP kWh\",VLOOKUP(X$4,'4. Billing Determinants'!$B$19:$Z$41,6,0)/'4. Billing Determinants'!$G$41*$D12, VLOOKUP(X$4,'4. Billing Determinants'!$B$19:$Z$41,18,0)*$D12)))),0)","v":0},{"$f":"IFERROR(IF(Y$4=\"\",0,IF($E12=\"kWh\",VLOOKUP(Y$4,'4. Billing Determinants'!$B$19:$Z$41,4,0)/'4. Billing Determinants'!$E$41*$D12,IF($E12=\"kW\",VLOOKUP(Y$4,'4. Billing Determinants'!$B$19:$Z$41,5,0)/'4. Billing Determinants'!$F$41*$D12,IF($E12=\"Non-RPP kWh\",VLOOKUP(Y$4,'4. Billing Determinants'!$B$19:$Z$41,6,0)/'4. Billing Determinants'!$G$41*$D12, VLOOKUP(Y$4,'4. Billing Determinants'!$B$19:$Z$41,18,0)*$D12)))),0)","v":0}]
[null,"Disposition and Recovery/Refund of Regulatory Balances (2009)",1595,{"$f":"'2. 2015 Continuity Schedule'!BS32","v":-6.0030000749975443E-3},"%",{"$f":"IFERROR(IF(F$4=\"\",0,IF($E13=\"kWh\",VLOOKUP(F$4,'4. Billing Determinants'!$B$19:$Z$41,4,0)/'4. Billing Determinants'!$E$41*$D13,IF($E13=\"kW\",VLOOKUP(F$4,'4. Billing Determinants'!$B$19:$Z$41,5,0)/'4. Billing Determinants'!$F$41*$D13,IF($E13=\"Non-RPP kWh\",VLOOKUP(F$4,'4. Billing Determinants'!$B$19:$Z$41,6,0)/'4. Billing Determinants'!$G$41*$D13, VLOOKUP(F$4,'4. Billing Determinants'!$B$19:$Z$41,19,0)*$D13)))),0)","v":0},{"$f":"IFERROR(IF(G$4=\"\",0,IF($E13=\"kWh\",VLOOKUP(G$4,'4. Billing Determinants'!$B$19:$Z$41,4,0)/'4. Billing Determinants'!$E$41*$D13,IF($E13=\"kW\",VLOOKUP(G$4,'4. Billing Determinants'!$B$19:$Z$41,5,0)/'4. Billing Determinants'!$F$41*$D13,IF($E13=\"Non-RPP kWh\",VLOOKUP(G$4,'4. Billing Determinants'!$B$19:$Z$41,6,0)/'4. Billing Determinants'!$G$41*$D13, VLOOKUP(G$4,'4. Billing Determinants'!$B$19:$Z$41,19,0)*$D13)))),0)","v":0},{"$f":"IFERROR(IF(H$4=\"\",0,IF($E13=\"kWh\",VLOOKUP(H$4,'4. Billing Determinants'!$B$19:$Z$41,4,0)/'4. Billing Determinants'!$E$41*$D13,IF($E13=\"kW\",VLOOKUP(H$4,'4. Billing Determinants'!$B$19:$Z$41,5,0)/'4. Billing Determinants'!$F$41*$D13,IF($E13=\"Non-RPP kWh\",VLOOKUP(H$4,'4. Billing Determinants'!$B$19:$Z$41,6,0)/'4. Billing Determinants'!$G$41*$D13, VLOOKUP(H$4,'4. Billing Determinants'!$B$19:$Z$41,19,0)*$D13)))),0)","v":0},{"$f":"IFERROR(IF(I$4=\"\",0,IF($E13=\"kWh\",VLOOKUP(I$4,'4. Billing Determinants'!$B$19:$Z$41,4,0)/'4. Billing Determinants'!$E$41*$D13,IF($E13=\"kW\",VLOOKUP(I$4,'4. Billing Determinants'!$B$19:$Z$41,5,0)/'4. Billing Determinants'!$F$41*$D13,IF($E13=\"Non-RPP kWh\",VLOOKUP(I$4,'4. Billing Determinants'!$B$19:$Z$41,6,0)/'4. Billing Determinants'!$G$41*$D13, VLOOKUP(I$4,'4. Billing Determinants'!$B$19:$Z$41,19,0)*$D13)))),0)","v":0},{"$f":"IFERROR(IF(J$4=\"\",0,IF($E13=\"kWh\",VLOOKUP(J$4,'4. Billing Determinants'!$B$19:$Z$41,4,0)/'4. Billing Determinants'!$E$41*$D13,IF($E13=\"kW\",VLOOKUP(J$4,'4. Billing Determinants'!$B$19:$Z$41,5,0)/'4. Billing Determinants'!$F$41*$D13,IF($E13=\"Non-RPP kWh\",VLOOKUP(J$4,'4. Billing Determinants'!$B$19:$Z$41,6,0)/'4. Billing Determinants'!$G$41*$D13, VLOOKUP(J$4,'4. Billing Determinants'!$B$19:$Z$41,19,0)*$D13)))),0)","v":0},{"$f":"IFERROR(IF(K$4=\"\",0,IF($E13=\"kWh\",VLOOKUP(K$4,'4. Billing Determinants'!$B$19:$Z$41,4,0)/'4. Billing Determinants'!$E$41*$D13,IF($E13=\"kW\",VLOOKUP(K$4,'4. Billing Determinants'!$B$19:$Z$41,5,0)/'4. Billing Determinants'!$F$41*$D13,IF($E13=\"Non-RPP kWh\",VLOOKUP(K$4,'4. Billing Determinants'!$B$19:$Z$41,6,0)/'4. Billing Determinants'!$G$41*$D13, VLOOKUP(K$4,'4. Billing Determinants'!$B$19:$Z$41,19,0)*$D13)))),0)","v":0},{"$f":"IFERROR(IF(L$4=\"\",0,IF($E13=\"kWh\",VLOOKUP(L$4,'4. Billing Determinants'!$B$19:$Z$41,4,0)/'4. Billing Determinants'!$E$41*$D13,IF($E13=\"kW\",VLOOKUP(L$4,'4. Billing Determinants'!$B$19:$Z$41,5,0)/'4. Billing Determinants'!$F$41*$D13,IF($E13=\"Non-RPP kWh\",VLOOKUP(L$4,'4. Billing Determinants'!$B$19:$Z$41,6,0)/'4. Billing Determinants'!$G$41*$D13, VLOOKUP(L$4,'4. Billing Determinants'!$B$19:$Z$41,19,0)*$D13)))),0)","v":0},{"$f":"IFERROR(IF(M$4=\"\",0,IF($E13=\"kWh\",VLOOKUP(M$4,'4. Billing Determinants'!$B$19:$Z$41,4,0)/'4. Billing Determinants'!$E$41*$D13,IF($E13=\"kW\",VLOOKUP(M$4,'4. Billing Determinants'!$B$19:$Z$41,5,0)/'4. Billing Determinants'!$F$41*$D13,IF($E13=\"Non-RPP kWh\",VLOOKUP(M$4,'4. Billing Determinants'!$B$19:$Z$41,6,0)/'4. Billing Determinants'!$G$41*$D13, VLOOKUP(M$4,'4. Billing Determinants'!$B$19:$Z$41,19,0)*$D13)))),0)","v":0},{"$f":"IFERROR(IF(N$4=\"\",0,IF($E13=\"kWh\",VLOOKUP(N$4,'4. Billing Determinants'!$B$19:$Z$41,4,0)/'4. Billing Determinants'!$E$41*$D13,IF($E13=\"kW\",VLOOKUP(N$4,'4. Billing Determinants'!$B$19:$Z$41,5,0)/'4. Billing Determinants'!$F$41*$D13,IF($E13=\"Non-RPP kWh\",VLOOKUP(N$4,'4. Billing Determinants'!$B$19:$Z$41,6,0)/'4. Billing Determinants'!$G$41*$D13, VLOOKUP(N$4,'4. Billing Determinants'!$B$19:$Z$41,19,0)*$D13)))),0)","v":0},{"$f":"IFERROR(IF(O$4=\"\",0,IF($E13=\"kWh\",VLOOKUP(O$4,'4. Billing Determinants'!$B$19:$Z$41,4,0)/'4. Billing Determinants'!$E$41*$D13,IF($E13=\"kW\",VLOOKUP(O$4,'4. Billing Determinants'!$B$19:$Z$41,5,0)/'4. Billing Determinants'!$F$41*$D13,IF($E13=\"Non-RPP kWh\",VLOOKUP(O$4,'4. Billing Determinants'!$B$19:$Z$41,6,0)/'4. Billing Determinants'!$G$41*$D13, VLOOKUP(O$4,'4. Billing Determinants'!$B$19:$Z$41,19,0)*$D13)))),0)","v":0},{"$f":"IFERROR(IF(P$4=\"\",0,IF($E13=\"kWh\",VLOOKUP(P$4,'4. Billing Determinants'!$B$19:$Z$41,4,0)/'4. Billing Determinants'!$E$41*$D13,IF($E13=\"kW\",VLOOKUP(P$4,'4. Billing Determinants'!$B$19:$Z$41,5,0)/'4. Billing Determinants'!$F$41*$D13,IF($E13=\"Non-RPP kWh\",VLOOKUP(P$4,'4. Billing Determinants'!$B$19:$Z$41,6,0)/'4. Billing Determinants'!$G$41*$D13, VLOOKUP(P$4,'4. Billing Determinants'!$B$19:$Z$41,19,0)*$D13)))),0)","v":0},{"$f":"IFERROR(IF(Q$4=\"\",0,IF($E13=\"kWh\",VLOOKUP(Q$4,'4. Billing Determinants'!$B$19:$Z$41,4,0)/'4. Billing Determinants'!$E$41*$D13,IF($E13=\"kW\",VLOOKUP(Q$4,'4. Billing Determinants'!$B$19:$Z$41,5,0)/'4. Billing Determinants'!$F$41*$D13,IF($E13=\"Non-RPP kWh\",VLOOKUP(Q$4,'4. Billing Determinants'!$B$19:$Z$41,6,0)/'4. Billing Determinants'!$G$41*$D13, VLOOKUP(Q$4,'4. Billing Determinants'!$B$19:$Z$41,19,0)*$D13)))),0)","v":0},{"$f":"IFERROR(IF(R$4=\"\",0,IF($E13=\"kWh\",VLOOKUP(R$4,'4. Billing Determinants'!$B$19:$Z$41,4,0)/'4. Billing Determinants'!$E$41*$D13,IF($E13=\"kW\",VLOOKUP(R$4,'4. Billing Determinants'!$B$19:$Z$41,5,0)/'4. Billing Determinants'!$F$41*$D13,IF($E13=\"Non-RPP kWh\",VLOOKUP(R$4,'4. Billing Determinants'!$B$19:$Z$41,6,0)/'4. Billing Determinants'!$G$41*$D13, VLOOKUP(R$4,'4. Billing Determinants'!$B$19:$Z$41,19,0)*$D13)))),0)","v":0},{"$f":"IFERROR(IF(S$4=\"\",0,IF($E13=\"kWh\",VLOOKUP(S$4,'4. Billing Determinants'!$B$19:$Z$41,4,0)/'4. Billing Determinants'!$E$41*$D13,IF($E13=\"kW\",VLOOKUP(S$4,'4. Billing Determinants'!$B$19:$Z$41,5,0)/'4. Billing Determinants'!$F$41*$D13,IF($E13=\"Non-RPP kWh\",VLOOKUP(S$4,'4. Billing Determinants'!$B$19:$Z$41,6,0)/'4. Billing Determinants'!$G$41*$D13, VLOOKUP(S$4,'4. Billing Determinants'!$B$19:$Z$41,19,0)*$D13)))),0)","v":0},{"$f":"IFERROR(IF(T$4=\"\",0,IF($E13=\"kWh\",VLOOKUP(T$4,'4. Billing Determinants'!$B$19:$Z$41,4,0)/'4. Billing Determinants'!$E$41*$D13,IF($E13=\"kW\",VLOOKUP(T$4,'4. Billing Determinants'!$B$19:$Z$41,5,0)/'4. Billing Determinants'!$F$41*$D13,IF($E13=\"Non-RPP kWh\",VLOOKUP(T$4,'4. Billing Determinants'!$B$19:$Z$41,6,0)/'4. Billing Determinants'!$G$41*$D13, VLOOKUP(T$4,'4. Billing Determinants'!$B$19:$Z$41,19,0)*$D13)))),0)","v":0},{"$f":"IFERROR(IF(U$4=\"\",0,IF($E13=\"kWh\",VLOOKUP(U$4,'4. Billing Determinants'!$B$19:$Z$41,4,0)/'4. Billing Determinants'!$E$41*$D13,IF($E13=\"kW\",VLOOKUP(U$4,'4. Billing Determinants'!$B$19:$Z$41,5,0)/'4. Billing Determinants'!$F$41*$D13,IF($E13=\"Non-RPP kWh\",VLOOKUP(U$4,'4. Billing Determinants'!$B$19:$Z$41,6,0)/'4. Billing Determinants'!$G$41*$D13, VLOOKUP(U$4,'4. Billing Determinants'!$B$19:$Z$41,19,0)*$D13)))),0)","v":0},{"$f":"IFERROR(IF(V$4=\"\",0,IF($E13=\"kWh\",VLOOKUP(V$4,'4. Billing Determinants'!$B$19:$Z$41,4,0)/'4. Billing Determinants'!$E$41*$D13,IF($E13=\"kW\",VLOOKUP(V$4,'4. Billing Determinants'!$B$19:$Z$41,5,0)/'4. Billing Determinants'!$F$41*$D13,IF($E13=\"Non-RPP kWh\",VLOOKUP(V$4,'4. Billing Determinants'!$B$19:$Z$41,6,0)/'4. Billing Determinants'!$G$41*$D13, VLOOKUP(V$4,'4. Billing Determinants'!$B$19:$Z$41,19,0)*$D13)))),0)","v":0},{"$f":"IFERROR(IF(W$4=\"\",0,IF($E13=\"kWh\",VLOOKUP(W$4,'4. Billing Determinants'!$B$19:$Z$41,4,0)/'4. Billing Determinants'!$E$41*$D13,IF($E13=\"kW\",VLOOKUP(W$4,'4. Billing Determinants'!$B$19:$Z$41,5,0)/'4. Billing Determinants'!$F$41*$D13,IF($E13=\"Non-RPP kWh\",VLOOKUP(W$4,'4. Billing Determinants'!$B$19:$Z$41,6,0)/'4. Billing Determinants'!$G$41*$D13, VLOOKUP(W$4,'4. Billing Determinants'!$B$19:$Z$41,19,0)*$D13)))),0)","v":0},{"$f":"IFERROR(IF(X$4=\"\",0,IF($E13=\"kWh\",VLOOKUP(X$4,'4. Billing Determinants'!$B$19:$Z$41,4,0)/'4. Billing Determinants'!$E$41*$D13,IF($E13=\"kW\",VLOOKUP(X$4,'4. Billing Determinants'!$B$19:$Z$41,5,0)/'4. Billing Determinants'!$F$41*$D13,IF($E13=\"Non-RPP kWh\",VLOOKUP(X$4,'4. Billing Determinants'!$B$19:$Z$41,6,0)/'4. Billing Determinants'!$G$41*$D13, VLOOKUP(X$4,'4. Billing Determinants'!$B$19:$Z$41,19,0)*$D13)))),0)","v":0},{"$f":"IFERROR(IF(Y$4=\"\",0,IF($E13=\"kWh\",VLOOKUP(Y$4,'4. Billing Determinants'!$B$19:$Z$41,4,0)/'4. Billing Determinants'!$E$41*$D13,IF($E13=\"kW\",VLOOKUP(Y$4,'4. Billing Determinants'!$B$19:$Z$41,5,0)/'4. Billing Determinants'!$F$41*$D13,IF($E13=\"Non-RPP kWh\",VLOOKUP(Y$4,'4. Billing Determinants'!$B$19:$Z$41,6,0)/'4. Billing Determinants'!$G$41*$D13, VLOOKUP(Y$4,'4. Billing Determinants'!$B$19:$Z$41,19,0)*$D13)))),0)","v":0}]
[null,"Disposition and Recovery/Refund of Regulatory Balances (2010)",1595,{"$f":"'2. 2015 Continuity Schedule'!BS33","v":4.6500000004016329E-2},"%",{"$f":"IFERROR(IF(F$4=\"\",0,IF($E14=\"kWh\",VLOOKUP(F$4,'4. Billing Determinants'!$B$19:$Z$41,4,0)/'4. Billing Determinants'!$E$41*$D14,IF($E14=\"kW\",VLOOKUP(F$4,'4. Billing Determinants'!$B$19:$Z$41,5,0)/'4. Billing Determinants'!$F$41*$D14,IF($E14=\"Non-RPP kWh\",VLOOKUP(F$4,'4. Billing Determinants'!$B$19:$Z$41,6,0)/'4. Billing Determinants'!$G$41*$D14, VLOOKUP(F$4,'4. Billing Determinants'!$B$19:$Z$41,20,0)*$D14)))),0)","v":0},{"$f":"IFERROR(IF(G$4=\"\",0,IF($E14=\"kWh\",VLOOKUP(G$4,'4. Billing Determinants'!$B$19:$Z$41,4,0)/'4. Billing Determinants'!$E$41*$D14,IF($E14=\"kW\",VLOOKUP(G$4,'4. Billing Determinants'!$B$19:$Z$41,5,0)/'4. Billing Determinants'!$F$41*$D14,IF($E14=\"Non-RPP kWh\",VLOOKUP(G$4,'4. Billing Determinants'!$B$19:$Z$41,6,0)/'4. Billing Determinants'!$G$41*$D14, VLOOKUP(G$4,'4. Billing Determinants'!$B$19:$Z$41,20,0)*$D14)))),0)","v":0},{"$f":"IFERROR(IF(H$4=\"\",0,IF($E14=\"kWh\",VLOOKUP(H$4,'4. Billing Determinants'!$B$19:$Z$41,4,0)/'4. Billing Determinants'!$E$41*$D14,IF($E14=\"kW\",VLOOKUP(H$4,'4. Billing Determinants'!$B$19:$Z$41,5,0)/'4. Billing Determinants'!$F$41*$D14,IF($E14=\"Non-RPP kWh\",VLOOKUP(H$4,'4. Billing Determinants'!$B$19:$Z$41,6,0)/'4. Billing Determinants'!$G$41*$D14, VLOOKUP(H$4,'4. Billing Determinants'!$B$19:$Z$41,20,0)*$D14)))),0)","v":0},{"$f":"IFERROR(IF(I$4=\"\",0,IF($E14=\"kWh\",VLOOKUP(I$4,'4. Billing Determinants'!$B$19:$Z$41,4,0)/'4. Billing Determinants'!$E$41*$D14,IF($E14=\"kW\",VLOOKUP(I$4,'4. Billing Determinants'!$B$19:$Z$41,5,0)/'4. Billing Determinants'!$F$41*$D14,IF($E14=\"Non-RPP kWh\",VLOOKUP(I$4,'4. Billing Determinants'!$B$19:$Z$41,6,0)/'4. Billing Determinants'!$G$41*$D14, VLOOKUP(I$4,'4. Billing Determinants'!$B$19:$Z$41,20,0)*$D14)))),0)","v":0},{"$f":"IFERROR(IF(J$4=\"\",0,IF($E14=\"kWh\",VLOOKUP(J$4,'4. Billing Determinants'!$B$19:$Z$41,4,0)/'4. Billing Determinants'!$E$41*$D14,IF($E14=\"kW\",VLOOKUP(J$4,'4. Billing Determinants'!$B$19:$Z$41,5,0)/'4. Billing Determinants'!$F$41*$D14,IF($E14=\"Non-RPP kWh\",VLOOKUP(J$4,'4. Billing Determinants'!$B$19:$Z$41,6,0)/'4. Billing Determinants'!$G$41*$D14, VLOOKUP(J$4,'4. Billing Determinants'!$B$19:$Z$41,20,0)*$D14)))),0)","v":0},{"$f":"IFERROR(IF(K$4=\"\",0,IF($E14=\"kWh\",VLOOKUP(K$4,'4. Billing Determinants'!$B$19:$Z$41,4,0)/'4. Billing Determinants'!$E$41*$D14,IF($E14=\"kW\",VLOOKUP(K$4,'4. Billing Determinants'!$B$19:$Z$41,5,0)/'4. Billing Determinants'!$F$41*$D14,IF($E14=\"Non-RPP kWh\",VLOOKUP(K$4,'4. Billing Determinants'!$B$19:$Z$41,6,0)/'4. Billing Determinants'!$G$41*$D14, VLOOKUP(K$4,'4. Billing Determinants'!$B$19:$Z$41,20,0)*$D14)))),0)","v":0},{"$f":"IFERROR(IF(L$4=\"\",0,IF($E14=\"kWh\",VLOOKUP(L$4,'4. Billing Determinants'!$B$19:$Z$41,4,0)/'4. Billing Determinants'!$E$41*$D14,IF($E14=\"kW\",VLOOKUP(L$4,'4. Billing Determinants'!$B$19:$Z$41,5,0)/'4. Billing Determinants'!$F$41*$D14,IF($E14=\"Non-RPP kWh\",VLOOKUP(L$4,'4. Billing Determinants'!$B$19:$Z$41,6,0)/'4. Billing Determinants'!$G$41*$D14, VLOOKUP(L$4,'4. Billing Determinants'!$B$19:$Z$41,20,0)*$D14)))),0)","v":0},{"$f":"IFERROR(IF(M$4=\"\",0,IF($E14=\"kWh\",VLOOKUP(M$4,'4. Billing Determinants'!$B$19:$Z$41,4,0)/'4. Billing Determinants'!$E$41*$D14,IF($E14=\"kW\",VLOOKUP(M$4,'4. Billing Determinants'!$B$19:$Z$41,5,0)/'4. Billing Determinants'!$F$41*$D14,IF($E14=\"Non-RPP kWh\",VLOOKUP(M$4,'4. Billing Determinants'!$B$19:$Z$41,6,0)/'4. Billing Determinants'!$G$41*$D14, VLOOKUP(M$4,'4. Billing Determinants'!$B$19:$Z$41,20,0)*$D14)))),0)","v":0},{"$f":"IFERROR(IF(N$4=\"\",0,IF($E14=\"kWh\",VLOOKUP(N$4,'4. Billing Determinants'!$B$19:$Z$41,4,0)/'4. Billing Determinants'!$E$41*$D14,IF($E14=\"kW\",VLOOKUP(N$4,'4. Billing Determinants'!$B$19:$Z$41,5,0)/'4. Billing Determinants'!$F$41*$D14,IF($E14=\"Non-RPP kWh\",VLOOKUP(N$4,'4. Billing Determinants'!$B$19:$Z$41,6,0)/'4. Billing Determinants'!$G$41*$D14, VLOOKUP(N$4,'4. Billing Determinants'!$B$19:$Z$41,20,0)*$D14)))),0)","v":0},{"$f":"IFERROR(IF(O$4=\"\",0,IF($E14=\"kWh\",VLOOKUP(O$4,'4. Billing Determinants'!$B$19:$Z$41,4,0)/'4. Billing Determinants'!$E$41*$D14,IF($E14=\"kW\",VLOOKUP(O$4,'4. Billing Determinants'!$B$19:$Z$41,5,0)/'4. Billing Determinants'!$F$41*$D14,IF($E14=\"Non-RPP kWh\",VLOOKUP(O$4,'4. Billing Determinants'!$B$19:$Z$41,6,0)/'4. Billing Determinants'!$G$41*$D14, VLOOKUP(O$4,'4. Billing Determinants'!$B$19:$Z$41,20,0)*$D14)))),0)","v":0},{"$f":"IFERROR(IF(P$4=\"\",0,IF($E14=\"kWh\",VLOOKUP(P$4,'4. Billing Determinants'!$B$19:$Z$41,4,0)/'4. Billing Determinants'!$E$41*$D14,IF($E14=\"kW\",VLOOKUP(P$4,'4. Billing Determinants'!$B$19:$Z$41,5,0)/'4. Billing Determinants'!$F$41*$D14,IF($E14=\"Non-RPP kWh\",VLOOKUP(P$4,'4. Billing Determinants'!$B$19:$Z$41,6,0)/'4. Billing Determinants'!$G$41*$D14, VLOOKUP(P$4,'4. Billing Determinants'!$B$19:$Z$41,20,0)*$D14)))),0)","v":0},{"$f":"IFERROR(IF(Q$4=\"\",0,IF($E14=\"kWh\",VLOOKUP(Q$4,'4. Billing Determinants'!$B$19:$Z$41,4,0)/'4. Billing Determinants'!$E$41*$D14,IF($E14=\"kW\",VLOOKUP(Q$4,'4. Billing Determinants'!$B$19:$Z$41,5,0)/'4. Billing Determinants'!$F$41*$D14,IF($E14=\"Non-RPP kWh\",VLOOKUP(Q$4,'4. Billing Determinants'!$B$19:$Z$41,6,0)/'4. Billing Determinants'!$G$41*$D14, VLOOKUP(Q$4,'4. Billing Determinants'!$B$19:$Z$41,20,0)*$D14)))),0)","v":0},{"$f":"IFERROR(IF(R$4=\"\",0,IF($E14=\"kWh\",VLOOKUP(R$4,'4. Billing Determinants'!$B$19:$Z$41,4,0)/'4. Billing Determinants'!$E$41*$D14,IF($E14=\"kW\",VLOOKUP(R$4,'4. Billing Determinants'!$B$19:$Z$41,5,0)/'4. Billing Determinants'!$F$41*$D14,IF($E14=\"Non-RPP kWh\",VLOOKUP(R$4,'4. Billing Determinants'!$B$19:$Z$41,6,0)/'4. Billing Determinants'!$G$41*$D14, VLOOKUP(R$4,'4. Billing Determinants'!$B$19:$Z$41,20,0)*$D14)))),0)","v":0},{"$f":"IFERROR(IF(S$4=\"\",0,IF($E14=\"kWh\",VLOOKUP(S$4,'4. Billing Determinants'!$B$19:$Z$41,4,0)/'4. Billing Determinants'!$E$41*$D14,IF($E14=\"kW\",VLOOKUP(S$4,'4. Billing Determinants'!$B$19:$Z$41,5,0)/'4. Billing Determinants'!$F$41*$D14,IF($E14=\"Non-RPP kWh\",VLOOKUP(S$4,'4. Billing Determinants'!$B$19:$Z$41,6,0)/'4. Billing Determinants'!$G$41*$D14, VLOOKUP(S$4,'4. Billing Determinants'!$B$19:$Z$41,20,0)*$D14)))),0)","v":0},{"$f":"IFERROR(IF(T$4=\"\",0,IF($E14=\"kWh\",VLOOKUP(T$4,'4. Billing Determinants'!$B$19:$Z$41,4,0)/'4. Billing Determinants'!$E$41*$D14,IF($E14=\"kW\",VLOOKUP(T$4,'4. Billing Determinants'!$B$19:$Z$41,5,0)/'4. Billing Determinants'!$F$41*$D14,IF($E14=\"Non-RPP kWh\",VLOOKUP(T$4,'4. Billing Determinants'!$B$19:$Z$41,6,0)/'4. Billing Determinants'!$G$41*$D14, VLOOKUP(T$4,'4. Billing Determinants'!$B$19:$Z$41,20,0)*$D14)))),0)","v":0},{"$f":"IFERROR(IF(U$4=\"\",0,IF($E14=\"kWh\",VLOOKUP(U$4,'4. Billing Determinants'!$B$19:$Z$41,4,0)/'4. Billing Determinants'!$E$41*$D14,IF($E14=\"kW\",VLOOKUP(U$4,'4. Billing Determinants'!$B$19:$Z$41,5,0)/'4. Billing Determinants'!$F$41*$D14,IF($E14=\"Non-RPP kWh\",VLOOKUP(U$4,'4. Billing Determinants'!$B$19:$Z$41,6,0)/'4. Billing Determinants'!$G$41*$D14, VLOOKUP(U$4,'4. Billing Determinants'!$B$19:$Z$41,20,0)*$D14)))),0)","v":0},{"$f":"IFERROR(IF(V$4=\"\",0,IF($E14=\"kWh\",VLOOKUP(V$4,'4. Billing Determinants'!$B$19:$Z$41,4,0)/'4. Billing Determinants'!$E$41*$D14,IF($E14=\"kW\",VLOOKUP(V$4,'4. Billing Determinants'!$B$19:$Z$41,5,0)/'4. Billing Determinants'!$F$41*$D14,IF($E14=\"Non-RPP kWh\",VLOOKUP(V$4,'4. Billing Determinants'!$B$19:$Z$41,6,0)/'4. Billing Determinants'!$G$41*$D14, VLOOKUP(V$4,'4. Billing Determinants'!$B$19:$Z$41,20,0)*$D14)))),0)","v":0},{"$f":"IFERROR(IF(W$4=\"\",0,IF($E14=\"kWh\",VLOOKUP(W$4,'4. Billing Determinants'!$B$19:$Z$41,4,0)/'4. Billing Determinants'!$E$41*$D14,IF($E14=\"kW\",VLOOKUP(W$4,'4. Billing Determinants'!$B$19:$Z$41,5,0)/'4. Billing Determinants'!$F$41*$D14,IF($E14=\"Non-RPP kWh\",VLOOKUP(W$4,'4. Billing Determinants'!$B$19:$Z$41,6,0)/'4. Billing Determinants'!$G$41*$D14, VLOOKUP(W$4,'4. Billing Determinants'!$B$19:$Z$41,20,0)*$D14)))),0)","v":0},{"$f":"IFERROR(IF(X$4=\"\",0,IF($E14=\"kWh\",VLOOKUP(X$4,'4. Billing Determinants'!$B$19:$Z$41,4,0)/'4. Billing Determinants'!$E$41*$D14,IF($E14=\"kW\",VLOOKUP(X$4,'4. Billing Determinants'!$B$19:$Z$41,5,0)/'4. Billing Determinants'!$F$41*$D14,IF($E14=\"Non-RPP kWh\",VLOOKUP(X$4,'4. Billing Determinants'!$B$19:$Z$41,6,0)/'4. Billing Determinants'!$G$41*$D14, VLOOKUP(X$4,'4. Billing Determinants'!$B$19:$Z$41,20,0)*$D14)))),0)","v":0},{"$f":"IFERROR(IF(Y$4=\"\",0,IF($E14=\"kWh\",VLOOKUP(Y$4,'4. Billing Determinants'!$B$19:$Z$41,4,0)/'4. Billing Determinants'!$E$41*$D14,IF($E14=\"kW\",VLOOKUP(Y$4,'4. Billing Determinants'!$B$19:$Z$41,5,0)/'4. Billing Determinants'!$F$41*$D14,IF($E14=\"Non-RPP kWh\",VLOOKUP(Y$4,'4. Billing Determinants'!$B$19:$Z$41,6,0)/'4. Billing Determinants'!$G$41*$D14, VLOOKUP(Y$4,'4. Billing Determinants'!$B$19:$Z$41,20,0)*$D14)))),0)","v":0}]
[null,"Disposition and Recovery/Refund of Regulatory Balances (2011)",1595,{"$f":"'2. 2015 Continuity Schedule'!BS34","v":5.3267999988747761E-2},"%",{"$f":"IFERROR(IF(F$4=\"\",0,IF($E15=\"kWh\",VLOOKUP(F$4,'4. Billing Determinants'!$B$19:$Z$41,4,0)/'4. Billing Determinants'!$E$41*$D15,IF($E15=\"kW\",VLOOKUP(F$4,'4. Billing Determinants'!$B$19:$Z$41,5,0)/'4. Billing Determinants'!$F$41*$D15,IF($E15=\"Non-RPP kWh\",VLOOKUP(F$4,'4. Billing Determinants'!$B$19:$Z$41,6,0)/'4. Billing Determinants'!$G$41*$D15, VLOOKUP(F$4,'4. Billing Determinants'!$B$19:$Z$41,21,0)*$D15)))),0)","v":0},{"$f":"IFERROR(IF(G$4=\"\",0,IF($E15=\"kWh\",VLOOKUP(G$4,'4. Billing Determinants'!$B$19:$Z$41,4,0)/'4. Billing Determinants'!$E$41*$D15,IF($E15=\"kW\",VLOOKUP(G$4,'4. Billing Determinants'!$B$19:$Z$41,5,0)/'4. Billing Determinants'!$F$41*$D15,IF($E15=\"Non-RPP kWh\",VLOOKUP(G$4,'4. Billing Determinants'!$B$19:$Z$41,6,0)/'4. Billing Determinants'!$G$41*$D15, VLOOKUP(G$4,'4. Billing Determinants'!$B$19:$Z$41,21,0)*$D15)))),0)","v":0},{"$f":"IFERROR(IF(H$4=\"\",0,IF($E15=\"kWh\",VLOOKUP(H$4,'4. Billing Determinants'!$B$19:$Z$41,4,0)/'4. Billing Determinants'!$E$41*$D15,IF($E15=\"kW\",VLOOKUP(H$4,'4. Billing Determinants'!$B$19:$Z$41,5,0)/'4. Billing Determinants'!$F$41*$D15,IF($E15=\"Non-RPP kWh\",VLOOKUP(H$4,'4. Billing Determinants'!$B$19:$Z$41,6,0)/'4. Billing Determinants'!$G$41*$D15, VLOOKUP(H$4,'4. Billing Determinants'!$B$19:$Z$41,21,0)*$D15)))),0)","v":0},{"$f":"IFERROR(IF(I$4=\"\",0,IF($E15=\"kWh\",VLOOKUP(I$4,'4. Billing Determinants'!$B$19:$Z$41,4,0)/'4. Billing Determinants'!$E$41*$D15,IF($E15=\"kW\",VLOOKUP(I$4,'4. Billing Determinants'!$B$19:$Z$41,5,0)/'4. Billing Determinants'!$F$41*$D15,IF($E15=\"Non-RPP kWh\",VLOOKUP(I$4,'4. Billing Determinants'!$B$19:$Z$41,6,0)/'4. Billing Determinants'!$G$41*$D15, VLOOKUP(I$4,'4. Billing Determinants'!$B$19:$Z$41,21,0)*$D15)))),0)","v":0},{"$f":"IFERROR(IF(J$4=\"\",0,IF($E15=\"kWh\",VLOOKUP(J$4,'4. Billing Determinants'!$B$19:$Z$41,4,0)/'4. Billing Determinants'!$E$41*$D15,IF($E15=\"kW\",VLOOKUP(J$4,'4. Billing Determinants'!$B$19:$Z$41,5,0)/'4. Billing Determinants'!$F$41*$D15,IF($E15=\"Non-RPP kWh\",VLOOKUP(J$4,'4. Billing Determinants'!$B$19:$Z$41,6,0)/'4. Billing Determinants'!$G$41*$D15, VLOOKUP(J$4,'4. Billing Determinants'!$B$19:$Z$41,21,0)*$D15)))),0)","v":0},{"$f":"IFERROR(IF(K$4=\"\",0,IF($E15=\"kWh\",VLOOKUP(K$4,'4. Billing Determinants'!$B$19:$Z$41,4,0)/'4. Billing Determinants'!$E$41*$D15,IF($E15=\"kW\",VLOOKUP(K$4,'4. Billing Determinants'!$B$19:$Z$41,5,0)/'4. Billing Determinants'!$F$41*$D15,IF($E15=\"Non-RPP kWh\",VLOOKUP(K$4,'4. Billing Determinants'!$B$19:$Z$41,6,0)/'4. Billing Determinants'!$G$41*$D15, VLOOKUP(K$4,'4. Billing Determinants'!$B$19:$Z$41,21,0)*$D15)))),0)","v":0},{"$f":"IFERROR(IF(L$4=\"\",0,IF($E15=\"kWh\",VLOOKUP(L$4,'4. Billing Determinants'!$B$19:$Z$41,4,0)/'4. Billing Determinants'!$E$41*$D15,IF($E15=\"kW\",VLOOKUP(L$4,'4. Billing Determinants'!$B$19:$Z$41,5,0)/'4. Billing Determinants'!$F$41*$D15,IF($E15=\"Non-RPP kWh\",VLOOKUP(L$4,'4. Billing Determinants'!$B$19:$Z$41,6,0)/'4. Billing Determinants'!$G$41*$D15, VLOOKUP(L$4,'4. Billing Determinants'!$B$19:$Z$41,21,0)*$D15)))),0)","v":0},{"$f":"IFERROR(IF(M$4=\"\",0,IF($E15=\"kWh\",VLOOKUP(M$4,'4. Billing Determinants'!$B$19:$Z$41,4,0)/'4. Billing Determinants'!$E$41*$D15,IF($E15=\"kW\",VLOOKUP(M$4,'4. Billing Determinants'!$B$19:$Z$41,5,0)/'4. Billing Determinants'!$F$41*$D15,IF($E15=\"Non-RPP kWh\",VLOOKUP(M$4,'4. Billing Determinants'!$B$19:$Z$41,6,0)/'4. Billing Determinants'!$G$41*$D15, VLOOKUP(M$4,'4. Billing Determinants'!$B$19:$Z$41,21,0)*$D15)))),0)","v":0},{"$f":"IFERROR(IF(N$4=\"\",0,IF($E15=\"kWh\",VLOOKUP(N$4,'4. Billing Determinants'!$B$19:$Z$41,4,0)/'4. Billing Determinants'!$E$41*$D15,IF($E15=\"kW\",VLOOKUP(N$4,'4. Billing Determinants'!$B$19:$Z$41,5,0)/'4. Billing Determinants'!$F$41*$D15,IF($E15=\"Non-RPP kWh\",VLOOKUP(N$4,'4. Billing Determinants'!$B$19:$Z$41,6,0)/'4. Billing Determinants'!$G$41*$D15, VLOOKUP(N$4,'4. Billing Determinants'!$B$19:$Z$41,21,0)*$D15)))),0)","v":0},{"$f":"IFERROR(IF(O$4=\"\",0,IF($E15=\"kWh\",VLOOKUP(O$4,'4. Billing Determinants'!$B$19:$Z$41,4,0)/'4. Billing Determinants'!$E$41*$D15,IF($E15=\"kW\",VLOOKUP(O$4,'4. Billing Determinants'!$B$19:$Z$41,5,0)/'4. Billing Determinants'!$F$41*$D15,IF($E15=\"Non-RPP kWh\",VLOOKUP(O$4,'4. Billing Determinants'!$B$19:$Z$41,6,0)/'4. Billing Determinants'!$G$41*$D15, VLOOKUP(O$4,'4. Billing Determinants'!$B$19:$Z$41,21,0)*$D15)))),0)","v":0},{"$f":"IFERROR(IF(P$4=\"\",0,IF($E15=\"kWh\",VLOOKUP(P$4,'4. Billing Determinants'!$B$19:$Z$41,4,0)/'4. Billing Determinants'!$E$41*$D15,IF($E15=\"kW\",VLOOKUP(P$4,'4. Billing Determinants'!$B$19:$Z$41,5,0)/'4. Billing Determinants'!$F$41*$D15,IF($E15=\"Non-RPP kWh\",VLOOKUP(P$4,'4. Billing Determinants'!$B$19:$Z$41,6,0)/'4. Billing Determinants'!$G$41*$D15, VLOOKUP(P$4,'4. Billing Determinants'!$B$19:$Z$41,21,0)*$D15)))),0)","v":0},{"$f":"IFERROR(IF(Q$4=\"\",0,IF($E15=\"kWh\",VLOOKUP(Q$4,'4. Billing Determinants'!$B$19:$Z$41,4,0)/'4. Billing Determinants'!$E$41*$D15,IF($E15=\"kW\",VLOOKUP(Q$4,'4. Billing Determinants'!$B$19:$Z$41,5,0)/'4. Billing Determinants'!$F$41*$D15,IF($E15=\"Non-RPP kWh\",VLOOKUP(Q$4,'4. Billing Determinants'!$B$19:$Z$41,6,0)/'4. Billing Determinants'!$G$41*$D15, VLOOKUP(Q$4,'4. Billing Determinants'!$B$19:$Z$41,21,0)*$D15)))),0)","v":0},{"$f":"IFERROR(IF(R$4=\"\",0,IF($E15=\"kWh\",VLOOKUP(R$4,'4. Billing Determinants'!$B$19:$Z$41,4,0)/'4. Billing Determinants'!$E$41*$D15,IF($E15=\"kW\",VLOOKUP(R$4,'4. Billing Determinants'!$B$19:$Z$41,5,0)/'4. Billing Determinants'!$F$41*$D15,IF($E15=\"Non-RPP kWh\",VLOOKUP(R$4,'4. Billing Determinants'!$B$19:$Z$41,6,0)/'4. Billing Determinants'!$G$41*$D15, VLOOKUP(R$4,'4. Billing Determinants'!$B$19:$Z$41,21,0)*$D15)))),0)","v":0},{"$f":"IFERROR(IF(S$4=\"\",0,IF($E15=\"kWh\",VLOOKUP(S$4,'4. Billing Determinants'!$B$19:$Z$41,4,0)/'4. Billing Determinants'!$E$41*$D15,IF($E15=\"kW\",VLOOKUP(S$4,'4. Billing Determinants'!$B$19:$Z$41,5,0)/'4. Billing Determinants'!$F$41*$D15,IF($E15=\"Non-RPP kWh\",VLOOKUP(S$4,'4. Billing Determinants'!$B$19:$Z$41,6,0)/'4. Billing Determinants'!$G$41*$D15, VLOOKUP(S$4,'4. Billing Determinants'!$B$19:$Z$41,21,0)*$D15)))),0)","v":0},{"$f":"IFERROR(IF(T$4=\"\",0,IF($E15=\"kWh\",VLOOKUP(T$4,'4. Billing Determinants'!$B$19:$Z$41,4,0)/'4. Billing Determinants'!$E$41*$D15,IF($E15=\"kW\",VLOOKUP(T$4,'4. Billing Determinants'!$B$19:$Z$41,5,0)/'4. Billing Determinants'!$F$41*$D15,IF($E15=\"Non-RPP kWh\",VLOOKUP(T$4,'4. Billing Determinants'!$B$19:$Z$41,6,0)/'4. Billing Determinants'!$G$41*$D15, VLOOKUP(T$4,'4. Billing Determinants'!$B$19:$Z$41,21,0)*$D15)))),0)","v":0},{"$f":"IFERROR(IF(U$4=\"\",0,IF($E15=\"kWh\",VLOOKUP(U$4,'4. Billing Determinants'!$B$19:$Z$41,4,0)/'4. Billing Determinants'!$E$41*$D15,IF($E15=\"kW\",VLOOKUP(U$4,'4. Billing Determinants'!$B$19:$Z$41,5,0)/'4. Billing Determinants'!$F$41*$D15,IF($E15=\"Non-RPP kWh\",VLOOKUP(U$4,'4. Billing Determinants'!$B$19:$Z$41,6,0)/'4. Billing Determinants'!$G$41*$D15, VLOOKUP(U$4,'4. Billing Determinants'!$B$19:$Z$41,21,0)*$D15)))),0)","v":0},{"$f":"IFERROR(IF(V$4=\"\",0,IF($E15=\"kWh\",VLOOKUP(V$4,'4. Billing Determinants'!$B$19:$Z$41,4,0)/'4. Billing Determinants'!$E$41*$D15,IF($E15=\"kW\",VLOOKUP(V$4,'4. Billing Determinants'!$B$19:$Z$41,5,0)/'4. Billing Determinants'!$F$41*$D15,IF($E15=\"Non-RPP kWh\",VLOOKUP(V$4,'4. Billing Determinants'!$B$19:$Z$41,6,0)/'4. Billing Determinants'!$G$41*$D15, VLOOKUP(V$4,'4. Billing Determinants'!$B$19:$Z$41,21,0)*$D15)))),0)","v":0},{"$f":"IFERROR(IF(W$4=\"\",0,IF($E15=\"kWh\",VLOOKUP(W$4,'4. Billing Determinants'!$B$19:$Z$41,4,0)/'4. Billing Determinants'!$E$41*$D15,IF($E15=\"kW\",VLOOKUP(W$4,'4. Billing Determinants'!$B$19:$Z$41,5,0)/'4. Billing Determinants'!$F$41*$D15,IF($E15=\"Non-RPP kWh\",VLOOKUP(W$4,'4. Billing Determinants'!$B$19:$Z$41,6,0)/'4. Billing Determinants'!$G$41*$D15, VLOOKUP(W$4,'4. Billing Determinants'!$B$19:$Z$41,21,0)*$D15)))),0)","v":0},{"$f":"IFERROR(IF(X$4=\"\",0,IF($E15=\"kWh\",VLOOKUP(X$4,'4. Billing Determinants'!$B$19:$Z$41,4,0)/'4. Billing Determinants'!$E$41*$D15,IF($E15=\"kW\",VLOOKUP(X$4,'4. Billing Determinants'!$B$19:$Z$41,5,0)/'4. Billing Determinants'!$F$41*$D15,IF($E15=\"Non-RPP kWh\",VLOOKUP(X$4,'4. Billing Determinants'!$B$19:$Z$41,6,0)/'4. Billing Determinants'!$G$41*$D15, VLOOKUP(X$4,'4. Billing Determinants'!$B$19:$Z$41,21,0)*$D15)))),0)","v":0},{"$f":"IFERROR(IF(Y$4=\"\",0,IF($E15=\"kWh\",VLOOKUP(Y$4,'4. Billing Determinants'!$B$19:$Z$41,4,0)/'4. Billing Determinants'!$E$41*$D15,IF($E15=\"kW\",VLOOKUP(Y$4,'4. Billing Determinants'!$B$19:$Z$41,5,0)/'4. Billing Determinants'!$F$41*$D15,IF($E15=\"Non-RPP kWh\",VLOOKUP(Y$4,'4. Billing Determinants'!$B$19:$Z$41,6,0)/'4. Billing Determinants'!$G$41*$D15, VLOOKUP(Y$4,'4. Billing Determinants'!$B$19:$Z$41,21,0)*$D15)))),0)","v":0}]
[null,"Disposition and Recovery/Refund of Regulatory Balances (2012)",1595,{"$f":"'2. 2015 Continuity Schedule'!BS35","v":4.1499999351799488E-3},"%",{"$f":"IFERROR(IF(F$4=\"\",0,IF($E16=\"kWh\",VLOOKUP(F$4,'4. Billing Determinants'!$B$19:$Z$41,4,0)/'4. Billing Determinants'!$E$41*$D16,IF($E16=\"kW\",VLOOKUP(F$4,'4. Billing Determinants'!$B$19:$Z$41,5,0)/'4. Billing Determinants'!$F$41*$D16,IF($E16=\"Non-RPP kWh\",VLOOKUP(F$4,'4. Billing Determinants'!$B$19:$Z$41,6,0)/'4. Billing Determinants'!$G$41*$D16, VLOOKUP(F$4,'4. Billing Determinants'!$B$19:$Z$41,22,0)*$D16)))),0)","v":0},{"$f":"IFERROR(IF(G$4=\"\",0,IF($E16=\"kWh\",VLOOKUP(G$4,'4. Billing Determinants'!$B$19:$Z$41,4,0)/'4. Billing Determinants'!$E$41*$D16,IF($E16=\"kW\",VLOOKUP(G$4,'4. Billing Determinants'!$B$19:$Z$41,5,0)/'4. Billing Determinants'!$F$41*$D16,IF($E16=\"Non-RPP kWh\",VLOOKUP(G$4,'4. Billing Determinants'!$B$19:$Z$41,6,0)/'4. Billing Determinants'!$G$41*$D16, VLOOKUP(G$4,'4. Billing Determinants'!$B$19:$Z$41,22,0)*$D16)))),0)","v":0},{"$f":"IFERROR(IF(H$4=\"\",0,IF($E16=\"kWh\",VLOOKUP(H$4,'4. Billing Determinants'!$B$19:$Z$41,4,0)/'4. Billing Determinants'!$E$41*$D16,IF($E16=\"kW\",VLOOKUP(H$4,'4. Billing Determinants'!$B$19:$Z$41,5,0)/'4. Billing Determinants'!$F$41*$D16,IF($E16=\"Non-RPP kWh\",VLOOKUP(H$4,'4. Billing Determinants'!$B$19:$Z$41,6,0)/'4. Billing Determinants'!$G$41*$D16, VLOOKUP(H$4,'4. Billing Determinants'!$B$19:$Z$41,22,0)*$D16)))),0)","v":0},{"$f":"IFERROR(IF(I$4=\"\",0,IF($E16=\"kWh\",VLOOKUP(I$4,'4. Billing Determinants'!$B$19:$Z$41,4,0)/'4. Billing Determinants'!$E$41*$D16,IF($E16=\"kW\",VLOOKUP(I$4,'4. Billing Determinants'!$B$19:$Z$41,5,0)/'4. Billing Determinants'!$F$41*$D16,IF($E16=\"Non-RPP kWh\",VLOOKUP(I$4,'4. Billing Determinants'!$B$19:$Z$41,6,0)/'4. Billing Determinants'!$G$41*$D16, VLOOKUP(I$4,'4. Billing Determinants'!$B$19:$Z$41,22,0)*$D16)))),0)","v":0},{"$f":"IFERROR(IF(J$4=\"\",0,IF($E16=\"kWh\",VLOOKUP(J$4,'4. Billing Determinants'!$B$19:$Z$41,4,0)/'4. Billing Determinants'!$E$41*$D16,IF($E16=\"kW\",VLOOKUP(J$4,'4. Billing Determinants'!$B$19:$Z$41,5,0)/'4. Billing Determinants'!$F$41*$D16,IF($E16=\"Non-RPP kWh\",VLOOKUP(J$4,'4. Billing Determinants'!$B$19:$Z$41,6,0)/'4. Billing Determinants'!$G$41*$D16, VLOOKUP(J$4,'4. Billing Determinants'!$B$19:$Z$41,22,0)*$D16)))),0)","v":0},{"$f":"IFERROR(IF(K$4=\"\",0,IF($E16=\"kWh\",VLOOKUP(K$4,'4. Billing Determinants'!$B$19:$Z$41,4,0)/'4. Billing Determinants'!$E$41*$D16,IF($E16=\"kW\",VLOOKUP(K$4,'4. Billing Determinants'!$B$19:$Z$41,5,0)/'4. Billing Determinants'!$F$41*$D16,IF($E16=\"Non-RPP kWh\",VLOOKUP(K$4,'4. Billing Determinants'!$B$19:$Z$41,6,0)/'4. Billing Determinants'!$G$41*$D16, VLOOKUP(K$4,'4. Billing Determinants'!$B$19:$Z$41,22,0)*$D16)))),0)","v":0},{"$f":"IFERROR(IF(L$4=\"\",0,IF($E16=\"kWh\",VLOOKUP(L$4,'4. Billing Determinants'!$B$19:$Z$41,4,0)/'4. Billing Determinants'!$E$41*$D16,IF($E16=\"kW\",VLOOKUP(L$4,'4. Billing Determinants'!$B$19:$Z$41,5,0)/'4. Billing Determinants'!$F$41*$D16,IF($E16=\"Non-RPP kWh\",VLOOKUP(L$4,'4. Billing Determinants'!$B$19:$Z$41,6,0)/'4. Billing Determinants'!$G$41*$D16, VLOOKUP(L$4,'4. Billing Determinants'!$B$19:$Z$41,22,0)*$D16)))),0)","v":0},{"$f":"IFERROR(IF(M$4=\"\",0,IF($E16=\"kWh\",VLOOKUP(M$4,'4. Billing Determinants'!$B$19:$Z$41,4,0)/'4. Billing Determinants'!$E$41*$D16,IF($E16=\"kW\",VLOOKUP(M$4,'4. Billing Determinants'!$B$19:$Z$41,5,0)/'4. Billing Determinants'!$F$41*$D16,IF($E16=\"Non-RPP kWh\",VLOOKUP(M$4,'4. Billing Determinants'!$B$19:$Z$41,6,0)/'4. Billing Determinants'!$G$41*$D16, VLOOKUP(M$4,'4. Billing Determinants'!$B$19:$Z$41,22,0)*$D16)))),0)","v":0},{"$f":"IFERROR(IF(N$4=\"\",0,IF($E16=\"kWh\",VLOOKUP(N$4,'4. Billing Determinants'!$B$19:$Z$41,4,0)/'4. Billing Determinants'!$E$41*$D16,IF($E16=\"kW\",VLOOKUP(N$4,'4. Billing Determinants'!$B$19:$Z$41,5,0)/'4. Billing Determinants'!$F$41*$D16,IF($E16=\"Non-RPP kWh\",VLOOKUP(N$4,'4. Billing Determinants'!$B$19:$Z$41,6,0)/'4. Billing Determinants'!$G$41*$D16, VLOOKUP(N$4,'4. Billing Determinants'!$B$19:$Z$41,22,0)*$D16)))),0)","v":0},{"$f":"IFERROR(IF(O$4=\"\",0,IF($E16=\"kWh\",VLOOKUP(O$4,'4. Billing Determinants'!$B$19:$Z$41,4,0)/'4. Billing Determinants'!$E$41*$D16,IF($E16=\"kW\",VLOOKUP(O$4,'4. Billing Determinants'!$B$19:$Z$41,5,0)/'4. Billing Determinants'!$F$41*$D16,IF($E16=\"Non-RPP kWh\",VLOOKUP(O$4,'4. Billing Determinants'!$B$19:$Z$41,6,0)/'4. Billing Determinants'!$G$41*$D16, VLOOKUP(O$4,'4. Billing Determinants'!$B$19:$Z$41,22,0)*$D16)))),0)","v":0},{"$f":"IFERROR(IF(P$4=\"\",0,IF($E16=\"kWh\",VLOOKUP(P$4,'4. Billing Determinants'!$B$19:$Z$41,4,0)/'4. Billing Determinants'!$E$41*$D16,IF($E16=\"kW\",VLOOKUP(P$4,'4. Billing Determinants'!$B$19:$Z$41,5,0)/'4. Billing Determinants'!$F$41*$D16,IF($E16=\"Non-RPP kWh\",VLOOKUP(P$4,'4. Billing Determinants'!$B$19:$Z$41,6,0)/'4. Billing Determinants'!$G$41*$D16, VLOOKUP(P$4,'4. Billing Determinants'!$B$19:$Z$41,22,0)*$D16)))),0)","v":0},{"$f":"IFERROR(IF(Q$4=\"\",0,IF($E16=\"kWh\",VLOOKUP(Q$4,'4. Billing Determinants'!$B$19:$Z$41,4,0)/'4. Billing Determinants'!$E$41*$D16,IF($E16=\"kW\",VLOOKUP(Q$4,'4. Billing Determinants'!$B$19:$Z$41,5,0)/'4. Billing Determinants'!$F$41*$D16,IF($E16=\"Non-RPP kWh\",VLOOKUP(Q$4,'4. Billing Determinants'!$B$19:$Z$41,6,0)/'4. Billing Determinants'!$G$41*$D16, VLOOKUP(Q$4,'4. Billing Determinants'!$B$19:$Z$41,22,0)*$D16)))),0)","v":0},{"$f":"IFERROR(IF(R$4=\"\",0,IF($E16=\"kWh\",VLOOKUP(R$4,'4. Billing Determinants'!$B$19:$Z$41,4,0)/'4. Billing Determinants'!$E$41*$D16,IF($E16=\"kW\",VLOOKUP(R$4,'4. Billing Determinants'!$B$19:$Z$41,5,0)/'4. Billing Determinants'!$F$41*$D16,IF($E16=\"Non-RPP kWh\",VLOOKUP(R$4,'4. Billing Determinants'!$B$19:$Z$41,6,0)/'4. Billing Determinants'!$G$41*$D16, VLOOKUP(R$4,'4. Billing Determinants'!$B$19:$Z$41,22,0)*$D16)))),0)","v":0},{"$f":"IFERROR(IF(S$4=\"\",0,IF($E16=\"kWh\",VLOOKUP(S$4,'4. Billing Determinants'!$B$19:$Z$41,4,0)/'4. Billing Determinants'!$E$41*$D16,IF($E16=\"kW\",VLOOKUP(S$4,'4. Billing Determinants'!$B$19:$Z$41,5,0)/'4. Billing Determinants'!$F$41*$D16,IF($E16=\"Non-RPP kWh\",VLOOKUP(S$4,'4. Billing Determinants'!$B$19:$Z$41,6,0)/'4. Billing Determinants'!$G$41*$D16, VLOOKUP(S$4,'4. Billing Determinants'!$B$19:$Z$41,22,0)*$D16)))),0)","v":0},{"$f":"IFERROR(IF(T$4=\"\",0,IF($E16=\"kWh\",VLOOKUP(T$4,'4. Billing Determinants'!$B$19:$Z$41,4,0)/'4. Billing Determinants'!$E$41*$D16,IF($E16=\"kW\",VLOOKUP(T$4,'4. Billing Determinants'!$B$19:$Z$41,5,0)/'4. Billing Determinants'!$F$41*$D16,IF($E16=\"Non-RPP kWh\",VLOOKUP(T$4,'4. Billing Determinants'!$B$19:$Z$41,6,0)/'4. Billing Determinants'!$G$41*$D16, VLOOKUP(T$4,'4. Billing Determinants'!$B$19:$Z$41,22,0)*$D16)))),0)","v":0},{"$f":"IFERROR(IF(U$4=\"\",0,IF($E16=\"kWh\",VLOOKUP(U$4,'4. Billing Determinants'!$B$19:$Z$41,4,0)/'4. Billing Determinants'!$E$41*$D16,IF($E16=\"kW\",VLOOKUP(U$4,'4. Billing Determinants'!$B$19:$Z$41,5,0)/'4. Billing Determinants'!$F$41*$D16,IF($E16=\"Non-RPP kWh\",VLOOKUP(U$4,'4. Billing Determinants'!$B$19:$Z$41,6,0)/'4. Billing Determinants'!$G$41*$D16, VLOOKUP(U$4,'4. Billing Determinants'!$B$19:$Z$41,22,0)*$D16)))),0)","v":0},{"$f":"IFERROR(IF(V$4=\"\",0,IF($E16=\"kWh\",VLOOKUP(V$4,'4. Billing Determinants'!$B$19:$Z$41,4,0)/'4. Billing Determinants'!$E$41*$D16,IF($E16=\"kW\",VLOOKUP(V$4,'4. Billing Determinants'!$B$19:$Z$41,5,0)/'4. Billing Determinants'!$F$41*$D16,IF($E16=\"Non-RPP kWh\",VLOOKUP(V$4,'4. Billing Determinants'!$B$19:$Z$41,6,0)/'4. Billing Determinants'!$G$41*$D16, VLOOKUP(V$4,'4. Billing Determinants'!$B$19:$Z$41,22,0)*$D16)))),0)","v":0},{"$f":"IFERROR(IF(W$4=\"\",0,IF($E16=\"kWh\",VLOOKUP(W$4,'4. Billing Determinants'!$B$19:$Z$41,4,0)/'4. Billing Determinants'!$E$41*$D16,IF($E16=\"kW\",VLOOKUP(W$4,'4. Billing Determinants'!$B$19:$Z$41,5,0)/'4. Billing Determinants'!$F$41*$D16,IF($E16=\"Non-RPP kWh\",VLOOKUP(W$4,'4. Billing Determinants'!$B$19:$Z$41,6,0)/'4. Billing Determinants'!$G$41*$D16, VLOOKUP(W$4,'4. Billing Determinants'!$B$19:$Z$41,22,0)*$D16)))),0)","v":0},{"$f":"IFERROR(IF(X$4=\"\",0,IF($E16=\"kWh\",VLOOKUP(X$4,'4. Billing Determinants'!$B$19:$Z$41,4,0)/'4. Billing Determinants'!$E$41*$D16,IF($E16=\"kW\",VLOOKUP(X$4,'4. Billing Determinants'!$B$19:$Z$41,5,0)/'4. Billing Determinants'!$F$41*$D16,IF($E16=\"Non-RPP kWh\",VLOOKUP(X$4,'4. Billing Determinants'!$B$19:$Z$41,6,0)/'4. Billing Determinants'!$G$41*$D16, VLOOKUP(X$4,'4. Billing Determinants'!$B$19:$Z$41,22,0)*$D16)))),0)","v":0},{"$f":"IFERROR(IF(Y$4=\"\",0,IF($E16=\"kWh\",VLOOKUP(Y$4,'4. Billing Determinants'!$B$19:$Z$41,4,0)/'4. Billing Determinants'!$E$41*$D16,IF($E16=\"kW\",VLOOKUP(Y$4,'4. Billing Determinants'!$B$19:$Z$41,5,0)/'4. Billing Determinants'!$F$41*$D16,IF($E16=\"Non-RPP kWh\",VLOOKUP(Y$4,'4. Billing Determinants'!$B$19:$Z$41,6,0)/'4. Billing Determinants'!$G$41*$D16, VLOOKUP(Y$4,'4. Billing Determinants'!$B$19:$Z$41,22,0)*$D16)))),0)","v":0}]
[null,"Disposition and Recovery/Refund of Regulatory Balances (2013)",1595,{"$f":"'2. 2015 Continuity Schedule'!BS36","v":-2.7398500951868483E-2},"%",{"$f":"IFERROR(IF(F$4=\"\",0,IF($E17=\"kWh\",VLOOKUP(F$4,'4. Billing Determinants'!$B$19:$Z$41,4,0)/'4. Billing Determinants'!$E$41*$D17,IF($E17=\"kW\",VLOOKUP(F$4,'4. Billing Determinants'!$B$19:$Z$41,5,0)/'4. Billing Determinants'!$F$41*$D17,IF($E17=\"Non-RPP kWh\",VLOOKUP(F$4,'4. Billing Determinants'!$B$19:$Z$41,6,0)/'4. Billing Determinants'!$G$41*$D17, VLOOKUP(F$4,'4. Billing Determinants'!$B$19:$Z$41,23,0)*$D17)))),0)","v":0},{"$f":"IFERROR(IF(G$4=\"\",0,IF($E17=\"kWh\",VLOOKUP(G$4,'4. Billing Determinants'!$B$19:$Z$41,4,0)/'4. Billing Determinants'!$E$41*$D17,IF($E17=\"kW\",VLOOKUP(G$4,'4. Billing Determinants'!$B$19:$Z$41,5,0)/'4. Billing Determinants'!$F$41*$D17,IF($E17=\"Non-RPP kWh\",VLOOKUP(G$4,'4. Billing Determinants'!$B$19:$Z$41,6,0)/'4. Billing Determinants'!$G$41*$D17, VLOOKUP(G$4,'4. Billing Determinants'!$B$19:$Z$41,23,0)*$D17)))),0)","v":0},{"$f":"IFERROR(IF(H$4=\"\",0,IF($E17=\"kWh\",VLOOKUP(H$4,'4. Billing Determinants'!$B$19:$Z$41,4,0)/'4. Billing Determinants'!$E$41*$D17,IF($E17=\"kW\",VLOOKUP(H$4,'4. Billing Determinants'!$B$19:$Z$41,5,0)/'4. Billing Determinants'!$F$41*$D17,IF($E17=\"Non-RPP kWh\",VLOOKUP(H$4,'4. Billing Determinants'!$B$19:$Z$41,6,0)/'4. Billing Determinants'!$G$41*$D17, VLOOKUP(H$4,'4. Billing Determinants'!$B$19:$Z$41,23,0)*$D17)))),0)","v":0},{"$f":"IFERROR(IF(I$4=\"\",0,IF($E17=\"kWh\",VLOOKUP(I$4,'4. Billing Determinants'!$B$19:$Z$41,4,0)/'4. Billing Determinants'!$E$41*$D17,IF($E17=\"kW\",VLOOKUP(I$4,'4. Billing Determinants'!$B$19:$Z$41,5,0)/'4. Billing Determinants'!$F$41*$D17,IF($E17=\"Non-RPP kWh\",VLOOKUP(I$4,'4. Billing Determinants'!$B$19:$Z$41,6,0)/'4. Billing Determinants'!$G$41*$D17, VLOOKUP(I$4,'4. Billing Determinants'!$B$19:$Z$41,23,0)*$D17)))),0)","v":0},{"$f":"IFERROR(IF(J$4=\"\",0,IF($E17=\"kWh\",VLOOKUP(J$4,'4. Billing Determinants'!$B$19:$Z$41,4,0)/'4. Billing Determinants'!$E$41*$D17,IF($E17=\"kW\",VLOOKUP(J$4,'4. Billing Determinants'!$B$19:$Z$41,5,0)/'4. Billing Determinants'!$F$41*$D17,IF($E17=\"Non-RPP kWh\",VLOOKUP(J$4,'4. Billing Determinants'!$B$19:$Z$41,6,0)/'4. Billing Determinants'!$G$41*$D17, VLOOKUP(J$4,'4. Billing Determinants'!$B$19:$Z$41,23,0)*$D17)))),0)","v":0},{"$f":"IFERROR(IF(K$4=\"\",0,IF($E17=\"kWh\",VLOOKUP(K$4,'4. Billing Determinants'!$B$19:$Z$41,4,0)/'4. Billing Determinants'!$E$41*$D17,IF($E17=\"kW\",VLOOKUP(K$4,'4. Billing Determinants'!$B$19:$Z$41,5,0)/'4. Billing Determinants'!$F$41*$D17,IF($E17=\"Non-RPP kWh\",VLOOKUP(K$4,'4. Billing Determinants'!$B$19:$Z$41,6,0)/'4. Billing Determinants'!$G$41*$D17, VLOOKUP(K$4,'4. Billing Determinants'!$B$19:$Z$41,23,0)*$D17)))),0)","v":0},{"$f":"IFERROR(IF(L$4=\"\",0,IF($E17=\"kWh\",VLOOKUP(L$4,'4. Billing Determinants'!$B$19:$Z$41,4,0)/'4. Billing Determinants'!$E$41*$D17,IF($E17=\"kW\",VLOOKUP(L$4,'4. Billing Determinants'!$B$19:$Z$41,5,0)/'4. Billing Determinants'!$F$41*$D17,IF($E17=\"Non-RPP kWh\",VLOOKUP(L$4,'4. Billing Determinants'!$B$19:$Z$41,6,0)/'4. Billing Determinants'!$G$41*$D17, VLOOKUP(L$4,'4. Billing Determinants'!$B$19:$Z$41,23,0)*$D17)))),0)","v":0},{"$f":"IFERROR(IF(M$4=\"\",0,IF($E17=\"kWh\",VLOOKUP(M$4,'4. Billing Determinants'!$B$19:$Z$41,4,0)/'4. Billing Determinants'!$E$41*$D17,IF($E17=\"kW\",VLOOKUP(M$4,'4. Billing Determinants'!$B$19:$Z$41,5,0)/'4. Billing Determinants'!$F$41*$D17,IF($E17=\"Non-RPP kWh\",VLOOKUP(M$4,'4. Billing Determinants'!$B$19:$Z$41,6,0)/'4. Billing Determinants'!$G$41*$D17, VLOOKUP(M$4,'4. Billing Determinants'!$B$19:$Z$41,23,0)*$D17)))),0)","v":0},{"$f":"IFERROR(IF(N$4=\"\",0,IF($E17=\"kWh\",VLOOKUP(N$4,'4. Billing Determinants'!$B$19:$Z$41,4,0)/'4. Billing Determinants'!$E$41*$D17,IF($E17=\"kW\",VLOOKUP(N$4,'4. Billing Determinants'!$B$19:$Z$41,5,0)/'4. Billing Determinants'!$F$41*$D17,IF($E17=\"Non-RPP kWh\",VLOOKUP(N$4,'4. Billing Determinants'!$B$19:$Z$41,6,0)/'4. Billing Determinants'!$G$41*$D17, VLOOKUP(N$4,'4. Billing Determinants'!$B$19:$Z$41,23,0)*$D17)))),0)","v":0},{"$f":"IFERROR(IF(O$4=\"\",0,IF($E17=\"kWh\",VLOOKUP(O$4,'4. Billing Determinants'!$B$19:$Z$41,4,0)/'4. Billing Determinants'!$E$41*$D17,IF($E17=\"kW\",VLOOKUP(O$4,'4. Billing Determinants'!$B$19:$Z$41,5,0)/'4. Billing Determinants'!$F$41*$D17,IF($E17=\"Non-RPP kWh\",VLOOKUP(O$4,'4. Billing Determinants'!$B$19:$Z$41,6,0)/'4. Billing Determinants'!$G$41*$D17, VLOOKUP(O$4,'4. Billing Determinants'!$B$19:$Z$41,23,0)*$D17)))),0)","v":0},{"$f":"IFERROR(IF(P$4=\"\",0,IF($E17=\"kWh\",VLOOKUP(P$4,'4. Billing Determinants'!$B$19:$Z$41,4,0)/'4. Billing Determinants'!$E$41*$D17,IF($E17=\"kW\",VLOOKUP(P$4,'4. Billing Determinants'!$B$19:$Z$41,5,0)/'4. Billing Determinants'!$F$41*$D17,IF($E17=\"Non-RPP kWh\",VLOOKUP(P$4,'4. Billing Determinants'!$B$19:$Z$41,6,0)/'4. Billing Determinants'!$G$41*$D17, VLOOKUP(P$4,'4. Billing Determinants'!$B$19:$Z$41,23,0)*$D17)))),0)","v":0},{"$f":"IFERROR(IF(Q$4=\"\",0,IF($E17=\"kWh\",VLOOKUP(Q$4,'4. Billing Determinants'!$B$19:$Z$41,4,0)/'4. Billing Determinants'!$E$41*$D17,IF($E17=\"kW\",VLOOKUP(Q$4,'4. Billing Determinants'!$B$19:$Z$41,5,0)/'4. Billing Determinants'!$F$41*$D17,IF($E17=\"Non-RPP kWh\",VLOOKUP(Q$4,'4. Billing Determinants'!$B$19:$Z$41,6,0)/'4. Billing Determinants'!$G$41*$D17, VLOOKUP(Q$4,'4. Billing Determinants'!$B$19:$Z$41,23,0)*$D17)))),0)","v":0},{"$f":"IFERROR(IF(R$4=\"\",0,IF($E17=\"kWh\",VLOOKUP(R$4,'4. Billing Determinants'!$B$19:$Z$41,4,0)/'4. Billing Determinants'!$E$41*$D17,IF($E17=\"kW\",VLOOKUP(R$4,'4. Billing Determinants'!$B$19:$Z$41,5,0)/'4. Billing Determinants'!$F$41*$D17,IF($E17=\"Non-RPP kWh\",VLOOKUP(R$4,'4. Billing Determinants'!$B$19:$Z$41,6,0)/'4. Billing Determinants'!$G$41*$D17, VLOOKUP(R$4,'4. Billing Determinants'!$B$19:$Z$41,23,0)*$D17)))),0)","v":0},{"$f":"IFERROR(IF(S$4=\"\",0,IF($E17=\"kWh\",VLOOKUP(S$4,'4. Billing Determinants'!$B$19:$Z$41,4,0)/'4. Billing Determinants'!$E$41*$D17,IF($E17=\"kW\",VLOOKUP(S$4,'4. Billing Determinants'!$B$19:$Z$41,5,0)/'4. Billing Determinants'!$F$41*$D17,IF($E17=\"Non-RPP kWh\",VLOOKUP(S$4,'4. Billing Determinants'!$B$19:$Z$41,6,0)/'4. Billing Determinants'!$G$41*$D17, VLOOKUP(S$4,'4. Billing Determinants'!$B$19:$Z$41,23,0)*$D17)))),0)","v":0},{"$f":"IFERROR(IF(T$4=\"\",0,IF($E17=\"kWh\",VLOOKUP(T$4,'4. Billing Determinants'!$B$19:$Z$41,4,0)/'4. Billing Determinants'!$E$41*$D17,IF($E17=\"kW\",VLOOKUP(T$4,'4. Billing Determinants'!$B$19:$Z$41,5,0)/'4. Billing Determinants'!$F$41*$D17,IF($E17=\"Non-RPP kWh\",VLOOKUP(T$4,'4. Billing Determinants'!$B$19:$Z$41,6,0)/'4. Billing Determinants'!$G$41*$D17, VLOOKUP(T$4,'4. Billing Determinants'!$B$19:$Z$41,23,0)*$D17)))),0)","v":0},{"$f":"IFERROR(IF(U$4=\"\",0,IF($E17=\"kWh\",VLOOKUP(U$4,'4. Billing Determinants'!$B$19:$Z$41,4,0)/'4. Billing Determinants'!$E$41*$D17,IF($E17=\"kW\",VLOOKUP(U$4,'4. Billing Determinants'!$B$19:$Z$41,5,0)/'4. Billing Determinants'!$F$41*$D17,IF($E17=\"Non-RPP kWh\",VLOOKUP(U$4,'4. Billing Determinants'!$B$19:$Z$41,6,0)/'4. Billing Determinants'!$G$41*$D17, VLOOKUP(U$4,'4. Billing Determinants'!$B$19:$Z$41,23,0)*$D17)))),0)","v":0},{"$f":"IFERROR(IF(V$4=\"\",0,IF($E17=\"kWh\",VLOOKUP(V$4,'4. Billing Determinants'!$B$19:$Z$41,4,0)/'4. Billing Determinants'!$E$41*$D17,IF($E17=\"kW\",VLOOKUP(V$4,'4. Billing Determinants'!$B$19:$Z$41,5,0)/'4. Billing Determinants'!$F$41*$D17,IF($E17=\"Non-RPP kWh\",VLOOKUP(V$4,'4. Billing Determinants'!$B$19:$Z$41,6,0)/'4. Billing Determinants'!$G$41*$D17, VLOOKUP(V$4,'4. Billing Determinants'!$B$19:$Z$41,23,0)*$D17)))),0)","v":0},{"$f":"IFERROR(IF(W$4=\"\",0,IF($E17=\"kWh\",VLOOKUP(W$4,'4. Billing Determinants'!$B$19:$Z$41,4,0)/'4. Billing Determinants'!$E$41*$D17,IF($E17=\"kW\",VLOOKUP(W$4,'4. Billing Determinants'!$B$19:$Z$41,5,0)/'4. Billing Determinants'!$F$41*$D17,IF($E17=\"Non-RPP kWh\",VLOOKUP(W$4,'4. Billing Determinants'!$B$19:$Z$41,6,0)/'4. Billing Determinants'!$G$41*$D17, VLOOKUP(W$4,'4. Billing Determinants'!$B$19:$Z$41,23,0)*$D17)))),0)","v":0},{"$f":"IFERROR(IF(X$4=\"\",0,IF($E17=\"kWh\",VLOOKUP(X$4,'4. Billing Determinants'!$B$19:$Z$41,4,0)/'4. Billing Determinants'!$E$41*$D17,IF($E17=\"kW\",VLOOKUP(X$4,'4. Billing Determinants'!$B$19:$Z$41,5,0)/'4. Billing Determinants'!$F$41*$D17,IF($E17=\"Non-RPP kWh\",VLOOKUP(X$4,'4. Billing Determinants'!$B$19:$Z$41,6,0)/'4. Billing Determinants'!$G$41*$D17, VLOOKUP(X$4,'4. Billing Determinants'!$B$19:$Z$41,23,0)*$D17)))),0)","v":0},{"$f":"IFERROR(IF(Y$4=\"\",0,IF($E17=\"kWh\",VLOOKUP(Y$4,'4. Billing Determinants'!$B$19:$Z$41,4,0)/'4. Billing Determinants'!$E$41*$D17,IF($E17=\"kW\",VLOOKUP(Y$4,'4. Billing Determinants'!$B$19:$Z$41,5,0)/'4. Billing Determinants'!$F$41*$D17,IF($E17=\"Non-RPP kWh\",VLOOKUP(Y$4,'4. Billing Determinants'!$B$19:$Z$41,6,0)/'4. Billing Determinants'!$G$41*$D17, VLOOKUP(Y$4,'4. Billing Determinants'!$B$19:$Z$41,23,0)*$D17)))),0)","v":0}]
[null,"Disposition and Recovery/Refund of Regulatory Balances (2014)",1595,{"$f":"'2. 2015 Continuity Schedule'!BS37","v":72324.014720899824},"kWh",{"$f":"IFERROR(IF(F$4=\"\",0,IF($E18=\"kWh\",VLOOKUP(F$4,'4. Billing Determinants'!$B$19:$Z$41,4,0)/'4. Billing Determinants'!$E$41*$D18,IF($E18=\"kW\",VLOOKUP(F$4,'4. Billing Determinants'!$B$19:$Z$41,5,0)/'4. Billing Determinants'!$F$41*$D18,IF($E18=\"Non-RPP kWh\",VLOOKUP(F$4,'4. Billing Determinants'!$B$19:$Z$41,6,0)/'4. Billing Determinants'!$G$41*$D18, VLOOKUP(F$4,'4. Billing Determinants'!$B$19:$Z$41,24,0)*$D18)))),0)","v":21392.481323265176},{"$f":"IFERROR(IF(G$4=\"\",0,IF($E18=\"kWh\",VLOOKUP(G$4,'4. Billing Determinants'!$B$19:$Z$41,4,0)/'4. Billing Determinants'!$E$41*$D18,IF($E18=\"kW\",VLOOKUP(G$4,'4. Billing Determinants'!$B$19:$Z$41,5,0)/'4. Billing Determinants'!$F$41*$D18,IF($E18=\"Non-RPP kWh\",VLOOKUP(G$4,'4. Billing Determinants'!$B$19:$Z$41,6,0)/'4. Billing Determinants'!$G$41*$D18, VLOOKUP(G$4,'4. Billing Determinants'!$B$19:$Z$41,24,0)*$D18)))),0)","v":7731.6609066456267},{"$f":"IFERROR(IF(H$4=\"\",0,IF($E18=\"kWh\",VLOOKUP(H$4,'4. Billing Determinants'!$B$19:$Z$41,4,0)/'4. Billing Determinants'!$E$41*$D18,IF($E18=\"kW\",VLOOKUP(H$4,'4. Billing Determinants'!$B$19:$Z$41,5,0)/'4. Billing Determinants'!$F$41*$D18,IF($E18=\"Non-RPP kWh\",VLOOKUP(H$4,'4. Billing Determinants'!$B$19:$Z$41,6,0)/'4. Billing Determinants'!$G$41*$D18, VLOOKUP(H$4,'4. Billing Determinants'!$B$19:$Z$41,24,0)*$D18)))),0)","v":24269.465426503109},{"$f":"IFERROR(IF(I$4=\"\",0,IF($E18=\"kWh\",VLOOKUP(I$4,'4. Billing Determinants'!$B$19:$Z$41,4,0)/'4. Billing Determinants'!$E$41*$D18,IF($E18=\"kW\",VLOOKUP(I$4,'4. Billing Determinants'!$B$19:$Z$41,5,0)/'4. Billing Determinants'!$F$41*$D18,IF($E18=\"Non-RPP kWh\",VLOOKUP(I$4,'4. Billing Determinants'!$B$19:$Z$41,6,0)/'4. Billing Determinants'!$G$41*$D18, VLOOKUP(I$4,'4. Billing Determinants'!$B$19:$Z$41,24,0)*$D18)))),0)","v":3502.6647488359558},{"$f":"IFERROR(IF(J$4=\"\",0,IF($E18=\"kWh\",VLOOKUP(J$4,'4. Billing Determinants'!$B$19:$Z$41,4,0)/'4. Billing Determinants'!$E$41*$D18,IF($E18=\"kW\",VLOOKUP(J$4,'4. Billing Determinants'!$B$19:$Z$41,5,0)/'4. Billing Determinants'!$F$41*$D18,IF($E18=\"Non-RPP kWh\",VLOOKUP(J$4,'4. Billing Determinants'!$B$19:$Z$41,6,0)/'4. Billing Determinants'!$G$41*$D18, VLOOKUP(J$4,'4. Billing Determinants'!$B$19:$Z$41,24,0)*$D18)))),0)","v":14758.915944875798},{"$f":"IFERROR(IF(K$4=\"\",0,IF($E18=\"kWh\",VLOOKUP(K$4,'4. Billing Determinants'!$B$19:$Z$41,4,0)/'4. Billing Determinants'!$E$41*$D18,IF($E18=\"kW\",VLOOKUP(K$4,'4. Billing Determinants'!$B$19:$Z$41,5,0)/'4. Billing Determinants'!$F$41*$D18,IF($E18=\"Non-RPP kWh\",VLOOKUP(K$4,'4. Billing Determinants'!$B$19:$Z$41,6,0)/'4. Billing Determinants'!$G$41*$D18, VLOOKUP(K$4,'4. Billing Determinants'!$B$19:$Z$41,24,0)*$D18)))),0)","v":145.98228419165758},{"$f":"IFERROR(IF(L$4=\"\",0,IF($E18=\"kWh\",VLOOKUP(L$4,'4. Billing Determinants'!$B$19:$Z$41,4,0)/'4. Billing Determinants'!$E$41*$D18,IF($E18=\"kW\",VLOOKUP(L$4,'4. Billing Determinants'!$B$19:$Z$41,5,0)/'4. Billing Determinants'!$F$41*$D18,IF($E18=\"Non-RPP kWh\",VLOOKUP(L$4,'4. Billing Determinants'!$B$19:$Z$41,6,0)/'4. Billing Determinants'!$G$41*$D18, VLOOKUP(L$4,'4. Billing Determinants'!$B$19:$Z$41,24,0)*$D18)))),0)","v":5.4735908025820246},{"$f":"IFERROR(IF(M$4=\"\",0,IF($E18=\"kWh\",VLOOKUP(M$4,'4. Billing Determinants'!$B$19:$Z$41,4,0)/'4. Billing Determinants'!$E$41*$D18,IF($E18=\"kW\",VLOOKUP(M$4,'4. Billing Determinants'!$B$19:$Z$41,5,0)/'4. Billing Determinants'!$F$41*$D18,IF($E18=\"Non-RPP kWh\",VLOOKUP(M$4,'4. Billing Determinants'!$B$19:$Z$41,6,0)/'4. Billing Determinants'!$G$41*$D18, VLOOKUP(M$4,'4. Billing Determinants'!$B$19:$Z$41,24,0)*$D18)))),0)","v":517.37049577993116},{"$f":"IFERROR(IF(N$4=\"\",0,IF($E18=\"kWh\",VLOOKUP(N$4,'4. Billing Determinants'!$B$19:$Z$41,4,0)/'4. Billing Determinants'!$E$41*$D18,IF($E18=\"kW\",VLOOKUP(N$4,'4. Billing Determinants'!$B$19:$Z$41,5,0)/'4. Billing Determinants'!$F$41*$D18,IF($E18=\"Non-RPP kWh\",VLOOKUP(N$4,'4. Billing Determinants'!$B$19:$Z$41,6,0)/'4. Billing Determinants'!$G$41*$D18, VLOOKUP(N$4,'4. Billing Determinants'!$B$19:$Z$41,24,0)*$D18)))),0)","v":0},{"$f":"IFERROR(IF(O$4=\"\",0,IF($E18=\"kWh\",VLOOKUP(O$4,'4. Billing Determinants'!$B$19:$Z$41,4,0)/'4. Billing Determinants'!$E$41*$D18,IF($E18=\"kW\",VLOOKUP(O$4,'4. Billing Determinants'!$B$19:$Z$41,5,0)/'4. Billing Determinants'!$F$41*$D18,IF($E18=\"Non-RPP kWh\",VLOOKUP(O$4,'4. Billing Determinants'!$B$19:$Z$41,6,0)/'4. Billing Determinants'!$G$41*$D18, VLOOKUP(O$4,'4. Billing Determinants'!$B$19:$Z$41,24,0)*$D18)))),0)","v":0},{"$f":"IFERROR(IF(P$4=\"\",0,IF($E18=\"kWh\",VLOOKUP(P$4,'4. Billing Determinants'!$B$19:$Z$41,4,0)/'4. Billing Determinants'!$E$41*$D18,IF($E18=\"kW\",VLOOKUP(P$4,'4. Billing Determinants'!$B$19:$Z$41,5,0)/'4. Billing Determinants'!$F$41*$D18,IF($E18=\"Non-RPP kWh\",VLOOKUP(P$4,'4. Billing Determinants'!$B$19:$Z$41,6,0)/'4. Billing Determinants'!$G$41*$D18, VLOOKUP(P$4,'4. Billing Determinants'!$B$19:$Z$41,24,0)*$D18)))),0)","v":0},{"$f":"IFERROR(IF(Q$4=\"\",0,IF($E18=\"kWh\",VLOOKUP(Q$4,'4. Billing Determinants'!$B$19:$Z$41,4,0)/'4. Billing Determinants'!$E$41*$D18,IF($E18=\"kW\",VLOOKUP(Q$4,'4. Billing Determinants'!$B$19:$Z$41,5,0)/'4. Billing Determinants'!$F$41*$D18,IF($E18=\"Non-RPP kWh\",VLOOKUP(Q$4,'4. Billing Determinants'!$B$19:$Z$41,6,0)/'4. Billing Determinants'!$G$41*$D18, VLOOKUP(Q$4,'4. Billing Determinants'!$B$19:$Z$41,24,0)*$D18)))),0)","v":0},{"$f":"IFERROR(IF(R$4=\"\",0,IF($E18=\"kWh\",VLOOKUP(R$4,'4. Billing Determinants'!$B$19:$Z$41,4,0)/'4. Billing Determinants'!$E$41*$D18,IF($E18=\"kW\",VLOOKUP(R$4,'4. Billing Determinants'!$B$19:$Z$41,5,0)/'4. Billing Determinants'!$F$41*$D18,IF($E18=\"Non-RPP kWh\",VLOOKUP(R$4,'4. Billing Determinants'!$B$19:$Z$41,6,0)/'4. Billing Determinants'!$G$41*$D18, VLOOKUP(R$4,'4. Billing Determinants'!$B$19:$Z$41,24,0)*$D18)))),0)","v":0},{"$f":"IFERROR(IF(S$4=\"\",0,IF($E18=\"kWh\",VLOOKUP(S$4,'4. Billing Determinants'!$B$19:$Z$41,4,0)/'4. Billing Determinants'!$E$41*$D18,IF($E18=\"kW\",VLOOKUP(S$4,'4. Billing Determinants'!$B$19:$Z$41,5,0)/'4. Billing Determinants'!$F$41*$D18,IF($E18=\"Non-RPP kWh\",VLOOKUP(S$4,'4. Billing Determinants'!$B$19:$Z$41,6,0)/'4. Billing Determinants'!$G$41*$D18, VLOOKUP(S$4,'4. Billing Determinants'!$B$19:$Z$41,24,0)*$D18)))),0)","v":0},{"$f":"IFERROR(IF(T$4=\"\",0,IF($E18=\"kWh\",VLOOKUP(T$4,'4. Billing Determinants'!$B$19:$Z$41,4,0)/'4. Billing Determinants'!$E$41*$D18,IF($E18=\"kW\",VLOOKUP(T$4,'4. Billing Determinants'!$B$19:$Z$41,5,0)/'4. Billing Determinants'!$F$41*$D18,IF($E18=\"Non-RPP kWh\",VLOOKUP(T$4,'4. Billing Determinants'!$B$19:$Z$41,6,0)/'4. Billing Determinants'!$G$41*$D18, VLOOKUP(T$4,'4. Billing Determinants'!$B$19:$Z$41,24,0)*$D18)))),0)","v":0},{"$f":"IFERROR(IF(U$4=\"\",0,IF($E18=\"kWh\",VLOOKUP(U$4,'4. Billing Determinants'!$B$19:$Z$41,4,0)/'4. Billing Determinants'!$E$41*$D18,IF($E18=\"kW\",VLOOKUP(U$4,'4. Billing Determinants'!$B$19:$Z$41,5,0)/'4. Billing Determinants'!$F$41*$D18,IF($E18=\"Non-RPP kWh\",VLOOKUP(U$4,'4. Billing Determinants'!$B$19:$Z$41,6,0)/'4. Billing Determinants'!$G$41*$D18, VLOOKUP(U$4,'4. Billing Determinants'!$B$19:$Z$41,24,0)*$D18)))),0)","v":0},{"$f":"IFERROR(IF(V$4=\"\",0,IF($E18=\"kWh\",VLOOKUP(V$4,'4. Billing Determinants'!$B$19:$Z$41,4,0)/'4. Billing Determinants'!$E$41*$D18,IF($E18=\"kW\",VLOOKUP(V$4,'4. Billing Determinants'!$B$19:$Z$41,5,0)/'4. Billing Determinants'!$F$41*$D18,IF($E18=\"Non-RPP kWh\",VLOOKUP(V$4,'4. Billing Determinants'!$B$19:$Z$41,6,0)/'4. Billing Determinants'!$G$41*$D18, VLOOKUP(V$4,'4. Billing Determinants'!$B$19:$Z$41,24,0)*$D18)))),0)","v":0},{"$f":"IFERROR(IF(W$4=\"\",0,IF($E18=\"kWh\",VLOOKUP(W$4,'4. Billing Determinants'!$B$19:$Z$41,4,0)/'4. Billing Determinants'!$E$41*$D18,IF($E18=\"kW\",VLOOKUP(W$4,'4. Billing Determinants'!$B$19:$Z$41,5,0)/'4. Billing Determinants'!$F$41*$D18,IF($E18=\"Non-RPP kWh\",VLOOKUP(W$4,'4. Billing Determinants'!$B$19:$Z$41,6,0)/'4. Billing Determinants'!$G$41*$D18, VLOOKUP(W$4,'4. Billing Determinants'!$B$19:$Z$41,24,0)*$D18)))),0)","v":0},{"$f":"IFERROR(IF(X$4=\"\",0,IF($E18=\"kWh\",VLOOKUP(X$4,'4. Billing Determinants'!$B$19:$Z$41,4,0)/'4. Billing Determinants'!$E$41*$D18,IF($E18=\"kW\",VLOOKUP(X$4,'4. Billing Determinants'!$B$19:$Z$41,5,0)/'4. Billing Determinants'!$F$41*$D18,IF($E18=\"Non-RPP kWh\",VLOOKUP(X$4,'4. Billing Determinants'!$B$19:$Z$41,6,0)/'4. Billing Determinants'!$G$41*$D18, VLOOKUP(X$4,'4. Billing Determinants'!$B$19:$Z$41,24,0)*$D18)))),0)","v":0},{"$f":"IFERROR(IF(Y$4=\"\",0,IF($E18=\"kWh\",VLOOKUP(Y$4,'4. Billing Determinants'!$B$19:$Z$41,4,0)/'4. Billing Determinants'!$E$41*$D18,IF($E18=\"kW\",VLOOKUP(Y$4,'4. Billing Determinants'!$B$19:$Z$41,5,0)/'4. Billing Determinants'!$F$41*$D18,IF($E18=\"Non-RPP kWh\",VLOOKUP(Y$4,'4. Billing Determinants'!$B$19:$Z$41,6,0)/'4. Billing Determinants'!$G$41*$D18, VLOOKUP(Y$4,'4. Billing Determinants'!$B$19:$Z$41,24,0)*$D18)))),0)","v":0}]
[null,"Total of Group 1 Accounts (excluding 1589)",null,{"$f":"SUM(D5:D18)-D11","v":2530366.1458164416},null,{"$f":"SUM(F5:F18)-F11","v":537131.4871945238},199037.32021835766,635890.11848304234,124057.25341660705,1016905.2397072035,3785.7546486593228,141.94648303028808,13416.955148520559,0,0,0,0,0,0,0,0,0,0,0,0]
[]
[null,"Other Regulatory Assets - Sub-Account - Deferred IFRS Transition Costs",1508,{"$f":"'2. 2015 Continuity Schedule'!BS44","v":0},"kWh",{"$f":"IFERROR(IF(F$4=\"\",0,IF($E21=\"kWh\",VLOOKUP(F$4,'4. Billing Determinants'!$B$19:$Z$41,4,0)/'4. Billing Determinants'!$E$41*$D21,IF($E21=\"kW\",VLOOKUP(F$4,'4. Billing Determinants'!$B$19:$Z$41,5,0)/'4. Billing Determinants'!$F$41*$D21,IF($E21=\"Non-RPP kWh\",VLOOKUP(F$4,'4. Billing Determinants'!$B$19:$Z$41,6,0)/'4. Billing Determinants'!$G$41*$D21,IF($E21=\"Distribution Rev.\",VLOOKUP(F$4,'4. Billing Determinants'!$B$19:$Z$41,8,0)/'4. Billing Determinants'!$I$41*$D21, VLOOKUP(F$4,'4. Billing Determinants'!$B$19:$Z$41,3,0)/'4. Billing Determinants'!$D$41*$D21))))),0)","v":0},{"$f":"IFERROR(IF(G$4=\"\",0,IF($E21=\"kWh\",VLOOKUP(G$4,'4. Billing Determinants'!$B$19:$Z$41,4,0)/'4. Billing Determinants'!$E$41*$D21,IF($E21=\"kW\",VLOOKUP(G$4,'4. Billing Determinants'!$B$19:$Z$41,5,0)/'4. Billing Determinants'!$F$41*$D21,IF($E21=\"Non-RPP kWh\",VLOOKUP(G$4,'4. Billing Determinants'!$B$19:$Z$41,6,0)/'4. Billing Determinants'!$G$41*$D21,IF($E21=\"Distribution Rev.\",VLOOKUP(G$4,'4. Billing Determinants'!$B$19:$Z$41,8,0)/'4. Billing Determinants'!$I$41*$D21, VLOOKUP(G$4,'4. Billing Determinants'!$B$19:$Z$41,3,0)/'4. Billing Determinants'!$D$41*$D21))))),0)","v":0},{"$f":"IFERROR(IF(H$4=\"\",0,IF($E21=\"kWh\",VLOOKUP(H$4,'4. Billing Determinants'!$B$19:$Z$41,4,0)/'4. Billing Determinants'!$E$41*$D21,IF($E21=\"kW\",VLOOKUP(H$4,'4. Billing Determinants'!$B$19:$Z$41,5,0)/'4. Billing Determinants'!$F$41*$D21,IF($E21=\"Non-RPP kWh\",VLOOKUP(H$4,'4. Billing Determinants'!$B$19:$Z$41,6,0)/'4. Billing Determinants'!$G$41*$D21,IF($E21=\"Distribution Rev.\",VLOOKUP(H$4,'4. Billing Determinants'!$B$19:$Z$41,8,0)/'4. Billing Determinants'!$I$41*$D21, VLOOKUP(H$4,'4. Billing Determinants'!$B$19:$Z$41,3,0)/'4. Billing Determinants'!$D$41*$D21))))),0)","v":0},{"$f":"IFERROR(IF(I$4=\"\",0,IF($E21=\"kWh\",VLOOKUP(I$4,'4. Billing Determinants'!$B$19:$Z$41,4,0)/'4. Billing Determinants'!$E$41*$D21,IF($E21=\"kW\",VLOOKUP(I$4,'4. Billing Determinants'!$B$19:$Z$41,5,0)/'4. Billing Determinants'!$F$41*$D21,IF($E21=\"Non-RPP kWh\",VLOOKUP(I$4,'4. Billing Determinants'!$B$19:$Z$41,6,0)/'4. Billing Determinants'!$G$41*$D21,IF($E21=\"Distribution Rev.\",VLOOKUP(I$4,'4. Billing Determinants'!$B$19:$Z$41,8,0)/'4. Billing Determinants'!$I$41*$D21, VLOOKUP(I$4,'4. Billing Determinants'!$B$19:$Z$41,3,0)/'4. Billing Determinants'!$D$41*$D21))))),0)","v":0},{"$f":"IFERROR(IF(J$4=\"\",0,IF($E21=\"kWh\",VLOOKUP(J$4,'4. Billing Determinants'!$B$19:$Z$41,4,0)/'4. Billing Determinants'!$E$41*$D21,IF($E21=\"kW\",VLOOKUP(J$4,'4. Billing Determinants'!$B$19:$Z$41,5,0)/'4. Billing Determinants'!$F$41*$D21,IF($E21=\"Non-RPP kWh\",VLOOKUP(J$4,'4. Billing Determinants'!$B$19:$Z$41,6,0)/'4. Billing Determinants'!$G$41*$D21,IF($E21=\"Distribution Rev.\",VLOOKUP(J$4,'4. Billing Determinants'!$B$19:$Z$41,8,0)/'4. Billing Determinants'!$I$41*$D21, VLOOKUP(J$4,'4. Billing Determinants'!$B$19:$Z$41,3,0)/'4. Billing Determinants'!$D$41*$D21))))),0)","v":0},{"$f":"IFERROR(IF(K$4=\"\",0,IF($E21=\"kWh\",VLOOKUP(K$4,'4. Billing Determinants'!$B$19:$Z$41,4,0)/'4. Billing Determinants'!$E$41*$D21,IF($E21=\"kW\",VLOOKUP(K$4,'4. Billing Determinants'!$B$19:$Z$41,5,0)/'4. Billing Determinants'!$F$41*$D21,IF($E21=\"Non-RPP kWh\",VLOOKUP(K$4,'4. Billing Determinants'!$B$19:$Z$41,6,0)/'4. Billing Determinants'!$G$41*$D21,IF($E21=\"Distribution Rev.\",VLOOKUP(K$4,'4. Billing Determinants'!$B$19:$Z$41,8,0)/'4. Billing Determinants'!$I$41*$D21, VLOOKUP(K$4,'4. Billing Determinants'!$B$19:$Z$41,3,0)/'4. Billing Determinants'!$D$41*$D21))))),0)","v":0},{"$f":"IFERROR(IF(L$4=\"\",0,IF($E21=\"kWh\",VLOOKUP(L$4,'4. Billing Determinants'!$B$19:$Z$41,4,0)/'4. Billing Determinants'!$E$41*$D21,IF($E21=\"kW\",VLOOKUP(L$4,'4. Billing Determinants'!$B$19:$Z$41,5,0)/'4. Billing Determinants'!$F$41*$D21,IF($E21=\"Non-RPP kWh\",VLOOKUP(L$4,'4. Billing Determinants'!$B$19:$Z$41,6,0)/'4. Billing Determinants'!$G$41*$D21,IF($E21=\"Distribution Rev.\",VLOOKUP(L$4,'4. Billing Determinants'!$B$19:$Z$41,8,0)/'4. Billing Determinants'!$I$41*$D21, VLOOKUP(L$4,'4. Billing Determinants'!$B$19:$Z$41,3,0)/'4. Billing Determinants'!$D$41*$D21))))),0)","v":0},{"$f":"IFERROR(IF(M$4=\"\",0,IF($E21=\"kWh\",VLOOKUP(M$4,'4. Billing Determinants'!$B$19:$Z$41,4,0)/'4. Billing Determinants'!$E$41*$D21,IF($E21=\"kW\",VLOOKUP(M$4,'4. Billing Determinants'!$B$19:$Z$41,5,0)/'4. Billing Determinants'!$F$41*$D21,IF($E21=\"Non-RPP kWh\",VLOOKUP(M$4,'4. Billing Determinants'!$B$19:$Z$41,6,0)/'4. Billing Determinants'!$G$41*$D21,IF($E21=\"Distribution Rev.\",VLOOKUP(M$4,'4. Billing Determinants'!$B$19:$Z$41,8,0)/'4. Billing Determinants'!$I$41*$D21, VLOOKUP(M$4,'4. Billing Determinants'!$B$19:$Z$41,3,0)/'4. Billing Determinants'!$D$41*$D21))))),0)","v":0},{"$f":"IFERROR(IF(N$4=\"\",0,IF($E21=\"kWh\",VLOOKUP(N$4,'4. Billing Determinants'!$B$19:$Z$41,4,0)/'4. Billing Determinants'!$E$41*$D21,IF($E21=\"kW\",VLOOKUP(N$4,'4. Billing Determinants'!$B$19:$Z$41,5,0)/'4. Billing Determinants'!$F$41*$D21,IF($E21=\"Non-RPP kWh\",VLOOKUP(N$4,'4. Billing Determinants'!$B$19:$Z$41,6,0)/'4. Billing Determinants'!$G$41*$D21,IF($E21=\"Distribution Rev.\",VLOOKUP(N$4,'4. Billing Determinants'!$B$19:$Z$41,8,0)/'4. Billing Determinants'!$I$41*$D21, VLOOKUP(N$4,'4. Billing Determinants'!$B$19:$Z$41,3,0)/'4. Billing Determinants'!$D$41*$D21))))),0)","v":0},{"$f":"IFERROR(IF(O$4=\"\",0,IF($E21=\"kWh\",VLOOKUP(O$4,'4. Billing Determinants'!$B$19:$Z$41,4,0)/'4. Billing Determinants'!$E$41*$D21,IF($E21=\"kW\",VLOOKUP(O$4,'4. Billing Determinants'!$B$19:$Z$41,5,0)/'4. Billing Determinants'!$F$41*$D21,IF($E21=\"Non-RPP kWh\",VLOOKUP(O$4,'4. Billing Determinants'!$B$19:$Z$41,6,0)/'4. Billing Determinants'!$G$41*$D21,IF($E21=\"Distribution Rev.\",VLOOKUP(O$4,'4. Billing Determinants'!$B$19:$Z$41,8,0)/'4. Billing Determinants'!$I$41*$D21, VLOOKUP(O$4,'4. Billing Determinants'!$B$19:$Z$41,3,0)/'4. Billing Determinants'!$D$41*$D21))))),0)","v":0},{"$f":"IFERROR(IF(P$4=\"\",0,IF($E21=\"kWh\",VLOOKUP(P$4,'4. Billing Determinants'!$B$19:$Z$41,4,0)/'4. Billing Determinants'!$E$41*$D21,IF($E21=\"kW\",VLOOKUP(P$4,'4. Billing Determinants'!$B$19:$Z$41,5,0)/'4. Billing Determinants'!$F$41*$D21,IF($E21=\"Non-RPP kWh\",VLOOKUP(P$4,'4. Billing Determinants'!$B$19:$Z$41,6,0)/'4. Billing Determinants'!$G$41*$D21,IF($E21=\"Distribution Rev.\",VLOOKUP(P$4,'4. Billing Determinants'!$B$19:$Z$41,8,0)/'4. Billing Determinants'!$I$41*$D21, VLOOKUP(P$4,'4. Billing Determinants'!$B$19:$Z$41,3,0)/'4. Billing Determinants'!$D$41*$D21))))),0)","v":0},{"$f":"IFERROR(IF(Q$4=\"\",0,IF($E21=\"kWh\",VLOOKUP(Q$4,'4. Billing Determinants'!$B$19:$Z$41,4,0)/'4. Billing Determinants'!$E$41*$D21,IF($E21=\"kW\",VLOOKUP(Q$4,'4. Billing Determinants'!$B$19:$Z$41,5,0)/'4. Billing Determinants'!$F$41*$D21,IF($E21=\"Non-RPP kWh\",VLOOKUP(Q$4,'4. Billing Determinants'!$B$19:$Z$41,6,0)/'4. Billing Determinants'!$G$41*$D21,IF($E21=\"Distribution Rev.\",VLOOKUP(Q$4,'4. Billing Determinants'!$B$19:$Z$41,8,0)/'4. Billing Determinants'!$I$41*$D21, VLOOKUP(Q$4,'4. Billing Determinants'!$B$19:$Z$41,3,0)/'4. Billing Determinants'!$D$41*$D21))))),0)","v":0},{"$f":"IFERROR(IF(R$4=\"\",0,IF($E21=\"kWh\",VLOOKUP(R$4,'4. Billing Determinants'!$B$19:$Z$41,4,0)/'4. Billing Determinants'!$E$41*$D21,IF($E21=\"kW\",VLOOKUP(R$4,'4. Billing Determinants'!$B$19:$Z$41,5,0)/'4. Billing Determinants'!$F$41*$D21,IF($E21=\"Non-RPP kWh\",VLOOKUP(R$4,'4. Billing Determinants'!$B$19:$Z$41,6,0)/'4. Billing Determinants'!$G$41*$D21,IF($E21=\"Distribution Rev.\",VLOOKUP(R$4,'4. Billing Determinants'!$B$19:$Z$41,8,0)/'4. Billing Determinants'!$I$41*$D21, VLOOKUP(R$4,'4. Billing Determinants'!$B$19:$Z$41,3,0)/'4. Billing Determinants'!$D$41*$D21))))),0)","v":0},{"$f":"IFERROR(IF(S$4=\"\",0,IF($E21=\"kWh\",VLOOKUP(S$4,'4. Billing Determinants'!$B$19:$Z$41,4,0)/'4. Billing Determinants'!$E$41*$D21,IF($E21=\"kW\",VLOOKUP(S$4,'4. Billing Determinants'!$B$19:$Z$41,5,0)/'4. Billing Determinants'!$F$41*$D21,IF($E21=\"Non-RPP kWh\",VLOOKUP(S$4,'4. Billing Determinants'!$B$19:$Z$41,6,0)/'4. Billing Determinants'!$G$41*$D21,IF($E21=\"Distribution Rev.\",VLOOKUP(S$4,'4. Billing Determinants'!$B$19:$Z$41,8,0)/'4. Billing Determinants'!$I$41*$D21, VLOOKUP(S$4,'4. Billing Determinants'!$B$19:$Z$41,3,0)/'4. Billing Determinants'!$D$41*$D21))))),0)","v":0},{"$f":"IFERROR(IF(T$4=\"\",0,IF($E21=\"kWh\",VLOOKUP(T$4,'4. Billing Determinants'!$B$19:$Z$41,4,0)/'4. Billing Determinants'!$E$41*$D21,IF($E21=\"kW\",VLOOKUP(T$4,'4. Billing Determinants'!$B$19:$Z$41,5,0)/'4. Billing Determinants'!$F$41*$D21,IF($E21=\"Non-RPP kWh\",VLOOKUP(T$4,'4. Billing Determinants'!$B$19:$Z$41,6,0)/'4. Billing Determinants'!$G$41*$D21,IF($E21=\"Distribution Rev.\",VLOOKUP(T$4,'4. Billing Determinants'!$B$19:$Z$41,8,0)/'4. Billing Determinants'!$I$41*$D21, VLOOKUP(T$4,'4. Billing Determinants'!$B$19:$Z$41,3,0)/'4. Billing Determinants'!$D$41*$D21))))),0)","v":0},{"$f":"IFERROR(IF(U$4=\"\",0,IF($E21=\"kWh\",VLOOKUP(U$4,'4. Billing Determinants'!$B$19:$Z$41,4,0)/'4. Billing Determinants'!$E$41*$D21,IF($E21=\"kW\",VLOOKUP(U$4,'4. Billing Determinants'!$B$19:$Z$41,5,0)/'4. Billing Determinants'!$F$41*$D21,IF($E21=\"Non-RPP kWh\",VLOOKUP(U$4,'4. Billing Determinants'!$B$19:$Z$41,6,0)/'4. Billing Determinants'!$G$41*$D21,IF($E21=\"Distribution Rev.\",VLOOKUP(U$4,'4. Billing Determinants'!$B$19:$Z$41,8,0)/'4. Billing Determinants'!$I$41*$D21, VLOOKUP(U$4,'4. Billing Determinants'!$B$19:$Z$41,3,0)/'4. Billing Determinants'!$D$41*$D21))))),0)","v":0},{"$f":"IFERROR(IF(V$4=\"\",0,IF($E21=\"kWh\",VLOOKUP(V$4,'4. Billing Determinants'!$B$19:$Z$41,4,0)/'4. Billing Determinants'!$E$41*$D21,IF($E21=\"kW\",VLOOKUP(V$4,'4. Billing Determinants'!$B$19:$Z$41,5,0)/'4. Billing Determinants'!$F$41*$D21,IF($E21=\"Non-RPP kWh\",VLOOKUP(V$4,'4. Billing Determinants'!$B$19:$Z$41,6,0)/'4. Billing Determinants'!$G$41*$D21,IF($E21=\"Distribution Rev.\",VLOOKUP(V$4,'4. Billing Determinants'!$B$19:$Z$41,8,0)/'4. Billing Determinants'!$I$41*$D21, VLOOKUP(V$4,'4. Billing Determinants'!$B$19:$Z$41,3,0)/'4. Billing Determinants'!$D$41*$D21))))),0)","v":0},{"$f":"IFERROR(IF(W$4=\"\",0,IF($E21=\"kWh\",VLOOKUP(W$4,'4. Billing Determinants'!$B$19:$Z$41,4,0)/'4. Billing Determinants'!$E$41*$D21,IF($E21=\"kW\",VLOOKUP(W$4,'4. Billing Determinants'!$B$19:$Z$41,5,0)/'4. Billing Determinants'!$F$41*$D21,IF($E21=\"Non-RPP kWh\",VLOOKUP(W$4,'4. Billing Determinants'!$B$19:$Z$41,6,0)/'4. Billing Determinants'!$G$41*$D21,IF($E21=\"Distribution Rev.\",VLOOKUP(W$4,'4. Billing Determinants'!$B$19:$Z$41,8,0)/'4. Billing Determinants'!$I$41*$D21, VLOOKUP(W$4,'4. Billing Determinants'!$B$19:$Z$41,3,0)/'4. Billing Determinants'!$D$41*$D21))))),0)","v":0},{"$f":"IFERROR(IF(X$4=\"\",0,IF($E21=\"kWh\",VLOOKUP(X$4,'4. Billing Determinants'!$B$19:$Z$41,4,0)/'4. Billing Determinants'!$E$41*$D21,IF($E21=\"kW\",VLOOKUP(X$4,'4. Billing Determinants'!$B$19:$Z$41,5,0)/'4. Billing Determinants'!$F$41*$D21,IF($E21=\"Non-RPP kWh\",VLOOKUP(X$4,'4. Billing Determinants'!$B$19:$Z$41,6,0)/'4. Billing Determinants'!$G$41*$D21,IF($E21=\"Distribution Rev.\",VLOOKUP(X$4,'4. Billing Determinants'!$B$19:$Z$41,8,0)/'4. Billing Determinants'!$I$41*$D21, VLOOKUP(X$4,'4. Billing Determinants'!$B$19:$Z$41,3,0)/'4. Billing Determinants'!$D$41*$D21))))),0)","v":0},{"$f":"IFERROR(IF(Y$4=\"\",0,IF($E21=\"kWh\",VLOOKUP(Y$4,'4. Billing Determinants'!$B$19:$Z$41,4,0)/'4. Billing Determinants'!$E$41*$D21,IF($E21=\"kW\",VLOOKUP(Y$4,'4. Billing Determinants'!$B$19:$Z$41,5,0)/'4. Billing Determinants'!$F$41*$D21,IF($E21=\"Non-RPP kWh\",VLOOKUP(Y$4,'4. Billing Determinants'!$B$19:$Z$41,6,0)/'4. Billing Determinants'!$G$41*$D21,IF($E21=\"Distribution Rev.\",VLOOKUP(Y$4,'4. Billing Determinants'!$B$19:$Z$41,8,0)/'4. Billing Determinants'!$I$41*$D21, VLOOKUP(Y$4,'4. Billing Determinants'!$B$19:$Z$41,3,0)/'4. Billing Determinants'!$D$41*$D21))))),0)","v":0}]
[null,"Other Regulatory Assets - Sub-Account - Incremental Capital Charges",1508,{"$f":"'2. 2015 Continuity Schedule'!BS45","v":0},"kWh",{"$f":"IFERROR(IF(F$4=\"\",0,IF($E22=\"kWh\",VLOOKUP(F$4,'4. Billing Determinants'!$B$19:$Z$41,4,0)/'4. Billing Determinants'!$E$41*$D22,IF($E22=\"kW\",VLOOKUP(F$4,'4. Billing Determinants'!$B$19:$Z$41,5,0)/'4. Billing Determinants'!$F$41*$D22,IF($E22=\"Non-RPP kWh\",VLOOKUP(F$4,'4. Billing Determinants'!$B$19:$Z$41,6,0)/'4. Billing Determinants'!$G$41*$D22,IF($E22=\"Distribution Rev.\",VLOOKUP(F$4,'4. Billing Determinants'!$B$19:$Z$41,8,0)/'4. Billing Determinants'!$I$41*$D22, VLOOKUP(F$4,'4. Billing Determinants'!$B$19:$Z$41,3,0)/'4. Billing Determinants'!$D$41*$D22))))),0)","v":0},{"$f":"IFERROR(IF(G$4=\"\",0,IF($E22=\"kWh\",VLOOKUP(G$4,'4. Billing Determinants'!$B$19:$Z$41,4,0)/'4. Billing Determinants'!$E$41*$D22,IF($E22=\"kW\",VLOOKUP(G$4,'4. Billing Determinants'!$B$19:$Z$41,5,0)/'4. Billing Determinants'!$F$41*$D22,IF($E22=\"Non-RPP kWh\",VLOOKUP(G$4,'4. Billing Determinants'!$B$19:$Z$41,6,0)/'4. Billing Determinants'!$G$41*$D22,IF($E22=\"Distribution Rev.\",VLOOKUP(G$4,'4. Billing Determinants'!$B$19:$Z$41,8,0)/'4. Billing Determinants'!$I$41*$D22, VLOOKUP(G$4,'4. Billing Determinants'!$B$19:$Z$41,3,0)/'4. Billing Determinants'!$D$41*$D22))))),0)","v":0},{"$f":"IFERROR(IF(H$4=\"\",0,IF($E22=\"kWh\",VLOOKUP(H$4,'4. Billing Determinants'!$B$19:$Z$41,4,0)/'4. Billing Determinants'!$E$41*$D22,IF($E22=\"kW\",VLOOKUP(H$4,'4. Billing Determinants'!$B$19:$Z$41,5,0)/'4. Billing Determinants'!$F$41*$D22,IF($E22=\"Non-RPP kWh\",VLOOKUP(H$4,'4. Billing Determinants'!$B$19:$Z$41,6,0)/'4. Billing Determinants'!$G$41*$D22,IF($E22=\"Distribution Rev.\",VLOOKUP(H$4,'4. Billing Determinants'!$B$19:$Z$41,8,0)/'4. Billing Determinants'!$I$41*$D22, VLOOKUP(H$4,'4. Billing Determinants'!$B$19:$Z$41,3,0)/'4. Billing Determinants'!$D$41*$D22))))),0)","v":0},{"$f":"IFERROR(IF(I$4=\"\",0,IF($E22=\"kWh\",VLOOKUP(I$4,'4. Billing Determinants'!$B$19:$Z$41,4,0)/'4. Billing Determinants'!$E$41*$D22,IF($E22=\"kW\",VLOOKUP(I$4,'4. Billing Determinants'!$B$19:$Z$41,5,0)/'4. Billing Determinants'!$F$41*$D22,IF($E22=\"Non-RPP kWh\",VLOOKUP(I$4,'4. Billing Determinants'!$B$19:$Z$41,6,0)/'4. Billing Determinants'!$G$41*$D22,IF($E22=\"Distribution Rev.\",VLOOKUP(I$4,'4. Billing Determinants'!$B$19:$Z$41,8,0)/'4. Billing Determinants'!$I$41*$D22, VLOOKUP(I$4,'4. Billing Determinants'!$B$19:$Z$41,3,0)/'4. Billing Determinants'!$D$41*$D22))))),0)","v":0},{"$f":"IFERROR(IF(J$4=\"\",0,IF($E22=\"kWh\",VLOOKUP(J$4,'4. Billing Determinants'!$B$19:$Z$41,4,0)/'4. Billing Determinants'!$E$41*$D22,IF($E22=\"kW\",VLOOKUP(J$4,'4. Billing Determinants'!$B$19:$Z$41,5,0)/'4. Billing Determinants'!$F$41*$D22,IF($E22=\"Non-RPP kWh\",VLOOKUP(J$4,'4. Billing Determinants'!$B$19:$Z$41,6,0)/'4. Billing Determinants'!$G$41*$D22,IF($E22=\"Distribution Rev.\",VLOOKUP(J$4,'4. Billing Determinants'!$B$19:$Z$41,8,0)/'4. Billing Determinants'!$I$41*$D22, VLOOKUP(J$4,'4. Billing Determinants'!$B$19:$Z$41,3,0)/'4. Billing Determinants'!$D$41*$D22))))),0)","v":0},{"$f":"IFERROR(IF(K$4=\"\",0,IF($E22=\"kWh\",VLOOKUP(K$4,'4. Billing Determinants'!$B$19:$Z$41,4,0)/'4. Billing Determinants'!$E$41*$D22,IF($E22=\"kW\",VLOOKUP(K$4,'4. Billing Determinants'!$B$19:$Z$41,5,0)/'4. Billing Determinants'!$F$41*$D22,IF($E22=\"Non-RPP kWh\",VLOOKUP(K$4,'4. Billing Determinants'!$B$19:$Z$41,6,0)/'4. Billing Determinants'!$G$41*$D22,IF($E22=\"Distribution Rev.\",VLOOKUP(K$4,'4. Billing Determinants'!$B$19:$Z$41,8,0)/'4. Billing Determinants'!$I$41*$D22, VLOOKUP(K$4,'4. Billing Determinants'!$B$19:$Z$41,3,0)/'4. Billing Determinants'!$D$41*$D22))))),0)","v":0},{"$f":"IFERROR(IF(L$4=\"\",0,IF($E22=\"kWh\",VLOOKUP(L$4,'4. Billing Determinants'!$B$19:$Z$41,4,0)/'4. Billing Determinants'!$E$41*$D22,IF($E22=\"kW\",VLOOKUP(L$4,'4. Billing Determinants'!$B$19:$Z$41,5,0)/'4. Billing Determinants'!$F$41*$D22,IF($E22=\"Non-RPP kWh\",VLOOKUP(L$4,'4. Billing Determinants'!$B$19:$Z$41,6,0)/'4. Billing Determinants'!$G$41*$D22,IF($E22=\"Distribution Rev.\",VLOOKUP(L$4,'4. Billing Determinants'!$B$19:$Z$41,8,0)/'4. Billing Determinants'!$I$41*$D22, VLOOKUP(L$4,'4. Billing Determinants'!$B$19:$Z$41,3,0)/'4. Billing Determinants'!$D$41*$D22))))),0)","v":0},{"$f":"IFERROR(IF(M$4=\"\",0,IF($E22=\"kWh\",VLOOKUP(M$4,'4. Billing Determinants'!$B$19:$Z$41,4,0)/'4. Billing Determinants'!$E$41*$D22,IF($E22=\"kW\",VLOOKUP(M$4,'4. Billing Determinants'!$B$19:$Z$41,5,0)/'4. Billing Determinants'!$F$41*$D22,IF($E22=\"Non-RPP kWh\",VLOOKUP(M$4,'4. Billing Determinants'!$B$19:$Z$41,6,0)/'4. Billing Determinants'!$G$41*$D22,IF($E22=\"Distribution Rev.\",VLOOKUP(M$4,'4. Billing Determinants'!$B$19:$Z$41,8,0)/'4. Billing Determinants'!$I$41*$D22, VLOOKUP(M$4,'4. Billing Determinants'!$B$19:$Z$41,3,0)/'4. Billing Determinants'!$D$41*$D22))))),0)","v":0},{"$f":"IFERROR(IF(N$4=\"\",0,IF($E22=\"kWh\",VLOOKUP(N$4,'4. Billing Determinants'!$B$19:$Z$41,4,0)/'4. Billing Determinants'!$E$41*$D22,IF($E22=\"kW\",VLOOKUP(N$4,'4. Billing Determinants'!$B$19:$Z$41,5,0)/'4. Billing Determinants'!$F$41*$D22,IF($E22=\"Non-RPP kWh\",VLOOKUP(N$4,'4. Billing Determinants'!$B$19:$Z$41,6,0)/'4. Billing Determinants'!$G$41*$D22,IF($E22=\"Distribution Rev.\",VLOOKUP(N$4,'4. Billing Determinants'!$B$19:$Z$41,8,0)/'4. Billing Determinants'!$I$41*$D22, VLOOKUP(N$4,'4. Billing Determinants'!$B$19:$Z$41,3,0)/'4. Billing Determinants'!$D$41*$D22))))),0)","v":0},{"$f":"IFERROR(IF(O$4=\"\",0,IF($E22=\"kWh\",VLOOKUP(O$4,'4. Billing Determinants'!$B$19:$Z$41,4,0)/'4. Billing Determinants'!$E$41*$D22,IF($E22=\"kW\",VLOOKUP(O$4,'4. Billing Determinants'!$B$19:$Z$41,5,0)/'4. Billing Determinants'!$F$41*$D22,IF($E22=\"Non-RPP kWh\",VLOOKUP(O$4,'4. Billing Determinants'!$B$19:$Z$41,6,0)/'4. Billing Determinants'!$G$41*$D22,IF($E22=\"Distribution Rev.\",VLOOKUP(O$4,'4. Billing Determinants'!$B$19:$Z$41,8,0)/'4. Billing Determinants'!$I$41*$D22, VLOOKUP(O$4,'4. Billing Determinants'!$B$19:$Z$41,3,0)/'4. Billing Determinants'!$D$41*$D22))))),0)","v":0},{"$f":"IFERROR(IF(P$4=\"\",0,IF($E22=\"kWh\",VLOOKUP(P$4,'4. Billing Determinants'!$B$19:$Z$41,4,0)/'4. Billing Determinants'!$E$41*$D22,IF($E22=\"kW\",VLOOKUP(P$4,'4. Billing Determinants'!$B$19:$Z$41,5,0)/'4. Billing Determinants'!$F$41*$D22,IF($E22=\"Non-RPP kWh\",VLOOKUP(P$4,'4. Billing Determinants'!$B$19:$Z$41,6,0)/'4. Billing Determinants'!$G$41*$D22,IF($E22=\"Distribution Rev.\",VLOOKUP(P$4,'4. Billing Determinants'!$B$19:$Z$41,8,0)/'4. Billing Determinants'!$I$41*$D22, VLOOKUP(P$4,'4. Billing Determinants'!$B$19:$Z$41,3,0)/'4. Billing Determinants'!$D$41*$D22))))),0)","v":0},{"$f":"IFERROR(IF(Q$4=\"\",0,IF($E22=\"kWh\",VLOOKUP(Q$4,'4. Billing Determinants'!$B$19:$Z$41,4,0)/'4. Billing Determinants'!$E$41*$D22,IF($E22=\"kW\",VLOOKUP(Q$4,'4. Billing Determinants'!$B$19:$Z$41,5,0)/'4. Billing Determinants'!$F$41*$D22,IF($E22=\"Non-RPP kWh\",VLOOKUP(Q$4,'4. Billing Determinants'!$B$19:$Z$41,6,0)/'4. Billing Determinants'!$G$41*$D22,IF($E22=\"Distribution Rev.\",VLOOKUP(Q$4,'4. Billing Determinants'!$B$19:$Z$41,8,0)/'4. Billing Determinants'!$I$41*$D22, VLOOKUP(Q$4,'4. Billing Determinants'!$B$19:$Z$41,3,0)/'4. Billing Determinants'!$D$41*$D22))))),0)","v":0},{"$f":"IFERROR(IF(R$4=\"\",0,IF($E22=\"kWh\",VLOOKUP(R$4,'4. Billing Determinants'!$B$19:$Z$41,4,0)/'4. Billing Determinants'!$E$41*$D22,IF($E22=\"kW\",VLOOKUP(R$4,'4. Billing Determinants'!$B$19:$Z$41,5,0)/'4. Billing Determinants'!$F$41*$D22,IF($E22=\"Non-RPP kWh\",VLOOKUP(R$4,'4. Billing Determinants'!$B$19:$Z$41,6,0)/'4. Billing Determinants'!$G$41*$D22,IF($E22=\"Distribution Rev.\",VLOOKUP(R$4,'4. Billing Determinants'!$B$19:$Z$41,8,0)/'4. Billing Determinants'!$I$41*$D22, VLOOKUP(R$4,'4. Billing Determinants'!$B$19:$Z$41,3,0)/'4. Billing Determinants'!$D$41*$D22))))),0)","v":0},{"$f":"IFERROR(IF(S$4=\"\",0,IF($E22=\"kWh\",VLOOKUP(S$4,'4. Billing Determinants'!$B$19:$Z$41,4,0)/'4. Billing Determinants'!$E$41*$D22,IF($E22=\"kW\",VLOOKUP(S$4,'4. Billing Determinants'!$B$19:$Z$41,5,0)/'4. Billing Determinants'!$F$41*$D22,IF($E22=\"Non-RPP kWh\",VLOOKUP(S$4,'4. Billing Determinants'!$B$19:$Z$41,6,0)/'4. Billing Determinants'!$G$41*$D22,IF($E22=\"Distribution Rev.\",VLOOKUP(S$4,'4. Billing Determinants'!$B$19:$Z$41,8,0)/'4. Billing Determinants'!$I$41*$D22, VLOOKUP(S$4,'4. Billing Determinants'!$B$19:$Z$41,3,0)/'4. Billing Determinants'!$D$41*$D22))))),0)","v":0},{"$f":"IFERROR(IF(T$4=\"\",0,IF($E22=\"kWh\",VLOOKUP(T$4,'4. Billing Determinants'!$B$19:$Z$41,4,0)/'4. Billing Determinants'!$E$41*$D22,IF($E22=\"kW\",VLOOKUP(T$4,'4. Billing Determinants'!$B$19:$Z$41,5,0)/'4. Billing Determinants'!$F$41*$D22,IF($E22=\"Non-RPP kWh\",VLOOKUP(T$4,'4. Billing Determinants'!$B$19:$Z$41,6,0)/'4. Billing Determinants'!$G$41*$D22,IF($E22=\"Distribution Rev.\",VLOOKUP(T$4,'4. Billing Determinants'!$B$19:$Z$41,8,0)/'4. Billing Determinants'!$I$41*$D22, VLOOKUP(T$4,'4. Billing Determinants'!$B$19:$Z$41,3,0)/'4. Billing Determinants'!$D$41*$D22))))),0)","v":0},{"$f":"IFERROR(IF(U$4=\"\",0,IF($E22=\"kWh\",VLOOKUP(U$4,'4. Billing Determinants'!$B$19:$Z$41,4,0)/'4. Billing Determinants'!$E$41*$D22,IF($E22=\"kW\",VLOOKUP(U$4,'4. Billing Determinants'!$B$19:$Z$41,5,0)/'4. Billing Determinants'!$F$41*$D22,IF($E22=\"Non-RPP kWh\",VLOOKUP(U$4,'4. Billing Determinants'!$B$19:$Z$41,6,0)/'4. Billing Determinants'!$G$41*$D22,IF($E22=\"Distribution Rev.\",VLOOKUP(U$4,'4. Billing Determinants'!$B$19:$Z$41,8,0)/'4. Billing Determinants'!$I$41*$D22, VLOOKUP(U$4,'4. Billing Determinants'!$B$19:$Z$41,3,0)/'4. Billing Determinants'!$D$41*$D22))))),0)","v":0},{"$f":"IFERROR(IF(V$4=\"\",0,IF($E22=\"kWh\",VLOOKUP(V$4,'4. Billing Determinants'!$B$19:$Z$41,4,0)/'4. Billing Determinants'!$E$41*$D22,IF($E22=\"kW\",VLOOKUP(V$4,'4. Billing Determinants'!$B$19:$Z$41,5,0)/'4. Billing Determinants'!$F$41*$D22,IF($E22=\"Non-RPP kWh\",VLOOKUP(V$4,'4. Billing Determinants'!$B$19:$Z$41,6,0)/'4. Billing Determinants'!$G$41*$D22,IF($E22=\"Distribution Rev.\",VLOOKUP(V$4,'4. Billing Determinants'!$B$19:$Z$41,8,0)/'4. Billing Determinants'!$I$41*$D22, VLOOKUP(V$4,'4. Billing Determinants'!$B$19:$Z$41,3,0)/'4. Billing Determinants'!$D$41*$D22))))),0)","v":0},{"$f":"IFERROR(IF(W$4=\"\",0,IF($E22=\"kWh\",VLOOKUP(W$4,'4. Billing Determinants'!$B$19:$Z$41,4,0)/'4. Billing Determinants'!$E$41*$D22,IF($E22=\"kW\",VLOOKUP(W$4,'4. Billing Determinants'!$B$19:$Z$41,5,0)/'4. Billing Determinants'!$F$41*$D22,IF($E22=\"Non-RPP kWh\",VLOOKUP(W$4,'4. Billing Determinants'!$B$19:$Z$41,6,0)/'4. Billing Determinants'!$G$41*$D22,IF($E22=\"Distribution Rev.\",VLOOKUP(W$4,'4. Billing Determinants'!$B$19:$Z$41,8,0)/'4. Billing Determinants'!$I$41*$D22, VLOOKUP(W$4,'4. Billing Determinants'!$B$19:$Z$41,3,0)/'4. Billing Determinants'!$D$41*$D22))))),0)","v":0},{"$f":"IFERROR(IF(X$4=\"\",0,IF($E22=\"kWh\",VLOOKUP(X$4,'4. Billing Determinants'!$B$19:$Z$41,4,0)/'4. Billing Determinants'!$E$41*$D22,IF($E22=\"kW\",VLOOKUP(X$4,'4. Billing Determinants'!$B$19:$Z$41,5,0)/'4. Billing Determinants'!$F$41*$D22,IF($E22=\"Non-RPP kWh\",VLOOKUP(X$4,'4. Billing Determinants'!$B$19:$Z$41,6,0)/'4. Billing Determinants'!$G$41*$D22,IF($E22=\"Distribution Rev.\",VLOOKUP(X$4,'4. Billing Determinants'!$B$19:$Z$41,8,0)/'4. Billing Determinants'!$I$41*$D22, VLOOKUP(X$4,'4. Billing Determinants'!$B$19:$Z$41,3,0)/'4. Billing Determinants'!$D$41*$D22))))),0)","v":0},{"$f":"IFERROR(IF(Y$4=\"\",0,IF($E22=\"kWh\",VLOOKUP(Y$4,'4. Billing Determinants'!$B$19:$Z$41,4,0)/'4. Billing Determinants'!$E$41*$D22,IF($E22=\"kW\",VLOOKUP(Y$4,'4. Billing Determinants'!$B$19:$Z$41,5,0)/'4. Billing Determinants'!$F$41*$D22,IF($E22=\"Non-RPP kWh\",VLOOKUP(Y$4,'4. Billing Determinants'!$B$19:$Z$41,6,0)/'4. Billing Determinants'!$G$41*$D22,IF($E22=\"Distribution Rev.\",VLOOKUP(Y$4,'4. Billing Determinants'!$B$19:$Z$41,8,0)/'4. Billing Determinants'!$I$41*$D22, VLOOKUP(Y$4,'4. Billing Determinants'!$B$19:$Z$41,3,0)/'4. Billing Determinants'!$D$41*$D22))))),0)","v":0}]
[null,"Other Regulatory Assets - Sub-Account - Financial Assistance Payment and Recovery Variance - Ontario Clean Energy Benefit Act8",1508,{"$f":"'2. 2015 Continuity Schedule'!BS46","v":0},"kWh",{"$f":"IFERROR(IF(F$4=\"\",0,IF($E23=\"kWh\",VLOOKUP(F$4,'4. Billing Determinants'!$B$19:$Z$41,4,0)/'4. Billing Determinants'!$E$41*$D23,IF($E23=\"kW\",VLOOKUP(F$4,'4. Billing Determinants'!$B$19:$Z$41,5,0)/'4. Billing Determinants'!$F$41*$D23,IF($E23=\"Non-RPP kWh\",VLOOKUP(F$4,'4. Billing Determinants'!$B$19:$Z$41,6,0)/'4. Billing Determinants'!$G$41*$D23,IF($E23=\"Distribution Rev.\",VLOOKUP(F$4,'4. Billing Determinants'!$B$19:$Z$41,8,0)/'4. Billing Determinants'!$I$41*$D23, VLOOKUP(F$4,'4. Billing Determinants'!$B$19:$Z$41,3,0)/'4. Billing Determinants'!$D$41*$D23))))),0)","v":0},{"$f":"IFERROR(IF(G$4=\"\",0,IF($E23=\"kWh\",VLOOKUP(G$4,'4. Billing Determinants'!$B$19:$Z$41,4,0)/'4. Billing Determinants'!$E$41*$D23,IF($E23=\"kW\",VLOOKUP(G$4,'4. Billing Determinants'!$B$19:$Z$41,5,0)/'4. Billing Determinants'!$F$41*$D23,IF($E23=\"Non-RPP kWh\",VLOOKUP(G$4,'4. Billing Determinants'!$B$19:$Z$41,6,0)/'4. Billing Determinants'!$G$41*$D23,IF($E23=\"Distribution Rev.\",VLOOKUP(G$4,'4. Billing Determinants'!$B$19:$Z$41,8,0)/'4. Billing Determinants'!$I$41*$D23, VLOOKUP(G$4,'4. Billing Determinants'!$B$19:$Z$41,3,0)/'4. Billing Determinants'!$D$41*$D23))))),0)","v":0},{"$f":"IFERROR(IF(H$4=\"\",0,IF($E23=\"kWh\",VLOOKUP(H$4,'4. Billing Determinants'!$B$19:$Z$41,4,0)/'4. Billing Determinants'!$E$41*$D23,IF($E23=\"kW\",VLOOKUP(H$4,'4. Billing Determinants'!$B$19:$Z$41,5,0)/'4. Billing Determinants'!$F$41*$D23,IF($E23=\"Non-RPP kWh\",VLOOKUP(H$4,'4. Billing Determinants'!$B$19:$Z$41,6,0)/'4. Billing Determinants'!$G$41*$D23,IF($E23=\"Distribution Rev.\",VLOOKUP(H$4,'4. Billing Determinants'!$B$19:$Z$41,8,0)/'4. Billing Determinants'!$I$41*$D23, VLOOKUP(H$4,'4. Billing Determinants'!$B$19:$Z$41,3,0)/'4. Billing Determinants'!$D$41*$D23))))),0)","v":0},{"$f":"IFERROR(IF(I$4=\"\",0,IF($E23=\"kWh\",VLOOKUP(I$4,'4. Billing Determinants'!$B$19:$Z$41,4,0)/'4. Billing Determinants'!$E$41*$D23,IF($E23=\"kW\",VLOOKUP(I$4,'4. Billing Determinants'!$B$19:$Z$41,5,0)/'4. Billing Determinants'!$F$41*$D23,IF($E23=\"Non-RPP kWh\",VLOOKUP(I$4,'4. Billing Determinants'!$B$19:$Z$41,6,0)/'4. Billing Determinants'!$G$41*$D23,IF($E23=\"Distribution Rev.\",VLOOKUP(I$4,'4. Billing Determinants'!$B$19:$Z$41,8,0)/'4. Billing Determinants'!$I$41*$D23, VLOOKUP(I$4,'4. Billing Determinants'!$B$19:$Z$41,3,0)/'4. Billing Determinants'!$D$41*$D23))))),0)","v":0},{"$f":"IFERROR(IF(J$4=\"\",0,IF($E23=\"kWh\",VLOOKUP(J$4,'4. Billing Determinants'!$B$19:$Z$41,4,0)/'4. Billing Determinants'!$E$41*$D23,IF($E23=\"kW\",VLOOKUP(J$4,'4. Billing Determinants'!$B$19:$Z$41,5,0)/'4. Billing Determinants'!$F$41*$D23,IF($E23=\"Non-RPP kWh\",VLOOKUP(J$4,'4. Billing Determinants'!$B$19:$Z$41,6,0)/'4. Billing Determinants'!$G$41*$D23,IF($E23=\"Distribution Rev.\",VLOOKUP(J$4,'4. Billing Determinants'!$B$19:$Z$41,8,0)/'4. Billing Determinants'!$I$41*$D23, VLOOKUP(J$4,'4. Billing Determinants'!$B$19:$Z$41,3,0)/'4. Billing Determinants'!$D$41*$D23))))),0)","v":0},{"$f":"IFERROR(IF(K$4=\"\",0,IF($E23=\"kWh\",VLOOKUP(K$4,'4. Billing Determinants'!$B$19:$Z$41,4,0)/'4. Billing Determinants'!$E$41*$D23,IF($E23=\"kW\",VLOOKUP(K$4,'4. Billing Determinants'!$B$19:$Z$41,5,0)/'4. Billing Determinants'!$F$41*$D23,IF($E23=\"Non-RPP kWh\",VLOOKUP(K$4,'4. Billing Determinants'!$B$19:$Z$41,6,0)/'4. Billing Determinants'!$G$41*$D23,IF($E23=\"Distribution Rev.\",VLOOKUP(K$4,'4. Billing Determinants'!$B$19:$Z$41,8,0)/'4. Billing Determinants'!$I$41*$D23, VLOOKUP(K$4,'4. Billing Determinants'!$B$19:$Z$41,3,0)/'4. Billing Determinants'!$D$41*$D23))))),0)","v":0},{"$f":"IFERROR(IF(L$4=\"\",0,IF($E23=\"kWh\",VLOOKUP(L$4,'4. Billing Determinants'!$B$19:$Z$41,4,0)/'4. Billing Determinants'!$E$41*$D23,IF($E23=\"kW\",VLOOKUP(L$4,'4. Billing Determinants'!$B$19:$Z$41,5,0)/'4. Billing Determinants'!$F$41*$D23,IF($E23=\"Non-RPP kWh\",VLOOKUP(L$4,'4. Billing Determinants'!$B$19:$Z$41,6,0)/'4. Billing Determinants'!$G$41*$D23,IF($E23=\"Distribution Rev.\",VLOOKUP(L$4,'4. Billing Determinants'!$B$19:$Z$41,8,0)/'4. Billing Determinants'!$I$41*$D23, VLOOKUP(L$4,'4. Billing Determinants'!$B$19:$Z$41,3,0)/'4. Billing Determinants'!$D$41*$D23))))),0)","v":0},{"$f":"IFERROR(IF(M$4=\"\",0,IF($E23=\"kWh\",VLOOKUP(M$4,'4. Billing Determinants'!$B$19:$Z$41,4,0)/'4. Billing Determinants'!$E$41*$D23,IF($E23=\"kW\",VLOOKUP(M$4,'4. Billing Determinants'!$B$19:$Z$41,5,0)/'4. Billing Determinants'!$F$41*$D23,IF($E23=\"Non-RPP kWh\",VLOOKUP(M$4,'4. Billing Determinants'!$B$19:$Z$41,6,0)/'4. Billing Determinants'!$G$41*$D23,IF($E23=\"Distribution Rev.\",VLOOKUP(M$4,'4. Billing Determinants'!$B$19:$Z$41,8,0)/'4. Billing Determinants'!$I$41*$D23, VLOOKUP(M$4,'4. Billing Determinants'!$B$19:$Z$41,3,0)/'4. Billing Determinants'!$D$41*$D23))))),0)","v":0},{"$f":"IFERROR(IF(N$4=\"\",0,IF($E23=\"kWh\",VLOOKUP(N$4,'4. Billing Determinants'!$B$19:$Z$41,4,0)/'4. Billing Determinants'!$E$41*$D23,IF($E23=\"kW\",VLOOKUP(N$4,'4. Billing Determinants'!$B$19:$Z$41,5,0)/'4. Billing Determinants'!$F$41*$D23,IF($E23=\"Non-RPP kWh\",VLOOKUP(N$4,'4. Billing Determinants'!$B$19:$Z$41,6,0)/'4. Billing Determinants'!$G$41*$D23,IF($E23=\"Distribution Rev.\",VLOOKUP(N$4,'4. Billing Determinants'!$B$19:$Z$41,8,0)/'4. Billing Determinants'!$I$41*$D23, VLOOKUP(N$4,'4. Billing Determinants'!$B$19:$Z$41,3,0)/'4. Billing Determinants'!$D$41*$D23))))),0)","v":0},{"$f":"IFERROR(IF(O$4=\"\",0,IF($E23=\"kWh\",VLOOKUP(O$4,'4. Billing Determinants'!$B$19:$Z$41,4,0)/'4. Billing Determinants'!$E$41*$D23,IF($E23=\"kW\",VLOOKUP(O$4,'4. Billing Determinants'!$B$19:$Z$41,5,0)/'4. Billing Determinants'!$F$41*$D23,IF($E23=\"Non-RPP kWh\",VLOOKUP(O$4,'4. Billing Determinants'!$B$19:$Z$41,6,0)/'4. Billing Determinants'!$G$41*$D23,IF($E23=\"Distribution Rev.\",VLOOKUP(O$4,'4. Billing Determinants'!$B$19:$Z$41,8,0)/'4. Billing Determinants'!$I$41*$D23, VLOOKUP(O$4,'4. Billing Determinants'!$B$19:$Z$41,3,0)/'4. Billing Determinants'!$D$41*$D23))))),0)","v":0},{"$f":"IFERROR(IF(P$4=\"\",0,IF($E23=\"kWh\",VLOOKUP(P$4,'4. Billing Determinants'!$B$19:$Z$41,4,0)/'4. Billing Determinants'!$E$41*$D23,IF($E23=\"kW\",VLOOKUP(P$4,'4. Billing Determinants'!$B$19:$Z$41,5,0)/'4. Billing Determinants'!$F$41*$D23,IF($E23=\"Non-RPP kWh\",VLOOKUP(P$4,'4. Billing Determinants'!$B$19:$Z$41,6,0)/'4. Billing Determinants'!$G$41*$D23,IF($E23=\"Distribution Rev.\",VLOOKUP(P$4,'4. Billing Determinants'!$B$19:$Z$41,8,0)/'4. Billing Determinants'!$I$41*$D23, VLOOKUP(P$4,'4. Billing Determinants'!$B$19:$Z$41,3,0)/'4. Billing Determinants'!$D$41*$D23))))),0)","v":0},{"$f":"IFERROR(IF(Q$4=\"\",0,IF($E23=\"kWh\",VLOOKUP(Q$4,'4. Billing Determinants'!$B$19:$Z$41,4,0)/'4. Billing Determinants'!$E$41*$D23,IF($E23=\"kW\",VLOOKUP(Q$4,'4. Billing Determinants'!$B$19:$Z$41,5,0)/'4. Billing Determinants'!$F$41*$D23,IF($E23=\"Non-RPP kWh\",VLOOKUP(Q$4,'4. Billing Determinants'!$B$19:$Z$41,6,0)/'4. Billing Determinants'!$G$41*$D23,IF($E23=\"Distribution Rev.\",VLOOKUP(Q$4,'4. Billing Determinants'!$B$19:$Z$41,8,0)/'4. Billing Determinants'!$I$41*$D23, VLOOKUP(Q$4,'4. Billing Determinants'!$B$19:$Z$41,3,0)/'4. Billing Determinants'!$D$41*$D23))))),0)","v":0},{"$f":"IFERROR(IF(R$4=\"\",0,IF($E23=\"kWh\",VLOOKUP(R$4,'4. Billing Determinants'!$B$19:$Z$41,4,0)/'4. Billing Determinants'!$E$41*$D23,IF($E23=\"kW\",VLOOKUP(R$4,'4. Billing Determinants'!$B$19:$Z$41,5,0)/'4. Billing Determinants'!$F$41*$D23,IF($E23=\"Non-RPP kWh\",VLOOKUP(R$4,'4. Billing Determinants'!$B$19:$Z$41,6,0)/'4. Billing Determinants'!$G$41*$D23,IF($E23=\"Distribution Rev.\",VLOOKUP(R$4,'4. Billing Determinants'!$B$19:$Z$41,8,0)/'4. Billing Determinants'!$I$41*$D23, VLOOKUP(R$4,'4. Billing Determinants'!$B$19:$Z$41,3,0)/'4. Billing Determinants'!$D$41*$D23))))),0)","v":0},{"$f":"IFERROR(IF(S$4=\"\",0,IF($E23=\"kWh\",VLOOKUP(S$4,'4. Billing Determinants'!$B$19:$Z$41,4,0)/'4. Billing Determinants'!$E$41*$D23,IF($E23=\"kW\",VLOOKUP(S$4,'4. Billing Determinants'!$B$19:$Z$41,5,0)/'4. Billing Determinants'!$F$41*$D23,IF($E23=\"Non-RPP kWh\",VLOOKUP(S$4,'4. Billing Determinants'!$B$19:$Z$41,6,0)/'4. Billing Determinants'!$G$41*$D23,IF($E23=\"Distribution Rev.\",VLOOKUP(S$4,'4. Billing Determinants'!$B$19:$Z$41,8,0)/'4. Billing Determinants'!$I$41*$D23, VLOOKUP(S$4,'4. Billing Determinants'!$B$19:$Z$41,3,0)/'4. Billing Determinants'!$D$41*$D23))))),0)","v":0},{"$f":"IFERROR(IF(T$4=\"\",0,IF($E23=\"kWh\",VLOOKUP(T$4,'4. Billing Determinants'!$B$19:$Z$41,4,0)/'4. Billing Determinants'!$E$41*$D23,IF($E23=\"kW\",VLOOKUP(T$4,'4. Billing Determinants'!$B$19:$Z$41,5,0)/'4. Billing Determinants'!$F$41*$D23,IF($E23=\"Non-RPP kWh\",VLOOKUP(T$4,'4. Billing Determinants'!$B$19:$Z$41,6,0)/'4. Billing Determinants'!$G$41*$D23,IF($E23=\"Distribution Rev.\",VLOOKUP(T$4,'4. Billing Determinants'!$B$19:$Z$41,8,0)/'4. Billing Determinants'!$I$41*$D23, VLOOKUP(T$4,'4. Billing Determinants'!$B$19:$Z$41,3,0)/'4. Billing Determinants'!$D$41*$D23))))),0)","v":0},{"$f":"IFERROR(IF(U$4=\"\",0,IF($E23=\"kWh\",VLOOKUP(U$4,'4. Billing Determinants'!$B$19:$Z$41,4,0)/'4. Billing Determinants'!$E$41*$D23,IF($E23=\"kW\",VLOOKUP(U$4,'4. Billing Determinants'!$B$19:$Z$41,5,0)/'4. Billing Determinants'!$F$41*$D23,IF($E23=\"Non-RPP kWh\",VLOOKUP(U$4,'4. Billing Determinants'!$B$19:$Z$41,6,0)/'4. Billing Determinants'!$G$41*$D23,IF($E23=\"Distribution Rev.\",VLOOKUP(U$4,'4. Billing Determinants'!$B$19:$Z$41,8,0)/'4. Billing Determinants'!$I$41*$D23, VLOOKUP(U$4,'4. Billing Determinants'!$B$19:$Z$41,3,0)/'4. Billing Determinants'!$D$41*$D23))))),0)","v":0},{"$f":"IFERROR(IF(V$4=\"\",0,IF($E23=\"kWh\",VLOOKUP(V$4,'4. Billing Determinants'!$B$19:$Z$41,4,0)/'4. Billing Determinants'!$E$41*$D23,IF($E23=\"kW\",VLOOKUP(V$4,'4. Billing Determinants'!$B$19:$Z$41,5,0)/'4. Billing Determinants'!$F$41*$D23,IF($E23=\"Non-RPP kWh\",VLOOKUP(V$4,'4. Billing Determinants'!$B$19:$Z$41,6,0)/'4. Billing Determinants'!$G$41*$D23,IF($E23=\"Distribution Rev.\",VLOOKUP(V$4,'4. Billing Determinants'!$B$19:$Z$41,8,0)/'4. Billing Determinants'!$I$41*$D23, VLOOKUP(V$4,'4. Billing Determinants'!$B$19:$Z$41,3,0)/'4. Billing Determinants'!$D$41*$D23))))),0)","v":0},{"$f":"IFERROR(IF(W$4=\"\",0,IF($E23=\"kWh\",VLOOKUP(W$4,'4. Billing Determinants'!$B$19:$Z$41,4,0)/'4. Billing Determinants'!$E$41*$D23,IF($E23=\"kW\",VLOOKUP(W$4,'4. Billing Determinants'!$B$19:$Z$41,5,0)/'4. Billing Determinants'!$F$41*$D23,IF($E23=\"Non-RPP kWh\",VLOOKUP(W$4,'4. Billing Determinants'!$B$19:$Z$41,6,0)/'4. Billing Determinants'!$G$41*$D23,IF($E23=\"Distribution Rev.\",VLOOKUP(W$4,'4. Billing Determinants'!$B$19:$Z$41,8,0)/'4. Billing Determinants'!$I$41*$D23, VLOOKUP(W$4,'4. Billing Determinants'!$B$19:$Z$41,3,0)/'4. Billing Determinants'!$D$41*$D23))))),0)","v":0},{"$f":"IFERROR(IF(X$4=\"\",0,IF($E23=\"kWh\",VLOOKUP(X$4,'4. Billing Determinants'!$B$19:$Z$41,4,0)/'4. Billing Determinants'!$E$41*$D23,IF($E23=\"kW\",VLOOKUP(X$4,'4. Billing Determinants'!$B$19:$Z$41,5,0)/'4. Billing Determinants'!$F$41*$D23,IF($E23=\"Non-RPP kWh\",VLOOKUP(X$4,'4. Billing Determinants'!$B$19:$Z$41,6,0)/'4. Billing Determinants'!$G$41*$D23,IF($E23=\"Distribution Rev.\",VLOOKUP(X$4,'4. Billing Determinants'!$B$19:$Z$41,8,0)/'4. Billing Determinants'!$I$41*$D23, VLOOKUP(X$4,'4. Billing Determinants'!$B$19:$Z$41,3,0)/'4. Billing Determinants'!$D$41*$D23))))),0)","v":0},{"$f":"IFERROR(IF(Y$4=\"\",0,IF($E23=\"kWh\",VLOOKUP(Y$4,'4. Billing Determinants'!$B$19:$Z$41,4,0)/'4. Billing Determinants'!$E$41*$D23,IF($E23=\"kW\",VLOOKUP(Y$4,'4. Billing Determinants'!$B$19:$Z$41,5,0)/'4. Billing Determinants'!$F$41*$D23,IF($E23=\"Non-RPP kWh\",VLOOKUP(Y$4,'4. Billing Determinants'!$B$19:$Z$41,6,0)/'4. Billing Determinants'!$G$41*$D23,IF($E23=\"Distribution Rev.\",VLOOKUP(Y$4,'4. Billing Determinants'!$B$19:$Z$41,8,0)/'4. Billing Determinants'!$I$41*$D23, VLOOKUP(Y$4,'4. Billing Determinants'!$B$19:$Z$41,3,0)/'4. Billing Determinants'!$D$41*$D23))))),0)","v":0}]
[null,"Other Regulatory Assets - Sub-Account - Financial Assistance Payment and Recovery Carrying Charges",1508,{"$f":"'2. 2015 Continuity Schedule'!BS47","v":0},"kWh",{"$f":"IFERROR(IF(F$4=\"\",0,IF($E24=\"kWh\",VLOOKUP(F$4,'4. Billing Determinants'!$B$19:$Z$41,4,0)/'4. Billing Determinants'!$E$41*$D24,IF($E24=\"kW\",VLOOKUP(F$4,'4. Billing Determinants'!$B$19:$Z$41,5,0)/'4. Billing Determinants'!$F$41*$D24,IF($E24=\"Non-RPP kWh\",VLOOKUP(F$4,'4. Billing Determinants'!$B$19:$Z$41,6,0)/'4. Billing Determinants'!$G$41*$D24,IF($E24=\"Distribution Rev.\",VLOOKUP(F$4,'4. Billing Determinants'!$B$19:$Z$41,8,0)/'4. Billing Determinants'!$I$41*$D24, VLOOKUP(F$4,'4. Billing Determinants'!$B$19:$Z$41,3,0)/'4. Billing Determinants'!$D$41*$D24))))),0)","v":0},{"$f":"IFERROR(IF(G$4=\"\",0,IF($E24=\"kWh\",VLOOKUP(G$4,'4. Billing Determinants'!$B$19:$Z$41,4,0)/'4. Billing Determinants'!$E$41*$D24,IF($E24=\"kW\",VLOOKUP(G$4,'4. Billing Determinants'!$B$19:$Z$41,5,0)/'4. Billing Determinants'!$F$41*$D24,IF($E24=\"Non-RPP kWh\",VLOOKUP(G$4,'4. Billing Determinants'!$B$19:$Z$41,6,0)/'4. Billing Determinants'!$G$41*$D24,IF($E24=\"Distribution Rev.\",VLOOKUP(G$4,'4. Billing Determinants'!$B$19:$Z$41,8,0)/'4. Billing Determinants'!$I$41*$D24, VLOOKUP(G$4,'4. Billing Determinants'!$B$19:$Z$41,3,0)/'4. Billing Determinants'!$D$41*$D24))))),0)","v":0},{"$f":"IFERROR(IF(H$4=\"\",0,IF($E24=\"kWh\",VLOOKUP(H$4,'4. Billing Determinants'!$B$19:$Z$41,4,0)/'4. Billing Determinants'!$E$41*$D24,IF($E24=\"kW\",VLOOKUP(H$4,'4. Billing Determinants'!$B$19:$Z$41,5,0)/'4. Billing Determinants'!$F$41*$D24,IF($E24=\"Non-RPP kWh\",VLOOKUP(H$4,'4. Billing Determinants'!$B$19:$Z$41,6,0)/'4. Billing Determinants'!$G$41*$D24,IF($E24=\"Distribution Rev.\",VLOOKUP(H$4,'4. Billing Determinants'!$B$19:$Z$41,8,0)/'4. Billing Determinants'!$I$41*$D24, VLOOKUP(H$4,'4. Billing Determinants'!$B$19:$Z$41,3,0)/'4. Billing Determinants'!$D$41*$D24))))),0)","v":0},{"$f":"IFERROR(IF(I$4=\"\",0,IF($E24=\"kWh\",VLOOKUP(I$4,'4. Billing Determinants'!$B$19:$Z$41,4,0)/'4. Billing Determinants'!$E$41*$D24,IF($E24=\"kW\",VLOOKUP(I$4,'4. Billing Determinants'!$B$19:$Z$41,5,0)/'4. Billing Determinants'!$F$41*$D24,IF($E24=\"Non-RPP kWh\",VLOOKUP(I$4,'4. Billing Determinants'!$B$19:$Z$41,6,0)/'4. Billing Determinants'!$G$41*$D24,IF($E24=\"Distribution Rev.\",VLOOKUP(I$4,'4. Billing Determinants'!$B$19:$Z$41,8,0)/'4. Billing Determinants'!$I$41*$D24, VLOOKUP(I$4,'4. Billing Determinants'!$B$19:$Z$41,3,0)/'4. Billing Determinants'!$D$41*$D24))))),0)","v":0},{"$f":"IFERROR(IF(J$4=\"\",0,IF($E24=\"kWh\",VLOOKUP(J$4,'4. Billing Determinants'!$B$19:$Z$41,4,0)/'4. Billing Determinants'!$E$41*$D24,IF($E24=\"kW\",VLOOKUP(J$4,'4. Billing Determinants'!$B$19:$Z$41,5,0)/'4. Billing Determinants'!$F$41*$D24,IF($E24=\"Non-RPP kWh\",VLOOKUP(J$4,'4. Billing Determinants'!$B$19:$Z$41,6,0)/'4. Billing Determinants'!$G$41*$D24,IF($E24=\"Distribution Rev.\",VLOOKUP(J$4,'4. Billing Determinants'!$B$19:$Z$41,8,0)/'4. Billing Determinants'!$I$41*$D24, VLOOKUP(J$4,'4. Billing Determinants'!$B$19:$Z$41,3,0)/'4. Billing Determinants'!$D$41*$D24))))),0)","v":0},{"$f":"IFERROR(IF(K$4=\"\",0,IF($E24=\"kWh\",VLOOKUP(K$4,'4. Billing Determinants'!$B$19:$Z$41,4,0)/'4. Billing Determinants'!$E$41*$D24,IF($E24=\"kW\",VLOOKUP(K$4,'4. Billing Determinants'!$B$19:$Z$41,5,0)/'4. Billing Determinants'!$F$41*$D24,IF($E24=\"Non-RPP kWh\",VLOOKUP(K$4,'4. Billing Determinants'!$B$19:$Z$41,6,0)/'4. Billing Determinants'!$G$41*$D24,IF($E24=\"Distribution Rev.\",VLOOKUP(K$4,'4. Billing Determinants'!$B$19:$Z$41,8,0)/'4. Billing Determinants'!$I$41*$D24, VLOOKUP(K$4,'4. Billing Determinants'!$B$19:$Z$41,3,0)/'4. Billing Determinants'!$D$41*$D24))))),0)","v":0},{"$f":"IFERROR(IF(L$4=\"\",0,IF($E24=\"kWh\",VLOOKUP(L$4,'4. Billing Determinants'!$B$19:$Z$41,4,0)/'4. Billing Determinants'!$E$41*$D24,IF($E24=\"kW\",VLOOKUP(L$4,'4. Billing Determinants'!$B$19:$Z$41,5,0)/'4. Billing Determinants'!$F$41*$D24,IF($E24=\"Non-RPP kWh\",VLOOKUP(L$4,'4. Billing Determinants'!$B$19:$Z$41,6,0)/'4. Billing Determinants'!$G$41*$D24,IF($E24=\"Distribution Rev.\",VLOOKUP(L$4,'4. Billing Determinants'!$B$19:$Z$41,8,0)/'4. Billing Determinants'!$I$41*$D24, VLOOKUP(L$4,'4. Billing Determinants'!$B$19:$Z$41,3,0)/'4. Billing Determinants'!$D$41*$D24))))),0)","v":0},{"$f":"IFERROR(IF(M$4=\"\",0,IF($E24=\"kWh\",VLOOKUP(M$4,'4. Billing Determinants'!$B$19:$Z$41,4,0)/'4. Billing Determinants'!$E$41*$D24,IF($E24=\"kW\",VLOOKUP(M$4,'4. Billing Determinants'!$B$19:$Z$41,5,0)/'4. Billing Determinants'!$F$41*$D24,IF($E24=\"Non-RPP kWh\",VLOOKUP(M$4,'4. Billing Determinants'!$B$19:$Z$41,6,0)/'4. Billing Determinants'!$G$41*$D24,IF($E24=\"Distribution Rev.\",VLOOKUP(M$4,'4. Billing Determinants'!$B$19:$Z$41,8,0)/'4. Billing Determinants'!$I$41*$D24, VLOOKUP(M$4,'4. Billing Determinants'!$B$19:$Z$41,3,0)/'4. Billing Determinants'!$D$41*$D24))))),0)","v":0},{"$f":"IFERROR(IF(N$4=\"\",0,IF($E24=\"kWh\",VLOOKUP(N$4,'4. Billing Determinants'!$B$19:$Z$41,4,0)/'4. Billing Determinants'!$E$41*$D24,IF($E24=\"kW\",VLOOKUP(N$4,'4. Billing Determinants'!$B$19:$Z$41,5,0)/'4. Billing Determinants'!$F$41*$D24,IF($E24=\"Non-RPP kWh\",VLOOKUP(N$4,'4. Billing Determinants'!$B$19:$Z$41,6,0)/'4. Billing Determinants'!$G$41*$D24,IF($E24=\"Distribution Rev.\",VLOOKUP(N$4,'4. Billing Determinants'!$B$19:$Z$41,8,0)/'4. Billing Determinants'!$I$41*$D24, VLOOKUP(N$4,'4. Billing Determinants'!$B$19:$Z$41,3,0)/'4. Billing Determinants'!$D$41*$D24))))),0)","v":0},{"$f":"IFERROR(IF(O$4=\"\",0,IF($E24=\"kWh\",VLOOKUP(O$4,'4. Billing Determinants'!$B$19:$Z$41,4,0)/'4. Billing Determinants'!$E$41*$D24,IF($E24=\"kW\",VLOOKUP(O$4,'4. Billing Determinants'!$B$19:$Z$41,5,0)/'4. Billing Determinants'!$F$41*$D24,IF($E24=\"Non-RPP kWh\",VLOOKUP(O$4,'4. Billing Determinants'!$B$19:$Z$41,6,0)/'4. Billing Determinants'!$G$41*$D24,IF($E24=\"Distribution Rev.\",VLOOKUP(O$4,'4. Billing Determinants'!$B$19:$Z$41,8,0)/'4. Billing Determinants'!$I$41*$D24, VLOOKUP(O$4,'4. Billing Determinants'!$B$19:$Z$41,3,0)/'4. Billing Determinants'!$D$41*$D24))))),0)","v":0},{"$f":"IFERROR(IF(P$4=\"\",0,IF($E24=\"kWh\",VLOOKUP(P$4,'4. Billing Determinants'!$B$19:$Z$41,4,0)/'4. Billing Determinants'!$E$41*$D24,IF($E24=\"kW\",VLOOKUP(P$4,'4. Billing Determinants'!$B$19:$Z$41,5,0)/'4. Billing Determinants'!$F$41*$D24,IF($E24=\"Non-RPP kWh\",VLOOKUP(P$4,'4. Billing Determinants'!$B$19:$Z$41,6,0)/'4. Billing Determinants'!$G$41*$D24,IF($E24=\"Distribution Rev.\",VLOOKUP(P$4,'4. Billing Determinants'!$B$19:$Z$41,8,0)/'4. Billing Determinants'!$I$41*$D24, VLOOKUP(P$4,'4. Billing Determinants'!$B$19:$Z$41,3,0)/'4. Billing Determinants'!$D$41*$D24))))),0)","v":0},{"$f":"IFERROR(IF(Q$4=\"\",0,IF($E24=\"kWh\",VLOOKUP(Q$4,'4. Billing Determinants'!$B$19:$Z$41,4,0)/'4. Billing Determinants'!$E$41*$D24,IF($E24=\"kW\",VLOOKUP(Q$4,'4. Billing Determinants'!$B$19:$Z$41,5,0)/'4. Billing Determinants'!$F$41*$D24,IF($E24=\"Non-RPP kWh\",VLOOKUP(Q$4,'4. Billing Determinants'!$B$19:$Z$41,6,0)/'4. Billing Determinants'!$G$41*$D24,IF($E24=\"Distribution Rev.\",VLOOKUP(Q$4,'4. Billing Determinants'!$B$19:$Z$41,8,0)/'4. Billing Determinants'!$I$41*$D24, VLOOKUP(Q$4,'4. Billing Determinants'!$B$19:$Z$41,3,0)/'4. Billing Determinants'!$D$41*$D24))))),0)","v":0},{"$f":"IFERROR(IF(R$4=\"\",0,IF($E24=\"kWh\",VLOOKUP(R$4,'4. Billing Determinants'!$B$19:$Z$41,4,0)/'4. Billing Determinants'!$E$41*$D24,IF($E24=\"kW\",VLOOKUP(R$4,'4. Billing Determinants'!$B$19:$Z$41,5,0)/'4. Billing Determinants'!$F$41*$D24,IF($E24=\"Non-RPP kWh\",VLOOKUP(R$4,'4. Billing Determinants'!$B$19:$Z$41,6,0)/'4. Billing Determinants'!$G$41*$D24,IF($E24=\"Distribution Rev.\",VLOOKUP(R$4,'4. Billing Determinants'!$B$19:$Z$41,8,0)/'4. Billing Determinants'!$I$41*$D24, VLOOKUP(R$4,'4. Billing Determinants'!$B$19:$Z$41,3,0)/'4. Billing Determinants'!$D$41*$D24))))),0)","v":0},{"$f":"IFERROR(IF(S$4=\"\",0,IF($E24=\"kWh\",VLOOKUP(S$4,'4. Billing Determinants'!$B$19:$Z$41,4,0)/'4. Billing Determinants'!$E$41*$D24,IF($E24=\"kW\",VLOOKUP(S$4,'4. Billing Determinants'!$B$19:$Z$41,5,0)/'4. Billing Determinants'!$F$41*$D24,IF($E24=\"Non-RPP kWh\",VLOOKUP(S$4,'4. Billing Determinants'!$B$19:$Z$41,6,0)/'4. Billing Determinants'!$G$41*$D24,IF($E24=\"Distribution Rev.\",VLOOKUP(S$4,'4. Billing Determinants'!$B$19:$Z$41,8,0)/'4. Billing Determinants'!$I$41*$D24, VLOOKUP(S$4,'4. Billing Determinants'!$B$19:$Z$41,3,0)/'4. Billing Determinants'!$D$41*$D24))))),0)","v":0},{"$f":"IFERROR(IF(T$4=\"\",0,IF($E24=\"kWh\",VLOOKUP(T$4,'4. Billing Determinants'!$B$19:$Z$41,4,0)/'4. Billing Determinants'!$E$41*$D24,IF($E24=\"kW\",VLOOKUP(T$4,'4. Billing Determinants'!$B$19:$Z$41,5,0)/'4. Billing Determinants'!$F$41*$D24,IF($E24=\"Non-RPP kWh\",VLOOKUP(T$4,'4. Billing Determinants'!$B$19:$Z$41,6,0)/'4. Billing Determinants'!$G$41*$D24,IF($E24=\"Distribution Rev.\",VLOOKUP(T$4,'4. Billing Determinants'!$B$19:$Z$41,8,0)/'4. Billing Determinants'!$I$41*$D24, VLOOKUP(T$4,'4. Billing Determinants'!$B$19:$Z$41,3,0)/'4. Billing Determinants'!$D$41*$D24))))),0)","v":0},{"$f":"IFERROR(IF(U$4=\"\",0,IF($E24=\"kWh\",VLOOKUP(U$4,'4. Billing Determinants'!$B$19:$Z$41,4,0)/'4. Billing Determinants'!$E$41*$D24,IF($E24=\"kW\",VLOOKUP(U$4,'4. Billing Determinants'!$B$19:$Z$41,5,0)/'4. Billing Determinants'!$F$41*$D24,IF($E24=\"Non-RPP kWh\",VLOOKUP(U$4,'4. Billing Determinants'!$B$19:$Z$41,6,0)/'4. Billing Determinants'!$G$41*$D24,IF($E24=\"Distribution Rev.\",VLOOKUP(U$4,'4. Billing Determinants'!$B$19:$Z$41,8,0)/'4. Billing Determinants'!$I$41*$D24, VLOOKUP(U$4,'4. Billing Determinants'!$B$19:$Z$41,3,0)/'4. Billing Determinants'!$D$41*$D24))))),0)","v":0},{"$f":"IFERROR(IF(V$4=\"\",0,IF($E24=\"kWh\",VLOOKUP(V$4,'4. Billing Determinants'!$B$19:$Z$41,4,0)/'4. Billing Determinants'!$E$41*$D24,IF($E24=\"kW\",VLOOKUP(V$4,'4. Billing Determinants'!$B$19:$Z$41,5,0)/'4. Billing Determinants'!$F$41*$D24,IF($E24=\"Non-RPP kWh\",VLOOKUP(V$4,'4. Billing Determinants'!$B$19:$Z$41,6,0)/'4. Billing Determinants'!$G$41*$D24,IF($E24=\"Distribution Rev.\",VLOOKUP(V$4,'4. Billing Determinants'!$B$19:$Z$41,8,0)/'4. Billing Determinants'!$I$41*$D24, VLOOKUP(V$4,'4. Billing Determinants'!$B$19:$Z$41,3,0)/'4. Billing Determinants'!$D$41*$D24))))),0)","v":0},{"$f":"IFERROR(IF(W$4=\"\",0,IF($E24=\"kWh\",VLOOKUP(W$4,'4. Billing Determinants'!$B$19:$Z$41,4,0)/'4. Billing Determinants'!$E$41*$D24,IF($E24=\"kW\",VLOOKUP(W$4,'4. Billing Determinants'!$B$19:$Z$41,5,0)/'4. Billing Determinants'!$F$41*$D24,IF($E24=\"Non-RPP kWh\",VLOOKUP(W$4,'4. Billing Determinants'!$B$19:$Z$41,6,0)/'4. Billing Determinants'!$G$41*$D24,IF($E24=\"Distribution Rev.\",VLOOKUP(W$4,'4. Billing Determinants'!$B$19:$Z$41,8,0)/'4. Billing Determinants'!$I$41*$D24, VLOOKUP(W$4,'4. Billing Determinants'!$B$19:$Z$41,3,0)/'4. Billing Determinants'!$D$41*$D24))))),0)","v":0},{"$f":"IFERROR(IF(X$4=\"\",0,IF($E24=\"kWh\",VLOOKUP(X$4,'4. Billing Determinants'!$B$19:$Z$41,4,0)/'4. Billing Determinants'!$E$41*$D24,IF($E24=\"kW\",VLOOKUP(X$4,'4. Billing Determinants'!$B$19:$Z$41,5,0)/'4. Billing Determinants'!$F$41*$D24,IF($E24=\"Non-RPP kWh\",VLOOKUP(X$4,'4. Billing Determinants'!$B$19:$Z$41,6,0)/'4. Billing Determinants'!$G$41*$D24,IF($E24=\"Distribution Rev.\",VLOOKUP(X$4,'4. Billing Determinants'!$B$19:$Z$41,8,0)/'4. Billing Determinants'!$I$41*$D24, VLOOKUP(X$4,'4. Billing Determinants'!$B$19:$Z$41,3,0)/'4. Billing Determinants'!$D$41*$D24))))),0)","v":0},{"$f":"IFERROR(IF(Y$4=\"\",0,IF($E24=\"kWh\",VLOOKUP(Y$4,'4. Billing Determinants'!$B$19:$Z$41,4,0)/'4. Billing Determinants'!$E$41*$D24,IF($E24=\"kW\",VLOOKUP(Y$4,'4. Billing Determinants'!$B$19:$Z$41,5,0)/'4. Billing Determinants'!$F$41*$D24,IF($E24=\"Non-RPP kWh\",VLOOKUP(Y$4,'4. Billing Determinants'!$B$19:$Z$41,6,0)/'4. Billing Determinants'!$G$41*$D24,IF($E24=\"Distribution Rev.\",VLOOKUP(Y$4,'4. Billing Determinants'!$B$19:$Z$41,8,0)/'4. Billing Determinants'!$I$41*$D24, VLOOKUP(Y$4,'4. Billing Determinants'!$B$19:$Z$41,3,0)/'4. Billing Determinants'!$D$41*$D24))))),0)","v":0}]
[null,"Other Regulatory Assets - Sub-Account - Other 4",1508,{"$f":"'2. 2015 Continuity Schedule'!BS48","v":0},"kWh",{"$f":"IFERROR(IF(F$4=\"\",0,IF($E25=\"kWh\",VLOOKUP(F$4,'4. Billing Determinants'!$B$19:$Z$41,4,0)/'4. Billing Determinants'!$E$41*$D25,IF($E25=\"kW\",VLOOKUP(F$4,'4. Billing Determinants'!$B$19:$Z$41,5,0)/'4. Billing Determinants'!$F$41*$D25,IF($E25=\"Non-RPP kWh\",VLOOKUP(F$4,'4. Billing Determinants'!$B$19:$Z$41,6,0)/'4. Billing Determinants'!$G$41*$D25,IF($E25=\"Distribution Rev.\",VLOOKUP(F$4,'4. Billing Determinants'!$B$19:$Z$41,8,0)/'4. Billing Determinants'!$I$41*$D25, VLOOKUP(F$4,'4. Billing Determinants'!$B$19:$Z$41,3,0)/'4. Billing Determinants'!$D$41*$D25))))),0)","v":0},{"$f":"IFERROR(IF(G$4=\"\",0,IF($E25=\"kWh\",VLOOKUP(G$4,'4. Billing Determinants'!$B$19:$Z$41,4,0)/'4. Billing Determinants'!$E$41*$D25,IF($E25=\"kW\",VLOOKUP(G$4,'4. Billing Determinants'!$B$19:$Z$41,5,0)/'4. Billing Determinants'!$F$41*$D25,IF($E25=\"Non-RPP kWh\",VLOOKUP(G$4,'4. Billing Determinants'!$B$19:$Z$41,6,0)/'4. Billing Determinants'!$G$41*$D25,IF($E25=\"Distribution Rev.\",VLOOKUP(G$4,'4. Billing Determinants'!$B$19:$Z$41,8,0)/'4. Billing Determinants'!$I$41*$D25, VLOOKUP(G$4,'4. Billing Determinants'!$B$19:$Z$41,3,0)/'4. Billing Determinants'!$D$41*$D25))))),0)","v":0},{"$f":"IFERROR(IF(H$4=\"\",0,IF($E25=\"kWh\",VLOOKUP(H$4,'4. Billing Determinants'!$B$19:$Z$41,4,0)/'4. Billing Determinants'!$E$41*$D25,IF($E25=\"kW\",VLOOKUP(H$4,'4. Billing Determinants'!$B$19:$Z$41,5,0)/'4. Billing Determinants'!$F$41*$D25,IF($E25=\"Non-RPP kWh\",VLOOKUP(H$4,'4. Billing Determinants'!$B$19:$Z$41,6,0)/'4. Billing Determinants'!$G$41*$D25,IF($E25=\"Distribution Rev.\",VLOOKUP(H$4,'4. Billing Determinants'!$B$19:$Z$41,8,0)/'4. Billing Determinants'!$I$41*$D25, VLOOKUP(H$4,'4. Billing Determinants'!$B$19:$Z$41,3,0)/'4. Billing Determinants'!$D$41*$D25))))),0)","v":0},{"$f":"IFERROR(IF(I$4=\"\",0,IF($E25=\"kWh\",VLOOKUP(I$4,'4. Billing Determinants'!$B$19:$Z$41,4,0)/'4. Billing Determinants'!$E$41*$D25,IF($E25=\"kW\",VLOOKUP(I$4,'4. Billing Determinants'!$B$19:$Z$41,5,0)/'4. Billing Determinants'!$F$41*$D25,IF($E25=\"Non-RPP kWh\",VLOOKUP(I$4,'4. Billing Determinants'!$B$19:$Z$41,6,0)/'4. Billing Determinants'!$G$41*$D25,IF($E25=\"Distribution Rev.\",VLOOKUP(I$4,'4. Billing Determinants'!$B$19:$Z$41,8,0)/'4. Billing Determinants'!$I$41*$D25, VLOOKUP(I$4,'4. Billing Determinants'!$B$19:$Z$41,3,0)/'4. Billing Determinants'!$D$41*$D25))))),0)","v":0},{"$f":"IFERROR(IF(J$4=\"\",0,IF($E25=\"kWh\",VLOOKUP(J$4,'4. Billing Determinants'!$B$19:$Z$41,4,0)/'4. Billing Determinants'!$E$41*$D25,IF($E25=\"kW\",VLOOKUP(J$4,'4. Billing Determinants'!$B$19:$Z$41,5,0)/'4. Billing Determinants'!$F$41*$D25,IF($E25=\"Non-RPP kWh\",VLOOKUP(J$4,'4. Billing Determinants'!$B$19:$Z$41,6,0)/'4. Billing Determinants'!$G$41*$D25,IF($E25=\"Distribution Rev.\",VLOOKUP(J$4,'4. Billing Determinants'!$B$19:$Z$41,8,0)/'4. Billing Determinants'!$I$41*$D25, VLOOKUP(J$4,'4. Billing Determinants'!$B$19:$Z$41,3,0)/'4. Billing Determinants'!$D$41*$D25))))),0)","v":0},{"$f":"IFERROR(IF(K$4=\"\",0,IF($E25=\"kWh\",VLOOKUP(K$4,'4. Billing Determinants'!$B$19:$Z$41,4,0)/'4. Billing Determinants'!$E$41*$D25,IF($E25=\"kW\",VLOOKUP(K$4,'4. Billing Determinants'!$B$19:$Z$41,5,0)/'4. Billing Determinants'!$F$41*$D25,IF($E25=\"Non-RPP kWh\",VLOOKUP(K$4,'4. Billing Determinants'!$B$19:$Z$41,6,0)/'4. Billing Determinants'!$G$41*$D25,IF($E25=\"Distribution Rev.\",VLOOKUP(K$4,'4. Billing Determinants'!$B$19:$Z$41,8,0)/'4. Billing Determinants'!$I$41*$D25, VLOOKUP(K$4,'4. Billing Determinants'!$B$19:$Z$41,3,0)/'4. Billing Determinants'!$D$41*$D25))))),0)","v":0},{"$f":"IFERROR(IF(L$4=\"\",0,IF($E25=\"kWh\",VLOOKUP(L$4,'4. Billing Determinants'!$B$19:$Z$41,4,0)/'4. Billing Determinants'!$E$41*$D25,IF($E25=\"kW\",VLOOKUP(L$4,'4. Billing Determinants'!$B$19:$Z$41,5,0)/'4. Billing Determinants'!$F$41*$D25,IF($E25=\"Non-RPP kWh\",VLOOKUP(L$4,'4. Billing Determinants'!$B$19:$Z$41,6,0)/'4. Billing Determinants'!$G$41*$D25,IF($E25=\"Distribution Rev.\",VLOOKUP(L$4,'4. Billing Determinants'!$B$19:$Z$41,8,0)/'4. Billing Determinants'!$I$41*$D25, VLOOKUP(L$4,'4. Billing Determinants'!$B$19:$Z$41,3,0)/'4. Billing Determinants'!$D$41*$D25))))),0)","v":0},{"$f":"IFERROR(IF(M$4=\"\",0,IF($E25=\"kWh\",VLOOKUP(M$4,'4. Billing Determinants'!$B$19:$Z$41,4,0)/'4. Billing Determinants'!$E$41*$D25,IF($E25=\"kW\",VLOOKUP(M$4,'4. Billing Determinants'!$B$19:$Z$41,5,0)/'4. Billing Determinants'!$F$41*$D25,IF($E25=\"Non-RPP kWh\",VLOOKUP(M$4,'4. Billing Determinants'!$B$19:$Z$41,6,0)/'4. Billing Determinants'!$G$41*$D25,IF($E25=\"Distribution Rev.\",VLOOKUP(M$4,'4. Billing Determinants'!$B$19:$Z$41,8,0)/'4. Billing Determinants'!$I$41*$D25, VLOOKUP(M$4,'4. Billing Determinants'!$B$19:$Z$41,3,0)/'4. Billing Determinants'!$D$41*$D25))))),0)","v":0},{"$f":"IFERROR(IF(N$4=\"\",0,IF($E25=\"kWh\",VLOOKUP(N$4,'4. Billing Determinants'!$B$19:$Z$41,4,0)/'4. Billing Determinants'!$E$41*$D25,IF($E25=\"kW\",VLOOKUP(N$4,'4. Billing Determinants'!$B$19:$Z$41,5,0)/'4. Billing Determinants'!$F$41*$D25,IF($E25=\"Non-RPP kWh\",VLOOKUP(N$4,'4. Billing Determinants'!$B$19:$Z$41,6,0)/'4. Billing Determinants'!$G$41*$D25,IF($E25=\"Distribution Rev.\",VLOOKUP(N$4,'4. Billing Determinants'!$B$19:$Z$41,8,0)/'4. Billing Determinants'!$I$41*$D25, VLOOKUP(N$4,'4. Billing Determinants'!$B$19:$Z$41,3,0)/'4. Billing Determinants'!$D$41*$D25))))),0)","v":0},{"$f":"IFERROR(IF(O$4=\"\",0,IF($E25=\"kWh\",VLOOKUP(O$4,'4. Billing Determinants'!$B$19:$Z$41,4,0)/'4. Billing Determinants'!$E$41*$D25,IF($E25=\"kW\",VLOOKUP(O$4,'4. Billing Determinants'!$B$19:$Z$41,5,0)/'4. Billing Determinants'!$F$41*$D25,IF($E25=\"Non-RPP kWh\",VLOOKUP(O$4,'4. Billing Determinants'!$B$19:$Z$41,6,0)/'4. Billing Determinants'!$G$41*$D25,IF($E25=\"Distribution Rev.\",VLOOKUP(O$4,'4. Billing Determinants'!$B$19:$Z$41,8,0)/'4. Billing Determinants'!$I$41*$D25, VLOOKUP(O$4,'4. Billing Determinants'!$B$19:$Z$41,3,0)/'4. Billing Determinants'!$D$41*$D25))))),0)","v":0},{"$f":"IFERROR(IF(P$4=\"\",0,IF($E25=\"kWh\",VLOOKUP(P$4,'4. Billing Determinants'!$B$19:$Z$41,4,0)/'4. Billing Determinants'!$E$41*$D25,IF($E25=\"kW\",VLOOKUP(P$4,'4. Billing Determinants'!$B$19:$Z$41,5,0)/'4. Billing Determinants'!$F$41*$D25,IF($E25=\"Non-RPP kWh\",VLOOKUP(P$4,'4. Billing Determinants'!$B$19:$Z$41,6,0)/'4. Billing Determinants'!$G$41*$D25,IF($E25=\"Distribution Rev.\",VLOOKUP(P$4,'4. Billing Determinants'!$B$19:$Z$41,8,0)/'4. Billing Determinants'!$I$41*$D25, VLOOKUP(P$4,'4. Billing Determinants'!$B$19:$Z$41,3,0)/'4. Billing Determinants'!$D$41*$D25))))),0)","v":0},{"$f":"IFERROR(IF(Q$4=\"\",0,IF($E25=\"kWh\",VLOOKUP(Q$4,'4. Billing Determinants'!$B$19:$Z$41,4,0)/'4. Billing Determinants'!$E$41*$D25,IF($E25=\"kW\",VLOOKUP(Q$4,'4. Billing Determinants'!$B$19:$Z$41,5,0)/'4. Billing Determinants'!$F$41*$D25,IF($E25=\"Non-RPP kWh\",VLOOKUP(Q$4,'4. Billing Determinants'!$B$19:$Z$41,6,0)/'4. Billing Determinants'!$G$41*$D25,IF($E25=\"Distribution Rev.\",VLOOKUP(Q$4,'4. Billing Determinants'!$B$19:$Z$41,8,0)/'4. Billing Determinants'!$I$41*$D25, VLOOKUP(Q$4,'4. Billing Determinants'!$B$19:$Z$41,3,0)/'4. Billing Determinants'!$D$41*$D25))))),0)","v":0},{"$f":"IFERROR(IF(R$4=\"\",0,IF($E25=\"kWh\",VLOOKUP(R$4,'4. Billing Determinants'!$B$19:$Z$41,4,0)/'4. Billing Determinants'!$E$41*$D25,IF($E25=\"kW\",VLOOKUP(R$4,'4. Billing Determinants'!$B$19:$Z$41,5,0)/'4. Billing Determinants'!$F$41*$D25,IF($E25=\"Non-RPP kWh\",VLOOKUP(R$4,'4. Billing Determinants'!$B$19:$Z$41,6,0)/'4. Billing Determinants'!$G$41*$D25,IF($E25=\"Distribution Rev.\",VLOOKUP(R$4,'4. Billing Determinants'!$B$19:$Z$41,8,0)/'4. Billing Determinants'!$I$41*$D25, VLOOKUP(R$4,'4. Billing Determinants'!$B$19:$Z$41,3,0)/'4. Billing Determinants'!$D$41*$D25))))),0)","v":0},{"$f":"IFERROR(IF(S$4=\"\",0,IF($E25=\"kWh\",VLOOKUP(S$4,'4. Billing Determinants'!$B$19:$Z$41,4,0)/'4. Billing Determinants'!$E$41*$D25,IF($E25=\"kW\",VLOOKUP(S$4,'4. Billing Determinants'!$B$19:$Z$41,5,0)/'4. Billing Determinants'!$F$41*$D25,IF($E25=\"Non-RPP kWh\",VLOOKUP(S$4,'4. Billing Determinants'!$B$19:$Z$41,6,0)/'4. Billing Determinants'!$G$41*$D25,IF($E25=\"Distribution Rev.\",VLOOKUP(S$4,'4. Billing Determinants'!$B$19:$Z$41,8,0)/'4. Billing Determinants'!$I$41*$D25, VLOOKUP(S$4,'4. Billing Determinants'!$B$19:$Z$41,3,0)/'4. Billing Determinants'!$D$41*$D25))))),0)","v":0},{"$f":"IFERROR(IF(T$4=\"\",0,IF($E25=\"kWh\",VLOOKUP(T$4,'4. Billing Determinants'!$B$19:$Z$41,4,0)/'4. Billing Determinants'!$E$41*$D25,IF($E25=\"kW\",VLOOKUP(T$4,'4. Billing Determinants'!$B$19:$Z$41,5,0)/'4. Billing Determinants'!$F$41*$D25,IF($E25=\"Non-RPP kWh\",VLOOKUP(T$4,'4. Billing Determinants'!$B$19:$Z$41,6,0)/'4. Billing Determinants'!$G$41*$D25,IF($E25=\"Distribution Rev.\",VLOOKUP(T$4,'4. Billing Determinants'!$B$19:$Z$41,8,0)/'4. Billing Determinants'!$I$41*$D25, VLOOKUP(T$4,'4. Billing Determinants'!$B$19:$Z$41,3,0)/'4. Billing Determinants'!$D$41*$D25))))),0)","v":0},{"$f":"IFERROR(IF(U$4=\"\",0,IF($E25=\"kWh\",VLOOKUP(U$4,'4. Billing Determinants'!$B$19:$Z$41,4,0)/'4. Billing Determinants'!$E$41*$D25,IF($E25=\"kW\",VLOOKUP(U$4,'4. Billing Determinants'!$B$19:$Z$41,5,0)/'4. Billing Determinants'!$F$41*$D25,IF($E25=\"Non-RPP kWh\",VLOOKUP(U$4,'4. Billing Determinants'!$B$19:$Z$41,6,0)/'4. Billing Determinants'!$G$41*$D25,IF($E25=\"Distribution Rev.\",VLOOKUP(U$4,'4. Billing Determinants'!$B$19:$Z$41,8,0)/'4. Billing Determinants'!$I$41*$D25, VLOOKUP(U$4,'4. Billing Determinants'!$B$19:$Z$41,3,0)/'4. Billing Determinants'!$D$41*$D25))))),0)","v":0},{"$f":"IFERROR(IF(V$4=\"\",0,IF($E25=\"kWh\",VLOOKUP(V$4,'4. Billing Determinants'!$B$19:$Z$41,4,0)/'4. Billing Determinants'!$E$41*$D25,IF($E25=\"kW\",VLOOKUP(V$4,'4. Billing Determinants'!$B$19:$Z$41,5,0)/'4. Billing Determinants'!$F$41*$D25,IF($E25=\"Non-RPP kWh\",VLOOKUP(V$4,'4. Billing Determinants'!$B$19:$Z$41,6,0)/'4. Billing Determinants'!$G$41*$D25,IF($E25=\"Distribution Rev.\",VLOOKUP(V$4,'4. Billing Determinants'!$B$19:$Z$41,8,0)/'4. Billing Determinants'!$I$41*$D25, VLOOKUP(V$4,'4. Billing Determinants'!$B$19:$Z$41,3,0)/'4. Billing Determinants'!$D$41*$D25))))),0)","v":0},{"$f":"IFERROR(IF(W$4=\"\",0,IF($E25=\"kWh\",VLOOKUP(W$4,'4. Billing Determinants'!$B$19:$Z$41,4,0)/'4. Billing Determinants'!$E$41*$D25,IF($E25=\"kW\",VLOOKUP(W$4,'4. Billing Determinants'!$B$19:$Z$41,5,0)/'4. Billing Determinants'!$F$41*$D25,IF($E25=\"Non-RPP kWh\",VLOOKUP(W$4,'4. Billing Determinants'!$B$19:$Z$41,6,0)/'4. Billing Determinants'!$G$41*$D25,IF($E25=\"Distribution Rev.\",VLOOKUP(W$4,'4. Billing Determinants'!$B$19:$Z$41,8,0)/'4. Billing Determinants'!$I$41*$D25, VLOOKUP(W$4,'4. Billing Determinants'!$B$19:$Z$41,3,0)/'4. Billing Determinants'!$D$41*$D25))))),0)","v":0},{"$f":"IFERROR(IF(X$4=\"\",0,IF($E25=\"kWh\",VLOOKUP(X$4,'4. Billing Determinants'!$B$19:$Z$41,4,0)/'4. Billing Determinants'!$E$41*$D25,IF($E25=\"kW\",VLOOKUP(X$4,'4. Billing Determinants'!$B$19:$Z$41,5,0)/'4. Billing Determinants'!$F$41*$D25,IF($E25=\"Non-RPP kWh\",VLOOKUP(X$4,'4. Billing Determinants'!$B$19:$Z$41,6,0)/'4. Billing Determinants'!$G$41*$D25,IF($E25=\"Distribution Rev.\",VLOOKUP(X$4,'4. Billing Determinants'!$B$19:$Z$41,8,0)/'4. Billing Determinants'!$I$41*$D25, VLOOKUP(X$4,'4. Billing Determinants'!$B$19:$Z$41,3,0)/'4. Billing Determinants'!$D$41*$D25))))),0)","v":0},{"$f":"IFERROR(IF(Y$4=\"\",0,IF($E25=\"kWh\",VLOOKUP(Y$4,'4. Billing Determinants'!$B$19:$Z$41,4,0)/'4. Billing Determinants'!$E$41*$D25,IF($E25=\"kW\",VLOOKUP(Y$4,'4. Billing Determinants'!$B$19:$Z$41,5,0)/'4. Billing Determinants'!$F$41*$D25,IF($E25=\"Non-RPP kWh\",VLOOKUP(Y$4,'4. Billing Determinants'!$B$19:$Z$41,6,0)/'4. Billing Determinants'!$G$41*$D25,IF($E25=\"Distribution Rev.\",VLOOKUP(Y$4,'4. Billing Determinants'!$B$19:$Z$41,8,0)/'4. Billing Determinants'!$I$41*$D25, VLOOKUP(Y$4,'4. Billing Determinants'!$B$19:$Z$41,3,0)/'4. Billing Determinants'!$D$41*$D25))))),0)","v":0}]
[null,"Retail Cost Variance Account - Retail",1518,{"$f":"'2. 2015 Continuity Schedule'!BS49","v":0},"kWh",{"$f":"IFERROR(IF(F$4=\"\",0,IF($E26=\"kWh\",VLOOKUP(F$4,'4. Billing Determinants'!$B$19:$Z$41,4,0)/'4. Billing Determinants'!$E$41*$D26,IF($E26=\"kW\",VLOOKUP(F$4,'4. Billing Determinants'!$B$19:$Z$41,5,0)/'4. Billing Determinants'!$F$41*$D26,IF($E26=\"Non-RPP kWh\",VLOOKUP(F$4,'4. Billing Determinants'!$B$19:$Z$41,6,0)/'4. Billing Determinants'!$G$41*$D26,IF($E26=\"Distribution Rev.\",VLOOKUP(F$4,'4. Billing Determinants'!$B$19:$Z$41,8,0)/'4. Billing Determinants'!$I$41*$D26, VLOOKUP(F$4,'4. Billing Determinants'!$B$19:$Z$41,3,0)/'4. Billing Determinants'!$D$41*$D26))))),0)","v":0},{"$f":"IFERROR(IF(G$4=\"\",0,IF($E26=\"kWh\",VLOOKUP(G$4,'4. Billing Determinants'!$B$19:$Z$41,4,0)/'4. Billing Determinants'!$E$41*$D26,IF($E26=\"kW\",VLOOKUP(G$4,'4. Billing Determinants'!$B$19:$Z$41,5,0)/'4. Billing Determinants'!$F$41*$D26,IF($E26=\"Non-RPP kWh\",VLOOKUP(G$4,'4. Billing Determinants'!$B$19:$Z$41,6,0)/'4. Billing Determinants'!$G$41*$D26,IF($E26=\"Distribution Rev.\",VLOOKUP(G$4,'4. Billing Determinants'!$B$19:$Z$41,8,0)/'4. Billing Determinants'!$I$41*$D26, VLOOKUP(G$4,'4. Billing Determinants'!$B$19:$Z$41,3,0)/'4. Billing Determinants'!$D$41*$D26))))),0)","v":0},{"$f":"IFERROR(IF(H$4=\"\",0,IF($E26=\"kWh\",VLOOKUP(H$4,'4. Billing Determinants'!$B$19:$Z$41,4,0)/'4. Billing Determinants'!$E$41*$D26,IF($E26=\"kW\",VLOOKUP(H$4,'4. Billing Determinants'!$B$19:$Z$41,5,0)/'4. Billing Determinants'!$F$41*$D26,IF($E26=\"Non-RPP kWh\",VLOOKUP(H$4,'4. Billing Determinants'!$B$19:$Z$41,6,0)/'4. Billing Determinants'!$G$41*$D26,IF($E26=\"Distribution Rev.\",VLOOKUP(H$4,'4. Billing Determinants'!$B$19:$Z$41,8,0)/'4. Billing Determinants'!$I$41*$D26, VLOOKUP(H$4,'4. Billing Determinants'!$B$19:$Z$41,3,0)/'4. Billing Determinants'!$D$41*$D26))))),0)","v":0},{"$f":"IFERROR(IF(I$4=\"\",0,IF($E26=\"kWh\",VLOOKUP(I$4,'4. Billing Determinants'!$B$19:$Z$41,4,0)/'4. Billing Determinants'!$E$41*$D26,IF($E26=\"kW\",VLOOKUP(I$4,'4. Billing Determinants'!$B$19:$Z$41,5,0)/'4. Billing Determinants'!$F$41*$D26,IF($E26=\"Non-RPP kWh\",VLOOKUP(I$4,'4. Billing Determinants'!$B$19:$Z$41,6,0)/'4. Billing Determinants'!$G$41*$D26,IF($E26=\"Distribution Rev.\",VLOOKUP(I$4,'4. Billing Determinants'!$B$19:$Z$41,8,0)/'4. Billing Determinants'!$I$41*$D26, VLOOKUP(I$4,'4. Billing Determinants'!$B$19:$Z$41,3,0)/'4. Billing Determinants'!$D$41*$D26))))),0)","v":0},{"$f":"IFERROR(IF(J$4=\"\",0,IF($E26=\"kWh\",VLOOKUP(J$4,'4. Billing Determinants'!$B$19:$Z$41,4,0)/'4. Billing Determinants'!$E$41*$D26,IF($E26=\"kW\",VLOOKUP(J$4,'4. Billing Determinants'!$B$19:$Z$41,5,0)/'4. Billing Determinants'!$F$41*$D26,IF($E26=\"Non-RPP kWh\",VLOOKUP(J$4,'4. Billing Determinants'!$B$19:$Z$41,6,0)/'4. Billing Determinants'!$G$41*$D26,IF($E26=\"Distribution Rev.\",VLOOKUP(J$4,'4. Billing Determinants'!$B$19:$Z$41,8,0)/'4. Billing Determinants'!$I$41*$D26, VLOOKUP(J$4,'4. Billing Determinants'!$B$19:$Z$41,3,0)/'4. Billing Determinants'!$D$41*$D26))))),0)","v":0},{"$f":"IFERROR(IF(K$4=\"\",0,IF($E26=\"kWh\",VLOOKUP(K$4,'4. Billing Determinants'!$B$19:$Z$41,4,0)/'4. Billing Determinants'!$E$41*$D26,IF($E26=\"kW\",VLOOKUP(K$4,'4. Billing Determinants'!$B$19:$Z$41,5,0)/'4. Billing Determinants'!$F$41*$D26,IF($E26=\"Non-RPP kWh\",VLOOKUP(K$4,'4. Billing Determinants'!$B$19:$Z$41,6,0)/'4. Billing Determinants'!$G$41*$D26,IF($E26=\"Distribution Rev.\",VLOOKUP(K$4,'4. Billing Determinants'!$B$19:$Z$41,8,0)/'4. Billing Determinants'!$I$41*$D26, VLOOKUP(K$4,'4. Billing Determinants'!$B$19:$Z$41,3,0)/'4. Billing Determinants'!$D$41*$D26))))),0)","v":0},{"$f":"IFERROR(IF(L$4=\"\",0,IF($E26=\"kWh\",VLOOKUP(L$4,'4. Billing Determinants'!$B$19:$Z$41,4,0)/'4. Billing Determinants'!$E$41*$D26,IF($E26=\"kW\",VLOOKUP(L$4,'4. Billing Determinants'!$B$19:$Z$41,5,0)/'4. Billing Determinants'!$F$41*$D26,IF($E26=\"Non-RPP kWh\",VLOOKUP(L$4,'4. Billing Determinants'!$B$19:$Z$41,6,0)/'4. Billing Determinants'!$G$41*$D26,IF($E26=\"Distribution Rev.\",VLOOKUP(L$4,'4. Billing Determinants'!$B$19:$Z$41,8,0)/'4. Billing Determinants'!$I$41*$D26, VLOOKUP(L$4,'4. Billing Determinants'!$B$19:$Z$41,3,0)/'4. Billing Determinants'!$D$41*$D26))))),0)","v":0},{"$f":"IFERROR(IF(M$4=\"\",0,IF($E26=\"kWh\",VLOOKUP(M$4,'4. Billing Determinants'!$B$19:$Z$41,4,0)/'4. Billing Determinants'!$E$41*$D26,IF($E26=\"kW\",VLOOKUP(M$4,'4. Billing Determinants'!$B$19:$Z$41,5,0)/'4. Billing Determinants'!$F$41*$D26,IF($E26=\"Non-RPP kWh\",VLOOKUP(M$4,'4. Billing Determinants'!$B$19:$Z$41,6,0)/'4. Billing Determinants'!$G$41*$D26,IF($E26=\"Distribution Rev.\",VLOOKUP(M$4,'4. Billing Determinants'!$B$19:$Z$41,8,0)/'4. Billing Determinants'!$I$41*$D26, VLOOKUP(M$4,'4. Billing Determinants'!$B$19:$Z$41,3,0)/'4. Billing Determinants'!$D$41*$D26))))),0)","v":0},{"$f":"IFERROR(IF(N$4=\"\",0,IF($E26=\"kWh\",VLOOKUP(N$4,'4. Billing Determinants'!$B$19:$Z$41,4,0)/'4. Billing Determinants'!$E$41*$D26,IF($E26=\"kW\",VLOOKUP(N$4,'4. Billing Determinants'!$B$19:$Z$41,5,0)/'4. Billing Determinants'!$F$41*$D26,IF($E26=\"Non-RPP kWh\",VLOOKUP(N$4,'4. Billing Determinants'!$B$19:$Z$41,6,0)/'4. Billing Determinants'!$G$41*$D26,IF($E26=\"Distribution Rev.\",VLOOKUP(N$4,'4. Billing Determinants'!$B$19:$Z$41,8,0)/'4. Billing Determinants'!$I$41*$D26, VLOOKUP(N$4,'4. Billing Determinants'!$B$19:$Z$41,3,0)/'4. Billing Determinants'!$D$41*$D26))))),0)","v":0},{"$f":"IFERROR(IF(O$4=\"\",0,IF($E26=\"kWh\",VLOOKUP(O$4,'4. Billing Determinants'!$B$19:$Z$41,4,0)/'4. Billing Determinants'!$E$41*$D26,IF($E26=\"kW\",VLOOKUP(O$4,'4. Billing Determinants'!$B$19:$Z$41,5,0)/'4. Billing Determinants'!$F$41*$D26,IF($E26=\"Non-RPP kWh\",VLOOKUP(O$4,'4. Billing Determinants'!$B$19:$Z$41,6,0)/'4. Billing Determinants'!$G$41*$D26,IF($E26=\"Distribution Rev.\",VLOOKUP(O$4,'4. Billing Determinants'!$B$19:$Z$41,8,0)/'4. Billing Determinants'!$I$41*$D26, VLOOKUP(O$4,'4. Billing Determinants'!$B$19:$Z$41,3,0)/'4. Billing Determinants'!$D$41*$D26))))),0)","v":0},{"$f":"IFERROR(IF(P$4=\"\",0,IF($E26=\"kWh\",VLOOKUP(P$4,'4. Billing Determinants'!$B$19:$Z$41,4,0)/'4. Billing Determinants'!$E$41*$D26,IF($E26=\"kW\",VLOOKUP(P$4,'4. Billing Determinants'!$B$19:$Z$41,5,0)/'4. Billing Determinants'!$F$41*$D26,IF($E26=\"Non-RPP kWh\",VLOOKUP(P$4,'4. Billing Determinants'!$B$19:$Z$41,6,0)/'4. Billing Determinants'!$G$41*$D26,IF($E26=\"Distribution Rev.\",VLOOKUP(P$4,'4. Billing Determinants'!$B$19:$Z$41,8,0)/'4. Billing Determinants'!$I$41*$D26, VLOOKUP(P$4,'4. Billing Determinants'!$B$19:$Z$41,3,0)/'4. Billing Determinants'!$D$41*$D26))))),0)","v":0},{"$f":"IFERROR(IF(Q$4=\"\",0,IF($E26=\"kWh\",VLOOKUP(Q$4,'4. Billing Determinants'!$B$19:$Z$41,4,0)/'4. Billing Determinants'!$E$41*$D26,IF($E26=\"kW\",VLOOKUP(Q$4,'4. Billing Determinants'!$B$19:$Z$41,5,0)/'4. Billing Determinants'!$F$41*$D26,IF($E26=\"Non-RPP kWh\",VLOOKUP(Q$4,'4. Billing Determinants'!$B$19:$Z$41,6,0)/'4. Billing Determinants'!$G$41*$D26,IF($E26=\"Distribution Rev.\",VLOOKUP(Q$4,'4. Billing Determinants'!$B$19:$Z$41,8,0)/'4. Billing Determinants'!$I$41*$D26, VLOOKUP(Q$4,'4. Billing Determinants'!$B$19:$Z$41,3,0)/'4. Billing Determinants'!$D$41*$D26))))),0)","v":0},{"$f":"IFERROR(IF(R$4=\"\",0,IF($E26=\"kWh\",VLOOKUP(R$4,'4. Billing Determinants'!$B$19:$Z$41,4,0)/'4. Billing Determinants'!$E$41*$D26,IF($E26=\"kW\",VLOOKUP(R$4,'4. Billing Determinants'!$B$19:$Z$41,5,0)/'4. Billing Determinants'!$F$41*$D26,IF($E26=\"Non-RPP kWh\",VLOOKUP(R$4,'4. Billing Determinants'!$B$19:$Z$41,6,0)/'4. Billing Determinants'!$G$41*$D26,IF($E26=\"Distribution Rev.\",VLOOKUP(R$4,'4. Billing Determinants'!$B$19:$Z$41,8,0)/'4. Billing Determinants'!$I$41*$D26, VLOOKUP(R$4,'4. Billing Determinants'!$B$19:$Z$41,3,0)/'4. Billing Determinants'!$D$41*$D26))))),0)","v":0},{"$f":"IFERROR(IF(S$4=\"\",0,IF($E26=\"kWh\",VLOOKUP(S$4,'4. Billing Determinants'!$B$19:$Z$41,4,0)/'4. Billing Determinants'!$E$41*$D26,IF($E26=\"kW\",VLOOKUP(S$4,'4. Billing Determinants'!$B$19:$Z$41,5,0)/'4. Billing Determinants'!$F$41*$D26,IF($E26=\"Non-RPP kWh\",VLOOKUP(S$4,'4. Billing Determinants'!$B$19:$Z$41,6,0)/'4. Billing Determinants'!$G$41*$D26,IF($E26=\"Distribution Rev.\",VLOOKUP(S$4,'4. Billing Determinants'!$B$19:$Z$41,8,0)/'4. Billing Determinants'!$I$41*$D26, VLOOKUP(S$4,'4. Billing Determinants'!$B$19:$Z$41,3,0)/'4. Billing Determinants'!$D$41*$D26))))),0)","v":0},{"$f":"IFERROR(IF(T$4=\"\",0,IF($E26=\"kWh\",VLOOKUP(T$4,'4. Billing Determinants'!$B$19:$Z$41,4,0)/'4. Billing Determinants'!$E$41*$D26,IF($E26=\"kW\",VLOOKUP(T$4,'4. Billing Determinants'!$B$19:$Z$41,5,0)/'4. Billing Determinants'!$F$41*$D26,IF($E26=\"Non-RPP kWh\",VLOOKUP(T$4,'4. Billing Determinants'!$B$19:$Z$41,6,0)/'4. Billing Determinants'!$G$41*$D26,IF($E26=\"Distribution Rev.\",VLOOKUP(T$4,'4. Billing Determinants'!$B$19:$Z$41,8,0)/'4. Billing Determinants'!$I$41*$D26, VLOOKUP(T$4,'4. Billing Determinants'!$B$19:$Z$41,3,0)/'4. Billing Determinants'!$D$41*$D26))))),0)","v":0},{"$f":"IFERROR(IF(U$4=\"\",0,IF($E26=\"kWh\",VLOOKUP(U$4,'4. Billing Determinants'!$B$19:$Z$41,4,0)/'4. Billing Determinants'!$E$41*$D26,IF($E26=\"kW\",VLOOKUP(U$4,'4. Billing Determinants'!$B$19:$Z$41,5,0)/'4. Billing Determinants'!$F$41*$D26,IF($E26=\"Non-RPP kWh\",VLOOKUP(U$4,'4. Billing Determinants'!$B$19:$Z$41,6,0)/'4. Billing Determinants'!$G$41*$D26,IF($E26=\"Distribution Rev.\",VLOOKUP(U$4,'4. Billing Determinants'!$B$19:$Z$41,8,0)/'4. Billing Determinants'!$I$41*$D26, VLOOKUP(U$4,'4. Billing Determinants'!$B$19:$Z$41,3,0)/'4. Billing Determinants'!$D$41*$D26))))),0)","v":0},{"$f":"IFERROR(IF(V$4=\"\",0,IF($E26=\"kWh\",VLOOKUP(V$4,'4. Billing Determinants'!$B$19:$Z$41,4,0)/'4. Billing Determinants'!$E$41*$D26,IF($E26=\"kW\",VLOOKUP(V$4,'4. Billing Determinants'!$B$19:$Z$41,5,0)/'4. Billing Determinants'!$F$41*$D26,IF($E26=\"Non-RPP kWh\",VLOOKUP(V$4,'4. Billing Determinants'!$B$19:$Z$41,6,0)/'4. Billing Determinants'!$G$41*$D26,IF($E26=\"Distribution Rev.\",VLOOKUP(V$4,'4. Billing Determinants'!$B$19:$Z$41,8,0)/'4. Billing Determinants'!$I$41*$D26, VLOOKUP(V$4,'4. Billing Determinants'!$B$19:$Z$41,3,0)/'4. Billing Determinants'!$D$41*$D26))))),0)","v":0},{"$f":"IFERROR(IF(W$4=\"\",0,IF($E26=\"kWh\",VLOOKUP(W$4,'4. Billing Determinants'!$B$19:$Z$41,4,0)/'4. Billing Determinants'!$E$41*$D26,IF($E26=\"kW\",VLOOKUP(W$4,'4. Billing Determinants'!$B$19:$Z$41,5,0)/'4. Billing Determinants'!$F$41*$D26,IF($E26=\"Non-RPP kWh\",VLOOKUP(W$4,'4. Billing Determinants'!$B$19:$Z$41,6,0)/'4. Billing Determinants'!$G$41*$D26,IF($E26=\"Distribution Rev.\",VLOOKUP(W$4,'4. Billing Determinants'!$B$19:$Z$41,8,0)/'4. Billing Determinants'!$I$41*$D26, VLOOKUP(W$4,'4. Billing Determinants'!$B$19:$Z$41,3,0)/'4. Billing Determinants'!$D$41*$D26))))),0)","v":0},{"$f":"IFERROR(IF(X$4=\"\",0,IF($E26=\"kWh\",VLOOKUP(X$4,'4. Billing Determinants'!$B$19:$Z$41,4,0)/'4. Billing Determinants'!$E$41*$D26,IF($E26=\"kW\",VLOOKUP(X$4,'4. Billing Determinants'!$B$19:$Z$41,5,0)/'4. Billing Determinants'!$F$41*$D26,IF($E26=\"Non-RPP kWh\",VLOOKUP(X$4,'4. Billing Determinants'!$B$19:$Z$41,6,0)/'4. Billing Determinants'!$G$41*$D26,IF($E26=\"Distribution Rev.\",VLOOKUP(X$4,'4. Billing Determinants'!$B$19:$Z$41,8,0)/'4. Billing Determinants'!$I$41*$D26, VLOOKUP(X$4,'4. Billing Determinants'!$B$19:$Z$41,3,0)/'4. Billing Determinants'!$D$41*$D26))))),0)","v":0},{"$f":"IFERROR(IF(Y$4=\"\",0,IF($E26=\"kWh\",VLOOKUP(Y$4,'4. Billing Determinants'!$B$19:$Z$41,4,0)/'4. Billing Determinants'!$E$41*$D26,IF($E26=\"kW\",VLOOKUP(Y$4,'4. Billing Determinants'!$B$19:$Z$41,5,0)/'4. Billing Determinants'!$F$41*$D26,IF($E26=\"Non-RPP kWh\",VLOOKUP(Y$4,'4. Billing Determinants'!$B$19:$Z$41,6,0)/'4. Billing Determinants'!$G$41*$D26,IF($E26=\"Distribution Rev.\",VLOOKUP(Y$4,'4. Billing Determinants'!$B$19:$Z$41,8,0)/'4. Billing Determinants'!$I$41*$D26, VLOOKUP(Y$4,'4. Billing Determinants'!$B$19:$Z$41,3,0)/'4. Billing Determinants'!$D$41*$D26))))),0)","v":0}]
[null,"Misc. Deferred Debits",1525,{"$f":"'2. 2015 Continuity Schedule'!BS50","v":0},"kWh",{"$f":"IFERROR(IF(F$4=\"\",0,IF($E27=\"kWh\",VLOOKUP(F$4,'4. Billing Determinants'!$B$19:$Z$41,4,0)/'4. Billing Determinants'!$E$41*$D27,IF($E27=\"kW\",VLOOKUP(F$4,'4. Billing Determinants'!$B$19:$Z$41,5,0)/'4. Billing Determinants'!$F$41*$D27,IF($E27=\"Non-RPP kWh\",VLOOKUP(F$4,'4. Billing Determinants'!$B$19:$Z$41,6,0)/'4. Billing Determinants'!$G$41*$D27,IF($E27=\"Distribution Rev.\",VLOOKUP(F$4,'4. Billing Determinants'!$B$19:$Z$41,8,0)/'4. Billing Determinants'!$I$41*$D27, VLOOKUP(F$4,'4. Billing Determinants'!$B$19:$Z$41,3,0)/'4. Billing Determinants'!$D$41*$D27))))),0)","v":0},{"$f":"IFERROR(IF(G$4=\"\",0,IF($E27=\"kWh\",VLOOKUP(G$4,'4. Billing Determinants'!$B$19:$Z$41,4,0)/'4. Billing Determinants'!$E$41*$D27,IF($E27=\"kW\",VLOOKUP(G$4,'4. Billing Determinants'!$B$19:$Z$41,5,0)/'4. Billing Determinants'!$F$41*$D27,IF($E27=\"Non-RPP kWh\",VLOOKUP(G$4,'4. Billing Determinants'!$B$19:$Z$41,6,0)/'4. Billing Determinants'!$G$41*$D27,IF($E27=\"Distribution Rev.\",VLOOKUP(G$4,'4. Billing Determinants'!$B$19:$Z$41,8,0)/'4. Billing Determinants'!$I$41*$D27, VLOOKUP(G$4,'4. Billing Determinants'!$B$19:$Z$41,3,0)/'4. Billing Determinants'!$D$41*$D27))))),0)","v":0},{"$f":"IFERROR(IF(H$4=\"\",0,IF($E27=\"kWh\",VLOOKUP(H$4,'4. Billing Determinants'!$B$19:$Z$41,4,0)/'4. Billing Determinants'!$E$41*$D27,IF($E27=\"kW\",VLOOKUP(H$4,'4. Billing Determinants'!$B$19:$Z$41,5,0)/'4. Billing Determinants'!$F$41*$D27,IF($E27=\"Non-RPP kWh\",VLOOKUP(H$4,'4. Billing Determinants'!$B$19:$Z$41,6,0)/'4. Billing Determinants'!$G$41*$D27,IF($E27=\"Distribution Rev.\",VLOOKUP(H$4,'4. Billing Determinants'!$B$19:$Z$41,8,0)/'4. Billing Determinants'!$I$41*$D27, VLOOKUP(H$4,'4. Billing Determinants'!$B$19:$Z$41,3,0)/'4. Billing Determinants'!$D$41*$D27))))),0)","v":0},{"$f":"IFERROR(IF(I$4=\"\",0,IF($E27=\"kWh\",VLOOKUP(I$4,'4. Billing Determinants'!$B$19:$Z$41,4,0)/'4. Billing Determinants'!$E$41*$D27,IF($E27=\"kW\",VLOOKUP(I$4,'4. Billing Determinants'!$B$19:$Z$41,5,0)/'4. Billing Determinants'!$F$41*$D27,IF($E27=\"Non-RPP kWh\",VLOOKUP(I$4,'4. Billing Determinants'!$B$19:$Z$41,6,0)/'4. Billing Determinants'!$G$41*$D27,IF($E27=\"Distribution Rev.\",VLOOKUP(I$4,'4. Billing Determinants'!$B$19:$Z$41,8,0)/'4. Billing Determinants'!$I$41*$D27, VLOOKUP(I$4,'4. Billing Determinants'!$B$19:$Z$41,3,0)/'4. Billing Determinants'!$D$41*$D27))))),0)","v":0},{"$f":"IFERROR(IF(J$4=\"\",0,IF($E27=\"kWh\",VLOOKUP(J$4,'4. Billing Determinants'!$B$19:$Z$41,4,0)/'4. Billing Determinants'!$E$41*$D27,IF($E27=\"kW\",VLOOKUP(J$4,'4. Billing Determinants'!$B$19:$Z$41,5,0)/'4. Billing Determinants'!$F$41*$D27,IF($E27=\"Non-RPP kWh\",VLOOKUP(J$4,'4. Billing Determinants'!$B$19:$Z$41,6,0)/'4. Billing Determinants'!$G$41*$D27,IF($E27=\"Distribution Rev.\",VLOOKUP(J$4,'4. Billing Determinants'!$B$19:$Z$41,8,0)/'4. Billing Determinants'!$I$41*$D27, VLOOKUP(J$4,'4. Billing Determinants'!$B$19:$Z$41,3,0)/'4. Billing Determinants'!$D$41*$D27))))),0)","v":0},{"$f":"IFERROR(IF(K$4=\"\",0,IF($E27=\"kWh\",VLOOKUP(K$4,'4. Billing Determinants'!$B$19:$Z$41,4,0)/'4. Billing Determinants'!$E$41*$D27,IF($E27=\"kW\",VLOOKUP(K$4,'4. Billing Determinants'!$B$19:$Z$41,5,0)/'4. Billing Determinants'!$F$41*$D27,IF($E27=\"Non-RPP kWh\",VLOOKUP(K$4,'4. Billing Determinants'!$B$19:$Z$41,6,0)/'4. Billing Determinants'!$G$41*$D27,IF($E27=\"Distribution Rev.\",VLOOKUP(K$4,'4. Billing Determinants'!$B$19:$Z$41,8,0)/'4. Billing Determinants'!$I$41*$D27, VLOOKUP(K$4,'4. Billing Determinants'!$B$19:$Z$41,3,0)/'4. Billing Determinants'!$D$41*$D27))))),0)","v":0},{"$f":"IFERROR(IF(L$4=\"\",0,IF($E27=\"kWh\",VLOOKUP(L$4,'4. Billing Determinants'!$B$19:$Z$41,4,0)/'4. Billing Determinants'!$E$41*$D27,IF($E27=\"kW\",VLOOKUP(L$4,'4. Billing Determinants'!$B$19:$Z$41,5,0)/'4. Billing Determinants'!$F$41*$D27,IF($E27=\"Non-RPP kWh\",VLOOKUP(L$4,'4. Billing Determinants'!$B$19:$Z$41,6,0)/'4. Billing Determinants'!$G$41*$D27,IF($E27=\"Distribution Rev.\",VLOOKUP(L$4,'4. Billing Determinants'!$B$19:$Z$41,8,0)/'4. Billing Determinants'!$I$41*$D27, VLOOKUP(L$4,'4. Billing Determinants'!$B$19:$Z$41,3,0)/'4. Billing Determinants'!$D$41*$D27))))),0)","v":0},{"$f":"IFERROR(IF(M$4=\"\",0,IF($E27=\"kWh\",VLOOKUP(M$4,'4. Billing Determinants'!$B$19:$Z$41,4,0)/'4. Billing Determinants'!$E$41*$D27,IF($E27=\"kW\",VLOOKUP(M$4,'4. Billing Determinants'!$B$19:$Z$41,5,0)/'4. Billing Determinants'!$F$41*$D27,IF($E27=\"Non-RPP kWh\",VLOOKUP(M$4,'4. Billing Determinants'!$B$19:$Z$41,6,0)/'4. Billing Determinants'!$G$41*$D27,IF($E27=\"Distribution Rev.\",VLOOKUP(M$4,'4. Billing Determinants'!$B$19:$Z$41,8,0)/'4. Billing Determinants'!$I$41*$D27, VLOOKUP(M$4,'4. Billing Determinants'!$B$19:$Z$41,3,0)/'4. Billing Determinants'!$D$41*$D27))))),0)","v":0},{"$f":"IFERROR(IF(N$4=\"\",0,IF($E27=\"kWh\",VLOOKUP(N$4,'4. Billing Determinants'!$B$19:$Z$41,4,0)/'4. Billing Determinants'!$E$41*$D27,IF($E27=\"kW\",VLOOKUP(N$4,'4. Billing Determinants'!$B$19:$Z$41,5,0)/'4. Billing Determinants'!$F$41*$D27,IF($E27=\"Non-RPP kWh\",VLOOKUP(N$4,'4. Billing Determinants'!$B$19:$Z$41,6,0)/'4. Billing Determinants'!$G$41*$D27,IF($E27=\"Distribution Rev.\",VLOOKUP(N$4,'4. Billing Determinants'!$B$19:$Z$41,8,0)/'4. Billing Determinants'!$I$41*$D27, VLOOKUP(N$4,'4. Billing Determinants'!$B$19:$Z$41,3,0)/'4. Billing Determinants'!$D$41*$D27))))),0)","v":0},{"$f":"IFERROR(IF(O$4=\"\",0,IF($E27=\"kWh\",VLOOKUP(O$4,'4. Billing Determinants'!$B$19:$Z$41,4,0)/'4. Billing Determinants'!$E$41*$D27,IF($E27=\"kW\",VLOOKUP(O$4,'4. Billing Determinants'!$B$19:$Z$41,5,0)/'4. Billing Determinants'!$F$41*$D27,IF($E27=\"Non-RPP kWh\",VLOOKUP(O$4,'4. Billing Determinants'!$B$19:$Z$41,6,0)/'4. Billing Determinants'!$G$41*$D27,IF($E27=\"Distribution Rev.\",VLOOKUP(O$4,'4. Billing Determinants'!$B$19:$Z$41,8,0)/'4. Billing Determinants'!$I$41*$D27, VLOOKUP(O$4,'4. Billing Determinants'!$B$19:$Z$41,3,0)/'4. Billing Determinants'!$D$41*$D27))))),0)","v":0},{"$f":"IFERROR(IF(P$4=\"\",0,IF($E27=\"kWh\",VLOOKUP(P$4,'4. Billing Determinants'!$B$19:$Z$41,4,0)/'4. Billing Determinants'!$E$41*$D27,IF($E27=\"kW\",VLOOKUP(P$4,'4. Billing Determinants'!$B$19:$Z$41,5,0)/'4. Billing Determinants'!$F$41*$D27,IF($E27=\"Non-RPP kWh\",VLOOKUP(P$4,'4. Billing Determinants'!$B$19:$Z$41,6,0)/'4. Billing Determinants'!$G$41*$D27,IF($E27=\"Distribution Rev.\",VLOOKUP(P$4,'4. Billing Determinants'!$B$19:$Z$41,8,0)/'4. Billing Determinants'!$I$41*$D27, VLOOKUP(P$4,'4. Billing Determinants'!$B$19:$Z$41,3,0)/'4. Billing Determinants'!$D$41*$D27))))),0)","v":0},{"$f":"IFERROR(IF(Q$4=\"\",0,IF($E27=\"kWh\",VLOOKUP(Q$4,'4. Billing Determinants'!$B$19:$Z$41,4,0)/'4. Billing Determinants'!$E$41*$D27,IF($E27=\"kW\",VLOOKUP(Q$4,'4. Billing Determinants'!$B$19:$Z$41,5,0)/'4. Billing Determinants'!$F$41*$D27,IF($E27=\"Non-RPP kWh\",VLOOKUP(Q$4,'4. Billing Determinants'!$B$19:$Z$41,6,0)/'4. Billing Determinants'!$G$41*$D27,IF($E27=\"Distribution Rev.\",VLOOKUP(Q$4,'4. Billing Determinants'!$B$19:$Z$41,8,0)/'4. Billing Determinants'!$I$41*$D27, VLOOKUP(Q$4,'4. Billing Determinants'!$B$19:$Z$41,3,0)/'4. Billing Determinants'!$D$41*$D27))))),0)","v":0},{"$f":"IFERROR(IF(R$4=\"\",0,IF($E27=\"kWh\",VLOOKUP(R$4,'4. Billing Determinants'!$B$19:$Z$41,4,0)/'4. Billing Determinants'!$E$41*$D27,IF($E27=\"kW\",VLOOKUP(R$4,'4. Billing Determinants'!$B$19:$Z$41,5,0)/'4. Billing Determinants'!$F$41*$D27,IF($E27=\"Non-RPP kWh\",VLOOKUP(R$4,'4. Billing Determinants'!$B$19:$Z$41,6,0)/'4. Billing Determinants'!$G$41*$D27,IF($E27=\"Distribution Rev.\",VLOOKUP(R$4,'4. Billing Determinants'!$B$19:$Z$41,8,0)/'4. Billing Determinants'!$I$41*$D27, VLOOKUP(R$4,'4. Billing Determinants'!$B$19:$Z$41,3,0)/'4. Billing Determinants'!$D$41*$D27))))),0)","v":0},{"$f":"IFERROR(IF(S$4=\"\",0,IF($E27=\"kWh\",VLOOKUP(S$4,'4. Billing Determinants'!$B$19:$Z$41,4,0)/'4. Billing Determinants'!$E$41*$D27,IF($E27=\"kW\",VLOOKUP(S$4,'4. Billing Determinants'!$B$19:$Z$41,5,0)/'4. Billing Determinants'!$F$41*$D27,IF($E27=\"Non-RPP kWh\",VLOOKUP(S$4,'4. Billing Determinants'!$B$19:$Z$41,6,0)/'4. Billing Determinants'!$G$41*$D27,IF($E27=\"Distribution Rev.\",VLOOKUP(S$4,'4. Billing Determinants'!$B$19:$Z$41,8,0)/'4. Billing Determinants'!$I$41*$D27, VLOOKUP(S$4,'4. Billing Determinants'!$B$19:$Z$41,3,0)/'4. Billing Determinants'!$D$41*$D27))))),0)","v":0},{"$f":"IFERROR(IF(T$4=\"\",0,IF($E27=\"kWh\",VLOOKUP(T$4,'4. Billing Determinants'!$B$19:$Z$41,4,0)/'4. Billing Determinants'!$E$41*$D27,IF($E27=\"kW\",VLOOKUP(T$4,'4. Billing Determinants'!$B$19:$Z$41,5,0)/'4. Billing Determinants'!$F$41*$D27,IF($E27=\"Non-RPP kWh\",VLOOKUP(T$4,'4. Billing Determinants'!$B$19:$Z$41,6,0)/'4. Billing Determinants'!$G$41*$D27,IF($E27=\"Distribution Rev.\",VLOOKUP(T$4,'4. Billing Determinants'!$B$19:$Z$41,8,0)/'4. Billing Determinants'!$I$41*$D27, VLOOKUP(T$4,'4. Billing Determinants'!$B$19:$Z$41,3,0)/'4. Billing Determinants'!$D$41*$D27))))),0)","v":0},{"$f":"IFERROR(IF(U$4=\"\",0,IF($E27=\"kWh\",VLOOKUP(U$4,'4. Billing Determinants'!$B$19:$Z$41,4,0)/'4. Billing Determinants'!$E$41*$D27,IF($E27=\"kW\",VLOOKUP(U$4,'4. Billing Determinants'!$B$19:$Z$41,5,0)/'4. Billing Determinants'!$F$41*$D27,IF($E27=\"Non-RPP kWh\",VLOOKUP(U$4,'4. Billing Determinants'!$B$19:$Z$41,6,0)/'4. Billing Determinants'!$G$41*$D27,IF($E27=\"Distribution Rev.\",VLOOKUP(U$4,'4. Billing Determinants'!$B$19:$Z$41,8,0)/'4. Billing Determinants'!$I$41*$D27, VLOOKUP(U$4,'4. Billing Determinants'!$B$19:$Z$41,3,0)/'4. Billing Determinants'!$D$41*$D27))))),0)","v":0},{"$f":"IFERROR(IF(V$4=\"\",0,IF($E27=\"kWh\",VLOOKUP(V$4,'4. Billing Determinants'!$B$19:$Z$41,4,0)/'4. Billing Determinants'!$E$41*$D27,IF($E27=\"kW\",VLOOKUP(V$4,'4. Billing Determinants'!$B$19:$Z$41,5,0)/'4. Billing Determinants'!$F$41*$D27,IF($E27=\"Non-RPP kWh\",VLOOKUP(V$4,'4. Billing Determinants'!$B$19:$Z$41,6,0)/'4. Billing Determinants'!$G$41*$D27,IF($E27=\"Distribution Rev.\",VLOOKUP(V$4,'4. Billing Determinants'!$B$19:$Z$41,8,0)/'4. Billing Determinants'!$I$41*$D27, VLOOKUP(V$4,'4. Billing Determinants'!$B$19:$Z$41,3,0)/'4. Billing Determinants'!$D$41*$D27))))),0)","v":0},{"$f":"IFERROR(IF(W$4=\"\",0,IF($E27=\"kWh\",VLOOKUP(W$4,'4. Billing Determinants'!$B$19:$Z$41,4,0)/'4. Billing Determinants'!$E$41*$D27,IF($E27=\"kW\",VLOOKUP(W$4,'4. Billing Determinants'!$B$19:$Z$41,5,0)/'4. Billing Determinants'!$F$41*$D27,IF($E27=\"Non-RPP kWh\",VLOOKUP(W$4,'4. Billing Determinants'!$B$19:$Z$41,6,0)/'4. Billing Determinants'!$G$41*$D27,IF($E27=\"Distribution Rev.\",VLOOKUP(W$4,'4. Billing Determinants'!$B$19:$Z$41,8,0)/'4. Billing Determinants'!$I$41*$D27, VLOOKUP(W$4,'4. Billing Determinants'!$B$19:$Z$41,3,0)/'4. Billing Determinants'!$D$41*$D27))))),0)","v":0},{"$f":"IFERROR(IF(X$4=\"\",0,IF($E27=\"kWh\",VLOOKUP(X$4,'4. Billing Determinants'!$B$19:$Z$41,4,0)/'4. Billing Determinants'!$E$41*$D27,IF($E27=\"kW\",VLOOKUP(X$4,'4. Billing Determinants'!$B$19:$Z$41,5,0)/'4. Billing Determinants'!$F$41*$D27,IF($E27=\"Non-RPP kWh\",VLOOKUP(X$4,'4. Billing Determinants'!$B$19:$Z$41,6,0)/'4. Billing Determinants'!$G$41*$D27,IF($E27=\"Distribution Rev.\",VLOOKUP(X$4,'4. Billing Determinants'!$B$19:$Z$41,8,0)/'4. Billing Determinants'!$I$41*$D27, VLOOKUP(X$4,'4. Billing Determinants'!$B$19:$Z$41,3,0)/'4. Billing Determinants'!$D$41*$D27))))),0)","v":0},{"$f":"IFERROR(IF(Y$4=\"\",0,IF($E27=\"kWh\",VLOOKUP(Y$4,'4. Billing Determinants'!$B$19:$Z$41,4,0)/'4. Billing Determinants'!$E$41*$D27,IF($E27=\"kW\",VLOOKUP(Y$4,'4. Billing Determinants'!$B$19:$Z$41,5,0)/'4. Billing Determinants'!$F$41*$D27,IF($E27=\"Non-RPP kWh\",VLOOKUP(Y$4,'4. Billing Determinants'!$B$19:$Z$41,6,0)/'4. Billing Determinants'!$G$41*$D27,IF($E27=\"Distribution Rev.\",VLOOKUP(Y$4,'4. Billing Determinants'!$B$19:$Z$41,8,0)/'4. Billing Determinants'!$I$41*$D27, VLOOKUP(Y$4,'4. Billing Determinants'!$B$19:$Z$41,3,0)/'4. Billing Determinants'!$D$41*$D27))))),0)","v":0}]
[null,"Board-Approved CDM Variance Account",1567,{"$f":"'2. 2015 Continuity Schedule'!BS70","v":0},"kWh",{"$f":"IFERROR(IF(F$4=\"\",0,IF($E28=\"kWh\",VLOOKUP(F$4,'4. Billing Determinants'!$B$19:$Z$41,4,0)/'4. Billing Determinants'!$E$41*$D28,IF($E28=\"kW\",VLOOKUP(F$4,'4. Billing Determinants'!$B$19:$Z$41,5,0)/'4. Billing Determinants'!$F$41*$D28,IF($E28=\"Non-RPP kWh\",VLOOKUP(F$4,'4. Billing Determinants'!$B$19:$Z$41,6,0)/'4. Billing Determinants'!$G$41*$D28,IF($E28=\"Distribution Rev.\",VLOOKUP(F$4,'4. Billing Determinants'!$B$19:$Z$41,8,0)/'4. Billing Determinants'!$I$41*$D28, VLOOKUP(F$4,'4. Billing Determinants'!$B$19:$Z$41,3,0)/'4. Billing Determinants'!$D$41*$D28))))),0)","v":0},{"$f":"IFERROR(IF(G$4=\"\",0,IF($E28=\"kWh\",VLOOKUP(G$4,'4. Billing Determinants'!$B$19:$Z$41,4,0)/'4. Billing Determinants'!$E$41*$D28,IF($E28=\"kW\",VLOOKUP(G$4,'4. Billing Determinants'!$B$19:$Z$41,5,0)/'4. Billing Determinants'!$F$41*$D28,IF($E28=\"Non-RPP kWh\",VLOOKUP(G$4,'4. Billing Determinants'!$B$19:$Z$41,6,0)/'4. Billing Determinants'!$G$41*$D28,IF($E28=\"Distribution Rev.\",VLOOKUP(G$4,'4. Billing Determinants'!$B$19:$Z$41,8,0)/'4. Billing Determinants'!$I$41*$D28, VLOOKUP(G$4,'4. Billing Determinants'!$B$19:$Z$41,3,0)/'4. Billing Determinants'!$D$41*$D28))))),0)","v":0},{"$f":"IFERROR(IF(H$4=\"\",0,IF($E28=\"kWh\",VLOOKUP(H$4,'4. Billing Determinants'!$B$19:$Z$41,4,0)/'4. Billing Determinants'!$E$41*$D28,IF($E28=\"kW\",VLOOKUP(H$4,'4. Billing Determinants'!$B$19:$Z$41,5,0)/'4. Billing Determinants'!$F$41*$D28,IF($E28=\"Non-RPP kWh\",VLOOKUP(H$4,'4. Billing Determinants'!$B$19:$Z$41,6,0)/'4. Billing Determinants'!$G$41*$D28,IF($E28=\"Distribution Rev.\",VLOOKUP(H$4,'4. Billing Determinants'!$B$19:$Z$41,8,0)/'4. Billing Determinants'!$I$41*$D28, VLOOKUP(H$4,'4. Billing Determinants'!$B$19:$Z$41,3,0)/'4. Billing Determinants'!$D$41*$D28))))),0)","v":0},{"$f":"IFERROR(IF(I$4=\"\",0,IF($E28=\"kWh\",VLOOKUP(I$4,'4. Billing Determinants'!$B$19:$Z$41,4,0)/'4. Billing Determinants'!$E$41*$D28,IF($E28=\"kW\",VLOOKUP(I$4,'4. Billing Determinants'!$B$19:$Z$41,5,0)/'4. Billing Determinants'!$F$41*$D28,IF($E28=\"Non-RPP kWh\",VLOOKUP(I$4,'4. Billing Determinants'!$B$19:$Z$41,6,0)/'4. Billing Determinants'!$G$41*$D28,IF($E28=\"Distribution Rev.\",VLOOKUP(I$4,'4. Billing Determinants'!$B$19:$Z$41,8,0)/'4. Billing Determinants'!$I$41*$D28, VLOOKUP(I$4,'4. Billing Determinants'!$B$19:$Z$41,3,0)/'4. Billing Determinants'!$D$41*$D28))))),0)","v":0},{"$f":"IFERROR(IF(J$4=\"\",0,IF($E28=\"kWh\",VLOOKUP(J$4,'4. Billing Determinants'!$B$19:$Z$41,4,0)/'4. Billing Determinants'!$E$41*$D28,IF($E28=\"kW\",VLOOKUP(J$4,'4. Billing Determinants'!$B$19:$Z$41,5,0)/'4. Billing Determinants'!$F$41*$D28,IF($E28=\"Non-RPP kWh\",VLOOKUP(J$4,'4. Billing Determinants'!$B$19:$Z$41,6,0)/'4. Billing Determinants'!$G$41*$D28,IF($E28=\"Distribution Rev.\",VLOOKUP(J$4,'4. Billing Determinants'!$B$19:$Z$41,8,0)/'4. Billing Determinants'!$I$41*$D28, VLOOKUP(J$4,'4. Billing Determinants'!$B$19:$Z$41,3,0)/'4. Billing Determinants'!$D$41*$D28))))),0)","v":0},{"$f":"IFERROR(IF(K$4=\"\",0,IF($E28=\"kWh\",VLOOKUP(K$4,'4. Billing Determinants'!$B$19:$Z$41,4,0)/'4. Billing Determinants'!$E$41*$D28,IF($E28=\"kW\",VLOOKUP(K$4,'4. Billing Determinants'!$B$19:$Z$41,5,0)/'4. Billing Determinants'!$F$41*$D28,IF($E28=\"Non-RPP kWh\",VLOOKUP(K$4,'4. Billing Determinants'!$B$19:$Z$41,6,0)/'4. Billing Determinants'!$G$41*$D28,IF($E28=\"Distribution Rev.\",VLOOKUP(K$4,'4. Billing Determinants'!$B$19:$Z$41,8,0)/'4. Billing Determinants'!$I$41*$D28, VLOOKUP(K$4,'4. Billing Determinants'!$B$19:$Z$41,3,0)/'4. Billing Determinants'!$D$41*$D28))))),0)","v":0},{"$f":"IFERROR(IF(L$4=\"\",0,IF($E28=\"kWh\",VLOOKUP(L$4,'4. Billing Determinants'!$B$19:$Z$41,4,0)/'4. Billing Determinants'!$E$41*$D28,IF($E28=\"kW\",VLOOKUP(L$4,'4. Billing Determinants'!$B$19:$Z$41,5,0)/'4. Billing Determinants'!$F$41*$D28,IF($E28=\"Non-RPP kWh\",VLOOKUP(L$4,'4. Billing Determinants'!$B$19:$Z$41,6,0)/'4. Billing Determinants'!$G$41*$D28,IF($E28=\"Distribution Rev.\",VLOOKUP(L$4,'4. Billing Determinants'!$B$19:$Z$41,8,0)/'4. Billing Determinants'!$I$41*$D28, VLOOKUP(L$4,'4. Billing Determinants'!$B$19:$Z$41,3,0)/'4. Billing Determinants'!$D$41*$D28))))),0)","v":0},{"$f":"IFERROR(IF(M$4=\"\",0,IF($E28=\"kWh\",VLOOKUP(M$4,'4. Billing Determinants'!$B$19:$Z$41,4,0)/'4. Billing Determinants'!$E$41*$D28,IF($E28=\"kW\",VLOOKUP(M$4,'4. Billing Determinants'!$B$19:$Z$41,5,0)/'4. Billing Determinants'!$F$41*$D28,IF($E28=\"Non-RPP kWh\",VLOOKUP(M$4,'4. Billing Determinants'!$B$19:$Z$41,6,0)/'4. Billing Determinants'!$G$41*$D28,IF($E28=\"Distribution Rev.\",VLOOKUP(M$4,'4. Billing Determinants'!$B$19:$Z$41,8,0)/'4. Billing Determinants'!$I$41*$D28, VLOOKUP(M$4,'4. Billing Determinants'!$B$19:$Z$41,3,0)/'4. Billing Determinants'!$D$41*$D28))))),0)","v":0},{"$f":"IFERROR(IF(N$4=\"\",0,IF($E28=\"kWh\",VLOOKUP(N$4,'4. Billing Determinants'!$B$19:$Z$41,4,0)/'4. Billing Determinants'!$E$41*$D28,IF($E28=\"kW\",VLOOKUP(N$4,'4. Billing Determinants'!$B$19:$Z$41,5,0)/'4. Billing Determinants'!$F$41*$D28,IF($E28=\"Non-RPP kWh\",VLOOKUP(N$4,'4. Billing Determinants'!$B$19:$Z$41,6,0)/'4. Billing Determinants'!$G$41*$D28,IF($E28=\"Distribution Rev.\",VLOOKUP(N$4,'4. Billing Determinants'!$B$19:$Z$41,8,0)/'4. Billing Determinants'!$I$41*$D28, VLOOKUP(N$4,'4. Billing Determinants'!$B$19:$Z$41,3,0)/'4. Billing Determinants'!$D$41*$D28))))),0)","v":0},{"$f":"IFERROR(IF(O$4=\"\",0,IF($E28=\"kWh\",VLOOKUP(O$4,'4. Billing Determinants'!$B$19:$Z$41,4,0)/'4. Billing Determinants'!$E$41*$D28,IF($E28=\"kW\",VLOOKUP(O$4,'4. Billing Determinants'!$B$19:$Z$41,5,0)/'4. Billing Determinants'!$F$41*$D28,IF($E28=\"Non-RPP kWh\",VLOOKUP(O$4,'4. Billing Determinants'!$B$19:$Z$41,6,0)/'4. Billing Determinants'!$G$41*$D28,IF($E28=\"Distribution Rev.\",VLOOKUP(O$4,'4. Billing Determinants'!$B$19:$Z$41,8,0)/'4. Billing Determinants'!$I$41*$D28, VLOOKUP(O$4,'4. Billing Determinants'!$B$19:$Z$41,3,0)/'4. Billing Determinants'!$D$41*$D28))))),0)","v":0},{"$f":"IFERROR(IF(P$4=\"\",0,IF($E28=\"kWh\",VLOOKUP(P$4,'4. Billing Determinants'!$B$19:$Z$41,4,0)/'4. Billing Determinants'!$E$41*$D28,IF($E28=\"kW\",VLOOKUP(P$4,'4. Billing Determinants'!$B$19:$Z$41,5,0)/'4. Billing Determinants'!$F$41*$D28,IF($E28=\"Non-RPP kWh\",VLOOKUP(P$4,'4. Billing Determinants'!$B$19:$Z$41,6,0)/'4. Billing Determinants'!$G$41*$D28,IF($E28=\"Distribution Rev.\",VLOOKUP(P$4,'4. Billing Determinants'!$B$19:$Z$41,8,0)/'4. Billing Determinants'!$I$41*$D28, VLOOKUP(P$4,'4. Billing Determinants'!$B$19:$Z$41,3,0)/'4. Billing Determinants'!$D$41*$D28))))),0)","v":0},{"$f":"IFERROR(IF(Q$4=\"\",0,IF($E28=\"kWh\",VLOOKUP(Q$4,'4. Billing Determinants'!$B$19:$Z$41,4,0)/'4. Billing Determinants'!$E$41*$D28,IF($E28=\"kW\",VLOOKUP(Q$4,'4. Billing Determinants'!$B$19:$Z$41,5,0)/'4. Billing Determinants'!$F$41*$D28,IF($E28=\"Non-RPP kWh\",VLOOKUP(Q$4,'4. Billing Determinants'!$B$19:$Z$41,6,0)/'4. Billing Determinants'!$G$41*$D28,IF($E28=\"Distribution Rev.\",VLOOKUP(Q$4,'4. Billing Determinants'!$B$19:$Z$41,8,0)/'4. Billing Determinants'!$I$41*$D28, VLOOKUP(Q$4,'4. Billing Determinants'!$B$19:$Z$41,3,0)/'4. Billing Determinants'!$D$41*$D28))))),0)","v":0},{"$f":"IFERROR(IF(R$4=\"\",0,IF($E28=\"kWh\",VLOOKUP(R$4,'4. Billing Determinants'!$B$19:$Z$41,4,0)/'4. Billing Determinants'!$E$41*$D28,IF($E28=\"kW\",VLOOKUP(R$4,'4. Billing Determinants'!$B$19:$Z$41,5,0)/'4. Billing Determinants'!$F$41*$D28,IF($E28=\"Non-RPP kWh\",VLOOKUP(R$4,'4. Billing Determinants'!$B$19:$Z$41,6,0)/'4. Billing Determinants'!$G$41*$D28,IF($E28=\"Distribution Rev.\",VLOOKUP(R$4,'4. Billing Determinants'!$B$19:$Z$41,8,0)/'4. Billing Determinants'!$I$41*$D28, VLOOKUP(R$4,'4. Billing Determinants'!$B$19:$Z$41,3,0)/'4. Billing Determinants'!$D$41*$D28))))),0)","v":0},{"$f":"IFERROR(IF(S$4=\"\",0,IF($E28=\"kWh\",VLOOKUP(S$4,'4. Billing Determinants'!$B$19:$Z$41,4,0)/'4. Billing Determinants'!$E$41*$D28,IF($E28=\"kW\",VLOOKUP(S$4,'4. Billing Determinants'!$B$19:$Z$41,5,0)/'4. Billing Determinants'!$F$41*$D28,IF($E28=\"Non-RPP kWh\",VLOOKUP(S$4,'4. Billing Determinants'!$B$19:$Z$41,6,0)/'4. Billing Determinants'!$G$41*$D28,IF($E28=\"Distribution Rev.\",VLOOKUP(S$4,'4. Billing Determinants'!$B$19:$Z$41,8,0)/'4. Billing Determinants'!$I$41*$D28, VLOOKUP(S$4,'4. Billing Determinants'!$B$19:$Z$41,3,0)/'4. Billing Determinants'!$D$41*$D28))))),0)","v":0},{"$f":"IFERROR(IF(T$4=\"\",0,IF($E28=\"kWh\",VLOOKUP(T$4,'4. Billing Determinants'!$B$19:$Z$41,4,0)/'4. Billing Determinants'!$E$41*$D28,IF($E28=\"kW\",VLOOKUP(T$4,'4. Billing Determinants'!$B$19:$Z$41,5,0)/'4. Billing Determinants'!$F$41*$D28,IF($E28=\"Non-RPP kWh\",VLOOKUP(T$4,'4. Billing Determinants'!$B$19:$Z$41,6,0)/'4. Billing Determinants'!$G$41*$D28,IF($E28=\"Distribution Rev.\",VLOOKUP(T$4,'4. Billing Determinants'!$B$19:$Z$41,8,0)/'4. Billing Determinants'!$I$41*$D28, VLOOKUP(T$4,'4. Billing Determinants'!$B$19:$Z$41,3,0)/'4. Billing Determinants'!$D$41*$D28))))),0)","v":0},{"$f":"IFERROR(IF(U$4=\"\",0,IF($E28=\"kWh\",VLOOKUP(U$4,'4. Billing Determinants'!$B$19:$Z$41,4,0)/'4. Billing Determinants'!$E$41*$D28,IF($E28=\"kW\",VLOOKUP(U$4,'4. Billing Determinants'!$B$19:$Z$41,5,0)/'4. Billing Determinants'!$F$41*$D28,IF($E28=\"Non-RPP kWh\",VLOOKUP(U$4,'4. Billing Determinants'!$B$19:$Z$41,6,0)/'4. Billing Determinants'!$G$41*$D28,IF($E28=\"Distribution Rev.\",VLOOKUP(U$4,'4. Billing Determinants'!$B$19:$Z$41,8,0)/'4. Billing Determinants'!$I$41*$D28, VLOOKUP(U$4,'4. Billing Determinants'!$B$19:$Z$41,3,0)/'4. Billing Determinants'!$D$41*$D28))))),0)","v":0},{"$f":"IFERROR(IF(V$4=\"\",0,IF($E28=\"kWh\",VLOOKUP(V$4,'4. Billing Determinants'!$B$19:$Z$41,4,0)/'4. Billing Determinants'!$E$41*$D28,IF($E28=\"kW\",VLOOKUP(V$4,'4. Billing Determinants'!$B$19:$Z$41,5,0)/'4. Billing Determinants'!$F$41*$D28,IF($E28=\"Non-RPP kWh\",VLOOKUP(V$4,'4. Billing Determinants'!$B$19:$Z$41,6,0)/'4. Billing Determinants'!$G$41*$D28,IF($E28=\"Distribution Rev.\",VLOOKUP(V$4,'4. Billing Determinants'!$B$19:$Z$41,8,0)/'4. Billing Determinants'!$I$41*$D28, VLOOKUP(V$4,'4. Billing Determinants'!$B$19:$Z$41,3,0)/'4. Billing Determinants'!$D$41*$D28))))),0)","v":0},{"$f":"IFERROR(IF(W$4=\"\",0,IF($E28=\"kWh\",VLOOKUP(W$4,'4. Billing Determinants'!$B$19:$Z$41,4,0)/'4. Billing Determinants'!$E$41*$D28,IF($E28=\"kW\",VLOOKUP(W$4,'4. Billing Determinants'!$B$19:$Z$41,5,0)/'4. Billing Determinants'!$F$41*$D28,IF($E28=\"Non-RPP kWh\",VLOOKUP(W$4,'4. Billing Determinants'!$B$19:$Z$41,6,0)/'4. Billing Determinants'!$G$41*$D28,IF($E28=\"Distribution Rev.\",VLOOKUP(W$4,'4. Billing Determinants'!$B$19:$Z$41,8,0)/'4. Billing Determinants'!$I$41*$D28, VLOOKUP(W$4,'4. Billing Determinants'!$B$19:$Z$41,3,0)/'4. Billing Determinants'!$D$41*$D28))))),0)","v":0},{"$f":"IFERROR(IF(X$4=\"\",0,IF($E28=\"kWh\",VLOOKUP(X$4,'4. Billing Determinants'!$B$19:$Z$41,4,0)/'4. Billing Determinants'!$E$41*$D28,IF($E28=\"kW\",VLOOKUP(X$4,'4. Billing Determinants'!$B$19:$Z$41,5,0)/'4. Billing Determinants'!$F$41*$D28,IF($E28=\"Non-RPP kWh\",VLOOKUP(X$4,'4. Billing Determinants'!$B$19:$Z$41,6,0)/'4. Billing Determinants'!$G$41*$D28,IF($E28=\"Distribution Rev.\",VLOOKUP(X$4,'4. Billing Determinants'!$B$19:$Z$41,8,0)/'4. Billing Determinants'!$I$41*$D28, VLOOKUP(X$4,'4. Billing Determinants'!$B$19:$Z$41,3,0)/'4. Billing Determinants'!$D$41*$D28))))),0)","v":0},{"$f":"IFERROR(IF(Y$4=\"\",0,IF($E28=\"kWh\",VLOOKUP(Y$4,'4. Billing Determinants'!$B$19:$Z$41,4,0)/'4. Billing Determinants'!$E$41*$D28,IF($E28=\"kW\",VLOOKUP(Y$4,'4. Billing Determinants'!$B$19:$Z$41,5,0)/'4. Billing Determinants'!$F$41*$D28,IF($E28=\"Non-RPP kWh\",VLOOKUP(Y$4,'4. Billing Determinants'!$B$19:$Z$41,6,0)/'4. Billing Determinants'!$G$41*$D28,IF($E28=\"Distribution Rev.\",VLOOKUP(Y$4,'4. Billing Determinants'!$B$19:$Z$41,8,0)/'4. Billing Determinants'!$I$41*$D28, VLOOKUP(Y$4,'4. Billing Determinants'!$B$19:$Z$41,3,0)/'4. Billing Determinants'!$D$41*$D28))))),0)","v":0}]
[null,"Extra-Ordinary Event Costs",1572,{"$f":"'2. 2015 Continuity Schedule'!BS71","v":0},"kWh",{"$f":"IFERROR(IF(F$4=\"\",0,IF($E29=\"kWh\",VLOOKUP(F$4,'4. Billing Determinants'!$B$19:$Z$41,4,0)/'4. Billing Determinants'!$E$41*$D29,IF($E29=\"kW\",VLOOKUP(F$4,'4. Billing Determinants'!$B$19:$Z$41,5,0)/'4. Billing Determinants'!$F$41*$D29,IF($E29=\"Non-RPP kWh\",VLOOKUP(F$4,'4. Billing Determinants'!$B$19:$Z$41,6,0)/'4. Billing Determinants'!$G$41*$D29,IF($E29=\"Distribution Rev.\",VLOOKUP(F$4,'4. Billing Determinants'!$B$19:$Z$41,8,0)/'4. Billing Determinants'!$I$41*$D29, VLOOKUP(F$4,'4. Billing Determinants'!$B$19:$Z$41,3,0)/'4. Billing Determinants'!$D$41*$D29))))),0)","v":0},{"$f":"IFERROR(IF(G$4=\"\",0,IF($E29=\"kWh\",VLOOKUP(G$4,'4. Billing Determinants'!$B$19:$Z$41,4,0)/'4. Billing Determinants'!$E$41*$D29,IF($E29=\"kW\",VLOOKUP(G$4,'4. Billing Determinants'!$B$19:$Z$41,5,0)/'4. Billing Determinants'!$F$41*$D29,IF($E29=\"Non-RPP kWh\",VLOOKUP(G$4,'4. Billing Determinants'!$B$19:$Z$41,6,0)/'4. Billing Determinants'!$G$41*$D29,IF($E29=\"Distribution Rev.\",VLOOKUP(G$4,'4. Billing Determinants'!$B$19:$Z$41,8,0)/'4. Billing Determinants'!$I$41*$D29, VLOOKUP(G$4,'4. Billing Determinants'!$B$19:$Z$41,3,0)/'4. Billing Determinants'!$D$41*$D29))))),0)","v":0},{"$f":"IFERROR(IF(H$4=\"\",0,IF($E29=\"kWh\",VLOOKUP(H$4,'4. Billing Determinants'!$B$19:$Z$41,4,0)/'4. Billing Determinants'!$E$41*$D29,IF($E29=\"kW\",VLOOKUP(H$4,'4. Billing Determinants'!$B$19:$Z$41,5,0)/'4. Billing Determinants'!$F$41*$D29,IF($E29=\"Non-RPP kWh\",VLOOKUP(H$4,'4. Billing Determinants'!$B$19:$Z$41,6,0)/'4. Billing Determinants'!$G$41*$D29,IF($E29=\"Distribution Rev.\",VLOOKUP(H$4,'4. Billing Determinants'!$B$19:$Z$41,8,0)/'4. Billing Determinants'!$I$41*$D29, VLOOKUP(H$4,'4. Billing Determinants'!$B$19:$Z$41,3,0)/'4. Billing Determinants'!$D$41*$D29))))),0)","v":0},{"$f":"IFERROR(IF(I$4=\"\",0,IF($E29=\"kWh\",VLOOKUP(I$4,'4. Billing Determinants'!$B$19:$Z$41,4,0)/'4. Billing Determinants'!$E$41*$D29,IF($E29=\"kW\",VLOOKUP(I$4,'4. Billing Determinants'!$B$19:$Z$41,5,0)/'4. Billing Determinants'!$F$41*$D29,IF($E29=\"Non-RPP kWh\",VLOOKUP(I$4,'4. Billing Determinants'!$B$19:$Z$41,6,0)/'4. Billing Determinants'!$G$41*$D29,IF($E29=\"Distribution Rev.\",VLOOKUP(I$4,'4. Billing Determinants'!$B$19:$Z$41,8,0)/'4. Billing Determinants'!$I$41*$D29, VLOOKUP(I$4,'4. Billing Determinants'!$B$19:$Z$41,3,0)/'4. Billing Determinants'!$D$41*$D29))))),0)","v":0},{"$f":"IFERROR(IF(J$4=\"\",0,IF($E29=\"kWh\",VLOOKUP(J$4,'4. Billing Determinants'!$B$19:$Z$41,4,0)/'4. Billing Determinants'!$E$41*$D29,IF($E29=\"kW\",VLOOKUP(J$4,'4. Billing Determinants'!$B$19:$Z$41,5,0)/'4. Billing Determinants'!$F$41*$D29,IF($E29=\"Non-RPP kWh\",VLOOKUP(J$4,'4. Billing Determinants'!$B$19:$Z$41,6,0)/'4. Billing Determinants'!$G$41*$D29,IF($E29=\"Distribution Rev.\",VLOOKUP(J$4,'4. Billing Determinants'!$B$19:$Z$41,8,0)/'4. Billing Determinants'!$I$41*$D29, VLOOKUP(J$4,'4. Billing Determinants'!$B$19:$Z$41,3,0)/'4. Billing Determinants'!$D$41*$D29))))),0)","v":0},{"$f":"IFERROR(IF(K$4=\"\",0,IF($E29=\"kWh\",VLOOKUP(K$4,'4. Billing Determinants'!$B$19:$Z$41,4,0)/'4. Billing Determinants'!$E$41*$D29,IF($E29=\"kW\",VLOOKUP(K$4,'4. Billing Determinants'!$B$19:$Z$41,5,0)/'4. Billing Determinants'!$F$41*$D29,IF($E29=\"Non-RPP kWh\",VLOOKUP(K$4,'4. Billing Determinants'!$B$19:$Z$41,6,0)/'4. Billing Determinants'!$G$41*$D29,IF($E29=\"Distribution Rev.\",VLOOKUP(K$4,'4. Billing Determinants'!$B$19:$Z$41,8,0)/'4. Billing Determinants'!$I$41*$D29, VLOOKUP(K$4,'4. Billing Determinants'!$B$19:$Z$41,3,0)/'4. Billing Determinants'!$D$41*$D29))))),0)","v":0},{"$f":"IFERROR(IF(L$4=\"\",0,IF($E29=\"kWh\",VLOOKUP(L$4,'4. Billing Determinants'!$B$19:$Z$41,4,0)/'4. Billing Determinants'!$E$41*$D29,IF($E29=\"kW\",VLOOKUP(L$4,'4. Billing Determinants'!$B$19:$Z$41,5,0)/'4. Billing Determinants'!$F$41*$D29,IF($E29=\"Non-RPP kWh\",VLOOKUP(L$4,'4. Billing Determinants'!$B$19:$Z$41,6,0)/'4. Billing Determinants'!$G$41*$D29,IF($E29=\"Distribution Rev.\",VLOOKUP(L$4,'4. Billing Determinants'!$B$19:$Z$41,8,0)/'4. Billing Determinants'!$I$41*$D29, VLOOKUP(L$4,'4. Billing Determinants'!$B$19:$Z$41,3,0)/'4. Billing Determinants'!$D$41*$D29))))),0)","v":0},{"$f":"IFERROR(IF(M$4=\"\",0,IF($E29=\"kWh\",VLOOKUP(M$4,'4. Billing Determinants'!$B$19:$Z$41,4,0)/'4. Billing Determinants'!$E$41*$D29,IF($E29=\"kW\",VLOOKUP(M$4,'4. Billing Determinants'!$B$19:$Z$41,5,0)/'4. Billing Determinants'!$F$41*$D29,IF($E29=\"Non-RPP kWh\",VLOOKUP(M$4,'4. Billing Determinants'!$B$19:$Z$41,6,0)/'4. Billing Determinants'!$G$41*$D29,IF($E29=\"Distribution Rev.\",VLOOKUP(M$4,'4. Billing Determinants'!$B$19:$Z$41,8,0)/'4. Billing Determinants'!$I$41*$D29, VLOOKUP(M$4,'4. Billing Determinants'!$B$19:$Z$41,3,0)/'4. Billing Determinants'!$D$41*$D29))))),0)","v":0},{"$f":"IFERROR(IF(N$4=\"\",0,IF($E29=\"kWh\",VLOOKUP(N$4,'4. Billing Determinants'!$B$19:$Z$41,4,0)/'4. Billing Determinants'!$E$41*$D29,IF($E29=\"kW\",VLOOKUP(N$4,'4. Billing Determinants'!$B$19:$Z$41,5,0)/'4. Billing Determinants'!$F$41*$D29,IF($E29=\"Non-RPP kWh\",VLOOKUP(N$4,'4. Billing Determinants'!$B$19:$Z$41,6,0)/'4. Billing Determinants'!$G$41*$D29,IF($E29=\"Distribution Rev.\",VLOOKUP(N$4,'4. Billing Determinants'!$B$19:$Z$41,8,0)/'4. Billing Determinants'!$I$41*$D29, VLOOKUP(N$4,'4. Billing Determinants'!$B$19:$Z$41,3,0)/'4. Billing Determinants'!$D$41*$D29))))),0)","v":0},{"$f":"IFERROR(IF(O$4=\"\",0,IF($E29=\"kWh\",VLOOKUP(O$4,'4. Billing Determinants'!$B$19:$Z$41,4,0)/'4. Billing Determinants'!$E$41*$D29,IF($E29=\"kW\",VLOOKUP(O$4,'4. Billing Determinants'!$B$19:$Z$41,5,0)/'4. Billing Determinants'!$F$41*$D29,IF($E29=\"Non-RPP kWh\",VLOOKUP(O$4,'4. Billing Determinants'!$B$19:$Z$41,6,0)/'4. Billing Determinants'!$G$41*$D29,IF($E29=\"Distribution Rev.\",VLOOKUP(O$4,'4. Billing Determinants'!$B$19:$Z$41,8,0)/'4. Billing Determinants'!$I$41*$D29, VLOOKUP(O$4,'4. Billing Determinants'!$B$19:$Z$41,3,0)/'4. Billing Determinants'!$D$41*$D29))))),0)","v":0},{"$f":"IFERROR(IF(P$4=\"\",0,IF($E29=\"kWh\",VLOOKUP(P$4,'4. Billing Determinants'!$B$19:$Z$41,4,0)/'4. Billing Determinants'!$E$41*$D29,IF($E29=\"kW\",VLOOKUP(P$4,'4. Billing Determinants'!$B$19:$Z$41,5,0)/'4. Billing Determinants'!$F$41*$D29,IF($E29=\"Non-RPP kWh\",VLOOKUP(P$4,'4. Billing Determinants'!$B$19:$Z$41,6,0)/'4. Billing Determinants'!$G$41*$D29,IF($E29=\"Distribution Rev.\",VLOOKUP(P$4,'4. Billing Determinants'!$B$19:$Z$41,8,0)/'4. Billing Determinants'!$I$41*$D29, VLOOKUP(P$4,'4. Billing Determinants'!$B$19:$Z$41,3,0)/'4. Billing Determinants'!$D$41*$D29))))),0)","v":0},{"$f":"IFERROR(IF(Q$4=\"\",0,IF($E29=\"kWh\",VLOOKUP(Q$4,'4. Billing Determinants'!$B$19:$Z$41,4,0)/'4. Billing Determinants'!$E$41*$D29,IF($E29=\"kW\",VLOOKUP(Q$4,'4. Billing Determinants'!$B$19:$Z$41,5,0)/'4. Billing Determinants'!$F$41*$D29,IF($E29=\"Non-RPP kWh\",VLOOKUP(Q$4,'4. Billing Determinants'!$B$19:$Z$41,6,0)/'4. Billing Determinants'!$G$41*$D29,IF($E29=\"Distribution Rev.\",VLOOKUP(Q$4,'4. Billing Determinants'!$B$19:$Z$41,8,0)/'4. Billing Determinants'!$I$41*$D29, VLOOKUP(Q$4,'4. Billing Determinants'!$B$19:$Z$41,3,0)/'4. Billing Determinants'!$D$41*$D29))))),0)","v":0},{"$f":"IFERROR(IF(R$4=\"\",0,IF($E29=\"kWh\",VLOOKUP(R$4,'4. Billing Determinants'!$B$19:$Z$41,4,0)/'4. Billing Determinants'!$E$41*$D29,IF($E29=\"kW\",VLOOKUP(R$4,'4. Billing Determinants'!$B$19:$Z$41,5,0)/'4. Billing Determinants'!$F$41*$D29,IF($E29=\"Non-RPP kWh\",VLOOKUP(R$4,'4. Billing Determinants'!$B$19:$Z$41,6,0)/'4. Billing Determinants'!$G$41*$D29,IF($E29=\"Distribution Rev.\",VLOOKUP(R$4,'4. Billing Determinants'!$B$19:$Z$41,8,0)/'4. Billing Determinants'!$I$41*$D29, VLOOKUP(R$4,'4. Billing Determinants'!$B$19:$Z$41,3,0)/'4. Billing Determinants'!$D$41*$D29))))),0)","v":0},{"$f":"IFERROR(IF(S$4=\"\",0,IF($E29=\"kWh\",VLOOKUP(S$4,'4. Billing Determinants'!$B$19:$Z$41,4,0)/'4. Billing Determinants'!$E$41*$D29,IF($E29=\"kW\",VLOOKUP(S$4,'4. Billing Determinants'!$B$19:$Z$41,5,0)/'4. Billing Determinants'!$F$41*$D29,IF($E29=\"Non-RPP kWh\",VLOOKUP(S$4,'4. Billing Determinants'!$B$19:$Z$41,6,0)/'4. Billing Determinants'!$G$41*$D29,IF($E29=\"Distribution Rev.\",VLOOKUP(S$4,'4. Billing Determinants'!$B$19:$Z$41,8,0)/'4. Billing Determinants'!$I$41*$D29, VLOOKUP(S$4,'4. Billing Determinants'!$B$19:$Z$41,3,0)/'4. Billing Determinants'!$D$41*$D29))))),0)","v":0},{"$f":"IFERROR(IF(T$4=\"\",0,IF($E29=\"kWh\",VLOOKUP(T$4,'4. Billing Determinants'!$B$19:$Z$41,4,0)/'4. Billing Determinants'!$E$41*$D29,IF($E29=\"kW\",VLOOKUP(T$4,'4. Billing Determinants'!$B$19:$Z$41,5,0)/'4. Billing Determinants'!$F$41*$D29,IF($E29=\"Non-RPP kWh\",VLOOKUP(T$4,'4. Billing Determinants'!$B$19:$Z$41,6,0)/'4. Billing Determinants'!$G$41*$D29,IF($E29=\"Distribution Rev.\",VLOOKUP(T$4,'4. Billing Determinants'!$B$19:$Z$41,8,0)/'4. Billing Determinants'!$I$41*$D29, VLOOKUP(T$4,'4. Billing Determinants'!$B$19:$Z$41,3,0)/'4. Billing Determinants'!$D$41*$D29))))),0)","v":0},{"$f":"IFERROR(IF(U$4=\"\",0,IF($E29=\"kWh\",VLOOKUP(U$4,'4. Billing Determinants'!$B$19:$Z$41,4,0)/'4. Billing Determinants'!$E$41*$D29,IF($E29=\"kW\",VLOOKUP(U$4,'4. Billing Determinants'!$B$19:$Z$41,5,0)/'4. Billing Determinants'!$F$41*$D29,IF($E29=\"Non-RPP kWh\",VLOOKUP(U$4,'4. Billing Determinants'!$B$19:$Z$41,6,0)/'4. Billing Determinants'!$G$41*$D29,IF($E29=\"Distribution Rev.\",VLOOKUP(U$4,'4. Billing Determinants'!$B$19:$Z$41,8,0)/'4. Billing Determinants'!$I$41*$D29, VLOOKUP(U$4,'4. Billing Determinants'!$B$19:$Z$41,3,0)/'4. Billing Determinants'!$D$41*$D29))))),0)","v":0},{"$f":"IFERROR(IF(V$4=\"\",0,IF($E29=\"kWh\",VLOOKUP(V$4,'4. Billing Determinants'!$B$19:$Z$41,4,0)/'4. Billing Determinants'!$E$41*$D29,IF($E29=\"kW\",VLOOKUP(V$4,'4. Billing Determinants'!$B$19:$Z$41,5,0)/'4. Billing Determinants'!$F$41*$D29,IF($E29=\"Non-RPP kWh\",VLOOKUP(V$4,'4. Billing Determinants'!$B$19:$Z$41,6,0)/'4. Billing Determinants'!$G$41*$D29,IF($E29=\"Distribution Rev.\",VLOOKUP(V$4,'4. Billing Determinants'!$B$19:$Z$41,8,0)/'4. Billing Determinants'!$I$41*$D29, VLOOKUP(V$4,'4. Billing Determinants'!$B$19:$Z$41,3,0)/'4. Billing Determinants'!$D$41*$D29))))),0)","v":0},{"$f":"IFERROR(IF(W$4=\"\",0,IF($E29=\"kWh\",VLOOKUP(W$4,'4. Billing Determinants'!$B$19:$Z$41,4,0)/'4. Billing Determinants'!$E$41*$D29,IF($E29=\"kW\",VLOOKUP(W$4,'4. Billing Determinants'!$B$19:$Z$41,5,0)/'4. Billing Determinants'!$F$41*$D29,IF($E29=\"Non-RPP kWh\",VLOOKUP(W$4,'4. Billing Determinants'!$B$19:$Z$41,6,0)/'4. Billing Determinants'!$G$41*$D29,IF($E29=\"Distribution Rev.\",VLOOKUP(W$4,'4. Billing Determinants'!$B$19:$Z$41,8,0)/'4. Billing Determinants'!$I$41*$D29, VLOOKUP(W$4,'4. Billing Determinants'!$B$19:$Z$41,3,0)/'4. Billing Determinants'!$D$41*$D29))))),0)","v":0},{"$f":"IFERROR(IF(X$4=\"\",0,IF($E29=\"kWh\",VLOOKUP(X$4,'4. Billing Determinants'!$B$19:$Z$41,4,0)/'4. Billing Determinants'!$E$41*$D29,IF($E29=\"kW\",VLOOKUP(X$4,'4. Billing Determinants'!$B$19:$Z$41,5,0)/'4. Billing Determinants'!$F$41*$D29,IF($E29=\"Non-RPP kWh\",VLOOKUP(X$4,'4. Billing Determinants'!$B$19:$Z$41,6,0)/'4. Billing Determinants'!$G$41*$D29,IF($E29=\"Distribution Rev.\",VLOOKUP(X$4,'4. Billing Determinants'!$B$19:$Z$41,8,0)/'4. Billing Determinants'!$I$41*$D29, VLOOKUP(X$4,'4. Billing Determinants'!$B$19:$Z$41,3,0)/'4. Billing Determinants'!$D$41*$D29))))),0)","v":0},{"$f":"IFERROR(IF(Y$4=\"\",0,IF($E29=\"kWh\",VLOOKUP(Y$4,'4. Billing Determinants'!$B$19:$Z$41,4,0)/'4. Billing Determinants'!$E$41*$D29,IF($E29=\"kW\",VLOOKUP(Y$4,'4. Billing Determinants'!$B$19:$Z$41,5,0)/'4. Billing Determinants'!$F$41*$D29,IF($E29=\"Non-RPP kWh\",VLOOKUP(Y$4,'4. Billing Determinants'!$B$19:$Z$41,6,0)/'4. Billing Determinants'!$G$41*$D29,IF($E29=\"Distribution Rev.\",VLOOKUP(Y$4,'4. Billing Determinants'!$B$19:$Z$41,8,0)/'4. Billing Determinants'!$I$41*$D29, VLOOKUP(Y$4,'4. Billing Determinants'!$B$19:$Z$41,3,0)/'4. Billing Determinants'!$D$41*$D29))))),0)","v":0}]
[null,"Deferred Rate Impact Amounts",1574,{"$f":"'2. 2015 Continuity Schedule'!BS72","v":0},"kWh",{"$f":"IFERROR(IF(F$4=\"\",0,IF($E30=\"kWh\",VLOOKUP(F$4,'4. Billing Determinants'!$B$19:$Z$41,4,0)/'4. Billing Determinants'!$E$41*$D30,IF($E30=\"kW\",VLOOKUP(F$4,'4. Billing Determinants'!$B$19:$Z$41,5,0)/'4. Billing Determinants'!$F$41*$D30,IF($E30=\"Non-RPP kWh\",VLOOKUP(F$4,'4. Billing Determinants'!$B$19:$Z$41,6,0)/'4. Billing Determinants'!$G$41*$D30,IF($E30=\"Distribution Rev.\",VLOOKUP(F$4,'4. Billing Determinants'!$B$19:$Z$41,8,0)/'4. Billing Determinants'!$I$41*$D30, VLOOKUP(F$4,'4. Billing Determinants'!$B$19:$Z$41,3,0)/'4. Billing Determinants'!$D$41*$D30))))),0)","v":0},{"$f":"IFERROR(IF(G$4=\"\",0,IF($E30=\"kWh\",VLOOKUP(G$4,'4. Billing Determinants'!$B$19:$Z$41,4,0)/'4. Billing Determinants'!$E$41*$D30,IF($E30=\"kW\",VLOOKUP(G$4,'4. Billing Determinants'!$B$19:$Z$41,5,0)/'4. Billing Determinants'!$F$41*$D30,IF($E30=\"Non-RPP kWh\",VLOOKUP(G$4,'4. Billing Determinants'!$B$19:$Z$41,6,0)/'4. Billing Determinants'!$G$41*$D30,IF($E30=\"Distribution Rev.\",VLOOKUP(G$4,'4. Billing Determinants'!$B$19:$Z$41,8,0)/'4. Billing Determinants'!$I$41*$D30, VLOOKUP(G$4,'4. Billing Determinants'!$B$19:$Z$41,3,0)/'4. Billing Determinants'!$D$41*$D30))))),0)","v":0},{"$f":"IFERROR(IF(H$4=\"\",0,IF($E30=\"kWh\",VLOOKUP(H$4,'4. Billing Determinants'!$B$19:$Z$41,4,0)/'4. Billing Determinants'!$E$41*$D30,IF($E30=\"kW\",VLOOKUP(H$4,'4. Billing Determinants'!$B$19:$Z$41,5,0)/'4. Billing Determinants'!$F$41*$D30,IF($E30=\"Non-RPP kWh\",VLOOKUP(H$4,'4. Billing Determinants'!$B$19:$Z$41,6,0)/'4. Billing Determinants'!$G$41*$D30,IF($E30=\"Distribution Rev.\",VLOOKUP(H$4,'4. Billing Determinants'!$B$19:$Z$41,8,0)/'4. Billing Determinants'!$I$41*$D30, VLOOKUP(H$4,'4. Billing Determinants'!$B$19:$Z$41,3,0)/'4. Billing Determinants'!$D$41*$D30))))),0)","v":0},{"$f":"IFERROR(IF(I$4=\"\",0,IF($E30=\"kWh\",VLOOKUP(I$4,'4. Billing Determinants'!$B$19:$Z$41,4,0)/'4. Billing Determinants'!$E$41*$D30,IF($E30=\"kW\",VLOOKUP(I$4,'4. Billing Determinants'!$B$19:$Z$41,5,0)/'4. Billing Determinants'!$F$41*$D30,IF($E30=\"Non-RPP kWh\",VLOOKUP(I$4,'4. Billing Determinants'!$B$19:$Z$41,6,0)/'4. Billing Determinants'!$G$41*$D30,IF($E30=\"Distribution Rev.\",VLOOKUP(I$4,'4. Billing Determinants'!$B$19:$Z$41,8,0)/'4. Billing Determinants'!$I$41*$D30, VLOOKUP(I$4,'4. Billing Determinants'!$B$19:$Z$41,3,0)/'4. Billing Determinants'!$D$41*$D30))))),0)","v":0},{"$f":"IFERROR(IF(J$4=\"\",0,IF($E30=\"kWh\",VLOOKUP(J$4,'4. Billing Determinants'!$B$19:$Z$41,4,0)/'4. Billing Determinants'!$E$41*$D30,IF($E30=\"kW\",VLOOKUP(J$4,'4. Billing Determinants'!$B$19:$Z$41,5,0)/'4. Billing Determinants'!$F$41*$D30,IF($E30=\"Non-RPP kWh\",VLOOKUP(J$4,'4. Billing Determinants'!$B$19:$Z$41,6,0)/'4. Billing Determinants'!$G$41*$D30,IF($E30=\"Distribution Rev.\",VLOOKUP(J$4,'4. Billing Determinants'!$B$19:$Z$41,8,0)/'4. Billing Determinants'!$I$41*$D30, VLOOKUP(J$4,'4. Billing Determinants'!$B$19:$Z$41,3,0)/'4. Billing Determinants'!$D$41*$D30))))),0)","v":0},{"$f":"IFERROR(IF(K$4=\"\",0,IF($E30=\"kWh\",VLOOKUP(K$4,'4. Billing Determinants'!$B$19:$Z$41,4,0)/'4. Billing Determinants'!$E$41*$D30,IF($E30=\"kW\",VLOOKUP(K$4,'4. Billing Determinants'!$B$19:$Z$41,5,0)/'4. Billing Determinants'!$F$41*$D30,IF($E30=\"Non-RPP kWh\",VLOOKUP(K$4,'4. Billing Determinants'!$B$19:$Z$41,6,0)/'4. Billing Determinants'!$G$41*$D30,IF($E30=\"Distribution Rev.\",VLOOKUP(K$4,'4. Billing Determinants'!$B$19:$Z$41,8,0)/'4. Billing Determinants'!$I$41*$D30, VLOOKUP(K$4,'4. Billing Determinants'!$B$19:$Z$41,3,0)/'4. Billing Determinants'!$D$41*$D30))))),0)","v":0},{"$f":"IFERROR(IF(L$4=\"\",0,IF($E30=\"kWh\",VLOOKUP(L$4,'4. Billing Determinants'!$B$19:$Z$41,4,0)/'4. Billing Determinants'!$E$41*$D30,IF($E30=\"kW\",VLOOKUP(L$4,'4. Billing Determinants'!$B$19:$Z$41,5,0)/'4. Billing Determinants'!$F$41*$D30,IF($E30=\"Non-RPP kWh\",VLOOKUP(L$4,'4. Billing Determinants'!$B$19:$Z$41,6,0)/'4. Billing Determinants'!$G$41*$D30,IF($E30=\"Distribution Rev.\",VLOOKUP(L$4,'4. Billing Determinants'!$B$19:$Z$41,8,0)/'4. Billing Determinants'!$I$41*$D30, VLOOKUP(L$4,'4. Billing Determinants'!$B$19:$Z$41,3,0)/'4. Billing Determinants'!$D$41*$D30))))),0)","v":0},{"$f":"IFERROR(IF(M$4=\"\",0,IF($E30=\"kWh\",VLOOKUP(M$4,'4. Billing Determinants'!$B$19:$Z$41,4,0)/'4. Billing Determinants'!$E$41*$D30,IF($E30=\"kW\",VLOOKUP(M$4,'4. Billing Determinants'!$B$19:$Z$41,5,0)/'4. Billing Determinants'!$F$41*$D30,IF($E30=\"Non-RPP kWh\",VLOOKUP(M$4,'4. Billing Determinants'!$B$19:$Z$41,6,0)/'4. Billing Determinants'!$G$41*$D30,IF($E30=\"Distribution Rev.\",VLOOKUP(M$4,'4. Billing Determinants'!$B$19:$Z$41,8,0)/'4. Billing Determinants'!$I$41*$D30, VLOOKUP(M$4,'4. Billing Determinants'!$B$19:$Z$41,3,0)/'4. Billing Determinants'!$D$41*$D30))))),0)","v":0},{"$f":"IFERROR(IF(N$4=\"\",0,IF($E30=\"kWh\",VLOOKUP(N$4,'4. Billing Determinants'!$B$19:$Z$41,4,0)/'4. Billing Determinants'!$E$41*$D30,IF($E30=\"kW\",VLOOKUP(N$4,'4. Billing Determinants'!$B$19:$Z$41,5,0)/'4. Billing Determinants'!$F$41*$D30,IF($E30=\"Non-RPP kWh\",VLOOKUP(N$4,'4. Billing Determinants'!$B$19:$Z$41,6,0)/'4. Billing Determinants'!$G$41*$D30,IF($E30=\"Distribution Rev.\",VLOOKUP(N$4,'4. Billing Determinants'!$B$19:$Z$41,8,0)/'4. Billing Determinants'!$I$41*$D30, VLOOKUP(N$4,'4. Billing Determinants'!$B$19:$Z$41,3,0)/'4. Billing Determinants'!$D$41*$D30))))),0)","v":0},{"$f":"IFERROR(IF(O$4=\"\",0,IF($E30=\"kWh\",VLOOKUP(O$4,'4. Billing Determinants'!$B$19:$Z$41,4,0)/'4. Billing Determinants'!$E$41*$D30,IF($E30=\"kW\",VLOOKUP(O$4,'4. Billing Determinants'!$B$19:$Z$41,5,0)/'4. Billing Determinants'!$F$41*$D30,IF($E30=\"Non-RPP kWh\",VLOOKUP(O$4,'4. Billing Determinants'!$B$19:$Z$41,6,0)/'4. Billing Determinants'!$G$41*$D30,IF($E30=\"Distribution Rev.\",VLOOKUP(O$4,'4. Billing Determinants'!$B$19:$Z$41,8,0)/'4. Billing Determinants'!$I$41*$D30, VLOOKUP(O$4,'4. Billing Determinants'!$B$19:$Z$41,3,0)/'4. Billing Determinants'!$D$41*$D30))))),0)","v":0},{"$f":"IFERROR(IF(P$4=\"\",0,IF($E30=\"kWh\",VLOOKUP(P$4,'4. Billing Determinants'!$B$19:$Z$41,4,0)/'4. Billing Determinants'!$E$41*$D30,IF($E30=\"kW\",VLOOKUP(P$4,'4. Billing Determinants'!$B$19:$Z$41,5,0)/'4. Billing Determinants'!$F$41*$D30,IF($E30=\"Non-RPP kWh\",VLOOKUP(P$4,'4. Billing Determinants'!$B$19:$Z$41,6,0)/'4. Billing Determinants'!$G$41*$D30,IF($E30=\"Distribution Rev.\",VLOOKUP(P$4,'4. Billing Determinants'!$B$19:$Z$41,8,0)/'4. Billing Determinants'!$I$41*$D30, VLOOKUP(P$4,'4. Billing Determinants'!$B$19:$Z$41,3,0)/'4. Billing Determinants'!$D$41*$D30))))),0)","v":0},{"$f":"IFERROR(IF(Q$4=\"\",0,IF($E30=\"kWh\",VLOOKUP(Q$4,'4. Billing Determinants'!$B$19:$Z$41,4,0)/'4. Billing Determinants'!$E$41*$D30,IF($E30=\"kW\",VLOOKUP(Q$4,'4. Billing Determinants'!$B$19:$Z$41,5,0)/'4. Billing Determinants'!$F$41*$D30,IF($E30=\"Non-RPP kWh\",VLOOKUP(Q$4,'4. Billing Determinants'!$B$19:$Z$41,6,0)/'4. Billing Determinants'!$G$41*$D30,IF($E30=\"Distribution Rev.\",VLOOKUP(Q$4,'4. Billing Determinants'!$B$19:$Z$41,8,0)/'4. Billing Determinants'!$I$41*$D30, VLOOKUP(Q$4,'4. Billing Determinants'!$B$19:$Z$41,3,0)/'4. Billing Determinants'!$D$41*$D30))))),0)","v":0},{"$f":"IFERROR(IF(R$4=\"\",0,IF($E30=\"kWh\",VLOOKUP(R$4,'4. Billing Determinants'!$B$19:$Z$41,4,0)/'4. Billing Determinants'!$E$41*$D30,IF($E30=\"kW\",VLOOKUP(R$4,'4. Billing Determinants'!$B$19:$Z$41,5,0)/'4. Billing Determinants'!$F$41*$D30,IF($E30=\"Non-RPP kWh\",VLOOKUP(R$4,'4. Billing Determinants'!$B$19:$Z$41,6,0)/'4. Billing Determinants'!$G$41*$D30,IF($E30=\"Distribution Rev.\",VLOOKUP(R$4,'4. Billing Determinants'!$B$19:$Z$41,8,0)/'4. Billing Determinants'!$I$41*$D30, VLOOKUP(R$4,'4. Billing Determinants'!$B$19:$Z$41,3,0)/'4. Billing Determinants'!$D$41*$D30))))),0)","v":0},{"$f":"IFERROR(IF(S$4=\"\",0,IF($E30=\"kWh\",VLOOKUP(S$4,'4. Billing Determinants'!$B$19:$Z$41,4,0)/'4. Billing Determinants'!$E$41*$D30,IF($E30=\"kW\",VLOOKUP(S$4,'4. Billing Determinants'!$B$19:$Z$41,5,0)/'4. Billing Determinants'!$F$41*$D30,IF($E30=\"Non-RPP kWh\",VLOOKUP(S$4,'4. Billing Determinants'!$B$19:$Z$41,6,0)/'4. Billing Determinants'!$G$41*$D30,IF($E30=\"Distribution Rev.\",VLOOKUP(S$4,'4. Billing Determinants'!$B$19:$Z$41,8,0)/'4. Billing Determinants'!$I$41*$D30, VLOOKUP(S$4,'4. Billing Determinants'!$B$19:$Z$41,3,0)/'4. Billing Determinants'!$D$41*$D30))))),0)","v":0},{"$f":"IFERROR(IF(T$4=\"\",0,IF($E30=\"kWh\",VLOOKUP(T$4,'4. Billing Determinants'!$B$19:$Z$41,4,0)/'4. Billing Determinants'!$E$41*$D30,IF($E30=\"kW\",VLOOKUP(T$4,'4. Billing Determinants'!$B$19:$Z$41,5,0)/'4. Billing Determinants'!$F$41*$D30,IF($E30=\"Non-RPP kWh\",VLOOKUP(T$4,'4. Billing Determinants'!$B$19:$Z$41,6,0)/'4. Billing Determinants'!$G$41*$D30,IF($E30=\"Distribution Rev.\",VLOOKUP(T$4,'4. Billing Determinants'!$B$19:$Z$41,8,0)/'4. Billing Determinants'!$I$41*$D30, VLOOKUP(T$4,'4. Billing Determinants'!$B$19:$Z$41,3,0)/'4. Billing Determinants'!$D$41*$D30))))),0)","v":0},{"$f":"IFERROR(IF(U$4=\"\",0,IF($E30=\"kWh\",VLOOKUP(U$4,'4. Billing Determinants'!$B$19:$Z$41,4,0)/'4. Billing Determinants'!$E$41*$D30,IF($E30=\"kW\",VLOOKUP(U$4,'4. Billing Determinants'!$B$19:$Z$41,5,0)/'4. Billing Determinants'!$F$41*$D30,IF($E30=\"Non-RPP kWh\",VLOOKUP(U$4,'4. Billing Determinants'!$B$19:$Z$41,6,0)/'4. Billing Determinants'!$G$41*$D30,IF($E30=\"Distribution Rev.\",VLOOKUP(U$4,'4. Billing Determinants'!$B$19:$Z$41,8,0)/'4. Billing Determinants'!$I$41*$D30, VLOOKUP(U$4,'4. Billing Determinants'!$B$19:$Z$41,3,0)/'4. Billing Determinants'!$D$41*$D30))))),0)","v":0},{"$f":"IFERROR(IF(V$4=\"\",0,IF($E30=\"kWh\",VLOOKUP(V$4,'4. Billing Determinants'!$B$19:$Z$41,4,0)/'4. Billing Determinants'!$E$41*$D30,IF($E30=\"kW\",VLOOKUP(V$4,'4. Billing Determinants'!$B$19:$Z$41,5,0)/'4. Billing Determinants'!$F$41*$D30,IF($E30=\"Non-RPP kWh\",VLOOKUP(V$4,'4. Billing Determinants'!$B$19:$Z$41,6,0)/'4. Billing Determinants'!$G$41*$D30,IF($E30=\"Distribution Rev.\",VLOOKUP(V$4,'4. Billing Determinants'!$B$19:$Z$41,8,0)/'4. Billing Determinants'!$I$41*$D30, VLOOKUP(V$4,'4. Billing Determinants'!$B$19:$Z$41,3,0)/'4. Billing Determinants'!$D$41*$D30))))),0)","v":0},{"$f":"IFERROR(IF(W$4=\"\",0,IF($E30=\"kWh\",VLOOKUP(W$4,'4. Billing Determinants'!$B$19:$Z$41,4,0)/'4. Billing Determinants'!$E$41*$D30,IF($E30=\"kW\",VLOOKUP(W$4,'4. Billing Determinants'!$B$19:$Z$41,5,0)/'4. Billing Determinants'!$F$41*$D30,IF($E30=\"Non-RPP kWh\",VLOOKUP(W$4,'4. Billing Determinants'!$B$19:$Z$41,6,0)/'4. Billing Determinants'!$G$41*$D30,IF($E30=\"Distribution Rev.\",VLOOKUP(W$4,'4. Billing Determinants'!$B$19:$Z$41,8,0)/'4. Billing Determinants'!$I$41*$D30, VLOOKUP(W$4,'4. Billing Determinants'!$B$19:$Z$41,3,0)/'4. Billing Determinants'!$D$41*$D30))))),0)","v":0},{"$f":"IFERROR(IF(X$4=\"\",0,IF($E30=\"kWh\",VLOOKUP(X$4,'4. Billing Determinants'!$B$19:$Z$41,4,0)/'4. Billing Determinants'!$E$41*$D30,IF($E30=\"kW\",VLOOKUP(X$4,'4. Billing Determinants'!$B$19:$Z$41,5,0)/'4. Billing Determinants'!$F$41*$D30,IF($E30=\"Non-RPP kWh\",VLOOKUP(X$4,'4. Billing Determinants'!$B$19:$Z$41,6,0)/'4. Billing Determinants'!$G$41*$D30,IF($E30=\"Distribution Rev.\",VLOOKUP(X$4,'4. Billing Determinants'!$B$19:$Z$41,8,0)/'4. Billing Determinants'!$I$41*$D30, VLOOKUP(X$4,'4. Billing Determinants'!$B$19:$Z$41,3,0)/'4. Billing Determinants'!$D$41*$D30))))),0)","v":0},{"$f":"IFERROR(IF(Y$4=\"\",0,IF($E30=\"kWh\",VLOOKUP(Y$4,'4. Billing Determinants'!$B$19:$Z$41,4,0)/'4. Billing Determinants'!$E$41*$D30,IF($E30=\"kW\",VLOOKUP(Y$4,'4. Billing Determinants'!$B$19:$Z$41,5,0)/'4. Billing Determinants'!$F$41*$D30,IF($E30=\"Non-RPP kWh\",VLOOKUP(Y$4,'4. Billing Determinants'!$B$19:$Z$41,6,0)/'4. Billing Determinants'!$G$41*$D30,IF($E30=\"Distribution Rev.\",VLOOKUP(Y$4,'4. Billing Determinants'!$B$19:$Z$41,8,0)/'4. Billing Determinants'!$I$41*$D30, VLOOKUP(Y$4,'4. Billing Determinants'!$B$19:$Z$41,3,0)/'4. Billing Determinants'!$D$41*$D30))))),0)","v":0}]
[null,"RSVA - One-time",1582,{"$f":"'2. 2015 Continuity Schedule'!BS73","v":0},"kWh",{"$f":"IFERROR(IF(F$4=\"\",0,IF($E31=\"kWh\",VLOOKUP(F$4,'4. Billing Determinants'!$B$19:$Z$41,4,0)/'4. Billing Determinants'!$E$41*$D31,IF($E31=\"kW\",VLOOKUP(F$4,'4. Billing Determinants'!$B$19:$Z$41,5,0)/'4. Billing Determinants'!$F$41*$D31,IF($E31=\"Non-RPP kWh\",VLOOKUP(F$4,'4. Billing Determinants'!$B$19:$Z$41,6,0)/'4. Billing Determinants'!$G$41*$D31,IF($E31=\"Distribution Rev.\",VLOOKUP(F$4,'4. Billing Determinants'!$B$19:$Z$41,8,0)/'4. Billing Determinants'!$I$41*$D31, VLOOKUP(F$4,'4. Billing Determinants'!$B$19:$Z$41,3,0)/'4. Billing Determinants'!$D$41*$D31))))),0)","v":0},{"$f":"IFERROR(IF(G$4=\"\",0,IF($E31=\"kWh\",VLOOKUP(G$4,'4. Billing Determinants'!$B$19:$Z$41,4,0)/'4. Billing Determinants'!$E$41*$D31,IF($E31=\"kW\",VLOOKUP(G$4,'4. Billing Determinants'!$B$19:$Z$41,5,0)/'4. Billing Determinants'!$F$41*$D31,IF($E31=\"Non-RPP kWh\",VLOOKUP(G$4,'4. Billing Determinants'!$B$19:$Z$41,6,0)/'4. Billing Determinants'!$G$41*$D31,IF($E31=\"Distribution Rev.\",VLOOKUP(G$4,'4. Billing Determinants'!$B$19:$Z$41,8,0)/'4. Billing Determinants'!$I$41*$D31, VLOOKUP(G$4,'4. Billing Determinants'!$B$19:$Z$41,3,0)/'4. Billing Determinants'!$D$41*$D31))))),0)","v":0},{"$f":"IFERROR(IF(H$4=\"\",0,IF($E31=\"kWh\",VLOOKUP(H$4,'4. Billing Determinants'!$B$19:$Z$41,4,0)/'4. Billing Determinants'!$E$41*$D31,IF($E31=\"kW\",VLOOKUP(H$4,'4. Billing Determinants'!$B$19:$Z$41,5,0)/'4. Billing Determinants'!$F$41*$D31,IF($E31=\"Non-RPP kWh\",VLOOKUP(H$4,'4. Billing Determinants'!$B$19:$Z$41,6,0)/'4. Billing Determinants'!$G$41*$D31,IF($E31=\"Distribution Rev.\",VLOOKUP(H$4,'4. Billing Determinants'!$B$19:$Z$41,8,0)/'4. Billing Determinants'!$I$41*$D31, VLOOKUP(H$4,'4. Billing Determinants'!$B$19:$Z$41,3,0)/'4. Billing Determinants'!$D$41*$D31))))),0)","v":0},{"$f":"IFERROR(IF(I$4=\"\",0,IF($E31=\"kWh\",VLOOKUP(I$4,'4. Billing Determinants'!$B$19:$Z$41,4,0)/'4. Billing Determinants'!$E$41*$D31,IF($E31=\"kW\",VLOOKUP(I$4,'4. Billing Determinants'!$B$19:$Z$41,5,0)/'4. Billing Determinants'!$F$41*$D31,IF($E31=\"Non-RPP kWh\",VLOOKUP(I$4,'4. Billing Determinants'!$B$19:$Z$41,6,0)/'4. Billing Determinants'!$G$41*$D31,IF($E31=\"Distribution Rev.\",VLOOKUP(I$4,'4. Billing Determinants'!$B$19:$Z$41,8,0)/'4. Billing Determinants'!$I$41*$D31, VLOOKUP(I$4,'4. Billing Determinants'!$B$19:$Z$41,3,0)/'4. Billing Determinants'!$D$41*$D31))))),0)","v":0},{"$f":"IFERROR(IF(J$4=\"\",0,IF($E31=\"kWh\",VLOOKUP(J$4,'4. Billing Determinants'!$B$19:$Z$41,4,0)/'4. Billing Determinants'!$E$41*$D31,IF($E31=\"kW\",VLOOKUP(J$4,'4. Billing Determinants'!$B$19:$Z$41,5,0)/'4. Billing Determinants'!$F$41*$D31,IF($E31=\"Non-RPP kWh\",VLOOKUP(J$4,'4. Billing Determinants'!$B$19:$Z$41,6,0)/'4. Billing Determinants'!$G$41*$D31,IF($E31=\"Distribution Rev.\",VLOOKUP(J$4,'4. Billing Determinants'!$B$19:$Z$41,8,0)/'4. Billing Determinants'!$I$41*$D31, VLOOKUP(J$4,'4. Billing Determinants'!$B$19:$Z$41,3,0)/'4. Billing Determinants'!$D$41*$D31))))),0)","v":0},{"$f":"IFERROR(IF(K$4=\"\",0,IF($E31=\"kWh\",VLOOKUP(K$4,'4. Billing Determinants'!$B$19:$Z$41,4,0)/'4. Billing Determinants'!$E$41*$D31,IF($E31=\"kW\",VLOOKUP(K$4,'4. Billing Determinants'!$B$19:$Z$41,5,0)/'4. Billing Determinants'!$F$41*$D31,IF($E31=\"Non-RPP kWh\",VLOOKUP(K$4,'4. Billing Determinants'!$B$19:$Z$41,6,0)/'4. Billing Determinants'!$G$41*$D31,IF($E31=\"Distribution Rev.\",VLOOKUP(K$4,'4. Billing Determinants'!$B$19:$Z$41,8,0)/'4. Billing Determinants'!$I$41*$D31, VLOOKUP(K$4,'4. Billing Determinants'!$B$19:$Z$41,3,0)/'4. Billing Determinants'!$D$41*$D31))))),0)","v":0},{"$f":"IFERROR(IF(L$4=\"\",0,IF($E31=\"kWh\",VLOOKUP(L$4,'4. Billing Determinants'!$B$19:$Z$41,4,0)/'4. Billing Determinants'!$E$41*$D31,IF($E31=\"kW\",VLOOKUP(L$4,'4. Billing Determinants'!$B$19:$Z$41,5,0)/'4. Billing Determinants'!$F$41*$D31,IF($E31=\"Non-RPP kWh\",VLOOKUP(L$4,'4. Billing Determinants'!$B$19:$Z$41,6,0)/'4. Billing Determinants'!$G$41*$D31,IF($E31=\"Distribution Rev.\",VLOOKUP(L$4,'4. Billing Determinants'!$B$19:$Z$41,8,0)/'4. Billing Determinants'!$I$41*$D31, VLOOKUP(L$4,'4. Billing Determinants'!$B$19:$Z$41,3,0)/'4. Billing Determinants'!$D$41*$D31))))),0)","v":0},{"$f":"IFERROR(IF(M$4=\"\",0,IF($E31=\"kWh\",VLOOKUP(M$4,'4. Billing Determinants'!$B$19:$Z$41,4,0)/'4. Billing Determinants'!$E$41*$D31,IF($E31=\"kW\",VLOOKUP(M$4,'4. Billing Determinants'!$B$19:$Z$41,5,0)/'4. Billing Determinants'!$F$41*$D31,IF($E31=\"Non-RPP kWh\",VLOOKUP(M$4,'4. Billing Determinants'!$B$19:$Z$41,6,0)/'4. Billing Determinants'!$G$41*$D31,IF($E31=\"Distribution Rev.\",VLOOKUP(M$4,'4. Billing Determinants'!$B$19:$Z$41,8,0)/'4. Billing Determinants'!$I$41*$D31, VLOOKUP(M$4,'4. Billing Determinants'!$B$19:$Z$41,3,0)/'4. Billing Determinants'!$D$41*$D31))))),0)","v":0},{"$f":"IFERROR(IF(N$4=\"\",0,IF($E31=\"kWh\",VLOOKUP(N$4,'4. Billing Determinants'!$B$19:$Z$41,4,0)/'4. Billing Determinants'!$E$41*$D31,IF($E31=\"kW\",VLOOKUP(N$4,'4. Billing Determinants'!$B$19:$Z$41,5,0)/'4. Billing Determinants'!$F$41*$D31,IF($E31=\"Non-RPP kWh\",VLOOKUP(N$4,'4. Billing Determinants'!$B$19:$Z$41,6,0)/'4. Billing Determinants'!$G$41*$D31,IF($E31=\"Distribution Rev.\",VLOOKUP(N$4,'4. Billing Determinants'!$B$19:$Z$41,8,0)/'4. Billing Determinants'!$I$41*$D31, VLOOKUP(N$4,'4. Billing Determinants'!$B$19:$Z$41,3,0)/'4. Billing Determinants'!$D$41*$D31))))),0)","v":0},{"$f":"IFERROR(IF(O$4=\"\",0,IF($E31=\"kWh\",VLOOKUP(O$4,'4. Billing Determinants'!$B$19:$Z$41,4,0)/'4. Billing Determinants'!$E$41*$D31,IF($E31=\"kW\",VLOOKUP(O$4,'4. Billing Determinants'!$B$19:$Z$41,5,0)/'4. Billing Determinants'!$F$41*$D31,IF($E31=\"Non-RPP kWh\",VLOOKUP(O$4,'4. Billing Determinants'!$B$19:$Z$41,6,0)/'4. Billing Determinants'!$G$41*$D31,IF($E31=\"Distribution Rev.\",VLOOKUP(O$4,'4. Billing Determinants'!$B$19:$Z$41,8,0)/'4. Billing Determinants'!$I$41*$D31, VLOOKUP(O$4,'4. Billing Determinants'!$B$19:$Z$41,3,0)/'4. Billing Determinants'!$D$41*$D31))))),0)","v":0},{"$f":"IFERROR(IF(P$4=\"\",0,IF($E31=\"kWh\",VLOOKUP(P$4,'4. Billing Determinants'!$B$19:$Z$41,4,0)/'4. Billing Determinants'!$E$41*$D31,IF($E31=\"kW\",VLOOKUP(P$4,'4. Billing Determinants'!$B$19:$Z$41,5,0)/'4. Billing Determinants'!$F$41*$D31,IF($E31=\"Non-RPP kWh\",VLOOKUP(P$4,'4. Billing Determinants'!$B$19:$Z$41,6,0)/'4. Billing Determinants'!$G$41*$D31,IF($E31=\"Distribution Rev.\",VLOOKUP(P$4,'4. Billing Determinants'!$B$19:$Z$41,8,0)/'4. Billing Determinants'!$I$41*$D31, VLOOKUP(P$4,'4. Billing Determinants'!$B$19:$Z$41,3,0)/'4. Billing Determinants'!$D$41*$D31))))),0)","v":0},{"$f":"IFERROR(IF(Q$4=\"\",0,IF($E31=\"kWh\",VLOOKUP(Q$4,'4. Billing Determinants'!$B$19:$Z$41,4,0)/'4. Billing Determinants'!$E$41*$D31,IF($E31=\"kW\",VLOOKUP(Q$4,'4. Billing Determinants'!$B$19:$Z$41,5,0)/'4. Billing Determinants'!$F$41*$D31,IF($E31=\"Non-RPP kWh\",VLOOKUP(Q$4,'4. Billing Determinants'!$B$19:$Z$41,6,0)/'4. Billing Determinants'!$G$41*$D31,IF($E31=\"Distribution Rev.\",VLOOKUP(Q$4,'4. Billing Determinants'!$B$19:$Z$41,8,0)/'4. Billing Determinants'!$I$41*$D31, VLOOKUP(Q$4,'4. Billing Determinants'!$B$19:$Z$41,3,0)/'4. Billing Determinants'!$D$41*$D31))))),0)","v":0},{"$f":"IFERROR(IF(R$4=\"\",0,IF($E31=\"kWh\",VLOOKUP(R$4,'4. Billing Determinants'!$B$19:$Z$41,4,0)/'4. Billing Determinants'!$E$41*$D31,IF($E31=\"kW\",VLOOKUP(R$4,'4. Billing Determinants'!$B$19:$Z$41,5,0)/'4. Billing Determinants'!$F$41*$D31,IF($E31=\"Non-RPP kWh\",VLOOKUP(R$4,'4. Billing Determinants'!$B$19:$Z$41,6,0)/'4. Billing Determinants'!$G$41*$D31,IF($E31=\"Distribution Rev.\",VLOOKUP(R$4,'4. Billing Determinants'!$B$19:$Z$41,8,0)/'4. Billing Determinants'!$I$41*$D31, VLOOKUP(R$4,'4. Billing Determinants'!$B$19:$Z$41,3,0)/'4. Billing Determinants'!$D$41*$D31))))),0)","v":0},{"$f":"IFERROR(IF(S$4=\"\",0,IF($E31=\"kWh\",VLOOKUP(S$4,'4. Billing Determinants'!$B$19:$Z$41,4,0)/'4. Billing Determinants'!$E$41*$D31,IF($E31=\"kW\",VLOOKUP(S$4,'4. Billing Determinants'!$B$19:$Z$41,5,0)/'4. Billing Determinants'!$F$41*$D31,IF($E31=\"Non-RPP kWh\",VLOOKUP(S$4,'4. Billing Determinants'!$B$19:$Z$41,6,0)/'4. Billing Determinants'!$G$41*$D31,IF($E31=\"Distribution Rev.\",VLOOKUP(S$4,'4. Billing Determinants'!$B$19:$Z$41,8,0)/'4. Billing Determinants'!$I$41*$D31, VLOOKUP(S$4,'4. Billing Determinants'!$B$19:$Z$41,3,0)/'4. Billing Determinants'!$D$41*$D31))))),0)","v":0},{"$f":"IFERROR(IF(T$4=\"\",0,IF($E31=\"kWh\",VLOOKUP(T$4,'4. Billing Determinants'!$B$19:$Z$41,4,0)/'4. Billing Determinants'!$E$41*$D31,IF($E31=\"kW\",VLOOKUP(T$4,'4. Billing Determinants'!$B$19:$Z$41,5,0)/'4. Billing Determinants'!$F$41*$D31,IF($E31=\"Non-RPP kWh\",VLOOKUP(T$4,'4. Billing Determinants'!$B$19:$Z$41,6,0)/'4. Billing Determinants'!$G$41*$D31,IF($E31=\"Distribution Rev.\",VLOOKUP(T$4,'4. Billing Determinants'!$B$19:$Z$41,8,0)/'4. Billing Determinants'!$I$41*$D31, VLOOKUP(T$4,'4. Billing Determinants'!$B$19:$Z$41,3,0)/'4. Billing Determinants'!$D$41*$D31))))),0)","v":0},{"$f":"IFERROR(IF(U$4=\"\",0,IF($E31=\"kWh\",VLOOKUP(U$4,'4. Billing Determinants'!$B$19:$Z$41,4,0)/'4. Billing Determinants'!$E$41*$D31,IF($E31=\"kW\",VLOOKUP(U$4,'4. Billing Determinants'!$B$19:$Z$41,5,0)/'4. Billing Determinants'!$F$41*$D31,IF($E31=\"Non-RPP kWh\",VLOOKUP(U$4,'4. Billing Determinants'!$B$19:$Z$41,6,0)/'4. Billing Determinants'!$G$41*$D31,IF($E31=\"Distribution Rev.\",VLOOKUP(U$4,'4. Billing Determinants'!$B$19:$Z$41,8,0)/'4. Billing Determinants'!$I$41*$D31, VLOOKUP(U$4,'4. Billing Determinants'!$B$19:$Z$41,3,0)/'4. Billing Determinants'!$D$41*$D31))))),0)","v":0},{"$f":"IFERROR(IF(V$4=\"\",0,IF($E31=\"kWh\",VLOOKUP(V$4,'4. Billing Determinants'!$B$19:$Z$41,4,0)/'4. Billing Determinants'!$E$41*$D31,IF($E31=\"kW\",VLOOKUP(V$4,'4. Billing Determinants'!$B$19:$Z$41,5,0)/'4. Billing Determinants'!$F$41*$D31,IF($E31=\"Non-RPP kWh\",VLOOKUP(V$4,'4. Billing Determinants'!$B$19:$Z$41,6,0)/'4. Billing Determinants'!$G$41*$D31,IF($E31=\"Distribution Rev.\",VLOOKUP(V$4,'4. Billing Determinants'!$B$19:$Z$41,8,0)/'4. Billing Determinants'!$I$41*$D31, VLOOKUP(V$4,'4. Billing Determinants'!$B$19:$Z$41,3,0)/'4. Billing Determinants'!$D$41*$D31))))),0)","v":0},{"$f":"IFERROR(IF(W$4=\"\",0,IF($E31=\"kWh\",VLOOKUP(W$4,'4. Billing Determinants'!$B$19:$Z$41,4,0)/'4. Billing Determinants'!$E$41*$D31,IF($E31=\"kW\",VLOOKUP(W$4,'4. Billing Determinants'!$B$19:$Z$41,5,0)/'4. Billing Determinants'!$F$41*$D31,IF($E31=\"Non-RPP kWh\",VLOOKUP(W$4,'4. Billing Determinants'!$B$19:$Z$41,6,0)/'4. Billing Determinants'!$G$41*$D31,IF($E31=\"Distribution Rev.\",VLOOKUP(W$4,'4. Billing Determinants'!$B$19:$Z$41,8,0)/'4. Billing Determinants'!$I$41*$D31, VLOOKUP(W$4,'4. Billing Determinants'!$B$19:$Z$41,3,0)/'4. Billing Determinants'!$D$41*$D31))))),0)","v":0},{"$f":"IFERROR(IF(X$4=\"\",0,IF($E31=\"kWh\",VLOOKUP(X$4,'4. Billing Determinants'!$B$19:$Z$41,4,0)/'4. Billing Determinants'!$E$41*$D31,IF($E31=\"kW\",VLOOKUP(X$4,'4. Billing Determinants'!$B$19:$Z$41,5,0)/'4. Billing Determinants'!$F$41*$D31,IF($E31=\"Non-RPP kWh\",VLOOKUP(X$4,'4. Billing Determinants'!$B$19:$Z$41,6,0)/'4. Billing Determinants'!$G$41*$D31,IF($E31=\"Distribution Rev.\",VLOOKUP(X$4,'4. Billing Determinants'!$B$19:$Z$41,8,0)/'4. Billing Determinants'!$I$41*$D31, VLOOKUP(X$4,'4. Billing Determinants'!$B$19:$Z$41,3,0)/'4. Billing Determinants'!$D$41*$D31))))),0)","v":0},{"$f":"IFERROR(IF(Y$4=\"\",0,IF($E31=\"kWh\",VLOOKUP(Y$4,'4. Billing Determinants'!$B$19:$Z$41,4,0)/'4. Billing Determinants'!$E$41*$D31,IF($E31=\"kW\",VLOOKUP(Y$4,'4. Billing Determinants'!$B$19:$Z$41,5,0)/'4. Billing Determinants'!$F$41*$D31,IF($E31=\"Non-RPP kWh\",VLOOKUP(Y$4,'4. Billing Determinants'!$B$19:$Z$41,6,0)/'4. Billing Determinants'!$G$41*$D31,IF($E31=\"Distribution Rev.\",VLOOKUP(Y$4,'4. Billing Determinants'!$B$19:$Z$41,8,0)/'4. Billing Determinants'!$I$41*$D31, VLOOKUP(Y$4,'4. Billing Determinants'!$B$19:$Z$41,3,0)/'4. Billing Determinants'!$D$41*$D31))))),0)","v":0}]
[null,"Other Deferred Credits",2425,{"$f":"'2. 2015 Continuity Schedule'!BS74","v":0},"kWh",{"$f":"IFERROR(IF(F$4=\"\",0,IF($E32=\"kWh\",VLOOKUP(F$4,'4. Billing Determinants'!$B$19:$Z$41,4,0)/'4. Billing Determinants'!$E$41*$D32,IF($E32=\"kW\",VLOOKUP(F$4,'4. Billing Determinants'!$B$19:$Z$41,5,0)/'4. Billing Determinants'!$F$41*$D32,IF($E32=\"Non-RPP kWh\",VLOOKUP(F$4,'4. Billing Determinants'!$B$19:$Z$41,6,0)/'4. Billing Determinants'!$G$41*$D32,IF($E32=\"Distribution Rev.\",VLOOKUP(F$4,'4. Billing Determinants'!$B$19:$Z$41,8,0)/'4. Billing Determinants'!$I$41*$D32, VLOOKUP(F$4,'4. Billing Determinants'!$B$19:$Z$41,3,0)/'4. Billing Determinants'!$D$41*$D32))))),0)","v":0},{"$f":"IFERROR(IF(G$4=\"\",0,IF($E32=\"kWh\",VLOOKUP(G$4,'4. Billing Determinants'!$B$19:$Z$41,4,0)/'4. Billing Determinants'!$E$41*$D32,IF($E32=\"kW\",VLOOKUP(G$4,'4. Billing Determinants'!$B$19:$Z$41,5,0)/'4. Billing Determinants'!$F$41*$D32,IF($E32=\"Non-RPP kWh\",VLOOKUP(G$4,'4. Billing Determinants'!$B$19:$Z$41,6,0)/'4. Billing Determinants'!$G$41*$D32,IF($E32=\"Distribution Rev.\",VLOOKUP(G$4,'4. Billing Determinants'!$B$19:$Z$41,8,0)/'4. Billing Determinants'!$I$41*$D32, VLOOKUP(G$4,'4. Billing Determinants'!$B$19:$Z$41,3,0)/'4. Billing Determinants'!$D$41*$D32))))),0)","v":0},{"$f":"IFERROR(IF(H$4=\"\",0,IF($E32=\"kWh\",VLOOKUP(H$4,'4. Billing Determinants'!$B$19:$Z$41,4,0)/'4. Billing Determinants'!$E$41*$D32,IF($E32=\"kW\",VLOOKUP(H$4,'4. Billing Determinants'!$B$19:$Z$41,5,0)/'4. Billing Determinants'!$F$41*$D32,IF($E32=\"Non-RPP kWh\",VLOOKUP(H$4,'4. Billing Determinants'!$B$19:$Z$41,6,0)/'4. Billing Determinants'!$G$41*$D32,IF($E32=\"Distribution Rev.\",VLOOKUP(H$4,'4. Billing Determinants'!$B$19:$Z$41,8,0)/'4. Billing Determinants'!$I$41*$D32, VLOOKUP(H$4,'4. Billing Determinants'!$B$19:$Z$41,3,0)/'4. Billing Determinants'!$D$41*$D32))))),0)","v":0},{"$f":"IFERROR(IF(I$4=\"\",0,IF($E32=\"kWh\",VLOOKUP(I$4,'4. Billing Determinants'!$B$19:$Z$41,4,0)/'4. Billing Determinants'!$E$41*$D32,IF($E32=\"kW\",VLOOKUP(I$4,'4. Billing Determinants'!$B$19:$Z$41,5,0)/'4. Billing Determinants'!$F$41*$D32,IF($E32=\"Non-RPP kWh\",VLOOKUP(I$4,'4. Billing Determinants'!$B$19:$Z$41,6,0)/'4. Billing Determinants'!$G$41*$D32,IF($E32=\"Distribution Rev.\",VLOOKUP(I$4,'4. Billing Determinants'!$B$19:$Z$41,8,0)/'4. Billing Determinants'!$I$41*$D32, VLOOKUP(I$4,'4. Billing Determinants'!$B$19:$Z$41,3,0)/'4. Billing Determinants'!$D$41*$D32))))),0)","v":0},{"$f":"IFERROR(IF(J$4=\"\",0,IF($E32=\"kWh\",VLOOKUP(J$4,'4. Billing Determinants'!$B$19:$Z$41,4,0)/'4. Billing Determinants'!$E$41*$D32,IF($E32=\"kW\",VLOOKUP(J$4,'4. Billing Determinants'!$B$19:$Z$41,5,0)/'4. Billing Determinants'!$F$41*$D32,IF($E32=\"Non-RPP kWh\",VLOOKUP(J$4,'4. Billing Determinants'!$B$19:$Z$41,6,0)/'4. Billing Determinants'!$G$41*$D32,IF($E32=\"Distribution Rev.\",VLOOKUP(J$4,'4. Billing Determinants'!$B$19:$Z$41,8,0)/'4. Billing Determinants'!$I$41*$D32, VLOOKUP(J$4,'4. Billing Determinants'!$B$19:$Z$41,3,0)/'4. Billing Determinants'!$D$41*$D32))))),0)","v":0},{"$f":"IFERROR(IF(K$4=\"\",0,IF($E32=\"kWh\",VLOOKUP(K$4,'4. Billing Determinants'!$B$19:$Z$41,4,0)/'4. Billing Determinants'!$E$41*$D32,IF($E32=\"kW\",VLOOKUP(K$4,'4. Billing Determinants'!$B$19:$Z$41,5,0)/'4. Billing Determinants'!$F$41*$D32,IF($E32=\"Non-RPP kWh\",VLOOKUP(K$4,'4. Billing Determinants'!$B$19:$Z$41,6,0)/'4. Billing Determinants'!$G$41*$D32,IF($E32=\"Distribution Rev.\",VLOOKUP(K$4,'4. Billing Determinants'!$B$19:$Z$41,8,0)/'4. Billing Determinants'!$I$41*$D32, VLOOKUP(K$4,'4. Billing Determinants'!$B$19:$Z$41,3,0)/'4. Billing Determinants'!$D$41*$D32))))),0)","v":0},{"$f":"IFERROR(IF(L$4=\"\",0,IF($E32=\"kWh\",VLOOKUP(L$4,'4. Billing Determinants'!$B$19:$Z$41,4,0)/'4. Billing Determinants'!$E$41*$D32,IF($E32=\"kW\",VLOOKUP(L$4,'4. Billing Determinants'!$B$19:$Z$41,5,0)/'4. Billing Determinants'!$F$41*$D32,IF($E32=\"Non-RPP kWh\",VLOOKUP(L$4,'4. Billing Determinants'!$B$19:$Z$41,6,0)/'4. Billing Determinants'!$G$41*$D32,IF($E32=\"Distribution Rev.\",VLOOKUP(L$4,'4. Billing Determinants'!$B$19:$Z$41,8,0)/'4. Billing Determinants'!$I$41*$D32, VLOOKUP(L$4,'4. Billing Determinants'!$B$19:$Z$41,3,0)/'4. Billing Determinants'!$D$41*$D32))))),0)","v":0},{"$f":"IFERROR(IF(M$4=\"\",0,IF($E32=\"kWh\",VLOOKUP(M$4,'4. Billing Determinants'!$B$19:$Z$41,4,0)/'4. Billing Determinants'!$E$41*$D32,IF($E32=\"kW\",VLOOKUP(M$4,'4. Billing Determinants'!$B$19:$Z$41,5,0)/'4. Billing Determinants'!$F$41*$D32,IF($E32=\"Non-RPP kWh\",VLOOKUP(M$4,'4. Billing Determinants'!$B$19:$Z$41,6,0)/'4. Billing Determinants'!$G$41*$D32,IF($E32=\"Distribution Rev.\",VLOOKUP(M$4,'4. Billing Determinants'!$B$19:$Z$41,8,0)/'4. Billing Determinants'!$I$41*$D32, VLOOKUP(M$4,'4. Billing Determinants'!$B$19:$Z$41,3,0)/'4. Billing Determinants'!$D$41*$D32))))),0)","v":0},{"$f":"IFERROR(IF(N$4=\"\",0,IF($E32=\"kWh\",VLOOKUP(N$4,'4. Billing Determinants'!$B$19:$Z$41,4,0)/'4. Billing Determinants'!$E$41*$D32,IF($E32=\"kW\",VLOOKUP(N$4,'4. Billing Determinants'!$B$19:$Z$41,5,0)/'4. Billing Determinants'!$F$41*$D32,IF($E32=\"Non-RPP kWh\",VLOOKUP(N$4,'4. Billing Determinants'!$B$19:$Z$41,6,0)/'4. Billing Determinants'!$G$41*$D32,IF($E32=\"Distribution Rev.\",VLOOKUP(N$4,'4. Billing Determinants'!$B$19:$Z$41,8,0)/'4. Billing Determinants'!$I$41*$D32, VLOOKUP(N$4,'4. Billing Determinants'!$B$19:$Z$41,3,0)/'4. Billing Determinants'!$D$41*$D32))))),0)","v":0},{"$f":"IFERROR(IF(O$4=\"\",0,IF($E32=\"kWh\",VLOOKUP(O$4,'4. Billing Determinants'!$B$19:$Z$41,4,0)/'4. Billing Determinants'!$E$41*$D32,IF($E32=\"kW\",VLOOKUP(O$4,'4. Billing Determinants'!$B$19:$Z$41,5,0)/'4. Billing Determinants'!$F$41*$D32,IF($E32=\"Non-RPP kWh\",VLOOKUP(O$4,'4. Billing Determinants'!$B$19:$Z$41,6,0)/'4. Billing Determinants'!$G$41*$D32,IF($E32=\"Distribution Rev.\",VLOOKUP(O$4,'4. Billing Determinants'!$B$19:$Z$41,8,0)/'4. Billing Determinants'!$I$41*$D32, VLOOKUP(O$4,'4. Billing Determinants'!$B$19:$Z$41,3,0)/'4. Billing Determinants'!$D$41*$D32))))),0)","v":0},{"$f":"IFERROR(IF(P$4=\"\",0,IF($E32=\"kWh\",VLOOKUP(P$4,'4. Billing Determinants'!$B$19:$Z$41,4,0)/'4. Billing Determinants'!$E$41*$D32,IF($E32=\"kW\",VLOOKUP(P$4,'4. Billing Determinants'!$B$19:$Z$41,5,0)/'4. Billing Determinants'!$F$41*$D32,IF($E32=\"Non-RPP kWh\",VLOOKUP(P$4,'4. Billing Determinants'!$B$19:$Z$41,6,0)/'4. Billing Determinants'!$G$41*$D32,IF($E32=\"Distribution Rev.\",VLOOKUP(P$4,'4. Billing Determinants'!$B$19:$Z$41,8,0)/'4. Billing Determinants'!$I$41*$D32, VLOOKUP(P$4,'4. Billing Determinants'!$B$19:$Z$41,3,0)/'4. Billing Determinants'!$D$41*$D32))))),0)","v":0},{"$f":"IFERROR(IF(Q$4=\"\",0,IF($E32=\"kWh\",VLOOKUP(Q$4,'4. Billing Determinants'!$B$19:$Z$41,4,0)/'4. Billing Determinants'!$E$41*$D32,IF($E32=\"kW\",VLOOKUP(Q$4,'4. Billing Determinants'!$B$19:$Z$41,5,0)/'4. Billing Determinants'!$F$41*$D32,IF($E32=\"Non-RPP kWh\",VLOOKUP(Q$4,'4. Billing Determinants'!$B$19:$Z$41,6,0)/'4. Billing Determinants'!$G$41*$D32,IF($E32=\"Distribution Rev.\",VLOOKUP(Q$4,'4. Billing Determinants'!$B$19:$Z$41,8,0)/'4. Billing Determinants'!$I$41*$D32, VLOOKUP(Q$4,'4. Billing Determinants'!$B$19:$Z$41,3,0)/'4. Billing Determinants'!$D$41*$D32))))),0)","v":0},{"$f":"IFERROR(IF(R$4=\"\",0,IF($E32=\"kWh\",VLOOKUP(R$4,'4. Billing Determinants'!$B$19:$Z$41,4,0)/'4. Billing Determinants'!$E$41*$D32,IF($E32=\"kW\",VLOOKUP(R$4,'4. Billing Determinants'!$B$19:$Z$41,5,0)/'4. Billing Determinants'!$F$41*$D32,IF($E32=\"Non-RPP kWh\",VLOOKUP(R$4,'4. Billing Determinants'!$B$19:$Z$41,6,0)/'4. Billing Determinants'!$G$41*$D32,IF($E32=\"Distribution Rev.\",VLOOKUP(R$4,'4. Billing Determinants'!$B$19:$Z$41,8,0)/'4. Billing Determinants'!$I$41*$D32, VLOOKUP(R$4,'4. Billing Determinants'!$B$19:$Z$41,3,0)/'4. Billing Determinants'!$D$41*$D32))))),0)","v":0},{"$f":"IFERROR(IF(S$4=\"\",0,IF($E32=\"kWh\",VLOOKUP(S$4,'4. Billing Determinants'!$B$19:$Z$41,4,0)/'4. Billing Determinants'!$E$41*$D32,IF($E32=\"kW\",VLOOKUP(S$4,'4. Billing Determinants'!$B$19:$Z$41,5,0)/'4. Billing Determinants'!$F$41*$D32,IF($E32=\"Non-RPP kWh\",VLOOKUP(S$4,'4. Billing Determinants'!$B$19:$Z$41,6,0)/'4. Billing Determinants'!$G$41*$D32,IF($E32=\"Distribution Rev.\",VLOOKUP(S$4,'4. Billing Determinants'!$B$19:$Z$41,8,0)/'4. Billing Determinants'!$I$41*$D32, VLOOKUP(S$4,'4. Billing Determinants'!$B$19:$Z$41,3,0)/'4. Billing Determinants'!$D$41*$D32))))),0)","v":0},{"$f":"IFERROR(IF(T$4=\"\",0,IF($E32=\"kWh\",VLOOKUP(T$4,'4. Billing Determinants'!$B$19:$Z$41,4,0)/'4. Billing Determinants'!$E$41*$D32,IF($E32=\"kW\",VLOOKUP(T$4,'4. Billing Determinants'!$B$19:$Z$41,5,0)/'4. Billing Determinants'!$F$41*$D32,IF($E32=\"Non-RPP kWh\",VLOOKUP(T$4,'4. Billing Determinants'!$B$19:$Z$41,6,0)/'4. Billing Determinants'!$G$41*$D32,IF($E32=\"Distribution Rev.\",VLOOKUP(T$4,'4. Billing Determinants'!$B$19:$Z$41,8,0)/'4. Billing Determinants'!$I$41*$D32, VLOOKUP(T$4,'4. Billing Determinants'!$B$19:$Z$41,3,0)/'4. Billing Determinants'!$D$41*$D32))))),0)","v":0},{"$f":"IFERROR(IF(U$4=\"\",0,IF($E32=\"kWh\",VLOOKUP(U$4,'4. Billing Determinants'!$B$19:$Z$41,4,0)/'4. Billing Determinants'!$E$41*$D32,IF($E32=\"kW\",VLOOKUP(U$4,'4. Billing Determinants'!$B$19:$Z$41,5,0)/'4. Billing Determinants'!$F$41*$D32,IF($E32=\"Non-RPP kWh\",VLOOKUP(U$4,'4. Billing Determinants'!$B$19:$Z$41,6,0)/'4. Billing Determinants'!$G$41*$D32,IF($E32=\"Distribution Rev.\",VLOOKUP(U$4,'4. Billing Determinants'!$B$19:$Z$41,8,0)/'4. Billing Determinants'!$I$41*$D32, VLOOKUP(U$4,'4. Billing Determinants'!$B$19:$Z$41,3,0)/'4. Billing Determinants'!$D$41*$D32))))),0)","v":0},{"$f":"IFERROR(IF(V$4=\"\",0,IF($E32=\"kWh\",VLOOKUP(V$4,'4. Billing Determinants'!$B$19:$Z$41,4,0)/'4. Billing Determinants'!$E$41*$D32,IF($E32=\"kW\",VLOOKUP(V$4,'4. Billing Determinants'!$B$19:$Z$41,5,0)/'4. Billing Determinants'!$F$41*$D32,IF($E32=\"Non-RPP kWh\",VLOOKUP(V$4,'4. Billing Determinants'!$B$19:$Z$41,6,0)/'4. Billing Determinants'!$G$41*$D32,IF($E32=\"Distribution Rev.\",VLOOKUP(V$4,'4. Billing Determinants'!$B$19:$Z$41,8,0)/'4. Billing Determinants'!$I$41*$D32, VLOOKUP(V$4,'4. Billing Determinants'!$B$19:$Z$41,3,0)/'4. Billing Determinants'!$D$41*$D32))))),0)","v":0},{"$f":"IFERROR(IF(W$4=\"\",0,IF($E32=\"kWh\",VLOOKUP(W$4,'4. Billing Determinants'!$B$19:$Z$41,4,0)/'4. Billing Determinants'!$E$41*$D32,IF($E32=\"kW\",VLOOKUP(W$4,'4. Billing Determinants'!$B$19:$Z$41,5,0)/'4. Billing Determinants'!$F$41*$D32,IF($E32=\"Non-RPP kWh\",VLOOKUP(W$4,'4. Billing Determinants'!$B$19:$Z$41,6,0)/'4. Billing Determinants'!$G$41*$D32,IF($E32=\"Distribution Rev.\",VLOOKUP(W$4,'4. Billing Determinants'!$B$19:$Z$41,8,0)/'4. Billing Determinants'!$I$41*$D32, VLOOKUP(W$4,'4. Billing Determinants'!$B$19:$Z$41,3,0)/'4. Billing Determinants'!$D$41*$D32))))),0)","v":0},{"$f":"IFERROR(IF(X$4=\"\",0,IF($E32=\"kWh\",VLOOKUP(X$4,'4. Billing Determinants'!$B$19:$Z$41,4,0)/'4. Billing Determinants'!$E$41*$D32,IF($E32=\"kW\",VLOOKUP(X$4,'4. Billing Determinants'!$B$19:$Z$41,5,0)/'4. Billing Determinants'!$F$41*$D32,IF($E32=\"Non-RPP kWh\",VLOOKUP(X$4,'4. Billing Determinants'!$B$19:$Z$41,6,0)/'4. Billing Determinants'!$G$41*$D32,IF($E32=\"Distribution Rev.\",VLOOKUP(X$4,'4. Billing Determinants'!$B$19:$Z$41,8,0)/'4. Billing Determinants'!$I$41*$D32, VLOOKUP(X$4,'4. Billing Determinants'!$B$19:$Z$41,3,0)/'4. Billing Determinants'!$D$41*$D32))))),0)","v":0},{"$f":"IFERROR(IF(Y$4=\"\",0,IF($E32=\"kWh\",VLOOKUP(Y$4,'4. Billing Determinants'!$B$19:$Z$41,4,0)/'4. Billing Determinants'!$E$41*$D32,IF($E32=\"kW\",VLOOKUP(Y$4,'4. Billing Determinants'!$B$19:$Z$41,5,0)/'4. Billing Determinants'!$F$41*$D32,IF($E32=\"Non-RPP kWh\",VLOOKUP(Y$4,'4. Billing Determinants'!$B$19:$Z$41,6,0)/'4. Billing Determinants'!$G$41*$D32,IF($E32=\"Distribution Rev.\",VLOOKUP(Y$4,'4. Billing Determinants'!$B$19:$Z$41,8,0)/'4. Billing Determinants'!$I$41*$D32, VLOOKUP(Y$4,'4. Billing Determinants'!$B$19:$Z$41,3,0)/'4. Billing Determinants'!$D$41*$D32))))),0)","v":0}]
[null,"Total of Group 2 Accounts",null,{"$f":"SUM(D21:D32)","v":0},null,{"$f":"SUM(F21:F32)","v":0},0,0,0,0,0,0,0,0,0,0,0,0,0,0,0,0,0,0,0]
[]
[null,"PILs and Tax Variance for 2006 and Subsequent Years \n      (excludes sub-account and contra account)",1592,{"$f":"'2. 2015 Continuity Schedule'!BS59","v":0},null,{"$f":"IFERROR(IF(F$4=\"\",0,IF($E35=\"kWh\",VLOOKUP(F$4,'4. Billing Determinants'!$B$19:$Z$41,4,0)/'4. Billing Determinants'!$E$41*$D35,IF($E35=\"kW\",VLOOKUP(F$4,'4. Billing Determinants'!$B$19:$Z$41,5,0)/'4. Billing Determinants'!$F$41*$D35,IF($E35=\"Non-RPP kWh\",VLOOKUP(F$4,'4. Billing Determinants'!$B$19:$Z$41,6,0)/'4. Billing Determinants'!$G$41*$D35,IF($E35=\"Distribution Rev.\",VLOOKUP(F$4,'4. Billing Determinants'!$B$19:$Z$41,8,0)/'4. Billing Determinants'!$I$41*$D35, VLOOKUP(F$4,'4. Billing Determinants'!$B$19:$Z$41,3,0)/'4. Billing Determinants'!$D$41*$D35))))),0)","v":0},{"$f":"IFERROR(IF(G$4=\"\",0,IF($E35=\"kWh\",VLOOKUP(G$4,'4. Billing Determinants'!$B$19:$Z$41,4,0)/'4. Billing Determinants'!$E$41*$D35,IF($E35=\"kW\",VLOOKUP(G$4,'4. Billing Determinants'!$B$19:$Z$41,5,0)/'4. Billing Determinants'!$F$41*$D35,IF($E35=\"Non-RPP kWh\",VLOOKUP(G$4,'4. Billing Determinants'!$B$19:$Z$41,6,0)/'4. Billing Determinants'!$G$41*$D35,IF($E35=\"Distribution Rev.\",VLOOKUP(G$4,'4. Billing Determinants'!$B$19:$Z$41,8,0)/'4. Billing Determinants'!$I$41*$D35, VLOOKUP(G$4,'4. Billing Determinants'!$B$19:$Z$41,3,0)/'4. Billing Determinants'!$D$41*$D35))))),0)","v":0},{"$f":"IFERROR(IF(H$4=\"\",0,IF($E35=\"kWh\",VLOOKUP(H$4,'4. Billing Determinants'!$B$19:$Z$41,4,0)/'4. Billing Determinants'!$E$41*$D35,IF($E35=\"kW\",VLOOKUP(H$4,'4. Billing Determinants'!$B$19:$Z$41,5,0)/'4. Billing Determinants'!$F$41*$D35,IF($E35=\"Non-RPP kWh\",VLOOKUP(H$4,'4. Billing Determinants'!$B$19:$Z$41,6,0)/'4. Billing Determinants'!$G$41*$D35,IF($E35=\"Distribution Rev.\",VLOOKUP(H$4,'4. Billing Determinants'!$B$19:$Z$41,8,0)/'4. Billing Determinants'!$I$41*$D35, VLOOKUP(H$4,'4. Billing Determinants'!$B$19:$Z$41,3,0)/'4. Billing Determinants'!$D$41*$D35))))),0)","v":0},{"$f":"IFERROR(IF(I$4=\"\",0,IF($E35=\"kWh\",VLOOKUP(I$4,'4. Billing Determinants'!$B$19:$Z$41,4,0)/'4. Billing Determinants'!$E$41*$D35,IF($E35=\"kW\",VLOOKUP(I$4,'4. Billing Determinants'!$B$19:$Z$41,5,0)/'4. Billing Determinants'!$F$41*$D35,IF($E35=\"Non-RPP kWh\",VLOOKUP(I$4,'4. Billing Determinants'!$B$19:$Z$41,6,0)/'4. Billing Determinants'!$G$41*$D35,IF($E35=\"Distribution Rev.\",VLOOKUP(I$4,'4. Billing Determinants'!$B$19:$Z$41,8,0)/'4. Billing Determinants'!$I$41*$D35, VLOOKUP(I$4,'4. Billing Determinants'!$B$19:$Z$41,3,0)/'4. Billing Determinants'!$D$41*$D35))))),0)","v":0},{"$f":"IFERROR(IF(J$4=\"\",0,IF($E35=\"kWh\",VLOOKUP(J$4,'4. Billing Determinants'!$B$19:$Z$41,4,0)/'4. Billing Determinants'!$E$41*$D35,IF($E35=\"kW\",VLOOKUP(J$4,'4. Billing Determinants'!$B$19:$Z$41,5,0)/'4. Billing Determinants'!$F$41*$D35,IF($E35=\"Non-RPP kWh\",VLOOKUP(J$4,'4. Billing Determinants'!$B$19:$Z$41,6,0)/'4. Billing Determinants'!$G$41*$D35,IF($E35=\"Distribution Rev.\",VLOOKUP(J$4,'4. Billing Determinants'!$B$19:$Z$41,8,0)/'4. Billing Determinants'!$I$41*$D35, VLOOKUP(J$4,'4. Billing Determinants'!$B$19:$Z$41,3,0)/'4. Billing Determinants'!$D$41*$D35))))),0)","v":0},{"$f":"IFERROR(IF(K$4=\"\",0,IF($E35=\"kWh\",VLOOKUP(K$4,'4. Billing Determinants'!$B$19:$Z$41,4,0)/'4. Billing Determinants'!$E$41*$D35,IF($E35=\"kW\",VLOOKUP(K$4,'4. Billing Determinants'!$B$19:$Z$41,5,0)/'4. Billing Determinants'!$F$41*$D35,IF($E35=\"Non-RPP kWh\",VLOOKUP(K$4,'4. Billing Determinants'!$B$19:$Z$41,6,0)/'4. Billing Determinants'!$G$41*$D35,IF($E35=\"Distribution Rev.\",VLOOKUP(K$4,'4. Billing Determinants'!$B$19:$Z$41,8,0)/'4. Billing Determinants'!$I$41*$D35, VLOOKUP(K$4,'4. Billing Determinants'!$B$19:$Z$41,3,0)/'4. Billing Determinants'!$D$41*$D35))))),0)","v":0},{"$f":"IFERROR(IF(L$4=\"\",0,IF($E35=\"kWh\",VLOOKUP(L$4,'4. Billing Determinants'!$B$19:$Z$41,4,0)/'4. Billing Determinants'!$E$41*$D35,IF($E35=\"kW\",VLOOKUP(L$4,'4. Billing Determinants'!$B$19:$Z$41,5,0)/'4. Billing Determinants'!$F$41*$D35,IF($E35=\"Non-RPP kWh\",VLOOKUP(L$4,'4. Billing Determinants'!$B$19:$Z$41,6,0)/'4. Billing Determinants'!$G$41*$D35,IF($E35=\"Distribution Rev.\",VLOOKUP(L$4,'4. Billing Determinants'!$B$19:$Z$41,8,0)/'4. Billing Determinants'!$I$41*$D35, VLOOKUP(L$4,'4. Billing Determinants'!$B$19:$Z$41,3,0)/'4. Billing Determinants'!$D$41*$D35))))),0)","v":0},{"$f":"IFERROR(IF(M$4=\"\",0,IF($E35=\"kWh\",VLOOKUP(M$4,'4. Billing Determinants'!$B$19:$Z$41,4,0)/'4. Billing Determinants'!$E$41*$D35,IF($E35=\"kW\",VLOOKUP(M$4,'4. Billing Determinants'!$B$19:$Z$41,5,0)/'4. Billing Determinants'!$F$41*$D35,IF($E35=\"Non-RPP kWh\",VLOOKUP(M$4,'4. Billing Determinants'!$B$19:$Z$41,6,0)/'4. Billing Determinants'!$G$41*$D35,IF($E35=\"Distribution Rev.\",VLOOKUP(M$4,'4. Billing Determinants'!$B$19:$Z$41,8,0)/'4. Billing Determinants'!$I$41*$D35, VLOOKUP(M$4,'4. Billing Determinants'!$B$19:$Z$41,3,0)/'4. Billing Determinants'!$D$41*$D35))))),0)","v":0},{"$f":"IFERROR(IF(N$4=\"\",0,IF($E35=\"kWh\",VLOOKUP(N$4,'4. Billing Determinants'!$B$19:$Z$41,4,0)/'4. Billing Determinants'!$E$41*$D35,IF($E35=\"kW\",VLOOKUP(N$4,'4. Billing Determinants'!$B$19:$Z$41,5,0)/'4. Billing Determinants'!$F$41*$D35,IF($E35=\"Non-RPP kWh\",VLOOKUP(N$4,'4. Billing Determinants'!$B$19:$Z$41,6,0)/'4. Billing Determinants'!$G$41*$D35,IF($E35=\"Distribution Rev.\",VLOOKUP(N$4,'4. Billing Determinants'!$B$19:$Z$41,8,0)/'4. Billing Determinants'!$I$41*$D35, VLOOKUP(N$4,'4. Billing Determinants'!$B$19:$Z$41,3,0)/'4. Billing Determinants'!$D$41*$D35))))),0)","v":0},{"$f":"IFERROR(IF(O$4=\"\",0,IF($E35=\"kWh\",VLOOKUP(O$4,'4. Billing Determinants'!$B$19:$Z$41,4,0)/'4. Billing Determinants'!$E$41*$D35,IF($E35=\"kW\",VLOOKUP(O$4,'4. Billing Determinants'!$B$19:$Z$41,5,0)/'4. Billing Determinants'!$F$41*$D35,IF($E35=\"Non-RPP kWh\",VLOOKUP(O$4,'4. Billing Determinants'!$B$19:$Z$41,6,0)/'4. Billing Determinants'!$G$41*$D35,IF($E35=\"Distribution Rev.\",VLOOKUP(O$4,'4. Billing Determinants'!$B$19:$Z$41,8,0)/'4. Billing Determinants'!$I$41*$D35, VLOOKUP(O$4,'4. Billing Determinants'!$B$19:$Z$41,3,0)/'4. Billing Determinants'!$D$41*$D35))))),0)","v":0},{"$f":"IFERROR(IF(P$4=\"\",0,IF($E35=\"kWh\",VLOOKUP(P$4,'4. Billing Determinants'!$B$19:$Z$41,4,0)/'4. Billing Determinants'!$E$41*$D35,IF($E35=\"kW\",VLOOKUP(P$4,'4. Billing Determinants'!$B$19:$Z$41,5,0)/'4. Billing Determinants'!$F$41*$D35,IF($E35=\"Non-RPP kWh\",VLOOKUP(P$4,'4. Billing Determinants'!$B$19:$Z$41,6,0)/'4. Billing Determinants'!$G$41*$D35,IF($E35=\"Distribution Rev.\",VLOOKUP(P$4,'4. Billing Determinants'!$B$19:$Z$41,8,0)/'4. Billing Determinants'!$I$41*$D35, VLOOKUP(P$4,'4. Billing Determinants'!$B$19:$Z$41,3,0)/'4. Billing Determinants'!$D$41*$D35))))),0)","v":0},{"$f":"IFERROR(IF(Q$4=\"\",0,IF($E35=\"kWh\",VLOOKUP(Q$4,'4. Billing Determinants'!$B$19:$Z$41,4,0)/'4. Billing Determinants'!$E$41*$D35,IF($E35=\"kW\",VLOOKUP(Q$4,'4. Billing Determinants'!$B$19:$Z$41,5,0)/'4. Billing Determinants'!$F$41*$D35,IF($E35=\"Non-RPP kWh\",VLOOKUP(Q$4,'4. Billing Determinants'!$B$19:$Z$41,6,0)/'4. Billing Determinants'!$G$41*$D35,IF($E35=\"Distribution Rev.\",VLOOKUP(Q$4,'4. Billing Determinants'!$B$19:$Z$41,8,0)/'4. Billing Determinants'!$I$41*$D35, VLOOKUP(Q$4,'4. Billing Determinants'!$B$19:$Z$41,3,0)/'4. Billing Determinants'!$D$41*$D35))))),0)","v":0},{"$f":"IFERROR(IF(R$4=\"\",0,IF($E35=\"kWh\",VLOOKUP(R$4,'4. Billing Determinants'!$B$19:$Z$41,4,0)/'4. Billing Determinants'!$E$41*$D35,IF($E35=\"kW\",VLOOKUP(R$4,'4. Billing Determinants'!$B$19:$Z$41,5,0)/'4. Billing Determinants'!$F$41*$D35,IF($E35=\"Non-RPP kWh\",VLOOKUP(R$4,'4. Billing Determinants'!$B$19:$Z$41,6,0)/'4. Billing Determinants'!$G$41*$D35,IF($E35=\"Distribution Rev.\",VLOOKUP(R$4,'4. Billing Determinants'!$B$19:$Z$41,8,0)/'4. Billing Determinants'!$I$41*$D35, VLOOKUP(R$4,'4. Billing Determinants'!$B$19:$Z$41,3,0)/'4. Billing Determinants'!$D$41*$D35))))),0)","v":0},{"$f":"IFERROR(IF(S$4=\"\",0,IF($E35=\"kWh\",VLOOKUP(S$4,'4. Billing Determinants'!$B$19:$Z$41,4,0)/'4. Billing Determinants'!$E$41*$D35,IF($E35=\"kW\",VLOOKUP(S$4,'4. Billing Determinants'!$B$19:$Z$41,5,0)/'4. Billing Determinants'!$F$41*$D35,IF($E35=\"Non-RPP kWh\",VLOOKUP(S$4,'4. Billing Determinants'!$B$19:$Z$41,6,0)/'4. Billing Determinants'!$G$41*$D35,IF($E35=\"Distribution Rev.\",VLOOKUP(S$4,'4. Billing Determinants'!$B$19:$Z$41,8,0)/'4. Billing Determinants'!$I$41*$D35, VLOOKUP(S$4,'4. Billing Determinants'!$B$19:$Z$41,3,0)/'4. Billing Determinants'!$D$41*$D35))))),0)","v":0},{"$f":"IFERROR(IF(T$4=\"\",0,IF($E35=\"kWh\",VLOOKUP(T$4,'4. Billing Determinants'!$B$19:$Z$41,4,0)/'4. Billing Determinants'!$E$41*$D35,IF($E35=\"kW\",VLOOKUP(T$4,'4. Billing Determinants'!$B$19:$Z$41,5,0)/'4. Billing Determinants'!$F$41*$D35,IF($E35=\"Non-RPP kWh\",VLOOKUP(T$4,'4. Billing Determinants'!$B$19:$Z$41,6,0)/'4. Billing Determinants'!$G$41*$D35,IF($E35=\"Distribution Rev.\",VLOOKUP(T$4,'4. Billing Determinants'!$B$19:$Z$41,8,0)/'4. Billing Determinants'!$I$41*$D35, VLOOKUP(T$4,'4. Billing Determinants'!$B$19:$Z$41,3,0)/'4. Billing Determinants'!$D$41*$D35))))),0)","v":0},{"$f":"IFERROR(IF(U$4=\"\",0,IF($E35=\"kWh\",VLOOKUP(U$4,'4. Billing Determinants'!$B$19:$Z$41,4,0)/'4. Billing Determinants'!$E$41*$D35,IF($E35=\"kW\",VLOOKUP(U$4,'4. Billing Determinants'!$B$19:$Z$41,5,0)/'4. Billing Determinants'!$F$41*$D35,IF($E35=\"Non-RPP kWh\",VLOOKUP(U$4,'4. Billing Determinants'!$B$19:$Z$41,6,0)/'4. Billing Determinants'!$G$41*$D35,IF($E35=\"Distribution Rev.\",VLOOKUP(U$4,'4. Billing Determinants'!$B$19:$Z$41,8,0)/'4. Billing Determinants'!$I$41*$D35, VLOOKUP(U$4,'4. Billing Determinants'!$B$19:$Z$41,3,0)/'4. Billing Determinants'!$D$41*$D35))))),0)","v":0},{"$f":"IFERROR(IF(V$4=\"\",0,IF($E35=\"kWh\",VLOOKUP(V$4,'4. Billing Determinants'!$B$19:$Z$41,4,0)/'4. Billing Determinants'!$E$41*$D35,IF($E35=\"kW\",VLOOKUP(V$4,'4. Billing Determinants'!$B$19:$Z$41,5,0)/'4. Billing Determinants'!$F$41*$D35,IF($E35=\"Non-RPP kWh\",VLOOKUP(V$4,'4. Billing Determinants'!$B$19:$Z$41,6,0)/'4. Billing Determinants'!$G$41*$D35,IF($E35=\"Distribution Rev.\",VLOOKUP(V$4,'4. Billing Determinants'!$B$19:$Z$41,8,0)/'4. Billing Determinants'!$I$41*$D35, VLOOKUP(V$4,'4. Billing Determinants'!$B$19:$Z$41,3,0)/'4. Billing Determinants'!$D$41*$D35))))),0)","v":0},{"$f":"IFERROR(IF(W$4=\"\",0,IF($E35=\"kWh\",VLOOKUP(W$4,'4. Billing Determinants'!$B$19:$Z$41,4,0)/'4. Billing Determinants'!$E$41*$D35,IF($E35=\"kW\",VLOOKUP(W$4,'4. Billing Determinants'!$B$19:$Z$41,5,0)/'4. Billing Determinants'!$F$41*$D35,IF($E35=\"Non-RPP kWh\",VLOOKUP(W$4,'4. Billing Determinants'!$B$19:$Z$41,6,0)/'4. Billing Determinants'!$G$41*$D35,IF($E35=\"Distribution Rev.\",VLOOKUP(W$4,'4. Billing Determinants'!$B$19:$Z$41,8,0)/'4. Billing Determinants'!$I$41*$D35, VLOOKUP(W$4,'4. Billing Determinants'!$B$19:$Z$41,3,0)/'4. Billing Determinants'!$D$41*$D35))))),0)","v":0},{"$f":"IFERROR(IF(X$4=\"\",0,IF($E35=\"kWh\",VLOOKUP(X$4,'4. Billing Determinants'!$B$19:$Z$41,4,0)/'4. Billing Determinants'!$E$41*$D35,IF($E35=\"kW\",VLOOKUP(X$4,'4. Billing Determinants'!$B$19:$Z$41,5,0)/'4. Billing Determinants'!$F$41*$D35,IF($E35=\"Non-RPP kWh\",VLOOKUP(X$4,'4. Billing Determinants'!$B$19:$Z$41,6,0)/'4. Billing Determinants'!$G$41*$D35,IF($E35=\"Distribution Rev.\",VLOOKUP(X$4,'4. Billing Determinants'!$B$19:$Z$41,8,0)/'4. Billing Determinants'!$I$41*$D35, VLOOKUP(X$4,'4. Billing Determinants'!$B$19:$Z$41,3,0)/'4. Billing Determinants'!$D$41*$D35))))),0)","v":0},{"$f":"IFERROR(IF(Y$4=\"\",0,IF($E35=\"kWh\",VLOOKUP(Y$4,'4. Billing Determinants'!$B$19:$Z$41,4,0)/'4. Billing Determinants'!$E$41*$D35,IF($E35=\"kW\",VLOOKUP(Y$4,'4. Billing Determinants'!$B$19:$Z$41,5,0)/'4. Billing Determinants'!$F$41*$D35,IF($E35=\"Non-RPP kWh\",VLOOKUP(Y$4,'4. Billing Determinants'!$B$19:$Z$41,6,0)/'4. Billing Determinants'!$G$41*$D35,IF($E35=\"Distribution Rev.\",VLOOKUP(Y$4,'4. Billing Determinants'!$B$19:$Z$41,8,0)/'4. Billing Determinants'!$I$41*$D35, VLOOKUP(Y$4,'4. Billing Determinants'!$B$19:$Z$41,3,0)/'4. Billing Determinants'!$D$41*$D35))))),0)","v":0}]
[null,"PILs and Tax Variance for 2006 and Subsequent Years -\n      Sub-Account HST/OVAT Input Tax Credits (ITCs)",1592,{"$f":"'2. 2015 Continuity Schedule'!BS60","v":0},null,{"$f":"IFERROR(IF(F$4=\"\",0,IF($E36=\"kWh\",VLOOKUP(F$4,'4. Billing Determinants'!$B$19:$Z$41,4,0)/'4. Billing Determinants'!$E$41*$D36,IF($E36=\"kW\",VLOOKUP(F$4,'4. Billing Determinants'!$B$19:$Z$41,5,0)/'4. Billing Determinants'!$F$41*$D36,IF($E36=\"Non-RPP kWh\",VLOOKUP(F$4,'4. Billing Determinants'!$B$19:$Z$41,6,0)/'4. Billing Determinants'!$G$41*$D36,IF($E36=\"Distribution Rev.\",VLOOKUP(F$4,'4. Billing Determinants'!$B$19:$Z$41,8,0)/'4. Billing Determinants'!$I$41*$D36, VLOOKUP(F$4,'4. Billing Determinants'!$B$19:$Z$41,3,0)/'4. Billing Determinants'!$D$41*$D36))))),0)","v":0},{"$f":"IFERROR(IF(G$4=\"\",0,IF($E36=\"kWh\",VLOOKUP(G$4,'4. Billing Determinants'!$B$19:$Z$41,4,0)/'4. Billing Determinants'!$E$41*$D36,IF($E36=\"kW\",VLOOKUP(G$4,'4. Billing Determinants'!$B$19:$Z$41,5,0)/'4. Billing Determinants'!$F$41*$D36,IF($E36=\"Non-RPP kWh\",VLOOKUP(G$4,'4. Billing Determinants'!$B$19:$Z$41,6,0)/'4. Billing Determinants'!$G$41*$D36,IF($E36=\"Distribution Rev.\",VLOOKUP(G$4,'4. Billing Determinants'!$B$19:$Z$41,8,0)/'4. Billing Determinants'!$I$41*$D36, VLOOKUP(G$4,'4. Billing Determinants'!$B$19:$Z$41,3,0)/'4. Billing Determinants'!$D$41*$D36))))),0)","v":0},{"$f":"IFERROR(IF(H$4=\"\",0,IF($E36=\"kWh\",VLOOKUP(H$4,'4. Billing Determinants'!$B$19:$Z$41,4,0)/'4. Billing Determinants'!$E$41*$D36,IF($E36=\"kW\",VLOOKUP(H$4,'4. Billing Determinants'!$B$19:$Z$41,5,0)/'4. Billing Determinants'!$F$41*$D36,IF($E36=\"Non-RPP kWh\",VLOOKUP(H$4,'4. Billing Determinants'!$B$19:$Z$41,6,0)/'4. Billing Determinants'!$G$41*$D36,IF($E36=\"Distribution Rev.\",VLOOKUP(H$4,'4. Billing Determinants'!$B$19:$Z$41,8,0)/'4. Billing Determinants'!$I$41*$D36, VLOOKUP(H$4,'4. Billing Determinants'!$B$19:$Z$41,3,0)/'4. Billing Determinants'!$D$41*$D36))))),0)","v":0},{"$f":"IFERROR(IF(I$4=\"\",0,IF($E36=\"kWh\",VLOOKUP(I$4,'4. Billing Determinants'!$B$19:$Z$41,4,0)/'4. Billing Determinants'!$E$41*$D36,IF($E36=\"kW\",VLOOKUP(I$4,'4. Billing Determinants'!$B$19:$Z$41,5,0)/'4. Billing Determinants'!$F$41*$D36,IF($E36=\"Non-RPP kWh\",VLOOKUP(I$4,'4. Billing Determinants'!$B$19:$Z$41,6,0)/'4. Billing Determinants'!$G$41*$D36,IF($E36=\"Distribution Rev.\",VLOOKUP(I$4,'4. Billing Determinants'!$B$19:$Z$41,8,0)/'4. Billing Determinants'!$I$41*$D36, VLOOKUP(I$4,'4. Billing Determinants'!$B$19:$Z$41,3,0)/'4. Billing Determinants'!$D$41*$D36))))),0)","v":0},{"$f":"IFERROR(IF(J$4=\"\",0,IF($E36=\"kWh\",VLOOKUP(J$4,'4. Billing Determinants'!$B$19:$Z$41,4,0)/'4. Billing Determinants'!$E$41*$D36,IF($E36=\"kW\",VLOOKUP(J$4,'4. Billing Determinants'!$B$19:$Z$41,5,0)/'4. Billing Determinants'!$F$41*$D36,IF($E36=\"Non-RPP kWh\",VLOOKUP(J$4,'4. Billing Determinants'!$B$19:$Z$41,6,0)/'4. Billing Determinants'!$G$41*$D36,IF($E36=\"Distribution Rev.\",VLOOKUP(J$4,'4. Billing Determinants'!$B$19:$Z$41,8,0)/'4. Billing Determinants'!$I$41*$D36, VLOOKUP(J$4,'4. Billing Determinants'!$B$19:$Z$41,3,0)/'4. Billing Determinants'!$D$41*$D36))))),0)","v":0},{"$f":"IFERROR(IF(K$4=\"\",0,IF($E36=\"kWh\",VLOOKUP(K$4,'4. Billing Determinants'!$B$19:$Z$41,4,0)/'4. Billing Determinants'!$E$41*$D36,IF($E36=\"kW\",VLOOKUP(K$4,'4. Billing Determinants'!$B$19:$Z$41,5,0)/'4. Billing Determinants'!$F$41*$D36,IF($E36=\"Non-RPP kWh\",VLOOKUP(K$4,'4. Billing Determinants'!$B$19:$Z$41,6,0)/'4. Billing Determinants'!$G$41*$D36,IF($E36=\"Distribution Rev.\",VLOOKUP(K$4,'4. Billing Determinants'!$B$19:$Z$41,8,0)/'4. Billing Determinants'!$I$41*$D36, VLOOKUP(K$4,'4. Billing Determinants'!$B$19:$Z$41,3,0)/'4. Billing Determinants'!$D$41*$D36))))),0)","v":0},{"$f":"IFERROR(IF(L$4=\"\",0,IF($E36=\"kWh\",VLOOKUP(L$4,'4. Billing Determinants'!$B$19:$Z$41,4,0)/'4. Billing Determinants'!$E$41*$D36,IF($E36=\"kW\",VLOOKUP(L$4,'4. Billing Determinants'!$B$19:$Z$41,5,0)/'4. Billing Determinants'!$F$41*$D36,IF($E36=\"Non-RPP kWh\",VLOOKUP(L$4,'4. Billing Determinants'!$B$19:$Z$41,6,0)/'4. Billing Determinants'!$G$41*$D36,IF($E36=\"Distribution Rev.\",VLOOKUP(L$4,'4. Billing Determinants'!$B$19:$Z$41,8,0)/'4. Billing Determinants'!$I$41*$D36, VLOOKUP(L$4,'4. Billing Determinants'!$B$19:$Z$41,3,0)/'4. Billing Determinants'!$D$41*$D36))))),0)","v":0},{"$f":"IFERROR(IF(M$4=\"\",0,IF($E36=\"kWh\",VLOOKUP(M$4,'4. Billing Determinants'!$B$19:$Z$41,4,0)/'4. Billing Determinants'!$E$41*$D36,IF($E36=\"kW\",VLOOKUP(M$4,'4. Billing Determinants'!$B$19:$Z$41,5,0)/'4. Billing Determinants'!$F$41*$D36,IF($E36=\"Non-RPP kWh\",VLOOKUP(M$4,'4. Billing Determinants'!$B$19:$Z$41,6,0)/'4. Billing Determinants'!$G$41*$D36,IF($E36=\"Distribution Rev.\",VLOOKUP(M$4,'4. Billing Determinants'!$B$19:$Z$41,8,0)/'4. Billing Determinants'!$I$41*$D36, VLOOKUP(M$4,'4. Billing Determinants'!$B$19:$Z$41,3,0)/'4. Billing Determinants'!$D$41*$D36))))),0)","v":0},{"$f":"IFERROR(IF(N$4=\"\",0,IF($E36=\"kWh\",VLOOKUP(N$4,'4. Billing Determinants'!$B$19:$Z$41,4,0)/'4. Billing Determinants'!$E$41*$D36,IF($E36=\"kW\",VLOOKUP(N$4,'4. Billing Determinants'!$B$19:$Z$41,5,0)/'4. Billing Determinants'!$F$41*$D36,IF($E36=\"Non-RPP kWh\",VLOOKUP(N$4,'4. Billing Determinants'!$B$19:$Z$41,6,0)/'4. Billing Determinants'!$G$41*$D36,IF($E36=\"Distribution Rev.\",VLOOKUP(N$4,'4. Billing Determinants'!$B$19:$Z$41,8,0)/'4. Billing Determinants'!$I$41*$D36, VLOOKUP(N$4,'4. Billing Determinants'!$B$19:$Z$41,3,0)/'4. Billing Determinants'!$D$41*$D36))))),0)","v":0},{"$f":"IFERROR(IF(O$4=\"\",0,IF($E36=\"kWh\",VLOOKUP(O$4,'4. Billing Determinants'!$B$19:$Z$41,4,0)/'4. Billing Determinants'!$E$41*$D36,IF($E36=\"kW\",VLOOKUP(O$4,'4. Billing Determinants'!$B$19:$Z$41,5,0)/'4. Billing Determinants'!$F$41*$D36,IF($E36=\"Non-RPP kWh\",VLOOKUP(O$4,'4. Billing Determinants'!$B$19:$Z$41,6,0)/'4. Billing Determinants'!$G$41*$D36,IF($E36=\"Distribution Rev.\",VLOOKUP(O$4,'4. Billing Determinants'!$B$19:$Z$41,8,0)/'4. Billing Determinants'!$I$41*$D36, VLOOKUP(O$4,'4. Billing Determinants'!$B$19:$Z$41,3,0)/'4. Billing Determinants'!$D$41*$D36))))),0)","v":0},{"$f":"IFERROR(IF(P$4=\"\",0,IF($E36=\"kWh\",VLOOKUP(P$4,'4. Billing Determinants'!$B$19:$Z$41,4,0)/'4. Billing Determinants'!$E$41*$D36,IF($E36=\"kW\",VLOOKUP(P$4,'4. Billing Determinants'!$B$19:$Z$41,5,0)/'4. Billing Determinants'!$F$41*$D36,IF($E36=\"Non-RPP kWh\",VLOOKUP(P$4,'4. Billing Determinants'!$B$19:$Z$41,6,0)/'4. Billing Determinants'!$G$41*$D36,IF($E36=\"Distribution Rev.\",VLOOKUP(P$4,'4. Billing Determinants'!$B$19:$Z$41,8,0)/'4. Billing Determinants'!$I$41*$D36, VLOOKUP(P$4,'4. Billing Determinants'!$B$19:$Z$41,3,0)/'4. Billing Determinants'!$D$41*$D36))))),0)","v":0},{"$f":"IFERROR(IF(Q$4=\"\",0,IF($E36=\"kWh\",VLOOKUP(Q$4,'4. Billing Determinants'!$B$19:$Z$41,4,0)/'4. Billing Determinants'!$E$41*$D36,IF($E36=\"kW\",VLOOKUP(Q$4,'4. Billing Determinants'!$B$19:$Z$41,5,0)/'4. Billing Determinants'!$F$41*$D36,IF($E36=\"Non-RPP kWh\",VLOOKUP(Q$4,'4. Billing Determinants'!$B$19:$Z$41,6,0)/'4. Billing Determinants'!$G$41*$D36,IF($E36=\"Distribution Rev.\",VLOOKUP(Q$4,'4. Billing Determinants'!$B$19:$Z$41,8,0)/'4. Billing Determinants'!$I$41*$D36, VLOOKUP(Q$4,'4. Billing Determinants'!$B$19:$Z$41,3,0)/'4. Billing Determinants'!$D$41*$D36))))),0)","v":0},{"$f":"IFERROR(IF(R$4=\"\",0,IF($E36=\"kWh\",VLOOKUP(R$4,'4. Billing Determinants'!$B$19:$Z$41,4,0)/'4. Billing Determinants'!$E$41*$D36,IF($E36=\"kW\",VLOOKUP(R$4,'4. Billing Determinants'!$B$19:$Z$41,5,0)/'4. Billing Determinants'!$F$41*$D36,IF($E36=\"Non-RPP kWh\",VLOOKUP(R$4,'4. Billing Determinants'!$B$19:$Z$41,6,0)/'4. Billing Determinants'!$G$41*$D36,IF($E36=\"Distribution Rev.\",VLOOKUP(R$4,'4. Billing Determinants'!$B$19:$Z$41,8,0)/'4. Billing Determinants'!$I$41*$D36, VLOOKUP(R$4,'4. Billing Determinants'!$B$19:$Z$41,3,0)/'4. Billing Determinants'!$D$41*$D36))))),0)","v":0},{"$f":"IFERROR(IF(S$4=\"\",0,IF($E36=\"kWh\",VLOOKUP(S$4,'4. Billing Determinants'!$B$19:$Z$41,4,0)/'4. Billing Determinants'!$E$41*$D36,IF($E36=\"kW\",VLOOKUP(S$4,'4. Billing Determinants'!$B$19:$Z$41,5,0)/'4. Billing Determinants'!$F$41*$D36,IF($E36=\"Non-RPP kWh\",VLOOKUP(S$4,'4. Billing Determinants'!$B$19:$Z$41,6,0)/'4. Billing Determinants'!$G$41*$D36,IF($E36=\"Distribution Rev.\",VLOOKUP(S$4,'4. Billing Determinants'!$B$19:$Z$41,8,0)/'4. Billing Determinants'!$I$41*$D36, VLOOKUP(S$4,'4. Billing Determinants'!$B$19:$Z$41,3,0)/'4. Billing Determinants'!$D$41*$D36))))),0)","v":0},{"$f":"IFERROR(IF(T$4=\"\",0,IF($E36=\"kWh\",VLOOKUP(T$4,'4. Billing Determinants'!$B$19:$Z$41,4,0)/'4. Billing Determinants'!$E$41*$D36,IF($E36=\"kW\",VLOOKUP(T$4,'4. Billing Determinants'!$B$19:$Z$41,5,0)/'4. Billing Determinants'!$F$41*$D36,IF($E36=\"Non-RPP kWh\",VLOOKUP(T$4,'4. Billing Determinants'!$B$19:$Z$41,6,0)/'4. Billing Determinants'!$G$41*$D36,IF($E36=\"Distribution Rev.\",VLOOKUP(T$4,'4. Billing Determinants'!$B$19:$Z$41,8,0)/'4. Billing Determinants'!$I$41*$D36, VLOOKUP(T$4,'4. Billing Determinants'!$B$19:$Z$41,3,0)/'4. Billing Determinants'!$D$41*$D36))))),0)","v":0},{"$f":"IFERROR(IF(U$4=\"\",0,IF($E36=\"kWh\",VLOOKUP(U$4,'4. Billing Determinants'!$B$19:$Z$41,4,0)/'4. Billing Determinants'!$E$41*$D36,IF($E36=\"kW\",VLOOKUP(U$4,'4. Billing Determinants'!$B$19:$Z$41,5,0)/'4. Billing Determinants'!$F$41*$D36,IF($E36=\"Non-RPP kWh\",VLOOKUP(U$4,'4. Billing Determinants'!$B$19:$Z$41,6,0)/'4. Billing Determinants'!$G$41*$D36,IF($E36=\"Distribution Rev.\",VLOOKUP(U$4,'4. Billing Determinants'!$B$19:$Z$41,8,0)/'4. Billing Determinants'!$I$41*$D36, VLOOKUP(U$4,'4. Billing Determinants'!$B$19:$Z$41,3,0)/'4. Billing Determinants'!$D$41*$D36))))),0)","v":0},{"$f":"IFERROR(IF(V$4=\"\",0,IF($E36=\"kWh\",VLOOKUP(V$4,'4. Billing Determinants'!$B$19:$Z$41,4,0)/'4. Billing Determinants'!$E$41*$D36,IF($E36=\"kW\",VLOOKUP(V$4,'4. Billing Determinants'!$B$19:$Z$41,5,0)/'4. Billing Determinants'!$F$41*$D36,IF($E36=\"Non-RPP kWh\",VLOOKUP(V$4,'4. Billing Determinants'!$B$19:$Z$41,6,0)/'4. Billing Determinants'!$G$41*$D36,IF($E36=\"Distribution Rev.\",VLOOKUP(V$4,'4. Billing Determinants'!$B$19:$Z$41,8,0)/'4. Billing Determinants'!$I$41*$D36, VLOOKUP(V$4,'4. Billing Determinants'!$B$19:$Z$41,3,0)/'4. Billing Determinants'!$D$41*$D36))))),0)","v":0},{"$f":"IFERROR(IF(W$4=\"\",0,IF($E36=\"kWh\",VLOOKUP(W$4,'4. Billing Determinants'!$B$19:$Z$41,4,0)/'4. Billing Determinants'!$E$41*$D36,IF($E36=\"kW\",VLOOKUP(W$4,'4. Billing Determinants'!$B$19:$Z$41,5,0)/'4. Billing Determinants'!$F$41*$D36,IF($E36=\"Non-RPP kWh\",VLOOKUP(W$4,'4. Billing Determinants'!$B$19:$Z$41,6,0)/'4. Billing Determinants'!$G$41*$D36,IF($E36=\"Distribution Rev.\",VLOOKUP(W$4,'4. Billing Determinants'!$B$19:$Z$41,8,0)/'4. Billing Determinants'!$I$41*$D36, VLOOKUP(W$4,'4. Billing Determinants'!$B$19:$Z$41,3,0)/'4. Billing Determinants'!$D$41*$D36))))),0)","v":0},{"$f":"IFERROR(IF(X$4=\"\",0,IF($E36=\"kWh\",VLOOKUP(X$4,'4. Billing Determinants'!$B$19:$Z$41,4,0)/'4. Billing Determinants'!$E$41*$D36,IF($E36=\"kW\",VLOOKUP(X$4,'4. Billing Determinants'!$B$19:$Z$41,5,0)/'4. Billing Determinants'!$F$41*$D36,IF($E36=\"Non-RPP kWh\",VLOOKUP(X$4,'4. Billing Determinants'!$B$19:$Z$41,6,0)/'4. Billing Determinants'!$G$41*$D36,IF($E36=\"Distribution Rev.\",VLOOKUP(X$4,'4. Billing Determinants'!$B$19:$Z$41,8,0)/'4. Billing Determinants'!$I$41*$D36, VLOOKUP(X$4,'4. Billing Determinants'!$B$19:$Z$41,3,0)/'4. Billing Determinants'!$D$41*$D36))))),0)","v":0},{"$f":"IFERROR(IF(Y$4=\"\",0,IF($E36=\"kWh\",VLOOKUP(Y$4,'4. Billing Determinants'!$B$19:$Z$41,4,0)/'4. Billing Determinants'!$E$41*$D36,IF($E36=\"kW\",VLOOKUP(Y$4,'4. Billing Determinants'!$B$19:$Z$41,5,0)/'4. Billing Determinants'!$F$41*$D36,IF($E36=\"Non-RPP kWh\",VLOOKUP(Y$4,'4. Billing Determinants'!$B$19:$Z$41,6,0)/'4. Billing Determinants'!$G$41*$D36,IF($E36=\"Distribution Rev.\",VLOOKUP(Y$4,'4. Billing Determinants'!$B$19:$Z$41,8,0)/'4. Billing Determinants'!$I$41*$D36, VLOOKUP(Y$4,'4. Billing Determinants'!$B$19:$Z$41,3,0)/'4. Billing Determinants'!$D$41*$D36))))),0)","v":0}]
[null,"Total of Account 1562 and Account 1592",null,{"$f":"SUM(D35:D36)","v":0},null,{"$f":"SUM(F35:F36)","v":0},0,0,0,0,0,0,0,0,0,0,0,0,0,0,0,0,0,0,0]
[]
[null,"LRAM Variance Account (Enter dollar amount for each class)",1568,{"$f":"'2. 2015 Continuity Schedule'!BS65","v":0},null,{"$f":"'4. Billing Determinants'!$Z21","v":0},{"$f":"'4. Billing Determinants'!$Z22","v":0},{"$f":"'4. Billing Determinants'!$Z23","v":0},{"$f":"'4. Billing Determinants'!$Z24","v":0},{"$f":"'4. Billing Determinants'!$Z25","v":0},{"$f":"'4. Billing Determinants'!$Z26","v":0},{"$f":"'4. Billing Determinants'!$Z27","v":0},{"$f":"'4. Billing Determinants'!$Z28","v":0},{"$f":"'4. Billing Determinants'!$Z29","v":0},{"$f":"'4. Billing Determinants'!$Z30","v":0},{"$f":"'4. Billing Determinants'!$Z31","v":0},{"$f":"'4. Billing Determinants'!$Z32","v":0},{"$f":"'4. Billing Determinants'!$Z33","v":0},{"$f":"'4. Billing Determinants'!$Z34","v":0},{"$f":"'4. Billing Determinants'!$Z35","v":0},{"$f":"'4. Billing Determinants'!$Z36","v":0},{"$f":"'4. Billing Determinants'!$Z37","v":0},{"$f":"'4. Billing Determinants'!$Z38","v":0},{"$f":"'4. Billing Determinants'!$Z39","v":0},{"$f":"'4. Billing Determinants'!$Z40","v":0}]
[null,"(Account 1568 - total amount allocated to classes)",null,{"$f":"SUM(F39:Y39)","v":0}]
[null,"Variance",null,{"$f":"D39-D40","v":0}]
[]
[null,"Total of Group 1 Accounts (1550, 1551, 1584, 1586 and 1595)",null,{"$f":"SUM(F43:Y43)","v":6551069.531636579},null,{"$f":"SUM(F5,F6,F8,F9,F12:F18)","v":1925731.587771243},700904.53937620146,2204726.434059028,318194.79439263651,1340753.5580156951,13261.56119245182,497.2408794178271,46999.815949905416,0,0,0,0,0,0,0,0,0,0,0,0]
[null,"Total of Account 1580 and 1588 (not allocated to WMPs)",null,{"$f":"SUM(F44:Y44)","v":-4020703.4563366338},null,{"$f":"SUM(F7,F10)","v":-1388600.100576719},-501867.21915784385,-1568836.315575985,-194137.54097602941,-323848.31830849184,-9475.8065437924979,-355.29439638753911,-33582.86080138485,0,0,0,0,0,0,0,0,0,0,0,0]
[null,"Balance of Account 1589 Allocated to Non-WMPs",null,{"$f":"SUM(F45:Y45)","v":6997091.608757142},null,{"$f":"F11","v":535220.4440206174},314970.78702757269,5894449.4034804786,99302.179672058657,4.3911242453842499E-10,8097.3914247384264,14.193589928052688,145037.20954174799,0,0,0,0,0,0,0,0,0,0,0,0]
[]
[null,"Balance of Account 1589 allocated to Class A Non-WMP Customers",null,{"$f":"SUM(F47:Y47)","v":0},null,{"$f":"'4. Billing Determinants'!$N21*'2. 2015 Continuity Schedule'!$BS$41","v":0},{"$f":"'4. Billing Determinants'!$N22*'2. 2015 Continuity Schedule'!$BS$41","v":0},{"$f":"'4. Billing Determinants'!$N23*'2. 2015 Continuity Schedule'!$BS$41","v":0},{"$f":"'4. Billing Determinants'!$N24*'2. 2015 Continuity Schedule'!$BS$41","v":0},{"$f":"'4. Billing Determinants'!$N25*'2. 2015 Continuity Schedule'!$BS$41","v":0},{"$f":"'4. Billing Determinants'!$N26*'2. 2015 Continuity Schedule'!$BS$41","v":0},{"$f":"'4. Billing Determinants'!$N27*'2. 2015 Continuity Schedule'!$BS$41","v":0},{"$f":"'4. Billing Determinants'!$N28*'2. 2015 Continuity Schedule'!$BS$41","v":0},{"$f":"'4. Billing Determinants'!$N29*'2. 2015 Continuity Schedule'!$BS$41","v":0},{"$f":"'4. Billing Determinants'!$N30*'2. 2015 Continuity Schedule'!$BS$41","v":0},{"$f":"'4. Billing Determinants'!$N31*'2. 2015 Continuity Schedule'!$BS$41","v":0},{"$f":"'4. Billing Determinants'!$N32*'2. 2015 Continuity Schedule'!$BS$41","v":0},{"$f":"'4. Billing Determinants'!$N33*'2. 2015 Continuity Schedule'!$BS$41","v":0},{"$f":"'4. Billing Determinants'!$N34*'2. 2015 Continuity Schedule'!$BS$41","v":0},{"$f":"'4. Billing Determinants'!$N35*'2. 2015 Continuity Schedule'!$BS$41","v":0},{"$f":"'4. Billing Determinants'!$N36*'2. 2015 Continuity Schedule'!$BS$41","v":0},{"$f":"'4. Billing Determinants'!$N37*'2. 2015 Continuity Schedule'!$BS$41","v":0},{"$f":"'4. Billing Determinants'!$N38*'2. 2015 Continuity Schedule'!$BS$41","v":0},{"$f":"'4. Billing Determinants'!$N39*'2. 2015 Continuity Schedule'!$BS$41","v":0},{"$f":"'4. Billing Determinants'!$N40*'2. 2015 Continuity Schedule'!$BS$41","v":0}]
[]
[null,"Group 2 Accounts - Total balance allocated to each class",null,{"$f":"SUM(F49:Y49)","v":0},null,{"$f":"SUM(F21:F32)","v":0},{"$f":"SUM(G21:G32)","v":0},0,0,0,0,0,0,0,0,0,0,0,0,0,0,0,0,0,0]
[]
[null,"IFRS-CGAAP Transition PP&E Amounts Balance + Return Component",1575,{"$f":"'2. 2015 Continuity Schedule'!BS82","v":0},null,{"$f":"IFERROR(IF(F$4=\"\",0,IF($E51=\"kWh\",VLOOKUP(F$4,'4. Billing Determinants'!$B$19:$Z$41,4,0)/'4. Billing Determinants'!$E$41*$D51,IF($E51=\"kW\",VLOOKUP(F$4,'4. Billing Determinants'!$B$19:$Z$41,5,0)/'4. Billing Determinants'!$F$41*$D51,IF($E51=\"Non-RPP kWh\",VLOOKUP(F$4,'4. Billing Determinants'!$B$19:$Z$41,6,0)/'4. Billing Determinants'!$G$41*$D51,IF($E51=\"Distribution Rev.\",VLOOKUP(F$4,'4. Billing Determinants'!$B$19:$Z$41,8,0)/'4. Billing Determinants'!$I$41*$D51, VLOOKUP(F$4,'4. Billing Determinants'!$B$19:$Z$41,3,0)/'4. Billing Determinants'!$D$41*$D51))))),0)","v":0},{"$f":"IFERROR(IF(G$4=\"\",0,IF($E51=\"kWh\",VLOOKUP(G$4,'4. Billing Determinants'!$B$19:$Z$41,4,0)/'4. Billing Determinants'!$E$41*$D51,IF($E51=\"kW\",VLOOKUP(G$4,'4. Billing Determinants'!$B$19:$Z$41,5,0)/'4. Billing Determinants'!$F$41*$D51,IF($E51=\"Non-RPP kWh\",VLOOKUP(G$4,'4. Billing Determinants'!$B$19:$Z$41,6,0)/'4. Billing Determinants'!$G$41*$D51,IF($E51=\"Distribution Rev.\",VLOOKUP(G$4,'4. Billing Determinants'!$B$19:$Z$41,8,0)/'4. Billing Determinants'!$I$41*$D51, VLOOKUP(G$4,'4. Billing Determinants'!$B$19:$Z$41,3,0)/'4. Billing Determinants'!$D$41*$D51))))),0)","v":0},{"$f":"IFERROR(IF(H$4=\"\",0,IF($E51=\"kWh\",VLOOKUP(H$4,'4. Billing Determinants'!$B$19:$Z$41,4,0)/'4. Billing Determinants'!$E$41*$D51,IF($E51=\"kW\",VLOOKUP(H$4,'4. Billing Determinants'!$B$19:$Z$41,5,0)/'4. Billing Determinants'!$F$41*$D51,IF($E51=\"Non-RPP kWh\",VLOOKUP(H$4,'4. Billing Determinants'!$B$19:$Z$41,6,0)/'4. Billing Determinants'!$G$41*$D51,IF($E51=\"Distribution Rev.\",VLOOKUP(H$4,'4. Billing Determinants'!$B$19:$Z$41,8,0)/'4. Billing Determinants'!$I$41*$D51, VLOOKUP(H$4,'4. Billing Determinants'!$B$19:$Z$41,3,0)/'4. Billing Determinants'!$D$41*$D51))))),0)","v":0},{"$f":"IFERROR(IF(I$4=\"\",0,IF($E51=\"kWh\",VLOOKUP(I$4,'4. Billing Determinants'!$B$19:$Z$41,4,0)/'4. Billing Determinants'!$E$41*$D51,IF($E51=\"kW\",VLOOKUP(I$4,'4. Billing Determinants'!$B$19:$Z$41,5,0)/'4. Billing Determinants'!$F$41*$D51,IF($E51=\"Non-RPP kWh\",VLOOKUP(I$4,'4. Billing Determinants'!$B$19:$Z$41,6,0)/'4. Billing Determinants'!$G$41*$D51,IF($E51=\"Distribution Rev.\",VLOOKUP(I$4,'4. Billing Determinants'!$B$19:$Z$41,8,0)/'4. Billing Determinants'!$I$41*$D51, VLOOKUP(I$4,'4. Billing Determinants'!$B$19:$Z$41,3,0)/'4. Billing Determinants'!$D$41*$D51))))),0)","v":0},{"$f":"IFERROR(IF(J$4=\"\",0,IF($E51=\"kWh\",VLOOKUP(J$4,'4. Billing Determinants'!$B$19:$Z$41,4,0)/'4. Billing Determinants'!$E$41*$D51,IF($E51=\"kW\",VLOOKUP(J$4,'4. Billing Determinants'!$B$19:$Z$41,5,0)/'4. Billing Determinants'!$F$41*$D51,IF($E51=\"Non-RPP kWh\",VLOOKUP(J$4,'4. Billing Determinants'!$B$19:$Z$41,6,0)/'4. Billing Determinants'!$G$41*$D51,IF($E51=\"Distribution Rev.\",VLOOKUP(J$4,'4. Billing Determinants'!$B$19:$Z$41,8,0)/'4. Billing Determinants'!$I$41*$D51, VLOOKUP(J$4,'4. Billing Determinants'!$B$19:$Z$41,3,0)/'4. Billing Determinants'!$D$41*$D51))))),0)","v":0},{"$f":"IFERROR(IF(K$4=\"\",0,IF($E51=\"kWh\",VLOOKUP(K$4,'4. Billing Determinants'!$B$19:$Z$41,4,0)/'4. Billing Determinants'!$E$41*$D51,IF($E51=\"kW\",VLOOKUP(K$4,'4. Billing Determinants'!$B$19:$Z$41,5,0)/'4. Billing Determinants'!$F$41*$D51,IF($E51=\"Non-RPP kWh\",VLOOKUP(K$4,'4. Billing Determinants'!$B$19:$Z$41,6,0)/'4. Billing Determinants'!$G$41*$D51,IF($E51=\"Distribution Rev.\",VLOOKUP(K$4,'4. Billing Determinants'!$B$19:$Z$41,8,0)/'4. Billing Determinants'!$I$41*$D51, VLOOKUP(K$4,'4. Billing Determinants'!$B$19:$Z$41,3,0)/'4. Billing Determinants'!$D$41*$D51))))),0)","v":0},{"$f":"IFERROR(IF(L$4=\"\",0,IF($E51=\"kWh\",VLOOKUP(L$4,'4. Billing Determinants'!$B$19:$Z$41,4,0)/'4. Billing Determinants'!$E$41*$D51,IF($E51=\"kW\",VLOOKUP(L$4,'4. Billing Determinants'!$B$19:$Z$41,5,0)/'4. Billing Determinants'!$F$41*$D51,IF($E51=\"Non-RPP kWh\",VLOOKUP(L$4,'4. Billing Determinants'!$B$19:$Z$41,6,0)/'4. Billing Determinants'!$G$41*$D51,IF($E51=\"Distribution Rev.\",VLOOKUP(L$4,'4. Billing Determinants'!$B$19:$Z$41,8,0)/'4. Billing Determinants'!$I$41*$D51, VLOOKUP(L$4,'4. Billing Determinants'!$B$19:$Z$41,3,0)/'4. Billing Determinants'!$D$41*$D51))))),0)","v":0},{"$f":"IFERROR(IF(M$4=\"\",0,IF($E51=\"kWh\",VLOOKUP(M$4,'4. Billing Determinants'!$B$19:$Z$41,4,0)/'4. Billing Determinants'!$E$41*$D51,IF($E51=\"kW\",VLOOKUP(M$4,'4. Billing Determinants'!$B$19:$Z$41,5,0)/'4. Billing Determinants'!$F$41*$D51,IF($E51=\"Non-RPP kWh\",VLOOKUP(M$4,'4. Billing Determinants'!$B$19:$Z$41,6,0)/'4. Billing Determinants'!$G$41*$D51,IF($E51=\"Distribution Rev.\",VLOOKUP(M$4,'4. Billing Determinants'!$B$19:$Z$41,8,0)/'4. Billing Determinants'!$I$41*$D51, VLOOKUP(M$4,'4. Billing Determinants'!$B$19:$Z$41,3,0)/'4. Billing Determinants'!$D$41*$D51))))),0)","v":0},{"$f":"IFERROR(IF(N$4=\"\",0,IF($E51=\"kWh\",VLOOKUP(N$4,'4. Billing Determinants'!$B$19:$Z$41,4,0)/'4. Billing Determinants'!$E$41*$D51,IF($E51=\"kW\",VLOOKUP(N$4,'4. Billing Determinants'!$B$19:$Z$41,5,0)/'4. Billing Determinants'!$F$41*$D51,IF($E51=\"Non-RPP kWh\",VLOOKUP(N$4,'4. Billing Determinants'!$B$19:$Z$41,6,0)/'4. Billing Determinants'!$G$41*$D51,IF($E51=\"Distribution Rev.\",VLOOKUP(N$4,'4. Billing Determinants'!$B$19:$Z$41,8,0)/'4. Billing Determinants'!$I$41*$D51, VLOOKUP(N$4,'4. Billing Determinants'!$B$19:$Z$41,3,0)/'4. Billing Determinants'!$D$41*$D51))))),0)","v":0},{"$f":"IFERROR(IF(O$4=\"\",0,IF($E51=\"kWh\",VLOOKUP(O$4,'4. Billing Determinants'!$B$19:$Z$41,4,0)/'4. Billing Determinants'!$E$41*$D51,IF($E51=\"kW\",VLOOKUP(O$4,'4. Billing Determinants'!$B$19:$Z$41,5,0)/'4. Billing Determinants'!$F$41*$D51,IF($E51=\"Non-RPP kWh\",VLOOKUP(O$4,'4. Billing Determinants'!$B$19:$Z$41,6,0)/'4. Billing Determinants'!$G$41*$D51,IF($E51=\"Distribution Rev.\",VLOOKUP(O$4,'4. Billing Determinants'!$B$19:$Z$41,8,0)/'4. Billing Determinants'!$I$41*$D51, VLOOKUP(O$4,'4. Billing Determinants'!$B$19:$Z$41,3,0)/'4. Billing Determinants'!$D$41*$D51))))),0)","v":0},{"$f":"IFERROR(IF(P$4=\"\",0,IF($E51=\"kWh\",VLOOKUP(P$4,'4. Billing Determinants'!$B$19:$Z$41,4,0)/'4. Billing Determinants'!$E$41*$D51,IF($E51=\"kW\",VLOOKUP(P$4,'4. Billing Determinants'!$B$19:$Z$41,5,0)/'4. Billing Determinants'!$F$41*$D51,IF($E51=\"Non-RPP kWh\",VLOOKUP(P$4,'4. Billing Determinants'!$B$19:$Z$41,6,0)/'4. Billing Determinants'!$G$41*$D51,IF($E51=\"Distribution Rev.\",VLOOKUP(P$4,'4. Billing Determinants'!$B$19:$Z$41,8,0)/'4. Billing Determinants'!$I$41*$D51, VLOOKUP(P$4,'4. Billing Determinants'!$B$19:$Z$41,3,0)/'4. Billing Determinants'!$D$41*$D51))))),0)","v":0},{"$f":"IFERROR(IF(Q$4=\"\",0,IF($E51=\"kWh\",VLOOKUP(Q$4,'4. Billing Determinants'!$B$19:$Z$41,4,0)/'4. Billing Determinants'!$E$41*$D51,IF($E51=\"kW\",VLOOKUP(Q$4,'4. Billing Determinants'!$B$19:$Z$41,5,0)/'4. Billing Determinants'!$F$41*$D51,IF($E51=\"Non-RPP kWh\",VLOOKUP(Q$4,'4. Billing Determinants'!$B$19:$Z$41,6,0)/'4. Billing Determinants'!$G$41*$D51,IF($E51=\"Distribution Rev.\",VLOOKUP(Q$4,'4. Billing Determinants'!$B$19:$Z$41,8,0)/'4. Billing Determinants'!$I$41*$D51, VLOOKUP(Q$4,'4. Billing Determinants'!$B$19:$Z$41,3,0)/'4. Billing Determinants'!$D$41*$D51))))),0)","v":0},{"$f":"IFERROR(IF(R$4=\"\",0,IF($E51=\"kWh\",VLOOKUP(R$4,'4. Billing Determinants'!$B$19:$Z$41,4,0)/'4. Billing Determinants'!$E$41*$D51,IF($E51=\"kW\",VLOOKUP(R$4,'4. Billing Determinants'!$B$19:$Z$41,5,0)/'4. Billing Determinants'!$F$41*$D51,IF($E51=\"Non-RPP kWh\",VLOOKUP(R$4,'4. Billing Determinants'!$B$19:$Z$41,6,0)/'4. Billing Determinants'!$G$41*$D51,IF($E51=\"Distribution Rev.\",VLOOKUP(R$4,'4. Billing Determinants'!$B$19:$Z$41,8,0)/'4. Billing Determinants'!$I$41*$D51, VLOOKUP(R$4,'4. Billing Determinants'!$B$19:$Z$41,3,0)/'4. Billing Determinants'!$D$41*$D51))))),0)","v":0},{"$f":"IFERROR(IF(S$4=\"\",0,IF($E51=\"kWh\",VLOOKUP(S$4,'4. Billing Determinants'!$B$19:$Z$41,4,0)/'4. Billing Determinants'!$E$41*$D51,IF($E51=\"kW\",VLOOKUP(S$4,'4. Billing Determinants'!$B$19:$Z$41,5,0)/'4. Billing Determinants'!$F$41*$D51,IF($E51=\"Non-RPP kWh\",VLOOKUP(S$4,'4. Billing Determinants'!$B$19:$Z$41,6,0)/'4. Billing Determinants'!$G$41*$D51,IF($E51=\"Distribution Rev.\",VLOOKUP(S$4,'4. Billing Determinants'!$B$19:$Z$41,8,0)/'4. Billing Determinants'!$I$41*$D51, VLOOKUP(S$4,'4. Billing Determinants'!$B$19:$Z$41,3,0)/'4. Billing Determinants'!$D$41*$D51))))),0)","v":0},{"$f":"IFERROR(IF(T$4=\"\",0,IF($E51=\"kWh\",VLOOKUP(T$4,'4. Billing Determinants'!$B$19:$Z$41,4,0)/'4. Billing Determinants'!$E$41*$D51,IF($E51=\"kW\",VLOOKUP(T$4,'4. Billing Determinants'!$B$19:$Z$41,5,0)/'4. Billing Determinants'!$F$41*$D51,IF($E51=\"Non-RPP kWh\",VLOOKUP(T$4,'4. Billing Determinants'!$B$19:$Z$41,6,0)/'4. Billing Determinants'!$G$41*$D51,IF($E51=\"Distribution Rev.\",VLOOKUP(T$4,'4. Billing Determinants'!$B$19:$Z$41,8,0)/'4. Billing Determinants'!$I$41*$D51, VLOOKUP(T$4,'4. Billing Determinants'!$B$19:$Z$41,3,0)/'4. Billing Determinants'!$D$41*$D51))))),0)","v":0},{"$f":"IFERROR(IF(U$4=\"\",0,IF($E51=\"kWh\",VLOOKUP(U$4,'4. Billing Determinants'!$B$19:$Z$41,4,0)/'4. Billing Determinants'!$E$41*$D51,IF($E51=\"kW\",VLOOKUP(U$4,'4. Billing Determinants'!$B$19:$Z$41,5,0)/'4. Billing Determinants'!$F$41*$D51,IF($E51=\"Non-RPP kWh\",VLOOKUP(U$4,'4. Billing Determinants'!$B$19:$Z$41,6,0)/'4. Billing Determinants'!$G$41*$D51,IF($E51=\"Distribution Rev.\",VLOOKUP(U$4,'4. Billing Determinants'!$B$19:$Z$41,8,0)/'4. Billing Determinants'!$I$41*$D51, VLOOKUP(U$4,'4. Billing Determinants'!$B$19:$Z$41,3,0)/'4. Billing Determinants'!$D$41*$D51))))),0)","v":0},{"$f":"IFERROR(IF(V$4=\"\",0,IF($E51=\"kWh\",VLOOKUP(V$4,'4. Billing Determinants'!$B$19:$Z$41,4,0)/'4. Billing Determinants'!$E$41*$D51,IF($E51=\"kW\",VLOOKUP(V$4,'4. Billing Determinants'!$B$19:$Z$41,5,0)/'4. Billing Determinants'!$F$41*$D51,IF($E51=\"Non-RPP kWh\",VLOOKUP(V$4,'4. Billing Determinants'!$B$19:$Z$41,6,0)/'4. Billing Determinants'!$G$41*$D51,IF($E51=\"Distribution Rev.\",VLOOKUP(V$4,'4. Billing Determinants'!$B$19:$Z$41,8,0)/'4. Billing Determinants'!$I$41*$D51, VLOOKUP(V$4,'4. Billing Determinants'!$B$19:$Z$41,3,0)/'4. Billing Determinants'!$D$41*$D51))))),0)","v":0},{"$f":"IFERROR(IF(W$4=\"\",0,IF($E51=\"kWh\",VLOOKUP(W$4,'4. Billing Determinants'!$B$19:$Z$41,4,0)/'4. Billing Determinants'!$E$41*$D51,IF($E51=\"kW\",VLOOKUP(W$4,'4. Billing Determinants'!$B$19:$Z$41,5,0)/'4. Billing Determinants'!$F$41*$D51,IF($E51=\"Non-RPP kWh\",VLOOKUP(W$4,'4. Billing Determinants'!$B$19:$Z$41,6,0)/'4. Billing Determinants'!$G$41*$D51,IF($E51=\"Distribution Rev.\",VLOOKUP(W$4,'4. Billing Determinants'!$B$19:$Z$41,8,0)/'4. Billing Determinants'!$I$41*$D51, VLOOKUP(W$4,'4. Billing Determinants'!$B$19:$Z$41,3,0)/'4. Billing Determinants'!$D$41*$D51))))),0)","v":0},{"$f":"IFERROR(IF(X$4=\"\",0,IF($E51=\"kWh\",VLOOKUP(X$4,'4. Billing Determinants'!$B$19:$Z$41,4,0)/'4. Billing Determinants'!$E$41*$D51,IF($E51=\"kW\",VLOOKUP(X$4,'4. Billing Determinants'!$B$19:$Z$41,5,0)/'4. Billing Determinants'!$F$41*$D51,IF($E51=\"Non-RPP kWh\",VLOOKUP(X$4,'4. Billing Determinants'!$B$19:$Z$41,6,0)/'4. Billing Determinants'!$G$41*$D51,IF($E51=\"Distribution Rev.\",VLOOKUP(X$4,'4. Billing Determinants'!$B$19:$Z$41,8,0)/'4. Billing Determinants'!$I$41*$D51, VLOOKUP(X$4,'4. Billing Determinants'!$B$19:$Z$41,3,0)/'4. Billing Determinants'!$D$41*$D51))))),0)","v":0},{"$f":"IFERROR(IF(Y$4=\"\",0,IF($E51=\"kWh\",VLOOKUP(Y$4,'4. Billing Determinants'!$B$19:$Z$41,4,0)/'4. Billing Determinants'!$E$41*$D51,IF($E51=\"kW\",VLOOKUP(Y$4,'4. Billing Determinants'!$B$19:$Z$41,5,0)/'4. Billing Determinants'!$F$41*$D51,IF($E51=\"Non-RPP kWh\",VLOOKUP(Y$4,'4. Billing Determinants'!$B$19:$Z$41,6,0)/'4. Billing Determinants'!$G$41*$D51,IF($E51=\"Distribution Rev.\",VLOOKUP(Y$4,'4. Billing Determinants'!$B$19:$Z$41,8,0)/'4. Billing Determinants'!$I$41*$D51, VLOOKUP(Y$4,'4. Billing Determinants'!$B$19:$Z$41,3,0)/'4. Billing Determinants'!$D$41*$D51))))),0)","v":0}]
[null,"Accounting Changes Under CGAAP Balance + Return Component",1576,{"$f":"'2. 2015 Continuity Schedule'!BS83","v":0},null,{"$f":"IFERROR(IF(F$4=\"\",0,IF($E52=\"kWh\",VLOOKUP(F$4,'4. Billing Determinants'!$B$19:$Z$41,4,0)/'4. Billing Determinants'!$E$41*$D52,IF($E52=\"kW\",VLOOKUP(F$4,'4. Billing Determinants'!$B$19:$Z$41,5,0)/'4. Billing Determinants'!$F$41*$D52,IF($E52=\"Non-RPP kWh\",VLOOKUP(F$4,'4. Billing Determinants'!$B$19:$Z$41,6,0)/'4. Billing Determinants'!$G$41*$D52,IF($E52=\"Distribution Rev.\",VLOOKUP(F$4,'4. Billing Determinants'!$B$19:$Z$41,8,0)/'4. Billing Determinants'!$I$41*$D52, VLOOKUP(F$4,'4. Billing Determinants'!$B$19:$Z$41,3,0)/'4. Billing Determinants'!$D$41*$D52))))),0)","v":0},{"$f":"IFERROR(IF(G$4=\"\",0,IF($E52=\"kWh\",VLOOKUP(G$4,'4. Billing Determinants'!$B$19:$Z$41,4,0)/'4. Billing Determinants'!$E$41*$D52,IF($E52=\"kW\",VLOOKUP(G$4,'4. Billing Determinants'!$B$19:$Z$41,5,0)/'4. Billing Determinants'!$F$41*$D52,IF($E52=\"Non-RPP kWh\",VLOOKUP(G$4,'4. Billing Determinants'!$B$19:$Z$41,6,0)/'4. Billing Determinants'!$G$41*$D52,IF($E52=\"Distribution Rev.\",VLOOKUP(G$4,'4. Billing Determinants'!$B$19:$Z$41,8,0)/'4. Billing Determinants'!$I$41*$D52, VLOOKUP(G$4,'4. Billing Determinants'!$B$19:$Z$41,3,0)/'4. Billing Determinants'!$D$41*$D52))))),0)","v":0},{"$f":"IFERROR(IF(H$4=\"\",0,IF($E52=\"kWh\",VLOOKUP(H$4,'4. Billing Determinants'!$B$19:$Z$41,4,0)/'4. Billing Determinants'!$E$41*$D52,IF($E52=\"kW\",VLOOKUP(H$4,'4. Billing Determinants'!$B$19:$Z$41,5,0)/'4. Billing Determinants'!$F$41*$D52,IF($E52=\"Non-RPP kWh\",VLOOKUP(H$4,'4. Billing Determinants'!$B$19:$Z$41,6,0)/'4. Billing Determinants'!$G$41*$D52,IF($E52=\"Distribution Rev.\",VLOOKUP(H$4,'4. Billing Determinants'!$B$19:$Z$41,8,0)/'4. Billing Determinants'!$I$41*$D52, VLOOKUP(H$4,'4. Billing Determinants'!$B$19:$Z$41,3,0)/'4. Billing Determinants'!$D$41*$D52))))),0)","v":0},{"$f":"IFERROR(IF(I$4=\"\",0,IF($E52=\"kWh\",VLOOKUP(I$4,'4. Billing Determinants'!$B$19:$Z$41,4,0)/'4. Billing Determinants'!$E$41*$D52,IF($E52=\"kW\",VLOOKUP(I$4,'4. Billing Determinants'!$B$19:$Z$41,5,0)/'4. Billing Determinants'!$F$41*$D52,IF($E52=\"Non-RPP kWh\",VLOOKUP(I$4,'4. Billing Determinants'!$B$19:$Z$41,6,0)/'4. Billing Determinants'!$G$41*$D52,IF($E52=\"Distribution Rev.\",VLOOKUP(I$4,'4. Billing Determinants'!$B$19:$Z$41,8,0)/'4. Billing Determinants'!$I$41*$D52, VLOOKUP(I$4,'4. Billing Determinants'!$B$19:$Z$41,3,0)/'4. Billing Determinants'!$D$41*$D52))))),0)","v":0},{"$f":"IFERROR(IF(J$4=\"\",0,IF($E52=\"kWh\",VLOOKUP(J$4,'4. Billing Determinants'!$B$19:$Z$41,4,0)/'4. Billing Determinants'!$E$41*$D52,IF($E52=\"kW\",VLOOKUP(J$4,'4. Billing Determinants'!$B$19:$Z$41,5,0)/'4. Billing Determinants'!$F$41*$D52,IF($E52=\"Non-RPP kWh\",VLOOKUP(J$4,'4. Billing Determinants'!$B$19:$Z$41,6,0)/'4. Billing Determinants'!$G$41*$D52,IF($E52=\"Distribution Rev.\",VLOOKUP(J$4,'4. Billing Determinants'!$B$19:$Z$41,8,0)/'4. Billing Determinants'!$I$41*$D52, VLOOKUP(J$4,'4. Billing Determinants'!$B$19:$Z$41,3,0)/'4. Billing Determinants'!$D$41*$D52))))),0)","v":0},{"$f":"IFERROR(IF(K$4=\"\",0,IF($E52=\"kWh\",VLOOKUP(K$4,'4. Billing Determinants'!$B$19:$Z$41,4,0)/'4. Billing Determinants'!$E$41*$D52,IF($E52=\"kW\",VLOOKUP(K$4,'4. Billing Determinants'!$B$19:$Z$41,5,0)/'4. Billing Determinants'!$F$41*$D52,IF($E52=\"Non-RPP kWh\",VLOOKUP(K$4,'4. Billing Determinants'!$B$19:$Z$41,6,0)/'4. Billing Determinants'!$G$41*$D52,IF($E52=\"Distribution Rev.\",VLOOKUP(K$4,'4. Billing Determinants'!$B$19:$Z$41,8,0)/'4. Billing Determinants'!$I$41*$D52, VLOOKUP(K$4,'4. Billing Determinants'!$B$19:$Z$41,3,0)/'4. Billing Determinants'!$D$41*$D52))))),0)","v":0},{"$f":"IFERROR(IF(L$4=\"\",0,IF($E52=\"kWh\",VLOOKUP(L$4,'4. Billing Determinants'!$B$19:$Z$41,4,0)/'4. Billing Determinants'!$E$41*$D52,IF($E52=\"kW\",VLOOKUP(L$4,'4. Billing Determinants'!$B$19:$Z$41,5,0)/'4. Billing Determinants'!$F$41*$D52,IF($E52=\"Non-RPP kWh\",VLOOKUP(L$4,'4. Billing Determinants'!$B$19:$Z$41,6,0)/'4. Billing Determinants'!$G$41*$D52,IF($E52=\"Distribution Rev.\",VLOOKUP(L$4,'4. Billing Determinants'!$B$19:$Z$41,8,0)/'4. Billing Determinants'!$I$41*$D52, VLOOKUP(L$4,'4. Billing Determinants'!$B$19:$Z$41,3,0)/'4. Billing Determinants'!$D$41*$D52))))),0)","v":0},{"$f":"IFERROR(IF(M$4=\"\",0,IF($E52=\"kWh\",VLOOKUP(M$4,'4. Billing Determinants'!$B$19:$Z$41,4,0)/'4. Billing Determinants'!$E$41*$D52,IF($E52=\"kW\",VLOOKUP(M$4,'4. Billing Determinants'!$B$19:$Z$41,5,0)/'4. Billing Determinants'!$F$41*$D52,IF($E52=\"Non-RPP kWh\",VLOOKUP(M$4,'4. Billing Determinants'!$B$19:$Z$41,6,0)/'4. Billing Determinants'!$G$41*$D52,IF($E52=\"Distribution Rev.\",VLOOKUP(M$4,'4. Billing Determinants'!$B$19:$Z$41,8,0)/'4. Billing Determinants'!$I$41*$D52, VLOOKUP(M$4,'4. Billing Determinants'!$B$19:$Z$41,3,0)/'4. Billing Determinants'!$D$41*$D52))))),0)","v":0},{"$f":"IFERROR(IF(N$4=\"\",0,IF($E52=\"kWh\",VLOOKUP(N$4,'4. Billing Determinants'!$B$19:$Z$41,4,0)/'4. Billing Determinants'!$E$41*$D52,IF($E52=\"kW\",VLOOKUP(N$4,'4. Billing Determinants'!$B$19:$Z$41,5,0)/'4. Billing Determinants'!$F$41*$D52,IF($E52=\"Non-RPP kWh\",VLOOKUP(N$4,'4. Billing Determinants'!$B$19:$Z$41,6,0)/'4. Billing Determinants'!$G$41*$D52,IF($E52=\"Distribution Rev.\",VLOOKUP(N$4,'4. Billing Determinants'!$B$19:$Z$41,8,0)/'4. Billing Determinants'!$I$41*$D52, VLOOKUP(N$4,'4. Billing Determinants'!$B$19:$Z$41,3,0)/'4. Billing Determinants'!$D$41*$D52))))),0)","v":0},{"$f":"IFERROR(IF(O$4=\"\",0,IF($E52=\"kWh\",VLOOKUP(O$4,'4. Billing Determinants'!$B$19:$Z$41,4,0)/'4. Billing Determinants'!$E$41*$D52,IF($E52=\"kW\",VLOOKUP(O$4,'4. Billing Determinants'!$B$19:$Z$41,5,0)/'4. Billing Determinants'!$F$41*$D52,IF($E52=\"Non-RPP kWh\",VLOOKUP(O$4,'4. Billing Determinants'!$B$19:$Z$41,6,0)/'4. Billing Determinants'!$G$41*$D52,IF($E52=\"Distribution Rev.\",VLOOKUP(O$4,'4. Billing Determinants'!$B$19:$Z$41,8,0)/'4. Billing Determinants'!$I$41*$D52, VLOOKUP(O$4,'4. Billing Determinants'!$B$19:$Z$41,3,0)/'4. Billing Determinants'!$D$41*$D52))))),0)","v":0},{"$f":"IFERROR(IF(P$4=\"\",0,IF($E52=\"kWh\",VLOOKUP(P$4,'4. Billing Determinants'!$B$19:$Z$41,4,0)/'4. Billing Determinants'!$E$41*$D52,IF($E52=\"kW\",VLOOKUP(P$4,'4. Billing Determinants'!$B$19:$Z$41,5,0)/'4. Billing Determinants'!$F$41*$D52,IF($E52=\"Non-RPP kWh\",VLOOKUP(P$4,'4. Billing Determinants'!$B$19:$Z$41,6,0)/'4. Billing Determinants'!$G$41*$D52,IF($E52=\"Distribution Rev.\",VLOOKUP(P$4,'4. Billing Determinants'!$B$19:$Z$41,8,0)/'4. Billing Determinants'!$I$41*$D52, VLOOKUP(P$4,'4. Billing Determinants'!$B$19:$Z$41,3,0)/'4. Billing Determinants'!$D$41*$D52))))),0)","v":0},{"$f":"IFERROR(IF(Q$4=\"\",0,IF($E52=\"kWh\",VLOOKUP(Q$4,'4. Billing Determinants'!$B$19:$Z$41,4,0)/'4. Billing Determinants'!$E$41*$D52,IF($E52=\"kW\",VLOOKUP(Q$4,'4. Billing Determinants'!$B$19:$Z$41,5,0)/'4. Billing Determinants'!$F$41*$D52,IF($E52=\"Non-RPP kWh\",VLOOKUP(Q$4,'4. Billing Determinants'!$B$19:$Z$41,6,0)/'4. Billing Determinants'!$G$41*$D52,IF($E52=\"Distribution Rev.\",VLOOKUP(Q$4,'4. Billing Determinants'!$B$19:$Z$41,8,0)/'4. Billing Determinants'!$I$41*$D52, VLOOKUP(Q$4,'4. Billing Determinants'!$B$19:$Z$41,3,0)/'4. Billing Determinants'!$D$41*$D52))))),0)","v":0},{"$f":"IFERROR(IF(R$4=\"\",0,IF($E52=\"kWh\",VLOOKUP(R$4,'4. Billing Determinants'!$B$19:$Z$41,4,0)/'4. Billing Determinants'!$E$41*$D52,IF($E52=\"kW\",VLOOKUP(R$4,'4. Billing Determinants'!$B$19:$Z$41,5,0)/'4. Billing Determinants'!$F$41*$D52,IF($E52=\"Non-RPP kWh\",VLOOKUP(R$4,'4. Billing Determinants'!$B$19:$Z$41,6,0)/'4. Billing Determinants'!$G$41*$D52,IF($E52=\"Distribution Rev.\",VLOOKUP(R$4,'4. Billing Determinants'!$B$19:$Z$41,8,0)/'4. Billing Determinants'!$I$41*$D52, VLOOKUP(R$4,'4. Billing Determinants'!$B$19:$Z$41,3,0)/'4. Billing Determinants'!$D$41*$D52))))),0)","v":0},{"$f":"IFERROR(IF(S$4=\"\",0,IF($E52=\"kWh\",VLOOKUP(S$4,'4. Billing Determinants'!$B$19:$Z$41,4,0)/'4. Billing Determinants'!$E$41*$D52,IF($E52=\"kW\",VLOOKUP(S$4,'4. Billing Determinants'!$B$19:$Z$41,5,0)/'4. Billing Determinants'!$F$41*$D52,IF($E52=\"Non-RPP kWh\",VLOOKUP(S$4,'4. Billing Determinants'!$B$19:$Z$41,6,0)/'4. Billing Determinants'!$G$41*$D52,IF($E52=\"Distribution Rev.\",VLOOKUP(S$4,'4. Billing Determinants'!$B$19:$Z$41,8,0)/'4. Billing Determinants'!$I$41*$D52, VLOOKUP(S$4,'4. Billing Determinants'!$B$19:$Z$41,3,0)/'4. Billing Determinants'!$D$41*$D52))))),0)","v":0},{"$f":"IFERROR(IF(T$4=\"\",0,IF($E52=\"kWh\",VLOOKUP(T$4,'4. Billing Determinants'!$B$19:$Z$41,4,0)/'4. Billing Determinants'!$E$41*$D52,IF($E52=\"kW\",VLOOKUP(T$4,'4. Billing Determinants'!$B$19:$Z$41,5,0)/'4. Billing Determinants'!$F$41*$D52,IF($E52=\"Non-RPP kWh\",VLOOKUP(T$4,'4. Billing Determinants'!$B$19:$Z$41,6,0)/'4. Billing Determinants'!$G$41*$D52,IF($E52=\"Distribution Rev.\",VLOOKUP(T$4,'4. Billing Determinants'!$B$19:$Z$41,8,0)/'4. Billing Determinants'!$I$41*$D52, VLOOKUP(T$4,'4. Billing Determinants'!$B$19:$Z$41,3,0)/'4. Billing Determinants'!$D$41*$D52))))),0)","v":0},{"$f":"IFERROR(IF(U$4=\"\",0,IF($E52=\"kWh\",VLOOKUP(U$4,'4. Billing Determinants'!$B$19:$Z$41,4,0)/'4. Billing Determinants'!$E$41*$D52,IF($E52=\"kW\",VLOOKUP(U$4,'4. Billing Determinants'!$B$19:$Z$41,5,0)/'4. Billing Determinants'!$F$41*$D52,IF($E52=\"Non-RPP kWh\",VLOOKUP(U$4,'4. Billing Determinants'!$B$19:$Z$41,6,0)/'4. Billing Determinants'!$G$41*$D52,IF($E52=\"Distribution Rev.\",VLOOKUP(U$4,'4. Billing Determinants'!$B$19:$Z$41,8,0)/'4. Billing Determinants'!$I$41*$D52, VLOOKUP(U$4,'4. Billing Determinants'!$B$19:$Z$41,3,0)/'4. Billing Determinants'!$D$41*$D52))))),0)","v":0},{"$f":"IFERROR(IF(V$4=\"\",0,IF($E52=\"kWh\",VLOOKUP(V$4,'4. Billing Determinants'!$B$19:$Z$41,4,0)/'4. Billing Determinants'!$E$41*$D52,IF($E52=\"kW\",VLOOKUP(V$4,'4. Billing Determinants'!$B$19:$Z$41,5,0)/'4. Billing Determinants'!$F$41*$D52,IF($E52=\"Non-RPP kWh\",VLOOKUP(V$4,'4. Billing Determinants'!$B$19:$Z$41,6,0)/'4. Billing Determinants'!$G$41*$D52,IF($E52=\"Distribution Rev.\",VLOOKUP(V$4,'4. Billing Determinants'!$B$19:$Z$41,8,0)/'4. Billing Determinants'!$I$41*$D52, VLOOKUP(V$4,'4. Billing Determinants'!$B$19:$Z$41,3,0)/'4. Billing Determinants'!$D$41*$D52))))),0)","v":0},{"$f":"IFERROR(IF(W$4=\"\",0,IF($E52=\"kWh\",VLOOKUP(W$4,'4. Billing Determinants'!$B$19:$Z$41,4,0)/'4. Billing Determinants'!$E$41*$D52,IF($E52=\"kW\",VLOOKUP(W$4,'4. Billing Determinants'!$B$19:$Z$41,5,0)/'4. Billing Determinants'!$F$41*$D52,IF($E52=\"Non-RPP kWh\",VLOOKUP(W$4,'4. Billing Determinants'!$B$19:$Z$41,6,0)/'4. Billing Determinants'!$G$41*$D52,IF($E52=\"Distribution Rev.\",VLOOKUP(W$4,'4. Billing Determinants'!$B$19:$Z$41,8,0)/'4. Billing Determinants'!$I$41*$D52, VLOOKUP(W$4,'4. Billing Determinants'!$B$19:$Z$41,3,0)/'4. Billing Determinants'!$D$41*$D52))))),0)","v":0},{"$f":"IFERROR(IF(X$4=\"\",0,IF($E52=\"kWh\",VLOOKUP(X$4,'4. Billing Determinants'!$B$19:$Z$41,4,0)/'4. Billing Determinants'!$E$41*$D52,IF($E52=\"kW\",VLOOKUP(X$4,'4. Billing Determinants'!$B$19:$Z$41,5,0)/'4. Billing Determinants'!$F$41*$D52,IF($E52=\"Non-RPP kWh\",VLOOKUP(X$4,'4. Billing Determinants'!$B$19:$Z$41,6,0)/'4. Billing Determinants'!$G$41*$D52,IF($E52=\"Distribution Rev.\",VLOOKUP(X$4,'4. Billing Determinants'!$B$19:$Z$41,8,0)/'4. Billing Determinants'!$I$41*$D52, VLOOKUP(X$4,'4. Billing Determinants'!$B$19:$Z$41,3,0)/'4. Billing Determinants'!$D$41*$D52))))),0)","v":0},{"$f":"IFERROR(IF(Y$4=\"\",0,IF($E52=\"kWh\",VLOOKUP(Y$4,'4. Billing Determinants'!$B$19:$Z$41,4,0)/'4. Billing Determinants'!$E$41*$D52,IF($E52=\"kW\",VLOOKUP(Y$4,'4. Billing Determinants'!$B$19:$Z$41,5,0)/'4. Billing Determinants'!$F$41*$D52,IF($E52=\"Non-RPP kWh\",VLOOKUP(Y$4,'4. Billing Determinants'!$B$19:$Z$41,6,0)/'4. Billing Determinants'!$G$41*$D52,IF($E52=\"Distribution Rev.\",VLOOKUP(Y$4,'4. Billing Determinants'!$B$19:$Z$41,8,0)/'4. Billing Determinants'!$I$41*$D52, VLOOKUP(Y$4,'4. Billing Determinants'!$B$19:$Z$41,3,0)/'4. Billing Determinants'!$D$41*$D52))))),0)","v":0}]
[null,"Total Balance Allocated to each class for Accounts 1575 and 1576",null,{"$f":"SUM(D51:D52)","v":0},null,{"$f":"SUM(F51:F52)","v":0},{"$f":"SUM(G51:G52)","v":0},0,0,0,0,0,0,0,0,0,0,0,0,0,0,0,0,0,0]
[]
[null,"Account 1589 reference calculation by customer and consumption"]
[null,"Account 1589 / Number of Customers",{"$f":"IF(ISERROR('2. 2015 Continuity Schedule'!BS41/'4. Billing Determinants'!D41), 0, '2. 2015 Continuity Schedule'!BS41/'4. Billing Determinants'!D41)","v":28.546093130906669}]
[null,"1589/total kwh",{"$f":"IF(ISERROR('2. 2015 Continuity Schedule'!BS41/'4. Billing Determinants'!E41), 0, '2. 2015 Continuity Schedule'!BS41/'4. Billing Determinants'!E41)","v":1.2639027768688411E-3}]

{"sheet":"6. Rate Rider Calculations","index":5,"n_rows":201,"n_cols":7,"rows_kept":201,"cut":false,"hidden":false,"merged":[[69,1,70,1],[69,2,70,2],[17,3,18,3],[17,4,18,4],[17,5,18,5],[69,4,70,4],[69,5,70,5],[69,3,70,3],[17,1,18,1],[17,2,18,2],[43,1,44,1],[43,2,44,2],[43,3,44,3],[43,4,44,4],[43,5,44,5],[150,1,151,1],[150,2,151,2],[150,3,151,3],[150,4,151,4],[150,5,151,5],[178,1,179,1],[178,2,179,2],[178,3,179,3],[178,4,179,4],[178,5,179,5],[95,1,96,1],[95,2,96,2],[95,3,96,3],[95,4,96,4],[95,5,96,5],[122,1,123,1],[122,2,123,2],[122,3,123,3],[122,4,123,4],[122,5,123,5]]}
[]
[]
[]
[]
[]
[]
[]
[]
[]
[]
[]
[]
[null," Please indicate the Rate Rider Recovery Period (in years)",null,1]
[]
[]
[null,"Rate Rider Calculation for Deferral / Variance Accounts Balances (excluding Global Adj.)"]
[null,"1550, 1551, 1584, 1586, 1595"]
[null,"Rate Class \n(Enter Rate Classes in cells below)","Units","kW / kWh / # of Customers","Allocated Balance (excluding 1589)","Rate Rider for Deferral/Variance Accounts"]
[]
[null,{"$f":"IF(ISBLANK('4. Billing Determinants'!$B21), \"\", '4. Billing Determinants'!$B21)","v":"RESIDENTIAL"},{"$f":"IF(ISBLANK('4. Billing Determinants'!C21), \"\", '4. Billing Determinants'!C21)","v":"kWh"},{"$f":"IF(C20=\"\", 0, IF(C20=\"kWh\", '4. Billing Determinants'!E21, IF(C20=\"kW\", '4. Billing Determinants'!F21, '4. Billing Determinants'!D21)))","v":1637504595.5259821},{"$f":"HLOOKUP($B20, '5. Allocation of Balances'!$D$4:$Z$53, 40,FALSE)","v":1925731.587771243},{"$f":"IF(ISERROR(E20/D20), 0, IF(C20=\"# of Customers\", E20/D20/12/$D$13, E20/D20/$D$13))","v":1.1760159898376833E-3},{"$f":"IF(C20=\"\", \"\", IF(C20=\"# of Customers\", \"per customer per month\", \"$/\"&C20))","v":"$/kWh"}]
[null,{"$f":"IF(ISBLANK('4. Billing Determinants'!$B22), \"\", '4. Billing Determinants'!$B22)","v":"GENERAL SERVICE LESS THAN 50 KW"},{"$f":"IF(ISBLANK('4. Billing Determinants'!C22), \"\", '4. Billing Determinants'!C22)","v":"kWh"},{"$f":"IF(C21=\"\", 0, IF(C21=\"kWh\", '4. Billing Determinants'!E22, IF(C21=\"kW\", '4. Billing Determinants'!F22, '4. Billing Determinants'!D22)))","v":591826168.94057333},{"$f":"HLOOKUP($B21, '5. Allocation of Balances'!$D$4:$Z$53, 40,FALSE)","v":700904.53937620146},{"$f":"IF(ISERROR(E21/D21), 0, IF(C21=\"# of Customers\", E21/D21/12/$D$13, E21/D21/$D$13))","v":1.184308123162058E-3},{"$f":"IF(C21=\"\", \"\", IF(C21=\"# of Customers\", \"per customer per month\", \"$/\"&C21))","v":"$/kWh"}]
[null,{"$f":"IF(ISBLANK('4. Billing Determinants'!$B23), \"\", '4. Billing Determinants'!$B23)","v":"GENERAL SERVICE 50 TO 4,999 KW"},{"$f":"IF(ISBLANK('4. Billing Determinants'!C23), \"\", '4. Billing Determinants'!C23)","v":"kW"},{"$f":"IF(C22=\"\", 0, IF(C22=\"kWh\", '4. Billing Determinants'!E23, IF(C22=\"kW\", '4. Billing Determinants'!F23, '4. Billing Determinants'!D23)))","v":5099311.3147127545},{"$f":"HLOOKUP($B22, '5. Allocation of Balances'!$D$4:$Z$53, 40,FALSE)","v":2204726.434059028},0.43235768479124931,"$/kW"]
[null,{"$f":"IF(ISBLANK('4. Billing Determinants'!$B24), \"\", '4. Billing Determinants'!$B24)","v":"LARGE USE (1)"},{"$f":"IF(ISBLANK('4. Billing Determinants'!C24), \"\", '4. Billing Determinants'!C24)","v":"kW"},{"$f":"IF(C23=\"\", 0, IF(C23=\"kWh\", '4. Billing Determinants'!E24, IF(C23=\"kW\", '4. Billing Determinants'!F24, '4. Billing Determinants'!D24)))","v":538661.30172098242},{"$f":"HLOOKUP($B23, '5. Allocation of Balances'!$D$4:$Z$53, 40,FALSE)","v":318194.79439263651},0.59071404122781423,"$/kW"]
[null,{"$f":"IF(ISBLANK('4. Billing Determinants'!$B25), \"\", '4. Billing Determinants'!$B25)","v":"LARGE USE (2)"},{"$f":"IF(ISBLANK('4. Billing Determinants'!C25), \"\", '4. Billing Determinants'!C25)","v":"kW"},{"$f":"IF(C24=\"\", 0, IF(C24=\"kWh\", '4. Billing Determinants'!E25, IF(C24=\"kW\", '4. Billing Determinants'!F25, '4. Billing Determinants'!D25)))","v":2021163.209658579},{"$f":"HLOOKUP($B24, '5. Allocation of Balances'!$D$4:$Z$53, 40,FALSE)","v":1340753.5580156951},0.66335739321228748,"$/kW"]
[null,{"$f":"IF(ISBLANK('4. Billing Determinants'!$B26), \"\", '4. Billing Determinants'!$B26)","v":"UNMETERED SCATTERED LOAD"},{"$f":"IF(ISBLANK('4. Billing Determinants'!C26), \"\", '4. Billing Determinants'!C26)","v":"kWh"},{"$f":"IF(C25=\"\", 0, IF(C25=\"kWh\", '4. Billing Determinants'!E26, IF(C25=\"kW\", '4. Billing Determinants'!F26, '4. Billing Determinants'!D26)))","v":11174330.720076239},{"$f":"HLOOKUP($B25, '5. Allocation of Balances'!$D$4:$Z$53, 40,FALSE)","v":13261.56119245182},1.186787962935944E-3,"$/kWh"]
[null,{"$f":"IF(ISBLANK('4. Billing Determinants'!$B27), \"\", '4. Billing Determinants'!$B27)","v":"SENTINEL LIGHTING"},{"$f":"IF(ISBLANK('4. Billing Determinants'!C27), \"\", '4. Billing Determinants'!C27)","v":"kW"},{"$f":"IF(C26=\"\", 0, IF(C26=\"kWh\", '4. Billing Determinants'!E27, IF(C26=\"kW\", '4. Billing Determinants'!F27, '4. Billing Determinants'!D27)))","v":1185.4190801856691},{"$f":"HLOOKUP($B26, '5. Allocation of Balances'!$D$4:$Z$53, 40,FALSE)","v":497.2408794178271},0.41946421120532795,"$/kW"]
[null,{"$f":"IF(ISBLANK('4. Billing Determinants'!$B28), \"\", '4. Billing Determinants'!$B28)","v":"STREET LIGHTING"},{"$f":"IF(ISBLANK('4. Billing Determinants'!C28), \"\", '4. Billing Determinants'!C28)","v":"kW"},{"$f":"IF(C27=\"\", 0, IF(C27=\"kWh\", '4. Billing Determinants'!E28, IF(C27=\"kW\", '4. Billing Determinants'!F28, '4. Billing Determinants'!D28)))","v":109947.98480445624},{"$f":"HLOOKUP($B27, '5. Allocation of Balances'!$D$4:$Z$53, 40,FALSE)","v":46999.815949905416},0.42747319137767859,"$/kW"]
[null,{"$f":"IF(ISBLANK('4. Billing Determinants'!$B29), \"\", '4. Billing Determinants'!$B29)","v":"STANDBY POWER"},{"$f":"IF(ISBLANK('4. Billing Determinants'!C29), \"\", '4. Billing Determinants'!C29)","v":"kW"},{"$f":"IF(C28=\"\", 0, IF(C28=\"kWh\", '4. Billing Determinants'!E29, IF(C28=\"kW\", '4. Billing Determinants'!F29, '4. Billing Determinants'!D29)))","v":300137.41770060419},{"$f":"HLOOKUP($B28, '5. Allocation of Balances'!$D$4:$Z$53, 40,FALSE)","v":0},0,"$/kW"]
[null,{"$f":"IF(ISBLANK('4. Billing Determinants'!$B30), \"\", '4. Billing Determinants'!$B30)","v":""},{"$f":"IF(ISBLANK('4. Billing Determinants'!C30), \"\", '4. Billing Determinants'!C30)","v":""},{"$f":"IF(C29=\"\", 0, IF(C29=\"kWh\", '4. Billing Determinants'!E30, IF(C29=\"kW\", '4. Billing Determinants'!F30, '4. Billing Determinants'!D30)))","v":0},{"$f":"HLOOKUP($B29, '5. Allocation of Balances'!$D$4:$Z$53, 40,FALSE)","v":0},0,""]
[null,{"$f":"IF(ISBLANK('4. Billing Determinants'!$B31), \"\", '4. Billing Determinants'!$B31)","v":""},{"$f":"IF(ISBLANK('4. Billing Determinants'!C31), \"\", '4. Billing Determinants'!C31)","v":""},{"$f":"IF(C30=\"\", 0, IF(C30=\"kWh\", '4. Billing Determinants'!E31, IF(C30=\"kW\", '4. Billing Determinants'!F31, '4. Billing Determinants'!D31)))","v":0},{"$f":"HLOOKUP($B30, '5. Allocation of Balances'!$D$4:$Z$53, 40,FALSE)","v":0},0,""]
[null,{"$f":"IF(ISBLANK('4. Billing Determinants'!$B32), \"\", '4. Billing Determinants'!$B32)","v":""},{"$f":"IF(ISBLANK('4. Billing Determinants'!C32), \"\", '4. Billing Determinants'!C32)","v":""},{"$f":"IF(C31=\"\", 0, IF(C31=\"kWh\", '4. Billing Determinants'!E32, IF(C31=\"kW\", '4. Billing Determinants'!F32, '4. Billing Determinants'!D32)))","v":0},{"$f":"HLOOKUP($B31, '5. Allocation of Balances'!$D$4:$Z$53, 40,FALSE)","v":0},0,""]
[null,{"$f":"IF(ISBLANK('4. Billing Determinants'!$B33), \"\", '4. Billing Determinants'!$B33)","v":""},{"$f":"IF(ISBLANK('4. Billing Determinants'!C33), \"\", '4. Billing Determinants'!C33)","v":""},{"$f":"IF(C32=\"\", 0, IF(C32=\"kWh\", '4. Billing Determinants'!E33, IF(C32=\"kW\", '4. Billing Determinants'!F33, '4. Billing Determinants'!D33)))","v":0},{"$f":"HLOOKUP($B32, '5. Allocation of Balances'!$D$4:$Z$53, 40,FALSE)","v":0},0,""]
[null,{"$f":"IF(ISBLANK('4. Billing Determinants'!$B34), \"\", '4. Billing Determinants'!$B34)","v":""},{"$f":"IF(ISBLANK('4. Billing Determinants'!C34), \"\", '4. Billing Determinants'!C34)","v":""},{"$f":"IF(C33=\"\", 0, IF(C33=\"kWh\", '4. Billing Determinants'!E34, IF(C33=\"kW\", '4. Billing Determinants'!F34, '4. Billing Determinants'!D34)))","v":0},{"$f":"HLOOKUP($B33, '5. Allocation of Balances'!$D$4:$Z$53, 40,FALSE)","v":0},0,""]
[null,{"$f":"IF(ISBLANK('4. Billing Determinants'!$B35), \"\", '4. Billing Determinants'!$B35)","v":""},{"$f":"IF(ISBLANK('4. Billing Determinants'!C35), \"\", '4. Billing Determinants'!C35)","v":""},{"$f":"IF(C34=\"\", 0, IF(C34=\"kWh\", '4. Billing Determinants'!E35, IF(C34=\"kW\", '4. Billing Determinants'!F35, '4. Billing Determinants'!D35)))","v":0},{"$f":"HLOOKUP($B34, '5. Allocation of Balances'!$D$4:$Z$53, 40,FALSE)","v":0},0,""]
[null,{"$f":"IF(ISBLANK('4. Billing Determinants'!$B36), \"\", '4. Billing Determinants'!$B36)","v":""},{"$f":"IF(ISBLANK('4. Billing Determinants'!C36), \"\", '4. Billing Determinants'!C36)","v":""},{"$f":"IF(C35=\"\", 0, IF(C35=\"kWh\", '4. Billing Determinants'!E36, IF(C35=\"kW\", '4. Billing Determinants'!F36, '4. Billing Determinants'!D36)))","v":0},{"$f":"HLOOKUP($B35, '5. Allocation of Balances'!$D$4:$Z$53, 40,FALSE)","v":0},0,""]
[null,{"$f":"IF(ISBLANK('4. Billing Determinants'!$B37), \"\", '4. Billing Determinants'!$B37)","v":""},{"$f":"IF(ISBLANK('4. Billing Determinants'!C37), \"\", '4. Billing Determinants'!C37)","v":""},{"$f":"IF(C36=\"\", 0, IF(C36=\"kWh\", '4. Billing Determinants'!E37, IF(C36=\"kW\", '4. Billing Determinants'!F37, '4. Billing Determinants'!D37)))","v":0},{"$f":"HLOOKUP($B36, '5. Allocation of Balances'!$D$4:$Z$53, 40,FALSE)","v":0},0,""]
[null,{"$f":"IF(ISBLANK('4. Billing Determinants'!$B38), \"\", '4. Billing Determinants'!$B38)","v":""},{"$f":"IF(ISBLANK('4. Billing Determinants'!C38), \"\", '4. Billing Determinants'!C38)","v":""},{"$f":"IF(C37=\"\", 0, IF(C37=\"kWh\", '4. Billing Determinants'!E38, IF(C37=\"kW\", '4. Billing Determinants'!F38, '4. Billing Determinants'!D38)))","v":0},{"$f":"HLOOKUP($B37, '5. Allocation of Balances'!$D$4:$Z$53, 40,FALSE)","v":0},0,""]
[null,{"$f":"IF(ISBLANK('4. Billing Determinants'!$B39), \"\", '4. Billing Determinants'!$B39)","v":""},{"$f":"IF(ISBLANK('4. Billing Determinants'!C39), \"\", '4. Billing Determinants'!C39)","v":""},{"$f":"IF(C38=\"\", 0, IF(C38=\"kWh\", '4. Billing Determinants'!E39, IF(C38=\"kW\", '4. Billing Determinants'!F39, '4. Billing Determinants'!D39)))","v":0},{"$f":"HLOOKUP($B38, '5. Allocation of Balances'!$D$4:$Z$53, 40,FALSE)","v":0},0,""]
[null,{"$f":"IF(ISBLANK('4. Billing Determinants'!$B40), \"\", '4. Billing Determinants'!$B40)","v":""},{"$f":"IF(ISBLANK('4. Billing Determinants'!C40), \"\", '4. Billing Determinants'!C40)","v":""},{"$f":"IF(C39=\"\", 0, IF(C39=\"kWh\", '4. Billing Determinants'!E40, IF(C39=\"kW\", '4. Billing Determinants'!F40, '4. Billing Determinants'!D40)))","v":0},{"$f":"HLOOKUP($B39, '5. Allocation of Balances'!$D$4:$Z$53, 40,FALSE)","v":0},0,""]
[null,"Total",null,null,{"$f":"SUM(E20:E39)","v":6551069.531636579}]
[]
[null,"Rate Rider Calculation for Deferral / Variance Accounts Balances (excluding Global Adj.) - NON-WMP"]
[null,"1580 and 1588"]
[null,"Rate Class \n(Enter Rate Classes in cells below)","Units","kW / kWh / # of Customers","Allocated Balance (excluding 1589)","Rate Rider for Deferral/Variance Accounts"]
[]
[null,{"$f":"IF(ISBLANK('4. Billing Determinants'!B21), \"\", '4. Billing Determinants'!B21)","v":"RESIDENTIAL"},{"$f":"IF(ISBLANK('4. Billing Determinants'!C21), \"\", '4. Billing Determinants'!C21)","v":"kWh"},{"$f":"IF(C46=\"\", 0, IF(C46=\"kWh\", '4. Billing Determinants'!L21, IF(C46=\"kW\", '4. Billing Determinants'!M21, '4. Billing Determinants'!D21)))","v":1637504595.5259821},{"$f":"HLOOKUP($B46, '5. Allocation of Balances'!$D$4:$Z$53, 41,FALSE)","v":-1388600.100576719},{"$f":"IF(ISERROR(E46/D46), 0, IF(C46=\"# of Customers\", E46/D46/12/$D$13, E46/D46/$D$13))","v":-8.4799768157639121E-4},{"$f":"IF(C46=\"\", \"\", IF(C46=\"# of Customers\", \"per customer per month\", \"$/\"&C46))","v":"$/kWh"}]
[null,{"$f":"IF(ISBLANK('4. Billing Determinants'!B22), \"\", '4. Billing Determinants'!B22)","v":"GENERAL SERVICE LESS THAN 50 KW"},{"$f":"IF(ISBLANK('4. Billing Determinants'!C22), \"\", '4. Billing Determinants'!C22)","v":"kWh"},{"$f":"IF(C47=\"\", 0, IF(C47=\"kWh\", '4. Billing Determinants'!L22, IF(C47=\"kW\", '4. Billing Determinants'!M22, '4. Billing Determinants'!D22)))","v":591826168.94057333},{"$f":"HLOOKUP($B47, '5. Allocation of Balances'!$D$4:$Z$53, 41,FALSE)","v":-501867.21915784385},{"$f":"IF(ISERROR(E47/D47), 0, IF(C47=\"# of Customers\", E47/D47/12/$D$13, E47/D47/$D$13))","v":-8.4799768157639132E-4},{"$f":"IF(C47=\"\", \"\", IF(C47=\"# of Customers\", \"per customer per month\", \"$/\"&C47))","v":"$/kWh"}]
[null,{"$f":"IF(ISBLANK('4. Billing Determinants'!B23), \"\", '4. Billing Determinants'!B23)","v":"GENERAL SERVICE 50 TO 4,999 KW"},{"$f":"IF(ISBLANK('4. Billing Determinants'!C23), \"\", '4. Billing Determinants'!C23)","v":"kW"},{"$f":"IF(C48=\"\", 0, IF(C48=\"kWh\", '4. Billing Determinants'!L23, IF(C48=\"kW\", '4. Billing Determinants'!M23, '4. Billing Determinants'!D23)))","v":5078236.4593356587},{"$f":"HLOOKUP($B48, '5. Allocation of Balances'!$D$4:$Z$53, 41,FALSE)","v":-1568836.315575985},-0.30893329370118028,"$/kW"]
[null,{"$f":"IF(ISBLANK('4. Billing Determinants'!B24), \"\", '4. Billing Determinants'!B24)","v":"LARGE USE (1)"},{"$f":"IF(ISBLANK('4. Billing Determinants'!C24), \"\", '4. Billing Determinants'!C24)","v":"kW"},{"$f":"IF(C49=\"\", 0, IF(C49=\"kWh\", '4. Billing Determinants'!L24, IF(C49=\"kW\", '4. Billing Determinants'!M24, '4. Billing Determinants'!D24)))","v":431903.36616456014},{"$f":"HLOOKUP($B49, '5. Allocation of Balances'!$D$4:$Z$53, 41,FALSE)","v":-194137.54097602941},-0.44949300279836391,"$/kW"]
[null,{"$f":"IF(ISBLANK('4. Billing Determinants'!B25), \"\", '4. Billing Determinants'!B25)","v":"LARGE USE (2)"},{"$f":"IF(ISBLANK('4. Billing Determinants'!C25), \"\", '4. Billing Determinants'!C25)","v":"kW"},{"$f":"IF(C50=\"\", 0, IF(C50=\"kWh\", '4. Billing Determinants'!L25, IF(C50=\"kW\", '4. Billing Determinants'!M25, '4. Billing Determinants'!D25)))","v":809583.12468861276},{"$f":"HLOOKUP($B50, '5. Allocation of Balances'!$D$4:$Z$53, 41,FALSE)","v":-323848.31830849184},-0.4000186125829297,"$/kW"]
[null,{"$f":"IF(ISBLANK('4. Billing Determinants'!B26), \"\", '4. Billing Determinants'!B26)","v":"UNMETERED SCATTERED LOAD"},{"$f":"IF(ISBLANK('4. Billing Determinants'!C26), \"\", '4. Billing Determinants'!C26)","v":"kWh"},{"$f":"IF(C51=\"\", 0, IF(C51=\"kWh\", '4. Billing Determinants'!L26, IF(C51=\"kW\", '4. Billing Determinants'!M26, '4. Billing Determinants'!D26)))","v":11174330.720076239},{"$f":"HLOOKUP($B51, '5. Allocation of Balances'!$D$4:$Z$53, 41,FALSE)","v":-9475.8065437924979},-8.4799768157639132E-4,"$/kWh"]
[null,{"$f":"IF(ISBLANK('4. Billing Determinants'!B27), \"\", '4. Billing Determinants'!B27)","v":"SENTINEL LIGHTING"},{"$f":"IF(ISBLANK('4. Billing Determinants'!C27), \"\", '4. Billing Determinants'!C27)","v":"kW"},{"$f":"IF(C52=\"\", 0, IF(C52=\"kWh\", '4. Billing Determinants'!L27, IF(C52=\"kW\", '4. Billing Determinants'!M27, '4. Billing Determinants'!D27)))","v":1185.4190801856691},{"$f":"HLOOKUP($B52, '5. Allocation of Balances'!$D$4:$Z$53, 41,FALSE)","v":-355.29439638753911},-0.29972049743951334,"$/kW"]
[null,{"$f":"IF(ISBLANK('4. Billing Determinants'!B28), \"\", '4. Billing Determinants'!B28)","v":"STREET LIGHTING"},{"$f":"IF(ISBLANK('4. Billing Determinants'!C28), \"\", '4. Billing Determinants'!C28)","v":"kW"},{"$f":"IF(C53=\"\", 0, IF(C53=\"kWh\", '4. Billing Determinants'!L28, IF(C53=\"kW\", '4. Billing Determinants'!M28, '4. Billing Determinants'!D28)))","v":109947.98480445624},{"$f":"HLOOKUP($B53, '5. Allocation of Balances'!$D$4:$Z$53, 41,FALSE)","v":-33582.86080138485},-0.30544316806817656,"$/kW"]
[null,{"$f":"IF(ISBLANK('4. Billing Determinants'!B29), \"\", '4. Billing Determinants'!B29)","v":"STANDBY POWER"},{"$f":"IF(ISBLANK('4. Billing Determinants'!C29), \"\", '4. Billing Determinants'!C29)","v":"kW"},{"$f":"IF(C54=\"\", 0, IF(C54=\"kWh\", '4. Billing Determinants'!L29, IF(C54=\"kW\", '4. Billing Determinants'!M29, '4. Billing Determinants'!D29)))","v":300137.41770060419},{"$f":"HLOOKUP($B54, '5. Allocation of Balances'!$D$4:$Z$53, 41,FALSE)","v":0},0,"$/kW"]
[null,{"$f":"IF(ISBLANK('4. Billing Determinants'!B30), \"\", '4. Billing Determinants'!B30)","v":""},{"$f":"IF(ISBLANK('4. Billing Determinants'!C30), \"\", '4. Billing Determinants'!C30)","v":""},{"$f":"IF(C55=\"\", 0, IF(C55=\"kWh\", '4. Billing Determinants'!L30, IF(C55=\"kW\", '4. Billing Determinants'!M30, '4. Billing Determinants'!D30)))","v":0},{"$f":"HLOOKUP($B55, '5. Allocation of Balances'!$D$4:$Z$53, 41,FALSE)","v":0},0,""]
[null,{"$f":"IF(ISBLANK('4. Billing Determinants'!B31), \"\", '4. Billing Determinants'!B31)","v":""},{"$f":"IF(ISBLANK('4. Billing Determinants'!C31), \"\", '4. Billing Determinants'!C31)","v":""},{"$f":"IF(C56=\"\", 0, IF(C56=\"kWh\", '4. Billing Determinants'!L31, IF(C56=\"kW\", '4. Billing Determinants'!M31, '4. Billing Determinants'!D31)))","v":0},{"$f":"HLOOKUP($B56, '5. Allocation of Balances'!$D$4:$Z$53, 41,FALSE)","v":0},0,""]
[null,{"$f":"IF(ISBLANK('4. Billing Determinants'!B32), \"\", '4. Billing Determinants'!B32)","v":""},{"$f":"IF(ISBLANK('4. Billing Determinants'!C32), \"\", '4. Billing Determinants'!C32)","v":""},{"$f":"IF(C57=\"\", 0, IF(C57=\"kWh\", '4. Billing Determinants'!L32, IF(C57=\"kW\", '4. Billing Determinants'!M32, '4. Billing Determinants'!D32)))","v":0},{"$f":"HLOOKUP($B57, '5. Allocation of Balances'!$D$4:$Z$53, 41,FALSE)","v":0},0,""]
[null,{"$f":"IF(ISBLANK('4. Billing Determinants'!B33), \"\", '4. Billing Determinants'!B33)","v":""},{"$f":"IF(ISBLANK('4. Billing Determinants'!C33), \"\", '4. Billing Determinants'!C33)","v":""},{"$f":"IF(C58=\"\", 0, IF(C58=\"kWh\", '4. Billing Determinants'!L33, IF(C58=\"kW\", '4. Billing Determinants'!M33, '4. Billing Determinants'!D33)))","v":0},{"$f":"HLOOKUP($B58, '5. Allocation of Balances'!$D$4:$Z$53, 41,FALSE)","v":0},0,""]
[null,{"$f":"IF(ISBLANK('4. Billing Determinants'!B34), \"\", '4. Billing Determinants'!B34)","v":""},{"$f":"IF(ISBLANK('4. Billing Determinants'!C34), \"\", '4. Billing Determinants'!C34)","v":""},{"$f":"IF(C59=\"\", 0, IF(C59=\"kWh\", '4. Billing Determinants'!L34, IF(C59=\"kW\", '4. Billing Determinants'!M34, '4. Billing Determinants'!D34)))","v":0},{"$f":"HLOOKUP($B59, '5. Allocation of Balances'!$D$4:$Z$53, 41,FALSE)","v":0},0,""]
[null,{"$f":"IF(ISBLANK('4. Billing Determinants'!B35), \"\", '4. Billing Determinants'!B35)","v":""},{"$f":"IF(ISBLANK('4. Billing Determinants'!C35), \"\", '4. Billing Determinants'!C35)","v":""},{"$f":"IF(C60=\"\", 0, IF(C60=\"kWh\", '4. Billing Determinants'!L35, IF(C60=\"kW\", '4. Billing Determinants'!M35, '4. Billing Determinants'!D35)))","v":0},{"$f":"HLOOKUP($B60, '5. Allocation of Balances'!$D$4:$Z$53, 41,FALSE)","v":0},0,""]
[null,{"$f":"IF(ISBLANK('4. Billing Determinants'!B36), \"\", '4. Billing Determinants'!B36)","v":""},{"$f":"IF(ISBLANK('4. Billing Determinants'!C36), \"\", '4. Billing Determinants'!C36)","v":""},{"$f":"IF(C61=\"\", 0, IF(C61=\"kWh\", '4. Billing Determinants'!L36, IF(C61=\"kW\", '4. Billing Determinants'!M36, '4. Billing Determinants'!D36)))","v":0},{"$f":"HLOOKUP($B61, '5. Allocation of Balances'!$D$4:$Z$53, 41,FALSE)","v":0},0,""]
[null,{"$f":"IF(ISBLANK('4. Billing Determinants'!B37), \"\", '4. Billing Determinants'!B37)","v":""},{"$f":"IF(ISBLANK('4. Billing Determinants'!C37), \"\", '4. Billing Determinants'!C37)","v":""},{"$f":"IF(C62=\"\", 0, IF(C62=\"kWh\", '4. Billing Determinants'!L37, IF(C62=\"kW\", '4. Billing Determinants'!M37, '4. Billing Determinants'!D37)))","v":0},{"$f":"HLOOKUP($B62, '5. Allocation of Balances'!$D$4:$Z$53, 41,FALSE)","v":0},0,""]
[null,{"$f":"IF(ISBLANK('4. Billing Determinants'!B38), \"\", '4. Billing Determinants'!B38)","v":""},{"$f":"IF(ISBLANK('4. Billing Determinants'!C38), \"\", '4. Billing Determinants'!C38)","v":""},{"$f":"IF(C63=\"\", 0, IF(C63=\"kWh\", '4. Billing Determinants'!L38, IF(C63=\"kW\", '4. Billing Determinants'!M38, '4. Billing Determinants'!D38)))","v":0},{"$f":"HLOOKUP($B63, '5. Allocation of Balances'!$D$4:$Z$53, 41,FALSE)","v":0},0,""]
[null,{"$f":"IF(ISBLANK('4. Billing Determinants'!B39), \"\", '4. Billing Determinants'!B39)","v":""},{"$f":"IF(ISBLANK('4. Billing Determinants'!C39), \"\", '4. Billing Determinants'!C39)","v":""},{"$f":"IF(C64=\"\", 0, IF(C64=\"kWh\", '4. Billing Determinants'!L39, IF(C64=\"kW\", '4. Billing Determinants'!M39, '4. Billing Determinants'!D39)))","v":0},{"$f":"HLOOKUP($B64, '5. Allocation of Balances'!$D$4:$Z$53, 41,FALSE)","v":0},0,""]
[null,{"$f":"IF(ISBLANK('4. Billing Determinants'!B40), \"\", '4. Billing Determinants'!B40)","v":""},{"$f":"IF(ISBLANK('4. Billing Determinants'!C40), \"\", '4. Billing Determinants'!C40)","v":""},{"$f":"IF(C65=\"\", 0, IF(C65=\"kWh\", '4. Billing Determinants'!L40, IF(C65=\"kW\", '4. Billing Determinants'!M40, '4. Billing Determinants'!D40)))","v":0},{"$f":"HLOOKUP($B65, '5. Allocation of Balances'!$D$4:$Z$53, 41,FALSE)","v":0},0,""]
[null,"Total",null,null,{"$f":"SUM(E46:E65)","v":-4020703.4563366338}]
[]
[null,"Rate Rider Calculation for RSVA - Power - Global Adjustment"]
[null,"Balance of Account 1589 Allocated to Non-WMPs"]
[null,"Rate Class \n(Enter Rate Classes in cells below)","Units","Non-RPP kW / kWh / # of Customers","Balance of RSVA - Power - Global Adjustment","Rate Rider for RSVA - Power - Global Adjustment"]
[]
[null,{"$f":"B20","v":"RESIDENTIAL"},{"$f":"IF(ISBLANK('4. Billing Determinants'!C21), \"\", '4. Billing Determinants'!C21)","v":"kWh"},{"$f":"IF(C72=\"\", 0, IF(C72=\"kWh\", '4. Billing Determinants'!Q21, IF(C72=\"kW\", '4. Billing Determinants'!R21, '4. Billing Determinants'!D21)))","v":145300486.43423963},{"$f":"HLOOKUP($B72, '5. Allocation of Balances'!$D$4:$Z$53, 42,FALSE)","v":535220.4440206174},{"$f":"IF(ISERROR(E72/D72), 0, IF(C72=\"# of Customers\", E72/D72/12/$D$13, E72/D72/$D$13))","v":3.6835419973824278E-3},{"$f":"IF(C72=\"\", \"\", IF(C72=\"# of Customers\", \"per customer per month\", \"$/\"&C72))","v":"$/kWh"}]
[null,"GENERAL SERVICE LESS THAN 50 KW",{"$f":"IF(ISBLANK('4. Billing Determinants'!C22), \"\", '4. Billing Determinants'!C22)","v":"kWh"},{"$f":"IF(C73=\"\", 0, IF(C73=\"kWh\", '4. Billing Determinants'!Q22, IF(C73=\"kW\", '4. Billing Determinants'!R22, '4. Billing Determinants'!D22)))","v":85507586.787769735},{"$f":"HLOOKUP($B73, '5. Allocation of Balances'!$D$4:$Z$53, 42,FALSE)","v":314970.78702757269},{"$f":"IF(ISERROR(E73/D73), 0, IF(C73=\"# of Customers\", E73/D73/12/$D$13, E73/D73/$D$13))","v":3.6835419973824286E-3},{"$f":"IF(C73=\"\", \"\", IF(C73=\"# of Customers\", \"per customer per month\", \"$/\"&C73))","v":"$/kWh"}]
[null,"GENERAL SERVICE 50 TO 4,999 KW",{"$f":"IF(ISBLANK('4. Billing Determinants'!C23), \"\", '4. Billing Determinants'!C23)","v":"kW"},{"$f":"IF(C74=\"\", 0, IF(C74=\"kWh\", '4. Billing Determinants'!Q23, IF(C74=\"kW\", '4. Billing Determinants'!R23, '4. Billing Determinants'!D23)))","v":4409898.5263198037},{"$f":"HLOOKUP($B74, '5. Allocation of Balances'!$D$4:$Z$53, 42,FALSE)","v":5894449.4034804786},1.3366405980319866,"$/kW"]
[null,"LARGE USE (1)",{"$f":"IF(ISBLANK('4. Billing Determinants'!C24), \"\", '4. Billing Determinants'!C24)","v":"kW"},{"$f":"IF(C75=\"\", 0, IF(C75=\"kWh\", '4. Billing Determinants'!Q24, IF(C75=\"kW\", '4. Billing Determinants'!R24, '4. Billing Determinants'!D24)))","v":48301.635930266406},{"$f":"HLOOKUP($B75, '5. Allocation of Balances'!$D$4:$Z$53, 42,FALSE)","v":99302.179672058657},2.0558761159854355,"$/kW"]
[null,"LARGE USE (2)",{"$f":"IF(ISBLANK('4. Billing Determinants'!C25), \"\", '4. Billing Determinants'!C25)","v":"kW"},{"$f":"IF(C76=\"\", 0, IF(C76=\"kWh\", '4. Billing Determinants'!Q25, IF(C76=\"kW\", '4. Billing Determinants'!R25, '4. Billing Determinants'!D25)))","v":0},{"$f":"HLOOKUP($B76, '5. Allocation of Balances'!$D$4:$Z$53, 42,FALSE)","v":4.3911242453842499E-10},0,"$/kW"]
[null,"UNMETERED SCATTERED LOAD",{"$f":"IF(ISBLANK('4. Billing Determinants'!C26), \"\", '4. Billing Determinants'!C26)","v":"kWh"},{"$f":"IF(C77=\"\", 0, IF(C77=\"kWh\", '4. Billing Determinants'!Q26, IF(C77=\"kW\", '4. Billing Determinants'!R26, '4. Billing Determinants'!D26)))","v":2198262.2786688833},{"$f":"HLOOKUP($B77, '5. Allocation of Balances'!$D$4:$Z$53, 42,FALSE)","v":8097.3914247384264},3.6835419973824282E-3,"$/kWh"]
[null,"SENTINEL LIGHTING",{"$f":"IF(ISBLANK('4. Billing Determinants'!C27), \"\", '4. Billing Determinants'!C27)","v":"kW"},{"$f":"IF(C78=\"\", 0, IF(C78=\"kWh\", '4. Billing Determinants'!Q27, IF(C78=\"kW\", '4. Billing Determinants'!R27, '4. Billing Determinants'!D27)))","v":10.901966624542128},{"$f":"HLOOKUP($B78, '5. Allocation of Balances'!$D$4:$Z$53, 42,FALSE)","v":14.193589928052688},1.3019293139368608,"$/kW"]
[null,"STREET LIGHTING",{"$f":"IF(ISBLANK('4. Billing Determinants'!C28), \"\", '4. Billing Determinants'!C28)","v":"kW"},{"$f":"IF(C79=\"\", 0, IF(C79=\"kWh\", '4. Billing Determinants'!Q28, IF(C79=\"kW\", '4. Billing Determinants'!R28, '4. Billing Determinants'!D28)))","v":109314.57208344377},{"$f":"HLOOKUP($B79, '5. Allocation of Balances'!$D$4:$Z$53, 42,FALSE)","v":145037.20954174799},1.3267875158586893,"$/kW"]
[null,"STANDBY POWER",{"$f":"IF(ISBLANK('4. Billing Determinants'!C29), \"\", '4. Billing Determinants'!C29)","v":"kW"},{"$f":"IF(C80=\"\", 0, IF(C80=\"kWh\", '4. Billing Determinants'!Q29, IF(C80=\"kW\", '4. Billing Determinants'!R29, '4. Billing Determinants'!D29)))","v":0},{"$f":"HLOOKUP($B80, '5. Allocation of Balances'!$D$4:$Z$53, 42,FALSE)","v":0},0,"$/kW"]
[null,"",{"$f":"IF(ISBLANK('4. Billing Determinants'!C30), \"\", '4. Billing Determinants'!C30)","v":""},{"$f":"IF(C81=\"\", 0, IF(C81=\"kWh\", '4. Billing Determinants'!Q30, IF(C81=\"kW\", '4. Billing Determinants'!R30, '4. Billing Determinants'!D30)))","v":0},{"$f":"HLOOKUP($B81, '5. Allocation of Balances'!$D$4:$Z$53, 42,FALSE)","v":0},0,""]
[null,"",{"$f":"IF(ISBLANK('4. Billing Determinants'!C31), \"\", '4. Billing Determinants'!C31)","v":""},{"$f":"IF(C82=\"\", 0, IF(C82=\"kWh\", '4. Billing Determinants'!Q31, IF(C82=\"kW\", '4. Billing Determinants'!R31, '4. Billing Determinants'!D31)))","v":0},{"$f":"HLOOKUP($B82, '5. Allocation of Balances'!$D$4:$Z$53, 42,FALSE)","v":0},0,""]
[null,"",{"$f":"IF(ISBLANK('4. Billing Determinants'!C32), \"\", '4. Billing Determinants'!C32)","v":""},{"$f":"IF(C83=\"\", 0, IF(C83=\"kWh\", '4. Billing Determinants'!Q32, IF(C83=\"kW\", '4. Billing Determinants'!R32, '4. Billing Determinants'!D32)))","v":0},{"$f":"HLOOKUP($B83, '5. Allocation of Balances'!$D$4:$Z$53, 42,FALSE)","v":0},0,""]
[null,"",{"$f":"IF(ISBLANK('4. Billing Determinants'!C33), \"\", '4. Billing Determinants'!C33)","v":""},{"$f":"IF(C84=\"\", 0, IF(C84=\"kWh\", '4. Billing Determinants'!Q33, IF(C84=\"kW\", '4. Billing Determinants'!R33, '4. Billing Determinants'!D33)))","v":0},{"$f":"HLOOKUP($B84, '5. Allocation of Balances'!$D$4:$Z$53, 42,FALSE)","v":0},0,""]
[null,"",{"$f":"IF(ISBLANK('4. Billing Determinants'!C34), \"\", '4. Billing Determinants'!C34)","v":""},{"$f":"IF(C85=\"\", 0, IF(C85=\"kWh\", '4. Billing Determinants'!Q34, IF(C85=\"kW\", '4. Billing Determinants'!R34, '4. Billing Determinants'!D34)))","v":0},{"$f":"HLOOKUP($B85, '5. Allocation of Balances'!$D$4:$Z$53, 42,FALSE)","v":0},0,""]
[null,"",{"$f":"IF(ISBLANK('4. Billing Determinants'!C35), \"\", '4. Billing Determinants'!C35)","v":""},{"$f":"IF(C86=\"\", 0, IF(C86=\"kWh\", '4. Billing Determinants'!Q35, IF(C86=\"kW\", '4. Billing Determinants'!R35, '4. Billing Determinants'!D35)))","v":0},{"$f":"HLOOKUP($B86, '5. Allocation of Balances'!$D$4:$Z$53, 42,FALSE)","v":0},0,""]
[null,"",{"$f":"IF(ISBLANK('4. Billing Determinants'!C36), \"\", '4. Billing Determinants'!C36)","v":""},{"$f":"IF(C87=\"\", 0, IF(C87=\"kWh\", '4. Billing Determinants'!Q36, IF(C87=\"kW\", '4. Billing Determinants'!R36, '4. Billing Determinants'!D36)))","v":0},{"$f":"HLOOKUP($B87, '5. Allocation of Balances'!$D$4:$Z$53, 42,FALSE)","v":0},0,""]
[null,"",{"$f":"IF(ISBLANK('4. Billing Determinants'!C37), \"\", '4. Billing Determinants'!C37)","v":""},{"$f":"IF(C88=\"\", 0, IF(C88=\"kWh\", '4. Billing Determinants'!Q37, IF(C88=\"kW\", '4. Billing Determinants'!R37, '4. Billing Determinants'!D37)))","v":0},{"$f":"HLOOKUP($B88, '5. Allocation of Balances'!$D$4:$Z$53, 42,FALSE)","v":0},0,""]
[null,"",{"$f":"IF(ISBLANK('4. Billing Determinants'!C38), \"\", '4. Billing Determinants'!C38)","v":""},{"$f":"IF(C89=\"\", 0, IF(C89=\"kWh\", '4. Billing Determinants'!Q38, IF(C89=\"kW\", '4. Billing Determinants'!R38, '4. Billing Determinants'!D38)))","v":0},{"$f":"HLOOKUP($B89, '5. Allocation of Balances'!$D$4:$Z$53, 42,FALSE)","v":0},0,""]
[null,"",{"$f":"IF(ISBLANK('4. Billing Determinants'!C39), \"\", '4. Billing Determinants'!C39)","v":""},{"$f":"IF(C90=\"\", 0, IF(C90=\"kWh\", '4. Billing Determinants'!Q39, IF(C90=\"kW\", '4. Billing Determinants'!R39, '4. Billing Determinants'!D39)))","v":0},{"$f":"HLOOKUP($B90, '5. Allocation of Balances'!$D$4:$Z$53, 42,FALSE)","v":0},0,""]
[null,"",{"$f":"IF(ISBLANK('4. Billing Determinants'!C40), \"\", '4. Billing Determinants'!C40)","v":""},{"$f":"IF(C91=\"\", 0, IF(C91=\"kWh\", '4. Billing Determinants'!Q40, IF(C91=\"kW\", '4. Billing Determinants'!R40, '4. Billing Determinants'!D40)))","v":0},{"$f":"HLOOKUP($B91, '5. Allocation of Balances'!$D$4:$Z$53, 42,FALSE)","v":0},0,""]
[null,"Total",null,null,{"$f":"SUM(E72:E91)","v":6997091.608757142}]
[]
[null,"Rate Rider Calculation for RSVA - Power - Global Adjustment - Class A Non-WMP Customers"]
[null,"Balance of Account 1589 allocated to Class A Non-WMP Customers"]
[null,"Rate Class \n(Enter Rate Classes in cells below)","Units","Non-RPP kW / kWh / # of Customers","Balance of RSVA - Power - Global Adjustment","Rate Rider for RSVA - Power - Global Adjustment"]
[]
[null,{"$f":"B20","v":"RESIDENTIAL"},{"$f":"IF(ISBLANK('4. Billing Determinants'!C21), \"\", '4. Billing Determinants'!C21)","v":"kWh"},{"$f":"IF(C98=\"\", 0, IF(C98=\"kWh\", '4. Billing Determinants'!O47, IF(C98=\"kW\", '4. Billing Determinants'!P21, '4. Billing Determinants'!D21)))","v":0},{"$f":"HLOOKUP($B98, '5. Allocation of Balances'!$D$4:$Z$53, 44,FALSE)","v":0},{"$f":"IF(ISERROR(E98/D98), 0, IF(C98=\"# of Customers\", E98/D98/12/$D$13, E98/D98/$D$13))","v":0},{"$f":"IF(C98=\"\", \"\", IF(C98=\"# of Customers\", \"per customer per month\", \"$/\"&C98))","v":"$/kWh"}]
[null,{"$f":"B21","v":"GENERAL SERVICE LESS THAN 50 KW"},{"$f":"IF(ISBLANK('4. Billing Determinants'!C22), \"\", '4. Billing Determinants'!C22)","v":"kWh"},{"$f":"IF(C99=\"\", 0, IF(C99=\"kWh\", '4. Billing Determinants'!O48, IF(C99=\"kW\", '4. Billing Determinants'!P22, '4. Billing Determinants'!D22)))","v":0},{"$f":"HLOOKUP($B99, '5. Allocation of Balances'!$D$4:$Z$53, 44,FALSE)","v":0},{"$f":"IF(ISERROR(E99/D99), 0, IF(C99=\"# of Customers\", E99/D99/12/$D$13, E99/D99/$D$13))","v":0},{"$f":"IF(C99=\"\", \"\", IF(C99=\"# of Customers\", \"per customer per month\", \"$/\"&C99))","v":"$/kWh"}]
[null,"GENERAL SERVICE 50 TO 4,999 KW",{"$f":"IF(ISBLANK('4. Billing Determinants'!C23), \"\", '4. Billing Determinants'!C23)","v":"kW"},{"$f":"IF(C100=\"\", 0, IF(C100=\"kWh\", '4. Billing Determinants'!O49, IF(C100=\"kW\", '4. Billing Determinants'!P23, '4. Billing Determinants'!D23)))","v":79009.255978036555},{"$f":"HLOOKUP($B100, '5. Allocation of Balances'!$D$4:$Z$53, 44,FALSE)","v":0},0,"$/kW"]
[null,"LARGE USE (1)",{"$f":"IF(ISBLANK('4. Billing Determinants'!C24), \"\", '4. Billing Determinants'!C24)","v":"kW"},{"$f":"IF(C101=\"\", 0, IF(C101=\"kWh\", '4. Billing Determinants'!O50, IF(C101=\"kW\", '4. Billing Determinants'!P24, '4. Billing Determinants'!D24)))","v":383601.73023429373},{"$f":"HLOOKUP($B101, '5. Allocation of Balances'!$D$4:$Z$53, 44,FALSE)","v":0},0,"$/kW"]
[null,"LARGE USE (2)",{"$f":"IF(ISBLANK('4. Billing Determinants'!C25), \"\", '4. Billing Determinants'!C25)","v":"kW"},{"$f":"IF(C102=\"\", 0, IF(C102=\"kWh\", '4. Billing Determinants'!O51, IF(C102=\"kW\", '4. Billing Determinants'!P25, '4. Billing Determinants'!D25)))","v":809583.12468861288},{"$f":"HLOOKUP($B102, '5. Allocation of Balances'!$D$4:$Z$53, 44,FALSE)","v":0},0,"$/kW"]
[null,"UNMETERED SCATTERED LOAD",{"$f":"IF(ISBLANK('4. Billing Determinants'!C26), \"\", '4. Billing Determinants'!C26)","v":"kWh"},{"$f":"IF(C103=\"\", 0, IF(C103=\"kWh\", '4. Billing Determinants'!O52, IF(C103=\"kW\", '4. Billing Determinants'!P26, '4. Billing Determinants'!D26)))","v":0},{"$f":"HLOOKUP($B103, '5. Allocation of Balances'!$D$4:$Z$53, 44,FALSE)","v":0},0,"$/kWh"]
[null,"SENTINEL LIGHTING",{"$f":"IF(ISBLANK('4. Billing Determinants'!C27), \"\", '4. Billing Determinants'!C27)","v":"kW"},{"$f":"IF(C104=\"\", 0, IF(C104=\"kWh\", '4. Billing Determinants'!O53, IF(C104=\"kW\", '4. Billing Determinants'!P27, '4. Billing Determinants'!D27)))","v":0},{"$f":"HLOOKUP($B104, '5. Allocation of Balances'!$D$4:$Z$53, 44,FALSE)","v":0},0,"$/kW"]
[null,"STREET LIGHTING",{"$f":"IF(ISBLANK('4. Billing Determinants'!C28), \"\", '4. Billing Determinants'!C28)","v":"kW"},{"$f":"IF(C105=\"\", 0, IF(C105=\"kWh\", '4. Billing Determinants'!O54, IF(C105=\"kW\", '4. Billing Determinants'!P28, '4. Billing Determinants'!D28)))","v":0},{"$f":"HLOOKUP($B105, '5. Allocation of Balances'!$D$4:$Z$53, 44,FALSE)","v":0},0,"$/kW"]
[null,"STANDBY POWER",{"$f":"IF(ISBLANK('4. Billing Determinants'!C29), \"\", '4. Billing Determinants'!C29)","v":"kW"},{"$f":"IF(C106=\"\", 0, IF(C106=\"kWh\", '4. Billing Determinants'!O55, IF(C106=\"kW\", '4. Billing Determinants'!P29, '4. Billing Determinants'!D29)))","v":0},{"$f":"HLOOKUP($B106, '5. Allocation of Balances'!$D$4:$Z$53, 44,FALSE)","v":0},0,"$/kW"]
[null,"",{"$f":"IF(ISBLANK('4. Billing Determinants'!C30), \"\", '4. Billing Determinants'!C30)","v":""},{"$f":"IF(C107=\"\", 0, IF(C107=\"kWh\", '4. Billing Determinants'!O56, IF(C107=\"kW\", '4. Billing Determinants'!P30, '4. Billing Determinants'!D30)))","v":0},{"$f":"HLOOKUP($B107, '5. Allocation of Balances'!$D$4:$Z$53, 44,FALSE)","v":0},0,""]
[null,"",{"$f":"IF(ISBLANK('4. Billing Determinants'!C31), \"\", '4. Billing Determinants'!C31)","v":""},{"$f":"IF(C108=\"\", 0, IF(C108=\"kWh\", '4. Billing Determinants'!O57, IF(C108=\"kW\", '4. Billing Determinants'!P31, '4. Billing Determinants'!D31)))","v":0},{"$f":"HLOOKUP($B108, '5. Allocation of Balances'!$D$4:$Z$53, 44,FALSE)","v":0},0,""]
[null,"",{"$f":"IF(ISBLANK('4. Billing Determinants'!C32), \"\", '4. Billing Determinants'!C32)","v":""},{"$f":"IF(C109=\"\", 0, IF(C109=\"kWh\", '4. Billing Determinants'!O58, IF(C109=\"kW\", '4. Billing Determinants'!P32, '4. Billing Determinants'!D32)))","v":0},{"$f":"HLOOKUP($B109, '5. Allocation of Balances'!$D$4:$Z$53, 44,FALSE)","v":0},0,""]
[null,"",{"$f":"IF(ISBLANK('4. Billing Determinants'!C33), \"\", '4. Billing Determinants'!C33)","v":""},{"$f":"IF(C110=\"\", 0, IF(C110=\"kWh\", '4. Billing Determinants'!O59, IF(C110=\"kW\", '4. Billing Determinants'!P33, '4. Billing Determinants'!D33)))","v":0},{"$f":"HLOOKUP($B110, '5. Allocation of Balances'!$D$4:$Z$53, 44,FALSE)","v":0},0,""]
[null,"",{"$f":"IF(ISBLANK('4. Billing Determinants'!C34), \"\", '4. Billing Determinants'!C34)","v":""},{"$f":"IF(C111=\"\", 0, IF(C111=\"kWh\", '4. Billing Determinants'!O60, IF(C111=\"kW\", '4. Billing Determinants'!P34, '4. Billing Determinants'!D34)))","v":0},{"$f":"HLOOKUP($B111, '5. Allocation of Balances'!$D$4:$Z$53, 44,FALSE)","v":0},0,""]
[null,"",{"$f":"IF(ISBLANK('4. Billing Determinants'!C35), \"\", '4. Billing Determinants'!C35)","v":""},{"$f":"IF(C112=\"\", 0, IF(C112=\"kWh\", '4. Billing Determinants'!O61, IF(C112=\"kW\", '4. Billing Determinants'!P35, '4. Billing Determinants'!D35)))","v":0},{"$f":"HLOOKUP($B112, '5. Allocation of Balances'!$D$4:$Z$53, 44,FALSE)","v":0},0,""]
[null,"",{"$f":"IF(ISBLANK('4. Billing Determinants'!C36), \"\", '4. Billing Determinants'!C36)","v":""},{"$f":"IF(C113=\"\", 0, IF(C113=\"kWh\", '4. Billing Determinants'!O62, IF(C113=\"kW\", '4. Billing Determinants'!P36, '4. Billing Determinants'!D36)))","v":0},{"$f":"HLOOKUP($B113, '5. Allocation of Balances'!$D$4:$Z$53, 44,FALSE)","v":0},0,""]
[null,"",{"$f":"IF(ISBLANK('4. Billing Determinants'!C37), \"\", '4. Billing Determinants'!C37)","v":""},{"$f":"IF(C114=\"\", 0, IF(C114=\"kWh\", '4. Billing Determinants'!O63, IF(C114=\"kW\", '4. Billing Determinants'!P37, '4. Billing Determinants'!D37)))","v":0},{"$f":"HLOOKUP($B114, '5. Allocation of Balances'!$D$4:$Z$53, 44,FALSE)","v":0},0,""]
[null,"",{"$f":"IF(ISBLANK('4. Billing Determinants'!C38), \"\", '4. Billing Determinants'!C38)","v":""},{"$f":"IF(C115=\"\", 0, IF(C115=\"kWh\", '4. Billing Determinants'!O64, IF(C115=\"kW\", '4. Billing Determinants'!P38, '4. Billing Determinants'!D38)))","v":0},{"$f":"HLOOKUP($B115, '5. Allocation of Balances'!$D$4:$Z$53, 44,FALSE)","v":0},0,""]
[null,"",{"$f":"IF(ISBLANK('4. Billing Determinants'!C39), \"\", '4. Billing Determinants'!C39)","v":""},{"$f":"IF(C116=\"\", 0, IF(C116=\"kWh\", '4. Billing Determinants'!O65, IF(C116=\"kW\", '4. Billing Determinants'!P39, '4. Billing Determinants'!D39)))","v":0},{"$f":"HLOOKUP($B116, '5. Allocation of Balances'!$D$4:$Z$53, 44,FALSE)","v":0},0,""]
[null,"",{"$f":"IF(ISBLANK('4. Billing Determinants'!C40), \"\", '4. Billing Determinants'!C40)","v":""},{"$f":"IF(C117=\"\", 0, IF(C117=\"kWh\", '4. Billing Determinants'!O66, IF(C117=\"kW\", '4. Billing Determinants'!P40, '4. Billing Determinants'!D40)))","v":0},{"$f":"HLOOKUP($B117, '5. Allocation of Balances'!$D$4:$Z$53, 42,FALSE)","v":0},0,""]
[null,"Total",null,null,{"$f":"SUM(E98:E117)","v":0}]
[]
[]
[null,"Rate Rider Calculation for Group 2 Accounts"]
[]
[null,"Rate Class \n(Enter Rate Classes in cells below)","Units","Non-RPP kW / kWh / # of Customers","Balance of Group 2 Accounts","Rate Rider for RSVA - Power - Global Adjustment"]
[]
[null,{"$f":"B20","v":"RESIDENTIAL"},{"$f":"IF(ISBLANK('4. Billing Determinants'!C48), \"\", '4. Billing Determinants'!C48)","v":""},{"$f":"IF(C125=\"\",0,IF(ISNUMBER(SEARCH(\"RESIDENTIAL\",UPPER(B125),1)),'4. Billing Determinants'!D21, IF(C125=\"kWh\",'4. Billing Determinants'!E21, IF(C125=\"kW\",'4. Billing Determinants'!F21,'4. Billing Determinants'!D21))))","v":0},{"$f":"HLOOKUP($B125, '5. Allocation of Balances'!$D$4:$Z$53, 46,FALSE)","v":0},{"$f":"IF(ISERROR(E125/D125), 0, IF(C125=\"# of Customers\", E125/D125/12/$D$13, E125/D125/$D$13))","v":0},{"$f":"IF(C125=\"\", \"\", IF(C125=\"# of Customers\", \"per customer per month\", \"$/\"&C125))","v":""}]
[null,{"$f":"B21","v":"GENERAL SERVICE LESS THAN 50 KW"},{"$f":"IF(ISBLANK('4. Billing Determinants'!C49), \"\", '4. Billing Determinants'!C49)","v":""},{"$f":"IF(C126=\"\", 0, IF(C126=\"kWh\", '4. Billing Determinants'!O22, IF(C22=\"kW\", '4. Billing Determinants'!P22, '4. Billing Determinants'!D22)))","v":0},{"$f":"HLOOKUP($B126, '5. Allocation of Balances'!$D$4:$Z$53, 46,FALSE)","v":0},{"$f":"IF(ISERROR(E126/D126), 0, IF(C126=\"# of Customers\", E126/D126/12/$D$13, E126/D126/$D$13))","v":0},{"$f":"IF(C126=\"\", \"\", IF(C126=\"# of Customers\", \"per customer per month\", \"$/\"&C126))","v":""}]
[null,"GENERAL SERVICE 50 TO 4,999 KW",{"$f":"IF(ISBLANK('4. Billing Determinants'!C50), \"\", '4. Billing Determinants'!C50)","v":""},{"$f":"IF(C127=\"\", 0, IF(C127=\"kWh\", '4. Billing Determinants'!O23, IF(C23=\"kW\", '4. Billing Determinants'!P23, '4. Billing Determinants'!D23)))","v":0},{"$f":"HLOOKUP($B127, '5. Allocation of Balances'!$D$4:$Z$53, 46,FALSE)","v":0},0,""]
[null,"LARGE USE (1)",{"$f":"IF(ISBLANK('4. Billing Determinants'!C51), \"\", '4. Billing Determinants'!C51)","v":""},{"$f":"IF(C128=\"\", 0, IF(C128=\"kWh\", '4. Billing Determinants'!O24, IF(C24=\"kW\", '4. Billing Determinants'!P24, '4. Billing Determinants'!D24)))","v":0},{"$f":"HLOOKUP($B128, '5. Allocation of Balances'!$D$4:$Z$53, 46,FALSE)","v":0},0,""]
[null,"LARGE USE (2)",{"$f":"IF(ISBLANK('4. Billing Determinants'!C52), \"\", '4. Billing Determinants'!C52)","v":""},{"$f":"IF(C129=\"\", 0, IF(C129=\"kWh\", '4. Billing Determinants'!O25, IF(C25=\"kW\", '4. Billing Determinants'!P25, '4. Billing Determinants'!D25)))","v":0},{"$f":"HLOOKUP($B129, '5. Allocation of Balances'!$D$4:$Z$53, 46,FALSE)","v":0},0,""]
[null,"UNMETERED SCATTERED LOAD",{"$f":"IF(ISBLANK('4. Billing Determinants'!C53), \"\", '4. Billing Determinants'!C53)","v":""},{"$f":"IF(C130=\"\", 0, IF(C130=\"kWh\", '4. Billing Determinants'!O26, IF(C26=\"kW\", '4. Billing Determinants'!P26, '4. Billing Determinants'!D26)))","v":0},{"$f":"HLOOKUP($B130, '5. Allocation of Balances'!$D$4:$Z$53, 46,FALSE)","v":0},0,""]
[null,"SENTINEL LIGHTING",{"$f":"IF(ISBLANK('4. Billing Determinants'!C54), \"\", '4. Billing Determinants'!C54)","v":""},{"$f":"IF(C131=\"\", 0, IF(C131=\"kWh\", '4. Billing Determinants'!O27, IF(C27=\"kW\", '4. Billing Determinants'!P27, '4. Billing Determinants'!D27)))","v":0},{"$f":"HLOOKUP($B131, '5. Allocation of Balances'!$D$4:$Z$53, 46,FALSE)","v":0},0,""]
[null,"STREET LIGHTING",{"$f":"IF(ISBLANK('4. Billing Determinants'!C55), \"\", '4. Billing Determinants'!C55)","v":""},{"$f":"IF(C132=\"\", 0, IF(C132=\"kWh\", '4. Billing Determinants'!O28, IF(C28=\"kW\", '4. Billing Determinants'!P28, '4. Billing Determinants'!D28)))","v":0},{"$f":"HLOOKUP($B132, '5. Allocation of Balances'!$D$4:$Z$53, 46,FALSE)","v":0},0,""]
[null,"STANDBY POWER",{"$f":"IF(ISBLANK('4. Billing Determinants'!C56), \"\", '4. Billing Determinants'!C56)","v":""},{"$f":"IF(C133=\"\", 0, IF(C133=\"kWh\", '4. Billing Determinants'!O29, IF(C29=\"kW\", '4. Billing Determinants'!P29, '4. Billing Determinants'!D29)))","v":0},{"$f":"HLOOKUP($B133, '5. Allocation of Balances'!$D$4:$Z$53, 46,FALSE)","v":0},0,""]
[null,"",{"$f":"IF(ISBLANK('4. Billing Determinants'!C57), \"\", '4. Billing Determinants'!C57)","v":""},{"$f":"IF(C134=\"\", 0, IF(C134=\"kWh\", '4. Billing Determinants'!O30, IF(C30=\"kW\", '4. Billing Determinants'!P30, '4. Billing Determinants'!D30)))","v":0},{"$f":"HLOOKUP($B134, '5. Allocation of Balances'!$D$4:$Z$53, 46,FALSE)","v":0},0,""]
[null,"",{"$f":"IF(ISBLANK('4. Billing Determinants'!C58), \"\", '4. Billing Determinants'!C58)","v":""},{"$f":"IF(C135=\"\", 0, IF(C135=\"kWh\", '4. Billing Determinants'!O31, IF(C31=\"kW\", '4. Billing Determinants'!P31, '4. Billing Determinants'!D31)))","v":0},{"$f":"HLOOKUP($B135, '5. Allocation of Balances'!$D$4:$Z$53, 46,FALSE)","v":0},0,""]
[null,"",{"$f":"IF(ISBLANK('4. Billing Determinants'!C59), \"\", '4. Billing Determinants'!C59)","v":""},{"$f":"IF(C136=\"\", 0, IF(C136=\"kWh\", '4. Billing Determinants'!O32, IF(C32=\"kW\", '4. Billing Determinants'!P32, '4. Billing Determinants'!D32)))","v":0},{"$f":"HLOOKUP($B136, '5. Allocation of Balances'!$D$4:$Z$53, 46,FALSE)","v":0},0,""]
[null,"",{"$f":"IF(ISBLANK('4. Billing Determinants'!C60), \"\", '4. Billing Determinants'!C60)","v":""},{"$f":"IF(C137=\"\", 0, IF(C137=\"kWh\", '4. Billing Determinants'!O33, IF(C33=\"kW\", '4. Billing Determinants'!P33, '4. Billing Determinants'!D33)))","v":0},{"$f":"HLOOKUP($B137, '5. Allocation of Balances'!$D$4:$Z$53, 46,FALSE)","v":0},0,""]
[null,"",{"$f":"IF(ISBLANK('4. Billing Determinants'!C61), \"\", '4. Billing Determinants'!C61)","v":""},{"$f":"IF(C138=\"\", 0, IF(C138=\"kWh\", '4. Billing Determinants'!O34, IF(C34=\"kW\", '4. Billing Determinants'!P34, '4. Billing Determinants'!D34)))","v":0},{"$f":"HLOOKUP($B138, '5. Allocation of Balances'!$D$4:$Z$53, 46,FALSE)","v":0},0,""]
[null,"",{"$f":"IF(ISBLANK('4. Billing Determinants'!C62), \"\", '4. Billing Determinants'!C62)","v":""},{"$f":"IF(C139=\"\", 0, IF(C139=\"kWh\", '4. Billing Determinants'!O35, IF(C35=\"kW\", '4. Billing Determinants'!P35, '4. Billing Determinants'!D35)))","v":0},{"$f":"HLOOKUP($B139, '5. Allocation of Balances'!$D$4:$Z$53, 46,FALSE)","v":0},0,""]
[null,"",{"$f":"IF(ISBLANK('4. Billing Determinants'!C63), \"\", '4. Billing Determinants'!C63)","v":""},{"$f":"IF(C140=\"\", 0, IF(C140=\"kWh\", '4. Billing Determinants'!O36, IF(C36=\"kW\", '4. Billing Determinants'!P36, '4. Billing Determinants'!D36)))","v":0},{"$f":"HLOOKUP($B140, '5. Allocation of Balances'!$D$4:$Z$53, 46,FALSE)","v":0},0,""]
[null,"",{"$f":"IF(ISBLANK('4. Billing Determinants'!C64), \"\", '4. Billing Determinants'!C64)","v":""},{"$f":"IF(C141=\"\", 0, IF(C141=\"kWh\", '4. Billing Determinants'!O37, IF(C37=\"kW\", '4. Billing Determinants'!P37, '4. Billing Determinants'!D37)))","v":0},{"$f":"HLOOKUP($B141, '5. Allocation of Balances'!$D$4:$Z$53, 46,FALSE)","v":0},0,""]
[null,"",{"$f":"IF(ISBLANK('4. Billing Determinants'!C65), \"\", '4. Billing Determinants'!C65)","v":""},{"$f":"IF(C142=\"\", 0, IF(C142=\"kWh\", '4. Billing Determinants'!O38, IF(C38=\"kW\", '4. Billing Determinants'!P38, '4. Billing Determinants'!D38)))","v":0},{"$f":"HLOOKUP($B142, '5. Allocation of Balances'!$D$4:$Z$53, 46,FALSE)","v":0},0,""]
[null,"",{"$f":"IF(ISBLANK('4. Billing Determinants'!C66), \"\", '4. Billing Determinants'!C66)","v":""},{"$f":"IF(C143=\"\", 0, IF(C143=\"kWh\", '4. Billing Determinants'!O39, IF(C39=\"kW\", '4. Billing Determinants'!P39, '4. Billing Determinants'!D39)))","v":0},{"$f":"HLOOKUP($B143, '5. Allocation of Balances'!$D$4:$Z$53, 46,FALSE)","v":0},0,""]
[null,"",{"$f":"IF(ISBLANK('4. Billing Determinants'!C67), \"\", '4. Billing Determinants'!C67)","v":""},{"$f":"IF(C144=\"\", 0, IF(C144=\"kWh\", '4. Billing Determinants'!O40, IF(C40=\"kW\", '4. Billing Determinants'!P40, '4. Billing Determinants'!D40)))","v":0},{"$f":"HLOOKUP($B144, '5. Allocation of Balances'!$D$4:$Z$53, 46,FALSE)","v":0},0,""]
[null,"Total",null,null,{"$f":"SUM(E125:E144)","v":0}]
[]
[null,"Rate Rider Calculation for Accounts 1575 and 1576"]
[]
[null," Please indicate the Rate Rider Recovery Period (in years)",null,1]
[]
[null,"Rate Class \n(Enter Rate Classes in cells below)","Units","kW / kWh / # of Customers","Balance of Accounts 1575 and 1576","Rate Rider for Accounts 1575 and 1576"]
[]
[null,{"$f":"B20","v":"RESIDENTIAL"},{"$f":"IF(ISBLANK('4. Billing Determinants'!C21), \"\", '4. Billing Determinants'!C21)","v":"kWh"},{"$f":"IF(C153=\"\", 0, IF(C153=\"kWh\", '4. Billing Determinants'!O21, IF(C153=\"kW\", '4. Billing Determinants'!P21, '4. Billing Determinants'!D21)))","v":0},{"$f":"HLOOKUP($B153, '5. Allocation of Balances'!$C$4:$Y$53, 50,FALSE)","v":0},{"$f":"IF(ISERROR(E153/D153), 0, IF(C153=\"# of Customers\", E153/D153/12/$D$149, E153/D153/$D$149))","v":0},{"$f":"IF(C153=\"\", \"\", IF(C153=\"# of Customers\", \"per customer per month\", \"$/\"&C153))","v":"$/kWh"}]
[null,"GENERAL SERVICE LESS THAN 50 KW",{"$f":"IF(ISBLANK('4. Billing Determinants'!C22), \"\", '4. Billing Determinants'!C22)","v":"kWh"},{"$f":"IF(C154=\"\", 0, IF(C154=\"kWh\", '4. Billing Determinants'!O22, IF(C154=\"kW\", '4. Billing Determinants'!P22, '4. Billing Determinants'!D22)))","v":0},{"$f":"HLOOKUP($B154, '5. Allocation of Balances'!$C$4:$Y$53, 50,FALSE)","v":0},{"$f":"IF(ISERROR(E154/D154), 0, IF(C154=\"# of Customers\", E154/D154/12/$D$149, E154/D154/$D$149))","v":0},"$/kWh"]
[null,"GENERAL SERVICE 50 TO 4,999 KW",{"$f":"IF(ISBLANK('4. Billing Determinants'!C23), \"\", '4. Billing Determinants'!C23)","v":"kW"},{"$f":"IF(C155=\"\", 0, IF(C155=\"kWh\", '4. Billing Determinants'!O23, IF(C155=\"kW\", '4. Billing Determinants'!P23, '4. Billing Determinants'!D23)))","v":79009.255978036555},{"$f":"HLOOKUP($B155, '5. Allocation of Balances'!$C$4:$Y$53, 50,FALSE)","v":0},0,"$/kW"]
[null,"LARGE USE (1)",{"$f":"IF(ISBLANK('4. Billing Determinants'!C24), \"\", '4. Billing Determinants'!C24)","v":"kW"},{"$f":"IF(C156=\"\", 0, IF(C156=\"kWh\", '4. Billing Determinants'!O24, IF(C156=\"kW\", '4. Billing Determinants'!P24, '4. Billing Determinants'!D24)))","v":383601.73023429373},{"$f":"HLOOKUP($B156, '5. Allocation of Balances'!$C$4:$Y$53, 50,FALSE)","v":0},0,"$/kW"]
[null,"LARGE USE (2)",{"$f":"IF(ISBLANK('4. Billing Determinants'!C25), \"\", '4. Billing Determinants'!C25)","v":"kW"},{"$f":"IF(C157=\"\", 0, IF(C157=\"kWh\", '4. Billing Determinants'!O25, IF(C157=\"kW\", '4. Billing Determinants'!P25, '4. Billing Determinants'!D25)))","v":809583.12468861288},{"$f":"HLOOKUP($B157, '5. Allocation of Balances'!$C$4:$Y$53, 50,FALSE)","v":0},0,"$/kW"]
[null,"UNMETERED SCATTERED LOAD",{"$f":"IF(ISBLANK('4. Billing Determinants'!C26), \"\", '4. Billing Determinants'!C26)","v":"kWh"},{"$f":"IF(C158=\"\", 0, IF(C158=\"kWh\", '4. Billing Determinants'!O26, IF(C158=\"kW\", '4. Billing Determinants'!P26, '4. Billing Determinants'!D26)))","v":0},{"$f":"HLOOKUP($B158, '5. Allocation of Balances'!$C$4:$Y$53, 50,FALSE)","v":0},0,"$/kWh"]
[null,"SENTINEL LIGHTING",{"$f":"IF(ISBLANK('4. Billing Determinants'!C27), \"\", '4. Billing Determinants'!C27)","v":"kW"},{"$f":"IF(C159=\"\", 0, IF(C159=\"kWh\", '4. Billing Determinants'!O27, IF(C159=\"kW\", '4. Billing Determinants'!P27, '4. Billing Determinants'!D27)))","v":0},{"$f":"HLOOKUP($B159, '5. Allocation of Balances'!$C$4:$Y$53, 50,FALSE)","v":0},0,"$/kW"]
[null,"STREET LIGHTING",{"$f":"IF(ISBLANK('4. Billing Determinants'!C28), \"\", '4. Billing Determinants'!C28)","v":"kW"},{"$f":"IF(C160=\"\", 0, IF(C160=\"kWh\", '4. Billing Determinants'!O28, IF(C160=\"kW\", '4. Billing Determinants'!P28, '4. Billing Determinants'!D28)))","v":0},{"$f":"HLOOKUP($B160, '5. Allocation of Balances'!$C$4:$Y$53, 50,FALSE)","v":0},0,"$/kW"]
[null,"STANDBY POWER",{"$f":"IF(ISBLANK('4. Billing Determinants'!C29), \"\", '4. Billing Determinants'!C29)","v":"kW"},{"$f":"IF(C161=\"\", 0, IF(C161=\"kWh\", '4. Billing Determinants'!O29, IF(C161=\"kW\", '4. Billing Determinants'!P29, '4. Billing Determinants'!D29)))","v":0},{"$f":"HLOOKUP($B161, '5. Allocation of Balances'!$C$4:$Y$53, 50,FALSE)","v":0},0,"$/kW"]
[null,"",{"$f":"IF(ISBLANK('4. Billing Determinants'!C30), \"\", '4. Billing Determinants'!C30)","v":""},{"$f":"IF(C162=\"\", 0, IF(C162=\"kWh\", '4. Billing Determinants'!O30, IF(C162=\"kW\", '4. Billing Determinants'!P30, '4. Billing Determinants'!D30)))","v":0},{"$f":"HLOOKUP($B162, '5. Allocation of Balances'!$C$4:$Y$53, 50,FALSE)","v":0},0,""]
[null,"",{"$f":"IF(ISBLANK('4. Billing Determinants'!C31), \"\", '4. Billing Determinants'!C31)","v":""},{"$f":"IF(C163=\"\", 0, IF(C163=\"kWh\", '4. Billing Determinants'!O31, IF(C163=\"kW\", '4. Billing Determinants'!P31, '4. Billing Determinants'!D31)))","v":0},{"$f":"HLOOKUP($B163, '5. Allocation of Balances'!$C$4:$Y$53, 50,FALSE)","v":0},0,""]
[null,"",{"$f":"IF(ISBLANK('4. Billing Determinants'!C32), \"\", '4. Billing Determinants'!C32)","v":""},{"$f":"IF(C164=\"\", 0, IF(C164=\"kWh\", '4. Billing Determinants'!O32, IF(C164=\"kW\", '4. Billing Determinants'!P32, '4. Billing Determinants'!D32)))","v":0},{"$f":"HLOOKUP($B164, '5. Allocation of Balances'!$C$4:$Y$53, 50,FALSE)","v":0},0,""]
[null,"",{"$f":"IF(ISBLANK('4. Billing Determinants'!C33), \"\", '4. Billing Determinants'!C33)","v":""},{"$f":"IF(C165=\"\", 0, IF(C165=\"kWh\", '4. Billing Determinants'!O33, IF(C165=\"kW\", '4. Billing Determinants'!P33, '4. Billing Determinants'!D33)))","v":0},{"$f":"HLOOKUP($B165, '5. Allocation of Balances'!$C$4:$Y$53, 50,FALSE)","v":0},0,""]
[null,"",{"$f":"IF(ISBLANK('4. Billing Determinants'!C34), \"\", '4. Billing Determinants'!C34)","v":""},{"$f":"IF(C166=\"\", 0, IF(C166=\"kWh\", '4. Billing Determinants'!O34, IF(C166=\"kW\", '4. Billing Determinants'!P34, '4. Billing Determinants'!D34)))","v":0},{"$f":"HLOOKUP($B166, '5. Allocation of Balances'!$C$4:$Y$53, 50,FALSE)","v":0},0,""]
[null,"",{"$f":"IF(ISBLANK('4. Billing Determinants'!C35), \"\", '4. Billing Determinants'!C35)","v":""},{"$f":"IF(C167=\"\", 0, IF(C167=\"kWh\", '4. Billing Determinants'!O35, IF(C167=\"kW\", '4. Billing Determinants'!P35, '4. Billing Determinants'!D35)))","v":0},{"$f":"HLOOKUP($B167, '5. Allocation of Balances'!$C$4:$Y$53, 50,FALSE)","v":0},0,""]
[null,"",{"$f":"IF(ISBLANK('4. Billing Determinants'!C36), \"\", '4. Billing Determinants'!C36)","v":""},{"$f":"IF(C168=\"\", 0, IF(C168=\"kWh\", '4. Billing Determinants'!O36, IF(C168=\"kW\", '4. Billing Determinants'!P36, '4. Billing Determinants'!D36)))","v":0},{"$f":"HLOOKUP($B168, '5. Allocation of Balances'!$C$4:$Y$53, 50,FALSE)","v":0},0,""]
[null,"",{"$f":"IF(ISBLANK('4. Billing Determinants'!C37), \"\", '4. Billing Determinants'!C37)","v":""},{"$f":"IF(C169=\"\", 0, IF(C169=\"kWh\", '4. Billing Determinants'!O37, IF(C169=\"kW\", '4. Billing Determinants'!P37, '4. Billing Determinants'!D37)))","v":0},{"$f":"HLOOKUP($B169, '5. Allocation of Balances'!$C$4:$Y$53, 50,FALSE)","v":0},0,""]
[null,"",{"$f":"IF(ISBLANK('4. Billing Determinants'!C38), \"\", '4. Billing Determinants'!C38)","v":""},{"$f":"IF(C170=\"\", 0, IF(C170=\"kWh\", '4. Billing Determinants'!O38, IF(C170=\"kW\", '4. Billing Determinants'!P38, '4. Billing Determinants'!D38)))","v":0},{"$f":"HLOOKUP($B170, '5. Allocation of Balances'!$C$4:$Y$53, 50,FALSE)","v":0},0,""]
[null,"",{"$f":"IF(ISBLANK('4. Billing Determinants'!C39), \"\", '4. Billing Determinants'!C39)","v":""},{"$f":"IF(C171=\"\", 0, IF(C171=\"kWh\", '4. Billing Determinants'!O39, IF(C171=\"kW\", '4. Billing Determinants'!P39, '4. Billing Determinants'!D39)))","v":0},{"$f":"HLOOKUP($B171, '5. Allocation of Balances'!$C$4:$Y$53, 50,FALSE)","v":0},0,""]
[null,"",{"$f":"IF(ISBLANK('4. Billing Determinants'!C40), \"\", '4. Billing Determinants'!C40)","v":""},{"$f":"IF(C172=\"\", 0, IF(C172=\"kWh\", '4. Billing Determinants'!O40, IF(C172=\"kW\", '4. Billing Determinants'!P40, '4. Billing Determinants'!D40)))","v":0},{"$f":"HLOOKUP($B172, '5. Allocation of Balances'!$C$4:$Y$53, 50,FALSE)","v":0},0,""]
[null,"Total",null,null,{"$f":"SUM(E153:E172)","v":0}]
[]
[null,"Rate Rider Calculation for Accounts 1568"]
[]
[null," Please indicate the Rate Rider Recovery Period (in years)",null,1]
[]
[null,"Rate Class \n(Enter Rate Classes in cells below)","Units","kW / kWh / # of Customers","Balance of \nAccount 1568","Rate Rider for Account 1568"]
[]
[null,{"$f":"B20","v":"RESIDENTIAL"},null,{"$f":"IF(C181=\"\", 0, IF(C181=\"kWh\", '4. Billing Determinants'!O21, IF(C181=\"kW\", '4. Billing Determinants'!P21, '4. Billing Determinants'!D21)))","v":0},{"$f":"HLOOKUP($B181, '5. Allocation of Balances'!$D$4:$Z$53, 36,FALSE)","v":0},{"$f":"IF(ISERROR(E181/D181), 0, IF(C181=\"# of Customers\", E181/D181/12/$D$177, E181/D181/$D$177))","v":0},{"$f":"IF(C181=\"\", \"\", IF(C181=\"# of Customers\", \"per customer per month\", \"$/\"&C181))","v":""}]
[null,"GENERAL SERVICE LESS THAN 50 KW",{"$f":"IF(ISBLANK('4. Billing Determinants'!C22), \"\", '4. Billing Determinants'!C22)","v":"kWh"},{"$f":"IF(C182=\"\", 0, IF(C182=\"kWh\", '4. Billing Determinants'!O22, IF(C182=\"kW\", '4. Billing Determinants'!P22, '4. Billing Determinants'!D22)))","v":0},{"$f":"HLOOKUP($B182, '5. Allocation of Balances'!$D$4:$Z$53, 36,FALSE)","v":0},0,{"$f":"IF(C182=\"\", \"\", IF(C182=\"# of Customers\", \"per customer per month\", \"$/\"&C182))","v":"$/kWh"}]
[null,"GENERAL SERVICE 50 TO 4,999 KW",{"$f":"IF(ISBLANK('4. Billing Determinants'!C23), \"\", '4. Billing Determinants'!C23)","v":"kW"},{"$f":"IF(C183=\"\", 0, IF(C183=\"kWh\", '4. Billing Determinants'!O23, IF(C183=\"kW\", '4. Billing Determinants'!P23, '4. Billing Determinants'!D23)))","v":79009.255978036555},{"$f":"HLOOKUP($B183, '5. Allocation of Balances'!$D$4:$Z$53, 36,FALSE)","v":0},0,"$/kW"]
[null,"LARGE USE (1)",{"$f":"IF(ISBLANK('4. Billing Determinants'!C24), \"\", '4. Billing Determinants'!C24)","v":"kW"},{"$f":"IF(C184=\"\", 0, IF(C184=\"kWh\", '4. Billing Determinants'!O24, IF(C184=\"kW\", '4. Billing Determinants'!P24, '4. Billing Determinants'!D24)))","v":383601.73023429373},{"$f":"HLOOKUP($B184, '5. Allocation of Balances'!$D$4:$Z$53, 36,FALSE)","v":0},0,"$/kW"]
[null,"LARGE USE (2)",{"$f":"IF(ISBLANK('4. Billing Determinants'!C25), \"\", '4. Billing Determinants'!C25)","v":"kW"},{"$f":"IF(C185=\"\", 0, IF(C185=\"kWh\", '4. Billing Determinants'!O25, IF(C185=\"kW\", '4. Billing Determinants'!P25, '4. Billing Determinants'!D25)))","v":809583.12468861288},{"$f":"HLOOKUP($B185, '5. Allocation of Balances'!$D$4:$Z$53, 36,FALSE)","v":0},0,"$/kW"]
[null,"UNMETERED SCATTERED LOAD",{"$f":"IF(ISBLANK('4. Billing Determinants'!C26), \"\", '4. Billing Determinants'!C26)","v":"kWh"},{"$f":"IF(C186=\"\", 0, IF(C186=\"kWh\", '4. Billing Determinants'!O26, IF(C186=\"kW\", '4. Billing Determinants'!P26, '4. Billing Determinants'!D26)))","v":0},{"$f":"HLOOKUP($B186, '5. Allocation of Balances'!$D$4:$Z$53, 36,FALSE)","v":0},0,"$/kWh"]
[null,"SENTINEL LIGHTING",{"$f":"IF(ISBLANK('4. Billing Determinants'!C27), \"\", '4. Billing Determinants'!C27)","v":"kW"},{"$f":"IF(C187=\"\", 0, IF(C187=\"kWh\", '4. Billing Determinants'!O27, IF(C187=\"kW\", '4. Billing Determinants'!P27, '4. Billing Determinants'!D27)))","v":0},{"$f":"HLOOKUP($B187, '5. Allocation of Balances'!$D$4:$Z$53, 36,FALSE)","v":0},0,"$/kW"]
[null,"STREET LIGHTING",{"$f":"IF(ISBLANK('4. Billing Determinants'!C28), \"\", '4. Billing Determinants'!C28)","v":"kW"},{"$f":"IF(C188=\"\", 0, IF(C188=\"kWh\", '4. Billing Determinants'!O28, IF(C188=\"kW\", '4. Billing Determinants'!P28, '4. Billing Determinants'!D28)))","v":0},{"$f":"HLOOKUP($B188, '5. Allocation of Balances'!$D$4:$Z$53, 36,FALSE)","v":0},0,"$/kW"]
[null,"STANDBY POWER",{"$f":"IF(ISBLANK('4. Billing Determinants'!C29), \"\", '4. Billing Determinants'!C29)","v":"kW"},{"$f":"IF(C189=\"\", 0, IF(C189=\"kWh\", '4. Billing Determinants'!O29, IF(C189=\"kW\", '4. Billing Determinants'!P29, '4. Billing Determinants'!D29)))","v":0},{"$f":"HLOOKUP($B189, '5. Allocation of Balances'!$D$4:$Z$53, 36,FALSE)","v":0},0,"$/kW"]
[null,"",{"$f":"IF(ISBLANK('4. Billing Determinants'!C30), \"\", '4. Billing Determinants'!C30)","v":""},{"$f":"IF(C190=\"\", 0, IF(C190=\"kWh\", '4. Billing Determinants'!O30, IF(C190=\"kW\", '4. Billing Determinants'!P30, '4. Billing Determinants'!D30)))","v":0},{"$f":"HLOOKUP($B190, '5. Allocation of Balances'!$D$4:$Z$53, 36,FALSE)","v":0},0,""]
[null,"",{"$f":"IF(ISBLANK('4. Billing Determinants'!C31), \"\", '4. Billing Determinants'!C31)","v":""},{"$f":"IF(C191=\"\", 0, IF(C191=\"kWh\", '4. Billing Determinants'!O31, IF(C191=\"kW\", '4. Billing Determinants'!P31, '4. Billing Determinants'!D31)))","v":0},{"$f":"HLOOKUP($B191, '5. Allocation of Balances'!$D$4:$Z$53, 36,FALSE)","v":0},0,""]
[null,"",{"$f":"IF(ISBLANK('4. Billing Determinants'!C32), \"\", '4. Billing Determinants'!C32)","v":""},{"$f":"IF(C192=\"\", 0, IF(C192=\"kWh\", '4. Billing Determinants'!O32, IF(C192=\"kW\", '4. Billing Determinants'!P32, '4. Billing Determinants'!D32)))","v":0},{"$f":"HLOOKUP($B192, '5. Allocation of Balances'!$D$4:$Z$53, 36,FALSE)","v":0},0,""]
[null,"",{"$f":"IF(ISBLANK('4. Billing Determinants'!C33), \"\", '4. Billing Determinants'!C33)","v":""},{"$f":"IF(C193=\"\", 0, IF(C193=\"kWh\", '4. Billing Determinants'!O33, IF(C193=\"kW\", '4. Billing Determinants'!P33, '4. Billing Determinants'!D33)))","v":0},{"$f":"HLOOKUP($B193, '5. Allocation of Balances'!$D$4:$Z$53, 36,FALSE)","v":0},0,""]
[null,"",{"$f":"IF(ISBLANK('4. Billing Determinants'!C34), \"\", '4. Billing Determinants'!C34)","v":""},{"$f":"IF(C194=\"\", 0, IF(C194=\"kWh\", '4. Billing Determinants'!O34, IF(C194=\"kW\", '4. Billing Determinants'!P34, '4. Billing Determinants'!D34)))","v":0},{"$f":"HLOOKUP($B194, '5. Allocation of Balances'!$D$4:$Z$53, 36,FALSE)","v":0},0,""]
[null,"",{"$f":"IF(ISBLANK('4. Billing Determinants'!C35), \"\", '4. Billing Determinants'!C35)","v":""},{"$f":"IF(C195=\"\", 0, IF(C195=\"kWh\", '4. Billing Determinants'!O35, IF(C195=\"kW\", '4. Billing Determinants'!P35, '4. Billing Determinants'!D35)))","v":0},{"$f":"HLOOKUP($B195, '5. Allocation of Balances'!$D$4:$Z$53, 36,FALSE)","v":0},0,""]
[null,"",{"$f":"IF(ISBLANK('4. Billing Determinants'!C36), \"\", '4. Billing Determinants'!C36)","v":""},{"$f":"IF(C196=\"\", 0, IF(C196=\"kWh\", '4. Billing Determinants'!O36, IF(C196=\"kW\", '4. Billing Determinants'!P36, '4. Billing Determinants'!D36)))","v":0},{"$f":"HLOOKUP($B196, '5. Allocation of Balances'!$D$4:$Z$53, 36,FALSE)","v":0},0,""]
[null,"",{"$f":"IF(ISBLANK('4. Billing Determinants'!C37), \"\", '4. Billing Determinants'!C37)","v":""},{"$f":"IF(C197=\"\", 0, IF(C197=\"kWh\", '4. Billing Determinants'!O37, IF(C197=\"kW\", '4. Billing Determinants'!P37, '4. Billing Determinants'!D37)))","v":0},{"$f":"HLOOKUP($B197, '5. Allocation of Balances'!$D$4:$Z$53, 36,FALSE)","v":0},0,""]
[null,"",{"$f":"IF(ISBLANK('4. Billing Determinants'!C38), \"\", '4. Billing Determinants'!C38)","v":""},{"$f":"IF(C198=\"\", 0, IF(C198=\"kWh\", '4. Billing Determinants'!O38, IF(C198=\"kW\", '4. Billing Determinants'!P38, '4. Billing Determinants'!D38)))","v":0},{"$f":"HLOOKUP($B198, '5. Allocation of Balances'!$D$4:$Z$53, 36,FALSE)","v":0},0,""]
[null,"",{"$f":"IF(ISBLANK('4. Billing Determinants'!C39), \"\", '4. Billing Determinants'!C39)","v":""},{"$f":"IF(C199=\"\", 0, IF(C199=\"kWh\", '4. Billing Determinants'!O39, IF(C199=\"kW\", '4. Billing Determinants'!P39, '4. Billing Determinants'!D39)))","v":0},{"$f":"HLOOKUP($B199, '5. Allocation of Balances'!$D$4:$Z$53, 36,FALSE)","v":0},0,""]
[null,"",{"$f":"IF(ISBLANK('4. Billing Determinants'!C40), \"\", '4. Billing Determinants'!C40)","v":""},{"$f":"IF(C200=\"\", 0, IF(C200=\"kWh\", '4. Billing Determinants'!O40, IF(C200=\"kW\", '4. Billing Determinants'!P40, '4. Billing Determinants'!D40)))","v":0},{"$f":"HLOOKUP($B200, '5. Allocation of Balances'!$D$4:$Z$53, 36,FALSE)","v":0},0,""]
[null,"Total",null,null,{"$f":"SUM(E181:E200)","v":0}]

{"sheet":"Summary Sheet","index":6,"n_rows":44,"n_cols":10,"rows_kept":44,"cut":false,"hidden":true,"merged":[[0,8,2,8],[0,9,2,9],[0,2,2,2],[0,3,2,3],[0,5,2,5],[0,6,2,6],[0,7,2,7],[0,4,2,4]]}
[null,null,"Closing Principal Balances as of Dec 31-13 Adjusted for Dispositions during 2014","Closing Interest Balances as of Dec 31-13 Adjusted for Dispositions during 2014","December 31, 2013 Audited Balances","Projected Interest from Jan 1, 2014 to December 31, 2014 on                        Dec 31 -13 balance adjusted for disposition during 2014 6","Projected Interest from January 1, 2015 to April 30, 2015 on Dec 31 -13 balance adjusted for disposition during 2014  6","Total Claim","2.1.7\nAs of Dec 31-13","Variance                           RRR vs. 2013 Balance                        (Principal + Interest)"]
[]
[null,null,null,null,null,null,null,"Claim before Forecasted Transactions"]
["Other Regulatory Assets - Sub-Account - Deferred IFRS Transition Costs",1508,{"$f":"VLOOKUP(A4, '2. 2015 Continuity Schedule'!$C$20:$BU$83, MATCH('2. 2015 Continuity Schedule'!BO$20, '2. 2015 Continuity Schedule'!C$20:BU$20,0),FALSE)","v":0},{"$f":"VLOOKUP(A4, '2. 2015 Continuity Schedule'!$C$20:$BU$83, MATCH('2. 2015 Continuity Schedule'!BP$20, '2. 2015 Continuity Schedule'!C$20:BU$20,0),FALSE)","v":0},{"$f":"SUM(C4:D4)","v":0},{"$f":"VLOOKUP(A4, '2. 2015 Continuity Schedule'!$C$20:$BU$83, MATCH('2. 2015 Continuity Schedule'!BQ$20, '2. 2015 Continuity Schedule'!C$20:BU$20,0),FALSE)","v":0},{"$f":"VLOOKUP(A4, '2. 2015 Continuity Schedule'!$C$20:$BU$83, MATCH('2. 2015 Continuity Schedule'!BR$20, '2. 2015 Continuity Schedule'!C$20:BU$20,0),FALSE)","v":0},{"$f":"SUM(E4:G4)","v":0},{"$f":"VLOOKUP(A4, '2. 2015 Continuity Schedule'!$C$20:$BU$83, MATCH('2. 2015 Continuity Schedule'!BT$20, '2. 2015 Continuity Schedule'!C$20:BU$20,0),FALSE)","v":0},{"$f":"VLOOKUP(A4, '2. 2015 Continuity Schedule'!$C$20:$BU$83, MATCH('2. 2015 Continuity Schedule'!BU$20, '2. 2015 Continuity Schedule'!C$20:BU$20,0),FALSE)","v":0}]
["Other Regulatory Assets - Sub-Account - Incremental Capital Charges",1508,{"$f":"VLOOKUP(A5, '2. 2015 Continuity Schedule'!$C$20:$BU$83, MATCH('2. 2015 Continuity Schedule'!BO$20, '2. 2015 Continuity Schedule'!C$20:BU$20,0),FALSE)","v":0},{"$f":"VLOOKUP(A5, '2. 2015 Continuity Schedule'!$C$20:$BU$83, MATCH('2. 2015 Continuity Schedule'!BP$20, '2. 2015 Continuity Schedule'!C$20:BU$20,0),FALSE)","v":0},{"$f":"SUM(C5:D5)","v":0},{"$f":"VLOOKUP(A5, '2. 2015 Continuity Schedule'!$C$20:$BU$83, MATCH('2. 2015 Continuity Schedule'!BQ$20, '2. 2015 Continuity Schedule'!C$20:BU$20,0),FALSE)","v":0},{"$f":"VLOOKUP(A5, '2. 2015 Continuity Schedule'!$C$20:$BU$83, MATCH('2. 2015 Continuity Schedule'!BR$20, '2. 2015 Continuity Schedule'!C$20:BU$20,0),FALSE)","v":0},{"$f":"SUM(E5:G5)","v":0},{"$f":"VLOOKUP(A5, '2. 2015 Continuity Schedule'!$C$20:$BU$83, MATCH('2. 2015 Continuity Schedule'!BT$20, '2. 2015 Continuity Schedule'!C$20:BU$20,0),FALSE)","v":0},{"$f":"VLOOKUP(A5, '2. 2015 Continuity Schedule'!$C$20:$BU$83, MATCH('2. 2015 Continuity Schedule'!BU$20, '2. 2015 Continuity Schedule'!C$20:BU$20,0),FALSE)","v":0}]
["Other Regulatory Assets - Sub-Account - Financial Assistance Payment and Recovery Variance - Ontario Clean Energy Benefit Act8",1508,{"$f":"VLOOKUP(A6, '2. 2015 Continuity Schedule'!$C$20:$BU$83, MATCH('2. 2015 Continuity Schedule'!BO$20, '2. 2015 Continuity Schedule'!C$20:BU$20,0),FALSE)","v":0},{"$f":"VLOOKUP(A6, '2. 2015 Continuity Schedule'!$C$20:$BU$83, MATCH('2. 2015 Continuity Schedule'!BP$20, '2. 2015 Continuity Schedule'!C$20:BU$20,0),FALSE)","v":0},0,{"$f":"VLOOKUP(A6, '2. 2015 Continuity Schedule'!$C$20:$BU$83, MATCH('2. 2015 Continuity Schedule'!BQ$20, '2. 2015 Continuity Schedule'!C$20:BU$20,0),FALSE)","v":0},{"$f":"VLOOKUP(A6, '2. 2015 Continuity Schedule'!$C$20:$BU$83, MATCH('2. 2015 Continuity Schedule'!BR$20, '2. 2015 Continuity Schedule'!C$20:BU$20,0),FALSE)","v":0},0,{"$f":"VLOOKUP(A6, '2. 2015 Continuity Schedule'!$C$20:$BU$83, MATCH('2. 2015 Continuity Schedule'!BT$20, '2. 2015 Continuity Schedule'!C$20:BU$20,0),FALSE)","v":0},{"$f":"VLOOKUP(A6, '2. 2015 Continuity Schedule'!$C$20:$BU$83, MATCH('2. 2015 Continuity Schedule'!BU$20, '2. 2015 Continuity Schedule'!C$20:BU$20,0),FALSE)","v":0}]
["Other Regulatory Assets - Sub-Account - Financial Assistance Payment and Recovery Carrying Charges",1508,{"$f":"VLOOKUP(A7, '2. 2015 Continuity Schedule'!$C$20:$BU$83, MATCH('2. 2015 Continuity Schedule'!BO$20, '2. 2015 Continuity Schedule'!C$20:BU$20,0),FALSE)","v":0},{"$f":"VLOOKUP(A7, '2. 2015 Continuity Schedule'!$C$20:$BU$83, MATCH('2. 2015 Continuity Schedule'!BP$20, '2. 2015 Continuity Schedule'!C$20:BU$20,0),FALSE)","v":0},0,{"$f":"VLOOKUP(A7, '2. 2015 Continuity Schedule'!$C$20:$BU$83, MATCH('2. 2015 Continuity Schedule'!BQ$20, '2. 2015 Continuity Schedule'!C$20:BU$20,0),FALSE)","v":0},{"$f":"VLOOKUP(A7, '2. 2015 Continuity Schedule'!$C$20:$BU$83, MATCH('2. 2015 Continuity Schedule'!BR$20, '2. 2015 Continuity Schedule'!C$20:BU$20,0),FALSE)","v":0},0,{"$f":"VLOOKUP(A7, '2. 2015 Continuity Schedule'!$C$20:$BU$83, MATCH('2. 2015 Continuity Schedule'!BT$20, '2. 2015 Continuity Schedule'!C$20:BU$20,0),FALSE)","v":0},{"$f":"VLOOKUP(A7, '2. 2015 Continuity Schedule'!$C$20:$BU$83, MATCH('2. 2015 Continuity Schedule'!BU$20, '2. 2015 Continuity Schedule'!C$20:BU$20,0),FALSE)","v":0}]
["Other Regulatory Assets - Sub-Account - Other 4",1508,{"$f":"VLOOKUP(A8, '2. 2015 Continuity Schedule'!$C$20:$BU$83, MATCH('2. 2015 Continuity Schedule'!BO$20, '2. 2015 Continuity Schedule'!C$20:BU$20,0),FALSE)","v":0},{"$f":"VLOOKUP(A8, '2. 2015 Continuity Schedule'!$C$20:$BU$83, MATCH('2. 2015 Continuity Schedule'!BP$20, '2. 2015 Continuity Schedule'!C$20:BU$20,0),FALSE)","v":0},0,{"$f":"VLOOKUP(A8, '2. 2015 Continuity Schedule'!$C$20:$BU$83, MATCH('2. 2015 Continuity Schedule'!BQ$20, '2. 2015 Continuity Schedule'!C$20:BU$20,0),FALSE)","v":0},{"$f":"VLOOKUP(A8, '2. 2015 Continuity Schedule'!$C$20:$BU$83, MATCH('2. 2015 Continuity Schedule'!BR$20, '2. 2015 Continuity Schedule'!C$20:BU$20,0),FALSE)","v":0},0,{"$f":"VLOOKUP(A8, '2. 2015 Continuity Schedule'!$C$20:$BU$83, MATCH('2. 2015 Continuity Schedule'!BT$20, '2. 2015 Continuity Schedule'!C$20:BU$20,0),FALSE)","v":0},{"$f":"VLOOKUP(A8, '2. 2015 Continuity Schedule'!$C$20:$BU$83, MATCH('2. 2015 Continuity Schedule'!BU$20, '2. 2015 Continuity Schedule'!C$20:BU$20,0),FALSE)","v":0}]
["Retail Cost Variance Account - Retail",1518,{"$f":"VLOOKUP(A9, '2. 2015 Continuity Schedule'!$C$20:$BU$83, MATCH('2. 2015 Continuity Schedule'!BO$20, '2. 2015 Continuity Schedule'!C$20:BU$20,0),FALSE)","v":0},{"$f":"VLOOKUP(A9, '2. 2015 Continuity Schedule'!$C$20:$BU$83, MATCH('2. 2015 Continuity Schedule'!BP$20, '2. 2015 Continuity Schedule'!C$20:BU$20,0),FALSE)","v":0},0,{"$f":"VLOOKUP(A9, '2. 2015 Continuity Schedule'!$C$20:$BU$83, MATCH('2. 2015 Continuity Schedule'!BQ$20, '2. 2015 Continuity Schedule'!C$20:BU$20,0),FALSE)","v":0},{"$f":"VLOOKUP(A9, '2. 2015 Continuity Schedule'!$C$20:$BU$83, MATCH('2. 2015 Continuity Schedule'!BR$20, '2. 2015 Continuity Schedule'!C$20:BU$20,0),FALSE)","v":0},0,{"$f":"VLOOKUP(A9, '2. 2015 Continuity Schedule'!$C$20:$BU$83, MATCH('2. 2015 Continuity Schedule'!BT$20, '2. 2015 Continuity Schedule'!C$20:BU$20,0),FALSE)","v":0},{"$f":"VLOOKUP(A9, '2. 2015 Continuity Schedule'!$C$20:$BU$83, MATCH('2. 2015 Continuity Schedule'!BU$20, '2. 2015 Continuity Schedule'!C$20:BU$20,0),FALSE)","v":0}]
["Misc. Deferred Debits",1525,{"$f":"VLOOKUP(A10, '2. 2015 Continuity Schedule'!$C$20:$BU$83, MATCH('2. 2015 Continuity Schedule'!BO$20, '2. 2015 Continuity Schedule'!C$20:BU$20,0),FALSE)","v":0},{"$f":"VLOOKUP(A10, '2. 2015 Continuity Schedule'!$C$20:$BU$83, MATCH('2. 2015 Continuity Schedule'!BP$20, '2. 2015 Continuity Schedule'!C$20:BU$20,0),FALSE)","v":0},0,{"$f":"VLOOKUP(A10, '2. 2015 Continuity Schedule'!$C$20:$BU$83, MATCH('2. 2015 Continuity Schedule'!BQ$20, '2. 2015 Continuity Schedule'!C$20:BU$20,0),FALSE)","v":0},{"$f":"VLOOKUP(A10, '2. 2015 Continuity Schedule'!$C$20:$BU$83, MATCH('2. 2015 Continuity Schedule'!BR$20, '2. 2015 Continuity Schedule'!C$20:BU$20,0),FALSE)","v":0},0,{"$f":"VLOOKUP(A10, '2. 2015 Continuity Schedule'!$C$20:$BU$83, MATCH('2. 2015 Continuity Schedule'!BT$20, '2. 2015 Continuity Schedule'!C$20:BU$20,0),FALSE)","v":0},{"$f":"VLOOKUP(A10, '2. 2015 Continuity Schedule'!$C$20:$BU$83, MATCH('2. 2015 Continuity Schedule'!BU$20, '2. 2015 Continuity Schedule'!C$20:BU$20,0),FALSE)","v":0}]
["Renewable Generation Connection Capital Deferral Account",1531,{"$f":"VLOOKUP(A11, '2. 2015 Continuity Schedule'!$C$20:$BU$83, MATCH('2. 2015 Continuity Schedule'!BO$20, '2. 2015 Continuity Schedule'!C$20:BU$20,0),FALSE)","v":0},{"$f":"VLOOKUP(A11, '2. 2015 Continuity Schedule'!$C$20:$BU$83, MATCH('2. 2015 Continuity Schedule'!BP$20, '2. 2015 Continuity Schedule'!C$20:BU$20,0),FALSE)","v":0},0,{"$f":"VLOOKUP(A11, '2. 2015 Continuity Schedule'!$C$20:$BU$83, MATCH('2. 2015 Continuity Schedule'!BQ$20, '2. 2015 Continuity Schedule'!C$20:BU$20,0),FALSE)","v":0},{"$f":"VLOOKUP(A11, '2. 2015 Continuity Schedule'!$C$20:$BU$83, MATCH('2. 2015 Continuity Schedule'!BR$20, '2. 2015 Continuity Schedule'!C$20:BU$20,0),FALSE)","v":0},0,{"$f":"VLOOKUP(A11, '2. 2015 Continuity Schedule'!$C$20:$BU$83, MATCH('2. 2015 Continuity Schedule'!BT$20, '2. 2015 Continuity Schedule'!C$20:BU$20,0),FALSE)","v":0},{"$f":"VLOOKUP(A11, '2. 2015 Continuity Schedule'!$C$20:$BU$83, MATCH('2. 2015 Continuity Schedule'!BU$20, '2. 2015 Continuity Schedule'!C$20:BU$20,0),FALSE)","v":0}]
["Renewable Generation Connection OM&A Deferral Account",1532,{"$f":"VLOOKUP(A12, '2. 2015 Continuity Schedule'!$C$20:$BU$83, MATCH('2. 2015 Continuity Schedule'!BO$20, '2. 2015 Continuity Schedule'!C$20:BU$20,0),FALSE)","v":0},{"$f":"VLOOKUP(A12, '2. 2015 Continuity Schedule'!$C$20:$BU$83, MATCH('2. 2015 Continuity Schedule'!BP$20, '2. 2015 Continuity Schedule'!C$20:BU$20,0),FALSE)","v":0},0,{"$f":"VLOOKUP(A12, '2. 2015 Continuity Schedule'!$C$20:$BU$83, MATCH('2. 2015 Continuity Schedule'!BQ$20, '2. 2015 Continuity Schedule'!C$20:BU$20,0),FALSE)","v":0},{"$f":"VLOOKUP(A12, '2. 2015 Continuity Schedule'!$C$20:$BU$83, MATCH('2. 2015 Continuity Schedule'!BR$20, '2. 2015 Continuity Schedule'!C$20:BU$20,0),FALSE)","v":0},0,{"$f":"VLOOKUP(A12, '2. 2015 Continuity Schedule'!$C$20:$BU$83, MATCH('2. 2015 Continuity Schedule'!BT$20, '2. 2015 Continuity Schedule'!C$20:BU$20,0),FALSE)","v":0},{"$f":"VLOOKUP(A12, '2. 2015 Continuity Schedule'!$C$20:$BU$83, MATCH('2. 2015 Continuity Schedule'!BU$20, '2. 2015 Continuity Schedule'!C$20:BU$20,0),FALSE)","v":0}]
["Renewable Generation Connection Funding Adder Deferral Account ",1533,{"$f":"VLOOKUP(A13, '2. 2015 Continuity Schedule'!$C$20:$BU$83, MATCH('2. 2015 Continuity Schedule'!BO$20, '2. 2015 Continuity Schedule'!C$20:BU$20,0),FALSE)","v":0},{"$f":"VLOOKUP(A13, '2. 2015 Continuity Schedule'!$C$20:$BU$83, MATCH('2. 2015 Continuity Schedule'!BP$20, '2. 2015 Continuity Schedule'!C$20:BU$20,0),FALSE)","v":0},0,{"$f":"VLOOKUP(A13, '2. 2015 Continuity Schedule'!$C$20:$BU$83, MATCH('2. 2015 Continuity Schedule'!BQ$20, '2. 2015 Continuity Schedule'!C$20:BU$20,0),FALSE)","v":0},{"$f":"VLOOKUP(A13, '2. 2015 Continuity Schedule'!$C$20:$BU$83, MATCH('2. 2015 Continuity Schedule'!BR$20, '2. 2015 Continuity Schedule'!C$20:BU$20,0),FALSE)","v":0},0,{"$f":"VLOOKUP(A13, '2. 2015 Continuity Schedule'!$C$20:$BU$83, MATCH('2. 2015 Continuity Schedule'!BT$20, '2. 2015 Continuity Schedule'!C$20:BU$20,0),FALSE)","v":0},{"$f":"VLOOKUP(A13, '2. 2015 Continuity Schedule'!$C$20:$BU$83, MATCH('2. 2015 Continuity Schedule'!BU$20, '2. 2015 Continuity Schedule'!C$20:BU$20,0),FALSE)","v":0}]
["Smart Grid Capital Deferral Account",1534,{"$f":"VLOOKUP(A14, '2. 2015 Continuity Schedule'!$C$20:$BU$83, MATCH('2. 2015 Continuity Schedule'!BO$20, '2. 2015 Continuity Schedule'!C$20:BU$20,0),FALSE)","v":0},{"$f":"VLOOKUP(A14, '2. 2015 Continuity Schedule'!$C$20:$BU$83, MATCH('2. 2015 Continuity Schedule'!BP$20, '2. 2015 Continuity Schedule'!C$20:BU$20,0),FALSE)","v":0},0,{"$f":"VLOOKUP(A14, '2. 2015 Continuity Schedule'!$C$20:$BU$83, MATCH('2. 2015 Continuity Schedule'!BQ$20, '2. 2015 Continuity Schedule'!C$20:BU$20,0),FALSE)","v":0},{"$f":"VLOOKUP(A14, '2. 2015 Continuity Schedule'!$C$20:$BU$83, MATCH('2. 2015 Continuity Schedule'!BR$20, '2. 2015 Continuity Schedule'!C$20:BU$20,0),FALSE)","v":0},0,{"$f":"VLOOKUP(A14, '2. 2015 Continuity Schedule'!$C$20:$BU$83, MATCH('2. 2015 Continuity Schedule'!BT$20, '2. 2015 Continuity Schedule'!C$20:BU$20,0),FALSE)","v":0},{"$f":"VLOOKUP(A14, '2. 2015 Continuity Schedule'!$C$20:$BU$83, MATCH('2. 2015 Continuity Schedule'!BU$20, '2. 2015 Continuity Schedule'!C$20:BU$20,0),FALSE)","v":0}]
["Smart Grid OM&A Deferral Account",1535,{"$f":"VLOOKUP(A15, '2. 2015 Continuity Schedule'!$C$20:$BU$83, MATCH('2. 2015 Continuity Schedule'!BO$20, '2. 2015 Continuity Schedule'!C$20:BU$20,0),FALSE)","v":0},{"$f":"VLOOKUP(A15, '2. 2015 Continuity Schedule'!$C$20:$BU$83, MATCH('2. 2015 Continuity Schedule'!BP$20, '2. 2015 Continuity Schedule'!C$20:BU$20,0),FALSE)","v":0},0,{"$f":"VLOOKUP(A15, '2. 2015 Continuity Schedule'!$C$20:$BU$83, MATCH('2. 2015 Continuity Schedule'!BQ$20, '2. 2015 Continuity Schedule'!C$20:BU$20,0),FALSE)","v":0},{"$f":"VLOOKUP(A15, '2. 2015 Continuity Schedule'!$C$20:$BU$83, MATCH('2. 2015 Continuity Schedule'!BR$20, '2. 2015 Continuity Schedule'!C$20:BU$20,0),FALSE)","v":0},0,{"$f":"VLOOKUP(A15, '2. 2015 Continuity Schedule'!$C$20:$BU$83, MATCH('2. 2015 Continuity Schedule'!BT$20, '2. 2015 Continuity Schedule'!C$20:BU$20,0),FALSE)","v":0},{"$f":"VLOOKUP(A15, '2. 2015 Continuity Schedule'!$C$20:$BU$83, MATCH('2. 2015 Continuity Schedule'!BU$20, '2. 2015 Continuity Schedule'!C$20:BU$20,0),FALSE)","v":0}]
["Smart Grid Funding Adder Deferral Account",1536,{"$f":"VLOOKUP(A16, '2. 2015 Continuity Schedule'!$C$20:$BU$83, MATCH('2. 2015 Continuity Schedule'!BO$20, '2. 2015 Continuity Schedule'!C$20:BU$20,0),FALSE)","v":0},{"$f":"VLOOKUP(A16, '2. 2015 Continuity Schedule'!$C$20:$BU$83, MATCH('2. 2015 Continuity Schedule'!BP$20, '2. 2015 Continuity Schedule'!C$20:BU$20,0),FALSE)","v":0},0,{"$f":"VLOOKUP(A16, '2. 2015 Continuity Schedule'!$C$20:$BU$83, MATCH('2. 2015 Continuity Schedule'!BQ$20, '2. 2015 Continuity Schedule'!C$20:BU$20,0),FALSE)","v":0},{"$f":"VLOOKUP(A16, '2. 2015 Continuity Schedule'!$C$20:$BU$83, MATCH('2. 2015 Continuity Schedule'!BR$20, '2. 2015 Continuity Schedule'!C$20:BU$20,0),FALSE)","v":0},0,{"$f":"VLOOKUP(A16, '2. 2015 Continuity Schedule'!$C$20:$BU$83, MATCH('2. 2015 Continuity Schedule'!BT$20, '2. 2015 Continuity Schedule'!C$20:BU$20,0),FALSE)","v":0},{"$f":"VLOOKUP(A16, '2. 2015 Continuity Schedule'!$C$20:$BU$83, MATCH('2. 2015 Continuity Schedule'!BU$20, '2. 2015 Continuity Schedule'!C$20:BU$20,0),FALSE)","v":0}]
["Retail Cost Variance Account - STR",1548,{"$f":"VLOOKUP(A17, '2. 2015 Continuity Schedule'!$C$20:$BU$83, MATCH('2. 2015 Continuity Schedule'!BO$20, '2. 2015 Continuity Schedule'!C$20:BU$20,0),FALSE)","v":0},{"$f":"VLOOKUP(A17, '2. 2015 Continuity Schedule'!$C$20:$BU$83, MATCH('2. 2015 Continuity Schedule'!BP$20, '2. 2015 Continuity Schedule'!C$20:BU$20,0),FALSE)","v":0},0,{"$f":"VLOOKUP(A17, '2. 2015 Continuity Schedule'!$C$20:$BU$83, MATCH('2. 2015 Continuity Schedule'!BQ$20, '2. 2015 Continuity Schedule'!C$20:BU$20,0),FALSE)","v":0},{"$f":"VLOOKUP(A17, '2. 2015 Continuity Schedule'!$C$20:$BU$83, MATCH('2. 2015 Continuity Schedule'!BR$20, '2. 2015 Continuity Schedule'!C$20:BU$20,0),FALSE)","v":0},0,{"$f":"VLOOKUP(A17, '2. 2015 Continuity Schedule'!$C$20:$BU$83, MATCH('2. 2015 Continuity Schedule'!BT$20, '2. 2015 Continuity Schedule'!C$20:BU$20,0),FALSE)","v":0},{"$f":"VLOOKUP(A17, '2. 2015 Continuity Schedule'!$C$20:$BU$83, MATCH('2. 2015 Continuity Schedule'!BU$20, '2. 2015 Continuity Schedule'!C$20:BU$20,0),FALSE)","v":0}]
["LV Variance Account",1550,{"$f":"VLOOKUP(A18, '2. 2015 Continuity Schedule'!$C$20:$BU$83, MATCH('2. 2015 Continuity Schedule'!BO$20, '2. 2015 Continuity Schedule'!C$20:BU$20,0),FALSE)","v":287709.56999999989},{"$f":"VLOOKUP(A18, '2. 2015 Continuity Schedule'!$C$20:$BU$83, MATCH('2. 2015 Continuity Schedule'!BP$20, '2. 2015 Continuity Schedule'!C$20:BU$20,0),FALSE)","v":1813.2786400000059},289522.84863999992,{"$f":"VLOOKUP(A18, '2. 2015 Continuity Schedule'!$C$20:$BU$83, MATCH('2. 2015 Continuity Schedule'!BQ$20, '2. 2015 Continuity Schedule'!C$20:BU$20,0),FALSE)","v":3430.9366222499984},{"$f":"VLOOKUP(A18, '2. 2015 Continuity Schedule'!$C$20:$BU$83, MATCH('2. 2015 Continuity Schedule'!BR$20, '2. 2015 Continuity Schedule'!C$20:BU$20,0),FALSE)","v":0},292953.78526224993,{"$f":"VLOOKUP(A18, '2. 2015 Continuity Schedule'!$C$20:$BU$83, MATCH('2. 2015 Continuity Schedule'!BT$20, '2. 2015 Continuity Schedule'!C$20:BU$20,0),FALSE)","v":584063},{"$f":"VLOOKUP(A18, '2. 2015 Continuity Schedule'!$C$20:$BU$83, MATCH('2. 2015 Continuity Schedule'!BU$20, '2. 2015 Continuity Schedule'!C$20:BU$20,0),FALSE)","v":0.38000000012107193}]
["Smart Metering Entity Charge Variance Account",1551,{"$f":"VLOOKUP(A19, '2. 2015 Continuity Schedule'!$C$20:$BU$83, MATCH('2. 2015 Continuity Schedule'!BO$20, '2. 2015 Continuity Schedule'!C$20:BU$20,0),FALSE)","v":-18781.050000000076},{"$f":"VLOOKUP(A19, '2. 2015 Continuity Schedule'!$C$20:$BU$83, MATCH('2. 2015 Continuity Schedule'!BP$20, '2. 2015 Continuity Schedule'!C$20:BU$20,0),FALSE)","v":-101.77550299999376},-18882.825503000069,{"$f":"VLOOKUP(A19, '2. 2015 Continuity Schedule'!$C$20:$BU$83, MATCH('2. 2015 Continuity Schedule'!BQ$20, '2. 2015 Continuity Schedule'!C$20:BU$20,0),FALSE)","v":-223.96402125000088},{"$f":"VLOOKUP(A19, '2. 2015 Continuity Schedule'!$C$20:$BU$83, MATCH('2. 2015 Continuity Schedule'!BR$20, '2. 2015 Continuity Schedule'!C$20:BU$20,0),FALSE)","v":0},-19106.789524250071,{"$f":"VLOOKUP(A19, '2. 2015 Continuity Schedule'!$C$20:$BU$83, MATCH('2. 2015 Continuity Schedule'!BT$20, '2. 2015 Continuity Schedule'!C$20:BU$20,0),FALSE)","v":-37128},{"$f":"VLOOKUP(A19, '2. 2015 Continuity Schedule'!$C$20:$BU$83, MATCH('2. 2015 Continuity Schedule'!BU$20, '2. 2015 Continuity Schedule'!C$20:BU$20,0),FALSE)","v":-0.2699999994947575}]
["Smart Meter Capital and Recovery Offset Variance - Sub-Account - Capital10",1555,{"$f":"VLOOKUP(A20, '2. 2015 Continuity Schedule'!$C$20:$BU$83, MATCH('2. 2015 Continuity Schedule'!BO$20, '2. 2015 Continuity Schedule'!C$20:BU$20,0),FALSE)","v":{"$error":"#N/A"}},{"$f":"VLOOKUP(A20, '2. 2015 Continuity Schedule'!$C$20:$BU$83, MATCH('2. 2015 Continuity Schedule'!BP$20, '2. 2015 Continuity Schedule'!C$20:BU$20,0),FALSE)","v":{"$error":"#N/A"}},{"$error":"#N/A"},{"$f":"VLOOKUP(A20, '2. 2015 Continuity Schedule'!$C$20:$BU$83, MATCH('2. 2015 Continuity Schedule'!BQ$20, '2. 2015 Continuity Schedule'!C$20:BU$20,0),FALSE)","v":{"$error":"#N/A"}},{"$f":"VLOOKUP(A20, '2. 2015 Continuity Schedule'!$C$20:$BU$83, MATCH('2. 2015 Continuity Schedule'!BR$20, '2. 2015 Continuity Schedule'!C$20:BU$20,0),FALSE)","v":{"$error":"#N/A"}},{"$error":"#N/A"},{"$f":"VLOOKUP(A20, '2. 2015 Continuity Schedule'!$C$20:$BU$83, MATCH('2. 2015 Continuity Schedule'!BT$20, '2. 2015 Continuity Schedule'!C$20:BU$20,0),FALSE)","v":{"$error":"#N/A"}},{"$f":"VLOOKUP(A20, '2. 2015 Continuity Schedule'!$C$20:$BU$83, MATCH('2. 2015 Continuity Schedule'!BU$20, '2. 2015 Continuity Schedule'!C$20:BU$20,0),FALSE)","v":{"$error":"#N/A"}}]
["Smart Meter Capital and Recovery Offset Variance - Sub-Account - Recoveries10",1555,{"$f":"VLOOKUP(A21, '2. 2015 Continuity Schedule'!$C$20:$BU$83, MATCH('2. 2015 Continuity Schedule'!BO$20, '2. 2015 Continuity Schedule'!C$20:BU$20,0),FALSE)","v":{"$error":"#N/A"}},{"$f":"VLOOKUP(A21, '2. 2015 Continuity Schedule'!$C$20:$BU$83, MATCH('2. 2015 Continuity Schedule'!BP$20, '2. 2015 Continuity Schedule'!C$20:BU$20,0),FALSE)","v":{"$error":"#N/A"}},{"$error":"#N/A"},{"$f":"VLOOKUP(A21, '2. 2015 Continuity Schedule'!$C$20:$BU$83, MATCH('2. 2015 Continuity Schedule'!BQ$20, '2. 2015 Continuity Schedule'!C$20:BU$20,0),FALSE)","v":{"$error":"#N/A"}},{"$f":"VLOOKUP(A21, '2. 2015 Continuity Schedule'!$C$20:$BU$83, MATCH('2. 2015 Continuity Schedule'!BR$20, '2. 2015 Continuity Schedule'!C$20:BU$20,0),FALSE)","v":{"$error":"#N/A"}},{"$error":"#N/A"},{"$f":"VLOOKUP(A21, '2. 2015 Continuity Schedule'!$C$20:$BU$83, MATCH('2. 2015 Continuity Schedule'!BT$20, '2. 2015 Continuity Schedule'!C$20:BU$20,0),FALSE)","v":{"$error":"#N/A"}},{"$f":"VLOOKUP(A21, '2. 2015 Continuity Schedule'!$C$20:$BU$83, MATCH('2. 2015 Continuity Schedule'!BU$20, '2. 2015 Continuity Schedule'!C$20:BU$20,0),FALSE)","v":{"$error":"#N/A"}}]
["Smart Meter Capital and Recovery Offset Variance - Sub-Account - Stranded Meter Costs10",1555,{"$f":"VLOOKUP(A22, '2. 2015 Continuity Schedule'!$C$20:$BU$83, MATCH('2. 2015 Continuity Schedule'!BO$20, '2. 2015 Continuity Schedule'!C$20:BU$20,0),FALSE)","v":{"$error":"#N/A"}},{"$f":"VLOOKUP(A22, '2. 2015 Continuity Schedule'!$C$20:$BU$83, MATCH('2. 2015 Continuity Schedule'!BP$20, '2. 2015 Continuity Schedule'!C$20:BU$20,0),FALSE)","v":{"$error":"#N/A"}},{"$error":"#N/A"},{"$f":"VLOOKUP(A22, '2. 2015 Continuity Schedule'!$C$20:$BU$83, MATCH('2. 2015 Continuity Schedule'!BQ$20, '2. 2015 Continuity Schedule'!C$20:BU$20,0),FALSE)","v":{"$error":"#N/A"}},{"$f":"VLOOKUP(A22, '2. 2015 Continuity Schedule'!$C$20:$BU$83, MATCH('2. 2015 Continuity Schedule'!BR$20, '2. 2015 Continuity Schedule'!C$20:BU$20,0),FALSE)","v":{"$error":"#N/A"}},{"$error":"#N/A"},{"$f":"VLOOKUP(A22, '2. 2015 Continuity Schedule'!$C$20:$BU$83, MATCH('2. 2015 Continuity Schedule'!BT$20, '2. 2015 Continuity Schedule'!C$20:BU$20,0),FALSE)","v":{"$error":"#N/A"}},{"$f":"VLOOKUP(A22, '2. 2015 Continuity Schedule'!$C$20:$BU$83, MATCH('2. 2015 Continuity Schedule'!BU$20, '2. 2015 Continuity Schedule'!C$20:BU$20,0),FALSE)","v":{"$error":"#N/A"}}]
["Smart Meter OM&A Variance10",1556,{"$f":"VLOOKUP(A23, '2. 2015 Continuity Schedule'!$C$20:$BU$83, MATCH('2. 2015 Continuity Schedule'!BO$20, '2. 2015 Continuity Schedule'!C$20:BU$20,0),FALSE)","v":{"$error":"#N/A"}},{"$f":"VLOOKUP(A23, '2. 2015 Continuity Schedule'!$C$20:$BU$83, MATCH('2. 2015 Continuity Schedule'!BP$20, '2. 2015 Continuity Schedule'!C$20:BU$20,0),FALSE)","v":{"$error":"#N/A"}},{"$error":"#N/A"},{"$f":"VLOOKUP(A23, '2. 2015 Continuity Schedule'!$C$20:$BU$83, MATCH('2. 2015 Continuity Schedule'!BQ$20, '2. 2015 Continuity Schedule'!C$20:BU$20,0),FALSE)","v":{"$error":"#N/A"}},{"$f":"VLOOKUP(A23, '2. 2015 Continuity Schedule'!$C$20:$BU$83, MATCH('2. 2015 Continuity Schedule'!BR$20, '2. 2015 Continuity Schedule'!C$20:BU$20,0),FALSE)","v":{"$error":"#N/A"}},{"$error":"#N/A"},{"$f":"VLOOKUP(A23, '2. 2015 Continuity Schedule'!$C$20:$BU$83, MATCH('2. 2015 Continuity Schedule'!BT$20, '2. 2015 Continuity Schedule'!C$20:BU$20,0),FALSE)","v":{"$error":"#N/A"}},{"$f":"VLOOKUP(A23, '2. 2015 Continuity Schedule'!$C$20:$BU$83, MATCH('2. 2015 Continuity Schedule'!BU$20, '2. 2015 Continuity Schedule'!C$20:BU$20,0),FALSE)","v":{"$error":"#N/A"}}]
["Deferred Payments in Lieu of Taxes",1562,{"$f":"VLOOKUP(A24, '2. 2015 Continuity Schedule'!$C$20:$BU$83, MATCH('2. 2015 Continuity Schedule'!BO$20, '2. 2015 Continuity Schedule'!C$20:BU$20,0),FALSE)","v":{"$error":"#N/A"}},{"$f":"VLOOKUP(A24, '2. 2015 Continuity Schedule'!$C$20:$BU$83, MATCH('2. 2015 Continuity Schedule'!BP$20, '2. 2015 Continuity Schedule'!C$20:BU$20,0),FALSE)","v":{"$error":"#N/A"}},{"$error":"#N/A"},{"$f":"VLOOKUP(A24, '2. 2015 Continuity Schedule'!$C$20:$BU$83, MATCH('2. 2015 Continuity Schedule'!BQ$20, '2. 2015 Continuity Schedule'!C$20:BU$20,0),FALSE)","v":{"$error":"#N/A"}},{"$f":"VLOOKUP(A24, '2. 2015 Continuity Schedule'!$C$20:$BU$83, MATCH('2. 2015 Continuity Schedule'!BR$20, '2. 2015 Continuity Schedule'!C$20:BU$20,0),FALSE)","v":{"$error":"#N/A"}},{"$error":"#N/A"},{"$f":"VLOOKUP(A24, '2. 2015 Continuity Schedule'!$C$20:$BU$83, MATCH('2. 2015 Continuity Schedule'!BT$20, '2. 2015 Continuity Schedule'!C$20:BU$20,0),FALSE)","v":{"$error":"#N/A"}},{"$f":"VLOOKUP(A24, '2. 2015 Continuity Schedule'!$C$20:$BU$83, MATCH('2. 2015 Continuity Schedule'!BU$20, '2. 2015 Continuity Schedule'!C$20:BU$20,0),FALSE)","v":{"$error":"#N/A"}}]
["Board-Approved CDM Variance Account",1567,{"$f":"VLOOKUP(A25, '2. 2015 Continuity Schedule'!$C$20:$BU$83, MATCH('2. 2015 Continuity Schedule'!BO$20, '2. 2015 Continuity Schedule'!C$20:BU$20,0),FALSE)","v":0},{"$f":"VLOOKUP(A25, '2. 2015 Continuity Schedule'!$C$20:$BU$83, MATCH('2. 2015 Continuity Schedule'!BP$20, '2. 2015 Continuity Schedule'!C$20:BU$20,0),FALSE)","v":0},0,{"$f":"VLOOKUP(A25, '2. 2015 Continuity Schedule'!$C$20:$BU$83, MATCH('2. 2015 Continuity Schedule'!BQ$20, '2. 2015 Continuity Schedule'!C$20:BU$20,0),FALSE)","v":0},{"$f":"VLOOKUP(A25, '2. 2015 Continuity Schedule'!$C$20:$BU$83, MATCH('2. 2015 Continuity Schedule'!BR$20, '2. 2015 Continuity Schedule'!C$20:BU$20,0),FALSE)","v":0},0,{"$f":"VLOOKUP(A25, '2. 2015 Continuity Schedule'!$C$20:$BU$83, MATCH('2. 2015 Continuity Schedule'!BT$20, '2. 2015 Continuity Schedule'!C$20:BU$20,0),FALSE)","v":0},{"$f":"VLOOKUP(A25, '2. 2015 Continuity Schedule'!$C$20:$BU$83, MATCH('2. 2015 Continuity Schedule'!BU$20, '2. 2015 Continuity Schedule'!C$20:BU$20,0),FALSE)","v":0}]
["LRAM Variance Account",1568,{"$f":"VLOOKUP(A26, '2. 2015 Continuity Schedule'!$C$20:$BU$83, MATCH('2. 2015 Continuity Schedule'!BO$20, '2. 2015 Continuity Schedule'!C$20:BU$20,0),FALSE)","v":0},{"$f":"VLOOKUP(A26, '2. 2015 Continuity Schedule'!$C$20:$BU$83, MATCH('2. 2015 Continuity Schedule'!BP$20, '2. 2015 Continuity Schedule'!C$20:BU$20,0),FALSE)","v":0},0,{"$f":"VLOOKUP(A26, '2. 2015 Continuity Schedule'!$C$20:$BU$83, MATCH('2. 2015 Continuity Schedule'!BQ$20, '2. 2015 Continuity Schedule'!C$20:BU$20,0),FALSE)","v":0},{"$f":"VLOOKUP(A26, '2. 2015 Continuity Schedule'!$C$20:$BU$83, MATCH('2. 2015 Continuity Schedule'!BR$20, '2. 2015 Continuity Schedule'!C$20:BU$20,0),FALSE)","v":0},0,{"$f":"VLOOKUP(A26, '2. 2015 Continuity Schedule'!$C$20:$BU$83, MATCH('2. 2015 Continuity Schedule'!BT$20, '2. 2015 Continuity Schedule'!C$20:BU$20,0),FALSE)","v":0},{"$f":"VLOOKUP(A26, '2. 2015 Continuity Schedule'!$C$20:$BU$83, MATCH('2. 2015 Continuity Schedule'!BU$20, '2. 2015 Continuity Schedule'!C$20:BU$20,0),FALSE)","v":0}]
["Extra-Ordinary Event Costs",1572,{"$f":"VLOOKUP(A27, '2. 2015 Continuity Schedule'!$C$20:$BU$83, MATCH('2. 2015 Continuity Schedule'!BO$20, '2. 2015 Continuity Schedule'!C$20:BU$20,0),FALSE)","v":0},{"$f":"VLOOKUP(A27, '2. 2015 Continuity Schedule'!$C$20:$BU$83, MATCH('2. 2015 Continuity Schedule'!BP$20, '2. 2015 Continuity Schedule'!C$20:BU$20,0),FALSE)","v":0},0,{"$f":"VLOOKUP(A27, '2. 2015 Continuity Schedule'!$C$20:$BU$83, MATCH('2. 2015 Continuity Schedule'!BQ$20, '2. 2015 Continuity Schedule'!C$20:BU$20,0),FALSE)","v":0},{"$f":"VLOOKUP(A27, '2. 2015 Continuity Schedule'!$C$20:$BU$83, MATCH('2. 2015 Continuity Schedule'!BR$20, '2. 2015 Continuity Schedule'!C$20:BU$20,0),FALSE)","v":0},0,{"$f":"VLOOKUP(A27, '2. 2015 Continuity Schedule'!$C$20:$BU$83, MATCH('2. 2015 Continuity Schedule'!BT$20, '2. 2015 Continuity Schedule'!C$20:BU$20,0),FALSE)","v":0},{"$f":"VLOOKUP(A27, '2. 2015 Continuity Schedule'!$C$20:$BU$83, MATCH('2. 2015 Continuity Schedule'!BU$20, '2. 2015 Continuity Schedule'!C$20:BU$20,0),FALSE)","v":0}]
["Deferred Rate Impact Amounts",1574,{"$f":"VLOOKUP(A28, '2. 2015 Continuity Schedule'!$C$20:$BU$83, MATCH('2. 2015 Continuity Schedule'!BO$20, '2. 2015 Continuity Schedule'!C$20:BU$20,0),FALSE)","v":0},{"$f":"VLOOKUP(A28, '2. 2015 Continuity Schedule'!$C$20:$BU$83, MATCH('2. 2015 Continuity Schedule'!BP$20, '2. 2015 Continuity Schedule'!C$20:BU$20,0),FALSE)","v":0},0,{"$f":"VLOOKUP(A28, '2. 2015 Continuity Schedule'!$C$20:$BU$83, MATCH('2. 2015 Continuity Schedule'!BQ$20, '2. 2015 Continuity Schedule'!C$20:BU$20,0),FALSE)","v":0},{"$f":"VLOOKUP(A28, '2. 2015 Continuity Schedule'!$C$20:$BU$83, MATCH('2. 2015 Continuity Schedule'!BR$20, '2. 2015 Continuity Schedule'!C$20:BU$20,0),FALSE)","v":0},0,{"$f":"VLOOKUP(A28, '2. 2015 Continuity Schedule'!$C$20:$BU$83, MATCH('2. 2015 Continuity Schedule'!BT$20, '2. 2015 Continuity Schedule'!C$20:BU$20,0),FALSE)","v":0},{"$f":"VLOOKUP(A28, '2. 2015 Continuity Schedule'!$C$20:$BU$83, MATCH('2. 2015 Continuity Schedule'!BU$20, '2. 2015 Continuity Schedule'!C$20:BU$20,0),FALSE)","v":0}]
["IFRS-CGAAP Transition PP&E Amounts Balance + Return Component9",1575,{"$f":"VLOOKUP(A29, '2. 2015 Continuity Schedule'!$C$20:$BU$83, MATCH('2. 2015 Continuity Schedule'!BO$20, '2. 2015 Continuity Schedule'!C$20:BU$20,0),FALSE)","v":{"$error":"#N/A"}},{"$f":"VLOOKUP(A29, '2. 2015 Continuity Schedule'!$C$20:$BU$83, MATCH('2. 2015 Continuity Schedule'!BP$20, '2. 2015 Continuity Schedule'!C$20:BU$20,0),FALSE)","v":{"$error":"#N/A"}},{"$error":"#N/A"},{"$f":"VLOOKUP(A29, '2. 2015 Continuity Schedule'!$C$20:$BU$83, MATCH('2. 2015 Continuity Schedule'!BQ$20, '2. 2015 Continuity Schedule'!C$20:BU$20,0),FALSE)","v":{"$error":"#N/A"}},{"$f":"VLOOKUP(A29, '2. 2015 Continuity Schedule'!$C$20:$BU$83, MATCH('2. 2015 Continuity Schedule'!BR$20, '2. 2015 Continuity Schedule'!C$20:BU$20,0),FALSE)","v":{"$error":"#N/A"}},{"$error":"#N/A"},{"$f":"VLOOKUP(A29, '2. 2015 Continuity Schedule'!$C$20:$BU$83, MATCH('2. 2015 Continuity Schedule'!BT$20, '2. 2015 Continuity Schedule'!C$20:BU$20,0),FALSE)","v":{"$error":"#N/A"}},{"$f":"VLOOKUP(A29, '2. 2015 Continuity Schedule'!$C$20:$BU$83, MATCH('2. 2015 Continuity Schedule'!BU$20, '2. 2015 Continuity Schedule'!C$20:BU$20,0),FALSE)","v":{"$error":"#N/A"}}]
["Accounting Changes Under CGAAP Balance + Return Component9",1576,{"$f":"VLOOKUP(A30, '2. 2015 Continuity Schedule'!$C$20:$BU$83, MATCH('2. 2015 Continuity Schedule'!BO$20, '2. 2015 Continuity Schedule'!C$20:BU$20,0),FALSE)","v":{"$error":"#N/A"}},{"$f":"VLOOKUP(A30, '2. 2015 Continuity Schedule'!$C$20:$BU$83, MATCH('2. 2015 Continuity Schedule'!BP$20, '2. 2015 Continuity Schedule'!C$20:BU$20,0),FALSE)","v":{"$error":"#N/A"}},{"$error":"#N/A"},{"$f":"VLOOKUP(A30, '2. 2015 Continuity Schedule'!$C$20:$BU$83, MATCH('2. 2015 Continuity Schedule'!BQ$20, '2. 2015 Continuity Schedule'!C$20:BU$20,0),FALSE)","v":{"$error":"#N/A"}},{"$f":"VLOOKUP(A30, '2. 2015 Continuity Schedule'!$C$20:$BU$83, MATCH('2. 2015 Continuity Schedule'!BR$20, '2. 2015 Continuity Schedule'!C$20:BU$20,0),FALSE)","v":{"$error":"#N/A"}},{"$error":"#N/A"},{"$f":"VLOOKUP(A30, '2. 2015 Continuity Schedule'!$C$20:$BU$83, MATCH('2. 2015 Continuity Schedule'!BT$20, '2. 2015 Continuity Schedule'!C$20:BU$20,0),FALSE)","v":{"$error":"#N/A"}},{"$f":"VLOOKUP(A30, '2. 2015 Continuity Schedule'!$C$20:$BU$83, MATCH('2. 2015 Continuity Schedule'!BU$20, '2. 2015 Continuity Schedule'!C$20:BU$20,0),FALSE)","v":{"$error":"#N/A"}}]
["RSVA - Wholesale Market Service Charge",1580,{"$f":"VLOOKUP(A31, '2. 2015 Continuity Schedule'!$C$20:$BU$83, MATCH('2. 2015 Continuity Schedule'!BO$20, '2. 2015 Continuity Schedule'!C$20:BU$20,0),FALSE)","v":-1179182.1299999878},{"$f":"VLOOKUP(A31, '2. 2015 Continuity Schedule'!$C$20:$BU$83, MATCH('2. 2015 Continuity Schedule'!BP$20, '2. 2015 Continuity Schedule'!C$20:BU$20,0),FALSE)","v":117315.50150899999},-1061866.6284909877,{"$f":"VLOOKUP(A31, '2. 2015 Continuity Schedule'!$C$20:$BU$83, MATCH('2. 2015 Continuity Schedule'!BQ$20, '2. 2015 Continuity Schedule'!C$20:BU$20,0),FALSE)","v":-14061.746900249853},{"$f":"VLOOKUP(A31, '2. 2015 Continuity Schedule'!$C$20:$BU$83, MATCH('2. 2015 Continuity Schedule'!BR$20, '2. 2015 Continuity Schedule'!C$20:BU$20,0),FALSE)","v":0},-1075928.3753912374,{"$f":"VLOOKUP(A31, '2. 2015 Continuity Schedule'!$C$20:$BU$83, MATCH('2. 2015 Continuity Schedule'!BT$20, '2. 2015 Continuity Schedule'!C$20:BU$20,0),FALSE)","v":-4646786},{"$f":"VLOOKUP(A31, '2. 2015 Continuity Schedule'!$C$20:$BU$83, MATCH('2. 2015 Continuity Schedule'!BU$20, '2. 2015 Continuity Schedule'!C$20:BU$20,0),FALSE)","v":-0.38000001199543476}]
["RSVA - One-time",1582,{"$f":"VLOOKUP(A32, '2. 2015 Continuity Schedule'!$C$20:$BU$83, MATCH('2. 2015 Continuity Schedule'!BO$20, '2. 2015 Continuity Schedule'!C$20:BU$20,0),FALSE)","v":0},{"$f":"VLOOKUP(A32, '2. 2015 Continuity Schedule'!$C$20:$BU$83, MATCH('2. 2015 Continuity Schedule'!BP$20, '2. 2015 Continuity Schedule'!C$20:BU$20,0),FALSE)","v":0},0,{"$f":"VLOOKUP(A32, '2. 2015 Continuity Schedule'!$C$20:$BU$83, MATCH('2. 2015 Continuity Schedule'!BQ$20, '2. 2015 Continuity Schedule'!C$20:BU$20,0),FALSE)","v":0},{"$f":"VLOOKUP(A32, '2. 2015 Continuity Schedule'!$C$20:$BU$83, MATCH('2. 2015 Continuity Schedule'!BR$20, '2. 2015 Continuity Schedule'!C$20:BU$20,0),FALSE)","v":0},0,{"$f":"VLOOKUP(A32, '2. 2015 Continuity Schedule'!$C$20:$BU$83, MATCH('2. 2015 Continuity Schedule'!BT$20, '2. 2015 Continuity Schedule'!C$20:BU$20,0),FALSE)","v":0},{"$f":"VLOOKUP(A32, '2. 2015 Continuity Schedule'!$C$20:$BU$83, MATCH('2. 2015 Continuity Schedule'!BU$20, '2. 2015 Continuity Schedule'!C$20:BU$20,0),FALSE)","v":0}]
["RSVA - Retail Transmission Network Charge",1584,{"$f":"VLOOKUP(A33, '2. 2015 Continuity Schedule'!$C$20:$BU$83, MATCH('2. 2015 Continuity Schedule'!BO$20, '2. 2015 Continuity Schedule'!C$20:BU$20,0),FALSE)","v":3491680.4000000074},{"$f":"VLOOKUP(A33, '2. 2015 Continuity Schedule'!$C$20:$BU$83, MATCH('2. 2015 Continuity Schedule'!BP$20, '2. 2015 Continuity Schedule'!C$20:BU$20,0),FALSE)","v":21374.370079},3513054.7700790074,{"$f":"VLOOKUP(A33, '2. 2015 Continuity Schedule'!$C$20:$BU$83, MATCH('2. 2015 Continuity Schedule'!BQ$20, '2. 2015 Continuity Schedule'!C$20:BU$20,0),FALSE)","v":41638.288770000087},{"$f":"VLOOKUP(A33, '2. 2015 Continuity Schedule'!$C$20:$BU$83, MATCH('2. 2015 Continuity Schedule'!BR$20, '2. 2015 Continuity Schedule'!C$20:BU$20,0),FALSE)","v":0},3554693.0588490074,{"$f":"VLOOKUP(A33, '2. 2015 Continuity Schedule'!$C$20:$BU$83, MATCH('2. 2015 Continuity Schedule'!BT$20, '2. 2015 Continuity Schedule'!C$20:BU$20,0),FALSE)","v":6965681},{"$f":"VLOOKUP(A33, '2. 2015 Continuity Schedule'!$C$20:$BU$83, MATCH('2. 2015 Continuity Schedule'!BU$20, '2. 2015 Continuity Schedule'!C$20:BU$20,0),FALSE)","v":-0.22000000718981028}]
["RSVA - Retail Transmission Connection Charge",1586,{"$f":"VLOOKUP(A34, '2. 2015 Continuity Schedule'!$C$20:$BU$83, MATCH('2. 2015 Continuity Schedule'!BO$20, '2. 2015 Continuity Schedule'!C$20:BU$20,0),FALSE)","v":2601535.5909999949},{"$f":"VLOOKUP(A34, '2. 2015 Continuity Schedule'!$C$20:$BU$83, MATCH('2. 2015 Continuity Schedule'!BP$20, '2. 2015 Continuity Schedule'!C$20:BU$20,0),FALSE)","v":17646.559406000011},2619182.1504059951,{"$f":"VLOOKUP(A34, '2. 2015 Continuity Schedule'!$C$20:$BU$83, MATCH('2. 2015 Continuity Schedule'!BQ$20, '2. 2015 Continuity Schedule'!C$20:BU$20,0),FALSE)","v":31023.31192267494},{"$f":"VLOOKUP(A34, '2. 2015 Continuity Schedule'!$C$20:$BU$83, MATCH('2. 2015 Continuity Schedule'!BR$20, '2. 2015 Continuity Schedule'!C$20:BU$20,0),FALSE)","v":0},2650205.4623286701,{"$f":"VLOOKUP(A34, '2. 2015 Continuity Schedule'!$C$20:$BU$83, MATCH('2. 2015 Continuity Schedule'!BT$20, '2. 2015 Continuity Schedule'!C$20:BU$20,0),FALSE)","v":3959035},{"$f":"VLOOKUP(A34, '2. 2015 Continuity Schedule'!$C$20:$BU$83, MATCH('2. 2015 Continuity Schedule'!BU$20, '2. 2015 Continuity Schedule'!C$20:BU$20,0),FALSE)","v":0.33900000574067235}]
["RSVA - Power (excluding Global Adjustment)",1588,{"$f":"VLOOKUP(A35, '2. 2015 Continuity Schedule'!$C$20:$BU$83, MATCH('2. 2015 Continuity Schedule'!BO$20, '2. 2015 Continuity Schedule'!C$20:BU$20,0),FALSE)","v":-2889872.5481011812},{"$f":"VLOOKUP(A35, '2. 2015 Continuity Schedule'!$C$20:$BU$83, MATCH('2. 2015 Continuity Schedule'!BP$20, '2. 2015 Continuity Schedule'!C$20:BU$20,0),FALSE)","v":-20440.802708108284},-2910313.3508092896,{"$f":"VLOOKUP(A35, '2. 2015 Continuity Schedule'!$C$20:$BU$83, MATCH('2. 2015 Continuity Schedule'!BQ$20, '2. 2015 Continuity Schedule'!C$20:BU$20,0),FALSE)","v":-34461.730136106584},{"$f":"VLOOKUP(A35, '2. 2015 Continuity Schedule'!$C$20:$BU$83, MATCH('2. 2015 Continuity Schedule'!BR$20, '2. 2015 Continuity Schedule'!C$20:BU$20,0),FALSE)","v":0},-2944775.0809453963,{"$f":"VLOOKUP(A35, '2. 2015 Continuity Schedule'!$C$20:$BU$83, MATCH('2. 2015 Continuity Schedule'!BT$20, '2. 2015 Continuity Schedule'!C$20:BU$20,0),FALSE)","v":-6757977},{"$f":"VLOOKUP(A35, '2. 2015 Continuity Schedule'!$C$20:$BU$83, MATCH('2. 2015 Continuity Schedule'!BU$20, '2. 2015 Continuity Schedule'!C$20:BU$20,0),FALSE)","v":-0.45682644378393888}]
["RSVA - Global Adjustment",1589,{"$f":"VLOOKUP(A36, '2. 2015 Continuity Schedule'!$C$20:$BU$83, MATCH('2. 2015 Continuity Schedule'!BO$20, '2. 2015 Continuity Schedule'!C$20:BU$20,0),FALSE)","v":6818513.4581011776},{"$f":"VLOOKUP(A36, '2. 2015 Continuity Schedule'!$C$20:$BU$83, MATCH('2. 2015 Continuity Schedule'!BP$20, '2. 2015 Continuity Schedule'!C$20:BU$20,0),FALSE)","v":97267.377668108122},6915780.8357692854,{"$f":"VLOOKUP(A36, '2. 2015 Continuity Schedule'!$C$20:$BU$83, MATCH('2. 2015 Continuity Schedule'!BQ$20, '2. 2015 Continuity Schedule'!C$20:BU$20,0),FALSE)","v":81310.77298785653},{"$f":"VLOOKUP(A36, '2. 2015 Continuity Schedule'!$C$20:$BU$83, MATCH('2. 2015 Continuity Schedule'!BR$20, '2. 2015 Continuity Schedule'!C$20:BU$20,0),FALSE)","v":0},6997091.608757142,{"$f":"VLOOKUP(A36, '2. 2015 Continuity Schedule'!$C$20:$BU$83, MATCH('2. 2015 Continuity Schedule'!BT$20, '2. 2015 Continuity Schedule'!C$20:BU$20,0),FALSE)","v":10002627},{"$f":"VLOOKUP(A36, '2. 2015 Continuity Schedule'!$C$20:$BU$83, MATCH('2. 2015 Continuity Schedule'!BU$20, '2. 2015 Continuity Schedule'!C$20:BU$20,0),FALSE)","v":-0.48317356035113335}]
["PILs and Tax Variance for 2006 and Subsequent Years                                                                          (excludes sub-account and contra account below)",1592,{"$f":"VLOOKUP(A37, '2. 2015 Continuity Schedule'!$C$20:$BU$83, MATCH('2. 2015 Continuity Schedule'!BO$20, '2. 2015 Continuity Schedule'!C$20:BU$20,0),FALSE)","v":0},{"$f":"VLOOKUP(A37, '2. 2015 Continuity Schedule'!$C$20:$BU$83, MATCH('2. 2015 Continuity Schedule'!BP$20, '2. 2015 Continuity Schedule'!C$20:BU$20,0),FALSE)","v":0},0,{"$f":"VLOOKUP(A37, '2. 2015 Continuity Schedule'!$C$20:$BU$83, MATCH('2. 2015 Continuity Schedule'!BQ$20, '2. 2015 Continuity Schedule'!C$20:BU$20,0),FALSE)","v":0},{"$f":"VLOOKUP(A37, '2. 2015 Continuity Schedule'!$C$20:$BU$83, MATCH('2. 2015 Continuity Schedule'!BR$20, '2. 2015 Continuity Schedule'!C$20:BU$20,0),FALSE)","v":0},0,{"$f":"VLOOKUP(A37, '2. 2015 Continuity Schedule'!$C$20:$BU$83, MATCH('2. 2015 Continuity Schedule'!BT$20, '2. 2015 Continuity Schedule'!C$20:BU$20,0),FALSE)","v":0},{"$f":"VLOOKUP(A37, '2. 2015 Continuity Schedule'!$C$20:$BU$83, MATCH('2. 2015 Continuity Schedule'!BU$20, '2. 2015 Continuity Schedule'!C$20:BU$20,0),FALSE)","v":0}]
["PILs and Tax Variance for 2006 and Subsequent Years - Sub-Account HST/OVAT                          Input Tax Credits (ITCs)",1592,{"$f":"VLOOKUP(A38, '2. 2015 Continuity Schedule'!$C$20:$BU$83, MATCH('2. 2015 Continuity Schedule'!BO$20, '2. 2015 Continuity Schedule'!C$20:BU$20,0),FALSE)","v":0},{"$f":"VLOOKUP(A38, '2. 2015 Continuity Schedule'!$C$20:$BU$83, MATCH('2. 2015 Continuity Schedule'!BP$20, '2. 2015 Continuity Schedule'!C$20:BU$20,0),FALSE)","v":0},0,{"$f":"VLOOKUP(A38, '2. 2015 Continuity Schedule'!$C$20:$BU$83, MATCH('2. 2015 Continuity Schedule'!BQ$20, '2. 2015 Continuity Schedule'!C$20:BU$20,0),FALSE)","v":0},{"$f":"VLOOKUP(A38, '2. 2015 Continuity Schedule'!$C$20:$BU$83, MATCH('2. 2015 Continuity Schedule'!BR$20, '2. 2015 Continuity Schedule'!C$20:BU$20,0),FALSE)","v":0},0,{"$f":"VLOOKUP(A38, '2. 2015 Continuity Schedule'!$C$20:$BU$83, MATCH('2. 2015 Continuity Schedule'!BT$20, '2. 2015 Continuity Schedule'!C$20:BU$20,0),FALSE)","v":0},{"$f":"VLOOKUP(A38, '2. 2015 Continuity Schedule'!$C$20:$BU$83, MATCH('2. 2015 Continuity Schedule'!BU$20, '2. 2015 Continuity Schedule'!C$20:BU$20,0),FALSE)","v":0}]
["Disposition and Recovery/Refund of Regulatory Balances (2008)7",1595,{"$f":"VLOOKUP(A39, '2. 2015 Continuity Schedule'!$C$20:$BU$83, MATCH('2. 2015 Continuity Schedule'!BO$20, '2. 2015 Continuity Schedule'!C$20:BU$20,0),FALSE)","v":{"$error":"#N/A"}},{"$f":"VLOOKUP(A39, '2. 2015 Continuity Schedule'!$C$20:$BU$83, MATCH('2. 2015 Continuity Schedule'!BP$20, '2. 2015 Continuity Schedule'!C$20:BU$20,0),FALSE)","v":{"$error":"#N/A"}},{"$error":"#N/A"},{"$f":"VLOOKUP(A39, '2. 2015 Continuity Schedule'!$C$20:$BU$83, MATCH('2. 2015 Continuity Schedule'!BQ$20, '2. 2015 Continuity Schedule'!C$20:BU$20,0),FALSE)","v":{"$error":"#N/A"}},{"$f":"VLOOKUP(A39, '2. 2015 Continuity Schedule'!$C$20:$BU$83, MATCH('2. 2015 Continuity Schedule'!BR$20, '2. 2015 Continuity Schedule'!C$20:BU$20,0),FALSE)","v":{"$error":"#N/A"}},{"$error":"#N/A"},{"$f":"VLOOKUP(A39, '2. 2015 Continuity Schedule'!$C$20:$BU$83, MATCH('2. 2015 Continuity Schedule'!BT$20, '2. 2015 Continuity Schedule'!C$20:BU$20,0),FALSE)","v":{"$error":"#N/A"}},{"$f":"VLOOKUP(A39, '2. 2015 Continuity Schedule'!$C$20:$BU$83, MATCH('2. 2015 Continuity Schedule'!BU$20, '2. 2015 Continuity Schedule'!C$20:BU$20,0),FALSE)","v":{"$error":"#N/A"}}]
["Disposition and Recovery/Refund of Regulatory Balances (2009)7",1595,{"$f":"VLOOKUP(A40, '2. 2015 Continuity Schedule'!$C$20:$BU$83, MATCH('2. 2015 Continuity Schedule'!BO$20, '2. 2015 Continuity Schedule'!C$20:BU$20,0),FALSE)","v":{"$error":"#N/A"}},{"$f":"VLOOKUP(A40, '2. 2015 Continuity Schedule'!$C$20:$BU$83, MATCH('2. 2015 Continuity Schedule'!BP$20, '2. 2015 Continuity Schedule'!C$20:BU$20,0),FALSE)","v":{"$error":"#N/A"}},{"$error":"#N/A"},{"$f":"VLOOKUP(A40, '2. 2015 Continuity Schedule'!$C$20:$BU$83, MATCH('2. 2015 Continuity Schedule'!BQ$20, '2. 2015 Continuity Schedule'!C$20:BU$20,0),FALSE)","v":{"$error":"#N/A"}},{"$f":"VLOOKUP(A40, '2. 2015 Continuity Schedule'!$C$20:$BU$83, MATCH('2. 2015 Continuity Schedule'!BR$20, '2. 2015 Continuity Schedule'!C$20:BU$20,0),FALSE)","v":{"$error":"#N/A"}},{"$error":"#N/A"},{"$f":"VLOOKUP(A40, '2. 2015 Continuity Schedule'!$C$20:$BU$83, MATCH('2. 2015 Continuity Schedule'!BT$20, '2. 2015 Continuity Schedule'!C$20:BU$20,0),FALSE)","v":{"$error":"#N/A"}},{"$f":"VLOOKUP(A40, '2. 2015 Continuity Schedule'!$C$20:$BU$83, MATCH('2. 2015 Continuity Schedule'!BU$20, '2. 2015 Continuity Schedule'!C$20:BU$20,0),FALSE)","v":{"$error":"#N/A"}}]
["Disposition and Recovery/Refund of Regulatory Balances (2010)7",1595,{"$f":"VLOOKUP(A41, '2. 2015 Continuity Schedule'!$C$20:$BU$83, MATCH('2. 2015 Continuity Schedule'!BO$20, '2. 2015 Continuity Schedule'!C$20:BU$20,0),FALSE)","v":{"$error":"#N/A"}},{"$f":"VLOOKUP(A41, '2. 2015 Continuity Schedule'!$C$20:$BU$83, MATCH('2. 2015 Continuity Schedule'!BP$20, '2. 2015 Continuity Schedule'!C$20:BU$20,0),FALSE)","v":{"$error":"#N/A"}},{"$error":"#N/A"},{"$f":"VLOOKUP(A41, '2. 2015 Continuity Schedule'!$C$20:$BU$83, MATCH('2. 2015 Continuity Schedule'!BQ$20, '2. 2015 Continuity Schedule'!C$20:BU$20,0),FALSE)","v":{"$error":"#N/A"}},{"$f":"VLOOKUP(A41, '2. 2015 Continuity Schedule'!$C$20:$BU$83, MATCH('2. 2015 Continuity Schedule'!BR$20, '2. 2015 Continuity Schedule'!C$20:BU$20,0),FALSE)","v":{"$error":"#N/A"}},{"$error":"#N/A"},{"$f":"VLOOKUP(A41, '2. 2015 Continuity Schedule'!$C$20:$BU$83, MATCH('2. 2015 Continuity Schedule'!BT$20, '2. 2015 Continuity Schedule'!C$20:BU$20,0),FALSE)","v":{"$error":"#N/A"}},{"$f":"VLOOKUP(A41, '2. 2015 Continuity Schedule'!$C$20:$BU$83, MATCH('2. 2015 Continuity Schedule'!BU$20, '2. 2015 Continuity Schedule'!C$20:BU$20,0),FALSE)","v":{"$error":"#N/A"}}]
["Disposition and Recovery/Refund of Regulatory Balances (2011)7",1595,{"$f":"VLOOKUP(A42, '2. 2015 Continuity Schedule'!$C$20:$BU$83, MATCH('2. 2015 Continuity Schedule'!BO$20, '2. 2015 Continuity Schedule'!C$20:BU$20,0),FALSE)","v":{"$error":"#N/A"}},{"$f":"VLOOKUP(A42, '2. 2015 Continuity Schedule'!$C$20:$BU$83, MATCH('2. 2015 Continuity Schedule'!BP$20, '2. 2015 Continuity Schedule'!C$20:BU$20,0),FALSE)","v":{"$error":"#N/A"}},{"$error":"#N/A"},{"$f":"VLOOKUP(A42, '2. 2015 Continuity Schedule'!$C$20:$BU$83, MATCH('2. 2015 Continuity Schedule'!BQ$20, '2. 2015 Continuity Schedule'!C$20:BU$20,0),FALSE)","v":{"$error":"#N/A"}},{"$f":"VLOOKUP(A42, '2. 2015 Continuity Schedule'!$C$20:$BU$83, MATCH('2. 2015 Continuity Schedule'!BR$20, '2. 2015 Continuity Schedule'!C$20:BU$20,0),FALSE)","v":{"$error":"#N/A"}},{"$error":"#N/A"},{"$f":"VLOOKUP(A42, '2. 2015 Continuity Schedule'!$C$20:$BU$83, MATCH('2. 2015 Continuity Schedule'!BT$20, '2. 2015 Continuity Schedule'!C$20:BU$20,0),FALSE)","v":{"$error":"#N/A"}},{"$f":"VLOOKUP(A42, '2. 2015 Continuity Schedule'!$C$20:$BU$83, MATCH('2. 2015 Continuity Schedule'!BU$20, '2. 2015 Continuity Schedule'!C$20:BU$20,0),FALSE)","v":{"$error":"#N/A"}}]
["Disposition and Recovery/Refund of Regulatory Balances (2012)7",1595,{"$f":"VLOOKUP(A43, '2. 2015 Continuity Schedule'!$C$20:$BU$83, MATCH('2. 2015 Continuity Schedule'!BO$20, '2. 2015 Continuity Schedule'!C$20:BU$20,0),FALSE)","v":{"$error":"#N/A"}},{"$f":"VLOOKUP(A43, '2. 2015 Continuity Schedule'!$C$20:$BU$83, MATCH('2. 2015 Continuity Schedule'!BP$20, '2. 2015 Continuity Schedule'!C$20:BU$20,0),FALSE)","v":{"$error":"#N/A"}},{"$error":"#N/A"},{"$f":"VLOOKUP(A43, '2. 2015 Continuity Schedule'!$C$20:$BU$83, MATCH('2. 2015 Continuity Schedule'!BQ$20, '2. 2015 Continuity Schedule'!C$20:BU$20,0),FALSE)","v":{"$error":"#N/A"}},{"$f":"VLOOKUP(A43, '2. 2015 Continuity Schedule'!$C$20:$BU$83, MATCH('2. 2015 Continuity Schedule'!BR$20, '2. 2015 Continuity Schedule'!C$20:BU$20,0),FALSE)","v":{"$error":"#N/A"}},{"$error":"#N/A"},{"$f":"VLOOKUP(A43, '2. 2015 Continuity Schedule'!$C$20:$BU$83, MATCH('2. 2015 Continuity Schedule'!BT$20, '2. 2015 Continuity Schedule'!C$20:BU$20,0),FALSE)","v":{"$error":"#N/A"}},{"$f":"VLOOKUP(A43, '2. 2015 Continuity Schedule'!$C$20:$BU$83, MATCH('2. 2015 Continuity Schedule'!BU$20, '2. 2015 Continuity Schedule'!C$20:BU$20,0),FALSE)","v":{"$error":"#N/A"}}]
["Other Deferred Credits",2425,{"$f":"VLOOKUP(A44, '2. 2015 Continuity Schedule'!$C$20:$BU$83, MATCH('2. 2015 Continuity Schedule'!BO$20, '2. 2015 Continuity Schedule'!C$20:BU$20,0),FALSE)","v":0},{"$f":"VLOOKUP(A44, '2. 2015 Continuity Schedule'!$C$20:$BU$83, MATCH('2. 2015 Continuity Schedule'!BP$20, '2. 2015 Continuity Schedule'!C$20:BU$20,0),FALSE)","v":0},0,{"$f":"VLOOKUP(A44, '2. 2015 Continuity Schedule'!$C$20:$BU$83, MATCH('2. 2015 Continuity Schedule'!BQ$20, '2. 2015 Continuity Schedule'!C$20:BU$20,0),FALSE)","v":0},{"$f":"VLOOKUP(A44, '2. 2015 Continuity Schedule'!$C$20:$BU$83, MATCH('2. 2015 Continuity Schedule'!BR$20, '2. 2015 Continuity Schedule'!C$20:BU$20,0),FALSE)","v":0},0,{"$f":"VLOOKUP(A44, '2. 2015 Continuity Schedule'!$C$20:$BU$83, MATCH('2. 2015 Continuity Schedule'!BT$20, '2. 2015 Continuity Schedule'!C$20:BU$20,0),FALSE)","v":0},{"$f":"VLOOKUP(A44, '2. 2015 Continuity Schedule'!$C$20:$BU$83, MATCH('2. 2015 Continuity Schedule'!BU$20, '2. 2015 Continuity Schedule'!C$20:BU$20,0),FALSE)","v":0}]