{"text_format":"1","workbook":"xlsx","n_sheets":10,"sheets":["1. Info","2. Table of Contents","3. Rate Classes","4. RRR Data","5. UTRs and Sub-Transmission","6. Historical Wholesale","7. Current Wholesale","8. Forecast Wholesale","9. RTSR Rates to Forecast","hidden1"],"not_rendered":{"charts":0,"images":3,"macros":1,"external_links":2,"defined_names":22,"comments":0,"pivot_tables":0},"unopened":[],"bounds":{"document_bytes":16777216,"sheet_cells":100000,"rows_first":2000,"rows_last":500,"rows_between":2000,"halvings":0,"cell_chars":16384,"cell_head_chars":4096},"cells_cut":0,"cells_raw":0,"read":"whole","date_system":"1900"}

{"sheet":"1. Info","index":0,"n_rows":76,"n_cols":28,"rows_kept":76,"cut":false,"hidden":false,"merged":[[24,3,24,4],[20,3,20,4],[1,2,1,9],[2,2,2,9],[3,2,3,9],[4,2,4,9],[14,3,14,4],[16,3,16,4]]}
[null,null,null,null,null,null,null,null,null,null,null,null,null,null,null,null,null,null,null,null,null,null,null,null,null,null,null,"Algoma Power Inc."]
[null,null,null,null,null,null,null,null,null,null,null,null,null,null,null,null,null,null,null,null,null,null,null,null,null,null,null,"Atikokan Hydro Inc."]
[null,null,null,null,null,null,null,null,null,null,null,null,null,null,null,null,null,null,null,null,null,null,null,null,null,null,null,"Attawapiskat Power Corporation"]
[null,null,null,null,null,null,null,null,null,null,null,null,null,null,null,null,null,null,null,null,null,null,null,null,null,null,null,"Bluewater Power Distribution Corporation"]
[null,null,null,null,null,null,null,null,null,null,null,null,null,null,null,null,null,null,null,null,null,null,null,null,null,null,null,"Brant County Power Inc."]
[null,null,null,null,null,null,null,null,null,null,null,null,null,null,null,null,null,null,null,null,null,null,null,null,null,null,null,"Brantford Power Inc."]
[null,null,null,null,null,null,null,null,null,null,null,null,null,null,null,null,null,null,null,null,null,null,null,null,null,null,null,"Burlington Hydro Inc."]
[null,null,null,null,null,null,null,null,null,null,null,null,null,null,null,null,null,null,null,null,null,null,null,null,null,null,null,"Cambridge and North Dumfries Hydro Inc."]
[null,null,null,null,null,null,null,null,null,null,null,null,null,null,null,null,null,null,null,null,null,null,null,null,null,null,null,"Canadian Niagara Power Inc."]
[null,null,null,null,null,null,null,null,null,null,null,null,null,null,null,null,null,null,null,null,null,null,null,null,null,null,null,"Centre Wellington Hydro Ltd."]
[null,null,null,null,null,null,null,null,null,null,null,null,null,null,null,null,null,null,null,null,null,null,null,null,null,null,null,"Chapleau Public Utilities Corporation"]
[null,null,null,null,null,null,null,null,null,null,null,null,null,null,null,null,null,null,null,null,null,null,null,null,null,null,null,"COLLUS PowerStream Corp."]
["Drop-down lists are shaded blue; Input cells are shaded green.",null,null,null,null,null,null,null,null,null,null,null,null,null,null,null,null,null,null,null,null,null,null,null,null,null,null,"Cooperative Hydro Embrun Inc."]
[null,null,null,null,null,null,null,null,null,null,null,null,null,null,null,null,null,null,null,null,null,null,null,null,null,null,null,"E.L.K. Energy Inc."]
[null,null,"Utility Name   ","Milton Hydro Distribution Inc.",null,null,null,null,null,null,null,null,null,null,null,null,null,null,null,null,null,null,null,null,null,null,null,"Enersource Hydro Mississauga Inc."]
[null,null,null,null,null,null,null,null,null,null,null,null,null,null,null,null,null,null,null,null,null,null,null,null,null,null,null,"Entegrus Powerlines Inc."]
[null,null,"Service Territory","Town of Milton",null,null,null,null,null,null,null,null,null,null,null,null,null,null,null,null,null,null,null,null,null,null,null,"EnWin Utilities Ltd."]
[null,null,null,null,null,null,null,null,null,null,null,null,null,null,null,null,null,null,null,null,null,null,null,null,null,null,null,"Erie Thames Powerlines Corporation"]
[null,null,"Assigned EB Number","EB-2015-0089",null,null,null,null,null,null,null,null,null,null,null,null,null,null,null,null,null,null,null,null,null,null,null,"Espanola Regional Hydro Distribution Corporation"]
[null,null,null,null,null,null,null,null,null,null,null,null,null,null,null,null,null,null,null,null,null,null,null,null,null,null,null,"Essex Powerlines Corporation"]
[null,null,"Name and Title","Cameron McKenzie, Director Regulatory Affairs",null,null,null,null,null,null,null,null,null,null,null,null,null,null,null,null,null,null,null,null,null,null,null,"Festival Hydro Inc."]
[null,null,null,null,null,null,null,null,null,null,null,null,null,null,null,null,null,null,null,null,null,null,null,null,null,null,null,"Fort Albany Power Corporation"]
[null,null,"Phone Number","289-429-5212",null,null,null,null,null,null,null,null,null,null,null,null,null,null,null,null,null,null,null,null,null,null,null,"Fort Frances Power Corporation"]
[null,null,null,null,null,null,null,null,null,null,null,null,null,null,null,null,null,null,null,null,null,null,null,null,null,null,null,"Greater Sudbury Hydro Inc."]
[null,null,"Email Address","cameronmckenzie@miltonhydro.com",null,null,null,null,null,null,null,null,null,null,null,null,null,null,null,null,null,null,null,null,null,null,null,"Grimsby Power Inc."]
[null,null,null,null,null,null,null,null,null,null,null,null,null,null,null,null,null,null,null,null,null,null,null,null,null,null,null,"Guelph Hydro Electric Systems Inc."]
[null,null,"Date","2015-08-28",null,null,null,null,null,null,null,null,null,null,null,null,null,null,null,null,null,null,null,null,null,null,null,"Haldimand County Hydro Inc."]
[null,null,null,null,null,null,null,null,null,null,null,null,null,null,null,null,null,null,null,null,null,null,null,null,null,null,null,"Halton Hills Hydro Inc."]
[null,null,"Last COS Re-based Year",2011,null,null,null,null,null,null,null,null,null,null,null,null,null,null,null,null,null,null,null,null,null,null,null,"Hearst Power Distribution Company Limited"]
[null,null,null,null,null,null,null,null,null,null,null,null,null,null,null,null,null,null,null,null,null,null,null,null,null,null,null,"Horizon Utilities Corporation"]
{"$rows_left_out":47}
{"sheet":"2. Table of Contents","index":1,"n_rows":28,"n_cols":9,"rows_kept":28,"cut":false,"hidden":false,"merged":[]}
[]
[]
[]
[]
[]
[]
[]
[]
[]
[]
[]
[]
[]
[]
[]
[]
[]
[]
[]
[null,null,null,"1. Info",null,null,null,null,"6. Historical Wholesale"]
[]
[null,null,null,"2. Table of Contents",null,null,null,null,"7. Current Wholesale"]
[]
[null,null,null,"3. Rate Classes",null,null,null,null,"8. Forecast Wholesale"]
[]
[null,null,null,"4. RRR Data",null,null,null,null,"9. RTSR Rates to Forecast"]
[]
[null,null,null,"5. UTRs and Sub-Transmission"]

{"sheet":"3. Rate Classes","index":2,"n_rows":100,"n_cols":23,"rows_kept":100,"cut":false,"hidden":false,"merged":[[12,2,12,8]]}
[]
[]
[]
[]
[]
[]
[]
[]
[]
[]
[]
[]
[null,null,"1.  Select the appropriate rate classes that appear on your most recent Board-Approved Tariff of Rates and Charges.\n2.  Enter the RTS Network and Connection Rate as it appears on the Tariff of Rates and Charges"]
[]
[null,null,"Rate Class",null,"Unit",null,"RTSR-Network",null,"RTSR-Connection"]
[]
[null,null,"Residential",null,"kWh",null,7.9000000000000008E-3,null,6.0000000000000001E-3,null,null,{"$f":"IF(OR(ISBLANK(C17), ISERROR(FIND(\"Choose\", C17))=FALSE), 0, 1)","v":1},{"$f":"\"C\" & ROW(C17)","v":"C17"},{"$f":"IF(OR(C17=\"General Service Intermediate Rate Class 1,000 To 4,999 kW (formerly General Service > 50 kW Customers)\", C17=\"General Service Intermediate Rate Class 1,000 To 4,999 kW (formerly Large Use Customers)\"), \"x\", \"\")","v":""},null,null,null,null,null,null,null,null,"Choose Rate Class"]
[null,null,"General Service Less Than 50 kW",null,"kWh",null,7.3000000000000001E-3,null,5.3E-3,null,null,1,"C18",{"$f":"IF(OR(C18=\"General Service Intermediate Rate Class 1,000 To 4,999 kW (formerly General Service > 50 kW Customers)\", C18=\"General Service Intermediate Rate Class 1,000 To 4,999 kW (formerly Large Use Customers)\"), \"x\", \"\")","v":""},null,null,null,null,null,null,null,null,"Residential"]
[null,null,"General Service 50 to 999 kW",null,"kW",null,3.2738999999999998,null,2.4626999999999999,null,null,1,"C19","",null,null,null,null,null,null,null,null,"Residential Regular"]
[null,null,"General Service 1,000 to 4,999 kW",null,"kW",null,3.2199,null,2.4224999999999999,null,null,1,"C20","",null,null,null,null,null,null,null,null,"Residential Urban"]
[null,null,"Large Use",null,"kW",null,3.4866999999999999,null,2.7092000000000001,null,null,1,"C21","",null,null,null,null,null,null,null,null,"Residential Urban Year-Round"]
[null,null,"Sentinel Lighting",null,"kW",null,2.2286999999999999,null,1.6914,null,null,1,"C22","",null,null,null,null,null,null,null,null,"Residential Suburban"]
[null,null,"Street Lighting",null,"kW",null,2.2172999999999998,null,1.6566000000000001,null,null,1,"C23","",null,null,null,null,null,null,null,null,"Residential Suburban Seasonal"]
[null,null,"Unmetered Scattered Load",null,"kWh",null,7.3000000000000001E-3,null,5.3E-3,null,null,1,"C24","",null,null,null,null,null,null,null,null,"Residential Suburban Year Round"]
[null,null,"Choose Rate Class",null,null,null,null,null,null,null,null,0,"C25","",null,null,null,null,null,null,null,null,"Residential - Time of Use"]
[null,null,"Choose Rate Class",null,null,null,null,null,null,null,null,0,"C26","",null,null,null,null,null,null,null,null,"Residential - Hensall"]
[null,null,"Choose Rate Class",null,null,null,null,null,null,null,null,0,"C27","",null,null,null,null,null,null,null,null,"Residential – High Density [R1]"]
[null,null,"Choose Rate Class",null,null,null,null,null,null,null,null,0,"C28","",null,null,null,null,null,null,null,null,"Residential – Normal Density [R2]"]
[null,null,"Choose Rate Class",null,null,null,null,null,null,null,null,0,"C29","",null,null,null,null,null,null,null,null,"Seasonal Residential – High Density [R3]"]
[null,null,"Choose Rate Class",null,null,null,null,null,null,null,null,0,"C30","",null,null,null,null,null,null,null,null,"Seasonal Residential – Normal Density [R4]"]
{"$rows_left_out":71}
{"sheet":"4. RRR Data","index":3,"n_rows":32,"n_cols":9,"rows_kept":32,"cut":false,"hidden":false,"merged":[[12,1,12,8]]}
[]
[]
[]
[]
[]
[]
[]
[]
[]
[]
[]
[]
[]
[]
[null,"Rate Class","Rate Description","Unit","Rate","Non-Loss Adjusted Metered kWh","Non-Loss Adjusted Metered kW","Applicable \nLoss Factor\neg: (1.0325)","Loss Adjusted Billed kWh"]
[]
[null,"Residential","RTSR - Network","kWh",7.9000000000000008E-3,290591983,null,1.0362,{"$f":"F17*H17","v":301111412.78460002}]
[null,"Residential","RTSR - Connection","kWh",6.0000000000000001E-3,290591983,null,1.0362,{"$f":"F18*H18","v":301111412.78460002}]
[null,"General Service Less Than 50 kW","RTSR - Network","kWh",7.3000000000000001E-3,88384427,null,1.0362,{"$f":"F19*H19","v":91583943.257400006}]
[null,"General Service Less Than 50 kW","RTSR - Connection","kWh",5.3E-3,88384427,null,1.0362,{"$f":"F20*H20","v":91583943.257400006}]
[null,"General Service 50 to 999 kW","RTSR - Network","kW",3.2738999999999998,null,523668]
[null,"General Service 50 to 999 kW","RTSR - Connection","kW",2.4626999999999999,null,523668]
[null,"General Service 1,000 to 4,999 kW","RTSR - Network","kW",3.2199,null,242504]
[null,"General Service 1,000 to 4,999 kW","RTSR - Connection","kW",2.4224999999999999,null,242504]
[null,"Large Use","RTSR - Network","kW",3.4866999999999999,null,253601]
[null,"Large Use","RTSR - Connection","kW",2.7092000000000001,null,253601]
[null,"Sentinel Lighting","RTSR - Network","kW",2.2286999999999999,null,419]
[null,"Sentinel Lighting","RTSR - Connection","kW",1.6914,null,419]
[null,"Street Lighting","RTSR - Network","kW",2.2172999999999998,null,20173]
[null,"Street Lighting","RTSR - Connection","kW",1.6566000000000001,null,20173]
{"$rows_left_out":3}
{"sheet":"5. UTRs and Sub-Transmission","index":4,"n_rows":95,"n_cols":9,"rows_kept":95,"cut":false,"hidden":false,"merged":[]}
[]
[]
[]
[]
[]
[]
[]
[]
[]
[]
[]
[]
[]
[]
[]
[]
[]
[null,"Uniform Transmission Rates","Unit",null,"Effective \nJanuary 1, 2014",null,"Effective \nJanuary 1, 2015",null,"Effective \nJanuary 1, 2016"]
[]
[null,"Rate Description",null,null,"Rate",null,"Rate",null,"Rate"]
[]
[null,"Network Service Rate","kW",null,3.82,null,3.78,null,3.66]
[]
[null,"Line Connection Service Rate","kW",null,0.82,null,0.86,null,0.87]
[]
[null,"Transformation Connection Service Rate","kW",null,1.98,null,2,null,2.02]
[]
[]
[null,"Hydro One Sub-Transmission Rates","Unit",null,"Effective \nJanuary 1, 2014 to April 30, 2015",null,"Effective \nMay 1, 2015",null,"Effective \nJanuary 1, 2016"]
[]
{"$rows_left_out":66}
{"sheet":"6. Historical Wholesale","index":5,"n_rows":117,"n_cols":16,"rows_kept":117,"cut":false,"hidden":false,"merged":[[96,7,96,9],[96,11,96,13],[20,3,20,5],[20,7,20,9],[20,11,20,13],[96,3,96,5],[38,3,38,5],[38,7,38,9],[38,11,38,13],[95,3,95,5],[57,3,57,5],[57,7,57,9],[57,11,57,13],[76,3,76,5],[76,7,76,9],[76,11,76,13],[95,7,95,9],[95,11,95,13]]}
[]
[]
[]
[]
[]
[]
[]
[]
[]
[]
[]
[]
[]
[]
[]
[]
[]
[]
[]
[]
[null,"IESO",null,"Network",null,null,null,"Line Connection",null,null,null,"Transformation Connection",null,null,null,"Total Line"]
[null,"Month",null,"Units Billed","Rate","Amount",null,"Units Billed","Rate","Amount",null,"Units Billed","Rate","Amount",null,"Amount"]
[]
[null,"January",null,118608,{"$f":"IF(D24<>0,F24/D24,0)","v":3.82},453082.56,null,124449,{"$f":"IF(H24<>0,J24/H24,0)","v":0.82},102048.18,null,124449,{"$f":"IF(L24<>0,N24/L24,0)","v":1.98},246409.02,null,{"$f":"J24+N24","v":348457.19999999995}]
[null,"February",null,119208,{"$f":"IF(D25<>0,F25/D25,0)","v":3.82},455374.56,null,120625,{"$f":"IF(H25<>0,J25/H25,0)","v":0.82},98912.5,null,120625,{"$f":"IF(L25<>0,N25/L25,0)","v":1.98},238837.5,null,337750]
[null,"March",null,121238,3.82,463129.16,null,122270,0.82,100261.4,null,122270,1.98,242094.6,null,342356]
[null,"April",null,98489,3.82,376227.98,null,104123,0.82,85380.86,null,104123,1.98,206163.54,null,291544.40000000002]
[null,"May",null,119364,3.82,455970.48,null,119364,0.82,97878.48,null,119364,1.98,236340.72,null,334219.2]
[null,"June",null,125911,3.8200000000000003,480980.02,null,141938,0.82000000000000006,116389.16,null,141938,1.98,281037.24,null,397426.4]
[null,"July",null,145194,3.82,554641.07999999996,null,153636,0.82000000000000006,125981.52,null,153636,1.9800000000000002,304199.28000000003,null,430180.80000000005]
{"$rows_left_out":88}
{"sheet":"7. Current Wholesale","index":6,"n_rows":117,"n_cols":16,"rows_kept":117,"cut":false,"hidden":false,"merged":[[96,7,96,9],[96,11,96,13],[20,3,20,5],[20,7,20,9],[20,11,20,13],[96,3,96,5],[95,3,95,5],[95,7,95,9],[95,11,95,13],[57,3,57,5],[57,7,57,9],[57,11,57,13],[76,3,76,5],[76,7,76,9],[76,11,76,13],[12,1,12,11],[19,3,19,5],[19,7,19,9],[19,11,19,13],[38,3,38,5],[38,7,38,9],[38,11,38,13]]}
[]
[]
[]
[]
[]
[]
[]
[]
[]
[]
[]
[]
[null,"The purpose of this sheet is to calculate the expected billing when current 2015 Uniform Transmission Rates are applied against historical 2014 transmission units."]
[]
[]
[]
[]
[]
[]
[null,"IESO",null,"Network",null,null,null,"Line Connection",null,null,null,"Transformation Connection",null,null,null,"Total Line"]
[]
[null,"Month",null,"Units Billed","Rate","Amount",null,"Units Billed","Rate","Amount",null,"Units Billed","Rate","Amount",null,"Amount"]
[]
[null,"January",null,{"$f":"'6. Historical Wholesale'!D24","v":118608},{"$f":"'5. UTRs and Sub-Transmission'!G22","v":3.78},{"$f":"D24*E24","v":448338.24},null,{"$f":"'6. Historical Wholesale'!H24","v":124449},{"$f":"'5. UTRs and Sub-Transmission'!G24","v":0.86},{"$f":"H24*I24","v":107026.14},null,{"$f":"'6. Historical Wholesale'!L24","v":124449},{"$f":"'5. UTRs and Sub-Transmission'!G26","v":2},{"$f":"L24*M24","v":248898},null,{"$f":"J24+N24","v":355924.14}]
[null,"February",null,{"$f":"'6. Historical Wholesale'!D25","v":119208},{"$f":"E24","v":3.78},{"$f":"D25*E25","v":450606.24},null,{"$f":"'6. Historical Wholesale'!H25","v":120625},{"$f":"I24","v":0.86},{"$f":"H25*I25","v":103737.5},null,{"$f":"'6. Historical Wholesale'!L25","v":120625},{"$f":"M24","v":2},{"$f":"L25*M25","v":241250},null,344987.5]
[null,"March",null,{"$f":"'6. Historical Wholesale'!D26","v":121238},{"$f":"E25","v":3.78},458279.63999999996,null,{"$f":"'6. Historical Wholesale'!H26","v":122270},{"$f":"I25","v":0.86},105152.2,null,{"$f":"'6. Historical Wholesale'!L26","v":122270},{"$f":"M25","v":2},244540,null,349692.2]
[null,"April",null,{"$f":"'6. Historical Wholesale'!D27","v":98489},3.78,372288.42,null,{"$f":"'6. Historical Wholesale'!H27","v":104123},0.86,89545.78,null,{"$f":"'6. Historical Wholesale'!L27","v":104123},2,208246,null,297791.78000000003]
[null,"May",null,{"$f":"'6. Historical Wholesale'!D28","v":119364},3.78,451195.92,null,{"$f":"'6. Historical Wholesale'!H28","v":119364},0.86,102653.04,null,{"$f":"'6. Historical Wholesale'!L28","v":119364},2,238728,null,341381.04]
[null,"June",null,{"$f":"'6. Historical Wholesale'!D29","v":125911},3.78,475943.57999999996,null,{"$f":"'6. Historical Wholesale'!H29","v":141938},0.86,122066.68,null,{"$f":"'6. Historical Wholesale'!L29","v":141938},2,283876,null,405942.68]
[null,"July",null,{"$f":"'6. Historical Wholesale'!D30","v":145194},3.78,548833.31999999995,null,{"$f":"'6. Historical Wholesale'!H30","v":153636},0.86,132126.96,null,{"$f":"'6. Historical Wholesale'!L30","v":153636},2,307272,null,439398.95999999996]
{"$rows_left_out":88}
{"sheet":"8. Forecast Wholesale","index":7,"n_rows":117,"n_cols":16,"rows_kept":117,"cut":false,"hidden":false,"merged":[[96,7,96,9],[96,11,96,13],[20,3,20,5],[20,7,20,9],[20,11,20,13],[96,3,96,5],[95,3,95,5],[95,7,95,9],[95,11,95,13],[57,3,57,5],[57,7,57,9],[57,11,57,13],[76,3,76,5],[76,7,76,9],[76,11,76,13],[12,1,12,12],[19,3,19,5],[19,7,19,9],[19,11,19,13],[38,3,38,5],[38,7,38,9],[38,11,38,13]]}
[]
[]
[]
[]
[]
[]
[]
[]
[]
[]
[]
[]
[null,"The purpose of this sheet is to calculate the expected billing when forecasted 2016 Uniform Transmission Rates are applied against historical 2014 transmission units."]
[]
[]
[]
[]
[]
[]
[null,"IESO",null,"Network",null,null,null,"Line Connection",null,null,null,"Transformation Connection",null,null,null,"Total Line"]
[]
[null,"Month",null,"Units Billed","Rate","Amount",null,"Units Billed","Rate","Amount",null,"Units Billed","Rate","Amount",null,"Amount"]
[]
[null,"January",null,{"$f":"'6. Historical Wholesale'!D24","v":118608},{"$f":"'5. UTRs and Sub-Transmission'!I22","v":3.66},{"$f":"D24*E24","v":434105.28},null,{"$f":"'6. Historical Wholesale'!H24","v":124449},{"$f":"'5. UTRs and Sub-Transmission'!I24","v":0.87},{"$f":"H24*I24","v":108270.63},null,{"$f":"'6. Historical Wholesale'!L24","v":124449},{"$f":"'5. UTRs and Sub-Transmission'!I26","v":2.02},{"$f":"L24*M24","v":251386.98},null,{"$f":"J24+N24","v":359657.61}]
[null,"February",null,{"$f":"'6. Historical Wholesale'!D25","v":119208},{"$f":"E24","v":3.66},436301.28,null,{"$f":"'6. Historical Wholesale'!H25","v":120625},{"$f":"I24","v":0.87},104943.75,null,{"$f":"'6. Historical Wholesale'!L25","v":120625},{"$f":"M24","v":2.02},243662.5,null,348606.25]
[null,"March",null,{"$f":"'6. Historical Wholesale'!D26","v":121238},3.66,443731.08,null,{"$f":"'6. Historical Wholesale'!H26","v":122270},0.87,106374.9,null,{"$f":"'6. Historical Wholesale'!L26","v":122270},2.02,246985.4,null,353360.3]
[null,"April",null,{"$f":"'6. Historical Wholesale'!D27","v":98489},3.66,360469.74,null,{"$f":"'6. Historical Wholesale'!H27","v":104123},0.87,90587.01,null,{"$f":"'6. Historical Wholesale'!L27","v":104123},2.02,210328.46,null,300915.46999999997]
[null,"May",null,{"$f":"'6. Historical Wholesale'!D28","v":119364},3.66,436872.24,null,{"$f":"'6. Historical Wholesale'!H28","v":119364},0.87,103846.68,null,{"$f":"'6. Historical Wholesale'!L28","v":119364},2.02,241115.28,null,344961.95999999996]
[null,"June",null,{"$f":"'6. Historical Wholesale'!D29","v":125911},3.66,460834.26,null,{"$f":"'6. Historical Wholesale'!H29","v":141938},0.87,123486.06,null,{"$f":"'6. Historical Wholesale'!L29","v":141938},2.02,286714.76,null,410200.82]
[null,"July",null,{"$f":"'6. Historical Wholesale'!D30","v":145194},3.66,531410.04,null,{"$f":"'6. Historical Wholesale'!H30","v":153636},0.87,133663.32,null,{"$f":"'6. Historical Wholesale'!L30","v":153636},2.02,310344.72000000003,null,444008.04000000004]
{"$rows_left_out":88}
{"sheet":"9. RTSR Rates to Forecast","index":8,"n_rows":60,"n_cols":10,"rows_kept":60,"cut":false,"hidden":false,"merged":[]}
[]
[]
[]
[]
[]
[]
[]
[]
[]
[]
[]
[]
["The purpose of this sheet is to re-align the current RTS Network Rates to recover current wholesale network costs."]
[]
["Rate Class","Rate Description","Unit","Current RTSR-Network","Loss Adjusted Billed kWh","Billed kW","Billed Amount","Billed Amount %","Current Wholesale Billing","Adjusted RTSR Network"]
[]
["Residential","RTSR - Network","kWh",7.9000000000000008E-3,301111412.78460002,null,{"$f":"ROUND(D17*E17, 2)","v":2378780.16},{"$f":"G17/6482646.66","v":0.36694583011562754},{"$f":"H17*total_current_wholesale_network","v":2263242.454214538},{"$f":"IF(ISERROR(I17/E17), 0, I17/E17)","v":7.5162958231461919E-3}]
["General Service Less Than 50 kW","RTSR - Network","kWh",7.3000000000000001E-3,91583943.257400006,null,{"$f":"ROUND(D18*E18, 2)","v":668562.79},0.10313114767233049,636090.59596163721,{"$f":"IF(ISERROR(I18/E18), 0, I18/E18)","v":6.9454379592925088E-3}]
["General Service 50 to 999 kW","RTSR - Network","kW",3.2738999999999998,null,523668,{"$f":"ROUND(D19*F19, 2)","v":1714436.67},0.26446554315209275,1631166.2262250411,{"$f":"IF(ISERROR(I19/F19), 0, I19/F19)","v":3.1148861993191126}]
["General Service 1,000 to 4,999 kW","RTSR - Network","kW",3.2199,null,242504,{"$f":"ROUND(D20*F20, 2)","v":780838.63},0.12045059232026692,742913.18173206784,{"$f":"IF(ISERROR(I20/F20), 0, I20/F20)","v":3.063508980190297}]
["Large Use","RTSR - Network","kW",3.4866999999999999,null,253601,{"$f":"ROUND(D21*F21, 2)","v":884230.61},0.13639963064098268,841283.3979025695,{"$f":"IF(ISERROR(I21/F21), 0, I21/F21)","v":3.3173504753631473}]
["Sentinel Lighting","RTSR - Network","kW",2.2286999999999999,null,419,{"$f":"ROUND(D22*F22, 2)","v":933.83},1.4405073251362431E-4,888.47373816131119,{"$f":"IF(ISERROR(I22/F22), 0, I22/F22)","v":2.1204623822465662}]
["Street Lighting","RTSR - Network","kW",2.2172999999999998,null,20173,{"$f":"ROUND(D23*F23, 2)","v":44729.59},6.8998963457311113E-3,42557.067168245609,{"$f":"IF(ISERROR(I23/F23), 0, I23/F23)","v":2.1096052728025385}]
["Unmetered Scattered Load","RTSR - Network","kWh",7.3000000000000001E-3,1388270.7102000001,null,{"$f":"ROUND(D24*E24, 2)","v":10134.379999999999},1.5633090204549261E-3,9642.1516577398743,{"$f":"IF(ISERROR(I24/E24), 0, I24/E24)","v":6.9454405303636963E-3}]
[]
["The purpose of this table is to re-align the current RTS Connection Rates to recover current wholesale connection costs."]
["Rate Class","Rate Description","Unit","Current RTSR-Connection","Loss Adjusted Billed kWh","Billed kW","Billed Amount","Billed Amount %","Current Wholesale Billing","Adjusted RTSR-Connection"]
[]
["Residential","RTSR - Connection","kWh",6.0000000000000001E-3,301111412.78460002,null,{"$f":"ROUND(D29*E29, 2)","v":1806668.48},{"$f":"G29/4897707.45","v":0.36888044017410632},{"$f":"H29*Total_Current_Wholesale_Lineplus","v":1785052.6936412179},{"$f":"IF(ISERROR(I29/E29), 0, I29/E29)","v":5.928213338489946E-3}]
["General Service Less Than 50 kW","RTSR - Connection","kWh",5.3E-3,91583943.257400006,null,{"$f":"ROUND(D30*E30, 2)","v":485394.9},9.9106552393201847E-2,479587.41922851815,{"$f":"IF(ISERROR(I30/E30), 0, I30/E30)","v":5.2365884473943242E-3}]
{"$rows_left_out":31}
{"sheet":"hidden1","index":9,"n_rows":22,"n_cols":2,"rows_kept":22,"cut":false,"hidden":true,"merged":[]}
[{"$f":"IF('3. Rate Classes'!L17=1, '3. Rate Classes'!C17, \"\")","v":"Residential"},1]
[{"$f":"IF('3. Rate Classes'!L18=1, '3. Rate Classes'!C18, \"\")","v":"General Service Less Than 50 kW"},2]
[{"$f":"IF('3. Rate Classes'!L19=1, '3. Rate Classes'!C19, \"\")","v":"General Service 50 to 999 kW"},3]
[{"$f":"IF('3. Rate Classes'!L20=1, '3. Rate Classes'!C20, \"\")","v":"General Service 1,000 to 4,999 kW"},4]
[{"$f":"IF('3. Rate Classes'!L21=1, '3. Rate Classes'!C21, \"\")","v":"Large Use"},5]
[{"$f":"IF('3. Rate Classes'!L22=1, '3. Rate Classes'!C22, \"\")","v":"Sentinel Lighting"},6]
[{"$f":"IF('3. Rate Classes'!L23=1, '3. Rate Classes'!C23, \"\")","v":"Street Lighting"},7]
[{"$f":"IF('3. Rate Classes'!L24=1, '3. Rate Classes'!C24, \"\")","v":"Unmetered Scattered Load"},8]
[{"$f":"IF('3. Rate Classes'!L25=1, '3. Rate Classes'!C25, \"\")","v":""},9]
[{"$f":"IF('3. Rate Classes'!L26=1, '3. Rate Classes'!C26, \"\")","v":""},10]
[{"$f":"IF('3. Rate Classes'!L27=1, '3. Rate Classes'!C27, \"\")","v":""},11]
[{"$f":"IF('3. Rate Classes'!L28=1, '3. Rate Classes'!C28, \"\")","v":""},12]
[{"$f":"IF('3. Rate Classes'!L29=1, '3. Rate Classes'!C29, \"\")","v":""},13]
[{"$f":"IF('3. Rate Classes'!L30=1, '3. Rate Classes'!C30, \"\")","v":""},14]
[{"$f":"IF('3. Rate Classes'!L31=1, '3. Rate Classes'!C31, \"\")","v":""},15]
[{"$f":"IF('3. Rate Classes'!L32=1, '3. Rate Classes'!C32, \"\")","v":""},16]
[{"$f":"IF('3. Rate Classes'!L33=1, '3. Rate Classes'!C33, \"\")","v":""},17]
[{"$f":"IF('3. Rate Classes'!L34=1, '3. Rate Classes'!C34, \"\")","v":""},18]
[{"$f":"IF('3. Rate Classes'!L35=1, '3. Rate Classes'!C35, \"\")","v":""},19]
[{"$f":"IF('3. Rate Classes'!L36=1, '3. Rate Classes'!C36, \"\")","v":""},20]
[{"$f":"IF('3. Rate Classes'!L37=1, '3. Rate Classes'!C37, \"\")","v":""},21]
[{"$f":"IF('3. Rate Classes'!L38=1, '3. Rate Classes'!C38, \"\")","v":""},22]