{"text_format":"1","workbook":"xlsx","n_sheets":10,"sheets":["1. Info","2. Table of Contents","3. Rate Classes","4. RRR Data","5. UTRs and Sub-Transmission","6. Historical Wholesale","7. Current Wholesale","8. Forecast Wholesale","9. RTSR Rates to Forecast","hidden1"],"not_rendered":{"charts":0,"images":3,"macros":1,"external_links":2,"defined_names":20,"comments":0,"pivot_tables":0},"unopened":[],"bounds":{"document_bytes":16777216,"sheet_cells":100000,"rows_first":2000,"rows_last":500,"rows_between":2000,"halvings":0,"cell_chars":16384,"cell_head_chars":4096},"cells_cut":0,"cells_raw":0,"read":"whole","date_system":"1900"}

{"sheet":"1. Info","index":0,"n_rows":76,"n_cols":28,"rows_kept":76,"cut":false,"hidden":false,"merged":[[24,3,24,4],[20,3,20,4],[1,2,1,9],[2,2,2,9],[3,2,3,9],[4,2,4,9],[14,3,14,4],[16,3,16,4]]}
[null,null,null,null,null,null,null,null,null,null,null,null,null,null,null,null,null,null,null,null,null,null,null,null,null,null,null,"Algoma Power Inc."]
[null,null,null,null,null,null,null,null,null,null,null,null,null,null,null,null,null,null,null,null,null,null,null,null,null,null,null,"Atikokan Hydro Inc."]
[null,null,null,null,null,null,null,null,null,null,null,null,null,null,null,null,null,null,null,null,null,null,null,null,null,null,null,"Attawapiskat Power Corporation"]
[null,null,null,null,null,null,null,null,null,null,null,null,null,null,null,null,null,null,null,null,null,null,null,null,null,null,null,"Bluewater Power Distribution Corporation"]
[null,null,null,null,null,null,null,null,null,null,null,null,null,null,null,null,null,null,null,null,null,null,null,null,null,null,null,"Brant County Power Inc."]
[null,null,null,null,null,null,null,null,null,null,null,null,null,null,null,null,null,null,null,null,null,null,null,null,null,null,null,"Brantford Power Inc."]
[null,null,null,null,null,null,null,null,null,null,null,null,null,null,null,null,null,null,null,null,null,null,null,null,null,null,null,"Burlington Hydro Inc."]
[null,null,null,null,null,null,null,null,null,null,null,null,null,null,null,null,null,null,null,null,null,null,null,null,null,null,null,"Cambridge and North Dumfries Hydro Inc."]
[null,null,null,null,null,null,null,null,null,null,null,null,null,null,null,null,null,null,null,null,null,null,null,null,null,null,null,"Canadian Niagara Power Inc."]
[null,null,null,null,null,null,null,null,null,null,null,null,null,null,null,null,null,null,null,null,null,null,null,null,null,null,null,"Centre Wellington Hydro Ltd."]
[null,null,null,null,null,null,null,null,null,null,null,null,null,null,null,null,null,null,null,null,null,null,null,null,null,null,null,"Chapleau Public Utilities Corporation"]
[null,null,null,null,null,null,null,null,null,null,null,null,null,null,null,null,null,null,null,null,null,null,null,null,null,null,null,"COLLUS PowerStream Corp."]
["Drop-down lists are shaded blue; Input cells are shaded green.",null,null,null,null,null,null,null,null,null,null,null,null,null,null,null,null,null,null,null,null,null,null,null,null,null,null,"Cooperative Hydro Embrun Inc."]
[null,null,null,null,null,null,null,null,null,null,null,null,null,null,null,null,null,null,null,null,null,null,null,null,null,null,null,"E.L.K. Energy Inc."]
[null,null,"Utility Name   ","Brantford Power Inc.",null,null,null,null,null,null,null,null,null,null,null,null,null,null,null,null,null,null,null,null,null,null,null,"Enersource Hydro Mississauga Inc."]
[null,null,null,null,null,null,null,null,null,null,null,null,null,null,null,null,null,null,null,null,null,null,null,null,null,null,null,"Entegrus Powerlines Inc."]
[null,null,"Service Territory","Brantford ON",null,null,null,null,null,null,null,null,null,null,null,null,null,null,null,null,null,null,null,null,null,null,null,"EnWin Utilities Ltd."]
[null,null,null,null,null,null,null,null,null,null,null,null,null,null,null,null,null,null,null,null,null,null,null,null,null,null,null,"Erie Thames Powerlines Corporation"]
[null,null,"Assigned EB Number","EB-2016-####",null,null,null,null,null,null,null,null,null,null,null,null,null,null,null,null,null,null,null,null,null,null,null,"Espanola Regional Hydro Distribution Corporation"]
[null,null,null,null,null,null,null,null,null,null,null,null,null,null,null,null,null,null,null,null,null,null,null,null,null,null,null,"Essex Powerlines Corporation"]
{"$rows_left_out":57}
{"sheet":"2. Table of Contents","index":1,"n_rows":28,"n_cols":9,"rows_kept":28,"cut":false,"hidden":false,"merged":[]}
[]
[]
[]
[]
[]
[]
[]
[]
[]
[]
[]
[]
[]
[]
[]
[]
[]
[]
[]
[null,null,null,"1. Info",null,null,null,null,"6. Historical Wholesale"]
{"$rows_left_out":9}
{"sheet":"3. Rate Classes","index":2,"n_rows":100,"n_cols":23,"rows_kept":100,"cut":false,"hidden":false,"merged":[[12,2,12,8]]}
[]
[]
[]
[]
[]
[]
[]
[]
[]
[]
[]
[]
[null,null,"1.  Select the appropriate rate classes that appear on your most recent Board-Approved Tariff of Rates and Charges.\n2.  Enter the RTS Network and Connection Rate as it appears on the Tariff of Rates and Charges"]
[]
[null,null,"Rate Class",null,"Unit",null,"RTSR-Network",null,"RTSR-Connection"]
[]
[null,null,"Residential",null,"kWh",null,8.2000000000000007E-3,null,5.5999999999999999E-3,null,null,{"$f":"IF(OR(ISBLANK(C17), ISERROR(FIND(\"Choose\", C17))=FALSE), 0, 1)","v":1},{"$f":"\"C\" & ROW(C17)","v":"C17"},{"$f":"IF(OR(C17=\"General Service Intermediate Rate Class 1,000 To 4,999 kW (formerly General Service > 50 kW Customers)\", C17=\"General Service Intermediate Rate Class 1,000 To 4,999 kW (formerly Large Use Customers)\"), \"x\", \"\")","v":""},null,null,null,null,null,null,null,null,"Choose Rate Class"]
[null,null,"General Service Less Than 50 kW",null,"kWh",null,7.3000000000000001E-3,null,4.8999999999999998E-3,null,null,1,"C18",{"$f":"IF(OR(C18=\"General Service Intermediate Rate Class 1,000 To 4,999 kW (formerly General Service > 50 kW Customers)\", C18=\"General Service Intermediate Rate Class 1,000 To 4,999 kW (formerly Large Use Customers)\"), \"x\", \"\")","v":""},null,null,null,null,null,null,null,null,"Residential"]
[null,null,"General Service 50 to 4,999 kW",null,"kW",null,2.5047000000000001,null,1.6685000000000001,null,null,1,"C19","",null,null,null,null,null,null,null,null,"Residential Regular"]
[null,null,"Unmetered Scattered Load",null,"kWh",null,4.3E-3,null,4.8999999999999998E-3,null,null,1,"C20","",null,null,null,null,null,null,null,null,"Residential Urban"]
{"$rows_left_out":81}
{"sheet":"4. RRR Data","index":3,"n_rows":30,"n_cols":9,"rows_kept":30,"cut":false,"hidden":false,"merged":[[12,1,12,8]]}
[]
[]
[]
[]
[]
[]
[]
[]
[]
[]
[]
[]
[]
[]
[null,"Rate Class","Rate Description","Unit","Rate","Non-Loss Adjusted Metered kWh","Non-Loss Adjusted Metered kW","Applicable \nLoss Factor\neg: (1.0325)","Loss Adjusted Billed kWh"]
[]
[null,"Residential","RTSR - Network","kWh",8.2000000000000007E-3,287594336,null,1.032,{"$f":"F17*H17","v":296797354.75200003}]
[null,"Residential","RTSR - Connection","kWh",5.5999999999999999E-3,287594336,null,1.032,{"$f":"F18*H18","v":296797354.75200003}]
[null,"General Service Less Than 50 kW","RTSR - Network","kWh",7.3000000000000001E-3,100078635,null,1.032,{"$f":"F19*H19","v":103281151.32000001}]
[null,"General Service Less Than 50 kW","RTSR - Connection","kWh",4.8999999999999998E-3,100078635,null,1.032,{"$f":"F20*H20","v":103281151.32000001}]
{"$rows_left_out":11}
{"sheet":"5. UTRs and Sub-Transmission","index":4,"n_rows":95,"n_cols":9,"rows_kept":95,"cut":false,"hidden":false,"merged":[]}
[]
[]
[]
[]
[]
[]
[]
[]
[]
[]
[]
[]
[]
[]
[]
[]
[]
[null,"Uniform Transmission Rates","Unit",null,"Effective \nJanuary 1, 2015",null,"Effective \nJanuary 1, 2016",null,"Effective \nJanuary 1, 2017"]
[]
[null,"Rate Description",null,null,"Rate",null,"Rate",null,"Rate"]
{"$rows_left_out":76}
{"sheet":"6. Historical Wholesale","index":5,"n_rows":117,"n_cols":16,"rows_kept":117,"cut":false,"hidden":false,"merged":[[95,7,95,9],[95,11,95,13],[96,7,96,9],[96,11,96,13],[20,3,20,5],[20,7,20,9],[20,11,20,13],[96,3,96,5],[38,3,38,5],[38,7,38,9],[38,11,38,13],[95,3,95,5],[57,3,57,5],[57,7,57,9],[57,11,57,13],[76,3,76,5],[76,7,76,9],[76,11,76,13]]}
[]
[]
[]
[]
[]
[]
[]
[]
[]
[]
[]
[]
[]
[]
[]
[]
[]
[]
[]
[]
{"$rows_left_out":98}
{"sheet":"7. Current Wholesale","index":6,"n_rows":117,"n_cols":16,"rows_kept":117,"cut":false,"hidden":false,"merged":[[12,1,12,11],[19,3,19,5],[19,7,19,9],[19,11,19,13],[38,3,38,5],[38,7,38,9],[38,11,38,13],[96,7,96,9],[96,11,96,13],[20,3,20,5],[20,7,20,9],[20,11,20,13],[96,3,96,5],[95,3,95,5],[95,7,95,9],[95,11,95,13],[57,3,57,5],[57,7,57,9],[57,11,57,13],[76,3,76,5],[76,7,76,9],[76,11,76,13]]}
[]
[]
[]
[]
[]
[]
[]
[]
[]
[]
[]
[]
[null,"The purpose of this sheet is to calculate the expected billing when current 2015 2016Uniform Transmission Rates are applied against historical 2014 2015 transmission units. "]
[]
[]
[]
[]
[]
[]
[null,"IESO",null,"Network",null,null,null,"Line Connection",null,null,null,"Transformation Connection",null,null,null,"Total Line"]
{"$rows_left_out":98}
{"sheet":"8. Forecast Wholesale","index":7,"n_rows":117,"n_cols":16,"rows_kept":117,"cut":false,"hidden":false,"merged":[[12,1,12,12],[19,3,19,5],[19,7,19,9],[19,11,19,13],[38,3,38,5],[38,7,38,9],[38,11,38,13],[96,7,96,9],[96,11,96,13],[20,3,20,5],[20,7,20,9],[20,11,20,13],[96,3,96,5],[95,3,95,5],[95,7,95,9],[95,11,95,13],[57,3,57,5],[57,7,57,9],[57,11,57,13],[76,3,76,5],[76,7,76,9],[76,11,76,13]]}
[]
[]
[]
[]
[]
[]
[]
[]
[]
[]
[]
[]
[null,"The purpose of this sheet is to calculate the expected billing when forecasted 2016  2017 Uniform Transmission Rates are applied against historical 2014  2015 transmission units. "]
[]
[]
[]
[]
[]
[]
[null,"IESO",null,"Network",null,null,null,"Line Connection",null,null,null,"Transformation Connection",null,null,null,"Total Line"]
{"$rows_left_out":98}
{"sheet":"9. RTSR Rates to Forecast","index":8,"n_rows":56,"n_cols":10,"rows_kept":56,"cut":false,"hidden":false,"merged":[]}
[]
[]
[]
[]
[]
[]
[]
[]
[]
[]
[]
[]
["The purpose of this sheet is to re-align the current RTS Network Rates to recover current wholesale network costs."]
[]
["Rate Class","Rate Description","Unit","Current RTSR-Network","Loss Adjusted Billed kWh","Billed kW","Billed Amount","Billed Amount %","Current Wholesale Billing","Adjusted RTSR Network"]
[]
["Residential","RTSR - Network","kWh",8.2000000000000007E-3,296797354.75200003,null,{"$f":"ROUND(D17*E17, 2)","v":2433738.31},{"$f":"G17/7116266.08","v":0.34199653057379775},{"$f":"H17*total_current_wholesale_network","v":2368498.3460392426},{"$f":"IF(ISERROR(I17/E17), 0, I17/E17)","v":7.9801868450557062E-3}]
["General Service Less Than 50 kW","RTSR - Network","kWh",7.3000000000000001E-3,103281151.32000001,null,{"$f":"ROUND(D18*E18, 2)","v":753952.4},{"$f":"G18/7116266.08","v":0.10594775286985897},{"$f":"H18*total_current_wholesale_network","v":733741.58801498974},{"$f":"IF(ISERROR(I18/E18), 0, I18/E18)","v":7.1043126324338663E-3}]
["General Service 50 to 4,999 kW","RTSR - Network","kW",2.5047000000000001,null,1400645.34,{"$f":"ROUND(D19*F19, 2)","v":3508196.38},{"$f":"G19/7116266.08","v":0.49298274411909004},{"$f":"H19*total_current_wholesale_network","v":3414153.9743485642},{"$f":"IF(ISERROR(I19/F19), 0, I19/F19)","v":2.4375578005696745}]
["Unmetered Scattered Load","RTSR - Network","kWh",4.3E-3,1564629.648,null,{"$f":"ROUND(D20*E20, 2)","v":6727.91},{"$f":"G20/7116266.08","v":9.4542698718201948E-4},{"$f":"H20*total_current_wholesale_network","v":6547.5583968191222},{"$f":"IF(ISERROR(I20/E20), 0, I20/E20)","v":4.1847336877379191E-3}]
{"$rows_left_out":37}
{"sheet":"hidden1","index":9,"n_rows":22,"n_cols":2,"rows_kept":22,"cut":false,"hidden":true,"merged":[]}
[{"$f":"IF('3. Rate Classes'!L17=1, '3. Rate Classes'!C17, \"\")","v":"Residential"},1]
[{"$f":"IF('3. Rate Classes'!L18=1, '3. Rate Classes'!C18, \"\")","v":"General Service Less Than 50 kW"},2]
[{"$f":"IF('3. Rate Classes'!L19=1, '3. Rate Classes'!C19, \"\")","v":"General Service 50 to 4,999 kW"},3]
[{"$f":"IF('3. Rate Classes'!L20=1, '3. Rate Classes'!C20, \"\")","v":"Unmetered Scattered Load"},4]
[{"$f":"IF('3. Rate Classes'!L21=1, '3. Rate Classes'!C21, \"\")","v":"Street Lighting"},5]
[{"$f":"IF('3. Rate Classes'!L22=1, '3. Rate Classes'!C22, \"\")","v":"Sentinel Lighting"},6]
[{"$f":"IF('3. Rate Classes'!L23=1, '3. Rate Classes'!C23, \"\")","v":"Embedded Distributor"},7]
[{"$f":"IF('3. Rate Classes'!L24=1, '3. Rate Classes'!C24, \"\")","v":""},8]
[{"$f":"IF('3. Rate Classes'!L25=1, '3. Rate Classes'!C25, \"\")","v":""},9]
[{"$f":"IF('3. Rate Classes'!L26=1, '3. Rate Classes'!C26, \"\")","v":""},10]
[{"$f":"IF('3. Rate Classes'!L27=1, '3. Rate Classes'!C27, \"\")","v":""},11]
[{"$f":"IF('3. Rate Classes'!L28=1, '3. Rate Classes'!C28, \"\")","v":""},12]
[{"$f":"IF('3. Rate Classes'!L29=1, '3. Rate Classes'!C29, \"\")","v":""},13]
[{"$f":"IF('3. Rate Classes'!L30=1, '3. Rate Classes'!C30, \"\")","v":""},14]
[{"$f":"IF('3. Rate Classes'!L31=1, '3. Rate Classes'!C31, \"\")","v":""},15]
[{"$f":"IF('3. Rate Classes'!L32=1, '3. Rate Classes'!C32, \"\")","v":""},16]
[{"$f":"IF('3. Rate Classes'!L33=1, '3. Rate Classes'!C33, \"\")","v":""},17]
[{"$f":"IF('3. Rate Classes'!L34=1, '3. Rate Classes'!C34, \"\")","v":""},18]
[{"$f":"IF('3. Rate Classes'!L35=1, '3. Rate Classes'!C35, \"\")","v":""},19]
[{"$f":"IF('3. Rate Classes'!L36=1, '3. Rate Classes'!C36, \"\")","v":""},20]
{"$rows_left_out":2}