{"text_format":"1","workbook":"xlsx","n_sheets":25,"sheets":["Table of Content","A. LDC Info","B. CurrentTariff","C. Revenues at Curr Rates","RATEBASE & REV REQ ->","D. Rate Base","E. Revenue Requirement","COST ALLOC. & RATE DESIGN ->","F. Cost Allocation & RevAllocn","G. RateDesign","H. Rev_Reconciliation","I. Res Rate Design","J. Cost Allocation","RATE RIDERS ->","K. SMRR","L. DVA","K. Summary of Tariffs","BILL IMPACT ->","Bill Impact - Res 10 Pct","Bill Impact - Residential","Bill Impact - GS<50","Bill Impact - GS>50","Bill Impact - StreetLight","Bill Impact - USL","Update to COS Application"],"not_rendered":{"charts":0,"images":3,"macros":1,"external_links":1,"defined_names":9,"comments":0,"pivot_tables":0},"unopened":[],"bounds":{"document_bytes":16777216,"sheet_cells":100000,"rows_first":2000,"rows_last":500,"rows_between":2000,"halvings":0,"cell_chars":16384,"cell_head_chars":4096},"cells_cut":0,"cells_raw":0,"read":"whole","date_system":"1900"}

{"sheet":"Table of Content","index":0,"n_rows":31,"n_cols":5,"rows_kept":31,"cut":false,"hidden":false,"merged":[[6,3,6,7]]}
["Rate Design Model version 1.0 © CHEC "]
[]
[]
[]
[]
[]
[null,null,null,"Table of Content"]
[]
[null,null,null,null,"A. LDC Info"]
[null,null,null,null,"B. CurrentTariff"]
[null,null,null,null,"C. Revenues at Curr Rates"]
[null,null,null,null,"RATEBASE & REV REQ ->"]
[null,null,null,null,"D. Rate Base"]
[null,null,null,null,"E. Revenue Requirement"]
[null,null,null,null,"COST ALLOC. & RATE DESIGN ->"]
{"$rows_left_out":17}
{"sheet":"A. LDC Info","index":1,"n_rows":34,"n_cols":20,"rows_kept":34,"cut":false,"hidden":false,"merged":[[17,4,17,8],[33,2,33,12],[19,4,19,8],[29,2,29,11],[31,2,31,13],[9,4,9,10],[11,4,11,8],[13,4,13,8],[15,4,15,8],[15,9,15,10]]}
["Rate Design Model version 1.0 © CHEC ",null,null,null,null,null,null,null,null,null,null,null,null,null,null,null,null,null,null,2]
[]
[]
[]
[]
[]
[]
[]
[]
[null,null,null,"Utility Name   ","Renfrew Hydro Inc."]
[]
[null,null,null,"Service Territory"," "]
[]
[null,null,null,"Assigned EB Number"," "]
[]
{"$rows_left_out":20}
{"sheet":"B. CurrentTariff","index":2,"n_rows":217,"n_cols":4,"rows_kept":217,"cut":false,"hidden":false,"merged":[[8,0,8,3]]}
["Rate Design Model version 1.0 © CHEC "]
[]
[]
[]
[]
[]
[]
[]
["Customer Class & Current Tariff Sheet"]
[]
[]
["Customer Class Name","Existing/ Proposed","MSC\nMetric","Usage Metric"]
["Residential","Exisitng","Customer","kWh"]
["General Service < 50 kW","Existing","Customer","kWh"]
["General Service > 50 to 4999 kW","Existing","Customer","kW"]
{"$rows_left_out":203}
{"sheet":"C. Revenues at Curr Rates","index":3,"n_rows":55,"n_cols":9,"rows_kept":55,"cut":false,"hidden":false,"merged":[[47,1,47,8],[9,0,9,8],[33,0,33,8],[8,0,8,10],[12,1,12,8],[23,1,23,8],[36,1,36,8]]}
["Rate Design Model version 1.0 © CHEC "]
[]
[]
[]
[]
[]
[]
[]
[" "]
["Projected Revenues at Current Rates"]
[]
["2010 Rates at 2017 Load"]
[null,"Test Year Projected Revenue from Existing Variable Charges"]
["Customer Class Name","Variable\nDistribution\nRate","per","Test Year Volume","Gross\nVariable\nRevenue","Transform.\nAllowance\nRate","Transform.\nAllowance\nkW's","Transform.\nAllowance\n$'s","Net\nVariable\nRevenue"]
[{"$f":"'B. CurrentTariff'!A13","v":"Residential"},1.4500000000000001E-2,{"$f":"'B. CurrentTariff'!D13","v":"kWh"},28929065.912004169,{"$f":"B15*D15","v":419471.45572406048},null,null,{"$f":"F15*G15","v":0},{"$f":"E15+H15","v":419471.45572406048}]
{"$rows_left_out":41}
{"sheet":"RATEBASE & REV REQ ->","index":4,"n_rows":11,"n_cols":8,"rows_kept":11,"cut":false,"hidden":false,"merged":[]}
["Rate Design Model version 1.0 © CHEC "]
[]
[]
[]
[]
[]
[null,null,null,null,null,null,null,"Rate Base"]
[null,null,null,null,null,null,null,"&"]
[null,null,null,null,null,null,null,"Revenue Requirement"]
[null,null,null,null,null,null,null," "]
[null,null,null,null,null,null,null," "]

{"sheet":"D. Rate Base","index":5,"n_rows":33,"n_cols":8,"rows_kept":33,"cut":false,"hidden":false,"merged":[[8,1,8,3],[9,1,9,3],[11,2,11,3],[21,1,21,3],[23,2,23,3]]}
["Rate Design Model version 1.0 © CHEC "]
[]
[]
[]
[]
[]
[]
[]
[]
[null,"Rate Base and Working Capital Allowance"]
[]
[null,"Particulars","Test Year 2014 (CGAAP)"]
[]
[null,"Test Year Net Fixed Asset Opening Balance",15495708.98]
[null,"Test Year Net Fixed Asset Closing Balance",-9556595.0500000007]
{"$rows_left_out":19}
{"sheet":"E. Revenue Requirement","index":6,"n_rows":26,"n_cols":3,"rows_kept":26,"cut":false,"hidden":false,"merged":[[8,1,8,5],[9,1,9,2]]}
["Rate Design Model version 1.0 © CHEC "]
[]
[]
[]
[]
[]
[]
[]
[null," "]
[null,"Distribution Revenue Requirement "]
[]
[null,"Particular","Test Year"]
[null,null," "]
[null,"OM&A Expenses",1549280]
[null,"Depreciation Expenses",247980.96000000002]
{"$rows_left_out":12}
{"sheet":"COST ALLOC. & RATE DESIGN ->","index":7,"n_rows":11,"n_cols":8,"rows_kept":11,"cut":false,"hidden":false,"merged":[]}
["Rate Design Model version 1.0 © CHEC "]
[]
[]
[]
[]
[]
[null,null,null,null,null,null,null,"Cost Allocation"]
[null,null,null,null,null,null,null,"&"]
[null,null,null,null,null,null,null,"Rate Design"]
[null,null,null,null,null,null,null," "]
[null,null,null,null,null,null,null," "]

{"sheet":"F. Cost Allocation & RevAllocn","index":8,"n_rows":53,"n_cols":14,"rows_kept":53,"cut":false,"hidden":false,"merged":[[42,8,42,10],[40,0,40,3],[42,1,42,3],[42,5,42,6],[25,0,25,3],[27,1,27,6],[27,11,27,13],[28,1,28,2],[28,3,28,4],[28,5,28,6],[8,0,8,10],[9,0,9,10],[12,1,12,7],[12,8,12,10],[13,1,13,2],[13,3,13,4],[27,8,27,9],[13,5,13,6],[6,12,6,13],[0,12,0,13],[1,12,1,13],[2,12,2,13],[3,12,3,13],[4,12,4,13]]}
["Rate Design Model version 1.0 © CHEC "]
[]
[]
[]
[]
[]
[]
[]
[]
["Cost Allocation Results and Revenue Allocation"]
[]
[]
["Cost Allocation Results","REVENUE ALLOCATION (sheet O1)",null,null,null,null,null,null,"CUSTOMER UNIT COST PER MONTH (sheet O2)"]
["Customer Class Name","Service Rev Req (row40)",null,"Misc. Revenue (mi) (row19)",null,"Base Rev Req (row80)",null,"Rev2Cost Expenses %","Avoided Costs\n(Minimum Charge)","Directly Related","Minimum System with PLCC * adjustment","Maximum Charge"]
[{"$f":"'B. CurrentTariff'!A13","v":"Residential"},1340506.6685747427,{"$f":"IF(B15,ABS(B15/$B$24),\"\")","v":0.59417823278214843},64906.685257473044,{"$f":"IF(D15,ABS(D15/$D$24),\"\")","v":0.60350241987422648},{"$f":"B15-D15","v":1275599.9833172697},{"$f":"IF(F15,ABS(F15/$F$24),\"\")","v":0.59371148491818249},0.9647466296054269,8.9455102936698445,14.283616454615341,20.875816275131893,{"$f":"MAX(J15,K15,'G. RateDesign'!B15)","v":20.875816275131893}]
{"$rows_left_out":39}
{"sheet":"G. RateDesign","index":9,"n_rows":79,"n_cols":10,"rows_kept":79,"cut":false,"hidden":false,"merged":[[8,0,8,7],[9,0,9,7],[12,1,12,3],[43,5,43,7]]}
["Rate Design Model version 1.0 © CHEC "]
[]
[]
[]
[]
[]
[]
[]
[]
["Rate Design"]
[]
["Existing Rates"]
[null,"Current Rates and Fixed to Variable Split",null,null,null,null," Proposed Rates at Current Fixed to Variable Split"]
["Customer Class Name","Rate","Fixed %","Variable %",null,"Rate","Fixed %","Variable %"]
[{"$f":"'B. CurrentTariff'!$A$13","v":"Residential"},{"$f":"'C. Revenues at Curr Rates'!B26","v":13.97},{"$f":"'C. Revenues at Curr Rates'!G26","v":0.605154571714972},{"$f":"'C. Revenues at Curr Rates'!H26","v":0.39484542828502794},null,16.155234712068133,{"$f":"C15","v":0.605154571714972},{"$f":"1-G15","v":0.394845428285028}]
{"$rows_left_out":65}
{"sheet":"H. Rev_Reconciliation","index":10,"n_rows":27,"n_cols":18,"rows_kept":27,"cut":false,"hidden":false,"merged":[[11,12,12,12],[12,8,12,9],[24,0,25,15],[26,0,27,15],[8,0,8,17],[9,0,9,17],[11,1,12,1],[11,2,11,4],[11,5,11,6],[11,7,11,9],[11,11,12,11],[11,14,12,14],[11,15,12,15],[11,16,12,16],[11,17,12,17],[11,10,12,10]]}
["Rate Design Model version 1.0 © CHEC "]
[]
[]
[]
[]
[]
[]
[]
["Appendix 2-V"]
["Revenue Reconciliation"]
[]
[null,"Customers/ Connections","Number of Customers/Connections",null,null,"Test Year Consumption",null,"Proposed Rates",null,null,"Revenues at Proposed Rates","Revenues at Proposed Rates","Total",null,"Class Specific Revenue Requirement","Transformer Allowance Credit","Total","Difference"]
[null,null,"Start of Test Year","End of Test Year","Average","kWh","kW","Monthly Service Charge","Volumetric"]
[null,null,null,null,null,null,null,null,"kWh","kW"]
[{"$f":"'B. CurrentTariff'!$A$13","v":"Residential"},"kWh",{"$f":"'C. Revenues at Curr Rates'!C26","v":3834.9876147687037},{"$f":"C15","v":3834.9876147687037},{"$f":"IF(SUM(C15:D15)=0,0,AVERAGE(C15:D15))","v":3834.9876147687037},28929065.912004169,0,{"$f":"'G. RateDesign'!B46","v":17.91},{"$f":"'G. RateDesign'!G46","v":1.3976689220655134E-2},null,{"$f":"H15*E15*12","v":824215.5381660898},{"$f":"I15*F15+J15*G15","v":404332.56369593053},{"$f":"K15+L15","v":1228548.1018620203},null,{"$f":"'G. RateDesign'!F61","v":1228548.1018620203},null,{"$f":"SUM(O15:P15)","v":1228548.1018620203},{"$f":"Q15-M15","v":0}]
{"$rows_left_out":13}
{"sheet":"I. Res Rate Design","index":11,"n_rows":60,"n_cols":7,"rows_kept":60,"cut":false,"hidden":false,"merged":[[53,0,54,4],[56,0,58,4],[59,0,60,4],[8,0,8,5],[9,0,9,5],[15,0,15,1],[21,0,21,1],[46,0,46,1],[48,0,49,0]]}
[null,null,null,null,"File Number:",0]
[null,null,null,null,"Exhibit:"]
[null,null,null,null,"Tab:"]
[null,null,null,null,"Schedule:"]
[null,null,null,null,"Page:"]
[]
[null,null,null,null,"Date:"]
[]
[]
["New Rate Design Policy For Residential Customers"]
[]
["Please complete the following tables."]
[]
["A)  Data Inputs"]
[]
{"$rows_left_out":46}
{"sheet":"J. Cost Allocation","index":12,"n_rows":67,"n_cols":6,"rows_kept":67,"cut":false,"hidden":false,"merged":[[8,0,8,4],[9,0,9,4]]}
[null,null,null,null,"File Number:",{"$f":"EBNUMBER","v":{"$error":"#NAME?"}}]
[null,null,null,null,"Exhibit:"]
[null,null,null,null,"Tab:"]
[null,null,null,null,"Schedule:"]
[null,null,null,null,"Page:"]
[]
[null,null,null,null,"Date:"]
[]
["Appendix 2-P"]
["Cost Allocation"]
[]
["Please complete the following four tables."]
[]
["A)  Allocated Costs"]
[]
{"$rows_left_out":53}
{"sheet":"RATE RIDERS ->","index":13,"n_rows":11,"n_cols":8,"rows_kept":11,"cut":false,"hidden":false,"merged":[]}
["Rate Design Model version 1.0 © CHEC "]
[]
[]
[]
[]
[]
[]
[null,null,null,null,null,null,null,"Rate Riders"]
[]
[null,null,null,null,null,null,null," "]
[null,null,null,null,null,null,null," "]

{"sheet":"K. SMRR","index":14,"n_rows":23,"n_cols":7,"rows_kept":23,"cut":false,"hidden":false,"merged":[[8,0,8,8],[9,0,9,8]]}
["Rate Design Model version 1.0 © CHEC "]
[]
[]
[]
[]
[]
[]
[]
[" "]
["Stranded Meter Rate Rider"]
[]
["Customer Class Name","Net Book Value","% share","Annual $","Customer ","Rate ","per month"]
["Residential",{"$f":"$D$19*C13","v":31323.78},0.56999999999999995,{"$f":"$D$21*C13","v":6264.7559999999994},3834.9876147687037,{"$f":"D13/E13","v":1.6335792000668143},{"$f":"F13/12","v":0.13613160000556787}]
["General Service < 50 kW",{"$f":"$D$19*C14","v":6044.94},0.11,{"$f":"$D$21*C14","v":1208.9879999999998},413.64109259168811,{"$f":"D14/E14","v":2.9227947166105466},{"$f":"F14/12","v":0.24356622638421221}]
["General Service > 50 to 4999 kW",{"$f":"$D$19*C15","v":17585.28},0.32,{"$f":"$D$21*C15","v":3517.056},60.779977365656592,{"$f":"D15/E15","v":57.86537199316718},{"$f":"F15/12","v":4.822114332763932}]
{"$rows_left_out":9}
{"sheet":"L. DVA","index":15,"n_rows":201,"n_cols":7,"rows_kept":201,"cut":false,"hidden":false,"merged":[[8,0,8,10],[43,1,44,1],[43,2,44,2],[43,3,44,3],[43,4,44,4],[43,5,44,5],[17,1,18,1],[17,2,18,2],[17,3,18,3],[17,4,18,4],[17,5,18,5],[69,1,70,1],[69,2,70,2],[69,3,70,3],[69,4,70,4],[69,5,70,5],[95,1,96,1],[95,2,96,2],[95,3,96,3],[95,4,96,4],[95,5,96,5],[122,1,123,1],[122,2,123,2],[122,3,123,3],[122,4,123,4],[122,5,123,5],[150,1,151,1],[150,2,151,2],[150,3,151,3],[150,4,151,4],[150,5,151,5],[178,1,179,1],[178,2,179,2],[178,3,179,3],[178,4,179,4],[178,5,179,5]]}
["Rate Design Model version 1.0 © CHEC "]
[]
[]
[]
[]
[]
[]
[]
["Disposition of Deferral and Variance Account"]
[]
[]
[]
[null," Please indicate the Rate Rider Recovery Period (in years)",null,4]
[]
[]
{"$rows_left_out":187}
{"sheet":"K. Summary of Tariffs","index":16,"n_rows":158,"n_cols":7,"rows_kept":158,"cut":false,"hidden":true,"merged":[[7,0,7,6],[8,0,8,6],[11,0,11,2],[11,4,11,6],[0,6,0,7],[1,6,1,7],[2,6,2,7],[3,6,3,7],[4,6,4,7],[6,6,6,7]]}
["Rate Design Model version 1.0 © CHEC "]
[]
[]
[]
[]
[]
[]
[" "]
["Summary of Tariff Sheet"]
[]
[]
["Current Rates",null,null,null,"Proposed Rates"]
[{"$f":"IF(ISBLANK('B. CurrentTariff'!A30),\"\",'B. CurrentTariff'!A30)","v":"Residential"},"rate","Connection Type",null,{"$f":"A13","v":"Residential"},{"$f":"B13","v":"rate"},{"$f":"C13","v":"Connection Type"}]
[null,""]
[{"$f":"IF(ISBLANK('B. CurrentTariff'!A32),\"\",'B. CurrentTariff'!A32)","v":"Service Charge"},{"$f":"IF(ISBLANK('B. CurrentTariff'!C32),\"\",'B. CurrentTariff'!C32)","v":13.97},{"$f":"IF(ISBLANK('B. CurrentTariff'!D32),\"\",'B. CurrentTariff'!D32)","v":"$"},null,{"$f":"A15","v":"Service Charge"},{"$f":"'G. RateDesign'!B46","v":17.91},{"$f":"C15","v":"$"}]
{"$rows_left_out":144}
{"sheet":"BILL IMPACT ->","index":17,"n_rows":10,"n_cols":8,"rows_kept":10,"cut":false,"hidden":false,"merged":[]}
["Rate Design Model version 1.0 © CHEC "]
[]
[]
[]
[]
[]
[null,null,null,null,null,null,null,"Revenue"]
[null,null,null,null,null,null,null,"Requirement"]
[null,null,null,null,null,null,null,"Workform"]
[null,null,null,null,null,null,null,"('RRWF')"]

{"sheet":"Bill Impact - Res 10 Pct","index":18,"n_rows":76,"n_cols":20,"rows_kept":76,"cut":false,"hidden":false,"merged":[[72,1,72,3],[20,3,21,3],[20,13,21,13],[20,14,21,14],[65,1,65,3],[66,1,66,3],[71,1,71,3],[2,0,2,10],[9,1,9,14],[10,1,10,14],[13,3,13,14],[19,5,19,7],[19,9,19,11],[19,13,19,14]]}
[null,null,null,null,null,null,null,null,null,null,null,null,null,null,null,null,null,null,null,1]
[]
[]
[]
[]
[]
[]
[]
[]
[null,"Appendix 2-W"]
[null,"Bill Impacts"]
[]
[]
[null,"Customer Class:",null,"Residential"]
[]
{"$rows_left_out":62}
{"sheet":"Bill Impact - Residential","index":19,"n_rows":76,"n_cols":20,"rows_kept":76,"cut":false,"hidden":false,"merged":[[72,1,72,3],[20,3,21,3],[20,13,21,13],[20,14,21,14],[65,1,65,3],[66,1,66,3],[71,1,71,3],[2,0,2,10],[9,1,9,14],[10,1,10,14],[13,3,13,14],[19,5,19,7],[19,9,19,11],[19,13,19,14]]}
[null,null,null,null,null,null,null,null,null,null,null,null,null,null,null,null,null,null,null,1]
[]
[]
[]
[]
[]
[]
[]
[]
[null,"Appendix 2-W"]
[null,"Bill Impacts"]
[]
[]
[null,"Customer Class:",null,"Residential"]
[]
{"$rows_left_out":62}
{"sheet":"Bill Impact - GS<50","index":20,"n_rows":76,"n_cols":20,"rows_kept":76,"cut":false,"hidden":false,"merged":[[72,1,72,3],[20,3,21,3],[20,13,21,13],[20,14,21,14],[65,1,65,3],[66,1,66,3],[71,1,71,3],[2,0,2,10],[9,1,9,14],[10,1,10,14],[13,3,13,14],[19,5,19,7],[19,9,19,11],[19,13,19,14]]}
[null,null,null,null,null,null,null,null,null,null,null,null,null,null,null,null,null,null,null,1]
[]
[]
[]
[]
[]
[]
[]
[]
[null,"Appendix 2-W"]
[null,"Bill Impacts"]
[]
[]
[null,"Customer Class:",null,"General Service < 50KW"]
[]
{"$rows_left_out":62}
{"sheet":"Bill Impact - GS>50","index":21,"n_rows":76,"n_cols":20,"rows_kept":76,"cut":false,"hidden":false,"merged":[[72,1,72,3],[20,3,21,3],[20,13,21,13],[20,14,21,14],[65,1,65,3],[66,1,66,3],[71,1,71,3],[2,0,2,10],[9,1,9,14],[10,1,10,14],[13,3,13,14],[19,5,19,7],[19,9,19,11],[19,13,19,14]]}
[null,null,null,null,null,null,null,null,null,null,null,null,null,null,null,null,null,null,null,1]
[]
[]
[]
[]
[]
[]
[]
[]
[null,"Appendix 2-W"]
[null,"Bill Impacts"]
[]
[]
[null,"Customer Class:",null,"General Service > 50KW"]
[]
{"$rows_left_out":62}
{"sheet":"Bill Impact - StreetLight","index":22,"n_rows":76,"n_cols":20,"rows_kept":76,"cut":false,"hidden":false,"merged":[[72,1,72,3],[20,3,21,3],[20,13,21,13],[20,14,21,14],[65,1,65,3],[66,1,66,3],[71,1,71,3],[2,0,2,10],[9,1,9,14],[10,1,10,14],[13,3,13,14],[19,5,19,7],[19,9,19,11],[19,13,19,14]]}
[null,null,null,null,null,null,null,null,null,null,null,null,null,null,null,null,null,null,null,1]
[]
[]
[]
[]
[]
[]
[]
[]
[null,"Appendix 2-W"]
[null,"Bill Impacts"]
[]
[]
[null,"Customer Class:",null,"StreetLight"]
[]
{"$rows_left_out":62}
{"sheet":"Bill Impact - USL","index":23,"n_rows":76,"n_cols":20,"rows_kept":76,"cut":false,"hidden":false,"merged":[[72,1,72,3],[20,3,21,3],[20,13,21,13],[20,14,21,14],[65,1,65,3],[66,1,66,3],[71,1,71,3],[2,0,2,10],[9,1,9,14],[10,1,10,14],[13,3,13,14],[19,5,19,7],[19,9,19,11],[19,13,19,14]]}
[null,null,null,null,null,null,null,null,null,null,null,null,null,null,null,null,null,null,null,1]
[]
[]
[]
[]
[]
[]
[]
[]
[null,"Appendix 2-W"]
[null,"Bill Impacts"]
[]
[]
[null,"Customer Class:",null,"USL"]
[]
{"$rows_left_out":62}
{"sheet":"Update to COS Application","index":24,"n_rows":51,"n_cols":16,"rows_kept":51,"cut":false,"hidden":false,"merged":[[3,3,3,9],[0,0,0,15]]}
["Rate Design Model version 1.0 © CHEC "]
[]
[]
[null,null,null," Updates to Cost of Service Application"]
[null,"Note: By clicking the camera icon, utilities can take a snapshot of that specific row. This feature is intended to help utilites keep track of the changes throughout the various stages of the application.. "]
["Snapshot/Reset",null,"Reference"," Description","Regulated Return on Capital","Regulated Rate of Return","Rate Base","WCA","Amortization","PILS","OM&A","Base Rev Req","Affects Cost Allocation Y/N","Affects Rate Design Y/N","Affects Rate Riders Y/N","Affects Final Rates Y/N"]
[null,{"$f":"TODAY()","v":"2016-06-13"},"Original Application","Filed on June 14, 2016",435760.01195310877,null,6933995.4801271195,994881.55012711952,247980.96000000002,23047.146341509921,1549280,2148518.118294619,"No","No","No","No"]
[null,null,null,null,{"$f":"'E. Revenue Requirement'!$C$19","v":435760.01195310877},null,{"$f":"'D. Rate Base'!$D$20","v":6933995.4801271195},{"$f":"'D. Rate Base'!$D$31","v":994881.55012711952},{"$f":"'E. Revenue Requirement'!$C$15","v":247980.96000000002},{"$f":"'E. Revenue Requirement'!$C$21","v":23047.146341509921},{"$f":"'E. Revenue Requirement'!$C$14","v":1549280},{"$f":"'E. Revenue Requirement'!$C$26","v":2148518.118294619},"No","No","No","No"]
[null,null,null,null,{"$f":"E7-E8","v":0},{"$f":"F7-F8","v":0},0,0,0,0,0,0]
[null,null,null,null,{"$f":"'E. Revenue Requirement'!C19","v":435760.01195310877},null,{"$f":"'D. Rate Base'!D20","v":6933995.4801271195},{"$f":"'D. Rate Base'!D31","v":994881.55012711952},{"$f":"'E. Revenue Requirement'!C15","v":247980.96000000002},{"$f":"'E. Revenue Requirement'!C21","v":23047.146341509921},{"$f":"'E. Revenue Requirement'!C14","v":1549280},{"$f":"'E. Revenue Requirement'!C26","v":2148518.118294619},"No","No","No","No"]
[null,null,null,null,{"$f":"'E. Revenue Requirement'!$C$19","v":435760.01195310877},null,{"$f":"'D. Rate Base'!$D$20","v":6933995.4801271195},{"$f":"'D. Rate Base'!$D$31","v":994881.55012711952},{"$f":"'E. Revenue Requirement'!$C$15","v":247980.96000000002},{"$f":"'E. Revenue Requirement'!$C$21","v":23047.146341509921},{"$f":"'E. Revenue Requirement'!$C$14","v":1549280},{"$f":"'E. Revenue Requirement'!$C$26","v":2148518.118294619},"No","No","No","No"]
[null,null,null,null,{"$f":"E10-E11","v":0},0,0,0,0,0,0,0]
[null,null,null,null,{"$f":"'E. Revenue Requirement'!$C$19","v":435760.01195310877},null,{"$f":"'D. Rate Base'!$D$20","v":6933995.4801271195},{"$f":"'D. Rate Base'!$D$31","v":994881.55012711952},{"$f":"'E. Revenue Requirement'!$C$15","v":247980.96000000002},{"$f":"'E. Revenue Requirement'!$C$21","v":23047.146341509921},{"$f":"'E. Revenue Requirement'!$C$14","v":1549280},{"$f":"'E. Revenue Requirement'!$C$26","v":2148518.118294619},"No","No","No","No"]
[null,null,null,null,{"$f":"'E. Revenue Requirement'!$C$19","v":435760.01195310877},null,{"$f":"'D. Rate Base'!$D$20","v":6933995.4801271195},{"$f":"'D. Rate Base'!$D$31","v":994881.55012711952},{"$f":"'E. Revenue Requirement'!$C$15","v":247980.96000000002},{"$f":"'E. Revenue Requirement'!$C$21","v":23047.146341509921},{"$f":"'E. Revenue Requirement'!$C$14","v":1549280},{"$f":"'E. Revenue Requirement'!$C$26","v":2148518.118294619},"No","No","No","No"]
[null,null,null,null,{"$f":"E13-E14","v":0},0,0,0,0,0,0,0]
{"$rows_left_out":36}