{"text_format":"1","workbook":"xlsx","n_sheets":9,"sheets":["Evaluations","Grade Structure","Job Matrix","Market Data","Public_Interp","Private_Interp","Participant List","Client Data","Job Matrix (blank)"],"not_rendered":{"charts":0,"images":4,"macros":0,"external_links":0,"defined_names":317,"comments":0,"pivot_tables":0},"unopened":[],"bounds":{"document_bytes":16777216,"sheet_cells":100000,"rows_first":2000,"rows_last":500,"rows_between":2000,"halvings":0,"cell_chars":16384,"cell_head_chars":4096},"cells_cut":0,"cells_raw":0,"read":"whole","date_system":"1900"}

{"sheet":"Evaluations","index":0,"n_rows":80,"n_cols":16,"rows_kept":80,"cut":false,"hidden":false,"merged":[[3,0,3,15],[4,0,5,0],[4,1,5,1],[4,2,4,5],[4,6,4,9],[4,10,4,13],[4,14,5,14],[4,15,5,15]]}
[]
[]
[]
["Evaluation Details"]
["Job Title","IESO Business Unit","KH",null,null,null,"PS",null,null,null,"AC",null,null,null,"Hay Pts","SP"]
[null,null,"PTK","POI","CIS","pts","TKE","TKC","%","pts","FTA","MAG","NOI","pts"]
["Director, Market Operations","Market & Systems Operations","F+","III-",3,528,"F",4,0.5,264,"F",5,"C",400,{"$f":"F7+J7+N7","v":1192},"A3"]
["Director, Power Systems Assessments","Market & Systems Operations","F+","III-",3,528,"F",4,0.5,264,"F",5,"C",400,1192,"A3"]
["Director, MACD","CEO","F+","III-",3,528,"F",4,0.5,264,"F",4,"C",304,1096,"A1"]
["Director, Contract Management","Market & Resource Development","F+","II",3,460,"F",4,0.5,230,"E+",5,"C",304,994,"A2"]
{"$rows_left_out":71}
{"sheet":"Grade Structure","index":1,"n_rows":82,"n_cols":14,"rows_kept":82,"cut":false,"hidden":false,"merged":[[1,0,1,4],[1,6,1,10],[1,11,1,13],[11,6,11,10]]}
["IESO Grading Structure"]
["Incumbent Data",null,null,null,null,null,"Grade Structure"]
["Title","Total Points","Grade","Pay Grade","Fit",null,"Start","Midpoint","End","Grade","Range Spread","bottom","top","tolerance #"]
[null,null,null,null,null,null,122,{"$f":"AVERAGE(G4,I4)","v":153},{"$f":"ROUND(G4*(1+K4),0)","v":184},8,0.51,{"$f":"G4+N4","v":125.1},{"$f":"I4-N4","v":180.9},{"$f":"(I4-G4)*J$28","v":3.1}]
[null,null,null,null,null,null,{"$f":"+I4+1","v":185},231.5,278,7,0.5,189.65,273.35000000000002,{"$f":"(I5-G5)*J$28","v":4.6500000000000004}]
[null,null,null,null,null,null,{"$f":"+I5+1","v":279},349,419,6,0.5,286,412,7]
[null,null,null,null,null,null,420,{"$f":"AVERAGE(G7,I7)","v":525},{"$f":"ROUND(G7*(1+K7),0)","v":630},5,0.5,{"$f":"G7+N7","v":430.5},{"$f":"I7-N7","v":619.5},{"$f":"(I7-G7)*J$28","v":10.5}]
[null,null,null,null,null,null,{"$f":"+I7+1","v":631},{"$f":"AVERAGE(G8,I8)","v":725.5},{"$f":"ROUND(G8*(1+K8),0)","v":820},4,0.3,{"$f":"G8+N8","v":640.45000000000005},{"$f":"I8-N8","v":810.55},{"$f":"(I8-G8)*J$28","v":9.4500000000000011}]
[null,null,null,null,null,null,{"$f":"+I8+1","v":821},1026.5,{"$f":"ROUND(G9*(1+K9),0)","v":1232},3,0.5,841.55,1211.45,{"$f":"(I9-G9)*J$28","v":20.55}]
[{"$f":"Evaluations!A7","v":"Director, Market Operations"},{"$f":"Evaluations!O7","v":1192},{"$f":"IFERROR(VLOOKUP($B10,$G$4:$J$10,4,1),\"\")","v":3},{"$f":"IFERROR(VLOOKUP($B10,$G$14:$J$26,4,1),\"\")","v":"3H"},{"$f":"IFERROR(IF(B10=\"\",\"\",IF(VLOOKUP($C10,J$4:N$10,3,0)>B10,\"L\",IF(VLOOKUP(C10,J$4:N$10,4,0)<B10,\"H\",\"\"))),\"\")","v":""},null,{"$f":"+I9+1","v":1233},{"$f":"AVERAGE(G10,I10)","v":1541.5},{"$f":"ROUND(G10*(1+K10),0)","v":1850},2,0.5,{"$f":"G10+N10","v":1263.8499999999999},{"$f":"I10-N10","v":1819.15},{"$f":"(I10-G10)*J$28","v":30.85}]
{"$rows_left_out":73}
{"sheet":"Job Matrix","index":2,"n_rows":47,"n_cols":21,"rows_kept":47,"cut":false,"hidden":false,"merged":[[5,0,6,0],[5,1,6,1],[5,2,6,2],[5,3,6,3],[5,4,6,4],[8,0,9,0],[8,4,9,4],[12,0,14,0],[12,2,14,2],[12,5,14,5],[8,3,9,3],[8,5,9,5],[15,0,21,0],[15,1,21,1],[15,2,21,2],[15,3,21,3],[15,4,21,4],[26,7,28,7],[22,0,23,0],[22,1,23,1],[22,3,23,3],[22,4,23,4],[22,5,23,5],[22,6,23,6],[26,0,28,0],[26,2,28,2],[26,3,28,3],[26,4,28,4],[24,0,25,0],[45,0,46,0],[45,3,46,3],[45,5,46,5],[45,6,46,6],[29,7,30,7],[32,0,38,0],[32,2,38,2],[32,3,38,3],[32,5,38,5],[32,6,38,6],[32,7,38,7],[29,0,30,0],[29,1,30,1],[29,2,30,2],[29,4,30,4],[29,5,30,5],[45,7,46,7],[39,1,40,1],[39,3,40,3],[39,4,40,4],[39,6,40,6],[42,2,43,2],[42,3,43,3],[42,4,43,4],[42,5,43,5],[42,6,43,6],[39,0,41,0],[42,0,44,0],[1,10,1,14],[8,2,9,2],[22,7,23,7],[15,6,21,6],[15,7,17,7],[19,7,21,7],[12,6,14,6],[8,6,9,6],[5,6,6,6],[5,7,6,7],[8,7,9,7],[29,6,30,6],[26,5,28,5],[26,6,28,6]]}
["Job Ranking Matrix",null,null,null,null,null,null,null,null,null,null,null,null,null,null,1]
["Evaluation Points","Corporate Services","Information & Technology Services","Planning, Law & Aboriginal Relations","Market & Resource Development","Market & Systems Operations","CEO","Conservation & Corporate Relations"]
[null,null,null,null,null,null,null,null,1708]
[null,null,null,null,null,null,null,null,1628,null,null,null,null,null,null,null,{"$f":"five_grade","v":420},525,630,5,0.5]
[null,null,null,null,null,null,null,null,1418,null,null,null,null,null,null,null,631,725.5,820,4,0.3]
[1192,null,null,null,null,"Director, Market Operations",null,null,1192,null,null,null,null,null,null,null,821,1026.5,1232,3,0.5]
[null,null,null,null,null,"Director, Power Systems Assessments",null,null,1192,null,null,null,null,null,null,null,1233,1541.5,1850,2,0.5]
[1096,null,null,null,null,null,"Director, MACD",null,1096,null,{"$f":"IFERROR(Q8,\"\")","v":""},{"$f":"IFERROR(R8,\"\")","v":""},{"$f":"IFERROR(S8,\"\")","v":""},{"$f":"IFERROR(T8,\"\")","v":""},{"$f":"IFERROR(U8,\"\")","v":""},null,{"$error":"#N/A"},{"$error":"#N/A"},{"$error":"#N/A"},{"$error":"#N/A"},{"$error":"#N/A"}]
[994,"Director, Human Resources\r",null,null,"Director, Contract Management",null,null,null,994,null,"","","","","",null,{"$error":"#N/A"},{"$error":"#N/A"},{"$error":"#N/A"},{"$error":"#N/A"},{"$error":"#N/A"}]
[null,"Director, Settlements",null,null,null,null,null,null,994,null,null,null,null,null,null,null,{"$f":"'Grade Structure'!G13","v":"Start"},{"$f":"'Grade Structure'!H13","v":"Midpoint"},{"$f":"'Grade Structure'!I13","v":"End"},{"$f":"'Grade Structure'!J13","v":"Grade"},{"$f":"'Grade Structure'!K13","v":"Range Spread"}]
{"$rows_left_out":38}
{"sheet":"Market Data","index":3,"n_rows":122,"n_cols":77,"rows_kept":122,"cut":false,"hidden":false,"merged":[[6,31,6,33],[6,34,6,36],[6,21,6,23],[6,7,6,9],[6,18,6,20],[6,14,6,16],[6,10,6,12],[6,24,6,26],[6,27,6,30],[28,40,28,43],[6,37,6,38],[6,72,6,76],[6,47,6,51],[6,52,6,56],[6,62,6,66],[6,67,6,71],[11,40,11,44],[6,57,6,61],[7,40,7,44]]}
[null,"Filed:  July 22, 2016, EB-2015-0275, Exhibit I, Tab 1.0, Schedule 10.05, Attachment 2"]
[null,"IESO - Market Pricing",null,null,null,null,null,null,null,null,null,null,null,null,null,null,null,null,null,null,null,null,null,null,null,null,null,null,null,null,null,null,"Hybrid Market - % Weighting"]
[null,null,null,null,null,null,null,null,null,null,null,null,null,null,null,null,null,null,null,null,null,null,null,null,"Public Market",null,null,"Private Market",null,null,null,null,"Public Market",0.5]
[null,null,null,null,null,null,null,null,null,null,null,null,null,null,null,null,null,null,null,null,null,null,null,null,"Percentile",null,null,"Percentile",null,null,null,null,"Private Market",{"$f":"1-AH3","v":0.5}]
[null,null,null,null,null,null,null,null,null,null,null,null,null,null,null,null,null,null,null,null,null,null,null,null,50,null,null,50,null,null,null,null,"Total",{"$f":"SUM(AH3:AH4)","v":1}]
[null,null,null,null,null,null,null,null,null,null,null,null,null,null,null,null,null,null,null,null,null,null,null,null,"*Between 25 to 75",null,null,"*Between 25 to 75",null,null,null,null,null,null,"* Please adjust min-mid-max %'s in cells AQ36 to AS48",null,null,null,null,null,null,null,null,null,null,null,null,15,null,14,null,13,23,null,22,null,21,39,null,38,null,37,15,null,14,null,13,23,null,22,null,21,39,null,38,null,37]
[null,"* Data is in thousands of Canadian dollars",null,null,null,null,null,"Compa Ratio\n(IESO Base Salary / \nMarket Base Salary)",null,null,"Compa Ratio \n(IESO Base Salary / \nMarket Target Total Direct)",null,null,null,"Compa Ratio\n(IESO Midpoint / \nMarket Target Total Cash)",null,null,null,"Compa Ratio\n(IESO Target Total Cash / \nMarket Target Total Cash)",null,null,"Compa Ratio \n(IESO Target Total Cash / \nMarket Target Total Direct)",null,null,{"$f":"\"Public Market - P\"&$Y$5","v":"Public Market - P50"},null,null,{"$f":"\"Private Market - P\"&$AB$5","v":"Private Market - P50"},null,null,null,{"$f":"\"Hybrid Market\n(\"&$AH$3*100&\"% Public / \"&$AH$4*100&\"% Private)\"","v":"Hybrid Market\n(50% Public / 50% Private)"},null,null,"Proposed Structure",null,null,"Implications of Salary Structure on Base Salaries",null,null,null,null,null,null,null,null,null,"Public Market - \nBase Salary",null,null,null,null,"Public Market - \nTarget Total Cash",null,null,null,null,"Public Market - \nTarget Total Direct",null,null,null,null,"Private Market - \nBase Salary",null,null,null,null,"Private Market - \nTarget Total Cash",null,null,null,null,"Public Market - \nTarget Total Direct"]
["IESO Title","Job Evaluation Title","Grade","Pay Grade","Pricing Point","Hay Points","IESO \nBase Salary","Public Market","Private Market","Hybrid Market","Public Market","Private Market","Hybrid Market","IESO \nMidpoint","Public Market","Private Market","Hybrid Market","IESO \nTarget Total Cash","Public Market","Private Market","Hybrid Market","Public Market","Private Market","Hybrid Market","Base Salary","Target Total Cash","Target Total Direct","Base Salary","Target Total Cash","LTI%","Target Total Direct","Base Salary","Target Total Cash","Target Total Direct","Min","Midpoint","Max","Below Min","Above Max",null,"Grade Structure",null,null,null,null,null,"Points","P25",{"$f":"\"P\"&$Y$5","v":"P50"},"P50",{"$f":"\"P\"&$Y$5","v":"P50"},"P75","P25",{"$f":"\"P\"&$Y$5","v":"P50"},"P50",{"$f":"\"P\"&$Y$5","v":"P50"},"P75","P25",{"$f":"\"P\"&$Y$5","v":"P50"},"P50",{"$f":"\"P\"&$Y$5","v":"P50"},"P75","P25",{"$f":"\"P\"&$AB$5","v":"P50"},"P50",{"$f":"\"P\"&$AB$5","v":"P50"},"P75","P25",{"$f":"\"P\"&$AB$5","v":"P50"},"P50",{"$f":"\"P\"&$AB$5","v":"P50"},"P75","P25",{"$f":"\"P\"&$Y$5","v":"P50"},"P50",{"$f":"\"P\"&$Y$5","v":"P50"},"P75"]
[null,"Director, Power Systems Assessments",null,"3H",1119,1192,"","*","*","*","*","*","*",253.3,1.1966740681249115,1.0845178969001541,1.1378388697976327,"","*","*","*","*","*","*",177.98,211.67,212.87,165.88,233.56,0.34717868338557978,291.14999999999998,171.93,222.61500000000001,252.01,214.20849999999999,252.01,315.01249999999999,"","",null,821,1026.5,1232,3,0.5,null,{"$f":"AP20","v":467},{"$f":"HLOOKUP($AU9,public_mkt,AV$6,0)","v":92.34},{"$f":"IF(AND($Y$5>25,$Y$5<50),((AX9-AV9)/25)*($Y$5-25)+AV9,\"*\")","v":"*"},{"$f":"HLOOKUP($AU9,public_mkt,AX$6,0)","v":100.16},{"$f":"IF(AND($Y$5>50,$Y$5<75),((AZ9-AX9)/25)*($Y$5-50)+AX9,\"*\")","v":"*"},{"$f":"HLOOKUP($AU9,public_mkt,AZ$6,0)","v":109.76},94.81,{"$f":"IF(AND($Y$5>25,$Y$5<50),((BC9-BA9)/25)*($Y$5-25)+BA9,\"*\")","v":"*"},{"$f":"HLOOKUP($AU9,public_mkt,BC$6,0)","v":109.36},{"$f":"IF(AND($Y$5>50,$Y$5<75),((BE9-BC9)/25)*($Y$5-50)+BC9,\"*\")","v":"*"},{"$f":"HLOOKUP($AU9,public_mkt,BE$6,0)","v":117.25},94.81,{"$f":"IF(AND($Y$5>25,$Y$5<50),((BH9-BF9)/25)*($Y$5-25)+BF9,\"*\")","v":"*"},{"$f":"HLOOKUP($AU9,public_mkt,BH$6,0)","v":109.36},{"$f":"IF(AND($Y$5>50,$Y$5<75),((BJ9-BH9)/25)*($Y$5-50)+BH9,\"*\")","v":"*"},{"$f":"HLOOKUP($AU9,public_mkt,BJ$6,0)","v":117.25},{"$f":"HLOOKUP($AU9,private_mkt,BK$6,0)","v":69.150000000000006},{"$f":"IF(AND($AB$5>25,$AB$5<50),((BM9-BK9)/25)*($AB$5-25)+BK9,\"*\")","v":"*"},{"$f":"HLOOKUP($AU9,private_mkt,BM$6,0)","v":82.01},{"$f":"IF(AND($AB$5>50,$AB$5<75),((BO9-BM9)/25)*($AB$5-50)+BM9,\"*\")","v":"*"},{"$f":"HLOOKUP($AU9,private_mkt,BO$6,0)","v":96.09},75.14,{"$f":"IF(AND($AB$5>25,$AB$5<50),((BR9-BP9)/25)*($AB$5-25)+BP9,\"*\")","v":"*"},{"$f":"HLOOKUP($AU9,private_mkt,BR$6,0)","v":90.47},{"$f":"IF(AND($AB$5>50,$AB$5<75),((BT9-BR9)/25)*($AB$5-50)+BR9,\"*\")","v":"*"},{"$f":"HLOOKUP($AU9,private_mkt,BT$6,0)","v":109.58},75.14,{"$f":"IF(AND($Y$5>25,$Y$5<50),((BW9-BU9)/25)*($Y$5-25)+BU9,\"*\")","v":"*"},{"$f":"HLOOKUP($AU9,private_mkt,BW$6,0)","v":90.47},{"$f":"IF(AND($Y$5>50,$Y$5<75),((BY9-BW9)/25)*($Y$5-50)+BW9,\"*\")","v":"*"},{"$f":"HLOOKUP($AU9,private_mkt,BY$6,0)","v":111.32}]
[null,"Director, MACD",null,"3H",1119,1096,"","*","*","*","*","*","*",253.3,1.1966740681249115,1.0845178969001541,1.1378388697976327,"","*","*","*","*","*","*",177.98,211.67,212.87,165.88,233.56,0.34717868338557978,291.14999999999998,171.93,222.61500000000001,252.01,214.20849999999999,252.01,315.01249999999999,"","",null,1233,1541.5,1850,2,0.5,null,573,101.43,{"$f":"IF(AND($Y$5>25,$Y$5<50),((AX10-AV10)/25)*($Y$5-25)+AV10,\"*\")","v":"*"},110.5,{"$f":"IF(AND($Y$5>50,$Y$5<75),((AZ10-AX10)/25)*($Y$5-50)+AX10,\"*\")","v":"*"},120.55,109.41,{"$f":"IF(AND($Y$5>25,$Y$5<50),((BC10-BA10)/25)*($Y$5-25)+BA10,\"*\")","v":"*"},121.61,{"$f":"IF(AND($Y$5>50,$Y$5<75),((BE10-BC10)/25)*($Y$5-50)+BC10,\"*\")","v":"*"},132.78,109.41,{"$f":"IF(AND($Y$5>25,$Y$5<50),((BH10-BF10)/25)*($Y$5-25)+BF10,\"*\")","v":"*"},121.61,{"$f":"IF(AND($Y$5>50,$Y$5<75),((BJ10-BH10)/25)*($Y$5-50)+BH10,\"*\")","v":"*"},132.78,82.64,"*",94.68,"*",114.17,91.31,"*",107.94,"*",134.26,91.33,{"$f":"IF(AND($Y$5>25,$Y$5<50),((BW10-BU10)/25)*($Y$5-25)+BU10,\"*\")","v":"*"},108.28,{"$f":"IF(AND($Y$5>50,$Y$5<75),((BY10-BW10)/25)*($Y$5-50)+BW10,\"*\")","v":"*"},136.01]
{"$rows_left_out":113}
{"sheet":"Public_Interp","index":4,"n_rows":163,"n_cols":116,"rows_kept":163,"cut":false,"hidden":true,"merged":[]}
[null,"INTERPOLATION SPREADSHEET - PLEASE INPUT DATA IN RANGE B10 TO X56"]
[]
[]
[null,"IESO"]
[null,2015]
[null,"Total Direct"]
[null,"INPUT",null,null,null,null,null,null,null,null,null,null,null,null,null,null,null,null,null,null,null,null,null,null,null,null,null,null,null,null,null,null,"SLOPE",null,null,null,null,{"$f":"\" \"&$B$4&\"             \"&$B$5","v":{"$error":"#VALUE!"}},null,null,null,null,null,null,null,null,null,null,null,null,null,null,null,null,null,null,null,null,null,null,null,null,null,"INTERCEPT",null,null,null,null,{"$f":"\" \"&$B$4&\"             \"&$B$5","v":{"$error":"#VALUE!"}},null,null,null,null,null,null,null,null,null,null,null,null,null,null,null,null,null,null,null,null,null,null,null,null,null,"OUTPUT",{"$f":"\" \"&$B$4&\"             \"&$B$5","v":{"$error":"#VALUE!"}}]
[null,null,null,null,null,null,null,null,null,null,null,null,null,null,null,null,null,null,null,null,null,null,null,null,null,null,null,null,null,null,null,null,null,null,null,null,null,null,null,null,null,null,null,null,null,null,null,null,null,null,null,null,null,null,null,null,null,null,null,null,null,null,null,null,null,null,null,null,null,null,null,null,null,null,null,null,null,null,null,null,null,null,null,null,null,null,null,null,null,null,null,null,null,null,"Total Pts",{"$f":"'Grade Structure'!$H14","v":136},{"$f":"'Grade Structure'!$H15","v":167},{"$f":"'Grade Structure'!$H16","v":206},{"$f":"'Grade Structure'!$H17","v":253},{"$f":"'Grade Structure'!$H18","v":310},{"$f":"'Grade Structure'!$H19","v":381},{"$f":"'Grade Structure'!$H20","v":467},{"$f":"'Grade Structure'!$H21","v":573},{"$f":"'Grade Structure'!$H22","v":726},{"$f":"'Grade Structure'!$H23","v":913},{"$f":"'Grade Structure'!$H24","v":1119},{"$f":"'Grade Structure'!$H25","v":1372},{"$f":"'Grade Structure'!$H26","v":1681},0,0,0,0,0,0,0,0]
[null,null,null,null,null,null,null,null,null,null,null,null,null,null,null,null,null,null,null,null,null,null,null,null,null,null,null,null,null,null,null,null,"S POINTS",{"$f":"C10","v":78},{"$f":"AH$10+1","v":92},{"$f":"AI$10+1","v":106},125,148,177,210,249,292,343,405,479,567,675,808,968,1159,1385,1655,1971,2346,2786,3301,3916,4656,5541,{"$f":"BF$10+1","v":5541},{"$f":"BH$10+1","v":7741},{"$f":"BI$10+1","v":8981},null,"S POINTS",{"$f":"C10","v":78},{"$f":"BM$10+1","v":92},{"$f":"BN$10+1","v":106},125,148,177,210,249,292,343,405,479,567,675,808,968,1159,1385,1655,1971,2346,2786,3301,3916,4656,{"$f":"CK$10+1","v":5541},6591,8981,null,null,"S-Correlation",1,null,"Aged",0,null,"Round",2]
[null,null,78,91,105,124,147,176,209,248,291,342,404,478,566,674,807,967,1158,1384,1654,1970,2345,2785,3300,3915,4655,5540,6590,7740,8980,null,null,{"$f":"D$10","v":91},105,124,147,176,209,248,291,342,404,478,566,674,807,967,1158,1384,1654,1970,2345,2785,3300,3915,4655,5540,6590,7740,8980,null,null,null,{"$f":"D$10","v":91},105,124,147,176,209,248,291,342,404,478,566,674,807,967,1158,1384,1654,1970,2345,2785,3300,3915,4655,5540,6590,{"$f":"AE$10","v":8980},null,null,1,"S-Pts",{"$f":"CR8","v":136},{"$f":"CS8","v":167},206,253,310,381,467,573,726,913,1119,1372,1681,0,0,0,0,0,0,0,0]
{"$rows_left_out":154}
{"sheet":"Private_Interp","index":5,"n_rows":163,"n_cols":116,"rows_kept":163,"cut":false,"hidden":true,"merged":[]}
[null,"INTERPOLATION SPREADSHEET - PLEASE INPUT DATA IN RANGE B10 TO X56"]
[]
[]
[null,"IESO"]
[null,2015]
[null,"Total Direct"]
[null,"INPUT",null,null,null,null,null,null,null,null,null,null,null,null,null,null,null,null,null,null,null,null,null,null,null,null,null,null,null,null,null,null,"SLOPE",null,null,null,null,{"$f":"\" \"&$B$4&\"             \"&$B$5","v":{"$error":"#VALUE!"}},null,null,null,null,null,null,null,null,null,null,null,null,null,null,null,null,null,null,null,null,null,null,null,null,null,"INTERCEPT",null,null,null,null,{"$f":"\" \"&$B$4&\"             \"&$B$5","v":{"$error":"#VALUE!"}},null,null,null,null,null,null,null,null,null,null,null,null,null,null,null,null,null,null,null,null,null,null,null,null,null,"OUTPUT",{"$f":"\" \"&$B$4&\"             \"&$B$5","v":{"$error":"#VALUE!"}}]
[null,null,null,null,null,null,null,null,null,null,null,null,null,null,null,null,null,null,null,null,null,null,null,null,null,null,null,null,null,null,null,null,null,null,null,null,null,null,null,null,null,null,null,null,null,null,null,null,null,null,null,null,null,null,null,null,null,null,null,null,null,null,null,null,null,null,null,null,null,null,null,null,null,null,null,null,null,null,null,null,null,null,null,null,null,null,null,null,null,null,null,null,null,null,"Total Pts",{"$f":"Public_Interp!CR8","v":136},{"$f":"Public_Interp!CS8","v":167},{"$f":"Public_Interp!CT8","v":206},{"$f":"Public_Interp!CU8","v":253},{"$f":"Public_Interp!CV8","v":310},{"$f":"Public_Interp!CW8","v":381},{"$f":"Public_Interp!CX8","v":467},{"$f":"Public_Interp!CY8","v":573},{"$f":"Public_Interp!CZ8","v":726},{"$f":"Public_Interp!DA8","v":913},{"$f":"Public_Interp!DB8","v":1119},{"$f":"Public_Interp!DC8","v":1372},{"$f":"Public_Interp!DD8","v":1681},{"$f":"Public_Interp!DE8","v":0},{"$f":"Public_Interp!DF8","v":0},{"$f":"Public_Interp!DG8","v":0},{"$f":"Public_Interp!DH8","v":0},{"$f":"Public_Interp!DI8","v":0},{"$f":"Public_Interp!DJ8","v":0},{"$f":"Public_Interp!DK8","v":0},{"$f":"Public_Interp!DL8","v":0}]
[null,null,null,null,null,null,null,null,null,null,null,null,null,null,null,null,null,null,null,null,null,null,null,null,null,null,null,null,null,null,null,null,"S POINTS",{"$f":"C10","v":78},{"$f":"AH$10+1","v":92},{"$f":"AI$10+1","v":106},125,148,177,210,249,292,343,405,479,567,675,808,968,1159,1385,1655,1971,2346,2786,3301,3916,4656,5541,{"$f":"BF$10+1","v":5541},{"$f":"BH$10+1","v":7741},{"$f":"BI$10+1","v":8981},null,"S POINTS",{"$f":"C10","v":78},{"$f":"BM$10+1","v":92},{"$f":"BN$10+1","v":106},125,148,177,210,249,292,343,405,479,567,675,808,968,1159,1385,1655,1971,2346,2786,3301,3916,4656,{"$f":"CK$10+1","v":5541},6591,8981,null,null,"S-Correlation",1,null,"Aged",0,null,"Round",2]
[null,null,78,91,105,124,147,176,209,248,291,342,404,478,566,674,807,967,1158,1384,1654,1970,2345,2785,3300,3915,4655,5540,6590,7740,8980,null,null,{"$f":"D$10","v":91},105,124,147,176,209,248,291,342,404,478,566,674,807,967,1158,1384,1654,1970,2345,2785,3300,3915,4655,5540,6590,7740,8980,null,null,null,{"$f":"D$10","v":91},105,124,147,176,209,248,291,342,404,478,566,674,807,967,1158,1384,1654,1970,2345,2785,3300,3915,4655,5540,6590,{"$f":"AE$10","v":8980},null,null,1,"S-Pts",{"$f":"CR8","v":136},{"$f":"CS8","v":167},206,253,310,381,467,573,726,913,1119,1372,1681,0,0,0,0,0,0,0,0]
{"$rows_left_out":154}
{"sheet":"Participant List","index":6,"n_rows":18,"n_cols":3,"rows_kept":18,"cut":false,"hidden":false,"merged":[[0,0,0,1]]}
["Participant List",null,"2014-12-01"]
[null," "]
[null,"Selected Private Organizatiosn (N=15)","Selected Public Organizations (N=15)"]
[null,"Bruce Power L.P.","Business Development Bank of Canada"]
[null,"CIBC","CPP Investment Board"]
[null,"Capgemini Canada","Enersource Hydro Mississauga Inc"]
[null,"Enbridge Inc.","Horizon Utilities Corporation"]
[null,"Fortis Inc.","Hydro One Inc."]
[null,"Manulife Financial","Hydro Ottawa Limited"]
[null,"Navtech Systems Support Inc.","Metrolinx"]
{"$rows_left_out":9}
{"sheet":"Client Data","index":7,"n_rows":92,"n_cols":20,"rows_kept":92,"cut":false,"hidden":true,"merged":[]}
["Emp #","PERSON Last Name","PERSON First Name","STATUS Status Code","Grade / Band","UNION Union Code","Former","STATUS Original Hire Date","Hay Points","JOB Business Card Title","Job Evaluation Title","PAY Base Pay Amount","STI","Other Pay","Manages","LOCATION Department Desc","LOCATION Division Desc","LOCATION Supervisor","BHrs","Gender"]
[338,"Kanagarajan","Jessei","ACT","4M","MGMT","OPA","2009-06-29",{"$f":"IFERROR(VLOOKUP($K2,'Grade Structure'!$A$4:$B$79,2,0),\"\")","v":""},"Data & Reporting Manager",null,91000,null,null,"Yes","Conservation & Corporate Relations","Program Delivery & Partner Services","Sparkes, Katherine",null,"F"]
[143,"Farmer","Charles","ACT","3M","MGMT","OPA","2006-09-18",{"$f":"IFERROR(VLOOKUP($K3,'Grade Structure'!$A$4:$B$79,2,0),\"\")","v":""},"Director Conservation Integration",null,193429,null,null,"Yes","Planning, Law & Aboriginal Relations","Conservation Integration","Lyle, Michael",null,"M"]
[625,"Rouse","Stephen","ACT","3M","MGMT","OPA","2013-05-27",{"$f":"IFERROR(VLOOKUP($K4,'Grade Structure'!$A$4:$B$79,2,0),\"\")","v":""},"Director, Marketing",null,195000,null,null,"Yes","Conservation & Corporate Relations","Marketing","Young, Terry",null,"M"]
[262745,"WILSON","MARK","A","03","MGT","IESO","1980-07-03",{"$f":"IFERROR(VLOOKUP($K5,'Grade Structure'!$A$4:$B$79,2,0),\"\")","v":""},"Director-Planning & Assessment",null,221697.84,null,null,"Yes","OPS",null,null,70,"M"]
[998187,"MCDONALD","GLENN","A","03","MGT","IESO","2008-05-05",{"$f":"IFERROR(VLOOKUP($K6,'Grade Structure'!$A$4:$B$79,2,0),\"\")","v":""},"Dir-Mrkt Assmt & Cmp",null,223936.18,null,null,"Yes","MAC",null,null,70,"M"]
[998888,"CHAPMAN","TOM","A","04","MGT","IESO","2013-12-02",{"$f":"IFERROR(VLOOKUP($K7,'Grade Structure'!$A$4:$B$79,2,0),\"\")","v":""},"Manager - Economics",null,160000.1,null,null,"Yes","M&F",null,null,70,"M"]
[31,"Marconi","Nancy","ACT","4H","MGMT","OPA","2005-07-25",{"$f":"IFERROR(VLOOKUP($K8,'Grade Structure'!$A$4:$B$79,2,0),\"\")","v":""},"Manager Regulatory Proceedings",null,115842,null,null,"Yes","Planning, Law & Aboriginal Relations","Regulatory Affairs","Lyle, Michael",null,"F"]
[346,"Cecchini","Perry","ACT","4H","MGMT","OPA","2009-09-08",{"$f":"IFERROR(VLOOKUP($K9,'Grade Structure'!$A$4:$B$79,2,0),\"\")","v":588},"Manager RESOP/FIT","Manager, RESOP/FIT",130047,null,null,"Yes","Market & Resource Development","Contract Management","Killeavy, Michael",null,"M"]
[35,"von Bertoldi","Viviana","ACT","4H","MGMT","OPA","2005-08-08",{"$f":"IFERROR(VLOOKUP($K10,'Grade Structure'!$A$4:$B$79,2,0),\"\")","v":588},"Manager, FIT & microFIT","Manager, FIT & microFIT",107100,null,null,"Yes","Market & Resource Development","Contract Management","Killeavy, Michael",null,"F"]
{"$rows_left_out":83}
{"sheet":"Job Matrix (blank)","index":8,"n_rows":47,"n_cols":8,"rows_kept":47,"cut":false,"hidden":true,"merged":[[4,0,4,7],[6,0,7,0],[6,1,7,1],[6,2,7,2],[6,3,7,3],[6,4,7,4],[6,6,7,6],[6,7,7,7],[9,0,10,0],[9,4,10,4],[13,0,15,0],[13,2,15,2],[13,5,15,5],[13,7,15,7],[16,0,22,0],[16,1,22,1],[16,2,22,2],[16,3,22,3],[16,4,22,4],[16,6,22,6],[16,7,18,7],[20,7,22,7],[13,6,15,6],[23,7,24,7],[25,0,26,0],[27,0,29,0],[27,2,29,2],[27,3,29,3],[27,4,29,4],[27,5,29,5],[27,6,29,6],[27,7,29,7],[23,0,24,0],[23,1,24,1],[23,3,24,3],[23,4,24,4],[23,5,24,5],[23,6,24,6],[30,7,31,7],[34,0,38,0],[34,2,38,2],[34,3,38,3],[34,5,38,5],[34,6,38,6],[34,7,38,7],[30,0,31,0],[30,1,31,1],[30,2,31,2],[30,4,31,4],[30,5,31,5],[30,6,31,6],[45,7,46,7],[39,0,41,0],[39,1,41,1],[39,3,41,3],[39,4,41,4],[39,6,41,6],[42,0,44,0],[42,2,44,2],[42,3,44,3],[42,4,44,4],[42,5,44,5],[42,6,44,6],[45,0,46,0],[45,3,46,3],[45,5,46,5],[45,6,46,6]]}
[]
[]
[]
[]
["Job Ranking Matrix"]
["Evaluation Points","Corporate Services","Information & Technology Services","Planning, Law & Aboriginal Relations","Market & Resource Development","Market & Systems Operations","CEO","Conservation & Corporate Relations"]
[1192,null,null,null,null,"Director, Market Operations"]
[null,null,null,null,null,"Director, Power Systems Assessments"]
[1096,null,null,null,null,null,"Director, MACD"]
[994,"Director, Human Resources\r",null,null,"Director, Contract Management"]
{"$rows_left_out":37}