{"text_format":"1","workbook":"xlsx","n_sheets":10,"sheets":["1. Info","2. Table of Contents","3. Rate Classes","4. RRR Data","5. UTRs and Sub-Transmission","6. Historical Wholesale","7. Current Wholesale","8. Forecast Wholesale","9. RTSR Rates to Forecast","hidden1"],"not_rendered":{"charts":0,"images":3,"macros":1,"external_links":2,"defined_names":20,"comments":0,"pivot_tables":0},"unopened":[],"bounds":{"document_bytes":16777216,"sheet_cells":100000,"rows_first":2000,"rows_last":500,"rows_between":2000,"halvings":0,"cell_chars":16384,"cell_head_chars":4096},"cells_cut":0,"cells_raw":0,"read":"whole","date_system":"1900"}

{"sheet":"1. Info","index":0,"n_rows":74,"n_cols":28,"rows_kept":74,"cut":false,"hidden":false,"merged":[[24,3,24,4],[20,3,20,4],[1,2,1,9],[2,2,2,9],[3,2,3,9],[4,2,4,9],[14,3,14,4],[16,3,16,4]]}
[null,null,null,null,null,null,null,null,null,null,null,null,null,null,null,null,null,null,null,null,null,null,null,null,null,null,null,"Algoma Power Inc."]
[null,null,null,null,null,null,null,null,null,null,null,null,null,null,null,null,null,null,null,null,null,null,null,null,null,null,null,"Atikokan Hydro Inc."]
[null,null,null,null,null,null,null,null,null,null,null,null,null,null,null,null,null,null,null,null,null,null,null,null,null,null,null,"Attawapiskat Power Corporation"]
[null,null,null,null,null,null,null,null,null,null,null,null,null,null,null,null,null,null,null,null,null,null,null,null,null,null,null,"Bluewater Power Distribution Corporation"]
[null,null,null,null,null,null,null,null,null,null,null,null,null,null,null,null,null,null,null,null,null,null,null,null,null,null,null,"Brantford Power Inc."]
[null,null,null,null,null,null,null,null,null,null,null,null,null,null,null,null,null,null,null,null,null,null,null,null,null,null,null,"Burlington Hydro Inc."]
[null,null,null,null,null,null,null,null,null,null,null,null,null,null,null,null,null,null,null,null,null,null,null,null,null,null,null,"Canadian Niagara Power Inc."]
[null,null,null,null,null,null,null,null,null,null,null,null,null,null,null,null,null,null,null,null,null,null,null,null,null,null,null,"Centre Wellington Hydro Ltd."]
[null,null,null,null,null,null,null,null,null,null,null,null,null,null,null,null,null,null,null,null,null,null,null,null,null,null,null,"Chapleau Public Utilities Corporation"]
[null,null,null,null,null,null,null,null,null,null,null,null,null,null,null,null,null,null,null,null,null,null,null,null,null,null,null,"COLLUS PowerStream Corp."]
[null,null,null,null,null,null,null,null,null,null,null,null,null,null,null,null,null,null,null,null,null,null,null,null,null,null,null,"Cooperative Hydro Embrun Inc."]
[null,null,null,null,null,null,null,null,null,null,null,null,null,null,null,null,null,null,null,null,null,null,null,null,null,null,null,"E.L.K. Energy Inc."]
["Drop-down lists are shaded blue; Input cells are shaded green.",null,null,null,null,null,null,null,null,null,null,null,null,null,null,null,null,null,null,null,null,null,null,null,null,null,null,"Energy + Inc."]
[null,null,null,null,null,null,null,null,null,null,null,null,null,null,null,null,null,null,null,null,null,null,null,null,null,null,null,"Enersource Hydro Mississauga Inc."]
[null,null,"Utility Name   ","Kingston Hydro Corporation",null,null,null,null,null,null,null,null,null,null,null,null,null,null,null,null,null,null,null,null,null,null,null,"Entegrus Powerlines Inc."]
[null,null,null,null,null,null,null,null,null,null,null,null,null,null,null,null,null,null,null,null,null,null,null,null,null,null,null,"EnWin Utilities Ltd."]
[null,null,"Service Territory","Kingston, ON",null,null,null,null,null,null,null,null,null,null,null,null,null,null,null,null,null,null,null,null,null,null,null,"Erie Thames Powerlines Corporation"]
[null,null,null,null,null,null,null,null,null,null,null,null,null,null,null,null,null,null,null,null,null,null,null,null,null,null,null,"Espanola Regional Hydro Distribution Corporation"]
[null,null,"Assigned EB Number","EB-2016-0087",null,null,null,null,null,null,null,null,null,null,null,null,null,null,null,null,null,null,null,null,null,null,null,"Essex Powerlines Corporation"]
[null,null,null,null,null,null,null,null,null,null,null,null,null,null,null,null,null,null,null,null,null,null,null,null,null,null,null,"Festival Hydro Inc."]
[null,null,"Name and Title","Sherry Gibson, Senior Advisor Rates & Regulatory Affairs",null,null,null,null,null,null,null,null,null,null,null,null,null,null,null,null,null,null,null,null,null,null,null,"Fort Albany Power Corporation"]
[null,null,null,null,null,null,null,null,null,null,null,null,null,null,null,null,null,null,null,null,null,null,null,null,null,null,null,"Fort Frances Power Corporation"]
[null,null,"Phone Number","613-546-1181 ext 2383",null,null,null,null,null,null,null,null,null,null,null,null,null,null,null,null,null,null,null,null,null,null,null,"Greater Sudbury Hydro Inc."]
[null,null,null,null,null,null,null,null,null,null,null,null,null,null,null,null,null,null,null,null,null,null,null,null,null,null,null,"Grimsby Power Inc."]
[null,null,"Email Address","sgibson@kingstonhydro.com",null,null,null,null,null,null,null,null,null,null,null,null,null,null,null,null,null,null,null,null,null,null,null,"Guelph Hydro Electric Systems Inc."]
[null,null,null,null,null,null,null,null,null,null,null,null,null,null,null,null,null,null,null,null,null,null,null,null,null,null,null,"Haldimand County Hydro Inc."]
[null,null,"Date","2016-Aug-15, Last Re-based Year: 2016",null,null,null,null,null,null,null,null,null,null,null,null,null,null,null,null,null,null,null,null,null,null,null,"Halton Hills Hydro Inc."]
[null,null,null,null,null,null,null,null,null,null,null,null,null,null,null,null,null,null,null,null,null,null,null,null,null,null,null,"Hearst Power Distribution Company Limited"]
[null,null,"Last COS Re-based Year",null,null,null,null,null,null,null,null,null,null,null,null,null,null,null,null,null,null,null,null,null,null,null,null,"Horizon Utilities Corporation"]
[null,null,null,null,null,null,null,null,null,null,null,null,null,null,null,null,null,null,null,null,null,null,null,null,null,null,null,"Hydro 2000 Inc."]
{"$rows_left_out":45}
{"sheet":"2. Table of Contents","index":1,"n_rows":28,"n_cols":9,"rows_kept":28,"cut":false,"hidden":false,"merged":[]}
[]
[]
[]
[]
[]
[]
[]
[]
[]
[]
[]
[]
[]
[]
[]
[]
[]
[]
[]
[null,null,null,"1. Info",null,null,null,null,"6. Historical Wholesale"]
[]
[null,null,null,"2. Table of Contents",null,null,null,null,"7. Current Wholesale"]
[]
[null,null,null,"3. Rate Classes",null,null,null,null,"8. Forecast Wholesale"]
[]
[null,null,null,"4. RRR Data",null,null,null,null,"9. RTSR Rates to Forecast"]
[]
[null,null,null,"5. UTRs and Sub-Transmission"]

{"sheet":"3. Rate Classes","index":2,"n_rows":100,"n_cols":23,"rows_kept":100,"cut":false,"hidden":false,"merged":[[12,2,12,8]]}
[]
[]
[]
[]
[]
[]
[]
[]
[]
[]
[]
[]
[null,null,"1.  Select the appropriate rate classes that appear on your most recent Board-Approved Tariff of Rates and Charges.\n2.  Enter the RTS Network and Connection Rate as it appears on the Tariff of Rates and Charges"]
[]
[null,null,"Rate Class",null,"Unit",null,"RTSR-Network",null,"RTSR-Connection"]
[]
[null,null,"Residential",null,"kWh",null,7.1000000000000004E-3,null,5.5999999999999999E-3,null,null,{"$f":"IF(OR(ISBLANK(C17), ISERROR(FIND(\"Choose\", C17))=FALSE), 0, 1)","v":1},{"$f":"\"C\" & ROW(C17)","v":"C17"},{"$f":"IF(OR(C17=\"General Service Intermediate Rate Class 1,000 To 4,999 kW (formerly General Service > 50 kW Customers)\", C17=\"General Service Intermediate Rate Class 1,000 To 4,999 kW (formerly Large Use Customers)\"), \"x\", \"\")","v":""},null,null,null,null,null,null,null,null,"Choose Rate Class"]
[null,null,"General Service Less Than 50 kW",null,"kWh",null,6.3E-3,null,5.1000000000000004E-3,null,null,1,"C18",{"$f":"IF(OR(C18=\"General Service Intermediate Rate Class 1,000 To 4,999 kW (formerly General Service > 50 kW Customers)\", C18=\"General Service Intermediate Rate Class 1,000 To 4,999 kW (formerly Large Use Customers)\"), \"x\", \"\")","v":""},null,null,null,null,null,null,null,null,"Residential"]
[null,null,"General Service 50 to 4,999 kW",null,"kW",null,2.7797000000000001,null,2.2225000000000001,null,null,1,"C19","",null,null,null,null,null,null,null,null,"Residential Regular"]
[null,null,"Large Use",null,"kW",null,3.3492000000000002,null,2.6779999999999999,null,null,1,"C20","",null,null,null,null,null,null,null,null,"Residential Urban"]
[null,null,"Unmetered Scattered Load",null,"kWh",null,7.1000000000000004E-3,null,5.5999999999999999E-3,null,null,1,"C21","",null,null,null,null,null,null,null,null,"Residential Urban Year-Round"]
[null,null,"Street Lighting",null,"kW",null,2.0078,null,1.6052999999999999,null,null,1,"C22","",null,null,null,null,null,null,null,null,"Residential Suburban"]
[null,null,"Standby Power",null,"kW",null,null,null,null,null,null,1,"C23","",null,null,null,null,null,null,null,null,"Residential Suburban Seasonal"]
[null,null,"Choose Rate Class",null,null,null,null,null,null,null,null,0,"C24","",null,null,null,null,null,null,null,null,"Residential Suburban Year Round"]
[null,null,"Choose Rate Class",null,null,null,null,null,null,null,null,0,"C25","",null,null,null,null,null,null,null,null,"Residential - Time of Use"]
[null,null,"Choose Rate Class",null,null,null,null,null,null,null,null,0,"C26","",null,null,null,null,null,null,null,null,"Residential - Hensall"]
[null,null,"Choose Rate Class",null,null,null,null,null,null,null,null,0,"C27","",null,null,null,null,null,null,null,null,"Residential – High Density [R1]"]
[null,null,"Choose Rate Class",null,null,null,null,null,null,null,null,0,"C28","",null,null,null,null,null,null,null,null,"Residential – Normal Density [R2]"]
[null,null,"Choose Rate Class",null,null,null,null,null,null,null,null,0,"C29","",null,null,null,null,null,null,null,null,"Seasonal Residential – High Density [R3]"]
[null,null,"Choose Rate Class",null,null,null,null,null,null,null,null,0,"C30","",null,null,null,null,null,null,null,null,"Seasonal Residential – Normal Density [R4]"]
{"$rows_left_out":71}
{"sheet":"4. RRR Data","index":3,"n_rows":30,"n_cols":9,"rows_kept":30,"cut":false,"hidden":false,"merged":[[12,1,12,8]]}
[]
[]
[]
[]
[]
[]
[]
[]
[]
[]
[]
[]
[]
[]
[null,"Rate Class","Rate Description","Unit","Rate","Non-Loss Adjusted Metered kWh","Non-Loss Adjusted Metered kW","Applicable \nLoss Factor\neg: (1.0325)","Loss Adjusted Billed kWh"]
[]
[null,"Residential","RTSR - Network","kWh",7.1000000000000004E-3,183596949.80000001,0,1.0344,{"$f":"F17*H17","v":189912684.87312001}]
[null,"Residential","RTSR - Connection","kWh",5.5999999999999999E-3,183596949.80000001,0,1.0344,{"$f":"F18*H18","v":189912684.87312001}]
[null,"General Service Less Than 50 kW","RTSR - Network","kWh",6.3E-3,89066220.099999994,0,1.0344,{"$f":"F19*H19","v":92130098.071439996}]
[null,"General Service Less Than 50 kW","RTSR - Connection","kWh",5.1000000000000004E-3,89066220.099999994,0,1.0344,{"$f":"F20*H20","v":92130098.071439996}]
[null,"General Service 50 to 4,999 kW","RTSR - Network","kW",2.7797000000000001,272266412.69999999,735399.97]
[null,"General Service 50 to 4,999 kW","RTSR - Connection","kW",2.2225000000000001,272226412.69999999,735399.97]
[null,"Large Use","RTSR - Network","kW",3.3492000000000002,151275662.59999999,280183]
[null,"Large Use","RTSR - Connection","kW",2.6779999999999999,151275662.59999999,280183]
[null,"Unmetered Scattered Load","RTSR - Network","kWh",7.1000000000000004E-3,1185727.1000000001,0,1.0344,{"$f":"F25*H25","v":1226516.1122400002}]
[null,"Unmetered Scattered Load","RTSR - Connection","kWh",5.5999999999999999E-3,1185727.1000000001,0,1.0344,{"$f":"F26*H26","v":1226516.1122400002}]
[null,"Street Lighting","RTSR - Network","kW",2.0078,1626159.9,4084]
[null,"Street Lighting","RTSR - Connection","kW",1.6052999999999999,1626159.9,4084]
[null,"Standby Power","RTSR - Network","kW"]
[null,"Standby Power","RTSR - Connection","kW"]
{"$rows_left_out":1}
{"sheet":"5. UTRs and Sub-Transmission","index":4,"n_rows":75,"n_cols":10,"rows_kept":75,"cut":false,"hidden":false,"merged":[[28,4,28,5],[17,4,17,5],[33,4,33,5],[19,4,19,5],[21,4,21,5],[23,4,23,5],[25,4,25,5],[69,4,69,5],[71,4,71,5],[74,4,74,5],[73,4,73,5],[50,4,50,5],[52,4,52,5],[54,4,54,5],[56,4,56,5],[65,4,65,5],[67,4,67,5]]}
[]
[]
[]
[]
[]
[]
[]
[]
[]
[]
[]
[]
[]
[]
[]
[]
[]
[null,"Uniform Transmission Rates","Unit",null,2015,null,null,2016,null,2017]
[]
[null,"Rate Description",null,null,"Rate",null,null,"Rate",null,"Rate"]
[]
[null,"Network Service Rate","kW",null,3.78,null,null,3.66,null,3.66]
[]
[null,"Line Connection Service Rate","kW",null,0.86,null,null,0.87,null,0.87]
[]
[null,"Transformation Connection Service Rate","kW",null,2,null,null,2.02,null,2.02]
[]
[]
[null,"Hydro One Sub-Transmission Rates","Unit",null,"2015 - 2016",null,null,2016,null,2017]
[null,null,null,null,"Jan - April 2015","May 2015 - Jan 2016",null,"Feb - Dec 2016"]
{"$rows_left_out":46}
{"sheet":"6. Historical Wholesale","index":5,"n_rows":117,"n_cols":16,"rows_kept":117,"cut":false,"hidden":false,"merged":[[95,7,95,9],[95,11,95,13],[96,7,96,9],[96,11,96,13],[20,3,20,5],[20,7,20,9],[20,11,20,13],[96,3,96,5],[38,3,38,5],[38,7,38,9],[38,11,38,13],[95,3,95,5],[57,3,57,5],[57,7,57,9],[57,11,57,13],[76,3,76,5],[76,7,76,9],[76,11,76,13]]}
[]
[]
[]
[]
[]
[]
[]
[]
[]
[]
[]
[]
[]
[]
[]
[]
[]
[]
[]
[]
[null,"IESO",null,"Network",null,null,null,"Line Connection",null,null,null,"Transformation Connection",null,null,null,"Total Line"]
[null,"Month",null,"Units Billed","Rate","Amount",null,"Units Billed","Rate","Amount",null,"Units Billed","Rate","Amount",null,"Amount"]
[]
[null,"January",null,54252,{"$f":"IF(D24<>0,F24/D24,0)","v":3.78},205072.56,null,46813.418604651168,{"$f":"IF(H24<>0,J24/H24,0)","v":0.85999999999999988},40259.54,null,48606.03,{"$f":"IF(L24<>0,N24/L24,0)","v":2},97212.06,null,{"$f":"J24+N24","v":137471.6}]
[null,"February",null,54217.000000000007,{"$f":"IF(D25<>0,F25/D25,0)","v":3.78},204940.26,null,57391,{"$f":"IF(H25<>0,J25/H25,0)","v":0.86},49356.26,null,57391,{"$f":"IF(L25<>0,N25/L25,0)","v":2},114782,null,164138.26]
[null,"March",null,54036,3.78,204256.08,null,63785,0.86,54855.1,null,63785,2,127570,null,182425.1]
[null,"April",null,39120,3.7800000000000002,147873.60000000001,null,55395,0.86,47639.7,null,55395,2,110790,null,158429.70000000001]
[null,"May",null,53359,3.78,201697.02,null,46837.267441860466,0.8600000000000001,40280.050000000003,null,46868.415000000001,2,93736.83,null,134016.88]
[null,"June",null,43870.000000000007,3.7799999999999994,165828.6,null,62090,0.86,53397.4,null,62090,2,124180,null,177577.4]
[null,"July",null,41790.000000000007,3.78,157966.20000000001,null,51612,0.86,44386.32,null,51612,2,103224,null,147610.32]
{"$rows_left_out":88}
{"sheet":"7. Current Wholesale","index":6,"n_rows":117,"n_cols":16,"rows_kept":117,"cut":false,"hidden":false,"merged":[[12,1,12,11],[19,3,19,5],[19,7,19,9],[19,11,19,13],[38,3,38,5],[38,7,38,9],[38,11,38,13],[96,7,96,9],[96,11,96,13],[20,3,20,5],[20,7,20,9],[20,11,20,13],[96,3,96,5],[95,3,95,5],[95,7,95,9],[95,11,95,13],[57,3,57,5],[57,7,57,9],[57,11,57,13],[76,3,76,5],[76,7,76,9],[76,11,76,13]]}
[]
[]
[]
[]
[]
[]
[]
[]
[]
[]
[]
[]
[null,"The purpose of this sheet is to calculate the expected billing when current 2016 Uniform Transmission Rates are applied against historical 2015 transmission units."]
[]
[]
[]
[]
[]
[]
[null,"IESO",null,"Network",null,null,null,"Line Connection",null,null,null,"Transformation Connection",null,null,null,"Total Line"]
[]
[null,"Month",null,"Units Billed","Rate","Amount",null,"Units Billed","Rate","Amount",null,"Units Billed","Rate","Amount",null,"Amount"]
[]
[null,"January",null,{"$f":"'6. Historical Wholesale'!D24","v":54252},{"$f":"'5. UTRs and Sub-Transmission'!H22","v":3.66},{"$f":"D24*E24","v":198562.32},null,{"$f":"'6. Historical Wholesale'!H24","v":46813.418604651168},{"$f":"'5. UTRs and Sub-Transmission'!H24","v":0.87},{"$f":"H24*I24","v":40727.674186046519},null,{"$f":"'6. Historical Wholesale'!L24","v":48606.03},{"$f":"'5. UTRs and Sub-Transmission'!H26","v":2.02},{"$f":"L24*M24","v":98184.180599999992},null,{"$f":"J24+N24","v":138911.85478604652}]
[null,"February",null,{"$f":"'6. Historical Wholesale'!D25","v":54217.000000000007},{"$f":"E24","v":3.66},{"$f":"D25*E25","v":198434.22000000003},null,{"$f":"'6. Historical Wholesale'!H25","v":57391},{"$f":"I24","v":0.87},{"$f":"H25*I25","v":49930.17},null,{"$f":"'6. Historical Wholesale'!L25","v":57391},{"$f":"M24","v":2.02},{"$f":"L25*M25","v":115929.82},null,165859.99]
[null,"March",null,{"$f":"'6. Historical Wholesale'!D26","v":54036},{"$f":"E25","v":3.66},197771.76,null,{"$f":"'6. Historical Wholesale'!H26","v":63785},{"$f":"I25","v":0.87},55492.95,null,{"$f":"'6. Historical Wholesale'!L26","v":63785},{"$f":"M25","v":2.02},128845.7,null,184338.65]
[null,"April",null,{"$f":"'6. Historical Wholesale'!D27","v":39120},3.66,143179.20000000001,null,{"$f":"'6. Historical Wholesale'!H27","v":55395},0.87,48193.65,null,{"$f":"'6. Historical Wholesale'!L27","v":55395},2.02,111897.9,null,160091.54999999999]
[null,"May",null,{"$f":"'6. Historical Wholesale'!D28","v":53359},3.66,195293.94,null,{"$f":"'6. Historical Wholesale'!H28","v":46837.267441860466},0.87,40748.422674418602,null,{"$f":"'6. Historical Wholesale'!L28","v":46868.415000000001},2.02,94674.198300000004,null,135422.62097441859]
[null,"June",null,{"$f":"'6. Historical Wholesale'!D29","v":43870.000000000007},3.66,160564.20000000004,null,{"$f":"'6. Historical Wholesale'!H29","v":62090},0.87,54018.3,null,{"$f":"'6. Historical Wholesale'!L29","v":62090},2.02,125421.8,null,179440.1]
[null,"July",null,{"$f":"'6. Historical Wholesale'!D30","v":41790.000000000007},3.66,152951.40000000002,null,{"$f":"'6. Historical Wholesale'!H30","v":51612},0.87,44902.44,null,{"$f":"'6. Historical Wholesale'!L30","v":51612},2.02,104256.24,null,149158.68]
{"$rows_left_out":88}
{"sheet":"8. Forecast Wholesale","index":7,"n_rows":117,"n_cols":16,"rows_kept":117,"cut":false,"hidden":false,"merged":[[12,1,12,12],[19,3,19,5],[19,7,19,9],[19,11,19,13],[38,3,38,5],[38,7,38,9],[38,11,38,13],[96,7,96,9],[96,11,96,13],[20,3,20,5],[20,7,20,9],[20,11,20,13],[96,3,96,5],[95,3,95,5],[95,7,95,9],[95,11,95,13],[57,3,57,5],[57,7,57,9],[57,11,57,13],[76,3,76,5],[76,7,76,9],[76,11,76,13]]}
[]
[]
[]
[]
[]
[]
[]
[]
[]
[]
[]
[]
[null,"The purpose of this sheet is to calculate the expected billing when forecasted 2017 Uniform Transmission Rates are applied against historical 2015 transmission units."]
[]
[]
[]
[]
[]
[]
[null,"IESO",null,"Network",null,null,null,"Line Connection",null,null,null,"Transformation Connection",null,null,null,"Total Line"]
[]
[null,"Month",null,"Units Billed","Rate","Amount",null,"Units Billed","Rate","Amount",null,"Units Billed","Rate","Amount",null,"Amount"]
[]
[null,"January",null,{"$f":"'6. Historical Wholesale'!D24","v":54252},{"$f":"'5. UTRs and Sub-Transmission'!J22","v":3.66},{"$f":"D24*E24","v":198562.32},null,{"$f":"'6. Historical Wholesale'!H24","v":46813.418604651168},{"$f":"'5. UTRs and Sub-Transmission'!J24","v":0.87},{"$f":"H24*I24","v":40727.674186046519},null,{"$f":"'6. Historical Wholesale'!L24","v":48606.03},{"$f":"'5. UTRs and Sub-Transmission'!J26","v":2.02},{"$f":"L24*M24","v":98184.180599999992},null,{"$f":"J24+N24","v":138911.85478604652}]
[null,"February",null,{"$f":"'6. Historical Wholesale'!D25","v":54217.000000000007},{"$f":"E24","v":3.66},198434.22000000003,null,{"$f":"'6. Historical Wholesale'!H25","v":57391},{"$f":"I24","v":0.87},49930.17,null,{"$f":"'6. Historical Wholesale'!L25","v":57391},{"$f":"M24","v":2.02},115929.82,null,165859.99]
[null,"March",null,{"$f":"'6. Historical Wholesale'!D26","v":54036},3.66,197771.76,null,{"$f":"'6. Historical Wholesale'!H26","v":63785},0.87,55492.95,null,{"$f":"'6. Historical Wholesale'!L26","v":63785},2.02,128845.7,null,184338.65]
[null,"April",null,{"$f":"'6. Historical Wholesale'!D27","v":39120},3.66,143179.20000000001,null,{"$f":"'6. Historical Wholesale'!H27","v":55395},0.87,48193.65,null,{"$f":"'6. Historical Wholesale'!L27","v":55395},2.02,111897.9,null,160091.54999999999]
[null,"May",null,{"$f":"'6. Historical Wholesale'!D28","v":53359},3.66,195293.94,null,{"$f":"'6. Historical Wholesale'!H28","v":46837.267441860466},0.87,40748.422674418602,null,{"$f":"'6. Historical Wholesale'!L28","v":46868.415000000001},2.02,94674.198300000004,null,135422.62097441859]
[null,"June",null,{"$f":"'6. Historical Wholesale'!D29","v":43870.000000000007},3.66,160564.20000000004,null,{"$f":"'6. Historical Wholesale'!H29","v":62090},0.87,54018.3,null,{"$f":"'6. Historical Wholesale'!L29","v":62090},2.02,125421.8,null,179440.1]
[null,"July",null,{"$f":"'6. Historical Wholesale'!D30","v":41790.000000000007},3.66,152951.40000000002,null,{"$f":"'6. Historical Wholesale'!H30","v":51612},0.87,44902.44,null,{"$f":"'6. Historical Wholesale'!L30","v":51612},2.02,104256.24,null,149158.68]
{"$rows_left_out":88}
{"sheet":"9. RTSR Rates to Forecast","index":8,"n_rows":56,"n_cols":10,"rows_kept":56,"cut":false,"hidden":false,"merged":[]}
[]
[]
[]
[]
[]
[]
[]
[]
[]
[]
[]
[]
["The purpose of this sheet is to re-align the current RTS Network Rates to recover current wholesale network costs."]
[]
["Rate Class","Rate Description","Unit","Current RTSR-Network","Loss Adjusted Billed kWh","Billed kW","Billed Amount","Billed Amount %","Current Wholesale Billing","Adjusted RTSR Network"]
[]
["Residential","RTSR - Network","kWh",7.1000000000000004E-3,189912684.87312001,0,{"$f":"ROUND(D17*E17, 2)","v":1348380.06},{"$f":"G17/4928288","v":0.27360009398801372},{"$f":"H17*total_current_wholesale_network","v":1394259.1870025424},{"$f":"IF(ISERROR(I17/E17), 0, I17/E17)","v":7.3415800947369157E-3}]
["General Service Less Than 50 kW","RTSR - Network","kWh",6.3E-3,92130098.071439996,0,{"$f":"ROUND(D18*E18, 2)","v":580419.62},0.11777307251524262,600168.61084516812,{"$f":"IF(ISERROR(I18/E18), 0, I18/E18)","v":6.5143598390591346E-3}]
["General Service 50 to 4,999 kW","RTSR - Network","kW",2.7797000000000001,null,735399.97,{"$f":"ROUND(D19*F19, 2)","v":2044191.3},0.41478730544968151,2113745.6601187577,{"$f":"IF(ISERROR(I19/F19), 0, I19/F19)","v":2.8742803186662598}]
["Large Use","RTSR - Network","kW",3.3492000000000002,null,280183,{"$f":"ROUND(D20*F20, 2)","v":938388.9},0.19040869770597824,970317.92713265866,{"$f":"IF(ISERROR(I20/F20), 0, I20/F20)","v":3.4631577473746038}]
["Unmetered Scattered Load","RTSR - Network","kWh",7.1000000000000004E-3,1226516.1122400002,0,{"$f":"ROUND(D21*E21, 2)","v":8708.26},1.7669949483471745E-3,9004.5617463423168,{"$f":"IF(ISERROR(I21/E21), 0, I21/E21)","v":7.3415764020394189E-3}]
["Street Lighting","RTSR - Network","kW",2.0078,null,4084,{"$f":"ROUND(D22*F22, 2)","v":8199.86},1.6638353927367882E-3,8478.863249531194,{"$f":"IF(ISERROR(I22/F22), 0, I22/F22)","v":2.07611734807326}]
["Standby Power","RTSR - Network","kW",null,null,null,{"$f":"ROUND(D23*F23, 2)","v":0},0,0,{"$f":"IF(ISERROR(I23/F23), 0, I23/F23)","v":0}]
[]
["The purpose of this table is to re-align the current RTS Connection Rates to recover current wholesale connection costs."]
["Rate Class","Rate Description","Unit","Current RTSR-Connection","Loss Adjusted Billed kWh","Billed kW","Billed Amount","Billed Amount %","Current Wholesale Billing","Adjusted RTSR-Connection"]
[]
["Residential","RTSR - Connection","kWh",5.5999999999999999E-3,189912684.87312001,0,{"$f":"ROUND(D28*E28, 2)","v":1063511.04},{"$f":"G28/3931555.58","v":0.27050642382117868},{"$f":"H28*Total_Current_Wholesale_Lineplus","v":1120320.6606511828},{"$f":"IF(ISERROR(I28/E28), 0, I28/E28)","v":5.8991354969240998E-3}]
["General Service Less Than 50 kW","RTSR - Connection","kWh",5.1000000000000004E-3,92130098.071439996,0,{"$f":"ROUND(D29*E29, 2)","v":469863.5},0.11951083748891068,494962.22130037978,{"$f":"IF(ISERROR(I29/E29), 0, I29/E29)","v":5.3724269447382291E-3}]
["General Service 50 to 4,999 kW","RTSR - Connection","kW",2.2225000000000001,null,735399.97,{"$f":"ROUND(D30*F30, 2)","v":1634426.43},0.41572003669855279,1721732.6656461924,{"$f":"IF(ISERROR(I30/F30), 0, I30/F30)","v":2.3412193852091026}]
{"$rows_left_out":27}
{"sheet":"hidden1","index":9,"n_rows":22,"n_cols":2,"rows_kept":22,"cut":false,"hidden":true,"merged":[]}
[{"$f":"IF('3. Rate Classes'!L17=1, '3. Rate Classes'!C17, \"\")","v":"Residential"},1]
[{"$f":"IF('3. Rate Classes'!L18=1, '3. Rate Classes'!C18, \"\")","v":"General Service Less Than 50 kW"},2]
[{"$f":"IF('3. Rate Classes'!L19=1, '3. Rate Classes'!C19, \"\")","v":"General Service 50 to 4,999 kW"},3]
[{"$f":"IF('3. Rate Classes'!L20=1, '3. Rate Classes'!C20, \"\")","v":"Large Use"},4]
[{"$f":"IF('3. Rate Classes'!L21=1, '3. Rate Classes'!C21, \"\")","v":"Unmetered Scattered Load"},5]
[{"$f":"IF('3. Rate Classes'!L22=1, '3. Rate Classes'!C22, \"\")","v":"Street Lighting"},6]
[{"$f":"IF('3. Rate Classes'!L23=1, '3. Rate Classes'!C23, \"\")","v":"Standby Power"},7]
[{"$f":"IF('3. Rate Classes'!L24=1, '3. Rate Classes'!C24, \"\")","v":""},8]
[{"$f":"IF('3. Rate Classes'!L25=1, '3. Rate Classes'!C25, \"\")","v":""},9]
[{"$f":"IF('3. Rate Classes'!L26=1, '3. Rate Classes'!C26, \"\")","v":""},10]
[{"$f":"IF('3. Rate Classes'!L27=1, '3. Rate Classes'!C27, \"\")","v":""},11]
[{"$f":"IF('3. Rate Classes'!L28=1, '3. Rate Classes'!C28, \"\")","v":""},12]
[{"$f":"IF('3. Rate Classes'!L29=1, '3. Rate Classes'!C29, \"\")","v":""},13]
[{"$f":"IF('3. Rate Classes'!L30=1, '3. Rate Classes'!C30, \"\")","v":""},14]
[{"$f":"IF('3. Rate Classes'!L31=1, '3. Rate Classes'!C31, \"\")","v":""},15]
[{"$f":"IF('3. Rate Classes'!L32=1, '3. Rate Classes'!C32, \"\")","v":""},16]
[{"$f":"IF('3. Rate Classes'!L33=1, '3. Rate Classes'!C33, \"\")","v":""},17]
[{"$f":"IF('3. Rate Classes'!L34=1, '3. Rate Classes'!C34, \"\")","v":""},18]
[{"$f":"IF('3. Rate Classes'!L35=1, '3. Rate Classes'!C35, \"\")","v":""},19]
[{"$f":"IF('3. Rate Classes'!L36=1, '3. Rate Classes'!C36, \"\")","v":""},20]
[{"$f":"IF('3. Rate Classes'!L37=1, '3. Rate Classes'!C37, \"\")","v":""},21]
[{"$f":"IF('3. Rate Classes'!L38=1, '3. Rate Classes'!C38, \"\")","v":""},22]