{"text_format":"1","workbook":"xlsx","n_sheets":22,"sheets":["1. Info","Table of Contents","A. Data Input Sheet","B. Tax Rates & Exemptions","C. Sch 8 Hist","D. Schedule 10 CEC Hist","E. Sch 13 Tax Reserves Hist","F. Sch 7-1 Loss Cfwd Hist","G. Adj. Taxable Income Historic","H. PILs,Tax Provision Historic","I. Schedule 8 CCA Bridge Year","J. Schedule 10 CEC Bridge Year","K. Sch 13 Tax Reserves Bridge","L. Sch 7-1 Loss Cfwd Bridge","M. Adj. Taxable Income Bridge","N. PILs,Tax Provision Bridge","O. Schedule 8 CCA Test Year  ","P. Schedule 10 CEC Test Year","Q Sch 13 Tax Reserve Test Year","R. Sch 7-1 Loss Cfwd","S. Taxable Income Test Year","T. PILs,Tax Provision "],"not_rendered":{"charts":0,"images":2,"macros":1,"external_links":3,"defined_names":49,"comments":3,"pivot_tables":0},"unopened":[],"bounds":{"document_bytes":16777216,"sheet_cells":100000,"rows_first":2000,"rows_last":500,"rows_between":2000,"halvings":0,"cell_chars":16384,"cell_head_chars":4096},"cells_cut":0,"cells_raw":0,"read":"whole","date_system":"1900"}

{"sheet":"1. Info","index":0,"n_rows":87,"n_cols":28,"rows_kept":87,"cut":false,"hidden":false,"merged":[[21,3,21,4],[17,3,17,4],[1,2,1,9],[2,2,2,9],[3,2,3,9],[4,2,4,9],[13,3,13,4]]}
[null,null,null,null,null,null,null,null,null,null,null,null,null,null,null,null,null,null,null,null,null,null,null,null,null,null,null,"Algoma Power Inc."]
[null,null,null,null,null,null,null,null,null,null,null,null,null,null,null,null,null,null,null,null,null,null,null,null,null,null,null,"Atikokan Hydro Inc."]
[null,null,null,null,null,null,null,null,null,null,null,null,null,null,null,null,null,null,null,null,null,null,null,null,null,null,null,"Attawapiskat Power Corp. "]
[null,null,null,null,null,null,null,null,null,null,null,null,null,null,null,null,null,null,null,null,null,null,null,null,null,null,null,"Bluewater Power Distribution Corporation"]
[null,null,null,null,null,null,null,null,null,null,null,null,null,null,null,null,null,null,null,null,null,null,null,null,null,null,null,"Brant County Power Inc."]
[null,null,null,null,null,null,null,null,null,null,null,null,null,null,null,null,null,null,null,null,null,null,null,null,null,null,null,"Brantford Power Inc."]
[null,null,null,null,null,null,null,null,null,null,null,null,null,null,null,null,null,null,null,null,null,null,null,null,null,null,null,"Burlington Hydro Inc."]
[null,null,null,null,null,null,null,null,null,null,null,null,null,null,null,null,null,null,null,null,null,null,null,null,null,null,null,"Cambridge and North Dumfries Hydro Inc."]
[null,null,null,null,null,null,null,null,null,null,null,null,null,null,null,null,null,null,null,null,null,null,null,null,null,null,null,"Canadian Niagara Power Inc. - Eastern Ontario Power"]
[null,null,null,null,null,null,null,null,null,null,null,null,null,null,null,null,null,null,null,null,null,null,null,null,null,null,null,"Canadian Niagara Power Inc. - Fort Erie"]
{"$rows_left_out":78}
{"sheet":"Table of Contents","index":1,"n_rows":26,"n_cols":27,"rows_kept":26,"cut":false,"hidden":false,"merged":[[83,0,90,6],[0,2,0,4],[1,3,1,6],[3,3,3,4],[8,2,8,4]]}
[null,null,null,null,null,null,null,null,null,null,null,null,null,null,null,null,null,null,null,null,null,null,null,null,null,null,1]
[null,null,null,null,null,null,null,null,null,null,null,null,null,null,null,null,null,null,null,null,null,null,null,null,null,null,2012]
[null,null,null,null,null,null,null,null,null,null,null,null,null,null,null,null,null,null,null,null,null,null,null,null,null,null,2013]
[null,null,null,null,null,null,null,null,null,null,null,null,null,null,null,null,null,null,null,null,null,null,null,null,null,null,2014]
[null,null,null,null,null,null,null,null,null,null,null,null,null,null,null,null,null,null,null,null,null,null,null,null,null,null,2015]
[null,null,null,null,null,null,null,null,null,null,null,null,null,null,null,null,null,null,null,null,null,null,null,null,null,null,2016]
[]
[]
[]
[]
{"$rows_left_out":17}
{"sheet":"A. Data Input Sheet","index":2,"n_rows":50,"n_cols":13,"rows_kept":50,"cut":false,"hidden":false,"merged":[[34,2,34,4],[36,2,36,4],[0,2,0,4],[1,2,1,8],[2,2,2,8],[3,2,3,8],[46,2,46,4],[49,2,49,4],[38,2,38,4],[40,2,40,4],[42,2,42,4],[44,2,44,4]]}
[]
[]
[]
[]
[]
[]
[null,null,null,null,null,null,"Test Year 1 (2016)","Test Year 2 (2017)","Test Year 3 (2018)","Test Year 4 (2019)","Test Year 5 (2020)"]
[]
[null,null,"Rate Base",null,null,null,{"$f":"[3]!RateBase2016","v":1071267832.9437622},{"$f":"[3]!RateBase2017","v":1085976831.0971262},{"$f":"[3]!RateBase2018","v":1160255448.7866583},{"$f":"[3]!RateBase2019","v":1230251245.6103637},{"$f":"[3]!RateBase2020","v":1300891119.7399583}]
[]
{"$rows_left_out":41}
{"sheet":"B. Tax Rates & Exemptions","index":3,"n_rows":31,"n_cols":14,"rows_kept":31,"cut":false,"hidden":false,"merged":[[0,2,0,3],[1,2,1,3],[2,2,2,3],[3,2,3,3]]}
[]
[]
[]
[]
[]
[]
[]
[]
[null,null,"Tax Rates"]
[null,null,"Federal & Provincial",null,"Effective","Effective","Effective","Effective","Effective","Effective","Effective","Effective","Effective","Effective"]
{"$rows_left_out":22}
{"sheet":"C. Sch 8 Hist","index":4,"n_rows":44,"n_cols":7,"rows_kept":44,"cut":false,"hidden":false,"merged":[[9,2,9,6],[0,2,0,4],[1,2,1,8],[2,2,2,8],[3,2,3,8]]}
[]
[]
[]
[]
[]
[]
[]
[]
[null,null,"Schedule 8 - Historical Year"]
[]
{"$rows_left_out":35}
{"sheet":"D. Schedule 10 CEC Hist","index":5,"n_rows":40,"n_cols":11,"rows_kept":40,"cut":false,"hidden":false,"merged":[[30,2,30,5],[30,6,30,7],[31,2,31,5],[32,6,32,7],[21,2,21,5],[21,6,21,7],[23,6,23,7],[27,2,27,5],[27,6,28,7],[28,2,28,5],[17,9,18,9],[18,2,18,5],[19,2,19,5],[15,2,15,5],[15,6,15,7],[17,2,17,5],[17,6,18,7],[0,2,0,4],[1,2,1,8],[2,2,2,8],[3,2,3,8],[17,8,18,8],[9,2,9,5],[11,2,11,5],[11,6,11,7],[13,2,13,5],[13,6,13,7]]}
[]
[]
[]
[]
[]
[]
[]
[null,null,"Schedule 10 CEC - Historical Year"]
[]
[null,null,"Cumulative Eligible Capital",null,null,null,null,null,null,null,5784065]
{"$rows_left_out":31}
{"sheet":"E. Sch 13 Tax Reserves Hist","index":6,"n_rows":51,"n_cols":6,"rows_kept":51,"cut":false,"hidden":false,"merged":[[15,2,15,5],[28,2,28,5],[0,2,0,4],[1,2,1,8],[2,2,2,8],[3,2,3,8]]}
[]
[]
[]
[]
[]
[]
[]
[null,null,"Schedule 13 Tax Reserves - Historical"]
[]
[null,null,"Continuity of Reserves"]
{"$rows_left_out":42}
{"sheet":"F. Sch 7-1 Loss Cfwd Hist","index":7,"n_rows":17,"n_cols":8,"rows_kept":17,"cut":false,"hidden":false,"merged":[[15,2,15,4],[16,2,16,4],[12,2,12,4],[13,2,13,4],[0,2,0,4],[1,2,1,8],[2,2,2,8],[3,2,3,8]]}
[]
[]
[]
[]
[]
[]
[]
[]
[null,null,"Schedule 7-1 Loss Carry Forward - Historic"]
[]
{"$rows_left_out":8}
{"sheet":"G. Adj. Taxable Income Historic","index":8,"n_rows":119,"n_cols":7,"rows_kept":119,"cut":false,"hidden":false,"merged":[[111,2,111,6],[0,2,0,4],[1,2,1,8],[2,2,2,8],[3,2,3,8]]}
[]
[]
[]
[]
[]
[]
[]
[null,null,"Adjusted Taxable Income - Historic Year"]
[]
[]
{"$rows_left_out":110}
{"sheet":"H. PILs,Tax Provision Historic","index":9,"n_rows":34,"n_cols":10,"rows_kept":34,"cut":false,"hidden":false,"merged":[[42,2,42,5],[0,2,0,6],[1,2,1,11],[2,2,2,11],[3,2,3,11],[38,2,38,5],[7,2,7,5]]}
[]
[]
[]
[]
[]
[]
[null,null,"PILs Tax Provision - Historic Year"]
[null,null,"Note: Input the actual information from the tax returns for the historic year. ",null,null,null,null,null,"Wires Only"]
[]
[null,null,"Regulatory Taxable Income",null,null,null,null,null,{"$f":"'G. Adj. Taxable Income Historic'!G119","v":3956831},"A"]
{"$rows_left_out":25}
{"sheet":"I. Schedule 8 CCA Bridge Year","index":10,"n_rows":42,"n_cols":13,"rows_kept":42,"cut":false,"hidden":false,"merged":[[0,2,0,4],[1,2,1,8],[2,2,2,8],[3,2,3,8]]}
[]
[]
[]
[]
[]
[]
[null,null,"Schedule 8 CCA - Bridge Year"]
[]
[null,null,"Class","Class Description","UCC Regulated Historic Year","Additions","Disposals (Negative)","UCC Before 1/2 Yr Adjustment","1/2 Year Rule {1/2 Additions Less Disposals}","Reduced UCC","Rate %","Bridge Year CCA","UCC End of Bridge Year"]
[null,null,{"$f":"IF(ISBLANK('C. Sch 8 Hist'!C12), \"\", 'C. Sch 8 Hist'!C12)","v":1},{"$f":"IF(ISBLANK('C. Sch 8 Hist'!D12), \"\", 'C. Sch 8 Hist'!D12)","v":"Distribution System - post 1987"},{"$f":"IF(ISBLANK('C. Sch 8 Hist'!E12), \"\", 'C. Sch 8 Hist'!G12)","v":380866553},3972000,null,{"$f":"MAX((SUM(E10:G10)),0)","v":384838553},{"$f":"IF((F10+G10)<=0, 0,(F10+G10)*0.5)","v":1986000},{"$f":"+H10-I10","v":382852553},0.04,{"$f":"IF(+J10<0,+J10,+J10*K10)","v":15314102.120000001},{"$f":"MAX(0,+H10-L10)","v":369524450.88}]
{"$rows_left_out":33}
{"sheet":"J. Schedule 10 CEC Bridge Year","index":11,"n_rows":40,"n_cols":11,"rows_kept":40,"cut":false,"hidden":false,"merged":[[11,2,11,5],[11,6,11,7],[0,2,0,4],[1,2,1,8],[2,2,2,8],[3,2,3,8],[9,2,9,5],[13,2,13,5],[13,6,13,7],[15,2,15,5],[15,6,15,7],[17,2,17,5],[17,6,18,7],[17,8,18,8],[17,9,18,9],[18,2,18,5],[19,2,19,5],[21,2,21,5],[21,6,21,7],[31,2,31,5],[32,6,32,7],[23,6,23,7],[27,2,27,5],[27,6,28,7],[28,2,28,5],[30,2,30,5],[30,6,30,7]]}
[]
[]
[]
[]
[]
[]
[]
[null,null,"Schedule 10 CEC - Bridge Year"]
[]
[null,null,"Cumulative Eligible Capital",null,null,null,null,null,null,null,{"$f":"'D. Schedule 10 CEC Hist'!K40","v":5411401.4625000004}]
{"$rows_left_out":31}
{"sheet":"K. Sch 13 Tax Reserves Bridge","index":12,"n_rows":44,"n_cols":11,"rows_kept":44,"cut":false,"hidden":false,"merged":[[9,6,9,7],[1,2,1,8],[2,2,2,8],[3,2,3,8]]}
[]
[]
[]
[]
[]
[]
[]
[null,null,"Schedule 13 Tax Reserves - Bridge Year"]
[null,null,"Continuity of Reserves"]
[null,null,null,null,null,null,"Bridge Year Adjustments"]
{"$rows_left_out":35}
{"sheet":"L. Sch 7-1 Loss Cfwd Bridge","index":13,"n_rows":25,"n_cols":6,"rows_kept":25,"cut":false,"hidden":false,"merged":[[21,2,21,4],[19,2,19,4],[0,2,0,4],[12,2,12,4],[13,2,13,4],[18,2,18,4],[10,2,10,4],[11,2,11,4],[1,2,1,8],[2,2,2,8],[3,2,3,8],[20,2,20,4]]}
[]
[]
[]
[]
[]
[]
[null,null,"Corporation Loss Continuity and Application"]
[]
[null,null,"Schedule 7-1 Loss Carry Forward - Bridge Year"]
[]
{"$rows_left_out":16}
{"sheet":"M. Adj. Taxable Income Bridge","index":14,"n_rows":114,"n_cols":5,"rows_kept":114,"cut":false,"hidden":false,"merged":[[68,2,68,4],[45,2,45,4],[112,2,112,4],[8,2,8,4],[0,2,0,4],[1,2,1,8],[2,2,2,8],[3,2,3,8],[9,2,9,4]]}
[]
[]
[]
[]
[null,"Adjusted Taxable Income - Bridge Year"]
[]
[null,null,null,"T2S1 line #","Total for Regulated Utility"]
[null,null,"Income before PILs/Taxes","A",34976530]
[]
[null,null,"Additions:"]
{"$rows_left_out":105}
{"sheet":"N. PILs,Tax Provision Bridge","index":15,"n_rows":39,"n_cols":10,"rows_kept":39,"cut":false,"hidden":false,"merged":[[42,2,42,5],[0,2,0,6],[1,2,1,11],[2,2,2,11],[3,2,3,11],[38,2,38,5]]}
[]
[]
[]
[]
[]
[null,"PILS Tax Provision - Bridge Year"]
[]
[null,null,null,null,null,null,null,null,"Wires Only"]
[]
[null,null,"Regulatory Taxable Income",null,null,null,null,null,{"$f":"'M. Adj. Taxable Income Bridge'!E114","v":-9303387.8623749912},"A"]
{"$rows_left_out":30}
{"sheet":"O. Schedule 8 CCA Test Year  ","index":16,"n_rows":195,"n_cols":13,"rows_kept":195,"cut":false,"hidden":false,"merged":[[0,2,0,4],[1,2,1,8],[2,2,2,8],[3,2,3,8]]}
[]
[]
[]
[]
[]
[]
[null,"Schedule 8 CCA - Test Year 1 (2016)"]
[]
[]
[null,null,"Class","Class Description","UCC Test Year 1 Opening Balance","Additions","Disposals  (Negative)","UCC Before 1/2 Yr Adjustment","1/2 Year Rule {1/2 Additions Less Disposals}","Reduced UCC","Rate %","Test Year 1 CCA","UCC End of Test Year 1"]
{"$rows_left_out":186}
{"sheet":"P. Schedule 10 CEC Test Year","index":17,"n_rows":39,"n_cols":35,"rows_kept":39,"cut":false,"hidden":false,"merged":[[28,2,28,5],[28,6,28,7],[29,2,29,5],[30,6,30,7],[19,2,19,5],[19,6,19,7],[21,6,21,7],[25,2,25,5],[25,6,26,7],[26,2,26,5],[17,2,17,5],[13,2,13,5],[13,6,13,7],[15,2,15,5],[15,6,16,7],[0,2,0,4],[1,2,1,8],[2,2,2,8],[3,2,3,8],[15,8,16,8],[6,2,6,5],[9,2,9,5],[9,6,9,7],[11,2,11,5],[11,6,11,7],[4,6,4,10],[15,9,16,9],[16,2,16,5],[19,18,19,19],[21,18,21,19],[25,18,26,19],[30,12,30,13],[9,18,9,19],[11,18,11,19],[13,18,13,19],[15,18,16,19],[28,18,28,19],[30,18,30,19],[15,15,16,15],[19,12,19,13],[21,12,21,13],[25,12,26,13],[28,12,28,13],[9,12,9,13],[19,30,19,31],[21,30,21,31],[25,30,26,31],[30,24,30,25],[9,30,9,31],[11,30,11,31],[13,30,13,31],[15,30,16,31],[28,30,28,31],[30,30,30,31],[15,27,16,27],[19,24,19,25],[21,24,21,25],[25,24,26,25],[28,24,28,25],[9,24,9,25],[4,12,4,16],[4,18,4,22],[4,24,4,28],[4,30,4,34],[15,32,16,32],[15,33,16,33],[11,24,11,25],[13,24,13,25],[15,24,16,25],[15,26,16,26],[15,20,16,20],[15,21,16,21],[11,12,11,13],[13,12,13,13],[15,12,16,13],[15,14,16,14]]}
[]
[]
[]
[]
[null,null,"Schedule 10 CEC ",null,null,null,"Test Year 1 (2016)",null,null,null,null,null,"Test Year 2 (2017)",null,null,null,null,null,"Test Year 3 (2018)",null,null,null,null,null,"Test Year 4 (2019)",null,null,null,null,null,"Test Year 5 (2020)"]
[]
[null,null,"Cumulative Eligible Capital",null,null,null,null,null,null,null,{"$f":"'J. Schedule 10 CEC Bridge Year'!K40","v":5055620.8601250006},null,null,null,null,null,{"$f":"K39","v":4725442.3999162503},null,null,null,null,null,{"$f":"Q39","v":4415586.4319221126},null,null,null,null,null,{"$f":"W39","v":4130907.8816875648},null,null,null,null,null,{"$f":"AC39","v":3866156.829969435}]
[]
[null,null,"Additions"]
[null,null,"Cost of Eligible Capital Property Acquired during Test Year",null,null,null,34000,null,null,null,null,null,30000,null,null,null,null,null,35000,null,null,null,null,null,35000,null,null,null,null,null,36000]
{"$rows_left_out":30}
{"sheet":"Q Sch 13 Tax Reserve Test Year","index":18,"n_rows":195,"n_cols":11,"rows_kept":195,"cut":false,"hidden":false,"merged":[[47,6,47,7],[51,3,51,10],[13,3,13,10],[9,6,9,7],[1,2,1,8],[2,2,2,8],[3,2,3,8],[165,3,165,10],[85,6,85,7],[89,3,89,10],[123,6,123,7],[127,3,127,10],[161,6,161,7]]}
[]
[]
[]
[]
[]
[]
[null,null,"Schedule 13 Tax Reserves - Test Year 1 (2016)"]
[]
[null,null,"Continuity of Reserves"]
[null,null,null,null,null,null,"Test Year 1 Adjustments"]
{"$rows_left_out":186}
{"sheet":"R. Sch 7-1 Loss Cfwd","index":19,"n_rows":25,"n_cols":24,"rows_kept":25,"cut":false,"hidden":false,"merged":[[0,2,0,4],[1,2,1,8],[2,2,2,8],[3,2,3,8],[10,2,10,4],[6,5,6,7],[21,2,21,4],[12,2,12,4],[13,2,13,4],[18,2,18,4],[19,2,19,4],[6,9,6,11],[6,13,6,15],[6,17,6,19],[6,21,6,23],[20,2,20,4],[11,2,11,4]]}
[]
[]
[]
[]
[]
[]
[null,null,"Schedule 7-1 Loss Carry Forward ",null,null,"Test Year 1 (2016)",null,null,null,"Test Year 2 (2017)",null,null,null,"Test Year 3 (2018)",null,null,null,"Test Year 4 (2019)",null,null,null,"Test Year 5 (2020)"]
[]
[null,null,"Corporation Loss Continuity and Application"]
[]
{"$rows_left_out":16}
{"sheet":"S. Taxable Income Test Year","index":20,"n_rows":127,"n_cols":9,"rows_kept":127,"cut":false,"hidden":false,"merged":[[0,2,0,4],[1,2,1,8],[2,2,2,8],[3,2,3,8]]}
[]
[]
[]
[]
[]
[]
[]
[]
[null,null,"Taxable Income - Test Years (2016 - 2020)"]
[]
{"$rows_left_out":118}
{"sheet":"T. PILs,Tax Provision ","index":21,"n_rows":185,"n_cols":10,"rows_kept":185,"cut":false,"hidden":false,"merged":[[42,2,42,5],[0,2,0,6],[1,2,1,11],[2,2,2,11],[3,2,3,11]]}
[]
[]
[]
[]
[]
[]
[null,"PILs Tax Provision - Test Year 1 (2016)"]
[null,null,null,null,null,null,null,null,"Wires Only"]
[]
[null,null,"Regulatory Taxable Income",null,null,null,null,null,{"$f":"'S. Taxable Income Test Year'!E124","v":-6436079.8409007937},"A"]
{"$rows_left_out":175}