{"text_format":"1","workbook":"xlsx","n_sheets":21,"sheets":["1. Information Sheet","2. Related Links","3. Rate Class Selection","4. Hidden","6. hidden","4. Growth Factor - NUM_CALC1","5. Growth Factor - NUM_CALC2","9. STS - Billing Det & Rate HID","6. Rev_Requ_Check","7. Growth Factor - DEN_CALC","7. Load Actual - HID","8. Revenue Proportions","8. Current Revenue - HID","9. Threshold Test","24. hidden","lists","Sheet1","10a. Proposed ACM Projects","10b. Proposed ACM ICM Projects","11. Incremental Capital Adj.","12. Opt 1-Rate Rider Calc F & V"],"not_rendered":{"charts":0,"images":5,"macros":1,"external_links":5,"defined_names":566,"comments":0,"pivot_tables":0},"unopened":[],"bounds":{"document_bytes":16777216,"sheet_cells":100000,"rows_first":2000,"rows_last":500,"rows_between":2000,"halvings":0,"cell_chars":16384,"cell_head_chars":4096},"cells_cut":0,"cells_raw":0,"read":"whole","date_system":"1900"}

{"sheet":"1. Information Sheet","index":0,"n_rows":117,"n_cols":27,"rows_kept":117,"cut":false,"hidden":false,"merged":[[43,5,43,7],[35,0,35,4],[35,5,35,7],[45,5,45,7],[41,5,41,7],[39,5,39,7],[37,0,37,4],[37,5,37,7],[47,9,51,12],[65,0,65,12],[52,2,52,11],[54,2,54,13],[56,2,56,12],[47,0,48,4],[47,5,47,7],[48,5,48,7],[13,5,13,11],[15,5,15,9],[17,5,17,9],[21,5,21,9],[19,5,19,9],[23,5,23,9],[33,5,33,7],[33,0,33,4],[25,0,25,4],[25,5,25,7],[27,0,27,4],[31,5,31,7],[27,5,27,7],[29,0,29,4],[29,5,29,7]]}
[null,null,null,null,null,null,null,null,null,null,null,null,null,null,null,null,null,null,null,null,"a",null,null,null,null,null,{"$f":"IF(OR(F16=\"\", F16=\"(if applicable)\"), F14, F14 & \" - \" & F16)","v":"London Hydro Inc."}]
[]
[]
[]
[]
[]
[]
[]
[]
[]
{"$rows_left_out":108}
{"sheet":"2. Related Links","index":1,"n_rows":15,"n_cols":1,"rows_kept":15,"cut":false,"hidden":true,"merged":[[12,1,12,7],[14,0,14,13]]}
[]
[]
[]
[]
[]
[]
[]
[]
[]
[]
{"$rows_left_out":6}
{"sheet":"3. Rate Class Selection","index":2,"n_rows":33,"n_cols":17,"rows_kept":33,"cut":false,"hidden":false,"merged":[[25,1,25,9],[26,1,26,9],[24,1,24,9],[23,1,23,9],[21,1,21,9],[22,1,22,9],[11,0,11,13],[18,1,18,9],[17,1,17,9],[19,1,19,9],[20,1,20,9]]}
[]
[]
[]
[]
[]
[]
[]
[]
[]
[]
{"$rows_left_out":24}
{"sheet":"4. Hidden","index":3,"n_rows":456,"n_cols":18,"rows_kept":456,"cut":false,"hidden":true,"merged":[[453,1,453,6],[454,1,454,6],[455,1,455,6],[444,1,444,6],[445,1,445,6],[446,1,446,6],[447,1,447,6],[448,1,448,6],[449,1,449,6],[450,1,450,6],[451,1,451,6],[452,1,452,6],[435,1,435,6],[436,1,436,6],[437,1,437,6],[438,1,438,6],[439,1,439,6],[440,1,440,6],[441,1,441,6],[442,1,442,6],[443,1,443,6],[426,1,426,6],[427,1,427,6],[428,1,428,6],[429,1,429,6],[430,1,430,6],[431,1,431,6],[432,1,432,6],[433,1,433,6],[434,1,434,6],[396,1,396,6],[397,1,397,6],[398,1,398,6],[401,1,401,8],[403,1,408,8],[411,1,413,8],[414,1,417,8],[418,1,420,8],[421,1,424,8],[385,1,385,6],[386,1,386,6],[387,1,387,6],[388,1,388,6],[389,1,389,6],[390,1,390,6],[391,1,391,6],[392,1,392,6],[395,1,395,6],[376,1,376,6],[377,1,377,6],[378,1,378,6],[379,1,379,6],[380,1,380,6],[381,1,381,6],[382,1,382,6],[383,1,383,6],[384,1,384,6],[367,1,367,6],[368,1,368,6],[369,1,369,6],[370,1,370,6],[371,1,371,6],[372,1,372,6],[373,1,373,6],[374,1,374,6],[375,1,375,6],[340,1,345,8],[348,1,350,8],[351,1,354,8],[355,1,357,8],[358,1,361,8],[363,1,363,6],[364,1,364,6],[365,1,365,6],[366,1,366,6],[326,1,326,6],[327,1,327,6],[328,1,328,6],[329,1,329,6],[332,1,332,6],[333,1,333,6],[334,1,334,6],[335,1,335,6],[338,1,338,8],[317,1,317,6],[318,1,318,6],[319,1,319,6],[320,1,320,6],[321,1,321,6],[322,1,322,6],[323,1,323,6],[324,1,324,6],[325,1,325,6],[308,1,308,6],[309,1,309,6],[310,1,310,6],[311,1,311,6],[312,1,312,6],[313,1,313,6],[314,1,314,6],[315,1,315,6],[316,1,316,6],[295,1,298,8],[300,1,300,6],[301,1,301,6],[302,1,302,6],[303,1,303,6],[304,1,304,6],[305,1,305,6],[306,1,306,6],[307,1,307,6],[269,1,269,6],[270,1,270,6],[271,1,271,6],[272,1,272,6],[275,1,275,8],[277,1,282,8],[285,1,287,8],[288,1,291,8],[292,1,294,8],[258,1,258,6],[259,1,259,6],[260,1,260,6],[261,1,261,6],[262,1,262,6],[263,1,263,6],[264,1,264,6],[265,1,265,6],[266,1,266,6],[249,1,249,6],[250,1,250,6],[251,1,251,6],[252,1,252,6],[253,1,253,6],[254,1,254,6],[255,1,255,6],[256,1,256,6],[257,1,257,6],[240,1,240,6],[241,1,241,6],[242,1,242,6],[243,1,243,6],[244,1,244,6],[245,1,245,6],[246,1,246,6],[247,1,247,6],[248,1,248,6],[212,1,212,8],[214,1,219,8],[222,1,224,8],[225,1,228,8],[229,1,231,8],[232,1,235,8],[237,1,237,6],[238,1,238,6],[239,1,239,6],[43,1,46,8],[48,1,48,6],[49,1,49,6],[50,1,50,6],[51,1,51,6],[23,1,23,8],[25,1,30,8],[33,1,35,8],[36,1,39,8],[40,1,42,8],[52,1,52,6],[58,1,58,6],[53,1,53,6],[54,1,54,6],[55,1,55,6],[56,1,56,6],[71,1,71,6],[72,1,72,6],[65,1,65,6],[63,1,63,6],[57,1,57,6],[59,1,59,6],[62,1,62,6],[64,1,64,6],[66,1,66,6],[60,1,60,6],[61,1,61,6],[75,1,75,6],[76,1,76,6],[67,1,67,6],[68,1,68,6],[69,1,69,6],[70,1,70,6],[106,1,109,8],[111,1,111,6],[112,1,112,6],[83,1,83,6],[80,1,80,6],[81,1,81,6],[82,1,82,6],[77,1,77,6],[73,1,73,6],[74,1,74,6],[113,1,113,6],[114,1,114,6],[86,1,86,8],[88,1,93,8],[96,1,98,8],[99,1,102,8],[103,1,105,8],[120,1,120,6],[121,1,121,6],[122,1,122,6],[123,1,123,6],[124,1,124,6],[115,1,115,6],[116,1,116,6],[117,1,117,6],[118,1,118,6],[119,1,119,6],[130,1,130,6],[131,1,131,6],[132,1,132,6],[133,1,133,6],[134,1,134,6],[125,1,125,6],[126,1,126,6],[127,1,127,6],[128,1,128,6],[129,1,129,6],[140,1,140,6],[143,1,143,6],[144,1,144,6],[145,1,145,6],[146,1,146,6],[135,1,135,6],[136,1,136,6],[137,1,137,6],[138,1,138,6],[139,1,139,6],[169,1,172,8],[174,1,174,6],[175,1,175,6],[176,1,176,6],[177,1,177,6],[149,1,149,8],[151,1,156,8],[159,1,161,8],[162,1,165,8],[166,1,168,8],[183,1,183,6],[184,1,184,6],[185,1,185,6],[186,1,186,6],[187,1,187,6],[178,1,178,6],[179,1,179,6],[180,1,180,6],[181,1,181,6],[182,1,182,6],[193,1,193,6],[194,1,194,6],[195,1,195,6],[196,1,196,6],[197,1,197,6],[188,1,188,6],[189,1,189,6],[190,1,190,6],[191,1,191,6],[192,1,192,6],[203,1,203,6],[206,1,206,6],[207,1,207,6],[208,1,208,6],[209,1,209,6],[198,1,198,6],[199,1,199,6],[200,1,200,6],[201,1,201,6],[202,1,202,6]]}
[null,null,null,null,null,null,null,null,null,null,null,null,"Current Rate Classes","Changed to Rate Classes","Values in A that are NOT in B","Values in B that are Not in A","Count of A","Count of B"]
[null,null,null,null,null,null,null,null,null,null,null,null,"RESIDENTIAL","RESIDENTIAL",null,null,3,3]
[null,null,null,null,null,null,null,null,null,null,null,null,"STREET LIGHTING","STREET LIGHTING"]
[null,null,null,null,null,null,null,null,null,null,null,null,"STANDBY POWER","STANDBY POWER"]
[]
[]
[]
[]
[]
[]
{"$rows_left_out":447}
{"sheet":"6. hidden","index":4,"n_rows":5,"n_cols":15,"rows_kept":5,"cut":false,"hidden":true,"merged":[[0,10,1,10],[0,12,1,12],[0,4,1,4],[0,5,1,5],[0,6,1,6],[0,7,1,7],[0,8,1,8],[0,9,1,9],[0,11,1,11]]}
[null,null,null,null,"Billed kWh for Non-RPP Customers","Estimated kW for Non-RPP Customers","Distribution Revenue 1","1590 Recovery Share Proportion*","1595 Recovery Share Proportion (2008) 2","1595 Recovery Share Proportion (2009) 2","1595 Recovery Share Proportion (2010) 2","1595 Recovery Share Proportion (2011) 2","1568 LRAM Variance Account Class Allocation"]
["Rate Class","Unit","Metered kWh","Metered kW"]
["RESIDENTIAL","$/kWh",0,0,0,null,0,0,0,0,0,0,0,0,0]
["STREET LIGHTING","$/kW",0,0,0,null,0,0,0,0,0,0,0,0,0]
["STANDBY POWER",0,0,0,0,null,0,0,0,0,0,0,0,0,0]

{"sheet":"4. Growth Factor - NUM_CALC1","index":5,"n_rows":25,"n_cols":9,"rows_kept":25,"cut":false,"hidden":false,"merged":[[14,6,14,8],[14,2,14,4],[12,0,12,4]]}
[]
[]
[]
[]
[]
[]
[]
[]
[]
[]
{"$rows_left_out":16}
{"sheet":"5. Growth Factor - NUM_CALC2","index":6,"n_rows":26,"n_cols":19,"rows_kept":26,"cut":false,"hidden":false,"merged":[[13,2,13,8]]}
[]
[]
[]
[]
[]
[]
[]
[]
[]
[]
{"$rows_left_out":17}
{"sheet":"9. STS - Billing Det & Rate HID","index":7,"n_rows":25,"n_cols":9,"rows_kept":25,"cut":false,"hidden":true,"merged":[]}
[]
[]
[]
[]
[]
[]
[]
[]
[]
[]
{"$rows_left_out":16}
{"sheet":"6. Rev_Requ_Check","index":8,"n_rows":69,"n_cols":6,"rows_kept":69,"cut":false,"hidden":false,"merged":[[7,2,7,5]]}
[]
[]
[]
[]
[]
[]
[]
["Applicants Rate Base",null,{"$f":"'4. Growth Factor - NUM_CALC1'!C15","v":"2017 Test Year Distribution Revenues"}]
["Average Net Fixed Assets"]
["Gross Fixed Assets - Re-based Opening",null,451867413,"A"]
{"$rows_left_out":60}
{"sheet":"7. Growth Factor - DEN_CALC","index":9,"n_rows":26,"n_cols":19,"rows_kept":26,"cut":false,"hidden":false,"merged":[[13,2,13,4],[13,6,13,8]]}
[]
[]
[]
[]
[]
[]
[]
[]
[]
[]
{"$rows_left_out":17}
{"sheet":"7. Load Actual - HID","index":10,"n_rows":25,"n_cols":19,"rows_kept":25,"cut":false,"hidden":true,"merged":[]}
[]
[]
[]
[]
[]
[]
[]
[]
[]
[]
{"$rows_left_out":16}
{"sheet":"8. Revenue Proportions","index":11,"n_rows":26,"n_cols":19,"rows_kept":26,"cut":false,"hidden":false,"merged":[[12,0,12,6],[13,6,13,8],[13,2,13,4]]}
[]
[]
[]
[]
[]
[]
[]
[]
[]
[]
{"$rows_left_out":17}
{"sheet":"8. Current Revenue - HID","index":12,"n_rows":25,"n_cols":19,"rows_kept":25,"cut":false,"hidden":true,"merged":[]}
[]
[]
[]
[]
[]
[]
[]
[]
[]
[]
{"$rows_left_out":16}
{"sheet":"9. Threshold Test","index":13,"n_rows":66,"n_cols":5,"rows_kept":66,"cut":false,"hidden":false,"merged":[[8,2,8,4],[65,2,65,5]]}
[]
[]
[]
[]
[]
[]
[]
["No Input Required."]
[null,null,{"$f":"IF('1. Information Sheet'!F26 = \"COS\", \"Preliminary Threshold Calculation\", \"Final Threshold Calculation\")","v":"Preliminary Threshold Calculation"}]
[]
{"$rows_left_out":57}
{"sheet":"24. hidden","index":14,"n_rows":1,"n_cols":3,"rows_kept":1,"cut":false,"hidden":true,"merged":[]}
["Rate Class","MFC Adjustment from R/C Model","DVR Adjustment from R/C Model"]

{"sheet":"lists","index":15,"n_rows":214,"n_cols":55,"rows_kept":214,"cut":false,"hidden":true,"merged":[[12,51,12,52],[1,51,1,52],[0,51,0,52],[11,51,11,52],[10,51,10,52],[9,51,9,52],[8,51,8,52],[7,51,7,52],[5,51,5,52],[4,51,4,52],[3,51,3,52],[2,51,2,52],[6,51,6,52],[13,51,13,52],[14,51,14,52],[15,51,15,52],[16,51,16,52],[17,51,17,52]]}
["DISTRIBUTED GENERATION [DGEN]","Embedded Distributor",{"$f":"COUNTA(B1:B17)","v":4},null,null,null,null,null,"A Standby Service Charge will be applied for a month where standby power is not provided. The applicable rate is the approved Distribution Volumetric Rate of the applicable service class and is applied to gross metered demand or contracted amount, whichever is greater. A monthly administration charge of $200, for simple metering arrangements, or $500, for complex metering arrangements, will also be applied.",null,null,"Loss Factors",null,"Units","Units1","Units2",null,null,null,null,null,null,null,null,null,"Account History","Account set up charge/change of occupancy charge (plus credit agency costs if applicable)","Total Loss Factor – Embedded Distributor – Hydro One Networks Inc.",null,null,null,null,null,null,null,null,null,"Algoma Power Inc.","Algoma Power Inc.",null,"DISTRIBUTED GENERATION [DGEN]","kW",null,null,null,"Sub-Total:  Delivery (Distribution and Retail Transmission)"]
["EMBEDDED DISTRIBUTOR","General Service 3,000 to 4,999 kW",null,null,null,null,null,null,"Distribution Volumetric Rate",null,null,"Total Loss Factor – Primary Metered Customer",null,"$","$/kWh","$",null,null,null,null,null,null,null,null,null,"Account set up charge/change of occupancy charge","Administrative Billing Charge","Total Loss Factor – Primary Metered Customer",null,null,null,null,null,null,null,null,null,"Atikokan Hydro Inc.","Atikokan Hydro Inc.",null,"EMBEDDED DISTRIBUTOR","kW",null,null,null,"Wholesale Market Service Rate ",null,null,{"$f":"AU2*AV2","v":0},{"$f":"AU2","v":0},0,{"$f":"AX2*AY2","v":0},null,{"$f":"AZ2-AW2","v":0},{"$f":"BB2/AW2","v":{"$error":"#DIV/0!"}}]
["EMBEDDED DISTRIBUTOR","General Service 1,000 to 4,999 kW",null,null,null,null,null,null,"Distribution Volumetric Rate - $/kW of contracted amount",null,null,"Total Loss Factor – Primary Metered Customer < 5,000 kW",null,"$/kWh","$/kW","%",null,null,null,null,null,null,"MSC",null,null,"Account set up charge/change of occupancy charge (plus credit agency costs if applicable – Residential)","Bell Canada Pole Rentals","Total Loss Factor – Primary Metered Customer < 5,000 kW",null,null,null,null,null,null,null,null,null,"Attawapiskat Power Corporation","Bluewater Power Distribution Corporation",null,"EMBEDDED DISTRIBUTOR","kW",null,null,null,"Rural or Remote Electricity Rate Protection Charge (RRRP)",null,null,{"$f":"AU3*AV3","v":0},0,0,{"$f":"AX3*AY3","v":0},null,{"$f":"AZ3-AW3","v":0},{"$f":"BB3/AW3","v":{"$error":"#DIV/0!"}}]
["FARMS - SINGLE PHASE ENERGY-BILLED [F1]","General Service Equal To Or Greater Than 1,500 kW - Interval Metered",null,null,null,null,null,null,"Distribution Wheeling Service Rate",null,null,"Total Loss Factor – Primary Metered Customer > 5,000 kW",null,"$/kW","$/kVA",null,null,null,null,null,null,null,"SM_Rate_Adder",null,null,"Account set up charge/change of occupancy charge (plus credit agency costs if applicable)","Clearance Pole Attachment charge $/pole/year","Total Loss Factor – Primary Metered Customer > 5,000 kW",null,null,null,null,null,null,null,null,null,"Bluewater Power Distribution Corporation","Brant County Power Inc.",null,"FARMS - SINGLE PHASE ENERGY-BILLED [F1]","kWh",null,null,null,"Standard Supply Service – Administration Charge (if applicable)",null,null,{"$f":"AU4*AV4","v":0},0,0,{"$f":"AX4*AY4","v":0},null,{"$f":"AZ4-AW4","v":0},{"$f":"BB4/AW4","v":{"$error":"#DIV/0!"}}]
["FARMS - THREE PHASE ENERGY-BILLED [F3]",null,null,null,null,null,null,null,"Electricity Rate",null,null,"Total Loss Factor – Secondary Metered Customer",null,"$/kVA",null,null,null,null,null,null,null,null,"MSC_Rate_Rider_",null,null,"Arrears certificate","Collection of account charge – no disconnection","Total Loss Factor – Secondary Metered Customer",null,null,null,null,null,null,null,null,null,"Brant County Power Inc.","Brantford Power Inc.",null,"FARMS - THREE PHASE ENERGY-BILLED [F3]","kWh",null,null,null,"Sub-Total:  Regulatory",null,null,{"$f":"SUM(AW2:AW4)","v":0},null,null,{"$f":"SUM(AZ2:BA4)","v":0},null,{"$f":"AZ5-AW5","v":0},{"$f":"BB5/AW5","v":{"$error":"#DIV/0!"}}]
["GENERAL SERVICE - COMMERCIAL",null,null,null,null,null,null,null,"Electricity Rate - All Additional kWh",null,null,"Total Loss Factor – Secondary Metered Customer < 5,000 kW",null,null,null,null,null,null,null,null,null,null,"VC",null,null,"Arrears certificate (credit reference)","Collection of account charge – no disconnection – after regular hours","Total Loss Factor – Secondary Metered Customer < 5,000 kW",null,null,null,null,null,null,null,null,null,"Brantford Power Inc.","Burlington Hydro Inc.",null,"GENERAL SERVICE - COMMERCIAL","kW",null,null,null,"Debt Retirement Charge (DRC)",null,null,{"$f":"AU6*AV6","v":0},{"$f":"AU6","v":0},{"$f":"AV6","v":0},{"$f":"AX6*AY6","v":0},null,{"$f":"AZ6-AW6","v":0},{"$f":"BB6/AW6","v":{"$error":"#DIV/0!"}}]
["GENERAL SERVICE - INSTITUTIONAL",null,null,null,null,null,null,null,"Electricity Rate - First 250 kWh",null,null,null,null,null,null,null,null,null,null,null,null,null,null,null,null,null,null,null,null,null,null,null,null,null,null,null,null,"Burlington Hydro Inc.","Cambridge and North Dumfries Hydro Inc.",null,"GENERAL SERVICE - INSTITUTIONAL","kW"]
["GENERAL SERVICE 1,000 TO 2,999 KW",null,null,null,null,null,null,null,"Electricity Rate -All Additional kWh",null,null,"Total Loss Factor – Secondary Metered Customer > 5,000 kW",null,null,null,null,null,null,null,null,null,null,"VC_Rate_Rider_",null,null,"Charge to certify cheque","Collection of account charge – no disconnection - during regular business hours","Total Loss Factor – Secondary Metered Customer > 5,000 kW",null,null,null,null,null,null,null,null,null,"Cambridge and North Dumfries Hydro Inc.","Canadian Niagara Power Inc.",null,"GENERAL SERVICE 1,000 TO 2,999 KW","kW",null,null,null,"Total Bill on RPP (before taxes)",null,null,null,null,null,null,null,{"$f":"AZ8-AW8","v":0}]
["GENERAL SERVICE 1,000 TO 4,999 KW",null,null,null,null,null,null,null,"Electricity Rate First 1,000 kWh",null,null,"Distribution Loss Factor - Secondary Metered Customer < 5,000 kW",null,null,null,null,null,null,null,null,null,null,"VC_GA_Rate_Rider_kW_",null,null,"Collection of Account Charge – No Disconnection","Collection of account charge – no disconnection – during regular hours",null,null,null,null,null,null,null,null,null,null,"Canadian Niagara Power Inc.","Centre Wellington Hydro Ltd.",null,"GENERAL SERVICE 1,000 TO 4,999 KW","kW",null,null,null,"HST",null,null,{"$f":"AV9*AW8","v":0},null,{"$f":"AV9","v":0},{"$f":"AY9*AZ8","v":0},null,{"$f":"AZ9-AW9","v":0},{"$f":"BB9/AW9","v":{"$error":"#DIV/0!"}}]
["GENERAL SERVICE 1,000 TO 4,999 KW - INTERVAL METERS",null,null,null,null,null,null,null,"Electricity Rate First 25,000 kWh",null,null,"Distribution Loss Factor - Secondary Metered Customer > 5,000 kW",null,null,null,null,null,null,null,null,null,null,"VC_LV_Rate",null,null,"Credit Card Convenience Charge","Collection/Disconnection/Load Limiter/Reconnection – if in Community",null,null,null,null,null,null,null,null,null,null,"Centre Wellington Hydro Ltd.","Chapleau Public Utilities Corporation",null,"GENERAL SERVICE 1,000 TO 4,999 KW - INTERVAL METERS","kW",null,null,null,"Total Bill (including HST)",null,null,{"$f":"AW9+AW8","v":0},null,null,{"$f":"AZ9+AZ8","v":0},null,{"$f":"AZ10-AW10","v":0},{"$f":"BB10/AW10","v":{"$error":"#DIV/0!"}}]
{"$rows_left_out":205}
{"sheet":"Sheet1","index":16,"n_rows":0,"n_cols":0,"rows_kept":0,"cut":false,"hidden":true,"merged":[]}

{"sheet":"10a. Proposed ACM Projects","index":17,"n_rows":109,"n_cols":7,"rows_kept":109,"cut":false,"hidden":false,"merged":[[12,2,12,5],[25,6,26,6],[24,2,24,5]]}
[]
[]
[]
[]
[]
[]
[]
[]
[]
[]
{"$rows_left_out":100}
{"sheet":"10b. Proposed ACM ICM Projects","index":18,"n_rows":82,"n_cols":15,"rows_kept":82,"cut":false,"hidden":true,"merged":[[48,3,48,14],[12,3,12,6],[51,1,54,1],[57,3,57,5],[57,6,57,8],[57,9,57,11],[57,12,57,14],[49,3,49,5],[49,6,49,8],[49,9,49,11],[49,12,49,14]]}
[]
[]
[]
[]
[]
[]
[]
[]
[]
[]
{"$rows_left_out":73}
{"sheet":"11. Incremental Capital Adj.","index":19,"n_rows":83,"n_cols":6,"rows_kept":83,"cut":false,"hidden":true,"merged":[]}
[]
[]
[]
[]
[]
[]
[]
[]
[]
[]
{"$rows_left_out":74}
{"sheet":"12. Opt 1-Rate Rider Calc F & V","index":20,"n_rows":25,"n_cols":26,"rows_kept":25,"cut":false,"hidden":true,"merged":[[12,0,12,3],[12,4,12,5]]}
[null,null,null,null,null,null,null,null,null,null,null,null,null,null,null,null,null,null,null,null,null,null,null,null,null,true]
[null,null,null,null,null,null,null,null,null,null,null,null,null,null,null,null,null,null,null,null,null,null,null,null,null,false]
[null,null,null,null,null,null,null,null,null,null,null,null,null,null,null,null,null,null,null,null,null,null,null,null,null,false]
[]
[]
[]
[]
[]
[]
[]
{"$rows_left_out":15}