{"text_format":"1","workbook":"xlsx","n_sheets":11,"sheets":["1. Info","2. Table of Contents","3. Rate Classes","4. RRR Data","5. UTRs and Sub-Transmission","6. Historical Wholesale","7. Current Wholesale","8. Forecast Wholesale","9. RTSR Rates to Forecast","Sheet1","hidden1"],"not_rendered":{"charts":0,"images":3,"macros":1,"external_links":2,"defined_names":20,"comments":0,"pivot_tables":0},"unopened":[],"bounds":{"document_bytes":16777216,"sheet_cells":100000,"rows_first":2000,"rows_last":500,"rows_between":2000,"halvings":0,"cell_chars":16384,"cell_head_chars":4096},"cells_cut":0,"cells_raw":0,"read":"whole","date_system":"1900"}

{"sheet":"1. Info","index":0,"n_rows":76,"n_cols":28,"rows_kept":76,"cut":false,"hidden":false,"merged":[[24,3,24,4],[20,3,20,4],[1,2,1,9],[2,2,2,9],[3,2,3,9],[4,2,4,9],[14,3,14,4],[16,3,16,4]]}
[null,null,null,null,null,null,null,null,null,null,null,null,null,null,null,null,null,null,null,null,null,null,null,null,null,null,null,"Algoma Power Inc."]
[null,null,null,null,null,null,null,null,null,null,null,null,null,null,null,null,null,null,null,null,null,null,null,null,null,null,null,"Atikokan Hydro Inc."]
[null,null,null,null,null,null,null,null,null,null,null,null,null,null,null,null,null,null,null,null,null,null,null,null,null,null,null,"Attawapiskat Power Corporation"]
[null,null,null,null,null,null,null,null,null,null,null,null,null,null,null,null,null,null,null,null,null,null,null,null,null,null,null,"Bluewater Power Distribution Corporation"]
[null,null,null,null,null,null,null,null,null,null,null,null,null,null,null,null,null,null,null,null,null,null,null,null,null,null,null,"Brant County Power Inc."]
[null,null,null,null,null,null,null,null,null,null,null,null,null,null,null,null,null,null,null,null,null,null,null,null,null,null,null,"Brantford Power Inc."]
[null,null,null,null,null,null,null,null,null,null,null,null,null,null,null,null,null,null,null,null,null,null,null,null,null,null,null,"Burlington Hydro Inc."]
[null,null,null,null,null,null,null,null,null,null,null,null,null,null,null,null,null,null,null,null,null,null,null,null,null,null,null,"Cambridge and North Dumfries Hydro Inc."]
[null,null,null,null,null,null,null,null,null,null,null,null,null,null,null,null,null,null,null,null,null,null,null,null,null,null,null,"Canadian Niagara Power Inc."]
[null,null,null,null,null,null,null,null,null,null,null,null,null,null,null,null,null,null,null,null,null,null,null,null,null,null,null,"Centre Wellington Hydro Ltd."]
[null,null,null,null,null,null,null,null,null,null,null,null,null,null,null,null,null,null,null,null,null,null,null,null,null,null,null,"Chapleau Public Utilities Corporation"]
[null,null,null,null,null,null,null,null,null,null,null,null,null,null,null,null,null,null,null,null,null,null,null,null,null,null,null,"COLLUS PowerStream Corp."]
["Drop-down lists are shaded blue; Input cells are shaded green.",null,null,null,null,null,null,null,null,null,null,null,null,null,null,null,null,null,null,null,null,null,null,null,null,null,null,"Cooperative Hydro Embrun Inc."]
[null,null,null,null,null,null,null,null,null,null,null,null,null,null,null,null,null,null,null,null,null,null,null,null,null,null,null,"E.L.K. Energy Inc."]
[null,null,"Utility Name   ","Lakefront Utilities Inc.",null,null,null,null,null,null,null,null,null,null,null,null,null,null,null,null,null,null,null,null,null,null,null,"Enersource Hydro Mississauga Inc."]
[null,null,null,null,null,null,null,null,null,null,null,null,null,null,null,null,null,null,null,null,null,null,null,null,null,null,null,"Entegrus Powerlines Inc."]
[null,null,"Service Territory","Town of Cobourg/Village of Colborne",null,null,null,null,null,null,null,null,null,null,null,null,null,null,null,null,null,null,null,null,null,null,null,"EnWin Utilities Ltd."]
[null,null,null,null,null,null,null,null,null,null,null,null,null,null,null,null,null,null,null,null,null,null,null,null,null,null,null,"Erie Thames Powerlines Corporation"]
[null,null,"Assigned EB Number","EB-2016-0000",null,null,null,null,null,null,null,null,null,null,null,null,null,null,null,null,null,null,null,null,null,null,null,"Espanola Regional Hydro Distribution Corporation"]
[null,null,null,null,null,null,null,null,null,null,null,null,null,null,null,null,null,null,null,null,null,null,null,null,null,null,null,"Essex Powerlines Corporation"]
[null,null,"Name and Title","Adam Giddings, Manager of Regulatory and Finance",null,null,null,null,null,null,null,null,null,null,null,null,null,null,null,null,null,null,null,null,null,null,null,"Festival Hydro Inc."]
[null,null,null,null,null,null,null,null,null,null,null,null,null,null,null,null,null,null,null,null,null,null,null,null,null,null,null,"Fort Albany Power Corporation"]
[null,null,"Phone Number","905-372-2193 ext:5242",null,null,null,null,null,null,null,null,null,null,null,null,null,null,null,null,null,null,null,null,null,null,null,"Fort Frances Power Corporation"]
[null,null,null,null,null,null,null,null,null,null,null,null,null,null,null,null,null,null,null,null,null,null,null,null,null,null,null,"Greater Sudbury Hydro Inc."]
[null,null,"Email Address","agiddings@lusi.on.ca",null,null,null,null,null,null,null,null,null,null,null,null,null,null,null,null,null,null,null,null,null,null,null,"Grimsby Power Inc."]
[null,null,null,null,null,null,null,null,null,null,null,null,null,null,null,null,null,null,null,null,null,null,null,null,null,null,null,"Guelph Hydro Electric Systems Inc."]
[null,null,"Date",null,null,null,null,null,null,null,null,null,null,null,null,null,null,null,null,null,null,null,null,null,null,null,null,"Haldimand County Hydro Inc."]
[null,null,null,null,null,null,null,null,null,null,null,null,null,null,null,null,null,null,null,null,null,null,null,null,null,null,null,"Halton Hills Hydro Inc."]
[null,null,"Last COS Re-based Year",2012,null,null,null,null,null,null,null,null,null,null,null,null,null,null,null,null,null,null,null,null,null,null,null,"Hearst Power Distribution Company Limited"]
[null,null,null,null,null,null,null,null,null,null,null,null,null,null,null,null,null,null,null,null,null,null,null,null,null,null,null,"Horizon Utilities Corporation"]
{"$rows_left_out":47}
{"sheet":"2. Table of Contents","index":1,"n_rows":28,"n_cols":9,"rows_kept":28,"cut":false,"hidden":false,"merged":[]}
[]
[]
[]
[]
[]
[]
[]
[]
[]
[]
[]
[]
[]
[]
[]
[]
[]
[]
[]
[null,null,null,"1. Info",null,null,null,null,"6. Historical Wholesale"]
[]
[null,null,null,"2. Table of Contents",null,null,null,null,"7. Current Wholesale"]
[]
[null,null,null,"3. Rate Classes",null,null,null,null,"8. Forecast Wholesale"]
[]
[null,null,null,"4. RRR Data",null,null,null,null,"9. RTSR Rates to Forecast"]
[]
[null,null,null,"5. UTRs and Sub-Transmission"]

{"sheet":"3. Rate Classes","index":2,"n_rows":100,"n_cols":23,"rows_kept":100,"cut":false,"hidden":false,"merged":[[12,2,12,8]]}
[]
[]
[]
[]
[]
[]
[]
[]
[]
[]
[]
[]
[null,null,"1.  Select the appropriate rate classes that appear on your most recent Board-Approved Tariff of Rates and Charges.\n2.  Enter the RTS Network and Connection Rate as it appears on the Tariff of Rates and Charges"]
[]
[null,null,"Rate Class",null,"Unit",null,"RTSR-Network",null,"RTSR-Connection"]
[]
[null,null,"Residential",null,"kWh",null,5.8999999999999999E-3,null,4.4999999999999997E-3,null,null,{"$f":"IF(OR(ISBLANK(C17), ISERROR(FIND(\"Choose\", C17))=FALSE), 0, 1)","v":1},{"$f":"\"C\" & ROW(C17)","v":"C17"},{"$f":"IF(OR(C17=\"General Service Intermediate Rate Class 1,000 To 4,999 kW (formerly General Service > 50 kW Customers)\", C17=\"General Service Intermediate Rate Class 1,000 To 4,999 kW (formerly Large Use Customers)\"), \"x\", \"\")","v":""},null,null,null,null,null,null,null,null,"Choose Rate Class"]
[null,null,"General Service Less Than 50 kW",null,"kWh",null,5.4000000000000003E-3,null,4.1000000000000003E-3,null,null,1,"C18",{"$f":"IF(OR(C18=\"General Service Intermediate Rate Class 1,000 To 4,999 kW (formerly General Service > 50 kW Customers)\", C18=\"General Service Intermediate Rate Class 1,000 To 4,999 kW (formerly Large Use Customers)\"), \"x\", \"\")","v":""},null,null,null,null,null,null,null,null,"Residential"]
[null,null,"General Service 50 to 2,999 kW",null,"kW",null,2.1728999999999998,null,1.6392,null,null,1,"C19","",null,null,null,null,null,null,null,null,"Residential Regular"]
[null,null,"General Service 3,000 to 4,999 kW",null,"kW",null,2.4302000000000001,null,1.9334,null,null,1,"C20","",null,null,null,null,null,null,null,null,"Residential Urban"]
[null,null,"Street Lighting",null,"kW",null,1.6388,null,1.2672000000000001,null,null,1,"C21","",null,null,null,null,null,null,null,null,"Residential Urban Year-Round"]
[null,null,"Sentinel Lighting",null,"kW",null,1.6468,null,1.2937000000000001,null,null,1,"C22","",null,null,null,null,null,null,null,null,"Residential Suburban"]
[null,null,"Unmetered Scattered Load",null,"kWh",null,6.1999999999999998E-3,null,5.1000000000000004E-3,null,null,1,"C23","",null,null,null,null,null,null,null,null,"Residential Suburban Seasonal"]
[null,null,"Choose Rate Class",null,null,null,null,null,null,null,null,0,"C24","",null,null,null,null,null,null,null,null,"Residential Suburban Year Round"]
[null,null,"Choose Rate Class",null,null,null,null,null,null,null,null,0,"C25","",null,null,null,null,null,null,null,null,"Residential - Time of Use"]
[null,null,"Choose Rate Class",null,null,null,null,null,null,null,null,0,"C26","",null,null,null,null,null,null,null,null,"Residential - Hensall"]
[null,null,"Choose Rate Class",null,null,null,null,null,null,null,null,0,"C27","",null,null,null,null,null,null,null,null,"Residential – High Density [R1]"]
[null,null,"Choose Rate Class",null,null,null,null,null,null,null,null,0,"C28","",null,null,null,null,null,null,null,null,"Residential – Normal Density [R2]"]
[null,null,"Choose Rate Class",null,null,null,null,null,null,null,null,0,"C29","",null,null,null,null,null,null,null,null,"Seasonal Residential – High Density [R3]"]
[null,null,"Choose Rate Class",null,null,null,null,null,null,null,null,0,"C30","",null,null,null,null,null,null,null,null,"Seasonal Residential – Normal Density [R4]"]
{"$rows_left_out":71}
{"sheet":"4. RRR Data","index":3,"n_rows":30,"n_cols":9,"rows_kept":30,"cut":false,"hidden":false,"merged":[[12,1,12,8]]}
[]
[]
[]
[]
[]
[]
[]
[]
[]
[]
[]
[]
[]
[]
[null,"Rate Class","Rate Description","Unit","Rate","Non-Loss Adjusted Metered kWh","Non-Loss Adjusted Metered kW","Applicable \nLoss Factor\neg: (1.0325)","Loss Adjusted Billed kWh"]
[]
[null,"Residential","RTSR - Network","kWh",5.8999999999999999E-3,77564089.09649004,null,1.0441,{"$f":"F17*H17","v":80984665.425645247}]
[null,"Residential","RTSR - Connection","kWh",4.4999999999999997E-3,77564089.09649004,null,1.0441,{"$f":"F18*H18","v":80984665.425645247}]
[null,"General Service Less Than 50 kW","RTSR - Network","kWh",5.4000000000000003E-3,32059727.781671293,null,1.0441,{"$f":"F19*H19","v":33473561.776842996}]
[null,"General Service Less Than 50 kW","RTSR - Connection","kWh",4.1000000000000003E-3,32059727.781671293,null,1.0441,{"$f":"F20*H20","v":33473561.776842996}]
[null,"General Service 50 to 2,999 kW","RTSR - Network","kW",2.1728999999999998,114771267.828899,289868.64584270574]
[null,"General Service 50 to 2,999 kW","RTSR - Connection","kW",1.6392,114771267.828899,289868.64584270574]
[null,"General Service 3,000 to 4,999 kW","RTSR - Network","kW",2.4302000000000001,14825705.435797453,39488.800157330261]
[null,"General Service 3,000 to 4,999 kW","RTSR - Connection","kW",1.9334,14825705.435797453,39488.800157330261]
[null,"Street Lighting","RTSR - Network","kW",1.6388,1428548.0796316436,3837.2665920832246]
[null,"Street Lighting","RTSR - Connection","kW",1.2672000000000001,1428548.0796316436,3837.2665920832246]
[null,"Sentinel Lighting","RTSR - Network","kW",1.6468,43471.550241087163,132.26609235784815]
[null,"Sentinel Lighting","RTSR - Connection","kW",1.2937000000000001,43471.550241087163,132.26609235784815]
[null,"Unmetered Scattered Load","RTSR - Network","kWh",6.1999999999999998E-3,597466.44663356245,null,1.0441,{"$f":"F29*H29","v":623814.71693010256}]
[null,"Unmetered Scattered Load","RTSR - Connection","kWh",5.1000000000000004E-3,597466.44663356245,null,1.0441,{"$f":"F30*H30","v":623814.71693010256}]
{"$rows_left_out":1}
{"sheet":"5. UTRs and Sub-Transmission","index":4,"n_rows":95,"n_cols":9,"rows_kept":95,"cut":false,"hidden":false,"merged":[]}
[]
[]
[]
[]
[]
[]
[]
[]
[]
[]
[]
[]
[]
[]
[]
[]
[]
[null,"Uniform Transmission Rates","Unit",null,"Effective \nJanuary 1, 2014",null,"Effective \nJanuary 1, 2015",null,"Effective \nJanuary 1, 2016"]
[]
[null,"Rate Description",null,null,"Rate",null,"Rate",null,"Rate"]
[]
[null,"Network Service Rate","kW",null,3.82,null,3.78,null,3.66]
[]
[null,"Line Connection Service Rate","kW",null,0.82,null,0.86,null,0.87]
[]
[null,"Transformation Connection Service Rate","kW",null,1.98,null,2,null,2.02]
[]
[]
[null,"Hydro One Sub-Transmission Rates","Unit",null,"Effective \nJanuary 1, 2014 to April 30, 2015",null,"Effective \nMay 1, 2015",null,"Effective \nJanuary 1, 2016"]
[]
{"$rows_left_out":66}
{"sheet":"6. Historical Wholesale","index":5,"n_rows":117,"n_cols":16,"rows_kept":117,"cut":false,"hidden":false,"merged":[[95,7,95,9],[95,11,95,13],[96,7,96,9],[96,11,96,13],[20,3,20,5],[20,7,20,9],[20,11,20,13],[96,3,96,5],[38,3,38,5],[38,7,38,9],[38,11,38,13],[95,3,95,5],[57,3,57,5],[57,7,57,9],[57,11,57,13],[76,3,76,5],[76,7,76,9],[76,11,76,13]]}
[]
[]
[]
[]
[]
[]
[]
[]
[]
[]
[]
[]
[]
[]
[]
[]
[]
[]
[]
[]
[null,"IESO",null,"Network",null,null,null,"Line Connection",null,null,null,"Transformation Connection",null,null,null,"Total Line"]
[null,"Month",null,"Units Billed","Rate","Amount",null,"Units Billed","Rate","Amount",null,"Units Billed","Rate","Amount",null,"Amount"]
[]
[null,"January",null,null,{"$f":"IF(D24<>0,F24/D24,0)","v":0},null,null,null,{"$f":"IF(H24<>0,J24/H24,0)","v":0},null,null,null,{"$f":"IF(L24<>0,N24/L24,0)","v":0},null,null,{"$f":"J24+N24","v":0}]
[null,"February",null,null,{"$f":"IF(D25<>0,F25/D25,0)","v":0},null,null,null,{"$f":"IF(H25<>0,J25/H25,0)","v":0},null,null,null,{"$f":"IF(L25<>0,N25/L25,0)","v":0},null,null,0]
[null,"March",null,null,0,null,null,null,0,null,null,null,0,null,null,0]
[null,"April",null,null,0,null,null,null,0,null,null,null,0,null,null,0]
[null,"May",null,null,0,null,null,null,0,null,null,null,0,null,null,0]
[null,"June",null,null,0,null,null,null,0,null,null,null,0,null,null,0]
[null,"July",null,null,0,null,null,null,0,null,null,null,0,null,null,0]
{"$rows_left_out":88}
{"sheet":"7. Current Wholesale","index":6,"n_rows":117,"n_cols":16,"rows_kept":117,"cut":false,"hidden":false,"merged":[[12,1,12,11],[19,3,19,5],[19,7,19,9],[19,11,19,13],[38,3,38,5],[38,7,38,9],[38,11,38,13],[96,7,96,9],[96,11,96,13],[20,3,20,5],[20,7,20,9],[20,11,20,13],[96,3,96,5],[95,3,95,5],[95,7,95,9],[95,11,95,13],[57,3,57,5],[57,7,57,9],[57,11,57,13],[76,3,76,5],[76,7,76,9],[76,11,76,13]]}
[]
[]
[]
[]
[]
[]
[]
[]
[]
[]
[]
[]
[null,"The purpose of this sheet is to calculate the expected billing when current 2015 Uniform Transmission Rates are applied against historical 2014 transmission units."]
[]
[]
[]
[]
[]
[]
[null,"IESO",null,"Network",null,null,null,"Line Connection",null,null,null,"Transformation Connection",null,null,null,"Total Line"]
[]
[null,"Month",null,"Units Billed","Rate","Amount",null,"Units Billed","Rate","Amount",null,"Units Billed","Rate","Amount",null,"Amount"]
[]
[null,"January",null,{"$f":"'6. Historical Wholesale'!D24","v":0},{"$f":"'5. UTRs and Sub-Transmission'!G22","v":3.78},{"$f":"D24*E24","v":0},null,{"$f":"'6. Historical Wholesale'!H24","v":0},{"$f":"'5. UTRs and Sub-Transmission'!G24","v":0.86},{"$f":"H24*I24","v":0},null,{"$f":"'6. Historical Wholesale'!L24","v":0},{"$f":"'5. UTRs and Sub-Transmission'!G26","v":2},{"$f":"L24*M24","v":0},null,{"$f":"J24+N24","v":0}]
[null,"February",null,{"$f":"'6. Historical Wholesale'!D25","v":0},{"$f":"E24","v":3.78},{"$f":"D25*E25","v":0},null,{"$f":"'6. Historical Wholesale'!H25","v":0},{"$f":"I24","v":0.86},{"$f":"H25*I25","v":0},null,{"$f":"'6. Historical Wholesale'!L25","v":0},{"$f":"M24","v":2},{"$f":"L25*M25","v":0},null,0]
[null,"March",null,{"$f":"'6. Historical Wholesale'!D26","v":0},{"$f":"E25","v":3.78},0,null,{"$f":"'6. Historical Wholesale'!H26","v":0},{"$f":"I25","v":0.86},0,null,{"$f":"'6. Historical Wholesale'!L26","v":0},{"$f":"M25","v":2},0,null,0]
[null,"April",null,{"$f":"'6. Historical Wholesale'!D27","v":0},3.78,0,null,{"$f":"'6. Historical Wholesale'!H27","v":0},0.86,0,null,{"$f":"'6. Historical Wholesale'!L27","v":0},2,0,null,0]
[null,"May",null,{"$f":"'6. Historical Wholesale'!D28","v":0},3.78,0,null,{"$f":"'6. Historical Wholesale'!H28","v":0},0.86,0,null,{"$f":"'6. Historical Wholesale'!L28","v":0},2,0,null,0]
[null,"June",null,{"$f":"'6. Historical Wholesale'!D29","v":0},3.78,0,null,{"$f":"'6. Historical Wholesale'!H29","v":0},0.86,0,null,{"$f":"'6. Historical Wholesale'!L29","v":0},2,0,null,0]
[null,"July",null,{"$f":"'6. Historical Wholesale'!D30","v":0},3.78,0,null,{"$f":"'6. Historical Wholesale'!H30","v":0},0.86,0,null,{"$f":"'6. Historical Wholesale'!L30","v":0},2,0,null,0]
{"$rows_left_out":88}
{"sheet":"8. Forecast Wholesale","index":7,"n_rows":117,"n_cols":16,"rows_kept":117,"cut":false,"hidden":false,"merged":[[12,1,12,12],[19,3,19,5],[19,7,19,9],[19,11,19,13],[38,3,38,5],[38,7,38,9],[38,11,38,13],[96,7,96,9],[96,11,96,13],[20,3,20,5],[20,7,20,9],[20,11,20,13],[96,3,96,5],[95,3,95,5],[95,7,95,9],[95,11,95,13],[57,3,57,5],[57,7,57,9],[57,11,57,13],[76,3,76,5],[76,7,76,9],[76,11,76,13]]}
[]
[]
[]
[]
[]
[]
[]
[]
[]
[]
[]
[]
[null,"The purpose of this sheet is to calculate the expected billing when forecasted 2016 Uniform Transmission Rates are applied against historical 2014 transmission units."]
[]
[]
[]
[]
[]
[]
[null,"IESO",null,"Network",null,null,null,"Line Connection",null,null,null,"Transformation Connection",null,null,null,"Total Line"]
[]
[null,"Month",null,"Units Billed","Rate","Amount",null,"Units Billed","Rate","Amount",null,"Units Billed","Rate","Amount",null,"Amount"]
[]
[null,"January",null,{"$f":"'6. Historical Wholesale'!D24","v":0},{"$f":"'5. UTRs and Sub-Transmission'!I22","v":3.66},{"$f":"D24*E24","v":0},null,{"$f":"'6. Historical Wholesale'!H24","v":0},{"$f":"'5. UTRs and Sub-Transmission'!I24","v":0.87},{"$f":"H24*I24","v":0},null,{"$f":"'6. Historical Wholesale'!L24","v":0},{"$f":"'5. UTRs and Sub-Transmission'!I26","v":2.02},{"$f":"L24*M24","v":0},null,{"$f":"J24+N24","v":0}]
[null,"February",null,{"$f":"'6. Historical Wholesale'!D25","v":0},{"$f":"E24","v":3.66},0,null,{"$f":"'6. Historical Wholesale'!H25","v":0},{"$f":"I24","v":0.87},0,null,{"$f":"'6. Historical Wholesale'!L25","v":0},{"$f":"M24","v":2.02},0,null,0]
[null,"March",null,{"$f":"'6. Historical Wholesale'!D26","v":0},3.66,0,null,{"$f":"'6. Historical Wholesale'!H26","v":0},0.87,0,null,{"$f":"'6. Historical Wholesale'!L26","v":0},2.02,0,null,0]
[null,"April",null,{"$f":"'6. Historical Wholesale'!D27","v":0},3.66,0,null,{"$f":"'6. Historical Wholesale'!H27","v":0},0.87,0,null,{"$f":"'6. Historical Wholesale'!L27","v":0},2.02,0,null,0]
[null,"May",null,{"$f":"'6. Historical Wholesale'!D28","v":0},3.66,0,null,{"$f":"'6. Historical Wholesale'!H28","v":0},0.87,0,null,{"$f":"'6. Historical Wholesale'!L28","v":0},2.02,0,null,0]
[null,"June",null,{"$f":"'6. Historical Wholesale'!D29","v":0},3.66,0,null,{"$f":"'6. Historical Wholesale'!H29","v":0},0.87,0,null,{"$f":"'6. Historical Wholesale'!L29","v":0},2.02,0,null,0]
[null,"July",null,{"$f":"'6. Historical Wholesale'!D30","v":0},3.66,0,null,{"$f":"'6. Historical Wholesale'!H30","v":0},0.87,0,null,{"$f":"'6. Historical Wholesale'!L30","v":0},2.02,0,null,0]
{"$rows_left_out":88}
{"sheet":"9. RTSR Rates to Forecast","index":8,"n_rows":56,"n_cols":10,"rows_kept":56,"cut":false,"hidden":false,"merged":[]}
[]
[]
[]
[]
[]
[]
[]
[]
[]
[]
[]
[]
["The purpose of this sheet is to re-align the current RTS Network Rates to recover current wholesale network costs."]
[]
["Rate Class","Rate Description","Unit","Current RTSR-Network","Loss Adjusted Billed kWh","Billed kW","Billed Amount","Billed Amount %","Current Wholesale Billing","Adjusted RTSR Network"]
[]
["Residential","RTSR - Network","kWh",5.8999999999999999E-3,80984665.425645247,null,{"$f":"ROUND(D17*E17, 2)","v":477809.53},{"$f":"G17/1394762","v":0.34257423847222684},{"$f":"H17*total_current_wholesale_network","v":538902.58095477824},{"$f":"IF(ISERROR(I17/E17), 0, I17/E17)","v":6.6543780618512635E-3}]
["General Service Less Than 50 kW","RTSR - Network","kWh",5.4000000000000003E-3,33473561.776842996,null,{"$f":"ROUND(D18*E18, 2)","v":180757.23},{"$f":"G18/1394762","v":0.12959718575642296},{"$f":"H18*total_current_wholesale_network","v":203868.97216812827},{"$f":"IF(ISERROR(I18/E18), 0, I18/E18)","v":6.0904475456557113E-3}]
["General Service 50 to 2,999 kW","RTSR - Network","kW",2.1728999999999998,null,289868.64584270574,{"$f":"ROUND(D19*F19, 2)","v":629855.57999999996},{"$f":"G19/1394762","v":0.45158642119587422},{"$f":"H19*total_current_wholesale_network","v":710389.34215223521},{"$f":"IF(ISERROR(I19/F19), 0, I19/F19)","v":2.4507284673269587}]
["General Service 3,000 to 4,999 kW","RTSR - Network","kW",2.4302000000000001,null,39488.800157330261,{"$f":"ROUND(D20*F20, 2)","v":95965.68},{"$f":"G20/1394762","v":6.8804340812267606E-2},{"$f":"H20*total_current_wholesale_network","v":108235.91700877194},{"$f":"IF(ISERROR(I20/F20), 0, I20/F20)","v":2.740926961000111}]
["Street Lighting","RTSR - Network","kW",1.6388,null,3837.2665920832246,{"$f":"ROUND(D21*F21, 2)","v":6288.51},{"$f":"G21/1394762","v":4.5086616928192765E-3},{"$f":"H21*total_current_wholesale_network","v":7092.5631587129119},{"$f":"IF(ISERROR(I21/F21), 0, I21/F21)","v":1.8483373486079344}]
["Sentinel Lighting","RTSR - Network","kW",1.6468,null,132.26609235784815,{"$f":"ROUND(D22*F22, 2)","v":217.82},{"$f":"G22/1394762","v":1.5617001323523297E-4},{"$f":"H22*total_current_wholesale_network","v":245.67061310721402},{"$f":"IF(ISERROR(I22/F22), 0, I22/F22)","v":1.8573967728822594}]
["Unmetered Scattered Load","RTSR - Network","kWh",6.1999999999999998E-3,623814.71693010256,null,{"$f":"ROUND(D23*E23, 2)","v":3867.65},{"$f":"G23/1394762","v":2.772982057153837E-3},{"$f":"H23*total_current_wholesale_network","v":4362.1703552663503},{"$f":"IF(ISERROR(I23/E23), 0, I23/E23)","v":6.9927339591045979E-3}]
[]
["The purpose of this table is to re-align the current RTS Connection Rates to recover current wholesale connection costs."]
["Rate Class","Rate Description","Unit","Current RTSR-Connection","Loss Adjusted Billed kWh","Billed kW","Billed Amount","Billed Amount %","Current Wholesale Billing","Adjusted RTSR-Connection"]
[]
["Residential","RTSR - Connection","kWh",4.4999999999999997E-3,80984665.425645247,null,{"$f":"ROUND(D28*E28, 2)","v":364430.99},{"$f":"G28/1061388.07","v":0.34335319973965789},{"$f":"H28*Total_Current_Wholesale_Lineplus","v":409943.84254561766},{"$f":"IF(ISERROR(I28/E28), 0, I28/E28)","v":5.0619934081471375E-3}]
["General Service Less Than 50 kW","RTSR - Connection","kWh",4.1000000000000003E-3,33473561.776842996,null,{"$f":"ROUND(D29*E29, 2)","v":137241.60000000001},{"$f":"G29/1061388.07","v":0.12930388411092655},{"$f":"H29*Total_Current_Wholesale_Lineplus","v":154381.35176459237},{"$f":"IF(ISERROR(I29/E29), 0, I29/E29)","v":4.6120383840178416E-3}]
["General Service 50 to 2,999 kW","RTSR - Connection","kW",1.6392,null,289868.64584270574,{"$f":"ROUND(D30*F30, 2)","v":475152.68},{"$f":"G30/1061388.07","v":0.44767102008222115},{"$f":"H30*Total_Current_Wholesale_Lineplus","v":534493.28070329095},{"$f":"IF(ISERROR(I30/F30), 0, I30/F30)","v":1.8439154712625534}]
{"$rows_left_out":27}
{"sheet":"Sheet1","index":9,"n_rows":0,"n_cols":0,"rows_kept":0,"cut":false,"hidden":false,"merged":[]}

{"sheet":"hidden1","index":10,"n_rows":22,"n_cols":2,"rows_kept":22,"cut":false,"hidden":true,"merged":[]}
[{"$f":"IF('3. Rate Classes'!L17=1, '3. Rate Classes'!C17, \"\")","v":"Residential"},1]
[{"$f":"IF('3. Rate Classes'!L18=1, '3. Rate Classes'!C18, \"\")","v":"General Service Less Than 50 kW"},2]
[{"$f":"IF('3. Rate Classes'!L19=1, '3. Rate Classes'!C19, \"\")","v":"General Service 50 to 2,999 kW"},3]
[{"$f":"IF('3. Rate Classes'!L20=1, '3. Rate Classes'!C20, \"\")","v":"General Service 3,000 to 4,999 kW"},4]
[{"$f":"IF('3. Rate Classes'!L21=1, '3. Rate Classes'!C21, \"\")","v":"Street Lighting"},5]
[{"$f":"IF('3. Rate Classes'!L22=1, '3. Rate Classes'!C22, \"\")","v":"Sentinel Lighting"},6]
[{"$f":"IF('3. Rate Classes'!L23=1, '3. Rate Classes'!C23, \"\")","v":"Unmetered Scattered Load"},7]
[{"$f":"IF('3. Rate Classes'!L24=1, '3. Rate Classes'!C24, \"\")","v":""},8]
[{"$f":"IF('3. Rate Classes'!L25=1, '3. Rate Classes'!C25, \"\")","v":""},9]
[{"$f":"IF('3. Rate Classes'!L26=1, '3. Rate Classes'!C26, \"\")","v":""},10]
[{"$f":"IF('3. Rate Classes'!L27=1, '3. Rate Classes'!C27, \"\")","v":""},11]
[{"$f":"IF('3. Rate Classes'!L28=1, '3. Rate Classes'!C28, \"\")","v":""},12]
[{"$f":"IF('3. Rate Classes'!L29=1, '3. Rate Classes'!C29, \"\")","v":""},13]
[{"$f":"IF('3. Rate Classes'!L30=1, '3. Rate Classes'!C30, \"\")","v":""},14]
[{"$f":"IF('3. Rate Classes'!L31=1, '3. Rate Classes'!C31, \"\")","v":""},15]
[{"$f":"IF('3. Rate Classes'!L32=1, '3. Rate Classes'!C32, \"\")","v":""},16]
[{"$f":"IF('3. Rate Classes'!L33=1, '3. Rate Classes'!C33, \"\")","v":""},17]
[{"$f":"IF('3. Rate Classes'!L34=1, '3. Rate Classes'!C34, \"\")","v":""},18]
[{"$f":"IF('3. Rate Classes'!L35=1, '3. Rate Classes'!C35, \"\")","v":""},19]
[{"$f":"IF('3. Rate Classes'!L36=1, '3. Rate Classes'!C36, \"\")","v":""},20]
[{"$f":"IF('3. Rate Classes'!L37=1, '3. Rate Classes'!C37, \"\")","v":""},21]
[{"$f":"IF('3. Rate Classes'!L38=1, '3. Rate Classes'!C38, \"\")","v":""},22]