{"text_format":"1","workbook":"xlsx","n_sheets":10,"sheets":["1. Info","2. Table of Contents","3. Rate Classes","4. RRR Data","5. UTRs and Sub-Transmission","6. Historical Wholesale","7. Current Wholesale","8. Forecast Wholesale","9. RTSR Rates to Forecast","hidden1"],"not_rendered":{"charts":0,"images":3,"macros":1,"external_links":2,"defined_names":20,"comments":0,"pivot_tables":0},"unopened":[],"bounds":{"document_bytes":16777216,"sheet_cells":100000,"rows_first":2000,"rows_last":500,"rows_between":2000,"halvings":0,"cell_chars":16384,"cell_head_chars":4096},"cells_cut":0,"cells_raw":0,"read":"whole","date_system":"1900"}

{"sheet":"1. Info","index":0,"n_rows":74,"n_cols":28,"rows_kept":74,"cut":false,"hidden":false,"merged":[[24,3,24,4],[20,3,20,4],[1,2,1,9],[2,2,2,9],[3,2,3,9],[4,2,4,9],[14,3,14,4],[16,3,16,4]]}
[null,null,null,null,null,null,null,null,null,null,null,null,null,null,null,null,null,null,null,null,null,null,null,null,null,null,null,"Algoma Power Inc."]
[null,null,null,null,null,null,null,null,null,null,null,null,null,null,null,null,null,null,null,null,null,null,null,null,null,null,null,"Atikokan Hydro Inc."]
[null,null,null,null,null,null,null,null,null,null,null,null,null,null,null,null,null,null,null,null,null,null,null,null,null,null,null,"Attawapiskat Power Corporation"]
[null,null,null,null,null,null,null,null,null,null,null,null,null,null,null,null,null,null,null,null,null,null,null,null,null,null,null,"Bluewater Power Distribution Corporation"]
[null,null,null,null,null,null,null,null,null,null,null,null,null,null,null,null,null,null,null,null,null,null,null,null,null,null,null,"Brantford Power Inc."]
[null,null,null,null,null,null,null,null,null,null,null,null,null,null,null,null,null,null,null,null,null,null,null,null,null,null,null,"Burlington Hydro Inc."]
[null,null,null,null,null,null,null,null,null,null,null,null,null,null,null,null,null,null,null,null,null,null,null,null,null,null,null,"Canadian Niagara Power Inc."]
[null,null,null,null,null,null,null,null,null,null,null,null,null,null,null,null,null,null,null,null,null,null,null,null,null,null,null,"Centre Wellington Hydro Ltd."]
[null,null,null,null,null,null,null,null,null,null,null,null,null,null,null,null,null,null,null,null,null,null,null,null,null,null,null,"Chapleau Public Utilities Corporation"]
[null,null,null,null,null,null,null,null,null,null,null,null,null,null,null,null,null,null,null,null,null,null,null,null,null,null,null,"COLLUS PowerStream Corp."]
[null,null,null,null,null,null,null,null,null,null,null,null,null,null,null,null,null,null,null,null,null,null,null,null,null,null,null,"Cooperative Hydro Embrun Inc."]
[null,null,null,null,null,null,null,null,null,null,null,null,null,null,null,null,null,null,null,null,null,null,null,null,null,null,null,"E.L.K. Energy Inc."]
["Drop-down lists are shaded blue; Input cells are shaded green.",null,null,null,null,null,null,null,null,null,null,null,null,null,null,null,null,null,null,null,null,null,null,null,null,null,null,"Energy + Inc."]
[null,null,null,null,null,null,null,null,null,null,null,null,null,null,null,null,null,null,null,null,null,null,null,null,null,null,null,"Enersource Hydro Mississauga Inc."]
[null,null,"Utility Name   ","Hydro One Networks Inc.",null,null,null,null,null,null,null,null,null,null,null,null,null,null,null,null,null,null,null,null,null,null,null,"Entegrus Powerlines Inc."]
[null,null,null,null,null,null,null,null,null,null,null,null,null,null,null,null,null,null,null,null,null,null,null,null,null,null,null,"EnWin Utilities Ltd."]
[null,null,"Service Territory","Haldimand Service Territory",null,null,null,null,null,null,null,null,null,null,null,null,null,null,null,null,null,null,null,null,null,null,null,"Erie Thames Powerlines Corporation"]
[null,null,null,null,null,null,null,null,null,null,null,null,null,null,null,null,null,null,null,null,null,null,null,null,null,null,null,"Espanola Regional Hydro Distribution Corporation"]
[null,null,"Assigned EB Number","EB",null,null,null,null,null,null,null,null,null,null,null,null,null,null,null,null,null,null,null,null,null,null,null,"Essex Powerlines Corporation"]
[null,null,null,null,null,null,null,null,null,null,null,null,null,null,null,null,null,null,null,null,null,null,null,null,null,null,null,"Festival Hydro Inc."]
[null,null,"Name and Title","Clement Li, Manager Distribution Pricing",null,null,null,null,null,null,null,null,null,null,null,null,null,null,null,null,null,null,null,null,null,null,null,"Fort Albany Power Corporation"]
[null,null,null,null,null,null,null,null,null,null,null,null,null,null,null,null,null,null,null,null,null,null,null,null,null,null,null,"Fort Frances Power Corporation"]
[null,null,"Phone Number","416-345-5848",null,null,null,null,null,null,null,null,null,null,null,null,null,null,null,null,null,null,null,null,null,null,null,"Greater Sudbury Hydro Inc."]
[null,null,null,null,null,null,null,null,null,null,null,null,null,null,null,null,null,null,null,null,null,null,null,null,null,null,null,"Grimsby Power Inc."]
[null,null,"Email Address","Clement.Li@HydroOne.com",null,null,null,null,null,null,null,null,null,null,null,null,null,null,null,null,null,null,null,null,null,null,null,"Guelph Hydro Electric Systems Inc."]
[null,null,null,null,null,null,null,null,null,null,null,null,null,null,null,null,null,null,null,null,null,null,null,null,null,null,null,"Haldimand County Hydro Inc."]
[null,null,"Date",null,null,null,null,null,null,null,null,null,null,null,null,null,null,null,null,null,null,null,null,null,null,null,null,"Halton Hills Hydro Inc."]
[null,null,null,null,null,null,null,null,null,null,null,null,null,null,null,null,null,null,null,null,null,null,null,null,null,null,null,"Hearst Power Distribution Company Limited"]
[null,null,"Last COS Re-based Year",2014,null,null,null,null,null,null,null,null,null,null,null,null,null,null,null,null,null,null,null,null,null,null,null,"Horizon Utilities Corporation"]
[null,null,null,null,null,null,null,null,null,null,null,null,null,null,null,null,null,null,null,null,null,null,null,null,null,null,null,"Hydro 2000 Inc."]
{"$rows_left_out":45}
{"sheet":"2. Table of Contents","index":1,"n_rows":28,"n_cols":9,"rows_kept":28,"cut":false,"hidden":false,"merged":[]}
[]
[]
[]
[]
[]
[]
[]
[]
[]
[]
[]
[]
[]
[]
[]
[]
[]
[]
[]
[null,null,null,"1. Info",null,null,null,null,"6. Historical Wholesale"]
[]
[null,null,null,"2. Table of Contents",null,null,null,null,"7. Current Wholesale"]
[]
[null,null,null,"3. Rate Classes",null,null,null,null,"8. Forecast Wholesale"]
[]
[null,null,null,"4. RRR Data",null,null,null,null,"9. RTSR Rates to Forecast"]
[]
[null,null,null,"5. UTRs and Sub-Transmission"]

{"sheet":"3. Rate Classes","index":2,"n_rows":100,"n_cols":23,"rows_kept":100,"cut":false,"hidden":false,"merged":[[12,2,12,8]]}
[]
[]
[]
[]
[]
[]
[]
[]
[]
[]
[]
[]
[null,null,"1.  Select the appropriate rate classes that appear on your most recent Board-Approved Tariff of Rates and Charges.\n2.  Enter the RTS Network and Connection Rate as it appears on the Tariff of Rates and Charges"]
[]
[null,null,"Rate Class",null,"Unit",null,"RTSR-Network",null,"RTSR-Connection"]
[]
[null,null,"Embedded Distributor",null,"kW",null,2.9565999999999999,null,2.3933,null,null,{"$f":"IF(OR(ISBLANK(C17), ISERROR(FIND(\"Choose\", C17))=FALSE), 0, 1)","v":1},{"$f":"\"C\" & ROW(C17)","v":"C17"},{"$f":"IF(OR(C17=\"General Service Intermediate Rate Class 1,000 To 4,999 kW (formerly General Service > 50 kW Customers)\", C17=\"General Service Intermediate Rate Class 1,000 To 4,999 kW (formerly Large Use Customers)\"), \"x\", \"\")","v":""},null,null,null,null,null,null,null,null,"Choose Rate Class"]
[null,null,"Choose Rate Class",null,null,null,null,null,null,null,null,0,"C18",{"$f":"IF(OR(C18=\"General Service Intermediate Rate Class 1,000 To 4,999 kW (formerly General Service > 50 kW Customers)\", C18=\"General Service Intermediate Rate Class 1,000 To 4,999 kW (formerly Large Use Customers)\"), \"x\", \"\")","v":""},null,null,null,null,null,null,null,null,"Residential"]
[null,null,"Choose Rate Class",null,null,null,null,null,null,null,null,0,"C19","",null,null,null,null,null,null,null,null,"Residential Regular"]
[null,null,"Choose Rate Class",null,null,null,null,null,null,null,null,0,"C20","",null,null,null,null,null,null,null,null,"Residential Urban"]
[null,null,"Choose Rate Class",null,null,null,null,null,null,null,null,0,"C21","",null,null,null,null,null,null,null,null,"Residential Urban Year-Round"]
[null,null,"Choose Rate Class",null,null,null,null,null,null,null,null,0,"C22","",null,null,null,null,null,null,null,null,"Residential Suburban"]
[null,null,"Choose Rate Class",null,null,null,null,null,null,null,null,0,"C23","",null,null,null,null,null,null,null,null,"Residential Suburban Seasonal"]
[null,null,"Choose Rate Class",null,null,null,null,null,null,null,null,0,"C24","",null,null,null,null,null,null,null,null,"Residential Suburban Year Round"]
[null,null,"Choose Rate Class",null,null,null,null,null,null,null,null,0,"C25","",null,null,null,null,null,null,null,null,"Residential - Time of Use"]
[null,null,"Choose Rate Class",null,null,null,null,null,null,null,null,0,"C26","",null,null,null,null,null,null,null,null,"Residential - Hensall"]
[null,null,"Choose Rate Class",null,null,null,null,null,null,null,null,0,"C27","",null,null,null,null,null,null,null,null,"Residential – High Density [R1]"]
[null,null,"Choose Rate Class",null,null,null,null,null,null,null,null,0,"C28","",null,null,null,null,null,null,null,null,"Residential – Normal Density [R2]"]
[null,null,"Choose Rate Class",null,null,null,null,null,null,null,null,0,"C29","",null,null,null,null,null,null,null,null,"Seasonal Residential – High Density [R3]"]
[null,null,"Choose Rate Class",null,null,null,null,null,null,null,null,0,"C30","",null,null,null,null,null,null,null,null,"Seasonal Residential – Normal Density [R4]"]
{"$rows_left_out":71}
{"sheet":"4. RRR Data","index":3,"n_rows":18,"n_cols":9,"rows_kept":18,"cut":false,"hidden":false,"merged":[[12,1,12,8]]}
[]
[]
[]
[]
[]
[]
[]
[]
[]
[]
[]
[]
[]
[]
[null,"Rate Class","Rate Description","Unit","Rate","Non-Loss Adjusted Metered kWh","Non-Loss Adjusted Metered kW","Applicable \nLoss Factor\neg: (1.0325)","Loss Adjusted Billed kWh"]
[]
[null,"Embedded Distributor","RTSR - Network","kW",2.9565999999999999,71831928,245804,1.0287999999999999]
[null,"Embedded Distributor","RTSR - Connection","kW",2.3933,71831928,245804,1.0287999999999999]

{"sheet":"5. UTRs and Sub-Transmission","index":4,"n_rows":75,"n_cols":10,"rows_kept":75,"cut":false,"hidden":false,"merged":[[69,4,69,5],[71,4,71,5],[74,4,74,5],[73,4,73,5],[50,4,50,5],[52,4,52,5],[54,4,54,5],[56,4,56,5],[65,4,65,5],[67,4,67,5],[28,4,28,5],[17,4,17,5],[33,4,33,5],[19,4,19,5],[21,4,21,5],[23,4,23,5],[25,4,25,5]]}
[]
[]
[]
[]
[]
[]
[]
[]
[]
[]
[]
[]
[]
[]
[]
[]
[]
[null,"Uniform Transmission Rates","Unit",null,2015,null,null,2016,null,2017]
[]
[null,"Rate Description",null,null,"Rate",null,null,"Rate",null,"Rate"]
[]
[null,"Network Service Rate","kW",null,3.78,null,null,3.66,null,3.66]
[]
[null,"Line Connection Service Rate","kW",null,0.86,null,null,0.87,null,0.87]
[]
[null,"Transformation Connection Service Rate","kW",null,2,null,null,2.02,null,2.02]
[]
[]
[null,"Hydro One Sub-Transmission Rates","Unit",null,"2015 - 2016",null,null,2016,null,2017]
[null,null,null,null,"Jan - April 2015","May 2015 - Jan 2016",null,"Feb - Dec 2016"]
{"$rows_left_out":46}
{"sheet":"6. Historical Wholesale","index":5,"n_rows":117,"n_cols":16,"rows_kept":117,"cut":false,"hidden":false,"merged":[[96,7,96,9],[96,11,96,13],[20,3,20,5],[20,7,20,9],[20,11,20,13],[96,3,96,5],[38,3,38,5],[38,7,38,9],[38,11,38,13],[95,3,95,5],[57,3,57,5],[57,7,57,9],[57,11,57,13],[76,3,76,5],[76,7,76,9],[76,11,76,13],[95,7,95,9],[95,11,95,13]]}
[]
[]
[]
[]
[]
[]
[]
[]
[]
[]
[]
[]
[]
[]
[]
[]
[]
[]
[]
[]
[null,"IESO",null,"Network",null,null,null,"Line Connection",null,null,null,"Transformation Connection",null,null,null,"Total Line"]
[null,"Month",null,"Units Billed","Rate","Amount",null,"Units Billed","Rate","Amount",null,"Units Billed","Rate","Amount",null,"Amount"]
[]
[null,"January",null,491.80500000000001,{"$f":"IF(D24<>0,F24/D24,0)","v":3.5705208365104055},1756,null,538.173,{"$f":"IF(H24<>0,J24/H24,0)","v":0.80000297302168633},430.54,null,538.173,{"$f":"IF(L24<>0,N24/L24,0)","v":1.859996692513374},1001,null,{"$f":"J24+N24","v":1431.54}]
[null,"February",null,480.483,{"$f":"IF(D25<>0,F25/D25,0)","v":3.5693250333518565},1715,null,515.98800000000006,{"$f":"IF(H25<>0,J25/H25,0)","v":0.79999922478817331},412.79,null,515.98800000000006,{"$f":"IF(L25<>0,N25/L25,0)","v":1.8600044962285942},959.74,null,1372.53]
[null,"March",null,446.04899999999998,3.5691146040009061,1592,null,460.09800000000001,0.80000347752000656,368.08,null,460.09800000000001,1.8599950445339906,855.78,null,1223.8599999999999]
[null,"April",null,1950.2550000000001,3.5697895916175062,6962,null,1950.2550000000001,0.79999794898615817,1560.2,null,1950.2550000000001,1.8599977951601199,3627.47,null,5187.67]
[null,"May",null,7751.29,3.5699864151644438,27672,null,8975.0400000000009,0.79999977715976744,7180.03,null,8975.0400000000009,1.8599995097514883,16693.57,null,23873.599999999999]
[null,"June",null,9067.76,3.5700106751832865,32372,null,9424.34,0.79999978778354774,7539.47,null,9424.34,1.8599997453402572,17529.27,null,25068.74]
[null,"July",null,412.29,3.5703024570084163,1472,null,9230.16,0.80000021668096766,7384.13,null,9230.16,1.860000260017161,17168.099999999999,null,24552.23]
{"$rows_left_out":88}
{"sheet":"7. Current Wholesale","index":6,"n_rows":117,"n_cols":16,"rows_kept":117,"cut":false,"hidden":false,"merged":[[96,7,96,9],[96,11,96,13],[20,3,20,5],[20,7,20,9],[20,11,20,13],[96,3,96,5],[95,3,95,5],[95,7,95,9],[95,11,95,13],[57,3,57,5],[57,7,57,9],[57,11,57,13],[76,3,76,5],[76,7,76,9],[76,11,76,13],[12,1,12,11],[19,3,19,5],[19,7,19,9],[19,11,19,13],[38,3,38,5],[38,7,38,9],[38,11,38,13]]}
[]
[]
[]
[]
[]
[]
[]
[]
[]
[]
[]
[]
[null,"The purpose of this sheet is to calculate the expected billing when current 2016 Uniform Transmission Rates are applied against historical 2015 transmission units."]
[]
[]
[]
[]
[]
[]
[null,"IESO",null,"Network",null,null,null,"Line Connection",null,null,null,"Transformation Connection",null,null,null,"Total Line"]
[]
[null,"Month",null,"Units Billed","Rate","Amount",null,"Units Billed","Rate","Amount",null,"Units Billed","Rate","Amount",null,"Amount"]
[]
[null,"January",null,{"$f":"'6. Historical Wholesale'!D24","v":491.80500000000001},{"$f":"'5. UTRs and Sub-Transmission'!H22","v":3.66},{"$f":"D24*E24","v":1800.0063},null,{"$f":"'6. Historical Wholesale'!H24","v":538.173},{"$f":"'5. UTRs and Sub-Transmission'!H24","v":0.87},{"$f":"H24*I24","v":468.21051},null,{"$f":"'6. Historical Wholesale'!L24","v":538.173},{"$f":"'5. UTRs and Sub-Transmission'!H26","v":2.02},{"$f":"L24*M24","v":1087.1094600000001},null,{"$f":"J24+N24","v":1555.31997}]
[null,"February",null,{"$f":"'6. Historical Wholesale'!D25","v":480.483},{"$f":"E24","v":3.66},{"$f":"D25*E25","v":1758.5677800000001},null,{"$f":"'6. Historical Wholesale'!H25","v":515.98800000000006},{"$f":"I24","v":0.87},{"$f":"H25*I25","v":448.90956000000006},null,{"$f":"'6. Historical Wholesale'!L25","v":515.98800000000006},{"$f":"M24","v":2.02},{"$f":"L25*M25","v":1042.2957600000002},null,1491.2053200000003]
[null,"March",null,{"$f":"'6. Historical Wholesale'!D26","v":446.04899999999998},{"$f":"E25","v":3.66},1632.53934,null,{"$f":"'6. Historical Wholesale'!H26","v":460.09800000000001},{"$f":"I25","v":0.87},400.28525999999999,null,{"$f":"'6. Historical Wholesale'!L26","v":460.09800000000001},{"$f":"M25","v":2.02},929.39796000000001,null,1329.6832199999999]
[null,"April",null,{"$f":"'6. Historical Wholesale'!D27","v":1950.2550000000001},3.66,7137.9333000000006,null,{"$f":"'6. Historical Wholesale'!H27","v":1950.2550000000001},0.87,1696.7218500000001,null,{"$f":"'6. Historical Wholesale'!L27","v":1950.2550000000001},2.02,3939.5151000000001,null,5636.2369500000004]
[null,"May",null,{"$f":"'6. Historical Wholesale'!D28","v":7751.29},3.66,28369.721400000002,null,{"$f":"'6. Historical Wholesale'!H28","v":8975.0400000000009},0.87,7808.2848000000004,null,{"$f":"'6. Historical Wholesale'!L28","v":8975.0400000000009},2.02,18129.580800000003,null,25937.865600000005]
[null,"June",null,{"$f":"'6. Historical Wholesale'!D29","v":9067.76},3.66,33188.001600000003,null,{"$f":"'6. Historical Wholesale'!H29","v":9424.34},0.87,8199.1758000000009,null,{"$f":"'6. Historical Wholesale'!L29","v":9424.34},2.02,19037.166799999999,null,27236.3426]
[null,"July",null,{"$f":"'6. Historical Wholesale'!D30","v":412.29},3.66,1508.9814000000001,null,{"$f":"'6. Historical Wholesale'!H30","v":9230.16},0.87,8030.2392,null,{"$f":"'6. Historical Wholesale'!L30","v":9230.16},2.02,18644.923200000001,null,26675.162400000001]
{"$rows_left_out":88}
{"sheet":"8. Forecast Wholesale","index":7,"n_rows":117,"n_cols":16,"rows_kept":117,"cut":false,"hidden":false,"merged":[[96,7,96,9],[96,11,96,13],[20,3,20,5],[20,7,20,9],[20,11,20,13],[96,3,96,5],[95,3,95,5],[95,7,95,9],[95,11,95,13],[57,3,57,5],[57,7,57,9],[57,11,57,13],[76,3,76,5],[76,7,76,9],[76,11,76,13],[12,1,12,12],[19,3,19,5],[19,7,19,9],[19,11,19,13],[38,3,38,5],[38,7,38,9],[38,11,38,13]]}
[]
[]
[]
[]
[]
[]
[]
[]
[]
[]
[]
[]
[null,"The purpose of this sheet is to calculate the expected billing when forecasted 2017 Uniform Transmission Rates are applied against historical 2015 transmission units."]
[]
[]
[]
[]
[]
[]
[null,"IESO",null,"Network",null,null,null,"Line Connection",null,null,null,"Transformation Connection",null,null,null,"Total Line"]
[]
[null,"Month",null,"Units Billed","Rate","Amount",null,"Units Billed","Rate","Amount",null,"Units Billed","Rate","Amount",null,"Amount"]
[]
[null,"January",null,{"$f":"'6. Historical Wholesale'!D24","v":491.80500000000001},{"$f":"'5. UTRs and Sub-Transmission'!J22","v":3.66},{"$f":"D24*E24","v":1800.0063},null,{"$f":"'6. Historical Wholesale'!H24","v":538.173},{"$f":"'5. UTRs and Sub-Transmission'!J24","v":0.87},{"$f":"H24*I24","v":468.21051},null,{"$f":"'6. Historical Wholesale'!L24","v":538.173},{"$f":"'5. UTRs and Sub-Transmission'!J26","v":2.02},{"$f":"L24*M24","v":1087.1094600000001},null,{"$f":"J24+N24","v":1555.31997}]
[null,"February",null,{"$f":"'6. Historical Wholesale'!D25","v":480.483},{"$f":"E24","v":3.66},1758.5677800000001,null,{"$f":"'6. Historical Wholesale'!H25","v":515.98800000000006},{"$f":"I24","v":0.87},448.90956000000006,null,{"$f":"'6. Historical Wholesale'!L25","v":515.98800000000006},{"$f":"M24","v":2.02},1042.2957600000002,null,1491.2053200000003]
[null,"March",null,{"$f":"'6. Historical Wholesale'!D26","v":446.04899999999998},3.66,1632.53934,null,{"$f":"'6. Historical Wholesale'!H26","v":460.09800000000001},0.87,400.28525999999999,null,{"$f":"'6. Historical Wholesale'!L26","v":460.09800000000001},2.02,929.39796000000001,null,1329.6832199999999]
[null,"April",null,{"$f":"'6. Historical Wholesale'!D27","v":1950.2550000000001},3.66,7137.9333000000006,null,{"$f":"'6. Historical Wholesale'!H27","v":1950.2550000000001},0.87,1696.7218500000001,null,{"$f":"'6. Historical Wholesale'!L27","v":1950.2550000000001},2.02,3939.5151000000001,null,5636.2369500000004]
[null,"May",null,{"$f":"'6. Historical Wholesale'!D28","v":7751.29},3.66,28369.721400000002,null,{"$f":"'6. Historical Wholesale'!H28","v":8975.0400000000009},0.87,7808.2848000000004,null,{"$f":"'6. Historical Wholesale'!L28","v":8975.0400000000009},2.02,18129.580800000003,null,25937.865600000005]
[null,"June",null,{"$f":"'6. Historical Wholesale'!D29","v":9067.76},3.66,33188.001600000003,null,{"$f":"'6. Historical Wholesale'!H29","v":9424.34},0.87,8199.1758000000009,null,{"$f":"'6. Historical Wholesale'!L29","v":9424.34},2.02,19037.166799999999,null,27236.3426]
[null,"July",null,{"$f":"'6. Historical Wholesale'!D30","v":412.29},3.66,1508.9814000000001,null,{"$f":"'6. Historical Wholesale'!H30","v":9230.16},0.87,8030.2392,null,{"$f":"'6. Historical Wholesale'!L30","v":9230.16},2.02,18644.923200000001,null,26675.162400000001]
{"$rows_left_out":88}
{"sheet":"9. RTSR Rates to Forecast","index":8,"n_rows":32,"n_cols":10,"rows_kept":32,"cut":false,"hidden":false,"merged":[]}
[]
[]
[]
[]
[]
[]
[]
[]
[]
[]
[]
[]
["The purpose of this sheet is to re-align the current RTS Network Rates to recover current wholesale network costs."]
[]
["Rate Class","Rate Description","Unit","Current RTSR-Network","Loss Adjusted Billed kWh","Billed kW","Billed Amount","Billed Amount %","Current Wholesale Billing","Adjusted RTSR Network"]
[]
["Embedded Distributor","RTSR - Network","kW",2.9565999999999999,null,245804,{"$f":"ROUND(D17*F17, 2)","v":726744.11},{"$f":"G17/726744.11","v":1},{"$f":"H17*total_current_wholesale_network","v":738128.41409296519},{"$f":"IF(ISERROR(I17/F17), 0, I17/F17)","v":3.0029145745918098}]
[]
["The purpose of this table is to re-align the current RTS Connection Rates to recover current wholesale connection costs."]
["Rate Class","Rate Description","Unit","Current RTSR-Connection","Loss Adjusted Billed kWh","Billed kW","Billed Amount","Billed Amount %","Current Wholesale Billing","Adjusted RTSR-Connection"]
[]
["Embedded Distributor","RTSR - Connection","kW",2.3933,null,245804,{"$f":"ROUND(D22*F22, 2)","v":588282.71},{"$f":"G22/588282.71","v":1},{"$f":"H22*Total_Current_Wholesale_Lineplus","v":652254.6103527532},{"$f":"IF(ISERROR(I22/F22), 0, I22/F22)","v":2.6535557206259996}]
[]
["The purpose of this table is to update the re-aligned RTS Network Rates to recover future wholesale network costs."]
["Rate Class","Rate Description","Unit","Adjusted RTSR-Network","Loss Adjusted Billed kWh","Billed kW","Billed Amount","Billed Amount %","Current Wholesale Billing","Proposed RTSR-Network"]
[]
["Embedded Distributor","RTSR - Network","kW",3.0029145745918098,null,245804,{"$f":"ROUND(D27*F27, 2)","v":738128.41},{"$f":"G27/738128.41","v":1},{"$f":"H27*forecast_wholesale_network","v":736947.54553433508},{"$f":"IF(ISERROR(I27/F27), 0, I27/F27)","v":2.998110468236217}]
[]
["The purpose of this table is to update the re-aligned RTS Connection Rates to recover future wholesale connection costs."]
["Rate Class","Rate Description","Unit","Adjusted RTSR-Connection","Loss Adjusted Billed kWh","Billed kW","Billed Amount","Billed Amount %","Current Wholesale Billing","Proposed RTSR-Connection"]
{"$rows_left_out":3}
{"sheet":"hidden1","index":9,"n_rows":22,"n_cols":2,"rows_kept":22,"cut":false,"hidden":true,"merged":[]}
[{"$f":"IF('3. Rate Classes'!L17=1, '3. Rate Classes'!C17, \"\")","v":"Embedded Distributor"},1]
[{"$f":"IF('3. Rate Classes'!L18=1, '3. Rate Classes'!C18, \"\")","v":""},2]
[{"$f":"IF('3. Rate Classes'!L19=1, '3. Rate Classes'!C19, \"\")","v":""},3]
[{"$f":"IF('3. Rate Classes'!L20=1, '3. Rate Classes'!C20, \"\")","v":""},4]
[{"$f":"IF('3. Rate Classes'!L21=1, '3. Rate Classes'!C21, \"\")","v":""},5]
[{"$f":"IF('3. Rate Classes'!L22=1, '3. Rate Classes'!C22, \"\")","v":""},6]
[{"$f":"IF('3. Rate Classes'!L23=1, '3. Rate Classes'!C23, \"\")","v":""},7]
[{"$f":"IF('3. Rate Classes'!L24=1, '3. Rate Classes'!C24, \"\")","v":""},8]
[{"$f":"IF('3. Rate Classes'!L25=1, '3. Rate Classes'!C25, \"\")","v":""},9]
[{"$f":"IF('3. Rate Classes'!L26=1, '3. Rate Classes'!C26, \"\")","v":""},10]
[{"$f":"IF('3. Rate Classes'!L27=1, '3. Rate Classes'!C27, \"\")","v":""},11]
[{"$f":"IF('3. Rate Classes'!L28=1, '3. Rate Classes'!C28, \"\")","v":""},12]
[{"$f":"IF('3. Rate Classes'!L29=1, '3. Rate Classes'!C29, \"\")","v":""},13]
[{"$f":"IF('3. Rate Classes'!L30=1, '3. Rate Classes'!C30, \"\")","v":""},14]
[{"$f":"IF('3. Rate Classes'!L31=1, '3. Rate Classes'!C31, \"\")","v":""},15]
[{"$f":"IF('3. Rate Classes'!L32=1, '3. Rate Classes'!C32, \"\")","v":""},16]
[{"$f":"IF('3. Rate Classes'!L33=1, '3. Rate Classes'!C33, \"\")","v":""},17]
[{"$f":"IF('3. Rate Classes'!L34=1, '3. Rate Classes'!C34, \"\")","v":""},18]
[{"$f":"IF('3. Rate Classes'!L35=1, '3. Rate Classes'!C35, \"\")","v":""},19]
[{"$f":"IF('3. Rate Classes'!L36=1, '3. Rate Classes'!C36, \"\")","v":""},20]
[{"$f":"IF('3. Rate Classes'!L37=1, '3. Rate Classes'!C37, \"\")","v":""},21]
[{"$f":"IF('3. Rate Classes'!L38=1, '3. Rate Classes'!C38, \"\")","v":""},22]