{"text_format":"1","workbook":"xlsx","n_sheets":13,"sheets":["1. Utility_Info_","2. Smart_Meter_Costs","3. Cost_of_Service_Parameters","4. SM_Assets_and_Rate_Base","5. SM_Rev_Reqt","6. UCC_Calculation","7_Taxes_PILs","8. Funding_Adder_Revs","8A. Opex_Interest_monthly","8B. Opex_Interest_annual","9. SMFA_SMDR_SMIRR","10A. Cost_Alloc_SMDR","10B. Cost_Alloc_SMIRR"],"not_rendered":{"charts":0,"images":2,"macros":1,"external_links":3,"defined_names":30,"comments":6,"pivot_tables":0},"unopened":[],"bounds":{"document_bytes":16777216,"sheet_cells":100000,"rows_first":2000,"rows_last":500,"rows_between":2000,"halvings":0,"cell_chars":16384,"cell_head_chars":4096},"cells_cut":0,"cells_raw":0,"read":"whole","date_system":"1900"}

{"sheet":"1. Utility_Info_","index":0,"n_rows":79,"n_cols":28,"rows_kept":79,"cut":false,"hidden":false,"merged":[[18,3,18,4],[1,2,1,9],[2,2,2,9],[3,2,3,9],[4,2,4,9],[14,3,14,4]]}
[null,null,null,null,null,null,null,null,null,null,null,null,null,null,null,null,null,null,null,null,null,null,null,null,null,null,null,"Algoma Power Inc."]
[null,null,null,null,null,null,null,null,null,null,null,null,null,null,null,null,null,null,null,null,null,null,null,null,null,null,null,"Atikokan Hydro Inc."]
[null,null,null,null,null,null,null,null,null,null,null,null,null,null,null,null,null,null,null,null,null,null,null,null,null,null,null,"Attawapiskat Power Corporation"]
[null,null,null,null,null,null,null,null,null,null,null,null,null,null,null,null,null,null,null,null,null,null,null,null,null,null,null,"Bluewater Power Distribution Corp."]
[null,null,null,null,null,null,null,null,null,null,null,null,null,null,null,null,null,null,null,null,null,null,null,null,null,null,null,"Brant County Power"]
[null,null,null,null,null,null,null,null,null,null,null,null,null,null,null,null,null,null,null,null,null,null,null,null,null,null,null,"Brantford Power Inc."]
[null,null,null,null,null,null,null,null,null,null,null,null,null,null,null,null,null,null,null,null,null,null,null,null,null,null,null,"Burlington Hydro Inc."]
[null,null,null,null,null,null,null,null,null,null,null,null,null,null,null,null,null,null,null,null,null,null,null,null,null,null,null,"Cambridge and North Dumfries Hydro"]
[null,null,null,null,null,null,null,null,null,null,null,null,null,null,null,null,null,null,null,null,null,null,null,null,null,null,null,"Canadian Niagara Power Inc. – Eastern Ontario Power/Fort Erie/Port Colborne"]
[null,null,null,null,null,null,null,null,null,null,null,null,null,null,null,null,null,null,null,null,null,null,null,null,null,null,null,"Centre Wellington Hydro Ltd."]
[null,null,null,null,null,null,null,null,null,null,null,null,null,null,null,null,null,null,null,null,null,null,null,null,null,null,null,"Chapleau Public Utilities Corporation"]
[null,null,null,null,null,null,null,null,null,null,null,null,null,null,null,null,null,null,null,null,null,null,null,null,null,null,null,"COLLUS Power Corp."]
[null,null,null,null,null,"Version",6,null,null,null,null,null,null,null,null,null,null,null,null,null,null,null,null,null,null,null,null,"Cooperative Hydro Embrun Inc."]
[null,null,null,null,null,null,null,null,null,null,null,null,null,null,null,null,null,null,null,null,null,null,null,null,null,null,null,"E.L.K. Energy Inc."]
[null,null,"Utility Name   ","Rideau St. Lawrence Distribution Inc.",null,null,null,null,null,null,null,null,null,null,null,null,null,null,null,null,null,null,null,null,null,null,null,"Enersource Hydro Mississauga Inc."]
[null,null,null,null,null,null,null,null,null,null,null,null,null,null,null,null,null,null,null,null,null,null,null,null,null,null,null,"Entegrus Powerlines Inc."]
[null,null,"Assigned EB Number","EB-2015-0100",null,null,null,null,null,null,null,null,null,null,null,null,null,null,null,null,null,null,null,null,null,null,null,"ENWIN Utilities Ltd."]
[null,null,null,null,null,null,null,null,null,null,null,null,null,null,null,null,null,null,null,null,null,null,null,null,null,null,null,"Erie Thames Powerlines Corp."]
[null,null,"Name and Title","Peter Soules, Chief Financial Officer",null,null,null,null,null,null,null,null,null,null,null,null,null,null,null,null,null,null,null,null,null,null,null,"Espanola Regional Hydro Distribution Corporation"]
[null,null,null,null,null,null,null,null,null,null,null,null,null,null,null,null,null,null,null,null,null,null,null,null,null,null,null,"Essex Powerlines Corporation"]
[null,null,"Phone Number","(613) 925-3851",null,null,null,null,null,null,null,null,null,null,null,null,null,null,null,null,null,null,null,null,null,null,null,"Festival Hydro Inc."]
[null,null,null,null,null,null,null,null,null,null,null,null,null,null,null,null,null,null,null,null,null,null,null,null,null,null,null,"Fort Albany Power Corporation"]
[null,null,"Email Address","psoules@rslu.ca",null,null,null,null,null,null,null,null,null,null,null,null,null,null,null,null,null,null,null,null,null,null,null,"Fort Frances Power Corporation"]
[null,null,null,null,null,null,null,null,null,null,null,null,null,null,null,null,null,null,null,null,null,null,null,null,null,null,null,"Greater Sudbury Hydro Inc."]
[null,null,"Date","2016-06-22",null,null,null,null,null,null,null,null,null,null,null,null,null,null,null,null,null,null,null,null,null,null,null,"Grimsby Power Inc."]
[null,null,null,null,null,null,null,null,null,null,null,null,null,null,null,null,null,null,null,null,null,null,null,null,null,null,null,"Guelph Hydro Electric Systems Inc."]
[null,null,"Last COS Re-based Year",2012,null,null,null,null,null,null,null,null,null,null,null,null,null,null,null,null,null,null,null,null,null,null,null,"Haldimand County Hydro Inc."]
[null,null,null,null,null,null,null,null,null,null,null,null,null,null,null,null,null,null,null,null,null,null,null,null,null,null,null,"Halton Hills Hydro Inc."]
[null,null,null,null,null,null,null,null,null,null,null,null,null,null,null,null,null,null,null,null,null,null,null,null,null,null,null,"Hearst Power Distribution Co. Ltd."]
["Note:  Drop-down lists are shaded blue; Input cells are shaded green."]
[]
[null,null,null,null,null,null,null,null,null,null,null,null,null,null,null,null,null,null,null,null,null,null,null,null,null,null,null,"Horizon Utilities Corporation"]
[null,null,null,null,null,null,null,null,null,null,null,null,null,null,null,null,null,null,null,null,null,null,null,null,null,null,null,"Hydro 2000 Inc."]
[null,null,null,null,null,null,null,null,null,null,null,null,null,null,null,null,null,null,null,null,null,null,null,null,null,null,null,"Hydro Hawkesbury Inc."]
[null,null,null,null,null,null,null,null,null,null,null,null,null,null,null,null,null,null,null,null,null,null,null,null,null,null,null,"Hydro One Brampton Networks Inc."]
[null,null,null,null,null,null,null,null,null,null,null,null,null,null,null,null,null,null,null,null,null,null,null,null,null,null,null,"Hydro One Networks Inc."]
[null,null,null,null,null,null,null,null,null,null,null,null,null,null,null,null,null,null,null,null,null,null,null,null,null,null,null,"Hydro One Remote Communities Inc."]
[null,null,null,null,null,null,null,null,null,null,null,null,null,null,null,null,null,null,null,null,null,null,null,null,null,null,null,"Hydro Ottawa Limited"]
[null,null,null,null,null,null,null,null,null,null,null,null,null,null,null,null,null,null,null,null,null,null,null,null,null,null,null,"Innisfil Hydro Dist. Systems Limited"]
[null,null,null,null,null,null,null,null,null,null,null,null,null,null,null,null,null,null,null,null,null,null,null,null,null,null,null,"Kashechewan Power Corporation"]
[null,null,null,null,null,null,null,null,null,null,null,null,null,null,null,null,null,null,null,null,null,null,null,null,null,null,null,"Kenora Hydro Electric Corporation Ltd."]
[null,null,null,null,null,null,null,null,null,null,null,null,null,null,null,null,null,null,null,null,null,null,null,null,null,null,null,"Kingston Hydro Corporation"]
[null,null,null,null,null,null,null,null,null,null,null,null,null,null,null,null,null,null,null,null,null,null,null,null,null,null,null,"Kitchener-Wilmot Hydro Inc."]
[null,null,null,null,null,null,null,null,null,null,null,null,null,null,null,null,null,null,null,null,null,null,null,null,null,null,null,"Lakefront Utilities Inc."]
[null,null,null,null,null,null,null,null,null,null,null,null,null,null,null,null,null,null,null,null,null,null,null,null,null,null,null,"Lakeland Power Distribution Ltd."]
[null,null,null,null,null,null,null,null,null,null,null,null,null,null,null,null,null,null,null,null,null,null,null,null,null,null,null,"London Hydro Inc."]
[null,null,null,null,null,null,null,null,null,null,null,null,null,null,null,null,null,null,null,null,null,null,null,null,null,null,null,"Midland Power Utility Corporation"]
[null,null,null,null,null,null,null,null,null,null,null,null,null,null,null,null,null,null,null,null,null,null,null,null,null,null,null,"Milton Hydro Distribution Inc."]
[null,null,null,null,null,null,null,null,null,null,null,null,null,null,null,null,null,null,null,null,null,null,null,null,null,null,null,"Newmarket – Tay Power Distribution Ltd."]
[null,null,null,null,null,null,null,null,null,null,null,null,null,null,null,null,null,null,null,null,null,null,null,null,null,null,null,"Niagara Peninsula Energy Inc."]
[null,null,null,null,null,null,null,null,null,null,null,null,null,null,null,null,null,null,null,null,null,null,null,null,null,null,null,"Niagara-on-the-Lake Hydro Inc."]
[null,null,null,null,null,null,null,null,null,null,null,null,null,null,null,null,null,null,null,null,null,null,null,null,null,null,null,"Norfolk Power Distribution Ltd."]
[null,null,null,null,null,null,null,null,null,null,null,null,null,null,null,null,null,null,null,null,null,null,null,null,null,null,null,"North Bay Hydro Distribution Limited"]
[null,null,null,null,null,null,null,null,null,null,null,null,null,null,null,null,null,null,null,null,null,null,null,null,null,null,null,"Northern Ontario Wires Inc."]
[null,null,null,null,null,null,null,null,null,null,null,null,null,null,null,null,null,null,null,null,null,null,null,null,null,null,null,"Oakville Hydro Distribution Inc."]
[null,null,null,null,null,null,null,null,null,null,null,null,null,null,null,null,null,null,null,null,null,null,null,null,null,null,null,"Orangeville Hydro Limited"]
[null,null,null,null,null,null,null,null,null,null,null,null,null,null,null,null,null,null,null,null,null,null,null,null,null,null,null,"Orillia Power Distribution Corp."]
[null,null,null,null,null,null,null,null,null,null,null,null,null,null,null,null,null,null,null,null,null,null,null,null,null,null,null,"Oshawa PUC Networks Inc."]
[null,null,null,null,null,null,null,null,null,null,null,null,null,null,null,null,null,null,null,null,null,null,null,null,null,null,null,"Ottawa River Power Corporation"]
[null,null,null,null,null,null,null,null,null,null,null,null,null,null,null,null,null,null,null,null,null,null,null,null,null,null,null,"Parry Sound Power Corporation"]
[null,null,null,null,null,null,null,null,null,null,null,null,null,null,null,null,null,null,null,null,null,null,null,null,null,null,null,"Peterborough Distribution Inc."]
[null,null,null,null,null,null,null,null,null,null,null,null,null,null,null,null,null,null,null,null,null,null,null,null,null,null,null,"PowerStream Inc."]
[null,null,null,null,null,null,null,null,null,null,null,null,null,null,null,null,null,null,null,null,null,null,null,null,null,null,null,"PUC Distribution Inc."]
[null,null,null,null,null,null,null,null,null,null,null,null,null,null,null,null,null,null,null,null,null,null,null,null,null,null,null,"Renfrew Hydro Inc."]
[null,null,null,null,null,null,null,null,null,null,null,null,null,null,null,null,null,null,null,null,null,null,null,null,null,null,null,"Rideau St. Lawrence Distribution Inc."]
[null,null,null,null,null,null,null,null,null,null,null,null,null,null,null,null,null,null,null,null,null,null,null,null,null,null,null,"St. Thomas Energy Inc."]
[null,null,null,null,null,null,null,null,null,null,null,null,null,null,null,null,null,null,null,null,null,null,null,null,null,null,null,"Sioux Lookout Hydro Inc."]
[null,null,null,null,null,null,null,null,null,null,null,null,null,null,null,null,null,null,null,null,null,null,null,null,null,null,null,"Thunder Bay Hydro Electricity Distribution"]
[null,null,null,null,null,null,null,null,null,null,null,null,null,null,null,null,null,null,null,null,null,null,null,null,null,null,null,"Tillsonburg Hydro Inc."]
[null,null,null,null,null,null,null,null,null,null,null,null,null,null,null,null,null,null,null,null,null,null,null,null,null,null,null,"Toronto Hydro-Electric System Limited"]
[null,null,null,null,null,null,null,null,null,null,null,null,null,null,null,null,null,null,null,null,null,null,null,null,null,null,null,"Veridian Connections Inc."]
[null,null,null,null,null,null,null,null,null,null,null,null,null,null,null,null,null,null,null,null,null,null,null,null,null,null,null,"Wasaga Distribution Inc."]
[null,null,null,null,null,null,null,null,null,null,null,null,null,null,null,null,null,null,null,null,null,null,null,null,null,null,null,"Waterloo North Hydro Inc."]
[null,null,null,null,null,null,null,null,null,null,null,null,null,null,null,null,null,null,null,null,null,null,null,null,null,null,null,"Welland Hydro Electric System Corp."]
[null,null,null,null,null,null,null,null,null,null,null,null,null,null,null,null,null,null,null,null,null,null,null,null,null,null,null,"Wellington North Power Inc."]
[null,null,null,null,null,null,null,null,null,null,null,null,null,null,null,null,null,null,null,null,null,null,null,null,null,null,null,"West Coast Huron Energy Inc."]
[null,null,null,null,null,null,null,null,null,null,null,null,null,null,null,null,null,null,null,null,null,null,null,null,null,null,null,"Westario Power Inc."]
[null,null,null,null,null,null,null,null,null,null,null,null,null,null,null,null,null,null,null,null,null,null,null,null,null,null,null,"Whitby Hydro Electric Corporation"]
[null,null,null,null,null,null,null,null,null,null,null,null,null,null,null,null,null,null,null,null,null,null,null,null,null,null,null,"Woodstock Hydro Services Inc."]

{"sheet":"2. Smart_Meter_Costs","index":1,"n_rows":197,"n_cols":29,"rows_kept":197,"cut":false,"hidden":false,"merged":[[12,1,12,9],[165,2,165,3],[167,2,167,3],[169,2,169,3],[62,2,62,3],[100,2,100,3],[102,2,102,3],[104,2,104,3]]}
[]
[]
[]
[]
[]
[]
[]
[]
[]
[]
[]
[]
[null,"Distributors must enter all incremental costs related to their smart meter program and all revenues recovered to date in the applicable tabs except for those costs (and associated revenues) for which the Board has approved on a final basis, i.e. capital costs have been included in rate base and OM&A costs in revenue requirement.\n\nFor 2014, distributors that have completed their deployments by the end of 2013 are not expected to enter any capital costs.  However, for OM&A, regardless of whether a distributor has deployments in 2014, distributors should enter the forecasted OM&A for 2014 for all smart meters in service."]
[]
[]
[]
[]
[null,null,null,null,null,null,2006,null,2007,null,2008,null,2009,null,2010,null,2011,null,2012,null,2013,null,2014,null,2015,null,2016,null,"Total"]
[null,"Smart Meter Capital Cost and Operational Expense Data",null,null,null,null,"Audited Actual",null,"Audited Actual",null,"Audited Actual",null,"Audited Actual",null,"Audited Actual",null,"Audited Actual",null,"Audited Actual",null,"Audited Actual",null,"Forecast",null,"Forecast",null,"Forecast"]
[]
[null,null,"Smart Meter Installation Plan"]
[]
[null,null,"Actual/Planned number of Smart Meters installed during the Calendar Year"]
[]
[null,null,"Residential",null,null,null,null,null,null,null,null,null,null,null,null,null,null,null,null,null,null,null,null,null,null,null,null,null,{"$f":"SUM(G25,I25,K25,M25,O25,Q25,S25,U25,W25,Y25,AA25)","v":0}]
[]
[null,null,"General Service < 50 kW",null,null,null,null,null,null,null,null,null,null,null,null,null,null,null,null,null,null,null,null,null,null,null,null,null,{"$f":"SUM(G27,I27,K27,M27,O27,Q27,S27,U27,W27,Y27,AA27)","v":0}]
[]
[null,null,"Actual/Planned number of Smart Meters installed (Residential and GS < 50 kW only)",null,null,null,{"$f":"G25+G27","v":0},null,{"$f":"I25+I27","v":0},null,{"$f":"K25+K27","v":0},null,{"$f":"M25+M27","v":0},null,{"$f":"O25+O27","v":0},null,{"$f":"Q25+Q27","v":0},null,{"$f":"S25+S27","v":0},null,{"$f":"U25+U27","v":0},null,{"$f":"W25+W27","v":0},null,{"$f":"Y25+Y27","v":0},null,{"$f":"AA25+AA27","v":0},null,{"$f":"SUM(G29,I29,K29,M29,O29,Q29,S29,U29,W29,Y29,AA29)","v":0}]
[]
[null,null,"Percentage of Residential and GS < 50 kW Smart Meter Installations Completed",null,null,null,{"$f":"IF($AC29=0,0,G29/$AC29)","v":0},null,{"$f":"IF(G31=100%, 0, IF(ISERROR(SUM(G29:I29)/$AC29),0,SUM(G29:I29)/$AC29))","v":0},null,{"$f":"IF(I31=100%, 0, IF(ISERROR(SUM(G29:K29)/$AC29), 0, SUM(G29:K29)/$AC29))","v":0},null,{"$f":"IF(K31=100%,0,IF(ISERROR(SUM(G29:M29)/$AC29),0,SUM(G29:M29)/$AC29))","v":0},null,{"$f":"IF(M31=100%,0,IF(ISERROR(SUM(G29:O29)/$AC29),0,SUM(G29:O29)/$AC29))","v":0},null,{"$f":"IF(O31=100%,0,IF(ISERROR(SUM(G29:Q29)/$AC29),0,SUM(G29:Q29)/$AC29))","v":0},null,{"$f":"IF(Q31=100%,0,IF(ISERROR(SUM(G29:S29)/$AC29),0,SUM(G29:S29)/$AC29))","v":0},null,{"$f":"IF(S31=100%,0,IF(ISERROR(SUM(I29:U29)/$AC29),0,SUM(I29:U29)/$AC29))","v":0},null,{"$f":"IF(U31=100%,0,IF(ISERROR(SUM(K29:W29)/$AC29),0,SUM(K29:W29)/$AC29))","v":0},null,{"$f":"IF(W31=100%,0,IF(ISERROR(SUM(M29:Y29)/$AC29),0,SUM(M29:Y29)/$AC29))","v":0},null,{"$f":"IF(Y31=100%,0,IF(ISERROR(SUM(O29:AA29)/$AC29),0,SUM(O29:AA29)/$AC29))","v":0},null,{"$f":"IF($AC29=0,\"\",AC29/$AC29)","v":""}]
[]
[null,null,"Actual/Planned number of GS > 50 kW meters installed",null,null,null,null,null,null,null,null,null,null,null,null,null,null,null,null,null,null,null,null,null,null,null,null,null,{"$f":"SUM(G33,I33,K33,M33,O33,Q33,S33,U33,W33,Y33,AA33)","v":0}]
[]
[null,null,"Other (please identify)",null,null,null,null,null,null,null,null,null,null,null,null,null,null,null,null,null,null,null,null,null,null,null,null,null,{"$f":"SUM(G35,I35,K35,M35,O35,Q35,S35,U35,W35,Y35,AA35)","v":0}]
[]
[null,null,"Total Number of Smart Meters installed or planned to be installed",null,null,null,{"$f":"SUM(G29,G33,G35)","v":0},null,{"$f":"SUM(I29,I33,I35)","v":0},null,{"$f":"SUM(K29,K33,K35)","v":0},null,{"$f":"SUM(M29,M33,M35)","v":0},null,{"$f":"SUM(O29,O33,O35)","v":0},null,{"$f":"SUM(Q29,Q33,Q35)","v":0},null,{"$f":"SUM(S29,S33,S35)","v":0},null,{"$f":"SUM(U29,U33,U35)","v":0},null,{"$f":"SUM(W29,W33,W35)","v":0},null,{"$f":"SUM(Y29,Y33,Y35)","v":0},null,{"$f":"SUM(AA29,AA33,AA35)","v":0},null,{"$f":"SUM(G37,I37,K37,M37,O37,Q37,S37,U37,W37,Y37,AA37)","v":0}]
[]
[null,1,"Capital Costs"]
[null,null,null,null,"Asset Type"]
[null,null,"1.1  ADVANCED METERING COMMUNICATION DEVICE (AMCD)",null,"Asset type must be selected to enable calculations",null,{"$f":"IF(ISBLANK(G19),\"\",G19)","v":"Audited Actual"},null,{"$f":"IF(ISBLANK(I19),\"\",I19)","v":"Audited Actual"},null,{"$f":"IF(ISBLANK(K19),\"\",K19)","v":"Audited Actual"},null,{"$f":"IF(ISBLANK(M19),\"\",M19)","v":"Audited Actual"},null,{"$f":"IF(ISBLANK(O19),\"\",O19)","v":"Audited Actual"},null,{"$f":"IF(ISBLANK(Q19),\"\",Q19)","v":"Audited Actual"},null,{"$f":"IF(ISBLANK(S19),\"\",S19)","v":"Audited Actual"},null,{"$f":"IF(ISBLANK(U19),\"\",U19)","v":"Audited Actual"},null,{"$f":"IF(ISBLANK(W19),\"\",W19)","v":"Forecast"},null,{"$f":"IF(ISBLANK(Y19),\"\",Y19)","v":"Forecast"},null,{"$f":"IF(ISBLANK(AA19),\"\",AA19)","v":"Forecast"}]
[null,null,"1.1.1  Smart Meters (may include new meters and modules, etc.)",null,null,null,null,null,null,null,null,null,null,null,null,null,null,null,null,null,null,null,null,null,null,null,null,null,{"$f":"SUM(G42,I42,K42,M42,O42,Q42,S42,U42,W42,Y42,AA42)","v":0}]
[]
[null,null,"1.1.2  Installation Costs (may include socket kits, labour, vehicle, benefits, etc.)",null,null,null,null,null,null,null,null,null,null,null,null,null,null,null,null,null,null,null,null,null,null,null,null,null,{"$f":"SUM(G44,I44,K44,M44,O44,Q44,S44,U44,W44,Y44,AA44)","v":0}]
[]
[null,null,"1.1.3a  Workforce Automation Hardware (may include fieldwork handhelds, barcode hardware, etc.)",null,null,null,null,null,null,null,null,null,null,null,null,null,null,null,null,null,null,null,null,null,null,null,null,null,{"$f":"SUM(G46,I46,K46,M46,O46,Q46,S46,U46,W46,Y46,AA46)","v":0}]
[]
[null,null,"1.1.3b  Workforce Automation Software (may include fieldwork handhelds, barcode hardware, etc.)",null,null,null,null,null,null,null,null,null,null,null,null,null,null,null,null,null,null,null,null,null,null,null,null,null,{"$f":"SUM(G48,I48,K48,M48,O48,Q48,S48,U48,W48,Y48,AA48)","v":0}]
[]
[null,null,"Total Advanced Metering Communications Devices (AMCD)",null,null,null,{"$f":"SUM(G42,G44,G46,G48)","v":0},null,{"$f":"SUM(I42,I44,I46,I48)","v":0},null,{"$f":"SUM(K42,K44,K46,K48)","v":0},null,{"$f":"SUM(M42,M44,M46,M48)","v":0},null,{"$f":"SUM(O42,O44,O46,O48)","v":0},null,{"$f":"SUM(Q42,Q44,Q46,Q48)","v":0},null,{"$f":"SUM(S42,S44,S46,S48)","v":0},null,{"$f":"SUM(U42,U44,U46,U48)","v":0},null,{"$f":"SUM(W42,W44,W46,W48)","v":0},null,{"$f":"SUM(Y42,Y44,Y46,Y48)","v":0},null,{"$f":"SUM(AA42,AA44,AA46,AA48)","v":0},null,{"$f":"AC42+AC44+AC46+AC48","v":0}]
[]
[null,null,null,null,{"$f":"E40","v":"Asset Type"}]
[null,null,"1.2  ADVANCED METERING REGIONAL COLLECTOR (AMRC)  (includes LAN)",null,null,null,{"$f":"G41","v":"Audited Actual"},null,{"$f":"I41","v":"Audited Actual"},null,{"$f":"K41","v":"Audited Actual"},null,{"$f":"M41","v":"Audited Actual"},null,{"$f":"O41","v":"Audited Actual"},null,{"$f":"Q41","v":"Audited Actual"},null,{"$f":"S41","v":"Audited Actual"},null,{"$f":"U41","v":"Audited Actual"},null,{"$f":"W41","v":"Forecast"},null,{"$f":"Y41","v":"Forecast"},null,{"$f":"AA41","v":"Forecast"}]
[null,null,"1.2.1  Collectors",null,null,null,null,null,null,null,null,null,null,null,null,null,null,null,null,null,null,null,null,null,null,null,null,null,{"$f":"SUM(G54,I54,K54,M54,O54,Q54,S54,U54,W54,Y54,AA54)","v":0}]
[]
[null,null,"1.2.2  Repeaters (may include radio licence, etc.)",null,null,null,null,null,null,null,null,null,null,null,null,null,null,null,null,null,null,null,null,null,null,null,null,null,{"$f":"SUM(G56,I56,K56,M56,O56,Q56,S56,U56,W56,Y56,AA56)","v":0}]
[]
[null,null,"1.2.3  Installation (may include meter seals and rings, collector computer hardware, etc.)",null,null,null,null,null,null,null,null,null,null,null,null,null,null,null,null,null,null,null,null,null,null,null,null,null,{"$f":"SUM(G58,I58,K58,M58,O58,Q58,S58,U58,W58,Y58,AA58)","v":0}]
[]
[null,null,"Total Advanced Metering Regional Collector (AMRC)  (Includes LAN)",null,null,null,{"$f":"G54+G56+G58","v":0},null,{"$f":"I54+I56+I58","v":0},null,{"$f":"K54+K56+K58","v":0},null,{"$f":"M54+M56+M58","v":0},null,{"$f":"O54+O56+O58","v":0},null,{"$f":"Q54+Q56+Q58","v":0},null,{"$f":"S54+S56+S58","v":0},null,{"$f":"U54+U56+U58","v":0},null,{"$f":"W54+W56+W58","v":0},null,{"$f":"Y54+Y56+Y58","v":0},null,{"$f":"AA54+AA56+AA58","v":0},null,{"$f":"AC54+AC56+AC58","v":0}]
[]
[null,null,null,null,{"$f":"E52","v":"Asset Type"}]
[null,null,"1.3  ADVANCED METERING CONTROL COMPUTER (AMCC)",null,null,null,{"$f":"G53","v":"Audited Actual"},null,{"$f":"I53","v":"Audited Actual"},null,{"$f":"K53","v":"Audited Actual"},null,{"$f":"M53","v":"Audited Actual"},null,{"$f":"O53","v":"Audited Actual"},null,{"$f":"Q53","v":"Audited Actual"},null,{"$f":"S53","v":"Audited Actual"},null,{"$f":"U53","v":"Audited Actual"},null,{"$f":"W53","v":"Forecast"},null,{"$f":"Y53","v":"Forecast"},null,{"$f":"AA53","v":"Forecast"}]
[null,null,"1.3.1  Computer Hardware",null,null,null,null,null,null,null,null,null,null,null,null,null,null,null,null,null,null,null,null,null,null,null,null,null,{"$f":"SUM(G64,I64,K64,M64,O64,Q64,S64,U64,W64,Y64,AA64)","v":0}]
[]
[null,null,"1.3.2  Computer Software",null,null,null,null,null,null,null,null,null,null,null,null,null,null,null,null,null,null,null,null,null,null,null,null,null,{"$f":"SUM(G66,I66,K66,M66,O66,Q66,S66,U66,W66,Y66,AA66)","v":0}]
[]
[null,null,"1.3.3  Computer Software Licences & Installation (includes hardware and software)",null,null,null,null,null,null,null,null,null,null,null,null,null,null,null,null,null,null,null,null,null,null,null,null,null,{"$f":"SUM(G68,I68,K68,M68,O68,Q68,S68,U68,W68,Y68,AA68)","v":0}]
[null,null,"          (may include AS/400 disk space, backup and recovery computer, UPS, etc.)"]
[null,null,"Total Advanced Metering Control Computer (AMCC)",null,null,null,{"$f":"G64+G66+G68","v":0},null,{"$f":"I64+I66+I68","v":0},null,{"$f":"K64+K66+K68","v":0},null,{"$f":"M64+M66+M68","v":0},null,{"$f":"O64+O66+O68","v":0},null,{"$f":"Q64+Q66+Q68","v":0},null,{"$f":"S64+S66+S68","v":0},null,{"$f":"U64+U66+U68","v":0},null,{"$f":"W64+W66+W68","v":0},null,{"$f":"Y64+Y66+Y68","v":0},null,{"$f":"AA64+AA66+AA68","v":0},null,{"$f":"AC64+AC66+AC68","v":0}]
[]
[null,null,null,null,{"$f":"E62","v":"Asset Type"}]
[null,null,"1.4  WIDE AREA NETWORK (WAN)",null,null,null,{"$f":"G63","v":"Audited Actual"},null,{"$f":"I63","v":"Audited Actual"},null,{"$f":"K63","v":"Audited Actual"},null,{"$f":"M63","v":"Audited Actual"},null,{"$f":"O63","v":"Audited Actual"},null,{"$f":"Q63","v":"Audited Actual"},null,{"$f":"S63","v":"Audited Actual"},null,{"$f":"U63","v":"Audited Actual"},null,{"$f":"W63","v":"Forecast"},null,{"$f":"Y63","v":"Forecast"},null,{"$f":"AA63","v":"Forecast"}]
[]
[null,null,"1.4.1  Activiation Fees",null,null,null,null,null,null,null,null,null,null,null,null,null,null,null,null,null,null,null,null,null,null,null,null,null,{"$f":"SUM(G75,I75,K75,M75,O75,Q75,S75,U75,W75,Y75,AA75)","v":0}]
[]
[null,null,"Total Wide Area Network (WAN)",null,null,null,{"$f":"G75","v":0},null,{"$f":"I75","v":0},null,{"$f":"K75","v":0},null,{"$f":"M75","v":0},null,{"$f":"O75","v":0},null,{"$f":"Q75","v":0},null,{"$f":"S75","v":0},null,{"$f":"U75","v":0},null,{"$f":"W75","v":0},null,{"$f":"Y75","v":0},null,{"$f":"AA75","v":0},null,{"$f":"AC75","v":0}]
[]
[null,null,null,null,{"$f":"E72","v":"Asset Type"}]
[null,null,"1.5  OTHER AMI CAPITAL COSTS RELATED TO MINIMUM FUNCTIONALITY",null,null,null,{"$f":"G73","v":"Audited Actual"},null,{"$f":"I73","v":"Audited Actual"},null,{"$f":"K73","v":"Audited Actual"},null,{"$f":"M73","v":"Audited Actual"},null,{"$f":"O73","v":"Audited Actual"},null,{"$f":"Q73","v":"Audited Actual"},null,{"$f":"S73","v":"Audited Actual"},null,{"$f":"U73","v":"Audited Actual"},null,{"$f":"W73","v":"Forecast"},null,{"$f":"Y73","v":"Forecast"},null,{"$f":"AA73","v":"Forecast"}]
[]
[null,null,"1.5.1  Customer Equipment (including repair of damaged equipment)",null,null,null,null,null,null,null,null,null,null,null,null,null,null,null,null,null,null,null,null,null,null,null,null,null,{"$f":"SUM(G82,I82,K82,M82,O82,Q82,S82,U82,W82,Y82,AA82)","v":0}]
[]
[null,null,"1.5.2  AMI Interface to CIS",null,null,null,null,null,null,null,null,null,null,null,null,null,null,null,null,null,null,null,null,null,null,null,null,null,{"$f":"SUM(G84,I84,K84,M84,O84,Q84,S84,U84,W84,Y84,AA84)","v":0}]
[]
[null,null,"1.5.3  Professional Fees",null,null,null,null,null,null,null,null,null,null,null,null,null,null,null,null,null,null,null,null,null,null,null,null,null,{"$f":"SUM(G86,I86,K86,M86,O86,Q86,S86,U86,W86,Y86,AA86)","v":0}]
[]
[null,null,"1.5.4  Integration",null,null,null,null,null,null,null,null,null,null,null,null,null,null,null,null,null,null,null,null,null,null,null,null,null,{"$f":"SUM(G88,I88,K88,M88,O88,Q88,S88,U88,W88,Y88,AA88)","v":0}]
[]
[null,null,"1.5.5  Program Management",null,null,null,null,null,null,null,null,null,null,null,null,null,null,null,null,null,null,null,null,null,null,null,null,null,{"$f":"SUM(G90,I90,K90,M90,O90,Q90,S90,U90,W90,Y90,AA90)","v":0}]
[]
[null,null,"1.5.6  Other AMI Capital",null,null,null,null,null,null,null,null,null,null,null,null,null,null,null,null,null,null,null,null,null,null,null,null,null,{"$f":"SUM(G92,I92,K92,M92,O92,Q92,S92,U92,W92,Y92,AA92)","v":0}]
[]
[null,null,"Total Other AMI Capital Costs Related to Minimum Functionality",null,null,null,{"$f":"SUM(G82,G84,G86,G88,G90,G92)","v":0},null,{"$f":"SUM(I82,I84,I86,I88,I90,I92)","v":0},null,{"$f":"SUM(K82,K84,K86,K88,K90,K92)","v":0},null,{"$f":"SUM(M82,M84,M86,M88,M90,M92)","v":0},null,{"$f":"SUM(O82,O84,O86,O88,O90,O92)","v":0},null,{"$f":"SUM(Q82,Q84,Q86,Q88,Q90,Q92)","v":0},null,{"$f":"SUM(S82,S84,S86,S88,S90,S92)","v":0},null,{"$f":"SUM(U82,U84,U86,U88,U90,U92)","v":0},null,{"$f":"SUM(W82,W84,W86,W88,W90,W92)","v":0},null,{"$f":"SUM(Y82,Y84,Y86,Y88,Y90,Y92)","v":0},null,{"$f":"SUM(AA82,AA84,AA86,AA88,AA90,AA92)","v":0},null,{"$f":"SUM(AC82,AC84,AC86,AC88,AC90,AC92)","v":0}]
[]
[null,null,"Total Capital Costs Related to Minimum Functionality",null,null,null,{"$f":"SUM(G50,G60,G70,G77,G94)","v":0},null,{"$f":"SUM(I50,I60,I70,I77,I94)","v":0},null,{"$f":"SUM(K50,K60,K70,K77,K94)","v":0},null,{"$f":"SUM(M50,M60,M70,M77,M94)","v":0},null,{"$f":"SUM(O50,O60,O70,O77,O94)","v":0},null,{"$f":"SUM(Q50,Q60,Q70,Q77,Q94)","v":0},null,{"$f":"SUM(S50,S60,S70,S77,S94)","v":0},null,{"$f":"SUM(U50,U60,U70,U77,U94)","v":0},null,{"$f":"SUM(W50,W60,W70,W77,W94)","v":0},null,{"$f":"SUM(Y50,Y60,Y70,Y77,Y94)","v":0},null,{"$f":"SUM(AA50,AA60,AA70,AA77,AA94)","v":0},null,{"$f":"SUM(AC50,AC60,AC70,AC77,AC94)","v":0}]
[]
[null,null,null,null,{"$f":"E79","v":"Asset Type"}]
[null,null,"1.6  CAPITAL COSTS BEYOND MINIMUM FUNCTIONALITY",null,null,null,{"$f":"G80","v":"Audited Actual"},null,{"$f":"I80","v":"Audited Actual"},null,{"$f":"K80","v":"Audited Actual"},null,{"$f":"M80","v":"Audited Actual"},null,{"$f":"O80","v":"Audited Actual"},null,{"$f":"Q80","v":"Audited Actual"},null,{"$f":"S80","v":"Audited Actual"},null,{"$f":"U80","v":"Audited Actual"},null,{"$f":"W80","v":"Forecast"},null,{"$f":"Y80","v":"Forecast"},null,{"$f":"AA80","v":"Forecast"}]
[null,null,"(Please provide a descriptive title and identify nature of beyond minimum functionality costs)"]
[null,null,"1.6.1  Costs related to technical capabilities in the smart meters or related communications infrastructure that exceed those specified in O.Reg 425/06",null,null,null,null,null,null,null,null,null,null,null,null,null,null,null,null,null,null,null,null,null,null,null,null,null,{"$f":"SUM(G101,I101,K101,M101,O101,Q101,S101,U101,W101,Y101,AA101)","v":0}]
[]
[null,null,"1.6.2  Costs for deployment of smart meters to customers other than residential                                                 and small general service ",null,null,null,null,null,null,null,null,null,null,null,null,null,null,null,null,null,null,null,null,null,null,null,null,null,{"$f":"SUM(G103,I103,K103,M103,O103,Q103,S103,U103,W103,Y103,AA103)","v":0}]
[]
[null,null,"1.6.3  Costs for TOU rate implementation, CIS system upgrades, web presentation,                                     integration with the MDM/R, etc.  ",null,"Computer Hardware",null,null,null,null,null,null,null,null,null,null,null,{"$f":"10311.09+931.24+1475.45+74.18+14.73+26663.3","v":39469.99},null,null,null,null,null,null,null,null,null,null,null,{"$f":"SUM(G105,I105,K105,M105,O105,Q105,S105,U105,W105,Y105,AA105)","v":39469.99}]
[]
[null,null,"Total Capital Costs Beyond Minimum Functionality",null,null,null,{"$f":"SUM(G101,G103,G105)","v":0},null,{"$f":"SUM(I101,I103,I105)","v":0},null,{"$f":"SUM(K101,K103,K105)","v":0},null,{"$f":"SUM(M101,M103,M105)","v":0},null,{"$f":"SUM(O101,O103,O105)","v":0},null,{"$f":"SUM(Q101,Q103,Q105)","v":39469.99},null,{"$f":"SUM(S101,S103,S105)","v":0},null,{"$f":"SUM(U101,U103,U105)","v":0},null,{"$f":"SUM(W101,W103,W105)","v":0},null,{"$f":"SUM(Y101,Y103,Y105)","v":0},null,{"$f":"SUM(AA101,AA103,AA105)","v":0},null,{"$f":"SUM(AC101,AC103,AC105)","v":39469.99}]
[]
[null,null,"Total Smart Meter Capital Costs",null,null,null,{"$f":"G96+G107","v":0},null,{"$f":"I96+I107","v":0},null,{"$f":"K96+K107","v":0},null,{"$f":"M96+M107","v":0},null,{"$f":"O96+O107","v":0},null,{"$f":"Q96+Q107","v":39469.99},null,{"$f":"S96+S107","v":0},null,{"$f":"U96+U107","v":0},null,{"$f":"W96+W107","v":0},null,{"$f":"Y96+Y107","v":0},null,{"$f":"AA96+AA107","v":0},null,{"$f":"AC96+AC107","v":39469.99}]
[]
[null,2,"OM&A Expenses"]
[null,null,"2.1  ADVANCED METERING COMMUNICATION DEVICE (AMCD)",null,null,null,{"$f":"G99","v":"Audited Actual"},null,{"$f":"I99","v":"Audited Actual"},null,{"$f":"K99","v":"Audited Actual"},null,{"$f":"M99","v":"Audited Actual"},null,{"$f":"O99","v":"Audited Actual"},null,{"$f":"Q99","v":"Audited Actual"},null,{"$f":"S99","v":"Audited Actual"},null,{"$f":"U99","v":"Audited Actual"},null,{"$f":"W99","v":"Forecast"},null,{"$f":"Y99","v":"Forecast"},null,{"$f":"AA99","v":"Forecast"}]
[]
[null,null,"2.1.1  Maintenance (may include meter reverification costs, etc.)",null,null,null,null,null,null,null,null,null,null,null,null,null,null,null,null,null,null,null,null,null,null,null,null,null,{"$f":"SUM(G114,I114,K114,M114,O114,Q114,S114,U114,W114,Y114,AA114)","v":0}]
[]
[null,null,"2.1.2  Other (please specifiy)",null,null,null,null,null,null,null,null,null,null,null,null,null,null,null,null,null,null,null,null,null,null,null,null,null,{"$f":"SUM(G116,I116,K116,M116,O116,Q116,S116,U116,W116,Y116,AA116)","v":0}]
[]
[null,null,"Total Incremental AMCD OM&A Costs",null,null,null,{"$f":"SUM(G114,G116)","v":0},null,{"$f":"SUM(I114,I116)","v":0},null,{"$f":"SUM(K114,K116)","v":0},null,{"$f":"SUM(M114,M116)","v":0},null,{"$f":"SUM(O114,O116)","v":0},null,{"$f":"SUM(Q114,Q116)","v":0},null,{"$f":"SUM(S114,S116)","v":0},null,{"$f":"SUM(U114,U116)","v":0},null,{"$f":"SUM(W114,W116)","v":0},null,{"$f":"SUM(Y114,Y116)","v":0},null,{"$f":"SUM(AA114,AA116)","v":0},null,{"$f":"SUM(AC114,AC116)","v":0}]
[]
[null,null,"2.2  ADVANCED METERING REGIONAL COLLECTOR (AMRC) (includes LAN)"]
[]
[null,null,"2.2.1  Maintenance",null,null,null,null,null,null,null,null,null,null,null,null,null,null,null,null,null,null,null,null,null,null,null,null,null,{"$f":"SUM(G122,I122,K122,M122,O122,Q122,S122,U122,W122,Y122,AA122)","v":0}]
[]
[null,null,"2.2.2  Other (please specifiy)",null,null,null,null,null,null,null,null,null,null,null,null,null,null,null,null,null,null,null,null,null,null,null,null,null,{"$f":"SUM(G124,I124,K124,M124,O124,Q124,S124,U124,W124,Y124,AA124)","v":0}]
[]
[null,null,"Total Incremental AMRC OM&A Costs",null,null,null,{"$f":"SUM(G122,G124)","v":0},null,{"$f":"SUM(I122,I124)","v":0},null,{"$f":"SUM(K122,K124)","v":0},null,{"$f":"SUM(M122,M124)","v":0},null,{"$f":"SUM(O122,O124)","v":0},null,{"$f":"SUM(Q122,Q124)","v":0},null,{"$f":"SUM(S122,S124)","v":0},null,{"$f":"SUM(U122,U124)","v":0},null,{"$f":"SUM(W122,W124)","v":0},null,{"$f":"SUM(Y122,Y124)","v":0},null,{"$f":"SUM(AA122,AA124)","v":0},null,{"$f":"SUM(AC122,AC124)","v":0}]
[]
[null,null,"2.3  ADVANCED METERING CONTROL COMPUTER (AMCC)"]
[]
[null,null,"2.3.1  Hardware Maintenance (may include server support, etc.)",null,null,null,null,null,null,null,null,null,null,null,null,null,null,null,null,null,null,null,null,null,null,null,null,null,{"$f":"SUM(G130,I130,K130,M130,O130,Q130,S130,U130,W130,Y130,AA130)","v":0}]
[]
[null,null,"2.3.2 Software Maintenance (may include maintenance support, etc.)",null,null,null,null,null,null,null,null,null,null,null,null,null,null,null,null,null,null,null,null,null,null,null,null,null,{"$f":"SUM(G132,I132,K132,M132,O132,Q132,S132,U132,W132,Y132,AA132)","v":0}]
[]
[null,null,"2.3.2  Other (please specifiy)",null,null,null,null,null,null,null,null,null,null,null,null,null,null,null,null,null,null,null,null,null,null,null,null,null,{"$f":"SUM(G134,I134,K134,M134,O134,Q134,S134,U134,W134,Y134,AA134)","v":0}]
[]
[null,null,"Total Incremental AMCC OM&A Costs",null,null,null,{"$f":"SUM(G130,G132,G134)","v":0},null,{"$f":"SUM(I130,I132,I134)","v":0},null,{"$f":"SUM(K130,K132,K134)","v":0},null,{"$f":"SUM(M130,M132,M134)","v":0},null,{"$f":"SUM(O130,O132,O134)","v":0},null,{"$f":"SUM(Q130,Q132,Q134)","v":0},null,{"$f":"SUM(S130,S132,S134)","v":0},null,{"$f":"SUM(U130,U132,U134)","v":0},null,{"$f":"SUM(W130,W132,W134)","v":0},null,{"$f":"SUM(Y130,Y132,Y134)","v":0},null,{"$f":"SUM(AA130,AA132,AA134)","v":0},null,{"$f":"SUM(AC130,AC132,AC134)","v":0}]
[]
[null,null,"2.4  WIDE AREA NETWORK (WAN)"]
[]
[null,null,"2.4.1  WAN Maintenance",null,null,null,null,null,null,null,null,null,null,null,null,null,null,null,null,null,null,null,null,null,null,null,null,null,{"$f":"SUM(G140,I140,K140,M140,O140,Q140,S140,U140,W140,Y140,AA140)","v":0}]
[]
[null,null,"2.4.2  Other (please specifiy)",null,null,null,null,null,null,null,null,null,null,null,null,null,null,null,null,null,null,null,null,null,null,null,null,null,{"$f":"SUM(G142,I142,K142,M142,O142,Q142,S142,U142,W142,Y142,AA142)","v":0}]
[]
[null,null,"Total Incremental AMRC OM&A Costs",null,null,null,{"$f":"SUM(G140,G142)","v":0},null,{"$f":"SUM(I140,I142)","v":0},null,{"$f":"SUM(K140,K142)","v":0},null,{"$f":"SUM(M140,M142)","v":0},null,{"$f":"SUM(O140,O142)","v":0},null,{"$f":"SUM(Q140,Q142)","v":0},null,{"$f":"SUM(S140,S142)","v":0},null,{"$f":"SUM(U140,U142)","v":0},null,{"$f":"SUM(W140,W142)","v":0},null,{"$f":"SUM(Y140,Y142)","v":0},null,{"$f":"SUM(AA140,AA142)","v":0},null,{"$f":"SUM(AC140,AC142)","v":0}]
[]
[null,null,"2.5  OTHER AMI OM&A COSTS RELATED TO MINIMUM FUNCTIONALITY"]
[]
[null,null,"2.5.1  Business Process Redesign",null,null,null,null,null,null,null,null,null,null,null,null,null,null,null,null,null,null,null,null,null,null,null,null,null,{"$f":"SUM(G148,I148,K148,M148,O148,Q148,S148,U148,W148,Y148,AA148)","v":0}]
[]
[null,null,"2.5.2  Customer Communication (may include project communication, etc.)",null,null,null,null,null,null,null,null,null,null,null,null,null,null,null,null,null,null,null,null,null,null,null,null,null,{"$f":"SUM(G150,I150,K150,M150,O150,Q150,S150,U150,W150,Y150,AA150)","v":0}]
[]
[null,null,"2.5.3  Program Management",null,null,null,null,null,null,null,null,null,null,null,null,null,null,null,null,null,null,null,null,null,null,null,null,null,{"$f":"SUM(G152,I152,K152,M152,O152,Q152,S152,U152,W152,Y152,AA152)","v":0}]
[]
[null,null,"2.5.4  Change Management (may include training, etc.)",null,null,null,null,null,null,null,null,null,null,null,null,null,null,null,null,null,null,null,null,null,null,null,null,null,{"$f":"SUM(G154,I154,K154,M154,O154,Q154,S154,U154,W154,Y154,AA154)","v":0}]
[]
[null,null,"2.5.5  Administration Costs",null,null,null,null,null,null,null,null,null,null,null,null,null,null,null,null,null,null,null,null,null,null,null,null,null,{"$f":"SUM(G156,I156,K156,M156,O156,Q156,S156,U156,W156,Y156,AA156)","v":0}]
[]
[null,null,"2.5.6  Other AMI Expenses",null,null,null,null,null,null,null,null,null,null,null,null,null,null,null,null,null,null,null,null,null,null,null,null,null,{"$f":"SUM(G158,I158,K158,M158,O158,Q158,S158,U158,W158,Y158,AA158)","v":0}]
[null,null,"             (please specify)"]
[null,null,"Total Other AMI OM&A Costs Related to Minimum Functionality",null,null,null,{"$f":"SUM(G158,G156,G154,G152,G150,G148)","v":0},null,{"$f":"SUM(I158,I156,I154,I152,I150,I148)","v":0},null,{"$f":"SUM(K158,K156,K154,K152,K150,K148)","v":0},null,{"$f":"SUM(M158,M156,M154,M152,M150,M148)","v":0},null,{"$f":"SUM(O158,O156,O154,O152,O150,O148)","v":0},null,{"$f":"SUM(Q158,Q156,Q154,Q152,Q150,Q148)","v":0},null,{"$f":"SUM(S158,S156,S154,S152,S150,S148)","v":0},null,{"$f":"SUM(U158,U156,U154,U152,U150,U148)","v":0},null,{"$f":"SUM(W158,W156,W154,W152,W150,W148)","v":0},null,{"$f":"SUM(Y158,Y156,Y154,Y152,Y150,Y148)","v":0},null,{"$f":"SUM(AA158,AA156,AA154,AA152,AA150,AA148)","v":0},null,{"$f":"SUM(AC154,AC156,AC158,AC152,AC150,AC148)","v":0}]
[]
[null,null,"TOTAL OM&A COSTS RELATED TO MINIMUM FUNCTIONALITY",null,null,null,{"$f":"SUM(G118,G126,G136,G144,G160)","v":0},null,{"$f":"SUM(I118,I126,I136,I144,I160)","v":0},null,{"$f":"SUM(K118,K126,K136,K144,K160)","v":0},null,{"$f":"SUM(M118,M126,M136,M144,M160)","v":0},null,{"$f":"SUM(O118,O126,O136,O144,O160)","v":0},null,{"$f":"SUM(Q118,Q126,Q136,Q144,Q160)","v":0},null,{"$f":"SUM(S118,S126,S136,S144,S160)","v":0},null,{"$f":"SUM(U118,U126,U136,U144,U160)","v":0},null,{"$f":"SUM(W118,W126,W136,W144,W160)","v":0},null,{"$f":"SUM(Y118,Y126,Y136,Y144,Y160)","v":0},null,{"$f":"SUM(AA118,AA126,AA136,AA144,AA160)","v":0},null,{"$f":"SUM(AC118,AC126,AC136,AC144,AC160)","v":0}]
[]
[null,null,"2.6  OM&A COSTS RELATED TO BEYOND MINIMUM FUNCTIONALITY",null,null,null,{"$f":"G112","v":"Audited Actual"},null,{"$f":"I112","v":"Audited Actual"},null,{"$f":"K112","v":"Audited Actual"},null,{"$f":"M112","v":"Audited Actual"},null,{"$f":"O112","v":"Audited Actual"},null,{"$f":"Q112","v":"Audited Actual"},null,{"$f":"S112","v":"Audited Actual"},null,"Audited Actual",null,"Forecast",null,{"$f":"Y112","v":"Forecast"},null,"Forecast"]
[null,null,"(Please provide a descriptive title and identify nature of beyond minimum functionality costs)"]
[null,null,"2.6.1  Costs related to technical capabilities in the smart meters or related communications infrastructure that exceed those specified in O.Reg 425/06",null,null,null,null,null,null,null,null,null,null,null,null,null,null,null,null,null,null,null,null,null,null,null,null,null,{"$f":"SUM(G166,I166,K166,M166,O166,Q166,S166,U166,W166,Y166,AA166)","v":0}]
[]
[null,null,"2.6.2  Costs for deployment of smart meters to customers other than residential                                                 and small general service ",null,null,null,null,null,null,null,null,null,null,null,null,null,null,null,null,null,null,null,null,null,null,null,null,null,{"$f":"SUM(G168,I168,K168,M168,O168,Q168,S168,U168,W168,Y168,AA168)","v":0}]
[]
[null,null,"2.6.3  Costs for TOU rate implementation, CIS system upgrades, web presentation,                                     integration with the MDM/R, etc.  ",null,null,null,null,null,null,null,null,null,null,null,null,null,null,null,null,null,null,null,null,null,null,null,null,null,{"$f":"SUM(G170,I170,K170,M170,O170,Q170,S170,U170,W170,Y170,AA170)","v":0}]
[]
[null,null,"Total OM&A Costs Beyond Minimum Functionality",null,null,null,{"$f":"SUM(G166,G168,G170)","v":0},null,{"$f":"SUM(I166,I168,I170)","v":0},null,{"$f":"SUM(K166,K168,K170)","v":0},null,{"$f":"SUM(M166,M168,M170)","v":0},null,{"$f":"SUM(O166,O168,O170)","v":0},null,{"$f":"SUM(Q166,Q168,Q170)","v":0},null,{"$f":"SUM(S166,S168,S170)","v":0},null,{"$f":"SUM(U166,U168,U170)","v":0},null,{"$f":"SUM(W166,W168,W170)","v":0},null,{"$f":"SUM(Y166,Y168,Y170)","v":0},null,{"$f":"SUM(AA166,AA168,AA170)","v":0},null,{"$f":"SUM(AC166,AC168,AC170)","v":0}]
[]
[null,null,"Total Smart Meter OM&A Costs",null,null,null,{"$f":"G162+G172","v":0},null,{"$f":"I162+I172","v":0},null,{"$f":"K162+K172","v":0},null,{"$f":"M162+M172","v":0},null,{"$f":"O162+O172","v":0},null,{"$f":"Q162+Q172","v":0},null,{"$f":"S162+S172","v":0},null,{"$f":"U162+U172","v":0},null,{"$f":"W162+W172","v":0},null,{"$f":"Y162+Y172","v":0},null,{"$f":"AA162+AA172","v":0},null,{"$f":"AC162+AC172","v":0}]
[]
[]
[null,3,"Aggregate Smart Meter Costs by Category"]
[]
[null,null,"3.1","Capital"]
[]
[null,null,"3.1.1","Smart Meter",null,null,{"$f":"SUMIF($E$42:$E$105,$D181,G$42:G$105)","v":0},null,{"$f":"SUMIF($E$42:$E$105,$D181,I$42:I$105)","v":0},null,{"$f":"SUMIF($E$42:$E$105,$D181,K$42:K$105)","v":0},null,{"$f":"SUMIF($E$42:$E$105,$D181,M$42:M$105)","v":0},null,{"$f":"SUMIF($E$42:$E$105,$D181,O$42:O$105)","v":0},null,{"$f":"SUMIF($E$42:$E$105,$D181,Q$42:Q$105)","v":0},null,{"$f":"SUMIF($E$42:$E$105,$D181,S$42:S$105)","v":0},null,{"$f":"SUMIF($E$42:$E$105,$D181,U$42:U$105)","v":0},null,{"$f":"SUMIF($E$42:$E$105,$D181,W$42:W$105)","v":0},null,{"$f":"SUMIF($E$42:$E$105,$D181,Y$42:Y$105)","v":0},null,{"$f":"SUMIF($E$42:$E$105,$D181,AA$42:AA$105)","v":0},null,{"$f":"SUM(G181:AA181)","v":0}]
[]
[null,null,"3.1.2","Computer Hardware",null,null,{"$f":"SUMIF($E$42:$E$105,$D183,G$42:G$105)","v":0},null,{"$f":"SUMIF($E$42:$E$105,$D183,I$42:I$105)","v":0},null,{"$f":"SUMIF($E$42:$E$105,$D183,K$42:K$105)","v":0},null,{"$f":"SUMIF($E$42:$E$105,$D183,M$42:M$105)","v":0},null,{"$f":"SUMIF($E$42:$E$105,$D183,O$42:O$105)","v":0},null,{"$f":"SUMIF($E$42:$E$105,$D183,Q$42:Q$105)","v":39469.99},null,{"$f":"SUMIF($E$42:$E$105,$D183,S$42:S$105)","v":0},null,{"$f":"SUMIF($E$42:$E$105,$D183,U$42:U$105)","v":0},null,{"$f":"SUMIF($E$42:$E$105,$D183,W$42:W$105)","v":0},null,{"$f":"SUMIF($E$42:$E$105,$D183,Y$42:Y$105)","v":0},null,{"$f":"SUMIF($E$42:$E$105,$D183,AA$42:AA$105)","v":0},null,{"$f":"SUM(G183:AA183)","v":39469.99}]
[]
[null,null,"3.1.3","Computer Software",null,null,{"$f":"SUMIF($E$42:$E$105,$D185,G$42:G$105)","v":0},null,{"$f":"SUMIF($E$42:$E$105,$D185,I$42:I$105)","v":0},null,{"$f":"SUMIF($E$42:$E$105,$D185,K$42:K$105)","v":0},null,{"$f":"SUMIF($E$42:$E$105,$D185,M$42:M$105)","v":0},null,{"$f":"SUMIF($E$42:$E$105,$D185,O$42:O$105)","v":0},null,{"$f":"SUMIF($E$42:$E$105,$D185,Q$42:Q$105)","v":0},null,{"$f":"SUMIF($E$42:$E$105,$D185,S$42:S$105)","v":0},null,{"$f":"SUMIF($E$42:$E$105,$D185,U$42:U$105)","v":0},null,{"$f":"SUMIF($E$42:$E$105,$D185,W$42:W$105)","v":0},null,{"$f":"SUMIF($E$42:$E$105,$D185,Y$42:Y$105)","v":0},null,{"$f":"SUMIF($E$42:$E$105,$D185,AA$42:AA$105)","v":0},null,{"$f":"SUM(G185:AA185)","v":0}]
[]
[null,null,"3.1.4","Tools & Equipment",null,null,{"$f":"SUMIF($E$42:$E$105,$D187,G$42:G$105)","v":0},null,{"$f":"SUMIF($E$42:$E$105,$D187,I$42:I$105)","v":0},null,{"$f":"SUMIF($E$42:$E$105,$D187,K$42:K$105)","v":0},null,{"$f":"SUMIF($E$42:$E$105,$D187,M$42:M$105)","v":0},null,{"$f":"SUMIF($E$42:$E$105,$D187,O$42:O$105)","v":0},null,{"$f":"SUMIF($E$42:$E$105,$D187,Q$42:Q$105)","v":0},null,{"$f":"SUMIF($E$42:$E$105,$D187,S$42:S$105)","v":0},null,{"$f":"SUMIF($E$42:$E$105,$D187,U$42:U$105)","v":0},null,{"$f":"SUMIF($E$42:$E$105,$D187,W$42:W$105)","v":0},null,{"$f":"SUMIF($E$42:$E$105,$D187,Y$42:Y$105)","v":0},null,{"$f":"SUMIF($E$42:$E$105,$D187,AA$42:AA$105)","v":0},null,{"$f":"SUM(G187:AA187)","v":0}]
[]
[null,null,"3.1.5","Other Equipment",null,null,{"$f":"SUMIF($E$42:$E$105,$D189,G$42:G$105)","v":0},null,{"$f":"SUMIF($E$42:$E$105,$D189,I$42:I$105)","v":0},null,{"$f":"SUMIF($E$42:$E$105,$D189,K$42:K$105)","v":0},null,{"$f":"SUMIF($E$42:$E$105,$D189,M$42:M$105)","v":0},null,{"$f":"SUMIF($E$42:$E$105,$D189,O$42:O$105)","v":0},null,{"$f":"SUMIF($E$42:$E$105,$D189,Q$42:Q$105)","v":0},null,{"$f":"SUMIF($E$42:$E$105,$D189,S$42:S$105)","v":0},null,{"$f":"SUMIF($E$42:$E$105,$D189,U$42:U$105)","v":0},null,{"$f":"SUMIF($E$42:$E$105,$D189,W$42:W$105)","v":0},null,{"$f":"SUMIF($E$42:$E$105,$D189,Y$42:Y$105)","v":0},null,{"$f":"SUMIF($E$42:$E$105,$D189,AA$42:AA$105)","v":0},null,{"$f":"SUM(G189:AA189)","v":0}]
[]
[null,null,"3.1.6","Applications Software",null,null,{"$f":"SUMIF($E$42:$E$105,$D191,G$42:G$105)","v":0},null,{"$f":"SUMIF($E$42:$E$105,$D191,I$42:I$105)","v":0},null,{"$f":"SUMIF($E$42:$E$105,$D191,K$42:K$105)","v":0},null,{"$f":"SUMIF($E$42:$E$105,$D191,M$42:M$105)","v":0},null,{"$f":"SUMIF($E$42:$E$105,$D191,O$42:O$105)","v":0},null,{"$f":"SUMIF($E$42:$E$105,$D191,Q$42:Q$105)","v":0},null,{"$f":"SUMIF($E$42:$E$105,$D191,S$42:S$105)","v":0},null,{"$f":"SUMIF($E$42:$E$105,$D191,U$42:U$105)","v":0},null,{"$f":"SUMIF($E$42:$E$105,$D191,W$42:W$105)","v":0},null,{"$f":"SUMIF($E$42:$E$105,$D191,Y$42:Y$105)","v":0},null,{"$f":"SUMIF($E$42:$E$105,$D191,AA$42:AA$105)","v":0},null,{"$f":"SUM(G191:AA191)","v":0}]
[]
[null,null,"3.1.7","Total Capital Costs",null,null,{"$f":"SUM(G181:G191)","v":0},null,{"$f":"SUM(I181:I191)","v":0},null,{"$f":"SUM(K181:K191)","v":0},null,{"$f":"SUM(M181:M191)","v":0},null,{"$f":"SUM(O181:O191)","v":0},null,{"$f":"SUM(Q181:Q191)","v":39469.99},null,{"$f":"SUM(S181:S191)","v":0},null,{"$f":"SUM(U181:U191)","v":0},null,{"$f":"SUM(W181:W191)","v":0},null,{"$f":"SUM(Y181:Y191)","v":0},null,{"$f":"SUM(AA181:AA191)","v":0},null,{"$f":"SUM(AC181:AC191)","v":39469.99}]
[null,null,null,null,null,null,{"$f":"IF(G193=G109,\"\",\"Error\")","v":""},null,{"$f":"IF(I193=I109,\"\",\"Error\")","v":""},null,{"$f":"IF(K193=K109,\"\",\"Error\")","v":""},null,{"$f":"IF(M193=M109,\"\",\"Error\")","v":""},null,{"$f":"IF(O193=O109,\"\",\"Error\")","v":""},null,{"$f":"IF(Q193=Q109,\"\",\"Error\")","v":""},null,{"$f":"IF(S193=S109,\"\",\"Error\")","v":""},null,{"$f":"IF(U193=U109,\"\",\"Error\")","v":""},null,{"$f":"IF(W193=W109,\"\",\"Error\")","v":""},null,{"$f":"IF(Y193=Y109,\"\",\"Error\")","v":""},null,{"$f":"IF(AA193=AA109,\"\",\"Error\")","v":""},null,{"$f":"IF(AC193=AC109,\"\",\"Error\")","v":""}]
[null,null,"3.2","OM&A Costs"]
[]
[null,null,"3.2.1","Total OM&A Costs",null,null,{"$f":"G174","v":0},null,{"$f":"I174","v":0},null,{"$f":"K174","v":0},null,{"$f":"M174","v":0},null,{"$f":"O174","v":0},null,{"$f":"Q174","v":0},null,{"$f":"S174","v":0},null,{"$f":"U174","v":0},null,{"$f":"W174","v":0},null,{"$f":"Y174","v":0},null,{"$f":"AA174","v":0},null,{"$f":"AC174","v":0}]

{"sheet":"3. Cost_of_Service_Parameters","index":2,"n_rows":72,"n_cols":27,"rows_kept":72,"cut":false,"hidden":false,"merged":[]}
[]
[]
[]
[]
[]
[]
[]
[]
[]
[]
[]
[]
[]
[]
[]
[]
[]
[]
[null,null,null,null,null,null,2006,null,2007,null,2008,null,2009,null,2010,null,2011,null,2012,null,2013,null,2014,null,2015,null,2016]
[null,"Cost of Capital"]
[null,null,"Capital Structure1"]
[null,null,null,"Deemed Short-term Debt Capitalization",null,null,null,null,null,null,null,null,null,null,null,null,0.04,null,0.04,null,0.04,null,0.04,null,0.04,null,0.04]
[null,null,null,"Deemed Long-term Debt Capitalization",null,null,null,null,{"$f":"G23","v":0},null,{"$f":"IF(I23=50%,53.3%-K22,IF(I23=55%,57.5%-K22,IF(I23=65%,62.5%-K22,60%-K22)))","v":0.6},null,{"$f":"IF(I23=50%,56.7%-M22,60%-M22)","v":0.6},null,{"$f":"60%-O22","v":0.6},null,{"$f":"O23-(Q22-O22)","v":0.55999999999999994},null,{"$f":"Q23-(S22-Q22)","v":0.55999999999999994},null,{"$f":"S23-(U22-S22)","v":0.55999999999999994},null,{"$f":"U23-(W22-U22)","v":0.55999999999999994},null,{"$f":"W23-(Y22-W22)","v":0.55999999999999994},null,{"$f":"Y23-(AA22-Y22)","v":0.55999999999999994}]
[null,null,null,"Deemed Equity Capitalization",null,null,{"$f":"100%-G23-G25","v":1},null,{"$f":"100%-I23-I25-I22","v":1},null,{"$f":"100%-K23-K25-K22","v":0.4},null,{"$f":"100%-M23-M25-M22","v":0.4},null,{"$f":"100%-O23-O25-O22","v":0.4},null,{"$f":"100%-Q23-Q25-Q22","v":0.40000000000000008},null,{"$f":"100%-S23-S25-S22","v":0.40000000000000008},null,{"$f":"100%-U23-U25-U22","v":0.40000000000000008},null,{"$f":"100%-W23-W25-W22","v":0.40000000000000008},null,{"$f":"100%-Y23-Y25-Y22","v":0.40000000000000008},null,{"$f":"100%-AA23-AA25-AA22","v":0.40000000000000008}]
[null,null,null,"Preferred Shares"]
[null,null,"Total",null,null,null,{"$f":"SUM(G22:G25)","v":1},null,{"$f":"SUM(I22:I25)","v":1},null,{"$f":"SUM(K22:K25)","v":1},null,{"$f":"SUM(M22:M25)","v":1},null,{"$f":"SUM(O22:O25)","v":1},null,{"$f":"SUM(Q22:Q25)","v":1},null,{"$f":"SUM(S22:S25)","v":1},null,{"$f":"SUM(U22:U25)","v":1},null,{"$f":"SUM(W22:W25)","v":1},null,{"$f":"SUM(Y22:Y25)","v":1},null,{"$f":"SUM(AA22:AA25)","v":1}]
[]
[null,null,"Cost of Capital Parameters"]
[null,null,null,"Deemed Short-term Debt Rate",null,null,null,null,null,null,null,null,null,null,null,null,4.4699999999999997E-2,null,2.0799999999999999E-2,null,2.0799999999999999E-2,null,2.0799999999999999E-2,null,2.0799999999999999E-2,null,{"$f":"'[3]App.2-OA Capital Structure'!$K$23","v":1.6500000000000001E-2}]
[null,null,null,"Long-term Debt Rate (actual/embedded/deemed)2",null,null,{"$f":"IF(G23=50%,6.25%,IF(G23=55%,6%,IF(G23=60%,5.9%,5.8%)))","v":5.7999999999999996E-2},null,{"$f":"G30","v":5.7999999999999996E-2},null,null,null,null,null,null,null,4.99E-2,null,3.7499999999999999E-2,null,3.7499999999999999E-2,null,3.7499999999999999E-2,null,3.7499999999999999E-2,null,{"$f":"'[3]App.2-OA Capital Structure'!$K$22","v":3.3599999999999998E-2}]
[null,null,null,"Target Return on Equity (ROE)",null,null,0.09,null,{"$f":"G31","v":0.09},null,null,null,null,null,null,null,8.5699999999999998E-2,null,9.1200000000000003E-2,null,9.1200000000000003E-2,null,9.1200000000000003E-2,null,9.1200000000000003E-2,null,9.1899999999999996E-2]
[null,null,null,"Return on Preferred Shares"]
[null,null,"WACC",null,null,null,{"$f":"SUMPRODUCT(G22:G25,G29:G32)","v":0.09},null,{"$f":"SUMPRODUCT(I22:I25,I29:I32)","v":0.09},null,{"$f":"SUMPRODUCT(K22:K25,K29:K32)","v":0},null,{"$f":"SUMPRODUCT(M22:M25,M29:M32)","v":0},null,{"$f":"SUMPRODUCT(O22:O25,O29:O32)","v":0},null,{"$f":"SUMPRODUCT(Q22:Q25,Q29:Q32)","v":6.4011999999999999E-2},null,{"$f":"SUMPRODUCT(S22:S25,S29:S32)","v":5.8312000000000003E-2},null,{"$f":"SUMPRODUCT(U22:U25,U29:U32)","v":5.8312000000000003E-2},null,{"$f":"SUMPRODUCT(W22:W25,W29:W32)","v":5.8312000000000003E-2},null,{"$f":"SUMPRODUCT(Y22:Y25,Y29:Y32)","v":5.8312000000000003E-2},null,{"$f":"SUMPRODUCT(AA22:AA25,AA29:AA32)","v":5.6236000000000008E-2}]
[]
[null,"Working Capital Allowance"]
[null,null,"Working Capital Allowance Rate",null,null,null,null,null,null,null,null,null,null,null,null,null,0.15,null,0.15,null,0.15,null,0.15,null,0.15,null,7.4999999999999997E-2]
[null,null,"(% of the sum of Cost of Power + controllable expenses)"]
[]
[null,"Taxes/PILs"]
[null,null,"Aggregate Corporate Income Tax Rate",null,null,null,0.36120000000000002,null,0.36120000000000002,null,0.33500000000000002,null,0.33,null,0.31,null,0.155,null,0.155,null,0.155,null,0.155,null,0.155,null,0.155]
[null,null,"Capital Tax (until July 1st, 2010)",null,null,null,3.0000000000000001E-3,null,2.2499999999999998E-3,null,2.2499999999999998E-3,null,2.2499999999999998E-3,null,7.5000000000000002E-4,null,0,null,0,null,0,null,0,null,0,null,0]
[]
[null,"Depreciation Rates"]
[null,"(expressed as expected useful life in years)"]
[null,null,"Smart Meters          - years"]
[null,null,"                              - rate (%)",null,null,null,{"$f":"IF(G45=0,0,1/G45)","v":0},null,{"$f":"IF(I45=0,0,1/I45)","v":0},null,{"$f":"IF(K45=0,0,1/K45)","v":0},null,{"$f":"IF(M45=0,0,1/M45)","v":0},null,{"$f":"IF(O45=0,0,1/O45)","v":0},null,{"$f":"IF(Q45=0,0,1/Q45)","v":0},null,{"$f":"IF(S45=0,0,1/S45)","v":0},null,{"$f":"IF(U45=0,0,1/U45)","v":0},null,{"$f":"IF(W45=0,0,1/W45)","v":0},null,{"$f":"IF(Y45=0,0,1/Y45)","v":0},null,{"$f":"IF(AA45=0,0,1/AA45)","v":0}]
[null,null,"Computer Hardware - years",null,null,null,null,null,null,null,null,null,null,null,null,null,5,null,5,null,5,null,5,null,5,null,5]
[null,null,"                             - rate (%)",null,null,null,{"$f":"IF(G47=0,0,1/G47)","v":0},null,{"$f":"IF(I47=0,0,1/I47)","v":0},null,{"$f":"IF(K47=0,0,1/K47)","v":0},null,{"$f":"IF(M47=0,0,1/M47)","v":0},null,{"$f":"IF(O47=0,0,1/O47)","v":0},null,{"$f":"IF(Q47=0,0,1/Q47)","v":0.2},null,{"$f":"IF(S47=0,0,1/S47)","v":0.2},null,{"$f":"IF(U47=0,0,1/U47)","v":0.2},null,{"$f":"IF(W47=0,0,1/W47)","v":0.2},null,{"$f":"IF(Y47=0,0,1/Y47)","v":0.2},null,{"$f":"IF(AA47=0,0,1/AA47)","v":0.2}]
[null,null,"Computer Software - years"]
[null,null,"                             - rate (%)",null,null,null,{"$f":"IF(G49=0,0,1/G49)","v":0},null,{"$f":"IF(I49=0,0,1/I49)","v":0},null,{"$f":"IF(K49=0,0,1/K49)","v":0},null,{"$f":"IF(M49=0,0,1/M49)","v":0},null,{"$f":"IF(O49=0,0,1/O49)","v":0},null,{"$f":"IF(Q49=0,0,1/Q49)","v":0},null,{"$f":"IF(S49=0,0,1/S49)","v":0},null,{"$f":"IF(U49=0,0,1/U49)","v":0},null,{"$f":"IF(W49=0,0,1/W49)","v":0},null,{"$f":"IF(Y49=0,0,1/Y49)","v":0},null,{"$f":"IF(AA49=0,0,1/AA49)","v":0}]
[null,null,"Tools & Equipment - years"]
[null,null,"                             - rate (%)",null,null,null,{"$f":"IF(G51=0,0,1/G51)","v":0},null,{"$f":"IF(I51=0,0,1/I51)","v":0},null,{"$f":"IF(K51=0,0,1/K51)","v":0},null,{"$f":"IF(M51=0,0,1/M51)","v":0},null,{"$f":"IF(O51=0,0,1/O51)","v":0},null,{"$f":"IF(Q51=0,0,1/Q51)","v":0},null,{"$f":"IF(S51=0,0,1/S51)","v":0},null,{"$f":"IF(U51=0,0,1/U51)","v":0},null,{"$f":"IF(W51=0,0,1/W51)","v":0},null,{"$f":"IF(Y51=0,0,1/Y51)","v":0},null,{"$f":"IF(AA51=0,0,1/AA51)","v":0}]
[null,null,"Other Equipment    - years"]
[null,null,"                             - rate (%)",null,null,null,{"$f":"IF(G53=0,0,1/G53)","v":0},null,{"$f":"IF(I53=0,0,1/I53)","v":0},null,{"$f":"IF(K53=0,0,1/K53)","v":0},null,{"$f":"IF(M53=0,0,1/M53)","v":0},null,{"$f":"IF(O53=0,0,1/O53)","v":0},null,{"$f":"IF(Q53=0,0,1/Q53)","v":0},null,{"$f":"IF(S53=0,0,1/S53)","v":0},null,{"$f":"IF(U53=0,0,1/U53)","v":0},null,{"$f":"IF(W53=0,0,1/W53)","v":0},null,{"$f":"IF(Y53=0,0,1/Y53)","v":0},null,{"$f":"IF(AA53=0,0,1/AA53)","v":0}]
[]
[null,"CCA Rates"]
[null,null,"Smart Meters - CCA Class"]
[null,null,"Smart Meters - CCA Rate"]
[]
[null,null,"Computer Equipment - CCA Class",null,null,null,null,null,null,null,null,null,null,null,null,null,50,null,50,null,50,null,50,null,50,null,50]
[null,null,"Computer Equipment - CCA Rate",null,null,null,null,null,null,null,null,null,null,null,null,null,0.55000000000000004,null,0.55000000000000004,null,0.55000000000000004,null,0.55000000000000004,null,0.55000000000000004,null,0.55000000000000004]
[]
[null,null,"General Equipment - CCA Class"]
[null,null,"General Equipment - CCA Rate"]
[]
[null,null,"Applications Software - CCA Class"]
[null,null,"Applications Software - CCA Rate"]
[]
[null,"Assumptions"]
[null,1,"Planned smart meter installations occur evenly throughout the year."]
[null,2,"Fiscal calendar year (January 1 to December 31) used."]
[null,3,"Amortization is done on a striaght line basis and has the \"half-year\" rule applied."]

{"sheet":"4. SM_Assets_and_Rate_Base","index":3,"n_rows":112,"n_cols":27,"rows_kept":112,"cut":false,"hidden":false,"merged":[]}
[]
[]
[]
[]
[]
[]
[]
[]
[]
[]
[]
[]
[]
[]
[]
[]
[]
[null,null,null,null,null,null,2006,null,2007,null,2008,null,2009,null,2010,null,2011,null,2012,null,2013,null,2014,null,2015,null,2016]
[null,"Net Fixed Assets - Smart Meters"]
[]
[null,null,"Gross Book Value"]
[null,null,null,"Opening Balance",null,null,null,null,{"$f":"G25","v":0},null,{"$f":"I25","v":0},null,{"$f":"K25","v":0},null,{"$f":"M25","v":0},null,{"$f":"O25","v":0},null,{"$f":"Q25","v":0},null,{"$f":"S25","v":0},null,{"$f":"U25","v":0},null,{"$f":"W25","v":0},null,{"$f":"Y25","v":0}]
[null,null,null,"Capital Additions during year (from Smart Meter Costs)",null,null,{"$f":"'2. Smart_Meter_Costs'!G181","v":0},null,{"$f":"'2. Smart_Meter_Costs'!I181","v":0},null,{"$f":"'2. Smart_Meter_Costs'!K181","v":0},null,{"$f":"'2. Smart_Meter_Costs'!M181","v":0},null,{"$f":"'2. Smart_Meter_Costs'!O181","v":0},null,{"$f":"'2. Smart_Meter_Costs'!Q181","v":0},null,{"$f":"'2. Smart_Meter_Costs'!S181","v":0},null,{"$f":"'2. Smart_Meter_Costs'!U181","v":0},null,{"$f":"'2. Smart_Meter_Costs'!W181","v":0},null,{"$f":"'2. Smart_Meter_Costs'!Y181","v":0},null,{"$f":"'2. Smart_Meter_Costs'!AA181","v":0}]
[null,null,null,"Retirements/Removals (if applicable)"]
[null,null,null,"Closing Balance",null,null,{"$f":"G22+G23-G24","v":0},null,{"$f":"I22+I23-I24","v":0},null,{"$f":"K22+K23-K24","v":0},null,{"$f":"M22+M23-M24","v":0},null,{"$f":"O22+O23-O24","v":0},null,{"$f":"Q22+Q23-Q24","v":0},null,{"$f":"S22+S23-S24","v":0},null,{"$f":"U22+U23-U24","v":0},null,{"$f":"W22+W23-W24","v":0},null,{"$f":"Y22+Y23-Y24","v":0},null,{"$f":"AA22+AA23-AA24","v":0}]
[]
[null,null,"Accumulated Depreciation"]
[null,null,null,"Opening Balance",null,null,null,null,{"$f":"G31","v":0},null,{"$f":"I31","v":0},null,{"$f":"K31","v":0},null,{"$f":"M31","v":0},null,{"$f":"O31","v":0},null,{"$f":"Q31","v":0},null,{"$f":"S31","v":0},null,{"$f":"U31","v":0},null,{"$f":"W31","v":0},null,{"$f":"Y31","v":0}]
[null,null,null,"Amortization expense during year",null,null,{"$f":"IF(ISERROR(-G23/('3. Cost_of_Service_Parameters'!G45*2)), 0, -G23/('3. Cost_of_Service_Parameters'!G45*2))","v":0},null,{"$f":"IF(ISERROR(-(I23/('3. Cost_of_Service_Parameters'!I45*2)+MIN((I22/'3. Cost_of_Service_Parameters'!I45),(I22+I28)))), 0, -(I23/('3. Cost_of_Service_Parameters'!I45*2)+MIN((I22/'3. Cost_of_Service_Parameters'!I45),(I22+I28))))","v":0},null,{"$f":"IF(ISERROR(-(K23/('3. Cost_of_Service_Parameters'!K45*2)+MIN((K22/'3. Cost_of_Service_Parameters'!K45),(K22+K28)))), 0, -(K23/('3. Cost_of_Service_Parameters'!K45*2)+MIN((K22/'3. Cost_of_Service_Parameters'!K45),(K22+K28))))","v":0},null,{"$f":"IF(ISERROR(-(M23/('3. Cost_of_Service_Parameters'!M45*2)+MIN((M22/'3. Cost_of_Service_Parameters'!M45),(M22+M28)))), 0,-(M23/('3. Cost_of_Service_Parameters'!M45*2)+MIN((M22/'3. Cost_of_Service_Parameters'!M45),(M22+M28))))","v":0},null,{"$f":"IF(ISERROR(-(O23/('3. Cost_of_Service_Parameters'!O45*2)+MIN((O22/'3. Cost_of_Service_Parameters'!O45),(O22+O28)))), 0, -(O23/('3. Cost_of_Service_Parameters'!O45*2)+MIN((O22/'3. Cost_of_Service_Parameters'!O45),(O22+O28))))","v":0},null,{"$f":"IF(ISERROR(-(Q23/('3. Cost_of_Service_Parameters'!Q45*2)+MIN((Q22/'3. Cost_of_Service_Parameters'!Q45),(Q22+Q28)))), 0, -(Q23/('3. Cost_of_Service_Parameters'!Q45*2)+MIN((Q22/'3. Cost_of_Service_Parameters'!Q45),(Q22+Q28))))","v":0},null,{"$f":"IF(ISERROR(-(S23/('3. Cost_of_Service_Parameters'!S45*2)+MIN((S22/'3. Cost_of_Service_Parameters'!S45),(S22+S28)))), 0, -(S23/('3. Cost_of_Service_Parameters'!S45*2)+MIN((S22/'3. Cost_of_Service_Parameters'!S45),(S22+S28))))","v":0},null,{"$f":"IF(ISERROR(-(U23/('3. Cost_of_Service_Parameters'!U45*2)+MIN((U22/'3. Cost_of_Service_Parameters'!U45),(U22+U28)))), 0, -(U23/('3. Cost_of_Service_Parameters'!U45*2)+MIN((U22/'3. Cost_of_Service_Parameters'!U45),(U22+U28))))","v":0},null,{"$f":"IF(ISERROR(-(W23/('3. Cost_of_Service_Parameters'!W45*2)+MIN((W22/'3. Cost_of_Service_Parameters'!W45),(W22+W28)))), 0, -(W23/('3. Cost_of_Service_Parameters'!W45*2)+MIN((W22/'3. Cost_of_Service_Parameters'!W45),(W22+W28))))","v":0},null,{"$f":"IF(ISERROR(-(Y23/('3. Cost_of_Service_Parameters'!Y45*2)+MIN((Y22/'3. Cost_of_Service_Parameters'!Y45),(Y22+Y28)))), 0, -(Y23/('3. Cost_of_Service_Parameters'!Y45*2)+MIN((Y22/'3. Cost_of_Service_Parameters'!Y45),(Y22+Y28))))","v":0},null,{"$f":"IF(ISERROR(-(AA23/('3. Cost_of_Service_Parameters'!AA45*2)+MIN((AA22/'3. Cost_of_Service_Parameters'!AA45),(AA22+AA28)))), 0, -(AA23/('3. Cost_of_Service_Parameters'!AA45*2)+MIN((AA22/'3. Cost_of_Service_Parameters'!AA45),(AA22+AA28))))","v":0}]
[null,null,null,"Retirements/Removals (if applicable)"]
[null,null,null,"Closing Balance",null,null,{"$f":"G28+G29-G30","v":0},null,{"$f":"I28+I29-I30","v":0},null,{"$f":"K28+K29-K30","v":0},null,{"$f":"M28+M29-M30","v":0},null,{"$f":"O28+O29-O30","v":0},null,{"$f":"Q28+Q29-Q30","v":0},null,{"$f":"S28+S29-S30","v":0},null,{"$f":"U28+U29-U30","v":0},null,{"$f":"W28+W29-W30","v":0},null,{"$f":"Y28+Y29-Y30","v":0},null,{"$f":"AA28+AA29-AA30","v":0}]
[]
[null,null,"Net Book Value"]
[null,null,null,"Opening Balance",null,null,{"$f":"G22+G28","v":0},null,{"$f":"G35","v":0},null,{"$f":"I35","v":0},null,{"$f":"K35","v":0},null,{"$f":"M35","v":0},null,{"$f":"O35","v":0},null,{"$f":"Q35","v":0},null,{"$f":"S35","v":0},null,{"$f":"U35","v":0},null,{"$f":"W35","v":0},null,{"$f":"Y35","v":0}]
[null,null,null,"Closing Balance",null,null,{"$f":"G25+G31","v":0},null,{"$f":"I25+I31","v":0},null,{"$f":"K25+K31","v":0},null,{"$f":"M25+M31","v":0},null,{"$f":"O25+O31","v":0},null,{"$f":"Q25+Q31","v":0},null,{"$f":"S25+S31","v":0},null,{"$f":"U25+U31","v":0},null,{"$f":"W25+W31","v":0},null,{"$f":"Y25+Y31","v":0},null,{"$f":"AA25+AA31","v":0}]
[null,null,null,"Average Net Book Value",null,null,{"$f":"AVERAGE(G34:G35)","v":0},null,{"$f":"AVERAGE(I34:I35)","v":0},null,{"$f":"AVERAGE(K34:K35)","v":0},null,{"$f":"AVERAGE(M34:M35)","v":0},null,{"$f":"AVERAGE(O34:O35)","v":0},null,{"$f":"AVERAGE(Q34:Q35)","v":0},null,{"$f":"AVERAGE(S34:S35)","v":0},null,{"$f":"AVERAGE(U34:U35)","v":0},null,{"$f":"AVERAGE(W34:W35)","v":0},null,{"$f":"AVERAGE(Y34:Y35)","v":0},null,{"$f":"AVERAGE(AA34:AA35)","v":0}]
[]
[null,"Net Fixed Assets - Computer Hardware"]
[]
[null,null,"Gross Book Value"]
[null,null,null,"Opening Balance",null,null,null,null,{"$f":"G44","v":0},null,{"$f":"I44","v":0},null,{"$f":"K44","v":0},null,{"$f":"M44","v":0},null,{"$f":"O44","v":0},null,{"$f":"Q44","v":39469.99},null,{"$f":"S44","v":39469.99},null,{"$f":"U44","v":39469.99},null,{"$f":"W44","v":39469.99},null,{"$f":"Y44","v":39469.99}]
[null,null,null,"Capital Additions during year (from Smart Meter Costs)",null,null,{"$f":"'2. Smart_Meter_Costs'!G183","v":0},null,{"$f":"'2. Smart_Meter_Costs'!I183","v":0},null,{"$f":"'2. Smart_Meter_Costs'!K183","v":0},null,{"$f":"'2. Smart_Meter_Costs'!M183","v":0},null,{"$f":"'2. Smart_Meter_Costs'!O183","v":0},null,{"$f":"'2. Smart_Meter_Costs'!Q183","v":39469.99},null,{"$f":"'2. Smart_Meter_Costs'!S183","v":0},null,{"$f":"'2. Smart_Meter_Costs'!U183","v":0},null,{"$f":"'2. Smart_Meter_Costs'!W183","v":0},null,{"$f":"'2. Smart_Meter_Costs'!Y183","v":0},null,{"$f":"'2. Smart_Meter_Costs'!AA183","v":0}]
[null,null,null,"Retirements/Removals (if applicable)"]
[null,null,null,"Closing Balance",null,null,{"$f":"G41+G42-G43","v":0},null,{"$f":"I41+I42-I43","v":0},null,{"$f":"K41+K42-K43","v":0},null,{"$f":"M41+M42-M43","v":0},null,{"$f":"O41+O42-O43","v":0},null,{"$f":"Q41+Q42-Q43","v":39469.99},null,{"$f":"S41+S42-S43","v":39469.99},null,{"$f":"U41+U42-U43","v":39469.99},null,{"$f":"W41+W42-W43","v":39469.99},null,{"$f":"Y41+Y42-Y43","v":39469.99},null,{"$f":"AA41+AA42-AA43","v":39469.99}]
[]
[null,null,"Accumulated Depreciation"]
[null,null,null,"Opening Balance",null,null,0,null,{"$f":"G50","v":0},null,{"$f":"I50","v":0},null,{"$f":"K50","v":0},null,{"$f":"M50","v":0},null,{"$f":"O50","v":0},null,{"$f":"Q50","v":-3946.9989999999998},null,{"$f":"S50","v":-11840.996999999999},null,{"$f":"U50","v":-19734.994999999999},null,{"$f":"W50","v":-27628.992999999999},null,{"$f":"Y50","v":-35522.990999999995}]
[null,null,null,"Amortization expense during year",null,null,{"$f":"IF(ISERROR(-G42/('3. Cost_of_Service_Parameters'!G47*2)), 0, -G42/('3. Cost_of_Service_Parameters'!G47*2))","v":0},null,{"$f":"IF(ISERROR(-(I42/('3. Cost_of_Service_Parameters'!I47*2)+MIN((I41/'3. Cost_of_Service_Parameters'!I47),(I41+I47)))), 0, -(I42/('3. Cost_of_Service_Parameters'!I47*2)+MIN((I41/'3. Cost_of_Service_Parameters'!I47),(I41+I47))))","v":0},null,{"$f":"IF(ISERROR(-(K42/('3. Cost_of_Service_Parameters'!K47*2)+MIN((K41/'3. Cost_of_Service_Parameters'!K47),(K41+K47)))), 0, -(K42/('3. Cost_of_Service_Parameters'!K47*2)+MIN((K41/'3. Cost_of_Service_Parameters'!K47),(K41+K47))))","v":0},null,{"$f":"IF(ISERROR(-(M42/('3. Cost_of_Service_Parameters'!M47*2)+MIN((M41/'3. Cost_of_Service_Parameters'!M47),(M41+M47)))), 0,-(M42/('3. Cost_of_Service_Parameters'!M47*2)+MIN((M41/'3. Cost_of_Service_Parameters'!M47),(M41+M47))))","v":0},null,{"$f":"IF(ISERROR(-(O42/('3. Cost_of_Service_Parameters'!O47*2)+MIN((O41/'3. Cost_of_Service_Parameters'!O47),(O41+O47)))), 0, -(O42/('3. Cost_of_Service_Parameters'!O47*2)+MIN((O41/'3. Cost_of_Service_Parameters'!O47),(O41+O47))))","v":0},null,{"$f":"IF(ISERROR(-(Q42/('3. Cost_of_Service_Parameters'!Q47*2)+MIN((Q41/'3. Cost_of_Service_Parameters'!Q47),(Q41+Q47)))), 0, -(Q42/('3. Cost_of_Service_Parameters'!Q47*2)+MIN((Q41/'3. Cost_of_Service_Parameters'!Q47),(Q41+Q47))))","v":-3946.9989999999998},null,{"$f":"IF(ISERROR(-(S42/('3. Cost_of_Service_Parameters'!S47*2)+MIN((S41/'3. Cost_of_Service_Parameters'!S47),(S41+S47)))), 0, -(S42/('3. Cost_of_Service_Parameters'!S47*2)+MIN((S41/'3. Cost_of_Service_Parameters'!S47),(S41+S47))))","v":-7893.9979999999996},null,{"$f":"IF(ISERROR(-(U42/('3. Cost_of_Service_Parameters'!U47*2)+MIN((U41/'3. Cost_of_Service_Parameters'!U47),(U41+U47)))), 0, -(U42/('3. Cost_of_Service_Parameters'!U47*2)+MIN((U41/'3. Cost_of_Service_Parameters'!U47),(U41+U47))))","v":-7893.9979999999996},null,{"$f":"IF(ISERROR(-(W42/('3. Cost_of_Service_Parameters'!W47*2)+MIN((W41/'3. Cost_of_Service_Parameters'!W47),(W41+W47)))), 0, -(W42/('3. Cost_of_Service_Parameters'!W47*2)+MIN((W41/'3. Cost_of_Service_Parameters'!W47),(W41+W47))))","v":-7893.9979999999996},null,{"$f":"IF(ISERROR(-(Y42/('3. Cost_of_Service_Parameters'!Y47*2)+MIN((Y41/'3. Cost_of_Service_Parameters'!Y47),(Y41+Y47)))), 0, -(Y42/('3. Cost_of_Service_Parameters'!Y47*2)+MIN((Y41/'3. Cost_of_Service_Parameters'!Y47),(Y41+Y47))))","v":-7893.9979999999996},null,{"$f":"IF(ISERROR(-(AA42/('3. Cost_of_Service_Parameters'!AA47*2)+MIN((AA41/'3. Cost_of_Service_Parameters'!AA47),(AA41+AA47)))), 0, -(AA42/('3. Cost_of_Service_Parameters'!AA47*2)+MIN((AA41/'3. Cost_of_Service_Parameters'!AA47),(AA41+AA47))))","v":-3946.9990000000034}]
[null,null,null,"Retirements/Removals (if applicable)"]
[null,null,null,"Closing Balance",null,null,{"$f":"G47+G48-G49","v":0},null,{"$f":"I47+I48-I49","v":0},null,{"$f":"K47+K48-K49","v":0},null,{"$f":"M47+M48-M49","v":0},null,{"$f":"O47+O48-O49","v":0},null,{"$f":"Q47+Q48-Q49","v":-3946.9989999999998},null,{"$f":"S47+S48-S49","v":-11840.996999999999},null,{"$f":"U47+U48-U49","v":-19734.994999999999},null,{"$f":"W47+W48-W49","v":-27628.992999999999},null,{"$f":"Y47+Y48-Y49","v":-35522.990999999995},null,{"$f":"AA47+AA48-AA49","v":-39469.99}]
[]
[null,null,"Net Book Value"]
[null,null,null,"Opening Balance",null,null,{"$f":"G41+G47","v":0},null,{"$f":"G54","v":0},null,{"$f":"I54","v":0},null,{"$f":"K54","v":0},null,{"$f":"M54","v":0},null,{"$f":"O54","v":0},null,{"$f":"Q54","v":35522.990999999995},null,{"$f":"S54","v":27628.992999999999},null,{"$f":"U54","v":19734.994999999999},null,{"$f":"W54","v":11840.996999999999},null,{"$f":"Y54","v":3946.9990000000034}]
[null,null,null,"Closing Balance",null,null,{"$f":"G44+G50","v":0},null,{"$f":"I44+I50","v":0},null,{"$f":"K44+K50","v":0},null,{"$f":"M44+M50","v":0},null,{"$f":"O44+O50","v":0},null,{"$f":"Q44+Q50","v":35522.990999999995},null,{"$f":"S44+S50","v":27628.992999999999},null,{"$f":"U44+U50","v":19734.994999999999},null,{"$f":"W44+W50","v":11840.996999999999},null,{"$f":"Y44+Y50","v":3946.9990000000034},null,{"$f":"AA44+AA50","v":0}]
[null,null,null,"Average Net Book Value",null,null,{"$f":"AVERAGE(G53:G54)","v":0},null,{"$f":"AVERAGE(I53:I54)","v":0},null,{"$f":"AVERAGE(K53:K54)","v":0},null,{"$f":"AVERAGE(M53:M54)","v":0},null,{"$f":"AVERAGE(O53:O54)","v":0},null,{"$f":"AVERAGE(Q53:Q54)","v":17761.495499999997},null,{"$f":"AVERAGE(S53:S54)","v":31575.991999999998},null,{"$f":"AVERAGE(U53:U54)","v":23681.993999999999},null,{"$f":"AVERAGE(W53:W54)","v":15787.995999999999},null,{"$f":"AVERAGE(Y53:Y54)","v":7893.9980000000014},null,{"$f":"AVERAGE(AA53:AA54)","v":1973.4995000000017}]
[]
[null,"Net Fixed Assets - Computer Software (including Applications Software)"]
[]
[null,null,"Gross Book Value"]
[null,null,null,"Opening Balance",null,null,null,null,{"$f":"G63","v":0},null,{"$f":"I63","v":0},null,{"$f":"K63","v":0},null,{"$f":"M63","v":0},null,{"$f":"O63","v":0},null,{"$f":"Q63","v":0},null,{"$f":"S63","v":0},null,{"$f":"U63","v":0},null,{"$f":"W63","v":0},null,{"$f":"Y63","v":0}]
[null,null,null,"Capital Additions during year (from Smart Meter Costs)",null,null,{"$f":"'2. Smart_Meter_Costs'!G185+'2. Smart_Meter_Costs'!G191","v":0},null,{"$f":"'2. Smart_Meter_Costs'!I185+'2. Smart_Meter_Costs'!I191","v":0},null,{"$f":"'2. Smart_Meter_Costs'!K185+'2. Smart_Meter_Costs'!K191","v":0},null,{"$f":"'2. Smart_Meter_Costs'!M185+'2. Smart_Meter_Costs'!M191","v":0},null,{"$f":"'2. Smart_Meter_Costs'!O185+'2. Smart_Meter_Costs'!O191","v":0},null,{"$f":"'2. Smart_Meter_Costs'!Q185+'2. Smart_Meter_Costs'!Q191","v":0},null,{"$f":"'2. Smart_Meter_Costs'!S185+'2. Smart_Meter_Costs'!S191","v":0},null,{"$f":"'2. Smart_Meter_Costs'!U185+'2. Smart_Meter_Costs'!U191","v":0},null,{"$f":"'2. Smart_Meter_Costs'!W185+'2. Smart_Meter_Costs'!W191","v":0},null,{"$f":"'2. Smart_Meter_Costs'!Y185+'2. Smart_Meter_Costs'!Y191","v":0},null,{"$f":"'2. Smart_Meter_Costs'!AA185+'2. Smart_Meter_Costs'!AA191","v":0}]
[null,null,null,"Retirements/Removals (if applicable)"]
[null,null,null,"Closing Balance",null,null,{"$f":"G60+G61-G62","v":0},null,{"$f":"I60+I61-I62","v":0},null,{"$f":"K60+K61-K62","v":0},null,{"$f":"M60+M61-M62","v":0},null,{"$f":"O60+O61-O62","v":0},null,{"$f":"Q60+Q61-Q62","v":0},null,{"$f":"S60+S61-S62","v":0},null,{"$f":"U60+U61-U62","v":0},null,{"$f":"W60+W61-W62","v":0},null,{"$f":"Y60+Y61-Y62","v":0},null,{"$f":"AA60+AA61-AA62","v":0}]
[]
[null,null,"Accumulated Depreciation"]
[null,null,null,"Opening Balance",null,null,0,null,{"$f":"G69","v":0},null,{"$f":"I69","v":0},null,{"$f":"K69","v":0},null,{"$f":"M69","v":0},null,{"$f":"O69","v":0},null,{"$f":"Q69","v":0},null,{"$f":"S69","v":0},null,{"$f":"U69","v":0},null,{"$f":"W69","v":0},null,{"$f":"Y69","v":0}]
[null,null,null,"Amortization expense during year",null,null,{"$f":"IF(ISERROR(-G61/('3. Cost_of_Service_Parameters'!G49*2)), 0, -G61/('3. Cost_of_Service_Parameters'!G49*2))","v":0},null,{"$f":"IF(ISERROR(-(I61/('3. Cost_of_Service_Parameters'!I49*2)+MIN((I60/'3. Cost_of_Service_Parameters'!I49),(I60+I66)))), 0, -(I61/('3. Cost_of_Service_Parameters'!I49*2)+MIN((I60/'3. Cost_of_Service_Parameters'!I49),(I60+I66))))","v":0},null,{"$f":"IF(ISERROR(-(K61/('3. Cost_of_Service_Parameters'!K49*2)+MIN((K60/'3. Cost_of_Service_Parameters'!K49),(K60+K66)))), 0, -(K61/('3. Cost_of_Service_Parameters'!K49*2)+MIN((K60/'3. Cost_of_Service_Parameters'!K49),(K60+K66))))","v":0},null,{"$f":"IF(ISERROR(-(M61/('3. Cost_of_Service_Parameters'!M49*2)+MIN((M60/'3. Cost_of_Service_Parameters'!M49),(M60+M66)))), 0,-(M61/('3. Cost_of_Service_Parameters'!M49*2)+MIN((M60/'3. Cost_of_Service_Parameters'!M49),(M60+M66))))","v":0},null,{"$f":"IF(ISERROR(-(O61/('3. Cost_of_Service_Parameters'!O49*2)+MIN((O60/'3. Cost_of_Service_Parameters'!O49),(O60+O66)))), 0, -(O61/('3. Cost_of_Service_Parameters'!O49*2)+MIN((O60/'3. Cost_of_Service_Parameters'!O49),(O60+O66))))","v":0},null,{"$f":"IF(ISERROR(-(Q61/('3. Cost_of_Service_Parameters'!Q49*2)+MIN((Q60/'3. Cost_of_Service_Parameters'!Q49),(Q60+Q66)))), 0, -(Q61/('3. Cost_of_Service_Parameters'!Q49*2)+MIN((Q60/'3. Cost_of_Service_Parameters'!Q49),(Q60+Q66))))","v":0},null,{"$f":"IF(ISERROR(-(S61/('3. Cost_of_Service_Parameters'!S49*2)+MIN((S60/'3. Cost_of_Service_Parameters'!S49),(S60+S66)))), 0, -(S61/('3. Cost_of_Service_Parameters'!S49*2)+MIN((S60/'3. Cost_of_Service_Parameters'!S49),(S60+S66))))","v":0},null,{"$f":"IF(ISERROR(-(U61/('3. Cost_of_Service_Parameters'!U49*2)+MIN((U60/'3. Cost_of_Service_Parameters'!U49),(U60+U66)))), 0, -(U61/('3. Cost_of_Service_Parameters'!U49*2)+MIN((U60/'3. Cost_of_Service_Parameters'!U49),(U60+U66))))","v":0},null,{"$f":"IF(ISERROR(-(W61/('3. Cost_of_Service_Parameters'!W49*2)+MIN((W60/'3. Cost_of_Service_Parameters'!W49),(W60+W66)))), 0, -(W61/('3. Cost_of_Service_Parameters'!W49*2)+MIN((W60/'3. Cost_of_Service_Parameters'!W49),(W60+W66))))","v":0},null,{"$f":"IF(ISERROR(-(Y61/('3. Cost_of_Service_Parameters'!Y49*2)+MIN((Y60/'3. Cost_of_Service_Parameters'!Y49),(Y60+Y66)))), 0, -(Y61/('3. Cost_of_Service_Parameters'!Y49*2)+MIN((Y60/'3. Cost_of_Service_Parameters'!Y49),(Y60+Y66))))","v":0},null,{"$f":"IF(ISERROR(-(AA61/('3. Cost_of_Service_Parameters'!AA49*2)+MIN((AA60/'3. Cost_of_Service_Parameters'!AA49),(AA60+AA66)))), 0, -(AA61/('3. Cost_of_Service_Parameters'!AA49*2)+MIN((AA60/'3. Cost_of_Service_Parameters'!AA49),(AA60+AA66))))","v":0}]
[null,null,null,"Retirements/Removals (if applicable)"]
[null,null,null,"Closing Balance",null,null,{"$f":"G66+G67-G68","v":0},null,{"$f":"I66+I67-I68","v":0},null,{"$f":"K66+K67-K68","v":0},null,{"$f":"M66+M67-M68","v":0},null,{"$f":"O66+O67-O68","v":0},null,{"$f":"Q66+Q67-Q68","v":0},null,{"$f":"S66+S67-S68","v":0},null,{"$f":"U66+U67-U68","v":0},null,{"$f":"W66+W67-W68","v":0},null,{"$f":"Y66+Y67-Y68","v":0},null,{"$f":"AA66+AA67-AA68","v":0}]
[]
[null,null,"Net Book Value"]
[null,null,null,"Opening Balance",null,null,{"$f":"G60+G66","v":0},null,{"$f":"G73","v":0},null,{"$f":"I73","v":0},null,{"$f":"K73","v":0},null,{"$f":"M73","v":0},null,{"$f":"O73","v":0},null,{"$f":"Q73","v":0},null,{"$f":"S73","v":0},null,{"$f":"U73","v":0},null,{"$f":"W73","v":0},null,{"$f":"Y73","v":0}]
[null,null,null,"Closing Balance",null,null,{"$f":"G63+G69","v":0},null,{"$f":"I63+I69","v":0},null,{"$f":"K63+K69","v":0},null,{"$f":"M63+M69","v":0},null,{"$f":"O63+O69","v":0},null,{"$f":"Q63+Q69","v":0},null,{"$f":"S63+S69","v":0},null,{"$f":"U63+U69","v":0},null,{"$f":"W63+W69","v":0},null,{"$f":"Y63+Y69","v":0},null,{"$f":"AA63+AA69","v":0}]
[null,null,null,"Average Net Book Value",null,null,{"$f":"AVERAGE(G72:G73)","v":0},null,{"$f":"AVERAGE(I72:I73)","v":0},null,{"$f":"AVERAGE(K72:K73)","v":0},null,{"$f":"AVERAGE(M72:M73)","v":0},null,{"$f":"AVERAGE(O72:O73)","v":0},null,{"$f":"AVERAGE(Q72:Q73)","v":0},null,{"$f":"AVERAGE(S72:S73)","v":0},null,{"$f":"AVERAGE(U72:U73)","v":0},null,{"$f":"AVERAGE(W72:W73)","v":0},null,{"$f":"AVERAGE(Y72:Y73)","v":0},null,{"$f":"AVERAGE(AA72:AA73)","v":0}]
[]
[null,"Net Fixed Assets - Tools and Equipment"]
[]
[null,null,"Gross Book Value"]
[null,null,null,"Opening Balance",null,null,null,null,{"$f":"G82","v":0},null,{"$f":"I82","v":0},null,{"$f":"K82","v":0},null,{"$f":"M82","v":0},null,{"$f":"O82","v":0},null,{"$f":"Q82","v":0},null,{"$f":"S82","v":0},null,{"$f":"U82","v":0},null,{"$f":"W82","v":0},null,{"$f":"Y82","v":0}]
[null,null,null,"Capital Additions during year (from Smart Meter Costs)",null,null,{"$f":"'2. Smart_Meter_Costs'!G187","v":0},null,{"$f":"'2. Smart_Meter_Costs'!I187","v":0},null,{"$f":"'2. Smart_Meter_Costs'!K187","v":0},null,{"$f":"'2. Smart_Meter_Costs'!M187","v":0},null,{"$f":"'2. Smart_Meter_Costs'!O187","v":0},null,{"$f":"'2. Smart_Meter_Costs'!Q187","v":0},null,{"$f":"'2. Smart_Meter_Costs'!S187","v":0},null,{"$f":"'2. Smart_Meter_Costs'!U187","v":0},null,{"$f":"'2. Smart_Meter_Costs'!W187","v":0},null,{"$f":"'2. Smart_Meter_Costs'!Y187","v":0},null,{"$f":"'2. Smart_Meter_Costs'!AA187","v":0}]
[null,null,null,"Retirements/Removals (if applicable)"]
[null,null,null,"Closing Balance",null,null,{"$f":"G79+G80-G81","v":0},null,{"$f":"I79+I80-I81","v":0},null,{"$f":"K79+K80-K81","v":0},null,{"$f":"M79+M80-M81","v":0},null,{"$f":"O79+O80-O81","v":0},null,{"$f":"Q79+Q80-Q81","v":0},null,{"$f":"S79+S80-S81","v":0},null,{"$f":"U79+U80-U81","v":0},null,{"$f":"W79+W80-W81","v":0},null,{"$f":"Y79+Y80-Y81","v":0},null,{"$f":"AA79+AA80-AA81","v":0}]
[]
[null,null,"Accumulated Depreciation"]
[null,null,null,"Opening Balance",null,null,0,null,{"$f":"G88","v":0},null,{"$f":"I88","v":0},null,{"$f":"K88","v":0},null,{"$f":"M88","v":0},null,{"$f":"O88","v":0},null,{"$f":"Q88","v":0},null,{"$f":"S88","v":0},null,{"$f":"U88","v":0},null,{"$f":"W88","v":0},null,{"$f":"Y88","v":0}]
[null,null,null,"Amortization expense during year",null,null,{"$f":"IF(ISERROR(-G80/('3. Cost_of_Service_Parameters'!G51*2)), 0, -G80/('3. Cost_of_Service_Parameters'!G51*2))","v":0},null,{"$f":"IF(ISERROR(-(I80/('3. Cost_of_Service_Parameters'!I51*2)+MIN((I79/'3. Cost_of_Service_Parameters'!I51),(I79+I85)))), 0, -(I80/('3. Cost_of_Service_Parameters'!I51*2)+MIN((I79/'3. Cost_of_Service_Parameters'!I51),(I79+I85))))","v":0},null,{"$f":"IF(ISERROR(-(K80/('3. Cost_of_Service_Parameters'!K51*2)+MIN((K79/'3. Cost_of_Service_Parameters'!K51),(K79+K85)))), 0, -(K80/('3. Cost_of_Service_Parameters'!K51*2)+MIN((K79/'3. Cost_of_Service_Parameters'!K51),(K79+K85))))","v":0},null,{"$f":"IF(ISERROR(-(M80/('3. Cost_of_Service_Parameters'!M51*2)+MIN((M79/'3. Cost_of_Service_Parameters'!M51),(M79+M85)))), 0,-(M80/('3. Cost_of_Service_Parameters'!M51*2)+MIN((M79/'3. Cost_of_Service_Parameters'!M51),(M79+M85))))","v":0},null,{"$f":"IF(ISERROR(-(O80/('3. Cost_of_Service_Parameters'!O51*2)+MIN((O79/'3. Cost_of_Service_Parameters'!O51),(O79+O85)))), 0, -(O80/('3. Cost_of_Service_Parameters'!O51*2)+MIN((O79/'3. Cost_of_Service_Parameters'!O51),(O79+O85))))","v":0},null,{"$f":"IF(ISERROR(-(Q80/('3. Cost_of_Service_Parameters'!Q51*2)+MIN((Q79/'3. Cost_of_Service_Parameters'!Q51),(Q79+Q85)))), 0, -(Q80/('3. Cost_of_Service_Parameters'!Q51*2)+MIN((Q79/'3. Cost_of_Service_Parameters'!Q51),(Q79+Q85))))","v":0},null,{"$f":"IF(ISERROR(-(S80/('3. Cost_of_Service_Parameters'!S51*2)+MIN((S79/'3. Cost_of_Service_Parameters'!S51),(S79+S85)))), 0, -(S80/('3. Cost_of_Service_Parameters'!S51*2)+MIN((S79/'3. Cost_of_Service_Parameters'!S51),(S79+S85))))","v":0},null,{"$f":"IF(ISERROR(-(U80/('3. Cost_of_Service_Parameters'!U51*2)+MIN((U79/'3. Cost_of_Service_Parameters'!U51),(U79+U85)))), 0, -(U80/('3. Cost_of_Service_Parameters'!U51*2)+MIN((U79/'3. Cost_of_Service_Parameters'!U51),(U79+U85))))","v":0},null,{"$f":"IF(ISERROR(-(W80/('3. Cost_of_Service_Parameters'!W51*2)+MIN((W79/'3. Cost_of_Service_Parameters'!W51),(W79+W85)))), 0, -(W80/('3. Cost_of_Service_Parameters'!W51*2)+MIN((W79/'3. Cost_of_Service_Parameters'!W51),(W79+W85))))","v":0},null,{"$f":"IF(ISERROR(-(Y80/('3. Cost_of_Service_Parameters'!Y51*2)+MIN((Y79/'3. Cost_of_Service_Parameters'!Y51),(Y79+Y85)))), 0, -(Y80/('3. Cost_of_Service_Parameters'!Y51*2)+MIN((Y79/'3. Cost_of_Service_Parameters'!Y51),(Y79+Y85))))","v":0},null,{"$f":"IF(ISERROR(-(AA80/('3. Cost_of_Service_Parameters'!AA51*2)+MIN((AA79/'3. Cost_of_Service_Parameters'!AA51),(AA79+AA85)))), 0, -(AA80/('3. Cost_of_Service_Parameters'!AA51*2)+MIN((AA79/'3. Cost_of_Service_Parameters'!AA51),(AA79+AA85))))","v":0}]
[null,null,null,"Retirements/Removals (if applicable)"]
[null,null,null,"Closing Balance",null,null,{"$f":"G85+G86-G87","v":0},null,{"$f":"I85+I86-I87","v":0},null,{"$f":"K85+K86-K87","v":0},null,{"$f":"M85+M86-M87","v":0},null,{"$f":"O85+O86-O87","v":0},null,{"$f":"Q85+Q86-Q87","v":0},null,{"$f":"S85+S86-S87","v":0},null,{"$f":"U85+U86-U87","v":0},null,{"$f":"W85+W86-W87","v":0},null,{"$f":"Y85+Y86-Y87","v":0},null,{"$f":"AA85+AA86-AA87","v":0}]
[]
[null,null,"Net Book Value"]
[null,null,null,"Opening Balance",null,null,{"$f":"G79+G85","v":0},null,{"$f":"G92","v":0},null,{"$f":"I92","v":0},null,{"$f":"K92","v":0},null,{"$f":"M92","v":0},null,{"$f":"O92","v":0},null,{"$f":"Q92","v":0},null,{"$f":"S92","v":0},null,{"$f":"U92","v":0},null,{"$f":"W92","v":0},null,{"$f":"Y92","v":0}]
[null,null,null,"Closing Balance",null,null,{"$f":"G82+G88","v":0},null,{"$f":"I82+I88","v":0},null,{"$f":"K82+K88","v":0},null,{"$f":"M82+M88","v":0},null,{"$f":"O82+O88","v":0},null,{"$f":"Q82+Q88","v":0},null,{"$f":"S82+S88","v":0},null,{"$f":"U82+U88","v":0},null,{"$f":"W82+W88","v":0},null,{"$f":"Y82+Y88","v":0},null,{"$f":"AA82+AA88","v":0}]
[null,null,null,"Average Net Book Value",null,null,{"$f":"AVERAGE(G91:G92)","v":0},null,{"$f":"AVERAGE(I91:I92)","v":0},null,{"$f":"AVERAGE(K91:K92)","v":0},null,{"$f":"AVERAGE(M91:M92)","v":0},null,{"$f":"AVERAGE(O91:O92)","v":0},null,{"$f":"AVERAGE(Q91:Q92)","v":0},null,{"$f":"AVERAGE(S91:S92)","v":0},null,{"$f":"AVERAGE(U91:U92)","v":0},null,{"$f":"AVERAGE(W91:W92)","v":0},null,{"$f":"AVERAGE(Y91:Y92)","v":0},null,{"$f":"AVERAGE(AA91:AA92)","v":0}]
[]
[null,"Net Fixed Assets - Other Equipment"]
[]
[null,null,"Gross Book Value"]
[null,null,null,"Opening Balance",null,null,null,null,{"$f":"G101","v":0},null,{"$f":"I101","v":0},null,{"$f":"K101","v":0},null,{"$f":"M101","v":0},null,{"$f":"O101","v":0},null,{"$f":"Q101","v":0},null,{"$f":"S101","v":0},null,{"$f":"U101","v":0},null,{"$f":"W101","v":0},null,{"$f":"Y101","v":0}]
[null,null,null,"Capital Additions during year (from Smart Meter Costs)",null,null,{"$f":"'2. Smart_Meter_Costs'!G189","v":0},null,{"$f":"'2. Smart_Meter_Costs'!I189","v":0},null,{"$f":"'2. Smart_Meter_Costs'!K189","v":0},null,{"$f":"'2. Smart_Meter_Costs'!M189","v":0},null,{"$f":"'2. Smart_Meter_Costs'!O189","v":0},null,{"$f":"'2. Smart_Meter_Costs'!Q189","v":0},null,{"$f":"'2. Smart_Meter_Costs'!S189","v":0},null,{"$f":"'2. Smart_Meter_Costs'!U189","v":0},null,{"$f":"'2. Smart_Meter_Costs'!W189","v":0},null,{"$f":"'2. Smart_Meter_Costs'!Y189","v":0},null,{"$f":"'2. Smart_Meter_Costs'!AA189","v":0}]
[null,null,null,"Retirements/Removals (if applicable)"]
[null,null,null,"Closing Balance",null,null,{"$f":"G98+G99-G100","v":0},null,{"$f":"I98+I99-I100","v":0},null,{"$f":"K98+K99-K100","v":0},null,{"$f":"M98+M99-M100","v":0},null,{"$f":"O98+O99-O100","v":0},null,{"$f":"Q98+Q99-Q100","v":0},null,{"$f":"S98+S99-S100","v":0},null,{"$f":"U98+U99-U100","v":0},null,{"$f":"W98+W99-W100","v":0},null,{"$f":"Y98+Y99-Y100","v":0},null,{"$f":"AA98+AA99-AA100","v":0}]
[]
[null,null,"Accumulated Depreciation"]
[null,null,null,"Opening Balance",null,null,0,null,{"$f":"G107","v":0},null,{"$f":"I107","v":0},null,{"$f":"K107","v":0},null,{"$f":"M107","v":0},null,{"$f":"O107","v":0},null,{"$f":"Q107","v":0},null,{"$f":"S107","v":0},null,{"$f":"U107","v":0},null,{"$f":"W107","v":0},null,{"$f":"Y107","v":0}]
[null,null,null,"Amortization expense during year",null,null,{"$f":"IF(ISERROR(-G99/('3. Cost_of_Service_Parameters'!G53*2)), 0, -G99/('3. Cost_of_Service_Parameters'!G53*2))","v":0},null,{"$f":"IF(ISERROR(-(I99/('3. Cost_of_Service_Parameters'!I53*2)+MIN((I98/'3. Cost_of_Service_Parameters'!I53),(I98+I104)))), 0, -(I99/('3. Cost_of_Service_Parameters'!I53*2)+MIN((I98/'3. Cost_of_Service_Parameters'!I53),(I98+I104))))","v":0},null,{"$f":"IF(ISERROR(-(K99/('3. Cost_of_Service_Parameters'!K53*2)+MIN((K98/'3. Cost_of_Service_Parameters'!K53),(K98+K104)))), 0, -(K99/('3. Cost_of_Service_Parameters'!K53*2)+MIN((K98/'3. Cost_of_Service_Parameters'!K53),(K98+K104))))","v":0},null,{"$f":"IF(ISERROR(-(M99/('3. Cost_of_Service_Parameters'!M53*2)+MIN((M98/'3. Cost_of_Service_Parameters'!M53),(M98+M104)))), 0,-(M99/('3. Cost_of_Service_Parameters'!M53*2)+MIN((M98/'3. Cost_of_Service_Parameters'!M53),(M98+M104))))","v":0},null,{"$f":"IF(ISERROR(-(O99/('3. Cost_of_Service_Parameters'!O53*2)+MIN((O98/'3. Cost_of_Service_Parameters'!O53),(O98+O104)))), 0, -(O99/('3. Cost_of_Service_Parameters'!O53*2)+MIN((O98/'3. Cost_of_Service_Parameters'!O53),(O98+O104))))","v":0},null,{"$f":"IF(ISERROR(-(Q99/('3. Cost_of_Service_Parameters'!Q53*2)+MIN((Q98/'3. Cost_of_Service_Parameters'!Q53),(Q98+Q104)))), 0, -(Q99/('3. Cost_of_Service_Parameters'!Q53*2)+MIN((Q98/'3. Cost_of_Service_Parameters'!Q53),(Q98+Q104))))","v":0},null,{"$f":"IF(ISERROR(-(S99/('3. Cost_of_Service_Parameters'!S53*2)+MIN((S98/'3. Cost_of_Service_Parameters'!S53),(S98+S104)))), 0, -(S99/('3. Cost_of_Service_Parameters'!S53*2)+MIN((S98/'3. Cost_of_Service_Parameters'!S53),(S98+S104))))","v":0},null,{"$f":"IF(ISERROR(-(U99/('3. Cost_of_Service_Parameters'!U53*2)+MIN((U98/'3. Cost_of_Service_Parameters'!U53),(U98+U104)))), 0, -(U99/('3. Cost_of_Service_Parameters'!U53*2)+MIN((U98/'3. Cost_of_Service_Parameters'!U53),(U98+U104))))","v":0},null,{"$f":"IF(ISERROR(-(W99/('3. Cost_of_Service_Parameters'!W53*2)+MIN((W98/'3. Cost_of_Service_Parameters'!W53),(W98+W104)))), 0, -(W99/('3. Cost_of_Service_Parameters'!W53*2)+MIN((W98/'3. Cost_of_Service_Parameters'!W53),(W98+W104))))","v":0},null,{"$f":"IF(ISERROR(-(Y99/('3. Cost_of_Service_Parameters'!Y53*2)+MIN((Y98/'3. Cost_of_Service_Parameters'!Y53),(Y98+Y104)))), 0, -(Y99/('3. Cost_of_Service_Parameters'!Y53*2)+MIN((Y98/'3. Cost_of_Service_Parameters'!Y53),(Y98+Y104))))","v":0},null,{"$f":"IF(ISERROR(-(AA99/('3. Cost_of_Service_Parameters'!AA53*2)+MIN((AA98/'3. Cost_of_Service_Parameters'!AA53),(AA98+AA104)))), 0, -(AA99/('3. Cost_of_Service_Parameters'!AA53*2)+MIN((AA98/'3. Cost_of_Service_Parameters'!AA53),(AA98+AA104))))","v":0}]
[null,null,null,"Retirements/Removals (if applicable)"]
[null,null,null,"Closing Balance",null,null,{"$f":"G104+G105-G106","v":0},null,{"$f":"I104+I105-I106","v":0},null,{"$f":"K104+K105-K106","v":0},null,{"$f":"M104+M105-M106","v":0},null,{"$f":"O104+O105-O106","v":0},null,{"$f":"Q104+Q105-Q106","v":0},null,{"$f":"S104+S105-S106","v":0},null,{"$f":"U104+U105-U106","v":0},null,{"$f":"W104+W105-W106","v":0},null,{"$f":"Y104+Y105-Y106","v":0},null,{"$f":"AA104+AA105-AA106","v":0}]
[]
[null,null,"Net Book Value"]
[null,null,null,"Opening Balance",null,null,{"$f":"G98+G104","v":0},null,{"$f":"G111","v":0},null,{"$f":"I111","v":0},null,{"$f":"K111","v":0},null,{"$f":"M111","v":0},null,{"$f":"O111","v":0},null,{"$f":"Q111","v":0},null,{"$f":"S111","v":0},null,{"$f":"U111","v":0},null,{"$f":"W111","v":0},null,{"$f":"Y111","v":0}]
[null,null,null,"Closing Balance",null,null,{"$f":"G101+G107","v":0},null,{"$f":"I101+I107","v":0},null,{"$f":"K101+K107","v":0},null,{"$f":"M101+M107","v":0},null,{"$f":"O101+O107","v":0},null,{"$f":"Q101+Q107","v":0},null,{"$f":"S101+S107","v":0},null,{"$f":"U101+U107","v":0},null,{"$f":"W101+W107","v":0},null,{"$f":"Y101+Y107","v":0},null,{"$f":"AA101+AA107","v":0}]
[null,null,null,"Average Net Book Value",null,null,{"$f":"AVERAGE(G110:G111)","v":0},null,{"$f":"AVERAGE(I110:I111)","v":0},null,{"$f":"AVERAGE(K110:K111)","v":0},null,{"$f":"AVERAGE(M110:M111)","v":0},null,{"$f":"AVERAGE(O110:O111)","v":0},null,{"$f":"AVERAGE(Q110:Q111)","v":0},null,{"$f":"AVERAGE(S110:S111)","v":0},null,{"$f":"AVERAGE(U110:U111)","v":0},null,{"$f":"AVERAGE(W110:W111)","v":0},null,{"$f":"AVERAGE(Y110:Y111)","v":0},null,{"$f":"AVERAGE(AA110:AA111)","v":0}]

{"sheet":"5. SM_Rev_Reqt","index":4,"n_rows":70,"n_cols":27,"rows_kept":70,"cut":false,"hidden":false,"merged":[[22,2,22,4],[23,2,23,4],[24,2,24,4],[19,2,19,4],[20,2,20,4],[21,2,21,4]]}
[]
[]
[]
[]
[]
[]
[]
[]
[]
[]
[]
[]
[]
[]
[]
[]
[]
[null,null,null,null,null,null,2006,null,2007,null,2008,null,2009,null,2010,null,2011,null,2012,null,2013,null,2014,null,2015,null,2016]
[null,"Average Net Fixed Asset Values (from Sheet 4)"]
[null,null,"Smart Meters",null,null,null,{"$f":"'4. SM_Assets_and_Rate_Base'!G36","v":0},null,{"$f":"'4. SM_Assets_and_Rate_Base'!I36","v":0},null,{"$f":"'4. SM_Assets_and_Rate_Base'!K36","v":0},null,{"$f":"'4. SM_Assets_and_Rate_Base'!M36","v":0},null,{"$f":"'4. SM_Assets_and_Rate_Base'!O36","v":0},null,{"$f":"'4. SM_Assets_and_Rate_Base'!Q36","v":0},null,{"$f":"'4. SM_Assets_and_Rate_Base'!S36","v":0},null,{"$f":"'4. SM_Assets_and_Rate_Base'!U36","v":0},null,{"$f":"'4. SM_Assets_and_Rate_Base'!W36","v":0},null,{"$f":"'4. SM_Assets_and_Rate_Base'!Y36","v":0},null,{"$f":"'4. SM_Assets_and_Rate_Base'!AA36","v":0}]
[null,null,"Computer Hardware",null,null,null,{"$f":"'4. SM_Assets_and_Rate_Base'!G55","v":0},null,{"$f":"'4. SM_Assets_and_Rate_Base'!I55","v":0},null,{"$f":"'4. SM_Assets_and_Rate_Base'!K55","v":0},null,{"$f":"'4. SM_Assets_and_Rate_Base'!M55","v":0},null,{"$f":"'4. SM_Assets_and_Rate_Base'!O55","v":0},null,{"$f":"'4. SM_Assets_and_Rate_Base'!Q55","v":17761.495499999997},null,{"$f":"'4. SM_Assets_and_Rate_Base'!S55","v":31575.991999999998},null,{"$f":"'4. SM_Assets_and_Rate_Base'!U55","v":23681.993999999999},null,{"$f":"'4. SM_Assets_and_Rate_Base'!W55","v":15787.995999999999},null,{"$f":"'4. SM_Assets_and_Rate_Base'!Y55","v":7893.9980000000014},null,{"$f":"'4. SM_Assets_and_Rate_Base'!AA55","v":1973.4995000000017}]
[null,null,"Computer Software",null,null,null,{"$f":"'4. SM_Assets_and_Rate_Base'!G74","v":0},null,{"$f":"'4. SM_Assets_and_Rate_Base'!I74","v":0},null,{"$f":"'4. SM_Assets_and_Rate_Base'!K74","v":0},null,{"$f":"'4. SM_Assets_and_Rate_Base'!M74","v":0},null,{"$f":"'4. SM_Assets_and_Rate_Base'!O74","v":0},null,{"$f":"'4. SM_Assets_and_Rate_Base'!Q74","v":0},null,{"$f":"'4. SM_Assets_and_Rate_Base'!S74","v":0},null,{"$f":"'4. SM_Assets_and_Rate_Base'!U74","v":0},null,{"$f":"'4. SM_Assets_and_Rate_Base'!W74","v":0},null,{"$f":"'4. SM_Assets_and_Rate_Base'!Y74","v":0},null,{"$f":"'4. SM_Assets_and_Rate_Base'!AA74","v":0}]
[null,null,"Tools & Equipment",null,null,null,{"$f":"'4. SM_Assets_and_Rate_Base'!G93","v":0},null,{"$f":"'4. SM_Assets_and_Rate_Base'!I93","v":0},null,{"$f":"'4. SM_Assets_and_Rate_Base'!K93","v":0},null,{"$f":"'4. SM_Assets_and_Rate_Base'!M93","v":0},null,{"$f":"'4. SM_Assets_and_Rate_Base'!O93","v":0},null,{"$f":"'4. SM_Assets_and_Rate_Base'!Q93","v":0},null,{"$f":"'4. SM_Assets_and_Rate_Base'!S93","v":0},null,{"$f":"'4. SM_Assets_and_Rate_Base'!U93","v":0},null,{"$f":"'4. SM_Assets_and_Rate_Base'!W93","v":0},null,{"$f":"'4. SM_Assets_and_Rate_Base'!Y93","v":0},null,{"$f":"'4. SM_Assets_and_Rate_Base'!AA93","v":0}]
[null,null,"Other Equipment",null,null,null,{"$f":"'4. SM_Assets_and_Rate_Base'!G112","v":0},null,{"$f":"'4. SM_Assets_and_Rate_Base'!I112","v":0},null,{"$f":"'4. SM_Assets_and_Rate_Base'!K112","v":0},null,{"$f":"'4. SM_Assets_and_Rate_Base'!M112","v":0},null,{"$f":"'4. SM_Assets_and_Rate_Base'!O112","v":0},null,{"$f":"'4. SM_Assets_and_Rate_Base'!Q112","v":0},null,{"$f":"'4. SM_Assets_and_Rate_Base'!S112","v":0},null,{"$f":"'4. SM_Assets_and_Rate_Base'!U112","v":0},null,{"$f":"'4. SM_Assets_and_Rate_Base'!W112","v":0},null,{"$f":"'4. SM_Assets_and_Rate_Base'!Y112","v":0},null,{"$f":"'4. SM_Assets_and_Rate_Base'!AA112","v":0}]
[null,null,"Total Net Fixed Assets",null,null,null,{"$f":"SUM(G20:G24)","v":0},null,{"$f":"SUM(I20:I24)","v":0},null,{"$f":"SUM(K20:K24)","v":0},null,{"$f":"SUM(M20:M24)","v":0},null,{"$f":"SUM(O20:O24)","v":0},null,{"$f":"SUM(Q20:Q24)","v":17761.495499999997},null,{"$f":"SUM(S20:S24)","v":31575.991999999998},null,{"$f":"SUM(U20:U24)","v":23681.993999999999},null,{"$f":"SUM(W20:W24)","v":15787.995999999999},null,{"$f":"SUM(Y20:Y24)","v":7893.9980000000014},null,{"$f":"SUM(AA20:AA24)","v":1973.4995000000017}]
[]
[null,"Working Capital"]
[null,null,"Operating Expenses (from Sheet 2)",null,null,null,{"$f":"'2. Smart_Meter_Costs'!G174","v":0},null,{"$f":"'2. Smart_Meter_Costs'!I174","v":0},null,{"$f":"'2. Smart_Meter_Costs'!K174","v":0},null,{"$f":"'2. Smart_Meter_Costs'!M174","v":0},null,{"$f":"'2. Smart_Meter_Costs'!O174","v":0},null,{"$f":"'2. Smart_Meter_Costs'!Q174","v":0},null,{"$f":"'2. Smart_Meter_Costs'!S174","v":0},null,{"$f":"'2. Smart_Meter_Costs'!U174","v":0},null,{"$f":"'2. Smart_Meter_Costs'!W174","v":0},null,{"$f":"'2. Smart_Meter_Costs'!Y174","v":0},null,{"$f":"'2. Smart_Meter_Costs'!AA174","v":0}]
[null,null,"Working Capital Factor (from Sheet 3)",null,null,null,{"$f":"'3. Cost_of_Service_Parameters'!G36","v":0},null,{"$f":"'3. Cost_of_Service_Parameters'!I36","v":0},null,{"$f":"'3. Cost_of_Service_Parameters'!K36","v":0},null,{"$f":"'3. Cost_of_Service_Parameters'!M36","v":0},null,{"$f":"'3. Cost_of_Service_Parameters'!O36","v":0},null,{"$f":"'3. Cost_of_Service_Parameters'!Q36","v":0.15},null,{"$f":"'3. Cost_of_Service_Parameters'!S36","v":0.15},null,{"$f":"'3. Cost_of_Service_Parameters'!U36","v":0.15},null,{"$f":"'3. Cost_of_Service_Parameters'!W36","v":0.15},null,{"$f":"'3. Cost_of_Service_Parameters'!Y36","v":0.15},null,{"$f":"'3. Cost_of_Service_Parameters'!AA36","v":7.4999999999999997E-2}]
[null,null,"Working Capital Allowance",null,null,null,{"$f":"G28*G29","v":0},null,{"$f":"I28*I29","v":0},null,{"$f":"K28*K29","v":0},null,{"$f":"M28*M29","v":0},null,{"$f":"O28*O29","v":0},null,{"$f":"Q28*Q29","v":0},null,{"$f":"S28*S29","v":0},null,{"$f":"U28*U29","v":0},null,{"$f":"W28*W29","v":0},null,{"$f":"Y28*Y29","v":0},null,{"$f":"AA28*AA29","v":0}]
[]
[null,"Incremental Smart Meter Rate Base",null,null,null,null,{"$f":"G25+G30","v":0},null,{"$f":"I25+I30","v":0},null,{"$f":"K25+K30","v":0},null,{"$f":"M25+M30","v":0},null,{"$f":"O25+O30","v":0},null,{"$f":"Q25+Q30","v":17761.495499999997},null,{"$f":"S25+S30","v":31575.991999999998},null,{"$f":"U25+U30","v":23681.993999999999},null,{"$f":"W25+W30","v":15787.995999999999},null,{"$f":"Y25+Y30","v":7893.9980000000014},null,{"$f":"AA25+AA30","v":1973.4995000000017}]
[]
[null,"Return on Rate Base"]
[null,null,"Capital Structure"]
[null,null,"Deemed Short Term Debt",null,null,null,{"$f":"G$32*'3. Cost_of_Service_Parameters'!G22","v":0},null,{"$f":"I$32*'3. Cost_of_Service_Parameters'!I22","v":0},null,{"$f":"K$32*'3. Cost_of_Service_Parameters'!K22","v":0},null,{"$f":"M$32*'3. Cost_of_Service_Parameters'!M22","v":0},null,{"$f":"O$32*'3. Cost_of_Service_Parameters'!O22","v":0},null,{"$f":"Q$32*'3. Cost_of_Service_Parameters'!Q22","v":710.45981999999992},null,{"$f":"S$32*'3. Cost_of_Service_Parameters'!S22","v":1263.0396799999999},null,{"$f":"U$32*'3. Cost_of_Service_Parameters'!U22","v":947.27976000000001},null,{"$f":"W$32*'3. Cost_of_Service_Parameters'!W22","v":631.51983999999993},null,{"$f":"Y$32*'3. Cost_of_Service_Parameters'!Y22","v":315.75992000000008},null,{"$f":"AA$32*'3. Cost_of_Service_Parameters'!AA22","v":78.939980000000077}]
[null,null,"Deemed Long Term Debt",null,null,null,{"$f":"G$32*'3. Cost_of_Service_Parameters'!G23","v":0},null,{"$f":"I$32*'3. Cost_of_Service_Parameters'!I23","v":0},null,{"$f":"K$32*'3. Cost_of_Service_Parameters'!K23","v":0},null,{"$f":"M$32*'3. Cost_of_Service_Parameters'!M23","v":0},null,{"$f":"O$32*'3. Cost_of_Service_Parameters'!O23","v":0},null,{"$f":"Q$32*'3. Cost_of_Service_Parameters'!Q23","v":9946.4374799999969},null,{"$f":"S$32*'3. Cost_of_Service_Parameters'!S23","v":17682.555519999998},null,{"$f":"U$32*'3. Cost_of_Service_Parameters'!U23","v":13261.916639999998},null,{"$f":"W$32*'3. Cost_of_Service_Parameters'!W23","v":8841.277759999999},null,{"$f":"Y$32*'3. Cost_of_Service_Parameters'!Y23","v":4420.6388800000004},null,{"$f":"AA$32*'3. Cost_of_Service_Parameters'!AA23","v":1105.1597200000008}]
[null,null,"Equity",null,null,null,{"$f":"G$32*'3. Cost_of_Service_Parameters'!G24","v":0},null,{"$f":"I$32*'3. Cost_of_Service_Parameters'!I24","v":0},null,{"$f":"K$32*'3. Cost_of_Service_Parameters'!K24","v":0},null,{"$f":"M$32*'3. Cost_of_Service_Parameters'!M24","v":0},null,{"$f":"O$32*'3. Cost_of_Service_Parameters'!O24","v":0},null,{"$f":"Q$32*'3. Cost_of_Service_Parameters'!Q24","v":7104.5982000000004},null,{"$f":"S$32*'3. Cost_of_Service_Parameters'!S24","v":12630.396800000002},null,{"$f":"U$32*'3. Cost_of_Service_Parameters'!U24","v":9472.7976000000017},null,{"$f":"W$32*'3. Cost_of_Service_Parameters'!W24","v":6315.1984000000011},null,{"$f":"Y$32*'3. Cost_of_Service_Parameters'!Y24","v":3157.599200000001},null,{"$f":"AA$32*'3. Cost_of_Service_Parameters'!AA24","v":789.39980000000082}]
[null,null,"Preferred Shares",null,null,null,{"$f":"G$32*'3. Cost_of_Service_Parameters'!G25","v":0},null,{"$f":"I$32*'3. Cost_of_Service_Parameters'!I25","v":0},null,{"$f":"K$32*'3. Cost_of_Service_Parameters'!K25","v":0},null,{"$f":"M$32*'3. Cost_of_Service_Parameters'!M25","v":0},null,{"$f":"O$32*'3. Cost_of_Service_Parameters'!O25","v":0},null,{"$f":"Q$32*'3. Cost_of_Service_Parameters'!Q25","v":0},null,{"$f":"S$32*'3. Cost_of_Service_Parameters'!S25","v":0},null,{"$f":"U$32*'3. Cost_of_Service_Parameters'!U25","v":0},null,{"$f":"W$32*'3. Cost_of_Service_Parameters'!W25","v":0},null,{"$f":"Y$32*'3. Cost_of_Service_Parameters'!Y25","v":0},null,{"$f":"AA$32*'3. Cost_of_Service_Parameters'!AA25","v":0}]
[null,null,"Total Capitalization",null,null,null,{"$f":"SUM(G36:G39)","v":0},null,{"$f":"SUM(I36:I39)","v":0},null,{"$f":"SUM(K36:K39)","v":0},null,{"$f":"SUM(M36:M39)","v":0},null,{"$f":"SUM(O36:O39)","v":0},null,{"$f":"SUM(Q36:Q39)","v":17761.495499999997},null,{"$f":"SUM(S36:S39)","v":31575.991999999998},null,{"$f":"SUM(U36:U39)","v":23681.993999999999},null,{"$f":"SUM(W36:W39)","v":15787.995999999999},null,{"$f":"SUM(Y36:Y39)","v":7893.9980000000014},null,{"$f":"SUM(AA36:AA39)","v":1973.4995000000017}]
[null,null,null,null,null,null,{"$f":"IF(G40=G32,\"\",\"Error\")","v":""},null,{"$f":"IF(I40=I32,\"\",\"Error\")","v":""},null,{"$f":"IF(K40=K32,\"\",\"Error\")","v":""},null,{"$f":"IF(M40=M32,\"\",\"Error\")","v":""},null,{"$f":"IF(O40=O32,\"\",\"Error\")","v":""},null,{"$f":"IF(Q40=Q32,\"\",\"Error\")","v":""},null,{"$f":"IF(S40=S32,\"\",\"Error\")","v":""},null,{"$f":"IF(U40=U32,\"\",\"Error\")","v":""},null,{"$f":"IF(W40=W32,\"\",\"Error\")","v":""},null,{"$f":"IF(Y40=Y32,\"\",\"Error\")","v":""},null,{"$f":"IF(AA40=AA32,\"\",\"Error\")","v":""}]
[null,null,"Return on"]
[null,null,"Deemed Short Term Debt",null,null,null,{"$f":"G36*'3. Cost_of_Service_Parameters'!G29","v":0},null,{"$f":"I36*'3. Cost_of_Service_Parameters'!I29","v":0},null,{"$f":"K36*'3. Cost_of_Service_Parameters'!K29","v":0},null,{"$f":"M36*'3. Cost_of_Service_Parameters'!M29","v":0},null,{"$f":"O36*'3. Cost_of_Service_Parameters'!O29","v":0},null,{"$f":"Q36*'3. Cost_of_Service_Parameters'!Q29","v":31.757553953999995},null,{"$f":"S36*'3. Cost_of_Service_Parameters'!S29","v":26.271225343999998},null,{"$f":"U36*'3. Cost_of_Service_Parameters'!U29","v":19.703419008000001},null,{"$f":"W36*'3. Cost_of_Service_Parameters'!W29","v":13.135612671999999},null,{"$f":"Y36*'3. Cost_of_Service_Parameters'!Y29","v":6.5678063360000012},null,{"$f":"AA36*'3. Cost_of_Service_Parameters'!AA29","v":1.3025096700000014}]
[null,null,"Deemed Long Term Debt",null,null,null,{"$f":"G37*'3. Cost_of_Service_Parameters'!G30","v":0},null,{"$f":"I37*'3. Cost_of_Service_Parameters'!I30","v":0},null,{"$f":"K37*'3. Cost_of_Service_Parameters'!K30","v":0},null,{"$f":"M37*'3. Cost_of_Service_Parameters'!M30","v":0},null,{"$f":"O37*'3. Cost_of_Service_Parameters'!O30","v":0},null,{"$f":"Q37*'3. Cost_of_Service_Parameters'!Q30","v":496.32723025199982},null,{"$f":"S37*'3. Cost_of_Service_Parameters'!S30","v":663.09583199999986},null,{"$f":"U37*'3. Cost_of_Service_Parameters'!U30","v":497.32187399999987},null,{"$f":"W37*'3. Cost_of_Service_Parameters'!W30","v":331.54791599999993},null,{"$f":"Y37*'3. Cost_of_Service_Parameters'!Y30","v":165.77395800000002},null,{"$f":"AA37*'3. Cost_of_Service_Parameters'!AA30","v":37.133366592000023}]
[null,null,"Equity",null,null,null,{"$f":"G38*'3. Cost_of_Service_Parameters'!G31","v":0},null,{"$f":"I38*'3. Cost_of_Service_Parameters'!I31","v":0},null,{"$f":"K38*'3. Cost_of_Service_Parameters'!K31","v":0},null,{"$f":"M38*'3. Cost_of_Service_Parameters'!M31","v":0},null,{"$f":"O38*'3. Cost_of_Service_Parameters'!O31","v":0},null,{"$f":"Q38*'3. Cost_of_Service_Parameters'!Q31","v":608.86406574},null,{"$f":"S38*'3. Cost_of_Service_Parameters'!S31","v":1151.8921881600002},null,{"$f":"U38*'3. Cost_of_Service_Parameters'!U31","v":863.91914112000018},null,{"$f":"W38*'3. Cost_of_Service_Parameters'!W31","v":575.94609408000008},null,{"$f":"Y38*'3. Cost_of_Service_Parameters'!Y31","v":287.9730470400001},null,{"$f":"AA38*'3. Cost_of_Service_Parameters'!AA31","v":72.545841620000076}]
[null,null,"Preferred Shares",null,null,null,{"$f":"G39*'3. Cost_of_Service_Parameters'!G32","v":0},null,{"$f":"I39*'3. Cost_of_Service_Parameters'!I32","v":0},null,{"$f":"K39*'3. Cost_of_Service_Parameters'!K32","v":0},null,{"$f":"M39*'3. Cost_of_Service_Parameters'!M32","v":0},null,{"$f":"O39*'3. Cost_of_Service_Parameters'!O32","v":0},null,{"$f":"Q39*'3. Cost_of_Service_Parameters'!Q32","v":0},null,{"$f":"S39*'3. Cost_of_Service_Parameters'!S32","v":0},null,{"$f":"U39*'3. Cost_of_Service_Parameters'!U32","v":0},null,{"$f":"W39*'3. Cost_of_Service_Parameters'!W32","v":0},null,{"$f":"Y39*'3. Cost_of_Service_Parameters'!Y32","v":0},null,{"$f":"AA39*'3. Cost_of_Service_Parameters'!AA32","v":0}]
[null,null,"Total Return on Capital",null,null,null,{"$f":"SUM(G43:G46)","v":0},null,{"$f":"SUM(I43:I46)","v":0},null,{"$f":"SUM(K43:K46)","v":0},null,{"$f":"SUM(M43:M46)","v":0},null,{"$f":"SUM(O43:O46)","v":0},null,{"$f":"SUM(Q43:Q46)","v":1136.9488499459999},null,{"$f":"SUM(S43:S46)","v":1841.2592455039999},null,{"$f":"SUM(U43:U46)","v":1380.944434128},null,{"$f":"SUM(W43:W46)","v":920.62962275199993},null,{"$f":"SUM(Y43:Y46)","v":460.31481137600008},null,{"$f":"SUM(AA43:AA46)","v":110.9817178820001}]
[]
[]
[null,"Operating Expenses",null,null,null,null,{"$f":"G28","v":0},null,{"$f":"I28","v":0},null,{"$f":"K28","v":0},null,{"$f":"M28","v":0},null,{"$f":"O28","v":0},null,{"$f":"Q28","v":0},null,{"$f":"S28","v":0},null,{"$f":"U28","v":0},null,{"$f":"W28","v":0},null,{"$f":"Y28","v":0},null,{"$f":"AA28","v":0}]
[]
[null,"Amortization Expenses (from Sheet 4)"]
[null,null,"Smart Meters",null,null,null,{"$f":"-'4. SM_Assets_and_Rate_Base'!G29","v":0},null,{"$f":"-'4. SM_Assets_and_Rate_Base'!I29","v":0},null,{"$f":"-'4. SM_Assets_and_Rate_Base'!K29","v":0},null,{"$f":"-'4. SM_Assets_and_Rate_Base'!M29","v":0},null,{"$f":"-'4. SM_Assets_and_Rate_Base'!O29","v":0},null,{"$f":"-'4. SM_Assets_and_Rate_Base'!Q29","v":0},null,{"$f":"-'4. SM_Assets_and_Rate_Base'!S29","v":0},null,{"$f":"-'4. SM_Assets_and_Rate_Base'!U29","v":0},null,{"$f":"-'4. SM_Assets_and_Rate_Base'!W29","v":0},null,{"$f":"-'4. SM_Assets_and_Rate_Base'!Y29","v":0},null,{"$f":"-'4. SM_Assets_and_Rate_Base'!AA29","v":0}]
[null,null,"Computer Hardware",null,null,null,{"$f":"-'4. SM_Assets_and_Rate_Base'!G48","v":0},null,{"$f":"-'4. SM_Assets_and_Rate_Base'!I48","v":0},null,{"$f":"-'4. SM_Assets_and_Rate_Base'!K48","v":0},null,{"$f":"-'4. SM_Assets_and_Rate_Base'!M48","v":0},null,{"$f":"-'4. SM_Assets_and_Rate_Base'!O48","v":0},null,{"$f":"-'4. SM_Assets_and_Rate_Base'!Q48","v":3946.9989999999998},null,{"$f":"-'4. SM_Assets_and_Rate_Base'!S48","v":7893.9979999999996},null,{"$f":"-'4. SM_Assets_and_Rate_Base'!U48","v":7893.9979999999996},null,{"$f":"-'4. SM_Assets_and_Rate_Base'!W48","v":7893.9979999999996},null,{"$f":"-'4. SM_Assets_and_Rate_Base'!Y48","v":7893.9979999999996},null,{"$f":"-'4. SM_Assets_and_Rate_Base'!AA48","v":3946.9990000000034}]
[null,null,"Computer Software",null,null,null,{"$f":"-'4. SM_Assets_and_Rate_Base'!G67","v":0},null,{"$f":"-'4. SM_Assets_and_Rate_Base'!I67","v":0},null,{"$f":"-'4. SM_Assets_and_Rate_Base'!K67","v":0},null,{"$f":"-'4. SM_Assets_and_Rate_Base'!M67","v":0},null,{"$f":"-'4. SM_Assets_and_Rate_Base'!O67","v":0},null,{"$f":"-'4. SM_Assets_and_Rate_Base'!Q67","v":0},null,{"$f":"-'4. SM_Assets_and_Rate_Base'!S67","v":0},null,{"$f":"-'4. SM_Assets_and_Rate_Base'!U67","v":0},null,{"$f":"-'4. SM_Assets_and_Rate_Base'!W67","v":0},null,{"$f":"-'4. SM_Assets_and_Rate_Base'!Y67","v":0},null,{"$f":"-'4. SM_Assets_and_Rate_Base'!AA67","v":0}]
[null,null,"Tools & Equipment",null,null,null,{"$f":"-'4. SM_Assets_and_Rate_Base'!G86","v":0},null,{"$f":"-'4. SM_Assets_and_Rate_Base'!I86","v":0},null,{"$f":"-'4. SM_Assets_and_Rate_Base'!K86","v":0},null,{"$f":"-'4. SM_Assets_and_Rate_Base'!M86","v":0},null,{"$f":"-'4. SM_Assets_and_Rate_Base'!O86","v":0},null,{"$f":"-'4. SM_Assets_and_Rate_Base'!Q86","v":0},null,{"$f":"-'4. SM_Assets_and_Rate_Base'!S86","v":0},null,{"$f":"-'4. SM_Assets_and_Rate_Base'!U86","v":0},null,{"$f":"-'4. SM_Assets_and_Rate_Base'!W86","v":0},null,{"$f":"-'4. SM_Assets_and_Rate_Base'!Y86","v":0},null,{"$f":"-'4. SM_Assets_and_Rate_Base'!AA86","v":0}]
[null,null,"Other Equipment",null,null,null,{"$f":"-'4. SM_Assets_and_Rate_Base'!G105","v":0},null,{"$f":"-'4. SM_Assets_and_Rate_Base'!I105","v":0},null,{"$f":"-'4. SM_Assets_and_Rate_Base'!K105","v":0},null,{"$f":"-'4. SM_Assets_and_Rate_Base'!M105","v":0},null,{"$f":"-'4. SM_Assets_and_Rate_Base'!O105","v":0},null,{"$f":"-'4. SM_Assets_and_Rate_Base'!Q105","v":0},null,{"$f":"-'4. SM_Assets_and_Rate_Base'!S105","v":0},null,{"$f":"-'4. SM_Assets_and_Rate_Base'!U105","v":0},null,{"$f":"-'4. SM_Assets_and_Rate_Base'!W105","v":0},null,{"$f":"-'4. SM_Assets_and_Rate_Base'!Y105","v":0},null,{"$f":"-'4. SM_Assets_and_Rate_Base'!AA105","v":0}]
[null,null,"Total Amortization Expense in Year",null,null,null,{"$f":"SUM(G53:G57)","v":0},null,{"$f":"SUM(I53:I57)","v":0},null,{"$f":"SUM(K53:K57)","v":0},null,{"$f":"SUM(M53:M57)","v":0},null,{"$f":"SUM(O53:O57)","v":0},null,{"$f":"SUM(Q53:Q57)","v":3946.9989999999998},null,{"$f":"SUM(S53:S57)","v":7893.9979999999996},null,{"$f":"SUM(U53:U57)","v":7893.9979999999996},null,{"$f":"SUM(W53:W57)","v":7893.9979999999996},null,{"$f":"SUM(Y53:Y57)","v":7893.9979999999996},null,{"$f":"SUM(AA53:AA57)","v":3946.9990000000034}]
[]
[null,"Incremental Revenue Requirement before Taxes/PILs",null,null,null,null,{"$f":"G47+G50+G58","v":0},null,{"$f":"I47+I50+I58","v":0},null,{"$f":"K47+K50+K58","v":0},null,{"$f":"M47+M50+M58","v":0},null,{"$f":"O47+O50+O58","v":0},null,{"$f":"Q47+Q50+Q58","v":5083.9478499460001},null,{"$f":"S47+S50+S58","v":9735.257245503999},null,{"$f":"U47+U50+U58","v":9274.9424341279991},null,{"$f":"W47+W50+W58","v":8814.6276227519993},null,{"$f":"Y47+Y50+Y58","v":8354.3128113759994},null,{"$f":"AA47+AA50+AA58","v":4057.9807178820033}]
[]
[null,"Calculation of Taxable Income"]
[null,null,"Incremental Operating Expenses",null,null,null,{"$f":"G50","v":0},null,{"$f":"I50","v":0},null,{"$f":"K50","v":0},null,{"$f":"M50","v":0},null,{"$f":"O50","v":0},null,{"$f":"Q50","v":0},null,{"$f":"S50","v":0},null,{"$f":"U50","v":0},null,{"$f":"W50","v":0},null,{"$f":"Y50","v":0},null,{"$f":"AA50","v":0}]
[null,null,"Amortization Expense",null,null,null,{"$f":"G58","v":0},null,{"$f":"I58","v":0},null,{"$f":"K58","v":0},null,{"$f":"M58","v":0},null,{"$f":"O58","v":0},null,{"$f":"Q58","v":3946.9989999999998},null,{"$f":"S58","v":7893.9979999999996},null,{"$f":"U58","v":7893.9979999999996},null,{"$f":"W58","v":7893.9979999999996},null,{"$f":"Y58","v":7893.9979999999996},null,{"$f":"AA58","v":3946.9990000000034}]
[null,null,"Interest Expense",null,null,null,{"$f":"G43+G44","v":0},null,{"$f":"I43+I44","v":0},null,{"$f":"K43+K44","v":0},null,{"$f":"M43+M44","v":0},null,{"$f":"O43+O44","v":0},null,{"$f":"Q43+Q44","v":528.08478420599977},null,{"$f":"S43+S44","v":689.36705734399982},null,{"$f":"U43+U44","v":517.02529300799984},null,{"$f":"W43+W44","v":344.68352867199991},null,{"$f":"Y43+Y44","v":172.34176433600001},null,{"$f":"AA43+AA44","v":38.435876262000022}]
[null,null,"Net Income for Taxes/PILs",null,null,null,{"$f":"G60-SUM(G63:G65)","v":0},null,{"$f":"I60-SUM(I63:I65)","v":0},null,{"$f":"K60-SUM(K63:K65)","v":0},null,{"$f":"M60-SUM(M63:M65)","v":0},null,{"$f":"O60-SUM(O63:O65)","v":0},null,{"$f":"Q60-SUM(Q63:Q65)","v":608.86406574000102},null,{"$f":"S60-SUM(S63:S65)","v":1151.8921881599999},null,{"$f":"U60-SUM(U63:U65)","v":863.91914111999904},null,{"$f":"W60-SUM(W63:W65)","v":575.94609407999997},null,{"$f":"Y60-SUM(Y63:Y65)","v":287.97304703999998},null,{"$f":"AA60-SUM(AA63:AA65)","v":72.545841619999919}]
[]
[null,"Grossed-up Taxes/PILs (from Sheet 7)",null,null,null,null,{"$f":"'7_Taxes_PILs'!C59","v":0},null,{"$f":"'7_Taxes_PILs'!E59","v":0},null,{"$f":"'7_Taxes_PILs'!G59","v":0},null,{"$f":"'7_Taxes_PILs'!I59","v":0},null,{"$f":"'7_Taxes_PILs'!K59","v":0},null,{"$f":"'7_Taxes_PILs'!M59","v":-1155.3249095388164},null,{"$f":"'7_Taxes_PILs'!O59","v":-1227.6675624528996},null,{"$f":"'7_Taxes_PILs'!Q59","v":307.34405399612427},null,{"$f":"'7_Taxes_PILs'!S59","v":969.04637931515538},null,{"$f":"'7_Taxes_PILs'!U59","v":1237.7595236256898},null,{"$f":"'7_Taxes_PILs'!W59","v":618.92902814050785}]
[]
[null,"Revenue Requirement, including Grossed-up Taxes/PILs",null,null,null,null,{"$f":"G60+G68","v":0},null,{"$f":"I60+I68","v":0},null,{"$f":"K60+K68","v":0},null,{"$f":"M60+M68","v":0},null,{"$f":"O60+O68","v":0},null,{"$f":"Q60+Q68","v":3928.6229404071837},null,{"$f":"S60+S68","v":8507.5896830510992},null,{"$f":"U60+U68","v":9582.2864881241239},null,{"$f":"W60+W68","v":9783.674002067155},null,{"$f":"Y60+Y68","v":9592.0723350016888},null,{"$f":"AA60+AA68","v":4676.9097460225112}]

{"sheet":"6. UCC_Calculation","index":5,"n_rows":76,"n_cols":22,"rows_kept":76,"cut":false,"hidden":false,"merged":[]}
[]
[]
[]
[]
[]
[]
[]
[]
[]
[]
[]
[]
[]
[]
[]
[]
[]
["For PILs Calculation"]
[]
["UCC - Smart Meters",{"$f":"'2. Smart_Meter_Costs'!G18","v":2006},null,{"$f":"'2. Smart_Meter_Costs'!I18","v":2007},null,{"$f":"'2. Smart_Meter_Costs'!K18","v":2008},null,{"$f":"'2. Smart_Meter_Costs'!M18","v":2009},null,{"$f":"'2. Smart_Meter_Costs'!O18","v":2010},null,{"$f":"'2. Smart_Meter_Costs'!Q18","v":2011},null,{"$f":"'2. Smart_Meter_Costs'!S18","v":2012},null,{"$f":"'2. Smart_Meter_Costs'!U18","v":2013},null,{"$f":"'2. Smart_Meter_Costs'!W18","v":2014},null,{"$f":"'2. Smart_Meter_Costs'!Y18","v":2015},null,{"$f":"'2. Smart_Meter_Costs'!AA18","v":2016}]
[null,{"$f":"'2. Smart_Meter_Costs'!G19","v":"Audited Actual"},null,{"$f":"'2. Smart_Meter_Costs'!I19","v":"Audited Actual"},null,{"$f":"'2. Smart_Meter_Costs'!K19","v":"Audited Actual"},null,{"$f":"'2. Smart_Meter_Costs'!M19","v":"Audited Actual"},null,{"$f":"'2. Smart_Meter_Costs'!O19","v":"Audited Actual"},null,{"$f":"'2. Smart_Meter_Costs'!Q19","v":"Audited Actual"},null,{"$f":"'2. Smart_Meter_Costs'!S19","v":"Audited Actual"},null,{"$f":"'2. Smart_Meter_Costs'!U19","v":"Audited Actual"},null,{"$f":"'2. Smart_Meter_Costs'!W19","v":"Forecast"},null,{"$f":"'2. Smart_Meter_Costs'!Y19","v":"Forecast"},null,{"$f":"'2. Smart_Meter_Costs'!AA19","v":"Forecast"}]
[]
["Opening UCC",0,null,{"$f":"B26-B31","v":0},null,{"$f":"D26-D31","v":0},null,{"$f":"F26-F31","v":0},null,{"$f":"H26-H31","v":0},null,{"$f":"J26-J31","v":0},null,{"$f":"L26-L31","v":0},null,{"$f":"N26-N31","v":0},null,{"$f":"P26-P31","v":0},null,{"$f":"R26-R31","v":0},null,{"$f":"T26-T31","v":0}]
["Capital Additions",{"$f":"'4. SM_Assets_and_Rate_Base'!G23","v":0},null,{"$f":"'4. SM_Assets_and_Rate_Base'!I23","v":0},null,{"$f":"'4. SM_Assets_and_Rate_Base'!K23","v":0},null,{"$f":"'4. SM_Assets_and_Rate_Base'!M23","v":0},null,{"$f":"'4. SM_Assets_and_Rate_Base'!O23","v":0},null,{"$f":"'4. SM_Assets_and_Rate_Base'!Q23","v":0},null,{"$f":"'4. SM_Assets_and_Rate_Base'!S23","v":0},null,{"$f":"'4. SM_Assets_and_Rate_Base'!U23","v":0},null,{"$f":"'4. SM_Assets_and_Rate_Base'!W23","v":0},null,{"$f":"'4. SM_Assets_and_Rate_Base'!Y23","v":0},null,{"$f":"'4. SM_Assets_and_Rate_Base'!AA23","v":0}]
["Retirements/Removals (if applicable)"]
["UCC Before Half Year Rule",{"$f":"SUM(B23:B24)-B25","v":0},null,{"$f":"SUM(D23:D24)-D25","v":0},null,{"$f":"SUM(F23:F24)-F25","v":0},null,{"$f":"SUM(H23:H24)-H25","v":0},null,{"$f":"SUM(J23:J24)-J25","v":0},null,{"$f":"SUM(L23:L24)-L25","v":0},null,{"$f":"SUM(N23:N24)-N25","v":0},null,{"$f":"SUM(P23:P24)-P25","v":0},null,{"$f":"SUM(R23:R24)-R25","v":0},null,{"$f":"SUM(T23:T24)-T25","v":0},null,{"$f":"SUM(V23:V24)-V25","v":0}]
["Half Year Rule (1/2 Additions - Disposals)",{"$f":"IF(((B24-B25)/2)<0, 0, (B24-B25)/2)","v":0},null,{"$f":"IF(((D24-D25)/2)<0, 0, (D24-D25)/2)","v":0},null,{"$f":"IF(((F24-F25)/2)<0, 0, (F24-F25)/2)","v":0},null,{"$f":"IF(((H24-H25)/2)<0, 0, (H24-H25)/2)","v":0},null,{"$f":"IF(((J24-J25)/2)<0, 0, (J24-J25)/2)","v":0},null,{"$f":"IF(((L24-L25)/2)<0, 0, (L24-L25)/2)","v":0},null,{"$f":"IF(((N24-N25)/2)<0, 0, (N24-N25)/2)","v":0},null,{"$f":"IF(((P24-P25)/2)<0, 0, (P24-P25)/2)","v":0},null,{"$f":"IF(((R24-R25)/2)<0, 0, (R24-R25)/2)","v":0},null,{"$f":"IF(((T24-T25)/2)<0, 0, (T24-T25)/2)","v":0},null,{"$f":"IF(((V24-V25)/2)<0, 0, (V24-V25)/2)","v":0}]
["Reduced UCC",{"$f":"B27+B23","v":0},null,{"$f":"D27+D23","v":0},null,{"$f":"F27+F23","v":0},null,{"$f":"H27+H23","v":0},null,{"$f":"J27+J23","v":0},null,{"$f":"L27+L23","v":0},null,{"$f":"N27+N23","v":0},null,{"$f":"P27+P23","v":0},null,{"$f":"R27+R23","v":0},null,{"$f":"T27+T23","v":0},null,{"$f":"V27+V23","v":0}]
["CCA Rate Class",{"$f":"'3. Cost_of_Service_Parameters'!G57","v":0},null,{"$f":"'3. Cost_of_Service_Parameters'!I57","v":0},null,{"$f":"'3. Cost_of_Service_Parameters'!K57","v":0},null,{"$f":"'3. Cost_of_Service_Parameters'!M57","v":0},null,{"$f":"'3. Cost_of_Service_Parameters'!O57","v":0},null,{"$f":"'3. Cost_of_Service_Parameters'!Q57","v":0},null,{"$f":"'3. Cost_of_Service_Parameters'!S57","v":0},null,{"$f":"'3. Cost_of_Service_Parameters'!U57","v":0},null,{"$f":"'3. Cost_of_Service_Parameters'!W57","v":0},null,{"$f":"'3. Cost_of_Service_Parameters'!Y57","v":0},null,{"$f":"'3. Cost_of_Service_Parameters'!AA57","v":0}]
["CCA Rate ",{"$f":"'3. Cost_of_Service_Parameters'!G58","v":0},null,{"$f":"'3. Cost_of_Service_Parameters'!I58","v":0},null,{"$f":"'3. Cost_of_Service_Parameters'!K58","v":0},null,{"$f":"'3. Cost_of_Service_Parameters'!M58","v":0},null,{"$f":"'3. Cost_of_Service_Parameters'!O58","v":0},null,{"$f":"'3. Cost_of_Service_Parameters'!Q58","v":0},null,{"$f":"'3. Cost_of_Service_Parameters'!S58","v":0},null,{"$f":"'3. Cost_of_Service_Parameters'!U58","v":0},null,{"$f":"'3. Cost_of_Service_Parameters'!W58","v":0},null,{"$f":"'3. Cost_of_Service_Parameters'!Y58","v":0},null,{"$f":"'3. Cost_of_Service_Parameters'!AA58","v":0}]
["CCA",{"$f":"B28*B30","v":0},null,{"$f":"D28*D30","v":0},null,{"$f":"F28*F30","v":0},null,{"$f":"H28*H30","v":0},null,{"$f":"J28*J30","v":0},null,{"$f":"L28*L30","v":0},null,{"$f":"N28*N30","v":0},null,{"$f":"P28*P30","v":0},null,{"$f":"R28*R30","v":0},null,{"$f":"T28*T30","v":0},null,{"$f":"V28*V30","v":0}]
["Closing UCC",{"$f":"IF((B26-B31)<0, 0, B26-B31)","v":0},null,{"$f":"IF((D26-D31)<0, 0, D26-D31)","v":0},null,{"$f":"IF((F26-F31)<0, 0, F26-F31)","v":0},null,{"$f":"IF((H26-H31)<0, 0, H26-H31)","v":0},null,{"$f":"IF((J26-J31)<0, 0, J26-J31)","v":0},null,{"$f":"IF((L26-L31)<0, 0, L26-L31)","v":0},null,{"$f":"IF((N26-N31)<0, 0, N26-N31)","v":0},null,{"$f":"IF((P26-P31)<0, 0, P26-P31)","v":0},null,{"$f":"IF((R26-R31)<0, 0, R26-R31)","v":0},null,{"$f":"IF((T26-T31)<0, 0, T26-T31)","v":0},null,{"$f":"IF((V26-V31)<0, 0, V26-V31)","v":0}]
[]
["UCC - Computer Equipment",{"$f":"B20","v":2006},null,2007,null,2008,null,2009,null,2010,null,2011,null,{"$f":"N20","v":2012},null,{"$f":"P20","v":2013},null,{"$f":"R20","v":2014},null,{"$f":"T20","v":2015},null,{"$f":"V20","v":2016}]
[null,"Audited Actual",null,"Audited Actual",null,"Audited Actual",null,"Audited Actual",null,"Audited Actual",null,"Audited Actual",null,{"$f":"N21","v":"Audited Actual"},null,{"$f":"P21","v":"Audited Actual"},null,{"$f":"R21","v":"Forecast"},null,{"$f":"T21","v":"Forecast"},null,{"$f":"V21","v":"Forecast"}]
[]
["Opening UCC",0,null,{"$f":"B41-B46","v":0},null,{"$f":"D41-D46","v":0},null,{"$f":"F41-F46","v":0},null,{"$f":"H41-H46","v":0},null,{"$f":"J41-J46","v":0},null,{"$f":"L41-L46","v":28615.742749999998},null,{"$f":"N41-N46","v":12877.084237499997},null,{"$f":"P41-P46","v":5794.6879068749986},null,{"$f":"R41-R46","v":2607.609558093749},null,{"$f":"T41-T46","v":1173.424301142187}]
["Capital Additions Computer Hardware",{"$f":"'2. Smart_Meter_Costs'!G183","v":0},null,{"$f":"'2. Smart_Meter_Costs'!I183","v":0},null,{"$f":"'2. Smart_Meter_Costs'!K183","v":0},null,{"$f":"'2. Smart_Meter_Costs'!M183","v":0},null,{"$f":"'2. Smart_Meter_Costs'!O183","v":0},null,{"$f":"'2. Smart_Meter_Costs'!Q183","v":39469.99},null,{"$f":"'2. Smart_Meter_Costs'!S183","v":0},null,{"$f":"'2. Smart_Meter_Costs'!U183","v":0},null,{"$f":"'2. Smart_Meter_Costs'!W183","v":0},null,{"$f":"'2. Smart_Meter_Costs'!Y183","v":0},null,{"$f":"'2. Smart_Meter_Costs'!AA183","v":0}]
["Capital Additions Computer Software",{"$f":"'2. Smart_Meter_Costs'!G185","v":0},null,{"$f":"'2. Smart_Meter_Costs'!I185","v":0},null,{"$f":"'2. Smart_Meter_Costs'!K185","v":0},null,{"$f":"'2. Smart_Meter_Costs'!M185","v":0},null,{"$f":"'2. Smart_Meter_Costs'!O185","v":0},null,{"$f":"'2. Smart_Meter_Costs'!Q185","v":0},null,{"$f":"'2. Smart_Meter_Costs'!S185","v":0},null,{"$f":"'2. Smart_Meter_Costs'!U185","v":0},null,{"$f":"'2. Smart_Meter_Costs'!W185","v":0},null,{"$f":"'2. Smart_Meter_Costs'!Y185","v":0},null,{"$f":"'2. Smart_Meter_Costs'!AA185","v":0}]
["Retirements/Removals (if applicable)"]
["UCC Before Half Year Rule",{"$f":"SUM(B37:B39)-B40","v":0},null,{"$f":"SUM(D37:D39)-D40","v":0},null,{"$f":"SUM(F37:F39)-F40","v":0},null,{"$f":"SUM(H37:H39)-H40","v":0},null,{"$f":"SUM(J37:J39)-J40","v":0},null,{"$f":"SUM(L37:L39)-L40","v":39469.99},null,{"$f":"SUM(N37:N39)-N40","v":28615.742749999998},null,{"$f":"SUM(P37:P39)-P40","v":12877.084237499997},null,{"$f":"SUM(R37:R39)-R40","v":5794.6879068749986},null,{"$f":"SUM(T37:T39)-T40","v":2607.609558093749},null,{"$f":"SUM(V37:V39)-V40","v":1173.424301142187}]
["Half Year Rule (1/2 Additions - Disposals)",{"$f":"IF((SUM(B38:B39)/2)<0, 0, SUM(B38:B39)/2)","v":0},null,{"$f":"IF((SUM(D38:D39)/2)<0, 0, SUM(D38:D39)/2)","v":0},null,{"$f":"IF((SUM(F38:F39)/2)<0, 0, SUM(F38:F39)/2)","v":0},null,{"$f":"IF((SUM(H38:H39)/2)<0, 0, SUM(H38:H39)/2)","v":0},null,{"$f":"IF((SUM(J38:J39)/2)<0, 0, SUM(J38:J39)/2)","v":0},null,{"$f":"IF((SUM(L38:L39)/2)<0, 0, SUM(L38:L39)/2)","v":19734.994999999999},null,{"$f":"IF((SUM(N38:N39)/2)<0, 0, SUM(N38:N39)/2)","v":0},null,{"$f":"IF((SUM(P38:P39)/2)<0, 0, SUM(P38:P39)/2)","v":0},null,{"$f":"IF((SUM(R38:R39)/2)<0, 0, SUM(R38:R39)/2)","v":0},null,{"$f":"IF((SUM(T38:T39)/2)<0, 0, SUM(T38:T39)/2)","v":0},null,{"$f":"IF((SUM(V38:V39)/2)<0, 0, SUM(V38:V39)/2)","v":0}]
["Reduced UCC",{"$f":"B42+B37","v":0},null,{"$f":"D42+D37","v":0},null,{"$f":"F42+F37","v":0},null,{"$f":"H42+H37","v":0},null,{"$f":"J42+J37","v":0},null,{"$f":"L42+L37","v":19734.994999999999},null,{"$f":"N42+N37","v":28615.742749999998},null,{"$f":"P42+P37","v":12877.084237499997},null,{"$f":"R42+R37","v":5794.6879068749986},null,{"$f":"T42+T37","v":2607.609558093749},null,{"$f":"V42+V37","v":1173.424301142187}]
["CCA Rate Class",{"$f":"'3. Cost_of_Service_Parameters'!G60","v":0},null,{"$f":"'3. Cost_of_Service_Parameters'!I60","v":0},null,{"$f":"'3. Cost_of_Service_Parameters'!K60","v":0},null,{"$f":"'3. Cost_of_Service_Parameters'!M60","v":0},null,{"$f":"'3. Cost_of_Service_Parameters'!O60","v":0},null,{"$f":"'3. Cost_of_Service_Parameters'!Q60","v":50},null,{"$f":"'3. Cost_of_Service_Parameters'!S60","v":50},null,{"$f":"'3. Cost_of_Service_Parameters'!U60","v":50},null,{"$f":"'3. Cost_of_Service_Parameters'!W60","v":50},null,{"$f":"'3. Cost_of_Service_Parameters'!Y60","v":50},null,{"$f":"'3. Cost_of_Service_Parameters'!AA60","v":50}]
["CCA Rate ",{"$f":"'3. Cost_of_Service_Parameters'!G61","v":0},null,{"$f":"'3. Cost_of_Service_Parameters'!I61","v":0},null,{"$f":"'3. Cost_of_Service_Parameters'!K61","v":0},null,{"$f":"'3. Cost_of_Service_Parameters'!M61","v":0},null,{"$f":"'3. Cost_of_Service_Parameters'!O61","v":0},null,{"$f":"'3. Cost_of_Service_Parameters'!Q61","v":0.55000000000000004},null,{"$f":"'3. Cost_of_Service_Parameters'!S61","v":0.55000000000000004},null,{"$f":"'3. Cost_of_Service_Parameters'!U61","v":0.55000000000000004},null,{"$f":"'3. Cost_of_Service_Parameters'!W61","v":0.55000000000000004},null,{"$f":"'3. Cost_of_Service_Parameters'!Y61","v":0.55000000000000004},null,{"$f":"'3. Cost_of_Service_Parameters'!AA61","v":0.55000000000000004}]
["CCA",{"$f":"B45*B43","v":0},null,{"$f":"D45*D43","v":0},null,{"$f":"F45*F43","v":0},null,{"$f":"H45*H43","v":0},null,{"$f":"J45*J43","v":0},null,{"$f":"L45*L43","v":10854.24725},null,{"$f":"N45*N43","v":15738.6585125},null,{"$f":"P45*P43","v":7082.3963306249989},null,{"$f":"R45*R43","v":3187.0783487812496},null,{"$f":"T45*T43","v":1434.185256951562},null,{"$f":"V45*V43","v":645.38336562820291}]
["Closing UCC",{"$f":"IF((B41-B46)<0, 0, B41-B46)","v":0},null,{"$f":"IF((D41-D46)<0, 0, D41-D46)","v":0},null,{"$f":"IF((F41-F46)<0, 0, F41-F46)","v":0},null,{"$f":"IF((H41-H46)<0, 0, H41-H46)","v":0},null,{"$f":"IF((J41-J46)<0, 0, J41-J46)","v":0},null,{"$f":"IF((L41-L46)<0, 0, L41-L46)","v":28615.742749999998},null,{"$f":"IF((N41-N46)<0, 0, N41-N46)","v":12877.084237499997},null,{"$f":"IF((P41-P46)<0, 0, P41-P46)","v":5794.6879068749986},null,{"$f":"IF((R41-R46)<0, 0, R41-R46)","v":2607.609558093749},null,{"$f":"IF((T41-T46)<0, 0, T41-T46)","v":1173.424301142187},null,{"$f":"IF((V41-V46)<0, 0, V41-V46)","v":528.0409355139841}]
[]
["UCC - General Equipment",{"$f":"B34","v":2006},null,2007,null,2008,null,2009,null,2010,null,2011,null,{"$f":"N34","v":2012},null,{"$f":"P34","v":2013},null,{"$f":"R34","v":2014},null,{"$f":"T34","v":2015},null,{"$f":"V34","v":2016}]
[null,"Audited Actual",null,"Audited Actual",null,"Audited Actual",null,"Audited Actual",null,"Audited Actual",null,"Audited Actual",null,{"$f":"N35","v":"Audited Actual"},null,{"$f":"P35","v":"Audited Actual"},null,{"$f":"R35","v":"Forecast"},null,{"$f":"T35","v":"Forecast"},null,{"$f":"V35","v":"Forecast"}]
[]
["Opening UCC",0,null,{"$f":"B56-B61","v":0},null,{"$f":"D56-D61","v":0},null,{"$f":"F56-F61","v":0},null,{"$f":"H56-H61","v":0},null,{"$f":"J56-J61","v":0},null,{"$f":"L56-L61","v":0},null,{"$f":"N56-N61","v":0},null,{"$f":"P56-P61","v":0},null,{"$f":"R56-R61","v":0},null,{"$f":"T56-T61","v":0}]
["Capital Additions Tools & Equipment",{"$f":"'2. Smart_Meter_Costs'!G187","v":0},null,{"$f":"'2. Smart_Meter_Costs'!I187","v":0},null,{"$f":"'2. Smart_Meter_Costs'!K187","v":0},null,{"$f":"'2. Smart_Meter_Costs'!M187","v":0},null,{"$f":"'2. Smart_Meter_Costs'!O187","v":0},null,{"$f":"'2. Smart_Meter_Costs'!Q187","v":0},null,{"$f":"'2. Smart_Meter_Costs'!S187","v":0},null,{"$f":"'2. Smart_Meter_Costs'!U187","v":0},null,{"$f":"'2. Smart_Meter_Costs'!W187","v":0},null,{"$f":"'2. Smart_Meter_Costs'!Y187","v":0},null,{"$f":"'2. Smart_Meter_Costs'!AA187","v":0}]
["Capital Additions Other Equipment",{"$f":"'2. Smart_Meter_Costs'!G189","v":0},null,{"$f":"'2. Smart_Meter_Costs'!I189","v":0},null,{"$f":"'2. Smart_Meter_Costs'!K189","v":0},null,{"$f":"'2. Smart_Meter_Costs'!M189","v":0},null,{"$f":"'2. Smart_Meter_Costs'!O189","v":0},null,{"$f":"'2. Smart_Meter_Costs'!Q189","v":0},null,{"$f":"'2. Smart_Meter_Costs'!S189","v":0},null,{"$f":"'2. Smart_Meter_Costs'!U189","v":0},null,{"$f":"'2. Smart_Meter_Costs'!W189","v":0},null,{"$f":"'2. Smart_Meter_Costs'!Y189","v":0},null,{"$f":"'2. Smart_Meter_Costs'!AA189","v":0}]
["Retirements/Removals (if applicable)"]
["UCC Before Half Year Rule",{"$f":"SUM(B52:B54)-B55","v":0},null,{"$f":"SUM(D52:D54)-D55","v":0},null,{"$f":"SUM(F52:F54)-F55","v":0},null,{"$f":"SUM(H52:H54)-H55","v":0},null,{"$f":"SUM(J52:J54)-J55","v":0},null,{"$f":"SUM(L52:L54)-L55","v":0},null,{"$f":"SUM(N52:N54)-N55","v":0},null,{"$f":"SUM(P52:P54)-P55","v":0},null,{"$f":"SUM(R52:R54)-R55","v":0},null,{"$f":"SUM(T52:T54)-T55","v":0},null,{"$f":"SUM(V52:V54)-V55","v":0}]
["Half Year Rule (1/2 Additions - Disposals)",{"$f":"IF(((SUM(B53:B54)-B55)/2)<0, 0, (SUM(B53:B54)-B55)/2)","v":0},null,{"$f":"IF(((SUM(D53:D54)-D55)/2)<0, 0, (SUM(D53:D54)-D55)/2)","v":0},null,{"$f":"IF(((SUM(F53:F54)-F55)/2)<0, 0, (SUM(F53:F54)-F55)/2)","v":0},null,{"$f":"IF(((SUM(H53:H54)-H55)/2)<0, 0, (SUM(H53:H54)-H55)/2)","v":0},null,{"$f":"IF(((SUM(J53:J54)-J55)/2)<0, 0, (SUM(J53:J54)-J55)/2)","v":0},null,{"$f":"IF(((SUM(L53:L54)-L55)/2)<0, 0, (SUM(L53:L54)-L55)/2)","v":0},null,{"$f":"IF(((SUM(N53:N54)-N55)/2)<0, 0, (SUM(N53:N54)-N55)/2)","v":0},null,{"$f":"IF(((SUM(P53:P54)-P55)/2)<0, 0, (SUM(P53:P54)-P55)/2)","v":0},null,{"$f":"IF(((SUM(R53:R54)-R55)/2)<0, 0, (SUM(R53:R54)-R55)/2)","v":0},null,{"$f":"IF(((SUM(T53:T54)-T55)/2)<0, 0, (SUM(T53:T54)-T55)/2)","v":0},null,{"$f":"IF(((SUM(V53:V54)-V55)/2)<0, 0, (SUM(V53:V54)-V55)/2)","v":0}]
["Reduced UCC",{"$f":"B57+B52","v":0},null,{"$f":"D57+D52","v":0},null,{"$f":"F57+F52","v":0},null,{"$f":"H57+H52","v":0},null,{"$f":"J57+J52","v":0},null,{"$f":"L57+L52","v":0},null,{"$f":"N57+N52","v":0},null,{"$f":"P57+P52","v":0},null,{"$f":"R57+R52","v":0},null,{"$f":"T57+T52","v":0},null,{"$f":"V57+V52","v":0}]
["CCA Rate Class",{"$f":"'3. Cost_of_Service_Parameters'!G63","v":0},null,{"$f":"'3. Cost_of_Service_Parameters'!I63","v":0},null,{"$f":"'3. Cost_of_Service_Parameters'!K63","v":0},null,{"$f":"'3. Cost_of_Service_Parameters'!M63","v":0},null,{"$f":"'3. Cost_of_Service_Parameters'!O63","v":0},null,{"$f":"'3. Cost_of_Service_Parameters'!Q63","v":0},null,{"$f":"'3. Cost_of_Service_Parameters'!S63","v":0},null,{"$f":"'3. Cost_of_Service_Parameters'!U63","v":0},null,{"$f":"'3. Cost_of_Service_Parameters'!W63","v":0},null,{"$f":"'3. Cost_of_Service_Parameters'!Y63","v":0},null,{"$f":"'3. Cost_of_Service_Parameters'!AA63","v":0}]
["CCA Rate ",{"$f":"'3. Cost_of_Service_Parameters'!G64","v":0},null,{"$f":"'3. Cost_of_Service_Parameters'!I64","v":0},null,{"$f":"'3. Cost_of_Service_Parameters'!K64","v":0},null,{"$f":"'3. Cost_of_Service_Parameters'!M64","v":0},null,{"$f":"'3. Cost_of_Service_Parameters'!O64","v":0},null,{"$f":"'3. Cost_of_Service_Parameters'!Q64","v":0},null,{"$f":"'3. Cost_of_Service_Parameters'!S64","v":0},null,{"$f":"'3. Cost_of_Service_Parameters'!U64","v":0},null,{"$f":"'3. Cost_of_Service_Parameters'!W64","v":0},null,{"$f":"'3. Cost_of_Service_Parameters'!Y64","v":0},null,{"$f":"'3. Cost_of_Service_Parameters'!AA64","v":0}]
["CCA",{"$f":"B60*B58","v":0},null,{"$f":"D60*D58","v":0},null,{"$f":"F60*F58","v":0},null,{"$f":"H60*H58","v":0},null,{"$f":"J60*J58","v":0},null,{"$f":"L60*L58","v":0},null,{"$f":"N60*N58","v":0},null,{"$f":"P60*P58","v":0},null,{"$f":"R60*R58","v":0},null,{"$f":"T60*T58","v":0},null,{"$f":"V60*V58","v":0}]
["Closing UCC",{"$f":"IF((B56-B61)<0, 0, B56-B61)","v":0},null,{"$f":"IF((D56-D61)<0, 0, D56-D61)","v":0},null,{"$f":"IF((F56-F61)<0, 0, F56-F61)","v":0},null,{"$f":"IF((H56-H61)<0, 0, H56-H61)","v":0},null,{"$f":"IF((J56-J61)<0, 0, J56-J61)","v":0},null,{"$f":"IF((L56-L61)<0, 0, L56-L61)","v":0},null,{"$f":"IF((N56-N61)<0, 0, N56-N61)","v":0},null,{"$f":"IF((P56-P61)<0, 0, P56-P61)","v":0},null,{"$f":"IF((R56-R61)<0, 0, R56-R61)","v":0},null,{"$f":"IF((T56-T61)<0, 0, T56-T61)","v":0},null,{"$f":"IF((V56-V61)<0, 0, V56-V61)","v":0}]
[]
["UCC - Applications Software",{"$f":"B49","v":2006},null,{"$f":"D49","v":2007},null,{"$f":"F49","v":2008},null,{"$f":"H49","v":2009},null,{"$f":"J49","v":2010},null,{"$f":"L49","v":2011},null,{"$f":"N49","v":2012},null,{"$f":"P49","v":2013},null,{"$f":"R49","v":2014},null,{"$f":"T49","v":2015},null,{"$f":"V49","v":2016}]
[null,{"$f":"B50","v":"Audited Actual"},null,{"$f":"D50","v":"Audited Actual"},null,{"$f":"F50","v":"Audited Actual"},null,{"$f":"H50","v":"Audited Actual"},null,{"$f":"J50","v":"Audited Actual"},null,{"$f":"L50","v":"Audited Actual"},null,{"$f":"N50","v":"Audited Actual"},null,{"$f":"P50","v":"Audited Actual"},null,{"$f":"R50","v":"Forecast"},null,{"$f":"T50","v":"Forecast"},null,{"$f":"V50","v":"Forecast"}]
[]
["Opening UCC",0,null,{"$f":"B70-B75","v":0},null,{"$f":"D70-D75","v":0},null,{"$f":"F70-F75","v":0},null,{"$f":"H70-H75","v":0},null,{"$f":"J70-J75","v":0},null,{"$f":"L70-L75","v":0},null,{"$f":"N70-N75","v":0},null,{"$f":"P70-P75","v":0},null,{"$f":"R70-R75","v":0},null,{"$f":"T70-T75","v":0}]
["Capital Additions Applications Software",{"$f":"'2. Smart_Meter_Costs'!G191","v":0},null,{"$f":"'2. Smart_Meter_Costs'!I191","v":0},null,{"$f":"'2. Smart_Meter_Costs'!K191","v":0},null,{"$f":"'2. Smart_Meter_Costs'!M191","v":0},null,{"$f":"'2. Smart_Meter_Costs'!O191","v":0},null,{"$f":"'2. Smart_Meter_Costs'!Q191","v":0},null,{"$f":"'2. Smart_Meter_Costs'!S191","v":0},null,{"$f":"'2. Smart_Meter_Costs'!U191","v":0},null,{"$f":"'2. Smart_Meter_Costs'!W191","v":0},null,{"$f":"'2. Smart_Meter_Costs'!Y191","v":0},null,{"$f":"'2. Smart_Meter_Costs'!AA191","v":0}]
["Retirements/Removals (if applicable)"]
["UCC Before Half Year Rule",{"$f":"SUM(B67:B68)-B69","v":0},null,{"$f":"SUM(D67:D68)-D69","v":0},null,{"$f":"SUM(F67:F68)-F69","v":0},null,{"$f":"SUM(H67:H68)-H69","v":0},null,{"$f":"SUM(J67:J68)-J69","v":0},null,{"$f":"SUM(L67:L68)-L69","v":0},null,{"$f":"SUM(N67:N68)-N69","v":0},null,{"$f":"SUM(P67:P68)-P69","v":0},null,{"$f":"SUM(R67:R68)-R69","v":0},null,{"$f":"SUM(T67:T68)-T69","v":0},null,{"$f":"SUM(V67:V68)-V69","v":0}]
["Half Year Rule (1/2 Additions - Disposals)",{"$f":"IF(((SUM(B68:B68)-B69)/2)<0, 0, (SUM(B68:B68)-B69)/2)","v":0},null,{"$f":"IF(((SUM(D68:D68)-D69)/2)<0, 0, (SUM(D68:D68)-D69)/2)","v":0},null,{"$f":"IF(((SUM(F68:F68)-F69)/2)<0, 0, (SUM(F68:F68)-F69)/2)","v":0},null,{"$f":"IF(((SUM(H68:H68)-H69)/2)<0, 0, (SUM(H68:H68)-H69)/2)","v":0},null,{"$f":"IF(((SUM(J68:J68)-J69)/2)<0, 0, (SUM(J68:J68)-J69)/2)","v":0},null,{"$f":"IF(((SUM(L68:L68)-L69)/2)<0, 0, (SUM(L68:L68)-L69)/2)","v":0},null,{"$f":"IF(((SUM(N68:N68)-N69)/2)<0, 0, (SUM(N68:N68)-N69)/2)","v":0},null,{"$f":"IF(((SUM(P68:P68)-P69)/2)<0, 0, (SUM(P68:P68)-P69)/2)","v":0},null,{"$f":"IF(((SUM(R68:R68)-R69)/2)<0, 0, (SUM(R68:R68)-R69)/2)","v":0},null,{"$f":"IF(((SUM(T68:T68)-T69)/2)<0, 0, (SUM(T68:T68)-T69)/2)","v":0},null,{"$f":"IF(((SUM(V68:V68)-V69)/2)<0, 0, (SUM(V68:V68)-V69)/2)","v":0}]
["Reduced UCC",{"$f":"B71+B67","v":0},null,{"$f":"D71+D67","v":0},null,{"$f":"F71+F67","v":0},null,{"$f":"H71+H67","v":0},null,{"$f":"J71+J67","v":0},null,{"$f":"L71+L67","v":0},null,{"$f":"N71+N67","v":0},null,{"$f":"P71+P67","v":0},null,{"$f":"R71+R67","v":0},null,{"$f":"T71+T67","v":0},null,{"$f":"V71+V67","v":0}]
["CCA Rate Class",{"$f":"'3. Cost_of_Service_Parameters'!G66","v":0},null,{"$f":"'3. Cost_of_Service_Parameters'!I66","v":0},null,{"$f":"'3. Cost_of_Service_Parameters'!K66","v":0},null,{"$f":"'3. Cost_of_Service_Parameters'!M66","v":0},null,{"$f":"'3. Cost_of_Service_Parameters'!O66","v":0},null,{"$f":"'3. Cost_of_Service_Parameters'!Q66","v":0},null,{"$f":"'3. Cost_of_Service_Parameters'!S66","v":0},null,{"$f":"'3. Cost_of_Service_Parameters'!U66","v":0},null,{"$f":"'3. Cost_of_Service_Parameters'!W66","v":0},null,{"$f":"'3. Cost_of_Service_Parameters'!Y66","v":0},null,{"$f":"'3. Cost_of_Service_Parameters'!AA66","v":0}]
["CCA Rate ",{"$f":"'3. Cost_of_Service_Parameters'!G67","v":0},null,{"$f":"'3. Cost_of_Service_Parameters'!I67","v":0},null,{"$f":"'3. Cost_of_Service_Parameters'!K67","v":0},null,{"$f":"'3. Cost_of_Service_Parameters'!M67","v":0},null,{"$f":"'3. Cost_of_Service_Parameters'!O67","v":0},null,{"$f":"'3. Cost_of_Service_Parameters'!Q67","v":0},null,{"$f":"'3. Cost_of_Service_Parameters'!S67","v":0},null,{"$f":"'3. Cost_of_Service_Parameters'!U67","v":0},null,{"$f":"'3. Cost_of_Service_Parameters'!W67","v":0},null,{"$f":"'3. Cost_of_Service_Parameters'!Y67","v":0},null,{"$f":"'3. Cost_of_Service_Parameters'!AA67","v":0}]
["CCA",{"$f":"B74*B72","v":0},null,{"$f":"D74*D72","v":0},null,{"$f":"F74*F72","v":0},null,{"$f":"H74*H72","v":0},null,{"$f":"J74*J72","v":0},null,{"$f":"L74*L72","v":0},null,{"$f":"N74*N72","v":0},null,{"$f":"P74*P72","v":0},null,{"$f":"R74*R72","v":0},null,{"$f":"T74*T72","v":0},null,{"$f":"V74*V72","v":0}]
["Closing UCC",{"$f":"IF((B70-B75)<0, 0, B70-B75)","v":0},null,{"$f":"IF((D70-D75)<0, 0, D70-D75)","v":0},null,{"$f":"IF((F70-F75)<0, 0, F70-F75)","v":0},null,{"$f":"IF((H70-H75)<0, 0, H70-H75)","v":0},null,{"$f":"IF((J70-J75)<0, 0, J70-J75)","v":0},null,{"$f":"IF((L70-L75)<0, 0, L70-L75)","v":0},null,{"$f":"IF((N70-N75)<0, 0, N70-N75)","v":0},null,{"$f":"IF((P70-P75)<0, 0, P70-P75)","v":0},null,{"$f":"IF((R70-R75)<0, 0, R70-R75)","v":0},null,{"$f":"IF((T70-T75)<0, 0, T70-T75)","v":0},null,{"$f":"IF((V70-V75)<0, 0, V70-V75)","v":0}]

{"sheet":"7_Taxes_PILs","index":6,"n_rows":59,"n_cols":23,"rows_kept":59,"cut":false,"hidden":false,"merged":[]}
[]
[]
[]
[]
[]
[]
[]
[]
[]
[]
[]
[]
[]
[]
[]
[]
[]
["PILs Calculation"]
[]
[null,null,{"$f":"'2. Smart_Meter_Costs'!G18& \" \" &'2. Smart_Meter_Costs'!G19","v":"2006 Audited Actual"},null,{"$f":"'2. Smart_Meter_Costs'!I18& \" \" &'2. Smart_Meter_Costs'!I19","v":"2007 Audited Actual"},null,{"$f":"'2. Smart_Meter_Costs'!K18& \" \" &'2. Smart_Meter_Costs'!K19","v":"2008 Audited Actual"},null,{"$f":"'2. Smart_Meter_Costs'!M18& \" \" &'2. Smart_Meter_Costs'!M19","v":"2009 Audited Actual"},null,{"$f":"'2. Smart_Meter_Costs'!O18& \" \" &'2. Smart_Meter_Costs'!O19","v":"2010 Audited Actual"},null,{"$f":"'2. Smart_Meter_Costs'!Q18& \" \" &'2. Smart_Meter_Costs'!Q19","v":"2011 Audited Actual"},null,{"$f":"'2. Smart_Meter_Costs'!S18& \" \" &'2. Smart_Meter_Costs'!S19","v":"2012 Audited Actual"},null,{"$f":"'2. Smart_Meter_Costs'!U18& \" \" &'2. Smart_Meter_Costs'!U19","v":"2013 Audited Actual"},null,{"$f":"'2. Smart_Meter_Costs'!W18& \" \" &'2. Smart_Meter_Costs'!W19","v":"2014 Forecast"},null,{"$f":"'2. Smart_Meter_Costs'!Y18& \" \" &'2. Smart_Meter_Costs'!Y19","v":"2015 Forecast"},null,{"$f":"'2. Smart_Meter_Costs'!AA18& \" \" &'2. Smart_Meter_Costs'!AA19","v":"2016 Forecast"}]
[]
["INCOME TAX"]
[null,"Net Income",{"$f":"'5. SM_Rev_Reqt'!G$66","v":0},null,{"$f":"'5. SM_Rev_Reqt'!I$66","v":0},null,{"$f":"'5. SM_Rev_Reqt'!K$66","v":0},null,{"$f":"'5. SM_Rev_Reqt'!M$66","v":0},null,{"$f":"'5. SM_Rev_Reqt'!O$66","v":0},null,{"$f":"'5. SM_Rev_Reqt'!Q$66","v":608.86406574000102},null,{"$f":"'5. SM_Rev_Reqt'!S$66","v":1151.8921881599999},null,{"$f":"'5. SM_Rev_Reqt'!U$66","v":863.91914111999904},null,{"$f":"'5. SM_Rev_Reqt'!W$66","v":575.94609407999997},null,{"$f":"'5. SM_Rev_Reqt'!Y$66","v":287.97304703999998},null,{"$f":"'5. SM_Rev_Reqt'!AA$66","v":72.545841619999919}]
[null,"Amortization ",{"$f":"'5. SM_Rev_Reqt'!G$64","v":0},null,{"$f":"'5. SM_Rev_Reqt'!I$64","v":0},null,{"$f":"'5. SM_Rev_Reqt'!K$64","v":0},null,{"$f":"'5. SM_Rev_Reqt'!M$64","v":0},null,{"$f":"'5. SM_Rev_Reqt'!O$64","v":0},null,{"$f":"'5. SM_Rev_Reqt'!Q$64","v":3946.9989999999998},null,{"$f":"'5. SM_Rev_Reqt'!S$64","v":7893.9979999999996},null,{"$f":"'5. SM_Rev_Reqt'!U$64","v":7893.9979999999996},null,{"$f":"'5. SM_Rev_Reqt'!W$64","v":7893.9979999999996},null,{"$f":"'5. SM_Rev_Reqt'!Y$64","v":7893.9979999999996},null,{"$f":"'5. SM_Rev_Reqt'!AA$64","v":3946.9990000000034}]
[null,"CCA - Smart Meters",{"$f":"-'6. UCC_Calculation'!B31","v":0},null,{"$f":"-'6. UCC_Calculation'!D31","v":0},null,{"$f":"-'6. UCC_Calculation'!F31","v":0},null,{"$f":"-'6. UCC_Calculation'!H31","v":0},null,{"$f":"-'6. UCC_Calculation'!J31","v":0},null,{"$f":"-'6. UCC_Calculation'!L31","v":0},null,{"$f":"-'6. UCC_Calculation'!N31","v":0},null,{"$f":"-'6. UCC_Calculation'!P31","v":0},null,{"$f":"-'6. UCC_Calculation'!R31","v":0},null,{"$f":"-'6. UCC_Calculation'!T31","v":0},null,{"$f":"-'6. UCC_Calculation'!V31","v":0}]
[null,"CCA - Computers",{"$f":"-'6. UCC_Calculation'!B46","v":0},null,{"$f":"-'6. UCC_Calculation'!D46","v":0},null,{"$f":"-'6. UCC_Calculation'!F46","v":0},null,{"$f":"-'6. UCC_Calculation'!H46","v":0},null,{"$f":"-'6. UCC_Calculation'!J46","v":0},null,{"$f":"-'6. UCC_Calculation'!L46","v":-10854.24725},null,{"$f":"-'6. UCC_Calculation'!N46","v":-15738.6585125},null,{"$f":"-'6. UCC_Calculation'!P46","v":-7082.3963306249989},null,{"$f":"-'6. UCC_Calculation'!R46","v":-3187.0783487812496},null,{"$f":"-'6. UCC_Calculation'!T46","v":-1434.185256951562},null,{"$f":"-'6. UCC_Calculation'!V46","v":-645.38336562820291}]
[null,"CCA - Applications Software",{"$f":"-'6. UCC_Calculation'!B75","v":0},null,{"$f":"-'6. UCC_Calculation'!D75","v":0},null,{"$f":"-'6. UCC_Calculation'!F75","v":0},null,{"$f":"-'6. UCC_Calculation'!H75","v":0},null,{"$f":"-'6. UCC_Calculation'!J75","v":0},null,{"$f":"-'6. UCC_Calculation'!L75","v":0},null,{"$f":"-'6. UCC_Calculation'!N75","v":0},null,{"$f":"-'6. UCC_Calculation'!P75","v":0},null,{"$f":"-'6. UCC_Calculation'!R75","v":0},null,{"$f":"-'6. UCC_Calculation'!T75","v":0},null,{"$f":"-'6. UCC_Calculation'!V75","v":0}]
[null,"CCA -  Other Equipment",{"$f":"-'6. UCC_Calculation'!B61","v":0},null,{"$f":"-'6. UCC_Calculation'!D61","v":0},null,{"$f":"-'6. UCC_Calculation'!F61","v":0},null,{"$f":"-'6. UCC_Calculation'!H61","v":0},null,{"$f":"-'6. UCC_Calculation'!J61","v":0},null,{"$f":"-'6. UCC_Calculation'!L61","v":0},null,{"$f":"-'6. UCC_Calculation'!N61","v":0},null,{"$f":"-'6. UCC_Calculation'!P61","v":0},null,{"$f":"-'6. UCC_Calculation'!R61","v":0},null,{"$f":"-'6. UCC_Calculation'!T61","v":0},null,{"$f":"-'6. UCC_Calculation'!V61","v":0}]
[null,"Change in taxable income",{"$f":"SUM(C23:C28)","v":0},null,0,null,0,null,0,null,0,null,-6298.3841842599995,null,-6692.7683243400006,null,1675.5208104949998,null,{"$f":"SUM(S23:S28)","v":5282.86574529875},null,6747.7857900884374,null,{"$f":"SUM(W23:W28)","v":3374.1614759918002}]
[]
[null,"Tax Rate (from Sheet 3)",{"$f":"'3. Cost_of_Service_Parameters'!G40","v":0.36120000000000002},null,{"$f":"'3. Cost_of_Service_Parameters'!I40","v":0.36120000000000002},null,{"$f":"'3. Cost_of_Service_Parameters'!K40","v":0.33500000000000002},null,{"$f":"'3. Cost_of_Service_Parameters'!M40","v":0.33},null,{"$f":"'3. Cost_of_Service_Parameters'!O40","v":0.31},null,{"$f":"'3. Cost_of_Service_Parameters'!Q40","v":0.155},null,{"$f":"'3. Cost_of_Service_Parameters'!S40","v":0.155},null,{"$f":"'3. Cost_of_Service_Parameters'!U40","v":0.155},null,{"$f":"'3. Cost_of_Service_Parameters'!W40","v":0.155},null,{"$f":"'3. Cost_of_Service_Parameters'!Y40","v":0.155},null,{"$f":"'3. Cost_of_Service_Parameters'!AA40","v":0.155}]
[]
[null,"Income Taxes Payable",{"$f":"C29*C31","v":0},null,0,null,0,null,0,null,0,null,-976.2495485602999,null,-1037.3790902727001,null,{"$f":"Q29*Q31","v":259.70572562672498},null,{"$f":"S29*S31","v":818.84419052130625},null,{"$f":"U29*U31","v":1045.9067974637078},null,{"$f":"W29*W31","v":522.99502877872908}]
[]
["ONTARIO CAPITAL TAX"]
[null,"Smart Meters",{"$f":"'4. SM_Assets_and_Rate_Base'!G35","v":0},null,{"$f":"'4. SM_Assets_and_Rate_Base'!I35","v":0},null,{"$f":"'4. SM_Assets_and_Rate_Base'!K35","v":0},null,{"$f":"'4. SM_Assets_and_Rate_Base'!M35","v":0},null,{"$f":"'4. SM_Assets_and_Rate_Base'!O35","v":0},null,{"$f":"'4. SM_Assets_and_Rate_Base'!Q35","v":0},null,{"$f":"'4. SM_Assets_and_Rate_Base'!S35","v":0},null,{"$f":"'4. SM_Assets_and_Rate_Base'!U35","v":0},null,{"$f":"'4. SM_Assets_and_Rate_Base'!W35","v":0},null,{"$f":"'4. SM_Assets_and_Rate_Base'!Y35","v":0},null,{"$f":"'4. SM_Assets_and_Rate_Base'!AA35","v":0}]
[null,"Computer Hardware",{"$f":"'4. SM_Assets_and_Rate_Base'!G54","v":0},null,{"$f":"'4. SM_Assets_and_Rate_Base'!I54","v":0},null,{"$f":"'4. SM_Assets_and_Rate_Base'!K54","v":0},null,{"$f":"'4. SM_Assets_and_Rate_Base'!M54","v":0},null,{"$f":"'4. SM_Assets_and_Rate_Base'!O54","v":0},null,{"$f":"'4. SM_Assets_and_Rate_Base'!Q54","v":35522.990999999995},null,{"$f":"'4. SM_Assets_and_Rate_Base'!S54","v":27628.992999999999},null,{"$f":"'4. SM_Assets_and_Rate_Base'!U54","v":19734.994999999999},null,{"$f":"'4. SM_Assets_and_Rate_Base'!W54","v":11840.996999999999},null,{"$f":"'4. SM_Assets_and_Rate_Base'!Y54","v":3946.9990000000034},null,{"$f":"'4. SM_Assets_and_Rate_Base'!AA54","v":0}]
[null,"Computer Software                                    (Including Application Software)",{"$f":"'4. SM_Assets_and_Rate_Base'!G73","v":0},null,{"$f":"'4. SM_Assets_and_Rate_Base'!I73","v":0},null,{"$f":"'4. SM_Assets_and_Rate_Base'!K73","v":0},null,{"$f":"'4. SM_Assets_and_Rate_Base'!M73","v":0},null,{"$f":"'4. SM_Assets_and_Rate_Base'!O73","v":0},null,{"$f":"'4. SM_Assets_and_Rate_Base'!Q73","v":0},null,{"$f":"'4. SM_Assets_and_Rate_Base'!S73","v":0},null,{"$f":"'4. SM_Assets_and_Rate_Base'!U73","v":0},null,{"$f":"'4. SM_Assets_and_Rate_Base'!W73","v":0},null,{"$f":"'4. SM_Assets_and_Rate_Base'!Y73","v":0},null,{"$f":"'4. SM_Assets_and_Rate_Base'!AA73","v":0}]
[null,"Tools & Equipment",{"$f":"'4. SM_Assets_and_Rate_Base'!G92","v":0},null,{"$f":"'4. SM_Assets_and_Rate_Base'!I92","v":0},null,{"$f":"'4. SM_Assets_and_Rate_Base'!K92","v":0},null,{"$f":"'4. SM_Assets_and_Rate_Base'!M92","v":0},null,{"$f":"'4. SM_Assets_and_Rate_Base'!O92","v":0},null,{"$f":"'4. SM_Assets_and_Rate_Base'!Q92","v":0},null,{"$f":"'4. SM_Assets_and_Rate_Base'!S92","v":0},null,{"$f":"'4. SM_Assets_and_Rate_Base'!U92","v":0},null,{"$f":"'4. SM_Assets_and_Rate_Base'!W92","v":0},null,{"$f":"'4. SM_Assets_and_Rate_Base'!Y92","v":0},null,{"$f":"'4. SM_Assets_and_Rate_Base'!AA92","v":0}]
[null,"Other Equipment",{"$f":"'4. SM_Assets_and_Rate_Base'!G111","v":0},null,{"$f":"'4. SM_Assets_and_Rate_Base'!I111","v":0},null,{"$f":"'4. SM_Assets_and_Rate_Base'!K111","v":0},null,{"$f":"'4. SM_Assets_and_Rate_Base'!M111","v":0},null,{"$f":"'4. SM_Assets_and_Rate_Base'!O111","v":0},null,{"$f":"'4. SM_Assets_and_Rate_Base'!Q111","v":0},null,{"$f":"'4. SM_Assets_and_Rate_Base'!S111","v":0},null,{"$f":"'4. SM_Assets_and_Rate_Base'!U111","v":0},null,{"$f":"'4. SM_Assets_and_Rate_Base'!W111","v":0},null,{"$f":"'4. SM_Assets_and_Rate_Base'!Y111","v":0},null,{"$f":"'4. SM_Assets_and_Rate_Base'!AA111","v":0}]
[null,"Rate Base",{"$f":"SUM(C36:C40)","v":0},null,{"$f":"SUM(E36:E40)","v":0},null,{"$f":"SUM(G36:G40)","v":0},null,{"$f":"SUM(I36:I40)","v":0},null,{"$f":"SUM(K36:K40)","v":0},null,{"$f":"SUM(M36:M40)","v":35522.990999999995},null,{"$f":"SUM(O36:O40)","v":27628.992999999999},null,{"$f":"SUM(Q36:Q40)","v":19734.994999999999},null,{"$f":"SUM(S36:S40)","v":11840.996999999999},null,{"$f":"SUM(U36:U40)","v":3946.9990000000034},null,{"$f":"SUM(W36:W40)","v":0}]
[null,"Less: Exemption"]
[null,"Deemed Taxable Capital",{"$f":"C41-C42","v":0},null,0,null,0,null,0,null,0,null,35522.990999999995,null,27628.992999999999,null,19734.994999999999,null,{"$f":"S41-S42","v":11840.996999999999},null,3946.9990000000034,null,{"$f":"W41-W42","v":0}]
[]
[null,"Ontario Capital Tax Rate (from Sheet 3)",{"$f":"'3. Cost_of_Service_Parameters'!G41","v":3.0000000000000001E-3},null,{"$f":"'3. Cost_of_Service_Parameters'!I41","v":2.2499999999999998E-3},null,{"$f":"'3. Cost_of_Service_Parameters'!K41","v":2.2499999999999998E-3},null,{"$f":"'3. Cost_of_Service_Parameters'!M41","v":2.2499999999999998E-3},null,{"$f":"'3. Cost_of_Service_Parameters'!O41","v":7.5000000000000002E-4},null,{"$f":"'3. Cost_of_Service_Parameters'!Q41","v":0},null,{"$f":"'3. Cost_of_Service_Parameters'!S41","v":0},null,{"$f":"'3. Cost_of_Service_Parameters'!U41","v":0},null,{"$f":"'3. Cost_of_Service_Parameters'!W41","v":0},null,{"$f":"'3. Cost_of_Service_Parameters'!Y41","v":0},null,{"$f":"'3. Cost_of_Service_Parameters'!AA41","v":0}]
[]
[null,"Net Amount (Taxable Capital x Rate)",{"$f":"C43*C45","v":0},null,0,null,0,null,0,null,0,null,0,null,0,null,{"$f":"Q43*Q45","v":0},null,{"$f":"S43*S45","v":0},null,{"$f":"U43*U45","v":0},null,{"$f":"W43*W45","v":0}]
[]
[]
[null,"Change in Income Taxes Payable",{"$f":"C33","v":0},null,0,null,0,null,0,null,0,null,-976.2495485602999,null,-1037.3790902727001,null,{"$f":"Q33","v":259.70572562672498},null,{"$f":"S33","v":818.84419052130625},null,{"$f":"U33","v":1045.9067974637078},null,{"$f":"W33","v":522.99502877872908}]
[null,"Change in OCT",{"$f":"C47","v":0},null,0,null,0,null,0,null,0,null,0,null,0,null,{"$f":"Q47","v":0},null,{"$f":"S47","v":0},null,{"$f":"U47","v":0},null,{"$f":"W47","v":0}]
[null,"PILs",{"$f":"SUM(C50:C51)","v":0},null,0,null,0,null,0,null,0,null,-976.2495485602999,null,-1037.3790902727001,null,259.70572562672498,null,{"$f":"SUM(S50:S51)","v":818.84419052130625},null,1045.9067974637078,null,{"$f":"SUM(W50:W51)","v":522.99502877872908}]
[]
[]
["Gross Up PILs"]
[null,"Tax Rate",{"$f":"C31","v":0.36120000000000002},null,{"$f":"E31","v":0.36120000000000002},null,0.33500000000000002,null,0.33,null,0.31,null,0.155,null,0.155,null,{"$f":"Q31","v":0.155},null,{"$f":"S31","v":0.155},null,{"$f":"U31","v":0.155},null,{"$f":"W31","v":0.155}]
[null,"Change in Income Taxes Payable",{"$f":"C50/(1-C56)","v":0},null,0,null,0,null,0,null,0,null,-1155.3249095388164,null,-1227.6675624528996,null,307.34405399612427,null,{"$f":"S50/(1-S56)","v":969.04637931515538},null,1237.7595236256898,null,{"$f":"W50/(1-W56)","v":618.92902814050785}]
[null,"Change in OCT",{"$f":"C51","v":0},null,0,null,0,null,0,null,0,null,0,null,0,null,{"$f":"Q51","v":0},null,{"$f":"S51","v":0},null,{"$f":"U51","v":0},null,{"$f":"W51","v":0}]
[null,"PILs",{"$f":"SUM(C57:C58)","v":0},null,0,null,0,null,0,null,0,null,-1155.3249095388164,null,-1227.6675624528996,null,307.34405399612427,null,{"$f":"SUM(S57:S58)","v":969.04637931515538},null,1237.7595236256898,null,{"$f":"SUM(W57:W58)","v":618.92902814050785}]

{"sheet":"8. Funding_Adder_Revs","index":7,"n_rows":157,"n_cols":16,"rows_kept":157,"cut":false,"hidden":false,"merged":[[18,5,18,15],[12,1,12,13]]}
[]
[]
[]
[]
[]
[]
[]
[]
[]
[]
[]
[]
[null,"This worksheet calculates the funding adder revenues.\n"]
[]
[]
[]
[]
[]
[]
[null,null,null,null,null,null,null,null,null,"Account 1555 - Sub-account Funding Adder Revenues"]
[]
[null,"Prescribed Interest Rates","Approved Deferral and Variance Accounts","CWIP",null,"Date","Year","Quarter",null,"Opening Balance (Principal)","Funding Adder Revenues","Interest Rate","Interest","Closing Balance","Annual amounts","Board Approved Smart Meter Funding Adder (from Tariff)"]
[]
[null,"2006 Q1",null,null,null,"2006-01-01",{"$f":"YEAR(F24)","v":2006},{"$f":"IF(MONTH(F24)=0,\"\",IF(MONTH(F24)<4,\"Q1\",IF(MONTH(F24)<7,\"Q2\",IF(MONTH(F24)<10,\"Q3\",\"Q4\"))))","v":"Q1"},{"$f":"CONCATENATE(G24,\" \",H24)","v":"2006 Q1"},0,null,{"$f":"VLOOKUP(I24,$B$22:$D$59,2)","v":0},{"$f":"ROUND(J24*L24/12,2)","v":0},{"$f":"J24+K24+M24","v":0}]
[null,"2006 Q2",4.1399999999999999E-2,4.6800000000000001E-2,null,"2006-02-01",{"$f":"YEAR(F25)","v":2006},{"$f":"IF(MONTH(F25)=0,\"\",IF(MONTH(F25)<4,\"Q1\",IF(MONTH(F25)<7,\"Q2\",IF(MONTH(F25)<10,\"Q3\",\"Q4\"))))","v":"Q1"},{"$f":"CONCATENATE(G25,\" \",H25)","v":"2006 Q1"},{"$f":"J24+K24","v":0},null,0,{"$f":"ROUND(J25*L25/12,2)","v":0},{"$f":"J25+K25+M25","v":0}]
[null,"2006 Q3",4.5900000000000003E-2,5.0500000000000003E-2,null,"2006-03-01",2006,"Q1","2006 Q1",{"$f":"J25+K25","v":0},null,0,0,0]
[null,"2006 Q4",4.5900000000000003E-2,4.7199999999999999E-2,null,"2006-04-01",2006,"Q2","2006 Q2",0,null,4.1399999999999999E-2,0,0]
[null,"2007 Q1",4.5900000000000003E-2,4.7199999999999999E-2,null,"2006-05-01",2006,"Q2","2006 Q2",0,null,4.1399999999999999E-2,0,0]
[null,"2007 Q2",4.5900000000000003E-2,4.7199999999999999E-2,null,"2006-06-01",2006,"Q2","2006 Q2",0,null,4.1399999999999999E-2,0,0]
[null,"2007 Q3",4.5900000000000003E-2,5.1799999999999999E-2,null,"2006-07-01",2006,"Q3","2006 Q3",0,null,4.5900000000000003E-2,0,0]
[null,"2007 Q4",5.1400000000000001E-2,5.1799999999999999E-2,null,"2006-08-01",2006,"Q3","2006 Q3",0,null,4.5900000000000003E-2,0,0]
[null,"2008 Q1",5.1400000000000001E-2,5.1799999999999999E-2,null,"2006-09-01",2006,"Q3","2006 Q3",0,null,4.5900000000000003E-2,0,0]
[null,"2008 Q2",4.0800000000000003E-2,5.1799999999999999E-2,null,"2006-10-01",2006,"Q4","2006 Q4",0,null,4.5900000000000003E-2,0,0]
[null,"2008 Q3",3.3500000000000002E-2,5.4300000000000001E-2,null,"2006-11-01",2006,"Q4","2006 Q4",0,null,4.5900000000000003E-2,0,0]
[null,"2008 Q4",3.3500000000000002E-2,5.4300000000000001E-2,null,"2006-12-01",2006,"Q4","2006 Q4",0,null,4.5900000000000003E-2,0,0,{"$f":"SUM(K24:K35)+SUM(M24:M35)","v":0}]
[null,"2009 Q1",2.4500000000000001E-2,6.6100000000000006E-2,null,"2007-01-01",2007,"Q1","2007 Q1",0,null,4.5900000000000003E-2,0,0]
[null,"2009 Q2",0.01,6.6100000000000006E-2,null,"2007-02-01",2007,"Q1","2007 Q1",0,null,4.5900000000000003E-2,0,0]
[null,"2009 Q3",5.4999999999999997E-3,5.67E-2,null,"2007-03-01",2007,"Q1","2007 Q1",0,null,4.5900000000000003E-2,0,0]
[null,"2009 Q4",5.4999999999999997E-3,4.6600000000000003E-2,null,"2007-04-01",2007,"Q2","2007 Q2",0,null,4.5900000000000003E-2,0,0]
[null,"2010 Q1",5.4999999999999997E-3,4.3400000000000001E-2,null,"2007-05-01",2007,"Q2","2007 Q2",0,null,4.5900000000000003E-2,0,0]
[null,"2010 Q2",5.4999999999999997E-3,4.3400000000000001E-2,null,"2007-06-01",2007,"Q2","2007 Q2",0,null,4.5900000000000003E-2,0,0]
[null,"2010 Q3",8.8999999999999999E-3,4.6600000000000003E-2,null,"2007-07-01",2007,"Q3","2007 Q3",0,null,4.5900000000000003E-2,0,0]
[null,"2010 Q4",1.2E-2,4.0099999999999997E-2,null,"2007-08-01",2007,"Q3","2007 Q3",0,null,4.5900000000000003E-2,0,0]
[null,"2011 Q1",1.47E-2,4.2900000000000001E-2,null,"2007-09-01",2007,"Q3","2007 Q3",0,null,4.5900000000000003E-2,0,0]
[null,"2011 Q2",1.47E-2,4.2900000000000001E-2,null,"2007-10-01",2007,"Q4","2007 Q4",0,null,5.1400000000000001E-2,0,0]
[null,"2011 Q3",1.47E-2,4.2900000000000001E-2,null,"2007-11-01",2007,"Q4","2007 Q4",0,null,5.1400000000000001E-2,0,0]
[null,"2011 Q4",{"$f":"C46","v":1.47E-2},3.9199999999999999E-2,null,"2007-12-01",2007,"Q4","2007 Q4",0,null,5.1400000000000001E-2,0,0,{"$f":"SUM(K36:K47)+SUM(M36:M47)","v":0}]
[null,"2012 Q1",1.47E-2,3.9199999999999999E-2,null,"2008-01-01",2008,"Q1","2008 Q1",0,null,5.1400000000000001E-2,0,0]
[null,"2012 Q2",1.47E-2,3.5099999999999999E-2,null,"2008-02-01",2008,"Q1","2008 Q1",0,null,5.1400000000000001E-2,0,0]
[null,"2012 Q3",1.47E-2,3.5099999999999999E-2,null,"2008-03-01",2008,"Q1","2008 Q1",0,null,5.1400000000000001E-2,0,0]
[null,"2012 Q4",1.47E-2,3.2300000000000002E-2,null,"2008-04-01",2008,"Q2","2008 Q2",0,null,4.0800000000000003E-2,0,0]
[null,"2013 Q1",1.47E-2,3.2300000000000002E-2,null,"2008-05-01",2008,"Q2","2008 Q2",0,null,4.0800000000000003E-2,0,0]
[null,"2013 Q2",1.47E-2,3.2300000000000002E-2,null,"2008-06-01",2008,"Q2","2008 Q2",0,null,4.0800000000000003E-2,0,0]
[null,"2013 Q3",1.47E-2,3.2300000000000002E-2,null,"2008-07-01",2008,"Q3","2008 Q3",0,null,3.3500000000000002E-2,0,0]
[null,"2013 Q4",1.47E-2,3.6999999999999998E-2,null,"2008-08-01",2008,"Q3","2008 Q3",0,null,3.3500000000000002E-2,0,0]
[null,"2014 Q1",1.47E-2,3.6999999999999998E-2,null,"2008-09-01",2008,"Q3","2008 Q3",0,null,{"$f":"VLOOKUP(I56,$B$22:$D$59,2)","v":3.3500000000000002E-2},0,0]
[null,"2014 Q2",1.47E-2,3.1699999999999999E-2,null,"2008-10-01",2008,"Q4","2008 Q4",0,null,3.3500000000000002E-2,0,0]
[null,"2014 Q3",1.47E-2,3.1699999999999999E-2,null,"2008-11-01",2008,"Q4","2008 Q4",0,null,3.3500000000000002E-2,0,0]
[null,"2014 Q4",1.47E-2,3.1699999999999999E-2,null,"2008-12-01",2008,"Q4","2008 Q4",0,null,3.3500000000000002E-2,0,0,{"$f":"SUM(K48:K59)+SUM(M48:M59)","v":0}]
[null,"2015 Q1",1.47E-2,2.8899999999999999E-2,null,"2009-01-01",2009,"Q1","2009 Q1",0,null,2.4500000000000001E-2,0,0]
[null,"2015 Q2",1.0999999999999999E-2,2.2800000000000001E-2,null,"2009-02-01",2009,"Q1","2009 Q1",0,null,2.4500000000000001E-2,0,0]
[null,"2015 Q3",1.0999999999999999E-2,2.5499999999999998E-2,null,"2009-03-01",2009,"Q1","2009 Q1",0,null,2.4500000000000001E-2,0,0]
[null,"2015 Q4",1.0999999999999999E-2,2.5499999999999998E-2,null,"2009-04-01",2009,"Q2","2009 Q2",0,null,0.01,0,0]
[null,"2016 Q1",1.0999999999999999E-2,2.5499999999999998E-2,null,"2009-05-01",2009,"Q2","2009 Q2",0,null,0.01,0,0]
[null,"2016 Q2",1.0999999999999999E-2,2.5499999999999998E-2,null,"2009-06-01",2009,"Q2","2009 Q2",0,null,0.01,0,0]
[null,"2016 Q3",1.0999999999999999E-2,2.5499999999999998E-2,null,"2009-07-01",2009,"Q3","2009 Q3",0,null,5.4999999999999997E-3,0,0]
[null,"2016 Q4",1.0999999999999999E-2,2.5499999999999998E-2,null,"2009-08-01",2009,"Q3","2009 Q3",0,null,5.4999999999999997E-3,0,0]
[null,null,null,null,null,"2009-09-01",2009,"Q3","2009 Q3",0,null,5.4999999999999997E-3,0,0]
[null,null,null,null,null,"2009-10-01",2009,"Q4","2009 Q4",0,null,5.4999999999999997E-3,0,0]
[null,null,null,null,null,"2009-11-01",2009,"Q4","2009 Q4",0,null,5.4999999999999997E-3,0,0]
[null,null,null,null,null,"2009-12-01",2009,"Q4","2009 Q4",0,null,5.4999999999999997E-3,0,0,{"$f":"SUM(K60:K71)+SUM(M60:M71)","v":0}]
[null,null,null,null,null,"2010-01-01",2010,"Q1","2010 Q1",0,null,5.4999999999999997E-3,0,0]
[null,null,null,null,null,"2010-02-01",2010,"Q1","2010 Q1",0,null,5.4999999999999997E-3,0,0]
[null,null,null,null,null,"2010-03-01",2010,"Q1","2010 Q1",0,null,5.4999999999999997E-3,0,0]
[null,null,null,null,null,"2010-04-01",2010,"Q2","2010 Q2",0,null,5.4999999999999997E-3,0,0]
[null,null,null,null,null,"2010-05-01",2010,"Q2","2010 Q2",0,null,5.4999999999999997E-3,0,0]
[null,null,null,null,null,"2010-06-01",2010,"Q2","2010 Q2",0,null,5.4999999999999997E-3,0,0]
[null,null,null,null,null,"2010-07-01",2010,"Q3","2010 Q3",0,null,8.8999999999999999E-3,0,0]
[null,null,null,null,null,"2010-08-01",2010,"Q3","2010 Q3",0,null,8.8999999999999999E-3,0,0]
[null,null,null,null,null,"2010-09-01",2010,"Q3","2010 Q3",0,null,8.8999999999999999E-3,0,0]
[null,null,null,null,null,"2010-10-01",2010,"Q4","2010 Q4",0,null,1.2E-2,0,0]
[null,null,null,null,null,"2010-11-01",2010,"Q4","2010 Q4",0,null,1.2E-2,0,0]
[null,null,null,null,null,"2010-12-01",2010,"Q4","2010 Q4",0,null,1.2E-2,0,0,{"$f":"SUM(K72:K83)+SUM(M72:M83)","v":0}]
[null,null,null,null,null,"2011-01-01",2011,"Q1","2011 Q1",0,null,1.47E-2,0,0]
[null,null,null,null,null,"2011-02-01",2011,"Q1","2011 Q1",0,null,1.47E-2,0,0]
[null,null,null,null,null,"2011-03-01",2011,"Q1","2011 Q1",0,null,1.47E-2,0,0]
[null,null,null,null,null,"2011-04-01",2011,"Q2","2011 Q2",0,null,1.47E-2,0,0]
[null,null,null,null,null,"2011-05-01",2011,"Q2","2011 Q2",0,null,{"$f":"VLOOKUP(I88,$B$22:$D$59,2)","v":1.47E-2},0,0]
[null,null,null,null,null,"2011-06-01",{"$f":"YEAR(F89)","v":2011},{"$f":"IF(MONTH(F89)=0,\"\",IF(MONTH(F89)<4,\"Q1\",IF(MONTH(F89)<7,\"Q2\",IF(MONTH(F89)<10,\"Q3\",\"Q4\"))))","v":"Q2"},{"$f":"CONCATENATE(G89,\" \",H89)","v":"2011 Q2"},0,null,1.47E-2,{"$f":"ROUND(J89*L89/12,2)","v":0},{"$f":"J89+K89+M89","v":0}]
[null,null,null,null,null,"2011-07-01",2011,"Q3","2011 Q3",{"$f":"J89+K89","v":0},null,1.47E-2,0,0]
[null,null,null,null,null,"2011-08-01",2011,"Q3","2011 Q3",0,null,1.47E-2,0,0]
[null,null,null,null,null,"2011-09-01",2011,"Q3","2011 Q3",0,null,1.47E-2,0,0]
[null,null,null,null,null,"2011-10-01",2011,"Q4","2011 Q4",0,null,1.47E-2,0,0]
[null,null,null,null,null,"2011-11-01",2011,"Q4","2011 Q4",0,null,1.47E-2,0,0]
[null,null,null,null,null,"2011-12-01",2011,"Q4","2011 Q4",0,null,1.47E-2,0,0,{"$f":"SUM(K84:K95)+SUM(M84:M95)","v":0}]
[null,null,null,null,null,"2012-01-01",2012,"Q1","2012 Q1",0,null,1.47E-2,0,0]
[null,null,null,null,null,"2012-02-01",2012,"Q1","2012 Q1",0,null,1.47E-2,0,0]
[null,null,null,null,null,"2012-03-01",2012,"Q1","2012 Q1",0,null,1.47E-2,0,0]
[null,null,null,null,null,"2012-04-01",2012,"Q2","2012 Q2",0,null,{"$f":"VLOOKUP(I99,$B$22:$D$63,2)","v":1.47E-2},0,0]
[null,null,null,null,null,"2012-05-01",2012,"Q2","2012 Q2",0,null,{"$f":"VLOOKUP(I100,$B$22:$D$63,2)","v":1.47E-2},0,0]
[null,null,null,null,null,"2012-06-01",2012,"Q2","2012 Q2",0,null,1.47E-2,0,0]
[null,null,null,null,null,"2012-07-01",2012,"Q3","2012 Q3",0,null,1.47E-2,0,0]
[null,null,null,null,null,"2012-08-01",2012,"Q3","2012 Q3",0,null,1.47E-2,0,0]
[null,null,null,null,null,"2012-09-01",2012,"Q3","2012 Q3",0,null,1.47E-2,0,0]
[null,null,null,null,null,"2012-10-01",2012,"Q4","2012 Q4",0,null,1.47E-2,0,0]
[null,null,null,null,null,"2012-11-01",2012,"Q4","2012 Q4",0,null,1.47E-2,0,0]
[null,null,null,null,null,"2012-12-01",2012,"Q4","2012 Q4",0,null,1.47E-2,0,0,{"$f":"SUM(K96:K107)+SUM(M96:M107)","v":0}]
[null,null,null,null,null,"2013-01-01",2013,"Q1","2013 Q1",0,null,1.47E-2,{"$f":"ROUND(J108*L108/12,2)","v":0},{"$f":"J108+K108+M108","v":0}]
[null,null,null,null,null,"2013-02-01",2013,"Q1","2013 Q1",0,null,1.47E-2,0,0]
[null,null,null,null,null,"2013-03-01",2013,"Q1","2013 Q1",0,null,1.47E-2,0,0]
[null,null,null,null,null,"2013-04-01",2013,"Q2","2013 Q2",0,null,1.47E-2,0,0]
[null,null,null,null,null,"2013-05-01",2013,"Q2","2013 Q2",0,null,1.47E-2,0,0]
[null,null,null,null,null,"2013-06-01",2013,"Q2","2013 Q2",0,null,1.47E-2,0,0]
[null,null,null,null,null,"2013-07-01",2013,"Q3","2013 Q3",0,null,1.47E-2,0,0]
[null,null,null,null,null,"2013-08-01",2013,"Q3","2013 Q3",0,null,1.47E-2,0,0]
[null,null,null,null,null,"2013-09-01",2013,"Q3","2013 Q3",0,null,1.47E-2,0,0]
[null,null,null,null,null,"2013-10-01",2013,"Q4","2013 Q4",0,null,1.47E-2,0,0]
[null,null,null,null,null,"2013-11-01",2013,"Q4","2013 Q4",0,null,1.47E-2,0,0]
[null,null,null,null,null,"2013-12-01",2013,"Q4","2013 Q4",0,null,1.47E-2,0,0,{"$f":"SUM(K108:K119)+SUM(M108:M119)","v":0}]
[null,null,null,null,null,"2014-01-01",{"$f":"YEAR(F120)","v":2014},{"$f":"IF(MONTH(F120)=0,\"\",IF(MONTH(F120)<4,\"Q1\",IF(MONTH(F120)<7,\"Q2\",IF(MONTH(F120)<10,\"Q3\",\"Q4\"))))","v":"Q1"},{"$f":"CONCATENATE(G120,\" \",H120)","v":"2014 Q1"},{"$f":"J119+K119","v":0},null,1.47E-2,{"$f":"ROUND(J120*L120/12,2)","v":0},{"$f":"J120+K120+M120","v":0}]
[null,null,null,null,null,"2014-02-01",2014,"Q1","2014 Q1",0,null,1.47E-2,0,0]
[null,null,null,null,null,"2014-03-01",2014,"Q1","2014 Q1",0,null,1.47E-2,0,0]
[null,null,null,null,null,"2014-04-01",2014,"Q2","2014 Q2",0,null,1.47E-2,0,0]
[null,null,null,null,null,"2014-05-01",2014,"Q2","2014 Q2",0,null,1.47E-2,0,0]
[null,null,null,null,null,"2014-06-01",2014,"Q2","2014 Q2",0,null,1.47E-2,0,0]
[null,null,null,null,null,"2014-07-01",2014,"Q3","2014 Q3",0,null,1.47E-2,0,0]
[null,null,null,null,null,"2014-08-01",2014,"Q3","2014 Q3",0,null,1.47E-2,0,0]
[null,null,null,null,null,"2014-09-01",2014,"Q3","2014 Q3",0,null,1.47E-2,0,0]
[null,null,null,null,null,"2014-10-01",2014,"Q4","2014 Q4",0,null,1.47E-2,0,0]
[null,null,null,null,null,"2014-11-01",2014,"Q4","2014 Q4",0,null,1.47E-2,0,0]
[null,null,null,null,null,"2014-12-01",2014,"Q4","2014 Q4",0,null,1.47E-2,0,0,{"$f":"SUM(K120:K131)+SUM(M120:M131)","v":0}]
[null,null,null,null,null,"2015-01-01",{"$f":"YEAR(F132)","v":2015},{"$f":"IF(MONTH(F132)=0,\"\",IF(MONTH(F132)<4,\"Q1\",IF(MONTH(F132)<7,\"Q2\",IF(MONTH(F132)<10,\"Q3\",\"Q4\"))))","v":"Q1"},{"$f":"CONCATENATE(G132,\" \",H132)","v":"2015 Q1"},{"$f":"J131+K131","v":0},null,1.47E-2,{"$f":"ROUND(J132*L132/12,2)","v":0},{"$f":"J132+K132+M132","v":0}]
[null,null,null,null,null,"2015-02-01",2015,"Q1","2015 Q1",0,null,1.47E-2,0,0]
[null,null,null,null,null,"2015-03-01",2015,"Q1","2015 Q1",0,null,1.47E-2,0,0]
[null,null,null,null,null,"2015-04-01",2015,"Q2","2015 Q2",0,null,1.0999999999999999E-2,0,0]
[null,null,null,null,null,"2015-05-01",2015,"Q2","2015 Q2",0,null,1.0999999999999999E-2,0,0]
[null,null,null,null,null,"2015-06-01",2015,"Q2","2015 Q2",0,null,1.0999999999999999E-2,0,0]
[null,null,null,null,null,"2015-07-01",2015,"Q3","2015 Q3",0,null,1.0999999999999999E-2,0,0]
[null,null,null,null,null,"2015-08-01",2015,"Q3","2015 Q3",0,null,1.0999999999999999E-2,0,0]
[null,null,null,null,null,"2015-09-01",2015,"Q3","2015 Q3",0,null,1.0999999999999999E-2,0,0]
[null,null,null,null,null,"2015-10-01",2015,"Q4","2015 Q4",0,null,1.0999999999999999E-2,0,0]
[null,null,null,null,null,"2015-11-01",2015,"Q4","2015 Q4",0,null,1.0999999999999999E-2,0,0]
[null,null,null,null,null,"2015-12-01",2015,"Q4","2015 Q4",0,null,1.0999999999999999E-2,0,0,{"$f":"SUM(K132:K143)+SUM(M132:M143)","v":0}]
[null,null,null,null,null,"2016-01-01",2016,"Q1","2016 Q1",{"$f":"J143+K143","v":0},null,{"$f":"VLOOKUP(I144,$B$22:$D$67,2)","v":1.0999999999999999E-2},{"$f":"ROUND(J144*L144/12,2)","v":0},{"$f":"J144+K144+M144","v":0}]
[null,null,null,null,null,"2016-02-01",2016,"Q1","2016 Q1",0,null,1.0999999999999999E-2,0,0]
[null,null,null,null,null,"2016-03-01",2016,"Q1","2016 Q1",0,null,1.0999999999999999E-2,0,0]
[null,null,null,null,null,"2016-04-01",2016,"Q2","2016 Q2",0,null,1.0999999999999999E-2,0,0]
[null,null,null,null,null,"2016-05-01",2016,"Q2","2016 Q2",0,null,1.0999999999999999E-2,0,0]
[null,null,null,null,null,"2016-06-01",2016,"Q2","2016 Q2",0,null,1.0999999999999999E-2,0,0]
[null,null,null,null,null,"2016-07-01",2016,"Q3","2016 Q3",0,null,1.0999999999999999E-2,0,0]
[null,null,null,null,null,"2016-08-01",2016,"Q3","2016 Q3",0,null,1.0999999999999999E-2,0,0]
[null,null,null,null,null,"2016-09-01",2016,"Q3","2016 Q3",0,null,1.0999999999999999E-2,0,0]
[null,null,null,null,null,"2016-10-01",2016,"Q4","2016 Q4",0,null,1.0999999999999999E-2,0,0]
[null,null,null,null,null,"2016-11-01",2016,"Q4","2016 Q4",0,null,1.0999999999999999E-2,0,0]
[null,null,null,null,null,"2016-12-01",2016,"Q4","2016 Q4",0,null,1.0999999999999999E-2,0,0,{"$f":"SUM(K144:K155)+SUM(M144:M155)","v":0}]
[]
[null,null,null,null,null,"Total Funding Adder Revenues Collected",null,null,null,null,{"$f":"SUM(K24:K155)","v":0},null,{"$f":"SUM(M24:M155)","v":0},{"$f":"K157+M157","v":0},{"$f":"SUM(O24:O155)","v":0}]

{"sheet":"8A. Opex_Interest_monthly","index":8,"n_rows":158,"n_cols":16,"rows_kept":158,"cut":false,"hidden":false,"merged":[[22,3,23,3]]}
[]
[]
[]
[]
[]
[]
[]
[]
[]
[]
[]
[]
[null,"This worksheet calculates the interest on OM&A and amortization/depreciation expense, based on monthly data."]
[]
[]
[]
[]
[]
[]
[]
[null,null,null,null,null,null,null,null,null,"Account 1556 - Sub-accounts Operating Expenses, Amortization Expenses, Carrying Charges"]
[]
[null,"Prescribed Interest Rates","Approved Deferral and Variance Accounts","CWIP",null,"Date","Year","Quarter",null,"Opening Balance (Principal)","OM&A Expenses","Amortization / Depreciation Expense","Closing Balance (Principal)","(Annual) Interest Rate","Interest (on opening balance)","Cumulative Interest"]
[]
[null,{"$f":"'8. Funding_Adder_Revs'!B24","v":"2006 Q1"},{"$f":"'8. Funding_Adder_Revs'!C24","v":0},{"$f":"'8. Funding_Adder_Revs'!D24","v":0},null,{"$f":"'8. Funding_Adder_Revs'!F24","v":"2006-01-01"},{"$f":"'8. Funding_Adder_Revs'!G24","v":2006},{"$f":"'8. Funding_Adder_Revs'!H24","v":"Q1"},null,0,null,null,{"$f":"J25+K25+L25","v":0},{"$f":"'8. Funding_Adder_Revs'!L24","v":0},{"$f":"J25*N25/12","v":0},{"$f":"O25","v":0}]
[null,{"$f":"'8. Funding_Adder_Revs'!B25","v":"2006 Q2"},{"$f":"'8. Funding_Adder_Revs'!C25","v":4.1399999999999999E-2},{"$f":"'8. Funding_Adder_Revs'!D25","v":4.6800000000000001E-2},null,{"$f":"'8. Funding_Adder_Revs'!F25","v":"2006-02-01"},{"$f":"'8. Funding_Adder_Revs'!G25","v":2006},{"$f":"'8. Funding_Adder_Revs'!H25","v":"Q1"},null,{"$f":"M25","v":0},null,null,{"$f":"J26+K26+L26","v":0},{"$f":"'8. Funding_Adder_Revs'!L25","v":0},{"$f":"J26*N26/12","v":0},{"$f":"O26+P25","v":0}]
[null,{"$f":"'8. Funding_Adder_Revs'!B26","v":"2006 Q3"},{"$f":"'8. Funding_Adder_Revs'!C26","v":4.5900000000000003E-2},{"$f":"'8. Funding_Adder_Revs'!D26","v":5.0500000000000003E-2},null,{"$f":"'8. Funding_Adder_Revs'!F26","v":"2006-03-01"},{"$f":"'8. Funding_Adder_Revs'!G26","v":2006},{"$f":"'8. Funding_Adder_Revs'!H26","v":"Q1"},null,{"$f":"M26","v":0},null,null,0,{"$f":"'8. Funding_Adder_Revs'!L26","v":0},0,{"$f":"O27+P26","v":0}]
[null,{"$f":"'8. Funding_Adder_Revs'!B27","v":"2006 Q4"},{"$f":"'8. Funding_Adder_Revs'!C27","v":4.5900000000000003E-2},{"$f":"'8. Funding_Adder_Revs'!D27","v":4.7199999999999999E-2},null,{"$f":"'8. Funding_Adder_Revs'!F27","v":"2006-04-01"},{"$f":"'8. Funding_Adder_Revs'!G27","v":2006},{"$f":"'8. Funding_Adder_Revs'!H27","v":"Q2"},null,0,null,null,0,{"$f":"'8. Funding_Adder_Revs'!L27","v":4.1399999999999999E-2},0,0]
[null,{"$f":"'8. Funding_Adder_Revs'!B28","v":"2007 Q1"},{"$f":"'8. Funding_Adder_Revs'!C28","v":4.5900000000000003E-2},{"$f":"'8. Funding_Adder_Revs'!D28","v":4.7199999999999999E-2},null,{"$f":"'8. Funding_Adder_Revs'!F28","v":"2006-05-01"},{"$f":"'8. Funding_Adder_Revs'!G28","v":2006},{"$f":"'8. Funding_Adder_Revs'!H28","v":"Q2"},null,0,null,null,0,{"$f":"'8. Funding_Adder_Revs'!L28","v":4.1399999999999999E-2},0,0]
[null,{"$f":"'8. Funding_Adder_Revs'!B29","v":"2007 Q2"},{"$f":"'8. Funding_Adder_Revs'!C29","v":4.5900000000000003E-2},{"$f":"'8. Funding_Adder_Revs'!D29","v":4.7199999999999999E-2},null,{"$f":"'8. Funding_Adder_Revs'!F29","v":"2006-06-01"},{"$f":"'8. Funding_Adder_Revs'!G29","v":2006},{"$f":"'8. Funding_Adder_Revs'!H29","v":"Q2"},null,0,null,null,0,{"$f":"'8. Funding_Adder_Revs'!L29","v":4.1399999999999999E-2},0,0]
[null,{"$f":"'8. Funding_Adder_Revs'!B30","v":"2007 Q3"},{"$f":"'8. Funding_Adder_Revs'!C30","v":4.5900000000000003E-2},{"$f":"'8. Funding_Adder_Revs'!D30","v":5.1799999999999999E-2},null,{"$f":"'8. Funding_Adder_Revs'!F30","v":"2006-07-01"},{"$f":"'8. Funding_Adder_Revs'!G30","v":2006},{"$f":"'8. Funding_Adder_Revs'!H30","v":"Q3"},null,0,null,null,0,{"$f":"'8. Funding_Adder_Revs'!L30","v":4.5900000000000003E-2},0,0]
[null,{"$f":"'8. Funding_Adder_Revs'!B31","v":"2007 Q4"},{"$f":"'8. Funding_Adder_Revs'!C31","v":5.1400000000000001E-2},{"$f":"'8. Funding_Adder_Revs'!D31","v":5.1799999999999999E-2},null,{"$f":"'8. Funding_Adder_Revs'!F31","v":"2006-08-01"},{"$f":"'8. Funding_Adder_Revs'!G31","v":2006},{"$f":"'8. Funding_Adder_Revs'!H31","v":"Q3"},null,0,null,null,0,{"$f":"'8. Funding_Adder_Revs'!L31","v":4.5900000000000003E-2},0,0]
[null,{"$f":"'8. Funding_Adder_Revs'!B32","v":"2008 Q1"},{"$f":"'8. Funding_Adder_Revs'!C32","v":5.1400000000000001E-2},{"$f":"'8. Funding_Adder_Revs'!D32","v":5.1799999999999999E-2},null,{"$f":"'8. Funding_Adder_Revs'!F32","v":"2006-09-01"},{"$f":"'8. Funding_Adder_Revs'!G32","v":2006},{"$f":"'8. Funding_Adder_Revs'!H32","v":"Q3"},null,0,null,null,0,{"$f":"'8. Funding_Adder_Revs'!L32","v":4.5900000000000003E-2},0,0]
[null,{"$f":"'8. Funding_Adder_Revs'!B33","v":"2008 Q2"},{"$f":"'8. Funding_Adder_Revs'!C33","v":4.0800000000000003E-2},{"$f":"'8. Funding_Adder_Revs'!D33","v":5.1799999999999999E-2},null,{"$f":"'8. Funding_Adder_Revs'!F33","v":"2006-10-01"},{"$f":"'8. Funding_Adder_Revs'!G33","v":2006},{"$f":"'8. Funding_Adder_Revs'!H33","v":"Q4"},null,0,null,null,0,{"$f":"'8. Funding_Adder_Revs'!L33","v":4.5900000000000003E-2},0,0]
[null,{"$f":"'8. Funding_Adder_Revs'!B34","v":"2008 Q3"},{"$f":"'8. Funding_Adder_Revs'!C34","v":3.3500000000000002E-2},{"$f":"'8. Funding_Adder_Revs'!D34","v":5.4300000000000001E-2},null,{"$f":"'8. Funding_Adder_Revs'!F34","v":"2006-11-01"},{"$f":"'8. Funding_Adder_Revs'!G34","v":2006},{"$f":"'8. Funding_Adder_Revs'!H34","v":"Q4"},null,0,null,null,0,{"$f":"'8. Funding_Adder_Revs'!L34","v":4.5900000000000003E-2},0,0]
[null,{"$f":"'8. Funding_Adder_Revs'!B35","v":"2008 Q4"},{"$f":"'8. Funding_Adder_Revs'!C35","v":3.3500000000000002E-2},{"$f":"'8. Funding_Adder_Revs'!D35","v":5.4300000000000001E-2},null,{"$f":"'8. Funding_Adder_Revs'!F35","v":"2006-12-01"},{"$f":"'8. Funding_Adder_Revs'!G35","v":2006},{"$f":"'8. Funding_Adder_Revs'!H35","v":"Q4"},null,0,null,null,0,{"$f":"'8. Funding_Adder_Revs'!L35","v":4.5900000000000003E-2},0,0]
[null,{"$f":"'8. Funding_Adder_Revs'!B36","v":"2009 Q1"},{"$f":"'8. Funding_Adder_Revs'!C36","v":2.4500000000000001E-2},{"$f":"'8. Funding_Adder_Revs'!D36","v":6.6100000000000006E-2},null,{"$f":"'8. Funding_Adder_Revs'!F36","v":"2007-01-01"},{"$f":"'8. Funding_Adder_Revs'!G36","v":2007},{"$f":"'8. Funding_Adder_Revs'!H36","v":"Q1"},null,0,null,null,0,{"$f":"'8. Funding_Adder_Revs'!L36","v":4.5900000000000003E-2},0,0]
[null,{"$f":"'8. Funding_Adder_Revs'!B37","v":"2009 Q2"},{"$f":"'8. Funding_Adder_Revs'!C37","v":0.01},{"$f":"'8. Funding_Adder_Revs'!D37","v":6.6100000000000006E-2},null,{"$f":"'8. Funding_Adder_Revs'!F37","v":"2007-02-01"},{"$f":"'8. Funding_Adder_Revs'!G37","v":2007},{"$f":"'8. Funding_Adder_Revs'!H37","v":"Q1"},null,0,null,null,0,{"$f":"'8. Funding_Adder_Revs'!L37","v":4.5900000000000003E-2},0,0]
[null,{"$f":"'8. Funding_Adder_Revs'!B38","v":"2009 Q3"},{"$f":"'8. Funding_Adder_Revs'!C38","v":5.4999999999999997E-3},{"$f":"'8. Funding_Adder_Revs'!D38","v":5.67E-2},null,{"$f":"'8. Funding_Adder_Revs'!F38","v":"2007-03-01"},{"$f":"'8. Funding_Adder_Revs'!G38","v":2007},{"$f":"'8. Funding_Adder_Revs'!H38","v":"Q1"},null,0,null,null,0,{"$f":"'8. Funding_Adder_Revs'!L38","v":4.5900000000000003E-2},0,0]
[null,{"$f":"'8. Funding_Adder_Revs'!B39","v":"2009 Q4"},{"$f":"'8. Funding_Adder_Revs'!C39","v":5.4999999999999997E-3},{"$f":"'8. Funding_Adder_Revs'!D39","v":4.6600000000000003E-2},null,{"$f":"'8. Funding_Adder_Revs'!F39","v":"2007-04-01"},{"$f":"'8. Funding_Adder_Revs'!G39","v":2007},{"$f":"'8. Funding_Adder_Revs'!H39","v":"Q2"},null,0,null,null,0,{"$f":"'8. Funding_Adder_Revs'!L39","v":4.5900000000000003E-2},0,0]
[null,{"$f":"'8. Funding_Adder_Revs'!B40","v":"2010 Q1"},{"$f":"'8. Funding_Adder_Revs'!C40","v":5.4999999999999997E-3},{"$f":"'8. Funding_Adder_Revs'!D40","v":4.3400000000000001E-2},null,{"$f":"'8. Funding_Adder_Revs'!F40","v":"2007-05-01"},{"$f":"'8. Funding_Adder_Revs'!G40","v":2007},{"$f":"'8. Funding_Adder_Revs'!H40","v":"Q2"},null,0,null,null,0,{"$f":"'8. Funding_Adder_Revs'!L40","v":4.5900000000000003E-2},0,0]
[null,{"$f":"'8. Funding_Adder_Revs'!B41","v":"2010 Q2"},{"$f":"'8. Funding_Adder_Revs'!C41","v":5.4999999999999997E-3},{"$f":"'8. Funding_Adder_Revs'!D41","v":4.3400000000000001E-2},null,{"$f":"'8. Funding_Adder_Revs'!F41","v":"2007-06-01"},{"$f":"'8. Funding_Adder_Revs'!G41","v":2007},{"$f":"'8. Funding_Adder_Revs'!H41","v":"Q2"},null,0,null,null,0,{"$f":"'8. Funding_Adder_Revs'!L41","v":4.5900000000000003E-2},0,0]
[null,{"$f":"'8. Funding_Adder_Revs'!B42","v":"2010 Q3"},{"$f":"'8. Funding_Adder_Revs'!C42","v":8.8999999999999999E-3},{"$f":"'8. Funding_Adder_Revs'!D42","v":4.6600000000000003E-2},null,{"$f":"'8. Funding_Adder_Revs'!F42","v":"2007-07-01"},{"$f":"'8. Funding_Adder_Revs'!G42","v":2007},{"$f":"'8. Funding_Adder_Revs'!H42","v":"Q3"},null,0,null,null,0,{"$f":"'8. Funding_Adder_Revs'!L42","v":4.5900000000000003E-2},0,0]
[null,{"$f":"'8. Funding_Adder_Revs'!B43","v":"2010 Q4"},{"$f":"'8. Funding_Adder_Revs'!C43","v":1.2E-2},{"$f":"'8. Funding_Adder_Revs'!D43","v":4.0099999999999997E-2},null,{"$f":"'8. Funding_Adder_Revs'!F43","v":"2007-08-01"},{"$f":"'8. Funding_Adder_Revs'!G43","v":2007},{"$f":"'8. Funding_Adder_Revs'!H43","v":"Q3"},null,0,null,null,0,{"$f":"'8. Funding_Adder_Revs'!L43","v":4.5900000000000003E-2},0,0]
[null,{"$f":"'8. Funding_Adder_Revs'!B44","v":"2011 Q1"},{"$f":"'8. Funding_Adder_Revs'!C44","v":1.47E-2},{"$f":"'8. Funding_Adder_Revs'!D44","v":4.2900000000000001E-2},null,{"$f":"'8. Funding_Adder_Revs'!F44","v":"2007-09-01"},{"$f":"'8. Funding_Adder_Revs'!G44","v":2007},{"$f":"'8. Funding_Adder_Revs'!H44","v":"Q3"},null,0,null,null,0,{"$f":"'8. Funding_Adder_Revs'!L44","v":4.5900000000000003E-2},0,0]
[null,{"$f":"'8. Funding_Adder_Revs'!B45","v":"2011 Q2"},{"$f":"'8. Funding_Adder_Revs'!C45","v":1.47E-2},{"$f":"'8. Funding_Adder_Revs'!D45","v":4.2900000000000001E-2},null,{"$f":"'8. Funding_Adder_Revs'!F45","v":"2007-10-01"},{"$f":"'8. Funding_Adder_Revs'!G45","v":2007},{"$f":"'8. Funding_Adder_Revs'!H45","v":"Q4"},null,0,null,null,0,{"$f":"'8. Funding_Adder_Revs'!L45","v":5.1400000000000001E-2},0,0]
[null,{"$f":"'8. Funding_Adder_Revs'!B46","v":"2011 Q3"},{"$f":"'8. Funding_Adder_Revs'!C46","v":1.47E-2},{"$f":"'8. Funding_Adder_Revs'!D46","v":4.2900000000000001E-2},null,{"$f":"'8. Funding_Adder_Revs'!F46","v":"2007-11-01"},{"$f":"'8. Funding_Adder_Revs'!G46","v":2007},{"$f":"'8. Funding_Adder_Revs'!H46","v":"Q4"},null,0,null,null,0,{"$f":"'8. Funding_Adder_Revs'!L46","v":5.1400000000000001E-2},0,0]
[null,{"$f":"'8. Funding_Adder_Revs'!B47","v":"2011 Q4"},{"$f":"'8. Funding_Adder_Revs'!C47","v":1.47E-2},{"$f":"'8. Funding_Adder_Revs'!D47","v":3.9199999999999999E-2},null,{"$f":"'8. Funding_Adder_Revs'!F47","v":"2007-12-01"},{"$f":"'8. Funding_Adder_Revs'!G47","v":2007},{"$f":"'8. Funding_Adder_Revs'!H47","v":"Q4"},null,0,null,null,0,{"$f":"'8. Funding_Adder_Revs'!L47","v":5.1400000000000001E-2},0,0]
[null,{"$f":"'8. Funding_Adder_Revs'!B48","v":"2012 Q1"},{"$f":"'8. Funding_Adder_Revs'!C48","v":1.47E-2},{"$f":"'8. Funding_Adder_Revs'!D48","v":3.9199999999999999E-2},null,{"$f":"'8. Funding_Adder_Revs'!F48","v":"2008-01-01"},{"$f":"'8. Funding_Adder_Revs'!G48","v":2008},{"$f":"'8. Funding_Adder_Revs'!H48","v":"Q1"},null,0,null,null,0,{"$f":"'8. Funding_Adder_Revs'!L48","v":5.1400000000000001E-2},0,0]
[null,{"$f":"'8. Funding_Adder_Revs'!B49","v":"2012 Q2"},{"$f":"'8. Funding_Adder_Revs'!C49","v":1.47E-2},{"$f":"'8. Funding_Adder_Revs'!D49","v":3.5099999999999999E-2},null,{"$f":"'8. Funding_Adder_Revs'!F49","v":"2008-02-01"},{"$f":"'8. Funding_Adder_Revs'!G49","v":2008},{"$f":"'8. Funding_Adder_Revs'!H49","v":"Q1"},null,0,null,null,0,{"$f":"'8. Funding_Adder_Revs'!L49","v":5.1400000000000001E-2},0,0]
[null,{"$f":"'8. Funding_Adder_Revs'!B50","v":"2012 Q3"},{"$f":"'8. Funding_Adder_Revs'!C50","v":1.47E-2},{"$f":"'8. Funding_Adder_Revs'!D50","v":3.5099999999999999E-2},null,{"$f":"'8. Funding_Adder_Revs'!F50","v":"2008-03-01"},{"$f":"'8. Funding_Adder_Revs'!G50","v":2008},{"$f":"'8. Funding_Adder_Revs'!H50","v":"Q1"},null,0,null,null,0,{"$f":"'8. Funding_Adder_Revs'!L50","v":5.1400000000000001E-2},0,0]
[null,{"$f":"'8. Funding_Adder_Revs'!B51","v":"2012 Q4"},{"$f":"'8. Funding_Adder_Revs'!C51","v":1.47E-2},{"$f":"'8. Funding_Adder_Revs'!D51","v":3.2300000000000002E-2},null,{"$f":"'8. Funding_Adder_Revs'!F51","v":"2008-04-01"},{"$f":"'8. Funding_Adder_Revs'!G51","v":2008},{"$f":"'8. Funding_Adder_Revs'!H51","v":"Q2"},null,0,null,null,0,{"$f":"'8. Funding_Adder_Revs'!L51","v":4.0800000000000003E-2},0,0]
[null,{"$f":"'8. Funding_Adder_Revs'!B52","v":"2013 Q1"},{"$f":"'8. Funding_Adder_Revs'!C52","v":1.47E-2},{"$f":"'8. Funding_Adder_Revs'!D52","v":3.2300000000000002E-2},null,{"$f":"'8. Funding_Adder_Revs'!F52","v":"2008-05-01"},{"$f":"'8. Funding_Adder_Revs'!G52","v":2008},{"$f":"'8. Funding_Adder_Revs'!H52","v":"Q2"},null,0,null,null,0,{"$f":"'8. Funding_Adder_Revs'!L52","v":4.0800000000000003E-2},0,0]
[null,{"$f":"'8. Funding_Adder_Revs'!B53","v":"2013 Q2"},{"$f":"'8. Funding_Adder_Revs'!C53","v":1.47E-2},{"$f":"'8. Funding_Adder_Revs'!D53","v":3.2300000000000002E-2},null,{"$f":"'8. Funding_Adder_Revs'!F53","v":"2008-06-01"},{"$f":"'8. Funding_Adder_Revs'!G53","v":2008},{"$f":"'8. Funding_Adder_Revs'!H53","v":"Q2"},null,0,null,null,0,{"$f":"'8. Funding_Adder_Revs'!L53","v":4.0800000000000003E-2},0,0]
[null,{"$f":"'8. Funding_Adder_Revs'!B54","v":"2013 Q3"},{"$f":"'8. Funding_Adder_Revs'!C54","v":1.47E-2},{"$f":"'8. Funding_Adder_Revs'!D54","v":3.2300000000000002E-2},null,{"$f":"'8. Funding_Adder_Revs'!F54","v":"2008-07-01"},{"$f":"'8. Funding_Adder_Revs'!G54","v":2008},{"$f":"'8. Funding_Adder_Revs'!H54","v":"Q3"},null,0,null,null,0,{"$f":"'8. Funding_Adder_Revs'!L54","v":3.3500000000000002E-2},0,0]
[null,{"$f":"'8. Funding_Adder_Revs'!B55","v":"2013 Q4"},{"$f":"'8. Funding_Adder_Revs'!C55","v":1.47E-2},{"$f":"'8. Funding_Adder_Revs'!D55","v":3.6999999999999998E-2},null,{"$f":"'8. Funding_Adder_Revs'!F55","v":"2008-08-01"},{"$f":"'8. Funding_Adder_Revs'!G55","v":2008},{"$f":"'8. Funding_Adder_Revs'!H55","v":"Q3"},null,0,null,null,0,{"$f":"'8. Funding_Adder_Revs'!L55","v":3.3500000000000002E-2},0,0]
[null,{"$f":"'8. Funding_Adder_Revs'!B56","v":"2014 Q1"},{"$f":"'8. Funding_Adder_Revs'!C56","v":1.47E-2},{"$f":"'8. Funding_Adder_Revs'!D56","v":3.6999999999999998E-2},null,{"$f":"'8. Funding_Adder_Revs'!F56","v":"2008-09-01"},{"$f":"'8. Funding_Adder_Revs'!G56","v":2008},{"$f":"'8. Funding_Adder_Revs'!H56","v":"Q3"},null,0,null,null,0,{"$f":"'8. Funding_Adder_Revs'!L56","v":3.3500000000000002E-2},0,0]
[null,{"$f":"'8. Funding_Adder_Revs'!B57","v":"2014 Q2"},{"$f":"'8. Funding_Adder_Revs'!C57","v":1.47E-2},{"$f":"'8. Funding_Adder_Revs'!D57","v":3.1699999999999999E-2},null,{"$f":"'8. Funding_Adder_Revs'!F57","v":"2008-10-01"},{"$f":"'8. Funding_Adder_Revs'!G57","v":2008},{"$f":"'8. Funding_Adder_Revs'!H57","v":"Q4"},null,0,null,null,0,{"$f":"'8. Funding_Adder_Revs'!L57","v":3.3500000000000002E-2},0,0]
[null,{"$f":"'8. Funding_Adder_Revs'!B58","v":"2014 Q3"},{"$f":"'8. Funding_Adder_Revs'!C58","v":1.47E-2},{"$f":"'8. Funding_Adder_Revs'!D58","v":3.1699999999999999E-2},null,{"$f":"'8. Funding_Adder_Revs'!F58","v":"2008-11-01"},{"$f":"'8. Funding_Adder_Revs'!G58","v":2008},{"$f":"'8. Funding_Adder_Revs'!H58","v":"Q4"},null,0,null,null,0,{"$f":"'8. Funding_Adder_Revs'!L58","v":3.3500000000000002E-2},0,0]
[null,{"$f":"'8. Funding_Adder_Revs'!B59","v":"2014 Q4"},{"$f":"'8. Funding_Adder_Revs'!C59","v":1.47E-2},{"$f":"'8. Funding_Adder_Revs'!D59","v":3.1699999999999999E-2},null,{"$f":"'8. Funding_Adder_Revs'!F59","v":"2008-12-01"},{"$f":"'8. Funding_Adder_Revs'!G59","v":2008},{"$f":"'8. Funding_Adder_Revs'!H59","v":"Q4"},null,0,null,null,0,{"$f":"'8. Funding_Adder_Revs'!L59","v":3.3500000000000002E-2},0,0]
[null,{"$f":"'8. Funding_Adder_Revs'!B60","v":"2015 Q1"},{"$f":"'8. Funding_Adder_Revs'!C60","v":1.47E-2},{"$f":"'8. Funding_Adder_Revs'!D60","v":2.8899999999999999E-2},null,{"$f":"'8. Funding_Adder_Revs'!F60","v":"2009-01-01"},{"$f":"'8. Funding_Adder_Revs'!G60","v":2009},{"$f":"'8. Funding_Adder_Revs'!H60","v":"Q1"},null,0,null,null,0,{"$f":"'8. Funding_Adder_Revs'!L60","v":2.4500000000000001E-2},0,0]
[null,{"$f":"'8. Funding_Adder_Revs'!B61","v":"2015 Q2"},{"$f":"'8. Funding_Adder_Revs'!C61","v":1.0999999999999999E-2},{"$f":"'8. Funding_Adder_Revs'!D61","v":2.2800000000000001E-2},null,{"$f":"'8. Funding_Adder_Revs'!F61","v":"2009-02-01"},{"$f":"'8. Funding_Adder_Revs'!G61","v":2009},{"$f":"'8. Funding_Adder_Revs'!H61","v":"Q1"},null,0,null,null,0,{"$f":"'8. Funding_Adder_Revs'!L61","v":2.4500000000000001E-2},0,0]
[null,{"$f":"'8. Funding_Adder_Revs'!B62","v":"2015 Q3"},{"$f":"'8. Funding_Adder_Revs'!C62","v":1.0999999999999999E-2},{"$f":"'8. Funding_Adder_Revs'!D62","v":2.5499999999999998E-2},null,{"$f":"'8. Funding_Adder_Revs'!F62","v":"2009-03-01"},{"$f":"'8. Funding_Adder_Revs'!G62","v":2009},{"$f":"'8. Funding_Adder_Revs'!H62","v":"Q1"},null,0,null,null,0,{"$f":"'8. Funding_Adder_Revs'!L62","v":2.4500000000000001E-2},0,0]
[null,{"$f":"'8. Funding_Adder_Revs'!B63","v":"2015 Q4"},{"$f":"'8. Funding_Adder_Revs'!C63","v":1.0999999999999999E-2},{"$f":"'8. Funding_Adder_Revs'!D63","v":2.5499999999999998E-2},null,{"$f":"'8. Funding_Adder_Revs'!F63","v":"2009-04-01"},{"$f":"'8. Funding_Adder_Revs'!G63","v":2009},{"$f":"'8. Funding_Adder_Revs'!H63","v":"Q2"},null,0,null,null,0,{"$f":"'8. Funding_Adder_Revs'!L63","v":0.01},0,0]
[null,{"$f":"'8. Funding_Adder_Revs'!B64","v":"2016 Q1"},{"$f":"'8. Funding_Adder_Revs'!C64","v":1.0999999999999999E-2},{"$f":"'8. Funding_Adder_Revs'!D64","v":2.5499999999999998E-2},null,{"$f":"'8. Funding_Adder_Revs'!F64","v":"2009-05-01"},{"$f":"'8. Funding_Adder_Revs'!G64","v":2009},{"$f":"'8. Funding_Adder_Revs'!H64","v":"Q2"},null,0,null,null,0,{"$f":"'8. Funding_Adder_Revs'!L64","v":0.01},0,0]
[null,{"$f":"'8. Funding_Adder_Revs'!B65","v":"2016 Q2"},{"$f":"'8. Funding_Adder_Revs'!C65","v":1.0999999999999999E-2},{"$f":"'8. Funding_Adder_Revs'!D65","v":2.5499999999999998E-2},null,{"$f":"'8. Funding_Adder_Revs'!F65","v":"2009-06-01"},{"$f":"'8. Funding_Adder_Revs'!G65","v":2009},{"$f":"'8. Funding_Adder_Revs'!H65","v":"Q2"},null,0,null,null,0,{"$f":"'8. Funding_Adder_Revs'!L65","v":0.01},0,0]
[null,{"$f":"'8. Funding_Adder_Revs'!B66","v":"2016 Q3"},{"$f":"'8. Funding_Adder_Revs'!C66","v":1.0999999999999999E-2},{"$f":"'8. Funding_Adder_Revs'!D66","v":2.5499999999999998E-2},null,{"$f":"'8. Funding_Adder_Revs'!F66","v":"2009-07-01"},{"$f":"'8. Funding_Adder_Revs'!G66","v":2009},{"$f":"'8. Funding_Adder_Revs'!H66","v":"Q3"},null,0,null,null,0,{"$f":"'8. Funding_Adder_Revs'!L66","v":5.4999999999999997E-3},0,0]
[null,{"$f":"'8. Funding_Adder_Revs'!B67","v":"2016 Q4"},{"$f":"'8. Funding_Adder_Revs'!C67","v":1.0999999999999999E-2},{"$f":"'8. Funding_Adder_Revs'!D67","v":2.5499999999999998E-2},null,{"$f":"'8. Funding_Adder_Revs'!F67","v":"2009-08-01"},{"$f":"'8. Funding_Adder_Revs'!G67","v":2009},{"$f":"'8. Funding_Adder_Revs'!H67","v":"Q3"},null,0,null,null,0,{"$f":"'8. Funding_Adder_Revs'!L67","v":5.4999999999999997E-3},0,0]
[null,null,null,null,null,{"$f":"'8. Funding_Adder_Revs'!F68","v":"2009-09-01"},{"$f":"'8. Funding_Adder_Revs'!G68","v":2009},{"$f":"'8. Funding_Adder_Revs'!H68","v":"Q3"},null,0,null,null,0,{"$f":"'8. Funding_Adder_Revs'!L68","v":5.4999999999999997E-3},0,0]
[null,null,null,null,null,{"$f":"'8. Funding_Adder_Revs'!F69","v":"2009-10-01"},{"$f":"'8. Funding_Adder_Revs'!G69","v":2009},{"$f":"'8. Funding_Adder_Revs'!H69","v":"Q4"},null,0,null,null,0,{"$f":"'8. Funding_Adder_Revs'!L69","v":5.4999999999999997E-3},0,0]
[null,null,null,null,null,{"$f":"'8. Funding_Adder_Revs'!F70","v":"2009-11-01"},{"$f":"'8. Funding_Adder_Revs'!G70","v":2009},{"$f":"'8. Funding_Adder_Revs'!H70","v":"Q4"},null,0,null,null,0,{"$f":"'8. Funding_Adder_Revs'!L70","v":5.4999999999999997E-3},0,0]
[null,null,null,null,null,{"$f":"'8. Funding_Adder_Revs'!F71","v":"2009-12-01"},{"$f":"'8. Funding_Adder_Revs'!G71","v":2009},{"$f":"'8. Funding_Adder_Revs'!H71","v":"Q4"},null,0,null,null,0,{"$f":"'8. Funding_Adder_Revs'!L71","v":5.4999999999999997E-3},0,0]
[null,null,null,null,null,{"$f":"'8. Funding_Adder_Revs'!F72","v":"2010-01-01"},{"$f":"'8. Funding_Adder_Revs'!G72","v":2010},{"$f":"'8. Funding_Adder_Revs'!H72","v":"Q1"},null,0,null,null,0,{"$f":"'8. Funding_Adder_Revs'!L72","v":5.4999999999999997E-3},0,0]
[null,null,null,null,null,{"$f":"'8. Funding_Adder_Revs'!F73","v":"2010-02-01"},{"$f":"'8. Funding_Adder_Revs'!G73","v":2010},{"$f":"'8. Funding_Adder_Revs'!H73","v":"Q1"},null,0,null,null,0,{"$f":"'8. Funding_Adder_Revs'!L73","v":5.4999999999999997E-3},0,0]
[null,null,null,null,null,{"$f":"'8. Funding_Adder_Revs'!F74","v":"2010-03-01"},{"$f":"'8. Funding_Adder_Revs'!G74","v":2010},{"$f":"'8. Funding_Adder_Revs'!H74","v":"Q1"},null,0,null,null,0,{"$f":"'8. Funding_Adder_Revs'!L74","v":5.4999999999999997E-3},0,0]
[null,null,null,null,null,{"$f":"'8. Funding_Adder_Revs'!F75","v":"2010-04-01"},{"$f":"'8. Funding_Adder_Revs'!G75","v":2010},{"$f":"'8. Funding_Adder_Revs'!H75","v":"Q2"},null,0,null,null,0,{"$f":"'8. Funding_Adder_Revs'!L75","v":5.4999999999999997E-3},0,0]
[null,null,null,null,null,{"$f":"'8. Funding_Adder_Revs'!F76","v":"2010-05-01"},{"$f":"'8. Funding_Adder_Revs'!G76","v":2010},{"$f":"'8. Funding_Adder_Revs'!H76","v":"Q2"},null,0,null,null,0,{"$f":"'8. Funding_Adder_Revs'!L76","v":5.4999999999999997E-3},0,0]
[null,null,null,null,null,{"$f":"'8. Funding_Adder_Revs'!F77","v":"2010-06-01"},{"$f":"'8. Funding_Adder_Revs'!G77","v":2010},{"$f":"'8. Funding_Adder_Revs'!H77","v":"Q2"},null,0,null,null,0,{"$f":"'8. Funding_Adder_Revs'!L77","v":5.4999999999999997E-3},0,0]
[null,null,null,null,null,{"$f":"'8. Funding_Adder_Revs'!F78","v":"2010-07-01"},{"$f":"'8. Funding_Adder_Revs'!G78","v":2010},{"$f":"'8. Funding_Adder_Revs'!H78","v":"Q3"},null,0,null,null,0,{"$f":"'8. Funding_Adder_Revs'!L78","v":8.8999999999999999E-3},0,0]
[null,null,null,null,null,{"$f":"'8. Funding_Adder_Revs'!F79","v":"2010-08-01"},{"$f":"'8. Funding_Adder_Revs'!G79","v":2010},{"$f":"'8. Funding_Adder_Revs'!H79","v":"Q3"},null,0,null,null,0,{"$f":"'8. Funding_Adder_Revs'!L79","v":8.8999999999999999E-3},0,0]
[null,null,null,null,null,{"$f":"'8. Funding_Adder_Revs'!F80","v":"2010-09-01"},{"$f":"'8. Funding_Adder_Revs'!G80","v":2010},{"$f":"'8. Funding_Adder_Revs'!H80","v":"Q3"},null,0,null,null,0,{"$f":"'8. Funding_Adder_Revs'!L80","v":8.8999999999999999E-3},0,0]
[null,null,null,null,null,{"$f":"'8. Funding_Adder_Revs'!F81","v":"2010-10-01"},{"$f":"'8. Funding_Adder_Revs'!G81","v":2010},{"$f":"'8. Funding_Adder_Revs'!H81","v":"Q4"},null,0,null,null,0,{"$f":"'8. Funding_Adder_Revs'!L81","v":1.2E-2},0,0]
[null,null,null,null,null,{"$f":"'8. Funding_Adder_Revs'!F82","v":"2010-11-01"},{"$f":"'8. Funding_Adder_Revs'!G82","v":2010},{"$f":"'8. Funding_Adder_Revs'!H82","v":"Q4"},null,0,null,null,0,{"$f":"'8. Funding_Adder_Revs'!L82","v":1.2E-2},0,0]
[null,null,null,null,null,{"$f":"'8. Funding_Adder_Revs'!F83","v":"2010-12-01"},{"$f":"'8. Funding_Adder_Revs'!G83","v":2010},{"$f":"'8. Funding_Adder_Revs'!H83","v":"Q4"},null,0,null,null,0,{"$f":"'8. Funding_Adder_Revs'!L83","v":1.2E-2},0,0]
[null,null,null,null,null,{"$f":"'8. Funding_Adder_Revs'!F84","v":"2011-01-01"},{"$f":"'8. Funding_Adder_Revs'!G84","v":2011},{"$f":"'8. Funding_Adder_Revs'!H84","v":"Q1"},null,0,null,null,0,{"$f":"'8. Funding_Adder_Revs'!L84","v":1.47E-2},0,0]
[null,null,null,null,null,{"$f":"'8. Funding_Adder_Revs'!F85","v":"2011-02-01"},{"$f":"'8. Funding_Adder_Revs'!G85","v":2011},{"$f":"'8. Funding_Adder_Revs'!H85","v":"Q1"},null,0,null,null,0,{"$f":"'8. Funding_Adder_Revs'!L85","v":1.47E-2},0,0]
[null,null,null,null,null,{"$f":"'8. Funding_Adder_Revs'!F86","v":"2011-03-01"},{"$f":"'8. Funding_Adder_Revs'!G86","v":2011},{"$f":"'8. Funding_Adder_Revs'!H86","v":"Q1"},null,0,null,null,0,{"$f":"'8. Funding_Adder_Revs'!L86","v":1.47E-2},0,0]
[null,null,null,null,null,{"$f":"'8. Funding_Adder_Revs'!F87","v":"2011-04-01"},{"$f":"'8. Funding_Adder_Revs'!G87","v":2011},{"$f":"'8. Funding_Adder_Revs'!H87","v":"Q2"},null,0,null,null,0,{"$f":"'8. Funding_Adder_Revs'!L87","v":1.47E-2},0,0]
[null,null,null,null,null,{"$f":"'8. Funding_Adder_Revs'!F88","v":"2011-05-01"},{"$f":"'8. Funding_Adder_Revs'!G88","v":2011},{"$f":"'8. Funding_Adder_Revs'!H88","v":"Q2"},null,0,null,null,0,{"$f":"'8. Funding_Adder_Revs'!L88","v":1.47E-2},0,0]
[null,null,null,null,null,{"$f":"'8. Funding_Adder_Revs'!F89","v":"2011-06-01"},{"$f":"'8. Funding_Adder_Revs'!G89","v":2011},{"$f":"'8. Funding_Adder_Revs'!H89","v":"Q2"},null,0,null,null,{"$f":"J90+K90+L90","v":0},{"$f":"'8. Funding_Adder_Revs'!L89","v":1.47E-2},{"$f":"J90*N90/12","v":0},0]
[null,null,null,null,null,{"$f":"'8. Funding_Adder_Revs'!F90","v":"2011-07-01"},{"$f":"'8. Funding_Adder_Revs'!G90","v":2011},{"$f":"'8. Funding_Adder_Revs'!H90","v":"Q3"},null,{"$f":"M90","v":0},null,null,0,{"$f":"'8. Funding_Adder_Revs'!L90","v":1.47E-2},0,{"$f":"O91+P90","v":0}]
[null,null,null,null,null,{"$f":"'8. Funding_Adder_Revs'!F91","v":"2011-08-01"},{"$f":"'8. Funding_Adder_Revs'!G91","v":2011},{"$f":"'8. Funding_Adder_Revs'!H91","v":"Q3"},null,0,null,null,0,{"$f":"'8. Funding_Adder_Revs'!L91","v":1.47E-2},0,0]
[null,null,null,null,null,{"$f":"'8. Funding_Adder_Revs'!F92","v":"2011-09-01"},{"$f":"'8. Funding_Adder_Revs'!G92","v":2011},{"$f":"'8. Funding_Adder_Revs'!H92","v":"Q3"},null,0,null,null,0,{"$f":"'8. Funding_Adder_Revs'!L92","v":1.47E-2},0,0]
[null,null,null,null,null,{"$f":"'8. Funding_Adder_Revs'!F93","v":"2011-10-01"},{"$f":"'8. Funding_Adder_Revs'!G93","v":2011},{"$f":"'8. Funding_Adder_Revs'!H93","v":"Q4"},null,0,null,null,0,{"$f":"'8. Funding_Adder_Revs'!L93","v":1.47E-2},0,0]
[null,null,null,null,null,{"$f":"'8. Funding_Adder_Revs'!F94","v":"2011-11-01"},{"$f":"'8. Funding_Adder_Revs'!G94","v":2011},{"$f":"'8. Funding_Adder_Revs'!H94","v":"Q4"},null,0,null,null,0,{"$f":"'8. Funding_Adder_Revs'!L94","v":1.47E-2},0,0]
[null,null,null,null,null,{"$f":"'8. Funding_Adder_Revs'!F95","v":"2011-12-01"},{"$f":"'8. Funding_Adder_Revs'!G95","v":2011},{"$f":"'8. Funding_Adder_Revs'!H95","v":"Q4"},null,0,null,null,0,{"$f":"'8. Funding_Adder_Revs'!L95","v":1.47E-2},0,0]
[null,null,null,null,null,{"$f":"'8. Funding_Adder_Revs'!F96","v":"2012-01-01"},{"$f":"'8. Funding_Adder_Revs'!G96","v":2012},{"$f":"'8. Funding_Adder_Revs'!H96","v":"Q1"},null,0,null,null,0,{"$f":"'8. Funding_Adder_Revs'!L96","v":1.47E-2},0,0]
[null,null,null,null,null,{"$f":"'8. Funding_Adder_Revs'!F97","v":"2012-02-01"},{"$f":"'8. Funding_Adder_Revs'!G97","v":2012},{"$f":"'8. Funding_Adder_Revs'!H97","v":"Q1"},null,0,null,null,0,{"$f":"'8. Funding_Adder_Revs'!L97","v":1.47E-2},0,0]
[null,null,null,null,null,{"$f":"'8. Funding_Adder_Revs'!F98","v":"2012-03-01"},{"$f":"'8. Funding_Adder_Revs'!G98","v":2012},{"$f":"'8. Funding_Adder_Revs'!H98","v":"Q1"},null,0,null,null,0,{"$f":"'8. Funding_Adder_Revs'!L98","v":1.47E-2},0,0]
[null,null,null,null,null,{"$f":"'8. Funding_Adder_Revs'!F99","v":"2012-04-01"},{"$f":"'8. Funding_Adder_Revs'!G99","v":2012},{"$f":"'8. Funding_Adder_Revs'!H99","v":"Q2"},null,0,null,null,0,{"$f":"'8. Funding_Adder_Revs'!L99","v":1.47E-2},0,0]
[null,null,null,null,null,{"$f":"'8. Funding_Adder_Revs'!F100","v":"2012-05-01"},{"$f":"'8. Funding_Adder_Revs'!G100","v":2012},{"$f":"'8. Funding_Adder_Revs'!H100","v":"Q2"},null,0,null,null,0,{"$f":"'8. Funding_Adder_Revs'!L100","v":1.47E-2},0,0]
[null,null,null,null,null,{"$f":"'8. Funding_Adder_Revs'!F101","v":"2012-06-01"},{"$f":"'8. Funding_Adder_Revs'!G101","v":2012},{"$f":"'8. Funding_Adder_Revs'!H101","v":"Q2"},null,0,null,null,0,{"$f":"'8. Funding_Adder_Revs'!L101","v":1.47E-2},0,0]
[null,null,null,null,null,{"$f":"'8. Funding_Adder_Revs'!F102","v":"2012-07-01"},{"$f":"'8. Funding_Adder_Revs'!G102","v":2012},{"$f":"'8. Funding_Adder_Revs'!H102","v":"Q3"},null,0,null,null,0,{"$f":"'8. Funding_Adder_Revs'!L102","v":1.47E-2},0,0]
[null,null,null,null,null,{"$f":"'8. Funding_Adder_Revs'!F103","v":"2012-08-01"},{"$f":"'8. Funding_Adder_Revs'!G103","v":2012},{"$f":"'8. Funding_Adder_Revs'!H103","v":"Q3"},null,0,null,null,0,{"$f":"'8. Funding_Adder_Revs'!L103","v":1.47E-2},0,0]
[null,null,null,null,null,{"$f":"'8. Funding_Adder_Revs'!F104","v":"2012-09-01"},{"$f":"'8. Funding_Adder_Revs'!G104","v":2012},{"$f":"'8. Funding_Adder_Revs'!H104","v":"Q3"},null,0,null,null,0,{"$f":"'8. Funding_Adder_Revs'!L104","v":1.47E-2},0,0]
[null,null,null,null,null,{"$f":"'8. Funding_Adder_Revs'!F105","v":"2012-10-01"},{"$f":"'8. Funding_Adder_Revs'!G105","v":2012},{"$f":"'8. Funding_Adder_Revs'!H105","v":"Q4"},null,0,null,null,0,{"$f":"'8. Funding_Adder_Revs'!L105","v":1.47E-2},0,0]
[null,null,null,null,null,{"$f":"'8. Funding_Adder_Revs'!F106","v":"2012-11-01"},{"$f":"'8. Funding_Adder_Revs'!G106","v":2012},{"$f":"'8. Funding_Adder_Revs'!H106","v":"Q4"},null,0,null,null,0,{"$f":"'8. Funding_Adder_Revs'!L106","v":1.47E-2},0,0]
[null,null,null,null,null,{"$f":"'8. Funding_Adder_Revs'!F107","v":"2012-12-01"},{"$f":"'8. Funding_Adder_Revs'!G107","v":2012},{"$f":"'8. Funding_Adder_Revs'!H107","v":"Q4"},null,0,null,null,0,{"$f":"'8. Funding_Adder_Revs'!L107","v":1.47E-2},0,0]
[null,null,null,null,null,{"$f":"'8. Funding_Adder_Revs'!F108","v":"2013-01-01"},{"$f":"'8. Funding_Adder_Revs'!G108","v":2013},{"$f":"'8. Funding_Adder_Revs'!H108","v":"Q1"},null,{"$f":"M108","v":0},null,null,{"$f":"J109+K109+L109","v":0},{"$f":"'8. Funding_Adder_Revs'!L108","v":1.47E-2},{"$f":"J109*N109/12","v":0},{"$f":"O109+P108","v":0}]
[null,null,null,null,null,{"$f":"'8. Funding_Adder_Revs'!F109","v":"2013-02-01"},{"$f":"'8. Funding_Adder_Revs'!G109","v":2013},{"$f":"'8. Funding_Adder_Revs'!H109","v":"Q1"},null,0,null,null,0,{"$f":"'8. Funding_Adder_Revs'!L109","v":1.47E-2},0,0]
[null,null,null,null,null,{"$f":"'8. Funding_Adder_Revs'!F110","v":"2013-03-01"},{"$f":"'8. Funding_Adder_Revs'!G110","v":2013},{"$f":"'8. Funding_Adder_Revs'!H110","v":"Q1"},null,0,null,null,0,{"$f":"'8. Funding_Adder_Revs'!L110","v":1.47E-2},0,0]
[null,null,null,null,null,{"$f":"'8. Funding_Adder_Revs'!F111","v":"2013-04-01"},{"$f":"'8. Funding_Adder_Revs'!G111","v":2013},{"$f":"'8. Funding_Adder_Revs'!H111","v":"Q2"},null,0,null,null,0,{"$f":"'8. Funding_Adder_Revs'!L111","v":1.47E-2},0,0]
[null,null,null,null,null,{"$f":"'8. Funding_Adder_Revs'!F112","v":"2013-05-01"},{"$f":"'8. Funding_Adder_Revs'!G112","v":2013},{"$f":"'8. Funding_Adder_Revs'!H112","v":"Q2"},null,0,null,null,0,{"$f":"'8. Funding_Adder_Revs'!L112","v":1.47E-2},0,0]
[null,null,null,null,null,{"$f":"'8. Funding_Adder_Revs'!F113","v":"2013-06-01"},{"$f":"'8. Funding_Adder_Revs'!G113","v":2013},{"$f":"'8. Funding_Adder_Revs'!H113","v":"Q2"},null,0,null,null,0,{"$f":"'8. Funding_Adder_Revs'!L113","v":1.47E-2},0,0]
[null,null,null,null,null,{"$f":"'8. Funding_Adder_Revs'!F114","v":"2013-07-01"},{"$f":"'8. Funding_Adder_Revs'!G114","v":2013},{"$f":"'8. Funding_Adder_Revs'!H114","v":"Q3"},null,0,null,null,0,{"$f":"'8. Funding_Adder_Revs'!L114","v":1.47E-2},0,0]
[null,null,null,null,null,{"$f":"'8. Funding_Adder_Revs'!F115","v":"2013-08-01"},{"$f":"'8. Funding_Adder_Revs'!G115","v":2013},{"$f":"'8. Funding_Adder_Revs'!H115","v":"Q3"},null,0,null,null,0,{"$f":"'8. Funding_Adder_Revs'!L115","v":1.47E-2},0,0]
[null,null,null,null,null,{"$f":"'8. Funding_Adder_Revs'!F116","v":"2013-09-01"},{"$f":"'8. Funding_Adder_Revs'!G116","v":2013},{"$f":"'8. Funding_Adder_Revs'!H116","v":"Q3"},null,0,null,null,0,{"$f":"'8. Funding_Adder_Revs'!L116","v":1.47E-2},0,0]
[null,null,null,null,null,{"$f":"'8. Funding_Adder_Revs'!F117","v":"2013-10-01"},{"$f":"'8. Funding_Adder_Revs'!G117","v":2013},{"$f":"'8. Funding_Adder_Revs'!H117","v":"Q4"},null,0,null,null,0,{"$f":"'8. Funding_Adder_Revs'!L117","v":1.47E-2},0,0]
[null,null,null,null,null,{"$f":"'8. Funding_Adder_Revs'!F118","v":"2013-11-01"},{"$f":"'8. Funding_Adder_Revs'!G118","v":2013},{"$f":"'8. Funding_Adder_Revs'!H118","v":"Q4"},null,0,null,null,0,{"$f":"'8. Funding_Adder_Revs'!L118","v":1.47E-2},0,0]
[null,null,null,null,null,{"$f":"'8. Funding_Adder_Revs'!F119","v":"2013-12-01"},{"$f":"'8. Funding_Adder_Revs'!G119","v":2013},{"$f":"'8. Funding_Adder_Revs'!H119","v":"Q4"},null,0,null,null,0,{"$f":"'8. Funding_Adder_Revs'!L119","v":1.47E-2},0,0]
[null,null,null,null,null,{"$f":"'8. Funding_Adder_Revs'!F120","v":"2014-01-01"},{"$f":"'8. Funding_Adder_Revs'!G120","v":2014},{"$f":"'8. Funding_Adder_Revs'!H120","v":"Q1"},null,{"$f":"M120","v":0},null,null,{"$f":"J121+K121+L121","v":0},{"$f":"'8. Funding_Adder_Revs'!L120","v":1.47E-2},{"$f":"J121*N121/12","v":0},{"$f":"O121+P120","v":0}]
[null,null,null,null,null,{"$f":"'8. Funding_Adder_Revs'!F121","v":"2014-02-01"},{"$f":"'8. Funding_Adder_Revs'!G121","v":2014},{"$f":"'8. Funding_Adder_Revs'!H121","v":"Q1"},null,0,null,null,0,{"$f":"'8. Funding_Adder_Revs'!L121","v":1.47E-2},0,0]
[null,null,null,null,null,{"$f":"'8. Funding_Adder_Revs'!F122","v":"2014-03-01"},{"$f":"'8. Funding_Adder_Revs'!G122","v":2014},{"$f":"'8. Funding_Adder_Revs'!H122","v":"Q1"},null,0,null,null,0,{"$f":"'8. Funding_Adder_Revs'!L122","v":1.47E-2},0,0]
[null,null,null,null,null,{"$f":"'8. Funding_Adder_Revs'!F123","v":"2014-04-01"},{"$f":"'8. Funding_Adder_Revs'!G123","v":2014},{"$f":"'8. Funding_Adder_Revs'!H123","v":"Q2"},null,0,null,null,0,{"$f":"'8. Funding_Adder_Revs'!L123","v":1.47E-2},0,0]
[null,null,null,null,null,{"$f":"'8. Funding_Adder_Revs'!F124","v":"2014-05-01"},{"$f":"'8. Funding_Adder_Revs'!G124","v":2014},{"$f":"'8. Funding_Adder_Revs'!H124","v":"Q2"},null,0,null,null,0,{"$f":"'8. Funding_Adder_Revs'!L124","v":1.47E-2},0,0]
[null,null,null,null,null,{"$f":"'8. Funding_Adder_Revs'!F125","v":"2014-06-01"},{"$f":"'8. Funding_Adder_Revs'!G125","v":2014},{"$f":"'8. Funding_Adder_Revs'!H125","v":"Q2"},null,0,null,null,0,{"$f":"'8. Funding_Adder_Revs'!L125","v":1.47E-2},0,0]
[null,null,null,null,null,{"$f":"'8. Funding_Adder_Revs'!F126","v":"2014-07-01"},{"$f":"'8. Funding_Adder_Revs'!G126","v":2014},{"$f":"'8. Funding_Adder_Revs'!H126","v":"Q3"},null,0,null,null,0,{"$f":"'8. Funding_Adder_Revs'!L126","v":1.47E-2},0,0]
[null,null,null,null,null,{"$f":"'8. Funding_Adder_Revs'!F127","v":"2014-08-01"},{"$f":"'8. Funding_Adder_Revs'!G127","v":2014},{"$f":"'8. Funding_Adder_Revs'!H127","v":"Q3"},null,0,null,null,0,{"$f":"'8. Funding_Adder_Revs'!L127","v":1.47E-2},0,0]
[null,null,null,null,null,{"$f":"'8. Funding_Adder_Revs'!F128","v":"2014-09-01"},{"$f":"'8. Funding_Adder_Revs'!G128","v":2014},{"$f":"'8. Funding_Adder_Revs'!H128","v":"Q3"},null,0,null,null,0,{"$f":"'8. Funding_Adder_Revs'!L128","v":1.47E-2},0,0]
[null,null,null,null,null,{"$f":"'8. Funding_Adder_Revs'!F129","v":"2014-10-01"},{"$f":"'8. Funding_Adder_Revs'!G129","v":2014},{"$f":"'8. Funding_Adder_Revs'!H129","v":"Q4"},null,0,null,null,0,{"$f":"'8. Funding_Adder_Revs'!L129","v":1.47E-2},0,0]
[null,null,null,null,null,{"$f":"'8. Funding_Adder_Revs'!F130","v":"2014-11-01"},{"$f":"'8. Funding_Adder_Revs'!G130","v":2014},{"$f":"'8. Funding_Adder_Revs'!H130","v":"Q4"},null,0,null,null,0,{"$f":"'8. Funding_Adder_Revs'!L130","v":1.47E-2},0,0]
[null,null,null,null,null,{"$f":"'8. Funding_Adder_Revs'!F131","v":"2014-12-01"},{"$f":"'8. Funding_Adder_Revs'!G131","v":2014},{"$f":"'8. Funding_Adder_Revs'!H131","v":"Q4"},null,0,null,null,0,{"$f":"'8. Funding_Adder_Revs'!L131","v":1.47E-2},0,0]
[null,null,null,null,null,{"$f":"'8. Funding_Adder_Revs'!F132","v":"2015-01-01"},{"$f":"'8. Funding_Adder_Revs'!G132","v":2015},{"$f":"'8. Funding_Adder_Revs'!H132","v":"Q1"},null,{"$f":"M132","v":0},null,null,{"$f":"J133+K133+L133","v":0},{"$f":"'8. Funding_Adder_Revs'!L132","v":1.47E-2},{"$f":"J133*N133/12","v":0},{"$f":"O133+P132","v":0}]
[null,null,null,null,null,{"$f":"'8. Funding_Adder_Revs'!F133","v":"2015-02-01"},{"$f":"'8. Funding_Adder_Revs'!G133","v":2015},{"$f":"'8. Funding_Adder_Revs'!H133","v":"Q1"},null,0,null,null,0,{"$f":"'8. Funding_Adder_Revs'!L133","v":1.47E-2},0,0]
[null,null,null,null,null,{"$f":"'8. Funding_Adder_Revs'!F134","v":"2015-03-01"},{"$f":"'8. Funding_Adder_Revs'!G134","v":2015},{"$f":"'8. Funding_Adder_Revs'!H134","v":"Q1"},null,0,null,null,0,{"$f":"'8. Funding_Adder_Revs'!L134","v":1.47E-2},0,0]
[null,null,null,null,null,{"$f":"'8. Funding_Adder_Revs'!F135","v":"2015-04-01"},{"$f":"'8. Funding_Adder_Revs'!G135","v":2015},{"$f":"'8. Funding_Adder_Revs'!H135","v":"Q2"},null,0,null,null,0,{"$f":"'8. Funding_Adder_Revs'!L135","v":1.0999999999999999E-2},0,0]
[null,null,null,null,null,{"$f":"'8. Funding_Adder_Revs'!F136","v":"2015-05-01"},{"$f":"'8. Funding_Adder_Revs'!G136","v":2015},{"$f":"'8. Funding_Adder_Revs'!H136","v":"Q2"},null,0,null,null,0,{"$f":"'8. Funding_Adder_Revs'!L136","v":1.0999999999999999E-2},0,0]
[null,null,null,null,null,{"$f":"'8. Funding_Adder_Revs'!F137","v":"2015-06-01"},{"$f":"'8. Funding_Adder_Revs'!G137","v":2015},{"$f":"'8. Funding_Adder_Revs'!H137","v":"Q2"},null,0,null,null,0,{"$f":"'8. Funding_Adder_Revs'!L137","v":1.0999999999999999E-2},0,0]
[null,null,null,null,null,{"$f":"'8. Funding_Adder_Revs'!F138","v":"2015-07-01"},{"$f":"'8. Funding_Adder_Revs'!G138","v":2015},{"$f":"'8. Funding_Adder_Revs'!H138","v":"Q3"},null,0,null,null,0,{"$f":"'8. Funding_Adder_Revs'!L138","v":1.0999999999999999E-2},0,0]
[null,null,null,null,null,{"$f":"'8. Funding_Adder_Revs'!F139","v":"2015-08-01"},{"$f":"'8. Funding_Adder_Revs'!G139","v":2015},{"$f":"'8. Funding_Adder_Revs'!H139","v":"Q3"},null,0,null,null,0,{"$f":"'8. Funding_Adder_Revs'!L139","v":1.0999999999999999E-2},0,0]
[null,null,null,null,null,{"$f":"'8. Funding_Adder_Revs'!F140","v":"2015-09-01"},{"$f":"'8. Funding_Adder_Revs'!G140","v":2015},{"$f":"'8. Funding_Adder_Revs'!H140","v":"Q3"},null,0,null,null,0,{"$f":"'8. Funding_Adder_Revs'!L140","v":1.0999999999999999E-2},0,0]
[null,null,null,null,null,{"$f":"'8. Funding_Adder_Revs'!F141","v":"2015-10-01"},{"$f":"'8. Funding_Adder_Revs'!G141","v":2015},{"$f":"'8. Funding_Adder_Revs'!H141","v":"Q4"},null,0,null,null,0,{"$f":"'8. Funding_Adder_Revs'!L141","v":1.0999999999999999E-2},0,0]
[null,null,null,null,null,{"$f":"'8. Funding_Adder_Revs'!F142","v":"2015-11-01"},{"$f":"'8. Funding_Adder_Revs'!G142","v":2015},{"$f":"'8. Funding_Adder_Revs'!H142","v":"Q4"},null,0,null,null,0,{"$f":"'8. Funding_Adder_Revs'!L142","v":1.0999999999999999E-2},0,0]
[null,null,null,null,null,{"$f":"'8. Funding_Adder_Revs'!F143","v":"2015-12-01"},{"$f":"'8. Funding_Adder_Revs'!G143","v":2015},{"$f":"'8. Funding_Adder_Revs'!H143","v":"Q4"},null,0,null,null,0,{"$f":"'8. Funding_Adder_Revs'!L143","v":1.0999999999999999E-2},0,0]
[null,null,null,null,null,{"$f":"'8. Funding_Adder_Revs'!F144","v":"2016-01-01"},{"$f":"'8. Funding_Adder_Revs'!G144","v":2016},{"$f":"'8. Funding_Adder_Revs'!H144","v":"Q1"},null,{"$f":"M144","v":0},null,null,{"$f":"J145+K145+L145","v":0},{"$f":"'8. Funding_Adder_Revs'!L144","v":1.0999999999999999E-2},{"$f":"J145*N145/12","v":0},{"$f":"O145+P144","v":0}]
[null,null,null,null,null,{"$f":"'8. Funding_Adder_Revs'!F145","v":"2016-02-01"},{"$f":"'8. Funding_Adder_Revs'!G145","v":2016},{"$f":"'8. Funding_Adder_Revs'!H145","v":"Q1"},null,0,null,null,0,{"$f":"'8. Funding_Adder_Revs'!L145","v":1.0999999999999999E-2},0,0]
[null,null,null,null,null,{"$f":"'8. Funding_Adder_Revs'!F146","v":"2016-03-01"},{"$f":"'8. Funding_Adder_Revs'!G146","v":2016},{"$f":"'8. Funding_Adder_Revs'!H146","v":"Q1"},null,0,null,null,0,{"$f":"'8. Funding_Adder_Revs'!L146","v":1.0999999999999999E-2},0,0]
[null,null,null,null,null,{"$f":"'8. Funding_Adder_Revs'!F147","v":"2016-04-01"},{"$f":"'8. Funding_Adder_Revs'!G147","v":2016},{"$f":"'8. Funding_Adder_Revs'!H147","v":"Q2"},null,0,null,null,0,{"$f":"'8. Funding_Adder_Revs'!L147","v":1.0999999999999999E-2},0,0]
[null,null,null,null,null,{"$f":"'8. Funding_Adder_Revs'!F148","v":"2016-05-01"},{"$f":"'8. Funding_Adder_Revs'!G148","v":2016},{"$f":"'8. Funding_Adder_Revs'!H148","v":"Q2"},null,0,null,null,0,{"$f":"'8. Funding_Adder_Revs'!L148","v":1.0999999999999999E-2},0,0]
[null,null,null,null,null,{"$f":"'8. Funding_Adder_Revs'!F149","v":"2016-06-01"},{"$f":"'8. Funding_Adder_Revs'!G149","v":2016},{"$f":"'8. Funding_Adder_Revs'!H149","v":"Q2"},null,0,null,null,0,{"$f":"'8. Funding_Adder_Revs'!L149","v":1.0999999999999999E-2},0,0]
[null,null,null,null,null,{"$f":"'8. Funding_Adder_Revs'!F150","v":"2016-07-01"},{"$f":"'8. Funding_Adder_Revs'!G150","v":2016},{"$f":"'8. Funding_Adder_Revs'!H150","v":"Q3"},null,0,null,null,0,{"$f":"'8. Funding_Adder_Revs'!L150","v":1.0999999999999999E-2},0,0]
[null,null,null,null,null,{"$f":"'8. Funding_Adder_Revs'!F151","v":"2016-08-01"},{"$f":"'8. Funding_Adder_Revs'!G151","v":2016},{"$f":"'8. Funding_Adder_Revs'!H151","v":"Q3"},null,0,null,null,0,{"$f":"'8. Funding_Adder_Revs'!L151","v":1.0999999999999999E-2},0,0]
[null,null,null,null,null,{"$f":"'8. Funding_Adder_Revs'!F152","v":"2016-09-01"},{"$f":"'8. Funding_Adder_Revs'!G152","v":2016},{"$f":"'8. Funding_Adder_Revs'!H152","v":"Q3"},null,0,null,null,0,{"$f":"'8. Funding_Adder_Revs'!L152","v":1.0999999999999999E-2},0,0]
[null,null,null,null,null,{"$f":"'8. Funding_Adder_Revs'!F153","v":"2016-10-01"},{"$f":"'8. Funding_Adder_Revs'!G153","v":2016},{"$f":"'8. Funding_Adder_Revs'!H153","v":"Q4"},null,0,null,null,0,{"$f":"'8. Funding_Adder_Revs'!L153","v":1.0999999999999999E-2},0,0]
[null,null,null,null,null,{"$f":"'8. Funding_Adder_Revs'!F154","v":"2016-11-01"},{"$f":"'8. Funding_Adder_Revs'!G154","v":2016},{"$f":"'8. Funding_Adder_Revs'!H154","v":"Q4"},null,0,null,null,0,{"$f":"'8. Funding_Adder_Revs'!L154","v":1.0999999999999999E-2},0,0]
[null,null,null,null,null,{"$f":"'8. Funding_Adder_Revs'!F155","v":"2016-12-01"},{"$f":"'8. Funding_Adder_Revs'!G155","v":2016},{"$f":"'8. Funding_Adder_Revs'!H155","v":"Q4"},null,0,null,null,0,{"$f":"'8. Funding_Adder_Revs'!L155","v":1.0999999999999999E-2},0,0]
[]
[null,null,null,null,null,null,null,null,null,null,{"$f":"SUM(K25:K156)","v":0},{"$f":"SUM(L25:L156)","v":0},{"$f":"K158+L158","v":0},null,{"$f":"SUM(O25:O156)","v":0},{"$f":"P156","v":0}]

{"sheet":"8B. Opex_Interest_annual","index":9,"n_rows":39,"n_cols":14,"rows_kept":39,"cut":false,"hidden":false,"merged":[]}
[]
[]
[]
[]
[]
[]
[]
[]
[]
[]
[]
[]
[null,"This worksheet calculates the interest on OM&A and amortization/depreciation expense, in the absence of monthly data."]
[]
[]
[]
[]
[]
[]
[]
[null,"Year",null,"OM&A",null,"Amortization Expense",null,"Cumulative OM&A and Amortization Expense",null,"Average Cumulative OM&A and Amortization Expense",null,"Average Annual Prescribed Interest Rate for Deferral and Variance Accounts (from Sheets 8A and 8B)",null,"Simple Interest on OM&A and Amortization Expenses"]
[null,null,null,"(from Sheet 5)",null,"(from Sheet 5)"]
[null,2006,null,{"$f":"'5. SM_Rev_Reqt'!G50","v":0},null,{"$f":"'5. SM_Rev_Reqt'!G58","v":0},null,{"$f":"D23+F23","v":0},null,{"$f":"H23/2","v":0},null,{"$f":"AVERAGE('8A. Opex_Interest_monthly'!$C$26:$C$28,'8A. Opex_Interest_monthly'!$C$26)","v":4.3650000000000001E-2},null,{"$f":"J23*L23","v":0}]
[null,2007,null,{"$f":"'5. SM_Rev_Reqt'!I50","v":0},null,{"$f":"'5. SM_Rev_Reqt'!I58","v":0},null,{"$f":"H23+D24+F24","v":0},null,{"$f":"(H24+H23)/2","v":0},null,{"$f":"AVERAGE('8A. Opex_Interest_monthly'!$C$29:$C$32)","v":4.7275000000000005E-2},null,0]
[null,2008,null,{"$f":"'5. SM_Rev_Reqt'!K50","v":0},null,{"$f":"'5. SM_Rev_Reqt'!K58","v":0},null,0,null,0,null,{"$f":"AVERAGE('8A. Opex_Interest_monthly'!$C$33:$C$36)","v":3.9800000000000002E-2},null,0]
[null,2009,null,{"$f":"'5. SM_Rev_Reqt'!M50","v":0},null,{"$f":"'5. SM_Rev_Reqt'!M58","v":0},null,0,null,0,null,{"$f":"AVERAGE('8A. Opex_Interest_monthly'!$C$37:$C$40)","v":1.1375E-2},null,0]
[null,2010,null,{"$f":"'5. SM_Rev_Reqt'!O50","v":0},null,{"$f":"'5. SM_Rev_Reqt'!O58","v":0},null,0,null,0,null,{"$f":"AVERAGE('8A. Opex_Interest_monthly'!$C$41:$C$44)","v":7.9749999999999995E-3},null,0]
[null,2011,null,{"$f":"'5. SM_Rev_Reqt'!Q50","v":0},null,{"$f":"'5. SM_Rev_Reqt'!Q58","v":3946.9989999999998},null,3946.9989999999998,null,1973.4994999999999,null,{"$f":"AVERAGE('8A. Opex_Interest_monthly'!$C$45:$C$48)","v":1.47E-2},null,29.010442649999998]
[null,2012,null,{"$f":"'5. SM_Rev_Reqt'!S50","v":0},null,{"$f":"'5. SM_Rev_Reqt'!S58","v":7893.9979999999996},null,11840.996999999999,null,7893.9979999999996,null,{"$f":"AVERAGE('8A. Opex_Interest_monthly'!N97:N108)","v":1.4699999999999998E-2},null,116.04177059999998]
[null,2013,null,{"$f":"'5. SM_Rev_Reqt'!U50","v":0},null,{"$f":"'5. SM_Rev_Reqt'!U58","v":7893.9979999999996},null,19734.994999999999,null,15787.995999999999,null,{"$f":"AVERAGE('8A. Opex_Interest_monthly'!N109:N120)","v":1.4699999999999998E-2},null,232.08354119999996]
[null,2014,null,{"$f":"'5. SM_Rev_Reqt'!W50","v":0},null,{"$f":"'5. SM_Rev_Reqt'!W58","v":7893.9979999999996},null,{"$f":"H30+D31+F31","v":27628.992999999999},null,{"$f":"(H31+H30)/2","v":23681.993999999999},null,{"$f":"AVERAGE('8A. Opex_Interest_monthly'!N121:N132)","v":1.4699999999999998E-2},null,{"$f":"J31*L31","v":348.12531179999991}]
[null,2015,null,{"$f":"'5. SM_Rev_Reqt'!Y50","v":0},null,{"$f":"'5. SM_Rev_Reqt'!Y58","v":7893.9979999999996},null,{"$f":"H31+D32+F32","v":35522.990999999995},null,{"$f":"(H32+H31)/2","v":31575.991999999998},null,{"$f":"AVERAGE('8A. Opex_Interest_monthly'!N133:N144)","v":1.1924999999999998E-2},null,{"$f":"J32*L32","v":376.5437045999999}]
[null,2016,null,{"$f":"'5. SM_Rev_Reqt'!AA50","v":0},null,{"$f":"'5. SM_Rev_Reqt'!AA58","v":3946.9990000000034},null,39469.99,null,37496.4905,null,{"$f":"AVERAGE('8A. Opex_Interest_monthly'!N145:N156)","v":1.0999999999999998E-2},null,412.46139549999992]
[]
[null,"Cumulative Interest to 2012",null,null,null,null,null,null,null,null,null,null,null,{"$f":"SUM(N23:N29)","v":145.05221324999997}]
[null,"Cumulative Interest to 2013",null,null,null,null,null,null,null,null,null,null,null,{"$f":"SUM(N23:N30)","v":377.13575444999992}]
[null,"Cumulative Interest to 2014",null,null,null,null,null,null,null,null,null,null,null,{"$f":"SUM(N23:N31)","v":725.26106624999989}]
[null,"Cumulative Interest to 2015",null,null,null,null,null,null,null,null,null,null,null,{"$f":"SUM(N23:N32)","v":1101.8047708499998}]
[null,"Cumulative Interest to 2016",null,null,null,null,null,null,null,null,null,null,null,{"$f":"SUM(N23:N33)","v":1514.2661663499998}]

{"sheet":"9. SMFA_SMDR_SMIRR","index":10,"n_rows":77,"n_cols":29,"rows_kept":77,"cut":false,"hidden":false,"merged":[[13,1,14,12],[19,1,19,3],[53,5,53,6],[27,2,27,3],[25,6,26,14],[50,3,50,4],[46,3,46,18]]}
[]
[]
[]
[]
[]
[]
[]
[]
[]
[]
[]
[]
[]
[null,"This worksheet calculates the Smart Meter Disposition Rider and the Smart Meter Incremental Revenue Requirement Rate Rider, if applicable.  This worksheet also calculates any new Smart Meter Funding Adder that a distributor may wish to request.  However, please note that in many 2011 IRM decisions, the Board noted that current funding adders will cease on April 30, 2011 and that the Board's expectation is that distributors will file for a final review of prudence at the earliest opportunity.  The Board also noted that the SMFA is a tool designed to provide advance funding and to mitigate the anticipated rate impact of smart meter costs when recovery of those costs is approved by the Board. The Board observed that the SMFA was not intended to be compensatory (return on and of capital) on a cumulative basis over the term the SMFA was in effect. The SMFA was initially designed to fund future investment, and not fully fund prior capital investment.  Distributors that seek a new SMFA should provide evidence to support its proposal.  This would include documentation of where the distributor is with respect to its smart meter deployment program, and reasons as to why the distributor's circumstances are such that continuation of the SMFA is warranted.  Press the \"UPDATE WORKSHEET\" button after choosing the applicable adders/riders.\n"]
[]
[]
[]
[]
[null,null," "]
[null,"Check if applicable"]
[]
[null,null,null,null,"Smart Meter Funding Adder (SMFA)"]
[]
[null,null,"X",null,"Smart Meter Disposition Rider (SMDR)",null,"The SMDR is calculated based on costs to December 31, 2015"]
[]
[null,null,null,null,"Smart Meter Incremental Revenue Requirement Rate Rider (SMIRR)",null,"The SMIRR is calculated based on the incremental revenue requirement associated with the recovery of capital related costs to December 31, 2016 and associated OM&A."]
[]
[null,null,null,null,null,null,2006,null,2007,null,2008,null,2009,null,2010,null,2011,null,2012,null,2013,null,2014,null,2015,null,2016,null,"Total"]
[]
[null,null,"Deferred and forecasted Smart Meter Incremental Revenue Requirement (from Sheet 5)",null,null,null,{"$f":"'5. SM_Rev_Reqt'!G70","v":0},null,{"$f":"'5. SM_Rev_Reqt'!I70","v":0},null,{"$f":"'5. SM_Rev_Reqt'!K70","v":0},null,{"$f":"'5. SM_Rev_Reqt'!M70","v":0},null,{"$f":"'5. SM_Rev_Reqt'!O70","v":0},null,{"$f":"'5. SM_Rev_Reqt'!Q70","v":3928.6229404071837},null,{"$f":"'5. SM_Rev_Reqt'!S70","v":8507.5896830510992},null,{"$f":"'5. SM_Rev_Reqt'!U70","v":9582.2864881241239},null,{"$f":"'5. SM_Rev_Reqt'!W70","v":9783.674002067155},null,{"$f":"'5. SM_Rev_Reqt'!Y70","v":9592.0723350016888},null,{"$f":"'5. SM_Rev_Reqt'!AA70","v":4676.9097460225112},null,{"$f":"SUM(G30:AA30)","v":46071.155194673767}]
[]
[null,null,"Interest on Deferred and forecasted OM&A and Amortization Expense (Sheet 8A/8B)",null,null,null,{"$f":"IF($C35=\"X\",G35,IF($C37=\"X\",G37,0))","v":0},null,{"$f":"IF($C35=\"X\",I35,IF($C37=\"X\",I37,0))","v":0},null,{"$f":"IF($C35=\"X\",K35,IF($C37=\"X\",K37,0))","v":0},null,{"$f":"IF($C35=\"X\",M35,IF($C37=\"X\",M37,0))","v":0},null,{"$f":"IF($C35=\"X\",O35,IF($C37=\"X\",O37,0))","v":0},null,{"$f":"IF($C35=\"X\",Q35,IF($C37=\"X\",Q37,0))","v":0},null,{"$f":"IF($C35=\"X\",S35,IF($C37=\"X\",S37,0))","v":0},null,{"$f":"IF($C35=\"X\",U35,IF($C37=\"X\",U37,0))","v":0},null,{"$f":"IF($C35=\"X\",W35,IF($C37=\"X\",W37,0))","v":0},null,{"$f":"IF($C35=\"X\",Y35,IF($C37=\"X\",Y37,0))","v":0},null,null,null,{"$f":"SUM(G32:Y32)","v":0}]
[null,null,"(Check one of the boxes below)"]
[]
[null,null,"X",null,"Sheet 8A (Interest calculated on monthly balances)",null,{"$f":"IF($C35=\"X\",SUM('8A. Opex_Interest_monthly'!O25:O36),\"\")","v":0},null,{"$f":"IF($C35=\"X\",SUM('8A. Opex_Interest_monthly'!O37:O48),\"\")","v":0},null,{"$f":"IF($C35=\"X\",SUM('8A. Opex_Interest_monthly'!O49:O60),\"\")","v":0},null,{"$f":"IF($C35=\"X\",SUM('8A. Opex_Interest_monthly'!O61:O72),\"\")","v":0},null,{"$f":"IF($C35=\"X\",SUM('8A. Opex_Interest_monthly'!O73:O84),\"\")","v":0},null,{"$f":"IF($C35=\"X\",SUM('8A. Opex_Interest_monthly'!O85:O96),\"\")","v":0},null,{"$f":"IF($C35=\"X\",SUM('8A. Opex_Interest_monthly'!O97:O108),\"\")","v":0},null,{"$f":"IF($C35=\"X\",SUM('8A. Opex_Interest_monthly'!O109:O120),\"\")","v":0},null,{"$f":"IF($C35=\"X\",SUM('8A. Opex_Interest_monthly'!O121:O132),\"\")","v":0},null,{"$f":"IF($C35=\"X\",SUM('8A. Opex_Interest_monthly'!O133:O144),\"\")","v":0},null,{"$f":"IF($C35=\"X\",SUM('8A. Opex_Interest_monthly'!O145:O156),\"\")","v":0},null,{"$f":"IF($C$35=\"X\",SUM(G35:Y35),\"\")","v":0}]
[]
[null,null,null,null,"Sheet 8B (Interest calculated on average annual balances)",null,{"$f":"IF($C37=\"X\",'8B. Opex_Interest_annual'!N23,\"\")","v":""},null,{"$f":"IF($C37=\"X\",'8B. Opex_Interest_annual'!N24,\"\")","v":""},null,{"$f":"IF($C37=\"X\",'8B. Opex_Interest_annual'!N25,\"\")","v":""},null,{"$f":"IF($C37=\"X\",'8B. Opex_Interest_annual'!N26,\"\")","v":""},null,{"$f":"IF($C37=\"X\",'8B. Opex_Interest_annual'!N27,\"\")","v":""},null,{"$f":"IF($C37=\"X\",'8B. Opex_Interest_annual'!N28,\"\")","v":""},null,{"$f":"IF($C37=\"X\",'8B. Opex_Interest_annual'!N29,\"\")","v":""},null,{"$f":"IF($C37=\"X\",'8B. Opex_Interest_annual'!N30,\"\")","v":""},null,{"$f":"IF($C37=\"X\",'8B. Opex_Interest_annual'!N31,\"\")","v":""},null,{"$f":"IF($C37=\"X\",'8B. Opex_Interest_annual'!N32,\"\")","v":""},null,{"$f":"IF($C37=\"X\",'8B. Opex_Interest_annual'!N33,\"\")","v":""},null,{"$f":"IF($C$37=\"X\",SUM(G37:Y37),\"\")","v":""}]
[]
[]
[null,null,"SMFA Revenues (from Sheet 8)",null,null,null,{"$f":"SUM('8. Funding_Adder_Revs'!K24:K35)","v":0},null,{"$f":"SUM('8. Funding_Adder_Revs'!K36:K47)","v":0},null,{"$f":"SUM('8. Funding_Adder_Revs'!K48:K59)","v":0},null,{"$f":"SUM('8. Funding_Adder_Revs'!K60:K71)","v":0},null,{"$f":"SUM('8. Funding_Adder_Revs'!K72:K83)","v":0},null,{"$f":"SUM('8. Funding_Adder_Revs'!K84:K95)","v":0},null,{"$f":"SUM('8. Funding_Adder_Revs'!K96:K107)","v":0},null,{"$f":"SUM('8. Funding_Adder_Revs'!K108:K119)","v":0},null,{"$f":"SUM('8. Funding_Adder_Revs'!K120:K131)","v":0},null,{"$f":"SUM('8. Funding_Adder_Revs'!K132:K143)","v":0},null,{"$f":"SUM('8. Funding_Adder_Revs'!K144:K155)","v":0},null,{"$f":"SUM(G40:AA40)","v":0}]
[]
[null,null,"SMFA Interest (from Sheet 8)",null,null,null,{"$f":"SUM('8. Funding_Adder_Revs'!M24:M35)","v":0},null,{"$f":"SUM('8. Funding_Adder_Revs'!M36:M47)","v":0},null,{"$f":"SUM('8. Funding_Adder_Revs'!M48:M59)","v":0},null,{"$f":"SUM('8. Funding_Adder_Revs'!M60:M71)","v":0},null,{"$f":"SUM('8. Funding_Adder_Revs'!M72:M83)","v":0},null,{"$f":"SUM('8. Funding_Adder_Revs'!M84:M95)","v":0},null,{"$f":"SUM('8. Funding_Adder_Revs'!M96:M107)","v":0},null,{"$f":"SUM('8. Funding_Adder_Revs'!M108:M119)","v":0},null,{"$f":"SUM('8. Funding_Adder_Revs'!M120:M131)","v":0},null,{"$f":"SUM('8. Funding_Adder_Revs'!M132:M143)","v":0},null,{"$f":"SUM('8. Funding_Adder_Revs'!M144:M155)","v":0},null,{"$f":"SUM(G42:AA42)","v":0}]
[]
[null,null,"Net Deferred Revenue Requirement",null,null,null,{"$f":"(G30+G32)-(G40+G42)","v":0},null,{"$f":"(I30+I32)-(I40+I42)","v":0},null,{"$f":"(K30+K32)-(K40+K42)","v":0},null,{"$f":"(M30+M32)-(M40+M42)","v":0},null,{"$f":"(O30+O32)-(O40+O42)","v":0},null,{"$f":"(Q30+Q32)-(Q40+Q42)","v":3928.6229404071837},null,{"$f":"(S30+S32)-(S40+S42)","v":8507.5896830510992},null,{"$f":"(U30+U32)-(U40+U42)","v":9582.2864881241239},null,{"$f":"(W30+W32)-(W40+W42)","v":9783.674002067155},null,{"$f":"(Y30+Y32)-(Y40+Y42)","v":9592.0723350016888},null,{"$f":"(AA30+AA32)-(AA40+AA42)","v":4676.9097460225112},null,{"$f":"(AC30+AC32)-(AC40+AC42)","v":46071.155194673767}]
[]
[null,null,"Number of Metered Customers (average for 2016 test year)",null,null,null,null,null,null,null,null,null,null,null,null,null,null,null,null,null,null,null,null,null,null,null,5806]
[null,null,null,"- Number of metered customers for which smart meter were deployed as part of program).  Residential and GS < 50 kW customer classes and any other metered classes involved (e.g. GS 50 to 4999 kW for which interval meters were upgraded to utilize AMI and ODS assets)"]
[]
[null,null,"Calculation of Smart Meter Funding Adder (per metered customer per month)"]
[]
[null,null,null,"Net Deferred Revenues ",null,"May 1, 2006 to December 31, 2015",{"$f":"AC44","v":46071.155194673767}]
[]
[null,null,null,"SMFA",null,"XXX 1, 2016 to XXX 30/31, 201X",{"$f":"IF(AA46=0,\"\",ROUND(U44/(AA46*12),2))","v":0.14000000000000001}]
[]
[null,null,null,"Check:  Forecasted SMFA Revenues for 2016 test year",null,null,{"$f":"IF(AA46=0,\"\",G53*AA46*12)","v":9754.08}]
[]
[null,null,"Calculation of Smart Meter Disposition Rider (per metered customer per month)"]
[]
[null,null,null,"Years for collection or refunding",null,null,1]
[]
[null,null,null,"Deferred Incremental Revenue Requirement from 2006 to December 31, 2015",null,null,{"$f":"SUM(G30:Y30)+SUM(G32:Y32)","v":41394.245448651258}]
[null,null,null,null,"plus Interest on OM&A and Amortization"]
[null,null,null,"SMFA Revenues collected from 2006 to 2015 test year (inclusive) ",null,null,{"$f":"AC40+SUM(G42:AA42)","v":0}]
[null,null,null,null,"Plus Simple Interest on SMFA Revenues"]
[null,null,null,"Net Deferred Revenue Requirement",null,null,{"$f":"G61-G63","v":41394.245448651258}]
[]
[null,null,null,"SMDR",null,"May 1, 2016 - April 30, 2017",{"$f":"IF(AA46=0,\"\",ROUND(G65/(AA46*12*G59),2))","v":0.59}]
[]
[null,null,null,"Check:  Forecasted SMDR Revenues",null,null,{"$f":"IF(ISERROR(G67*AA46*12*G59), \"\", G67*AA46*12*G59)","v":41106.479999999996},null,{"$f":"IF(ISERROR(G69/G65), \"Error\", IF(G69/G65>=95%, \"Match\", \"Error\"))","v":"Match"}]
[]
[null,null,"Calculation of Smart Meter Incremental Revenue Requirement Rate Rider (per metered customer per month)"]
[]
[null,null,null,"Incremental Revenue Requirement for 2016",null,null,{"$f":"AA30","v":4676.9097460225112}]
[]
[null,null,null,"SMIRR",null,null,{"$f":"IF(ISERROR(ROUND(G73/(AA46*12),2)), \"\", ROUND(G73/(AA46*12),2))","v":7.0000000000000007E-2}]
[]
[null,null,null,"Check:  Forecasted SMIRR Revenues",null,null,{"$f":"IF(ISERROR(G75*AA46*12), \"\", G75*AA46*12)","v":4877.04},null,{"$f":"IF(ISERROR(G77/G73), \"Error\", IF(G77/G73>=95%, \"Match\", \"Error\"))","v":"Match"}]

{"sheet":"10A. Cost_Alloc_SMDR","index":11,"n_rows":65,"n_cols":34,"rows_kept":65,"cut":false,"hidden":false,"merged":[[12,1,12,14],[47,14,47,23],[48,14,49,23],[27,1,28,1],[25,1,26,1],[31,23,32,23],[41,1,43,1],[43,23,44,23]]}
[]
[]
[]
[]
[]
[]
[]
[]
[]
[]
[]
[]
[null,"This worksheet calculates the class-specific SMDRs according to accepted practice.  A distributor may choose to use its own methodology, but should provide analogous support for its allocation and derivation of class-specific SMDRs and SMIRRs."]
[]
[]
[]
[]
[]
[]
[null,"Class-specific SMDRs"]
[]
[null,"Revenue Requirement for Historical Years",2006,null,2007,null,2008,null,2009,null,2010,null,2011,null,2012,null,2013,null,2014,null,2015,null,"Total 2006 to 2015","Explanation / Allocator",null,"Residential",null,"GS < 50 kW",null,"GS 50 to 4999 kW",null,"Other (please specify)",null,"Total"]
[null,null,null,null,null,null,null,null,null,null,null,null,null,null,null,null,null,null,null,null,null,null,null,"Check Row if SMDR/SMIRR apply to class",null,"X",null,"X",null,null,null,null,null,{"$f":"COUNTIF(Z23:AF23,\"X\")","v":2}]
[null,null,null,null,null,null,null,null,null,null,null,null,null,null,null,null,null,null,null,null,null,null,null,null,null,"%",null,"%",null,"%",null,"%"]
[null,null,null,null,null,null,null,null,null,null,null,null,null,null,null,null,null,null,null,null,null,null,null,"Weighted Meter Cost - Capital",null,0.87,null,0.13,null,null,null,null,null,{"$f":"Z25+AB25+AD25+AF25","v":1}]
[null,"Return on Capital",{"$f":"'5. SM_Rev_Reqt'!G47","v":0},null,{"$f":"'5. SM_Rev_Reqt'!I47","v":0},null,{"$f":"'5. SM_Rev_Reqt'!K47","v":0},null,{"$f":"'5. SM_Rev_Reqt'!M47","v":0},null,{"$f":"'5. SM_Rev_Reqt'!O47","v":0},null,{"$f":"'5. SM_Rev_Reqt'!Q47","v":1136.9488499459999},null,{"$f":"'5. SM_Rev_Reqt'!S47","v":1841.2592455039999},null,{"$f":"'5. SM_Rev_Reqt'!U47","v":1380.944434128},null,{"$f":"'5. SM_Rev_Reqt'!W47","v":920.62962275199993},null,{"$f":"'5. SM_Rev_Reqt'!Y47","v":460.31481137600008},null,{"$f":"SUM(C26,E26,G26,I26,K26,M26,O26,Q26,S26,U26)","v":5740.0969637059989},"Allocated per class",null,{"$f":"W26*Z25","v":4993.8843584242186},null,{"$f":"W26*AB25","v":746.21260528177993},null,{"$f":"W26*AD25","v":0},null,{"$f":"W26*AF25","v":0}]
[]
[null,"Depreciation/Amortization expense and related interest",{"$f":"'5. SM_Rev_Reqt'!G58","v":0},null,{"$f":"'5. SM_Rev_Reqt'!I58","v":0},null,{"$f":"'5. SM_Rev_Reqt'!K58","v":0},null,{"$f":"'5. SM_Rev_Reqt'!M58","v":0},null,{"$f":"'5. SM_Rev_Reqt'!O58","v":0},null,{"$f":"'5. SM_Rev_Reqt'!Q58","v":3946.9989999999998},null,{"$f":"'5. SM_Rev_Reqt'!S58","v":7893.9979999999996},null,{"$f":"'5. SM_Rev_Reqt'!U58","v":7893.9979999999996},null,{"$f":"'5. SM_Rev_Reqt'!W58","v":7893.9979999999996},null,{"$f":"'5. SM_Rev_Reqt'!Y58","v":7893.9979999999996}]
[null,null,{"$f":"IF(C28+C32=0,0,'9. SMFA_SMDR_SMIRR'!G32*C28/(C28+C32))","v":0},null,{"$f":"IF(E28+E32=0,0,'9. SMFA_SMDR_SMIRR'!I32*E28/(E28+E32))","v":0},null,{"$f":"IF(G28+G32=0,0,'9. SMFA_SMDR_SMIRR'!K32*G28/(G28+G32))","v":0},null,{"$f":"IF(I28+I32=0,0,'9. SMFA_SMDR_SMIRR'!M32*I28/(I28+I32))","v":0},null,{"$f":"IF(K28+K32=0,0,'9. SMFA_SMDR_SMIRR'!O32*K28/(K28+K32))","v":0},null,{"$f":"IF(M28+M32=0,0,'9. SMFA_SMDR_SMIRR'!Q32*M28/(M28+M32))","v":0},null,{"$f":"IF(O28+O32=0,0,'9. SMFA_SMDR_SMIRR'!S32*O28/(O28+O32))","v":0},null,{"$f":"IF(Q28+Q32=0,0,'9. SMFA_SMDR_SMIRR'!U32*Q28/(Q28+Q32))","v":0},null,{"$f":"IF(S28+S32=0,0,'9. SMFA_SMDR_SMIRR'!W32*S28/(S28+S32))","v":0},null,{"$f":"IF(U28+U32=0,0,'9. SMFA_SMDR_SMIRR'!Y32*U28/(U28+U32))","v":0},null,null,{"$f":"X25","v":"Weighted Meter Cost - Capital"},null,{"$f":"Z25","v":0.87},null,{"$f":"AB25","v":0.13},null,{"$f":"AD25","v":0},null,{"$f":"AF25","v":0},null,{"$f":"Z29+AB29+AD29+AF29","v":1}]
[null,null,{"$f":"C28+C29","v":0},null,{"$f":"E28+E29","v":0},null,{"$f":"G28+G29","v":0},null,{"$f":"I28+I29","v":0},null,{"$f":"K28+K29","v":0},null,{"$f":"M28+M29","v":3946.9989999999998},null,{"$f":"O28+O29","v":7893.9979999999996},null,{"$f":"Q28+Q29","v":7893.9979999999996},null,{"$f":"S28+S29","v":7893.9979999999996},null,{"$f":"U28+U29","v":7893.9979999999996},null,{"$f":"SUM(C30,E30,G30,I30,K30,M30,O30,Q30,S30,U30)","v":35522.990999999995},{"$f":"X26","v":"Allocated per class"},null,{"$f":"W30*Z29","v":30905.002169999996},null,{"$f":"W30*AB29","v":4617.9888299999993},null,{"$f":"W30*AD29","v":0},null,{"$f":"W30*AF29","v":0}]
[]
[null,"Operating Expenses and related interest",{"$f":"'5. SM_Rev_Reqt'!G50","v":0},null,{"$f":"'5. SM_Rev_Reqt'!I50","v":0},null,{"$f":"'5. SM_Rev_Reqt'!K50","v":0},null,{"$f":"'5. SM_Rev_Reqt'!M50","v":0},null,{"$f":"'5. SM_Rev_Reqt'!O50","v":0},null,{"$f":"'5. SM_Rev_Reqt'!Q50","v":0},null,{"$f":"'5. SM_Rev_Reqt'!S50","v":0},null,{"$f":"'5. SM_Rev_Reqt'!U50","v":0},null,{"$f":"'5. SM_Rev_Reqt'!W50","v":0},null,{"$f":"'5. SM_Rev_Reqt'!Y50","v":0},null,null,"Number of Smart Meters installed by Class",null,"#",null,"#",null,"#",null,"#"]
[null,null,{"$f":"'9. SMFA_SMDR_SMIRR'!G32","v":0},null,{"$f":"'9. SMFA_SMDR_SMIRR'!I32","v":0},null,{"$f":"IF((G28+G32)=0,0,'9. SMFA_SMDR_SMIRR'!K32*G32/(G28+G32))","v":0},null,{"$f":"IF((I28+I32)=0,0,'9. SMFA_SMDR_SMIRR'!M32*I32/(I28+I32))","v":0},null,{"$f":"IF((K28+K32)=0,0,'9. SMFA_SMDR_SMIRR'!O32*K32/(K28+K32))","v":0},null,{"$f":"IF((M28+M32)=0,0,'9. SMFA_SMDR_SMIRR'!Q32*M32/(M28+M32))","v":0},null,{"$f":"IF((O28+O32)=0,0,'9. SMFA_SMDR_SMIRR'!S32*O32/(O28+O32))","v":0},null,{"$f":"IF((Q28+Q32)=0,0,'9. SMFA_SMDR_SMIRR'!U32*Q32/(Q28+Q32))","v":0},null,{"$f":"IF((S28+S32)=0,0,'9. SMFA_SMDR_SMIRR'!W32*S32/(S28+S32))","v":0},null,{"$f":"IF((U28+U32)=0,0,'9. SMFA_SMDR_SMIRR'!Y32*U32/(U28+U32))","v":0},null,null,null,null,5064,null,742]
[null,null,{"$f":"C32+C33","v":0},null,{"$f":"E32+E33","v":0},null,{"$f":"G32+G33","v":0},null,{"$f":"I32+I33","v":0},null,{"$f":"K32+K33","v":0},null,{"$f":"M32+M33","v":0},null,{"$f":"O32+O33","v":0},null,{"$f":"Q32+Q33","v":0},null,{"$f":"S32+S33","v":0},null,{"$f":"U32+U33","v":0},null,{"$f":"SUM(C34,E34,G34,I34,K34,M34,O34,Q34,S34,U34)","v":0},"Allocated per class",null,{"$f":"IF(SUM($Z33,$AB33,$AD33,$AF33)=0,0,$W34*Z33/(SUM($Z33,$AB33,$AD33,$AF33)))","v":0},null,{"$f":"IF(SUM($Z33,$AB33,$AD33,$AF33)=0,0,$W34*AB33/(SUM($Z33,$AB33,$AD33,$AF33)))","v":0},null,{"$f":"IF(SUM($Z33,$AB33,$AD33,$AF33)=0,0,$W34*AD33/(SUM($Z33,$AB33,$AD33,$AF33)))","v":0},null,{"$f":"IF(SUM($Z33,$AB33,$AD33,$AF33)=0,0,$W34*AF33/(SUM($Z33,$AB33,$AD33,$AF33)))","v":0}]
[]
[null,"Revenue Requirement before Taxes/PILs",null,null,null,null,null,null,null,null,null,null,null,null,null,null,null,null,null,null,null,null,{"$f":"W26+W30+W34","v":41263.087963705992},null,null,{"$f":"Z26+Z30+Z34","v":35898.886528424213},null,{"$f":"AB26+AB30+AB34","v":5364.2014352817796},null,{"$f":"AD26+AD30+AD34","v":0},null,{"$f":"AF26+AF30+AF34","v":0},null,{"$f":"W36-SUM(Z36,AB36,AD36,AF36)","v":0}]
[]
[null,null,null,null,null,null,null,null,null,null,null,null,null,null,null,null,null,null,null,null,null,null,null,"Revenue Requirement before PILs",null,{"$f":"IF(Z36=0,0,Z36/SUM($Z36,$AB36,$AD36,$AF36))","v":0.87},null,{"$f":"IF(AB36=0,0,AB36/SUM($Z36,$AB36,$AD36,$AF36))","v":0.13},null,{"$f":"IF(AD36=0,0,AD36/SUM($Z36,$AB36,$AD36,$AF36))","v":0},null,{"$f":"IF(AF36=0,0,AF36/SUM($Z36,$AB36,$AD36,$AF36))","v":0},null,{"$f":"Z38+AB38+AD38+AF38","v":1}]
[]
[null,"Grossed-up Taxes/PILs",{"$f":"'5. SM_Rev_Reqt'!G68","v":0},null,{"$f":"'5. SM_Rev_Reqt'!I68","v":0},null,{"$f":"'5. SM_Rev_Reqt'!K68","v":0},null,{"$f":"'5. SM_Rev_Reqt'!M68","v":0},null,{"$f":"'5. SM_Rev_Reqt'!O68","v":0},null,{"$f":"'5. SM_Rev_Reqt'!Q68","v":-1155.3249095388164},null,{"$f":"'5. SM_Rev_Reqt'!S68","v":-1227.6675624528996},null,{"$f":"'5. SM_Rev_Reqt'!U68","v":307.34405399612427},null,{"$f":"'5. SM_Rev_Reqt'!W68","v":969.04637931515538},null,{"$f":"'5. SM_Rev_Reqt'!Y68","v":1237.7595236256898},null,{"$f":"SUM(C40,E40,G40,I40,K40,M40,O40,Q40,S40,U40)","v":131.15748494525315},null,null,{"$f":"W40*Z38","v":114.10701190237023},null,{"$f":"W40*AB38","v":17.05047304288291},null,{"$f":"W40*AD38","v":0},null,{"$f":"W40*AF38","v":0}]
[]
[null,"Total Revenue Requirement plus interest on OM&A and depreciation expense",null,null,null,null,null,null,null,null,null,null,null,null,null,null,null,null,null,null,null,null,{"$f":"W36+W40","v":41394.245448651243},null,null,{"$f":"Z36+Z40","v":36012.993540326584},null,{"$f":"AB36+AB40","v":5381.2519083246625},null,{"$f":"AD40+AD36","v":0},null,{"$f":"AF40+AF36","v":0}]
[null,null,null,null,null,null,null,null,null,null,null,null,null,null,null,null,null,null,null,null,null,null,null,"Percentage of costs allocated to each class",null,{"$f":"IF(SUM($Z42,$AB42,$AD42,$AF42)=0,0,Z42/(SUM($Z42,$AB42,$AD42,$AF42)))","v":0.87000000000000011},null,{"$f":"IF(SUM($Z42,$AB42,$AD42,$AF42)=0,0,AB42/(SUM($Z42,$AB42,$AD42,$AF42)))","v":0.13000000000000003},null,{"$f":"IF(SUM($Z42,$AB42,$AD42,$AF42)=0,0,AD42/(SUM($Z42,$AB42,$AD42,$AF42)))","v":0},null,{"$f":"IF(SUM($Z42,$AB42,$AD42,$AF42)=0,0,AF42/(SUM($Z42,$AB42,$AD42,$AF42)))","v":0}]
[null,null,null,null,null,null,null,null,null,null,null,null,null,null,null,null,null,null,null,null,null,null,{"$f":"W42-'9. SMFA_SMDR_SMIRR'!G61","v":0},"Percentage of costs for classes with SMDR/SMIRR",null,{"$f":"IF(Z23=\"X\",Z43,0)","v":0.87000000000000011},null,{"$f":"IF(AB23=\"X\",AB43,0)","v":0.13000000000000003},null,{"$f":"IF(AD23=\"X\",AD43,0)","v":0},null,{"$f":"IF(AF23=\"X\",AF43,0)","v":0}]
[null,null,null,null,null,null,null,null,null,null,null,null,null,null,null,null,null,null,null,null,null,null,null,null,null,{"$f":"IF(SUM($Z44,$AB44,$AD44,$AF44)=0,0,Z44/SUM($Z44,$AB44,$AD44,$AF44))","v":0.86999999999999988},null,{"$f":"IF(SUM($Z44,$AB44,$AD44,$AF44)=0,0,AB44/SUM($Z44,$AB44,$AD44,$AF44))","v":0.13},null,{"$f":"IF(SUM($Z44,$AB44,$AD44,$AF44)=0,0,AD44/SUM($Z44,$AB44,$AD44,$AF44))","v":0},null,{"$f":"IF(SUM($Z44,$AB44,$AD44,$AF44)=0,0,AF44/SUM($Z44,$AB44,$AD44,$AF44))","v":0}]
[]
[null,null,null,null,null,null,null,null,null,null,null,null,null,null,null,null,null,null,null,null,null,null,null,null,null,"%",null,"%",null,"%",null,"%"]
[null,null,null,null,null,null,null,null,null,null,null,null,null,null,"SMFA Revenues directly attributable to class",null,null,null,null,null,null,null,null,null,null,null,null,null,null,null,null,null,null,{"$f":"Z48+AB48+AD48+AF48","v":0}]
[null,null,null,null,null,null,null,null,null,null,null,null,null,null,"Residual SMFA Revenues (from other metered classes) attributed evenly",null,null,null,null,null,null,null,null,null,null,{"$f":"IF(Z23=\"X\",Z48,0)","v":0},null,{"$f":"IF(AB23=\"X\",AB48,0)","v":0},null,{"$f":"IF(AD23=\"X\",AD48,0)","v":0},null,{"$f":"IF(AF23=\"X\",AF48,0)","v":0},null,{"$f":"Z49+AB49+AD49+AF49","v":0}]
[null,null,null,null,null,null,null,null,null,null,null,null,null,null,null,null,null,null,null,null,null,null,null,null,null,{"$f":"IF(Z23=\"X\",(100%-$AH49)/$AH$23,0)","v":0.5},null,{"$f":"IF(AB23=\"X\",(100%-$AH49)/$AH$23,0)","v":0.5},null,{"$f":"IF(AD23=\"X\",(100%-$AH49)/$AH$23,0)","v":0},null,{"$f":"IF(AF23=\"X\",(100%-$AH49)/$AH$23,0)","v":0}]
[null,null,null,null,null,null,null,null,null,null,null,null,null,null,"Total",null,null,null,null,null,null,null,null,null,null,{"$f":"Z48+Z50","v":0.5},null,{"$f":"AB48+AB50","v":0.5},null,{"$f":"AD48+AD50","v":0},null,{"$f":"AF48+AF50","v":0}]
[]
[null,"SMFA Revenues plus interest expense",null,null,null,null,null,null,null,null,null,null,null,null,null,null,null,null,null,null,null,null,{"$f":"'9. SMFA_SMDR_SMIRR'!G63","v":0},null,null,{"$f":"W53*Z51","v":0},null,{"$f":"W53*AB51","v":0},null,{"$f":"W53*AD51","v":0},null,{"$f":"W53*AF51","v":0}]
[]
[null,"Net Deferred Revenue Requirement to be recovered via SMDR",null,null,null,null,null,null,null,null,null,null,null,null,null,null,null,null,null,null,null,null,{"$f":"W42-W53","v":41394.245448651243},null,null,{"$f":"IF(Z23=\"X\",Z42-Z53,0)","v":36012.993540326584},null,{"$f":"IF(AB23=\"X\",AB42-AB53,0)","v":5381.2519083246625},null,{"$f":"IF(AD23=\"X\",AD42-AD53,0)","v":0},null,{"$f":"IF(AF23=\"X\",AF42-AF53,0)","v":0}]
[]
[null,"Average number of metered customers by class (2015), for customer classes with smart meters deployed",null,null,null,null,null,null,null,null,null,null,null,null,null,null,null,null,null,null,null,null,"Average number of customers (2015), for applicable classes",null,null,5064,null,742,null,0,null,0]
[]
[null,"Number of Years for SMDR recovery",null,null,null,null,null,null,null,null,null,null,null,null,null,null,null,null,null,null,null,null,1,"years",null,{"$f":"W59","v":1},null,{"$f":"W59","v":1},null,{"$f":"W59","v":1},null,{"$f":"W59","v":1}]
[]
[null,"Smart Meter Disposition Rider ($/month per metered customer in the customer class)",null,null,null,null,null,null,null,null,null,null,null,null,null,null,null,null,null,null,null,null,null,null,null,{"$f":"IF(Z23=\"X\",IF(Z57*Z59=0,\"\",ROUND(Z55/(Z57*Z59*12),2)),\"\")","v":0.59},null,{"$f":"IF(AB23=\"X\",IF(AB57*AB59=0,\"\",ROUND(AB55/(AB57*AB59*12),2)),\"\")","v":0.6},null,{"$f":"IF(AD23=\"X\",IF(AD57*AD59=0,\"\",ROUND(AD55/(AD57*AD59*12),2)),\"\")","v":""},null,{"$f":"IF(AF23=\"X\",IF(AF57*AF59=0,\"\",ROUND(AF55/(AF57*AF59*12),2)),\"\")","v":""}]
[]
[null,"Estimated SMDR Revenues",null,null,null,null,null,null,null,null,null,null,null,null,null,null,null,null,null,null,null,null,{"$f":"Z63+AB63+AD63+AF63","v":41195.519999999997},null,null,{"$f":"IF(Z23=\"X\",IF(Z57=0,0,Z61*Z59*Z57*12),0)","v":35853.119999999995},null,{"$f":"IF(AB23=\"X\",IF(AB57=0,0,AB61*AB59*AB57*12),0)","v":5342.4},null,{"$f":"IF(AD23=\"X\",IF(AD57=0,0,AD61*AD59*AD57*12),0)","v":0},null,{"$f":"IF(AF23=\"X\",IF(AF57=0,0,AF61*AF59*AF57*12),0)","v":0}]
[]
[null,null,null,null,null,null,null,null,null,null,null,null,null,null,null,null,null,null,null,null,null,null,{"$f":"W55-W63","v":198.72544865124655}]

{"sheet":"10B. Cost_Alloc_SMIRR","index":12,"n_rows":56,"n_cols":28,"rows_kept":56,"cut":false,"hidden":false,"merged":[[12,1,12,17],[49,1,49,15],[27,1,28,1],[25,1,26,1],[31,17,32,17],[41,1,43,1],[43,17,44,17]]}
[]
[]
[]
[]
[]
[]
[]
[]
[]
[]
[]
[]
[null,"This worksheet calculates the class-specific SMIRRs according to accepted practice.  A distributor may choose to use its own methodology, but should provide analogous support for its allocation and derivation of class-specific SMDRs and SMIRRs."]
[]
[]
[]
[]
[]
[]
[null,"Class-specific SMDRs"]
[]
[null,"Revenue Requirement for 2016",2006,null,2007,null,2008,null,2009,null,2010,null,2011,null,2012,null,2016,"Explanation / Allocator",null,"Residential",null,"GS < 50 kW",null,"GS 50 to 4999 kW",null,{"$f":"'10A. Cost_Alloc_SMDR'!AF22","v":"Other (please specify)"},null,"Total"]
[null,null,null,null,null,null,null,null,null,null,null,null,null,null,null,null,null,"Check Row if SMDR/SMIRR apply to class",null,{"$f":"IF('10A. Cost_Alloc_SMDR'!Z23=\"X\",\"X\",\"\")","v":"X"},null,{"$f":"IF('10A. Cost_Alloc_SMDR'!AB23=\"X\",\"X\",\"\")","v":"X"},null,{"$f":"IF('10A. Cost_Alloc_SMDR'!AD23=\"X\",\"X\",\"\")","v":""},null,{"$f":"IF('10A. Cost_Alloc_SMDR'!AF23=\"X\",\"X\",\"\")","v":""},null,{"$f":"COUNTIF(T23:Z23,\"X\")","v":2}]
[null,null,null,null,null,null,null,null,null,null,null,null,null,null,null,null,null,null,null,"%",null,"%",null,"%",null,"%"]
[null,null,null,null,null,null,null,null,null,null,null,null,null,null,null,null,null,"Weighted Meter Cost - Capital",null,{"$f":"'10A. Cost_Alloc_SMDR'!Z25","v":0.87},null,{"$f":"'10A. Cost_Alloc_SMDR'!AB25","v":0.13},null,{"$f":"'10A. Cost_Alloc_SMDR'!AD25","v":0},null,{"$f":"'10A. Cost_Alloc_SMDR'!AF25","v":0},null,{"$f":"T25+V25+X25+Z25","v":1}]
[null,"Return on Capital",{"$f":"'5. SM_Rev_Reqt'!G47","v":0},null,{"$f":"'5. SM_Rev_Reqt'!I47","v":0},null,{"$f":"'5. SM_Rev_Reqt'!K47","v":0},null,{"$f":"'5. SM_Rev_Reqt'!M47","v":0},null,{"$f":"'5. SM_Rev_Reqt'!O47","v":0},null,{"$f":"'5. SM_Rev_Reqt'!Q47","v":1136.9488499459999},null,{"$f":"'5. SM_Rev_Reqt'!S47","v":1841.2592455039999},null,{"$f":"'5. SM_Rev_Reqt'!AA47","v":110.9817178820001},"Allocated per class",null,{"$f":"Q26*T25","v":96.554094557340079},null,{"$f":"Q26*V25","v":14.427623324660013},null,{"$f":"Q26*X25","v":0},null,{"$f":"Q26*Z25","v":0}]
[]
[null,"Depreciation/Amortization expense",{"$f":"'5. SM_Rev_Reqt'!G58","v":0},null,{"$f":"'5. SM_Rev_Reqt'!I58","v":0},null,{"$f":"'5. SM_Rev_Reqt'!K58","v":0},null,{"$f":"'5. SM_Rev_Reqt'!M58","v":0},null,{"$f":"'5. SM_Rev_Reqt'!O58","v":0},null,{"$f":"'5. SM_Rev_Reqt'!Q58","v":3946.9989999999998},null,{"$f":"'5. SM_Rev_Reqt'!S58","v":7893.9979999999996}]
[null,null,{"$f":"IF(C28+C32=0,0,'9. SMFA_SMDR_SMIRR'!G32*C28/(C28+C32))","v":0},null,{"$f":"IF(E28+E32=0,0,'9. SMFA_SMDR_SMIRR'!I32*E28/(E28+E32))","v":0},null,{"$f":"IF(G28+G32=0,0,'9. SMFA_SMDR_SMIRR'!K32*G28/(G28+G32))","v":0},null,{"$f":"IF(I28+I32=0,0,'9. SMFA_SMDR_SMIRR'!M32*I28/(I28+I32))","v":0},null,{"$f":"IF(K28+K32=0,0,'9. SMFA_SMDR_SMIRR'!O32*K28/(K28+K32))","v":0},null,{"$f":"IF(M28+M32=0,0,'9. SMFA_SMDR_SMIRR'!Q32*M28/(M28+M32))","v":0},null,{"$f":"IF(O28+O32=0,0,'9. SMFA_SMDR_SMIRR'!S32*O28/(O28+O32))","v":0},null,null,{"$f":"R25","v":"Weighted Meter Cost - Capital"},null,{"$f":"T25","v":0.87},null,{"$f":"V25","v":0.13},null,{"$f":"X25","v":0},null,{"$f":"Z25","v":0},null,{"$f":"T29+V29+X29+Z29","v":1}]
[null,null,{"$f":"C28+C29","v":0},null,{"$f":"E28+E29","v":0},null,{"$f":"G28+G29","v":0},null,{"$f":"I28+I29","v":0},null,{"$f":"K28+K29","v":0},null,{"$f":"M28+M29","v":3946.9989999999998},null,{"$f":"O28+O29","v":7893.9979999999996},null,{"$f":"'5. SM_Rev_Reqt'!AA58","v":3946.9990000000034},{"$f":"R26","v":"Allocated per class"},null,{"$f":"Q30*T29","v":3433.8891300000028},null,{"$f":"Q30*V29","v":513.10987000000046},null,{"$f":"Q30*X29","v":0},null,{"$f":"Q30*Z29","v":0}]
[]
[null,"Operating Expenses",{"$f":"'5. SM_Rev_Reqt'!G50","v":0},null,{"$f":"'5. SM_Rev_Reqt'!I50","v":0},null,{"$f":"'5. SM_Rev_Reqt'!K50","v":0},null,{"$f":"'5. SM_Rev_Reqt'!M50","v":0},null,{"$f":"'5. SM_Rev_Reqt'!O50","v":0},null,{"$f":"'5. SM_Rev_Reqt'!Q50","v":0},null,{"$f":"'5. SM_Rev_Reqt'!S50","v":0},null,{"$f":"'5. SM_Rev_Reqt'!AA50","v":0},"Number of Smart Meters installed by Class",null,"#",null,"#",null,"#",null,"#"]
[null,null,{"$f":"'9. SMFA_SMDR_SMIRR'!G32","v":0},null,{"$f":"'9. SMFA_SMDR_SMIRR'!I32","v":0},null,{"$f":"'9. SMFA_SMDR_SMIRR'!K32","v":0},null,{"$f":"'9. SMFA_SMDR_SMIRR'!M32","v":0},null,{"$f":"'9. SMFA_SMDR_SMIRR'!O32","v":0},null,{"$f":"'9. SMFA_SMDR_SMIRR'!Q32","v":0},null,{"$f":"'9. SMFA_SMDR_SMIRR'!S32","v":0},null,null,null,null,{"$f":"'10A. Cost_Alloc_SMDR'!Z33","v":5064},null,{"$f":"'10A. Cost_Alloc_SMDR'!AB33","v":742},null,{"$f":"'10A. Cost_Alloc_SMDR'!AD33","v":0},null,{"$f":"'10A. Cost_Alloc_SMDR'!AF33","v":0}]
[null,null,{"$f":"C32+C33","v":0},null,{"$f":"E32+E33","v":0},null,{"$f":"G32+G33","v":0},null,{"$f":"I32+I33","v":0},null,{"$f":"K32+K33","v":0},null,{"$f":"M32+M33","v":0},null,{"$f":"O32+O33","v":0},null,{"$f":"SUM(T34,V34,X34,Z34)","v":0},"Allocated per class",null,{"$f":"IF(SUM($T33,$V33,$X33,$Z33)=0,0,$Q32*T33/(SUM($T33,$V33,$X33,$Z33)))","v":0},null,{"$f":"IF(SUM($T33,$V33,$X33,$Z33)=0,0,$Q32*V33/(SUM($T33,$V33,$X33,$Z33)))","v":0},null,{"$f":"IF(SUM($T33,$V33,$X33,$Z33)=0,0,$Q32*X33/(SUM($T33,$V33,$X33,$Z33)))","v":0},null,{"$f":"IF(SUM($T33,$V33,$X33,$Z33)=0,0,$Q32*Z33/(SUM($T33,$V33,$X33,$Z33)))","v":0}]
[]
[null,"Revenue Requirement before Taxes/PILs",null,null,null,null,null,null,null,null,null,null,null,null,null,null,{"$f":"Q26+Q30+Q32","v":4057.9807178820033},null,null,{"$f":"T26+T30+T34","v":3530.443224557343},null,{"$f":"V26+V30+V34","v":527.53749332466043},null,{"$f":"X26+X30+X34","v":0},null,{"$f":"Z26+Z30+Z34","v":0},null,{"$f":"Q36-SUM(T36,V36,X36,Z36)","v":0}]
[]
[null,null,null,null,null,null,null,null,null,null,null,null,null,null,null,null,null,"Revenue Requirement before PILs",null,{"$f":"IF(T36=0,0,T36/SUM($T36,$V36,$X36,$Z36))","v":0.87},null,{"$f":"IF(V36=0,0,V36/SUM($T36,$V36,$X36,$Z36))","v":0.13},null,{"$f":"IF(X36=0,0,X36/SUM($T36,$V36,$X36,$Z36))","v":0},null,{"$f":"IF(Z36=0,0,Z36/SUM($T36,$V36,$X36,$Z36))","v":0},null,{"$f":"T38+V38+X38+Z38","v":1}]
[]
[null,"Grossed-up Taxes/PILs",{"$f":"'5. SM_Rev_Reqt'!G68","v":0},null,{"$f":"'5. SM_Rev_Reqt'!I68","v":0},null,{"$f":"'5. SM_Rev_Reqt'!K68","v":0},null,{"$f":"'5. SM_Rev_Reqt'!M68","v":0},null,{"$f":"'5. SM_Rev_Reqt'!O68","v":0},null,{"$f":"'5. SM_Rev_Reqt'!Q68","v":-1155.3249095388164},null,{"$f":"'5. SM_Rev_Reqt'!S68","v":-1227.6675624528996},null,{"$f":"'5. SM_Rev_Reqt'!AA68","v":618.92902814050785},null,null,{"$f":"Q40*T38","v":538.46825448224183},null,{"$f":"Q40*V38","v":80.460773658266021},null,{"$f":"Q40*X38","v":0},null,{"$f":"Q40*Z38","v":0}]
[]
[null,"Total Revenue Requirement for 2013",null,null,null,null,null,null,null,null,null,null,null,null,null,null,{"$f":"Q36+Q40","v":4676.9097460225112},null,null,{"$f":"T36+T40","v":4068.9114790395847},null,{"$f":"V36+V40","v":607.99826698292645},null,{"$f":"X40+X36","v":0},null,{"$f":"Z40+Z36","v":0}]
[null,null,null,null,null,null,null,null,null,null,null,null,null,null,null,null,null,"Percentage of costs allocated to each class",null,{"$f":"IF(SUM($T42,$V42,$X42,$Z42)=0,0,T42/(SUM($T42,$V42,$X42,$Z42)))","v":0.87},null,{"$f":"IF(SUM($T42,$V42,$X42,$Z42)=0,0,V42/(SUM($T42,$V42,$X42,$Z42)))","v":0.13},null,{"$f":"IF(SUM($T42,$V42,$X42,$Z42)=0,0,X42/(SUM($T42,$V42,$X42,$Z42)))","v":0},null,{"$f":"IF(SUM($T42,$V42,$X42,$Z42)=0,0,Z42/(SUM($T42,$V42,$X42,$Z42)))","v":0}]
[null,null,null,null,null,null,null,null,null,null,null,null,null,null,null,null,{"$f":"Q42-'9. SMFA_SMDR_SMIRR'!G73","v":0},"Percentage of costs for classes with SMDR/SMIRR",null,{"$f":"IF(T23=\"X\",T43,0)","v":0.87},null,{"$f":"IF(V23=\"X\",V43,0)","v":0.13},null,{"$f":"IF(X23=\"X\",X43,0)","v":0},null,{"$f":"IF(Z23=\"X\",Z43,0)","v":0}]
[null,null,null,null,null,null,null,null,null,null,null,null,null,null,null,null,null,null,null,{"$f":"IF(SUM($T44,$V44,$X44,$Z44)=0,0,T44/SUM($T44,$V44,$X44,$Z44))","v":0.87},null,{"$f":"IF(SUM($T44,$V44,$X44,$Z44)=0,0,V44/SUM($T44,$V44,$X44,$Z44))","v":0.13},null,{"$f":"IF(SUM($T44,$V44,$X44,$Z44)=0,0,X44/SUM($T44,$V44,$X44,$Z44))","v":0},null,{"$f":"IF(SUM($T44,$V44,$X44,$Z44)=0,0,Z44/SUM($T44,$V44,$X44,$Z44))","v":0}]
[]
[]
[null,"Average number of metered customers by class (2013)",null,null,null,null,null,null,null,null,null,null,null,null,null,null,null,null,null,{"$f":"'10A. Cost_Alloc_SMDR'!Z57","v":5064},null,{"$f":"'10A. Cost_Alloc_SMDR'!AB57","v":742},null,{"$f":"'10A. Cost_Alloc_SMDR'!AD57","v":0},null,{"$f":"'10A. Cost_Alloc_SMDR'!AF57","v":0}]
[]
[null,"The SMIRR is recovered as an annualized rate until the effective date of the distributor's next rebased rates resulting from a cost of service application",null,null,null,null,null,null,null,null,null,null,null,null,null,null,1,"year",null,{"$f":"Q50","v":1},null,{"$f":"Q50","v":1},null,{"$f":"Q50","v":1},null,{"$f":"Q50","v":1}]
[]
[null,"Smart Meter Incremental Revenue Requirement Rate Rider ($/month per metered customer in the customer class)",null,null,null,null,null,null,null,null,null,null,null,null,null,null,null,null,null,{"$f":"IF(T23=\"X\",IF(T48*T50=0,\"\",ROUND(T42/(T48*T50*12),2)),\"\")","v":7.0000000000000007E-2},null,{"$f":"IF(V23=\"X\",IF(V48*V50=0,\"\",ROUND(V42/(V48*V50*12),2)),\"\")","v":7.0000000000000007E-2},null,{"$f":"IF(X23=\"X\",IF(X48*X50=0,\"\",ROUND(X42/(X48*X50*12),2)),\"\")","v":""},null,{"$f":"IF(Z23=\"X\",IF(Z48*Z50=0,\"\",ROUND(Z42/(Z48*Z50*12),2)),\"\")","v":""}]
[]
[null,"Estimated SMIRR Revenues",null,null,null,null,null,null,null,null,null,null,null,null,null,null,{"$f":"T54+V54+X54+Z54","v":4877.04},null,null,{"$f":"IF(T23=\"X\",IF(T48=0,0,T52*T50*T48*12),0)","v":4253.76},null,{"$f":"IF(V23=\"X\",IF(V48=0,0,V52*V50*V48*12),0)","v":623.28000000000009},null,{"$f":"IF(X23=\"X\",IF(X48=0,0,X52*X50*X48*12),0)","v":0},null,{"$f":"IF(Z23=\"X\",IF(Z48=0,0,Z52*Z50*Z48*12),0)","v":0}]
[]
[null,null,null,null,null,null,null,null,null,null,null,null,null,null,null,null,{"$f":"Q54-Q42","v":200.13025397748879}]