{"text_format":"1","workbook":"xlsx","n_sheets":10,"sheets":["1. Info","2. Table of Contents","3. Rate Classes","4. RRR Data","5. UTRs and Sub-Transmission","6. Historical Wholesale","7. Current Wholesale","8. Forecast Wholesale","9. RTSR Rates to Forecast","hidden1"],"not_rendered":{"charts":0,"images":3,"macros":1,"external_links":2,"defined_names":20,"comments":0,"pivot_tables":0},"unopened":[],"bounds":{"document_bytes":16777216,"sheet_cells":100000,"rows_first":2000,"rows_last":500,"rows_between":2000,"halvings":0,"cell_chars":16384,"cell_head_chars":4096},"cells_cut":0,"cells_raw":0,"read":"whole","date_system":"1900"}

{"sheet":"1. Info","index":0,"n_rows":76,"n_cols":28,"rows_kept":76,"cut":false,"hidden":false,"merged":[[24,3,24,4],[20,3,20,4],[1,2,1,9],[2,2,2,9],[3,2,3,9],[4,2,4,9],[14,3,14,4],[16,3,16,4]]}
[null,null,null,null,null,null,null,null,null,null,null,null,null,null,null,null,null,null,null,null,null,null,null,null,null,null,null,"Algoma Power Inc."]
[null,null,null,null,null,null,null,null,null,null,null,null,null,null,null,null,null,null,null,null,null,null,null,null,null,null,null,"Atikokan Hydro Inc."]
[null,null,null,null,null,null,null,null,null,null,null,null,null,null,null,null,null,null,null,null,null,null,null,null,null,null,null,"Attawapiskat Power Corporation"]
[null,null,null,null,null,null,null,null,null,null,null,null,null,null,null,null,null,null,null,null,null,null,null,null,null,null,null,"Bluewater Power Distribution Corporation"]
[null,null,null,null,null,null,null,null,null,null,null,null,null,null,null,null,null,null,null,null,null,null,null,null,null,null,null,"Brant County Power Inc."]
[null,null,null,null,null,null,null,null,null,null,null,null,null,null,null,null,null,null,null,null,null,null,null,null,null,null,null,"Brantford Power Inc."]
[null,null,null,null,null,null,null,null,null,null,null,null,null,null,null,null,null,null,null,null,null,null,null,null,null,null,null,"Burlington Hydro Inc."]
[null,null,null,null,null,null,null,null,null,null,null,null,null,null,null,null,null,null,null,null,null,null,null,null,null,null,null,"Cambridge and North Dumfries Hydro Inc."]
[null,null,null,null,null,null,null,null,null,null,null,null,null,null,null,null,null,null,null,null,null,null,null,null,null,null,null,"Canadian Niagara Power Inc."]
[null,null,null,null,null,null,null,null,null,null,null,null,null,null,null,null,null,null,null,null,null,null,null,null,null,null,null,"Centre Wellington Hydro Ltd."]
[null,null,null,null,null,null,null,null,null,null,null,null,null,null,null,null,null,null,null,null,null,null,null,null,null,null,null,"Chapleau Public Utilities Corporation"]
[null,null,null,null,null,null,null,null,null,null,null,null,null,null,null,null,null,null,null,null,null,null,null,null,null,null,null,"COLLUS PowerStream Corp."]
["Drop-down lists are shaded blue; Input cells are shaded green.",null,null,null,null,null,null,null,null,null,null,null,null,null,null,null,null,null,null,null,null,null,null,null,null,null,null,"Cooperative Hydro Embrun Inc."]
[null,null,null,null,null,null,null,null,null,null,null,null,null,null,null,null,null,null,null,null,null,null,null,null,null,null,null,"E.L.K. Energy Inc."]
[null,null,"Utility Name   ","Innpower Corporation",null,null,null,null,null,null,null,null,null,null,null,null,null,null,null,null,null,null,null,null,null,null,null,"Enersource Hydro Mississauga Inc."]
[null,null,null,null,null,null,null,null,null,null,null,null,null,null,null,null,null,null,null,null,null,null,null,null,null,null,null,"Entegrus Powerlines Inc."]
[null,null,"Service Territory",null,null,null,null,null,null,null,null,null,null,null,null,null,null,null,null,null,null,null,null,null,null,null,null,"EnWin Utilities Ltd."]
[null,null,null,null,null,null,null,null,null,null,null,null,null,null,null,null,null,null,null,null,null,null,null,null,null,null,null,"Erie Thames Powerlines Corporation"]
[null,null,"Assigned EB Number","EB-2016-nnnn",null,null,null,null,null,null,null,null,null,null,null,null,null,null,null,null,null,null,null,null,null,null,null,"Espanola Regional Hydro Distribution Corporation"]
[null,null,null,null,null,null,null,null,null,null,null,null,null,null,null,null,null,null,null,null,null,null,null,null,null,null,null,"Essex Powerlines Corporation"]
[null,null,"Name and Title","Brenda L Pinke, Regulatory/CDM Manager",null,null,null,null,null,null,null,null,null,null,null,null,null,null,null,null,null,null,null,null,null,null,null,"Festival Hydro Inc."]
[null,null,null,null,null,null,null,null,null,null,null,null,null,null,null,null,null,null,null,null,null,null,null,null,null,null,null,"Fort Albany Power Corporation"]
[null,null,"Phone Number","705-431-6870 Ext 262",null,null,null,null,null,null,null,null,null,null,null,null,null,null,null,null,null,null,null,null,null,null,null,"Fort Frances Power Corporation"]
[null,null,null,null,null,null,null,null,null,null,null,null,null,null,null,null,null,null,null,null,null,null,null,null,null,null,null,"Greater Sudbury Hydro Inc."]
[null,null,"Email Address","brendap@innpower.ca",null,null,null,null,null,null,null,null,null,null,null,null,null,null,null,null,null,null,null,null,null,null,null,"Grimsby Power Inc."]
[null,null,null,null,null,null,null,null,null,null,null,null,null,null,null,null,null,null,null,null,null,null,null,null,null,null,null,"Guelph Hydro Electric Systems Inc."]
[null,null,"Date","2016-02-05",null,null,null,null,null,null,null,null,null,null,null,null,null,null,null,null,null,null,null,null,null,null,null,"Haldimand County Hydro Inc."]
[null,null,null,null,null,null,null,null,null,null,null,null,null,null,null,null,null,null,null,null,null,null,null,null,null,null,null,"Halton Hills Hydro Inc."]
[null,null,"Last COS Re-based Year",2013,null,null,null,null,null,null,null,null,null,null,null,null,null,null,null,null,null,null,null,null,null,null,null,"Hearst Power Distribution Company Limited"]
[null,null,null,null,null,null,null,null,null,null,null,null,null,null,null,null,null,null,null,null,null,null,null,null,null,null,null,"Horizon Utilities Corporation"]
[null,null,null,null,null,null,null,null,null,null,null,null,null,null,null,null,null,null,null,null,null,null,null,null,null,null,null,"Hydro 2000 Inc."]
[null,null,null,null,null,null,null,null,null,null,null,null,null,null,null,null,null,null,null,null,null,null,null,null,null,null,null,"Hydro Hawkesbury Inc."]
[null,null,null,null,null,null,null,null,null,null,null,null,null,null,null,null,null,null,null,null,null,null,null,null,null,null,null,"Hydro One Brampton Networks Inc."]
[null,null,null,null,null,null,null,null,null,null,null,null,null,null,null,null,null,null,null,null,null,null,null,null,null,null,null,"Hydro One Networks Inc."]
[null,null,null,null,null,null,null,null,null,null,null,null,null,null,null,null,null,null,null,null,null,null,null,null,null,null,null,"Hydro One Remote Communities Inc."]
[null,null,null,null,null,null,null,null,null,null,null,null,null,null,null,null,null,null,null,null,null,null,null,null,null,null,null,"Hydro Ottawa Limited"]
[null,null,null,null,null,null,null,null,null,null,null,null,null,null,null,null,null,null,null,null,null,null,null,null,null,null,null,"Innpower Corporation"]
[null,null,null,null,null,null,null,null,null,null,null,null,null,null,null,null,null,null,null,null,null,null,null,null,null,null,null,"Kashechewan Power Corporation"]
[null,null,null,null,null,null,null,null,null,null,null,null,null,null,null,null,null,null,null,null,null,null,null,null,null,null,null,"Kenora Hydro Electric Corporation Ltd."]
[null,null,null,null,null,null,null,null,null,null,null,null,null,null,null,null,null,null,null,null,null,null,null,null,null,null,null,"Kingston Hydro Corporation"]
[null,null,null,null,null,null,null,null,null,null,null,null,null,null,null,null,null,null,null,null,null,null,null,null,null,null,null,"Kitchener-Wilmot Hydro Inc."]
[null,null,null,null,null,null,null,null,null,null,null,null,null,null,null,null,null,null,null,null,null,null,null,null,null,null,null,"Lakefront Utilities Inc."]
[null,null,null,null,null,null,null,null,null,null,null,null,null,null,null,null,null,null,null,null,null,null,null,null,null,null,null,"Lakeland Power Distribution Ltd."]
[null,null,null,null,null,null,null,null,null,null,null,null,null,null,null,null,null,null,null,null,null,null,null,null,null,null,null,"London Hydro Inc."]
[null,null,null,null,null,null,null,null,null,null,null,null,null,null,null,null,null,null,null,null,null,null,null,null,null,null,null,"Midland Power Utility Corporation"]
[null,null,null,null,null,null,null,null,null,null,null,null,null,null,null,null,null,null,null,null,null,null,null,null,null,null,null,"Milton Hydro Distribution Inc."]
[null,null,null,null,null,null,null,null,null,null,null,null,null,null,null,null,null,null,null,null,null,null,null,null,null,null,null,"Newmarket-Tay Power Distribution Ltd."]
[null,null,null,null,null,null,null,null,null,null,null,null,null,null,null,null,null,null,null,null,null,null,null,null,null,null,null,"Niagara Peninsula Energy Inc."]
[null,null,null,null,null,null,null,null,null,null,null,null,null,null,null,null,null,null,null,null,null,null,null,null,null,null,null,"Niagara-on-the-Lake Hydro Inc."]
[null,null,null,null,null,null,null,null,null,null,null,null,null,null,null,null,null,null,null,null,null,null,null,null,null,null,null,"Norfolk Power Distribution Inc."]
[null,null,null,null,null,null,null,null,null,null,null,null,null,null,null,null,null,null,null,null,null,null,null,null,null,null,null,"North Bay Hydro Distribution Limited"]
[null,null,null,null,null,null,null,null,null,null,null,null,null,null,null,null,null,null,null,null,null,null,null,null,null,null,null,"Northern Ontario Wires Inc."]
[null,null,null,null,null,null,null,null,null,null,null,null,null,null,null,null,null,null,null,null,null,null,null,null,null,null,null,"Oakville Hydro Electricity Distribution Inc."]
[null,null,null,null,null,null,null,null,null,null,null,null,null,null,null,null,null,null,null,null,null,null,null,null,null,null,null,"Orangeville Hydro Limited"]
[null,null,null,null,null,null,null,null,null,null,null,null,null,null,null,null,null,null,null,null,null,null,null,null,null,null,null,"Orillia Power Distribution Corporation"]
[null,null,null,null,null,null,null,null,null,null,null,null,null,null,null,null,null,null,null,null,null,null,null,null,null,null,null,"Oshawa PUC Networks Inc."]
[null,null,null,null,null,null,null,null,null,null,null,null,null,null,null,null,null,null,null,null,null,null,null,null,null,null,null,"Ottawa River Power Corporation"]
[null,null,null,null,null,null,null,null,null,null,null,null,null,null,null,null,null,null,null,null,null,null,null,null,null,null,null,"Peterborough Distribution Incorporated"]
[null,null,null,null,null,null,null,null,null,null,null,null,null,null,null,null,null,null,null,null,null,null,null,null,null,null,null,"PowerStream Inc."]
[null,null,null,null,null,null,null,null,null,null,null,null,null,null,null,null,null,null,null,null,null,null,null,null,null,null,null,"PUC Distribution Inc."]
[null,null,null,null,null,null,null,null,null,null,null,null,null,null,null,null,null,null,null,null,null,null,null,null,null,null,null,"Renfrew Hydro Inc."]
[null,null,null,null,null,null,null,null,null,null,null,null,null,null,null,null,null,null,null,null,null,null,null,null,null,null,null,"Rideau St. Lawrence Distribution Inc."]
[null,null,null,null,null,null,null,null,null,null,null,null,null,null,null,null,null,null,null,null,null,null,null,null,null,null,null,"Sioux Lookout Hydro Inc."]
[null,null,null,null,null,null,null,null,null,null,null,null,null,null,null,null,null,null,null,null,null,null,null,null,null,null,null,"St. Thomas Energy Inc."]
[null,null,null,null,null,null,null,null,null,null,null,null,null,null,null,null,null,null,null,null,null,null,null,null,null,null,null,"Thunder Bay Hydro Electricity Distribution Inc."]
[null,null,null,null,null,null,null,null,null,null,null,null,null,null,null,null,null,null,null,null,null,null,null,null,null,null,null,"Tillsonburg Hydro Inc."]
[null,null,null,null,null,null,null,null,null,null,null,null,null,null,null,null,null,null,null,null,null,null,null,null,null,null,null,"Toronto Hydro-Electric System Limited"]
[null,null,null,null,null,null,null,null,null,null,null,null,null,null,null,null,null,null,null,null,null,null,null,null,null,null,null,"Veridian Connections Inc."]
[null,null,null,null,null,null,null,null,null,null,null,null,null,null,null,null,null,null,null,null,null,null,null,null,null,null,null,"Wasaga Distribution Inc."]
[null,null,null,null,null,null,null,null,null,null,null,null,null,null,null,null,null,null,null,null,null,null,null,null,null,null,null,"Waterloo North Hydro Inc."]
[null,null,null,null,null,null,null,null,null,null,null,null,null,null,null,null,null,null,null,null,null,null,null,null,null,null,null,"Welland Hydro-Electric System Corp."]
[null,null,null,null,null,null,null,null,null,null,null,null,null,null,null,null,null,null,null,null,null,null,null,null,null,null,null,"Wellington North Power Inc."]
[null,null,null,null,null,null,null,null,null,null,null,null,null,null,null,null,null,null,null,null,null,null,null,null,null,null,null,"West Coast Huron Energy Inc."]
[null,null,null,null,null,null,null,null,null,null,null,null,null,null,null,null,null,null,null,null,null,null,null,null,null,null,null,"Westario Power Inc."]
[null,null,null,null,null,null,null,null,null,null,null,null,null,null,null,null,null,null,null,null,null,null,null,null,null,null,null,"Whitby Hydro Electric Corporation"]
[null,null,null,null,null,null,null,null,null,null,null,null,null,null,null,null,null,null,null,null,null,null,null,null,null,null,null,"Woodstock Hydro Services Inc."]

{"sheet":"2. Table of Contents","index":1,"n_rows":28,"n_cols":9,"rows_kept":28,"cut":false,"hidden":false,"merged":[]}
[]
[]
[]
[]
[]
[]
[]
[]
[]
[]
[]
[]
[]
[]
[]
[]
[]
[]
[]
[null,null,null,"1. Info",null,null,null,null,"6. Historical Wholesale"]
[]
[null,null,null,"2. Table of Contents",null,null,null,null,"7. Current Wholesale"]
[]
[null,null,null,"3. Rate Classes",null,null,null,null,"8. Forecast Wholesale"]
[]
[null,null,null,"4. RRR Data",null,null,null,null,"9. RTSR Rates to Forecast"]
[]
[null,null,null,"5. UTRs and Sub-Transmission"]

{"sheet":"3. Rate Classes","index":2,"n_rows":100,"n_cols":23,"rows_kept":100,"cut":false,"hidden":false,"merged":[[12,2,12,8]]}
[]
[]
[]
[]
[]
[]
[]
[]
[]
[]
[]
[]
[null,null,"1.  Select the appropriate rate classes that appear on your most recent Board-Approved Tariff of Rates and Charges.\n2.  Enter the RTS Network and Connection Rate as it appears on the Tariff of Rates and Charges"]
[]
[null,null,"Rate Class",null,"Unit",null,"RTSR-Network",null,"RTSR-Connection"]
[]
[null,null,"Residential",null,"kWh",null,5.7000000000000002E-3,null,4.1000000000000003E-3,null,null,{"$f":"IF(OR(ISBLANK(C17), ISERROR(FIND(\"Choose\", C17))=FALSE), 0, 1)","v":1},{"$f":"\"C\" & ROW(C17)","v":"C17"},{"$f":"IF(OR(C17=\"General Service Intermediate Rate Class 1,000 To 4,999 kW (formerly General Service > 50 kW Customers)\", C17=\"General Service Intermediate Rate Class 1,000 To 4,999 kW (formerly Large Use Customers)\"), \"x\", \"\")","v":""},null,null,null,null,null,null,null,null,"Choose Rate Class"]
[null,null,"General Service Less Than 50 kW",null,"kWh",null,5.1999999999999998E-3,null,3.8999999999999998E-3,null,null,1,"C18",{"$f":"IF(OR(C18=\"General Service Intermediate Rate Class 1,000 To 4,999 kW (formerly General Service > 50 kW Customers)\", C18=\"General Service Intermediate Rate Class 1,000 To 4,999 kW (formerly Large Use Customers)\"), \"x\", \"\")","v":""},null,null,null,null,null,null,null,null,"Residential"]
[null,null,"General Service 50 to 4,999 kW",null,"kW",null,2.0385,null,2.1757,null,null,1,"C19","",null,null,null,null,null,null,null,null,"Residential Regular"]
[null,null,"General Service 50 to 4,999 kW – Interval Metered",null,"kW",null,2.0385,null,2.1757,null,null,1,"C20","",null,null,null,null,null,null,null,null,"Residential Urban"]
[null,null,"Unmetered Scattered Load",null,"kWh",null,5.1999999999999998E-3,null,3.8999999999999998E-3,null,null,1,"C21","",null,null,null,null,null,null,null,null,"Residential Urban Year-Round"]
[null,null,"Sentinel Lighting",null,"kW",null,1.5953999999999999,null,1.7003999999999999,null,null,1,"C22","",null,null,null,null,null,null,null,null,"Residential Suburban"]
[null,null,"Street Lighting",null,"kW",null,1.5872999999999999,null,1.1469,null,null,1,"C23","",null,null,null,null,null,null,null,null,"Residential Suburban Seasonal"]
[null,null,"Choose Rate Class",null,null,null,null,null,null,null,null,0,"C24","",null,null,null,null,null,null,null,null,"Residential Suburban Year Round"]
[null,null,"Choose Rate Class",null,null,null,null,null,null,null,null,0,"C25","",null,null,null,null,null,null,null,null,"Residential - Time of Use"]
[null,null,"Choose Rate Class",null,null,null,null,null,null,null,null,0,"C26","",null,null,null,null,null,null,null,null,"Residential - Hensall"]
[null,null,"Choose Rate Class",null,null,null,null,null,null,null,null,0,"C27","",null,null,null,null,null,null,null,null,"Residential – High Density [R1]"]
[null,null,"Choose Rate Class",null,null,null,null,null,null,null,null,0,"C28","",null,null,null,null,null,null,null,null,"Residential – Normal Density [R2]"]
[null,null,"Choose Rate Class",null,null,null,null,null,null,null,null,0,"C29","",null,null,null,null,null,null,null,null,"Seasonal Residential – High Density [R3]"]
[null,null,"Choose Rate Class",null,null,null,null,null,null,null,null,0,"C30","",null,null,null,null,null,null,null,null,"Seasonal Residential – Normal Density [R4]"]
[null,null,"Choose Rate Class",null,null,null,null,null,null,null,null,0,"C31","",null,null,null,null,null,null,null,null,"Residential – Urban [UR]"]
[null,null,"Choose Rate Class",null,null,null,null,null,null,null,null,0,"C32","",null,null,null,null,null,null,null,null,"General Service Less Than 50 kW"]
[null,null,"Choose Rate Class",null,null,null,null,null,null,null,null,0,"C33","",null,null,null,null,null,null,null,null,"General Service Less Than 50 kW – Single Phase energy-billed [G1]"]
[null,null,"Choose Rate Class",null,null,null,null,null,null,null,null,0,"C34","",null,null,null,null,null,null,null,null,"General Service Less Than 50 kW – Three Phase energy-billed [G3]"]
[null,null,"Choose Rate Class",null,null,null,null,null,null,null,null,0,"C35","",null,null,null,null,null,null,null,null,"General Service Less Than 50 kW – Transmission Class energy-billed [T]"]
[null,null,"Choose Rate Class",null,null,null,null,null,null,null,null,0,"C36","",null,null,null,null,null,null,null,null,"General Service Less Than 50 kW – Urban energy-billed [UG]"]
[null,null,"Choose Rate Class",null,null,null,null,null,null,null,null,0,"C37","",null,null,null,null,null,null,null,null,"Westport Sewage Treatment Plant"]
[null,null,"Choose Rate Class",null,null,null,null,null,null,null,null,0,"C38","",null,null,null,null,null,null,null,null,"Small Commercial and USL - per meter"]
[null,null,null,null,null,null,null,null,null,null,null,null,null,{"$f":"COUNTIF(N17:N38, \"x\")","v":0},null,null,null,null,null,null,null,null,"Small Commercial and USL - per connection"]
[null,null,null,null,null,null,null,null,null,null,null,null,null,null,null,null,null,null,null,null,null,null,"Farms – Single Phase energy-billed [F1]"]
[null,null,null,null,null,null,null,null,null,null,null,null,null,null,null,null,null,null,null,null,null,null,"General Service 50 to 499 kW"]
[null,null,null,null,null,null,null,null,null,null,null,null,null,null,null,null,null,null,null,null,null,null,"General Service 50 to 699 kW"]
[null,null,null,null,null,null,null,null,null,null,null,null,null,null,null,null,null,null,null,null,null,null,"General Service 50 to 999 kW"]
[null,null,null,null,null,null,null,null,null,null,null,null,null,null,null,null,null,null,null,null,null,null,"General Service 50 to 999 kW - Interval Metered"]
[null,null,null,null,null,null,null,null,null,null,null,null,null,null,null,null,null,null,null,null,null,null,"General Service 50 to 1,000 kW"]
[null,null,null,null,null,null,null,null,null,null,null,null,null,null,null,null,null,null,null,null,null,null,"General Service 50 to 1,000 kW - Interval Meters"]
[null,null,null,null,null,null,null,null,null,null,null,null,null,null,null,null,null,null,null,null,null,null,"General Service 50 to 1,000 kW - Non Interval Meters"]
[null,null,null,null,null,null,null,null,null,null,null,null,null,null,null,null,null,null,null,null,null,null,"General Service 50 to 1,499 kW"]
[null,null,null,null,null,null,null,null,null,null,null,null,null,null,null,null,null,null,null,null,null,null,"General Service 50 to 1,499 kW - Interval Metered"]
[null,null,null,null,null,null,null,null,null,null,null,null,null,null,null,null,null,null,null,null,null,null,"General Service  50 to 2,499 kW"]
[null,null,null,null,null,null,null,null,null,null,null,null,null,null,null,null,null,null,null,null,null,null,"General Service 50 to 2,999 kW"]
[null,null,null,null,null,null,null,null,null,null,null,null,null,null,null,null,null,null,null,null,null,null,"General Service 50 to 2,999 kW - Time of Use"]
[null,null,null,null,null,null,null,null,null,null,null,null,null,null,null,null,null,null,null,null,null,null,"General Service 50 to 4,999 kW"]
[null,null,null,null,null,null,null,null,null,null,null,null,null,null,null,null,null,null,null,null,null,null,"General Service 50 to 4,999 kW – Interval Metered"]
[null,null,null,null,null,null,null,null,null,null,null,null,null,null,null,null,null,null,null,null,null,null,"General Service 50 to 4,999 kW - Time of Use"]
[null,null,null,null,null,null,null,null,null,null,null,null,null,null,null,null,null,null,null,null,null,null,"General Service 50 to 4,999 kW (CoGeneration)"]
[null,null,null,null,null,null,null,null,null,null,null,null,null,null,null,null,null,null,null,null,null,null,"General Service 50 to 4,999 kW (formerly Time of Use)"]
[null,null,null,null,null,null,null,null,null,null,null,null,null,null,null,null,null,null,null,null,null,null,"General Service 500 to 4,999 kW"]
[null,null,null,null,null,null,null,null,null,null,null,null,null,null,null,null,null,null,null,null,null,null,"General Service 700 to 4,999 kW"]
[null,null,null,null,null,null,null,null,null,null,null,null,null,null,null,null,null,null,null,null,null,null,"General Service 1,000 to 2,999 kW"]
[null,null,null,null,null,null,null,null,null,null,null,null,null,null,null,null,null,null,null,null,null,null,"General Service 1,000 to 4,999 kW"]
[null,null,null,null,null,null,null,null,null,null,null,null,null,null,null,null,null,null,null,null,null,null,"General Service 1,000 to 4,999 kW - Interval Meters"]
[null,null,null,null,null,null,null,null,null,null,null,null,null,null,null,null,null,null,null,null,null,null,"General Service 1,000 To 4,999 kW (co-generation)"]
[null,null,null,null,null,null,null,null,null,null,null,null,null,null,null,null,null,null,null,null,null,null,"General Service Greater Than 1,000 kW"]
[null,null,null,null,null,null,null,null,null,null,null,null,null,null,null,null,null,null,null,null,null,null,"General Service Intermediate Rate Class 1,000 To 4,999 kW (formerly Large Use Customers)"]
[null,null,null,null,null,null,null,null,null,null,null,null,null,null,null,null,null,null,null,null,null,null,"General Service Intermediate Rate Class 1,000 To 4,999 kW (formerly General Service > 50 kW Customers)"]
[null,null,null,null,null,null,null,null,null,null,null,null,null,null,null,null,null,null,null,null,null,null,"General Service 1,500 to 4,999 kW"]
[null,null,null,null,null,null,null,null,null,null,null,null,null,null,null,null,null,null,null,null,null,null,"General Service Equal To Or Greater Than 1,500 kW"]
[null,null,null,null,null,null,null,null,null,null,null,null,null,null,null,null,null,null,null,null,null,null,"General Service Equal To Or Greater Than 1,500 kW - Interval Metered"]
[null,null,null,null,null,null,null,null,null,null,null,null,null,null,null,null,null,null,null,null,null,null,"General Service Intermediate 1,000 To 4,999 kW"]
[null,null,null,null,null,null,null,null,null,null,null,null,null,null,null,null,null,null,null,null,null,null,"General Service 2,500 to 4,999 kW"]
[null,null,null,null,null,null,null,null,null,null,null,null,null,null,null,null,null,null,null,null,null,null,"General Service 3,000 to 4,999 kW"]
[null,null,null,null,null,null,null,null,null,null,null,null,null,null,null,null,null,null,null,null,null,null,"General Service 3,000 to 4,999 kW - Interval Metered"]
[null,null,null,null,null,null,null,null,null,null,null,null,null,null,null,null,null,null,null,null,null,null,"General Service 3,000 to 4,999 kW - Intermediate Use"]
[null,null,null,null,null,null,null,null,null,null,null,null,null,null,null,null,null,null,null,null,null,null,"General Service 3,000 to 4,999 kW - Time of Use"]
[null,null,null,null,null,null,null,null,null,null,null,null,null,null,null,null,null,null,null,null,null,null,"Intermediate With Self Generation"]
[null,null,null,null,null,null,null,null,null,null,null,null,null,null,null,null,null,null,null,null,null,null,"General Service - Commercial"]
[null,null,null,null,null,null,null,null,null,null,null,null,null,null,null,null,null,null,null,null,null,null,"General Service - Institutional"]
[null,null,null,null,null,null,null,null,null,null,null,null,null,null,null,null,null,null,null,null,null,null,"Farms – Three Phase energy-billed [F3]"]
[null,null,null,null,null,null,null,null,null,null,null,null,null,null,null,null,null,null,null,null,null,null,"Large Use"]
[null,null,null,null,null,null,null,null,null,null,null,null,null,null,null,null,null,null,null,null,null,null,"Large Use - Regular"]
[null,null,null,null,null,null,null,null,null,null,null,null,null,null,null,null,null,null,null,null,null,null,"Large Use > 5000 kW"]
[null,null,null,null,null,null,null,null,null,null,null,null,null,null,null,null,null,null,null,null,null,null,"Large Use - 3TS"]
[null,null,null,null,null,null,null,null,null,null,null,null,null,null,null,null,null,null,null,null,null,null,"Large Use - Ford Annex"]
[null,null,null,null,null,null,null,null,null,null,null,null,null,null,null,null,null,null,null,null,null,null,"Unmetered Scattered Load"]
[null,null,null,null,null,null,null,null,null,null,null,null,null,null,null,null,null,null,null,null,null,null,"Sentinel Lighting"]
[null,null,null,null,null,null,null,null,null,null,null,null,null,null,null,null,null,null,null,null,null,null,"Street Lighting"]
[null,null,null,null,null,null,null,null,null,null,null,null,null,null,null,null,null,null,null,null,null,null,"Embedded Distributor"]
[null,null,null,null,null,null,null,null,null,null,null,null,null,null,null,null,null,null,null,null,null,null,"Low Voltage Wheeling Charge Rate"]
[null,null,null,null,null,null,null,null,null,null,null,null,null,null,null,null,null,null,null,null,null,null,"Stand-By"]
[null,null,null,null,null,null,null,null,null,null,null,null,null,null,null,null,null,null,null,null,null,null,"Standby Power"]
[null,null,null,null,null,null,null,null,null,null,null,null,null,null,null,null,null,null,null,null,null,null,"Standby Power – INTERIM APPROVAL"]
[null,null,null,null,null,null,null,null,null,null,null,null,null,null,null,null,null,null,null,null,null,null,"Standby Power - APPROVED ON AN INTERIM BASIS"]
[null,null,null,null,null,null,null,null,null,null,null,null,null,null,null,null,null,null,null,null,null,null,"Standby - General Service 50 - 1,000 kW"]
[null,null,null,null,null,null,null,null,null,null,null,null,null,null,null,null,null,null,null,null,null,null,"Standby Power General Service 50 to 1,499 kW"]
[null,null,null,null,null,null,null,null,null,null,null,null,null,null,null,null,null,null,null,null,null,null,"Standby - General Service 1,000 - 5,000 kW"]
[null,null,null,null,null,null,null,null,null,null,null,null,null,null,null,null,null,null,null,null,null,null,"Standby Power General Service 1,500 to 4,999 kW"]
[null,null,null,null,null,null,null,null,null,null,null,null,null,null,null,null,null,null,null,null,null,null,"Standby - Large Use"]
[null,null,null,null,null,null,null,null,null,null,null,null,null,null,null,null,null,null,null,null,null,null,"Standby Power General Service Large Use"]
[null,null,null,null,null,null,null,null,null,null,null,null,null,null,null,null,null,null,null,null,null,null,"Standby Distribution Service"]

{"sheet":"4. RRR Data","index":3,"n_rows":30,"n_cols":9,"rows_kept":30,"cut":false,"hidden":false,"merged":[[12,1,12,8]]}
[]
[]
[]
[]
[]
[]
[]
[]
[]
[]
[]
[]
[]
[]
[null,"Rate Class","Rate Description","Unit","Rate","Non-Loss Adjusted Metered kWh","Non-Loss Adjusted Metered kW","Applicable \nLoss Factor\neg: (1.0325)","Loss Adjusted Billed kWh"]
[]
[null,"Residential","RTSR - Network","kWh",5.7000000000000002E-3,149311532,null,1.0678000000000001,{"$f":"F17*H17","v":159434853.8696}]
[null,"Residential","RTSR - Connection","kWh",4.1000000000000003E-3,149311532,null,1.0678000000000001,{"$f":"F18*H18","v":159434853.8696}]
[null,"General Service Less Than 50 kW","RTSR - Network","kWh",5.1999999999999998E-3,33730295,null,1.0678000000000001,{"$f":"F19*H19","v":36017209.001000002}]
[null,"General Service Less Than 50 kW","RTSR - Connection","kWh",3.8999999999999998E-3,33730295,null,1.0678000000000001,{"$f":"F20*H20","v":36017209.001000002}]
[null,"General Service 50 to 4,999 kW","RTSR - Network","kW",2.0385,19751251,66619]
[null,"General Service 50 to 4,999 kW","RTSR - Connection","kW",2.1757,19751251,66619]
[null,"General Service 50 to 4,999 kW – Interval Metered","RTSR - Network","kW",2.0385,34967663,74982]
[null,"General Service 50 to 4,999 kW – Interval Metered","RTSR - Connection","kW",2.1757,34967663,74982]
[null,"Unmetered Scattered Load","RTSR - Network","kWh",5.1999999999999998E-3,463092,null,1.0678000000000001,{"$f":"F25*H25","v":494489.63760000002}]
[null,"Unmetered Scattered Load","RTSR - Connection","kWh",3.8999999999999998E-3,463092,null,1.0678000000000001,{"$f":"F26*H26","v":494489.63760000002}]
[null,"Sentinel Lighting","RTSR - Network","kW",1.5953999999999999,107542,298]
[null,"Sentinel Lighting","RTSR - Connection","kW",1.7003999999999999,107542,298]
[null,"Street Lighting","RTSR - Network","kW",1.5872999999999999,1016454,2886]
[null,"Street Lighting","RTSR - Connection","kW",1.1469,1016454,2886]

{"sheet":"5. UTRs and Sub-Transmission","index":4,"n_rows":95,"n_cols":9,"rows_kept":95,"cut":false,"hidden":false,"merged":[]}
[]
[]
[]
[]
[]
[]
[]
[]
[]
[]
[]
[]
[]
[]
[]
[]
[]
[null,"Uniform Transmission Rates","Unit",null,"Effective \nJanuary 1, 2014",null,"Effective \nJanuary 1, 2015",null,"Effective \nJanuary 1, 2016"]
[]
[null,"Rate Description",null,null,"Rate",null,"Rate",null,"Rate"]
[]
[null,"Network Service Rate","kW",null,3.82,null,3.78,null,3.78]
[]
[null,"Line Connection Service Rate","kW",null,0.82,null,0.86,null,0.86]
[]
[null,"Transformation Connection Service Rate","kW",null,1.98,null,2,null,2]
[]
[]
[null,"Hydro One Sub-Transmission Rates","Unit",null,"Effective \nJanuary 1, 2014 to April 30, 2015",null,"Effective \nMay 1, 2015",null,"Effective \nJanuary 1, 2016"]
[]
[]
[]
[null,"Rate Description",null,null,"Rate",null,"Rate",null,"Rate"]
[]
[null,"Network Service Rate","kW",null,3.23,null,3.4121000000000001,null,3.66]
[]
[null,"Line Connection Service Rate","kW",null,0.65,null,0.78790000000000004,null,0.87]
[]
[null,"Transformation Connection Service Rate","kW",null,1.62,null,1.8018000000000001,null,2.02]
[]
[null,"Both Line and Transformation Connection Service Rate","kW",null,{"$f":"SUM(E39,E37)","v":2.27},null,{"$f":"SUM(G39,G37)","v":2.5897000000000001},null,{"$f":"SUM(I39,I37)","v":2.89}]
[]
[]
[null,"If needed, add extra host here. (I)","Unit",null,"Effective \nJanuary 1, 2014",null,"Effective \nJanuary 1, 2015",null,"Effective \nJanuary 1, 2016"]
[]
[]
[]
[null,"Rate Description",null,null,"Rate",null,"Rate",null,"Rate"]
[]
[null,"Network Service Rate","kW"]
[]
[null,"Line Connection Service Rate","kW"]
[]
[null,"Transformation Connection Service Rate","kW"]
[]
[null,"Both Line and Transformation Connection Service Rate","kW",null,{"$f":"SUM(E52,E54)","v":0},null,{"$f":"SUM(G52,G54)","v":0},null,{"$f":"I54+I52","v":0}]
[]
[]
[null,"If needed, add extra host here. (II)","Unit",null,"Effective \nJanuary 1, 2014",null,"Effective \nJanuary 1, 2015",null,"Effective \nJanuary 1, 2016"]
[]
[]
[]
[null,"Rate Description",null,null,"Rate",null,"Rate",null,"Rate"]
[]
[null,"Network Service Rate","kW"]
[]
[null,"Line Connection Service Rate","kW"]
[]
[null,"Transformation Connection Service Rate","kW"]
[]
[null,"Both Line and Transformation Connection Service Rate","kW",null,{"$f":"SUM(E67,E69)","v":0},null,{"$f":"SUM(G67,G69)","v":0},null,{"$f":"I69+I67","v":0}]
[]
[]
[]
[null,"Hydro One Sub-Transmission Rate Rider 9A","Unit",null,"Effective \nJanuary 1, 2014",null,"Effective \nJanuary 1, 2015",null,"Effective \nJanuary 1, 2016"]
[]
[null,"Rate Description",null,null,"Rate",null,"Rate",null,"Rate"]
[]
[null,"RSVA Transmission network – 4714 – which affects 1584","kW",null,0.14649999999999999,null,0,null,0]
[]
[null,"RSVA Transmission connection – 4716 – which affects 1586","kW",null,6.6699999999999995E-2,null,0,null,0]
[]
[null,"RSVA LV – 4750 – which affects 1550","kW",null,4.7500000000000001E-2,null,0,null,0]
[]
[null,"RARA 1 – 2252 – which affects 1590 ","kW",null,4.19E-2,null,0,null,0]
[]
[null,"RARA 1 – 2252 – which affects 1590 (2008)","kW",null,-2.7E-2,null,0,null,0]
[]
[null,"RARA 1 – 2252 – which affects 1590 (2009)","kW",null,-5.9999999999999995E-4,null,0,null,0]
[]
[null,"Hydro One Sub-Transmission Rate Rider 9A","kW",null,0.27499999999999997,null,0,null,{"$f":"SUM(I79:I89)","v":0}]
[]
[]
[null,null,null,null,"Historical 2014",null,"Current 2015",null,"Forecast 2016"]
[null,"Low Voltage Switchgear Credit (if applicable, enter as a negative value)","$"]

{"sheet":"6. Historical Wholesale","index":5,"n_rows":117,"n_cols":16,"rows_kept":117,"cut":false,"hidden":false,"merged":[[76,7,76,9],[76,11,76,13],[95,7,95,9],[95,11,95,13],[96,7,96,9],[96,11,96,13],[20,3,20,5],[20,7,20,9],[20,11,20,13],[96,3,96,5],[38,3,38,5],[38,7,38,9],[38,11,38,13],[95,3,95,5],[57,3,57,5],[57,7,57,9],[57,11,57,13],[76,3,76,5]]}
[]
[]
[]
[]
[]
[]
[]
[]
[]
[]
[]
[]
[]
[]
[]
[]
[]
[]
[]
[]
[null,"IESO",null,"Network",null,null,null,"Line Connection",null,null,null,"Transformation Connection",null,null,null,"Total Line"]
[null,"Month",null,"Units Billed","Rate","Amount",null,"Units Billed","Rate","Amount",null,"Units Billed","Rate","Amount",null,"Amount"]
[]
[null,"January",null,null,{"$f":"IF(D24<>0,F24/D24,0)","v":0},null,null,null,{"$f":"IF(H24<>0,J24/H24,0)","v":0},null,null,null,{"$f":"IF(L24<>0,N24/L24,0)","v":0},null,null,{"$f":"J24+N24","v":0}]
[null,"February",null,null,{"$f":"IF(D25<>0,F25/D25,0)","v":0},null,null,null,{"$f":"IF(H25<>0,J25/H25,0)","v":0},null,null,null,{"$f":"IF(L25<>0,N25/L25,0)","v":0},null,null,0]
[null,"March",null,null,0,null,null,null,0,null,null,null,0,null,null,0]
[null,"April",null,null,0,null,null,null,0,null,null,null,0,null,null,0]
[null,"May",null,null,0,null,null,null,0,null,null,null,0,null,null,0]
[null,"June",null,null,0,null,null,null,0,null,null,null,0,null,null,0]
[null,"July",null,null,0,null,null,null,0,null,null,null,0,null,null,0]
[null,"August",null,null,0,null,null,null,0,null,null,null,0,null,null,0]
[null,"September",null,null,0,null,null,null,0,null,null,null,0,null,null,0]
[null,"October",null,null,0,null,null,null,0,null,null,null,0,null,null,0]
[null,"November",null,null,0,null,null,null,0,null,null,null,0,null,null,0]
[null,"December",null,null,0,null,null,null,0,null,null,null,0,null,null,0]
[]
[null,"Total",null,{"$f":"SUM(D24:D35)","v":0},{"$f":"IF(D37<>0,F37/D37,0)","v":0},{"$f":"SUM(F24:F35)","v":0},null,{"$f":"SUM(H24:H35)","v":0},{"$f":"IF(H37<>0,J37/H37,0)","v":0},{"$f":"SUM(J24:J35)","v":0},null,{"$f":"SUM(L24:L35)","v":0},{"$f":"IF(L37<>0,N37/L37,0)","v":0},{"$f":"SUM(N24:N35)","v":0},null,{"$f":"SUM(P24:P35)","v":0}]
[]
[null,"Hydro One",null,"Network",null,null,null,"Line Connection",null,null,null,"Transformation Connection",null,null,null,"Total Line"]
[]
[null,"Month",null,"Units Billed","Rate","Amount",null,"Units Billed","Rate","Amount",null,"Units Billed","Rate","Amount",null,"Amount"]
[]
[null,"January",null,47686.71,3.23,{"$f":"D43*E43","v":154028.07329999999},null,47837.45,0.65,{"$f":"H43*I43","v":31094.342499999999},null,47837.45,1.62,{"$f":"L43*M43","v":77496.668999999994},null,{"$f":"J43+N43","v":108591.01149999999}]
[null,"February",null,49315.150000000009,3.23,{"$f":"D44*E44","v":159287.93450000003},null,50980.83,0.65,{"$f":"H44*I44","v":33137.539499999999},null,50980.83,1.62,{"$f":"L44*M44","v":82588.944600000003},null,115726.4841]
[null,"March",null,36964.639999999999,3.23,119395.78719999999,null,40349.380000000005,0.65,26227.097000000005,null,40349.380000000005,1.62,65365.995600000009,null,91593.092600000018]
[null,"April",null,34228,"3.23/3.41",{"$f":"+D46*3.23+(D46*0.1821*0.2142889)","v":111892.08531344132},null,36126.46,"0.65/.7989",{"$f":"+H46*0.65+(H46*0.1379*0.2142889)","v":24549.751763715143},null,36126.46,"1.62/1.80",{"$f":"+L46*1.62+(L46*0.1818*0.2142889)","v":59932.269786246652},null,84482.021549961792]
[null,"May",null,37837.439999999995,3.4121000000000001,129105.12902399999,null,38096.479999999996,0.78790000000000004,{"$f":"H47*I47","v":30016.216591999997},null,38096.479999999996,1.8018000000000001,{"$f":"L47*M47","v":68642.237664},null,98658.454255999997]
[null,"June",null,40588.630000000005,3.4121000000000001,138492.46442300003,null,40594.400000000001,0.78790000000000004,{"$f":"H48*I48","v":31984.327760000004},null,40594.400000000001,1.8018000000000001,{"$f":"L48*M48","v":73142.989920000007},null,105127.31768000001]
[null,"July",null,48974.8,3.4121000000000001,167106.91508000001,null,48974.8,0.78790000000000004,38587.244920000005,null,48974.8,1.8018000000000001,88242.794640000007,null,126830.03956]
[null,"August",null,48999.38,3.4121000000000001,167190.78449799999,null,50218.25,0.78790000000000004,39566.959175000004,null,50218.25,1.8018000000000001,90483.24285000001,null,130050.20202500001]
[null,"September",null,39102.910000000003,3.4121000000000001,133423.03921100002,null,41214.53,0.78790000000000004,32472.928187000001,null,41214.53,1.8018000000000001,74260.340154000005,null,106733.268341]
[null,"October",null,38719.58,3.4121000000000001,132115.07891800001,null,39919.839999999997,0.78790000000000004,31452.841936000001,null,39919.839999999997,1.8018000000000001,71927.567712000004,null,103380.409648]
[null,"November",null,47999.06,3.4121000000000001,163777.592626,null,50241.05,0.78790000000000004,39584.923295000008,null,50241.05,1.8018000000000001,90524.323890000014,null,130109.24718500001]
[null,"December",null,39783.600000000006,3.4121000000000001,135745.62156000003,null,43105.009999999995,0.78790000000000004,33962.437378999995,null,43105.009999999995,1.8018000000000001,77666.607017999995,null,111629.04439699999]
[]
[null,"Total",null,{"$f":"SUM(D43:D54)","v":510199.9},{"$f":"IF(D56<>0,F56/D56,0)","v":3.3546860860879071},{"$f":"SUM(F43:F54)","v":1711560.5056534417},null,{"$f":"SUM(H43:H54)","v":527658.47999999986},{"$f":"IF(H56<>0,J56/H56,0)","v":0.74411124788085514},{"$f":"SUM(J43:J54)","v":392636.61000771512},null,{"$f":"SUM(L43:L54)","v":527658.47999999986},{"$f":"IF(L56<>0,N56/L56,0)","v":1.7440712462997789},{"$f":"SUM(N43:N54)","v":920273.98283424671},null,{"$f":"SUM(P43:P54)","v":1312910.5928419617}]
[]
[null,"Add Extra Host Here (I)",null,"Network",null,null,null,"Line Connection",null,null,null,"Transformation Connection",null,null,null,"Total Line"]
[null,"(if needed)"]
[null,"Month",null,"Units Billed","Rate","Amount",null,"Units Billed","Rate","Amount",null,"Units Billed","Rate","Amount",null,"Amount"]
[]
[null,"January",null,null,{"$f":"IF(D62<>0,F62/D62,0)","v":0},null,null,null,{"$f":"IF(H62<>0,J62/H62,0)","v":0},null,null,null,{"$f":"IF(L62<>0,N62/L62,0)","v":0},null,null,{"$f":"J62+N62","v":0}]
[null,"February",null,null,0,null,null,null,0,null,null,null,0,null,null,0]
[null,"March",null,null,0,null,null,null,0,null,null,null,0,null,null,0]
[null,"April",null,null,0,null,null,null,0,null,null,null,0,null,null,0]
[null,"May",null,null,0,null,null,null,0,null,null,null,0,null,null,0]
[null,"June",null,null,0,null,null,null,0,null,null,null,0,null,null,0]
[null,"July",null,null,0,null,null,null,0,null,null,null,0,null,null,0]
[null,"August",null,null,0,null,null,null,0,null,null,null,0,null,null,0]
[null,"September",null,null,0,null,null,null,0,null,null,null,0,null,null,0]
[null,"October",null,null,0,null,null,null,0,null,null,null,0,null,null,0]
[null,"November",null,null,0,null,null,null,0,null,null,null,0,null,null,0]
[null,"December",null,null,0,null,null,null,0,null,null,null,0,null,null,0]
[]
[null,"Total",null,{"$f":"SUM(D62:D73)","v":0},{"$f":"IF(D75<>0,F75/D75,0)","v":0},{"$f":"SUM(F62:F73)","v":0},null,{"$f":"SUM(H62:H73)","v":0},{"$f":"IF(H75<>0,J75/H75,0)","v":0},{"$f":"SUM(J62:J73)","v":0},null,{"$f":"SUM(L62:L73)","v":0},{"$f":"IF(L75<>0,N75/L75,0)","v":0},{"$f":"SUM(N62:N73)","v":0},null,{"$f":"SUM(P62:P73)","v":0}]
[]
[null,"Add Extra Host Here (II)",null,"Network",null,null,null,"Line Connection",null,null,null,"Transformation Connection",null,null,null,"Total Line"]
[null,"(if needed)"]
[null,"Month",null,"Units Billed","Rate","Amount",null,"Units Billed","Rate","Amount",null,"Units Billed","Rate","Amount",null,"Amount"]
[]
[null,"January",null,null,{"$f":"IF(D81<>0,F81/D81,0)","v":0},null,null,null,{"$f":"IF(H81<>0,J81/H81,0)","v":0},null,null,null,{"$f":"IF(L81<>0,N81/L81,0)","v":0},null,null,{"$f":"J81+N81","v":0}]
[null,"February",null,null,0,null,null,null,0,null,null,null,0,null,null,0]
[null,"March",null,null,0,null,null,null,0,null,null,null,0,null,null,0]
[null,"April",null,null,0,null,null,null,0,null,null,null,0,null,null,0]
[null,"May",null,null,0,null,null,null,0,null,null,null,0,null,null,0]
[null,"June",null,null,0,null,null,null,0,null,null,null,0,null,null,0]
[null,"July",null,null,0,null,null,null,0,null,null,null,0,null,null,0]
[null,"August",null,null,0,null,null,null,0,null,null,null,0,null,null,0]
[null,"September",null,null,0,null,null,null,0,null,null,null,0,null,null,0]
[null,"October",null,null,0,null,null,null,0,null,null,null,0,null,null,0]
[null,"November",null,null,0,null,null,null,0,null,null,null,0,null,null,0]
[null,"December",null,null,0,null,null,null,0,null,null,null,0,null,null,0]
[]
[null,"Total",null,{"$f":"SUM(D81:D92)","v":0},{"$f":"IF(D94<>0,F94/D94,0)","v":0},{"$f":"SUM(F81:F92)","v":0},null,{"$f":"SUM(H81:H92)","v":0},{"$f":"IF(H94<>0,J94/H94,0)","v":0},{"$f":"SUM(J81:J92)","v":0},null,{"$f":"SUM(L81:L92)","v":0},{"$f":"IF(L94<>0,N94/L94,0)","v":0},{"$f":"SUM(N81:N92)","v":0},null,{"$f":"SUM(P81:P92)","v":0}]
[]
[null,"Total",null,"Network",null,null,null,"Line Connection",null,null,null,"Transformation Connection",null,null,null,"Total Line"]
[]
[null,"Month",null,"Units Billed","Rate","Amount",null,"Units Billed","Rate","Amount",null,"Units Billed","Rate","Amount",null,"Amount"]
[]
[null,"January",null,{"$f":"D24+D43+D62+D81","v":47686.71},{"$f":"IF(D100<>0,F100/D100,0)","v":3.23},{"$f":"F24+F43+F62+F81","v":154028.07329999999},null,{"$f":"H24+H43+H62+H81","v":47837.45},{"$f":"IF(H100<>0,J100/H100,0)","v":0.65},{"$f":"J24+J43+J62+J81","v":31094.342499999999},null,{"$f":"L24+L43+L62+L81","v":47837.45},{"$f":"IF(L100<>0,N100/L100,0)","v":1.6199999999999999},{"$f":"N24+N43+N62+N81","v":77496.668999999994},null,{"$f":"J100+N100","v":108591.01149999999}]
[null,"February",null,{"$f":"D25+D44+D63+D82","v":49315.150000000009},3.23,{"$f":"F25+F44+F63+F82","v":159287.93450000003},null,{"$f":"H25+H44+H63+H82","v":50980.83},0.64999999999999991,{"$f":"J25+J44+J63+J82","v":33137.539499999999},null,{"$f":"L25+L44+L63+L82","v":50980.83},1.6199999999999999,{"$f":"N25+N44+N63+N82","v":82588.944600000003},null,115726.4841]
[null,"March",null,36964.639999999999,3.23,119395.78719999999,null,40349.380000000005,0.65,26227.097000000005,null,40349.380000000005,1.62,65365.995600000009,null,91593.092600000018]
[null,"April",null,34228,3.2690220086899999,111892.08531344132,null,36126.46,0.67955043931000003,24549.751763715143,null,36126.46,1.65895772202,59932.269786246652,null,84482.021549961792]
[null,"May",null,37837.439999999995,3.4121000000000001,129105.12902399999,null,38096.479999999996,0.78790000000000004,30016.216591999997,null,38096.479999999996,1.8018000000000003,68642.237664,null,98658.454255999997]
[null,"June",null,40588.630000000005,3.4121000000000001,138492.46442300003,null,40594.400000000001,0.78790000000000004,31984.327760000004,null,40594.400000000001,1.8018000000000001,73142.989920000007,null,105127.31768000001]
[null,"July",null,48974.8,3.4121000000000001,167106.91508000001,null,48974.8,0.78790000000000004,38587.244920000005,null,48974.8,1.8018000000000001,88242.794640000007,null,126830.03956]
[null,"August",null,48999.38,3.4121000000000001,167190.78449799999,null,50218.25,0.78790000000000004,39566.959175000004,null,50218.25,1.8018000000000003,90483.24285000001,null,130050.20202500001]
[null,"September",null,39102.910000000003,3.4121000000000001,133423.03921100002,null,41214.53,0.78790000000000004,32472.928187000001,null,41214.53,1.8018000000000001,74260.340154000005,null,106733.268341]
[null,"October",null,38719.58,3.4121000000000001,132115.07891800001,null,39919.839999999997,0.78790000000000004,31452.841936000001,null,39919.839999999997,1.8018000000000003,71927.567712000004,null,103380.409648]
[null,"November",null,47999.06,3.4121000000000001,163777.592626,null,50241.05,0.78790000000000016,39584.923295000008,null,50241.05,1.8018000000000001,90524.323890000014,null,130109.24718500001]
[null,"December",null,39783.600000000006,3.4121000000000001,135745.62156000003,null,43105.009999999995,0.78790000000000004,33962.437378999995,null,43105.009999999995,1.8018000000000001,77666.607017999995,null,111629.04439699999]
[]
[null,"Total",null,{"$f":"SUM(D100:D111)","v":510199.9},{"$f":"IF(D113<>0,F113/D113,0)","v":3.3546860860879071},{"$f":"SUM(F100:F111)","v":1711560.5056534417},null,{"$f":"SUM(H100:H111)","v":527658.47999999986},{"$f":"IF(H113<>0,J113/H113,0)","v":0.74411124788085514},{"$f":"SUM(J100:J111)","v":392636.61000771512},null,{"$f":"SUM(L100:L111)","v":527658.47999999986},{"$f":"IF(L113<>0,N113/L113,0)","v":1.7440712462997789},{"$f":"SUM(N100:N111)","v":920273.98283424671},null,{"$f":"SUM(P100:P111)","v":1312910.5928419617}]
[]
[null,null,null,null,null,null,null,null,null,null,null,null,null,"Low Voltage Switchgear Credit (if applicable)",null,{"$f":"'5. UTRs and Sub-Transmission'!E95","v":0}]
[]
[null,null,null,null,null,null,null,null,null,null,null,null,null,"Total including deduction for Low Voltage Switchgear Credit",null,{"$f":"P113+P115","v":1312910.5928419617}]

{"sheet":"7. Current Wholesale","index":6,"n_rows":117,"n_cols":16,"rows_kept":117,"cut":false,"hidden":false,"merged":[[96,7,96,9],[96,11,96,13],[20,3,20,5],[20,7,20,9],[20,11,20,13],[96,3,96,5],[95,3,95,5],[95,7,95,9],[95,11,95,13],[57,3,57,5],[57,7,57,9],[57,11,57,13],[76,3,76,5],[76,7,76,9],[76,11,76,13],[12,1,12,11],[19,3,19,5],[19,7,19,9],[19,11,19,13],[38,3,38,5],[38,7,38,9],[38,11,38,13]]}
[]
[]
[]
[]
[]
[]
[]
[]
[]
[]
[]
[]
[null,"The purpose of this sheet is to calculate the expected billing when current 2015 Uniform Transmission Rates are applied against historical 2014 transmission units."]
[]
[]
[]
[]
[]
[]
[null,"IESO",null,"Network",null,null,null,"Line Connection",null,null,null,"Transformation Connection",null,null,null,"Total Line"]
[]
[null,"Month",null,"Units Billed","Rate","Amount",null,"Units Billed","Rate","Amount",null,"Units Billed","Rate","Amount",null,"Amount"]
[]
[null,"January",null,{"$f":"'6. Historical Wholesale'!D24","v":0},{"$f":"'5. UTRs and Sub-Transmission'!G22","v":3.78},{"$f":"D24*E24","v":0},null,{"$f":"'6. Historical Wholesale'!H24","v":0},{"$f":"'5. UTRs and Sub-Transmission'!G24","v":0.86},{"$f":"H24*I24","v":0},null,{"$f":"'6. Historical Wholesale'!L24","v":0},{"$f":"'5. UTRs and Sub-Transmission'!G26","v":2},{"$f":"L24*M24","v":0},null,{"$f":"J24+N24","v":0}]
[null,"February",null,{"$f":"'6. Historical Wholesale'!D25","v":0},{"$f":"E24","v":3.78},{"$f":"D25*E25","v":0},null,{"$f":"'6. Historical Wholesale'!H25","v":0},{"$f":"I24","v":0.86},{"$f":"H25*I25","v":0},null,{"$f":"'6. Historical Wholesale'!L25","v":0},{"$f":"M24","v":2},{"$f":"L25*M25","v":0},null,0]
[null,"March",null,{"$f":"'6. Historical Wholesale'!D26","v":0},{"$f":"E25","v":3.78},0,null,{"$f":"'6. Historical Wholesale'!H26","v":0},{"$f":"I25","v":0.86},0,null,{"$f":"'6. Historical Wholesale'!L26","v":0},{"$f":"M25","v":2},0,null,0]
[null,"April",null,{"$f":"'6. Historical Wholesale'!D27","v":0},3.78,0,null,{"$f":"'6. Historical Wholesale'!H27","v":0},0.86,0,null,{"$f":"'6. Historical Wholesale'!L27","v":0},2,0,null,0]
[null,"May",null,{"$f":"'6. Historical Wholesale'!D28","v":0},3.78,0,null,{"$f":"'6. Historical Wholesale'!H28","v":0},0.86,0,null,{"$f":"'6. Historical Wholesale'!L28","v":0},2,0,null,0]
[null,"June",null,{"$f":"'6. Historical Wholesale'!D29","v":0},3.78,0,null,{"$f":"'6. Historical Wholesale'!H29","v":0},0.86,0,null,{"$f":"'6. Historical Wholesale'!L29","v":0},2,0,null,0]
[null,"July",null,{"$f":"'6. Historical Wholesale'!D30","v":0},3.78,0,null,{"$f":"'6. Historical Wholesale'!H30","v":0},0.86,0,null,{"$f":"'6. Historical Wholesale'!L30","v":0},2,0,null,0]
[null,"August",null,{"$f":"'6. Historical Wholesale'!D31","v":0},3.78,0,null,{"$f":"'6. Historical Wholesale'!H31","v":0},0.86,0,null,{"$f":"'6. Historical Wholesale'!L31","v":0},2,0,null,0]
[null,"September",null,{"$f":"'6. Historical Wholesale'!D32","v":0},3.78,0,null,{"$f":"'6. Historical Wholesale'!H32","v":0},0.86,0,null,{"$f":"'6. Historical Wholesale'!L32","v":0},2,0,null,0]
[null,"October",null,{"$f":"'6. Historical Wholesale'!D33","v":0},3.78,0,null,{"$f":"'6. Historical Wholesale'!H33","v":0},0.86,0,null,{"$f":"'6. Historical Wholesale'!L33","v":0},2,0,null,0]
[null,"November",null,{"$f":"'6. Historical Wholesale'!D34","v":0},3.78,0,null,{"$f":"'6. Historical Wholesale'!H34","v":0},0.86,0,null,{"$f":"'6. Historical Wholesale'!L34","v":0},2,0,null,0]
[null,"December",null,{"$f":"'6. Historical Wholesale'!D35","v":0},3.78,0,null,{"$f":"'6. Historical Wholesale'!H35","v":0},0.86,0,null,{"$f":"'6. Historical Wholesale'!L35","v":0},2,0,null,0]
[]
[null,"Total",null,{"$f":"SUM(D24:D35)","v":0},{"$f":"IF(D37<>0,F37/D37,0)","v":0},{"$f":"SUM(F24:F35)","v":0},null,{"$f":"SUM(H24:H35)","v":0},{"$f":"IF(H37<>0,J37/H37,0)","v":0},{"$f":"SUM(J24:J35)","v":0},null,{"$f":"SUM(L24:L35)","v":0},{"$f":"IF(L37<>0,N37/L37,0)","v":0},{"$f":"SUM(N24:N35)","v":0},null,{"$f":"SUM(P24:P35)","v":0}]
[]
[null,"Hydro One",null,"Network",null,null,null,"Line Connection",null,null,null,"Transformation Connection",null,null,null,"Total Line"]
[]
[null,"Month",null,"Units Billed","Rate","Amount",null,"Units Billed","Rate","Amount",null,"Units Billed","Rate","Amount",null,"Amount"]
[]
[null,"January",null,{"$f":"'6. Historical Wholesale'!D43","v":47686.71},{"$f":"'5. UTRs and Sub-Transmission'!G35+'5. UTRs and Sub-Transmission'!G79","v":3.4121000000000001},{"$f":"D43*E43","v":162711.823191},null,{"$f":"'6. Historical Wholesale'!H43","v":47837.45},{"$f":"'5. UTRs and Sub-Transmission'!G37+'5. UTRs and Sub-Transmission'!G81","v":0.78790000000000004},{"$f":"H43*I43","v":37691.126855000002},null,{"$f":"'6. Historical Wholesale'!L43","v":47837.45},{"$f":"'5. UTRs and Sub-Transmission'!G39","v":1.8018000000000001},{"$f":"L43*M43","v":86193.51741},null,{"$f":"J43+N43","v":123884.64426500001}]
[null,"February",null,{"$f":"'6. Historical Wholesale'!D44","v":49315.150000000009},{"$f":"E43","v":3.4121000000000001},{"$f":"D44*E44","v":168268.22331500004},null,{"$f":"'6. Historical Wholesale'!H44","v":50980.83},{"$f":"I43","v":0.78790000000000004},{"$f":"H44*I44","v":40167.795957000002},null,{"$f":"'6. Historical Wholesale'!L44","v":50980.83},{"$f":"M43","v":1.8018000000000001},{"$f":"L44*M44","v":91857.259494000013},null,132025.05545100002]
[null,"March",null,{"$f":"'6. Historical Wholesale'!D45","v":36964.639999999999},{"$f":"E44","v":3.4121000000000001},126127.048144,null,{"$f":"'6. Historical Wholesale'!H45","v":40349.380000000005},{"$f":"I44","v":0.78790000000000004},31791.276502000004,null,{"$f":"'6. Historical Wholesale'!L45","v":40349.380000000005},{"$f":"M44","v":1.8018000000000001},72701.512884000011,null,104492.78938600002]
[null,"April",null,{"$f":"'6. Historical Wholesale'!D46","v":34228},3.4121000000000001,116789.3588,null,{"$f":"'6. Historical Wholesale'!H46","v":36126.46},0.78790000000000004,28464.037834000002,null,{"$f":"'6. Historical Wholesale'!L46","v":36126.46},{"$f":"M45","v":1.8018000000000001},65092.655628,null,93556.693461999996]
[null,"May",null,{"$f":"'6. Historical Wholesale'!D47","v":37837.439999999995},3.4121000000000001,129105.12902399999,null,{"$f":"'6. Historical Wholesale'!H47","v":38096.479999999996},0.78790000000000004,30016.216591999997,null,{"$f":"'6. Historical Wholesale'!L47","v":38096.479999999996},1.8018000000000001,68642.237664,null,98658.454255999997]
[null,"June",null,{"$f":"'6. Historical Wholesale'!D48","v":40588.630000000005},3.4121000000000001,138492.46442300003,null,{"$f":"'6. Historical Wholesale'!H48","v":40594.400000000001},0.78790000000000004,31984.327760000004,null,{"$f":"'6. Historical Wholesale'!L48","v":40594.400000000001},1.8018000000000001,73142.989920000007,null,105127.31768000001]
[null,"July",null,{"$f":"'6. Historical Wholesale'!D49","v":48974.8},3.4121000000000001,167106.91508000001,null,{"$f":"'6. Historical Wholesale'!H49","v":48974.8},0.78790000000000004,38587.244920000005,null,{"$f":"'6. Historical Wholesale'!L49","v":48974.8},1.8018000000000001,88242.794640000007,null,126830.03956]
[null,"August",null,{"$f":"'6. Historical Wholesale'!D50","v":48999.38},3.4121000000000001,167190.78449799999,null,{"$f":"'6. Historical Wholesale'!H50","v":50218.25},0.78790000000000004,39566.959175000004,null,{"$f":"'6. Historical Wholesale'!L50","v":50218.25},1.8018000000000001,90483.24285000001,null,130050.20202500001]
[null,"September",null,{"$f":"'6. Historical Wholesale'!D51","v":39102.910000000003},3.4121000000000001,133423.03921100002,null,{"$f":"'6. Historical Wholesale'!H51","v":41214.53},0.78790000000000004,32472.928187000001,null,{"$f":"'6. Historical Wholesale'!L51","v":41214.53},1.8018000000000001,74260.340154000005,null,106733.268341]
[null,"October",null,{"$f":"'6. Historical Wholesale'!D52","v":38719.58},3.4121000000000001,132115.07891800001,null,{"$f":"'6. Historical Wholesale'!H52","v":39919.839999999997},0.78790000000000004,31452.841936000001,null,{"$f":"'6. Historical Wholesale'!L52","v":39919.839999999997},1.8018000000000001,71927.567712000004,null,103380.409648]
[null,"November",null,{"$f":"'6. Historical Wholesale'!D53","v":47999.06},3.4121000000000001,163777.592626,null,{"$f":"'6. Historical Wholesale'!H53","v":50241.05},0.78790000000000004,39584.923295000008,null,{"$f":"'6. Historical Wholesale'!L53","v":50241.05},1.8018000000000001,90524.323890000014,null,130109.24718500001]
[null,"December",null,{"$f":"'6. Historical Wholesale'!D54","v":39783.600000000006},3.4121000000000001,135745.62156000003,null,{"$f":"'6. Historical Wholesale'!H54","v":43105.009999999995},0.78790000000000004,33962.437378999995,null,{"$f":"'6. Historical Wholesale'!L54","v":43105.009999999995},1.8018000000000001,77666.607017999995,null,111629.04439699999]
[]
[null,"Total",null,{"$f":"SUM(D43:D54)","v":510199.9},{"$f":"IF(D56<>0,F56/D56,0)","v":3.4121000000000006},{"$f":"SUM(F43:F54)","v":1740853.0787900004},null,{"$f":"SUM(H43:H54)","v":527658.47999999986},{"$f":"IF(H56<>0,J56/H56,0)","v":0.78790000000000016},{"$f":"SUM(J43:J54)","v":415742.116392},null,{"$f":"SUM(L43:L54)","v":527658.47999999986},{"$f":"IF(L56<>0,N56/L56,0)","v":1.8018000000000005},{"$f":"SUM(N43:N54)","v":950735.04926400003},null,{"$f":"SUM(P43:P54)","v":1366477.1656559999}]
[]
[null,{"$f":"'6. Historical Wholesale'!B58","v":"Add Extra Host Here (I)"},null,"Network",null,null,null,"Line Connection",null,null,null,"Transformation Connection",null,null,null,"Total Line"]
[]
[null,"Month",null,"Units Billed","Rate","Amount",null,"Units Billed","Rate","Amount",null,"Units Billed","Rate","Amount",null,"Amount"]
[]
[null,"January",null,{"$f":"'6. Historical Wholesale'!D62","v":0},{"$f":"'5. UTRs and Sub-Transmission'!G50","v":0},{"$f":"D62*E62","v":0},null,{"$f":"'6. Historical Wholesale'!H62","v":0},{"$f":"'5. UTRs and Sub-Transmission'!G52","v":0},{"$f":"H62*I62","v":0},null,{"$f":"'6. Historical Wholesale'!L62","v":0},{"$f":"'5. UTRs and Sub-Transmission'!G54","v":0},{"$f":"L62*M62","v":0},null,{"$f":"J62+N62","v":0}]
[null,"February",null,{"$f":"'6. Historical Wholesale'!D63","v":0},{"$f":"E62","v":0},{"$f":"D63*E63","v":0},null,{"$f":"'6. Historical Wholesale'!H63","v":0},{"$f":"I62","v":0},{"$f":"H63*I63","v":0},null,{"$f":"'6. Historical Wholesale'!L63","v":0},{"$f":"M62","v":0},{"$f":"L63*M63","v":0},null,0]
[null,"March",null,{"$f":"'6. Historical Wholesale'!D64","v":0},{"$f":"E63","v":0},0,null,{"$f":"'6. Historical Wholesale'!H64","v":0},{"$f":"I63","v":0},0,null,{"$f":"'6. Historical Wholesale'!L64","v":0},{"$f":"M63","v":0},0,null,0]
[null,"April",null,{"$f":"'6. Historical Wholesale'!D65","v":0},0,0,null,{"$f":"'6. Historical Wholesale'!H65","v":0},0,0,null,{"$f":"'6. Historical Wholesale'!L65","v":0},{"$f":"M64","v":0},0,null,0]
[null,"May",null,{"$f":"'6. Historical Wholesale'!D66","v":0},0,0,null,{"$f":"'6. Historical Wholesale'!H66","v":0},0,0,null,{"$f":"'6. Historical Wholesale'!L66","v":0},0,0,null,0]
[null,"June",null,{"$f":"'6. Historical Wholesale'!D67","v":0},0,0,null,{"$f":"'6. Historical Wholesale'!H67","v":0},0,0,null,{"$f":"'6. Historical Wholesale'!L67","v":0},0,0,null,0]
[null,"July",null,{"$f":"'6. Historical Wholesale'!D68","v":0},0,0,null,{"$f":"'6. Historical Wholesale'!H68","v":0},0,0,null,{"$f":"'6. Historical Wholesale'!L68","v":0},0,0,null,0]
[null,"August",null,{"$f":"'6. Historical Wholesale'!D69","v":0},0,0,null,{"$f":"'6. Historical Wholesale'!H69","v":0},0,0,null,{"$f":"'6. Historical Wholesale'!L69","v":0},0,0,null,0]
[null,"September",null,{"$f":"'6. Historical Wholesale'!D70","v":0},0,0,null,{"$f":"'6. Historical Wholesale'!H70","v":0},0,0,null,{"$f":"'6. Historical Wholesale'!L70","v":0},0,0,null,0]
[null,"October",null,{"$f":"'6. Historical Wholesale'!D71","v":0},0,0,null,{"$f":"'6. Historical Wholesale'!H71","v":0},0,0,null,{"$f":"'6. Historical Wholesale'!L71","v":0},0,0,null,0]
[null,"November",null,{"$f":"'6. Historical Wholesale'!D72","v":0},0,0,null,{"$f":"'6. Historical Wholesale'!H72","v":0},0,0,null,{"$f":"'6. Historical Wholesale'!L72","v":0},0,0,null,0]
[null,"December",null,{"$f":"'6. Historical Wholesale'!D73","v":0},0,0,null,{"$f":"'6. Historical Wholesale'!H73","v":0},0,0,null,{"$f":"'6. Historical Wholesale'!L73","v":0},0,0,null,0]
[]
[null,"Total",null,{"$f":"SUM(D62:D73)","v":0},{"$f":"IF(D75<>0,F75/D75,0)","v":0},{"$f":"SUM(F62:F73)","v":0},null,{"$f":"SUM(H62:H73)","v":0},{"$f":"IF(H75<>0,J75/H75,0)","v":0},{"$f":"SUM(J62:J73)","v":0},null,{"$f":"SUM(L62:L73)","v":0},{"$f":"IF(L75<>0,N75/L75,0)","v":0},{"$f":"SUM(N62:N73)","v":0},null,{"$f":"SUM(P62:P73)","v":0}]
[]
[null,{"$f":"'6. Historical Wholesale'!B77","v":"Add Extra Host Here (II)"},null,"Network",null,null,null,"Line Connection",null,null,null,"Transformation Connection",null,null,null,"Total Line"]
[]
[null,"Month",null,"Units Billed","Rate","Amount",null,"Units Billed","Rate","Amount",null,"Units Billed","Rate","Amount",null,"Amount"]
[]
[null,"January",null,{"$f":"'6. Historical Wholesale'!D81","v":0},{"$f":"'5. UTRs and Sub-Transmission'!G65","v":0},{"$f":"D81*E81","v":0},null,{"$f":"'6. Historical Wholesale'!H81","v":0},{"$f":"'5. UTRs and Sub-Transmission'!G67","v":0},{"$f":"H81*I81","v":0},null,{"$f":"'6. Historical Wholesale'!L81","v":0},{"$f":"'5. UTRs and Sub-Transmission'!G69","v":0},{"$f":"L81*M81","v":0},null,{"$f":"J81+N81","v":0}]
[null,"February",null,{"$f":"'6. Historical Wholesale'!D82","v":0},{"$f":"E81","v":0},{"$f":"D82*E82","v":0},null,{"$f":"'6. Historical Wholesale'!H82","v":0},{"$f":"I81","v":0},{"$f":"H82*I82","v":0},null,{"$f":"'6. Historical Wholesale'!L82","v":0},{"$f":"M81","v":0},{"$f":"L82*M82","v":0},null,0]
[null,"March",null,{"$f":"'6. Historical Wholesale'!D83","v":0},{"$f":"E82","v":0},0,null,{"$f":"'6. Historical Wholesale'!H83","v":0},{"$f":"I82","v":0},0,null,{"$f":"'6. Historical Wholesale'!L83","v":0},{"$f":"M82","v":0},0,null,0]
[null,"April",null,{"$f":"'6. Historical Wholesale'!D84","v":0},0,0,null,{"$f":"'6. Historical Wholesale'!H84","v":0},0,0,null,{"$f":"'6. Historical Wholesale'!L84","v":0},{"$f":"M83","v":0},0,null,0]
[null,"May",null,{"$f":"'6. Historical Wholesale'!D85","v":0},0,0,null,{"$f":"'6. Historical Wholesale'!H85","v":0},0,0,null,{"$f":"'6. Historical Wholesale'!L85","v":0},0,0,null,0]
[null,"June",null,{"$f":"'6. Historical Wholesale'!D86","v":0},0,0,null,{"$f":"'6. Historical Wholesale'!H86","v":0},0,0,null,{"$f":"'6. Historical Wholesale'!L86","v":0},0,0,null,0]
[null,"July",null,{"$f":"'6. Historical Wholesale'!D87","v":0},0,0,null,{"$f":"'6. Historical Wholesale'!H87","v":0},0,0,null,{"$f":"'6. Historical Wholesale'!L87","v":0},0,0,null,0]
[null,"August",null,{"$f":"'6. Historical Wholesale'!D88","v":0},0,0,null,{"$f":"'6. Historical Wholesale'!H88","v":0},0,0,null,{"$f":"'6. Historical Wholesale'!L88","v":0},0,0,null,0]
[null,"September",null,{"$f":"'6. Historical Wholesale'!D89","v":0},0,0,null,{"$f":"'6. Historical Wholesale'!H89","v":0},0,0,null,{"$f":"'6. Historical Wholesale'!L89","v":0},0,0,null,0]
[null,"October",null,{"$f":"'6. Historical Wholesale'!D90","v":0},0,0,null,{"$f":"'6. Historical Wholesale'!H90","v":0},0,0,null,{"$f":"'6. Historical Wholesale'!L90","v":0},0,0,null,0]
[null,"November",null,{"$f":"'6. Historical Wholesale'!D91","v":0},0,0,null,{"$f":"'6. Historical Wholesale'!H91","v":0},0,0,null,{"$f":"'6. Historical Wholesale'!L91","v":0},0,0,null,0]
[null,"December",null,{"$f":"'6. Historical Wholesale'!D92","v":0},0,0,null,{"$f":"'6. Historical Wholesale'!H92","v":0},0,0,null,{"$f":"'6. Historical Wholesale'!L92","v":0},0,0,null,0]
[]
[null,"Total",null,{"$f":"SUM(D81:D92)","v":0},{"$f":"IF(D94<>0,F94/D94,0)","v":0},{"$f":"SUM(F81:F92)","v":0},null,{"$f":"SUM(H81:H92)","v":0},{"$f":"IF(H94<>0,J94/H94,0)","v":0},{"$f":"SUM(J81:J92)","v":0},null,{"$f":"SUM(L81:L92)","v":0},{"$f":"IF(L94<>0,N94/L94,0)","v":0},{"$f":"SUM(N81:N92)","v":0},null,{"$f":"SUM(P81:P92)","v":0}]
[]
[null,"Total",null,"Network",null,null,null,"Line Connection",null,null,null,"Transformation Connection",null,null,null,"Total Line"]
[]
[null,"Month",null,"Units Billed","Rate","Amount",null,"Units Billed","Rate","Amount",null,"Units Billed","Rate","Amount",null,"Amount"]
[]
[null,"January",null,{"$f":"D24+D43+D62+D81","v":47686.71},{"$f":"IF(D100<>0,F100/D100,0)","v":3.4121000000000001},{"$f":"F24+F43+F62+F81","v":162711.823191},null,{"$f":"H24+H43+H62+H81","v":47837.45},{"$f":"IF(H100<>0,J100/H100,0)","v":0.78790000000000004},{"$f":"J24+J43+J62+J81","v":37691.126855000002},null,{"$f":"L24+L43+L62+L81","v":47837.45},{"$f":"IF(L100<>0,N100/L100,0)","v":1.8018000000000001},{"$f":"N24+N43+N62+N81","v":86193.51741},null,{"$f":"J100+N100","v":123884.64426500001}]
[null,"February",null,{"$f":"D25+D44+D63+D82","v":49315.150000000009},3.4121000000000001,{"$f":"F25+F44+F63+F82","v":168268.22331500004},null,{"$f":"H25+H44+H63+H82","v":50980.83},0.78790000000000004,{"$f":"J25+J44+J63+J82","v":40167.795957000002},null,{"$f":"L25+L44+L63+L82","v":50980.83},1.8018000000000003,{"$f":"N25+N44+N63+N82","v":91857.259494000013},null,132025.05545100002]
[null,"March",null,36964.639999999999,3.4121000000000001,126127.048144,null,40349.380000000005,0.78790000000000004,31791.276502000004,null,40349.380000000005,1.8018000000000001,72701.512884000011,null,104492.78938600002]
[null,"April",null,34228,3.4121000000000001,116789.3588,null,36126.46,0.78790000000000004,28464.037834000002,null,36126.46,1.8018000000000001,65092.655628,null,93556.693461999996]
[null,"May",null,37837.439999999995,3.4121000000000001,129105.12902399999,null,38096.479999999996,0.78790000000000004,30016.216591999997,null,38096.479999999996,1.8018000000000003,68642.237664,null,98658.454255999997]
[null,"June",null,40588.630000000005,3.4121000000000001,138492.46442300003,null,40594.400000000001,0.78790000000000004,31984.327760000004,null,40594.400000000001,1.8018000000000001,73142.989920000007,null,105127.31768000001]
[null,"July",null,48974.8,3.4121000000000001,167106.91508000001,null,48974.8,0.78790000000000004,38587.244920000005,null,48974.8,1.8018000000000001,88242.794640000007,null,126830.03956]
[null,"August",null,48999.38,3.4121000000000001,167190.78449799999,null,50218.25,0.78790000000000004,39566.959175000004,null,50218.25,1.8018000000000003,90483.24285000001,null,130050.20202500001]
[null,"September",null,39102.910000000003,3.4121000000000001,133423.03921100002,null,41214.53,0.78790000000000004,32472.928187000001,null,41214.53,1.8018000000000001,74260.340154000005,null,106733.268341]
[null,"October",null,38719.58,3.4121000000000001,132115.07891800001,null,39919.839999999997,0.78790000000000004,31452.841936000001,null,39919.839999999997,1.8018000000000003,71927.567712000004,null,103380.409648]
[null,"November",null,47999.06,3.4121000000000001,163777.592626,null,50241.05,0.78790000000000016,39584.923295000008,null,50241.05,1.8018000000000001,90524.323890000014,null,130109.24718500001]
[null,"December",null,39783.600000000006,3.4121000000000001,135745.62156000003,null,43105.009999999995,0.78790000000000004,33962.437378999995,null,43105.009999999995,1.8018000000000001,77666.607017999995,null,111629.04439699999]
[]
[null,"Total",null,{"$f":"SUM(D100:D111)","v":510199.9},{"$f":"IF(D113<>0,F113/D113,0)","v":3.4121000000000006},{"$f":"SUM(F100:F111)","v":1740853.0787900004},null,{"$f":"SUM(H100:H111)","v":527658.47999999986},{"$f":"IF(H113<>0,J113/H113,0)","v":0.78790000000000016},{"$f":"SUM(J100:J111)","v":415742.116392},null,{"$f":"SUM(L100:L111)","v":527658.47999999986},{"$f":"IF(L113<>0,N113/L113,0)","v":1.8018000000000005},{"$f":"SUM(N100:N111)","v":950735.04926400003},null,{"$f":"SUM(P100:P111)","v":1366477.1656559999}]
[]
[null,null,null,null,null,null,null,null,null,null,null,null,null,"Low Voltage Switchgear Credit (if applicable)",null,{"$f":"'5. UTRs and Sub-Transmission'!G95","v":0}]
[]
[null,null,null,null,null,null,null,null,null,null,null,null,null,"Total including deduction for Low Voltage Switchgear Credit",null,{"$f":"P113+P115","v":1366477.1656559999}]

{"sheet":"8. Forecast Wholesale","index":7,"n_rows":117,"n_cols":16,"rows_kept":117,"cut":false,"hidden":false,"merged":[[96,7,96,9],[96,11,96,13],[20,3,20,5],[20,7,20,9],[20,11,20,13],[96,3,96,5],[95,3,95,5],[95,7,95,9],[95,11,95,13],[57,3,57,5],[57,7,57,9],[57,11,57,13],[76,3,76,5],[76,7,76,9],[76,11,76,13],[12,1,12,12],[19,3,19,5],[19,7,19,9],[19,11,19,13],[38,3,38,5],[38,7,38,9],[38,11,38,13]]}
[]
[]
[]
[]
[]
[]
[]
[]
[]
[]
[]
[]
[null,"The purpose of this sheet is to calculate the expected billing when forecasted 2016 Uniform Transmission Rates are applied against historical 2014 transmission units."]
[]
[]
[]
[]
[]
[]
[null,"IESO",null,"Network",null,null,null,"Line Connection",null,null,null,"Transformation Connection",null,null,null,"Total Line"]
[]
[null,"Month",null,"Units Billed","Rate","Amount",null,"Units Billed","Rate","Amount",null,"Units Billed","Rate","Amount",null,"Amount"]
[]
[null,"January",null,{"$f":"'6. Historical Wholesale'!D24","v":0},{"$f":"'5. UTRs and Sub-Transmission'!I22","v":3.78},{"$f":"D24*E24","v":0},null,{"$f":"'6. Historical Wholesale'!H24","v":0},{"$f":"'5. UTRs and Sub-Transmission'!I24","v":0.86},{"$f":"H24*I24","v":0},null,{"$f":"'6. Historical Wholesale'!L24","v":0},{"$f":"'5. UTRs and Sub-Transmission'!I26","v":2},{"$f":"L24*M24","v":0},null,{"$f":"J24+N24","v":0}]
[null,"February",null,{"$f":"'6. Historical Wholesale'!D25","v":0},{"$f":"E24","v":3.78},0,null,{"$f":"'6. Historical Wholesale'!H25","v":0},{"$f":"I24","v":0.86},0,null,{"$f":"'6. Historical Wholesale'!L25","v":0},{"$f":"M24","v":2},0,null,0]
[null,"March",null,{"$f":"'6. Historical Wholesale'!D26","v":0},3.78,0,null,{"$f":"'6. Historical Wholesale'!H26","v":0},0.86,0,null,{"$f":"'6. Historical Wholesale'!L26","v":0},2,0,null,0]
[null,"April",null,{"$f":"'6. Historical Wholesale'!D27","v":0},3.78,0,null,{"$f":"'6. Historical Wholesale'!H27","v":0},0.86,0,null,{"$f":"'6. Historical Wholesale'!L27","v":0},2,0,null,0]
[null,"May",null,{"$f":"'6. Historical Wholesale'!D28","v":0},3.78,0,null,{"$f":"'6. Historical Wholesale'!H28","v":0},0.86,0,null,{"$f":"'6. Historical Wholesale'!L28","v":0},2,0,null,0]
[null,"June",null,{"$f":"'6. Historical Wholesale'!D29","v":0},3.78,0,null,{"$f":"'6. Historical Wholesale'!H29","v":0},0.86,0,null,{"$f":"'6. Historical Wholesale'!L29","v":0},2,0,null,0]
[null,"July",null,{"$f":"'6. Historical Wholesale'!D30","v":0},3.78,0,null,{"$f":"'6. Historical Wholesale'!H30","v":0},0.86,0,null,{"$f":"'6. Historical Wholesale'!L30","v":0},2,0,null,0]
[null,"August",null,{"$f":"'6. Historical Wholesale'!D31","v":0},3.78,0,null,{"$f":"'6. Historical Wholesale'!H31","v":0},0.86,0,null,{"$f":"'6. Historical Wholesale'!L31","v":0},2,0,null,0]
[null,"September",null,{"$f":"'6. Historical Wholesale'!D32","v":0},3.78,0,null,{"$f":"'6. Historical Wholesale'!H32","v":0},0.86,0,null,{"$f":"'6. Historical Wholesale'!L32","v":0},2,0,null,0]
[null,"October",null,{"$f":"'6. Historical Wholesale'!D33","v":0},3.78,0,null,{"$f":"'6. Historical Wholesale'!H33","v":0},0.86,0,null,{"$f":"'6. Historical Wholesale'!L33","v":0},2,0,null,0]
[null,"November",null,{"$f":"'6. Historical Wholesale'!D34","v":0},3.78,0,null,{"$f":"'6. Historical Wholesale'!H34","v":0},0.86,0,null,{"$f":"'6. Historical Wholesale'!L34","v":0},2,0,null,0]
[null,"December",null,{"$f":"'6. Historical Wholesale'!D35","v":0},3.78,0,null,{"$f":"'6. Historical Wholesale'!H35","v":0},0.86,0,null,{"$f":"'6. Historical Wholesale'!L35","v":0},2,0,null,0]
[]
[null,"Total",null,{"$f":"SUM(D24:D35)","v":0},{"$f":"IF(D37<>0,F37/D37,0)","v":0},{"$f":"SUM(F24:F35)","v":0},null,{"$f":"SUM(H24:H35)","v":0},{"$f":"IF(H37<>0,J37/H37,0)","v":0},{"$f":"SUM(J24:J35)","v":0},null,{"$f":"SUM(L24:L35)","v":0},{"$f":"IF(L37<>0,N37/L37,0)","v":0},{"$f":"SUM(N24:N35)","v":0},null,{"$f":"SUM(P24:P35)","v":0}]
[]
[null,"Hydro One",null,"Network",null,null,null,"Line Connection",null,null,null,"Transformation Connection",null,null,null,"Total Line"]
[]
[null,"Month",null,"Units Billed","Rate","Amount",null,"Units Billed","Rate","Amount",null,"Units Billed","Rate","Amount",null,"Amount"]
[]
[null,"January",null,{"$f":"'6. Historical Wholesale'!D43","v":47686.71},{"$f":"'5. UTRs and Sub-Transmission'!I35+'5. UTRs and Sub-Transmission'!I79","v":3.66},{"$f":"D43*E43","v":174533.35860000001},null,{"$f":"'6. Historical Wholesale'!H43","v":47837.45},{"$f":"'5. UTRs and Sub-Transmission'!I37+'5. UTRs and Sub-Transmission'!I81","v":0.87},{"$f":"H43*I43","v":41618.5815},null,{"$f":"'6. Historical Wholesale'!L43","v":47837.45},{"$f":"'5. UTRs and Sub-Transmission'!I39","v":2.02},{"$f":"L43*M43","v":96631.64899999999},null,{"$f":"J43+N43","v":138250.23050000001}]
[null,"February",null,{"$f":"'6. Historical Wholesale'!D44","v":49315.150000000009},{"$f":"E43","v":3.66},180493.44900000005,null,{"$f":"'6. Historical Wholesale'!H44","v":50980.83},{"$f":"I43","v":0.87},44353.322100000005,null,{"$f":"'6. Historical Wholesale'!L44","v":50980.83},{"$f":"M43","v":2.02},102981.2766,null,147334.5987]
[null,"March",null,{"$f":"'6. Historical Wholesale'!D45","v":36964.639999999999},3.66,135290.58240000001,null,{"$f":"'6. Historical Wholesale'!H45","v":40349.380000000005},0.87,35103.960600000006,null,{"$f":"'6. Historical Wholesale'!L45","v":40349.380000000005},2.02,81505.747600000017,null,116609.70820000002]
[null,"April",null,{"$f":"'6. Historical Wholesale'!D46","v":34228},3.66,125274.48000000001,null,{"$f":"'6. Historical Wholesale'!H46","v":36126.46},0.87,31430.020199999999,null,{"$f":"'6. Historical Wholesale'!L46","v":36126.46},2.02,72975.449200000003,null,104405.4694]
[null,"May",null,{"$f":"'6. Historical Wholesale'!D47","v":37837.439999999995},3.66,138485.03039999999,null,{"$f":"'6. Historical Wholesale'!H47","v":38096.479999999996},0.87,33143.937599999997,null,{"$f":"'6. Historical Wholesale'!L47","v":38096.479999999996},2.02,76954.889599999995,null,110098.8272]
[null,"June",null,{"$f":"'6. Historical Wholesale'!D48","v":40588.630000000005},3.66,148554.38580000002,null,{"$f":"'6. Historical Wholesale'!H48","v":40594.400000000001},0.87,35317.128000000004,null,{"$f":"'6. Historical Wholesale'!L48","v":40594.400000000001},2.02,82000.688000000009,null,117317.81600000002]
[null,"July",null,{"$f":"'6. Historical Wholesale'!D49","v":48974.8},3.66,179247.76800000001,null,{"$f":"'6. Historical Wholesale'!H49","v":48974.8},0.87,42608.076000000001,null,{"$f":"'6. Historical Wholesale'!L49","v":48974.8},2.02,98929.096000000005,null,141537.17200000002]
[null,"August",null,{"$f":"'6. Historical Wholesale'!D50","v":48999.38},3.66,179337.73079999999,null,{"$f":"'6. Historical Wholesale'!H50","v":50218.25},0.87,43689.877500000002,null,{"$f":"'6. Historical Wholesale'!L50","v":50218.25},2.02,101440.86500000001,null,145130.74249999999]
[null,"September",null,{"$f":"'6. Historical Wholesale'!D51","v":39102.910000000003},3.66,143116.65060000002,null,{"$f":"'6. Historical Wholesale'!H51","v":41214.53},0.87,35856.641100000001,null,{"$f":"'6. Historical Wholesale'!L51","v":41214.53},2.02,83253.350600000005,null,119109.99170000001]
[null,"October",null,{"$f":"'6. Historical Wholesale'!D52","v":38719.58},3.66,141713.66280000002,null,{"$f":"'6. Historical Wholesale'!H52","v":39919.839999999997},0.87,34730.260799999996,null,{"$f":"'6. Historical Wholesale'!L52","v":39919.839999999997},2.02,80638.076799999995,null,115368.3376]
[null,"November",null,{"$f":"'6. Historical Wholesale'!D53","v":47999.06},3.66,175676.55960000001,null,{"$f":"'6. Historical Wholesale'!H53","v":50241.05},0.87,43709.713500000005,null,{"$f":"'6. Historical Wholesale'!L53","v":50241.05},2.02,101486.921,null,145196.63450000001]
[null,"December",null,{"$f":"'6. Historical Wholesale'!D54","v":39783.600000000006},3.66,145607.97600000002,null,{"$f":"'6. Historical Wholesale'!H54","v":43105.009999999995},0.87,37501.358699999997,null,{"$f":"'6. Historical Wholesale'!L54","v":43105.009999999995},2.02,87072.12019999999,null,124573.47889999999]
[]
[null,"Total",null,{"$f":"SUM(D43:D54)","v":510199.9},{"$f":"IF(D56<>0,F56/D56,0)","v":3.6600000000000006},{"$f":"SUM(F43:F54)","v":1867331.6340000003},null,{"$f":"SUM(H43:H54)","v":527658.47999999986},{"$f":"IF(H56<>0,J56/H56,0)","v":0.87000000000000022},{"$f":"SUM(J43:J54)","v":459062.87760000001},null,{"$f":"SUM(L43:L54)","v":527658.47999999986},{"$f":"IF(L56<>0,N56/L56,0)","v":2.0200000000000005},{"$f":"SUM(N43:N54)","v":1065870.1295999999},null,{"$f":"SUM(P43:P54)","v":1524933.0071999999}]
[]
[null,{"$f":"'6. Historical Wholesale'!B58","v":"Add Extra Host Here (I)"},null,"Network",null,null,null,"Line Connection",null,null,null,"Transformation Connection",null,null,null,"Total Line"]
[]
[null,"Month",null,"Units Billed","Rate","Amount",null,"Units Billed","Rate","Amount",null,"Units Billed","Rate","Amount",null,"Amount"]
[]
[null,"January",null,{"$f":"'6. Historical Wholesale'!D62","v":0},{"$f":"'5. UTRs and Sub-Transmission'!I50","v":0},{"$f":"D62*E62","v":0},null,{"$f":"'6. Historical Wholesale'!H62","v":0},{"$f":"'5. UTRs and Sub-Transmission'!I52","v":0},{"$f":"H62*I62","v":0},null,{"$f":"'6. Historical Wholesale'!L62","v":0},{"$f":"'5. UTRs and Sub-Transmission'!I54","v":0},{"$f":"L62*M62","v":0},null,{"$f":"J62+N62","v":0}]
[null,"February",null,{"$f":"'6. Historical Wholesale'!D63","v":0},{"$f":"E62","v":0},0,null,{"$f":"'6. Historical Wholesale'!H63","v":0},{"$f":"I62","v":0},0,null,{"$f":"'6. Historical Wholesale'!L63","v":0},{"$f":"M62","v":0},0,null,0]
[null,"March",null,{"$f":"'6. Historical Wholesale'!D64","v":0},0,0,null,{"$f":"'6. Historical Wholesale'!H64","v":0},0,0,null,{"$f":"'6. Historical Wholesale'!L64","v":0},0,0,null,0]
[null,"April",null,{"$f":"'6. Historical Wholesale'!D65","v":0},0,0,null,{"$f":"'6. Historical Wholesale'!H65","v":0},0,0,null,{"$f":"'6. Historical Wholesale'!L65","v":0},0,0,null,0]
[null,"May",null,{"$f":"'6. Historical Wholesale'!D66","v":0},0,0,null,{"$f":"'6. Historical Wholesale'!H66","v":0},0,0,null,{"$f":"'6. Historical Wholesale'!L66","v":0},0,0,null,0]
[null,"June",null,{"$f":"'6. Historical Wholesale'!D67","v":0},0,0,null,{"$f":"'6. Historical Wholesale'!H67","v":0},0,0,null,{"$f":"'6. Historical Wholesale'!L67","v":0},0,0,null,0]
[null,"July",null,{"$f":"'6. Historical Wholesale'!D68","v":0},0,0,null,{"$f":"'6. Historical Wholesale'!H68","v":0},0,0,null,{"$f":"'6. Historical Wholesale'!L68","v":0},0,0,null,0]
[null,"August",null,{"$f":"'6. Historical Wholesale'!D69","v":0},0,0,null,{"$f":"'6. Historical Wholesale'!H69","v":0},0,0,null,{"$f":"'6. Historical Wholesale'!L69","v":0},0,0,null,0]
[null,"September",null,{"$f":"'6. Historical Wholesale'!D70","v":0},0,0,null,{"$f":"'6. Historical Wholesale'!H70","v":0},0,0,null,{"$f":"'6. Historical Wholesale'!L70","v":0},0,0,null,0]
[null,"October",null,{"$f":"'6. Historical Wholesale'!D71","v":0},0,0,null,{"$f":"'6. Historical Wholesale'!H71","v":0},0,0,null,{"$f":"'6. Historical Wholesale'!L71","v":0},0,0,null,0]
[null,"November",null,{"$f":"'6. Historical Wholesale'!D72","v":0},0,0,null,{"$f":"'6. Historical Wholesale'!H72","v":0},0,0,null,{"$f":"'6. Historical Wholesale'!L72","v":0},0,0,null,0]
[null,"December",null,{"$f":"'6. Historical Wholesale'!D73","v":0},0,0,null,{"$f":"'6. Historical Wholesale'!H73","v":0},0,0,null,{"$f":"'6. Historical Wholesale'!L73","v":0},0,0,null,0]
[]
[null,"Total",null,{"$f":"SUM(D62:D73)","v":0},{"$f":"IF(D75<>0,F75/D75,0)","v":0},{"$f":"SUM(F62:F73)","v":0},null,{"$f":"SUM(H62:H73)","v":0},{"$f":"IF(H75<>0,J75/H75,0)","v":0},{"$f":"SUM(J62:J73)","v":0},null,{"$f":"SUM(L62:L73)","v":0},{"$f":"IF(L75<>0,N75/L75,0)","v":0},{"$f":"SUM(N62:N73)","v":0},null,{"$f":"SUM(P62:P73)","v":0}]
[]
[null,{"$f":"'6. Historical Wholesale'!B77","v":"Add Extra Host Here (II)"},null,"Network",null,null,null,"Line Connection",null,null,null,"Transformation Connection",null,null,null,"Total Line"]
[]
[null,"Month",null,"Units Billed","Rate","Amount",null,"Units Billed","Rate","Amount",null,"Units Billed","Rate","Amount",null,"Amount"]
[]
[null,"January",null,{"$f":"'6. Historical Wholesale'!D81","v":0},{"$f":"'5. UTRs and Sub-Transmission'!I65","v":0},{"$f":"D81*E81","v":0},null,{"$f":"'6. Historical Wholesale'!H81","v":0},{"$f":"'5. UTRs and Sub-Transmission'!I67","v":0},{"$f":"H81*I81","v":0},null,{"$f":"'6. Historical Wholesale'!L81","v":0},{"$f":"'5. UTRs and Sub-Transmission'!I69","v":0},{"$f":"L81*M81","v":0},null,{"$f":"J81+N81","v":0}]
[null,"February",null,{"$f":"'6. Historical Wholesale'!D82","v":0},{"$f":"E81","v":0},0,null,{"$f":"'6. Historical Wholesale'!H82","v":0},{"$f":"I81","v":0},0,null,{"$f":"'6. Historical Wholesale'!L82","v":0},{"$f":"M81","v":0},0,null,0]
[null,"March",null,{"$f":"'6. Historical Wholesale'!D83","v":0},0,0,null,{"$f":"'6. Historical Wholesale'!H83","v":0},0,0,null,{"$f":"'6. Historical Wholesale'!L83","v":0},0,0,null,0]
[null,"April",null,{"$f":"'6. Historical Wholesale'!D84","v":0},0,0,null,{"$f":"'6. Historical Wholesale'!H84","v":0},0,0,null,{"$f":"'6. Historical Wholesale'!L84","v":0},0,0,null,0]
[null,"May",null,{"$f":"'6. Historical Wholesale'!D85","v":0},0,0,null,{"$f":"'6. Historical Wholesale'!H85","v":0},0,0,null,{"$f":"'6. Historical Wholesale'!L85","v":0},0,0,null,0]
[null,"June",null,{"$f":"'6. Historical Wholesale'!D86","v":0},0,0,null,{"$f":"'6. Historical Wholesale'!H86","v":0},0,0,null,{"$f":"'6. Historical Wholesale'!L86","v":0},0,0,null,0]
[null,"July",null,{"$f":"'6. Historical Wholesale'!D87","v":0},0,0,null,{"$f":"'6. Historical Wholesale'!H87","v":0},0,0,null,{"$f":"'6. Historical Wholesale'!L87","v":0},0,0,null,0]
[null,"August",null,{"$f":"'6. Historical Wholesale'!D88","v":0},0,0,null,{"$f":"'6. Historical Wholesale'!H88","v":0},0,0,null,{"$f":"'6. Historical Wholesale'!L88","v":0},0,0,null,0]
[null,"September",null,{"$f":"'6. Historical Wholesale'!D89","v":0},0,0,null,{"$f":"'6. Historical Wholesale'!H89","v":0},0,0,null,{"$f":"'6. Historical Wholesale'!L89","v":0},0,0,null,0]
[null,"October",null,{"$f":"'6. Historical Wholesale'!D90","v":0},0,0,null,{"$f":"'6. Historical Wholesale'!H90","v":0},0,0,null,{"$f":"'6. Historical Wholesale'!L90","v":0},0,0,null,0]
[null,"November",null,{"$f":"'6. Historical Wholesale'!D91","v":0},0,0,null,{"$f":"'6. Historical Wholesale'!H91","v":0},0,0,null,{"$f":"'6. Historical Wholesale'!L91","v":0},0,0,null,0]
[null,"December",null,{"$f":"'6. Historical Wholesale'!D92","v":0},0,0,null,{"$f":"'6. Historical Wholesale'!H92","v":0},0,0,null,{"$f":"'6. Historical Wholesale'!L92","v":0},0,0,null,0]
[]
[null,"Total",null,{"$f":"SUM(D81:D92)","v":0},{"$f":"IF(D94<>0,F94/D94,0)","v":0},{"$f":"SUM(F81:F92)","v":0},null,{"$f":"SUM(H81:H92)","v":0},{"$f":"IF(H94<>0,J94/H94,0)","v":0},{"$f":"SUM(J81:J92)","v":0},null,{"$f":"SUM(L81:L92)","v":0},{"$f":"IF(L94<>0,N94/L94,0)","v":0},{"$f":"SUM(N81:N92)","v":0},null,{"$f":"SUM(P81:P92)","v":0}]
[]
[null,"Total",null,"Network",null,null,null,"Line Connection",null,null,null,"Transformation Connection",null,null,null,"Total Line"]
[]
[null,"Month",null,"Units Billed","Rate","Amount",null,"Units Billed","Rate","Amount",null,"Units Billed","Rate","Amount",null,"Amount"]
[]
[null,"January",null,{"$f":"D24+D43+D62+D81","v":47686.71},{"$f":"IF(D100<>0,F100/D100,0)","v":3.66},{"$f":"F24+F43+F62+F81","v":174533.35860000001},null,{"$f":"H24+H43+H62+H81","v":47837.45},{"$f":"IF(H100<>0,J100/H100,0)","v":0.87000000000000011},{"$f":"J24+J43+J62+J81","v":41618.5815},null,{"$f":"L24+L43+L62+L81","v":47837.45},{"$f":"IF(L100<>0,N100/L100,0)","v":2.02},{"$f":"N24+N43+N62+N81","v":96631.64899999999},null,{"$f":"J100+N100","v":138250.23050000001}]
[null,"February",null,{"$f":"D25+D44+D63+D82","v":49315.150000000009},3.6600000000000006,180493.44900000005,null,{"$f":"H25+H44+H63+H82","v":50980.83},0.87000000000000011,{"$f":"J25+J44+J63+J82","v":44353.322100000005},null,{"$f":"L25+L44+L63+L82","v":50980.83},2.02,{"$f":"N25+N44+N63+N82","v":102981.2766},null,147334.5987]
[null,"March",null,36964.639999999999,3.6600000000000006,135290.58240000001,null,{"$f":"H26+H45+H64+H83","v":40349.380000000005},0.87,{"$f":"J26+J45+J64+J83","v":35103.960600000006},null,{"$f":"L26+L45+L64+L83","v":40349.380000000005},2.02,{"$f":"N26+N45+N64+N83","v":81505.747600000017},null,116609.70820000002]
[null,"April",null,34228,3.66,125274.48000000001,null,{"$f":"H27+H46+H65+H84","v":36126.46},0.87,{"$f":"J27+J46+J65+J84","v":31430.020199999999},null,{"$f":"L27+L46+L65+L84","v":36126.46},2.02,{"$f":"N27+N46+N65+N84","v":72975.449200000003},null,104405.4694]
[null,"May",null,37837.439999999995,3.66,138485.03039999999,null,{"$f":"H28+H47+H66+H85","v":38096.479999999996},0.87,{"$f":"J28+J47+J66+J85","v":33143.937599999997},null,{"$f":"L28+L47+L66+L85","v":38096.479999999996},2.02,{"$f":"N28+N47+N66+N85","v":76954.889599999995},null,110098.8272]
[null,"June",null,40588.630000000005,3.66,148554.38580000002,null,{"$f":"H29+H48+H67+H86","v":40594.400000000001},0.87000000000000011,{"$f":"J29+J48+J67+J86","v":35317.128000000004},null,{"$f":"L29+L48+L67+L86","v":40594.400000000001},2.02,{"$f":"N29+N48+N67+N86","v":82000.688000000009},null,117317.81600000002]
[null,"July",null,48974.8,3.66,179247.76800000001,null,{"$f":"H30+H49+H68+H87","v":48974.8},0.87,{"$f":"J30+J49+J68+J87","v":42608.076000000001},null,{"$f":"L30+L49+L68+L87","v":48974.8},2.02,{"$f":"N30+N49+N68+N87","v":98929.096000000005},null,141537.17200000002]
[null,"August",null,48999.38,3.66,179337.73079999999,null,{"$f":"H31+H50+H69+H88","v":50218.25},0.87,{"$f":"J31+J50+J69+J88","v":43689.877500000002},null,{"$f":"L31+L50+L69+L88","v":50218.25},2.02,{"$f":"N31+N50+N69+N88","v":101440.86500000001},null,145130.74249999999]
[null,"September",null,39102.910000000003,3.66,143116.65060000002,null,{"$f":"H32+H51+H70+H89","v":41214.53},0.87,{"$f":"J32+J51+J70+J89","v":35856.641100000001},null,{"$f":"L32+L51+L70+L89","v":41214.53},2.02,{"$f":"N32+N51+N70+N89","v":83253.350600000005},null,119109.99170000001]
[null,"October",null,38719.58,3.66,141713.66280000002,null,{"$f":"H33+H52+H71+H90","v":39919.839999999997},0.87,{"$f":"J33+J52+J71+J90","v":34730.260799999996},null,{"$f":"L33+L52+L71+L90","v":39919.839999999997},2.02,{"$f":"N33+N52+N71+N90","v":80638.076799999995},null,115368.3376]
[null,"November",null,47999.06,3.66,175676.55960000001,null,{"$f":"H34+H53+H72+H91","v":50241.05},0.87000000000000011,{"$f":"J34+J53+J72+J91","v":43709.713500000005},null,{"$f":"L34+L53+L72+L91","v":50241.05},2.02,{"$f":"N34+N53+N72+N91","v":101486.921},null,145196.63450000001]
[null,"December",null,39783.600000000006,3.66,145607.97600000002,null,{"$f":"H35+H54+H73+H92","v":43105.009999999995},0.87,{"$f":"J35+J54+J73+J92","v":37501.358699999997},null,{"$f":"L35+L54+L73+L92","v":43105.009999999995},2.02,{"$f":"N35+N54+N73+N92","v":87072.12019999999},null,124573.47889999999]
[]
[null,"Total",null,{"$f":"SUM(D100:D111)","v":510199.9},{"$f":"IF(D113<>0,F113/D113,0)","v":3.6600000000000006},{"$f":"SUM(F100:F111)","v":1867331.6340000003},null,{"$f":"SUM(H100:H111)","v":527658.47999999986},{"$f":"IF(H113<>0,J113/H113,0)","v":0.87000000000000022},{"$f":"SUM(J100:J111)","v":459062.87760000001},null,{"$f":"SUM(L100:L111)","v":527658.47999999986},{"$f":"IF(L113<>0,N113/L113,0)","v":2.0200000000000005},{"$f":"SUM(N100:N111)","v":1065870.1295999999},null,{"$f":"SUM(P100:P111)","v":1524933.0071999999}]
[]
[null,null,null,null,null,null,null,null,null,null,null,null,null,"Low Voltage Switchgear Credit (if applicable)",null,{"$f":"'5. UTRs and Sub-Transmission'!I95","v":0}]
[]
[null,null,null,null,null,null,null,null,null,null,null,null,null,"Total including deduction for Low Voltage Switchgear Credit",null,{"$f":"P113+P115","v":1524933.0071999999}]

{"sheet":"9. RTSR Rates to Forecast","index":8,"n_rows":56,"n_cols":10,"rows_kept":56,"cut":false,"hidden":false,"merged":[]}
[]
[]
[]
[]
[]
[]
[]
[]
[]
[]
[]
[]
["The purpose of this sheet is to re-align the current RTS Network Rates to recover current wholesale network costs."]
[]
["Rate Class","Rate Description","Unit","Current RTSR-Network","Loss Adjusted Billed kWh","Billed kW","Billed Amount","Billed Amount %","Current Wholesale Billing","Adjusted RTSR Network"]
[]
["Residential","RTSR - Network","kWh",5.7000000000000002E-3,159434853.8696,null,{"$f":"ROUND(D17*E17, 2)","v":908778.67},{"$f":"G17/1392349.53","v":0.65269434895417389},{"$f":"H17*total_current_wholesale_network","v":1136244.9668857085},{"$f":"IF(ISERROR(I17/E17), 0, I17/E17)","v":7.1267037244881889E-3}]
["General Service Less Than 50 kW","RTSR - Network","kWh",5.1999999999999998E-3,36017209.001000002,null,{"$f":"ROUND(D18*E18, 2)","v":187289.49},{"$f":"G18/1392349.53","v":0.13451327124734261},{"$f":"H18*total_current_wholesale_network","v":234167.84238905081},{"$f":"IF(ISERROR(I18/E18), 0, I18/E18)","v":6.5015543648190297E-3}]
["General Service 50 to 4,999 kW","RTSR - Network","kW",2.0385,null,66619,{"$f":"ROUND(D19*F19, 2)","v":135802.82999999999},{"$f":"G19/1392349.53","v":9.753501335257389E-2},{"$f":"H19*total_current_wholesale_network","v":169794.12828465205},{"$f":"IF(ISERROR(I19/F19), 0, I19/F19)","v":2.5487342692723103}]
["General Service 50 to 4,999 kW – Interval Metered","RTSR - Network","kW",2.0385,null,74982,{"$f":"ROUND(D20*F20, 2)","v":152850.81},{"$f":"G20/1392349.53","v":0.10977905095425285},{"$f":"H20*total_current_wholesale_network","v":191109.19884035541},{"$f":"IF(ISERROR(I20/F20), 0, I20/F20)","v":2.5487343474481263}]
["Unmetered Scattered Load","RTSR - Network","kWh",5.1999999999999998E-3,494489.63760000002,null,{"$f":"ROUND(D21*E21, 2)","v":2571.35},{"$f":"G21/1392349.53","v":1.8467704729285899E-3},{"$f":"H21*total_current_wholesale_network","v":3214.9560636162009},{"$f":"IF(ISERROR(I21/E21), 0, I21/E21)","v":6.5015640756800374E-3}]
["Sentinel Lighting","RTSR - Network","kW",1.5953999999999999,null,298,{"$f":"ROUND(D22*F22, 2)","v":475.43},{"$f":"G22/1392349.53","v":3.4145880021951098E-4},{"$f":"H22*total_current_wholesale_network","v":594.42960364207534},{"$f":"IF(ISERROR(I22/F22), 0, I22/F22)","v":1.9947302135640113}]
["Street Lighting","RTSR - Network","kW",1.5872999999999999,null,2886,{"$f":"ROUND(D23*F23, 2)","v":4580.95},{"$f":"G23/1392349.53","v":3.2900862185086524E-3},{"$f":"H23*total_current_wholesale_network","v":5727.5567229753378},{"$f":"IF(ISERROR(I23/F23), 0, I23/F23)","v":1.9846003891113437}]
[]
["The purpose of this table is to re-align the current RTS Connection Rates to recover current wholesale connection costs."]
["Rate Class","Rate Description","Unit","Current RTSR-Connection","Loss Adjusted Billed kWh","Billed kW","Billed Amount","Billed Amount %","Current Wholesale Billing","Adjusted RTSR-Connection"]
[]
["Residential","RTSR - Connection","kWh",4.1000000000000003E-3,159434853.8696,null,{"$f":"ROUND(D28*E28, 2)","v":653682.9},{"$f":"G28/1107976.5","v":0.58997902933861868},{"$f":"H28*Total_Current_Wholesale_Lineplus","v":806192.87180711364},{"$f":"IF(ISERROR(I28/E28), 0, I28/E28)","v":5.0565660659524919E-3}]
["General Service Less Than 50 kW","RTSR - Connection","kWh",3.8999999999999998E-3,36017209.001000002,null,{"$f":"ROUND(D29*E29, 2)","v":140467.12},{"$f":"G29/1107976.5","v":0.12677806794638694},{"$f":"H29*Total_Current_Wholesale_Lineplus","v":173239.33495472258},{"$f":"IF(ISERROR(I29/E29), 0, I29/E29)","v":4.8099044806584725E-3}]
["General Service 50 to 4,999 kW","RTSR - Connection","kW",2.1757,null,66619,{"$f":"ROUND(D30*F30, 2)","v":144942.96},{"$f":"G30/1107976.5","v":0.13081772041194015},{"$f":"H30*Total_Current_Wholesale_Lineplus","v":178759.42780608701},{"$f":"IF(ISERROR(I30/F30), 0, I30/F30)","v":2.6833099837296719}]
["General Service 50 to 4,999 kW – Interval Metered","RTSR - Connection","kW",2.1757,null,74982,{"$f":"ROUND(D31*F31, 2)","v":163138.34},{"$f":"G31/1107976.5","v":0.14723989182081026},{"$f":"H31*Total_Current_Wholesale_Lineplus","v":201199.95004679685},{"$f":"IF(ISERROR(I31/F31), 0, I31/F31)","v":2.6833099950227632}]
["Unmetered Scattered Load","RTSR - Connection","kWh",3.8999999999999998E-3,494489.63760000002,null,{"$f":"ROUND(D32*E32, 2)","v":1928.51},{"$f":"G32/1107976.5","v":1.7405694073836402E-3},{"$f":"H32*Total_Current_Wholesale_Lineplus","v":2378.4483504291402},{"$f":"IF(ISERROR(I32/E32), 0, I32/E32)","v":4.8099053439682035E-3}]
["Sentinel Lighting","RTSR - Connection","kW",1.7003999999999999,null,298,{"$f":"ROUND(D33*F33, 2)","v":506.72},{"$f":"G33/1107976.5","v":4.5733821971855905E-4},{"$f":"H33*Total_Current_Wholesale_Lineplus","v":624.94223422717755},{"$f":"IF(ISERROR(I33/F33), 0, I33/F33)","v":2.0971215913663674}]
["Street Lighting","RTSR - Connection","kW",1.1469,null,2886,{"$f":"ROUND(D34*F34, 2)","v":3309.95},{"$f":"G34/1107976.5","v":2.9873828551417831E-3},{"$f":"H34*Total_Current_Wholesale_Lineplus","v":4082.1904566234725},{"$f":"IF(ISERROR(I34/F34), 0, I34/F34)","v":1.4144804077004409}]
[]
["The purpose of this table is to update the re-aligned RTS Network Rates to recover future wholesale network costs."]
["Rate Class","Rate Description","Unit","Adjusted RTSR-Network","Loss Adjusted Billed kWh","Billed kW","Billed Amount","Billed Amount %","Current Wholesale Billing","Proposed RTSR-Network"]
[]
["Residential","RTSR - Network","kWh",7.1267037244881889E-3,159434853.8696,null,{"$f":"IF(ISERROR(D39*E39), 0, ROUND(D39*E39, 2))","v":1136244.97},{"$f":"G39/1740853.09","v":0.65269434654017811},{"$f":"H39*forecast_wholesale_network","v":1218796.8006274332},{"$f":"IF(ISERROR(I39/E39), 0, I39/E39)","v":7.6444815612543146E-3}]
["General Service Less Than 50 kW","RTSR - Network","kWh",6.5015543648190297E-3,36017209.001000002,null,{"$f":"IF(ISERROR(D40*E40), 0, ROUND(D40*E40, 2))","v":234167.84},{"$f":"G40/1740853.09","v":0.1345132690088168},{"$f":"H40*forecast_wholesale_network","v":251180.88241291547},{"$f":"IF(ISERROR(I40/E40), 0, I40/E40)","v":6.973913009360096E-3}]
["General Service 50 to 4,999 kW","RTSR - Network","kW",2.5487342692723103,null,66619,{"$f":"ROUND(D41*F41, 2)","v":169794.13},{"$f":"G41/1740853.09","v":9.7535013709858773E-2},{"$f":"H41*forecast_wholesale_network","v":182130.21652304303},{"$f":"IF(ISERROR(I41/F41), 0, I41/F41)","v":2.7339079920599683}]
["General Service 50 to 4,999 kW – Interval Metered","RTSR - Network","kW",2.5487343474481263,null,74982,{"$f":"ROUND(D42*F42, 2)","v":191109.2},{"$f":"G42/1740853.09","v":0.10977905091348059},{"$f":"H42*forecast_wholesale_network","v":204993.89452123892},{"$f":"IF(ISERROR(I42/F42), 0, I42/F42)","v":2.7339080648854246}]
["Unmetered Scattered Load","RTSR - Network","kWh",6.5015640756800374E-3,494489.63760000002,null,{"$f":"IF(ISERROR(D43*E43), 0, ROUND(D43*E43, 2))","v":3214.96},{"$f":"G43/1740853.09","v":1.8467727222174731E-3},{"$f":"H43*forecast_wholesale_network","v":3448.537125004983},{"$f":"IF(ISERROR(I43/E43), 0, I43/E43)","v":6.9739320357498687E-3}]
["Sentinel Lighting","RTSR - Network","kW",1.9947302135640113,null,298,{"$f":"ROUND(D44*F44, 2)","v":594.42999999999995},{"$f":"G44/1740853.09","v":3.4145902570101414E-4},{"$f":"H44*forecast_wholesale_network","v":637.61724040632282},{"$f":"IF(ISERROR(I44/F44), 0, I44/F44)","v":2.1396551691487344}]
["Street Lighting","RTSR - Network","kW",1.9846003891113437,null,2886,{"$f":"ROUND(D45*F45, 2)","v":5727.56},{"$f":"G45/1740853.09","v":3.2900880797471542E-3},{"$f":"H45*forecast_wholesale_network","v":6143.685549958177},{"$f":"IF(ISERROR(I45/F45), 0, I45/F45)","v":2.1287891718496801}]
[]
["The purpose of this table is to update the re-aligned RTS Connection Rates to recover future wholesale connection costs."]
["Rate Class","Rate Description","Unit","Adjusted RTSR-Connection","Loss Adjusted Billed kWh","Billed kW","Billed Amount","Billed Amount %","Current Wholesale Billing","Proposed RTSR-Connection"]
[]
["Residential","RTSR - Connection","kWh",5.0565660659524919E-3,159434853.8696,null,{"$f":"ROUND(D50*E50, 2)","v":806192.87},{"$f":"G50/1366477.16","v":0.58997903045814537},{"$f":"H50*forecast_wholesale_lineplus","v":899678.49710147991},{"$f":"IF(ISERROR(I50/E50), 0, I50/E50)","v":5.6429223301281226E-3}]
["General Service Less Than 50 kW","RTSR - Connection","kWh",4.8099044806584725E-3,36017209.001000002,null,{"$f":"ROUND(D51*E51, 2)","v":173239.33},{"$f":"G51/1366477.16","v":0.1267780648452258},{"$f":"H51*forecast_wholesale_lineplus","v":193328.05567142676},{"$f":"IF(ISERROR(I51/E51), 0, I51/E51)","v":5.3676578789339036E-3}]
["General Service 50 to 4,999 kW","RTSR - Connection","kW",2.6833099837296719,null,66619,{"$f":"ROUND(D52*F52, 2)","v":178759.43},{"$f":"G52/1366477.16","v":0.13081772255893395},{"$f":"H52*forecast_wholesale_lineplus","v":199488.26305685041},{"$f":"IF(ISERROR(I52/F52), 0, I52/F52)","v":2.9944649883194043}]
["General Service 50 to 4,999 kW – Interval Metered","RTSR - Connection","kW",2.6833099950227632,null,74982,{"$f":"ROUND(D53*F53, 2)","v":201199.95},{"$f":"G53/1366477.16","v":0.1472398923960061},{"$f":"H53*forecast_wholesale_lineplus","v":224530.97189124598},{"$f":"IF(ISERROR(I53/F53), 0, I53/F53)","v":2.9944649634745137}]
["Unmetered Scattered Load","RTSR - Connection","kWh",4.8099053439682035E-3,494489.63760000002,null,{"$f":"ROUND(D54*E54, 2)","v":2378.4499999999998},{"$f":"G54/1366477.16","v":1.7405706217585078E-3},{"$f":"H54*forecast_wholesale_lineplus","v":2654.253592482175},{"$f":"IF(ISERROR(I54/E54), 0, I54/E54)","v":5.367662718605319E-3}]
["Sentinel Lighting","RTSR - Connection","kW",2.0971215913663674,null,298,{"$f":"ROUND(D55*F55, 2)","v":624.94000000000005},{"$f":"G55/1366477.16","v":4.5733658658444028E-4},{"$f":"H55*forecast_wholesale_lineplus","v":697.4076562827936},{"$f":"IF(ISERROR(I55/F55), 0, I55/F55)","v":2.3402941485999786}]
["Street Lighting","RTSR - Connection","kW",1.4144804077004409,null,2886,{"$f":"ROUND(D56*F56, 2)","v":4082.19},{"$f":"G56/1366477.16","v":2.9873825333458191E-3},{"$f":"H56*forecast_wholesale_lineplus","v":4555.5582302317935},{"$f":"IF(ISERROR(I56/F56), 0, I56/F56)","v":1.5785025052778217}]

{"sheet":"hidden1","index":9,"n_rows":22,"n_cols":2,"rows_kept":22,"cut":false,"hidden":true,"merged":[]}
[{"$f":"IF('3. Rate Classes'!L17=1, '3. Rate Classes'!C17, \"\")","v":"Residential"},1]
[{"$f":"IF('3. Rate Classes'!L18=1, '3. Rate Classes'!C18, \"\")","v":"General Service Less Than 50 kW"},2]
[{"$f":"IF('3. Rate Classes'!L19=1, '3. Rate Classes'!C19, \"\")","v":"General Service 50 to 4,999 kW"},3]
[{"$f":"IF('3. Rate Classes'!L20=1, '3. Rate Classes'!C20, \"\")","v":"General Service 50 to 4,999 kW – Interval Metered"},4]
[{"$f":"IF('3. Rate Classes'!L21=1, '3. Rate Classes'!C21, \"\")","v":"Unmetered Scattered Load"},5]
[{"$f":"IF('3. Rate Classes'!L22=1, '3. Rate Classes'!C22, \"\")","v":"Sentinel Lighting"},6]
[{"$f":"IF('3. Rate Classes'!L23=1, '3. Rate Classes'!C23, \"\")","v":"Street Lighting"},7]
[{"$f":"IF('3. Rate Classes'!L24=1, '3. Rate Classes'!C24, \"\")","v":""},8]
[{"$f":"IF('3. Rate Classes'!L25=1, '3. Rate Classes'!C25, \"\")","v":""},9]
[{"$f":"IF('3. Rate Classes'!L26=1, '3. Rate Classes'!C26, \"\")","v":""},10]
[{"$f":"IF('3. Rate Classes'!L27=1, '3. Rate Classes'!C27, \"\")","v":""},11]
[{"$f":"IF('3. Rate Classes'!L28=1, '3. Rate Classes'!C28, \"\")","v":""},12]
[{"$f":"IF('3. Rate Classes'!L29=1, '3. Rate Classes'!C29, \"\")","v":""},13]
[{"$f":"IF('3. Rate Classes'!L30=1, '3. Rate Classes'!C30, \"\")","v":""},14]
[{"$f":"IF('3. Rate Classes'!L31=1, '3. Rate Classes'!C31, \"\")","v":""},15]
[{"$f":"IF('3. Rate Classes'!L32=1, '3. Rate Classes'!C32, \"\")","v":""},16]
[{"$f":"IF('3. Rate Classes'!L33=1, '3. Rate Classes'!C33, \"\")","v":""},17]
[{"$f":"IF('3. Rate Classes'!L34=1, '3. Rate Classes'!C34, \"\")","v":""},18]
[{"$f":"IF('3. Rate Classes'!L35=1, '3. Rate Classes'!C35, \"\")","v":""},19]
[{"$f":"IF('3. Rate Classes'!L36=1, '3. Rate Classes'!C36, \"\")","v":""},20]
[{"$f":"IF('3. Rate Classes'!L37=1, '3. Rate Classes'!C37, \"\")","v":""},21]
[{"$f":"IF('3. Rate Classes'!L38=1, '3. Rate Classes'!C38, \"\")","v":""},22]