{"text_format":"1","workbook":"xlsx","n_sheets":49,"sheets":["LDC Info","Index","COS Flowchart","List of Key References","App.2-A_Requested_Approvals","App.2-AA_Capital Projects","App.2-AB_Capital Expenditures","App.2-AC_Customer Engagement","App.2-B_Acctg Instructions","App.2-BA_Fixed Asset Cont","Appendix 2-BB Service Life  ","App.2-CA_OldCGAAPDepExp_Yr1","App.2-CB_NewCGAAP_DepExp_Yr1","App.2-CC_DepExp_Yr2","App.2-CD_DepExp_Yr3","App.2-CE_DepExp_Yr4","App.2-CF_DepExp_Yr5","App.2-CG_DepExp_Yr6","App.2-CH_DepExp","App.2-D_Overhead","App.2-EA_Account 1575 (2015)","App.2-EB_Account 1576 (2012)","App.2-EC_Account 1576 (2013)","App.2-FA Proposed REG Invest.","App.2-FB Calc of REG Improvemnt","App.2-FC Calc of REG Expansion","App.2-G SQI","App.2-H_Other_Oper_Rev","App_2-I LF_CDM","App.2-IA_Load_Forecast_Instrct","App.2-IB_Load_Forecast_Analysis","App.2-JA_OM&A_Summary_Analys","App.2-JB_OM&A_Cost _Drivers","App.2-JC_OMA Programs","App.2-K_Employee Costs","App.2-KA_P_OPEBs","App.2-L_OM&A_per_Cust_FTE","App.2-L_OM&A_per_Cust_FTEE_exp","App.2-M_Regulatory_Costs","App.2-N_Corp_Cost_Allocation","App.2-OA Capital Structure","App.2-OB_Debt Instruments","App.2-Q_Cost of Serv. Emb. Dx","App.2-R_Loss Factors","App.2-S_Stranded Meters","App.2-Y_MIFRS Summary Impacts","Sheet19","App.2-YA_IFRS Transition Costs","Sheet1"],"not_rendered":{"charts":0,"images":17,"macros":1,"external_links":20,"defined_names":644,"comments":4,"pivot_tables":0},"unopened":[],"bounds":{"document_bytes":16777216,"sheet_cells":100000,"rows_first":2000,"rows_last":500,"rows_between":2000,"halvings":0,"cell_chars":16384,"cell_head_chars":4096},"cells_cut":0,"cells_raw":0,"read":"whole","date_system":"1900"}

{"sheet":"LDC Info","index":0,"n_rows":77,"n_cols":27,"rows_kept":77,"cut":false,"hidden":false,"merged":[[17,4,17,10],[13,4,13,10],[15,4,15,8],[19,4,19,8],[25,4,25,6],[23,4,23,6],[45,0,45,3],[50,2,50,11],[54,2,54,12],[52,2,52,13],[27,4,27,6],[30,4,30,6],[29,0,30,3],[42,0,43,3],[38,0,39,3],[39,4,39,6],[32,0,33,3],[33,4,33,6],[35,0,36,3]]}
[]
[]
[null,null,null,null,null,null,null,null,null,null,null,null,null,null,null,null,null,null,null,null,null,null,null,null,null,1,"Algoma Power Inc."]
[null,null,null,null,null,null,null,null,null,null,null,null,null,null,null,null,null,null,null,null,null,null,null,null,null,2,"Atikokan Hydro Inc."]
[null,null,null,null,null,null,null,null,null,null,null,null,null,null,null,null,null,null,null,null,null,null,null,null,null,3,"Attawapiskat Power Corporation"]
[null,null,null,null,null,null,null,null,null,null,null,null,null,null,null,null,null,null,null,null,null,null,null,null,null,4,"Bluewater Power Distribution Corporation"]
[null,null,null,null,null,null,null,null,null,null,null,null,null,null,null,null,null,null,null,null,null,null,null,null,null,5,"Brantford Power Inc."]
[null,null,null,null,null,null,null,null,null,null,null,null,null,null,null,null,null,null,null,null,null,null,null,null,null,6,"Burlington Hydro Inc."]
[null,null,null,null,null,null,null,null,null,null,null,null,null,null,null,null,null,null,null,null,null,null,null,null,null,7,"Canadian Niagara Power Inc."]
[null,null,null,null,null,null,null,null,null,null,null,null,null,null,null,null,null,null,null,null,null,null,null,null,null,8,"Centre Wellington Hydro Ltd."]
[null,null,null,null,null,null,null,null,null,null,null,null,null,null,null,null,null,null,null,null,null,null,null,null,null,9,"Chapleau Public Utilities Corporation"]
[null,null,null,null,null,null,null,null,null,null,null,null,null,null,null,null,null,null,null,null,null,null,null,null,null,10,"COLLUS PowerStream Corp."]
[null,null,null,null,null,null,null,null,null,null,null,null,null,null,null,null,null,null,null,null,null,null,null,null,null,11,"Cooperative Hydro Embrun Inc."]
[null,null,null,"Utility Name   ","Innpower Corporation",null,null,null,null,null,null,null,null,null,null,null,null,null,null,null,null,null,null,null,null,12,"E.L.K. Energy Inc."]
[null,null,null,null,null,null,null,null,null,null,null,null,null,null,null,null,null,null,null,null,null,null,null,null,null,13,"Energy + Inc."]
[null,null,null,"Assigned EB Number","EB-2016-0085",null,null,null,null,null,null,null,null,null,null,null,null,null,null,null,null,null,null,null,null,14,"Enersource Hydro Mississauga Inc."]
[null,null,null,null,null,null,null,null,null,null,null,null,null,null,null,null,null,null,null,null,null,null,null,null,null,15,"Entegrus Powerlines Inc."]
[null,null,null,"Name of Contact and Title","Brenda L Pinke",null,null,null,null,null,null,null,null,null,null,null,null,null,null,null,null,null,null,null,null,16,"ENWIN Utilities Ltd."]
[null,null,null,null,null,null,null,null,null,null,null,null,null,null,null,null,null,null,null,null,null,null,null,null,null,17,"Erie Thames Powerlines Corporation"]
[null,null,null,"Phone Number   ","705-431-6870 Ext 262",null,null,null,null,null,null,null,null,null,null,null,null,null,null,null,null,null,null,null,null,18,"Espanola Regional Hydro Distribution Corporation"]
[null,null,null,null,null,null,null,null,null,null,null,null,null,null,null,null,null,null,null,null,null,null,null,null,null,19,"Essex Powerlines Corporation"]
[null,null,null,"Email Address   ","brendap\"innpower.ca",null,null,null,null,null,null,null,null,null,null,null,null,null,null,null,null,null,null,null,null,20,"Festival Hydro Inc."]
[null,null,null,null,null,null,null,null,null,null,null,null,null,null,null,null,null,null,null,null,null,null,null,null,null,21,"Fort Albany Power Corporation"]
[null,null,null,"Test Year",2017,null,null,null,null,null,null,null,null,null,null,null,null,null,null,null,null,null,null,null,null,22,"Fort Frances Power Corporation"]
[null,null,null,null,null,null,null,null,null,null,null,null,null,null,null,null,null,null,null,null,null,null,null,null,null,23,"Greater Sudbury Hydro Inc."]
[null,null,null,"Bridge Year",{"$f":"IF(ISBLANK(E24), \"\", E24-1)","v":2016},null,null,null,null,null,null,null,null,null,null,null,null,null,null,null,null,null,null,null,null,24,"Grimsby Power Inc."]
[null,null,null,null,null,null,null,null,null,null,null,null,null,null,null,null,null,null,null,null,null,null,null,null,null,25,"Guelph Hydro Electric Systems Inc."]
[null,null,null,"Last Rebasing Year",2013,null,null,null,null,null,null,null,null,null,null,null,null,null,null,null,null,null,null,null,null,26,"Haldimand County Hydro Inc."]
[null,null,null,null,null,null,null,null,null,null,null,null,null,null,null,null,null,null,null,null,null,null,null,null,null,27,"Halton Hills Hydro Inc."]
["Identify the accounting standard used for the test year",null,null,null,null,null,null,null,null,null,null,null,null,null,null,null,null,null,null,null,null,null,null,null,null,28,"Hearst Power Distribution Company Limited"]
[null,null,null,null,"MIFRS",null,null,null,null,null,null,null,null,null,null,null,null,null,null,null,null,null,null,null,null,29,"Horizon Utilities Corporation"]
[null,null,null,null,null,null,null,null,null,null,null,null,null,null,null,null,null,null,null,null,null,null,null,null,null,30,"Hydro 2000 Inc."]
["Did you update your depreciation and capitalization policies and reflect the changes in policies in a prior rebasing application?",null,null,null,null,null,null,null,null,null,null,null,null,null,null,null,null,null,null,null,null,null,null,null,null,31,"Hydro Hawkesbury Inc."]
[null,null,null,null,"Yes",null,null,null,null,null,null,null,null,null,null,null,null,null,null,null,null,null,null,null,null,32,"Hydro One Brampton Networks Inc."]
[null,null,null,null,null,null,null,null,null,null,null,null,null,null,null,null,null,null,null,null,null,null,null,null,null,33,"Hydro One Networks Inc."]
["When did you update your actual depreciation and capitalization policies?",null,null,null,null,null,null,null,null,null,null,null,null,null,null,null,null,null,null,null,null,null,null,null,null,34,"Hydro One Networks Inc. - Norfolk"]
[null,null,null,null,"2001-01-01",2012,null,null,null,null,null,null,null,null,null,null,null,null,null,null,null,null,null,null,null,35,"Hydro One Remote Communities Inc."]
[null,null,null,null,null,null,null,null,null,null,null,null,null,null,null,null,null,null,null,null,null,null,null,null,null,36,"Hydro Ottawa Limited"]
["Identify the year the applicant adopted IFRS for financial reporting purposes",null,null,null,null,null,null,null,null,null,null,null,null,null,null,null,null,null,null,null,null,null,null,null,null,37,"Innpower Corporation"]
[null,null,null,null,2015,null,null,null,null,null,null,null,null,null,null,null,null,null,null,null,null,null,null,null,null,38,"Kashechewan Power Corporation"]
[null,null,null,null,null,null,null,null,null,null,null,null,null,null,null,null,null,null,null,null,null,null,null,null,null,39,"Kenora Hydro Electric Corporation Ltd."]
[null,null,null,null,null,null,null,null,null,null,null,null,null,null,null,null,null,null,null,null,null,null,null,null,null,40,"Kingston Hydro Corporation"]
["Are you applying for cost recovery for the test and/or future year(s) for Green Energy initiatives?",null,null,null,null,null,null,null,null,null,null,null,null,null,null,null,null,null,null,null,null,null,null,null,null,41,"Kitchener-Wilmot Hydro Inc."]
[null,null,null,null,"No",null,null,null,null,null,null,null,null,null,null,null,null,null,null,null,null,null,null,null,null,42,"Lakefront Utilities Inc."]
[null,null,null,null,null,null,null,null,null,null,null,null,null,null,null,null,null,null,null,null,null,null,null,null,null,43,"Lakeland Power Distribution Ltd."]
[{"$f":"\"Is \" & E14 & \" an embedded distributor?\"","v":"Is Innpower Corporation an embedded distributor?"},null,null,null,"No",null,null,null,null,null,null,null,null,null,null,null,null,null,null,null,null,null,null,null,null,44,"London Hydro Inc."]
[null,null,null,null,null,null,null,null,null,null,null,null,null,null,null,null,null,null,null,null,null,null,null,null,null,45,"Midland Power Utility Corporation"]
[null,null,null,null,null,null,null,null,null,null,null,null,null,null,null,null,null,null,null,null,null,null,null,null,null,46,"Milton Hydro Distribution Inc."]
[null,"Notes",null,null,null,null,null,null,null,null,null,null,null,null,null,null,null,null,null,null,null,null,null,null,null,47,"Newmarket-Tay Power Distribution Ltd."]
[null,null,null,null,null,null,null,null,null,null,null,null,null,null,null,null,null,null,null,null,null,null,null,null,null,48,"Niagara Peninsula Energy Inc."]
[null,null,"Pale green cells represent input cells.",null,null,null,null,null,null,null,null,null,null,null,null,null,null,null,null,null,null,null,null,null,null,49,"Niagara-on-the-Lake Hydro Inc."]
[null,null,null,null,null,null,null,null,null,null,null,null,null,null,null,null,null,null,null,null,null,null,null,null,null,50,"North Bay Hydro Distribution Limited"]
[null,null,"Pale blue cells represent drop-down lists.  The applicant should select the appropriate item from the drop-down list.",null,null,null,null,null,null,null,null,null,null,null,null,null,null,null,null,null,null,null,null,null,null,51,"Northern Ontario Wires Inc."]
[null,null,null,null,null,null,null,null,null,null,null,null,null,null,null,null,null,null,null,null,null,null,null,null,null,52,"Oakville Hydro Electricity Distribution Inc."]
[null,null,"White cells contain fixed values, automatically generated values or formulae. ",null,null,null,null,null,null,null,null,null,null,{"$f":"IF(LEN($G55)>1, (SUMPRODUCT(--($C$78:$C$1000=$C55),--($A$78:$A$1000=$D55), --($B$78:$B$1000=$B55&\"_TOTAL\"), $L$78:$L$1000)), \"\")","v":""},{"$f":"IF(LEN($G55)>1, (SUMPRODUCT(--($C$78:$C$1000=$C55),--($A$78:$A$1000=$D55), --($B$78:$B$1000=$B55&\"_TOTAL\"), $M$78:$M$1000)), \"\")","v":""},null,null,null,null,null,null,null,null,null,null,53,"Orangeville Hydro Limited"]
[null,null,null,null,null,null,null,null,null,null,null,null,null,{"$f":"IF(LEN($G56)>1, (SUMPRODUCT(--($C$78:$C$1000=$C56),--($A$78:$A$1000=$D56), --($B$78:$B$1000=$B56&\"_TOTAL\"), $L$78:$L$1000)), \"\")","v":""},{"$f":"IF(LEN($G56)>1, (SUMPRODUCT(--($C$78:$C$1000=$C56),--($A$78:$A$1000=$D56), --($B$78:$B$1000=$B56&\"_TOTAL\"), $M$78:$M$1000)), \"\")","v":""},null,null,null,null,null,null,null,null,null,null,54,"Orillia Power Distribution Corporation"]
[null,null,null,null,null,null,null,null,null,null,null,null,null,"","",null,null,null,null,null,null,null,null,null,null,55,"Oshawa PUC Networks Inc."]
[null,null,null,null,null,null,null,null,null,null,null,null,null,"","",null,null,null,null,null,null,null,null,null,null,56,"Ottawa River Power Corporation"]
[null,null,null,null,null,null,null,null,null,null,null,null,null,"","",null,null,null,null,null,null,null,null,null,null,57,"Peterborough Distribution Inc."]
[null,null,null,null,null,null,null,null,null,null,null,null,null,"","",null,null,null,null,null,null,null,null,null,null,58,"PowerStream Inc."]
[null,null,null,null,null,null,null,null,null,null,null,null,null,"","",null,null,null,null,null,null,null,null,null,null,59,"PUC Distribution Inc."]
[null,null,null,null,null,null,null,null,null,null,null,null,null,"","",null,null,null,null,null,null,null,null,null,null,60,"Renfrew Hydro Inc."]
[null,null,null,null,null,null,null,null,null,null,null,null,null,"","",null,null,null,null,null,null,null,null,null,null,61,"Rideau St. Lawrence Distribution Inc."]
[null,null,null,null,null,null,null,null,null,null,null,null,null,"","",null,null,null,null,null,null,null,null,null,null,62,"Sioux Lookout Hydro Inc."]
[null,null,null,null,null,null,null,null,null,null,null,null,null,"","",null,null,null,null,null,null,null,null,null,null,63,"St. Thomas Energy Inc."]
[null,null,null,null,null,null,null,null,null,null,null,null,null,"","",null,null,null,null,null,null,null,null,null,null,64,"Thunder Bay Hydro Electricity Distribution Inc."]
[null,null,null,null,null,null,null,null,null,null,null,null,null,"","",null,null,null,null,null,null,null,null,null,null,65,"Tillsonburg Hydro Inc."]
[null,null,null,null,null,null,null,null,null,null,null,null,null,"","",null,null,null,null,null,null,null,null,null,null,66,"Toronto Hydro-Electric System Limited"]
[null,null,null,null,null,null,null,null,null,null,null,null,null,"","",null,null,null,null,null,null,null,null,null,null,67,"Veridian Connections Inc."]
[null,null,null,null,null,null,null,null,null,null,null,null,null,"","",null,null,null,null,null,null,null,null,null,null,68,"Wasaga Distribution Inc."]
[null,null,null,null,null,null,null,null,null,null,null,null,null,"","",null,null,null,null,null,null,null,null,null,null,69,"Waterloo North Hydro Inc."]
[null,null,null,null,null,null,null,null,null,null,null,null,null,"","",null,null,null,null,null,null,null,null,null,null,70,"Welland Hydro-Electric System Corp."]
[null,null,null,null,null,null,null,null,null,null,null,null,null,"","",null,null,null,null,null,null,null,null,null,null,71,"Wellington North Power Inc."]
[null,null,null,null,null,null,null,null,null,null,null,null,null,"","",null,null,null,null,null,null,null,null,null,null,72,"West Coast Huron Energy Inc."]
[null,null,null,null,null,null,null,null,null,null,null,null,null,null,null,null,null,null,null,null,null,null,null,null,null,73,"Westario Power Inc."]
[null,null,null,null,null,null,null,null,null,null,null,null,null,null,null,null,null,null,null,null,null,null,null,null,null,74,"Whitby Hydro Electric Corporation"]
[null,null,null,null,null,null,null,null,null,null,null,null,null,null,null,null,null,null,null,null,null,null,null,null,null,75,"Woodstock Hydro Services Inc."]

{"sheet":"Index","index":1,"n_rows":42,"n_cols":6,"rows_kept":42,"cut":false,"hidden":false,"merged":[[41,1,41,5]]}
[]
[]
[]
[]
[]
[]
[]
[]
[]
[]
[]
[]
[]
[]
[1,"LDC Information Sheet",null,null,27,"App.2-G: Service Reliability Indicators"]
[2,"Index",null,null,28,"App.2-H: Other Operating Revenue"]
[3,"Cost of Service Application Flowchart",null,null,29,"App.2-I: Load Forecast CDM Adjustment Workform"]
[4,"List of Key References",null,null,30,"App.2-IA: Load Forecast Data Instructions"]
[5,"App.2-A: List of Requested Approvals",null,null,31,"App.2-IB:  Actual and Forecast Load and Customer Data"]
[6,"App.2-AA: Capital Projects Table",null,null,32,"App.2-JA: OM&A Summary Analysis"]
[7,"App.2-AB: Capital Expenditures",null,null,33,"App.2-JB: Recoverable OM&A Cost Driver Table"]
[8,"App. 2-AC: Customer Engagement Worksheet",null,null,34,"App.2-JC: OM&A Programs Table"]
[9,"App.2-B: General Accounting Instructions",null,null,35,"App.2-K: Employee Costs"]
[10,"App.2-BA: Fixed Asset Continuity Schedule",null,null,36,"App.2-KA: OPEBs (Other Post-Employment Benefits) Costs"]
[11,"Appendix 2-BB: Service Life Comparison",null,null,37,"App.2-L: Recoverable OM&A Cost per Customer and per FTE"]
[12,"App.2-CA: Year 1 Depreciation and Amortization Expense (Old CGAAP)",null,null,38,"App.2-M: Regulatory Costs Schedule"]
[13,"App.2-CB: Year 1 Depreciation and Amortization Expense (New CGAAP)",null,null,39,"App.2-N: Shared Services and Corporate Cost Allocation"]
[14,"App.2-CC: Year 2 Depreciation and Amortization Expense (New CGAAP)",null,null,40,"App.2-OA: Capital Structure and Cost of Capital"]
[15,"App.2-CD: Year 3 Depreciation and Amortization Expense (New CGAAP or MIFRS)",null,null,41,"App.2-OB: Debt Instruments"]
[16,"App.2-CE: Year 4 Depreciation and Amortization Expense (MIFRS)",null,null,42,"App.2-Q: Cost of Serving Embedded Distributor(s)"]
[17,"App.2-CF: Year 5 Depreciation and Amortization Expense (MIFRS)",null,null,43,"App.2-R: Loss Factors"]
[18,"App.2-CG: Year 6 Depreciation and Amortization Expense (Old CGAAP)",null,null,44,"App.2-S: Stranded Meter Treatment"]
[19,"App.2-CH: Depreciation and Amortization Expense (MIFRS)",null,null,45,"App.2-Y: Transition to MIFRS Summary Impact"]
[20,"App.2-D: Overhead Expenses",null,null,46,"App.2-YA: One-Time Incremental IFRS Transition Costs"]
[21,"App.2-EA: Account 1575 PP&E Deferral Account (2015 IFRS Adopters)"]
[22,"App.2-EB: Account 1576 - Accounting Changes Under CGAAP (2012 Changes)"]
[23,"App.2-EC: Account 1576 - Accounting Changes Under CGAAP (2013 Changes)"]
[24,"App.2-FA: Renewable Generation Connection Investment Summary"]
[25,"App.2-FB: Calculation of Renewable Generation Connection Direct Benefits/Provincial Amount: Renewable Enabling Improvement Investments"]
[26,"App.2-FC: Calculation of Renewable Generation Connection Direct Benefits/Provincial Amount: Renewable Expansion Investments"]
[]
["Note:","Appendices for the Tariff of Rates and Charges at Current and Proposed Rates, and for the Bill Impacts are now in a separate spreadsheet model. These appendices were formerly 2-Z and 2-W."]

{"sheet":"COS Flowchart","index":2,"n_rows":6,"n_cols":2,"rows_kept":6,"cut":false,"hidden":false,"merged":[[5,1,5,6],[2,1,2,6],[3,1,3,6]]}
[]
[]
[]
[null,"Cost of Service Rate Application Schematic"]
[]
[null,"The Cost of Service Rate Application Schematic is a flowchart that is included as a guide for the components of an application. The schematic demonstrates how demand and costs interrelate to derive the revenue requirement and how the revenue requirement is allocated between classes and through fixed/variable splits to derive rates that will be compensatory for the annual revenue requirement, based on the the forecasted demand.  There is no form to be filled out; therefore, this Schedule is not required to be filed."]

{"sheet":"List of Key References","index":3,"n_rows":5,"n_cols":2,"rows_kept":5,"cut":false,"hidden":false,"merged":[[2,1,2,11],[4,0,4,11]]}
[]
[]
[null,"List of Key References"]
[]
["A list of key references for understanding the Filing Requirements has been embedded in the document below. To access the list of references and associated hyperlinks double-click the icon below."]

{"sheet":"App.2-A_Requested_Approvals","index":4,"n_rows":46,"n_cols":8,"rows_kept":46,"cut":false,"hidden":false,"merged":[[15,1,15,7],[17,1,17,7],[19,5,19,7],[42,5,42,7],[45,5,45,7],[39,5,39,7],[8,1,8,7],[31,5,31,7],[33,5,33,7],[35,5,35,7],[37,5,37,7],[9,1,9,7],[11,1,11,7],[27,5,27,7],[23,5,23,7],[25,5,25,7],[29,5,29,7],[21,5,21,7],[13,1,13,7]]}
[null,null,null,null,null,null,"File Number:",{"$f":"EBNUMBER","v":"EB-2016-0085"}]
[null,null,null,null,null,null,"Exhibit:",1]
[null,null,null,null,null,null,"Tab:"]
[null,null,null,null,null,null,"Schedule:"]
[null,null,null,null,null,null,"Page:"]
[]
[null,null,null,null,null,null,"Date:","2016-11-28"]
[]
[null,"Appendix 2-A"]
[null,"List of Requested Approvals"]
[]
[null,"The distributor must fill out the following sheet with the complete list of specific approvals requested and relevant section(s) of the legislation must be provided. All approvals, including accounting orders (deferral and variance accounts) new rate classes, revised specific service charges or retail service charges which the applicant is seeking, must be separately identified, as well being clearly documented in the appropriate sections of the application."]
[]
[null,"Additional requests may be added by copying and pasting blank input rows, as needed."]
[]
[null,"If additional requests arise, or requested approvals are removed, during the processing of the application, the distributor should update this list."]
[]
[null,{"$f":"CONCATENATE('LDC Info'!E14,\" is seeking the following approvals in this application:\")","v":"Innpower Corporation is seeking the following approvals in this application:"}]
[]
[null,1]
[]
[null,2]
[]
[null,3]
[]
[null,4]
[]
[null,5]
[]
[null,6]
[]
[null,7]
[]
[null,8]
[]
[null,9]
[]
[null,10]
[]
[null,11]
[]
[]
[null,12]
[]
[]
[null,13]

{"sheet":"App.2-AA_Capital Projects","index":5,"n_rows":165,"n_cols":8,"rows_kept":165,"cut":false,"hidden":false,"merged":[[11,0,11,7],[9,0,9,7],[8,0,8,7]]}
[null,null,null,null,null,null,"File Number:",{"$f":"EBNUMBER","v":"EB-2016-0085"}]
[null,null,null,null,null,null,"Exhibit:",2]
[null,null,null,null,null,null,"Tab:"]
[null,null,null,null,null,null,"Schedule:"]
[null,null,null,null,null,null,"Page:"]
[]
[null,null,null,null,null,null,"Date:","2016-11-28"]
[]
["Appendix 2-AA"]
["Capital Projects Table"]
[]
[]
["Projects",{"$f":"C13-1","v":2012},{"$f":"D13-1","v":2013},{"$f":"E13-1","v":2014},{"$f":"BridgeYear - 1","v":2015},{"$f":"BridgeYear & \" Bridge Year\"","v":"2016 Bridge Year"},{"$f":"TestYear & \" Test Year\"","v":"2017 Test Year"}]
["Reporting Basis","CGAAP","MIFRS","MIFRS","MIFRS","MIFRS","MIFRS"]
["SYSTEM ACCESS"]
["DO-015 County relocates IBR & 20th SDRD",203]
["DO-016 County relocated 7th Line & 20th SDRD",297101.43]
["DO-017 County relocates IBR & 10th SDRD ",441029.24]
["DO-018 Urbanization carry forward",119210.37000000002]
["DO-022 TS Land",526913]
["DB-001 Retail meters",50794,96757,120569]
["Base",1016719,968603,1665195]
["Economic Evaluation",942138,null,893568]
["DO-009 Big Bay Point F3 for BBPT development",null,2979]
["DO-010 Utility relocates",null,1766]
["DO-012 BBPT line ext for BBPT dev & new 27.6 kV sub stn",null,397894]
["IPC2015BASE1 - C & CTC WORK ORDERS",null," ",null,282319,275010,116880]
["IPC2015BASE2 - PO WORK ORDERS",null," ",null,30806,36248,34254]
["IPC2015BASE3 - L, DG, RPO, RCTC WORK ORDERS",null,null,null,901869,900530,945557]
["IPC2015BASE4 - SD WORK ORDERS",null,null,null,1557550,3711228,641280]
["IPC2015DB001 - RETAIL/WHOLESALE METERS",null,null,null,95343,147500,230000]
["IPC2015DO013 - COUNTY RELOCATES IBR & 20TH SR",null,null,null,253796]
["Intersection Widening IBR & Yonge St",null,null,null,null,null,430000]
["Intersection Widening IBR & 5 SR",null,null,null,null,null,656981]
["Contributions",-1643538,-428863,-1416471,-2225541,-3986075,-1869254]
["Sub-Total System Access",{"$f":"SUM(B16:B35)","v":1750570.04},1039136,1262861,896142,1084441,1185698]
["SYSTEM RENEWAL"]
["DO-005 2012 Pole Replacement Program",446005]
["DO-006 System Renewal",163797]
["DO-012 UG padmount TX replacements",16873]
["DO-013 Substandard trnasformer rehabs",27623]
["DO-004 System Renewal & Betterments",null,181259]
["DO-005 U/G Padmounted TX Replacements & painting",null,81562]
["DO-006 Substandard Transformer Rehabs",null,179665]
["DO-007 Pole Replacements",null,395175]
["DO-015 3 ph 44kV Repoling/Reconductoring 20th btwn 6th & 7th",null,149284]
["DO-001 Pole replacement",null,null,401651]
["DO-002 Substandard Transformer Rehabs",null,null,131794]
["DO-003 Transformer/Switchgear replacements & painting",null,null,7574]
["DO-004 System Renewal & betterments",null,null,156029]
["IPC2015DO008 - POLE REPLACEMENT 2015",null,null,null,114433]
["IPC2015DO009 - INFRASTRUCTURE REPLACEMENTS & BETTERMENTS",null,null,null,185862]
["IPC2015DO010 - TRANSFORMER/SWITCHGEAR REPLACEMENTS ",null,null,null,30455]
["IPC2015DO017 - DS TRANSFORMER OIL RE-INHIBIT PROGRAM",null,null,null,18591]
["IPC2015GB003 - INFRASTRUCTURE REPLACEMENT",null,null,null,16883]
["IPC2015DO005 - LINE RECLOSER REFURBISHMENT",null,null,null,17459]
["IPC2015DO006 - SUBSTANDARD TRANSFORMER REHAB",null,null,null,103800]
["IPC2016DO001 - Substandard Infrastructure Replacement",null,null,null," ",109505]
["IPC2016DO002 - Pole Replacement Program",null,null,null," ",200914]
["IPC2016DO003 - Infrastructure Replacements and Betterments",null,null,null," ",143098]
["IPC2016DO004 - Line Reclosure Refurbishments - 4 Year Cycle",null,null,null," ",15186]
["IPC2016DO005 - DS Oil Re-inhibit Treatment per/each",null,null,null," ",26216]
["IPC2016DO006 - U/G Padmounted Transformer and Switchgear ",null,null,null,null,83256]
["IPC2016DO012 - Station Reliability Upgrade",null,null,null,null,199280]
["IPC2016DO015 - Ewart Street Rebuild",null,null,null,null,101790]
["IPC2016DO016 - Transformers",null,null,null,null,120000]
["Base 1 (50%)",null,null,null,null,null,116885]
["Substandard Transformer Rehab",null,null,null,null,null,85000]
["Pole Replacement Program",null,null,null,null,null,126470]
["Infrastructure Replacements and Betterments",null,null,null,null,null,150253]
["Line Reclosure Refurbishments - 4 Year Cycle",null,null,null,null,null,15945]
["DS Oil Re-inhibit Treatment",null,null,null,null,null,27526.5]
["Padmounted Transformer and Switchgear Replacements and Painting",null,null,null,null,null,43709.5]
["Station rehab",null,null,null,null,null,104300]
["Ewart Street Rebuild - Phased Approach",null,null,null,null,null,105000]
["Transformers",null,null,null,null,null,100000]
["Reliability Rebuild: Subtransmission - Lockhart Road",null,null,null,null,null,170650]
["Reliability Rebuild: Subtransmission - 5 Side Road",null,null,null,null,null,75000]
["Reliability Rebuild: Distribution - Cookstown",null,null,null,null,null,50000]
["Reliability Rebuild: Distribution - Alcona",null,null,null,null,null,22500]
["Reliability Rebuild: Distribution - Lefroy",null,null,null,null,null,22500]
["Sub-Total System Renewal",{"$f":"SUM(B38:B81)","v":654298},986945,697048,487483,999245,1215739]
["SYSTEM SERVICE"," "]
["DO-007 Reclosurer automation ",33443]
["DO-009 27.6kv Mechanized SCADA Load Interpt",124767]
["DO-010 44kv Mechanized SCADA Load Interpt",149065]
["GO-004 System Supervisory",19208]
["GO-005 Radio repeated faulted indicators",3800]
["GO-011 Scada program conversion",253248]
["DO-009 - 27.6kv Mechanized SCADA Load Interpt",69]
["DO-010 - 44kv Mechanized SCADA Load Interpt",2375," "]
["DO-001 Station Reclosurer",null,169828]
["DO-002 44 kV Alduti Ruptor",null,185785]
["DO-003 27.6 kV Mechanized SCADA controlled load interpt",null,13384]
["DO-008 27 kV Extension 20th SR, BBPT to 13th Line",null,687654]
["DO-014 3 ph 27.6kV conductoring 20th btwn 5th & 7th",null,123174]
["GO-007 System Supervisory",null,45457]
["GO-012 Scada program conversion",null,151319]
["DO-005 Reclosurere automation & replacement 4 yr cycle",null,null,214679]
["DO-010 Lefroy Distribution Station",null,null,2336737]
["GO-007 System Supervisory",null,null,54572]
["GO-012 Scada program conversion",null,null,212788]
["IPC2015DO002 - LINE EXT MAPLEVIEW RD 20TH SR TO PR WILLIAM WAY",null,null,null,325911]
["IPC2015DO004 - LINE REBUILD YONGE ST FROM LOCKHART TO MAPLEVIW",null,null,null,433436]
["IPC2015DO007 - LINE EXT BBP RD & 25TH SR TO FRIDAY HARBOUR S ENTR",null,null,null,599917]
["IPC2015DO020 - LOCKHART ROAD REBUILD PHASE 1",null,null,null,260002]
["IPC2015DO012 - 44KV ALDUTIRUPTOR SCADA CONTROLLED SWITCHES",null,null,null,175151]
["IPC2015DO014 - DS ELECTRICAL CODE COMPLIANCE UPGRADE",null,null,null,129692]
["IPC2015DO015 - DS BATTERY BACKUP SYSTEM",null,null,null,545994]
["IPC2015DO018 - RADIO COMMUNICATION 2014 CARRYFORWARD",null,null,null,136938]
["IPC2015DO019 - LEFROY DS UPGRADE",null,null,null,152900]
["IPC2015GO014 - SCADA BATTERIES & CHARGERS & CABINET REPLCMNT",null,null,null,183883]
["IPC2015DO011 & IPC2015GO11",null,null,null,273]
["IPC2016DO008 - Cedar Point DS Transformer Upgrade",null,null,null,null,1578016]
["IPC2016DO013 - Stroud DS Automation",null,null,null,null,164590]
["Distribution SCADA controlled load interrupting gang switch",null,null,null,null,null,75000]
["Repoling: Big Bay Point Road - Friday Harbour DS to Friday Harbour Development ",null,null,null,null,null,362570]
["Repoling: Lockhart Road - Huronia Road to Stroud DS",null,null,null,null,null,618932]
["Sandy Cove DS automation",null,null,null,null,null,125000]
["Repoling: Mapleview Drive - Prince William Way to Seline Crescent",null,null,null,null,null,837831]
["Repoling: 5 SR - McKay Road to Salem Rd",null,null,null,null,null,636000]
["DS Transformer oil containment",null,null,null,null,null,45000]
["Repoling: McKay Rd - 5 SR to 10 SR",null,null,null,null,null,400041]
["Sub-Total System Service",{"$f":"SUM(B83:B123)","v":585975},1376601,2818776,2944097,1742606,3100374]
["GENERAL PLANT"," "]
["GO-010 New Building ",662562]
["GB-001 Hardware General",73117]
["GO-001  New Building & Land",null,1015496]
["GB-001 Hardware General",null,53604]
["GB-001 Software General",null,124394]
["GO-003 Transport Equipment",null,64048]
["GB-002A Hardware General",null," ",80063]
["GB-002B Software General",null,null,88347]
["IPC2015GB001A - HARDWARE GENERAL",null,null,null,148675]
["IPC2015GB001B - SOFTWARE GENERAL",null,null,null,61990]
["IPC2015GF001 - FINANCE & REGULATORY IT HW & SW",null,null,null,94356]
["IPC2015GO001 - ENGINEERING IT PROJECT",null,null,null,82472]
["IPC2015GO005 - STORES EQUIPMENT",null,null,null,117204]
["IPC2015GO009 - SYSTEM SUPERVISORY & CONTROL ROOM",null,null,null,67317]
["IPC2015GO013 - NEW BUILDING",null,null,null,12475713]
["IPC2015GO015 - POLE BUNK",null,null,null,68583]
["IPC2016GB001 - IT Hardware",null,null,null,null,130000]
["IPC2016GB001 - IT Hardware",null,null,null,null,115000]
["IPC2016GF001 - Finance IT",null,null,null,null,122000]
["IPC2016GO001 - Engineering IT",null,null,null,null,121500]
["IPC2016GO006 - Distribution Fault Current Indicators",null,null,null,null,41001]
["IPC2016GO007 - System Supervisory",null,null,null,null,43000]
["IT Hardware",null,null,null,null,null,165000]
["IT Software",null,null,null,null,null,95000]
["Finance IT",null,null,null,null,null,77000]
["Engineering IT",null,null,null,null,null,167325]
["Transprtation/Vehicles",null,null,null,null,null,505500]
["System Supervisory",null,null,null,null,null,32400]
["Miscellaneous",91856,90911,84288,133674,88000,144910]
["Sub-Total General Plant",{"$f":"SUM(B125:B154)","v":827535},1348453,252698,13249984,660501,1187135]
["Total Capital  (Net of Contibutions)",{"$f":"B155+B124+B82+B36","v":3818378.04},{"$f":"C155+C124+C82+C36","v":4751135},{"$f":"D155+D124+D82+D36","v":5031383},{"$f":"SUM(E155+E124+E82+E36)","v":17577706},{"$f":"SUM(F155+F124+F82+F36)","v":4486793},{"$f":"SUM(G155+G124+G82+G36)","v":6688946}]
[" "]
["Total"]
["Less Renewable Generation Facility Assets and Other Non-Rate-Regulated Utility Assets (input as negative)"]
["Total"]
[]
["Notes:"]
[]
["1   Please provide a breakdown of the major components of each capital project undertaken in each year.  Please ensure that all projects below the materiality threshold are included in the miscellaneous line.  Add more projects as required."]
["2   The applicant should group projects appropriately and avoid presentations that result in classification of significant components of the capital budget in the miscellaneous category."]

{"sheet":"App.2-AB_Capital Expenditures","index":6,"n_rows":35,"n_cols":21,"rows_kept":35,"cut":false,"hidden":false,"merged":[[8,0,8,20],[9,0,9,20],[13,7,13,9],[13,10,13,12],[13,13,13,15],[13,16,14,16],[13,17,14,17],[15,16,15,20],[12,0,15,0],[12,1,12,15],[15,1,15,2],[15,4,15,5],[15,7,15,8],[15,10,15,11],[15,13,15,14],[12,16,12,20],[13,1,13,3],[13,4,13,6],[13,18,14,18],[13,19,14,19],[13,20,14,20],[24,0,24,20],[32,0,33,20],[35,0,36,20],[34,0,34,20],[27,0,27,20],[28,0,28,20],[29,0,30,20],[31,0,31,20],[25,0,25,7]]}
[null,null,null,null,null,null,null,null,null,null,null,null,null,null,null,null,null,null,"File Number:",null,{"$f":"EBNUMBER","v":"EB-2016-0085"}]
[null,null,null,null,null,null,null,null,null,null,null,null,null,null,null,null,null,null,"Exhibit:",null,2]
[null,null,null,null,null,null,null,null,null,null,null,null,null,null,null,null,null,null,"Tab:"]
[null,null,null,null,null,null,null,null,null,null,null,null,null,null,null,null,null,null,"Schedule:"]
[null,null,null,null,null,null,null,null,null,null,null,null,null,null,null,null,null,null,"Page:"]
[]
[null,null,null,null,null,null,null,null,null,null,null,null,null,null,null,null,null,null,"Date:",null,"2016-11-28"]
[]
["Appendix 2-AB"]
["Table 2 - Capital Expenditure Summary from Chapter 5 Consolidated\nDistribution System Plan Filing Requirements"]
[]
["First year of Forecast Period:",{"$f":"TestYear","v":2017}]
["CATEGORY","Historical Period (previous plan1 & actual)",null,null,null,null,null,null,null,null,null,null,null,null,null,null,"Forecast Period (planned)"]
[null,{"$f":"E14-1","v":2012},null,null,{"$f":"H14-1","v":2013},null,null,{"$f":"K14-1","v":2014},null,null,{"$f":"N14-1","v":2015},null,null,{"$f":"Q14-1","v":2016},null,null,{"$f":"B12","v":2017},{"$f":"Q14+1","v":2018},{"$f":"R14+1","v":2019},2020,2021]
[null,"Plan","Actual","Var","Plan","Actual","Var","Plan","Actual","Var","Plan","Actual","Var","Plan","Actual2","Var"]
[null,"$ '000",null,"%","$ '000",null,"%","$ '000",null,"%","$ '000",null,"%","$ '000",null,"%","$ '000"]
["System Access",null,{"$f":"'App.2-AA_Capital Projects'!B36*$A$27","v":1750.5700400000001},{"$f":"IF(ISERROR((C17-B17)/B17),\"--\",(C17-B17)/B17)","v":"--"},null,{"$f":"'App.2-AA_Capital Projects'!C36*$A$27","v":1039.136},{"$f":"IF(ISERROR((F17-E17)/E17),\"--\",(F17-E17)/E17)","v":"--"},null,{"$f":"'App.2-AA_Capital Projects'!D36*$A$27","v":1262.8610000000001},{"$f":"IF(ISERROR((I17-H17)/H17),\"--\",(I17-H17)/H17)","v":"--"},null,{"$f":"'App.2-AA_Capital Projects'!E36*$A$27","v":896.14200000000005},{"$f":"IF(ISERROR((L17-K17)/K17),\"--\",(L17-K17)/K17)","v":"--"},null,{"$f":"'App.2-AA_Capital Projects'!F36*$A$27","v":1084.441},{"$f":"IF(ISERROR((O17-N17)/N17),\"--\",(O17-N17)/N17)","v":"--"},{"$f":"'App.2-AA_Capital Projects'!G36*$A$27","v":1185.6980000000001},1984,1595,1598,2013]
["System Renewal",null,{"$f":"'App.2-AA_Capital Projects'!B82*$A$27","v":654.298},{"$f":"IF(ISERROR((C18-B18)/B18),\"--\",(C18-B18)/B18)","v":"--"},null,{"$f":"'App.2-AA_Capital Projects'!C82*$A$27","v":986.94500000000005},{"$f":"IF(ISERROR((F18-E18)/E18),\"--\",(F18-E18)/E18)","v":"--"},null,{"$f":"'App.2-AA_Capital Projects'!D82*$A$27","v":697.048},{"$f":"IF(ISERROR((I18-H18)/H18),\"--\",(I18-H18)/H18)","v":"--"},null,{"$f":"'App.2-AA_Capital Projects'!E82*$A$27","v":487.483},{"$f":"IF(ISERROR((L18-K18)/K18),\"--\",(L18-K18)/K18)","v":"--"},null,{"$f":"'App.2-AA_Capital Projects'!F82*$A$27","v":999.245},{"$f":"IF(ISERROR((O18-N18)/N18),\"--\",(O18-N18)/N18)","v":"--"},{"$f":"'App.2-AA_Capital Projects'!G82*$A$27","v":1215.739},1140,2919,2400,2109]
["System Service",null,{"$f":"'App.2-AA_Capital Projects'!B124*$A$27","v":585.97500000000002},"--",null,{"$f":"'App.2-AA_Capital Projects'!C124*$A$27","v":1376.6010000000001},"--",null,{"$f":"'App.2-AA_Capital Projects'!D124*$A$27","v":2818.7759999999998},"--",null,{"$f":"'App.2-AA_Capital Projects'!E124*$A$27","v":2944.0970000000002},"--",null,{"$f":"'App.2-AA_Capital Projects'!F124*$A$27","v":1742.606},"--",{"$f":"'App.2-AA_Capital Projects'!G124*$A$27","v":3100.3740000000003},2829,1276,1556,1402]
["General Plant",null,{"$f":"'App.2-AA_Capital Projects'!B155*$A$27","v":827.53499999999997},"--",null,{"$f":"'App.2-AA_Capital Projects'!C155*$A$27","v":1348.453},"--",null,{"$f":"'App.2-AA_Capital Projects'!D155*$A$27","v":252.69800000000001},"--",null,{"$f":"'App.2-AA_Capital Projects'!E155*$A$27","v":13249.984},"--",null,{"$f":"'App.2-AA_Capital Projects'!F155*$A$27","v":660.50099999999998},"--",{"$f":"'App.2-AA_Capital Projects'!G155*$A$27","v":1187.135},1423,897,680,706]
["TOTAL EXPENDITURE",6084,{"$f":"SUM(C17:C20)","v":3818.3780400000001},-0.37239019723865879,9021,4751.1350000000002,-0.47332501939917965,13038,5031.3829999999998,-0.61409855806105229,5674,17577.705999999998,2.0979390200916459,4487,4486.7930000000006,-4.6133273902256562E-5,6688.9459999999999,7376,6687,6234,{"$f":"SUM(U17:U20)","v":6230}]
["System O&M",null,1761,"--",null,1787,"--",null,1814,"--",null,1805,"--",null,1986,"--",2246,2245,2246,2246,2246]
[]
["Notes to the Table:"]
["1. Historical “previous plan” data is not required unless a plan has previously been filed. However, use the last Board-approved, at least on a Total (Capital) Expenditure basis for the last cost of service rebasing year, and the applicant should include their planned budget in each subsequent historical year up to and including the Bridge Year."]
["2. Indicate the number of months of 'actual' data included in the last year of the Historical Period (normally a 'bridge' year):",null,null,null,null,null,null,null,null,6]
[1E-3]
["Explanatory Notes on Variances (complete only if applicable)"]
["Notes on shifts in forecast vs. historical budgets by category"]
[]
[]
["Notes on year over year Plan vs. Actual variances for Total Expenditures"]
[]
[]
["Notes on Plan vs. Actual variance trends for individual expenditure categories"]

{"sheet":"App.2-AC_Customer Engagement","index":7,"n_rows":38,"n_cols":3,"rows_kept":38,"cut":false,"hidden":false,"merged":[[9,0,9,2],[8,0,8,2]]}
[null,"File Number:",{"$f":"EBNUMBER","v":"EB-2016-0085"}]
[null,"Exhibit:",1]
[null,"Tab:"]
[null,"Schedule:"]
[null,"Page:"]
[]
[null,"Date:","2016-11-28"]
[]
["Appendix 2-AC"]
["Customer Engagement Activities Summary"]
[]
["Provide a list of customer engagement activities","Provide a list of customer needs and preferences identified through each engagement activity","Actions taken to respond to identified needs and preferences.  If no action was taken, explain why."]
["Call Centre/Customer Service Activities"]
["Providing service to approximately 6,000 customer walk-ins per year","Need to explain the bill, need to make payment arrangements, account balances, billing inquiries, services such as e-Billing, TOU rates, outages, conservation programs,  bill components. Enhancing customer education/knowledge\n","Maintain this service option including an ability to make payment in-person. Trained all front office staff to handle majority of issues, one stop service. Raised issues and concerns are discussed at customer service weekly huddle for communication and action to appropriate department."]
["InnPower Corporation managed over 21,000 inbound calls in 2015","Need to explain the bill, need to make payment arrangements, account balances, billing inquiries, services such as e-Billing, TOU rates, outages, conservation programs,  bill components. Enhancing customer education/knowledge\n"," Trained all front office staff to handle majority of issues, one stop service. Raised issues and concerns are discussed at customer service weekly huddle for communication and action to appropriate department."]
["Low Income customers and or customers having difficulty making payments","Low-income customers in need of assistance require information about low income programs available to them. ","Participation in the Low Income Energy Assistance Program\nContinuous training for Customer Service Representatives for AMP arrangements, OESP, LEAP and HAP CDM program"]
["Services for disabled customers","Disabled customers need to receive the same level and quality of service as non-disabled customers, regardless of any barriers there may be. ","InnPower Corporation is firmly committed to providing accessible, quality service to all customers and visitors in compliance with the Accessibility for Ontarians with Disability Act (AODA). InnPower Corporate Headquarters was designed to incorporate accessible building features\n\nCustomer Service staff and all other employees have been trained and re-trained annually to accommodate the needs of customers with disabilities.\n\n"]
["Community Outreach and Consumer Education","Customers and their families need information about how to understand your bill, causes of high bills, new energy programs (TOU,OESP) and conservation programs.","Customer Service, CDM and Operational staff attend community events to provide information, answer questions and provide face to face interaction to our customers.  From 2011 to 2015 InnPower has spent a total of 102 days at community events and educational sessions."]
["Operations Customer Engagement "]
["Emergency First Responders: Fire, Police, Ambulance","Emergency first responders must be made aware of electrical hazards they may encounter when responding to emergencies and taught how to keep themselves safe.","InnPower Corporation works closely with First Responders to ensure adequate knowledge of electrical hazards."]
["Customer Demand Work","Customer require new services, service upgrades, increased transformation, sevice new developments including subdivisions","Requests are managed via a scheduling process with appropriate priorization."]
["Trouble call response","Customer need for power restoration","24/7 coverage with ability to call in necessary resources to respond to most contingency situations"]
["Customers Impacted by Capital Improvements, Reconstruction Projects or Tree-Trimming","Customers need to be informed of planned outages or tree-trimming.","Customers who will be impacted by a planned outage or tree-trimming receive a hand-delivered notice that outlines details of the project and provides a number to call for questions."]
["Locating electrical infrastructure, approximately 4,000 requests per year","Need to build new infrastructure requires electrical plant to be safely located so construction can proceed\n","Locates are all now scheduled through On1Call as mandated by the Government of Ontario. On1Call then contacts InnPower Corporation via a file transfer process to schedule the appointment. "]
["Municipal Government Consultations - Town of Innisfil, Town of Barrie","Need for shared information on planning and development ","Plans need to be communicated in order to ensure appropriate design or construction decisions and system planning, and future capital planning."]
["Conservation Demand Management (CDM) Activities"]
["102 days of participation in community events and educational sessions on conservation programs from 2011 - 2016 (year to date). Full listing of all events and potentially outreach potential is detailed in Exhibit 1 Section 2.1.6 Customer Engagement.","Customers and their families need information about how to understand your bill, causes of high bills, new energy programs (TOU,OESP) and conservation programs and household conservation tips to assist customers to reduce overall consumption.","Community events and energy educational sessions are constantly updated based on customer feedback. Feedback is also provided to all departments via Management meetings to ensure opportunities can be addressed."]
["Commercial and Industrial Customer Site Visits ","Commercial and industrial customers need technical expertise to identify and implement complex commercial or industrial energy conservation projects.","More than 167 commerical and industrial customer visits were made between 2013 -2016 (YTD) by IPC's Roving Energy Manager and Conservation specialist. The purpose of the visits was to assist these customers in identifying and implementing complex commercial or industrial energy conservation projects as well as in submitting applications saveONenergy programs."]
["Customer Service TV","Customers and their families need information about how to understand your bill, causes of high bills, new energy programs (TOU,OESP) and conservation programs and household conservation tips to assist customers to reduce overall consumption.","Customer Service TV is constantly updated reflecting new rates, conservation programs, consumer alerts, etc."]
["Social Media - Facebook and Twitter","Customer behaviour during power outages has indicated their strong desire for up-to-the minute outage information and an almost immediate Twitter response to outages, 24 hours a day. Safety information prior to severe weather events appears to be greatly appreciated by customers.\nInformation about scams, energy conservation tips, safety information, etc. are retweeted by followers indicating a strong level of interest in these topics.\n","Community events and energy educational sessions are posted on social media. Outage updates are updated via Twitter which automatically posts to Facebooks providing customers options for updates. "]
["InnPower Corporation Corporate Engagement"]
["UtilityPulse Customer Satisfaction Survey 2014","Customers want low price and high value, customer service, company leadership, the business to be a good corporate steward, operational effectiveness and power quality/reliability. Customers require various communication channels to be kept informed","InnPower Corporation is in the process of developing a formal communication plan as to how IPC can continously improve communications to our customers. "]
["Shareholder Meetings","InnPower Corporation regulary meets with its shareholders to discuss IPC's plans, rates and the impact on customers.","IPC takes shareholder feedback and integrates into strategic planning"]
["Bill messages, bill inserts, envelope messages, advertising","Customers require information on rate changes, conservation programs, etc.\nSome customers prefer to receive information in print form.","Regular bill messages, bill inserts, envelope messages and print advertising informs customers about changes in rates, conservation programs, electrical safety topics, customer surveys, holiday hours, etc.\n"]
["Media Releases, Information Alerts ","Customers require information on material issues such as power outages, new services and price increases as well energy conservation initiatives.","InnPower Corporation sends out media releases and information alerts to keep customers informed."]
["InnPower Open House - opportunity to tour InnPower Corporations new Corporate Headquarters","InnPower Corporation hosted an open house of the new Coporate Headquarters. The focus was on the services and tools available to customers. Over 500 customers attended the open house. ","Management and staff on hand to meet with InnPower Corporation  customers and discussed electricity concerns and electricity conservation practices"]
[]
["Note:  Use \"ALT-ENTER\" to go to the next line within a cell"]

{"sheet":"App.2-B_Acctg Instructions","index":8,"n_rows":73,"n_cols":7,"rows_kept":73,"cut":false,"hidden":false,"merged":[[103,0,103,10],[103,11,103,18],[98,0,98,10],[98,11,98,18],[99,0,99,10],[99,11,99,18],[100,0,100,10],[100,11,100,18],[101,0,101,10],[101,11,101,18],[102,0,102,10],[107,0,107,10],[107,11,107,18],[108,0,108,10],[108,11,108,18],[109,0,109,10],[109,11,109,18],[104,0,104,10],[104,11,104,18],[105,0,105,10],[105,11,105,18],[106,0,106,10],[106,11,106,18],[115,0,115,10],[115,11,115,18],[110,0,110,10],[110,11,110,18],[111,0,111,10],[111,11,111,18],[112,0,112,10],[112,11,112,18],[119,0,119,10],[119,11,119,18],[113,0,113,10],[113,11,113,18],[114,0,114,10],[114,11,114,18],[120,0,120,10],[120,11,120,18],[121,0,121,10],[121,11,121,18],[116,0,116,10],[116,11,116,18],[117,0,117,10],[117,11,117,18],[118,0,118,10],[118,11,118,18],[128,0,128,10],[128,11,128,18],[125,0,125,10],[125,11,125,18],[126,0,126,10],[126,11,126,18],[127,0,127,10],[127,11,127,18],[122,0,122,10],[122,11,122,18],[123,0,123,10],[123,11,123,18],[124,0,124,10],[124,11,124,18],[95,11,95,18],[96,0,96,10],[96,11,96,18],[97,0,97,10],[97,11,97,18],[93,11,93,18],[94,0,94,10],[94,11,94,18],[102,11,102,18],[91,0,91,10],[91,11,91,18],[93,0,93,10],[84,11,84,18],[92,0,92,10],[92,11,92,18],[90,0,90,10],[90,11,90,18],[88,0,88,10],[88,11,88,18],[89,0,89,10],[89,11,89,18],[75,0,75,10],[75,11,75,18],[76,0,76,10],[76,11,76,18],[85,0,85,10],[85,11,85,18],[86,0,86,10],[86,11,86,18],[87,0,87,10],[77,11,77,18],[77,0,77,10],[78,11,78,18],[79,0,79,10],[79,11,79,18],[80,0,80,10],[80,11,80,18],[81,0,81,10],[81,11,81,18],[87,11,87,18],[82,0,82,10],[82,11,82,18],[83,0,83,10],[83,11,83,18],[84,0,84,10],[63,0,64,12],[72,0,72,12],[0,0,0,10],[1,0,1,10],[5,0,5,10],[31,0,33,10],[31,11,33,18],[39,0,41,10],[39,11,41,18],[25,0,27,10],[10,0,16,0],[8,4,8,5],[18,0,18,9],[19,0,19,8],[48,1,50,12],[52,1,53,12],[20,0,20,8],[51,1,51,12],[58,1,58,12],[59,1,59,12],[62,1,62,11]]}
["General Instructions to MIFRS Appendices"]
["Types of Schedules to File"]
[]
["The purpose of this tab is to provide general instructions.  The specific instructions to each appendix are listed in footnotes of each appendix."]
[]
["The typical applicant is expected to have made capitalization and depreciation policy changes under CGAAP as permitted by the Board on January 1, 2012 or mandated by the Board by January 1, 2013, and adopted IFRS for reporting purposes on January 1, 2015 (transition date January 1, 2014).  Some distributors filing for 2017 rates have rebased with these accounting changes reflected in a prior rebasing application.  If that is the case, information relating to pre-accounting policy changes is not generally required.  The information to be provided by applicants will depend on when the accounting policy changes were made and when they last rebased.  In general, applicants should provide the following information in the appendices: "]
[]
[]
[null,null,null,null,"Reflecting Accounting Policy Changes in Current Application",null,"Reflected Accounting Policy Changes in Prior Application3"]
[null,null,null,null,"Accounting Policy Changes in 2012 and Adopted IFRS in 2015","Accounting Policy Changes in 2013 and Adopted IFRS in 2015","Adopted IFRS in 2015"]
["Information to be filed in 2017 CoS Application",2017,"Test",null,"MIFRS","MIFRS","MIFRS"]
[null,2016,"Bridge",null,"MIFRS","MIFRS","MIFRS"]
[null,2015,"Historical",null,"MIFRS","MIFRS","MIFRS"]
[null,2014,"Historical",null," MIFRS and Revised CGAAP1"," MIFRS and Revised CGAAP1"," MIFRS and Revised CGAAP1"]
[null,2013,"Historical",null,"Revised CGAAP","CGAAP and Revised CGAAP2","Rebased under Revised CGAAP"]
[null,2012,"Historical",null,"CGAAP and Revised CGAAP2","CGAAP","Rebased under Revised CGAAP"]
[null,"Prior","Historicals",null,"Rebased under CGAAP","Rebased under CGAAP","N/A"]
[]
["1)  For the transition year (2014), the applicant may file two appendices, one under Revised CGAAP and one under MIFRS, depending on the materiality of impacts.  See the specific instructions under each appendix below for further details."]
["2) For applicants that are reflecting accounting policy changes for the first time in a rebasing application, the applicant must file two appendices in the year that the applicant implemented changes to its capitalization and depreciation policies (2012 or 2013), one before and one after the policy changes."]
["3) Applicants should provide CGGAP and Revised CGAAP schedules (i.e. as indicated in the first two columns of the above table) to support balances in Account 1576 if the account has yet to be disposed of."]
[]
["Appendix 2-BA - Fixed Asset Schedule "]
[]
["Applicants are to provide Appendix 2-BA in accordance with the years and corresponding accounting standards noted in the above table to provide a year over year continuity in fixed assets."]
["For the transition year (2014), the applicant should file two appendices, one under Revised CGAAP and one under MIFRS if the change between Revised CGAAP and MIFRS is material.  If the change from the accounting standards is not material, the applicant may choose to only provide one appendix under MIFRS.  However, the applicant must also indicate the fixed asset net book value balance under Revised CGAAP, the total dollar value of the change and explain why it is not material."]
[]
[]
[]
["Regulatory Gross Assets of Property, Plant and Equipment"]
[]
["For an applicant that adopted IFRS on January 1, 2015 for financial reporting purposes, the applicant must establish the continuity of historic cost by using the December 31, 2013 regulatory gross assets of property, plant and equipment as the opening January 1, 2014 regulatory gross assets.  The applicant must provide schedules (including Appendix 2-BA, Fixed Asset Continuity Schedule) which must identify the following details to substantiate the continuity of historic cost for regulatory purposes: "]
[]
[]
["·         December 31, 2013 regulatory gross assets of property, plant and equipment, by asset class; and"]
["·         January 1, 2014 regulatory gross assets of property, plant and equipment, by asset class."]
[]
["Accumulated Depreciation"]
[]
["For an applicant that adopted IFRS on January 1, 2015 for financial reporting purposes, the applicant must establish the continuity of historic cost by using the December 31, 2013 regulatory accumulated depreciation as the opening January 1, 2014 regulatory accumulated depreciation.  The applicant must provide schedules (including Appendix 2-BA, Fixed Asset Continuity Schedule) which must identify the following details to substantiate the continuity of historic cost for regulatory purposes: "]
[]
[]
["·         December 31, 2013 regulatory accumulated depreciation, by asset class; and"]
["·         January 1, 2014 regulatory accumulated depreciation, by asset class."]
[]
["Appendix 2-Cx - Depreciation and Amortization "]
[]
["Applicants are to provide Appendix 2-Cx in accordance with the years and corresponding accounting standards listed in the above table.  "]
["·       ","If an applicant is reflecting changes to its depreciation policies for the first time in a rebasing application, the applicant should complete Appendix 2-CA to 2-CG (changes made in 2012) or Appendix 2-CA to 2-CF (changes made in 2013).   In this set of appendices, the applicant will need to indicate the year it made the accounting policy changes.  The applicant must provide data starting from the year it made changes to its capitalization and depreciation policies."]
[]
[]
[null,"*Depreciation accounting policy changes were mandated by the Board by January 1, 2013. In general, no further changes to an applicant's depreciation policy (i.e.  assets' service lives) are expected after the Board mandated changes by January 1, 2013.  The set of Appendix 2-CA to 2-CG assumes this to be the case.  If the applicant has made any changes to its depreciation policy subsequent to the Board mandated changes,  applicants must identify the change, explain the nature of the change, the reason for the change, quantify the impact of the change, and quantify the depreciation expense before and after the change."]
["·       "," If an applicant changed depreciation policies and reflected these changes in a prior rebasing application, the applicant should complete Appendix 2-CH. The applicant must provide data starting from the earlier of 1) all historical years back to its last rebasing; or 2) at least three years of historical actuals, in addition to Bridge Year and Test Year forecasts."]
[]
[]
["Appendix 2-E - Account 1575, IFRS-CGAAP Transitional PP&E Amounts (2-EA), Account 1576, Accounting Changes Under CGAAP (2-EB, 2-EC)"]
[]
["1) For an applicant that has a balance in Account 1576 to dispose:"]
["·       ","If an applicant changed capitalization and depreciation policies effective January 1, 2012, the applicant must complete Appendix 2-EB "]
["·       ","If an applicant changed capitalization and depreciation policies effective January 1, 2013, the applicant must complete Appendix 2-EC"]
[]
["2) For an applicant that has a balance in Account 1575 to dispose:"]
["·       ","The applicant must complete 2-EA"]
[" If the applicant did not make any further PP&E accounting policy changes beyond the capitalization and depreciation policy changes as mandated by the Board by January 1, 2013 (i.e. no further changes made on transition to IFRS), the applicant must indicate this and does not need to complete Appendix 2-EA."]
[]
[]
[]
[]
["Please refer to section 2.12.4 and 2.12.5 of the Filing Requirements for further details."]
[]
["Appendix 2-Y - Summary of Impacts to Revenue Requirement from Transition to MIFRS"]
[]
["An applicant must provide a summary of the dollar impacts of MIFRS to each component of the revenue requirement (e.g. rate base, operating costs, etc.), including the overall impact on the proposed revenue requirement.  Accordingly,  the applicant must identify financial differences and resulting revenue requirement impacts arising from the adoption of  MIFRS as compared to CGAAP.  If the applicant is reflecting the changes in capitalization and depreciation policies for the first time in a rebasing application, then a comparison between MIFRS and CGAAP before the change in accounting policies should be completed.  If the applicant changed capitalization and depreciation policies and  reflected these changes in a prior rebasing application, then a comparison between MIFRS and CGAAP after the change in accounting policies should be completed.  "]

{"sheet":"App.2-BA_Fixed Asset Cont","index":9,"n_rows":391,"n_cols":13,"rows_kept":391,"cut":false,"hidden":false,"merged":[[86,1,87,12],[82,1,84,12],[73,1,74,12],[76,1,76,12],[8,0,8,12],[9,0,9,12],[14,3,14,6],[60,2,60,8],[61,2,61,8],[70,1,71,12],[88,0,88,12],[89,0,89,12],[94,3,94,6],[140,2,140,8],[141,2,141,8],[149,0,149,12],[150,0,150,12],[155,3,155,6],[201,2,201,8],[202,2,202,8],[210,0,210,12],[211,0,211,12],[216,3,216,6],[262,2,262,8],[263,2,263,8],[271,0,271,12],[272,0,272,12],[277,3,277,6],[323,2,323,8],[324,2,324,8],[332,0,332,12],[333,0,333,12],[338,3,338,6],[384,2,384,8],[385,2,385,8]]}
[null,null,null,null,null,null,null,null,null,null,null,"File Number:",{"$f":"EBNUMBER","v":"EB-2016-0085"}]
[null,null,null,null,null,null,null,null,null,null,null,"Exhibit:"]
[null,null,null,null,null,null,null,null,null,null,null,"Tab:"]
[null,null,null,null,null,null,null,null,null,null,null,"Schedule:"]
[null,null,null,null,null,null,null,null,null,null,null,"Page:"]
[]
[null,null,null,null,null,null,null,null,null,null,null,"Date:","2016-11-28"]
[]
["Appendix 2-BA"]
["Fixed Asset Continuity Schedule 1 "]
[]
[null,null,null,null,"Accounting Standard","CGAAP"]
[null,null,null,null,"Year ",2013]
[]
[null,null,null,"Cost",null,null,null,null,null,"Accumulated Depreciation"]
["CCA Class 2","OEB Account 3","Description 3","Opening Balance","Additions 4","Disposals 6","Closing Balance",null,"Opening Balance","Additions","Disposals 6","Closing Balance","Net Book Value"]
[12,1611,"Computer Software (Formally known as Account 1925)",{"$f":"'[11]FA Continuity 2013'!$D50","v":463501.72},{"$f":"'[11]FA Continuity 2013'!$E50","v":177249.6},{"$f":"'[11]FA Continuity 2013'!$F50","v":0},{"$f":"D17+E17+F17","v":640751.31999999995},null,{"$f":"'[11]FA Continuity 2013'!$I50","v":-342235.44},{"$f":"'[11]FA Continuity 2013'!$J$50","v":-95944.42},{"$f":"'[11]FA Continuity 2013'!$K50","v":0},{"$f":"I17+J17+K17","v":-438179.86},{"$f":"G17+L17","v":202571.45999999996}]
["CEC",1612,"Land Rights (Formally known as Account 1906)",{"$f":"'[11]FA Continuity 2013'!$D10","v":982510.18},{"$f":"'[11]FA Continuity 2013'!$E10","v":0},{"$f":"'[11]FA Continuity 2013'!$F10","v":0},{"$f":"D18+E18+F18","v":982510.18},null,{"$f":"'[11]FA Continuity 2013'!$I10","v":-572921.02},{"$f":"'[11]FA Continuity 2013'!$J10","v":-15126},{"$f":"'[11]FA Continuity 2013'!$K10","v":0},{"$f":"I18+J18+K18","v":-588047.02},{"$f":"G18+L18","v":394463.16000000003}]
["N/A",1805,"Land",{"$f":"'[11]FA Continuity 2013'!$D11","v":792971.28},{"$f":"'[11]FA Continuity 2013'!$E11","v":179065.56},{"$f":"'[11]FA Continuity 2013'!$F11","v":0},{"$f":"D19+E19+F19","v":972036.84000000008},null,{"$f":"'[11]FA Continuity 2013'!$I11","v":0},{"$f":"'[11]FA Continuity 2013'!$J11","v":0},{"$f":"'[11]FA Continuity 2013'!$K11","v":0},{"$f":"I19+J19+K19","v":0},{"$f":"G19+L19","v":972036.84000000008}]
[47,1808,"Buildings",{"$f":"'[11]FA Continuity 2013'!$D12","v":0},null,null,{"$f":"D20+E20+F20","v":0},null,null,{"$f":"'[11]FA Continuity 2013'!$J12","v":0},null,{"$f":"I20+J20+K20","v":0},{"$f":"G20+L20","v":0}]
[13,1810,"Leasehold Improvements",{"$f":"'[11]FA Continuity 2013'!$D13","v":86252},{"$f":"'[11]FA Continuity 2013'!$E13","v":0},{"$f":"'[11]FA Continuity 2013'!$F13","v":0},86252,null,{"$f":"'[11]FA Continuity 2013'!$I13","v":-86252},{"$f":"'[11]FA Continuity 2013'!$J13","v":0},{"$f":"'[11]FA Continuity 2013'!$K13","v":0},-86252,0]
[47,1815,"Transformer Station Equipment >50 kV",null,null,null,0,null,null,{"$f":"'[11]FA Continuity 2013'!$J14","v":-85926.76},null,-85926.76,-85926.76]
[47,1820,"Distribution Station Equipment <50 kV",{"$f":"'[11]FA Continuity 2013'!$D14","v":4311364.45},{"$f":"'[11]FA Continuity 2013'!$E$14","v":164417.71},{"$f":"'[11]FA Continuity 2013'!$F$14","v":0},4475782.16,null,{"$f":"'[11]FA Continuity 2013'!$I$14","v":-2413615.15},{"$f":"'[11]FA Continuity 2013'!$J15","v":0},{"$f":"'[11]FA Continuity 2013'!$K$14","v":0},-2413615.15,2062167.0100000002]
[47,1825,"Storage Battery Equipment",null,null,null,0,null,null,null,null,0,0]
[47,1830,"Poles, Towers & Fixtures",{"$f":"'[11]FA Continuity 2013'!$D$18","v":10110986.039999999},{"$f":"'[11]FA Continuity 2013'!$E$18","v":1112471.55},{"$f":"'[11]FA Continuity 2013'!$F$18","v":-92325.18},11131132.41,null,{"$f":"'[11]FA Continuity 2013'!$I$18","v":-4379463.6399999997},{"$f":"'[11]FA Continuity 2013'!$J$18","v":-196350.05},{"$f":"'[11]FA Continuity 2013'!$K$18","v":70398.080000000002},-4505415.6099999994,6625716.8000000007]
[47,1835,"Overhead Conductors & Devices",{"$f":"'[11]FA Continuity 2013'!$D$21","v":14057885.67},{"$f":"'[11]FA Continuity 2013'!$E$21","v":1403523.4},{"$f":"'[11]FA Continuity 2013'!$F$21","v":-50073.4},15411335.67,null,{"$f":"'[11]FA Continuity 2013'!$I$21","v":-7537250.0300000003},{"$f":"'[11]FA Continuity 2013'!$J$21","v":-188425.3},{"$f":"'[11]FA Continuity 2013'!$K$21","v":38213.61},-7687461.7199999997,7723873.9500000002]
[47,1840,"Underground Conduit",{"$f":"'[11]FA Continuity 2013'!$D$26","v":2440333.38},{"$f":"'[11]FA Continuity 2013'!$E$26","v":20539.09},{"$f":"'[11]FA Continuity 2013'!$F$26","v":0},2460872.4699999997,null,{"$f":"'[11]FA Continuity 2013'!$I$26","v":-549272.55000000005},{"$f":"'[11]FA Continuity 2013'!$J$26","v":-66667.86},{"$f":"'[11]FA Continuity 2013'!$K$26","v":0},-615940.41,1844932.0599999996]
[47,1845,"Underground Conductors & Devices",{"$f":"'[11]FA Continuity 2013'!$D$29+'[11]FA Continuity 2013'!$D$35","v":17022213.809999999},{"$f":"'[11]FA Continuity 2013'!$E$29+'[11]FA Continuity 2013'!$E$35","v":260368.63},{"$f":"'[11]FA Continuity 2013'!$F$29+'[11]FA Continuity 2013'!$F$35","v":-72273.489999999991},17210308.949999999,null,{"$f":"'[11]FA Continuity 2013'!$I$29+'[11]FA Continuity 2013'!$I$35","v":-7648015.0999999996},{"$f":"'[11]FA Continuity 2013'!$J$29","v":-243721.91},{"$f":"'[11]FA Continuity 2013'!$K$29+'[11]FA Continuity 2013'!$K$35","v":33489.33},-7858247.6799999997,9352061.2699999996]
[47,1850,"Line Transformers",{"$f":"'[11]FA Continuity 2013'!$D$34","v":4090747.32},{"$f":"'[11]FA Continuity 2013'!$E$34","v":132221.35999999996},{"$f":"'[11]FA Continuity 2013'!$F$34","v":29578.900000000009},4252547.58,null,{"$f":"'[11]FA Continuity 2013'!$I$34","v":-2611639.4300000002},{"$f":"'[11]FA Continuity 2013'!$J$34+'[11]FA Continuity 2013'!$J$35","v":-136314.89000000001},{"$f":"'[11]FA Continuity 2013'!$K$34","v":39601.71},-2708352.6100000003,1544194.9699999997]
[47,1855,"Services (Overhead & Underground)",{"$f":"'[11]FA Continuity 2013'!$D$37","v":4238781.24},{"$f":"'[11]FA Continuity 2013'!$E$37","v":228275.51},{"$f":"'[11]FA Continuity 2013'!$F$37","v":0},4467056.75,null,{"$f":"'[11]FA Continuity 2013'!$I$37","v":-1824389.1400000001},{"$f":"'[11]FA Continuity 2013'!$J$37","v":-72190.61},{"$f":"'[11]FA Continuity 2013'!$K$37","v":0},-1896579.7500000002,2570477]
[47,1860,"Meters (Smart Meters)",{"$f":"'[11]FA Continuity 2013'!$D$39","v":2446555.35},{"$f":"'[11]FA Continuity 2013'!$E$39","v":126985.75},{"$f":"'[11]FA Continuity 2013'!$F$39","v":-18761.580000000002},2554779.52,null,{"$f":"'[11]FA Continuity 2013'!$I$39","v":-570645.43999999994},{"$f":"'[11]FA Continuity 2013'!$J$39","v":-182147.8},{"$f":"'[11]FA Continuity 2013'!$K$39","v":16357.7},-736435.54,1818343.98]
[47,1860,"Meters",null,null,null,0,null,null,null,null,0,0]
["N/A",1905,"Land",{"$f":"'[11]FA Continuity 2013'!$D$43","v":863610.64},{"$f":"'[11]FA Continuity 2013'!$E$43","v":1015496.3},{"$f":"'[11]FA Continuity 2013'!$F$43","v":-662561.64},1216545.2999999998,null,{"$f":"'[11]FA Continuity 2013'!$I$43","v":0},{"$f":"'[11]FA Continuity 2013'!$J$43","v":0},{"$f":"'[11]FA Continuity 2013'!$K$43","v":0},0,1216545.2999999998]
[47,1908,"Buildings & Fixtures",{"$f":"'[11]FA Continuity 2013'!$D$45","v":744088.66},{"$f":"'[11]FA Continuity 2013'!$E$45","v":4303.58},{"$f":"'[11]FA Continuity 2013'!$F$45","v":0},748392.24,null,{"$f":"'[11]FA Continuity 2013'!$I$45","v":-285190.46000000002},{"$f":"'[11]FA Continuity 2013'!$J$45","v":-11324.18},{"$f":"'[11]FA Continuity 2013'!$K$45","v":0},-296514.64,451877.6]
[13,1910,"Leasehold Improvements",null,null,null,0,null,null,null,null,0,0]
[8,1915,"Office Furniture & Equipment (10 years)",{"$f":"'[11]FA Continuity 2013'!$D$47","v":314602.76},{"$f":"'[11]FA Continuity 2013'!$E$47","v":12060},{"$f":"'[11]FA Continuity 2013'!$F$47","v":0},326662.76,null,{"$f":"'[11]FA Continuity 2013'!$I$47","v":-247407.11},{"$f":"'[11]FA Continuity 2013'!$J$47","v":-14563.45},{"$f":"'[11]FA Continuity 2013'!$K$47","v":0},-261970.56,64692.200000000012]
[8,1915,"Office Furniture & Equipment (5 years)",null,null,null,0,null,null,null,null,0,0]
[10,1920,"Computer Equipment - Hardware",{"$f":"'[11]FA Continuity 2013'!$D$48","v":570318.02},{"$f":"'[11]FA Continuity 2013'!$E$48","v":61163.5},{"$f":"'[11]FA Continuity 2013'!$F$48","v":-33392.050000000003},598089.47,null,{"$f":"'[11]FA Continuity 2013'!$I$48","v":-387788.75},{"$f":"'[11]FA Continuity 2013'!$J$48","v":-66218.02},{"$f":"'[11]FA Continuity 2013'!$K$48","v":33174.01},-420832.76,177256.70999999996]
[45,1920,"Computer Equip.-Hardware(Post Mar. 22/04)",null,null,null,0,null,null,null,null,0,0]
[45.1,1920,"Computer Equip.-Hardware(Post Mar. 19/07)",null,null,null,0,null,null,null,null,0,0]
[10,1930,"Transportation Equipment",{"$f":"'[11]FA Continuity 2013'!$D$51","v":1167493.23},{"$f":"'[11]FA Continuity 2013'!$E$51","v":65100.15},{"$f":"'[11]FA Continuity 2013'!$F$51","v":0},1232593.3799999999,null,{"$f":"'[11]FA Continuity 2013'!$I$51","v":-598070.48},{"$f":"'[11]FA Continuity 2013'!$J$51","v":-144358.04},{"$f":"'[11]FA Continuity 2013'!$K$51","v":0},-742428.52,490164.85999999987]
[8,1935,"Stores Equipment",{"$f":"'[11]FA Continuity 2013'!$D$52","v":36284.949999999997},{"$f":"'[11]FA Continuity 2013'!$E$52","v":0},{"$f":"'[11]FA Continuity 2013'!$F$52","v":0},36284.949999999997,null,{"$f":"'[11]FA Continuity 2013'!$I$52","v":-20437.29},{"$f":"'[11]FA Continuity 2013'!$J$52","v":-2445.36},{"$f":"'[11]FA Continuity 2013'!$K$52","v":0},-22882.65,13402.299999999996]
[8,1940,"Tools, Shop & Garage Equipment",{"$f":"'[11]FA Continuity 2013'!$D$53","v":500835},{"$f":"'[11]FA Continuity 2013'!$E$53","v":8336.94},{"$f":"'[11]FA Continuity 2013'!$F$53","v":0},509171.94,null,{"$f":"'[11]FA Continuity 2013'!$I$53","v":-225010.46},{"$f":"'[11]FA Continuity 2013'!$J$53","v":-37618.379999999997},{"$f":"'[11]FA Continuity 2013'!$K$53","v":0},-262628.83999999997,246543.10000000003]
[8,1945,"Measurement & Testing Equipment",{"$f":"'[11]FA Continuity 2013'!$D$54","v":40374.720000000001},{"$f":"'[11]FA Continuity 2013'!$E$54","v":5794.24},{"$f":"'[11]FA Continuity 2013'!$F$54","v":0},46168.959999999999,null,{"$f":"'[11]FA Continuity 2013'!$I$54","v":-17081.900000000001},{"$f":"'[11]FA Continuity 2013'!$J$54","v":-3486.3},{"$f":"'[11]FA Continuity 2013'!$K$54","v":0},-20568.2,25600.76]
[8,1950,"Power Operated Equipment",null,null,null,0,null,null,null,null,0,0]
[8,1955,"Communications Equipment",null,null,null,0,null,null,null,null,0,0]
[8,1955,"Communication Equipment (Smart Meters)",null,null,null,0,null,null,null,null,0,0]
[8,1960,"Miscellaneous Equipment ",null,null,null,0,null,null,null,null,0,0]
[47,1970,"Load Management Controls Customer Premises",null,null,null,0,null,null,null,null,0,0]
[47,1975,"Load Management Controls Utility Premises",null,null,null,0,null,null,null,null,0,0]
[47,1980,"System Supervisor Equipment",{"$f":"'[11]FA Continuity 2013'!$D$58","v":1692883.1},{"$f":"'[11]FA Continuity 2013'!$E$58","v":202625.3},{"$f":"'[11]FA Continuity 2013'!$F$58","v":0},1895508.4000000001,null,{"$f":"'[11]FA Continuity 2013'!$I$58","v":-887493.9},{"$f":"'[11]FA Continuity 2013'!$J$58","v":-112506.33},{"$f":"'[11]FA Continuity 2013'!$K$58","v":0},-1000000.23,895508.17000000016]
[47,1985,"Miscellaneous Fixed Assets",null,null,null,0,null,null,null,null,0,0]
[47,1990,"Other Tangible Property",null,null,null,0,null,null,null,null,0,0]
[47,1995,"Contributions & Grants",{"$f":"'[11]FA Continuity 2013'!$D$63","v":-9364011.7300000004},{"$f":"'[11]FA Continuity 2013'!$E$63","v":-428862.62},{"$f":"'[11]FA Continuity 2013'!$F$63","v":0},-9792874.3499999996,null,{"$f":"'[11]FA Continuity 2013'!$I$63","v":1793095.54},{"$f":"'[11]FA Continuity 2013'!$J$63","v":243767.61},{"$f":"'[11]FA Continuity 2013'!$K$63","v":0},2036863.15,-7756011.1999999993]
[47,2440,"Deferred Revenue5"]
[null,null,null,null,null,null,0,null,null,null,null,0,0]
[null,null,"Sub-Total",{"$f":"SUM(D17:D56)","v":57610581.789999992},{"$f":"SUM(E17:E56)","v":4751135.55},{"$f":"SUM(F17:F56)","v":-899808.44000000006},{"$f":"SUM(G17:G56)","v":61461908.899999999},null,{"$f":"SUM(I17:I56)","v":-29411083.75},{"$f":"SUM(J17:J56)","v":-1431568.0500000003},{"$f":"SUM(K17:K56)","v":231234.44000000003},{"$f":"SUM(L17:L56)","v":-30611417.359999999},{"$f":"SUM(M17:M56)","v":30850491.539999995}]
[null,null,"Less Socialized Renewable Energy Generation Investments (input as negative)",null,null,null,{"$f":"D58+E58+F58","v":0},null,null,null,null,{"$f":"I58+J58+K58","v":0},{"$f":"G58+L58","v":0}]
[null,null,"Less Other Non Rate-Regulated Utility Assets (input as negative)",null,null,null,0,null,null,null,null,0,0]
[null,null,"Total PP&E",{"$f":"SUM(D57:D59)","v":57610581.789999992},{"$f":"SUM(E57:E59)","v":4751135.55},-899808.44000000006,61461908.899999999,null,{"$f":"SUM(I57:I59)","v":-29411083.75},-1431568.0500000003,231234.44000000003,-30611417.359999999,30850491.539999995]
[null,null,"Depreciation Expense adj. from gain or loss on the retirement of assets (pool of like assets), if applicable6"]
[null,null,"Total",null,null,null,null,null,null,{"$f":"J60+J61","v":-1431568.0500000003}]
[]
[null,null,null,null,null,null,null,null,"Less: Fully Allocated Depreciation"]
[10,null,"Transportation",null,null,null,null,null,"Transportation",null,-144358]
[8,null,"Stores Equipment",null,null,null,null,null,"Stores Equipment"]
[null,null,null,null,null,null,null,null,"Net Depreciation",null,{"$f":"J62-K65-K66","v":-1287210.0500000003}]
[]
["Notes:"]
[]
[1,"Tables in the format outlined above covering all fixed asset accounts should be submitted for the Test Year, Bridge Year and all relevant historical years.  At a minimum , the applicant must provide data for the earlier of: 1) all historical years back to its last rebasing; or 2) at least three years of historical actuals, in addition to Bridge Year and Test Year forecasts."]
[]
[]
[2,"The \"CCA Class\" for fixed assets should agree with the CCA Class used for tax purposes in Tax Returns. Fixed Assets sub-components may be used where the underlying asset components are classified under multiple CCA Classes for tax purposes. If an applicant uses any different classes from those shown in the table, an explanation should be provided. (also see note 3)."]
[]
[]
[3,"The table may need to be customized for a utility's asset categories or for any new asset accounts announced or authorized by the Board."]
[]
[4,"The additions in column (E) must not include construction work in progress (CWIP)."]
[]
[5,"Effective on the date of IFRS adoption, customer contributions will no longer be recorded in Account 1995 Contributions & Grants, but will be recorded in Account 2440, Deferred Revenues.  "]
[]
[6,"The applicant must ensure that all asset disposals have been clearly identified in the Chapter 2 Appendices for all historic, bridge and test years.  Where a distributor for general financial reporting purposes under IFRS has accounted for the amount of gain or loss on the retirement of assets in a pool of like assets as a charge or credit to income, for reporting and rate application filings, the distributor shall reclassify such gains and losses as depreciation expense, and disclose the amount separately."]
[]
[]
[]
[]
[]
["Appendix 2-BA"]
["Fixed Asset Continuity Schedule 1 "]
[]
[null,null,null,null,"Accounting Standard","CGAAP"]
[null,null,null,null,"Year ",2014]
[]
[null,null,null,"Cost",null,null,null,null,null,"Accumulated Depreciation"]
["CCA Class 2","OEB Account 3","Description 3","Opening Balance","Additions 4","Disposals 6","Closing Balance",null,"Opening Balance","Additions","Disposals 6","Closing Balance","Net Book Value"]
[12,1611,"Computer Software (Formally known as Account 1925)",{"$f":"'[11]FA Continuity CGAAP 2014'!$D$50","v":640751.31999999995},{"$f":"'[11]FA Continuity CGAAP 2014'!$E$50","v":198584.75},{"$f":"'[11]FA Continuity CGAAP 2014'!$F$50","v":-10519.15},{"$f":"D97+E97+F97","v":828816.91999999993},null,{"$f":"'[11]FA Continuity CGAAP 2014'!$I$50","v":-438179.86},{"$f":"'[11]FA Continuity CGAAP 2014'!$J$50","v":-133980.79999999999},{"$f":"'[11]FA Continuity CGAAP 2014'!$K$50","v":10519.15},{"$f":"I97+J97+K97","v":-561641.50999999989},{"$f":"G97+L97","v":267175.41000000003}]
["CEC",1612,"Land Rights (Formally known as Account 1906)",{"$f":"'[11]FA Continuity CGAAP 2014'!$D$10","v":982510.18},{"$f":"'[11]FA Continuity CGAAP 2014'!$E$10","v":0},{"$f":"'[11]FA Continuity CGAAP 2014'!$F$10","v":0},{"$f":"D98+E98+F98","v":982510.18},null,{"$f":"'[11]FA Continuity CGAAP 2014'!$I$10","v":-588047.02},{"$f":"'[11]FA Continuity CGAAP 2014'!$J$10","v":-15126},{"$f":"'[11]FA Continuity CGAAP 2014'!$K$10","v":0},{"$f":"I98+J98+K98","v":-603173.02},{"$f":"G98+L98","v":379337.16000000003}]
["N/A",1805,"Land",{"$f":"'[11]FA Continuity CGAAP 2014'!$D$11","v":972036.84000000008},{"$f":"'[11]FA Continuity CGAAP 2014'!$E$11","v":0},{"$f":"'[11]FA Continuity CGAAP 2014'!$F$11","v":0},{"$f":"D99+E99+F99","v":972036.84000000008},null,{"$f":"'[11]FA Continuity CGAAP 2014'!$I$11","v":0},{"$f":"'[11]FA Continuity CGAAP 2014'!$J$11","v":0},{"$f":"'[11]FA Continuity CGAAP 2014'!$K$11","v":0},{"$f":"I99+J99+K99","v":0},{"$f":"G99+L99","v":972036.84000000008}]
[47,1808,"Buildings",{"$f":"'[11]FA Continuity CGAAP 2014'!$D$12","v":0},{"$f":"'[11]FA Continuity CGAAP 2014'!$E$12","v":0},{"$f":"'[11]FA Continuity CGAAP 2014'!$F$12","v":0},{"$f":"D100+E100+F100","v":0},null,{"$f":"'[11]FA Continuity CGAAP 2014'!$I$12","v":0},{"$f":"'[11]FA Continuity CGAAP 2014'!$J$12","v":0},{"$f":"'[11]FA Continuity CGAAP 2014'!$K$12","v":0},{"$f":"I100+J100+K100","v":0},{"$f":"G100+L100","v":0}]
[13,1810,"Leasehold Improvements",{"$f":"'[11]FA Continuity CGAAP 2014'!$D$13","v":86252},{"$f":"'[11]FA Continuity CGAAP 2014'!$E$13","v":0},{"$f":"'[11]FA Continuity CGAAP 2014'!$F$13","v":0},86252,null,{"$f":"'[11]FA Continuity CGAAP 2014'!$I$13","v":-86252},{"$f":"'[11]FA Continuity CGAAP 2014'!$J$13","v":0},{"$f":"'[11]FA Continuity CGAAP 2014'!$K$13","v":0},-86252,0]
[47,1815,"Transformer Station Equipment >50 kV",null,null,null,0,null,null,null,null,0,0]
[47,1820,"Distribution Station Equipment <50 kV",{"$f":"'[11]FA Continuity CGAAP 2014'!$D$14","v":4475782.16},{"$f":"'[11]FA Continuity CGAAP 2014'!$E$14","v":2895486.45},{"$f":"'[11]FA Continuity CGAAP 2014'!$F$14","v":-391900.8},6979367.8100000005,null,{"$f":"'[11]FA Continuity CGAAP 2014'!$I$14","v":-2499541.9099999997},{"$f":"'[11]FA Continuity CGAAP 2014'!$J$14","v":-133796.76999999999},{"$f":"'[11]FA Continuity CGAAP 2014'!$K$14","v":229098.42},-2404240.2599999998,4575127.5500000007]
[47,1825,"Storage Battery Equipment",null,null,null,0,null,null,null,null,0,0]
[47,1830,"Poles, Towers & Fixtures",{"$f":"'[11]FA Continuity CGAAP 2014'!$D$18","v":11131132.41},{"$f":"'[11]FA Continuity CGAAP 2014'!$E$18","v":576010.85},{"$f":"'[11]FA Continuity CGAAP 2014'!$F$18","v":-28624.760000000002},11678518.5,null,{"$f":"'[11]FA Continuity CGAAP 2014'!$I$18","v":-4505415.6099999994},{"$f":"'[11]FA Continuity CGAAP 2014'!$J$18","v":-214178.88},{"$f":"'[11]FA Continuity CGAAP 2014'!$K$18","v":17611.52},-4701982.97,6976535.5300000003]
[47,1835,"Overhead Conductors & Devices",{"$f":"'[11]FA Continuity CGAAP 2014'!$D$21","v":15411335.67},{"$f":"'[11]FA Continuity CGAAP 2014'!$E$21","v":724698.04},{"$f":"'[11]FA Continuity CGAAP 2014'!$F$21","v":-37174.42},16098859.290000001,null,{"$f":"'[11]FA Continuity CGAAP 2014'!$I$21","v":-7687461.7199999997},{"$f":"'[11]FA Continuity CGAAP 2014'!$J$21","v":-206930.88},{"$f":"'[11]FA Continuity CGAAP 2014'!$K$21","v":28198.54},-7866194.0599999996,8232665.2300000014]
[47,1840,"Underground Conduit",{"$f":"'[11]FA Continuity CGAAP 2014'!$D$26","v":2460872.4699999997},{"$f":"'[11]FA Continuity CGAAP 2014'!$E$26","v":320502.08},{"$f":"'[11]FA Continuity CGAAP 2014'!$F$26","v":0},2781374.55,null,{"$f":"'[11]FA Continuity CGAAP 2014'!$I$26","v":-615940.41},{"$f":"'[11]FA Continuity CGAAP 2014'!$J$26","v":-70930.880000000005},{"$f":"'[11]FA Continuity CGAAP 2014'!$K$26","v":0},-686871.29,2094503.2599999998]
[47,1845,"Underground Conductors & Devices",{"$f":"'[11]FA Continuity CGAAP 2014'!$D$29","v":12070665.5},{"$f":"'[11]FA Continuity CGAAP 2014'!$E$29","v":279956.42},{"$f":"'[11]FA Continuity CGAAP 2014'!$F$29","v":-11882.33},12338739.59,null,{"$f":"'[11]FA Continuity CGAAP 2014'!$I$29","v":-4814495.42},{"$f":"'[11]FA Continuity CGAAP 2014'!$J$29","v":-247482.95},{"$f":"'[11]FA Continuity CGAAP 2014'!$K$29","v":5208.37},-5056770,7281969.5899999999]
[47,1850,"Line Transformers",{"$f":"'[11]FA Continuity CGAAP 2014'!$D$34","v":9392191.0300000012},{"$f":"'[11]FA Continuity CGAAP 2014'!$E$34","v":556533.29},{"$f":"'[11]FA Continuity CGAAP 2014'!$F$34","v":-116969.44},9831754.8800000008,null,{"$f":"'[11]FA Continuity CGAAP 2014'!$I$34","v":-5752104.870000001},{"$f":"'[11]FA Continuity CGAAP 2014'!$J$34","v":-146575.75},{"$f":"'[11]FA Continuity CGAAP 2014'!$K$34","v":46068.49},-5852612.1300000008,3979142.75]
[47,1855,"Services (Overhead & Underground)",{"$f":"'[11]FA Continuity CGAAP 2014'!$D$37","v":4467056.75},{"$f":"'[11]FA Continuity CGAAP 2014'!$E$37","v":519763.79},{"$f":"'[11]FA Continuity CGAAP 2014'!$F$37","v":-2272.98},4984547.5599999996,null,{"$f":"'[11]FA Continuity CGAAP 2014'!$I$37","v":-1896579.7500000002},{"$f":"'[11]FA Continuity CGAAP 2014'!$J$37","v":-81169.09},{"$f":"'[11]FA Continuity CGAAP 2014'!$K$37","v":180.83999999999997},-1977568.0000000002,3006979.5599999996]
[47,1860,"Meters (Smart Meters)",{"$f":"'[11]FA Continuity CGAAP 2014'!$D$39","v":2554779.52},{"$f":"'[11]FA Continuity CGAAP 2014'!$E$39","v":131826.75},{"$f":"'[11]FA Continuity CGAAP 2014'!$F$39","v":-61196.319999999992},2625409.9500000002,null,{"$f":"'[11]FA Continuity CGAAP 2014'!$I$39","v":-736435.54},{"$f":"'[11]FA Continuity CGAAP 2014'!$J$39","v":-176031.72},{"$f":"'[11]FA Continuity CGAAP 2014'!$K$39","v":14831.32},-897635.94000000006,1727774.0100000002]
[47,1860,"Meters",null,null,null,0,null,null,null,null,0,0]
["N/A",1905,"Land",{"$f":"'[11]FA Continuity CGAAP 2014'!$D$43","v":1216545.2999999998},{"$f":"'[11]FA Continuity CGAAP 2014'!$E$43","v":0},{"$f":"'[11]FA Continuity CGAAP 2014'!$F$43","v":0},1216545.2999999998,null,{"$f":"'[11]FA Continuity CGAAP 2014'!$I$43","v":0},{"$f":"'[11]FA Continuity CGAAP 2014'!$J$43","v":0},{"$f":"'[11]FA Continuity CGAAP 2014'!$K$43","v":0},0,1216545.2999999998]
[47,1908,"Buildings & Fixtures",{"$f":"'[11]FA Continuity CGAAP 2014'!$D$45","v":748392.24},{"$f":"'[11]FA Continuity CGAAP 2014'!$E$45","v":0},{"$f":"'[11]FA Continuity CGAAP 2014'!$F$45","v":0},748392.24,null,{"$f":"'[11]FA Continuity CGAAP 2014'!$I$45","v":-296514.64},{"$f":"'[11]FA Continuity CGAAP 2014'!$J$45","v":-11367.21},{"$f":"'[11]FA Continuity CGAAP 2014'!$K$45","v":0},-307881.85000000003,440510.38999999996]
[13,1910,"Leasehold Improvements",null,null,null,0,null,null,null,null,0,0]
[8,1915,"Office Furniture & Equipment (10 years)",{"$f":"'[11]FA Continuity CGAAP 2014'!$D$47","v":326662.76},{"$f":"'[11]FA Continuity CGAAP 2014'!$E$47","v":9292},{"$f":"'[11]FA Continuity CGAAP 2014'!$F$47","v":0},335954.76,null,{"$f":"'[11]FA Continuity CGAAP 2014'!$I$47","v":-261970.56},{"$f":"'[11]FA Continuity CGAAP 2014'!$J$47","v":-14034},{"$f":"'[11]FA Continuity CGAAP 2014'!$K$47","v":0},-276004.56,59950.200000000012]
[8,1915,"Office Furniture & Equipment (5 years)",null,null,null,0,null,null,null,null,0,0]
[10,1920,"Computer Equipment - Hardware",{"$f":"'[11]FA Continuity CGAAP 2014'!$D$48","v":598089.47},{"$f":"'[11]FA Continuity CGAAP 2014'!$E$48","v":80063.460000000006},{"$f":"'[11]FA Continuity CGAAP 2014'!$F$48","v":-130613.09},547539.84,null,{"$f":"'[11]FA Continuity CGAAP 2014'!$I$48","v":-420832.76},{"$f":"'[11]FA Continuity CGAAP 2014'!$J$48","v":-70671.009999999995},{"$f":"'[11]FA Continuity CGAAP 2014'!$K$48","v":130613.09},-360890.68000000005,186649.15999999992]
[45,1920,"Computer Equip.-Hardware(Post Mar. 22/04)",null,null,null,0,null,null,null,null,0,0]
[45.1,1920,"Computer Equip.-Hardware(Post Mar. 19/07)",null,null,null,0,null,null,null,null,0,0]
[10,1930,"Transportation Equipment",{"$f":"'[11]FA Continuity CGAAP 2014'!$D$51","v":1232593.3799999999},{"$f":"'[11]FA Continuity CGAAP 2014'!$E$51","v":3267.67},{"$f":"'[11]FA Continuity CGAAP 2014'!$F$51","v":0},1235861.0499999998,null,{"$f":"'[11]FA Continuity CGAAP 2014'!$I$51","v":-742428.52},{"$f":"'[11]FA Continuity CGAAP 2014'!$J$51","v":-139931.45000000001},{"$f":"'[11]FA Continuity CGAAP 2014'!$K$51","v":0},-882359.97,353501.07999999984]
[8,1935,"Stores Equipment",{"$f":"'[11]FA Continuity CGAAP 2014'!$D$52","v":36284.949999999997},{"$f":"'[11]FA Continuity CGAAP 2014'!$E$52","v":4787.59},{"$f":"'[11]FA Continuity CGAAP 2014'!$F$52","v":0},41072.539999999994,null,{"$f":"'[11]FA Continuity CGAAP 2014'!$I$52","v":-22882.65},{"$f":"'[11]FA Continuity CGAAP 2014'!$J$52","v":-2588.65},{"$f":"'[11]FA Continuity CGAAP 2014'!$K$52","v":0},-25471.300000000003,15601.239999999991]
[8,1940,"Tools, Shop & Garage Equipment",{"$f":"'[11]FA Continuity CGAAP 2014'!$D$53","v":509171.94},{"$f":"'[11]FA Continuity CGAAP 2014'!$E$53","v":17552.580000000002},{"$f":"'[11]FA Continuity CGAAP 2014'!$F$53","v":0},526724.52,null,{"$f":"'[11]FA Continuity CGAAP 2014'!$I$53","v":-262628.83999999997},{"$f":"'[11]FA Continuity CGAAP 2014'!$J$53","v":-38485.83},{"$f":"'[11]FA Continuity CGAAP 2014'!$K$53","v":0},-301114.67,225609.85000000003]
[8,1945,"Measurement & Testing Equipment",{"$f":"'[11]FA Continuity CGAAP 2014'!$D$54","v":46168.959999999999},{"$f":"'[11]FA Continuity CGAAP 2014'!$E$54","v":4066.7},{"$f":"'[11]FA Continuity CGAAP 2014'!$F$54","v":0},50235.659999999996,null,{"$f":"'[11]FA Continuity CGAAP 2014'!$I$54","v":-20568.2},{"$f":"'[11]FA Continuity CGAAP 2014'!$J$54","v":-3979.35},{"$f":"'[11]FA Continuity CGAAP 2014'!$K$54","v":0},-24547.55,25688.109999999997]
[8,1950,"Power Operated Equipment",null,null,null,0,null,null,null,null,0,0]
[8,1955,"Communications Equipment",null,null,null,0,null,null,null,null,0,0]
[8,1955,"Communication Equipment (Smart Meters)",null,null,null,0,null,null,null,null,0,0]
[8,1960,"Miscellaneous Equipment ",null,null,null,0,null,null,null,null,0,0]
[47,1970,"Load Management Controls Customer Premises",null,null,null,0,null,null,null,null,0,0]
[47,1975,"Load Management Controls Utility Premises",null,null,null,0,null,null,null,null,0,0]
[47,1980,"System Supervisor Equipment",{"$f":"'[11]FA Continuity CGAAP 2014'!$D$58","v":1895508.4000000001},{"$f":"'[11]FA Continuity CGAAP 2014'!$E$58","v":125462.03},{"$f":"'[11]FA Continuity CGAAP 2014'!$F$58","v":0},2020970.4300000002,null,{"$f":"'[11]FA Continuity CGAAP 2014'!$I$58","v":-1000000.23},{"$f":"'[11]FA Continuity CGAAP 2014'!$J$58","v":-118906.41},{"$f":"'[11]FA Continuity CGAAP 2014'!$K$58","v":0},-1118906.6399999999,902063.79000000027]
[47,1985,"Miscellaneous Fixed Assets",null,null,null,0,null,null,null,null,0,0]
[47,1990,"Other Tangible Property",null,null,null,0,null,null,null,null,0,0]
[47,1995,"Contributions & Grants",{"$f":"'[11]FA Continuity CGAAP 2014'!$D$63","v":-9792874.3499999996},{"$f":"'[11]FA Continuity CGAAP 2014'!$E$63","v":-1416471.4},{"$f":"'[11]FA Continuity CGAAP 2014'!$F$63","v":3874.77},-11205470.98,null,{"$f":"'[11]FA Continuity CGAAP 2014'!$I$63","v":2036863.15},{"$f":"'[11]FA Continuity CGAAP 2014'!$J$63","v":268851.62},{"$f":"'[11]FA Continuity CGAAP 2014'!$K$63","v":-6.43},2305708.34,-8899762.6400000006]
[47,2440,"Deferred Revenue5"]
[null,null,null,null,null,null,{"$f":"D136+E136+F136","v":0},null,null,null,null,{"$f":"I136+J136+K136","v":0},{"$f":"G136+L136","v":0}]
[null,null,"Sub-Total",{"$f":"SUM(D97:D136)","v":61461908.899999999},{"$f":"SUM(E97:E136)","v":5031383.0500000007},{"$f":"SUM(F97:F136)","v":-787278.5199999999},{"$f":"SUM(G97:G136)","v":65706013.429999992},null,{"$f":"SUM(I97:I136)","v":-30611417.359999996},{"$f":"SUM(J97:J136)","v":-1557316.0099999998},{"$f":"SUM(K97:K136)","v":482323.31},{"$f":"SUM(L97:L136)","v":-31686410.060000006},{"$f":"SUM(M97:M136)","v":34019603.370000005}]
[null,null,"Less Socialized Renewable Energy Generation Investments (input as negative)",null,null,null,{"$f":"D138+E138+F138","v":0},null,null,null,null,{"$f":"I138+J138+K138","v":0},{"$f":"G138+L138","v":0}]
[null,null,"Less Other Non Rate-Regulated Utility Assets (input as negative)",null,null,null,0,null,null,null,null,0,0]
[null,null,"Total PP&E",{"$f":"SUM(D137:D139)","v":61461908.899999999},{"$f":"SUM(E137:E139)","v":5031383.0500000007},-787278.5199999999,65706013.429999992,null,{"$f":"SUM(I137:I139)","v":-30611417.359999996},-1557316.0099999998,482323.31,-31686410.060000006,34019603.370000005]
[null,null,"Depreciation Expense adj. from gain or loss on the retirement of assets (pool of like assets), if applicable6"]
[null,null,"Total",null,null,null,null,null,null,{"$f":"J140+J141","v":-1557316.0099999998}]
[]
[null,null,null,null,null,null,null,null,"Less: Fully Allocated Depreciation"]
[10,null,"Transportation",null,null,null,null,null,"Transportation",null,-139931]
[8,null,"Stores Equipment",null,null,null,null,null,"Stores Equipment"]
[null,null,null,null,null,null,null,null,"Net Depreciation",null,{"$f":"J142-K145-K146","v":-1417385.0099999998}]
[]
[]
["Appendix 2-BA"]
["Fixed Asset Continuity Schedule 1 "]
[]
[null,null,null,null,"Accounting Standard","MIFRS"]
[null,null,null,null,"Year ",2014]
[]
[null,null,null,"Cost",null,null,null,null,null,"Accumulated Depreciation"]
["CCA Class 2","OEB Account 3","Description 3","Opening Balance","Additions 4","Disposals 6","Closing Balance",null,"Opening Balance","Additions","Disposals 6","Closing Balance","Net Book Value"]
[12,1611,"Computer Software (Formally known as Account 1925)",{"$f":"'[11]FA Continuity MIFRS 2014'!$D$50","v":202571.45999999996},{"$f":"'[11]FA Continuity MIFRS 2014'!$E$50","v":198584.75},{"$f":"'[11]FA Continuity MIFRS 2014'!$F$50","v":0},{"$f":"D158+E158+F158","v":401156.20999999996},null,{"$f":"'[11]FA Continuity MIFRS 2014'!$I$50","v":0},{"$f":"'[11]FA Continuity MIFRS 2014'!$J$50","v":-133980.79999999999},{"$f":"'[11]FA Continuity MIFRS 2014'!$K$50","v":0},{"$f":"I158+J158+K158","v":-133980.79999999999},{"$f":"G158+L158","v":267175.40999999997}]
["CEC",1612,"Land Rights (Formally known as Account 1906)",{"$f":"'[11]FA Continuity MIFRS 2014'!$D$10","v":394463.16000000003},{"$f":"'[11]FA Continuity MIFRS 2014'!$E$10","v":0},{"$f":"'[11]FA Continuity MIFRS 2014'!$F$10","v":0},{"$f":"D159+E159+F159","v":394463.16000000003},null,{"$f":"'[11]FA Continuity MIFRS 2014'!$I$10","v":0},{"$f":"'[11]FA Continuity MIFRS 2014'!$J$10","v":-15126},{"$f":"'[11]FA Continuity MIFRS 2014'!$K$10","v":0},{"$f":"I159+J159+K159","v":-15126},{"$f":"G159+L159","v":379337.16000000003}]
["N/A",1805,"Land",{"$f":"'[11]FA Continuity MIFRS 2014'!$D$11","v":972036.84000000008},{"$f":"'[11]FA Continuity MIFRS 2014'!$E$11","v":0},{"$f":"'[11]FA Continuity MIFRS 2014'!$F$11","v":0},{"$f":"D160+E160+F160","v":972036.84000000008},null,{"$f":"'[11]FA Continuity MIFRS 2014'!$I$11","v":0},{"$f":"'[11]FA Continuity MIFRS 2014'!$J$11","v":0},{"$f":"'[11]FA Continuity MIFRS 2014'!$K$11","v":0},{"$f":"I160+J160+K160","v":0},{"$f":"G160+L160","v":972036.84000000008}]
[47,1808,"Buildings",null,null,null,{"$f":"D161+E161+F161","v":0},null,null,null,null,{"$f":"I161+J161+K161","v":0},{"$f":"G161+L161","v":0}]
[13,1810,"Leasehold Improvements",null,null,null,0,null,null,null,null,0,0]
[47,1815,"Transformer Station Equipment >50 kV",null,null,null,0,null,null,null,null,0,0]
[47,1820,"Distribution Station Equipment <50 kV",{"$f":"'[11]FA Continuity MIFRS 2014'!$D$14","v":1976240.2500000005},{"$f":"'[11]FA Continuity MIFRS 2014'!$E$14","v":2895486.45},{"$f":"'[11]FA Continuity MIFRS 2014'!$F$14","v":-162802.37999999998},4708924.3200000012,null,{"$f":"'[11]FA Continuity MIFRS 2014'!$I$14","v":0},{"$f":"'[11]FA Continuity MIFRS 2014'!$J$14","v":-133796.76999999999},{"$f":"'[11]FA Continuity MIFRS 2014'!$K$14","v":0},-133796.76999999999,4575127.5500000017]
[47,1825,"Storage Battery Equipment",null,null,null,0,null,null,null,null,0,0]
[47,1830,"Poles, Towers & Fixtures",{"$f":"'[11]FA Continuity MIFRS 2014'!$D$18","v":6625716.8000000007},{"$f":"'[11]FA Continuity MIFRS 2014'!$E$18","v":576010.85},{"$f":"'[11]FA Continuity MIFRS 2014'!$F$18","v":-11013.240000000002},7190714.4100000001,null,{"$f":"'[11]FA Continuity MIFRS 2014'!$I$18","v":0},{"$f":"'[11]FA Continuity MIFRS 2014'!$J$18","v":-214178.88},{"$f":"'[11]FA Continuity MIFRS 2014'!$K$18","v":0},-214178.88,6976535.5300000003]
[47,1835,"Overhead Conductors & Devices",{"$f":"'[11]FA Continuity MIFRS 2014'!$D$21","v":7723873.9500000002},{"$f":"'[11]FA Continuity MIFRS 2014'!$E$21","v":724698.04},{"$f":"'[11]FA Continuity MIFRS 2014'!$F$21","v":-8975.8799999999974},8439596.1099999994,null,{"$f":"'[11]FA Continuity MIFRS 2014'!$I$21","v":0},{"$f":"'[11]FA Continuity MIFRS 2014'!$J$21","v":-206930.88},{"$f":"'[11]FA Continuity MIFRS 2014'!$K$21","v":0},-206930.88,8232665.2299999995]
[47,1840,"Underground Conduit",{"$f":"'[11]FA Continuity MIFRS 2014'!$D$26","v":1844932.0599999996},{"$f":"'[11]FA Continuity MIFRS 2014'!$E$26","v":320502.08},{"$f":"'[11]FA Continuity MIFRS 2014'!$F$26","v":0},2165434.1399999997,null,{"$f":"'[11]FA Continuity MIFRS 2014'!$I$26","v":0},{"$f":"'[11]FA Continuity MIFRS 2014'!$J$26","v":-70930.880000000005},{"$f":"'[11]FA Continuity MIFRS 2014'!$K$26","v":0},-70930.880000000005,2094503.2599999998]
[47,1845,"Underground Conductors & Devices",{"$f":"'[11]FA Continuity MIFRS 2014'!$D$29","v":7256170.0800000001},{"$f":"'[11]FA Continuity MIFRS 2014'!$E$29","v":279956.42},{"$f":"'[11]FA Continuity MIFRS 2014'!$F$29","v":-6673.96},7529452.54,null,{"$f":"'[11]FA Continuity MIFRS 2014'!$I$29","v":0},{"$f":"'[11]FA Continuity MIFRS 2014'!$J$29","v":-247482.95},{"$f":"'[11]FA Continuity MIFRS 2014'!$K$29","v":0},-247482.95,7281969.5899999999]
[47,1850,"Line Transformers",{"$f":"'[11]FA Continuity MIFRS 2014'!$D$34","v":3640086.16},{"$f":"'[11]FA Continuity MIFRS 2014'!$E$34","v":556533.29},{"$f":"'[11]FA Continuity MIFRS 2014'!$F$34","v":-70900.950000000012},4125718.5,null,{"$f":"'[11]FA Continuity MIFRS 2014'!$I$34","v":0},{"$f":"'[11]FA Continuity MIFRS 2014'!$J$34","v":-146575.75},{"$f":"'[11]FA Continuity MIFRS 2014'!$K$34","v":0},-146575.75,3979142.75]
[47,1855,"Services (Overhead & Underground)",{"$f":"'[11]FA Continuity MIFRS 2014'!$D$37","v":2570477},{"$f":"'[11]FA Continuity MIFRS 2014'!$E$37","v":519763.79},{"$f":"'[11]FA Continuity MIFRS 2014'!$F$37","v":-2092.14},3088148.65,null,{"$f":"'[11]FA Continuity MIFRS 2014'!$I$37","v":0},{"$f":"'[11]FA Continuity MIFRS 2014'!$J$37","v":-81169.09},{"$f":"'[11]FA Continuity MIFRS 2014'!$K$37","v":0},-81169.09,3006979.56]
[47,1860,"Meters (Smart Meters)",{"$f":"'[11]FA Continuity MIFRS 2014'!$D$39","v":1818343.98},{"$f":"'[11]FA Continuity MIFRS 2014'!$E$39","v":131826.75},{"$f":"'[11]FA Continuity MIFRS 2014'!$F$39","v":-46364.999999999993},1903805.73,null,{"$f":"'[11]FA Continuity MIFRS 2014'!$I$39","v":0},{"$f":"'[11]FA Continuity MIFRS 2014'!$J$39","v":-176031.72},{"$f":"'[11]FA Continuity MIFRS 2014'!$K$39","v":0},-176031.72,1727774.01]
[47,1860,"Meters",null,null,null,0,null,null,null,null,0,0]
["N/A",1905,"Land",{"$f":"'[11]FA Continuity MIFRS 2014'!$D$43","v":1216545.2999999998},{"$f":"'[11]FA Continuity MIFRS 2014'!$E$43","v":0},{"$f":"'[11]FA Continuity MIFRS 2014'!$F$43","v":0},1216545.2999999998,null,{"$f":"'[11]FA Continuity MIFRS 2014'!$I$43","v":0},{"$f":"'[11]FA Continuity MIFRS 2014'!$J$43","v":0},{"$f":"'[11]FA Continuity MIFRS 2014'!$K$43","v":0},0,1216545.2999999998]
[47,1908,"Buildings & Fixtures",{"$f":"'[11]FA Continuity MIFRS 2014'!$D$45","v":451877.6},{"$f":"'[11]FA Continuity MIFRS 2014'!$E$45","v":0},{"$f":"'[11]FA Continuity MIFRS 2014'!$F$45","v":0},451877.6,null,{"$f":"'[11]FA Continuity MIFRS 2014'!$I$45","v":0},{"$f":"'[11]FA Continuity MIFRS 2014'!$J$45","v":-11367.21},{"$f":"'[11]FA Continuity MIFRS 2014'!$K$45","v":0},-11367.21,440510.38999999996]
[13,1910,"Leasehold Improvements",null,null,null,0,null,null,null,null,0,0]
[8,1915,"Office Furniture & Equipment (10 years)",{"$f":"'[11]FA Continuity MIFRS 2014'!$D$47","v":64692.200000000012},{"$f":"'[11]FA Continuity MIFRS 2014'!$E$47","v":9292},{"$f":"'[11]FA Continuity MIFRS 2014'!$F$47","v":0},73984.200000000012,null,{"$f":"'[11]FA Continuity MIFRS 2014'!$I$47","v":0},{"$f":"'[11]FA Continuity MIFRS 2014'!$J$47","v":-14034},{"$f":"'[11]FA Continuity MIFRS 2014'!$K$47","v":0},-14034,59950.200000000012]
[8,1915,"Office Furniture & Equipment (5 years)",null,null,null,0,null,null,null,null,0,0]
[10,1920,"Computer Equipment - Hardware",{"$f":"'[11]FA Continuity MIFRS 2014'!$D$48","v":177256.70999999996},{"$f":"'[11]FA Continuity MIFRS 2014'!$E$48","v":80063.460000000006},{"$f":"'[11]FA Continuity MIFRS 2014'!$F$48","v":0},257320.16999999998,null,{"$f":"'[11]FA Continuity MIFRS 2014'!$I$48","v":0},{"$f":"'[11]FA Continuity MIFRS 2014'!$J$48","v":-70671.009999999995},{"$f":"'[11]FA Continuity MIFRS 2014'!$K$48","v":0},-70671.009999999995,186649.15999999997]
[45,1920,"Computer Equip.-Hardware(Post Mar. 22/04)",null,null,null,0,null,null,null,null,0,0]
[45.1,1920,"Computer Equip.-Hardware(Post Mar. 19/07)",null,null,null,0,null,null,null,null,0,0]
[10,1930,"Transportation Equipment",{"$f":"'[11]FA Continuity MIFRS 2014'!$D$51","v":490164.85999999987},{"$f":"'[11]FA Continuity MIFRS 2014'!$E$51","v":3267.67},{"$f":"'[11]FA Continuity MIFRS 2014'!$F$51","v":0},493432.52999999985,null,{"$f":"'[11]FA Continuity MIFRS 2014'!$I$51","v":0},{"$f":"'[11]FA Continuity MIFRS 2014'!$J$51","v":-139931.45000000001},{"$f":"'[11]FA Continuity MIFRS 2014'!$K$51","v":0},-139931.45000000001,353501.07999999984]
[8,1935,"Stores Equipment",{"$f":"'[11]FA Continuity MIFRS 2014'!$D$52","v":13402.299999999996},{"$f":"'[11]FA Continuity MIFRS 2014'!$E$52","v":4787.59},{"$f":"'[11]FA Continuity MIFRS 2014'!$F$52","v":0},18189.889999999996,null,{"$f":"'[11]FA Continuity MIFRS 2014'!$I$52","v":0},{"$f":"'[11]FA Continuity MIFRS 2014'!$J$52","v":-2588.65},{"$f":"'[11]FA Continuity MIFRS 2014'!$K$52","v":0},-2588.65,15601.239999999996]
[8,1940,"Tools, Shop & Garage Equipment",{"$f":"'[11]FA Continuity MIFRS 2014'!$D$53","v":246543.10000000003},{"$f":"'[11]FA Continuity MIFRS 2014'!$E$53","v":17552.580000000002},{"$f":"'[11]FA Continuity MIFRS 2014'!$F$53","v":0},264095.68000000005,null,{"$f":"'[11]FA Continuity MIFRS 2014'!$I$53","v":0},{"$f":"'[11]FA Continuity MIFRS 2014'!$J$53","v":-38485.83},{"$f":"'[11]FA Continuity MIFRS 2014'!$K$53","v":0},-38485.83,225609.85000000003]
[8,1945,"Measurement & Testing Equipment",{"$f":"'[11]FA Continuity MIFRS 2014'!$D$54","v":25600.76},{"$f":"'[11]FA Continuity MIFRS 2014'!$E$54","v":4066.7},{"$f":"'[11]FA Continuity MIFRS 2014'!$F$54","v":0},29667.46,null,{"$f":"'[11]FA Continuity MIFRS 2014'!$I$54","v":0},{"$f":"'[11]FA Continuity MIFRS 2014'!$J$54","v":-3979.35},{"$f":"'[11]FA Continuity MIFRS 2014'!$K$54","v":0},-3979.35,25688.11]
[8,1950,"Power Operated Equipment",null,null,null,0,null,null,null,null,0,0]
[8,1955,"Communications Equipment",null,null,null,0,null,null,null,null,0,0]
[8,1955,"Communication Equipment (Smart Meters)",null,null,null,0,null,null,null,null,0,0]
[8,1960,"Miscellaneous Equipment ",null,null,null,0,null,null,null,null,0,0]
[47,1970,"Load Management Controls Customer Premises",null,null,null,0,null,null,null,null,0,0]
[47,1975,"Load Management Controls Utility Premises",null,null,null,0,null,null,null,null,0,0]
[47,1980,"System Supervisor Equipment",{"$f":"'[11]FA Continuity MIFRS 2014'!$D$58","v":895508.17000000016},{"$f":"'[11]FA Continuity MIFRS 2014'!$E$58","v":125462.03},{"$f":"'[11]FA Continuity MIFRS 2014'!$F$58","v":0},1020970.2000000002,null,{"$f":"'[11]FA Continuity MIFRS 2014'!$I$58","v":0},{"$f":"'[11]FA Continuity MIFRS 2014'!$J$58","v":-118833.41},{"$f":"'[11]FA Continuity MIFRS 2014'!$K$58","v":0},-118833.41,902136.79000000015]
[47,1985,"Miscellaneous Fixed Assets",null,null,null,0,null,null,null,null,0,0]
[47,1990,"Other Tangible Property",null,null,null,0,null,null,null,null,0,0]
[47,1995,"Contributions & Grants",{"$f":"'[11]FA Continuity MIFRS 2014'!$D$63","v":-7756011.1999999993},{"$f":"'[11]FA Continuity MIFRS 2014'!$E$63","v":-1416471.4},{"$f":"'[11]FA Continuity MIFRS 2014'!$F$63","v":3868.57},-9168614.0299999993,null,{"$f":"'[11]FA Continuity MIFRS 2014'!$I$63","v":0},{"$f":"'[11]FA Continuity MIFRS 2014'!$J$63","v":268928.62},{"$f":"'[11]FA Continuity MIFRS 2014'!$K$63","v":0},268928.62,-8899685.4100000001]
[47,2440,"Deferred Revenue5"]
[null,null,null,null,null,null,{"$f":"D197+E197+F197","v":0},null,null,null,null,{"$f":"I197+J197+K197","v":0},{"$f":"G197+L197","v":0}]
[null,null,"Sub-Total",{"$f":"SUM(D158:D197)","v":30850491.540000003},{"$f":"SUM(E158:E197)","v":5031383.0500000007},{"$f":"SUM(F158:F197)","v":-304954.98},{"$f":"SUM(G158:G197)","v":35576919.610000007},null,{"$f":"SUM(I158:I197)","v":0},{"$f":"SUM(J158:J197)","v":-1557166.0099999998},{"$f":"SUM(K158:K197)","v":0},{"$f":"SUM(L158:L197)","v":-1557166.0099999998},{"$f":"SUM(M158:M197)","v":34019753.600000009}]
[null,null,"Less Socialized Renewable Energy Generation Investments (input as negative)",null,null,null,{"$f":"D199+E199+F199","v":0},null,null,null,null,{"$f":"I199+J199+K199","v":0},{"$f":"G199+L199","v":0}]
[null,null,"Less Other Non Rate-Regulated Utility Assets (input as negative)",null,null,null,0,null,null,null,null,0,0]
[null,null,"Total PP&E",{"$f":"SUM(D198:D200)","v":30850491.540000003},{"$f":"SUM(E198:E200)","v":5031383.0500000007},-304954.98,35576919.610000007,null,{"$f":"SUM(I198:I200)","v":0},-1557166.0099999998,0,-1557166.0099999998,34019753.600000009]
[null,null,"Depreciation Expense adj. from gain or loss on the retirement of assets (pool of like assets), if applicable6"]
[null,null,"Total",null,null,null,null,null,null,{"$f":"J201+J202","v":-1557166.0099999998}]
[]
[null,null,null,null,null,null,null,null,"Less: Fully Allocated Depreciation"]
[10,null,"Transportation",null,null,null,null,null,"Transportation",null,-139931]
[8,null,"Stores Equipment",null,null,null,null,null,"Stores Equipment"]
[null,null,null,null,null,null,null,null,"Net Depreciation",null,{"$f":"J203-K206-K207","v":-1417235.0099999998}]
[]
[]
["Appendix 2-BA"]
["Fixed Asset Continuity Schedule 1 "]
[]
[null,null,null,null,"Accounting Standard","MIFRS"]
[null,null,null,null,"Year ",2015]
[]
[null,null,null,"Cost",null,null,null,null,null,"Accumulated Depreciation"]
["CCA Class 2","OEB Account 3","Description 3","Opening Balance","Additions 4","Disposals 6","Closing Balance",null,"Opening Balance","Additions","Disposals 6","Closing Balance","Net Book Value"]
[12,1611,"Computer Software (Formally known as Account 1925)",{"$f":"'[11]FA Continuity MIFRS 2015'!$D$50","v":401156.20999999996},{"$f":"'[11]FA Continuity MIFRS 2015'!$E$50","v":185053},{"$f":"'[11]FA Continuity MIFRS 2015'!$F$50","v":-15673},{"$f":"D219+E219+F219","v":570536.21},null,{"$f":"'[11]FA Continuity MIFRS 2015'!$I$50","v":-133980.79999999999},{"$f":"'[11]FA Continuity MIFRS 2015'!$J$50","v":-169499},{"$f":"'[11]FA Continuity MIFRS 2015'!$K$50","v":15673},{"$f":"I219+J219+K219","v":-287806.8},{"$f":"G219+L219","v":282729.40999999997}]
["CEC",1612,"Land Rights (Formally known as Account 1906)",{"$f":"'[11]FA Continuity MIFRS 2015'!$D$10","v":394463.16000000003},{"$f":"'[11]FA Continuity MIFRS 2015'!$E$10","v":0},{"$f":"'[11]FA Continuity MIFRS 2015'!$F$10","v":-17},{"$f":"D220+E220+F220","v":394446.16000000003},null,{"$f":"'[11]FA Continuity MIFRS 2015'!$I$10","v":-15126},{"$f":"'[11]FA Continuity MIFRS 2015'!$J$10","v":-12699},{"$f":"'[11]FA Continuity MIFRS 2015'!$K$10","v":17},{"$f":"I220+J220+K220","v":-27808},{"$f":"G220+L220","v":366638.16000000003}]
["N/A",1805,"Land",{"$f":"'[11]FA Continuity MIFRS 2015'!$D$11","v":972036.84000000008},{"$f":"'[11]FA Continuity MIFRS 2015'!$E$11","v":77556},{"$f":"'[11]FA Continuity MIFRS 2015'!$F$11","v":0},{"$f":"D221+E221+F221","v":1049592.8400000001},null,{"$f":"'[11]FA Continuity MIFRS 2015'!$I$11","v":0},{"$f":"'[11]FA Continuity MIFRS 2015'!$J$11","v":0},{"$f":"'[11]FA Continuity MIFRS 2015'!$K$11","v":0},{"$f":"I221+J221+K221","v":0},{"$f":"G221+L221","v":1049592.8400000001}]
[47,1808,"Buildings",null,null,null,{"$f":"D222+E222+F222","v":0},null,null,null,null,{"$f":"I222+J222+K222","v":0},{"$f":"G222+L222","v":0}]
[13,1810,"Leasehold Improvements",null,null,null,0,null,null,null,null,0,0]
[47,1815,"Transformer Station Equipment >50 kV",null,null,null,0,null,null,null,null,0,0]
[47,1820,"Distribution Station Equipment <50 kV",{"$f":"'[11]FA Continuity MIFRS 2015'!$D$14","v":4708924.3200000012},{"$f":"'[11]FA Continuity MIFRS 2015'!$E$14","v":779993},{"$f":"'[11]FA Continuity MIFRS 2015'!$F$14","v":-3109},5485808.3200000012,null,{"$f":"'[11]FA Continuity MIFRS 2015'!$I$14","v":-133796.76999999999},{"$f":"'[11]FA Continuity MIFRS 2015'!$J$14","v":-191509},{"$f":"'[11]FA Continuity MIFRS 2015'!$K$14","v":3109},-322196.77,5163611.5500000007]
[47,1825,"Storage Battery Equipment",null,null,null,0,null,null,null,null,0,0]
[47,1830,"Poles, Towers & Fixtures",{"$f":"'[11]FA Continuity MIFRS 2015'!$D$18","v":7190714.4100000001},{"$f":"'[11]FA Continuity MIFRS 2015'!$E$18","v":1533272},{"$f":"'[11]FA Continuity MIFRS 2015'!$F$18","v":-12553},8711433.4100000001,null,{"$f":"'[11]FA Continuity MIFRS 2015'!$I$18","v":-214178.88},{"$f":"'[11]FA Continuity MIFRS 2015'!$J$18","v":-237728},{"$f":"'[11]FA Continuity MIFRS 2015'!$K$18","v":1204},-450702.88,8260730.5300000003]
[47,1835,"Overhead Conductors & Devices",{"$f":"'[11]FA Continuity MIFRS 2015'!$D$21","v":8439596.1099999994},{"$f":"'[11]FA Continuity MIFRS 2015'!$E$21","v":1390592},{"$f":"'[11]FA Continuity MIFRS 2015'!$F$21","v":-9487},9820701.1099999994,null,{"$f":"'[11]FA Continuity MIFRS 2015'!$I$21","v":-206930.88},{"$f":"'[11]FA Continuity MIFRS 2015'!$J$21","v":-225949},{"$f":"'[11]FA Continuity MIFRS 2015'!$K$21","v":1291},-431588.88,9389112.2299999986]
[47,1840,"Underground Conduit",{"$f":"'[11]FA Continuity MIFRS 2015'!$D$26","v":2165434.1399999997},{"$f":"'[11]FA Continuity MIFRS 2015'!$E$26","v":546399},{"$f":"'[11]FA Continuity MIFRS 2015'!$F$26","v":-15253},2696580.1399999997,null,{"$f":"'[11]FA Continuity MIFRS 2015'!$I$26","v":-70930.880000000005},{"$f":"'[11]FA Continuity MIFRS 2015'!$J$26","v":-81467},{"$f":"'[11]FA Continuity MIFRS 2015'!$K$26","v":192},-152205.88,2544374.2599999998]
[47,1845,"Underground Conductors & Devices",{"$f":"'[11]FA Continuity MIFRS 2015'!$D$29","v":7529452.54},{"$f":"'[11]FA Continuity MIFRS 2015'!$E$29","v":283406},{"$f":"'[11]FA Continuity MIFRS 2015'!$F$29","v":-7492},7805366.54,null,{"$f":"'[11]FA Continuity MIFRS 2015'!$I$29","v":-247482.95},{"$f":"'[11]FA Continuity MIFRS 2015'!$J$29","v":-254303},{"$f":"'[11]FA Continuity MIFRS 2015'!$K$29","v":579},-501206.95,7304159.5899999999]
[47,1850,"Line Transformers",{"$f":"'[11]FA Continuity MIFRS 2015'!$D$34","v":4125718.5},{"$f":"'[11]FA Continuity MIFRS 2015'!$E$34","v":999677},{"$f":"'[11]FA Continuity MIFRS 2015'!$F$34","v":-22972},5102423.5,null,{"$f":"'[11]FA Continuity MIFRS 2015'!$I$34","v":-146575.75},{"$f":"'[11]FA Continuity MIFRS 2015'!$J$34","v":-164241},{"$f":"'[11]FA Continuity MIFRS 2015'!$K$34","v":3807},-307009.75,4795413.75]
[47,1855,"Services (Overhead & Underground)",{"$f":"'[11]FA Continuity MIFRS 2015'!$D$37","v":3088148.65},{"$f":"'[11]FA Continuity MIFRS 2015'!$E$37","v":479966},{"$f":"'[11]FA Continuity MIFRS 2015'!$F$37","v":-9769},3558345.65,null,{"$f":"'[11]FA Continuity MIFRS 2015'!$I$37","v":-81169.09},{"$f":"'[11]FA Continuity MIFRS 2015'!$J$37","v":-93028},{"$f":"'[11]FA Continuity MIFRS 2015'!$K$37","v":146},-174051.09,3384294.56]
[47,1860,"Meters (Smart Meters)",{"$f":"'[11]FA Continuity MIFRS 2015'!$D$39","v":1903805.73},{"$f":"'[11]FA Continuity MIFRS 2015'!$E$39","v":113146},{"$f":"'[11]FA Continuity MIFRS 2015'!$F$39","v":-11281},2005670.73,null,{"$f":"'[11]FA Continuity MIFRS 2015'!$I$39","v":-176031.72},{"$f":"'[11]FA Continuity MIFRS 2015'!$J$39","v":-178804},{"$f":"'[11]FA Continuity MIFRS 2015'!$K$39","v":3192},-351643.72,1654027.01]
[47,1860,"Meters",null,null,null,0,null,null,null,null,0,0]
["N/A",1905,"Land",{"$f":"'[11]FA Continuity MIFRS 2015'!$D$43","v":1216545.2999999998},{"$f":"'[11]FA Continuity MIFRS 2015'!$E$43","v":0},{"$f":"'[11]FA Continuity MIFRS 2015'!$F$43","v":-201049},1015496.2999999998,null,{"$f":"'[11]FA Continuity MIFRS 2015'!$I$43","v":0},{"$f":"'[11]FA Continuity MIFRS 2015'!$J$43","v":0},{"$f":"'[11]FA Continuity MIFRS 2015'!$K$43","v":0},0,1015496.2999999998]
[47,1908,"Buildings & Fixtures",{"$f":"'[11]FA Continuity MIFRS 2015'!$D$45","v":451877.6},{"$f":"'[11]FA Continuity MIFRS 2015'!$E$45","v":12430510},{"$f":"'[11]FA Continuity MIFRS 2015'!$F$45","v":-451878},12430509.6,null,{"$f":"'[11]FA Continuity MIFRS 2015'!$I$45","v":-11367.21},{"$f":"'[11]FA Continuity MIFRS 2015'!$J$45","v":-145132},{"$f":"'[11]FA Continuity MIFRS 2015'!$K$45","v":17051},-139448.21,12291061.389999999]
[13,1910,"Leasehold Improvements",null,null,null,0,null,null,null,null,0,0]
[8,1915,"Office Furniture & Equipment (10 years)",{"$f":"'[11]FA Continuity MIFRS 2015'!$D$47","v":73984.200000000012},{"$f":"'[11]FA Continuity MIFRS 2015'!$E$47","v":154231},{"$f":"'[11]FA Continuity MIFRS 2015'!$F$47","v":-4713},223502.2,null,{"$f":"'[11]FA Continuity MIFRS 2015'!$I$47","v":-14034},{"$f":"'[11]FA Continuity MIFRS 2015'!$J$47","v":-19569},{"$f":"'[11]FA Continuity MIFRS 2015'!$K$47","v":1467},-32136,191366.2]
[8,1915,"Office Furniture & Equipment (5 years)",null,null,null,0,null,null,null,null,0,0]
[10,1920,"Computer Equipment - Hardware",{"$f":"'[11]FA Continuity MIFRS 2015'!$D$48","v":257320.16999999998},{"$f":"'[11]FA Continuity MIFRS 2015'!$E$48","v":149497},{"$f":"'[11]FA Continuity MIFRS 2015'!$F$48","v":-5283},401534.17,null,{"$f":"'[11]FA Continuity MIFRS 2015'!$I$48","v":-70671.009999999995},{"$f":"'[11]FA Continuity MIFRS 2015'!$J$48","v":-82659},{"$f":"'[11]FA Continuity MIFRS 2015'!$K$48","v":4831},-148499.01,253035.15999999997]
[45,1920,"Computer Equip.-Hardware(Post Mar. 22/04)",null,null,null,0,null,null,null,null,0,0]
[45.1,1920,"Computer Equip.-Hardware(Post Mar. 19/07)",null,null,null,0,null,null,null,null,0,0]
[10,1930,"Transportation Equipment",{"$f":"'[11]FA Continuity MIFRS 2015'!$D$51","v":493432.52999999985},{"$f":"'[11]FA Continuity MIFRS 2015'!$E$51","v":33347},{"$f":"'[11]FA Continuity MIFRS 2015'!$F$51","v":-9505},517274.5299999998,null,{"$f":"'[11]FA Continuity MIFRS 2015'!$I$51","v":-139931.45000000001},{"$f":"'[11]FA Continuity MIFRS 2015'!$J$51","v":-120051},{"$f":"'[11]FA Continuity MIFRS 2015'!$K$51","v":8589},-251393.45,265881.07999999978]
[8,1935,"Stores Equipment",{"$f":"'[11]FA Continuity MIFRS 2015'!$D$52","v":18189.889999999996},{"$f":"'[11]FA Continuity MIFRS 2015'!$E$52","v":117204},{"$f":"'[11]FA Continuity MIFRS 2015'!$F$52","v":-59},135334.88999999998,null,{"$f":"'[11]FA Continuity MIFRS 2015'!$I$52","v":-2588.65},{"$f":"'[11]FA Continuity MIFRS 2015'!$J$52","v":-8603},{"$f":"'[11]FA Continuity MIFRS 2015'!$K$52","v":59},-11132.65,124202.23999999999]
[8,1940,"Tools, Shop & Garage Equipment",{"$f":"'[11]FA Continuity MIFRS 2015'!$D$53","v":264095.68000000005},{"$f":"'[11]FA Continuity MIFRS 2015'!$E$53","v":41581},{"$f":"'[11]FA Continuity MIFRS 2015'!$F$53","v":-109},305567.68000000005,null,{"$f":"'[11]FA Continuity MIFRS 2015'!$I$53","v":-38485.83},{"$f":"'[11]FA Continuity MIFRS 2015'!$J$53","v":-41285},{"$f":"'[11]FA Continuity MIFRS 2015'!$K$53","v":109},-79661.83,225905.85000000003]
[8,1945,"Measurement & Testing Equipment",{"$f":"'[11]FA Continuity MIFRS 2015'!$D$54","v":29667.46},{"$f":"'[11]FA Continuity MIFRS 2015'!$E$54","v":0},{"$f":"'[11]FA Continuity MIFRS 2015'!$F$54","v":0},29667.46,null,{"$f":"'[11]FA Continuity MIFRS 2015'!$I$54","v":-3979.35},{"$f":"'[11]FA Continuity MIFRS 2015'!$J$54","v":-4161},{"$f":"'[11]FA Continuity MIFRS 2015'!$K$54","v":0},-8140.35,21527.11]
[8,1950,"Power Operated Equipment",null,null,null,0,null,null,null,null,0,0]
[8,1955,"Communications Equipment",null,null,null,0,null,null,null,null,0,0]
[8,1955,"Communication Equipment (Smart Meters)",null,null,null,0,null,null,null,null,0,0]
[8,1960,"Miscellaneous Equipment ",null,null,null,0,null,null,null,null,0,0]
[47,1970,"Load Management Controls Customer Premises",null,null,null,0,null,null,null,null,0,0]
[47,1975,"Load Management Controls Utility Premises",null,null,null,0,null,null,null,null,0,0]
[47,1980,"System Supervisor Equipment",{"$f":"'[11]FA Continuity MIFRS 2015'!$D$58","v":1020970.2000000002},{"$f":"'[11]FA Continuity MIFRS 2015'!$E$58","v":569196},{"$f":"'[11]FA Continuity MIFRS 2015'!$F$58","v":-2569},1587597.2000000002,null,{"$f":"'[11]FA Continuity MIFRS 2015'!$I$58","v":-118833.41},{"$f":"'[11]FA Continuity MIFRS 2015'!$J$58","v":-133510},{"$f":"'[11]FA Continuity MIFRS 2015'!$K$58","v":2569},-249774.41,1337822.7900000003]
[47,1985,"Miscellaneous Fixed Assets",null,null,null,0,null,null,null,null,0,0]
[47,1990,"Other Tangible Property",null,null,null,0,null,null,null,null,0,0]
[47,1995,"Contributions & Grants",{"$f":"'[11]FA Continuity MIFRS 2015'!$D$63","v":-9168614.0299999993},{"$f":"'[11]FA Continuity MIFRS 2015'!$E$63","v":-2267837},{"$f":"'[11]FA Continuity MIFRS 2015'!$F$63","v":77513},-11358938.029999999,null,{"$f":"'[11]FA Continuity MIFRS 2015'!$I$63","v":268928.62},{"$f":"'[11]FA Continuity MIFRS 2015'!$J$63","v":313336},{"$f":"'[11]FA Continuity MIFRS 2015'!$K$63","v":782.96},583047.57999999996,-10775890.449999999]
[47,2440,"Deferred Revenue5"]
[null,null,null,null,null,null,{"$f":"D258+E258+F258","v":0},null,null,null,null,{"$f":"I258+J258+K258","v":0},{"$f":"G258+L258","v":0}]
[null,null,"Sub-Total",{"$f":"SUM(D219:D258)","v":35576919.610000007},{"$f":"SUM(E219:E258)","v":17616789},{"$f":"SUM(F219:F258)","v":-705258},{"$f":"SUM(G219:G258)","v":52488450.610000007},null,{"$f":"SUM(I219:I258)","v":-1557166.0099999998},{"$f":"SUM(J219:J258)","v":-1850861},{"$f":"SUM(K219:K258)","v":64667.96},{"$f":"SUM(L219:L258)","v":-3343359.05},{"$f":"SUM(M219:M258)","v":49145091.559999987}]
[null,null,"Less Socialized Renewable Energy Generation Investments (input as negative)",null,null,null,{"$f":"D260+E260+F260","v":0},null,null,null,null,{"$f":"I260+J260+K260","v":0},{"$f":"G260+L260","v":0}]
[null,null,"Less Other Non Rate-Regulated Utility Assets (input as negative)",null,null,null,0,null,null,null,null,0,0]
[null,null,"Total PP&E",{"$f":"SUM(D259:D261)","v":35576919.610000007},{"$f":"SUM(E259:E261)","v":17616789},-705258,52488450.610000007,null,{"$f":"SUM(I259:I261)","v":-1557166.0099999998},-1850861,64667.96,-3343359.05,49145091.559999987]
[null,null,"Depreciation Expense adj. from gain or loss on the retirement of assets (pool of like assets), if applicable6"]
[null,null,"Total",null,null,null,null,null,null,{"$f":"J262+J263","v":-1850861}]
[]
[null,null,null,null,null,null,null,null,"Less: Fully Allocated Depreciation"]
[10,null,"Transportation",null,null,null,null,null,"Transportation",null,-120051]
[8,null,"Stores Equipment",null,null,null,null,null,"Contributions",null,313336]
[null,null,null,null,null,null,null,null,"Net Depreciation",null,{"$f":"J264-K267-K268","v":-2044146}]
[]
[]
["Appendix 2-BA"]
["Fixed Asset Continuity Schedule 1 "]
[]
[null,null,null,null,"Accounting Standard","MIFRS"]
[null,null,null,null,"Year ",2016]
[]
[null,null,null,"Cost",null,null,null,null,null,"Accumulated Depreciation"]
["CCA Class 2","OEB Account 3","Description 3","Opening Balance","Additions 4","Disposals 6","Closing Balance",null,"Opening Balance","Additions","Disposals 6","Closing Balance","Net Book Value"]
[12,1611,"Computer Software (Formally known as Account 1925)",{"$f":"'[11]FA Continuity MIFRS 2016'!$D$50","v":570536.21},{"$f":"'[11]FA Continuity MIFRS 2016'!$E$50","v":358500},{"$f":"'[11]FA Continuity MIFRS 2016'!$F$50","v":0},{"$f":"D280+E280+F280","v":929036.21},null,{"$f":"'[11]FA Continuity MIFRS 2016'!$I$50","v":-287806.8},{"$f":"'[11]FA Continuity MIFRS 2016'!$J$50","v":-199987.66333333333},{"$f":"'[11]FA Continuity MIFRS 2016'!$K$50","v":0},{"$f":"I280+J280+K280","v":-487794.46333333332},{"$f":"G280+L280","v":441241.74666666664}]
["CEC",1612,"Land Rights (Formally known as Account 1906)",{"$f":"'[11]FA Continuity MIFRS 2016'!$D$10","v":394446.16000000003},{"$f":"'[11]FA Continuity MIFRS 2016'!$E$10","v":0},{"$f":"'[11]FA Continuity MIFRS 2016'!$F$10","v":0},{"$f":"D281+E281+F281","v":394446.16000000003},null,{"$f":"'[11]FA Continuity MIFRS 2016'!$I$10","v":-27808},{"$f":"'[11]FA Continuity MIFRS 2016'!$J$10","v":-12699.01},{"$f":"'[11]FA Continuity MIFRS 2016'!$K$10","v":0},{"$f":"I281+J281+K281","v":-40507.01},{"$f":"G281+L281","v":353939.15}]
["N/A",1805,"Land",{"$f":"'[11]FA Continuity MIFRS 2016'!$D$11","v":1049592.8400000001},{"$f":"'[11]FA Continuity MIFRS 2016'!$E$11","v":0},{"$f":"'[11]FA Continuity MIFRS 2016'!$F$11","v":0},{"$f":"D282+E282+F282","v":1049592.8400000001},null,{"$f":"'[11]FA Continuity MIFRS 2016'!$I$11","v":0},{"$f":"'[11]FA Continuity MIFRS 2016'!$J$11","v":0},{"$f":"'[11]FA Continuity MIFRS 2016'!$K$11","v":0},{"$f":"I282+J282+K282","v":0},{"$f":"G282+L282","v":1049592.8400000001}]
[47,1808,"Buildings",null,null,null,{"$f":"D283+E283+F283","v":0},null,null,null,null,{"$f":"I283+J283+K283","v":0},{"$f":"G283+L283","v":0}]
[13,1810,"Leasehold Improvements",null,null,null,0,null,null,null,null,0,0]
[47,1815,"Transformer Station Equipment >50 kV",null,null,null,0,null,null,null,null,0,0]
[47,1820,"Distribution Station Equipment <50 kV",{"$f":"'[11]FA Continuity MIFRS 2016'!$D$14","v":5485808.3200000012},{"$f":"'[11]FA Continuity MIFRS 2016'!$E$14","v":2008854},{"$f":"'[11]FA Continuity MIFRS 2016'!$F$14","v":0},7494662.3200000012,null,{"$f":"'[11]FA Continuity MIFRS 2016'!$I$14","v":-322196.77},{"$f":"'[11]FA Continuity MIFRS 2016'!$J$14","v":-226178.75999999998},{"$f":"'[11]FA Continuity MIFRS 2016'!$K$14","v":0},-548375.53,6946286.790000001]
[47,1825,"Storage Battery Equipment",null,null,null,0,null,null,null,null,0,0]
[47,1830,"Poles, Towers & Fixtures",{"$f":"'[11]FA Continuity MIFRS 2016'!$D$18","v":8711433.4100000001},{"$f":"'[11]FA Continuity MIFRS 2016'!$E$18","v":565916},{"$f":"'[11]FA Continuity MIFRS 2016'!$F$18","v":-12000},9265349.4100000001,null,{"$f":"'[11]FA Continuity MIFRS 2016'!$I$18","v":-450702.88},{"$f":"'[11]FA Continuity MIFRS 2016'!$J$18","v":-258788.71666666665},{"$f":"'[11]FA Continuity MIFRS 2016'!$K$18","v":100},-709391.59666666668,8555957.8133333325]
[47,1835,"Overhead Conductors & Devices",{"$f":"'[11]FA Continuity MIFRS 2016'!$D$21","v":9820701.1099999994},{"$f":"'[11]FA Continuity MIFRS 2016'!$E$21","v":448346},{"$f":"'[11]FA Continuity MIFRS 2016'!$F$21","v":-6000},10263047.109999999,null,{"$f":"'[11]FA Continuity MIFRS 2016'!$I$21","v":-431588.88},{"$f":"'[11]FA Continuity MIFRS 2016'!$J$21","v":-239829.93},{"$f":"'[11]FA Continuity MIFRS 2016'!$K$21","v":50},-671368.81,9591678.2999999989]
[47,1840,"Underground Conduit",{"$f":"'[11]FA Continuity MIFRS 2016'!$D$26","v":2696580.1399999997},{"$f":"'[11]FA Continuity MIFRS 2016'!$E$26","v":1282396},{"$f":"'[11]FA Continuity MIFRS 2016'!$F$26","v":0},3978976.1399999997,null,{"$f":"'[11]FA Continuity MIFRS 2016'!$I$26","v":-152205.88},{"$f":"'[11]FA Continuity MIFRS 2016'!$J$26","v":-104328.80500000001},{"$f":"'[11]FA Continuity MIFRS 2016'!$K$26","v":0},-256534.685,3722441.4549999996]
[47,1845,"Underground Conductors & Devices",{"$f":"'[11]FA Continuity MIFRS 2016'!$D$29","v":7805366.54},{"$f":"'[11]FA Continuity MIFRS 2016'!$E$29","v":613881},{"$f":"'[11]FA Continuity MIFRS 2016'!$F$29","v":-2800},8416447.5399999991,null,{"$f":"'[11]FA Continuity MIFRS 2016'!$I$29","v":-501206.95},{"$f":"'[11]FA Continuity MIFRS 2016'!$J$29","v":-265602.9325},{"$f":"'[11]FA Continuity MIFRS 2016'!$K$29","v":25},-766784.88250000007,7649662.6574999988]
[47,1850,"Line Transformers",{"$f":"'[11]FA Continuity MIFRS 2016'!$D$34","v":5102423.5},{"$f":"'[11]FA Continuity MIFRS 2016'!$E$34","v":1760980},{"$f":"'[11]FA Continuity MIFRS 2016'!$F$34","v":-138000},6725403.5,null,{"$f":"'[11]FA Continuity MIFRS 2016'!$I$34","v":-307009.75},{"$f":"'[11]FA Continuity MIFRS 2016'!$J$34","v":-198414.54500000019},{"$f":"'[11]FA Continuity MIFRS 2016'!$K$34","v":600},-504824.29500000016,6220579.2050000001]
[47,1855,"Services (Overhead & Underground)",{"$f":"'[11]FA Continuity MIFRS 2016'!$D$37","v":3558345.65},{"$f":"'[11]FA Continuity MIFRS 2016'!$E$37","v":963939},{"$f":"'[11]FA Continuity MIFRS 2016'!$F$37","v":0},4522284.6500000004,null,{"$f":"'[11]FA Continuity MIFRS 2016'!$I$37","v":-174051.09},{"$f":"'[11]FA Continuity MIFRS 2016'!$J$37","v":-107846.22166666666},{"$f":"'[11]FA Continuity MIFRS 2016'!$K$37","v":0},-281897.31166666665,4240387.3383333338]
[47,1860,"Meters (Smart Meters)",{"$f":"'[11]FA Continuity MIFRS 2016'!$D$39","v":2005670.73},{"$f":"'[11]FA Continuity MIFRS 2016'!$E$39","v":168055},{"$f":"'[11]FA Continuity MIFRS 2016'!$F$39","v":-8500},2165225.73,null,{"$f":"'[11]FA Continuity MIFRS 2016'!$I$39","v":-351643.72},{"$f":"'[11]FA Continuity MIFRS 2016'!$J$39","v":-188147.35},{"$f":"'[11]FA Continuity MIFRS 2016'!$K$39","v":75},-539716.06999999995,1625509.6600000001]
[47,1860,"Meters",null,null,null,0,null,null,null,null,0,0]
["N/A",1905,"Land",{"$f":"'[11]FA Continuity MIFRS 2016'!$D$43","v":1015496.2999999998},{"$f":"'[11]FA Continuity MIFRS 2016'!$E$43","v":0},{"$f":"'[11]FA Continuity MIFRS 2016'!$F$43","v":0},1015496.2999999998,null,{"$f":"'[11]FA Continuity MIFRS 2016'!$I$43","v":0},{"$f":"'[11]FA Continuity MIFRS 2016'!$J$43","v":0},{"$f":"'[11]FA Continuity MIFRS 2016'!$K$43","v":0},0,1015496.2999999998]
[47,1908,"Buildings & Fixtures",{"$f":"'[11]FA Continuity MIFRS 2016'!$D$45","v":12430509.6},{"$f":"'[11]FA Continuity MIFRS 2016'!$E$45","v":15000},{"$f":"'[11]FA Continuity MIFRS 2016'!$F$45","v":0},12445509.6,null,{"$f":"'[11]FA Continuity MIFRS 2016'!$I$45","v":-139448.21},{"$f":"'[11]FA Continuity MIFRS 2016'!$J$45","v":-268987.2},{"$f":"'[11]FA Continuity MIFRS 2016'!$K$45","v":0},-408435.41000000003,12037074.189999999]
[13,1910,"Leasehold Improvements",null,null,null,0,null,null,null,null,0,0]
[8,1915,"Office Furniture & Equipment (10 years)",{"$f":"'[11]FA Continuity MIFRS 2016'!$D$47","v":223502.2},{"$f":"'[11]FA Continuity MIFRS 2016'!$E$47","v":15000},{"$f":"'[11]FA Continuity MIFRS 2016'!$F$47","v":0},238502.2,null,{"$f":"'[11]FA Continuity MIFRS 2016'!$I$47","v":-32136},{"$f":"'[11]FA Continuity MIFRS 2016'!$J$47","v":-28030.87},{"$f":"'[11]FA Continuity MIFRS 2016'!$K$47","v":0},-60166.869999999995,178335.33000000002]
[8,1915,"Office Furniture & Equipment (5 years)",null,null,null,0,null,null,null,null,0,0]
[10,1920,"Computer Equipment - Hardware",{"$f":"'[11]FA Continuity MIFRS 2016'!$D$48","v":401534.17},{"$f":"'[11]FA Continuity MIFRS 2016'!$E$48","v":130000},{"$f":"'[11]FA Continuity MIFRS 2016'!$F$48","v":0},531534.16999999993,null,{"$f":"'[11]FA Continuity MIFRS 2016'!$I$48","v":-148499.01},{"$f":"'[11]FA Continuity MIFRS 2016'!$J$48","v":-110609.12999999999},{"$f":"'[11]FA Continuity MIFRS 2016'!$K$48","v":0},-259108.14,272426.02999999991]
[45,1920,"Computer Equip.-Hardware(Post Mar. 22/04)",null,null,null,0,null,null,null,null,0,0]
[45.1,1920,"Computer Equip.-Hardware(Post Mar. 19/07)",null,null,null,0,null,null,null,null,0,0]
[10,1930,"Transportation Equipment",{"$f":"'[11]FA Continuity MIFRS 2016'!$D$51","v":517274.5299999998},{"$f":"'[11]FA Continuity MIFRS 2016'!$E$51","v":0},{"$f":"'[11]FA Continuity MIFRS 2016'!$F$51","v":0},517274.5299999998,null,{"$f":"'[11]FA Continuity MIFRS 2016'!$I$51","v":-251393.45},{"$f":"'[11]FA Continuity MIFRS 2016'!$J$51","v":-123384.7},{"$f":"'[11]FA Continuity MIFRS 2016'!$K$51","v":0},-374778.15,142496.37999999977]
[8,1935,"Stores Equipment",{"$f":"'[11]FA Continuity MIFRS 2016'!$D$52","v":135334.88999999998},{"$f":"'[11]FA Continuity MIFRS 2016'!$E$52","v":5000},{"$f":"'[11]FA Continuity MIFRS 2016'!$F$52","v":0},140334.88999999998,null,{"$f":"'[11]FA Continuity MIFRS 2016'!$I$52","v":-11132.65},{"$f":"'[11]FA Continuity MIFRS 2016'!$J$52","v":-14712.75},{"$f":"'[11]FA Continuity MIFRS 2016'!$K$52","v":0},-25845.4,114489.48999999999]
[8,1940,"Tools, Shop & Garage Equipment",{"$f":"'[11]FA Continuity MIFRS 2016'!$D$53","v":305567.68000000005},{"$f":"'[11]FA Continuity MIFRS 2016'!$E$53","v":38000},{"$f":"'[11]FA Continuity MIFRS 2016'!$F$53","v":0},343567.68000000005,null,{"$f":"'[11]FA Continuity MIFRS 2016'!$I$53","v":-79661.83},{"$f":"'[11]FA Continuity MIFRS 2016'!$J$53","v":-45264.000000000007},{"$f":"'[11]FA Continuity MIFRS 2016'!$K$53","v":0},-124925.83000000002,218641.85000000003]
[8,1945,"Measurement & Testing Equipment",{"$f":"'[11]FA Continuity MIFRS 2016'!$D$54","v":29667.46},{"$f":"'[11]FA Continuity MIFRS 2016'!$E$54","v":15000},{"$f":"'[11]FA Continuity MIFRS 2016'!$F$54","v":0},44667.46,null,{"$f":"'[11]FA Continuity MIFRS 2016'!$I$54","v":-8140.35},{"$f":"'[11]FA Continuity MIFRS 2016'!$J$54","v":-4911.3500000000004},{"$f":"'[11]FA Continuity MIFRS 2016'!$K$54","v":0},-13051.7,31615.759999999998]
[8,1950,"Power Operated Equipment",null,null,null,0,null,null,null,null,0,0]
[8,1955,"Communications Equipment",null,null,null,0,null,null,null,null,0,0]
[8,1955,"Communication Equipment (Smart Meters)",null,null,null,0,null,null,null,null,0,0]
[8,1960,"Miscellaneous Equipment ",null,null,null,0,null,null,null,null,0,0]
[47,1970,"Load Management Controls Customer Premises",null,null,null,0,null,null,null,null,0,0]
[47,1975,"Load Management Controls Utility Premises",null,null,null,0,null,null,null,null,0,0]
[47,1980,"System Supervisor Equipment",{"$f":"'[11]FA Continuity MIFRS 2016'!$D$58","v":1587597.2000000002},{"$f":"'[11]FA Continuity MIFRS 2016'!$E$58","v":84002.400000000402},{"$f":"'[11]FA Continuity MIFRS 2016'!$F$58","v":0},1671599.6000000006,null,{"$f":"'[11]FA Continuity MIFRS 2016'!$I$58","v":-249774.41},{"$f":"'[11]FA Continuity MIFRS 2016'!$J$58","v":-155283.33000000005},{"$f":"'[11]FA Continuity MIFRS 2016'!$K$58","v":0},-405057.74000000005,1266541.8600000006]
[47,1985,"Miscellaneous Fixed Assets",null,null,null,0,null,null,null,null,0,0]
[47,1990,"Other Tangible Property",null,null,null,0,null,null,null,null,0,0]
[47,1995,"Contributions & Grants",{"$f":"'[11]FA Continuity MIFRS 2016'!$D$63","v":-11358938.029999999},{"$f":"'[11]FA Continuity MIFRS 2016'!$E$63","v":-3986076},{"$f":"'[11]FA Continuity MIFRS 2016'!$F$63","v":0},-15345014.029999999,null,{"$f":"'[11]FA Continuity MIFRS 2016'!$I$63","v":583047.57999999996},{"$f":"'[11]FA Continuity MIFRS 2016'!$J$63","v":421161.72413793107},{"$f":"'[11]FA Continuity MIFRS 2016'!$K$63","v":0},1004209.304137931,-14340804.725862069]
[47,2440,"Deferred Revenue5"]
[null,null,null,null,null,null,{"$f":"D319+E319+F319","v":0},null,null,null,null,{"$f":"I319+J319+K319","v":0},{"$f":"G319+L319","v":0}]
[null,null,"Sub-Total",{"$f":"SUM(D280:D319)","v":52488450.610000007},{"$f":"SUM(E280:E319)","v":4486793.4000000004},{"$f":"SUM(F280:F319)","v":-167300},{"$f":"SUM(G280:G319)","v":56807944.00999999},null,{"$f":"SUM(I280:I319)","v":-3343359.05},{"$f":"SUM(J280:J319)","v":-2131845.540028736},{"$f":"SUM(K280:K319)","v":850},{"$f":"SUM(L280:L319)","v":-5474354.5900287367},{"$f":"SUM(M280:M319)","v":51333589.419971257}]
[null,null,"Less Socialized Renewable Energy Generation Investments (input as negative)",null,null,null,{"$f":"D321+E321+F321","v":0},null,null,null,null,{"$f":"I321+J321+K321","v":0},{"$f":"G321+L321","v":0}]
[null,null,"Less Other Non Rate-Regulated Utility Assets (input as negative)",null,null,null,0,null,null,null,null,0,0]
[null,null,"Total PP&E",{"$f":"SUM(D320:D322)","v":52488450.610000007},{"$f":"SUM(E320:E322)","v":4486793.4000000004},-167300,56807944.00999999,null,{"$f":"SUM(I320:I322)","v":-3343359.05},-2131845.540028736,850,-5474354.5900287367,51333589.419971257]
[null,null,"Depreciation Expense adj. from gain or loss on the retirement of assets (pool of like assets), if applicable6"]
[null,null,"Total",null,null,null,null,null,null,{"$f":"J323+J324","v":-2131845.540028736}]
[]
[null,null,null,null,null,null,null,null,"Less: Fully Allocated Depreciation"]
[10,null,"Transportation",null,null,null,null,null,"Transportation",null,{"$f":"J304","v":-123384.7}]
[8,null,"Stores Equipment",null,null,null,null,null,"Contributions",null,{"$f":"J317","v":421161.72413793107}]
[null,null,null,null,null,null,null,null,"Net Depreciation",null,{"$f":"J325-K328-K329","v":-2429622.5641666669}]
[]
[]
["Appendix 2-BA"]
["Fixed Asset Continuity Schedule 1 "]
[]
[null,null,null,null,"Accounting Standard","MIFRS"]
[null,null,null,null,"Year ",2017]
[]
[null,null,null,"Cost",null,null,null,null,null,"Accumulated Depreciation"]
["CCA Class 2","OEB Account 3","Description 3","Opening Balance","Additions 4","Disposals 6","Closing Balance",null,"Opening Balance","Additions","Disposals 6","Closing Balance","Net Book Value"]
[12,1611,"Computer Software (Formally known as Account 1925)",{"$f":"'[11]FA Continuity MIFRS 2017'!$D$50","v":929036.21},{"$f":"'[11]FA Continuity MIFRS 2017'!$E$50","v":339325},{"$f":"'[11]FA Continuity MIFRS 2017'!$F$50","v":0},{"$f":"D341+E341+F341","v":1268361.21},null,{"$f":"'[11]FA Continuity MIFRS 2017'!$I$50","v":-487794.46333333332},{"$f":"'[11]FA Continuity MIFRS 2017'!$J$50","v":-286492.83},{"$f":"'[11]FA Continuity MIFRS 2017'!$K$50","v":0},{"$f":"I341+J341+K341","v":-774287.29333333333},{"$f":"G341+L341","v":494073.91666666663}]
["CEC",1612,"Land Rights (Formally known as Account 1906)",{"$f":"'[11]FA Continuity MIFRS 2017'!$D$10","v":394446.16000000003},{"$f":"'[11]FA Continuity MIFRS 2017'!$E$10","v":0},{"$f":"'[11]FA Continuity MIFRS 2017'!$F$10","v":0},{"$f":"D342+E342+F342","v":394446.16000000003},null,{"$f":"'[11]FA Continuity MIFRS 2017'!$I$10","v":-40507.01},{"$f":"'[11]FA Continuity MIFRS 2017'!$J$10","v":-12699.01},{"$f":"'[11]FA Continuity MIFRS 2017'!$K$10","v":0},{"$f":"I342+J342+K342","v":-53206.020000000004},{"$f":"G342+L342","v":341240.14}]
["N/A",1805,"Land",{"$f":"'[11]FA Continuity MIFRS 2017'!$D$11","v":1049592.8400000001},{"$f":"'[11]FA Continuity MIFRS 2017'!$E$11","v":0},{"$f":"'[11]FA Continuity MIFRS 2017'!$F$11","v":0},{"$f":"D343+E343+F343","v":1049592.8400000001},null,{"$f":"'[11]FA Continuity MIFRS 2017'!$I$11","v":0},{"$f":"'[11]FA Continuity MIFRS 2017'!$J$11","v":0},{"$f":"'[11]FA Continuity MIFRS 2017'!$K$11","v":0},{"$f":"I343+J343+K343","v":0},{"$f":"G343+L343","v":1049592.8400000001}]
[47,1808,"Buildings",null,null,null,{"$f":"D344+E344+F344","v":0},null,null,null,null,{"$f":"I344+J344+K344","v":0},{"$f":"G344+L344","v":0}]
[13,1810,"Leasehold Improvements",null,null,null,0,null,null,null,null,0,0]
[47,1815,"Transformer Station Equipment >50 kV",null,null,null,0,null,null,null,null,0,0]
[47,1820,"Distribution Station Equipment <50 kV",{"$f":"'[11]FA Continuity MIFRS 2017'!$D$14","v":7494662.3200000012},{"$f":"'[11]FA Continuity MIFRS 2017'!$E$14","v":325114},{"$f":"'[11]FA Continuity MIFRS 2017'!$F$14","v":0},7819776.3200000012,null,{"$f":"'[11]FA Continuity MIFRS 2017'!$I$14","v":-548375.53},{"$f":"'[11]FA Continuity MIFRS 2017'!$J$14","v":-255544.35999999996},{"$f":"'[11]FA Continuity MIFRS 2017'!$K$14","v":0},-803919.89,7015856.4300000016]
[47,1825,"Storage Battery Equipment",null,null,null,0,null,null,null,null,0,0]
[47,1830,"Poles, Towers & Fixtures",{"$f":"'[11]FA Continuity MIFRS 2017'!$D$18","v":9265349.4100000001},{"$f":"'[11]FA Continuity MIFRS 2017'!$E$18","v":2921679},{"$f":"'[11]FA Continuity MIFRS 2017'!$F$18","v":-13200},12173828.41,null,{"$f":"'[11]FA Continuity MIFRS 2017'!$I$18","v":-709391.59666666668},{"$f":"'[11]FA Continuity MIFRS 2017'!$J$18","v":-299803.77222222218},{"$f":"'[11]FA Continuity MIFRS 2017'!$K$18","v":110},-1009085.3688888889,11164743.041111112]
[47,1835,"Overhead Conductors & Devices",{"$f":"'[11]FA Continuity MIFRS 2017'!$D$21","v":10263047.109999999},{"$f":"'[11]FA Continuity MIFRS 2017'!$E$21","v":2266734},{"$f":"'[11]FA Continuity MIFRS 2017'!$F$21","v":-6600},12523181.109999999,null,{"$f":"'[11]FA Continuity MIFRS 2017'!$I$21","v":-671368.81},{"$f":"'[11]FA Continuity MIFRS 2017'!$J$21","v":-263899.59666666668},{"$f":"'[11]FA Continuity MIFRS 2017'!$K$21","v":55},-935213.40666666673,11587967.703333333]
[47,1840,"Underground Conduit",{"$f":"'[11]FA Continuity MIFRS 2017'!$D$26","v":3978976.1399999997},{"$f":"'[11]FA Continuity MIFRS 2017'!$E$26","v":221375},{"$f":"'[11]FA Continuity MIFRS 2017'!$F$26","v":0},4200351.1399999997,null,{"$f":"'[11]FA Continuity MIFRS 2017'!$I$26","v":-256534.685},{"$f":"'[11]FA Continuity MIFRS 2017'!$J$26","v":-123123.9425},{"$f":"'[11]FA Continuity MIFRS 2017'!$K$26","v":0},-379658.6275,3820692.5124999997]
[47,1845,"Underground Conductors & Devices",{"$f":"'[11]FA Continuity MIFRS 2017'!$D$29","v":8416447.5399999991},{"$f":"'[11]FA Continuity MIFRS 2017'!$E$29","v":133681},{"$f":"'[11]FA Continuity MIFRS 2017'!$F$29","v":-3080},8547048.5399999991,null,{"$f":"'[11]FA Continuity MIFRS 2017'!$I$29","v":-766784.88250000007},{"$f":"'[11]FA Continuity MIFRS 2017'!$J$29","v":-274863.45750000002},{"$f":"'[11]FA Continuity MIFRS 2017'!$K$29","v":28},-1041620.3400000001,7505428.1999999993]
[47,1850,"Line Transformers",{"$f":"'[11]FA Continuity MIFRS 2017'!$D$34","v":6725403.5},{"$f":"'[11]FA Continuity MIFRS 2017'!$E$34","v":746731},{"$f":"'[11]FA Continuity MIFRS 2017'!$F$34","v":-151800},7320334.5,null,{"$f":"'[11]FA Continuity MIFRS 2017'!$I$34","v":-504824.29500000016},{"$f":"'[11]FA Continuity MIFRS 2017'!$J$34","v":-230095.93250000017},{"$f":"'[11]FA Continuity MIFRS 2017'!$K$34","v":660},-734260.22750000027,6586074.2725]
[47,1855,"Services (Overhead & Underground)",{"$f":"'[11]FA Continuity MIFRS 2017'!$D$37","v":4522284.6500000004},{"$f":"'[11]FA Continuity MIFRS 2017'!$E$37","v":505121},{"$f":"'[11]FA Continuity MIFRS 2017'!$F$37","v":0},5027405.6500000004,null,{"$f":"'[11]FA Continuity MIFRS 2017'!$I$37","v":-281897.31166666665},{"$f":"'[11]FA Continuity MIFRS 2017'!$J$37","v":-125788.22583333333},{"$f":"'[11]FA Continuity MIFRS 2017'!$K$37","v":0},-407685.53749999998,4619720.1125000007]
[47,1860,"Meters (Smart Meters)",{"$f":"'[11]FA Continuity MIFRS 2017'!$D$39","v":2165225.73},{"$f":"'[11]FA Continuity MIFRS 2017'!$E$39","v":250632},{"$f":"'[11]FA Continuity MIFRS 2017'!$F$39","v":-9350},2406507.73,null,{"$f":"'[11]FA Continuity MIFRS 2017'!$I$39","v":-539716.06999999995},{"$f":"'[11]FA Continuity MIFRS 2017'!$J$39","v":-202133.58333333334},{"$f":"'[11]FA Continuity MIFRS 2017'!$K$39","v":83},-741766.65333333332,1664741.0766666667]
[47,1860,"Meters",null,null,null,0,null,null,null,null,0,0]
["N/A",1905,"Land",{"$f":"'[11]FA Continuity MIFRS 2017'!$D$43","v":1015496.2999999998},{"$f":"'[11]FA Continuity MIFRS 2017'!$E$43","v":0},{"$f":"'[11]FA Continuity MIFRS 2017'!$F$43","v":0},1015496.2999999998,null,{"$f":"'[11]FA Continuity MIFRS 2017'!$I$43","v":0},{"$f":"'[11]FA Continuity MIFRS 2017'!$J$43","v":0},{"$f":"'[11]FA Continuity MIFRS 2017'!$K$43","v":0},0,1015496.2999999998]
[47,1908,"Buildings & Fixtures",{"$f":"'[11]FA Continuity MIFRS 2017'!$D$45","v":12445509.6},{"$f":"'[11]FA Continuity MIFRS 2017'!$E$45","v":15000},{"$f":"'[11]FA Continuity MIFRS 2017'!$F$45","v":0},12460509.6,null,{"$f":"'[11]FA Continuity MIFRS 2017'!$I$45","v":-408435.41000000003},{"$f":"'[11]FA Continuity MIFRS 2017'!$J$45","v":-269587.20000000001},{"$f":"'[11]FA Continuity MIFRS 2017'!$K$45","v":0},-678022.6100000001,11782486.99]
[13,1910,"Leasehold Improvements",null,null,null,0,null,null,null,null,0,0]
[8,1915,"Office Furniture & Equipment (10 years)",{"$f":"'[11]FA Continuity MIFRS 2017'!$D$47","v":238502.2},{"$f":"'[11]FA Continuity MIFRS 2017'!$E$47","v":15000},{"$f":"'[11]FA Continuity MIFRS 2017'!$F$47","v":0},253502.2,null,{"$f":"'[11]FA Continuity MIFRS 2017'!$I$47","v":-60166.869999999995},{"$f":"'[11]FA Continuity MIFRS 2017'!$J$47","v":-29530.87},{"$f":"'[11]FA Continuity MIFRS 2017'!$K$47","v":0},-89697.739999999991,163804.46000000002]
[8,1915,"Office Furniture & Equipment (5 years)",null,null,null,0,null,null,null,null,0,0]
[10,1920,"Computer Equipment - Hardware",{"$f":"'[11]FA Continuity MIFRS 2017'!$D$48","v":531534.16999999993},{"$f":"'[11]FA Continuity MIFRS 2017'!$E$48","v":165000},{"$f":"'[11]FA Continuity MIFRS 2017'!$F$48","v":0},696534.16999999993,null,{"$f":"'[11]FA Continuity MIFRS 2017'!$I$48","v":-259108.14},{"$f":"'[11]FA Continuity MIFRS 2017'!$J$48","v":-140109.13},{"$f":"'[11]FA Continuity MIFRS 2017'!$K$48","v":0},-399217.27,297316.89999999991]
[45,1920,"Computer Equip.-Hardware(Post Mar. 22/04)",null,null,null,0,null,null,null,null,0,0]
[45.1,1920,"Computer Equip.-Hardware(Post Mar. 19/07)",null,null,null,0,null,null,null,null,0,0]
[10,1930,"Transportation Equipment",{"$f":"'[11]FA Continuity MIFRS 2017'!$D$51","v":517274.5299999998},{"$f":"'[11]FA Continuity MIFRS 2017'!$E$51","v":505500},{"$f":"'[11]FA Continuity MIFRS 2017'!$F$51","v":0},1022774.5299999998,null,{"$f":"'[11]FA Continuity MIFRS 2017'!$I$51","v":-374778.15},{"$f":"'[12]BS Cap Assets'!$F$18","v":-173934.7},{"$f":"'[11]FA Continuity MIFRS 2017'!$K$51","v":0},-548712.85000000009,474061.6799999997]
[8,1935,"Stores Equipment",{"$f":"'[11]FA Continuity MIFRS 2017'!$D$52","v":140334.88999999998},{"$f":"'[11]FA Continuity MIFRS 2017'!$E$52","v":5250},{"$f":"'[11]FA Continuity MIFRS 2017'!$F$52","v":0},145584.88999999998,null,{"$f":"'[11]FA Continuity MIFRS 2017'!$I$52","v":-25845.4},{"$f":"'[11]FA Continuity MIFRS 2017'!$J$52","v":-15225.25},{"$f":"'[11]FA Continuity MIFRS 2017'!$K$52","v":0},-41070.65,104514.23999999999]
[8,1940,"Tools, Shop & Garage Equipment",{"$f":"'[11]FA Continuity MIFRS 2017'!$D$53","v":343567.68000000005},{"$f":"'[11]FA Continuity MIFRS 2017'!$E$53","v":39900},{"$f":"'[11]FA Continuity MIFRS 2017'!$F$53","v":0},383467.68000000005,null,{"$f":"'[11]FA Continuity MIFRS 2017'!$I$53","v":-124925.83000000002},{"$f":"'[11]FA Continuity MIFRS 2017'!$J$53","v":-49159.000000000007},{"$f":"'[11]FA Continuity MIFRS 2017'!$K$53","v":0},-174084.83000000002,209382.85000000003]
[8,1945,"Measurement & Testing Equipment",{"$f":"'[11]FA Continuity MIFRS 2017'!$D$54","v":44667.46},{"$f":"'[11]FA Continuity MIFRS 2017'!$E$54","v":69760},{"$f":"'[11]FA Continuity MIFRS 2017'!$F$54","v":0},114427.45999999999,null,{"$f":"'[11]FA Continuity MIFRS 2017'!$I$54","v":-13051.7},{"$f":"'[11]FA Continuity MIFRS 2017'!$J$54","v":-9149.35},{"$f":"'[11]FA Continuity MIFRS 2017'!$K$54","v":0},-22201.050000000003,92226.409999999989]
[8,1950,"Power Operated Equipment",null,null,null,0,null,null,null,null,0,0]
[8,1955,"Communications Equipment",null,null,null,0,null,null,null,null,0,0]
[8,1955,"Communication Equipment (Smart Meters)",null,null,null,0,null,null,null,null,0,0]
[8,1960,"Miscellaneous Equipment ",null,null,null,0,null,null,null,null,0,0]
[47,1970,"Load Management Controls Customer Premises",null,null,null,0,null,null,null,null,0,0]
[47,1975,"Load Management Controls Utility Premises",null,null,null,0,null,null,null,null,0,0]
[47,1980,"System Supervisor Equipment",{"$f":"'[11]FA Continuity MIFRS 2017'!$D$58","v":1671599.6000000006},{"$f":"'[11]FA Continuity MIFRS 2017'!$E$58","v":32400},{"$f":"'[11]FA Continuity MIFRS 2017'!$F$58","v":0},1703999.6000000006,null,{"$f":"'[11]FA Continuity MIFRS 2017'!$I$58","v":-405057.74000000005},{"$f":"'[11]FA Continuity MIFRS 2017'!$J$58","v":-159163.41000000006},{"$f":"'[11]FA Continuity MIFRS 2017'!$K$58","v":0},-564221.15000000014,1139778.4500000004]
[47,1985,"Miscellaneous Fixed Assets",null,null,null,0,null,null,null,null,0,0]
[47,1990,"Other Tangible Property",null,null,null,0,null,null,null,null,0,0]
[47,1995,"Contributions & Grants",{"$f":"'[11]FA Continuity MIFRS 2017'!$D$63","v":-15345014.029999999},{"$f":"'[11]FA Continuity MIFRS 2017'!$E$63","v":-1869254},{"$f":"'[11]FA Continuity MIFRS 2017'!$F$63","v":0},-17214268.030000001,null,{"$f":"'[11]FA Continuity MIFRS 2017'!$I$63","v":1004209.304137931},{"$f":"'[11]FA Continuity MIFRS 2017'!$J$63","v":522115.68965517246},{"$f":"'[11]FA Continuity MIFRS 2017'!$K$63","v":0},1526324.9937931034,-15687943.036206897]
[47,2440,"Deferred Revenue5"]
[null,null,null,null,null,null,{"$f":"D380+E380+F380","v":0},null,null,null,null,{"$f":"I380+J380+K380","v":0},{"$f":"G380+L380","v":0}]
[null,null,"Sub-Total",{"$f":"SUM(D341:D380)","v":56807944.00999999},{"$f":"SUM(E341:E380)","v":6688948},{"$f":"SUM(F341:F380)","v":-184030},{"$f":"SUM(G341:G380)","v":63312862.00999999},null,{"$f":"SUM(I341:I380)","v":-5474354.5900287367},{"$f":"SUM(J341:J380)","v":-2398187.9309003833},{"$f":"SUM(K341:K380)","v":936},{"$f":"SUM(L341:L380)","v":-7871606.5209291205},{"$f":"SUM(M341:M380)","v":55441255.489070863}]
[null,null,"Less Socialized Renewable Energy Generation Investments (input as negative)",null,null,null,{"$f":"D382+E382+F382","v":0},null,null,null,null,{"$f":"I382+J382+K382","v":0},{"$f":"G382+L382","v":0}]
[null,null,"Less Other Non Rate-Regulated Utility Assets (input as negative)",null,null,null,0,null,null,null,null,0,0]
[null,null,"Total PP&E",{"$f":"SUM(D381:D383)","v":56807944.00999999},{"$f":"SUM(E381:E383)","v":6688948},-184030,63312862.00999999,null,{"$f":"SUM(I381:I383)","v":-5474354.5900287367},-2398187.9309003833,936,-7871606.5209291205,55441255.489070863]
[null,null,"Depreciation Expense adj. from gain or loss on the retirement of assets (pool of like assets), if applicable6"]
[null,null,"Total",null,null,null,null,null,null,{"$f":"J384+J385","v":-2398187.9309003833}]
[]
[null,null,null,null,null,null,null,null,"Less: Fully Allocated Depreciation"]
[10,null,"Transportation",null,null,null,null,null,"Transportation",null,{"$f":"J365","v":-173934.7}]
[8,null,"Stores Equipment",null,null,null,null,null,"Contributions",null,{"$f":"J378","v":522115.68965517246}]
[null,null,null,null,null,null,null,null,"Net Depreciation",null,{"$f":"J386-K389-K390","v":-2746368.9205555557}]

{"sheet":"Appendix 2-BB Service Life  ","index":10,"n_rows":107,"n_cols":17,"rows_kept":107,"cut":false,"hidden":false,"merged":[[0,15,0,16],[1,15,1,16],[2,15,2,16],[3,15,3,16],[4,15,4,16],[6,15,6,16],[14,11,14,12],[14,13,14,14],[31,2,31,4],[14,2,14,4],[14,5,14,7],[14,9,15,9],[14,10,15,10],[8,0,8,16],[9,0,9,16],[10,0,10,16],[14,15,14,16],[15,2,15,4],[35,3,35,4],[36,2,36,4],[37,2,37,4],[16,0,32,0],[16,1,18,1],[16,2,18,2],[16,3,16,4],[17,3,18,3],[25,2,25,4],[26,2,26,4],[27,2,27,4],[28,2,28,4],[29,2,29,4],[30,2,30,4],[19,1,21,1],[19,2,21,2],[19,3,19,4],[20,3,21,3],[22,1,24,1],[22,2,24,2],[22,3,22,4],[23,3,24,3],[32,2,32,4],[48,2,48,4],[56,2,56,4],[57,1,58,1],[57,2,58,2],[57,3,57,4],[58,3,58,4],[38,1,40,1],[38,2,40,2],[38,3,38,4],[39,3,39,4],[40,3,40,4],[41,1,42,1],[41,3,41,4],[42,3,42,4],[59,2,59,4],[49,2,49,4],[50,0,68,0],[50,2,50,4],[51,2,51,4],[52,2,52,4],[53,2,53,4],[54,2,54,4],[55,2,55,4],[64,2,64,4],[65,2,65,4],[66,2,66,4],[67,2,67,4],[68,2,68,4],[33,0,49,0],[33,1,35,1],[33,2,35,2],[33,3,33,4],[34,3,34,4],[43,2,43,4],[44,2,44,4],[45,2,45,4],[46,2,46,4],[47,2,47,4],[72,0,72,7],[74,2,74,4],[74,5,75,7],[74,9,75,9],[78,6,78,7],[79,3,79,4],[79,6,79,7],[69,2,69,4],[60,2,60,4],[61,2,61,4],[62,1,63,1],[62,2,63,2],[62,3,62,4],[63,3,63,4],[77,1,79,1],[77,2,79,2],[77,3,77,4],[80,2,80,4],[80,6,80,7],[81,2,81,4],[81,5,81,7],[74,13,74,14],[74,15,74,16],[75,2,75,4],[76,2,76,4],[76,6,76,7],[74,10,75,10],[74,11,74,12],[77,6,77,7],[78,3,78,4],[86,1,87,1],[86,2,87,2],[86,3,86,4],[86,6,86,7],[87,3,87,4],[87,6,87,7],[82,1,85,1],[82,2,85,2],[82,3,82,4],[82,6,82,7],[83,3,83,4],[83,6,83,7],[84,3,84,4],[84,6,84,7],[85,3,85,4],[85,6,85,7],[88,1,91,1],[88,2,91,2],[88,3,88,4],[88,6,88,7],[89,3,89,4],[89,6,89,7],[90,3,90,4],[90,6,90,7],[91,3,91,4],[91,6,91,7],[94,2,94,4],[94,6,94,7],[95,2,95,4],[95,6,95,7],[96,2,96,4],[96,6,96,7],[92,1,93,1],[92,2,93,2],[92,3,92,4],[92,6,92,7],[93,3,93,4],[93,6,93,7],[100,2,100,4],[100,6,100,7],[103,0,103,7],[97,2,97,4],[97,6,97,7],[98,2,98,4],[98,6,98,7],[99,2,99,4],[99,6,99,7]]}
[null,null,null,null,null,null,null,null,null,null,null,null,null,"File Number:",null,0]
[null,null,null,null,null,null,null,null,null,null,null,null,null,"Exhibit:",null,4]
[null,null,null,null,null,null,null,null,null,null,null,null,null,"Tab:"]
[null,null,null,null,null,null,null,null,null,null,null,null,null,"Schedule:"]
[null,null,null,null,null,null,null,null,null,null,null,null,null,"Page:"]
[]
[null,null,null,null,null,null,null,null,null,null,null,null,null,"Date:",null,"2016-11-28"]
[]
["Appendix 2-BB"]
["Service Life Comparison"]
["Table F-1 from Kinetrics Report1"]
[]
[]
[]
[null,null,"Asset Details",null,null,"Useful Life",null,null,null,"USoA Account Number","USoA Account Description","Current",null,"Proposed",null,"Outside Range of Min, Max TUL?"]
["Parent*","#","Category| Component | Type",null,null,"MIN UL","TUL","MAX UL",null,null,null,"Years","Rate","Years","Rate","Below Min TUL","Above Max TUL"]
["OH",1,"Fully Dressed Wood Poles","Overall",null,35,45,75,null,1830,"Poles,Towers and Fixtures",40,{"$f":"IF(ISERROR(1/L17), \"\", 1/L17)","v":2.5000000000000001E-2},40,{"$f":"IF(ISERROR(1/N17), \"\", 1/N17)","v":2.5000000000000001E-2},{"$f":"IF(ISBLANK(N17),\"\",IF(N17<F17,\"Yes\",\"No\"))","v":"No"},{"$f":"IF(ISBLANK(N17),\"\",IF(N17>H17,\"Yes\",\"No\"))","v":"No"}]
[null,null,null,"Cross Arm","Wood",20,40,55,null,1830,"Poles,Towers and Fixtures",40,{"$f":"IF(ISERROR(1/L18), \"\", 1/L18)","v":2.5000000000000001E-2},40,{"$f":"IF(ISERROR(1/N18), \"\", 1/N18)","v":2.5000000000000001E-2},{"$f":"IF(ISBLANK(N18),\"\",IF(N18<F18,\"Yes\",\"No\"))","v":"No"},{"$f":"IF(ISBLANK(N18),\"\",IF(N18>H18,\"Yes\",\"No\"))","v":"No"}]
[null,null,null,null,"Steel",30,70,95,null,1830,"Poles,Towers and Fixtures",40,2.5000000000000001E-2,40,2.5000000000000001E-2,"No","No"]
[null,2,"Fully Dressed Concrete Poles","Overall",null,50,60,80,null,1830,"Poles,Towers and Fixtures",40,2.5000000000000001E-2,40,2.5000000000000001E-2,"Yes","No"]
[null,null,null,"Cross Arm","Wood",20,40,55,null,1830,"Poles,Towers and Fixtures",40,2.5000000000000001E-2,40,2.5000000000000001E-2,"No","No"]
[null,null,null,null,"Steel",30,70,95,null,1830,"Poles,Towers and Fixtures",40,2.5000000000000001E-2,40,2.5000000000000001E-2,"No","No"]
[null,3,"Fully Dressed Steel Poles","Overall",null,60,60,80,null,"N/A",null,null,"",null,"","",""]
[null,null,null,"Cross Arm","Wood",20,40,55,null,"N/A",null,null,"",null,"","",""]
[null,null,null,null,"Steel",30,70,95,null,"N/A",null,null,"",null,"","",""]
[null,4,"OH Line Switch",null,null,30,45,55,null,1835,"Overhead Conductors & Devices",40,2.5000000000000001E-2,40,2.5000000000000001E-2,"No","No"]
[null,5,"OH Line Switch Motor",null,null,15,25,25,null,1835,"Overhead Conductors & Devices",20,0.05,20,0.05,"No","No"]
[null,6,"OH Line Switch RTU",null,null,15,20,20,null,1835,"Overhead Conductors & Devices",20,0.05,20,0.05,"No","No"]
[null,7,"OH Integral Switches",null,null,35,45,60,null,1835,"Overhead Conductors & Devices",40,2.5000000000000001E-2,40,2.5000000000000001E-2,"No","No"]
[null,8,"OH Conductors",null,null,50,60,75,null,1835,"Overhead Conductors & Devices",60,1.6666666666666666E-2,60,1.6666666666666666E-2,"No","No"]
[null,9,"OH Transformers & Voltage Regulators",null,null,30,40,60,null,1850,"Line Transformers",40,2.5000000000000001E-2,40,2.5000000000000001E-2,"No","No"]
[null,10,"OH Shunt Capacitor Banks",null,null,25,30,40,null,"N/A",null,null,"",null,"","",""]
[null,11,"Reclosers",null,null,25,40,55,null,"N/A",null,null,"",null,"","",""]
["TS & MS",12,"Power Transformers","Overall",null,30,45,60,null,1850,"Line Transformers",40,2.5000000000000001E-2,40,2.5000000000000001E-2,"No","No"]
[null,null,null,"Bushing",null,10,20,30,null,null,null,null,"",null,"","",""]
[null,null,null,"Tap Changer",null,20,30,60,null,null,null,null,"",null,"","",""]
[null,13,"Station Service Transformer",null,null,30,45,55,null,null,null,null,"",null,"","",""]
[null,14,"Station Grounding Transformer",null,null,30,40,40,null,null,null,null,"",null,"","",""]
[null,15,"Station DC System","Overall",null,10,20,30,null,null,null,null,"",null,"","",""]
[null,null,null,"Battery Bank",null,10,15,15,null,1820,"Distribution Station Equipment",20,0.05,20,0.05,"No","Yes"]
[null,null,null,"Charger",null,20,20,30,null,1820,"Distribution Station Equipment",20,0.05,20,0.05,"No","No"]
[null,16,"Station Metal Clad Switchgear","Overall",null,30,40,60,null,1820,"Distribution Station Equipment",40,2.5000000000000001E-2,40,2.5000000000000001E-2,"No","No"]
[null,null,null,"Removable Breaker",null,25,40,60,null,null,null,null,"",null,"","",""]
[null,17,"Station Independent Breakers",null,null,35,45,65,null,null,null,null,"",null,"","",""]
[null,18,"Station Switch",null,null,30,50,60,null,null,null,null,"",null,"","",""]
[null,19,"Electromechanical Relays",null,null,25,35,50,null,null,null,null,"",null,"","",""]
[null,20,"Solid State Relays",null,null,10,30,45,null,1820,"Distribtion Station Equipment",30,3.3333333333333333E-2,30,3.3333333333333333E-2,"No","No"]
[null,21,"Digital & Numeric Relays",null,null,15,20,20,null,null,null,null,"",null,"","",""]
[null,22,"Rigid Busbars",null,null,30,55,60,null,null,null,null,"",null,"","",""]
[null,23,"Steel Structure",null,null,35,50,90,null,null,null,null,"",null,"","",""]
["UG",24,"Primary Paper Insulated Lead Covered (PILC) Cables",null,null,60,65,75,null,"N/A",null,null,"",null,"","",""]
[null,25,"Primary Ethylene-Propylene Rubber (EPR) Cables",null,null,20,25,25,null,1845,"Underground Conductors & Devices",40,2.5000000000000001E-2,40,2.5000000000000001E-2,"No","Yes"]
[null,26,"Primary Non-Tree Retardant (TR) Cross Linked \nPolyethylene (XLPE) Cables Direct Buried",null,null,20,25,30,null,1845,"Underground Conductors & Devices",40,2.5000000000000001E-2,40,2.5000000000000001E-2,"No","Yes"]
[null,27,"Primary Non-TR XLPE Cables in Duct",null,null,20,25,30,null,1845,"Underground Conductors & Devices",40,2.5000000000000001E-2,40,2.5000000000000001E-2,"No","Yes"]
[null,30,"Secondary PILC Cables",null,null,70,75,80,null,"N/A"," "," ",""," ","","No","Yes"]
[null,31,"Secondary Cables Direct Buried",null,null,25,35,40,null,1855,"Service",40,2.5000000000000001E-2,40,2.5000000000000001E-2,"No","No"]
[null,32,"Secondary Cables in Duct",null,null,35,40,60,null,1855,"Service",null,"",null,"","",""]
[null,33,"Network Tranformers","Overall",null,20,35,50,null,"N/A"," "," ",""," ","","No","Yes"]
[null,null,null,"Protector",null,20,35,40,null,"N/A"," "," ",""," ","","No","Yes"]
[null,34,"Pad-Mounted Transformers",null,null,25,40,45,null,1850,"Line Transformers",40,2.5000000000000001E-2,40,2.5000000000000001E-2,"No","No"]
[null,35,"Submersible/Vault Transformers",null,null,25,35,45,null,1850,"Line Transformers",40,2.5000000000000001E-2,40,2.5000000000000001E-2,"No","No"]
[null,36,"UG Foundation",null,null,35,55,70,null,1840,"Underground Conduit",60,1.6666666666666666E-2,60,1.6666666666666666E-2,"No","No"]
[null,37,"UG Vaults","Overall",null,40,60,80,null,"N/A",null,null,"",null,"","",""]
[null,null,null,"Roof",null,20,30,45,null,"N/A",null,null,"",null,"","",""]
[null,38,"UG Vault Switches",null,null,20,35,50,null,1845,"Underground Conductors & Devices",30,3.3333333333333333E-2,30,3.3333333333333333E-2,"No","No"]
[null,39,"Pad-Mounted Switchgear",null,null,20,30,45,null,1845,"Underground Conductors & Devices",30,3.3333333333333333E-2,30,3.3333333333333333E-2,"No","No"]
[null,40,"Ducts",null,null,30,50,85,null,1840,"Underground Conduit",60,1.6666666666666666E-2,60,1.6666666666666666E-2,"No","No"]
[null,41,"Concrete Encased Duct Banks",null,null,35,55,80,null,1840,"Underground Conduit",60,1.6666666666666666E-2,60,1.6666666666666666E-2,"No","No"]
[null,42,"Cable Chambers",null,null,50,60,80,null,1840,"Underground Conduit",60,1.6666666666666666E-2,60,1.6666666666666666E-2,"No","No"]
["S",43,"Remote SCADA",null,null,15,20,30,null,null,null,null,"",null,"","",""]
[]
[]
["Table F-2 from Kinetrics Report1"]
[]
[null,null,"Asset Details",null,null,"Useful Life Range",null,null,null,"USoA Account Number","USoA Account Description","Current",null,"Proposed",null,"Outside Range of Min, Max TUL?"]
[null,"#","Category| Component | Type",null,null,null,null,null,null,null,null,"Years","Rate","Years","Rate","Below Min Range","Above Max Range"]
[null,1,"Office Equipment",null,null,5,15,null,null,1915,"Office Furniture & Equipment ",10,{"$f":"IF(ISERROR(1/L77), \"\", 1/L77)","v":0.1},10,{"$f":"IF(ISERROR(1/N77), \"\", 1/N77)","v":0.1},{"$f":"IF(ISBLANK(N77),\"\",IF(N77<F77,\"Yes\",\"No\"))","v":"No"},{"$f":"IF(ISBLANK(N77),\"\",IF(N77>G77,\"Yes\",\"No\"))","v":"No"}]
[null,2,"Vehicles","Trucks & Buckets",null,5,15,null,null,1930,"Transportation Equipment",15,{"$f":"IF(ISERROR(1/L78), \"\", 1/L78)","v":6.6666666666666666E-2},15,{"$f":"IF(ISERROR(1/N78), \"\", 1/N78)","v":6.6666666666666666E-2},{"$f":"IF(ISBLANK(N78),\"\",IF(N78<F78,\"Yes\",\"No\"))","v":"No"},{"$f":"IF(ISBLANK(N78),\"\",IF(N78>G78,\"Yes\",\"No\"))","v":"No"}]
[null,null,null,"Trailers",null,5,20,null,null,1930,"Transportation Equipment",20,0.05,20,0.05,"No","No"]
[null,null,null,"Vans",null,5,10,null,null,1930,"Transportation Equipment",12,8.3333333333333329E-2,12,8.3333333333333329E-2,"No","Yes"]
[null,3,"Administrative Buildings",null,null,50,75,null,null,"200/201","Building & Fixtures","1950-05-01",5.4395126196692775E-5,"1950-05-01",5.4395126196692775E-5,"No","Yes"]
[null,4,"Leasehold Improvements",null,null,"Lease dependent",null,null,null,"N/A",null,0,"",0,""]
[null,5,"Station Buildings","Station Buildings",null,50,75,null,null,1808,"Building & Fixtures",50,0.02,50,0.02,"No","No"]
[null,null,null,"Parking",null,25,30,null,null,1808,"Building & Fixtures",30,3.3333333333333333E-2,30,3.3333333333333333E-2,"No","No"]
[null,null,null,"Fence",null,25,60,null,null,1808,"Building & Fixtures",25,0.04,25,0.04,"No","No"]
[null,null,null,"Roof",null,20,30,null,null,1808,"Building & Fixtures",20,0.05,20,0.05,"No","No"]
[null,6,"Computer Equipment","Hardware",null,3,5,null,null,1920,"Computer Equipment - Hardware",5,0.2,5,0.2,"No","No"]
[null,null,null,"Software",null,2,5,null,null,1925,"Computer Equipment - Software",5,0.2,5,0.2,"No","No"]
[null,7,"Equipment","Power Operated",null,5,10,null,null,"N/A",null,null,"",null,"","",""]
[null,null,null,"Stores",null,5,10,null,null,1935,"Stores Equipment ",10,0.1,10,0.1,"No","No"]
[null,null,null,"Tools, Shop, Garage Equipment",null,5,10,null,null,1940,"Tools, Shops Garage Equipment ",10,0.1,10,0.1,"No","No"]
[null,null,null,"Measurement & Testing Equipment",null,5,10,null,null,1945,"Measurement and Testing Equipment",10,0.1,10,0.1,"No","No"]
[null,8,"Communication","Towers",null,60,70,null,null,1955,"Communication Equipment ",10,0.1,10,0.1,"Yes","No"]
[null,null,null,"Wireless",null,2,10,null,null,1955,"Communication Equipment ",10,0.1,10,0.1,"No","No"]
[null,9,"Residential Energy Meters",null,null,25,35,null,null,1860,"Meters",15,6.6666666666666666E-2,15,6.6666666666666666E-2,"Yes","No"]
[null,10,"Industrial/Commercial Energy Meters",null,null,25,35,null,null,1860,"Meters",20,0.05,20,0.05,"Yes","No"]
[null,11,"Wholesale Energy Meters",null,null,15,30,null,null,"N/A",null,null,"",null,"","",""]
[null,12,"Current & Potential Transformer (CT & PT)",null,null,35,50,null,null,1860,"Meters",45,2.2222222222222223E-2,45,2.2222222222222223E-2,"No","No"]
[null,13,"Smart Meters",null,null,5,15,null,null,1860,"Meters",15,6.6666666666666666E-2,15,6.6666666666666666E-2,"No","No"]
[null,14,"Repeaters - Smart Metering",null,null,10,15,null,null,1915,"Office Furniture & Equipment ",5,0.2,5,0.2,"Yes","No"]
[null,15,"Data Collectors - Smart Metering",null,null,15,20,null,null,1915,"Office Furniture & Equipment ",5,0.2,5,0.2,"Yes","No"]
[]
[]
["* TS & MS = Transformer and Municipal Stations UG = Underground Systems S = Monitoring and Control Systems"]
[]
["Note 1:","Tables F-1 and F-2 above are to be used as a reference in order to complete columns J, K, L and N."]
[null,"See pages 17-19 of Kinetrics Report"]

{"sheet":"App.2-CA_OldCGAAPDepExp_Yr1","index":11,"n_rows":65,"n_cols":12,"rows_kept":65,"cut":false,"hidden":false,"merged":[[13,2,13,9],[61,1,61,11],[62,1,63,9],[64,1,65,11],[8,0,8,11],[9,0,9,11],[17,0,18,0],[17,1,18,1],[17,10,18,10],[10,1,10,10],[12,0,12,1],[13,0,13,1],[14,0,14,1],[14,2,14,9]]}
[null,null,null,null,null,null,null,null,null,null,"File Number:",{"$f":"EBNUMBER","v":"EB-2016-0085"}]
[null,null,null,null,null,null,null,null,null,null,"Exhibit:",4]
[null,null,null,null,null,null,null,null,null,null,"Tab:"]
[null,null,null,null,null,null,null,null,null,null,"Schedule:"]
[null,null,null,null,null,null,null,null,null,null,"Page:"]
[]
[null,null,null,null,null,null,null,null,null,null,"Date:","2016-11-28"]
[]
["Appendix 2-CA"]
["Depreciation and Amortization Expense"]
[null,"Former CGAAP (Year 1)"]
[]
["Select the set of appendices that apply",null,null,null,null,null,null,null,null,null,"Year Reflected in Schedule Below","Accounting Standard"]
["2012 Set of Appendices (2-CA to 2-CG)",null,"Assumes the applicant made capitalization and depreciation expense accounting policy changes under CGAAP effective January 1, 2012 and has adopted IFRS for financial reporting purposes effective January 1, 2015.  Assumes that the applicant is reflecting these changes in a rebasing application for the first time.",null,null,null,null,null,null,null,2012,"Former CGAAP"]
["2013 Set of Appendices (2-CA to 2-CF)",null,"Assumes the applicant made capitalization and depreciation expense accounting policy changes under CGAAP effective January 1, 2013 and has adopted IFRS for financial reporting purposes effective January 1, 2015.  Assumes that the applicant is reflecting these changes in a rebasing application for the first time.",null,null,null,null,null,null,null,2013,"Former CGAAP"]
[]
[]
["Account","Description","Opening Regulatory Gross PP&E as at Jan. 1","Less Fully Depreciated","Net for Depreciation","Additions","Total for Depreciation 1","Years","Depreciation Rate","Current Year Depreciation Expense","Depreciation Expense per Appendix 2-BA Fixed Assets, Column J \n (l)","Variance 2"]
[null,null,"(a)","(b)","(c)","(d)","(e) = (c) + ½ x (d) ","(f)","(g) = 1 / (f)","(h) = (e) / (f)",null,"(m) = (h) - (l)"]
[1611,"Computer Software (Formally known as Account 1925)",363599,162914,{"$f":"C20-D20","v":200685},99903,{"$f":"E20+0.5*F20","v":250636.5},3,{"$f":"IF(H20=0,0,1/H20)","v":0.33333333333333331},{"$f":"IF(H20=0,0,G20/H20)","v":83545.5},103253,{"$f":"IF(ISERROR(+J20-K20), 0, +J20-K20)","v":-19707.5}]
[1612,"Land Rights (Formally known as Account 1906)",0,0,{"$f":"C21-D21","v":0},0,{"$f":"E21+0.5*F21","v":0},0,0,0,0,0]
[1805,"Land",273770,0,273770,0,273770,0,0,0,0,0]
[1808,"Buildings",982703,239102.8,743600.2,-195,743502.7,50,0.02,14870.053999999998,14935,-64.946000000001732]
[1810,"Leasehold Improvements",0,0,0,0,0,0,0,0,0,0]
[1815,"Transformer Station Equipment >50 kV",86252,3452,82800,0,82800,25,0.04,3312,3450,-138]
[1820,"Distribution Station Equipment <50 kV",0,0,0,0,0,0,0,0,0,0]
[1825,"Storage Battery Equipment",4358561,1353335,3005226,-47197,2981627.5,25,0.04,119265.1,115044,4221.1000000000058]
[1830,"Poles, Towers & Fixtures",0,0,0,0,0,0,0,0,0,0]
[1835,"Overhead Conductors & Devices",9077888,726324.5,8351563.5,1161036,8932081.5,25,0.04,357283.26,288222,69061.260000000009]
[1840,"Underground Conduit",13192946,6253570.5,6939375.5,1013377,7446064,25,0.04,297842.56,247207,50635.56]
[1845,"Underground Conductors & Devices",2035571,297546.09999999998,1738024.9,404762,1940405.9,25,0.04,77616.23599999999,89518,-11901.76400000001]
[1850,"Line Transformers",11721156,546405.9,11174750.1,316123,11332811.6,25,0.04,453312.46399999998,475199,-21886.536000000022]
[1855,"Services (Overhead & Underground)",8602786,609566,7993220,581801,8284120.5,25,0.04,331364.82,354852,-23487.179999999993]
[1860,"Meters (Smart Meters)",4017136,309263.5,3707872.5,221645,3818695,25,0.04,152747.79999999999,165198,-12450.200000000012]
[1860,"Meters",287258,0,287258,0,287258,25,0.04,11490.32,8917.24,2573.08]
[1905,"Land",2162281,0,2162281,61343,2192952.5,15,6.6666666666666666E-2,146196.83333333334,189557.76000000001,-43360.926666666666]
[1908,"Buildings & Fixtures",7646,7646,0,0,0,25,0.04,0,0,0]
[1910,"Leasehold Improvements",201049,0,201049,0,201049,0,0,0,0,0]
[1915,"Office Furniture & Equipment (10 years)",739631,0,739631,4457,741859.5,25,0.04,29674.38,29717,-42.619999999998981]
[1915,"Office Furniture & Equipment (5 years)",0,0,0,0,0,0,0,0,0,0]
[1920,"Computer Equipment - Hardware",308655,196045,112610,5948,115584,10,0.1,11558.4,14760,-3201.6000000000004]
[1920,"Computer Equip.-Hardware(Post Mar. 22/04)",0,0,0,0,0,0,0,0,0,0]
[1920,"Computer Equip.-Hardware(Post Mar. 19/07)",515306,263231,252075,143665,323907.5,5,0.2,64781.5,76124,-11342.5]
[1930,"Transportation Equipment",0,0,0,0,0,0,0,0,0,0]
[1935,"Stores Equipment",0,0,0,0,0,0,0,0,0,0]
[1940,"Tools, Shop & Garage Equipment",1174196,null,1174196,-4702,1171845,7.35,0.1360544217687075,159434.69387755104,139936,19498.693877551035]
[1945,"Measurement & Testing Equipment",31824,14284,17540,4461,19770.5,10,0.1,1977.05,2264,-286.95000000000005]
[1950,"Power Operated Equipment",487684,180064,307620,13151,314195.5,10,0.1,31419.55,36773,-5353.4500000000007]
[1955,"Communications Equipment",32997,10937,22060,7378,25749,10,0.1,2574.9,2856,-281.09999999999991]
[1955,"Communication Equipment (Smart Meters)",0,0,0,0,0,0,0,0,0,0]
[1960,"Miscellaneous Equipment ",0,0,0,0,0,0,0,0,0,0]
[1970,"Load Management Controls Customer Premises",0,0,0,0,0,0,0,0,0,0]
[1975,"Load Management Controls Utility Premises",0,0,0,0,0,0,0,0,0,0]
[1980,"System Supervisor Equipment",0,0,0,0,0,0,0,0,0,0]
[1985,"Miscellaneous Fixed Assets",1407393,132313,1275080,285490,1417825,15,6.6666666666666666E-2,94521.666666666672,98435,-3913.3333333333285]
[1990,"Other Tangible Property",0,0,0,0,0,0,0,0,0,0]
[1995,"Contributions & Grants",-7714946,-739898,-6975048,-1688744,-7819420,25,0.04,-312776.8,-343231,30454.200000000012]
[null,"Total",{"$f":"SUM(C20:C57)","v":54353342},{"$f":"SUM(D20:D57)","v":10566102.300000001},{"$f":"SUM(E20:E57)","v":43787239.699999996},{"$f":"SUM(F20:F57)","v":2583702},{"$f":"SUM(G20:G57)","v":45079090.699999996},null,null,{"$f":"SUM(J20:J57)","v":2132012.2878775508},{"$f":"SUM(K20:K57)","v":2112987},{"$f":"SUM(L20:L57)","v":19025.287877551033}]
[]
["Notes:"]
[]
[1,"Board policy of the \"half-year\" rule - the applicant must ensure that additions in the year attract a half-year depreciation expense in the first year.  Deviations from this standard practice must be supported in the application."]
[2,"The applicant must provide an explanation of material variances."]
[]
["General","Applicants must provide a breakdown of depreciation and amortization expense in the above format for all relevant accounts.  Asset Retirement Obligations (AROs), depreciation and accretion expense should be disclosed separately consistent with the Notes of historical Audited Financial Statements."]

{"sheet":"App.2-CB_NewCGAAP_DepExp_Yr1","index":12,"n_rows":69,"n_cols":15,"rows_kept":69,"cut":false,"hidden":false,"merged":[[68,1,69,14],[61,1,61,14],[62,1,62,14],[63,1,63,14],[64,1,64,14],[65,1,65,14],[66,1,66,14],[8,0,8,14],[9,0,9,14],[17,0,18,0],[17,1,18,1],[17,10,18,10],[17,13,18,13],[10,0,10,14],[12,0,12,1],[12,11,12,12],[13,0,13,1],[13,2,13,10],[13,11,13,12],[14,0,14,1],[14,2,14,10],[14,11,14,12]]}
[null,null,null,null,null,null,null,null,null,null,null,null,null,"File Number:",{"$f":"EBNUMBER","v":"EB-2016-0085"}]
[null,null,null,null,null,null,null,null,null,null,null,null,null,"Exhibit:",4]
[null,null,null,null,null,null,null,null,null,null,null,null,null,"Tab:"]
[null,null,null,null,null,null,null,null,null,null,null,null,null,"Schedule:"]
[null,null,null,null,null,null,null,null,null,null,null,null,null,"Page:"]
[]
[null,null,null,null,null,null,null,null,null,null,null,null,null,"Date:","2016-11-28"]
[]
["Appendix 2-CB"]
["Depreciation and Amortization Expense"]
["Revised CGAAP (Year 1)"]
[]
["Select the set of appendices that apply",null,null,null,null,null,null,null,null,null,null,"Year Reflected in Schedule Below",null,"Accounting Standard"]
["2012 Set of Appendices (2-CA to 2-CG)",null,"Assumes the applicant made capitalization and depreciation expense accounting policy changes under CGAAP effective January 1, 2012 and has adopted IFRS for financial reporting purposes effective January 1, 2015.  Assumes that the applicant is reflecting these changes in a rebasing application for the first time.",null,null,null,null,null,null,null,null,2012,null,"Revised CGAAP"]
["2013 Set of Appendices (2-CA to 2-CF)",null,"Assumes the applicant made capitalization and depreciation expense accounting policy changes under CGAAP effective January 1, 2013 and has adopted IFRS for financial reporting purposes effective January 1, 2015.  Assumes that the applicant is reflecting these changes in a rebasing application for the first time.",null,null,null,null,null,null,null,null,2013,null,"Revised CGAAP"]
[]
[]
["Account","Description","Opening NBV as at Jan 15","Additions","Average Remaining Life of Opening NBV 4","Years (new additions only) 3","Depreciation Rate on New Additions","Depreciation Expense on Opening NBV","Depreciation Expense on Additions 1","Current Year Depreciation Expense ","Depreciation Expense per Appendix 2-BA Fixed Assets, Column J \n (l)","Variance 2","Depreciation Expense on Current Full Year Additions","Less Depreciation Expense on Assets Fully Depreciated During the Year\n(o)","Current Full Year Depreciation 6"]
[null,null,"(a)","(d)","(i)","(f)","(g) = 1 / (f)","(j) = (a) / (i)","(h)=((d)*0.5)/(f) ","(k) = (j) + (h)",null,"(m) = (k) - (l)","(n) = (d)/(f) ",null,"(p) = (j) + (n) - (o)"]
[1611,"Computer Software (Formally known as Account 1925)",{"$f":"INDEX('[13]App.2-CG_MIFRS_DepExp_2012'!$C$16:$C$55,MATCH(A20,'[13]App.2-CG_MIFRS_DepExp_2012'!$A$16:$A$55,0))","v":119195},{"$f":"INDEX('[13]App.2-CG_MIFRS_DepExp_2012'!D$16:D$55,MATCH(A20,'[13]App.2-CG_MIFRS_DepExp_2012'!$A$16:$A$55,0))","v":99903},1.35,{"$f":"INDEX('[13]App.2-CG_MIFRS_DepExp_2012'!F$16:F$55,MATCH(A20,'[13]App.2-CG_MIFRS_DepExp_2012'!$A$16:$A$55,0))","v":3},{"$f":"IF(F20=0,0,1/F20)","v":0.33333333333333331},{"$f":"IF(E20=0,0,+C20/E20)","v":88292.592592592584},{"$f":"IF(F20=0,0,+(D20*0.5)/F20)","v":16650.5},{"$f":"IF(ISERROR(+H20+I20), 0, +H20+I20)","v":104943.09259259258},{"$f":"INDEX('[13]App.2-CG_MIFRS_DepExp_2012'!$K$16:$K$55,MATCH(A20,'[13]App.2-CG_MIFRS_DepExp_2012'!$A$16:$A$55,0))","v":103253},{"$f":"IF(ISERROR(+J20-K20), 0, +J20-K20)","v":1690.092592592584},{"$f":"IF(F20=0,0,+(D20)/F20)","v":33301},{"$f":"46300+8800","v":55100},{"$f":"IF(ISERROR(+M20+H20-N20), 0, +M20+H20-N20)","v":66493.592592592584}]
[1612,"Land Rights (Formally known as Account 1906)",{"$f":"INDEX('[13]App.2-CG_MIFRS_DepExp_2012'!C$16:C$55,MATCH(1806,'[13]App.2-CG_MIFRS_DepExp_2012'!$A$16:$A$55,0))","v":424717},0,{"$f":"INDEX('[13]App.2-CG_MIFRS_DepExp_2012'!E$16:E$55,MATCH(1806,'[13]App.2-CG_MIFRS_DepExp_2012'!$A$16:$A$55,0))","v":28.558},{"$f":"INDEX('[13]App.2-CG_MIFRS_DepExp_2012'!F$16:F$55,MATCH(1806,'[13]App.2-CG_MIFRS_DepExp_2012'!$A$16:$A$55,0))","v":50},0.02,14872.084879893549,0,14872.084879893549,{"$f":"INDEX('[13]App.2-CG_MIFRS_DepExp_2012'!K$16:K55,MATCH(1806,'[13]App.2-CG_MIFRS_DepExp_2012'!$A$16:$A$55,0))","v":14935},-62.915120106450559,0,{"$f":"INDEX('[13]App.2-CG_MIFRS_DepExp_2012'!N$16:N55,MATCH(1806,'[13]App.2-CG_MIFRS_DepExp_2012'!$A$16:$A$55,0))","v":297},{"$f":"IF(ISERROR(+M21+H21-N21), 0, +M21+H21-N21)","v":14575.084879893549}]
[1805,"Land",{"$f":"INDEX('[13]App.2-CG_MIFRS_DepExp_2012'!$C$16:$C$55,MATCH(A22,'[13]App.2-CG_MIFRS_DepExp_2012'!$A$16:$A$55,0))","v":273770},{"$f":"INDEX('[13]App.2-CG_MIFRS_DepExp_2012'!D$16:D$55,MATCH(A22,'[13]App.2-CG_MIFRS_DepExp_2012'!$A$16:$A$55,0))","v":0},{"$f":"INDEX('[13]App.2-CG_MIFRS_DepExp_2012'!E$16:E$55,MATCH(A22,'[13]App.2-CG_MIFRS_DepExp_2012'!$A$16:$A$55,0))","v":0},{"$f":"INDEX('[13]App.2-CG_MIFRS_DepExp_2012'!F$16:F$55,MATCH(A22,'[13]App.2-CG_MIFRS_DepExp_2012'!$A$16:$A$55,0))","v":0},0,0,0,0,{"$f":"INDEX('[13]App.2-CG_MIFRS_DepExp_2012'!$K$16:$K$55,MATCH(A22,'[13]App.2-CG_MIFRS_DepExp_2012'!$A$16:$A$55,0))","v":0},0,0,{"$f":"INDEX('[13]App.2-CG_MIFRS_DepExp_2012'!$N$16:$N$55,MATCH(A22,'[13]App.2-CG_MIFRS_DepExp_2012'!$A$16:$A$55,0))","v":0},0]
[1808,"Buildings",{"$f":"INDEX('[13]App.2-CG_MIFRS_DepExp_2012'!$C$16:$C$55,MATCH(A23,'[13]App.2-CG_MIFRS_DepExp_2012'!$A$16:$A$55,0))","v":0},{"$f":"INDEX('[13]App.2-CG_MIFRS_DepExp_2012'!D$16:D$55,MATCH(A23,'[13]App.2-CG_MIFRS_DepExp_2012'!$A$16:$A$55,0))","v":0},{"$f":"INDEX('[13]App.2-CG_MIFRS_DepExp_2012'!E$16:E$55,MATCH(A23,'[13]App.2-CG_MIFRS_DepExp_2012'!$A$16:$A$55,0))","v":0},{"$f":"INDEX('[13]App.2-CG_MIFRS_DepExp_2012'!F$16:F$55,MATCH(A23,'[13]App.2-CG_MIFRS_DepExp_2012'!$A$16:$A$55,0))","v":0},0,0,0,0,{"$f":"INDEX('[13]App.2-CG_MIFRS_DepExp_2012'!$K$16:$K$55,MATCH(A23,'[13]App.2-CG_MIFRS_DepExp_2012'!$A$16:$A$55,0))","v":0},0,0,{"$f":"INDEX('[13]App.2-CG_MIFRS_DepExp_2012'!$N$16:$N$55,MATCH(A23,'[13]App.2-CG_MIFRS_DepExp_2012'!$A$16:$A$55,0))","v":0},0]
[1810,"Leasehold Improvements",{"$f":"INDEX('[13]App.2-CG_MIFRS_DepExp_2012'!$C$16:$C$55,MATCH(A24,'[13]App.2-CG_MIFRS_DepExp_2012'!$A$16:$A$55,0))","v":51752},{"$f":"INDEX('[13]App.2-CG_MIFRS_DepExp_2012'!D$16:D$55,MATCH(A24,'[13]App.2-CG_MIFRS_DepExp_2012'!$A$16:$A$55,0))","v":0},1,{"$f":"INDEX('[13]App.2-CG_MIFRS_DepExp_2012'!F$16:F$55,MATCH(A24,'[13]App.2-CG_MIFRS_DepExp_2012'!$A$16:$A$55,0))","v":25},0.04,51752,0,51752,{"$f":"INDEX('[13]App.2-CG_MIFRS_DepExp_2012'!$K$16:$K$55,MATCH(A24,'[13]App.2-CG_MIFRS_DepExp_2012'!$A$16:$A$55,0))","v":51752},0,0,51752,0]
[1815,"Transformer Station Equipment >50 kV",{"$f":"INDEX('[13]App.2-CG_MIFRS_DepExp_2012'!$C$16:$C$55,MATCH(A25,'[13]App.2-CG_MIFRS_DepExp_2012'!$A$16:$A$55,0))","v":0},{"$f":"INDEX('[13]App.2-CG_MIFRS_DepExp_2012'!D$16:D$55,MATCH(A25,'[13]App.2-CG_MIFRS_DepExp_2012'!$A$16:$A$55,0))","v":0},{"$f":"INDEX('[13]App.2-CG_MIFRS_DepExp_2012'!E$16:E$55,MATCH(A25,'[13]App.2-CG_MIFRS_DepExp_2012'!$A$16:$A$55,0))","v":0},{"$f":"INDEX('[13]App.2-CG_MIFRS_DepExp_2012'!F$16:F$55,MATCH(A25,'[13]App.2-CG_MIFRS_DepExp_2012'!$A$16:$A$55,0))","v":0},0,0,0,0,{"$f":"INDEX('[13]App.2-CG_MIFRS_DepExp_2012'!$K$16:$K$55,MATCH(A25,'[13]App.2-CG_MIFRS_DepExp_2012'!$A$16:$A$55,0))","v":0},0,0,{"$f":"INDEX('[13]App.2-CG_MIFRS_DepExp_2012'!$N$16:$N$55,MATCH(A25,'[13]App.2-CG_MIFRS_DepExp_2012'!$A$16:$A$55,0))","v":0},0]
[1820,"Distribution Station Equipment <50 kV",{"$f":"INDEX('[13]App.2-CG_MIFRS_DepExp_2012'!$C$16:$C$55,MATCH(A26,'[13]App.2-CG_MIFRS_DepExp_2012'!$A$16:$A$55,0))","v":2035685},0,{"$f":"INDEX('[13]App.2-CG_MIFRS_DepExp_2012'!E$16:E$55,MATCH(A26,'[13]App.2-CG_MIFRS_DepExp_2012'!$A$16:$A$55,0))","v":22.51},{"$f":"INDEX('[13]App.2-CG_MIFRS_DepExp_2012'!F$16:F$55,MATCH(A26,'[13]App.2-CG_MIFRS_DepExp_2012'!$A$16:$A$55,0))","v":40},2.5000000000000001E-2,90434.695690804074,0,90434.695690804074,{"$f":"INDEX('[13]App.2-CG_MIFRS_DepExp_2012'!$K$16:$K$55,MATCH(A26,'[13]App.2-CG_MIFRS_DepExp_2012'!$A$16:$A$55,0))","v":90740},-305.30430919592618,0,null,90434.695690804074]
[1825,"Storage Battery Equipment",{"$f":"INDEX('[13]App.2-CG_MIFRS_DepExp_2012'!$C$16:$C$55,MATCH(A27,'[13]App.2-CG_MIFRS_DepExp_2012'!$A$16:$A$55,0))","v":0},{"$f":"INDEX('[13]App.2-CG_MIFRS_DepExp_2012'!D$16:D$55,MATCH(A27,'[13]App.2-CG_MIFRS_DepExp_2012'!$A$16:$A$55,0))","v":0},{"$f":"INDEX('[13]App.2-CG_MIFRS_DepExp_2012'!E$16:E$55,MATCH(A27,'[13]App.2-CG_MIFRS_DepExp_2012'!$A$16:$A$55,0))","v":0},{"$f":"INDEX('[13]App.2-CG_MIFRS_DepExp_2012'!F$16:F$55,MATCH(A27,'[13]App.2-CG_MIFRS_DepExp_2012'!$A$16:$A$55,0))","v":0},0,0,0,0,{"$f":"INDEX('[13]App.2-CG_MIFRS_DepExp_2012'!$K$16:$K$55,MATCH(A27,'[13]App.2-CG_MIFRS_DepExp_2012'!$A$16:$A$55,0))","v":0},0,0,null,0]
[1830,"Poles, Towers & Fixtures",{"$f":"INDEX('[13]App.2-CG_MIFRS_DepExp_2012'!$C$16:$C$55,MATCH(A28,'[13]App.2-CG_MIFRS_DepExp_2012'!$A$16:$A$55,0))","v":4791235},{"$f":"INDEX('[13]App.2-CG_MIFRS_DepExp_2012'!D$16:D$55,MATCH(A28,'[13]App.2-CG_MIFRS_DepExp_2012'!$A$16:$A$55,0))","v":1161036},31,{"$f":"INDEX('[13]App.2-CG_MIFRS_DepExp_2012'!F$16:F$55,MATCH(A28,'[13]App.2-CG_MIFRS_DepExp_2012'!$A$16:$A$55,0))","v":45},2.2222222222222223E-2,154555.96774193548,12900.4,167456.36774193548,{"$f":"INDEX('[13]App.2-CG_MIFRS_DepExp_2012'!$K$16:$K$55,MATCH(A28,'[13]App.2-CG_MIFRS_DepExp_2012'!$A$16:$A$55,0))","v":169153},-1696.632258064521,25800.799999999999,{"$f":"INDEX('[13]App.2-CG_MIFRS_DepExp_2012'!$N$16:$N$55,MATCH(A28,'[13]App.2-CG_MIFRS_DepExp_2012'!$A$16:$A$55,0))","v":0},180356.76774193547]
[1835,"Overhead Conductors & Devices",{"$f":"INDEX('[13]App.2-CG_MIFRS_DepExp_2012'!$C$16:$C$55,MATCH(A29,'[13]App.2-CG_MIFRS_DepExp_2012'!$A$16:$A$55,0))","v":5716025},{"$f":"INDEX('[13]App.2-CG_MIFRS_DepExp_2012'!D$16:D$55,MATCH(A29,'[13]App.2-CG_MIFRS_DepExp_2012'!$A$16:$A$55,0))","v":1013377},36,{"$f":"INDEX('[13]App.2-CG_MIFRS_DepExp_2012'!F$16:F$55,MATCH(A29,'[13]App.2-CG_MIFRS_DepExp_2012'!$A$16:$A$55,0))","v":60},1.6666666666666666E-2,158778.47222222222,8444.8083333333325,{"$f":"IF(ISERROR(+H29+I29), 0, +H29+I29)","v":167223.28055555554},{"$f":"INDEX('[13]App.2-CG_MIFRS_DepExp_2012'!$K$16:$K$55,MATCH(A29,'[13]App.2-CG_MIFRS_DepExp_2012'!$A$16:$A$55,0))","v":168676},-1452.7194444444613,16889.616666666665,{"$f":"INDEX('[13]App.2-CG_MIFRS_DepExp_2012'!$N$16:$N$55,MATCH(A29,'[13]App.2-CG_MIFRS_DepExp_2012'!$A$16:$A$55,0))","v":0},175668.08888888889]
[1840,"Underground Conduit",{"$f":"INDEX('[13]App.2-CG_MIFRS_DepExp_2012'!$C$16:$C$55,MATCH(A30,'[13]App.2-CG_MIFRS_DepExp_2012'!$A$16:$A$55,0))","v":1547804},{"$f":"INDEX('[13]App.2-CG_MIFRS_DepExp_2012'!D$16:D$55,MATCH(A30,'[13]App.2-CG_MIFRS_DepExp_2012'!$A$16:$A$55,0))","v":404762},27,{"$f":"INDEX('[13]App.2-CG_MIFRS_DepExp_2012'!F$16:F$55,MATCH(A30,'[13]App.2-CG_MIFRS_DepExp_2012'!$A$16:$A$55,0))","v":40},2.5000000000000001E-2,57326.074074074073,5059.5249999999996,62385.599074074074,{"$f":"INDEX('[13]App.2-CG_MIFRS_DepExp_2012'!$K$16:$K$55,MATCH(A30,'[13]App.2-CG_MIFRS_DepExp_2012'!$A$16:$A$55,0))","v":61506},879.59907407407445,10119.049999999999,{"$f":"INDEX('[13]App.2-CG_MIFRS_DepExp_2012'!$N$16:$N$55,MATCH(A30,'[13]App.2-CG_MIFRS_DepExp_2012'!$A$16:$A$55,0))","v":0},67445.124074074076]
[1845,"Underground Conductors & Devices",{"$f":"INDEX('[13]App.2-CG_MIFRS_DepExp_2012'!$C$16:$C$55,MATCH(A31,'[13]App.2-CG_MIFRS_DepExp_2012'!$A$16:$A$55,0))","v":7382140},{"$f":"INDEX('[13]App.2-CG_MIFRS_DepExp_2012'!D$16:D$55,MATCH(A31,'[13]App.2-CG_MIFRS_DepExp_2012'!$A$16:$A$55,0))","v":316123},31.2,{"$f":"INDEX('[13]App.2-CG_MIFRS_DepExp_2012'!F$16:F$55,MATCH(A31,'[13]App.2-CG_MIFRS_DepExp_2012'!$A$16:$A$55,0))","v":40},2.5000000000000001E-2,{"$f":"IF(E31=0,0,+C31/E31)","v":236607.05128205128},3951.5374999999999,240558.58878205129,{"$f":"INDEX('[13]App.2-CG_MIFRS_DepExp_2012'!$K$16:$K$55,MATCH(A31,'[13]App.2-CG_MIFRS_DepExp_2012'!$A$16:$A$55,0))","v":240015},543.58878205128713,7903.0749999999998,{"$f":"INDEX('[13]App.2-CG_MIFRS_DepExp_2012'!$N$16:$N$55,MATCH(A31,'[13]App.2-CG_MIFRS_DepExp_2012'!$A$16:$A$55,0))","v":0},244510.12628205129]
[1850,"Line Transformers",{"$f":"INDEX('[13]App.2-CG_MIFRS_DepExp_2012'!$C$16:$C$55,MATCH(A32,'[13]App.2-CG_MIFRS_DepExp_2012'!$A$16:$A$55,0))","v":3014840},{"$f":"INDEX('[13]App.2-CG_MIFRS_DepExp_2012'!D$16:D$55,MATCH(A32,'[13]App.2-CG_MIFRS_DepExp_2012'!$A$16:$A$55,0))","v":581801},25,{"$f":"INDEX('[13]App.2-CG_MIFRS_DepExp_2012'!F$16:F$55,MATCH(A32,'[13]App.2-CG_MIFRS_DepExp_2012'!$A$16:$A$55,0))","v":40},2.5000000000000001E-2,120593.60000000001,7272.5124999999998,127866.1125,{"$f":"INDEX('[13]App.2-CG_MIFRS_DepExp_2012'!$K$16:$K$55,MATCH(A32,'[13]App.2-CG_MIFRS_DepExp_2012'!$A$16:$A$55,0))","v":127228},638.11250000000291,14545.025,0,135138.625]
[1855,"Services (Overhead & Underground)",{"$f":"INDEX('[13]App.2-CG_MIFRS_DepExp_2012'!$C$16:$C$55,MATCH(A33,'[13]App.2-CG_MIFRS_DepExp_2012'!$A$16:$A$55,0))","v":2259956},{"$f":"INDEX('[13]App.2-CG_MIFRS_DepExp_2012'!D$16:D$55,MATCH(A33,'[13]App.2-CG_MIFRS_DepExp_2012'!$A$16:$A$55,0))","v":221645},34,{"$f":"INDEX('[13]App.2-CG_MIFRS_DepExp_2012'!F$16:F$55,MATCH(A33,'[13]App.2-CG_MIFRS_DepExp_2012'!$A$16:$A$55,0))","v":50},0.02,66469.294117647063,2216.4499999999998,68685.74411764706,{"$f":"INDEX('[13]App.2-CG_MIFRS_DepExp_2012'!$K$16:$K$55,MATCH(A33,'[13]App.2-CG_MIFRS_DepExp_2012'!$A$16:$A$55,0))","v":67209},1476.7441176470602,4432.8999999999996,{"$f":"INDEX('[13]App.2-CG_MIFRS_DepExp_2012'!$N$16:$N$55,MATCH(A33,'[13]App.2-CG_MIFRS_DepExp_2012'!$A$16:$A$55,0))","v":0},70902.194117647057]
[1860,"Meters (Smart Meters)",1834786,61343,9.8000000000000007,15,6.6666666666666666E-2,187223.06122448979,2044.7666666666667,189267.82789115646,189558,-290.17210884354427,4089.5333333333333,13390,177922.59455782312]
[1860,"Meters",220222,0,19,25,0.04,11590.631578947368,0,11590.631578947368,8917,2673.6315789473683,0,11591,-0.36842105263167468]
[1905,"Land",{"$f":"INDEX('[13]App.2-CG_MIFRS_DepExp_2012'!C$16:C$55,MATCH($A$36,'[13]App.2-CG_MIFRS_DepExp_2012'!$A$16:$A$55,0))","v":201049},{"$f":"INDEX('[13]App.2-CG_MIFRS_DepExp_2012'!D$16:D$55,MATCH($A36,'[13]App.2-CG_MIFRS_DepExp_2012'!$A$16:$A$55,0))","v":0},{"$f":"INDEX('[13]App.2-CG_MIFRS_DepExp_2012'!E$16:E$55,MATCH(A36,'[13]App.2-CG_MIFRS_DepExp_2012'!$A$16:$A$55,0))","v":0},{"$f":"INDEX('[13]App.2-CG_MIFRS_DepExp_2012'!F$16:F$55,MATCH(A36,'[13]App.2-CG_MIFRS_DepExp_2012'!$A$16:$A$55,0))","v":0},0,0,0,0,{"$f":"INDEX('[13]App.2-CG_MIFRS_DepExp_2012'!$K$16:$K$55,MATCH(A36,'[13]App.2-CG_MIFRS_DepExp_2012'!$A$16:$A$55,0))","v":0},0,0,{"$f":"INDEX('[13]App.2-CG_MIFRS_DepExp_2012'!$N$16:$N$55,MATCH(A36,'[13]App.2-CG_MIFRS_DepExp_2012'!$A$16:$A$55,0))","v":0},0]
[1908,"Buildings & Fixtures",{"$f":"INDEX('[13]App.2-CG_MIFRS_DepExp_2012'!$C$16:$C$55,MATCH(A37,'[13]App.2-CG_MIFRS_DepExp_2012'!$A$16:$A$55,0))","v":465719},4457,35,{"$f":"INDEX('[13]App.2-CG_MIFRS_DepExp_2012'!F$16:F$55,MATCH(A37,'[13]App.2-CG_MIFRS_DepExp_2012'!$A$16:$A$55,0))","v":50},0.02,13306.257142857143,{"$f":"IF(F37=0,0,+(D37*0.5)/F37)","v":44.57},13350.827142857142,{"$f":"INDEX('[13]App.2-CG_MIFRS_DepExp_2012'!$K$16:$K$55,MATCH(A37,'[13]App.2-CG_MIFRS_DepExp_2012'!$A$16:$A$55,0))","v":11279},2071.8271428571425,89.14,{"$f":"INDEX('[13]App.2-CG_MIFRS_DepExp_2012'!$N$16:$N$55,MATCH(A37,'[13]App.2-CG_MIFRS_DepExp_2012'!$A$16:$A$55,0))","v":0},13395.397142857142]
[1910,"Leasehold Improvements",{"$f":"INDEX('[13]App.2-CG_MIFRS_DepExp_2012'!$C$16:$C$55,MATCH(A38,'[13]App.2-CG_MIFRS_DepExp_2012'!$A$16:$A$55,0))","v":0},{"$f":"INDEX('[13]App.2-CG_MIFRS_DepExp_2012'!D$16:D$55,MATCH($A38,'[13]App.2-CG_MIFRS_DepExp_2012'!$A$16:$A$55,0))","v":0},{"$f":"INDEX('[13]App.2-CG_MIFRS_DepExp_2012'!E$16:E$55,MATCH(A38,'[13]App.2-CG_MIFRS_DepExp_2012'!$A$16:$A$55,0))","v":0},{"$f":"INDEX('[13]App.2-CG_MIFRS_DepExp_2012'!F$16:F$55,MATCH(A38,'[13]App.2-CG_MIFRS_DepExp_2012'!$A$16:$A$55,0))","v":0},0,0,0,0,{"$f":"INDEX('[13]App.2-CG_MIFRS_DepExp_2012'!$K$16:$K$55,MATCH(A38,'[13]App.2-CG_MIFRS_DepExp_2012'!$A$16:$A$55,0))","v":0},0,0,{"$f":"INDEX('[13]App.2-CG_MIFRS_DepExp_2012'!$N$16:$N$55,MATCH(A38,'[13]App.2-CG_MIFRS_DepExp_2012'!$A$16:$A$55,0))","v":0},0]
[1915,"Office Furniture & Equipment (10 years)",{"$f":"INDEX('[13]App.2-CG_MIFRS_DepExp_2012'!$C$16:$C$55,MATCH(A39,'[13]App.2-CG_MIFRS_DepExp_2012'!$A$16:$A$55,0))","v":76007},{"$f":"INDEX('[13]App.2-CG_MIFRS_DepExp_2012'!D$16:D$55,MATCH($A39,'[13]App.2-CG_MIFRS_DepExp_2012'!$A$16:$A$55,0))","v":5948},5,{"$f":"INDEX('[13]App.2-CG_MIFRS_DepExp_2012'!F$16:F$55,MATCH(A39,'[13]App.2-CG_MIFRS_DepExp_2012'!$A$16:$A$55,0))","v":10},0.1,15201.4,297.39999999999998,15498.8,{"$f":"INDEX('[13]App.2-CG_MIFRS_DepExp_2012'!$K$16:$K$55,MATCH(A39,'[13]App.2-CG_MIFRS_DepExp_2012'!$A$16:$A$55,0))","v":14760},738.79999999999927,594.79999999999995,{"$f":"INDEX('[13]App.2-CG_MIFRS_DepExp_2012'!$N$16:$N$55,MATCH(A39,'[13]App.2-CG_MIFRS_DepExp_2012'!$A$16:$A$55,0))","v":0},15796.199999999999]
[1915,"Office Furniture & Equipment (5 years)",{"$f":"'[13]App.2-CG_MIFRS_DepExp_2012'!C$38","v":0},{"$f":"'[13]App.2-CG_MIFRS_DepExp_2012'!D$38","v":0},{"$f":"'[13]App.2-CG_MIFRS_DepExp_2012'!E$38","v":0},{"$f":"'[13]App.2-CG_MIFRS_DepExp_2012'!F$38","v":0},0,0,0,0,0,0,0,{"$f":"'[13]App.2-CG_MIFRS_DepExp_2012'!N$32","v":0},0]
[1920,"Computer Equipment - Hardware",{"$f":"INDEX('[13]App.2-CG_MIFRS_DepExp_2012'!C$16:C$55,MATCH($A$41,'[13]App.2-CG_MIFRS_DepExp_2012'!$A$16:$A$55,0))","v":115225},{"$f":"INDEX('[13]App.2-CG_MIFRS_DepExp_2012'!D$16:D$55,MATCH($A$41,'[13]App.2-CG_MIFRS_DepExp_2012'!$A$16:$A$55,0))","v":143665},1.9,{"$f":"INDEX('[13]App.2-CG_MIFRS_DepExp_2012'!F$16:F$55,MATCH($A$41,'[13]App.2-CG_MIFRS_DepExp_2012'!$A$16:$A$55,0))","v":5},0.2,60644.736842105267,14366.5,75011.236842105267,{"$f":"INDEX('[13]App.2-CG_MIFRS_DepExp_2012'!$K$16:$K$55,MATCH(A41,'[13]App.2-CG_MIFRS_DepExp_2012'!$A$16:$A$55,0))","v":76124},-1112.763157894733,28733,28500,60877.736842105267]
[1920,"Computer Equip.-Hardware(Post Mar. 22/04)",{"$f":"'[13]App.2-CG_MIFRS_DepExp_2012'!C$40","v":0},{"$f":"'[13]App.2-CG_MIFRS_DepExp_2012'!D$40","v":0},{"$f":"'[13]App.2-CG_MIFRS_DepExp_2012'!E$40","v":0},{"$f":"'[13]App.2-CG_MIFRS_DepExp_2012'!F$40","v":0},0,0,0,0,{"$f":"'[13]App.2-CG_MIFRS_DepExp_2012'!K40","v":0},0,0,{"$f":"'[13]App.2-CG_MIFRS_DepExp_2012'!N40","v":0},0]
[1920,"Computer Equip.-Hardware(Post Mar. 19/07)",{"$f":"'[13]App.2-CG_MIFRS_DepExp_2012'!C$41","v":0},{"$f":"'[13]App.2-CG_MIFRS_DepExp_2012'!D$41","v":0},{"$f":"'[13]App.2-CG_MIFRS_DepExp_2012'!E$41","v":0},{"$f":"'[13]App.2-CG_MIFRS_DepExp_2012'!F$41","v":0},0,0,0,0,{"$f":"'[13]App.2-CG_MIFRS_DepExp_2012'!K41","v":0},0,0,{"$f":"'[13]App.2-CG_MIFRS_DepExp_2012'!N41","v":0},0]
[1930,"Transportation Equipment",{"$f":"INDEX('[13]App.2-CG_MIFRS_DepExp_2012'!C$16:C$55,MATCH($A$44,'[13]App.2-CG_MIFRS_DepExp_2012'!$A$16:$A$55,0))","v":714062},0,5.0999999999999996,{"$f":"INDEX('[13]App.2-CG_MIFRS_DepExp_2012'!F$16:F$55,MATCH($A44,'[13]App.2-CG_MIFRS_DepExp_2012'!$A$16:$A$55,0))","v":5},0.2,140012.15686274512,0,140012.15686274512,{"$f":"INDEX('[13]App.2-CG_MIFRS_DepExp_2012'!$K$16:$K$55,MATCH(A44,'[13]App.2-CG_MIFRS_DepExp_2012'!$A$16:$A$55,0))","v":139936},76.156862745119724,0,{"$f":"INDEX('[13]App.2-CG_MIFRS_DepExp_2012'!$N$16:$N$55,MATCH(A44,'[13]App.2-CG_MIFRS_DepExp_2012'!$A$16:$A$55,0))","v":0},140012.15686274512]
[1935,"Stores Equipment",{"$f":"INDEX('[13]App.2-CG_MIFRS_DepExp_2012'!$C$16:$C$55,MATCH(A45,'[13]App.2-CG_MIFRS_DepExp_2012'!$A$16:$A$55,0))","v":13652},{"$f":"INDEX('[13]App.2-CG_MIFRS_DepExp_2012'!D$16:D$55,MATCH($A45,'[13]App.2-CG_MIFRS_DepExp_2012'!$A$16:$A$55,0))","v":4461},{"$f":"INDEX('[13]App.2-CG_MIFRS_DepExp_2012'!E$16:E$55,MATCH($A45,'[13]App.2-CG_MIFRS_DepExp_2012'!$A$16:$A$55,0))","v":7.7850000000000001},{"$f":"INDEX('[13]App.2-CG_MIFRS_DepExp_2012'!F$16:F$55,MATCH($A45,'[13]App.2-CG_MIFRS_DepExp_2012'!$A$16:$A$55,0))","v":10},0.1,1753.6287732819524,223.05,1976.6787732819523,{"$f":"INDEX('[13]App.2-CG_MIFRS_DepExp_2012'!$K$16:$K$55,MATCH(A45,'[13]App.2-CG_MIFRS_DepExp_2012'!$A$16:$A$55,0))","v":2264},-287.32122671804768,446.1,{"$f":"INDEX('[13]App.2-CG_MIFRS_DepExp_2012'!$N$16:$N$55,MATCH(A45,'[13]App.2-CG_MIFRS_DepExp_2012'!$A$16:$A$55,0))","v":0},2199.7287732819523]
[1940,"Tools, Shop & Garage Equipment",{"$f":"INDEX('[13]App.2-CG_MIFRS_DepExp_2012'!$C$16:$C$55,MATCH(A46,'[13]App.2-CG_MIFRS_DepExp_2012'!$A$16:$A$55,0))","v":299447},{"$f":"INDEX('[13]App.2-CG_MIFRS_DepExp_2012'!D$16:D$55,MATCH($A46,'[13]App.2-CG_MIFRS_DepExp_2012'!$A$16:$A$55,0))","v":13151},8.5,{"$f":"INDEX('[13]App.2-CG_MIFRS_DepExp_2012'!F$16:F$55,MATCH($A46,'[13]App.2-CG_MIFRS_DepExp_2012'!$A$16:$A$55,0))","v":10},0.1,35229.058823529413,657.55,35886.608823529416,{"$f":"INDEX('[13]App.2-CG_MIFRS_DepExp_2012'!$K$16:$K$55,MATCH(A46,'[13]App.2-CG_MIFRS_DepExp_2012'!$A$16:$A$55,0))","v":36773},-886.39117647058447,1315.1,{"$f":"INDEX('[13]App.2-CG_MIFRS_DepExp_2012'!$N$16:$N$55,MATCH(A46,'[13]App.2-CG_MIFRS_DepExp_2012'!$A$16:$A$55,0))","v":0},36544.158823529411]
[1945,"Measurement & Testing Equipment",{"$f":"INDEX('[13]App.2-CG_MIFRS_DepExp_2012'!$C$16:$C$55,MATCH(A47,'[13]App.2-CG_MIFRS_DepExp_2012'!$A$16:$A$55,0))","v":18771},{"$f":"INDEX('[13]App.2-CG_MIFRS_DepExp_2012'!D$16:D$55,MATCH($A47,'[13]App.2-CG_MIFRS_DepExp_2012'!$A$16:$A$55,0))","v":7378},{"$f":"INDEX('[13]App.2-CG_MIFRS_DepExp_2012'!E$16:E$55,MATCH($A47,'[13]App.2-CG_MIFRS_DepExp_2012'!$A$16:$A$55,0))","v":8.51},{"$f":"INDEX('[13]App.2-CG_MIFRS_DepExp_2012'!F$16:F$55,MATCH($A47,'[13]App.2-CG_MIFRS_DepExp_2012'!$A$16:$A$55,0))","v":10},0.1,2205.7579318448884,368.9,2574.6579318448885,{"$f":"INDEX('[13]App.2-CG_MIFRS_DepExp_2012'!$K$16:$K$55,MATCH(A47,'[13]App.2-CG_MIFRS_DepExp_2012'!$A$16:$A$55,0))","v":2856},-281.34206815511152,737.8,{"$f":"INDEX('[13]App.2-CG_MIFRS_DepExp_2012'!$N$16:$N$55,MATCH(A47,'[13]App.2-CG_MIFRS_DepExp_2012'!$A$16:$A$55,0))","v":0},2943.5579318448881]
[1950,"Power Operated Equipment",{"$f":"INDEX('[13]App.2-CG_MIFRS_DepExp_2012'!$C$16:$C$55,MATCH(A48,'[13]App.2-CG_MIFRS_DepExp_2012'!$A$16:$A$55,0))","v":0},{"$f":"INDEX('[13]App.2-CG_MIFRS_DepExp_2012'!D$16:D$55,MATCH($A48,'[13]App.2-CG_MIFRS_DepExp_2012'!$A$16:$A$55,0))","v":0},{"$f":"INDEX('[13]App.2-CG_MIFRS_DepExp_2012'!E$16:E$55,MATCH($A48,'[13]App.2-CG_MIFRS_DepExp_2012'!$A$16:$A$55,0))","v":0},{"$f":"INDEX('[13]App.2-CG_MIFRS_DepExp_2012'!F$16:F$55,MATCH($A48,'[13]App.2-CG_MIFRS_DepExp_2012'!$A$16:$A$55,0))","v":0},0,0,0,0,{"$f":"INDEX('[13]App.2-CG_MIFRS_DepExp_2012'!$K$16:$K$55,MATCH(A48,'[13]App.2-CG_MIFRS_DepExp_2012'!$A$16:$A$55,0))","v":0},0,0,{"$f":"INDEX('[13]App.2-CG_MIFRS_DepExp_2012'!$N$16:$N$55,MATCH(A48,'[13]App.2-CG_MIFRS_DepExp_2012'!$A$16:$A$55,0))","v":0},0]
[1955,"Communications Equipment",{"$f":"INDEX('[13]App.2-CG_MIFRS_DepExp_2012'!$C$16:$C$55,MATCH(A49,'[13]App.2-CG_MIFRS_DepExp_2012'!$A$16:$A$55,0))","v":0},{"$f":"INDEX('[13]App.2-CG_MIFRS_DepExp_2012'!D$16:D$55,MATCH($A49,'[13]App.2-CG_MIFRS_DepExp_2012'!$A$16:$A$55,0))","v":0},{"$f":"INDEX('[13]App.2-CG_MIFRS_DepExp_2012'!E$16:E$55,MATCH($A49,'[13]App.2-CG_MIFRS_DepExp_2012'!$A$16:$A$55,0))","v":0},{"$f":"INDEX('[13]App.2-CG_MIFRS_DepExp_2012'!F$16:F$55,MATCH($A49,'[13]App.2-CG_MIFRS_DepExp_2012'!$A$16:$A$55,0))","v":0},0,0,0,0,{"$f":"INDEX('[13]App.2-CG_MIFRS_DepExp_2012'!$K$16:$K$55,MATCH(A49,'[13]App.2-CG_MIFRS_DepExp_2012'!$A$16:$A$55,0))","v":0},0,0,{"$f":"INDEX('[13]App.2-CG_MIFRS_DepExp_2012'!$N$16:$N$55,MATCH(A49,'[13]App.2-CG_MIFRS_DepExp_2012'!$A$16:$A$55,0))","v":0},0]
[1955,"Communication Equipment (Smart Meters)",{"$f":"'[13]App.2-CG_MIFRS_DepExp_2012'!C$47","v":0},{"$f":"'[13]App.2-CG_MIFRS_DepExp_2012'!D$47","v":0},{"$f":"'[13]App.2-CG_MIFRS_DepExp_2012'!E$47","v":0},{"$f":"'[13]App.2-CG_MIFRS_DepExp_2012'!F$47","v":0},0,0,0,0,{"$f":"'[13]App.2-CG_MIFRS_DepExp_2012'!K$47","v":0},0,0,{"$f":"'[13]App.2-CG_MIFRS_DepExp_2012'!N$47","v":0},0]
[1960,"Miscellaneous Equipment ",{"$f":"INDEX('[13]App.2-CG_MIFRS_DepExp_2012'!C$16:C$55,MATCH($A$51,'[13]App.2-CG_MIFRS_DepExp_2012'!$A$16:$A$55,0))","v":0},{"$f":"INDEX('[13]App.2-CG_MIFRS_DepExp_2012'!D$16:D$55,MATCH($A51,'[13]App.2-CG_MIFRS_DepExp_2012'!$A$16:$A$55,0))","v":0},{"$f":"INDEX('[13]App.2-CG_MIFRS_DepExp_2012'!E$16:E$55,MATCH($A51,'[13]App.2-CG_MIFRS_DepExp_2012'!$A$16:$A$55,0))","v":0},{"$f":"INDEX('[13]App.2-CG_MIFRS_DepExp_2012'!F$16:F$55,MATCH($A51,'[13]App.2-CG_MIFRS_DepExp_2012'!$A$16:$A$55,0))","v":0},0,0,0,0,{"$f":"INDEX('[13]App.2-CG_MIFRS_DepExp_2012'!$K$16:$K$55,MATCH(A51,'[13]App.2-CG_MIFRS_DepExp_2012'!$A$16:$A$55,0))","v":0},0,0,{"$f":"INDEX('[13]App.2-CG_MIFRS_DepExp_2012'!$N$16:$N$55,MATCH(A51,'[13]App.2-CG_MIFRS_DepExp_2012'!$A$16:$A$55,0))","v":0},0]
[1970,"Load Management Controls Customer Premises",null,null,null,null,0,0,0,0,null,0,0,null,0]
[1975,"Load Management Controls Utility Premises",{"$f":"INDEX('[13]App.2-CG_MIFRS_DepExp_2012'!$C$16:$C$55,MATCH(A53,'[13]App.2-CG_MIFRS_DepExp_2012'!$A$16:$A$55,0))","v":0},{"$f":"INDEX('[13]App.2-CG_MIFRS_DepExp_2012'!D$16:D$55,MATCH($A53,'[13]App.2-CG_MIFRS_DepExp_2012'!$A$16:$A$55,0))","v":0},{"$f":"INDEX('[13]App.2-CG_MIFRS_DepExp_2012'!E$16:E$55,MATCH($A53,'[13]App.2-CG_MIFRS_DepExp_2012'!$A$16:$A$55,0))","v":0},{"$f":"INDEX('[13]App.2-CG_MIFRS_DepExp_2012'!F$16:F$55,MATCH($A53,'[13]App.2-CG_MIFRS_DepExp_2012'!$A$16:$A$55,0))","v":0},0,0,0,0,{"$f":"INDEX('[13]App.2-CG_MIFRS_DepExp_2012'!$K$16:$K$55,MATCH(A53,'[13]App.2-CG_MIFRS_DepExp_2012'!$A$16:$A$55,0))","v":0},0,0,{"$f":"INDEX('[13]App.2-CG_MIFRS_DepExp_2012'!$N$16:$N$55,MATCH(A53,'[13]App.2-CG_MIFRS_DepExp_2012'!$A$16:$A$55,0))","v":0},0]
[1980,"System Supervisor Equipment",{"$f":"INDEX('[13]App.2-CG_MIFRS_DepExp_2012'!$C$16:$C$55,MATCH(A54,'[13]App.2-CG_MIFRS_DepExp_2012'!$A$16:$A$55,0))","v":618334},{"$f":"INDEX('[13]App.2-CG_MIFRS_DepExp_2012'!D$16:D$55,MATCH($A54,'[13]App.2-CG_MIFRS_DepExp_2012'!$A$16:$A$55,0))","v":285490},7,{"$f":"INDEX('[13]App.2-CG_MIFRS_DepExp_2012'!F$16:F$55,MATCH($A54,'[13]App.2-CG_MIFRS_DepExp_2012'!$A$16:$A$55,0))","v":15},6.6666666666666666E-2,88333.428571428565,9516.3333333333339,97849.761904761894,{"$f":"INDEX('[13]App.2-CG_MIFRS_DepExp_2012'!$K$16:$K$55,MATCH(A54,'[13]App.2-CG_MIFRS_DepExp_2012'!$A$16:$A$55,0))","v":98435},-585.23809523810633,19032.666666666668,{"$f":"INDEX('[13]App.2-CG_MIFRS_DepExp_2012'!$N$16:$N$55,MATCH(A54,'[13]App.2-CG_MIFRS_DepExp_2012'!$A$16:$A$55,0))","v":0},107366.09523809524]
[1985,"Miscellaneous Fixed Assets",{"$f":"INDEX('[13]App.2-CG_MIFRS_DepExp_2012'!$C$16:$C$55,MATCH(A55,'[13]App.2-CG_MIFRS_DepExp_2012'!$A$16:$A$55,0))","v":0},{"$f":"INDEX('[13]App.2-CG_MIFRS_DepExp_2012'!D$16:D$55,MATCH($A55,'[13]App.2-CG_MIFRS_DepExp_2012'!$A$16:$A$55,0))","v":0},{"$f":"INDEX('[13]App.2-CG_MIFRS_DepExp_2012'!E$16:E$55,MATCH($A55,'[13]App.2-CG_MIFRS_DepExp_2012'!$A$16:$A$55,0))","v":0},{"$f":"INDEX('[13]App.2-CG_MIFRS_DepExp_2012'!F$16:F$55,MATCH($A55,'[13]App.2-CG_MIFRS_DepExp_2012'!$A$16:$A$55,0))","v":0},0,0,0,0,{"$f":"INDEX('[13]App.2-CG_MIFRS_DepExp_2012'!$K$16:$K$55,MATCH(A55,'[13]App.2-CG_MIFRS_DepExp_2012'!$A$16:$A$55,0))","v":0},0,0,{"$f":"INDEX('[13]App.2-CG_MIFRS_DepExp_2012'!$N$16:$N$55,MATCH(A55,'[13]App.2-CG_MIFRS_DepExp_2012'!$A$16:$A$55,0))","v":0},0]
[1990,"Other Tangible Property",null,null,null,null,0,0,0,0,null,0,0,null,0]
[1995,"Contributions & Grants",{"$f":"INDEX('[13]App.2-CG_MIFRS_DepExp_2012'!$C$16:$C$55,MATCH(A57,'[13]App.2-CG_MIFRS_DepExp_2012'!$A$16:$A$55,0))","v":-6144728},{"$f":"INDEX('[13]App.2-CG_MIFRS_DepExp_2012'!D$16:D$55,MATCH($A57,'[13]App.2-CG_MIFRS_DepExp_2012'!$A$16:$A$55,0))","v":-1688744},31,{"$f":"INDEX('[13]App.2-CG_MIFRS_DepExp_2012'!F$16:F$55,MATCH($A57,'[13]App.2-CG_MIFRS_DepExp_2012'!$A$16:$A$55,0))","v":35},2.8571428571428571E-2,-198217.03225806452,-24124.914285714287,-222341.94654377882,{"$f":"INDEX('[13]App.2-CG_MIFRS_DepExp_2012'!$K$16:$K$55,MATCH(A57,'[13]App.2-CG_MIFRS_DepExp_2012'!$A$16:$A$55,0))","v":-222877},535.0534562211833,-48249.828571428574,-10900,-235566.86082949309]
[null,"Total",{"$f":"SUM(C20:C57)","v":26049665},{"$f":"SUM(D20:D57)","v":2635796},null,null,null,{"$f":"SUM(H20:H57)","v":1396964.9180943852},59889.889047619043,1456854.8071420046,1452492,4362.8071420043352,119779.77809523809,{"$f":"SUM(N20:N57)","v":149730},1367014.6961896231]
[null,null," "," "]
["Notes:"]
[]
[1,"Board policy of the \"half-year\" rule - the applicant must ensure that additions in the year attract a half-year depreciation expense in the first year.  Deviations from this standard practice must be supported in the application."]
[2,"The applicant must provide an explanation of material variances in evidence."]
[3,"The applicant should ensure that the years for new additions of assets are the asset useful lives determined by management in accordance with the Board's regulatory accounting policies.   The capitalization and depreciation expense accounting changes should be implemented consistent with the Board’s regulatory accounting policies as set out for modified IFRS as contained in the Report of the Board, Transition to International Financial Reporting Standards, EB-2008-0408, the Kinectrics Report, and the Revised 2012 Accounting Procedures Handbook for Electricity Distributors (“APH”)."]
[4,"A recalculation should be performed to determine the average remaining life of opening balance of assets (i.e. excluding current year's additions) under the change in policies under CGAAP.  For example, Asset A had a useful life of 20 years under CGAAP without the change in policies.  On January 1 of the year of policy changes, Asset A was 3 years depreciated. As a result, Asset A would have a remaining service life of 17 years (20 years less 3 years) as at January 1 of the year of policy changes.  Due to making the change in policies under CGAAP, management re-assessed the asset useful lives and concluded that the revised useful life of Asset A is now 30 years. Therefore, the average remaining useful life of the opening balance of Asset A is determined to be 27 years (30 years less 3 years) under the revised CGAAP as at January 1 of the year of policy changes."]
[5," NBV must exclude assets still on the books but which have been fully amortized or depreciated."]
[6,"This column refers to the calculated full year depreciation but excludes the depreciation expense on assets fully depreciated during the year.  This column is used for the purpose of calculating depreciation expense in the following year on the next worksheet."]
[]
["General:","Applicants must provide a breakdown of depreciation and amortization expense in the above format for all relevant accounts.  Asset Retirement Obligations (AROs), depreciation and accretion expense should be disclosed separately consistent with the Notes of historical Audited Financial Statements."]

{"sheet":"App.2-CC_DepExp_Yr2","index":13,"n_rows":65,"n_cols":11,"rows_kept":65,"cut":false,"hidden":false,"merged":[[64,1,65,10],[8,0,8,10],[9,0,9,10],[10,0,10,10],[17,0,18,0],[17,1,18,1],[17,6,18,6],[17,9,18,9],[12,0,12,1],[13,0,13,1],[14,0,14,1],[14,2,14,8],[13,2,13,8],[60,1,60,10],[61,1,61,10],[62,1,62,10]]}
[null,null,null,null,null,null,null,null,null,"File Number:",{"$f":"EBNUMBER","v":"EB-2016-0085"}]
[null,null,null,null,null,null,null,null,null,"Exhibit:",4]
[null,null,null,null,null,null,null,null,null,"Tab:"]
[null,null,null,null,null,null,null,null,null,"Schedule:"]
[null,null,null,null,null,null,null,null,null,"Page:"]
[]
[null,null,null,null,null,null,null,null,null,"Date:","2016-11-28"]
[]
["Appendix 2-CC"]
["Depreciation and Amortization Expense"]
["Revised CGAAP (Year 2) - 2013 Revised CGAAP"]
[]
["Select the set of appendices that apply",null,null,null,null,null,null,null,null,"Year Reflected in Schedule Below","Accounting Standard"]
["2012 Set of Appendices (2-CA to 2-CG)",null,"Assumes the applicant made capitalization and depreciation expense accounting policy changes under CGAAP effective January 1, 2012 and has adopted IFRS for financial reporting purposes effective January 1, 2015.  Assumes that the applicant is reflecting these changes in a rebasing application for the first time.",null,null,null,null,null,null,2013,"Revised CGAAP"]
["2013 Set of Appendices (2-CA to 2-CF)",null,"Assumes the applicant made capitalization and depreciation expense accounting policy changes under CGAAP effective January 1, 2013 and has adopted IFRS for financial reporting purposes effective January 1, 2015.  Assumes that the applicant is reflecting these changes in a rebasing application for the first time.",null,null,null,null,null,null,2014,"Revised CGAAP"]
[]
[]
["Account","Description","Additions","Years (new additions only)","Depreciation Rate on New Additions","Current Year Depreciation Expense 1"," Depreciation Expense per Apppendix 2-BA Fixed Assets, Column J\n (l)","Variance 2","Depreciation Expense on Current Full Year Additions","Less Depreciation Expense on Assets Fully Depreciated During the Year\n(o)","Current Full Year Depreciation 3"]
[null,null,"(d)","(f)","(g) = 1 / (f)","(h)= Prior Full Year Deprecation + ((d)*0.5)/(f) ",null,"(m) = (h) - (l)","(n)=((d))/(f) ",null,"(p) = Prior Full Year Depreciation  + (n) - (o)"]
[1611,"Computer Software (Formally known as Account 1925)",177249.6,3,{"$f":"IF(D20=0,0,1/D20)","v":0.33333333333333331},{"$f":"IF(D20=0,+'App.2-CB_NewCGAAP_DepExp_Yr1'!O20,+'App.2-CB_NewCGAAP_DepExp_Yr1'!O20+((C20*0.5)/D20))","v":96035.19259259259},{"$f":"-'App.2-BA_Fixed Asset Cont'!J17","v":95944.42},{"$f":"IF(ISERROR(+F20-G20), 0, +F20-G20)","v":90.772592592591536},{"$f":"IF(D20=0,0,+(C20)/D20)","v":59083.200000000004},24600,{"$f":"IF(ISERROR(+I20+'App.2-CB_NewCGAAP_DepExp_Yr1'!O20-J20), 0, +I20+'App.2-CB_NewCGAAP_DepExp_Yr1'!O20-J20)","v":100976.7925925926}]
[1612,"Land Rights (Formally known as Account 1906)",0,50,0.02,{"$f":"IF(D21=0,+'App.2-CB_NewCGAAP_DepExp_Yr1'!O21,+'App.2-CB_NewCGAAP_DepExp_Yr1'!O21+((C21*0.5)/D21))","v":14575.084879893549},{"$f":"-'App.2-BA_Fixed Asset Cont'!J18","v":15126},-550.91512010645056,0,null,{"$f":"IF(ISERROR(+I21+'App.2-CB_NewCGAAP_DepExp_Yr1'!O21-J21), 0, +I21+'App.2-CB_NewCGAAP_DepExp_Yr1'!O21-J21)","v":14575.084879893549}]
[1805,"Land",179065.56,0,0,{"$f":"IF(D22=0,+'App.2-CB_NewCGAAP_DepExp_Yr1'!O22,+'App.2-CB_NewCGAAP_DepExp_Yr1'!O22+((C22*0.5)/D22))","v":0},{"$f":"-'App.2-BA_Fixed Asset Cont'!J19","v":0},0,0,null,{"$f":"IF(ISERROR(+I22+'App.2-CB_NewCGAAP_DepExp_Yr1'!O22-J22), 0, +I22+'App.2-CB_NewCGAAP_DepExp_Yr1'!O22-J22)","v":0}]
[1808,"Buildings",0,0,0,{"$f":"IF(D23=0,+'App.2-CB_NewCGAAP_DepExp_Yr1'!O23,+'App.2-CB_NewCGAAP_DepExp_Yr1'!O23+((C23*0.5)/D23))","v":0},{"$f":"-'App.2-BA_Fixed Asset Cont'!J20","v":0},0,0,null,{"$f":"IF(ISERROR(+I23+'App.2-CB_NewCGAAP_DepExp_Yr1'!O23-J23), 0, +I23+'App.2-CB_NewCGAAP_DepExp_Yr1'!O23-J23)","v":0}]
[1810,"Leasehold Improvements",0,25,0.04,{"$f":"IF(D24=0,+'App.2-CB_NewCGAAP_DepExp_Yr1'!O24,+'App.2-CB_NewCGAAP_DepExp_Yr1'!O24+((C24*0.5)/D24))","v":0},{"$f":"-'App.2-BA_Fixed Asset Cont'!J21","v":0},0,0,null,{"$f":"IF(ISERROR(+I24+'App.2-CB_NewCGAAP_DepExp_Yr1'!O24-J24), 0, +I24+'App.2-CB_NewCGAAP_DepExp_Yr1'!O24-J24)","v":0}]
[1815,"Transformer Station Equipment >50 kV",0,0,0,{"$f":"IF(D25=0,+'App.2-CB_NewCGAAP_DepExp_Yr1'!O25,+'App.2-CB_NewCGAAP_DepExp_Yr1'!O25+((C25*0.5)/D25))","v":0},0,0,0,null,{"$f":"IF(ISERROR(+I25+'App.2-CB_NewCGAAP_DepExp_Yr1'!O25-J25), 0, +I25+'App.2-CB_NewCGAAP_DepExp_Yr1'!O25-J25)","v":0}]
[1820,"Distribution Station Equipment <50 kV",164417.71,40,2.5000000000000001E-2,{"$f":"IF(D26=0,+'App.2-CB_NewCGAAP_DepExp_Yr1'!O26,+'App.2-CB_NewCGAAP_DepExp_Yr1'!O26+((C26*0.5)/D26))","v":92489.917065804068},{"$f":"-'App.2-BA_Fixed Asset Cont'!J22","v":85926.76},6563.1570658040728,4110.4427500000002,null,{"$f":"IF(ISERROR(+I26+'App.2-CB_NewCGAAP_DepExp_Yr1'!O26-J26), 0, +I26+'App.2-CB_NewCGAAP_DepExp_Yr1'!O26-J26)","v":94545.138440804076}]
[1825,"Storage Battery Equipment",0,0,0,{"$f":"IF(D27=0,+'App.2-CB_NewCGAAP_DepExp_Yr1'!O27,+'App.2-CB_NewCGAAP_DepExp_Yr1'!O27+((C27*0.5)/D27))","v":0},{"$f":"-'App.2-BA_Fixed Asset Cont'!J24","v":0},0,0,null,{"$f":"IF(ISERROR(+I27+'App.2-CB_NewCGAAP_DepExp_Yr1'!O27-J27), 0, +I27+'App.2-CB_NewCGAAP_DepExp_Yr1'!O27-J27)","v":0}]
[1830,"Poles, Towers & Fixtures",1112471.55,45,2.2222222222222223E-2,{"$f":"IF(D28=0,+'App.2-CB_NewCGAAP_DepExp_Yr1'!O28,+'App.2-CB_NewCGAAP_DepExp_Yr1'!O28+((C28*0.5)/D28))","v":192717.56274193549},{"$f":"-'App.2-BA_Fixed Asset Cont'!J25","v":196350.05},-3632.4872580645024,24721.59,null,{"$f":"IF(ISERROR(+I28+'App.2-CB_NewCGAAP_DepExp_Yr1'!O28-J28), 0, +I28+'App.2-CB_NewCGAAP_DepExp_Yr1'!O28-J28)","v":205078.35774193547}]
[1835,"Overhead Conductors & Devices",1403523.4,60,1.6666666666666666E-2,{"$f":"IF(D29=0,+'App.2-CB_NewCGAAP_DepExp_Yr1'!O29,+'App.2-CB_NewCGAAP_DepExp_Yr1'!O29+((C29*0.5)/D29))","v":187364.11722222221},{"$f":"-'App.2-BA_Fixed Asset Cont'!J26","v":188425.3},-1061.1827777777798,23392.056666666664,null,{"$f":"IF(ISERROR(+I29+'App.2-CB_NewCGAAP_DepExp_Yr1'!O29-J29), 0, +I29+'App.2-CB_NewCGAAP_DepExp_Yr1'!O29-J29)","v":199060.14555555556}]
[1840,"Underground Conduit",20539.09,40,2.5000000000000001E-2,{"$f":"IF(D30=0,+'App.2-CB_NewCGAAP_DepExp_Yr1'!O30,+'App.2-CB_NewCGAAP_DepExp_Yr1'!O30+((C30*0.5)/D30))","v":67701.862699074074},{"$f":"-'App.2-BA_Fixed Asset Cont'!J27","v":66667.86},1034.0026990740735,513.47725000000003,null,{"$f":"IF(ISERROR(+I30+'App.2-CB_NewCGAAP_DepExp_Yr1'!O30-J30), 0, +I30+'App.2-CB_NewCGAAP_DepExp_Yr1'!O30-J30)","v":67958.601324074072}]
[1845,"Underground Conductors & Devices",51561.65,40,2.5000000000000001E-2,{"$f":"IF(D31=0,+'App.2-CB_NewCGAAP_DepExp_Yr1'!O31,+'App.2-CB_NewCGAAP_DepExp_Yr1'!O31+((C31*0.5)/D31))","v":245154.6469070513},{"$f":"-'App.2-BA_Fixed Asset Cont'!J28","v":243721.91},1432.7369070512941,1289.04125,null,{"$f":"IF(ISERROR(+I31+'App.2-CB_NewCGAAP_DepExp_Yr1'!O31-J31), 0, +I31+'App.2-CB_NewCGAAP_DepExp_Yr1'!O31-J31)","v":245799.1675320513}]
[1850,"Line Transformers",341028.33999999997,40,2.5000000000000001E-2,{"$f":"IF(D32=0,+'App.2-CB_NewCGAAP_DepExp_Yr1'!O32,+'App.2-CB_NewCGAAP_DepExp_Yr1'!O32+((C32*0.5)/D32))","v":139401.47925},{"$f":"-'App.2-BA_Fixed Asset Cont'!J29","v":136314.89000000001},3086.58924999999,8525.7084999999988,4100,{"$f":"IF(ISERROR(+I32+'App.2-CB_NewCGAAP_DepExp_Yr1'!O32-J32), 0, +I32+'App.2-CB_NewCGAAP_DepExp_Yr1'!O32-J32)","v":139564.33350000001}]
[1855,"Services (Overhead & Underground)",228275.51,50,0.02,{"$f":"IF(D33=0,+'App.2-CB_NewCGAAP_DepExp_Yr1'!O33,+'App.2-CB_NewCGAAP_DepExp_Yr1'!O33+((C33*0.5)/D33))","v":73184.949217647052},{"$f":"-'App.2-BA_Fixed Asset Cont'!J30","v":72190.61},994.33921764705156,4565.5102000000006,null,{"$f":"IF(ISERROR(+I33+'App.2-CB_NewCGAAP_DepExp_Yr1'!O33-J33), 0, +I33+'App.2-CB_NewCGAAP_DepExp_Yr1'!O33-J33)","v":75467.704317647062}]
[1860,"Meters (Smart Meters)",126985.75,15,6.6666666666666666E-2,{"$f":"IF(D34=0,+'App.2-CB_NewCGAAP_DepExp_Yr1'!O34,+'App.2-CB_NewCGAAP_DepExp_Yr1'!O34+((C34*0.5)/D34))","v":182155.45289115646},{"$f":"-'App.2-BA_Fixed Asset Cont'!J31","v":182147.8},7.6528911564673763,8465.7166666666672,14100,{"$f":"IF(ISERROR(+I34+'App.2-CB_NewCGAAP_DepExp_Yr1'!O34-J34), 0, +I34+'App.2-CB_NewCGAAP_DepExp_Yr1'!O34-J34)","v":172288.31122448979}]
[1860,"Meters",0,25,0.04,{"$f":"IF(D35=0,+'App.2-CB_NewCGAAP_DepExp_Yr1'!O35,+'App.2-CB_NewCGAAP_DepExp_Yr1'!O35+((C35*0.5)/D35))","v":-0.36842105263167468},{"$f":"-'App.2-BA_Fixed Asset Cont'!J32","v":0},-0.36842105263167468,0,null,{"$f":"IF(ISERROR(+I35+'App.2-CB_NewCGAAP_DepExp_Yr1'!O35-J35), 0, +I35+'App.2-CB_NewCGAAP_DepExp_Yr1'!O35-J35)","v":-0.36842105263167468}]
[1905,"Land",1015496.3,0,0,{"$f":"IF(D36=0,+'App.2-CB_NewCGAAP_DepExp_Yr1'!O36,+'App.2-CB_NewCGAAP_DepExp_Yr1'!O36+((C36*0.5)/D36))","v":0},{"$f":"-'App.2-BA_Fixed Asset Cont'!J33","v":0},0,0,null,{"$f":"IF(ISERROR(+I36+'App.2-CB_NewCGAAP_DepExp_Yr1'!O36-J36), 0, +I36+'App.2-CB_NewCGAAP_DepExp_Yr1'!O36-J36)","v":0}]
[1908,"Buildings & Fixtures",4303.58,50,0.02,{"$f":"IF(D37=0,+'App.2-CB_NewCGAAP_DepExp_Yr1'!O37,+'App.2-CB_NewCGAAP_DepExp_Yr1'!O37+((C37*0.5)/D37))","v":13438.432942857142},{"$f":"-'App.2-BA_Fixed Asset Cont'!J34","v":11324.18},2114.2529428571415,86.071600000000004,null,{"$f":"IF(ISERROR(+I37+'App.2-CB_NewCGAAP_DepExp_Yr1'!O37-J37), 0, +I37+'App.2-CB_NewCGAAP_DepExp_Yr1'!O37-J37)","v":13481.468742857141}]
[1910,"Leasehold Improvements",0,0,0,{"$f":"IF(D38=0,+'App.2-CB_NewCGAAP_DepExp_Yr1'!O38,+'App.2-CB_NewCGAAP_DepExp_Yr1'!O38+((C38*0.5)/D38))","v":0},{"$f":"-'App.2-BA_Fixed Asset Cont'!J35","v":0},0,0,null,{"$f":"IF(ISERROR(+I38+'App.2-CB_NewCGAAP_DepExp_Yr1'!O38-J38), 0, +I38+'App.2-CB_NewCGAAP_DepExp_Yr1'!O38-J38)","v":0}]
[1915,"Office Furniture & Equipment (10 years)",0,10,0.1,{"$f":"IF(D39=0,+'App.2-CB_NewCGAAP_DepExp_Yr1'!O39,+'App.2-CB_NewCGAAP_DepExp_Yr1'!O39+((C39*0.5)/D39))","v":15796.199999999999},{"$f":"-'App.2-BA_Fixed Asset Cont'!J36","v":14563.45},1232.7499999999982,0,null,{"$f":"IF(ISERROR(+I39+'App.2-CB_NewCGAAP_DepExp_Yr1'!O39-J39), 0, +I39+'App.2-CB_NewCGAAP_DepExp_Yr1'!O39-J39)","v":15796.199999999999}]
[1915,"Office Furniture & Equipment (5 years)",0,0,0,{"$f":"IF(D40=0,+'App.2-CB_NewCGAAP_DepExp_Yr1'!O40,+'App.2-CB_NewCGAAP_DepExp_Yr1'!O40+((C40*0.5)/D40))","v":0},{"$f":"-'App.2-BA_Fixed Asset Cont'!J37","v":0},0,0,null,{"$f":"IF(ISERROR(+I40+'App.2-CB_NewCGAAP_DepExp_Yr1'!O40-J40), 0, +I40+'App.2-CB_NewCGAAP_DepExp_Yr1'!O40-J40)","v":0}]
[1920,"Computer Equipment - Hardware",61163.5,5,0.2,{"$f":"IF(D41=0,+'App.2-CB_NewCGAAP_DepExp_Yr1'!O41,+'App.2-CB_NewCGAAP_DepExp_Yr1'!O41+((C41*0.5)/D41))","v":66994.086842105273},{"$f":"-'App.2-BA_Fixed Asset Cont'!J38","v":66218.02},776.06684210526873,12232.7,10100,{"$f":"IF(ISERROR(+I41+'App.2-CB_NewCGAAP_DepExp_Yr1'!O41-J41), 0, +I41+'App.2-CB_NewCGAAP_DepExp_Yr1'!O41-J41)","v":63010.436842105264}]
[1920,"Computer Equip.-Hardware(Post Mar. 22/04)",0,0,0,{"$f":"IF(D42=0,+'App.2-CB_NewCGAAP_DepExp_Yr1'!O42,+'App.2-CB_NewCGAAP_DepExp_Yr1'!O42+((C42*0.5)/D42))","v":0},{"$f":"-'App.2-BA_Fixed Asset Cont'!J39","v":0},0,0,null,{"$f":"IF(ISERROR(+I42+'App.2-CB_NewCGAAP_DepExp_Yr1'!O42-J42), 0, +I42+'App.2-CB_NewCGAAP_DepExp_Yr1'!O42-J42)","v":0}]
[1920,"Computer Equip.-Hardware(Post Mar. 19/07)",0,0,0,{"$f":"IF(D43=0,+'App.2-CB_NewCGAAP_DepExp_Yr1'!O43,+'App.2-CB_NewCGAAP_DepExp_Yr1'!O43+((C43*0.5)/D43))","v":0},{"$f":"-'App.2-BA_Fixed Asset Cont'!J40","v":0},0,0,null,{"$f":"IF(ISERROR(+I43+'App.2-CB_NewCGAAP_DepExp_Yr1'!O43-J43), 0, +I43+'App.2-CB_NewCGAAP_DepExp_Yr1'!O43-J43)","v":0}]
[1930,"Transportation Equipment",65100.15,5,0.2,{"$f":"IF(D44=0,+'App.2-CB_NewCGAAP_DepExp_Yr1'!O44,+'App.2-CB_NewCGAAP_DepExp_Yr1'!O44+((C44*0.5)/D44))","v":146522.17186274513},{"$f":"-'App.2-BA_Fixed Asset Cont'!J41","v":144358.04},2164.1318627451255,13020.03,13400,{"$f":"IF(ISERROR(+I44+'App.2-CB_NewCGAAP_DepExp_Yr1'!O44-J44), 0, +I44+'App.2-CB_NewCGAAP_DepExp_Yr1'!O44-J44)","v":139632.18686274512}]
[1935,"Stores Equipment",0,10,0.1,{"$f":"IF(D45=0,+'App.2-CB_NewCGAAP_DepExp_Yr1'!O45,+'App.2-CB_NewCGAAP_DepExp_Yr1'!O45+((C45*0.5)/D45))","v":2199.7287732819523},{"$f":"-'App.2-BA_Fixed Asset Cont'!J42","v":2445.36},-245.63122671804786,0,null,{"$f":"IF(ISERROR(+I45+'App.2-CB_NewCGAAP_DepExp_Yr1'!O45-J45), 0, +I45+'App.2-CB_NewCGAAP_DepExp_Yr1'!O45-J45)","v":2199.7287732819523}]
[1940,"Tools, Shop & Garage Equipment",8336.94,10,0.1,{"$f":"IF(D46=0,+'App.2-CB_NewCGAAP_DepExp_Yr1'!O46,+'App.2-CB_NewCGAAP_DepExp_Yr1'!O46+((C46*0.5)/D46))","v":36961.005823529413},{"$f":"-'App.2-BA_Fixed Asset Cont'!J43","v":37618.379999999997},-657.37417647058464,833.69400000000007,null,{"$f":"IF(ISERROR(+I46+'App.2-CB_NewCGAAP_DepExp_Yr1'!O46-J46), 0, +I46+'App.2-CB_NewCGAAP_DepExp_Yr1'!O46-J46)","v":37377.852823529414}]
[1945,"Measurement & Testing Equipment",5794.24,10,0.1,{"$f":"IF(D47=0,+'App.2-CB_NewCGAAP_DepExp_Yr1'!O47,+'App.2-CB_NewCGAAP_DepExp_Yr1'!O47+((C47*0.5)/D47))","v":3233.2699318448881},{"$f":"-'App.2-BA_Fixed Asset Cont'!J44","v":3486.3},-253.03006815511208,579.42399999999998,null,{"$f":"IF(ISERROR(+I47+'App.2-CB_NewCGAAP_DepExp_Yr1'!O47-J47), 0, +I47+'App.2-CB_NewCGAAP_DepExp_Yr1'!O47-J47)","v":3522.9819318448881}]
[1950,"Power Operated Equipment",0,0,0,{"$f":"IF(D48=0,+'App.2-CB_NewCGAAP_DepExp_Yr1'!O48,+'App.2-CB_NewCGAAP_DepExp_Yr1'!O48+((C48*0.5)/D48))","v":0},{"$f":"-'App.2-BA_Fixed Asset Cont'!J45","v":0},0,0,null,{"$f":"IF(ISERROR(+I48+'App.2-CB_NewCGAAP_DepExp_Yr1'!O48-J48), 0, +I48+'App.2-CB_NewCGAAP_DepExp_Yr1'!O48-J48)","v":0}]
[1955,"Communications Equipment",0,0,0,{"$f":"IF(D49=0,+'App.2-CB_NewCGAAP_DepExp_Yr1'!O49,+'App.2-CB_NewCGAAP_DepExp_Yr1'!O49+((C49*0.5)/D49))","v":0},{"$f":"'App.2-BA_Fixed Asset Cont'!J46","v":0},0,0,null,{"$f":"IF(ISERROR(+I49+'App.2-CB_NewCGAAP_DepExp_Yr1'!O49-J49), 0, +I49+'App.2-CB_NewCGAAP_DepExp_Yr1'!O49-J49)","v":0}]
[1955,"Communication Equipment (Smart Meters)",0,0,0,{"$f":"IF(D50=0,+'App.2-CB_NewCGAAP_DepExp_Yr1'!O50,+'App.2-CB_NewCGAAP_DepExp_Yr1'!O50+((C50*0.5)/D50))","v":0},{"$f":"'App.2-BA_Fixed Asset Cont'!J47","v":0},0,0,null,{"$f":"IF(ISERROR(+I50+'App.2-CB_NewCGAAP_DepExp_Yr1'!O50-J50), 0, +I50+'App.2-CB_NewCGAAP_DepExp_Yr1'!O50-J50)","v":0}]
[1960,"Miscellaneous Equipment ",0,0,0,{"$f":"IF(D51=0,+'App.2-CB_NewCGAAP_DepExp_Yr1'!O51,+'App.2-CB_NewCGAAP_DepExp_Yr1'!O51+((C51*0.5)/D51))","v":0},{"$f":"'App.2-BA_Fixed Asset Cont'!J48","v":0},0,0,null,{"$f":"IF(ISERROR(+I51+'App.2-CB_NewCGAAP_DepExp_Yr1'!O51-J51), 0, +I51+'App.2-CB_NewCGAAP_DepExp_Yr1'!O51-J51)","v":0}]
[1970,"Load Management Controls Customer Premises",0,null,0,{"$f":"IF(D52=0,+'App.2-CB_NewCGAAP_DepExp_Yr1'!O52,+'App.2-CB_NewCGAAP_DepExp_Yr1'!O52+((C52*0.5)/D52))","v":0},{"$f":"'App.2-BA_Fixed Asset Cont'!J49","v":0},0,0,null,{"$f":"IF(ISERROR(+I52+'App.2-CB_NewCGAAP_DepExp_Yr1'!O52-J52), 0, +I52+'App.2-CB_NewCGAAP_DepExp_Yr1'!O52-J52)","v":0}]
[1975,"Load Management Controls Utility Premises",0,0,0,{"$f":"IF(D53=0,+'App.2-CB_NewCGAAP_DepExp_Yr1'!O53,+'App.2-CB_NewCGAAP_DepExp_Yr1'!O53+((C53*0.5)/D53))","v":0},{"$f":"'App.2-BA_Fixed Asset Cont'!J50","v":0},0,0,null,{"$f":"IF(ISERROR(+I53+'App.2-CB_NewCGAAP_DepExp_Yr1'!O53-J53), 0, +I53+'App.2-CB_NewCGAAP_DepExp_Yr1'!O53-J53)","v":0}]
[1980,"System Supervisor Equipment",202625.3,15,6.6666666666666666E-2,{"$f":"IF(D54=0,+'App.2-CB_NewCGAAP_DepExp_Yr1'!O54,+'App.2-CB_NewCGAAP_DepExp_Yr1'!O54+((C54*0.5)/D54))","v":114120.2719047619},{"$f":"-'App.2-BA_Fixed Asset Cont'!J51","v":112506.33},1613.9419047619012,13508.353333333333,6100,{"$f":"IF(ISERROR(+I54+'App.2-CB_NewCGAAP_DepExp_Yr1'!O54-J54), 0, +I54+'App.2-CB_NewCGAAP_DepExp_Yr1'!O54-J54)","v":114774.44857142857}]
[1985,"Miscellaneous Fixed Assets",0,0,0,{"$f":"IF(D55=0,+'App.2-CB_NewCGAAP_DepExp_Yr1'!O55,+'App.2-CB_NewCGAAP_DepExp_Yr1'!O55+((C55*0.5)/D55))","v":0},{"$f":"'App.2-BA_Fixed Asset Cont'!J52","v":0},0,0,null,{"$f":"IF(ISERROR(+I55+'App.2-CB_NewCGAAP_DepExp_Yr1'!O55-J55), 0, +I55+'App.2-CB_NewCGAAP_DepExp_Yr1'!O55-J55)","v":0}]
[1990,"Other Tangible Property",0,null,0,{"$f":"IF(D56=0,+'App.2-CB_NewCGAAP_DepExp_Yr1'!O56,+'App.2-CB_NewCGAAP_DepExp_Yr1'!O56+((C56*0.5)/D56))","v":0},{"$f":"'App.2-BA_Fixed Asset Cont'!J53","v":0},0,0,null,{"$f":"IF(ISERROR(+I56+'App.2-CB_NewCGAAP_DepExp_Yr1'!O56-J56), 0, +I56+'App.2-CB_NewCGAAP_DepExp_Yr1'!O56-J56)","v":0}]
[1995,"Contributions & Grants",-428862.62,35,2.8571428571428571E-2,{"$f":"IF(D57=0,+'App.2-CB_NewCGAAP_DepExp_Yr1'!O57,+'App.2-CB_NewCGAAP_DepExp_Yr1'!O57+((C57*0.5)/D57))","v":-241693.46968663594},{"$f":"-'App.2-BA_Fixed Asset Cont'!J54","v":-243767.61},2074.1403133640415,-12253.217714285714,null,{"$f":"IF(ISERROR(+I57+'App.2-CB_NewCGAAP_DepExp_Yr1'!O57-J57), 0, +I57+'App.2-CB_NewCGAAP_DepExp_Yr1'!O57-J57)","v":-247820.0785437788}]
[null,"Total",{"$f":"SUM(C20:C57)","v":4739075.55},null,null,{"$f":"SUM(F20:F57)","v":1448351.5954408138},1431568.0500000003,16783.545440813908,162673.79850238093,72400,1457288.4946920045]
[]
["Notes:"]
[1,"Board policy of the \"half-year\" rule - the applicant must ensure that additions in the year attract a half-year depreciation expense in the first year.  Deviations from this standard practice must be supported in the application."]
[2,"The applicant must provide an explanation of material variances in evidence."]
[3,"This column refers to the calculated full year depreciation but excludes the depreciation expense on assets fully depreciated during the year.  This column is used for the purpose of calculating depreciation expense in the following year on the next worksheet."]
[]
["General:","Applicants must provide a breakdown of depreciation and amortization expense in the above format for all relevant accounts.  Asset Retirement Obligations (AROs), depreciation and accretion expense should be disclosed separately consistent with the Notes of historical Audited Financial Statements."]

{"sheet":"App.2-CD_DepExp_Yr3","index":14,"n_rows":67,"n_cols":11,"rows_kept":67,"cut":false,"hidden":false,"merged":[[62,1,62,10],[63,1,63,10],[64,1,64,10],[66,1,67,10],[58,1,58,4],[8,0,8,10],[9,0,9,10],[10,0,10,10],[17,0,18,0],[17,1,18,1],[17,6,18,6],[17,9,18,9],[12,0,12,1],[13,0,13,1],[14,0,14,1],[13,2,13,8],[14,2,14,8]]}
[null,null,null,null,null,null,null,null,null,"File Number:",{"$f":"EBNUMBER","v":"EB-2016-0085"}]
[null,null,null,null,null,null,null,null,null,"Exhibit:",4]
[null,null,null,null,null,null,null,null,null,"Tab:"]
[null,null,null,null,null,null,null,null,null,"Schedule:"]
[null,null,null,null,null,null,null,null,null,"Page:"]
[]
[null,null,null,null,null,null,null,null,null,"Date:","2016-11-28"]
[]
["Appendix 2-CD"]
["Depreciation and Amortization Expense"]
["Revised CGAAP or MIFRS (Year 3) - 2014 Revised CGAAP"]
[]
["Select the set of appendices that apply",null,null,null,null,null,null,null,null,"Year Reflected in Schedule Below","Accounting Standard"]
["2012 Set of Appendices (2-CA to 2-CG)",null,"Assumes the applicant made capitalization and depreciation expense accounting policy changes under CGAAP effective January 1, 2012 and has adopted IFRS for financial reporting purposes effective January 1, 2015.  Assumes that the applicant is reflecting these changes in a rebasing application for the first time.",null,null,null,null,null,null,2014,"Revised CGAAP"]
["2013 Set of Appendices (2-CA to 2-CF)",null,"Assumes the applicant made capitalization and depreciation expense accounting policy changes under CGAAP effective January 1, 2013 and has adopted IFRS for financial reporting purposes effective January 1, 2015.  Assumes that the applicant is reflecting these changes in a rebasing application for the first time.",null,null,null,null,null,null,2015,"MIFRS"]
[]
[]
["Account","Description","Additions","Years (new additions only)","Depreciation Rate on New Additions","Current Year Depreciation Expense1","Depreciation Expense per Apppendix 2-BA Fixed Assets, Column J\n (l)","Variance 2","Depreciation Expense on Current Full Year Additions","Less Depreciation Expense on Assets Fully Depreciated During the Year\n(o)","Current Full Year Depreciation 3"]
[null,null,"(d)","(f)","(g) = 1 / (f)","(h) = Prior Full Year Deprecation + ((d)*0.5)/(f) ",null,"(m) = (h) - (l)","(n)=((d))/(f) ",null,"(p) = Prior Full Year Depreciation  + (n) - (o)"]
[1611,"Computer Software (Formally known as Account 1925)",198584.75,3,{"$f":"IF(D20=0,0,1/D20)","v":0.33333333333333331},{"$f":"IF(D20=0,+'App.2-CC_DepExp_Yr2'!K20,+'App.2-CC_DepExp_Yr2'!K20+((C20*0.5)/D20))","v":134074.25092592594},{"$f":"-'App.2-BA_Fixed Asset Cont'!J97","v":133980.79999999999},{"$f":"IF(ISERROR(+F20-G20), 0, +F20-G20)","v":93.450925925950287},{"$f":"IF(D20=0,0,+(C20)/D20)","v":66194.916666666672},28500,{"$f":"IF(ISERROR(+I20+'App.2-CC_DepExp_Yr2'!K20-J20), 0, +I20+'App.2-CC_DepExp_Yr2'!K20-J20)","v":138671.70925925928}]
[1612,"Land Rights (Formally known as Account 1906)",0,50,0.02,{"$f":"IF(D21=0,+'App.2-CC_DepExp_Yr2'!K21,+'App.2-CC_DepExp_Yr2'!K21+((C21*0.5)/D21))","v":14575.084879893549},{"$f":"-'App.2-BA_Fixed Asset Cont'!J98","v":15126},-550.91512010645056,{"$f":"IF(D21=0,0,+(C21)/D21)","v":0},null,{"$f":"IF(ISERROR(+I21+'App.2-CC_DepExp_Yr2'!K21-J21), 0, +I21+'App.2-CC_DepExp_Yr2'!K21-J21)","v":14575.084879893549}]
[1805,"Land",0,0,0,{"$f":"IF(D22=0,+'App.2-CC_DepExp_Yr2'!K22,+'App.2-CC_DepExp_Yr2'!K22+((C22*0.5)/D22))","v":0},{"$f":"-'App.2-BA_Fixed Asset Cont'!J99","v":0},0,0,null,{"$f":"IF(ISERROR(+I22+'App.2-CC_DepExp_Yr2'!K22-J22), 0, +I22+'App.2-CC_DepExp_Yr2'!K22-J22)","v":0}]
[1808,"Buildings",0,0,0,{"$f":"IF(D23=0,+'App.2-CC_DepExp_Yr2'!K23,+'App.2-CC_DepExp_Yr2'!K23+((C23*0.5)/D23))","v":0},{"$f":"-'App.2-BA_Fixed Asset Cont'!J100","v":0},0,0,null,{"$f":"IF(ISERROR(+I23+'App.2-CC_DepExp_Yr2'!K23-J23), 0, +I23+'App.2-CC_DepExp_Yr2'!K23-J23)","v":0}]
[1810,"Leasehold Improvements",0,25,0.04,{"$f":"IF(D24=0,+'App.2-CC_DepExp_Yr2'!K24,+'App.2-CC_DepExp_Yr2'!K24+((C24*0.5)/D24))","v":0},{"$f":"-'App.2-BA_Fixed Asset Cont'!J101","v":0},0,0,null,{"$f":"IF(ISERROR(+I24+'App.2-CC_DepExp_Yr2'!K24-J24), 0, +I24+'App.2-CC_DepExp_Yr2'!K24-J24)","v":0}]
[1815,"Transformer Station Equipment >50 kV",0,0,0,{"$f":"IF(D25=0,+'App.2-CC_DepExp_Yr2'!K25,+'App.2-CC_DepExp_Yr2'!K25+((C25*0.5)/D25))","v":0},{"$f":"-'App.2-BA_Fixed Asset Cont'!J102","v":0},0,0,null,{"$f":"IF(ISERROR(+I25+'App.2-CC_DepExp_Yr2'!K25-J25), 0, +I25+'App.2-CC_DepExp_Yr2'!K25-J25)","v":0}]
[1820,"Distribution Station Equipment <50 kV",2895486.45,40,2.5000000000000001E-2,{"$f":"IF(D26=0,+'App.2-CC_DepExp_Yr2'!K26,+'App.2-CC_DepExp_Yr2'!K26+((C26*0.5)/D26))","v":130738.71906580408},{"$f":"-'App.2-BA_Fixed Asset Cont'!J103","v":133796.76999999999},-3058.0509341959114,72387.161250000005,null,{"$f":"IF(ISERROR(+I26+'App.2-CC_DepExp_Yr2'!K26-J26), 0, +I26+'App.2-CC_DepExp_Yr2'!K26-J26)","v":166932.2996908041}]
[1825,"Storage Battery Equipment",0,0,0,{"$f":"IF(D27=0,+'App.2-CC_DepExp_Yr2'!K27,+'App.2-CC_DepExp_Yr2'!K27+((C27*0.5)/D27))","v":0},{"$f":"-'App.2-BA_Fixed Asset Cont'!J104","v":0},0,0,null,{"$f":"IF(ISERROR(+I27+'App.2-CC_DepExp_Yr2'!K27-J27), 0, +I27+'App.2-CC_DepExp_Yr2'!K27-J27)","v":0}]
[1830,"Poles, Towers & Fixtures",576010.85,45,2.2222222222222223E-2,{"$f":"IF(D28=0,+'App.2-CC_DepExp_Yr2'!K28,+'App.2-CC_DepExp_Yr2'!K28+((C28*0.5)/D28))","v":211478.47829749103},{"$f":"-'App.2-BA_Fixed Asset Cont'!J105","v":214178.88},-2700.4017025089706,12800.241111111111,null,{"$f":"IF(ISERROR(+I28+'App.2-CC_DepExp_Yr2'!K28-J28), 0, +I28+'App.2-CC_DepExp_Yr2'!K28-J28)","v":217878.59885304657}]
[1835,"Overhead Conductors & Devices",724698.04,60,1.6666666666666666E-2,{"$f":"IF(D29=0,+'App.2-CC_DepExp_Yr2'!K29,+'App.2-CC_DepExp_Yr2'!K29+((C29*0.5)/D29))","v":205099.29588888888},{"$f":"-'App.2-BA_Fixed Asset Cont'!J106","v":206930.88},-1831.5841111111222,12078.300666666668,null,{"$f":"IF(ISERROR(+I29+'App.2-CC_DepExp_Yr2'!K29-J29), 0, +I29+'App.2-CC_DepExp_Yr2'!K29-J29)","v":211138.44622222224}]
[1840,"Underground Conduit",320502.08,40,2.5000000000000001E-2,{"$f":"IF(D30=0,+'App.2-CC_DepExp_Yr2'!K30,+'App.2-CC_DepExp_Yr2'!K30+((C30*0.5)/D30))","v":71964.87732407407},{"$f":"-'App.2-BA_Fixed Asset Cont'!J107","v":70930.880000000005},1033.9973240740655,8012.5520000000006,null,{"$f":"IF(ISERROR(+I30+'App.2-CC_DepExp_Yr2'!K30-J30), 0, +I30+'App.2-CC_DepExp_Yr2'!K30-J30)","v":75971.153324074068}]
[1845,"Underground Conductors & Devices",279956.42,40,2.5000000000000001E-2,{"$f":"IF(D31=0,+'App.2-CC_DepExp_Yr2'!K31,+'App.2-CC_DepExp_Yr2'!K31+((C31*0.5)/D31))","v":249298.6227820513},{"$f":"-'App.2-BA_Fixed Asset Cont'!J108","v":247482.95},1815.6727820512897,6998.9105,null,{"$f":"IF(ISERROR(+I31+'App.2-CC_DepExp_Yr2'!K31-J31), 0, +I31+'App.2-CC_DepExp_Yr2'!K31-J31)","v":252798.0780320513}]
[1850,"Line Transformers",556533.29,40,2.5000000000000001E-2,{"$f":"IF(D32=0,+'App.2-CC_DepExp_Yr2'!K32,+'App.2-CC_DepExp_Yr2'!K32+((C32*0.5)/D32))","v":146520.999625},{"$f":"-'App.2-BA_Fixed Asset Cont'!J109","v":146575.75},-54.75037500000326,13913.332250000001,null,{"$f":"IF(ISERROR(+I32+'App.2-CC_DepExp_Yr2'!K32-J32), 0, +I32+'App.2-CC_DepExp_Yr2'!K32-J32)","v":153477.66575000001}]
[1855,"Services (Overhead & Underground)",519763.79,50,0.02,{"$f":"IF(D33=0,+'App.2-CC_DepExp_Yr2'!K33,+'App.2-CC_DepExp_Yr2'!K33+((C33*0.5)/D33))","v":80665.342217647063},{"$f":"-'App.2-BA_Fixed Asset Cont'!J110","v":81169.09},-503.74778235293343,10395.275799999999,null,{"$f":"IF(ISERROR(+I33+'App.2-CC_DepExp_Yr2'!K33-J33), 0, +I33+'App.2-CC_DepExp_Yr2'!K33-J33)","v":85862.980117647065}]
[1860,"Meters (Smart Meters)",131826.75,15,6.6666666666666666E-2,{"$f":"IF(D34=0,+'App.2-CC_DepExp_Yr2'!K34,+'App.2-CC_DepExp_Yr2'!K34+((C34*0.5)/D34))","v":176682.5362244898},{"$f":"-'App.2-BA_Fixed Asset Cont'!J111","v":176031.72},650.81622448979761,8788.4500000000007,6100,{"$f":"IF(ISERROR(+I34+'App.2-CC_DepExp_Yr2'!K34-J34), 0, +I34+'App.2-CC_DepExp_Yr2'!K34-J34)","v":174976.7612244898}]
[1860,"Meters",null,25,0.04,{"$f":"IF(D35=0,+'App.2-CC_DepExp_Yr2'!K35,+'App.2-CC_DepExp_Yr2'!K35+((C35*0.5)/D35))","v":-0.36842105263167468},{"$f":"-'App.2-BA_Fixed Asset Cont'!J112","v":0},-0.36842105263167468,0,null,{"$f":"IF(ISERROR(+I35+'App.2-CC_DepExp_Yr2'!K35-J35), 0, +I35+'App.2-CC_DepExp_Yr2'!K35-J35)","v":-0.36842105263167468}]
[1905,"Land",0,0,0,{"$f":"IF(D36=0,+'App.2-CC_DepExp_Yr2'!K36,+'App.2-CC_DepExp_Yr2'!K36+((C36*0.5)/D36))","v":0},{"$f":"-'App.2-BA_Fixed Asset Cont'!J113","v":0},0,0,null,{"$f":"IF(ISERROR(+I36+'App.2-CC_DepExp_Yr2'!K36-J36), 0, +I36+'App.2-CC_DepExp_Yr2'!K36-J36)","v":0}]
[1908,"Buildings & Fixtures",0,50,0.02,{"$f":"IF(D37=0,+'App.2-CC_DepExp_Yr2'!K37,+'App.2-CC_DepExp_Yr2'!K37+((C37*0.5)/D37))","v":13481.468742857141},{"$f":"-'App.2-BA_Fixed Asset Cont'!J114","v":11367.21},2114.2587428571424,0,null,{"$f":"IF(ISERROR(+I37+'App.2-CC_DepExp_Yr2'!K37-J37), 0, +I37+'App.2-CC_DepExp_Yr2'!K37-J37)","v":13481.468742857141}]
[1910,"Leasehold Improvements",0,0,0,{"$f":"IF(D38=0,+'App.2-CC_DepExp_Yr2'!K38,+'App.2-CC_DepExp_Yr2'!K38+((C38*0.5)/D38))","v":0},{"$f":"-'App.2-BA_Fixed Asset Cont'!J115","v":0},0,0,null,{"$f":"IF(ISERROR(+I38+'App.2-CC_DepExp_Yr2'!K38-J38), 0, +I38+'App.2-CC_DepExp_Yr2'!K38-J38)","v":0}]
[1915,"Office Furniture & Equipment (10 years)",0,10,0.1,{"$f":"IF(D39=0,+'App.2-CC_DepExp_Yr2'!K39,+'App.2-CC_DepExp_Yr2'!K39+((C39*0.5)/D39))","v":15796.199999999999},{"$f":"-'App.2-BA_Fixed Asset Cont'!J116","v":14034},1762.1999999999989,0,null,{"$f":"IF(ISERROR(+I39+'App.2-CC_DepExp_Yr2'!K39-J39), 0, +I39+'App.2-CC_DepExp_Yr2'!K39-J39)","v":15796.199999999999}]
[1915,"Office Furniture & Equipment (5 years)",0,0,0,{"$f":"IF(D40=0,+'App.2-CC_DepExp_Yr2'!K40,+'App.2-CC_DepExp_Yr2'!K40+((C40*0.5)/D40))","v":0},{"$f":"-'App.2-BA_Fixed Asset Cont'!J117","v":0},0,0,null,{"$f":"IF(ISERROR(+I40+'App.2-CC_DepExp_Yr2'!K40-J40), 0, +I40+'App.2-CC_DepExp_Yr2'!K40-J40)","v":0}]
[1920,"Computer Equipment - Hardware",80063.460000000006,5,0.2,{"$f":"IF(D41=0,+'App.2-CC_DepExp_Yr2'!K41,+'App.2-CC_DepExp_Yr2'!K41+((C41*0.5)/D41))","v":71016.782842105269},{"$f":"-'App.2-BA_Fixed Asset Cont'!J118","v":70671.009999999995},345.77284210527432,16012.692000000001,11300,{"$f":"IF(ISERROR(+I41+'App.2-CC_DepExp_Yr2'!K41-J41), 0, +I41+'App.2-CC_DepExp_Yr2'!K41-J41)","v":67723.12884210526}]
[1920,"Computer Equip.-Hardware(Post Mar. 22/04)",null,0,0,{"$f":"IF(D42=0,+'App.2-CC_DepExp_Yr2'!K42,+'App.2-CC_DepExp_Yr2'!K42+((C42*0.5)/D42))","v":0},{"$f":"-'App.2-BA_Fixed Asset Cont'!J119","v":0},0,0,null,{"$f":"IF(ISERROR(+I42+'App.2-CC_DepExp_Yr2'!K42-J42), 0, +I42+'App.2-CC_DepExp_Yr2'!K42-J42)","v":0}]
[1920,"Computer Equip.-Hardware(Post Mar. 19/07)",null,0,0,{"$f":"IF(D43=0,+'App.2-CC_DepExp_Yr2'!K43,+'App.2-CC_DepExp_Yr2'!K43+((C43*0.5)/D43))","v":0},{"$f":"-'App.2-BA_Fixed Asset Cont'!J120","v":0},0,0,null,{"$f":"IF(ISERROR(+I43+'App.2-CC_DepExp_Yr2'!K43-J43), 0, +I43+'App.2-CC_DepExp_Yr2'!K43-J43)","v":0}]
[1930,"Transportation Equipment",3267.67,5,0.2,{"$f":"IF(D44=0,+'App.2-CC_DepExp_Yr2'!K44,+'App.2-CC_DepExp_Yr2'!K44+((C44*0.5)/D44))","v":139958.95386274511},{"$f":"-'App.2-BA_Fixed Asset Cont'!J121","v":139931.45000000001},27.503862745099468,653.53399999999999,23400,{"$f":"IF(ISERROR(+I44+'App.2-CC_DepExp_Yr2'!K44-J44), 0, +I44+'App.2-CC_DepExp_Yr2'!K44-J44)","v":116885.72086274513}]
[1935,"Stores Equipment",4787.59,10,0.1,{"$f":"IF(D45=0,+'App.2-CC_DepExp_Yr2'!K45,+'App.2-CC_DepExp_Yr2'!K45+((C45*0.5)/D45))","v":2439.1082732819523},{"$f":"-'App.2-BA_Fixed Asset Cont'!J122","v":2588.65},-149.54172671804781,478.75900000000001,null,{"$f":"IF(ISERROR(+I45+'App.2-CC_DepExp_Yr2'!K45-J45), 0, +I45+'App.2-CC_DepExp_Yr2'!K45-J45)","v":2678.4877732819523}]
[1940,"Tools, Shop & Garage Equipment",17552.580000000002,10,0.1,{"$f":"IF(D46=0,+'App.2-CC_DepExp_Yr2'!K46,+'App.2-CC_DepExp_Yr2'!K46+((C46*0.5)/D46))","v":38255.481823529415},{"$f":"-'App.2-BA_Fixed Asset Cont'!J123","v":38485.83},-230.34817647058662,1755.2580000000003,null,{"$f":"IF(ISERROR(+I46+'App.2-CC_DepExp_Yr2'!K46-J46), 0, +I46+'App.2-CC_DepExp_Yr2'!K46-J46)","v":39133.110823529416}]
[1945,"Measurement & Testing Equipment",4066.7,10,0.1,{"$f":"IF(D47=0,+'App.2-CC_DepExp_Yr2'!K47,+'App.2-CC_DepExp_Yr2'!K47+((C47*0.5)/D47))","v":3726.3169318448881},{"$f":"-'App.2-BA_Fixed Asset Cont'!J124","v":3979.35},-253.03306815511178,406.66999999999996,null,{"$f":"IF(ISERROR(+I47+'App.2-CC_DepExp_Yr2'!K47-J47), 0, +I47+'App.2-CC_DepExp_Yr2'!K47-J47)","v":3929.6519318448882}]
[1950,"Power Operated Equipment",0,0,0,{"$f":"IF(D48=0,+'App.2-CC_DepExp_Yr2'!K48,+'App.2-CC_DepExp_Yr2'!K48+((C48*0.5)/D48))","v":0},{"$f":"-'App.2-BA_Fixed Asset Cont'!J125","v":0},0,0,null,{"$f":"IF(ISERROR(+I48+'App.2-CC_DepExp_Yr2'!K48-J48), 0, +I48+'App.2-CC_DepExp_Yr2'!K48-J48)","v":0}]
[1955,"Communications Equipment",0,0,0,{"$f":"IF(D49=0,+'App.2-CC_DepExp_Yr2'!K49,+'App.2-CC_DepExp_Yr2'!K49+((C49*0.5)/D49))","v":0},{"$f":"-'App.2-BA_Fixed Asset Cont'!J126","v":0},0,0,null,{"$f":"IF(ISERROR(+I49+'App.2-CC_DepExp_Yr2'!K49-J49), 0, +I49+'App.2-CC_DepExp_Yr2'!K49-J49)","v":0}]
[1955,"Communication Equipment (Smart Meters)",0,0,0,{"$f":"IF(D50=0,+'App.2-CC_DepExp_Yr2'!K50,+'App.2-CC_DepExp_Yr2'!K50+((C50*0.5)/D50))","v":0},{"$f":"-'App.2-BA_Fixed Asset Cont'!J127","v":0},0,0,null,{"$f":"IF(ISERROR(+I50+'App.2-CC_DepExp_Yr2'!K50-J50), 0, +I50+'App.2-CC_DepExp_Yr2'!K50-J50)","v":0}]
[1960,"Miscellaneous Equipment ",0,0,0,{"$f":"IF(D51=0,+'App.2-CC_DepExp_Yr2'!K51,+'App.2-CC_DepExp_Yr2'!K51+((C51*0.5)/D51))","v":0},{"$f":"-'App.2-BA_Fixed Asset Cont'!J128","v":0},0,0,null,{"$f":"IF(ISERROR(+I51+'App.2-CC_DepExp_Yr2'!K51-J51), 0, +I51+'App.2-CC_DepExp_Yr2'!K51-J51)","v":0}]
[1970,"Load Management Controls Customer Premises",0,null,0,{"$f":"IF(D52=0,+'App.2-CC_DepExp_Yr2'!K52,+'App.2-CC_DepExp_Yr2'!K52+((C52*0.5)/D52))","v":0},{"$f":"-'App.2-BA_Fixed Asset Cont'!J129","v":0},0,0,null,{"$f":"IF(ISERROR(+I52+'App.2-CC_DepExp_Yr2'!K52-J52), 0, +I52+'App.2-CC_DepExp_Yr2'!K52-J52)","v":0}]
[1975,"Load Management Controls Utility Premises",0,0,0,{"$f":"IF(D53=0,+'App.2-CC_DepExp_Yr2'!K53,+'App.2-CC_DepExp_Yr2'!K53+((C53*0.5)/D53))","v":0},{"$f":"-'App.2-BA_Fixed Asset Cont'!J130","v":0},0,0,null,{"$f":"IF(ISERROR(+I53+'App.2-CC_DepExp_Yr2'!K53-J53), 0, +I53+'App.2-CC_DepExp_Yr2'!K53-J53)","v":0}]
[1980,"System Supervisor Equipment",125462.03,15,6.6666666666666666E-2,{"$f":"IF(D54=0,+'App.2-CC_DepExp_Yr2'!K54,+'App.2-CC_DepExp_Yr2'!K54+((C54*0.5)/D54))","v":118956.51623809524},{"$f":"-'App.2-BA_Fixed Asset Cont'!J131","v":118906.41},50.106238095235312,8364.1353333333336,8600,{"$f":"IF(ISERROR(+I54+'App.2-CC_DepExp_Yr2'!K54-J54), 0, +I54+'App.2-CC_DepExp_Yr2'!K54-J54)","v":114538.58390476191}]
[1985,"Miscellaneous Fixed Assets",0,0,0,{"$f":"IF(D55=0,+'App.2-CC_DepExp_Yr2'!K55,+'App.2-CC_DepExp_Yr2'!K55+((C55*0.5)/D55))","v":0},{"$f":"-'App.2-BA_Fixed Asset Cont'!J132","v":0},0,0,null,{"$f":"IF(ISERROR(+I55+'App.2-CC_DepExp_Yr2'!K55-J55), 0, +I55+'App.2-CC_DepExp_Yr2'!K55-J55)","v":0}]
[1990,"Other Tangible Property",0,null,0,{"$f":"IF(D56=0,+'App.2-CC_DepExp_Yr2'!K56,+'App.2-CC_DepExp_Yr2'!K56+((C56*0.5)/D56))","v":0},{"$f":"-'App.2-BA_Fixed Asset Cont'!J133","v":0},0,0,null,{"$f":"IF(ISERROR(+I56+'App.2-CC_DepExp_Yr2'!K56-J56), 0, +I56+'App.2-CC_DepExp_Yr2'!K56-J56)","v":0}]
[1995,"Contributions & Grants",-1416471.4,35,{"$f":"IF(D57=0,0,1/D57)","v":2.8571428571428571E-2},{"$f":"IF(D57=0,+'App.2-CC_DepExp_Yr2'!K57,+'App.2-CC_DepExp_Yr2'!K57+((C57*0.5)/D57))","v":-268055.3842580645},{"$f":"-'App.2-BA_Fixed Asset Cont'!J134","v":-268851.62},796.23574193549575,-40470.611428571428,-7300,{"$f":"IF(ISERROR(+I57+'App.2-CC_DepExp_Yr2'!K57-J57), 0, +I57+'App.2-CC_DepExp_Yr2'!K57-J57)","v":-280990.68997235026}]
[null,"Total",{"$f":"SUM(C20:C57)","v":5022091.0500000007},null,null,{"$f":"SUM(F20:F57)","v":1556673.2832666077},1557316.0099999998,-642.7267333924201,198769.57714920642,70600,1585458.0718412106]
[null,"Depreciation exp. adj. from gain or loss on the retirement of assets (pool of like assets) (under MIFRS) "]
[null,"Total Depreciation Expense",null,null,null,{"$f":"+F59+F58","v":1556673.2832666077}]
[]
["Notes:"]
[1,"Board policy of the \"half-year\" rule - the applicant must ensure that additions in the year attract a half-year depreciation expense in the first year.  Deviations from this standard practice must be supported in the application."]
[2,"The applicant must provide an explanation of material variances in evidence."]
[3,"This column refers to the calculated full year depreciation but excludes the depreciation expense on assets fully depreciated during the year.  This column is used for the purpose of calculating depreciation expense in the following year on the next worksheet."]
[]
["General:","Applicants must provide a breakdown of depreciation and amortization expense in the above format for all relevant accounts.  Asset Retirement Obligations (AROs), depreciation and accretion expense should be disclosed separately consistent with the Notes of historical Audited Financial Statements."]

{"sheet":"App.2-CE_DepExp_Yr4","index":15,"n_rows":66,"n_cols":11,"rows_kept":66,"cut":false,"hidden":false,"merged":[[17,9,18,9],[67,1,68,7],[61,1,61,7],[62,1,62,8],[64,1,64,8],[65,1,66,7],[63,1,63,10],[8,0,8,8],[9,0,9,8],[17,1,18,1],[17,6,18,6],[59,1,59,4],[10,0,10,7],[12,0,12,1],[13,0,13,1],[13,2,13,8],[14,0,14,1],[14,2,14,8]]}
[null,null,null,null,null,null,null,null,null,"File Number:",{"$f":"EBNUMBER","v":"EB-2016-0085"}]
[null,null,null,null,null,null,null,null,null,"Exhibit:",4]
[null,null,null,null,null,null,null,null,null,"Tab:"]
[null,null,null,null,null,null,null,null,null,"Schedule:"]
[null,null,null,null,null,null,null,null,null,"Page:"]
[]
[null,null,null,null,null,null,null,null,null,"Date:","2016-11-28"]
[]
["Appendix 2-CE"]
["Depreciation and Amortization Expense"]
["MIFRS (Year 4) - 2015 MIFRS"]
[]
["Select the set of appendices that apply",null,null,null,null,null,null,null,null,"Year Reflected in Schedule Below","Accounting Standard"]
["2012 Set of Appendices (2-CA to 2-CG)",null,"Assumes the applicant made capitalization and depreciation expense accounting policy changes under CGAAP effective January 1, 2012 and has adopted IFRS for financial reporting purposes effective January 1, 2015.  Assumes that the applicant is reflecting these changes in a rebasing application for the first time.",null,null,null,null,null,null,2015,"MIFRS"]
["2013 Set of Appendices (2-CA to 2-CF)",null,"Assumes the applicant made capitalization and depreciation expense accounting policy changes under CGAAP effective January 1, 2013 and has adopted IFRS for financial reporting purposes effective January 1, 2015.  Assumes that the applicant is reflecting these changes in a rebasing application for the first time.",null,null,null,null,null,null,2016,"MIFRS"]
[]
[]
["Account","Description","Additions","Years (new additions only)","Depreciation Rate on New Additions","Current Year Depreciation Expense1","Depreciation Expense per Appendix 2-BA Fixed Assets, Column J\n (l)","Variance 2","Depreciation Expense on Current Full Year Additions","Less Depreciation Expense on Assets Fully Depreciated During the Year\n(o)","Current Full Year Depreciation 3"]
[null,null,"(d)","(f)","(g) = 1 / (f)","(h)=Prior Full Year Depreciation + ((d)*0.5)/(f) ",null,"(m) = (h) - (l)","(n)=((d))/(f) ",null,"(p) = Prior Full Year Depreciation  + (n) - (o)"]
[1611,"Computer Software (Formally known as Account 1925)",{"$f":"'App.2-BA_Fixed Asset Cont'!E219","v":185053},3,{"$f":"IF(D20=0,0,1/D20)","v":0.33333333333333331},{"$f":"IF(D20=0,'App.2-CD_DepExp_Yr3'!K20,+'App.2-CD_DepExp_Yr3'!K20+((C20*0.5)/D20))","v":169513.87592592594},{"$f":"-'App.2-BA_Fixed Asset Cont'!J219","v":169499},{"$f":"IF(ISERROR(+F20-G20), 0, +F20-G20)","v":14.875925925938645},{"$f":"IF(D20=0,0,+(C20)/D20)","v":61684.333333333336},60100,{"$f":"IF(ISERROR(+I20+'App.2-CD_DepExp_Yr3'!K20-J20), 0, +I20+'App.2-CD_DepExp_Yr3'!K20-J20)","v":140256.04259259262}]
[1612,"Land Rights (Formally known as Account 1906)",{"$f":"'App.2-BA_Fixed Asset Cont'!E220","v":0},50,0.02,{"$f":"IF(D21=0,'App.2-CD_DepExp_Yr3'!K21,+'App.2-CD_DepExp_Yr3'!K21+((C21*0.5)/D21))","v":14575.084879893549},{"$f":"-'App.2-BA_Fixed Asset Cont'!J220","v":12699},1876.0848798935494,{"$f":"IF(D21=0,0,+(C21)/D21)","v":0},null,{"$f":"IF(ISERROR(+I21+'App.2-CD_DepExp_Yr3'!K21-J21), 0, +I21+'App.2-CD_DepExp_Yr3'!K21-J21)","v":14575.084879893549}]
[1805,"Land",{"$f":"'App.2-BA_Fixed Asset Cont'!E221","v":77556},0,0,{"$f":"IF(D22=0,'App.2-CD_DepExp_Yr3'!K22,+'App.2-CD_DepExp_Yr3'!K22+((C22*0.5)/D22))","v":0},{"$f":"-'App.2-BA_Fixed Asset Cont'!J221","v":0},0,0,null,{"$f":"IF(ISERROR(+I22+'App.2-CD_DepExp_Yr3'!K22-J22), 0, +I22+'App.2-CD_DepExp_Yr3'!K22-J22)","v":0}]
[1808,"Buildings",{"$f":"'App.2-BA_Fixed Asset Cont'!E222","v":0},0,0,{"$f":"IF(D23=0,'App.2-CD_DepExp_Yr3'!K23,+'App.2-CD_DepExp_Yr3'!K23+((C23*0.5)/D23))","v":0},{"$f":"-'App.2-BA_Fixed Asset Cont'!J222","v":0},0,0,null,{"$f":"IF(ISERROR(+I23+'App.2-CD_DepExp_Yr3'!K23-J23), 0, +I23+'App.2-CD_DepExp_Yr3'!K23-J23)","v":0}]
[1810,"Leasehold Improvements",{"$f":"'App.2-BA_Fixed Asset Cont'!E223","v":0},25,0.04,{"$f":"IF(D24=0,'App.2-CD_DepExp_Yr3'!K24,+'App.2-CD_DepExp_Yr3'!K24+((C24*0.5)/D24))","v":0},{"$f":"-'App.2-BA_Fixed Asset Cont'!J223","v":0},0,0,null,{"$f":"IF(ISERROR(+I24+'App.2-CD_DepExp_Yr3'!K24-J24), 0, +I24+'App.2-CD_DepExp_Yr3'!K24-J24)","v":0}]
[1815,"Transformer Station Equipment >50 kV",{"$f":"'App.2-BA_Fixed Asset Cont'!E224","v":0},0,0,{"$f":"IF(D25=0,'App.2-CD_DepExp_Yr3'!K25,+'App.2-CD_DepExp_Yr3'!K25+((C25*0.5)/D25))","v":0},{"$f":"-'App.2-BA_Fixed Asset Cont'!J224","v":0},0,0,null,{"$f":"IF(ISERROR(+I25+'App.2-CD_DepExp_Yr3'!K25-J25), 0, +I25+'App.2-CD_DepExp_Yr3'!K25-J25)","v":0}]
[1820,"Distribution Station Equipment <50 kV",{"$f":"'App.2-BA_Fixed Asset Cont'!E225","v":779993},25,0.04,{"$f":"IF(D26=0,'App.2-CD_DepExp_Yr3'!K26,+'App.2-CD_DepExp_Yr3'!K26+((C26*0.5)/D26))","v":182532.15969080408},{"$f":"-'App.2-BA_Fixed Asset Cont'!J225","v":191509},-8976.840309195919,31199.72,null,{"$f":"IF(ISERROR(+I26+'App.2-CD_DepExp_Yr3'!K26-J26), 0, +I26+'App.2-CD_DepExp_Yr3'!K26-J26)","v":198132.0196908041}]
[1825,"Storage Battery Equipment",{"$f":"'App.2-BA_Fixed Asset Cont'!E226","v":0},0,0,{"$f":"IF(D27=0,'App.2-CD_DepExp_Yr3'!K27,+'App.2-CD_DepExp_Yr3'!K27+((C27*0.5)/D27))","v":0},{"$f":"-'App.2-BA_Fixed Asset Cont'!J226","v":0},0,0,null,{"$f":"IF(ISERROR(+I27+'App.2-CD_DepExp_Yr3'!K27-J27), 0, +I27+'App.2-CD_DepExp_Yr3'!K27-J27)","v":0}]
[1830,"Poles, Towers & Fixtures",{"$f":"'App.2-BA_Fixed Asset Cont'!E227","v":1533272},45,2.2222222222222223E-2,{"$f":"IF(D28=0,'App.2-CD_DepExp_Yr3'!K28,+'App.2-CD_DepExp_Yr3'!K28+((C28*0.5)/D28))","v":234914.95440860212},{"$f":"-'App.2-BA_Fixed Asset Cont'!J227","v":237728},-2813.0455913978803,34072.711111111108,null,{"$f":"IF(ISERROR(+I28+'App.2-CD_DepExp_Yr3'!K28-J28), 0, +I28+'App.2-CD_DepExp_Yr3'!K28-J28)","v":251951.30996415767}]
[1835,"Overhead Conductors & Devices",{"$f":"'App.2-BA_Fixed Asset Cont'!E228","v":1390592},60,1.6666666666666666E-2,{"$f":"IF(D29=0,'App.2-CD_DepExp_Yr3'!K29,+'App.2-CD_DepExp_Yr3'!K29+((C29*0.5)/D29))","v":222726.7128888889},{"$f":"-'App.2-BA_Fixed Asset Cont'!J228","v":225949},-3222.2871111111017,23176.533333333333,null,{"$f":"IF(ISERROR(+I29+'App.2-CD_DepExp_Yr3'!K29-J29), 0, +I29+'App.2-CD_DepExp_Yr3'!K29-J29)","v":234314.97955555556}]
[1840,"Underground Conduit",{"$f":"'App.2-BA_Fixed Asset Cont'!E229","v":546399},40,2.5000000000000001E-2,{"$f":"IF(D30=0,'App.2-CD_DepExp_Yr3'!K30,+'App.2-CD_DepExp_Yr3'!K30+((C30*0.5)/D30))","v":82801.140824074071},{"$f":"-'App.2-BA_Fixed Asset Cont'!J229","v":81467},1334.1408240740711,13659.975,null,{"$f":"IF(ISERROR(+I30+'App.2-CD_DepExp_Yr3'!K30-J30), 0, +I30+'App.2-CD_DepExp_Yr3'!K30-J30)","v":89631.128324074074}]
[1845,"Underground Conductors & Devices",{"$f":"'App.2-BA_Fixed Asset Cont'!E230","v":283406},40,2.5000000000000001E-2,{"$f":"IF(D31=0,'App.2-CD_DepExp_Yr3'!K31,+'App.2-CD_DepExp_Yr3'!K31+((C31*0.5)/D31))","v":256340.65303205131},{"$f":"-'App.2-BA_Fixed Asset Cont'!J230","v":254303},2037.653032051312,7085.15,null,{"$f":"IF(ISERROR(+I31+'App.2-CD_DepExp_Yr3'!K31-J31), 0, +I31+'App.2-CD_DepExp_Yr3'!K31-J31)","v":259883.22803205129}]
[1850,"Line Transformers",{"$f":"'App.2-BA_Fixed Asset Cont'!E231","v":999677},40,2.5000000000000001E-2,{"$f":"IF(D32=0,'App.2-CD_DepExp_Yr3'!K32,+'App.2-CD_DepExp_Yr3'!K32+((C32*0.5)/D32))","v":165973.62825000001},{"$f":"-'App.2-BA_Fixed Asset Cont'!J231","v":164241},1732.6282500000088,24991.924999999999,null,{"$f":"IF(ISERROR(+I32+'App.2-CD_DepExp_Yr3'!K32-J32), 0, +I32+'App.2-CD_DepExp_Yr3'!K32-J32)","v":178469.59075}]
[1855,"Services (Overhead & Underground)",{"$f":"'App.2-BA_Fixed Asset Cont'!E232","v":479966},50,0.02,{"$f":"IF(D33=0,'App.2-CD_DepExp_Yr3'!K33,+'App.2-CD_DepExp_Yr3'!K33+((C33*0.5)/D33))","v":90662.640117647068},{"$f":"-'App.2-BA_Fixed Asset Cont'!J232","v":93028},-2365.3598823529319,9599.32,null,{"$f":"IF(ISERROR(+I33+'App.2-CD_DepExp_Yr3'!K33-J33), 0, +I33+'App.2-CD_DepExp_Yr3'!K33-J33)","v":95462.300117647072}]
[1860,"Meters",{"$f":"'App.2-BA_Fixed Asset Cont'!E233","v":113146},15,6.6666666666666666E-2,{"$f":"IF(D34=0,'App.2-CD_DepExp_Yr3'!K34,+'App.2-CD_DepExp_Yr3'!K34+((C34*0.5)/D34))","v":178748.29455782313},{"$f":"-'App.2-BA_Fixed Asset Cont'!J233","v":178804},-55.705442176869838,7543.0666666666666,null,{"$f":"IF(ISERROR(+I34+'App.2-CD_DepExp_Yr3'!K34-J34), 0, +I34+'App.2-CD_DepExp_Yr3'!K34-J34)","v":182519.82789115648}]
[1860,"Meters (Smart Meters)",{"$f":"'App.2-BA_Fixed Asset Cont'!E234","v":0},25,0.04,{"$f":"IF(D35=0,'App.2-CD_DepExp_Yr3'!K35,+'App.2-CD_DepExp_Yr3'!K35+((C35*0.5)/D35))","v":-0.36842105263167468},{"$f":"-'App.2-BA_Fixed Asset Cont'!J234","v":0},-0.36842105263167468,0,null,{"$f":"IF(ISERROR(+I35+'App.2-CD_DepExp_Yr3'!K35-J35), 0, +I35+'App.2-CD_DepExp_Yr3'!K35-J35)","v":-0.36842105263167468}]
[1905,"Land",{"$f":"'App.2-BA_Fixed Asset Cont'!E235","v":0},0,0,{"$f":"IF(D36=0,'App.2-CD_DepExp_Yr3'!K36,+'App.2-CD_DepExp_Yr3'!K36+((C36*0.5)/D36))","v":0},{"$f":"-'App.2-BA_Fixed Asset Cont'!J235","v":0},0,0,null,{"$f":"IF(ISERROR(+I36+'App.2-CD_DepExp_Yr3'!K36-J36), 0, +I36+'App.2-CD_DepExp_Yr3'!K36-J36)","v":0}]
[1908,"Buildings & Fixtures",{"$f":"'App.2-BA_Fixed Asset Cont'!E236","v":12430510},47,2.1276595744680851E-2,{"$f":"IF(D37=0,'App.2-CD_DepExp_Yr3'!K37,+'App.2-CD_DepExp_Yr3'!K37+((C37*0.5)/D37))","v":145720.93682796351},{"$f":"-'App.2-BA_Fixed Asset Cont'!J236","v":145132},588.93682796350913,264478.93617021275,10100,{"$f":"IF(ISERROR(+I37+'App.2-CD_DepExp_Yr3'!K37-J37), 0, +I37+'App.2-CD_DepExp_Yr3'!K37-J37)","v":267860.40491306991}]
[1910,"Leasehold Improvements",{"$f":"'App.2-BA_Fixed Asset Cont'!E237","v":0},0,0,{"$f":"IF(D38=0,'App.2-CD_DepExp_Yr3'!K38,+'App.2-CD_DepExp_Yr3'!K38+((C38*0.5)/D38))","v":0},{"$f":"-'App.2-BA_Fixed Asset Cont'!J237","v":0},0,0,null,{"$f":"IF(ISERROR(+I38+'App.2-CD_DepExp_Yr3'!K38-J38), 0, +I38+'App.2-CD_DepExp_Yr3'!K38-J38)","v":0}]
[1915,"Office Furniture & Equipment (10 years)",{"$f":"'App.2-BA_Fixed Asset Cont'!E238","v":154231},10,0.1,{"$f":"IF(D39=0,'App.2-CD_DepExp_Yr3'!K39,+'App.2-CD_DepExp_Yr3'!K39+((C39*0.5)/D39))","v":23507.75},{"$f":"-'App.2-BA_Fixed Asset Cont'!J238","v":19569},3938.75,15423.1,null,{"$f":"IF(ISERROR(+I39+'App.2-CD_DepExp_Yr3'!K39-J39), 0, +I39+'App.2-CD_DepExp_Yr3'!K39-J39)","v":31219.3}]
[1915,"Office Furniture & Equipment (5 years)",{"$f":"'App.2-BA_Fixed Asset Cont'!E239","v":0},0,0,{"$f":"IF(D40=0,'App.2-CD_DepExp_Yr3'!K40,+'App.2-CD_DepExp_Yr3'!K40+((C40*0.5)/D40))","v":0},{"$f":"-'App.2-BA_Fixed Asset Cont'!J239","v":0},0,0,null,{"$f":"IF(ISERROR(+I40+'App.2-CD_DepExp_Yr3'!K40-J40), 0, +I40+'App.2-CD_DepExp_Yr3'!K40-J40)","v":0}]
[1920,"Computer Equipment - Hardware",{"$f":"'App.2-BA_Fixed Asset Cont'!E240","v":149497},5,0.2,{"$f":"IF(D41=0,'App.2-CD_DepExp_Yr3'!K41,+'App.2-CD_DepExp_Yr3'!K41+((C41*0.5)/D41))","v":82672.828842105257},{"$f":"-'App.2-BA_Fixed Asset Cont'!J240","v":82659},13.828842105256626,29899.4,null,{"$f":"IF(ISERROR(+I41+'App.2-CD_DepExp_Yr3'!K41-J41), 0, +I41+'App.2-CD_DepExp_Yr3'!K41-J41)","v":97622.528842105268}]
[1920,"Computer Equip.-Hardware(Post Mar. 22/04)",{"$f":"'App.2-BA_Fixed Asset Cont'!E241","v":0},0,0,{"$f":"IF(D42=0,'App.2-CD_DepExp_Yr3'!K42,+'App.2-CD_DepExp_Yr3'!K42+((C42*0.5)/D42))","v":0},{"$f":"-'App.2-BA_Fixed Asset Cont'!J241","v":0},0,0,null,{"$f":"IF(ISERROR(+I42+'App.2-CD_DepExp_Yr3'!K42-J42), 0, +I42+'App.2-CD_DepExp_Yr3'!K42-J42)","v":0}]
[1920,"Computer Equip.-Hardware(Post Mar. 19/07)",{"$f":"'App.2-BA_Fixed Asset Cont'!E242","v":0},0,0,{"$f":"IF(D43=0,'App.2-CD_DepExp_Yr3'!K43,+'App.2-CD_DepExp_Yr3'!K43+((C43*0.5)/D43))","v":0},{"$f":"-'App.2-BA_Fixed Asset Cont'!J242","v":0},0,0,null,{"$f":"IF(ISERROR(+I43+'App.2-CD_DepExp_Yr3'!K43-J43), 0, +I43+'App.2-CD_DepExp_Yr3'!K43-J43)","v":0}]
[1930,"Transportation Equipment",{"$f":"'App.2-BA_Fixed Asset Cont'!E243","v":33347},5,0.2,{"$f":"IF(D44=0,'App.2-CD_DepExp_Yr3'!K44,+'App.2-CD_DepExp_Yr3'!K44+((C44*0.5)/D44))","v":120220.42086274513},{"$f":"-'App.2-BA_Fixed Asset Cont'!J243","v":120051},169.42086274512985,6669.4,null,{"$f":"IF(ISERROR(+I44+'App.2-CD_DepExp_Yr3'!K44-J44), 0, +I44+'App.2-CD_DepExp_Yr3'!K44-J44)","v":123555.12086274513}]
[1935,"Stores Equipment",{"$f":"'App.2-BA_Fixed Asset Cont'!E244","v":117204},10,0.1,{"$f":"IF(D45=0,'App.2-CD_DepExp_Yr3'!K45,+'App.2-CD_DepExp_Yr3'!K45+((C45*0.5)/D45))","v":8538.6877732819521},{"$f":"-'App.2-BA_Fixed Asset Cont'!J244","v":8603},-64.312226718047896,11720.4,null,{"$f":"IF(ISERROR(+I45+'App.2-CD_DepExp_Yr3'!K45-J45), 0, +I45+'App.2-CD_DepExp_Yr3'!K45-J45)","v":14398.887773281953}]
[1940,"Tools, Shop & Garage Equipment",{"$f":"'App.2-BA_Fixed Asset Cont'!E245","v":41581},10,0.1,{"$f":"IF(D46=0,'App.2-CD_DepExp_Yr3'!K46,+'App.2-CD_DepExp_Yr3'!K46+((C46*0.5)/D46))","v":41212.160823529419},{"$f":"-'App.2-BA_Fixed Asset Cont'!J245","v":41285},-72.839176470581151,4158.1000000000004,null,{"$f":"IF(ISERROR(+I46+'App.2-CD_DepExp_Yr3'!K46-J46), 0, +I46+'App.2-CD_DepExp_Yr3'!K46-J46)","v":43291.210823529414}]
[1945,"Measurement & Testing Equipment",{"$f":"'App.2-BA_Fixed Asset Cont'!E246","v":0},10,0.1,{"$f":"IF(D47=0,'App.2-CD_DepExp_Yr3'!K47,+'App.2-CD_DepExp_Yr3'!K47+((C47*0.5)/D47))","v":3929.6519318448882},{"$f":"-'App.2-BA_Fixed Asset Cont'!J246","v":4161},-231.34806815511183,0,null,{"$f":"IF(ISERROR(+I47+'App.2-CD_DepExp_Yr3'!K47-J47), 0, +I47+'App.2-CD_DepExp_Yr3'!K47-J47)","v":3929.6519318448882}]
[1950,"Power Operated Equipment",{"$f":"'App.2-BA_Fixed Asset Cont'!E247","v":0},0,0,{"$f":"IF(D48=0,'App.2-CD_DepExp_Yr3'!K48,+'App.2-CD_DepExp_Yr3'!K48+((C48*0.5)/D48))","v":0},{"$f":"-'App.2-BA_Fixed Asset Cont'!J247","v":0},0,0,null,{"$f":"IF(ISERROR(+I48+'App.2-CD_DepExp_Yr3'!K48-J48), 0, +I48+'App.2-CD_DepExp_Yr3'!K48-J48)","v":0}]
[1955,"Communications Equipment",{"$f":"'App.2-BA_Fixed Asset Cont'!E248","v":0},0,0,{"$f":"IF(D49=0,'App.2-CD_DepExp_Yr3'!K49,+'App.2-CD_DepExp_Yr3'!K49+((C49*0.5)/D49))","v":0},{"$f":"-'App.2-BA_Fixed Asset Cont'!J248","v":0},0,0,null,{"$f":"IF(ISERROR(+I49+'App.2-CD_DepExp_Yr3'!K49-J49), 0, +I49+'App.2-CD_DepExp_Yr3'!K49-J49)","v":0}]
[1955,"Communication Equipment (Smart Meters)",{"$f":"'App.2-BA_Fixed Asset Cont'!E249","v":0},0,0,{"$f":"IF(D50=0,'App.2-CD_DepExp_Yr3'!K50,+'App.2-CD_DepExp_Yr3'!K50+((C50*0.5)/D50))","v":0},{"$f":"-'App.2-BA_Fixed Asset Cont'!J249","v":0},0,0,null,{"$f":"IF(ISERROR(+I50+'App.2-CD_DepExp_Yr3'!K50-J50), 0, +I50+'App.2-CD_DepExp_Yr3'!K50-J50)","v":0}]
[1960,"Miscellaneous Equipment ",{"$f":"'App.2-BA_Fixed Asset Cont'!E250","v":0},0,0,{"$f":"IF(D51=0,'App.2-CD_DepExp_Yr3'!K51,+'App.2-CD_DepExp_Yr3'!K51+((C51*0.5)/D51))","v":0},{"$f":"-'App.2-BA_Fixed Asset Cont'!J250","v":0},0,0,null,{"$f":"IF(ISERROR(+I51+'App.2-CD_DepExp_Yr3'!K51-J51), 0, +I51+'App.2-CD_DepExp_Yr3'!K51-J51)","v":0}]
[1970,"Load Management Controls Customer Premises",{"$f":"'App.2-BA_Fixed Asset Cont'!E251","v":0},null,0,{"$f":"IF(D52=0,'App.2-CD_DepExp_Yr3'!K52,+'App.2-CD_DepExp_Yr3'!K52+((C52*0.5)/D52))","v":0},{"$f":"-'App.2-BA_Fixed Asset Cont'!J251","v":0},0,0,null,{"$f":"IF(ISERROR(+I52+'App.2-CD_DepExp_Yr3'!K52-J52), 0, +I52+'App.2-CD_DepExp_Yr3'!K52-J52)","v":0}]
[1975,"Load Management Controls Utility Premises",{"$f":"'App.2-BA_Fixed Asset Cont'!E252","v":0},0,0,{"$f":"IF(D53=0,'App.2-CD_DepExp_Yr3'!K53,+'App.2-CD_DepExp_Yr3'!K53+((C53*0.5)/D53))","v":0},{"$f":"-'App.2-BA_Fixed Asset Cont'!J252","v":0},0,0,null,{"$f":"IF(ISERROR(+I53+'App.2-CD_DepExp_Yr3'!K53-J53), 0, +I53+'App.2-CD_DepExp_Yr3'!K53-J53)","v":0}]
[1980,"System Supervisor Equipment",{"$f":"'App.2-BA_Fixed Asset Cont'!E253","v":569196},15,6.6666666666666666E-2,{"$f":"IF(D54=0,'App.2-CD_DepExp_Yr3'!K54,+'App.2-CD_DepExp_Yr3'!K54+((C54*0.5)/D54))","v":133511.78390476192},{"$f":"-'App.2-BA_Fixed Asset Cont'!J253","v":133510},1.7839047619199846,37946.400000000001,null,{"$f":"IF(ISERROR(+I54+'App.2-CD_DepExp_Yr3'!K54-J54), 0, +I54+'App.2-CD_DepExp_Yr3'!K54-J54)","v":152484.9839047619}]
[1985,"Miscellaneous Fixed Assets",{"$f":"'App.2-BA_Fixed Asset Cont'!E254","v":0},0,0,{"$f":"IF(D55=0,'App.2-CD_DepExp_Yr3'!K55,+'App.2-CD_DepExp_Yr3'!K55+((C55*0.5)/D55))","v":0},{"$f":"-'App.2-BA_Fixed Asset Cont'!J254","v":0},0,0,null,{"$f":"IF(ISERROR(+I55+'App.2-CD_DepExp_Yr3'!K55-J55), 0, +I55+'App.2-CD_DepExp_Yr3'!K55-J55)","v":0}]
[1990,"Other Tangible Property",{"$f":"'App.2-BA_Fixed Asset Cont'!E255","v":0},null,0,{"$f":"IF(D56=0,'App.2-CD_DepExp_Yr3'!K56,+'App.2-CD_DepExp_Yr3'!K56+((C56*0.5)/D56))","v":0},{"$f":"-'App.2-BA_Fixed Asset Cont'!J255","v":0},0,0,null,{"$f":"IF(ISERROR(+I56+'App.2-CD_DepExp_Yr3'!K56-J56), 0, +I56+'App.2-CD_DepExp_Yr3'!K56-J56)","v":0}]
[1995,"Contributions & Grants",{"$f":"'App.2-BA_Fixed Asset Cont'!E256","v":-2267837},35,2.8571428571428571E-2,{"$f":"IF(D57=0,'App.2-CD_DepExp_Yr3'!K57,+'App.2-CD_DepExp_Yr3'!K57+((C57*0.5)/D57))","v":-313388.36140092171},{"$f":"-'App.2-BA_Fixed Asset Cont'!J256","v":-313336},-52.361400921712629,-64795.342857142859,null,{"$f":"IF(ISERROR(+I57+'App.2-CD_DepExp_Yr3'!K57-J57), 0, +I57+'App.2-CD_DepExp_Yr3'!K57-J57)","v":-345786.03282949311}]
[null,"Total",{"$f":"SUM(C20:C57)","v":17616789},null,null,{"$f":"SUM(F20:F57)","v":1844714.6357199675},{"$f":"SUM(G20:G57)","v":1850861},{"$f":"SUM(H20:H57)","v":-6146.3642800320922},{"$f":"SUM(I20:I57)","v":518513.12775751442},70200,{"$f":"SUM(K20:K57)","v":2033771.1995987252}]
[null,"Depreciation exp. adj. from gain or loss on the retirement of assets (pool of like assets)"]
[null,"Total Depreciation Expense ",null,null,null,{"$f":"SUM(F58:F59)","v":1844714.6357199675}]
["Notes:"]
[1,"Board policy of the \"half-year\" rule - the applicant must ensure that additions in the year attract a half-year depreciation expense in the first year.  Deviations from this standard practice must be supported in the application."]
[2,"The applicant must provide an explanation of material variances in evidence."]
[3,"This column refers to the calculated full year depreciation but excludes the depreciation expense on assets fully depreciated during the year.  This column is used for the purpose of calculating depreciation expense in the following year on the next worksheet."]
[]
["General:","Applicants must provide a breakdown of depreciation and amortization expense in the above format for all relevant accounts.  Asset Retirement Obligations (AROs), depreciation and accretion expense should be disclosed separately consistent with the Notes of historical Audited Financial Statements."]

{"sheet":"App.2-CF_DepExp_Yr5","index":16,"n_rows":66,"n_cols":11,"rows_kept":66,"cut":false,"hidden":false,"merged":[[17,9,18,9],[59,1,59,4],[8,0,8,8],[9,0,9,8],[10,0,10,7],[17,1,18,1],[17,6,18,6],[12,0,12,1],[13,0,13,1],[13,2,13,8],[14,0,14,1],[14,2,14,8],[61,1,61,7],[62,1,62,8],[64,1,64,8],[65,1,66,7],[67,1,68,7],[63,1,63,10]]}
[null,null,null,null,null,null,null,null,null,"File Number:",{"$f":"EBNUMBER","v":"EB-2016-0085"}]
[null,null,null,null,null,null,null,null,null,"Exhibit:",4]
[null,null,null,null,null,null,null,null,null,"Tab:"]
[null,null,null,null,null,null,null,null,null,"Schedule:"]
[null,null,null,null,null,null,null,null,null,"Page:"]
[]
[null,null,null,null,null,null,null,null,null,"Date:","2016-11-28"]
[]
["Appendix 2-CF"]
["Depreciation and Amortization Expense"]
["MIFRS (Year 5) - 2016"]
[]
["Select the set of appendices that apply",null,null,null,null,null,null,null,null,"Year Reflected in Schedule Below","Accounting Standard"]
["2012 Set of Appendices (2-CA to 2-CG)",null,"Assumes the applicant made capitalization and depreciation expense accounting policy changes under CGAAP effective January 1, 2012 and has adopted IFRS for financial reporting purposes effective January 1, 2015.  Assumes that the applicant is reflecting these changes in a rebasing application for the first time.",null,null,null,null,null,null,2016,"MIFRS"]
["2013 Set of Appendices (2-CA to 2-CF)",null,"Assumes the applicant made capitalization and depreciation expense accounting policy changes under CGAAP effective January 1, 2013 and has adopted IFRS for financial reporting purposes effective January 1, 2015.  Assumes that the applicant is reflecting these changes in a rebasing application for the first time.",null,null,null,null,null,null,2017,"MIFRS"]
[]
[]
["Account","Description","Additions","Years (new additions only)","Depreciation Rate on New Additions","Current Depreciation Expense1"," Depreciation Expense per Appendix 2-BA Fixed Assets, Column J\n (l)","Variance 2","Depreciation Expense on Current Full Year Additions","Less Depreciation Expense on Assets Fully Depreciated During the Year\n(o)","Current Full Year Depreciation 3"]
[null,null,"(d)","(f)","(g) = 1 / (f)","(h)= Prior Full Year Depreciation + ((d)*0.5)/(f) ",null,"(m) = (h) - (l)","(n)=((d))/(f) ",null,"(p) = Prior Full Year Depreciation  + (n) - (o)"]
[1611,"Computer Software (Formally known as Account 1925)",358500,3,{"$f":"IF(D20=0,0,1/D20)","v":0.33333333333333331},{"$f":"IF(D20=0,'App.2-CE_DepExp_Yr4'!K20,+'App.2-CE_DepExp_Yr4'!K20+((C20*0.5)/D20))","v":200006.04259259262},{"$f":"-'App.2-BA_Fixed Asset Cont'!J280","v":199987.66333333333},{"$f":"IF(ISERROR(+F20-G20), 0, +F20-G20)","v":18.379259259294486},{"$f":"IF(D20=0,0,+(C20)/D20)","v":119500},30000,{"$f":"IF(ISERROR(+I20+'App.2-CE_DepExp_Yr4'!K20-J20), 0,+I20 +'App.2-CE_DepExp_Yr4'!K20-J20)","v":229756.04259259262}]
[1612,"Land Rights (Formally known as Account 1906)",0,50,0.02,{"$f":"IF(D21=0,'App.2-CE_DepExp_Yr4'!K21,+'App.2-CE_DepExp_Yr4'!K21+((C21*0.5)/D21))","v":14575.084879893549},{"$f":"-'App.2-BA_Fixed Asset Cont'!J281","v":12699.01},1876.0748798935492,{"$f":"IF(D21=0,0,+(C21)/D21)","v":0},null,{"$f":"IF(ISERROR(+I21+'App.2-CE_DepExp_Yr4'!K21-J21), 0,+I21 +'App.2-CE_DepExp_Yr4'!K21-J21)","v":14575.084879893549}]
[1805,"Land",0,0,0,{"$f":"IF(D22=0,'App.2-CE_DepExp_Yr4'!K22,+'App.2-CE_DepExp_Yr4'!K22+((C22*0.5)/D22))","v":0},{"$f":"-'App.2-BA_Fixed Asset Cont'!J282","v":0},0,0,null,{"$f":"IF(ISERROR(+I22+'App.2-CE_DepExp_Yr4'!K22-J22), 0,+I22 +'App.2-CE_DepExp_Yr4'!K22-J22)","v":0}]
[1808,"Buildings",0,0,0,{"$f":"IF(D23=0,'App.2-CE_DepExp_Yr4'!K23,+'App.2-CE_DepExp_Yr4'!K23+((C23*0.5)/D23))","v":0},{"$f":"-'App.2-BA_Fixed Asset Cont'!J283","v":0},0,0,null,{"$f":"IF(ISERROR(+I23+'App.2-CE_DepExp_Yr4'!K23-J23), 0,+I23 +'App.2-CE_DepExp_Yr4'!K23-J23)","v":0}]
[1810,"Leasehold Improvements",0,25,0.04,{"$f":"IF(D24=0,'App.2-CE_DepExp_Yr4'!K24,+'App.2-CE_DepExp_Yr4'!K24+((C24*0.5)/D24))","v":0},{"$f":"-'App.2-BA_Fixed Asset Cont'!J284","v":0},0,0,null,{"$f":"IF(ISERROR(+I24+'App.2-CE_DepExp_Yr4'!K24-J24), 0,+I24 +'App.2-CE_DepExp_Yr4'!K24-J24)","v":0}]
[1815,"Transformer Station Equipment >50 kV",0,0,0,{"$f":"IF(D25=0,'App.2-CE_DepExp_Yr4'!K25,+'App.2-CE_DepExp_Yr4'!K25+((C25*0.5)/D25))","v":0},{"$f":"-'App.2-BA_Fixed Asset Cont'!J285","v":0},0,0,null,{"$f":"IF(ISERROR(+I25+'App.2-CE_DepExp_Yr4'!K25-J25), 0,+I25 +'App.2-CE_DepExp_Yr4'!K25-J25)","v":0}]
[1820,"Distribution Station Equipment <50 kV",2008854,40,2.5000000000000001E-2,{"$f":"IF(D26=0,'App.2-CE_DepExp_Yr4'!K26,+'App.2-CE_DepExp_Yr4'!K26+((C26*0.5)/D26))","v":223242.69469080408},{"$f":"-'App.2-BA_Fixed Asset Cont'!J286","v":226178.75999999998},-2936.0653091958957,50221.35,null,{"$f":"IF(ISERROR(+I26+'App.2-CE_DepExp_Yr4'!K26-J26), 0,+I26 +'App.2-CE_DepExp_Yr4'!K26-J26)","v":248353.3696908041}]
[1825,"Storage Battery Equipment",0,0,0,{"$f":"IF(D27=0,'App.2-CE_DepExp_Yr4'!K27,+'App.2-CE_DepExp_Yr4'!K27+((C27*0.5)/D27))","v":0},{"$f":"-'App.2-BA_Fixed Asset Cont'!J287","v":0},0,0,null,{"$f":"IF(ISERROR(+I27+'App.2-CE_DepExp_Yr4'!K27-J27), 0,+I27 +'App.2-CE_DepExp_Yr4'!K27-J27)","v":0}]
[1830,"Poles, Towers & Fixtures",1245717,40,2.5000000000000001E-2,{"$f":"IF(D28=0,'App.2-CE_DepExp_Yr4'!K28,+'App.2-CE_DepExp_Yr4'!K28+((C28*0.5)/D28))","v":267522.77246415766},{"$f":"-'App.2-BA_Fixed Asset Cont'!J288","v":258788.71666666665},8734.0557974910189,31142.924999999999,null,{"$f":"IF(ISERROR(+I28+'App.2-CE_DepExp_Yr4'!K28-J28), 0,+I28 +'App.2-CE_DepExp_Yr4'!K28-J28)","v":283094.23496415769}]
[1835,"Overhead Conductors & Devices",1111002,60,1.6666666666666666E-2,{"$f":"IF(D29=0,'App.2-CE_DepExp_Yr4'!K29,+'App.2-CE_DepExp_Yr4'!K29+((C29*0.5)/D29))","v":243573.32955555557},{"$f":"-'App.2-BA_Fixed Asset Cont'!J289","v":239829.93},3743.3995555555739,18516.7,null,{"$f":"IF(ISERROR(+I29+'App.2-CE_DepExp_Yr4'!K29-J29), 0,+I29 +'App.2-CE_DepExp_Yr4'!K29-J29)","v":252831.67955555557}]
[1840,"Underground Conduit",1282396,40,2.5000000000000001E-2,{"$f":"IF(D30=0,'App.2-CE_DepExp_Yr4'!K30,+'App.2-CE_DepExp_Yr4'!K30+((C30*0.5)/D30))","v":105661.07832407407},{"$f":"-'App.2-BA_Fixed Asset Cont'!J290","v":104328.80500000001},1332.2733240740636,32059.9,null,{"$f":"IF(ISERROR(+I30+'App.2-CE_DepExp_Yr4'!K30-J30), 0,+I30 +'App.2-CE_DepExp_Yr4'!K30-J30)","v":121691.02832407408}]
[1845,"Underground Conductors & Devices",613881,40,2.5000000000000001E-2,{"$f":"IF(D31=0,'App.2-CE_DepExp_Yr4'!K31,+'App.2-CE_DepExp_Yr4'!K31+((C31*0.5)/D31))","v":267556.74053205131},{"$f":"-'App.2-BA_Fixed Asset Cont'!J291","v":265602.9325},1953.8080320513109,15347.025,null,{"$f":"IF(ISERROR(+I31+'App.2-CE_DepExp_Yr4'!K31-J31), 0,+I31 +'App.2-CE_DepExp_Yr4'!K31-J31)","v":275230.25303205132}]
[1850,"Line Transformers",1818685,40,2.5000000000000001E-2,{"$f":"IF(D32=0,'App.2-CE_DepExp_Yr4'!K32,+'App.2-CE_DepExp_Yr4'!K32+((C32*0.5)/D32))","v":201203.15325},{"$f":"-'App.2-BA_Fixed Asset Cont'!J292","v":198414.54500000019},2788.6082499998156,45467.125,null,{"$f":"IF(ISERROR(+I32+'App.2-CE_DepExp_Yr4'!K32-J32), 0,+I32 +'App.2-CE_DepExp_Yr4'!K32-J32)","v":223936.71575}]
[1855,"Services (Overhead & Underground)",983373,50,0.02,{"$f":"IF(D33=0,'App.2-CE_DepExp_Yr4'!K33,+'App.2-CE_DepExp_Yr4'!K33+((C33*0.5)/D33))","v":105296.03011764707},{"$f":"-'App.2-BA_Fixed Asset Cont'!J293","v":107846.22166666666},-2550.191549019597,19667.46,null,{"$f":"IF(ISERROR(+I33+'App.2-CE_DepExp_Yr4'!K33-J33), 0,+I33 +'App.2-CE_DepExp_Yr4'!K33-J33)","v":115129.76011764706}]
[1860,"Meters",168055,15,6.6666666666666666E-2,{"$f":"IF(D34=0,'App.2-CE_DepExp_Yr4'!K34,+'App.2-CE_DepExp_Yr4'!K34+((C34*0.5)/D34))","v":188121.66122448983},{"$f":"-'App.2-BA_Fixed Asset Cont'!J294","v":188147.35},-25.688775510177948,11203.666666666666,null,{"$f":"IF(ISERROR(+I34+'App.2-CE_DepExp_Yr4'!K34-J34), 0,+I34 +'App.2-CE_DepExp_Yr4'!K34-J34)","v":193723.49455782314}]
[1860,"Meters (Smart Meters)",null,25,0.04,{"$f":"IF(D35=0,'App.2-CE_DepExp_Yr4'!K35,+'App.2-CE_DepExp_Yr4'!K35+((C35*0.5)/D35))","v":-0.36842105263167468},{"$f":"-'App.2-BA_Fixed Asset Cont'!J295","v":0},-0.36842105263167468,0,null,{"$f":"IF(ISERROR(+I35+'App.2-CE_DepExp_Yr4'!K35-J35), 0,+I35 +'App.2-CE_DepExp_Yr4'!K35-J35)","v":-0.36842105263167468}]
[1905,"Land",0,0,0,{"$f":"IF(D36=0,'App.2-CE_DepExp_Yr4'!K36,+'App.2-CE_DepExp_Yr4'!K36+((C36*0.5)/D36))","v":0},{"$f":"-'App.2-BA_Fixed Asset Cont'!J296","v":0},0,0,null,{"$f":"IF(ISERROR(+I36+'App.2-CE_DepExp_Yr4'!K36-J36), 0,+I36 +'App.2-CE_DepExp_Yr4'!K36-J36)","v":0}]
[1908,"Buildings & Fixtures",15000,50,0.02,{"$f":"IF(D37=0,'App.2-CE_DepExp_Yr4'!K37,+'App.2-CE_DepExp_Yr4'!K37+((C37*0.5)/D37))","v":268010.40491306991},{"$f":"-'App.2-BA_Fixed Asset Cont'!J297","v":268987.2},-976.79508693009848,300,null,{"$f":"IF(ISERROR(+I37+'App.2-CE_DepExp_Yr4'!K37-J37), 0,+I37 +'App.2-CE_DepExp_Yr4'!K37-J37)","v":268160.40491306991}]
[1910,"Leasehold Improvements",0,0,0,{"$f":"IF(D38=0,'App.2-CE_DepExp_Yr4'!K38,+'App.2-CE_DepExp_Yr4'!K38+((C38*0.5)/D38))","v":0},{"$f":"-'App.2-BA_Fixed Asset Cont'!J298","v":0},0,0,null,{"$f":"IF(ISERROR(+I38+'App.2-CE_DepExp_Yr4'!K38-J38), 0,+I38 +'App.2-CE_DepExp_Yr4'!K38-J38)","v":0}]
[1915,"Office Furniture & Equipment (10 years)",0,10,0.1,{"$f":"IF(D39=0,'App.2-CE_DepExp_Yr4'!K39,+'App.2-CE_DepExp_Yr4'!K39+((C39*0.5)/D39))","v":31219.3},{"$f":"-'App.2-BA_Fixed Asset Cont'!J299","v":28030.87},3188.4300000000003,0,null,{"$f":"IF(ISERROR(+I39+'App.2-CE_DepExp_Yr4'!K39-J39), 0,+I39 +'App.2-CE_DepExp_Yr4'!K39-J39)","v":31219.3}]
[1915,"Office Furniture & Equipment (5 years)",0,0,0,{"$f":"IF(D40=0,'App.2-CE_DepExp_Yr4'!K40,+'App.2-CE_DepExp_Yr4'!K40+((C40*0.5)/D40))","v":0},{"$f":"-'App.2-BA_Fixed Asset Cont'!J300","v":0},0,0,null,{"$f":"IF(ISERROR(+I40+'App.2-CE_DepExp_Yr4'!K40-J40), 0,+I40 +'App.2-CE_DepExp_Yr4'!K40-J40)","v":0}]
[1920,"Computer Equipment - Hardware",130000,5,0.2,{"$f":"IF(D41=0,'App.2-CE_DepExp_Yr4'!K41,+'App.2-CE_DepExp_Yr4'!K41+((C41*0.5)/D41))","v":110622.52884210527},{"$f":"-'App.2-BA_Fixed Asset Cont'!J301","v":110609.12999999999},13.398842105278163,26000,null,{"$f":"IF(ISERROR(+I41+'App.2-CE_DepExp_Yr4'!K41-J41), 0,+I41 +'App.2-CE_DepExp_Yr4'!K41-J41)","v":123622.52884210527}]
[1920,"Computer Equip.-Hardware(Post Mar. 22/04)",0,0,0,{"$f":"IF(D42=0,'App.2-CE_DepExp_Yr4'!K42,+'App.2-CE_DepExp_Yr4'!K42+((C42*0.5)/D42))","v":0},{"$f":"-'App.2-BA_Fixed Asset Cont'!J302","v":0},0,0,null,{"$f":"IF(ISERROR(+I42+'App.2-CE_DepExp_Yr4'!K42-J42), 0,+I42 +'App.2-CE_DepExp_Yr4'!K42-J42)","v":0}]
[1920,"Computer Equip.-Hardware(Post Mar. 19/07)",0,0,0,{"$f":"IF(D43=0,'App.2-CE_DepExp_Yr4'!K43,+'App.2-CE_DepExp_Yr4'!K43+((C43*0.5)/D43))","v":0},{"$f":"-'App.2-BA_Fixed Asset Cont'!J303","v":0},0,0,null,{"$f":"IF(ISERROR(+I43+'App.2-CE_DepExp_Yr4'!K43-J43), 0,+I43 +'App.2-CE_DepExp_Yr4'!K43-J43)","v":0}]
[1930,"Transportation Equipment",0,5,0.2,{"$f":"IF(D44=0,'App.2-CE_DepExp_Yr4'!K44,+'App.2-CE_DepExp_Yr4'!K44+((C44*0.5)/D44))","v":123555.12086274513},{"$f":"-'App.2-BA_Fixed Asset Cont'!J304","v":123384.7},170.42086274512985,0,null,{"$f":"IF(ISERROR(+I44+'App.2-CE_DepExp_Yr4'!K44-J44), 0,+I44 +'App.2-CE_DepExp_Yr4'!K44-J44)","v":123555.12086274513}]
[1935,"Stores Equipment",5000,10,0.1,{"$f":"IF(D45=0,'App.2-CE_DepExp_Yr4'!K45,+'App.2-CE_DepExp_Yr4'!K45+((C45*0.5)/D45))","v":14648.887773281953},{"$f":"-'App.2-BA_Fixed Asset Cont'!J305","v":14712.75},-63.862226718047168,500,null,{"$f":"IF(ISERROR(+I45+'App.2-CE_DepExp_Yr4'!K45-J45), 0,+I45 +'App.2-CE_DepExp_Yr4'!K45-J45)","v":14898.887773281953}]
[1940,"Tools, Shop & Garage Equipment",38000,10,0.1,{"$f":"IF(D46=0,'App.2-CE_DepExp_Yr4'!K46,+'App.2-CE_DepExp_Yr4'!K46+((C46*0.5)/D46))","v":45191.210823529414},{"$f":"-'App.2-BA_Fixed Asset Cont'!J306","v":45264.000000000007},-72.789176470592793,3800,null,{"$f":"IF(ISERROR(+I46+'App.2-CE_DepExp_Yr4'!K46-J46), 0,+I46 +'App.2-CE_DepExp_Yr4'!K46-J46)","v":47091.210823529414}]
[1945,"Measurement & Testing Equipment",15000,10,0.1,{"$f":"IF(D47=0,'App.2-CE_DepExp_Yr4'!K47,+'App.2-CE_DepExp_Yr4'!K47+((C47*0.5)/D47))","v":4679.6519318448882},{"$f":"-'App.2-BA_Fixed Asset Cont'!J307","v":4911.3500000000004},-231.6980681551122,1500,null,{"$f":"IF(ISERROR(+I47+'App.2-CE_DepExp_Yr4'!K47-J47), 0,+I47 +'App.2-CE_DepExp_Yr4'!K47-J47)","v":5429.6519318448882}]
[1950,"Power Operated Equipment",0,0,0,{"$f":"IF(D48=0,'App.2-CE_DepExp_Yr4'!K48,+'App.2-CE_DepExp_Yr4'!K48+((C48*0.5)/D48))","v":0},{"$f":"-'App.2-BA_Fixed Asset Cont'!J308","v":0},0,0,null,{"$f":"IF(ISERROR(+I48+'App.2-CE_DepExp_Yr4'!K48-J48), 0,+I48 +'App.2-CE_DepExp_Yr4'!K48-J48)","v":0}]
[1955,"Communications Equipment",0,0,0,{"$f":"IF(D49=0,'App.2-CE_DepExp_Yr4'!K49,+'App.2-CE_DepExp_Yr4'!K49+((C49*0.5)/D49))","v":0},{"$f":"-'App.2-BA_Fixed Asset Cont'!J309","v":0},0,0,null,{"$f":"IF(ISERROR(+I49+'App.2-CE_DepExp_Yr4'!K49-J49), 0,+I49 +'App.2-CE_DepExp_Yr4'!K49-J49)","v":0}]
[1955,"Communication Equipment (Smart Meters)",0,0,0,{"$f":"IF(D50=0,'App.2-CE_DepExp_Yr4'!K50,+'App.2-CE_DepExp_Yr4'!K50+((C50*0.5)/D50))","v":0},{"$f":"-'App.2-BA_Fixed Asset Cont'!J310","v":0},0,0,null,{"$f":"IF(ISERROR(+I50+'App.2-CE_DepExp_Yr4'!K50-J50), 0,+I50 +'App.2-CE_DepExp_Yr4'!K50-J50)","v":0}]
[1960,"Miscellaneous Equipment ",0,0,0,{"$f":"IF(D51=0,'App.2-CE_DepExp_Yr4'!K51,+'App.2-CE_DepExp_Yr4'!K51+((C51*0.5)/D51))","v":0},{"$f":"-'App.2-BA_Fixed Asset Cont'!J311","v":0},0,0,null,{"$f":"IF(ISERROR(+I51+'App.2-CE_DepExp_Yr4'!K51-J51), 0,+I51 +'App.2-CE_DepExp_Yr4'!K51-J51)","v":0}]
[1970,"Load Management Controls Customer Premises",0,null,0,{"$f":"IF(D52=0,'App.2-CE_DepExp_Yr4'!K52,+'App.2-CE_DepExp_Yr4'!K52+((C52*0.5)/D52))","v":0},{"$f":"-'App.2-BA_Fixed Asset Cont'!J312","v":0},0,0,null,{"$f":"IF(ISERROR(+I52+'App.2-CE_DepExp_Yr4'!K52-J52), 0,+I52 +'App.2-CE_DepExp_Yr4'!K52-J52)","v":0}]
[1975,"Load Management Controls Utility Premises",0,0,0,{"$f":"IF(D53=0,'App.2-CE_DepExp_Yr4'!K53,+'App.2-CE_DepExp_Yr4'!K53+((C53*0.5)/D53))","v":0},{"$f":"-'App.2-BA_Fixed Asset Cont'!J313","v":0},0,0,null,{"$f":"IF(ISERROR(+I53+'App.2-CE_DepExp_Yr4'!K53-J53), 0,+I53 +'App.2-CE_DepExp_Yr4'!K53-J53)","v":0}]
[1980,"System Supervisor Equipment",84002,15,6.6666666666666666E-2,{"$f":"IF(D54=0,'App.2-CE_DepExp_Yr4'!K54,+'App.2-CE_DepExp_Yr4'!K54+((C54*0.5)/D54))","v":155285.05057142858},{"$f":"-'App.2-BA_Fixed Asset Cont'!J314","v":155283.33000000005},1.7205714285373688,5600.1333333333332,null,{"$f":"IF(ISERROR(+I54+'App.2-CE_DepExp_Yr4'!K54-J54), 0,+I54 +'App.2-CE_DepExp_Yr4'!K54-J54)","v":158085.11723809523}]
[1985,"Miscellaneous Fixed Assets",0,0,0,{"$f":"IF(D55=0,'App.2-CE_DepExp_Yr4'!K55,+'App.2-CE_DepExp_Yr4'!K55+((C55*0.5)/D55))","v":0},{"$f":"-'App.2-BA_Fixed Asset Cont'!J315","v":0},0,0,null,{"$f":"IF(ISERROR(+I55+'App.2-CE_DepExp_Yr4'!K55-J55), 0,+I55 +'App.2-CE_DepExp_Yr4'!K55-J55)","v":0}]
[1990,"Other Tangible Property",0,null,0,{"$f":"IF(D56=0,'App.2-CE_DepExp_Yr4'!K56,+'App.2-CE_DepExp_Yr4'!K56+((C56*0.5)/D56))","v":0},{"$f":"-'App.2-BA_Fixed Asset Cont'!J316","v":0},0,0,null,{"$f":"IF(ISERROR(+I56+'App.2-CE_DepExp_Yr4'!K56-J56), 0,+I56 +'App.2-CE_DepExp_Yr4'!K56-J56)","v":0}]
[1995,"Contributions & Grants",-4227692,35,2.8571428571428571E-2,{"$f":"IF(D57=0,'App.2-CE_DepExp_Yr4'!K57,+'App.2-CE_DepExp_Yr4'!K57+((C57*0.5)/D57))","v":-406181.63282949309},{"$f":"-'App.2-BA_Fixed Asset Cont'!J317","v":-421161.72413793107},14980.091308437986,-120791.2,-14700,{"$f":"IF(ISERROR(+I57+'App.2-CE_DepExp_Yr4'!K57-J57), 0,+I57 +'App.2-CE_DepExp_Yr4'!K57-J57)","v":-451877.23282949312}]
[null,"Total",{"$f":"SUM(C20:C57)","v":5649773},null,null,{"$f":"SUM(F20:F57)","v":2163788.7420987254},{"$f":"SUM(G20:G57)","v":2131845.540028736},{"$f":"SUM(H20:H57)","v":31943.202069989406},{"$f":"SUM(I20:I57)","v":260035.08500000008},15300,2278506.2845987249]
[null,"Depreciation exp. adj. from gain or loss on the retirement of assets (pool of like assets)"]
[null,"Total Depreciation Expense ",null,null,null,{"$f":"SUM(F58:F59)","v":2163788.7420987254}]
["Notes:"]
[1,"Board policy of the \"half-year\" rule - the applicant must ensure that additions in the year attract a half-year depreciation expense in the first year.  Deviations from this standard practice must be supported in the application."]
[2,"The applicant must provide an explanation of material variances in evidence."]
[3,"This column refers to the calculated full year depreciation but excludes the depreciation expense on assets fully depreciated during the year.  This column is used for the purpose of calculating depreciation expense in the following year on the next worksheet."]
[]
["General:","Applicants must provide a breakdown of depreciation and amortization expense in the above format for all relevant accounts.  Asset Retirement Obligations (AROs), depreciation and accretion expense should be disclosed separately consistent with the Notes of historical Audited Financial Statements."]

{"sheet":"App.2-CG_DepExp_Yr6","index":17,"n_rows":66,"n_cols":11,"rows_kept":66,"cut":false,"hidden":false,"merged":[[8,0,8,8],[9,0,9,8],[10,0,10,7],[12,0,12,1],[13,0,13,1],[13,2,13,8],[14,2,14,8],[17,1,18,1],[17,6,18,6],[17,9,18,9],[59,1,59,4],[61,1,61,7],[62,1,62,8],[64,1,64,8],[65,1,66,7],[67,1,68,7]]}
[null,null,null,null,null,null,null,null,null,"File Number:",{"$f":"EBNUMBER","v":"EB-2016-0085"}]
[null,null,null,null,null,null,null,null,null,"Exhibit:",4]
[null,null,null,null,null,null,null,null,null,"Tab:"]
[null,null,null,null,null,null,null,null,null,"Schedule:"]
[null,null,null,null,null,null,null,null,null,"Page:"]
[]
[null,null,null,null,null,null,null,null,null,"Date:","2016-11-28"]
[]
["Appendix 2-CG"]
["Depreciation and Amortization Expense"]
["MIFRS (Year 6) - 2017"]
[]
["Select the set of appendices that apply",null,null,null,null,null,null,null,null,"Year Reflected in Schedule Below","Accounting Standard"]
["2012 Set of Appendices (2-CA to 2-CG)",null,"Assumes the applicant made capitalization and depreciation expense accounting policy changes under CGAAP effective January 1, 2012 and has adopted IFRS for financial reporting purposes effective January 1, 2015.  Assumes that the applicant is reflecting these changes in a rebasing application for the first time.",null,null,null,null,null,null,2017,"MIFRS"]
["N/A","         2013 Set of Appendices","Not applicable as the test year depreciation is already calculated in Appendix 2-CF.  Note that this appendix is not to be used even though depreciation expense calculations will flow through from previous years to this appendix.",null,null,null,null,null,null,"N/A","N/A"]
[]
[]
["Account","Description","Additions","Years (new additions only)","Depreciation Rate on New Additions","Current Depreciation Expense1"," Depreciation Expense per Appendix 2-BA Fixed Assets, Column J\n (l)","Variance 2"]
[null,null,"(d)","(f)","(g) = 1 / (f)","(h)= Prior Full Year Depreciation + ((d)*0.5)/(f) ",null,"(m) = (h) - (l)"]
[1611,"Computer Software (Formally known as Account 1925)",{"$f":"'App.2-BA_Fixed Asset Cont'!E341","v":339325},3,{"$f":"IF(D20=0,0,1/D20)","v":0.33333333333333331},{"$f":"IF(D20=0,'App.2-CF_DepExp_Yr5'!K20,+'App.2-CF_DepExp_Yr5'!K20+((C20*0.5)/D20))","v":286310.20925925928},{"$f":"-'App.2-BA_Fixed Asset Cont'!J341","v":286492.83},{"$f":"IF(ISERROR(+F20-G20), 0, +F20-G20)","v":-182.62074074073462}]
[1612,"Land Rights (Formally known as Account 1906)",{"$f":"'App.2-BA_Fixed Asset Cont'!E342","v":0},50,0.02,{"$f":"IF(D21=0,'App.2-CF_DepExp_Yr5'!K21,+'App.2-CF_DepExp_Yr5'!K21+((C21*0.5)/D21))","v":14575.084879893549},{"$f":"-'App.2-BA_Fixed Asset Cont'!J342","v":12699.01},{"$f":"IF(ISERROR(+F21-G21), 0, +F21-G21)","v":1876.0748798935492}]
[1805,"Land",{"$f":"'App.2-BA_Fixed Asset Cont'!E343","v":0},0,0,{"$f":"IF(D22=0,'App.2-CF_DepExp_Yr5'!K22,+'App.2-CF_DepExp_Yr5'!K22+((C22*0.5)/D22))","v":0},{"$f":"-'App.2-BA_Fixed Asset Cont'!J343","v":0},0]
[1808,"Buildings",{"$f":"'App.2-BA_Fixed Asset Cont'!E344","v":0},0,0,{"$f":"IF(D23=0,'App.2-CF_DepExp_Yr5'!K23,+'App.2-CF_DepExp_Yr5'!K23+((C23*0.5)/D23))","v":0},{"$f":"-'App.2-BA_Fixed Asset Cont'!J344","v":0},0]
[1810,"Leasehold Improvements",{"$f":"'App.2-BA_Fixed Asset Cont'!E345","v":0},25,0.04,{"$f":"IF(D24=0,'App.2-CF_DepExp_Yr5'!K24,+'App.2-CF_DepExp_Yr5'!K24+((C24*0.5)/D24))","v":0},{"$f":"-'App.2-BA_Fixed Asset Cont'!J345","v":0},0]
[1815,"Transformer Station Equipment >50 kV",{"$f":"'App.2-BA_Fixed Asset Cont'!E346","v":0},0,0,{"$f":"IF(D25=0,'App.2-CF_DepExp_Yr5'!K25,+'App.2-CF_DepExp_Yr5'!K25+((C25*0.5)/D25))","v":0},{"$f":"-'App.2-BA_Fixed Asset Cont'!J346","v":0},0]
[1820,"Distribution Station Equipment <50 kV",{"$f":"'App.2-BA_Fixed Asset Cont'!E347","v":325114},40,2.5000000000000001E-2,{"$f":"IF(D26=0,'App.2-CF_DepExp_Yr5'!K26,+'App.2-CF_DepExp_Yr5'!K26+((C26*0.5)/D26))","v":252417.29469080409},{"$f":"-'App.2-BA_Fixed Asset Cont'!J347","v":255544.35999999996},-3127.0653091958666]
[1825,"Storage Battery Equipment",{"$f":"'App.2-BA_Fixed Asset Cont'!E348","v":0},0,0,{"$f":"IF(D27=0,'App.2-CF_DepExp_Yr5'!K27,+'App.2-CF_DepExp_Yr5'!K27+((C27*0.5)/D27))","v":0},{"$f":"-'App.2-BA_Fixed Asset Cont'!J348","v":0},0]
[1830,"Poles, Towers & Fixtures",{"$f":"'App.2-BA_Fixed Asset Cont'!E349","v":2921679},45,2.2222222222222223E-2,{"$f":"IF(D28=0,'App.2-CF_DepExp_Yr5'!K28,+'App.2-CF_DepExp_Yr5'!K28+((C28*0.5)/D28))","v":315557.33496415766},{"$f":"-'App.2-BA_Fixed Asset Cont'!J349","v":299803.77222222218},15753.562741935486]
[1835,"Overhead Conductors & Devices",{"$f":"'App.2-BA_Fixed Asset Cont'!E350","v":2266734},60,1.6666666666666666E-2,{"$f":"IF(D29=0,'App.2-CF_DepExp_Yr5'!K29,+'App.2-CF_DepExp_Yr5'!K29+((C29*0.5)/D29))","v":271721.12955555558},{"$f":"-'App.2-BA_Fixed Asset Cont'!J350","v":263899.59666666668},7821.5328888889053]
[1840,"Underground Conduit",{"$f":"'App.2-BA_Fixed Asset Cont'!E351","v":221375},40,2.5000000000000001E-2,{"$f":"IF(D30=0,'App.2-CF_DepExp_Yr5'!K30,+'App.2-CF_DepExp_Yr5'!K30+((C30*0.5)/D30))","v":124458.21582407408},{"$f":"-'App.2-BA_Fixed Asset Cont'!J351","v":123123.9425},1334.2733240740781]
[1845,"Underground Conductors & Devices",{"$f":"'App.2-BA_Fixed Asset Cont'!E352","v":133681},40,2.5000000000000001E-2,{"$f":"IF(D31=0,'App.2-CF_DepExp_Yr5'!K31,+'App.2-CF_DepExp_Yr5'!K31+((C31*0.5)/D31))","v":276901.26553205133},{"$f":"-'App.2-BA_Fixed Asset Cont'!J352","v":274863.45750000002},2037.8080320513109]
[1850,"Line Transformers",{"$f":"'App.2-BA_Fixed Asset Cont'!E353","v":746731},40,2.5000000000000001E-2,{"$f":"IF(D32=0,'App.2-CF_DepExp_Yr5'!K32,+'App.2-CF_DepExp_Yr5'!K32+((C32*0.5)/D32))","v":233270.85325000001},{"$f":"-'App.2-BA_Fixed Asset Cont'!J353","v":230095.93250000017},3174.9207499998447]
[1855,"Services (Overhead & Underground)",{"$f":"'App.2-BA_Fixed Asset Cont'!E354","v":505121},50,0.02,{"$f":"IF(D33=0,'App.2-CF_DepExp_Yr5'!K33,+'App.2-CF_DepExp_Yr5'!K33+((C33*0.5)/D33))","v":120180.97011764707},{"$f":"-'App.2-BA_Fixed Asset Cont'!J354","v":125788.22583333333},{"$f":"IF(ISERROR(+F33-G33), 0, +F33-G33)","v":-5607.2557156862604}]
[1860,"Meters",{"$f":"'App.2-BA_Fixed Asset Cont'!E355","v":250632},15,6.6666666666666666E-2,{"$f":"IF(D34=0,'App.2-CF_DepExp_Yr5'!K34,+'App.2-CF_DepExp_Yr5'!K34+((C34*0.5)/D34))","v":202077.89455782314},{"$f":"-'App.2-BA_Fixed Asset Cont'!J355","v":202133.58333333334},-55.688775510207051]
[1860,"Meters (Smart Meters)",{"$f":"'App.2-BA_Fixed Asset Cont'!E356","v":0},25,0.04,{"$f":"IF(D35=0,'App.2-CF_DepExp_Yr5'!K35,+'App.2-CF_DepExp_Yr5'!K35+((C35*0.5)/D35))","v":-0.36842105263167468},{"$f":"-'App.2-BA_Fixed Asset Cont'!J356","v":0},-0.36842105263167468]
[1905,"Land",{"$f":"'App.2-BA_Fixed Asset Cont'!E357","v":0},0,0,{"$f":"IF(D36=0,'App.2-CF_DepExp_Yr5'!K36,+'App.2-CF_DepExp_Yr5'!K36+((C36*0.5)/D36))","v":0},{"$f":"-'App.2-BA_Fixed Asset Cont'!J357","v":0},0]
[1908,"Buildings & Fixtures",{"$f":"'App.2-BA_Fixed Asset Cont'!E358","v":15000},50,0.02,{"$f":"IF(D37=0,'App.2-CF_DepExp_Yr5'!K37,+'App.2-CF_DepExp_Yr5'!K37+((C37*0.5)/D37))","v":268310.40491306991},{"$f":"-'App.2-BA_Fixed Asset Cont'!J358","v":269587.20000000001},-1276.7950869300985]
[1910,"Leasehold Improvements",{"$f":"'App.2-BA_Fixed Asset Cont'!E359","v":0},0,0,{"$f":"IF(D38=0,'App.2-CF_DepExp_Yr5'!K38,+'App.2-CF_DepExp_Yr5'!K38+((C38*0.5)/D38))","v":0},{"$f":"-'App.2-BA_Fixed Asset Cont'!J359","v":0},0]
[1915,"Office Furniture & Equipment (10 years)",{"$f":"'App.2-BA_Fixed Asset Cont'!E360","v":15000},10,0.1,{"$f":"IF(D39=0,'App.2-CF_DepExp_Yr5'!K39,+'App.2-CF_DepExp_Yr5'!K39+((C39*0.5)/D39))","v":31969.3},{"$f":"-'App.2-BA_Fixed Asset Cont'!J360","v":29530.87},2438.4300000000003]
[1915,"Office Furniture & Equipment (5 years)",{"$f":"'App.2-BA_Fixed Asset Cont'!E361","v":0},0,0,{"$f":"IF(D40=0,'App.2-CF_DepExp_Yr5'!K40,+'App.2-CF_DepExp_Yr5'!K40+((C40*0.5)/D40))","v":0},{"$f":"-'App.2-BA_Fixed Asset Cont'!J361","v":0},0]
[1920,"Computer Equipment - Hardware",{"$f":"'App.2-BA_Fixed Asset Cont'!E362","v":165000},5,0.2,{"$f":"IF(D41=0,'App.2-CF_DepExp_Yr5'!K41,+'App.2-CF_DepExp_Yr5'!K41+((C41*0.5)/D41))","v":140122.52884210527},{"$f":"-'App.2-BA_Fixed Asset Cont'!J362","v":140109.13},13.398842105263611]
[1920,"Computer Equip.-Hardware(Post Mar. 22/04)",{"$f":"'App.2-BA_Fixed Asset Cont'!E363","v":0},0,0,{"$f":"IF(D42=0,'App.2-CF_DepExp_Yr5'!K42,+'App.2-CF_DepExp_Yr5'!K42+((C42*0.5)/D42))","v":0},{"$f":"-'App.2-BA_Fixed Asset Cont'!J363","v":0},0]
[1920,"Computer Equip.-Hardware(Post Mar. 19/07)",{"$f":"'App.2-BA_Fixed Asset Cont'!E364","v":0},0,0,{"$f":"IF(D43=0,'App.2-CF_DepExp_Yr5'!K43,+'App.2-CF_DepExp_Yr5'!K43+((C43*0.5)/D43))","v":0},{"$f":"-'App.2-BA_Fixed Asset Cont'!J364","v":0},0]
[1930,"Transportation Equipment",{"$f":"'App.2-BA_Fixed Asset Cont'!E365","v":505500},5,0.2,{"$f":"IF(D44=0,'App.2-CF_DepExp_Yr5'!K44,+'App.2-CF_DepExp_Yr5'!K44+((C44*0.5)/D44))","v":174105.12086274513},{"$f":"-'App.2-BA_Fixed Asset Cont'!J365","v":173934.7},170.4208627451153]
[1935,"Stores Equipment",{"$f":"'App.2-BA_Fixed Asset Cont'!E366","v":5250},10,0.1,{"$f":"IF(D45=0,'App.2-CF_DepExp_Yr5'!K45,+'App.2-CF_DepExp_Yr5'!K45+((C45*0.5)/D45))","v":15161.387773281953},{"$f":"-'App.2-BA_Fixed Asset Cont'!J366","v":15225.25},-63.862226718047168]
[1940,"Tools, Shop & Garage Equipment",{"$f":"'App.2-BA_Fixed Asset Cont'!E367","v":39900},10,0.1,{"$f":"IF(D46=0,'App.2-CF_DepExp_Yr5'!K46,+'App.2-CF_DepExp_Yr5'!K46+((C46*0.5)/D46))","v":49086.210823529414},{"$f":"-'App.2-BA_Fixed Asset Cont'!J367","v":49159.000000000007},-72.789176470592793]
[1945,"Measurement & Testing Equipment",{"$f":"'App.2-BA_Fixed Asset Cont'!E368","v":69760},10,0.1,{"$f":"IF(D47=0,'App.2-CF_DepExp_Yr5'!K47,+'App.2-CF_DepExp_Yr5'!K47+((C47*0.5)/D47))","v":8917.6519318448882},{"$f":"-'App.2-BA_Fixed Asset Cont'!J368","v":9149.35},-231.6980681551122]
[1950,"Power Operated Equipment",{"$f":"'App.2-BA_Fixed Asset Cont'!E369","v":0},0,0,{"$f":"IF(D48=0,'App.2-CF_DepExp_Yr5'!K48,+'App.2-CF_DepExp_Yr5'!K48+((C48*0.5)/D48))","v":0},{"$f":"-'App.2-BA_Fixed Asset Cont'!J369","v":0},0]
[1955,"Communications Equipment",{"$f":"'App.2-BA_Fixed Asset Cont'!E370","v":0},0,0,{"$f":"IF(D49=0,'App.2-CF_DepExp_Yr5'!K49,+'App.2-CF_DepExp_Yr5'!K49+((C49*0.5)/D49))","v":0},{"$f":"-'App.2-BA_Fixed Asset Cont'!J370","v":0},0]
[1955,"Communication Equipment (Smart Meters)",{"$f":"'App.2-BA_Fixed Asset Cont'!E371","v":0},0,0,{"$f":"IF(D50=0,'App.2-CF_DepExp_Yr5'!K50,+'App.2-CF_DepExp_Yr5'!K50+((C50*0.5)/D50))","v":0},{"$f":"-'App.2-BA_Fixed Asset Cont'!J371","v":0},0]
[1960,"Miscellaneous Equipment ",{"$f":"'App.2-BA_Fixed Asset Cont'!E372","v":0},0,0,{"$f":"IF(D51=0,'App.2-CF_DepExp_Yr5'!K51,+'App.2-CF_DepExp_Yr5'!K51+((C51*0.5)/D51))","v":0},{"$f":"-'App.2-BA_Fixed Asset Cont'!J372","v":0},0]
[1970,"Load Management Controls Customer Premises",{"$f":"'App.2-BA_Fixed Asset Cont'!E373","v":0},null,0,{"$f":"IF(D52=0,'App.2-CF_DepExp_Yr5'!K52,+'App.2-CF_DepExp_Yr5'!K52+((C52*0.5)/D52))","v":0},{"$f":"-'App.2-BA_Fixed Asset Cont'!J373","v":0},0]
[1975,"Load Management Controls Utility Premises",{"$f":"'App.2-BA_Fixed Asset Cont'!E374","v":0},0,0,{"$f":"IF(D53=0,'App.2-CF_DepExp_Yr5'!K53,+'App.2-CF_DepExp_Yr5'!K53+((C53*0.5)/D53))","v":0},{"$f":"-'App.2-BA_Fixed Asset Cont'!J374","v":0},0]
[1980,"System Supervisor Equipment",{"$f":"'App.2-BA_Fixed Asset Cont'!E375","v":32400},15,6.6666666666666666E-2,{"$f":"IF(D54=0,'App.2-CF_DepExp_Yr5'!K54,+'App.2-CF_DepExp_Yr5'!K54+((C54*0.5)/D54))","v":159165.11723809523},{"$f":"-'App.2-BA_Fixed Asset Cont'!J375","v":159163.41000000006},1.7072380951722153]
[1985,"Miscellaneous Fixed Assets",{"$f":"'App.2-BA_Fixed Asset Cont'!E376","v":0},0,0,{"$f":"IF(D55=0,'App.2-CF_DepExp_Yr5'!K55,+'App.2-CF_DepExp_Yr5'!K55+((C55*0.5)/D55))","v":0},{"$f":"-'App.2-BA_Fixed Asset Cont'!J376","v":0},0]
[1990,"Other Tangible Property",{"$f":"'App.2-BA_Fixed Asset Cont'!E377","v":0},null,0,{"$f":"IF(D56=0,'App.2-CF_DepExp_Yr5'!K56,+'App.2-CF_DepExp_Yr5'!K56+((C56*0.5)/D56))","v":0},{"$f":"-'App.2-BA_Fixed Asset Cont'!J377","v":0},0]
[1995,"Contributions & Grants",{"$f":"'App.2-BA_Fixed Asset Cont'!E378","v":-1869254},35,2.8571428571428571E-2,{"$f":"IF(D57=0,'App.2-CF_DepExp_Yr5'!K57,+'App.2-CF_DepExp_Yr5'!K57+((C57*0.5)/D57))","v":-478580.86140092171},{"$f":"-'App.2-BA_Fixed Asset Cont'!J378","v":-522115.68965517246},43534.828254250751]
[null,"Total",{"$f":"SUM(C20:C57)","v":6688948},null,null,{"$f":"SUM(F20:F57)","v":2465726.7451939625},{"$f":"SUM(G20:G57)","v":2398187.9309003833},{"$f":"SUM(H20:H57)","v":67538.814293579926}]
[null,"Depreciation exp. adj. from gain or loss on the retirement of assets (pool of like assets)"]
[null,"Total Depreciation Expense ",null,null,null,{"$f":"SUM(F58:F59)","v":2465726.7451939625}]
["Notes:"]
[1,"Board policy of the \"half-year\" rule - the applicant must ensure that additions in the year attract a half-year depreciation expense in the first year.  Deviations from this standard practice must be supported in the application."]
[2,"The applicant must provide an explanation of material variances in evidence."]
[]
[]
["General:","Applicants must provide a breakdown of depreciation and amortization expense in the above format for all relevant accounts.  Asset Retirement Obligations (AROs), depreciation and accretion expense should be disclosed separately consistent with the Notes of historical Audited Financial Statements."]

{"sheet":"App.2-CH_DepExp","index":18,"n_rows":69,"n_cols":12,"rows_kept":69,"cut":false,"hidden":false,"merged":[[8,0,8,11],[9,0,9,11],[17,0,18,0],[17,1,18,1],[17,10,18,10],[10,0,10,11],[58,1,58,8],[65,1,65,11],[66,1,67,9],[68,1,69,11],[63,1,64,11]]}
[null,null,null,null,null,null,null,null,null,null,"File Number:",{"$f":"EBNUMBER","v":"EB-2016-0085"}]
[null,null,null,null,null,null,null,null,null,null,"Exhibit:"]
[null,null,null,null,null,null,null,null,null,null,"Tab:"]
[null,null,null,null,null,null,null,null,null,null,"Schedule:"]
[null,null,null,null,null,null,null,null,null,null,"Page:"]
[]
[null,null,null,null,null,null,null,null,null,null,"Date:"]
[]
["Appendix 2-CH1"]
["Depreciation and Amortization Expense"]
["Revised CGAAP or MIFRS"]
[]
["Assumes the applicant changed capitalization and depreciation policies and reflected these changes in a prior rebasing application"]
[]
[null,null,null,"Accounting Standard"]
[null,null,null,"Year "]
[]
["Account","Description","Opening Regulatory Gross PP&E as at Jan. 1","Less Fully Depreciated","Net for Depreciation","Additions","Total for Depreciation 2","Years","Depreciation Rate","Current Year Depreciation Expense"," Depreciation Expense per Appendix 2-BA Fixed Assets, Column J\n (l)","Variance 3"]
[null,null,"(a)","(b)","(c)","(d)","(e) = (c) + ½ x (d) ","(f)","(g) = 1 / (f)","(h) = (e) / (f)",null,"(m) = (h) - (l)"]
[1611,"Computer Software (Formally known as Account 1925)",null,null,{"$f":"C20-D20","v":0},null,{"$f":"E20+0.5*F20","v":0},null,{"$f":"IF(H20=0,0,1/H20)","v":0},{"$f":"IF(H20=0,0,G20/H20)","v":0},null,{"$f":"IF(ISERROR(+J20-K20), 0, +J20-K20)","v":0}]
[1612,"Land Rights (Formally known as Account 1906)",null,null,{"$f":"C21-D21","v":0},null,{"$f":"E21+0.5*F21","v":0},null,0,0,null,0]
[1805,"Land",null,null,0,null,0,null,0,0,null,0]
[1808,"Buildings",null,null,0,null,0,null,0,0,null,0]
[1810,"Leasehold Improvements",null,null,0,null,0,null,0,0,null,0]
[1815,"Transformer Station Equipment >50 kV",null,null,0,null,0,null,0,0,null,0]
[1820,"Distribution Station Equipment <50 kV",null,null,0,null,0,null,0,0,null,0]
[1825,"Storage Battery Equipment",null,null,0,null,0,null,0,0,null,0]
[1830,"Poles, Towers & Fixtures",null,null,0,null,0,null,0,0,null,0]
[1835,"Overhead Conductors & Devices",null,null,0,null,0,null,0,0,null,0]
[1840,"Underground Conduit",null,null,0,null,0,null,0,0,null,0]
[1845,"Underground Conductors & Devices",null,null,0,null,0,null,0,0,null,0]
[1850,"Line Transformers",null,null,0,null,0,null,0,0,null,0]
[1855,"Services (Overhead & Underground)",null,null,0,null,0,null,0,0,null,0]
[1860,"Meters",null,null,0,null,0,null,0,0,null,0]
[1860,"Meters (Smart Meters)",null,null,0,null,0,null,0,0,null,0]
[1905,"Land",null,null,0,null,0,null,0,0,null,0]
[1908,"Buildings & Fixtures",null,null,0,null,0,null,0,0,null,0]
[1910,"Leasehold Improvements",null,null,0,null,0,null,0,0,null,0]
[1915,"Office Furniture & Equipment (10 years)",null,null,0,null,0,null,0,0,null,0]
[1915,"Office Furniture & Equipment (5 years)",null,null,0,null,0,null,0,0,null,0]
[1920,"Computer Equipment - Hardware",null,null,0,null,0,null,0,0,null,0]
[1920,"Computer Equip.-Hardware(Post Mar. 22/04)",null,null,0,null,0,null,0,0,null,0]
[1920,"Computer Equip.-Hardware(Post Mar. 19/07)",null,null,0,null,0,null,0,0,null,0]
[1930,"Transportation Equipment",null,null,0,null,0,null,0,0,null,0]
[1935,"Stores Equipment",null,null,0,null,0,null,0,0,null,0]
[1940,"Tools, Shop & Garage Equipment",null,null,0,null,0,null,0,0,null,0]
[1945,"Measurement & Testing Equipment",null,null,0,null,0,null,0,0,null,0]
[1950,"Power Operated Equipment",null,null,0,null,0,null,0,0,null,0]
[1955,"Communications Equipment",null,null,0,null,0,null,0,0,null,0]
[1955,"Communication Equipment (Smart Meters)",null,null,0,null,0,null,0,0,null,0]
[1960,"Miscellaneous Equipment ",null,null,0,null,0,null,0,0,null,0]
[1970,"Load Management Controls - Customer Premises",null,null,0,null,0,null,0,0,null,0]
[1975,"Load Management Controls Utility Premises",null,null,0,null,0,null,0,0,null,0]
[1980,"System Supervisor Equipment",null,null,0,null,0,null,0,0,null,0]
[1985,"Miscellaneous Fixed Assets",null,null,0,null,0,null,0,0,null,0]
[1990,"Other Tangible Property",null,null,0,null,0,null,0,0,null,0]
[1995,"Contributions & Grants",null,null,0,null,0,null,0,0,null,0]
[null,"Total",{"$f":"SUM(C20:C57)","v":0},{"$f":"SUM(D20:D57)","v":0},{"$f":"SUM(E20:E57)","v":0},{"$f":"SUM(F20:F57)","v":0},{"$f":"SUM(G20:G57)","v":0},null,null,{"$f":"SUM(J20:J57)","v":0},{"$f":"SUM(K20:K57)","v":0},{"$f":"SUM(L20:L57)","v":0}]
[null,"Depreciation exp. adj. from gain or loss on the retirement of assets (pool of like assets) (under MIFRS) "]
[null,"Total Depreciation Expense",null,null,null,null,null,null,null,{"$f":"SUM(J58:J59)","v":0}]
[]
["Notes:"]
[]
[1,"The appendix should be submitted for the Test Year, Bridge Year and all relevant historical years.  At a minimum , the applicant must provide data for the earlier of: 1) all historical years back to its last rebasing; or 2) at least three years of historical actuals, in addition to Bridge Year and Test Year forecasts."]
[]
[2,"Board policy of the \"half-year\" rule - the applicant must ensure that additions in the year attract a half-year depreciation expense in the first year.  Deviations from this standard practice must be supported in the application."]
[3,"The applicant must provide an explanation of material variances in evidence."]
[]
["General","Applicants must provide a breakdown of depreciation and amortization expense in the above format for all relevant accounts.  Asset Retirement Obligations (AROs), depreciation and accretion expense should be disclosed separately consistent with the Notes of historical Audited Financial Statements."]

{"sheet":"App.2-D_Overhead","index":19,"n_rows":49,"n_cols":8,"rows_kept":49,"cut":false,"hidden":false,"merged":[[63,0,64,0],[49,0,50,0],[49,1,50,1],[52,0,53,0],[55,0,56,0],[58,0,61,0],[30,7,32,7],[11,0,11,5],[28,0,28,5],[8,0,8,6],[9,0,10,6],[13,0,15,0],[30,0,32,0]]}
[null,null,null,null,null,"File Number:",{"$f":"EBNUMBER","v":"EB-2016-0085"}]
[null,null,null,null,null,"Exhibit:",4]
[null,null,null,null,null,"Tab:"]
[null,null,null,null,null,"Schedule:"]
[null,null,null,null,null,"Page:"]
[]
[null,null,null,null,null,"Date:","Novemeber 28, 2016"]
[]
["Appendix 2-D"]
["Overhead Expense"]
[]
["Applicants are to provide a breakdown of OM&A before capitalization in the below table.  OM&A before capitalization may be broken down by cost center, program, drivers or another format best suited to focus on capitalized vs. uncapitalized OM&A."]
[]
[" OM&A Before Capitalization"]
[null,{"$f":"F15-4","v":2013},{"$f":"F15-3","v":2014},{"$f":"F15-2","v":2015},{"$f":"F15-1","v":2016},{"$f":"TestYear","v":2017}]
[null,"Historical Year","Historical Year","Historical Year","Bridge Year","Test Year"]
[]
[]
[]
[]
[]
[]
[]
[]
[]
[]
["Total OM&A Before Capitalization (B)",{"$f":"SUM(B17:B26)","v":0},{"$f":"SUM(C17:C26)","v":0},0,0,0]
[]
["Applicants are to provide a breakdown of capitalized OM&A in the below table.  Capitalized OM&A may be broken down using the categories listed in the table below if possible.  Otherwise, applicants are to provide its own break down of capitalized OM&A."]
[]
["Capitalized OM&A",null,null,null,null,null,"Directly","Explanation for Change in Overhead Capitalized"]
[null,{"$f":"F32-4","v":2013},{"$f":"F32-3","v":2014},{"$f":"F32-2","v":2015},{"$f":"F32-1","v":2016},{"$f":"TestYear","v":2017},"Attributable?"]
[null,"Historical Year","Historical Year","Historical Year","Bridge Year","Test Year","(Yes/No)"]
["employee benefits"]
["costs of site preparation"]
["initial delivery and handling costs"]
["costs of testing whether the asset is functioning properly"]
["professional fees"]
[]
["costs of opening a new facility"]
["costs of introducing a new product or service (including costs of advertising and promotional activities)"]
["costs of conducting business in a new location or with a new class of customer (including costs of staff training)"]
["administration and other general overhead costs"]
[]
["Insert description of additional item(s) and new rows if needed"]
[]
["Total Capitalized OM&A (A)",{"$f":"SUM(B34:B46)","v":0},{"$f":"SUM(C34:C46)","v":0},{"$f":"SUM(D34:D46)","v":0},{"$f":"SUM(E34:E46)","v":0},{"$f":"SUM(F34:F46)","v":0}]
[]
["% of Capitalized OM&A (=A/B)",{"$f":"IF(ISERROR(B47/B27),\"0%\",B47/B27)","v":"0%"},{"$f":"IF(ISERROR(C47/C27),\"0%\",C47/C27)","v":"0%"},"0%","0%","0%"]

{"sheet":"App.2-EA_Account 1575 (2015)","index":20,"n_rows":47,"n_cols":9,"rows_kept":47,"cut":false,"hidden":false,"merged":[[47,0,47,9],[52,0,53,8],[25,1,26,5],[31,1,31,5],[37,6,38,7],[37,8,38,8],[20,1,20,5],[8,0,8,8],[9,0,9,8],[10,0,10,8],[12,0,12,8],[14,0,14,8]]}
[null,null,null,null,null,null,null,"File Number:",{"$f":"EBNUMBER","v":"EB-2016-0085"}]
[null,null,null,null,null,null,null,"Exhibit:"]
[null,null,null,null,null,null,null,"Tab:"]
[null,null,null,null,null,null,null,"Schedule:"]
[null,null,null,null,null,null,null,"Page:"]
[]
[null,null,null,null,null,null,null,"Date:"]
[]
["Appendix 2-EA"]
["Account 1575 - IFRS-CGAAP Transitional PP&E Amounts"]
["2015 Adopters of IFRS for Financial Reporting Purposes"]
[]
["For applicants that adopted IFRS on January 1, 2015 for financial reporting purposes"]
[]
[]
[]
[null,{"$f":"RebaseYear &\" Rebasing Year\"","v":"2013 Rebasing Year"},{"$f":"TestYear-3","v":2014},{"$f":"TestYear-2","v":2015},{"$f":"CONCATENATE(TestYear-1,\" Bridge Year\")","v":"2016 Bridge Year"},{"$f":"CONCATENATE(TestYear,\" Rebasing Year\")","v":"2017 Rebasing Year"}]
["Reporting Basis","CGAAP","CGAAP","CGAAP","MIFRS","MIFRS"]
[null,"Forecast","Actual","Actual","Forecast","Forecast"]
[null,null,null,"$","$"]
["PP&E Values under CGAAP"]
["            Opening net PP&E - Note 1",null,null,{"$f":"+C25","v":0},{"$f":"+D25","v":0}]
["            Net Additions - Note 4"]
["            Net Depreciation (amounts should be negative) - Note 4"]
["            Closing net PP&E (1)",null,{"$f":"C22+C23+C24","v":0},{"$f":"SUM(D22:D24)","v":0},{"$f":"SUM(E22:E24)","v":0}]
[]
["PP&E Values under MIFRS (Starts from 2014, the transition year)"]
["            Opening net PP&E  - Note 1",null,null,{"$f":"+C31","v":0},{"$f":"+D31","v":0}]
["            Net Additions - Note 4"]
["            Net Depreciation (amounts should be negative) - Note 4"]
["            Closing net PP&E (2)",null,{"$f":"SUM(C28:C30)","v":0},{"$f":"SUM(D28:D30)","v":0},{"$f":"SUM(E28:E30)","v":0}]
[]
["Difference in Closing net PP&E, former CGAAP vs. revised CGAAP ",null,{"$f":"C25-C31","v":0},{"$f":"D25-D31","v":0},{"$f":"E25-E31","v":0}]
[]
[]
["Effect on Deferral and Variance Account Rate Riders"]
["Closing balance in Account 1576",null,null,null,null,{"$f":"IF(ISERROR(E33), 0, E33)","v":0},null,"WACC"]
["Return on Rate Base Associated with Account 1576 balance at WACC  - Note 2",null,null,null,null,{"$f":"E33*I37*I38","v":0},"# of years of rate rider disposition period"]
["     Amount included in Deferral and Variance Account Rate Rider Calculation",null,null,null,null,{"$f":"F37+F38","v":0}]
[]
["Notes:"]
["1  For an applicant that adopted IFRS on January 1, 2015, the PP&E values as of January 1, 2014 under both CGAAP and MIFRS should be the same. "]
["2 Return on rate base associated with deferred balance is calculated as:"]
["     the deferral account closing balance as of 2016 x WACC X # of years of rate rider disposition period"]
["     * Please note that the calculation should be adjusted once WACC is updated and finalized in the rate application."]
["3  The  PP&E deferral account is cleared by including the total balance in the deferral and variance account rate rider calculation."]
["4  Net additions are additions net of disposals; Net depreciation is additions to depreciation net of disposals."]

{"sheet":"App.2-EB_Account 1576 (2012)","index":21,"n_rows":48,"n_cols":11,"rows_kept":48,"cut":false,"hidden":false,"merged":[[41,0,41,10],[45,0,45,9],[31,1,31,7],[25,1,26,7],[20,1,20,7],[37,8,38,9],[37,10,38,10],[8,0,8,10],[9,0,9,10],[10,0,10,10],[14,0,14,10],[12,0,13,10]]}
[null,null,null,null,null,null,null,null,null,"File Number:",{"$f":"EBNUMBER","v":"EB-2016-0085"}]
[null,null,null,null,null,null,null,null,null,"Exhibit:"]
[null,null,null,null,null,null,null,null,null,"Tab:"]
[null,null,null,null,null,null,null,null,null,"Schedule:"]
[null,null,null,null,null,null,null,null,null,"Page:"]
[]
[null,null,null,null,null,null,null,null,null,"Date:"]
[]
["Appendix 2-EB"]
["Account 1576 - Accounting Changes under CGAAP"]
["2012 Changes in Accounting Policies under CGAAP"]
[]
["For applicants with a balance in Account 1576 and made capitalization and depreciation expense accounting policy changes under CGAAP effective January 1, 2012 "]
[]
[]
[]
[null,"2011 Rebasing Year",2012,2013,2014,2015,2016,"2017 Rebasing Year"]
["Reporting Basis","CGAAP","CGAAP","CGAAP","CGAAP","MIFRS - Note 5","MIFRS","MIFRS"]
[null,"Forecast","Actual","Actual","Actual","Actual","Forecast","Forecast"]
[null,null,"$","$","$",null,"$"]
["PP&E Values under former CGAAP"]
["            Opening net PP&E - Note 1",null,null,{"$f":"+C25","v":0},{"$f":"+D25","v":0},{"$f":"+D25","v":0},{"$f":"+E25","v":0}]
["            Net Additions - Note 4"]
["            Net Depreciation (amounts should be negative) - Note 4"]
["            Closing net PP&E (1)",null,{"$f":"C22+C23+C24","v":0},{"$f":"D22+D23+D24","v":0},{"$f":"E22+E23+E24","v":0},{"$f":"F22+F23+F24","v":0},{"$f":"G22+G23+G24","v":0}]
[]
["PP&E Values under revised CGAAP (Starts from 2012)"]
["            Opening net PP&E  - Note 1",null,null,{"$f":"+C31","v":0},{"$f":"+D31","v":0},{"$f":"+D31","v":0},{"$f":"+E31","v":0}]
["            Net Additions - Note 4"]
["            Net Depreciation (amounts should be negative) - Note 4"]
["            Closing net PP&E (2)",null,{"$f":"SUM(C28:C30)","v":0},{"$f":"SUM(D28:D30)","v":0},{"$f":"SUM(E28:E30)","v":0},{"$f":"SUM(F28:F30)","v":0},{"$f":"SUM(G28:G30)","v":0}]
[]
["Difference in Closing net PP&E, former CGAAP vs. revised CGAAP ",null,{"$f":"C25-C31","v":0},{"$f":"D25-D31","v":0},{"$f":"E25-E31","v":0},{"$f":"F25-F31","v":0},{"$f":"G25-G31","v":0}]
[]
[]
["Effect on Deferral and Variance Account Rate Riders"]
["Closing balance in Account 1576",null,null,null,null,null,null,{"$f":"IF(ISERROR(G33), 0, G33)","v":0},null,"WACC"]
["Return on Rate Base Associated with Account 1576 balance at WACC  - Note 2",null,null,null,null,null,null,{"$f":"G33*K37*K38","v":0},"# of years of rate rider disposition period"]
["     Amount included in Deferral and Variance Account Rate Rider Calculation",null,null,null,null,null,null,{"$f":"H37+H38","v":0}]
[]
["Notes:"]
["1  For an applicant that made the capitalization and depreciation expense accounting policy changes on January 1, 2012, the PP&E values as of January 1, 2012 under both former CGAAP and revised CGAAP should be the same. "]
["2 Return on rate base associated with Account 1576 balance is calculated as:"]
["     the variance account ending balance as of 2016 x WACC X # of years of rate rider disposition period"]
["     * Please note that the calculation should be adjusted once WACC is updated and finalized in the rate application."]
["3  Account 1576 is cleared by including the total balance in the deferral and variance account rate rider calculation."]
["4  Net additions are additions net of disposals; Net depreciation is additions to depreciation net of disposals."]
["5 Differences due to the adoption of MIFRS are to be shown separately in Account 1575 in Appendix 2-EA as Accounts 1575 and 1576 cannot be used interchangably."]

{"sheet":"App.2-EC_Account 1576 (2013)","index":22,"n_rows":48,"n_cols":10,"rows_kept":48,"cut":false,"hidden":false,"merged":[[41,0,41,9],[45,0,45,8],[20,1,20,6],[25,1,26,6],[31,1,31,6],[37,7,38,8],[37,9,38,9],[8,0,8,9],[9,0,9,9],[10,0,10,9],[12,0,12,9],[14,0,14,9]]}
[null,null,null,null,null,null,null,null,"File Number:",{"$f":"EBNUMBER","v":"EB-2016-0085"}]
[null,null,null,null,null,null,null,null,"Exhibit:"]
[null,null,null,null,null,null,null,null,"Tab:"]
[null,null,null,null,null,null,null,null,"Schedule:"]
[null,null,null,null,null,null,null,null,"Page:"]
[]
[null,null,null,null,null,null,null,null,"Date:"]
[]
["Appendix 2-EC"]
["Account 1576 - Accounting Changes under CGAAP"]
["2013 Changes in Accounting Policies under CGAAP"]
[]
["For applicants with a balance in Account 1576 and made capitalization and depreciation expense accounting policy changes under CGAAP effective January 1, 2013"]
[]
[]
[]
[null,"2012 Rebasing Year",2013,2014,2015,2016,"2017 Rebasing Year"]
["Reporting Basis","CGAAP","CGAAP","CGAAP","MIFRS - Note 5","MIFRS","MIFRS"]
[null,"Actual","Actual","Actual","Actual","Forecast","Forecast"]
[null,null,"$","$",null,"$"]
["PP&E Values under former CGAAP"]
["            Opening net PP&E - Note 1",null,null,{"$f":"+C25","v":0},{"$f":"+D25","v":0},{"$f":"+D25","v":0}]
["            Net Additions - Note 4"]
["            Net Depreciation (amounts should be negative) - Note 4"]
["            Closing net PP&E (1)",null,{"$f":"C22+C23+C24","v":0},{"$f":"D22+D23+D24","v":0},{"$f":"E22+E23+E24","v":0},{"$f":"F22+F23+F24","v":0}]
[]
["PP&E Values under revised CGAAP (Starts from 2012)"]
["            Opening net PP&E  - Note 1",null,null,{"$f":"+C31","v":0},{"$f":"+D31","v":0},{"$f":"+D31","v":0}]
["            Net Additions - Note 4"]
["            Net Depreciation (amounts should be negative) - Note 4"]
["            Closing net PP&E (2)",null,{"$f":"SUM(C28:C30)","v":0},{"$f":"SUM(D28:D30)","v":0},{"$f":"SUM(E28:E30)","v":0},{"$f":"SUM(F28:F30)","v":0}]
[]
["Difference in Closing net PP&E, former CGAAP vs. revised CGAAP ",null,{"$f":"C25-C31","v":0},{"$f":"D25-D31","v":0},{"$f":"E25-E31","v":0},{"$f":"F25-F31","v":0}]
[]
[]
["Effect on Deferral and Variance Account Rate Riders"]
["Closing balance in Account 1576",null,null,null,null,null,{"$f":"IF(ISERROR(F33), 0, F33)","v":0},null,"WACC"]
["Return on Rate Base Associated with Account 1576 balance at WACC  - Note 2",null,null,null,null,null,{"$f":"F33*J37*J38","v":0},"# of years of rate rider disposition period"]
["     Amount included in Deferral and Variance Account Rate Rider Calculation",null,null,null,null,null,{"$f":"G37+G38","v":0}]
[]
["Notes:"]
["1  For an applicant that made the capitalization and depreciation expense accounting policy changes on January 1, 2013, the PP&E values as of January 1, 2013 under both former CGAAP and revised CGAAP should be the same. "]
["2 Return on rate base associated with Account 1576 balance is calculated as:"]
["     the variance account ending balance as of 2016 x WACC X # of years of rate rider disposition period"]
["     * Please note that the calculation should be adjusted once WACC is updated and finalized in the rate application."]
["3  Account 1576 is cleared by including the total balance in the deferral and variance account rate rider calculation."]
["4  Net additions are additions net of disposals; Net depreciation is additions to depreciation net of disposals."]
["5 Differences due to the adoption of MIFRS are to be shown separately in Account 1575 in Appendix 2-EA as Accounts 1575 and 1576 cannot be used interchangably."]

{"sheet":"App.2-FA Proposed REG Invest.","index":23,"n_rows":101,"n_cols":11,"rows_kept":101,"cut":false,"hidden":false,"merged":[[8,0,8,10],[17,0,17,8],[16,0,16,9],[12,0,12,6],[13,0,13,5],[14,0,14,5],[11,0,11,6],[9,0,9,10]]}
[null,null,null,null,null,null,null,null,null,"File Number:",{"$f":"EBNUMBER","v":"EB-2016-0085"}]
[null,null,null,null,null,null,null,null,null,"Exhibit:"]
[null,null,null,null,null,null,null,null,null,"Tab:"]
[null,null,null,null,null,null,null,null,null,"Schedule:"]
[null,null,null,null,null,null,null,null,null,"Page:"]
[]
[null,null,null,null,null,null,null,null,null,"Date:"]
[]
["Appendix 2-FA"]
["Renewable Generation Connection Investment Summary (past investments or over the future rate setting period)"]
[]
["Enter the details of the Renewable Generation Connection projects as described in the appropriate section of the Filing Requirements."]
["All costs entered on this page will be transferred to the appropriate cells in the appendices that follow."]
["For Part A, Renewable Enabling Improvements (REI), these amounts will be transferred to Appendix 2 - FB"]
["For Part B, Expansions, these amounts will be transferred to Appendix 2 - FC"]
[]
["If there are more than five projects proposed to be in-service in a certain year, please amend the tables below and ensure that the formulae for the Total Amounts in any given rate year are updated."]
["Based on the current methodology and allocation, amounts allocated represent 6% for REI Connection Investments and 17% for Expansion Investments. (EB-2009-0349, 6-10-2010, p. 15, note 9)"]
[]
["There are two scenarios described below.  Separate sets of spreadsheets (2-FA, 2-FB, 2-FC) should be submited for each scenario as required."]
["Scenario 1:  Past Investments with No Recovery.  The distributor has made investments in the past (during the IRM Years), but has not received approval for these projects and therefore did not receive"]
["revenue from the IESO under Regulation 330/09 and did not receive ratepayer revenue for the direct benefit portion of the investment."]
["The WCA percentage, debt percentages, interest rates, kWh, tax rates, amortization period, CCA Class and percentage should correspond to the distributor's last Cost of Service approval. "]
["The Direct Benefit portion of the calculated Revenue Requirement for each year should be summed and can be applied for recovery from the distributor's ratepayers through a rate rider."]
["The Provincial Recovery portion of the calculated Revenue Requirement for each year should be summed and can be applied for recovery from the IESO through a separate order."]
[]
["Scenario 2:  Investments in the Test Year and Beyond.  Distributor plans to make investments in 2017 and/or beyond.  These investments should be added to 2-FA in the appropriate year."]
["The WCA percentage, debt percentages, interest rates, kWh, tax rates, amortization period, CCA Class and percentage should correspond to the distributor's current application. "]
[]
["Part A",null,null,null,null,null,"Test Year"]
["REI Investments (Direct Benefit at 6%)",null,{"$f":"D31-1","v":2013},{"$f":"E31-1","v":2014},{"$f":"F31-1","v":2015},{"$f":"G31-1","v":2016},{"$f":"TestYear","v":2017},{"$f":"G31+1","v":2018},{"$f":"H31+1","v":2019},{"$f":"I31+1","v":2020},{"$f":"J31+1","v":2021}]
["Project 1"]
["Name: REI Connection Project"]
["Capital Costs",null,0,0,0,0,0,0,0,0,0]
["OM&A (Start-Up)",null,0,0,0,0,0,0,0,0,0]
["OM&A (Ongoing)",null,0,0,0,0,0,0,0,0,0]
[]
["Project 2"]
["Name: REI Connection Project"]
["Capital Costs",null,0,0,0,0,0,0,0,0,0]
["OM&A (Start-Up)",null,0,0,0,0,0,0,0,0,0]
["OM&A (Ongoing)",null,0,0,0,0,0,0,0,0,0]
[]
["Project 3"]
["Name: REI Connection Project"]
["Capital Costs",null,0,0,0,0,0,0,0,0,0]
["OM&A (Start-Up)",null,0,0,0,0,0,0,0,0,0]
["OM&A (Ongoing)",null,0,0,0,0,0,0,0,0,0]
[]
["Project 4"]
["Name: REI Connection Project"]
["Capital Costs",null,0,0,0,0,0,0,0,0,0]
["OM&A (Start-Up)",null,0,0,0,0,0,0,0,0,0]
["OM&A (Ongoing)",null,0,0,0,0,0,0,0,0,0]
[]
["Project 5"]
["Name: REI Connection Project"]
["Capital Costs",null,0,0,0,0,0,0,0,0,0]
["OM&A (Start-Up)",null,0,0,0,0,0,0,0,0,0]
["OM&A (Ongoing)",null,0,0,0,0,0,0,0,0,0]
[]
["Total Capital Costs",null,{"$f":"SUM(C58,C52,C46,C40,C34)","v":0},0,0,0,{"$f":"SUM(G58,G52,G46,G40,G34)","v":0},{"$f":"SUM(H58,H52,H46,H40,H34)","v":0},0,0,0]
["Total OM&A (Start-Up)",null,0,0,0,0,{"$f":"SUM(G59,G53,G47,G41,G35)","v":0},0,0,0,0]
["Total OM&A (Ongoing)",null,0,0,0,0,{"$f":"SUM(G60,G54,G48,G42,G36)","v":0},0,0,0,0]
[]
[]
["Part B",null,null,null,null,null,"Test Year"]
["Expansion Investments (Direct Benefit at 17%)",null,{"$f":"D68-1","v":2013},{"$f":"E68-1","v":2014},{"$f":"F68-1","v":2015},{"$f":"G68-1","v":2016},{"$f":"TestYear","v":2017},{"$f":"G68+1","v":2018},{"$f":"H68+1","v":2019},2020,2021]
["Project 1"]
["Name: Expansion Connection Project"]
["Capital Costs",null,0,0,0,0,0,0,0,0,0]
["OM&A (Start-Up)",null,0,0,0,0,0,0,0,0,0]
["OM&A (Ongoing)",null,0,0,0,0,0,0,0,0,0]
[]
["Project 2"]
["Name: Expansion Connection Project"]
["Capital Costs",null,0,0,0,0,0,0,0,0,0]
["OM&A (Start-Up)",null,0,0,0,0,0,0,0,0,0]
["OM&A (Ongoing)",null,0,0,0,0,0,0,0,0,0]
[]
["Project 3"]
["Name: Expansion Connection Project"]
["Capital Costs",null,0,0,0,0,0,0,0,0,0]
["OM&A (Start-Up)",null,0,0,0,0,0,0,0,0,0]
["OM&A (Ongoing)",null,0,0,0,0,0,0,0,0,0]
[]
["Project 4"]
["Name: Expansion Connection Project"]
["Capital Costs",null,0,0,0,0,0,0,0,0,0]
["OM&A (Start-Up)",null,0,0,0,0,0,0,0,0,0]
["OM&A (Ongoing)",null,0,0,0,0,0,0,0,0,0]
[]
["Project 5"]
["Name: Expansion Connection Project"]
["Capital Costs",null,0,0,0,0,0,0,0,0,0]
["OM&A (Start-Up)",null,0,0,0,0,0,0,0,0,0]
["OM&A (Ongoing)",null,0,0,0,0,0,0,0,0,0]
[]
["Total Capital Costs",null,{"$f":"SUM(C95,C89,C83,C77,C71)","v":0},0,0,0,{"$f":"SUM(G95,G89,G83,G77,G71)","v":0},{"$f":"SUM(H95,H89,H83,H77,H71)","v":0},0,0,0]
["Total OM&A (Start-Up)",null,0,0,0,0,{"$f":"SUM(G96,G90,G84,G78,G72)","v":0},0,0,0,0]
["Total OM&A (Ongoing)",null,0,0,0,0,{"$f":"SUM(G97,G91,G85,G79,G73)","v":0},0,0,0,0]

{"sheet":"App.2-FB Calc of REG Improvemnt","index":24,"n_rows":95,"n_cols":29,"rows_kept":95,"cut":false,"hidden":false,"merged":[[16,26,16,28],[8,0,8,17],[9,0,9,17],[11,0,11,17],[12,0,12,17],[14,0,14,17],[46,0,46,22],[16,14,16,16],[16,17,16,19],[16,20,16,22],[16,23,16,25],[16,11,16,13],[16,8,16,10],[16,5,16,7],[16,2,16,4],[51,24,51,25],[51,27,51,28],[48,0,48,22],[49,0,49,1],[51,15,51,16],[51,18,51,19],[51,21,51,22],[51,12,51,13],[51,9,51,10],[51,6,51,7],[51,3,51,4]]}
[null,null,null,null,null,null,null,null,null,null,null,null,null,"File Number:",{"$f":"EBNUMBER","v":"EB-2016-0085"}]
[null,null,null,null,null,null,null,null,null,null,null,null,null,"Exhibit:"]
[null,null,null,null,null,null,null,null,null,null,null,null,null,"Tab:"]
[null,null,null,null,null,null,null,null,null,null,null,null,null,"Schedule:"]
[null,null,null,null,null,null,null,null,null,null,null,null,null,"Page:"]
[]
[null,null,null,null,null,null,null,null,null,null,null,null,null,"Date:"]
[]
["Appendix 2-FB"]
["Calculation of Renewable Generation Connection Direct Benefits/Provincial Amount: Renewable Enabling Improvement Investments"]
[]
["This table will calculate the distributor/provincial shares of the investments entered in Part A of Appendix 2-FA."]
["Enter values in green shaded cells: WCA percentage, debt percentages, interest rates, kWh, tax rates, amortization period, CCA Class and percentage."]
["For historical investments, enter these variables for your last cost of service test year.  For 2017 and beyond, enter variables as in the application."]
["Rate Riders are not calculated for the Test Year as these assets and costs are already in the distributor's rate base/revenue requirement."]
[]
[null,null,{"$f":"F17-1","v":2013},null,null,{"$f":"I17-1","v":2014},null,null,{"$f":"L17-1","v":2015},null,null,{"$f":"BridgeYear","v":2016},null,null,{"$f":"CONCATENATE(TestYear,\" Test Year\")","v":"2017 Test Year"},null,null,{"$f":"TestYear+1","v":2018},null,null,{"$f":"R17+1","v":2019},2016,null,{"$f":"U17+1","v":2020},null,null,{"$f":"X17+1","v":2021}]
[null,null,null,"Direct Benefit","Provincial",null,"Direct Benefit","Provincial",null,"Direct Benefit","Provincial",null,"Direct Benefit","Provincial",null,"Direct Benefit","Provincial",null,"Direct Benefit","Provincial",null,"Direct Benefit","Provincial",null,"Direct Benefit","Provincial",null,"Direct Benefit","Provincial"]
[null,null,"Total",0.06,0.94,"Total",0.06,0.94,"Total",0.06,0.94,"Total",0.06,0.94,"Total",0.06,0.94,"Total",0.06,0.94,"Total",0.06,0.94,"Total",0.06,0.94,"Total",0.06,0.94]
["Net Fixed Assets (average)",null,{"$f":"D82","v":0},{"$f":"C20*D19","v":0},{"$f":"C20*E19","v":0},{"$f":"E82","v":0},{"$f":"F20*G19","v":0},{"$f":"F20*H19","v":0},{"$f":"F82","v":0},{"$f":"I20*J19","v":0},{"$f":"I20*K19","v":0},{"$f":"G82","v":0},{"$f":"L20*M19","v":0},{"$f":"L20*N19","v":0},{"$f":"H82","v":0},{"$f":"O20*P19","v":0},{"$f":"O20*Q19","v":0},{"$f":"I82","v":0},{"$f":"R20*S19","v":0},{"$f":"R20*T19","v":0},{"$f":"J82","v":0},{"$f":"U20*V19","v":0},{"$f":"U20*W19","v":0},{"$f":"K82","v":0},{"$f":"X20*Y19","v":0},{"$f":"X20*Z19","v":0},{"$f":"L82","v":0},{"$f":"AA20*AB19","v":0},{"$f":"AA20*AC19","v":0}]
["Incremental OM&A (on-going, N/A for Provincial Recovery)",null,{"$f":"'App.2-FA Proposed REG Invest.'!C64","v":0},{"$f":"C21","v":0},null,{"$f":"'App.2-FA Proposed REG Invest.'!D64","v":0},{"$f":"F21","v":0},null,{"$f":"'App.2-FA Proposed REG Invest.'!E64","v":0},{"$f":"I21","v":0},null,{"$f":"'App.2-FA Proposed REG Invest.'!F64","v":0},{"$f":"L21","v":0},null,{"$f":"'App.2-FA Proposed REG Invest.'!G64","v":0},{"$f":"O21","v":0},null,{"$f":"'App.2-FA Proposed REG Invest.'!H64","v":0},{"$f":"R21","v":0},null,{"$f":"'App.2-FA Proposed REG Invest.'!I64","v":0},{"$f":"U21","v":0},null,{"$f":"'App.2-FA Proposed REG Invest.'!J64","v":0},{"$f":"X21","v":0},null,{"$f":"'App.2-FA Proposed REG Invest.'!K64","v":0},{"$f":"AA21","v":0}]
["Incremental OM&A (start-up, applicable for Provincial Recovery)",null,{"$f":"'App.2-FA Proposed REG Invest.'!C63","v":0},{"$f":"C22*D19","v":0},{"$f":"C22*E19","v":0},{"$f":"'App.2-FA Proposed REG Invest.'!D63","v":0},{"$f":"F22*G19","v":0},{"$f":"F22*H19","v":0},{"$f":"'App.2-FA Proposed REG Invest.'!E63","v":0},{"$f":"I22*J19","v":0},{"$f":"I22*K19","v":0},{"$f":"'App.2-FA Proposed REG Invest.'!F63","v":0},{"$f":"L22*M19","v":0},{"$f":"L22*N19","v":0},{"$f":"'App.2-FA Proposed REG Invest.'!G63","v":0},{"$f":"O22*P19","v":0},{"$f":"O22*Q19","v":0},{"$f":"'App.2-FA Proposed REG Invest.'!H63","v":0},{"$f":"R22*S19","v":0},{"$f":"R22*T19","v":0},{"$f":"'App.2-FA Proposed REG Invest.'!I63","v":0},{"$f":"U22*V19","v":0},{"$f":"U22*W19","v":0},{"$f":"'App.2-FA Proposed REG Invest.'!J63","v":0},{"$f":"X22*Y19","v":0},{"$f":"X22*Z19","v":0},{"$f":"'App.2-FA Proposed REG Invest.'!K63","v":0},{"$f":"AA22*AB19","v":0},{"$f":"AA22*AC19","v":0}]
["WCA",null,null,{"$f":"(D21+D22)*$B$23","v":0},{"$f":"E22*$B$23","v":0},null,{"$f":"(G21+G22)*$B$23","v":0},{"$f":"H22*$B$23","v":0},null,{"$f":"(J21+J22)*$B$23","v":0},{"$f":"K22*$B$23","v":0},null,{"$f":"(M21+M22)*$B$23","v":0},{"$f":"N22*$B$23","v":0},null,{"$f":"(P21+P22)*$B$23","v":0},{"$f":"Q22*$B$23","v":0},null,{"$f":"(S21+S22)*$B$23","v":0},{"$f":"T22*$B$23","v":0},null,{"$f":"(V21+V22)*$B$23","v":0},{"$f":"W22*$B$23","v":0},null,{"$f":"(Y21+Y22)*$B$23","v":0},{"$f":"Z22*$B$23","v":0},null,{"$f":"(AB21+AB22)*$B$23","v":0},{"$f":"AC22*$B$23","v":0}]
["Rate Base",null,null,{"$f":"SUM(D20+D23)","v":0},{"$f":"SUM(E20+E23)","v":0},null,{"$f":"SUM(G20+G23)","v":0},{"$f":"SUM(H20+H23)","v":0},null,{"$f":"SUM(J20+J23)","v":0},{"$f":"SUM(K20+K23)","v":0},null,{"$f":"SUM(M20+M23)","v":0},{"$f":"SUM(N20+N23)","v":0},null,{"$f":"SUM(P20+P23)","v":0},{"$f":"SUM(Q20+Q23)","v":0},null,{"$f":"SUM(S20+S23)","v":0},{"$f":"SUM(T20+T23)","v":0},null,{"$f":"SUM(V20+V23)","v":0},{"$f":"SUM(W20+W23)","v":0},null,{"$f":"SUM(Y20+Y23)","v":0},{"$f":"SUM(Z20+Z23)","v":0},null,{"$f":"SUM(AB20+AB23)","v":0},{"$f":"SUM(AC20+AC23)","v":0}]
[]
[]
["Deemed ST Debt",null,null,{"$f":"D24*$B$27","v":0},{"$f":"E24*$B$27","v":0},null,{"$f":"G24*$B$27","v":0},{"$f":"H24*$B$27","v":0},null,{"$f":"J24*$B$27","v":0},{"$f":"K24*$B$27","v":0},null,{"$f":"M24*$B$27","v":0},{"$f":"N24*$B$27","v":0},null,{"$f":"P24*$B$27","v":0},{"$f":"Q24*$B$27","v":0},null,{"$f":"S24*$B$27","v":0},{"$f":"T24*$B$27","v":0},null,{"$f":"V24*$B$27","v":0},{"$f":"W24*$B$27","v":0},null,{"$f":"Y24*$B$27","v":0},{"$f":"Z24*$B$27","v":0},null,{"$f":"AB24*$B$27","v":0},{"$f":"AC24*$B$27","v":0}]
["Deemed LT Debt",null,null,{"$f":"D24*$B$28","v":0},{"$f":"E24*$B$28","v":0},null,{"$f":"G24*$B$28","v":0},{"$f":"H24*$B$28","v":0},null,{"$f":"J24*$B$28","v":0},{"$f":"K24*$B$28","v":0},null,{"$f":"M24*$B$28","v":0},{"$f":"N24*$B$28","v":0},null,{"$f":"P24*$B$28","v":0},{"$f":"Q24*$B$28","v":0},null,{"$f":"S24*$B$28","v":0},{"$f":"T24*$B$28","v":0},null,{"$f":"V24*$B$28","v":0},{"$f":"W24*$B$28","v":0},null,{"$f":"Y24*$B$28","v":0},{"$f":"Z24*$B$28","v":0},null,{"$f":"AB24*$B$28","v":0},{"$f":"AC24*$B$28","v":0}]
["Deemed Equity",null,null,{"$f":"D24*$B$29","v":0},{"$f":"E24*$B$29","v":0},null,{"$f":"G24*$B$29","v":0},{"$f":"H24*$B$29","v":0},null,{"$f":"J24*$B$29","v":0},{"$f":"K24*$B$29","v":0},null,{"$f":"M24*$B$29","v":0},{"$f":"N24*$B$29","v":0},null,{"$f":"P24*$B$29","v":0},{"$f":"Q24*$B$29","v":0},null,{"$f":"S24*$B$29","v":0},{"$f":"T24*$B$29","v":0},null,{"$f":"V24*$B$29","v":0},{"$f":"W24*$B$29","v":0},null,{"$f":"Y24*$B$29","v":0},{"$f":"Z24*$B$29","v":0},null,{"$f":"AB24*$B$29","v":0},{"$f":"AC24*$B$29","v":0}]
[]
["ST Interest",null,null,{"$f":"D27*$B31","v":0},{"$f":"E27*$B31","v":0},null,{"$f":"G27*$B31","v":0},{"$f":"H27*$B31","v":0},null,{"$f":"J27*$B31","v":0},{"$f":"K27*$B31","v":0},null,{"$f":"M27*$B31","v":0},{"$f":"N27*$B31","v":0},null,{"$f":"P27*$B31","v":0},{"$f":"Q27*$B31","v":0},null,{"$f":"S27*$B31","v":0},{"$f":"T27*$B31","v":0},null,{"$f":"V27*$B31","v":0},{"$f":"W27*$B31","v":0},null,{"$f":"Y27*$B31","v":0},{"$f":"Z27*$B31","v":0},null,{"$f":"AB27*$B31","v":0},{"$f":"AC27*$B31","v":0}]
["LT Interest",null,null,{"$f":"D28*$B32","v":0},0,null,{"$f":"G28*$B32","v":0},0,null,{"$f":"J28*$B32","v":0},0,null,{"$f":"M28*$B32","v":0},0,null,{"$f":"P28*$B32","v":0},0,null,{"$f":"S28*$B32","v":0},0,null,{"$f":"V28*$B32","v":0},0,null,{"$f":"Y28*$B32","v":0},0,null,{"$f":"AB28*$B32","v":0},0]
["ROE",null,null,0,0,null,0,0,null,0,0,null,0,0,null,0,0,null,0,0,null,0,0,null,0,0,null,0,0]
["Cost of Capital Total",null,null,{"$f":"SUM(D31:D33)","v":0},{"$f":"SUM(E31:E33)","v":0},null,{"$f":"SUM(G31:G33)","v":0},{"$f":"SUM(H31:H33)","v":0},null,{"$f":"SUM(J31:J33)","v":0},{"$f":"SUM(K31:K33)","v":0},null,{"$f":"SUM(M31:M33)","v":0},{"$f":"SUM(N31:N33)","v":0},null,{"$f":"SUM(P31:P33)","v":0},{"$f":"SUM(Q31:Q33)","v":0},null,{"$f":"SUM(S31:S33)","v":0},{"$f":"SUM(T31:T33)","v":0},null,{"$f":"SUM(V31:V33)","v":0},{"$f":"SUM(W31:W33)","v":0},null,{"$f":"SUM(Y31:Y33)","v":0},{"$f":"SUM(Z31:Z33)","v":0},null,{"$f":"SUM(AB31:AB33)","v":0},{"$f":"SUM(AC31:AC33)","v":0}]
[]
["OM&A",null,null,{"$f":"D21+D22","v":0},{"$f":"E22","v":0},null,{"$f":"G21+G22","v":0},{"$f":"H22","v":0},null,{"$f":"J21+J22","v":0},{"$f":"K22","v":0},null,{"$f":"M21+M22","v":0},{"$f":"N22","v":0},null,{"$f":"P21+P22","v":0},{"$f":"Q22","v":0},null,{"$f":"S21+S22","v":0},{"$f":"T22","v":0},null,{"$f":"V21+V22","v":0},{"$f":"W22","v":0},null,{"$f":"Y21+Y22","v":0},{"$f":"Z22","v":0},null,{"$f":"AB21+AB22","v":0},{"$f":"AC22","v":0}]
["Amortization",null,{"$f":"D77","v":0},{"$f":"C37*D$19","v":0},{"$f":"C37*E$19","v":0},{"$f":"E77","v":0},{"$f":"F37*G$19","v":0},{"$f":"F37*H$19","v":0},{"$f":"F77","v":0},{"$f":"I37*J$19","v":0},{"$f":"I37*K$19","v":0},{"$f":"G77","v":0},{"$f":"L37*M$19","v":0},{"$f":"L37*N$19","v":0},{"$f":"H77","v":0},{"$f":"O37*P$19","v":0},{"$f":"O37*Q$19","v":0},{"$f":"I76+I77","v":0},{"$f":"R37*S$19","v":0},{"$f":"R37*T$19","v":0},{"$f":"J76+J77","v":0},{"$f":"U37*V$19","v":0},{"$f":"U37*W$19","v":0},{"$f":"K76+K77","v":0},{"$f":"X37*Y$19","v":0},{"$f":"X37*Z$19","v":0},{"$f":"L76+L77","v":0},{"$f":"AA37*AB$19","v":0},{"$f":"AA37*AC$19","v":0}]
["Grossed-up PILs",null,null,{"$f":"D65","v":0},{"$f":"E65","v":0},null,{"$f":"G65","v":0},{"$f":"H65","v":0},null,{"$f":"J65","v":0},{"$f":"K65","v":0},null,{"$f":"M65","v":0},{"$f":"N65","v":0},null,{"$f":"P65","v":0},{"$f":"Q65","v":0},null,{"$f":"S65","v":0},{"$f":"T65","v":0},null,{"$f":"V65","v":0},{"$f":"W65","v":0},null,{"$f":"Y65","v":0},{"$f":"Z65","v":0},null,{"$f":"AB65","v":0},{"$f":"AC65","v":0}]
[]
["Revenue Requirement",null,null,{"$f":"SUM(D34:D38)","v":0},{"$f":"SUM(E34:E38)","v":0},null,{"$f":"SUM(G34:G38)","v":0},{"$f":"SUM(H34:H38)","v":0},null,{"$f":"SUM(J34:J38)","v":0},{"$f":"SUM(K34:K38)","v":0},null,{"$f":"SUM(M34:M38)","v":0},{"$f":"SUM(N34:N38)","v":0},null,{"$f":"SUM(P34:P38)","v":0},{"$f":"SUM(Q34:Q38)","v":0},null,{"$f":"SUM(S34:S38)","v":0},{"$f":"SUM(T34:T38)","v":0},null,{"$f":"SUM(V34:V38)","v":0},{"$f":"SUM(W34:W38)","v":0},null,{"$f":"SUM(Y34:Y38)","v":0},{"$f":"SUM(Z34:Z38)","v":0},null,{"$f":"SUM(AB34:AB38)","v":0},{"$f":"SUM(AC34:AC38)","v":0}]
[]
[]
["Provincial Rate Protection",null,null,null,{"$f":"E40","v":0},null,null,{"$f":"H40","v":0},null,null,{"$f":"K40","v":0},null,null,{"$f":"N40","v":0},null,null,{"$f":"Q40","v":0},null,null,{"$f":"T40","v":0},null,null,{"$f":"W40","v":0},null,null,{"$f":"Z40","v":0},null,null,{"$f":"AC40","v":0}]
[]
["Monthly Amount Paid by IESO",null,null,null,{"$f":"E43/12","v":0},null,null,{"$f":"H43/12","v":0},null,null,{"$f":"K43/12","v":0},null,null,{"$f":"N43/12","v":0},null,null,{"$f":"Q43/12","v":0},null,null,{"$f":"T43/12","v":0},null,null,{"$f":"W43/12","v":0},null,null,{"$f":"Z43/12","v":0},null,null,{"$f":"AC43/12","v":0}]
[]
["Note 1: The difference between the actual costs of approved eligible investments and revenue received from the IESO should be recorded in a variance account.  The Board may provide "]
["regulatory accounting guidance regarding a variance account either in an individual proceeding or on a generic basis."]
["Note 2: For the 2016 Test Year, Costs and Revenues of the Direct Benefit are to be included in the test year applicant Rate Base and Revenues.  "]
[]
["PILs Calculation"]
[null,null,null,{"$f":"C17","v":2013},null,null,{"$f":"F17","v":2014},null,null,{"$f":"I17","v":2015},null,null,{"$f":"L17","v":2016},null,null,{"$f":"O17","v":"2017 Test Year"},null,null,{"$f":"R17","v":2018},null,null,{"$f":"U17","v":2019},null,null,{"$f":"X17","v":2020},null,null,{"$f":"AA17","v":2021}]
["Income Tax",null,null,"Direct Benefit","Provincial",null,"Direct Benefit","Provincial",null,"Direct Benefit","Provincial",null,"Direct Benefit","Provincial",null,"Direct Benefit","Provincial",null,"Direct Benefit","Provincial",null,"Direct Benefit","Provincial",null,"Direct Benefit","Provincial",null,"Direct Benefit","Provincial"]
[null,null,null,null,null,null,null,null,null,null,null,null,null,null,null,null,null,null,null,null,null,null,null,"Total",null,null,"Total"]
["Net Income - ROE on Rate Base",null,null,{"$f":"D33","v":0},{"$f":"E33","v":0},null,{"$f":"G33","v":0},{"$f":"H33","v":0},null,{"$f":"J33","v":0},{"$f":"K33","v":0},null,{"$f":"M33","v":0},{"$f":"N33","v":0},null,{"$f":"P33","v":0},{"$f":"Q33","v":0},null,{"$f":"S33","v":0},{"$f":"T33","v":0},null,{"$f":"V33","v":0},{"$f":"W33","v":0},null,{"$f":"Y33","v":0},{"$f":"Z33","v":0},null,{"$f":"AB33","v":0},{"$f":"AC33","v":0}]
["Amortization (6% DB and 94% P)",null,null,{"$f":"D37","v":0},{"$f":"E37","v":0},null,{"$f":"G37","v":0},{"$f":"H37","v":0},null,{"$f":"J37","v":0},{"$f":"K37","v":0},null,{"$f":"M37","v":0},{"$f":"N37","v":0},null,{"$f":"P37","v":0},{"$f":"Q37","v":0},null,{"$f":"S37","v":0},{"$f":"T37","v":0},null,{"$f":"V37","v":0},{"$f":"W37","v":0},null,{"$f":"Y37","v":0},{"$f":"Z37","v":0},null,{"$f":"AB37","v":0},{"$f":"AC37","v":0}]
["CCA (6% DB and 94% P)",null,null,{"$f":"-D94*D$19","v":0},{"$f":"-D94*E$19","v":0},null,{"$f":"-E94*G19","v":0},{"$f":"-E94*H$19","v":0},null,{"$f":"-F94*J$19","v":0},{"$f":"-F94*K$19","v":0},null,{"$f":"-G94*M$19","v":0},{"$f":"-G94*N$19","v":0},null,{"$f":"-H94*P$19","v":0},{"$f":"-H94*Q$19","v":0},null,{"$f":"-I94*S$19","v":0},{"$f":"-I94*T$19","v":0},null,{"$f":"-J94*V$19","v":0},{"$f":"-J94*W$19","v":0},null,{"$f":"-K94*Y$19","v":0},{"$f":"-K94*Z$19","v":0},null,{"$f":"-L94*AB$19","v":0},{"$f":"-L94*AC$19","v":0}]
["Taxable income",null,null,{"$f":"SUM(D55:D57)","v":0},{"$f":"SUM(E55:E57)","v":0},null,{"$f":"SUM(G55:G57)","v":0},{"$f":"SUM(H55:H57)","v":0},null,{"$f":"SUM(J55:J57)","v":0},{"$f":"SUM(K55:K57)","v":0},null,{"$f":"SUM(M55:M57)","v":0},{"$f":"SUM(N55:N57)","v":0},null,{"$f":"SUM(P55:P57)","v":0},{"$f":"SUM(Q55:Q57)","v":0},null,{"$f":"SUM(S55:S57)","v":0},{"$f":"SUM(T55:T57)","v":0},null,{"$f":"SUM(V55:V57)","v":0},{"$f":"SUM(W55:W57)","v":0},null,{"$f":"SUM(Y55:Y57)","v":0},{"$f":"SUM(Z55:Z57)","v":0},null,{"$f":"SUM(AB55:AB57)","v":0},{"$f":"SUM(AC55:AC57)","v":0}]
[]
["Tax Rate  (to be entered)"]
[]
["Income Taxes Payable",null,null,{"$f":"D58*D60","v":0},{"$f":"E58*E60","v":0},null,{"$f":"G58*G60","v":0},{"$f":"H58*H60","v":0},null,{"$f":"J58*J60","v":0},{"$f":"K58*K60","v":0},null,{"$f":"M58*M60","v":0},{"$f":"N58*N60","v":0},null,{"$f":"P58*P60","v":0},{"$f":"Q58*Q60","v":0},null,{"$f":"S58*S60","v":0},{"$f":"T58*T60","v":0},null,{"$f":"V58*V60","v":0},{"$f":"W58*W60","v":0},null,{"$f":"Y58*Y60","v":0},{"$f":"Z58*Z60","v":0},null,{"$f":"AB58*AB60","v":0},{"$f":"AC58*AC60","v":0}]
["Gross Up"]
["Income Taxes Payable",null,null,{"$f":"D62/(1-D60)","v":0},{"$f":"E62/(1-E60)","v":0},null,{"$f":"G62/(1-G60)","v":0},{"$f":"H62/(1-H60)","v":0},null,{"$f":"J62/(1-J60)","v":0},{"$f":"K62/(1-K60)","v":0},null,{"$f":"M62/(1-M60)","v":0},{"$f":"N62/(1-N60)","v":0},null,{"$f":"P62/(1-P60)","v":0},{"$f":"Q62/(1-Q60)","v":0},null,{"$f":"S62/(1-S60)","v":0},{"$f":"T62/(1-T60)","v":0},null,{"$f":"V62/(1-V60)","v":0},{"$f":"W62/(1-W60)","v":0},null,{"$f":"Y62/(1-Y60)","v":0},{"$f":"Z62/(1-Z60)","v":0},null,{"$f":"AB62/(1-AB60)","v":0},{"$f":"AC62/(1-AC60)","v":0}]
["Grossed Up PILs",null,null,{"$f":"SUM(D64:D64)","v":0},{"$f":"SUM(E64:E64)","v":0},null,{"$f":"SUM(G64:G64)","v":0},{"$f":"SUM(H64:H64)","v":0},null,{"$f":"SUM(J64:J64)","v":0},{"$f":"SUM(K64:K64)","v":0},null,{"$f":"SUM(M64:M64)","v":0},{"$f":"SUM(N64:N64)","v":0},null,{"$f":"SUM(P64:P64)","v":0},{"$f":"SUM(Q64:Q64)","v":0},null,{"$f":"SUM(S64:S64)","v":0},{"$f":"SUM(T64:T64)","v":0},null,{"$f":"SUM(V64:V64)","v":0},{"$f":"SUM(W64:W64)","v":0},null,{"$f":"SUM(Y64:Y64)","v":0},{"$f":"SUM(Z64:Z64)","v":0},null,{"$f":"SUM(AB64:AB64)","v":0},{"$f":"SUM(AC64:AC64)","v":0}]
[]
[]
[null,null,null,{"$f":"E68-1","v":2013},{"$f":"F68-1","v":2014},{"$f":"G68-1","v":2015},{"$f":"H68-1","v":2016},{"$f":"TestYear","v":2017},{"$f":"H68+1","v":2018},{"$f":"I68+1","v":2019},{"$f":"J68+1","v":2020},{"$f":"K68+1","v":2021}]
["Net Fixed Assets"]
[null,"Enter applicable amortization in years:",25]
["Opening Gross Fixed Assets",null,null,null,{"$f":"D73","v":0},0,0,0,{"$f":"H73","v":0},{"$f":"I73","v":0},{"$f":"J73","v":0},{"$f":"K73","v":0}]
["Gross Capital Additions",null,null,{"$f":"'App.2-FA Proposed REG Invest.'!C62","v":0},{"$f":"'App.2-FA Proposed REG Invest.'!D62","v":0},{"$f":"'App.2-FA Proposed REG Invest.'!E62","v":0},{"$f":"'App.2-FA Proposed REG Invest.'!F62","v":0},{"$f":"'App.2-FA Proposed REG Invest.'!G62","v":0},{"$f":"'App.2-FA Proposed REG Invest.'!H62","v":0},{"$f":"'App.2-FA Proposed REG Invest.'!I62","v":0},{"$f":"'App.2-FA Proposed REG Invest.'!J62","v":0},{"$f":"'App.2-FA Proposed REG Invest.'!K62","v":0}]
["Closing Gross Fixed Assets",null,null,{"$f":"SUM(D71:D72)","v":0},0,0,0,{"$f":"SUM(H71:H72)","v":0},{"$f":"SUM(I71:I72)","v":0},0,0,0]
[]
["Opening Accumulated Amortization",null,null,null,{"$f":"+D78","v":0},{"$f":"E78","v":0},0,0,0,0,0,0]
["Current Year Amortization (before additions)",null,null,{"$f":"IF(ISERROR(D71/$C$70), 0, D71/$C$70)","v":0},0,0,0,0,{"$f":"IF(ISERROR(I71/$C$70), 0, I71/$C$70)","v":0},{"$f":"IF(ISERROR(J71/$C$70), 0, J71/$C$70)","v":0},{"$f":"IF(ISERROR(K71/$C$70), 0, K71/$C$70)","v":0},{"$f":"IF(ISERROR(L71/$C$70), 0, L71/$C$70)","v":0}]
["Additions (half year)",null,null,{"$f":"D72/$C$70/2","v":0},{"$f":"E72/$C$70/2","v":0},{"$f":"F72/$C$70/2","v":0},0,{"$f":"H72/$C$70/2","v":0},{"$f":"I72/C70/2","v":0},{"$f":"J72/C70/2","v":0},{"$f":"K72/C70/2","v":0},{"$f":"L72/C70/2","v":0}]
["Closing Accumulated Amortization",null,null,{"$f":"SUM(D75+D76+D77)","v":0},{"$f":"SUM(E75+E76+E77)","v":0},{"$f":"SUM(F75+F76+F77)","v":0},{"$f":"SUM(G75+G76+G77)","v":0},{"$f":"SUM(H75+H76+H77)","v":0},{"$f":"SUM(I75:I77)","v":0},{"$f":"SUM(J75:J77)","v":0},{"$f":"SUM(K75:K77)","v":0},{"$f":"SUM(L75:L77)","v":0}]
[]
["Opening Net Fixed Assets",null,null,{"$f":"D71-D75","v":0},0,{"$f":"F71-F75","v":0},0,{"$f":"H71-H75","v":0},{"$f":"H81","v":0},{"$f":"I81","v":0},{"$f":"J81","v":0},{"$f":"K81","v":0}]
["Closing Net Fixed Assets",null,null,{"$f":"D73-D78","v":0},{"$f":"E73-E78","v":0},0,0,{"$f":"H73-H78","v":0},{"$f":"I73-I78","v":0},{"$f":"J73-J78","v":0},{"$f":"K73-K78","v":0},{"$f":"L73-L78","v":0}]
["Average Net Fixed Assets",null,null,{"$f":"SUM(D80:D81)/2","v":0},0,0,0,{"$f":"SUM(H80:H81)/2","v":0},{"$f":"SUM(I80:I81)/2","v":0},{"$f":"SUM(J80:J81)/2","v":0},{"$f":"SUM(K80:K81)/2","v":0},{"$f":"SUM(L80:L81)/2","v":0}]
[]
["UCC for PILs Calculation"]
[null,null,null,{"$f":"D68","v":2013},{"$f":"E68","v":2014},2015,2016,2017,2018,2019,2020,2021]
[]
["Opening UCC",null,null,null,{"$f":"D95","v":0},0,0,0,0,0,0,0]
["Capital Additions (from Appendix 2-FA)",null,null,{"$f":"D72","v":0},0,0,0,{"$f":"H72","v":0},{"$f":"I72","v":0},0,0,0]
["UCC Before Half Year Rule",null,null,{"$f":"SUM(D87:D88)","v":0},0,0,0,{"$f":"SUM(H87:H88)","v":0},{"$f":"SUM(I87:I88)","v":0},{"$f":"SUM(J87:J88)","v":0},{"$f":"SUM(K87:K88)","v":0},{"$f":"SUM(L87:L88)","v":0}]
["Half Year Rule (1/2 Additions - Disposals)",null,null,{"$f":"D88/2","v":0},0,0,0,{"$f":"H88/2","v":0},{"$f":"I88/2","v":0},{"$f":"J88/2","v":0},{"$f":"K88/2","v":0},{"$f":"L88/2","v":0}]
["Reduced UCC",null,null,{"$f":"D89-D90","v":0},0,0,0,{"$f":"H89-H90","v":0},{"$f":"I89-I90","v":0},{"$f":"J89-J90","v":0},{"$f":"K89-K90","v":0},{"$f":"L89-L90","v":0}]
["CCA Rate Class (to be entered)",null,47,{"$f":"C92","v":47},{"$f":"D92","v":47},47,47,47,47,47,47,47]
["CCA Rate  (to be entered)",null,0.08,{"$f":"C93","v":0.08},0.08,0.08,0.08,0.08,0.08,0.08,0.08,0.08]
["CCA",null,null,{"$f":"D91*D93","v":0},0,0,0,{"$f":"H91*H93","v":0},{"$f":"I91*I93","v":0},0,0,{"$f":"L91*L93","v":0}]
["Closing UCC",null,null,{"$f":"D89-D94","v":0},0,0,0,{"$f":"H89-H94","v":0},{"$f":"I89-I94","v":0},{"$f":"J89-J94","v":0},{"$f":"K89-K94","v":0},{"$f":"L89-L94","v":0}]

{"sheet":"App.2-FC Calc of REG Expansion","index":25,"n_rows":95,"n_cols":30,"rows_kept":95,"cut":false,"hidden":false,"merged":[[8,0,8,14],[9,0,9,14],[11,0,11,14],[12,0,12,14],[14,0,14,14],[17,3,17,5],[17,6,17,8],[17,9,17,11],[17,12,17,14],[17,15,17,17],[17,18,17,20],[17,21,17,23],[17,24,17,26],[17,27,17,29],[52,22,52,23],[52,25,52,26],[52,28,52,29],[47,0,47,20],[49,0,49,21],[50,0,50,1],[52,4,52,5],[52,7,52,8],[52,10,52,11],[52,13,52,14],[52,16,52,17],[52,19,52,20]]}
[null,null,null,null,null,null,null,null,null,null,null,null,null,"File Number:",{"$f":"EBNUMBER","v":"EB-2016-0085"}]
[null,null,null,null,null,null,null,null,null,null,null,null,null,"Exhibit:"]
[null,null,null,null,null,null,null,null,null,null,null,null,null,"Tab:"]
[null,null,null,null,null,null,null,null,null,null,null,null,null,"Schedule:"]
[null,null,null,null,null,null,null,null,null,null,null,null,null,"Page:"]
[]
[null,null,null,null,null,null,null,null,null,null,null,null,null,"Date:"]
[]
["Appendix 2-FC"]
["Calculation of Renewable Generation Connection Direct Benefits/Provincial Amount: Renewable Expansion Investments"]
[]
["This table will calculate the distributor/provincial shares of the investments entered in Part B of Appendix 2-FA."]
["Enter values in green shaded cells: WCA percentage, debt percentages, interest rates, kWh, tax rates, amortization period, CCA Class and percentage."]
["For historical investments, enter these variables for your last cost of service test year.  For 2016 and beyond, enter variables as in the application."]
["Rate Riders are not calculated for the Test Year as these assets and costs are already in the distributor's rate base."]
[]
[]
[null,null,null,{"$f":"G18-1","v":2013},null,null,{"$f":"J18-1","v":2014},null,null,{"$f":"M18-1","v":2015},null,null,{"$f":"BridgeYear","v":2016},null,null,{"$f":"CONCATENATE(TestYear,\" Test Year\")","v":"2017 Test Year"},null,null,{"$f":"TestYear+1","v":2018},2016,null,{"$f":"S18+1","v":2019},null,null,{"$f":"V18+1","v":2020},null,null,{"$f":"Y18+1","v":2021}]
[null,null,null,null,"Direct Benefit","Provincial",null,"Direct Benefit","Provincial",null,"Direct Benefit","Provincial",null,"Direct Benefit","Provincial",null,"Direct Benefit","Provincial",null,"Direct Benefit","Provincial",null,"Direct Benefit","Provincial",null,"Direct Benefit","Provincial",null,"Direct Benefit","Provincial"]
[null,null,null,"Total",0.17,0.83,"Total",0.17,0.83,"Total",0.17,0.83,"Total",0.17,0.83,"Total",0.17,0.83,"Total",0.17,0.83,"Total",0.17,0.83,"Total",0.17,0.83,"Total",0.17,0.83]
["Net Fixed Assets (average)",null,null,{"$f":"D82","v":0},{"$f":"D21*E20","v":0},{"$f":"D21*F20","v":0},{"$f":"E82","v":0},{"$f":"G21*H20","v":0},{"$f":"G21*I20","v":0},{"$f":"F82","v":0},{"$f":"J21*K20","v":0},{"$f":"J21*L20","v":0},{"$f":"G82","v":0},{"$f":"M21*N20","v":0},{"$f":"M21*O20","v":0},{"$f":"H82","v":0},{"$f":"P21*Q20","v":0},{"$f":"P21*R20","v":0},{"$f":"I82","v":0},{"$f":"S21*T20","v":0},{"$f":"S21*U20","v":0},{"$f":"J82","v":0},{"$f":"V21*W20","v":0},{"$f":"V21*X20","v":0},{"$f":"K82","v":0},{"$f":"Y21*Z20","v":0},{"$f":"Y21*AA20","v":0},{"$f":"L82","v":0},{"$f":"AB21*AC20","v":0},{"$f":"AB21*AD20","v":0}]
["Incremental OM&A (on-going, N/A for Provincial Recovery)",null,null,{"$f":"'App.2-FA Proposed REG Invest.'!C101","v":0},{"$f":"D22","v":0},null,{"$f":"'App.2-FA Proposed REG Invest.'!D$101","v":0},{"$f":"G22","v":0},null,{"$f":"'App.2-FA Proposed REG Invest.'!E$101","v":0},{"$f":"J22","v":0},null,{"$f":"'App.2-FA Proposed REG Invest.'!F$101","v":0},{"$f":"M22","v":0},null,{"$f":"'App.2-FA Proposed REG Invest.'!G$101","v":0},{"$f":"P22","v":0},null,{"$f":"'App.2-FA Proposed REG Invest.'!H$101","v":0},{"$f":"S22","v":0},null,{"$f":"'App.2-FA Proposed REG Invest.'!I$101","v":0},{"$f":"V22","v":0},null,{"$f":"'App.2-FA Proposed REG Invest.'!J$101","v":0},{"$f":"Y22","v":0},null,{"$f":"'App.2-FA Proposed REG Invest.'!K$101","v":0},{"$f":"AB22","v":0}]
["Incremental OM&A (start-up, applicable for Provincial Recovery)",null,null,{"$f":"'App.2-FA Proposed REG Invest.'!C100","v":0},{"$f":"D23*E20","v":0},{"$f":"D23*F20","v":0},{"$f":"'App.2-FA Proposed REG Invest.'!D$100","v":0},{"$f":"G23*H20","v":0},{"$f":"G23*I20","v":0},{"$f":"'App.2-FA Proposed REG Invest.'!E$100","v":0},{"$f":"J23*K20","v":0},{"$f":"J23*L20","v":0},{"$f":"'App.2-FA Proposed REG Invest.'!F$100","v":0},{"$f":"M23*N20","v":0},{"$f":"M23*O20","v":0},{"$f":"'App.2-FA Proposed REG Invest.'!G$100","v":0},{"$f":"P23*Q20","v":0},{"$f":"P23*R20","v":0},{"$f":"'App.2-FA Proposed REG Invest.'!H$100","v":0},{"$f":"S23*T20","v":0},{"$f":"S23*U20","v":0},{"$f":"'App.2-FA Proposed REG Invest.'!I$100","v":0},{"$f":"V23*W20","v":0},{"$f":"V23*X20","v":0},{"$f":"'App.2-FA Proposed REG Invest.'!J$100","v":0},{"$f":"Y23*Z20","v":0},{"$f":"Y23*AA20","v":0},{"$f":"'App.2-FA Proposed REG Invest.'!K$100","v":0},{"$f":"AB23*AC20","v":0},{"$f":"AB23*AD20","v":0}]
["WCA",null,null,null,{"$f":"(E22+E23)*$B$24","v":0},{"$f":"F23*$B$24","v":0},null,{"$f":"(H22+H23)*$B$24","v":0},{"$f":"I23*$B$24","v":0},null,{"$f":"(K22+K23)*$B$24","v":0},{"$f":"L23*$B$24","v":0},null,{"$f":"(N22+N23)*$B$24","v":0},{"$f":"O23*$B$24","v":0},null,{"$f":"(Q22+Q23)*$B$24","v":0},{"$f":"R23*$B$24","v":0},null,{"$f":"(T22+T23)*$B$24","v":0},{"$f":"U23*$B$24","v":0},null,{"$f":"(W22+W23)*$B$24","v":0},{"$f":"X23*$B$24","v":0},null,{"$f":"(Z22+Z23)*$B$24","v":0},{"$f":"AA23*$B$24","v":0},null,{"$f":"(AC22+AC23)*$B$24","v":0},{"$f":"AD23*$B$24","v":0}]
["Rate Base",null,null,null,{"$f":"SUM(E21+E24)","v":0},{"$f":"SUM(F21+F24)","v":0},null,{"$f":"SUM(H21+H24)","v":0},{"$f":"SUM(I21+I24)","v":0},null,{"$f":"SUM(K21+K24)","v":0},{"$f":"SUM(L21+L24)","v":0},null,{"$f":"SUM(N21+N24)","v":0},{"$f":"SUM(O21+O24)","v":0},null,{"$f":"SUM(Q21+Q24)","v":0},{"$f":"SUM(R21+R24)","v":0},null,{"$f":"SUM(T21+T24)","v":0},{"$f":"SUM(U21+U24)","v":0},null,{"$f":"SUM(W21+W24)","v":0},{"$f":"SUM(X21+X24)","v":0},null,{"$f":"SUM(Z21+Z24)","v":0},{"$f":"SUM(AA21+AA24)","v":0},null,{"$f":"SUM(AC21+AC24)","v":0},{"$f":"SUM(AD21+AD24)","v":0}]
[]
[]
["Deemed ST Debt",null,null,null,{"$f":"E25*$B$28","v":0},{"$f":"F25*$B$28","v":0},null,{"$f":"H25*$B$28","v":0},{"$f":"I25*$B$28","v":0},null,{"$f":"K25*$B$28","v":0},{"$f":"L25*$B$28","v":0},null,{"$f":"N25*$B$28","v":0},{"$f":"O25*$B$28","v":0},null,{"$f":"Q25*$B$28","v":0},{"$f":"R25*$B$28","v":0},null,{"$f":"T25*$B$28","v":0},{"$f":"U25*$B$28","v":0},null,{"$f":"W25*$B$28","v":0},{"$f":"X25*$B$28","v":0},null,{"$f":"Z25*$B$28","v":0},{"$f":"AA25*$B$28","v":0},null,{"$f":"AC25*$B$28","v":0},{"$f":"AD25*$B$28","v":0}]
["Deemed LT Debt",null,null,null,{"$f":"E25*$B$29","v":0},{"$f":"F25*$B$29","v":0},null,{"$f":"H25*$B$29","v":0},{"$f":"I25*$B$29","v":0},null,{"$f":"K25*$B$29","v":0},{"$f":"L25*$B$29","v":0},null,{"$f":"N25*$B$29","v":0},{"$f":"O25*$B$29","v":0},null,{"$f":"Q25*$B$29","v":0},{"$f":"R25*$B$29","v":0},null,{"$f":"T25*$B$29","v":0},{"$f":"U25*$B$29","v":0},null,{"$f":"W25*$B$29","v":0},{"$f":"X25*$B$29","v":0},null,{"$f":"Z25*$B$29","v":0},{"$f":"AA25*$B$29","v":0},null,{"$f":"AC25*$B$29","v":0},{"$f":"AD25*$B$29","v":0}]
["Deemed Equity",null,null,null,{"$f":"E25*$B$30","v":0},{"$f":"F25*$B$30","v":0},null,{"$f":"H25*$B$30","v":0},{"$f":"I25*$B$30","v":0},null,{"$f":"K25*$B$30","v":0},{"$f":"L25*$B$30","v":0},null,{"$f":"N25*$B$30","v":0},{"$f":"O25*$B$30","v":0},null,{"$f":"Q25*$B$30","v":0},{"$f":"R25*$B$30","v":0},null,{"$f":"T25*$B$30","v":0},{"$f":"U25*$B$30","v":0},null,{"$f":"W25*$B$30","v":0},{"$f":"X25*$B$30","v":0},null,{"$f":"Z25*$B$30","v":0},{"$f":"AA25*$B$30","v":0},null,{"$f":"AC25*$B$30","v":0},{"$f":"AD25*$B$30","v":0}]
[]
["ST Interest",null,null,null,{"$f":"E28*$B$32","v":0},{"$f":"F28*$B$32","v":0},null,{"$f":"H28*$B$32","v":0},{"$f":"I28*$B$32","v":0},null,{"$f":"K28*$B$32","v":0},{"$f":"L28*$B$32","v":0},null,{"$f":"N28*$B$32","v":0},{"$f":"O28*$B$32","v":0},null,{"$f":"Q28*$B$32","v":0},{"$f":"R28*$B$32","v":0},null,{"$f":"T28*$B$32","v":0},{"$f":"U28*$B$32","v":0},null,{"$f":"W28*$B$32","v":0},{"$f":"X28*$B$32","v":0},null,{"$f":"Z28*$B$32","v":0},{"$f":"AA28*$B$32","v":0},null,{"$f":"AC28*$B$32","v":0},{"$f":"AD28*$B$32","v":0}]
["LT Interest",null,null,null,{"$f":"E29*$B$33","v":0},{"$f":"F29*$B$33","v":0},null,{"$f":"H29*$B$33","v":0},{"$f":"I29*$B$33","v":0},null,{"$f":"K29*$B$33","v":0},{"$f":"L29*$B$33","v":0},null,{"$f":"N29*$B$33","v":0},{"$f":"O29*$B$33","v":0},null,{"$f":"Q29*$B$33","v":0},{"$f":"R29*$B$33","v":0},null,{"$f":"T29*$B$33","v":0},{"$f":"U29*$B$33","v":0},null,{"$f":"W29*$B$33","v":0},{"$f":"X29*$B$33","v":0},null,{"$f":"Z29*$B$33","v":0},{"$f":"AA29*$B$33","v":0},null,{"$f":"AC29*$B$33","v":0},{"$f":"AD29*$B$33","v":0}]
["ROE",null,null,null,{"$f":"E30*$B$34","v":0},{"$f":"F30*$B$34","v":0},null,{"$f":"H30*$B$34","v":0},{"$f":"I30*$B$34","v":0},null,{"$f":"K30*$B$34","v":0},{"$f":"L30*$B$34","v":0},null,{"$f":"N30*$B$34","v":0},{"$f":"O30*$B$34","v":0},null,{"$f":"Q30*$B$34","v":0},{"$f":"R30*$B$34","v":0},null,{"$f":"T30*$B$34","v":0},{"$f":"U30*$B$34","v":0},null,{"$f":"W30*$B$34","v":0},{"$f":"X30*$B$34","v":0},null,{"$f":"Z30*$B$34","v":0},{"$f":"AA30*$B$34","v":0},null,{"$f":"AC30*$B$34","v":0},{"$f":"AD30*$B$34","v":0}]
["Cost of Capital Total",null,null,null,{"$f":"SUM(E32:E34)","v":0},{"$f":"SUM(F32:F34)","v":0},null,{"$f":"SUM(H32:H34)","v":0},{"$f":"SUM(I32:I34)","v":0},null,{"$f":"SUM(K32:K34)","v":0},{"$f":"SUM(L32:L34)","v":0},null,{"$f":"SUM(N32:N34)","v":0},{"$f":"SUM(O32:O34)","v":0},null,{"$f":"SUM(Q32:Q34)","v":0},{"$f":"SUM(R32:R34)","v":0},null,{"$f":"SUM(T32:T34)","v":0},{"$f":"SUM(U32:U34)","v":0},null,{"$f":"SUM(W32:W34)","v":0},{"$f":"SUM(X32:X34)","v":0},null,{"$f":"SUM(Z32:Z34)","v":0},{"$f":"SUM(AA32:AA34)","v":0},null,{"$f":"SUM(AC32:AC34)","v":0},{"$f":"SUM(AD32:AD34)","v":0}]
[]
["OM&A",null,null,null,{"$f":"E22+E23","v":0},{"$f":"F23","v":0},null,{"$f":"H22+H23","v":0},{"$f":"I23","v":0},null,{"$f":"K22+K23","v":0},{"$f":"L23","v":0},null,{"$f":"N22+N23","v":0},{"$f":"O23","v":0},null,{"$f":"Q22+Q23","v":0},{"$f":"R23","v":0},null,{"$f":"T22+T23","v":0},{"$f":"U23","v":0},null,{"$f":"W22+W23","v":0},{"$f":"X23","v":0},null,{"$f":"Z22+Z23","v":0},{"$f":"AA23","v":0},null,{"$f":"AC22+AC23","v":0},{"$f":"AD23","v":0}]
["Amortization",null,null,{"$f":"D78","v":0},{"$f":"D38*E$20","v":0},{"$f":"D38*F$20","v":0},{"$f":"E78","v":0},{"$f":"G38*H$20","v":0},{"$f":"G38*I$20","v":0},{"$f":"F78","v":0},{"$f":"J38*K$20","v":0},{"$f":"J38*L$20","v":0},{"$f":"G78","v":0},{"$f":"M38*N$20","v":0},{"$f":"M38*O$20","v":0},{"$f":"H76+H77","v":0},{"$f":"P38*Q$20","v":0},{"$f":"P38*R$20","v":0},{"$f":"I76+I77","v":0},{"$f":"S38*T$20","v":0},{"$f":"S38*U$20","v":0},{"$f":"J76+J77","v":0},{"$f":"V38*W$20","v":0},{"$f":"V38*X$20","v":0},{"$f":"K76+K77","v":0},{"$f":"Y38*Z$20","v":0},{"$f":"Y38*AA$20","v":0},{"$f":"L76+L77","v":0},{"$f":"AB38*AC$20","v":0},{"$f":"AB38*AD$20","v":0}]
["Grossed-up PILs",null,null,null,{"$f":"E66","v":0},{"$f":"F66","v":0},null,{"$f":"H66","v":0},{"$f":"I66","v":0},null,{"$f":"K66","v":0},{"$f":"L66","v":0},null,{"$f":"N66","v":0},{"$f":"O66","v":0},null,{"$f":"Q66","v":0},{"$f":"R66","v":0},null,{"$f":"T66","v":0},{"$f":"U66","v":0},null,{"$f":"W66","v":0},{"$f":"X66","v":0},null,{"$f":"Z66","v":0},{"$f":"AA66","v":0},null,{"$f":"AC66","v":0},{"$f":"AD66","v":0}]
[]
["Revenue Requirement",null,null,null,{"$f":"SUM(E35:E39)","v":0},{"$f":"SUM(F35:F39)","v":0},null,{"$f":"SUM(H35:H39)","v":0},{"$f":"SUM(I35:I39)","v":0},null,{"$f":"SUM(K35:K39)","v":0},{"$f":"SUM(L35:L39)","v":0},null,{"$f":"SUM(N35:N39)","v":0},{"$f":"SUM(O35:O39)","v":0},null,{"$f":"SUM(Q35:Q39)","v":0},{"$f":"SUM(R35:R39)","v":0},null,{"$f":"SUM(T35:T39)","v":0},{"$f":"SUM(U35:U39)","v":0},null,{"$f":"SUM(W35:W39)","v":0},{"$f":"SUM(X35:X39)","v":0},null,{"$f":"SUM(Z35:Z39)","v":0},{"$f":"SUM(AA35:AA39)","v":0},null,{"$f":"SUM(AC35:AC39)","v":0},{"$f":"SUM(AD35:AD39)","v":0}]
[]
[]
["Provincial Rate Protection",null,null,null,null,{"$f":"F41","v":0},null,null,{"$f":"I41","v":0},null,null,{"$f":"L41","v":0},null,null,{"$f":"O41","v":0},null,null,{"$f":"R41","v":0},null,null,{"$f":"U41","v":0},null,null,{"$f":"X41","v":0},null,null,{"$f":"AA41","v":0},null,null,{"$f":"AD41","v":0}]
[]
["Monthly Amount Paid by IESO",null,null,null,null,{"$f":"F44/12","v":0},null,null,{"$f":"I44/12","v":0},null,null,{"$f":"L44/12","v":0},null,null,{"$f":"O44/12","v":0},null,null,{"$f":"R44/12","v":0},null,null,{"$f":"U44/12","v":0},null,null,{"$f":"X44/12","v":0},null,null,{"$f":"AA44/12","v":0},null,null,{"$f":"AD44/12","v":0}]
[]
["Note 1: The difference between the actual costs of approved eligible investments and revenue received from the IESO should be recorded in a variance account.  The Board may provide "]
["regulatory accounting guidance regarding a variance account either in an individual proceeding or on a generic basis."]
["Note 2: For the 2016 Test Year, Costs and Revenues of the Direct Benefit are to be included in the test year applicant Rate Base and Revenues."]
[]
["PILs Calculation"]
[null,null,null,null,{"$f":"D18","v":2013},null,null,{"$f":"G18","v":2014},null,null,{"$f":"J18","v":2015},null,null,{"$f":"M18","v":2016},null,null,{"$f":"P18","v":"2017 Test Year"},null,null,{"$f":"S18","v":2018},null,null,{"$f":"V18","v":2019},null,null,{"$f":"Y18","v":2020},null,null,{"$f":"AB18","v":2021}]
["Income Tax",null,null,null,"Direct Benefit","Provincial",null,"Direct Benefit","Provincial",null,"Direct Benefit","Provincial",null,"Direct Benefit","Provincial",null,"Direct Benefit","Provincial",null,"Direct Benefit","Provincial",null,"Direct Benefit","Provincial",null,"Direct Benefit","Provincial",null,"Direct Benefit","Provincial"]
[null,null,null,null,null,null,null,null,null,null,null,null,null,null,null,null,null,null,null,null,null,"Total",null,null,"Total",null,null,"Total"]
["Net Income - ROE on Rate Base",null,null,null,{"$f":"E34","v":0},{"$f":"F34","v":0},null,{"$f":"H34","v":0},{"$f":"I34","v":0},null,{"$f":"K34","v":0},{"$f":"L34","v":0},null,{"$f":"N34","v":0},{"$f":"O34","v":0},null,{"$f":"Q34","v":0},{"$f":"R34","v":0},null,{"$f":"T34","v":0},{"$f":"U34","v":0},null,{"$f":"W34","v":0},{"$f":"X34","v":0},null,{"$f":"Z34","v":0},{"$f":"AA34","v":0},null,{"$f":"AC34","v":0},{"$f":"AD34","v":0}]
["Amortization (17% DB and 83% P)",null,null,null,{"$f":"E38","v":0},{"$f":"F38","v":0},null,{"$f":"H38","v":0},{"$f":"I38","v":0},null,{"$f":"K38","v":0},{"$f":"L38","v":0},null,{"$f":"N38","v":0},{"$f":"O38","v":0},null,{"$f":"Q38","v":0},{"$f":"R38","v":0},null,{"$f":"T38","v":0},{"$f":"U38","v":0},null,{"$f":"W38","v":0},{"$f":"X38","v":0},null,{"$f":"Z38","v":0},{"$f":"AA38","v":0},null,{"$f":"AC38","v":0},{"$f":"AD38","v":0}]
["CCA (17% DB and 83% P)",null,null,null,{"$f":"-D94*E$20","v":0},{"$f":"-D94*F$20","v":0},null,{"$f":"-E94*H$20","v":0},{"$f":"-E94*I$20","v":0},null,{"$f":"-F94*K$20","v":0},{"$f":"-F94*L$20","v":0},null,{"$f":"-G94*N$20","v":0},{"$f":"-G94*O$20","v":0},null,{"$f":"-H94*Q$20","v":0},{"$f":"-H94*R$20","v":0},null,{"$f":"-I94*T$20","v":0},{"$f":"-I94*U$20","v":0},null,{"$f":"-J94*W$20","v":0},{"$f":"-J94*X$20","v":0},null,{"$f":"-K94*Z$20","v":0},{"$f":"-K94*AA$20","v":0},null,{"$f":"-L94*AC$20","v":0},{"$f":"-L94*AD$20","v":0}]
["Taxable income",null,null,null,{"$f":"SUM(E56:E58)","v":0},{"$f":"SUM(F56:F58)","v":0},null,{"$f":"SUM(H56:H58)","v":0},{"$f":"SUM(I56:I58)","v":0},null,{"$f":"SUM(K56:K58)","v":0},{"$f":"SUM(L56:L58)","v":0},null,{"$f":"SUM(N56:N58)","v":0},{"$f":"SUM(O56:O58)","v":0},null,{"$f":"SUM(Q56:Q58)","v":0},{"$f":"SUM(R56:R58)","v":0},null,{"$f":"SUM(T56:T58)","v":0},{"$f":"SUM(U56:U58)","v":0},null,{"$f":"SUM(W56:W58)","v":0},{"$f":"SUM(X56:X58)","v":0},null,{"$f":"SUM(Z56:Z58)","v":0},{"$f":"SUM(AA56:AA58)","v":0},null,{"$f":"SUM(AC56:AC58)","v":0},{"$f":"SUM(AD56:AD58)","v":0}]
[]
["Tax Rate  (to be entered)"]
[]
["Income Taxes Payable",null,null,null,{"$f":"E59*E61","v":0},{"$f":"F59*F61","v":0},null,{"$f":"H59*H61","v":0},{"$f":"I59*I61","v":0},null,{"$f":"K59*K61","v":0},{"$f":"L59*L61","v":0},null,{"$f":"N59*N61","v":0},{"$f":"O59*O61","v":0},null,{"$f":"Q59*Q61","v":0},{"$f":"R59*R61","v":0},null,{"$f":"T59*T61","v":0},{"$f":"U59*U61","v":0},null,{"$f":"W59*W61","v":0},{"$f":"X59*X61","v":0},null,{"$f":"Z59*Z61","v":0},{"$f":"AA59*AA61","v":0},null,{"$f":"AC59*AC61","v":0},{"$f":"AD59*AD61","v":0}]
["Gross Up"]
["Income Taxes Payable",null,null,null,{"$f":"E63/(1-E61)","v":0},{"$f":"F63/(1-F61)","v":0},null,{"$f":"H63/(1-H61)","v":0},{"$f":"I63/(1-I61)","v":0},null,{"$f":"K63/(1-K61)","v":0},{"$f":"L63/(1-L61)","v":0},null,{"$f":"N63/(1-N61)","v":0},{"$f":"O63/(1-O61)","v":0},null,{"$f":"Q63/(1-Q61)","v":0},{"$f":"R63/(1-R61)","v":0},null,{"$f":"T63/(1-T61)","v":0},{"$f":"U63/(1-U61)","v":0},null,{"$f":"W63/(1-W61)","v":0},{"$f":"X63/(1-X61)","v":0},null,{"$f":"Z63/(1-Z61)","v":0},{"$f":"AA63/(1-AA61)","v":0},null,{"$f":"AC63/(1-AC61)","v":0},{"$f":"AD63/(1-AD61)","v":0}]
["Grossed Up PILs",null,null,null,{"$f":"SUM(E65:E65)","v":0},{"$f":"SUM(F65:F65)","v":0},null,{"$f":"SUM(H65:H65)","v":0},{"$f":"SUM(I65:I65)","v":0},null,{"$f":"SUM(K65:K65)","v":0},{"$f":"SUM(L65:L65)","v":0},null,{"$f":"SUM(N65:N65)","v":0},{"$f":"SUM(O65:O65)","v":0},null,{"$f":"SUM(Q65:Q65)","v":0},{"$f":"SUM(R65:R65)","v":0},null,{"$f":"SUM(T65:T65)","v":0},{"$f":"SUM(U65:U65)","v":0},null,{"$f":"SUM(W65:W65)","v":0},{"$f":"SUM(X65:X65)","v":0},null,{"$f":"SUM(Z65:Z65)","v":0},{"$f":"SUM(AA65:AA65)","v":0},null,{"$f":"SUM(AC65:AC65)","v":0},{"$f":"SUM(AD65:AD65)","v":0}]
[]
[]
["Net Fixed Assets",null,null,2011,2012,2013,2014,2015,2016,2017,2018,2019]
[null,"Enter applicable amortization in years:",25]
["Opening Gross Fixed Assets",null,null,null,{"$f":"D73","v":0},0,0,0,0,0,0,0]
["Gross Capital Additions",null,null,{"$f":"'App.2-FA Proposed REG Invest.'!C99","v":0},{"$f":"'App.2-FA Proposed REG Invest.'!D99","v":0},{"$f":"'App.2-FA Proposed REG Invest.'!E99","v":0},{"$f":"'App.2-FA Proposed REG Invest.'!F99","v":0},{"$f":"'App.2-FA Proposed REG Invest.'!G99","v":0},{"$f":"'App.2-FA Proposed REG Invest.'!H99","v":0},{"$f":"'App.2-FA Proposed REG Invest.'!I99","v":0},{"$f":"'App.2-FA Proposed REG Invest.'!J99","v":0},{"$f":"'App.2-FA Proposed REG Invest.'!K99","v":0}]
["Closing Gross Fixed Assets",null,null,{"$f":"SUM(D71:D72)","v":0},0,0,0,0,0,0,0,0]
[]
["Opening Accumulated Amortization",null,null,null,{"$f":"+D78","v":0},{"$f":"E78","v":0},0,{"$f":"G78","v":0},{"$f":"H78","v":0},{"$f":"I78","v":0},{"$f":"J78","v":0},{"$f":"K78","v":0}]
["Current Year Amortization (before additions)",null,null,null,{"$f":"IF(ISERROR(E71/$C$70), 0, E71/$C$70)","v":0},0,0,{"$f":"H71/$C$70","v":0},{"$f":"I71/$C$70","v":0},{"$f":"J71/$C$70","v":0},{"$f":"K71/$C$70","v":0},{"$f":"L71/$C$70","v":0}]
["Additions (half year)",null,null,{"$f":"D72/C70/2","v":0},{"$f":"E72/C70/2","v":0},{"$f":"F72/C70/2","v":0},{"$f":"G72/C70/2","v":0},{"$f":"H72/C70/2","v":0},{"$f":"I72/C70/2","v":0},{"$f":"J72/C70/2","v":0},{"$f":"K72/C70/2","v":0},{"$f":"L72/C70/2","v":0}]
["Closing Accumulated Amortization",null,null,{"$f":"SUM(D75+D77)","v":0},{"$f":"SUM(E75:E77)","v":0},0,0,0,0,0,0,0]
[]
["Opening Net Fixed Assets",null,null,{"$f":"D71-D75","v":0},{"$f":"E71-E75","v":0},{"$f":"F71-F75","v":0},{"$f":"G71-G75","v":0},{"$f":"G81","v":0},{"$f":"H81","v":0},{"$f":"I81","v":0},{"$f":"J81","v":0},{"$f":"K81","v":0}]
["Closing Net Fixed Assets",null,null,{"$f":"D73-D78","v":0},0,0,0,0,0,0,0,0]
["Average Net Fixed Assets",null,null,{"$f":"SUM(D80:D81)/2","v":0},0,0,0,0,0,0,0,0]
[]
["UCC for PILs Calculation"]
[null,null,null,2014,2014,2014,2014,2015,2016,2017,2018,2019]
[]
["Opening UCC",null,null,null,{"$f":"D95","v":0},0,0,0,0,0,0,0]
["Capital Additions (from Appendix 2-FA)",null,null,{"$f":"D72","v":0},0,0,0,0,0,0,0,0]
["UCC Before Half Year Rule",null,null,{"$f":"SUM(D87:D88)","v":0},0,0,0,0,0,0,0,0]
["Half Year Rule (1/2 Additions - Disposals)",null,null,{"$f":"D88/2","v":0},0,0,0,0,0,0,0,0]
["Reduced UCC",null,null,{"$f":"D89-D90","v":0},0,0,0,0,0,0,0,0]
["CCA Rate Class (to be entered)",null,47,{"$f":"$C$92","v":47},{"$f":"$C$92","v":47},47,47,47,47,47,47,47]
["CCA Rate  (to be entered)",null,0.08,{"$f":"$C$93","v":0.08},{"$f":"$C$93","v":0.08},0.08,0.08,0.08,0.08,0.08,0.08,0.08]
["CCA",null,null,{"$f":"D91*D$93","v":0},{"$f":"E91*E$93","v":0},{"$f":"F91*F$93","v":0},{"$f":"G91*G$93","v":0},{"$f":"H91*H$93","v":0},0,0,0,0]
["Closing UCC",null,null,{"$f":"D89-D94","v":0},0,0,0,0,0,0,0,0]

{"sheet":"App.2-G SQI","index":26,"n_rows":40,"n_cols":16,"rows_kept":40,"cut":false,"hidden":false,"merged":[[37,4,37,5],[38,4,38,5],[39,4,39,5],[29,0,29,3],[30,0,30,3],[31,0,31,3],[32,0,32,3],[33,0,33,3],[34,0,34,3],[35,0,35,3],[36,0,36,3],[37,0,37,3],[38,0,38,3],[39,0,39,3],[32,4,32,5],[33,4,33,5],[34,4,34,5],[35,4,35,5],[36,4,36,5],[28,4,28,5],[29,4,29,5],[30,4,30,5],[31,4,31,5],[28,0,28,3],[6,14,6,15],[14,11,14,15],[20,11,20,14],[21,11,21,14],[19,0,19,15],[8,0,8,15],[9,0,9,15],[10,0,10,15],[12,0,12,15],[20,1,20,4],[20,6,20,9],[23,0,23,10],[24,0,24,10],[26,0,26,10],[21,1,21,4],[21,6,21,9],[14,0,15,0],[14,1,14,5],[14,6,14,10],[0,14,0,15],[1,14,1,15],[2,14,2,15],[3,14,3,15],[4,14,4,15]]}
[null,null,null,null,null,null,null,null,null,null,null,null,"File Number:",null,{"$f":"EBNUMBER","v":"EB-2016-0085"}]
[null,null,null,null,null,null,null,null,null,null,null,null,"Exhibit:",null,1]
[null,null,null,null,null,null,null,null,null,null,null,null,"Tab:"]
[null,null,null,null,null,null,null,null,null,null,null,null,"Schedule:"]
[null,null,null,null,null,null,null,null,null,null,null,null,"Page:"]
[]
[null,null,null,null,null,null,null,null,null,null,null,null,"Date:",null,"2016-11-28"]
[]
["Appendix 2-G"]
["Service Reliability and Quality Indicators"]
["2011 - 2015"]
[]
["Service Reliability"]
[]
["Index","Including outages caused by loss of supply",null,null,null,null,"Excluding outages caused by loss of supply",null,null,null,null,"Excluding Major Event Days"]
[null,{"$f":"TestYear-6","v":2011},{"$f":"TestYear-5","v":2012},{"$f":"TestYear-4","v":2013},{"$f":"TestYear-3","v":2014},{"$f":"TestYear-2","v":2015},{"$f":"B16","v":2011},2012,2013,2014,2015,2011,2012,2013,2014,2015]
["SAIDI ",1.34,0.98,2.14,4.07,1.74,0.98,3.11,2.6,5.0199999999999996,1.51]
["SAIFI",1.19,1.1000000000000001,1.1000000000000001,3.14,0.99,1.1200000000000001,1.69,1.1000000000000001,3.93,1.08]
[]
["5 Year Historical Average"]
["SAIDI ",null,null,null,null,{"$f":"IF(ISERROR(AVERAGE(B17:F17)), \"\", AVERAGE(B17:F17))","v":2.0540000000000003},null,null,null,null,{"$f":"IF(ISERROR(AVERAGE(G17:K17)), \"\", AVERAGE(G17:K17))","v":2.6439999999999997},null,null,null,null,{"$f":"IF(ISERROR(AVERAGE(L17:P17)), \"\", AVERAGE(L17:P17))","v":""}]
["SAIFI",null,null,null,null,{"$f":"IF(ISERROR(AVERAGE(B18:F18)), \"\", AVERAGE(B18:F18))","v":1.504},null,null,null,null,{"$f":"IF(ISERROR(AVERAGE(G18:K18)), \"\", AVERAGE(G18:K18))","v":1.784},null,null,null,null,{"$f":"IF(ISERROR(AVERAGE(L18:P18)), \"\", AVERAGE(L18:P18))","v":""}]
[]
["SAIDI = System Average Interruption Duration Index"]
["SAIFI = System Average Interruption Frequency Index "]
[]
["Service Quality"]
[]
["Indicator",null,null,null,"OEB Minimum Standard",null,{"$f":"B16","v":2011},{"$f":"C16","v":2012},{"$f":"D16","v":2013},{"$f":"E16","v":2014},{"$f":"F16","v":2015}]
["Low Voltage Connections",null,null,null,0.9,null,0.81200000000000006,0.95299999999999996,0.89900000000000002,0.96399999999999997,0.97899999999999998]
["High Voltage Connections",null,null,null,0.9,null,"N/A","N/A","N/A","N/A","N/A"]
["Telephone Accessibility",null,null,null,0.65,null,0.95799999999999996,0.746,0.67100000000000004,0.70599999999999996,0.80400000000000005]
["Appointments Met",null,null,null,0.9,null,0.60399999999999998,0.64300000000000002,0.83,0.94399999999999995,0.91800000000000004]
["Written Response to Enquires",null,null,null,0.8,null,1,1,1,0.98399999999999999,0.97499999999999998]
["Emergency Urban Response",null,null,null,0.8,null,"N/A","N/A","N/A","N/A","N/A"]
["Emergency Rural Response",null,null,null,0.8,null,1,1,1,1,1]
["Telephone Call Abandon Rate",null,null,null,0.1,null,1E-3,6.7000000000000004E-2,9.0999999999999998E-2,7.4999999999999997E-2,9.5000000000000001E-2]
["Appointment Scheduling",null,null,null,0.9,null,0.57999999999999996,0.98299999999999998,0.96899999999999997,0.97699999999999998,0.97699999999999998]
["Rescheduling a Missed Appointment",null,null,null,1,null,1,1,1,1,1]
["Reconnection Performance Standard",null,null,null,0.85,null,0.93,0.97,0.99,0.98899999999999999,0.997]

{"sheet":"App.2-H_Other_Oper_Rev","index":27,"n_rows":122,"n_cols":10,"rows_kept":122,"cut":false,"hidden":false,"merged":[[127,1,127,7],[125,1,125,7],[126,1,126,7],[49,0,49,1],[42,0,43,7],[48,0,48,1],[54,0,54,1],[50,0,50,1],[51,0,51,1],[52,0,52,1],[53,0,53,1],[121,1,121,7],[59,0,59,1],[60,0,60,1],[67,0,67,1],[70,0,70,1],[39,0,39,7],[26,0,26,1],[27,0,27,1],[8,0,8,7],[9,0,9,7],[24,0,24,7],[25,0,25,1],[34,2,34,7],[35,2,36,7],[28,0,28,1],[29,0,29,1],[32,0,32,1],[33,0,33,1],[34,0,34,1],[35,0,35,1],[80,0,80,1],[81,0,81,1],[82,0,82,1],[71,0,71,1],[76,0,76,1],[77,0,77,1],[78,0,78,1],[79,0,79,1],[98,0,98,1],[87,0,87,1],[88,0,88,1],[89,0,89,1],[92,0,92,1],[93,0,93,1],[61,0,61,1],[113,0,113,1],[114,0,114,1],[115,0,115,1],[104,0,104,1],[109,0,109,1],[110,0,110,1],[111,0,111,1],[112,0,112,1],[99,0,99,1],[100,0,100,1],[101,0,101,1],[102,0,102,1],[103,0,103,1],[90,0,90,1],[91,0,91,1]]}
[null,null,null,null,null,null,"File Number:",{"$f":"EBNUMBER","v":"EB-2016-0085"}]
[null,null,null,null,null,null,"Exhibit:",3]
[null,null,null,null,null,null,"Tab:"]
[null,null,null,null,null,null,"Schedule:"]
[null,null,null,null,null,null,"Page:"]
[]
[null,null,null,null,null,null,"Date:","2016-11-28"]
[]
["Appendix 2-H"]
["Other Operating Revenue"]
[]
["USoA #","USoA Description",{"$f":"F13-2 & \" Actual\"","v":"2013 Actual"},{"$f":"F13-1 & \" Actual\"","v":"2014 Actual"},{"$f":"F13 & \" Actual\" & CHAR(178)","v":"2015 Actual²"},{"$f":"\"Actual Year\" & CHAR(178)","v":"Actual Year²"},{"$f":"\"Bridge Year\" & CHAR(178)","v":"Bridge Year²"},"Test Year"]
[null,null,{"$f":"D13-1","v":2013},{"$f":"E13-1","v":2014},{"$f":"F13","v":2015},{"$f":"G13-1","v":2015},{"$f":"BridgeYear","v":2016},{"$f":"TestYear","v":2017}]
[null,"Reporting Basis","CGAAP","CGAAP","CGAAP","MIFRS","MIFRS","MIFRS"]
[4210,"Rent from Electric Property",{"$f":"'[11]2013 Income Statement'!$B$36","v":-153289},{"$f":"'[11]2014 Income Statement'!$B$36","v":-169620},{"$f":"'[11]2015 Income Statement'!$B$36","v":-161206.79999999999},{"$f":"'[11]2015 Income Statement'!$B$36","v":-161206.79999999999},{"$f":"'[11]2016 Income Statement '!$B$36","v":-155000},{"$f":"'[11]2017 Income Statement'!$B$36","v":-326648.91256102972}]
[4225,"Late Payment Charges",{"$f":"'[11]2013 Income Statement'!$B$39","v":-73904},{"$f":"'[11]2014 Income Statement'!$B$39","v":-84703},{"$f":"'[11]2015 Income Statement'!$B$39","v":-96925.26},{"$f":"'[11]2015 Income Statement'!$B$39","v":-96925.26},{"$f":"'[11]2016 Income Statement '!$B$39","v":-108150},{"$f":"'[11]2017 Income Statement'!$B$39","v":-78000}]
[4235,"Specific Service Charges",{"$f":"'[11]2013 Income Statement'!$B$41","v":-116157},{"$f":"'[11]2014 Income Statement'!$B$41","v":-139676},{"$f":"'[11]2015 Income Statement'!$B$41","v":-156169.51999999999},{"$f":"'[11]2015 Income Statement'!$B$41","v":-156169.51999999999},{"$f":"'[11]2016 Income Statement '!$B$41","v":-192331.31},{"$f":"'[11]2017 Income Statement'!$B$41","v":-170000}]
[4245,"Deferred Revenues - Contributions",{"$f":"'[11]2013 Income Statement'!$B$43","v":0},{"$f":"'[11]2014 Income Statement'!$B$43","v":0},0,{"$f":"'[11]2015 Income Statement'!$B$43","v":-313329.81},{"$f":"'[11]2016 Income Statement '!$B$43","v":-421161.72413793107},{"$f":"'[11]2017 Income Statement'!$B$43","v":-522115.68965517246}]
[4355,"Gain on Dispositions",{"$f":"'[11]2013 Income Statement'!$B$57","v":0},{"$f":"'[11]2014 Income Statement'!$B$57","v":-4450},{"$f":"'[11]2015 Income Statement'!$B$57","v":-440397.48},{"$f":"'[11]2015 Income Statement'!$B$57","v":-440397.48},{"$f":"'[11]2016 Income Statement '!$B$57","v":166450},{"$f":"'[11]2017 Income Statement'!$B$57","v":183094}]
[4375,"Revenues from Non Utility Operations",{"$f":"'[11]2013 Income Statement'!$B$61","v":-682460},{"$f":"'[11]2014 Income Statement'!$B$61","v":-801855},{"$f":"'[11]2015 Income Statement'!$B$61","v":-775119.7},{"$f":"'[11]2015 Income Statement'!$B$61","v":-775119.7},{"$f":"'[11]2016 Income Statement '!$B$61","v":-1077311},{"$f":"'[11]2017 Income Statement'!$B$61","v":-1087311}]
[4380,"Expenses of Non Utility Operations",{"$f":"'[11]2013 Income Statement'!$B$62","v":627785},{"$f":"'[11]2014 Income Statement'!$B$62","v":718395},{"$f":"'[11]2015 Income Statement'!$B$62","v":689823.14},{"$f":"'[11]2015 Income Statement'!$B$62","v":689823.14},{"$f":"'[11]2016 Income Statement '!$B$62","v":980311},{"$f":"'[11]2017 Income Statement'!$B$62","v":983861}]
[4390,"Misc Non Operating Expense",{"$f":"'[11]2013 Income Statement'!$B$64","v":-11015},{"$f":"'[11]2014 Income Statement'!$B$64","v":-10882},{"$f":"'[11]2015 Income Statement'!$B$64","v":-30115.79},{"$f":"'[11]2015 Income Statement'!$B$64","v":-30115.79},{"$f":"'[11]2016 Income Statement '!$B$64","v":-210000},{"$f":"'[11]2017 Income Statement'!$B$64","v":-160000}]
[4405,"Interest and Dividend Income",{"$f":"'[11]2013 Income Statement'!$B$70","v":-26558},{"$f":"'[11]2014 Income Statement'!$B$70","v":-39974},{"$f":"'[11]2015 Income Statement'!$B$70","v":-27917.94},{"$f":"'[11]2015 Income Statement'!$B$70","v":-27917.94},{"$f":"'[11]2016 Income Statement '!$B$70","v":-30000},{"$f":"-'[11]Revenue Requirement'!$D$53","v":-30000}]
[null,"Total",{"$f":"SUM(C15:C23)","v":-435598},{"$f":"SUM(D15:D23)","v":-532765},-998029.34999999974,{"$f":"SUM(F15:F23)","v":-1311359.1599999997},{"$f":"SUM(G15:G23)","v":-1047193.0341379312},-1207120.6022162021]
[]
["Specific Service Charges",null,{"$f":"C17","v":-116157},{"$f":"D17","v":-139676},{"$f":"E17","v":-156169.51999999999},{"$f":"F16","v":-96925.26},{"$f":"G17","v":-192331.31},{"$f":"H17","v":-170000}]
["Late Payment Charges",null,{"$f":"C16","v":-73904},{"$f":"D16","v":-84703},{"$f":"E16","v":-96925.26},{"$f":"F17","v":-156169.51999999999},{"$f":"G16","v":-108150},{"$f":"H16","v":-78000}]
["Other Operating Revenues (4210 & 4245)",null,{"$f":"C15+C18","v":-153289},-169620,-161206.79999999999,-474536.61,-576161.72413793113,-848764.60221620218]
["Other Income or Deductions (4355, 4375,4380, 4390, 4405)",null,{"$f":"C19+C20+C21+C22+C23","v":-92248},-138766,-583727.7699999999,-583727.7699999999,-170550,-110356]
["Total",null,{"$f":"SUM(C26:C29)","v":-435598},-532765,-998029.34999999986,-1311359.1599999997,-1047193.0341379312,-1207120.6022162023]
[]
["Description",null,"Account(s)"]
["Specific Service Charges:",null,4235]
["Late Payment Charges:",null,4225]
["Other Distribution Revenues:",null,"4080, 4082, 4084, 4090, 4205, 4210, 4215, 4220, 4240, 4245"]
["Other Income and Expenses:",null,"4305, 4310, 4315, 4320, 4325, 4330, 4335, 4340, 4345, 4350, 4355, 4360, 4365, 4370, 4375, 4380, 4385, 4390, 4395, 4398, 4405, 4415"]
[]
[]
["Note: Add all applicable accounts listed above to the table and include all relevant information."]
[]
["Account Breakdown Details"]
[]
["For each \"Other Operating Revenue\" and \"Other Income or Deductions\" Account, a detailed breakdown of the account components is required.  See the example below for Account 4405, Interest and Dividend Income."]
[]
[]
["Account 4405 - Interest and Dividend Income"]
[null,null,{"$f":"C12","v":"2013 Actual"},"2014 Actual","2015 Actual²","Actual Year²","Bridge Year²","Test Year"]
[null,null,null,null,null,{"$f":"F13","v":2015},{"$f":"G13","v":2016},{"$f":"H13","v":2017}]
["Reporting Basis",null,{"$f":"IF(C14=0, \"\", C14)","v":"CGAAP"},"CGAAP","CGAAP","MIFRS","MIFRS","MIFRS"]
["Short-term Investment Interest",null,null,null,{"$f":"IF(F50=\"\",\"\",F50)","v":""}]
["Bank Deposit Interest",null,null,null,{"$f":"IF(F51=\"\",\"\",F51)","v":""}]
["Miscellaneous Interest Revenue",null,null,null,""]
["Interest Income - Bank & Cust",null,{"$f":"'[11]Trial Balance'!$E$259","v":-26558},{"$f":"-[12]Revenue!$D$38-[12]Revenue!$D$39","v":-39973.619999999995},-27917.94,{"$f":"'[11]2015 Income Statement'!$B$70","v":-27917.94},{"$f":"-[12]Revenue!$F$38-[12]Revenue!$F$39","v":-30000},{"$f":"-[12]Revenue!$G$38-[12]Revenue!$G$39","v":-30000}]
[null,null,null,null,""]
["Total",null,{"$f":"SUM(C50:C54)","v":-26558},-39973.619999999995,-27917.94,-27917.94,-30000,-30000]
[]
["Account 4210 - Rent from Electric Property"]
[null,null,"2013 Actual","2014 Actual","2015 Actual²","Actual Year²","Bridge Year²","Test Year"]
[null,null,null,null,null,2015,2016,2017]
["Reporting Basis",null,"CGAAP","CGAAP","CGAAP","MIFRS","MIFRS","MIFRS"]
["Rogers - 2013 per OEB @ $22.35",null,{"$f":"'[14]2013'!$E$5*'[14]2013'!$F$5","v":85332.3},{"$f":"'[14]2014'!$E$5*'[14]2014'!$F$5","v":86516.85},{"$f":"IF(F61=\"\",\"\",F61)","v":86516.85},{"$f":"'[14]2015'!$E$5*'[14]2015'!$F$5","v":86516.85}]
["Rogers - 2013 per OEB @ $5.59",null,{"$f":"'[14]2013'!$G$5*'[14]2013'!$H$5","v":7261.41},{"$f":"'[14]2014'!$G$5*'[14]2014'!$H$5","v":7261.41},7261.41,{"$f":"'[14]2015'!$G$5*'[14]2015'!$H$5","v":7261.41}]
["Rogers Cable Inc (Previously Atria Networks) @ $22.35",null,{"$f":"'[14]2013'!$I$6","v":19645.650000000001},{"$f":"'[14]2014'!$K$6","v":19645.650000000001},19645.650000000001,{"$f":"'[14]2015'!$K$6","v":19645.650000000001}]
["Hydro One @ $28.61",null,{"$f":"'[14]2013'!$I$7","v":1773.82},{"$f":"'[14]2014'!$K$7","v":1773.82},1974.09,{"$f":"'[14]2015'!$K$7","v":1974.09}]
["Bell Canada @ $22.35",null,{"$f":"'[14]2013'!$I$8","v":36251.699999999997},{"$f":"'[14]2014'!$K$8","v":37771.5},38084.400000000001,{"$f":"'[14]2015'!$K$8","v":38084.400000000001}]
["Vianet Internet Solutions",null,0,{"$f":"'[14]2014'!$K$9","v":201.15},201.15,{"$f":"'[14]2015'!$K$9","v":201.15}]
["MTS Allstream Inc. - 2013 per OEB @ $22.35",null,{"$f":"'[14]2013'!$I$9","v":2123.25},{"$f":"'[14]2014'!$K$10","v":2123.25},2123.25,{"$f":"'[14]2015'!$K$10","v":2123.25}]
["Atria Networks (Pop use land fee)",null,{"$f":"'[14]2013'!$K$25","v":900},{"$f":"'[14]2014'!$K$26","v":14325},5400,{"$f":"'[14]2015'!$K$26","v":5400}]
["Forecasted 6880 poles @ $22.53",null,null,null,"",null,{"$f":"[12]Revenue!$F$24","v":155000}]
["Forecasted 6880 poles @ $47.48",null,null,null,"",null,null,{"$f":"[12]Revenue!$G$24","v":326648.91256102972}]
[null,null,null,null,""]
["Total",null,{"$f":"SUM(C61:C71)","v":153288.13},169618.63,161206.79999999999,161206.79999999999,155000,326648.91256102972]
[]
["Account 4245 - Deferred Revenues - Contributions"]
[null,null,"2013 Actual","2014 Actual","2015 Actual²","Actual Year²","Bridge Year²","Test Year"]
[null,null,null,null,null,2015,2016,2017]
["Reporting Basis",null,"CGAAP","CGAAP","CGAAP","MIFRS","MIFRS","MIFRS"]
["Deferred Revenue",null,0,0,0,{"$f":"-[12]Revenue!$E$41","v":-313335.63793103449},{"$f":"-[12]Revenue!$F$41","v":-421161.72413793107},{"$f":"-[12]Revenue!$G$41","v":-522115.68965517246}]
[]
[]
["etc.1"]
[]
["Total",null,{"$f":"SUM(C78:C82)","v":0},0,0,-313335.63793103449,-421161.72413793107,-522115.68965517246]
[]
["Account 4380 -  Expenses of Non Utility Operations"]
[null,null,"2013 Actual","2014 Actual","2015 Actual²","Actual Year²","Bridge Year²","Test Year"]
[null,null,null,null,null,2015,2016,2017]
["Reporting Basis",null,"CGAAP","CGAAP","CGAAP","MIFRS","MIFRS","MIFRS"]
["Misc. Non Utility Water",null,{"$f":"'[15]angi file'!$H$44","v":190269.12},{"$f":"-[12]Revenue!D34","v":74549.45},{"$f":"IF(F89=\"\",\"\",F89)","v":184243.26},{"$f":"'[16]4380 2015'!$H$48","v":184243.26},{"$f":"-[12]Revenue!F34","v":142000},{"$f":"-[12]Revenue!G34","v":145550}]
["IESL Expenses",null,{"$f":"'[15]angi file'!$H$48","v":5174.2},{"$f":"-[12]Revenue!D35","v":8864.5499999999993},9244.33,{"$f":"'[16]4380 2015'!$H$42","v":9244.33},{"$f":"-[12]Revenue!F35","v":8000},{"$f":"-[12]Revenue!G35","v":8000}]
["Misc. Non Utility Exp-OPA",null,{"$f":"'[15]angi file'!$H$38","v":432342},{"$f":"-[12]Revenue!D36","v":634981.31999999995},496335.55000000005,{"$f":"'[16]4380 2015'!$H$39","v":496335.55000000005},{"$f":"-[12]Revenue!F36","v":830311},{"$f":"-[12]Revenue!G36","v":830311}]
[null,null,null,null,""]
[null,null,null,null,""]
["Total",null,{"$f":"SUM(C89:C93)","v":627785.32000000007},718395.32,689823.14,689823.14,980311,983861]
[]
["Account 4375 -Revenues from Non Utility Operations"]
[null,null,"2013 Actual","2014 Actual","2015 Actual²","Actual Year²","Bridge Year²","Test Year"]
[null,null,null,null,null,2015,2016,2017]
["Reporting Basis",null,"CGAAP","CGAAP","CGAAP","MIFRS","MIFRS","MIFRS"]
["Misc. Non-Utility Water",null,{"$f":"'[17]4375'!$H$42","v":-251043.77},{"$f":"[12]Revenue!D31","v":204916.1},{"$f":"IF(F100=\"\",\"\",F100)","v":-269613.8},{"$f":"'[16]4375 2015'!$H$42","v":-269613.8},{"$f":"-[12]Revenue!F31","v":-235000},{"$f":"-[12]Revenue!G31","v":-245000}]
["MIESL Management Fee",null,{"$f":"'[17]4375'!$H$26","v":-3757.69},{"$f":"[12]Revenue!$D32","v":11572.67},-12319.18,{"$f":"'[16]4375 2015'!$H$26","v":-12319.18},{"$f":"-[12]Revenue!F32","v":-12000},{"$f":"-[12]Revenue!G32","v":-12000}]
["Misc. Non Utility Income OPA",null,{"$f":"'[17]4375'!$H$23","v":-427658.42000000004},{"$f":"[12]Revenue!$D33","v":585367.69999999995},-493186.72000000003,{"$f":"'[16]4375 2015'!$H$23","v":-493186.72000000003},{"$f":"-[12]Revenue!F33","v":-830311},{"$f":"-[12]Revenue!G33","v":-830311}]
["etc.1",null,null,null,""]
[null,null,null,null,""]
["Total",null,{"$f":"SUM(C100:C104)","v":-682459.88},801856.47,-775119.7,{"$f":"SUM(F100:F104)","v":-775119.7},-1077311,-1087311]
[]
["Account 4390 - Misc Non Operating Expense"]
[null,null,"2013 Actual","2014 Actual","2015 Actual²","Actual Year²","Bridge Year²","Test Year"]
[null,null,null,null,null,2015,2016,2017,null,"brenda to look at "]
["Reporting Basis",null,"CGAAP","CGAAP","CGAAP","MIFRS","MIFRS","MIFRS"]
["Misc Non-Utility Income",null,{"$f":"'[17]4390'!$H$6","v":-11015.63},{"$f":"[12]Revenue!D37","v":10882.28},{"$f":"IF(F111=\"\",\"\",F111)","v":20000},{"$f":"[12]Revenue!E37","v":20000},{"$f":"[12]Revenue!F37","v":160000},{"$f":"[12]Revenue!G37","v":160000}]
["Carrying Charges - Reg. Ass.",null,{"$f":"'[17]4390'!$H$8","v":0},{"$f":"-[12]Revenue!D40","v":0},-50000.333333333401,{"$f":"-[12]Revenue!E40","v":-50000.333333333401},{"$f":"-[12]Revenue!F40","v":-50000},{"$f":"-[12]Revenue!G40","v":0}]
[null,null,null,null,""]
["etc.1",null,null,null,""]
[null,null,null,null,""]
["Total",null,{"$f":"SUM(C111:C115)","v":-11015.63},10882.28,-30000.333333333401,-30000.333333333401,110000,160000]
[]
[]
[]
["Notes:"]
[1,"List and specify any other interest revenue."]
[2,"In the transition year to IFRS, the applicant is to present information in both MIFRS and CGAAP.  For the typical applicant that adopted IFRS on January 1, 2015, 2014 must be presented in both a CGAAP and MIFRS basis."]

{"sheet":"App_2-I LF_CDM","index":28,"n_rows":96,"n_cols":14,"rows_kept":96,"cut":false,"hidden":false,"merged":[[19,0,19,7],[21,0,21,7],[22,0,22,7],[17,0,17,5],[8,0,8,7],[9,0,9,7],[11,0,11,7],[13,0,13,7],[15,0,15,7],[24,0,24,7],[32,0,32,7],[61,0,61,1],[63,0,63,7],[84,0,84,7],[65,0,65,7],[67,0,67,5],[70,4,70,6],[72,0,72,7],[51,0,51,4],[54,0,54,1],[41,0,41,5],[43,0,43,7],[45,0,45,7],[47,0,47,7],[49,0,49,5],[95,0,95,7],[74,0,74,7],[76,0,76,7],[78,0,78,7],[80,0,80,7],[82,0,82,7]]}
[{"$f":"+G69+1","v":2021},null,null,null,null,null,"File Number:",{"$f":"EBNUMBER","v":"EB-2016-0085"}]
[null,null,null,null,null,null,"Exhibit:",3]
[null,null,null,null,null,null,"Tab:"]
[null,null,null,null,null,null,"Schedule:"]
[null,null,null,null,null,null,"Page:"]
[]
[null,null,null,null,null,null,"Date:","2016-11-28"]
[]
["Appendix 2-I"]
["Load Forecast CDM Adjustment Work Form (2017)"]
[]
["Appendix 2-I was initially developed to help determine what would be the amount of CDM savings needed in each year to cumulatively achieve the four year 2011-2014 CDM target.  This then determined the amount of kWh (and with translation, kW of demand) savings that were converted into dollar balances for the LRAMVA, and also to determine the related adjustment to the load forecast to account for OPA-reported savings.  Beginning for the 2015 year, it has been adjusted because the persistence of 2011-2014 CDM programs will be an adjustment to the load forecast in addition to the estimated savings for the first year (2015) for the new 2015-2020 CDM plan."]
[]
["2017 is the third year of the six-year (2015-2020) Conservation First program. Final results for the 2011-14 program were issued in the fall of 2015, and the program in completed, although in some instances disposition of the amounts has been deferred. For the purposes of the 2015-2020 LRAMVA, and the impact of CDM on the load forecast, CDM programs in 2014 and earlier are implicit in the historical data on which the base load forecast is developed. Only impacts of 2015 to 2017 CDM programs need to be reflected in the manual load forecast adjustment and for the LRAMVA threshold amount in 2017 and carrying forward, although the half-year impact of 2015 CDM programs on the 2015 historical data is also assumed to be reflected in the base load forecast.  "]
[]
["The new six year (2015-2020) CDM program works similarly to the previous 2011-2014 CDM program, meaning that distributors will offer programs each year that, over the six years (from January 1, 2015 to December 31, 2020) will strive to cumulatively achieve savings meeting the new six year CDM target. In other words, distributors will be able to offer and execute programs on a basis so that cumulatively over the period, the measured impacts, including persistence, of the CDM programs will accumulate towards achieving each distributor's 2015-2020 CDM target."]
[]
["2015-2020 CDM Program - 2017, third year of the current CDM plan"]
[]
["For the first year of the new 2015-2020 CDM plan, it is assumed that each year's program will achieve an equal amount of new CDM savings.  The new targets for 2015-2020 do not take into account persistence beyond the first year, but the IESO will encourage distributors to promote and implement  CDM plans that will have longer term persistence of savings.  This results in each year's program being about 1/6 (18.67%) of the cumulative 2015-2020 CDM target for kWh savings.  A distributor may propose an alternative approach but would be expected to document in its application why it believes that its proposal is more reasonable.  In its proposal, the distributor should ensure that the sum of the results for each year's CDM program from 2015 to 2020 add up to its 2015-2020 CDM target as established by the IESO."]
[]
["6 Year (2015-2020) kWh Target:"]
[13010000]
[null,2015,2016,2017,2018,2019,2020,"Total"]
["%"]
["2015 CDM Programs",{"$f":"B34/$H$40","v":4.7619047619047616E-2},{"$f":"C34/$H$40","v":4.7619047619047616E-2},4.7619047619047616E-2,4.7619047619047616E-2,4.7619047619047616E-2,4.7619047619047616E-2,{"$f":"SUM(B26:G26)","v":0.2857142857142857}]
["2016 CDM Programs",null,4.7619047619047616E-2,4.7619047619047616E-2,4.7619047619047616E-2,4.7619047619047616E-2,4.7619047619047616E-2,{"$f":"SUM(B27:G27)","v":0.23809523809523808}]
["2017 CDM Programs",null,null,4.7619047619047623E-2,4.7619047619047623E-2,4.7619047619047623E-2,4.7619047619047623E-2,{"$f":"SUM(B28:G28)","v":0.19047619047619049}]
["2018 CDM Programs",null,null,null,4.7619047619047603E-2,4.7619047619047603E-2,4.7619047619047603E-2,{"$f":"SUM(E29:G29)","v":0.14285714285714279}]
["2019 CDM Programs",null,null,null,null,4.7619047619047603E-2,4.7619047619047603E-2,{"$f":"SUM(F30:G30)","v":9.5238095238095205E-2}]
["2020 CDM Programs",null,null,null,null,null,{"$f":"G39/$H$40","v":4.7619047619047603E-2},{"$f":"SUM(B31:G31)","v":4.7619047619047603E-2}]
["Total in Year",{"$f":"SUM(B26:B31)","v":4.7619047619047616E-2},{"$f":"SUM(C26:C31)","v":9.5238095238095233E-2},{"$f":"SUM(D26:D31)","v":0.14285714285714285},{"$f":"SUM(E26:E29)","v":0.19047619047619047},{"$f":"SUM(F26:F30)","v":0.23809523809523808},{"$f":"SUM(G26:G31)","v":0.2857142857142857},{"$f":"SUM(B32:G32)","v":0.99999999999999989}]
["kWh"]
[{"$f":"A26","v":"2015 CDM Programs"},{"$f":"1/21*A23","v":619523.80952380947},{"$f":"B34","v":619523.80952380947},{"$f":"C34","v":619523.80952380947},{"$f":"D34","v":619523.80952380947},{"$f":"E34","v":619523.80952380947},{"$f":"F34","v":619523.80952380947},{"$f":"SUM(B34:G34)","v":3717142.8571428573}]
["2016 CDM Programs",null,{"$f":"1/15*(A23-H34)","v":619523.80952380947},{"$f":"C35","v":619523.80952380947},{"$f":"D35","v":619523.80952380947},{"$f":"E35","v":619523.80952380947},{"$f":"F35","v":619523.80952380947},{"$f":"SUM(B35:G35)","v":3097619.0476190476},null,null,2011,2012,2013,2014]
["2017 CDM Programs",null,null,{"$f":"1/10*(A23-(H34+H35))","v":619523.80952380958},{"$f":"D36","v":619523.80952380958},{"$f":"E36","v":619523.80952380958},{"$f":"F36","v":619523.80952380958},{"$f":"SUM(B36:G36)","v":2478095.2380952383},null,"2011 CDM Programs",{"$f":"50%","v":0.5},1,1,1]
["2018 CDM Programs",null,null,null,{"$f":"1/6*(A23-(H34+H35+H36))","v":619523.80952380935},{"$f":"E37","v":619523.80952380935},{"$f":"F37","v":619523.80952380935},{"$f":"SUM(E37:G37)","v":1858571.4285714282},null,"2012 CDM Programs",null,0.5,1,1]
["2019 CDM Programs",null,null,null,null,{"$f":"E37","v":619523.80952380935},{"$f":"F38","v":619523.80952380935},{"$f":"SUM(F38:G38)","v":1239047.6190476187},null,"2013 CDM Programs",null,null,0.5,1]
["2020 CDM Programs",null,null,null,null,null,{"$f":"F38","v":619523.80952380935},{"$f":"SUM(B39:G39)","v":619523.80952380935},null,"2014 CDM Programs",null,null,null,0.5]
["Total in Year",{"$f":"SUM(B34:B39)","v":619523.80952380947},{"$f":"SUM(C34:C39)","v":1239047.6190476189},1858571.4285714286,{"$f":"SUM(E34:E37)","v":2478095.2380952379},{"$f":"SUM(F34:F38)","v":3097619.0476190471},{"$f":"SUM(G34:G39)","v":3717142.8571428563},{"$f":"SUM(H34:H39)","v":13010000}]
[]
["Note: The default formulae in the above table assume that 1/21 of the 2015-2020 kWh CDM target is required each year so that, including persistence, 100% of the kWh target is achieved by the end of 2020.  The distributor can input the 2015 CDM savings, including persistence from 2016 to 2020, once the reports become available. The distributor can also input estimates or forecasts of the 2016 and 2017 CDM programs if it believes that these are more realistic; such information would typically be derived from the CDM plans that the distributor has filed with the IESO. Similarly, CDM savings and persistence into future years can be estimated for 2018, 2019 and 2020 CDM programs. However, the distributor will have to support its proposals for estimated or forecasted savings, particularly beyond the 2017 test year. The sum of cumulative savings, including persistence, should equal the target entered into cell A25.",null,null,null,null,null,null,"Total does not match 6 year CDM target"]
[]
["Determination of 2017 Load Forecast Adjustment"]
[]
["The Board determined that the \"net\" number should be used in its Decision and Order with respect to Centre Wellington Hydro Ltd.'s 2013 Cost of Service rates (EB-2012-0113).  This approach has also been used in Settlement Agreements accepted by the Board in other 2013 and 2014 applications.  The distributor should select whether the adjustment is done on a \"net\" or \"gross\" basis, but must support a proposal for the adjustment being done on a \"gross\" basis.  Sheet 2-I defaults to the adjustment being done on a \"net\" basis consistent with Board policy and practice."]
[]
["From each of the 2006-2010 CDM Final Report,  and the 2011, 2012, 2013, 2014 and 2015 CDM Final Reports, issued by the OPA/IESO for the distributor, the distributor should input the \"gross\" and \"net\" results of the cumulative CDM savings for 2014 into cells D84 to E88.  The model will calculate the cumulative savings for all programs from 2006 to 2012 and determine the \"net\" to \"gross\" factor \"g\"."]
[]
["Net-to-Gross Conversion"]
[]
["Is CDM adjustment being done on a \"net\" or \"gross\" basis?",null,null,null,null,"net"]
[]
[null,null,"\"Gross\"","\"Net\"","Difference","\"Net-to-Gross\" Conversion Factor"]
["Persistence of Historical CDM programs to 2015",null,"kWh","kWh","kWh","('g')"]
["2006-2010 CDM programs",null,null,null,{"$f":"IF(ISBLANK(D56),\"\",C56-D56)","v":""}]
["2011 CDM program",null,null,555545,{"$f":"IF(ISBLANK(D57),\"\",C57-D57)","v":-555545}]
["2012 CDM program",null,null,601538,-601538]
["2013 CDM program",null,null,1063080,-1063080]
["2014 CDM program",null,null,1146872,-1146872]
["2015 CDM program",null,null,1850172,-1850172]
["2006 to 2015 OPA CDM programs:  Persistence to 2017",null,{"$f":"SUM(C56:C61)","v":0},{"$f":"SUM(D56:D61)","v":5217207},{"$f":"C62-D62","v":-5217207},{"$f":"IF(D62=0,0,IF(F52=\"net\",0,E62/D62))","v":0}]
[]
["The default values below represent the factor used for how each year's CDM program is factored into the manual CDM adjustment.  Distributors can choose alternative weights of \"0\", \"0.5\" or \"1\" from the drop-down menu for each cell, but must support its alternatives."]
[]
["These factors do not mean that CDM programs are excluded, but the assumption that impacts of previous year CDM programs are already implicitly reflected in the actual data for historical years that are used to derive the load forecast prior to any manual CDM adjustment for the 2017 test year."]
[]
["Weight Factor for Inclusion in CDM Adjustment to 2017 Load Forecast"]
[null,2015,2016,2017,2018,2019,2020]
["Weight Factor for each year's CDM program impact on 2014 load forecast",0.5,1,0.5,0,0,0,"Distributor can select \"0\", \"0.5\", or \"1\" from drop-down list"]
["Default Value selection rationale.  ","Default is 0, but one option is for full year impact of persistence of 2015 CDM programs on 2017 load forecast, but 50% impact in base forecast (first year impact of 2014 CDM programs on 2014 actuals, which is part of the data for the load forecast.","Full year impact of persistence of 2015 programs on 2015 load forecast.  2015 CDM program impacts are not in the base forecast.","Only 50% of 2016 CDM programs are assumed to impact the 2016 load forecast based on the \"half-year\" rule.","2018, 2019 and 2020 are future years beyond the 2017 test year. No impacts of CDM programs beyond the 2017 test year are factored into the test year load forecast."]
[]
["2015-2020 LRAMVA and 2017 CDM adjustment to Load Forecast"]
[]
["One manual adjustment for CDM impacts to the 2017 load forecast is made.  There is a different but related threshold amount that is used for the 2017 LRAMVA amount for Account 1568."]
[]
["The Amount used for the CDM threshold of the LRAMVA is the kWh that will be used to determine the base amount for the LRAMVA balance for 2017, for assessing performance against the five-year target."]
[]
["If used to determine the manual CDM adjustment for the system purchased kWh, the proposed loss factor should correspond with the proposed total loss factor calculated in Appendix 2-R "]
[]
["The Manual Adjustment for the 2017 Load Forecast is the amount manually subtracted from the system-wide load forecast (either based on a purchased or billed basis) derived from the base forecast from historical data. "]
[]
["If the distributor has developed their load forecast on a system purchased basis, then the manual adjustment should be on a system purchased basis, including the adjustment for losses.  If the load forecast has been developed on a billed basis, either on a system basis or on a class-specific basis, the manual adjustment should be on a billed basis, excluding losses."]
[]
["The distributor should determine the allocation of the savings to all customer classes in a reasonable manner (e.g. taking into account what programs and what IESO-measured impacts were directed at specific customer classes), for both the LRAMVA and for the load forecast adjustment."]
[]
[null,2015,2016,2017,2018,2019,2020,"Total for 2017"]
[]
["Amount used for CDM threshold for LRAMVA (2017)",{"$f":"D34","v":619523.80952380947},{"$f":"D35","v":619523.80952380947},{"$f":"D36","v":619523.80952380958},null,null,null,{"$f":"SUM(B89:G89)","v":1858571.4285714286}]
[]
["Manual Adjustment for 2017 Load Forecast (billed basis)",{"$f":"B89*(1+F62)*B70","v":309761.90476190473},{"$f":"C89*(1+F62)*C70","v":619523.80952380947},{"$f":"D89*(1+F62)*D70","v":309761.90476190479},{"$f":"E89*(1+E62)*E70","v":0},{"$f":"F89*(1+F62)*F70","v":0},{"$f":"G89*(1+F62)*G70","v":0},{"$f":"SUM(B91:G91)","v":1239047.6190476189}]
[]
["Proposed Loss Factor (TLF)",1.0678E-2," Format: X.XX%"]
["Manual Adjustment for 2017 Load Forecast (system purchased basis)",{"$f":"B91*(1+$B93)","v":313069.54238095233},{"$f":"C91*(1+$B93)","v":626139.08476190467},313069.54238095239,0,0,0,{"$f":"SUM(B94:G94)","v":1252278.1695238096}]
[]
["Manual adjustment uses \"gross\" versus \"net\" (i.e. numbers multiplied by (1 + g).  The Weight factor is also used to calculate the impact of each year's program on the CDM adjustment to the 2017 load forecast."]

{"sheet":"App.2-IA_Load_Forecast_Instrct","index":29,"n_rows":45,"n_cols":18,"rows_kept":45,"cut":false,"hidden":false,"merged":[[9,1,9,17],[8,1,8,17],[18,1,18,17],[20,1,20,17],[22,1,22,17],[24,1,24,17],[26,1,26,17],[43,2,43,17],[44,2,44,17],[28,8,28,10],[28,12,28,14],[29,13,29,14],[29,9,29,10],[41,2,41,17],[42,2,42,17],[28,16,28,17]]}
[null,null,null,null,null,null,null,null,null,null,null,null,null,null,null,null,"File Number:",{"$f":"EBNUMBER","v":"EB-2016-0085"}]
[null,null,null,null,null,null,null,null,null,null,null,null,null,null,null,null,"Exhibit:",3]
[null,null,null,null,null,null,null,null,null,null,null,null,null,null,null,null,"Tab:"]
[null,null,null,null,null,null,null,null,null,null,null,null,null,null,null,null,"Schedule:"]
[null,null,null,null,null,null,null,null,null,null,null,null,null,null,null,null,"Page:"]
[]
[null,null,null,null,null,null,null,null,null,null,null,null,null,null,null,null,"Date:","2016-11-28"]
[]
[null,"Appendix 2-IA"]
[null,"Instructions on Customer, Connections, Load Forecast and Revenues Data and Analysis"]
[]
[null,"This sheet requires no inputs, but serves as a summary of the hiostorical and forecasted data to be provided with respect to:"]
[]
[null,"1)","Customers and connections"]
[null,"2)","Consumption (kWh)"]
[null,"3)","Demand (kW or kCA) for applicable demand-billed customer classes"]
[null,"4)","Revenues"]
[]
[null,"The spreadsheet summarizes the data provided and the analyses (variance or year-over-year) that are required. Data are required to be provided on a customer class level. Consumption (kWh) must also be provided on a total distribution system level."]
[]
[null,"Appendix 2-IB (formerly 2-IA) is the appendix spreadsheet that the distributor populates, and the spreadsheet is laid out for inputting the necessary data. The spreadsheet also calculates necessary statistics such as average consumption per customer/connection per year, and variances and % annual changes, as necessary."]
[]
[null,"The distributor is required to provide suitable documentation in Exhibit 3 of its Application, in accordance with section 2.3.2 of Chaoter 2 of the Filing Requirements. This would include explanations for material variations or of trends in the data."]
[]
[null,"The distributor is also required to input its test year customer/connection and load forecast in Sheet 10 - Load Forecast of the Revenue Requirement Work Form. This sheet should also be updated to reflect changes in the load forecast made through the stages of processing of the rates application."]
[]
[null,"The applicant must demonstrate the historical accuracy of its load forecast approach for at least the past 5 years. Such analysis will cover both customer/connections and consumption (kWh) and demand (kW or kVA) by providing the following, as shown in the following table:"]
[]
[null,null,null,"Calendar Year",null,"Customers / Connections",null,null,"Consumption (kWh) (3)",null,null,null,"Demand (kW or kVA)",null,null,null,"Revenues"]
[null,null,null,"(for 2017 Cost of Service)",null,null,null,null,"Weather-actual","Weather-normalized",null,null,"Weather-actual","Weather-normalized",null,null,"Weather-actual","Weather-normalized"]
[null,null,"Historical",2011,null,"Actual",null,null,"Actual","Actual (1)",null,null,"Actual","Actual (1)",null,null,"Actual"]
[null,null,"Historical",2012,null,"Actual",null,null,"Actual","Actual (1)",null,null,"Actual","Actual (1)",null,null,"Actual"]
[null,null,"Historical",2013,null,"Actual","Board-approved (2)",null,"Actual","Actual (1)","Board-approved (2)",null,"Actual","Actual (1)","Board-approved (2)",null,"Actual"]
[null,null,"Historical",2014,null,"Actual",null,null,"Actual","Actual (1)",null,null,"Actual","Actual (1)",null,null,"Actual"]
[null,null,"Historical",2015,null,"Actual",null,null,"Actual","Actual (1)",null,null,"Actual","Actual (1)",null,null,"Actual"]
[null,null,"Bridge Year (Forecast)",2016,null,"Forecast",null,null,null,"Forecast",null,null,null,"Forecast",null,null,null,"Forecast"]
[null,null,"Test Year (Forecast)",2017,null,"Forecast",null,null,null,"Forecast",null,null,null,"Forecast",null,null,null,"Forecast"]
[]
[]
[null,"Notes:"]
[]
[null,"(1)","“Weather-normalized actuals” are estimated by replacing the actual weather-related values (typically Heating Degree Days (HDD) and Cooling Degree Days (CDD)) by the “typical” or “weather-normalized” values. These “weather-normalized HDD and CDD values would be the same as used to estimate the Bridge Year and Test Year forecasts."]
[null,"(2)","For 2017 Cost of Service rebasers, the typical situation is that 2013 would have been the most recent cost of service rebasing application. If the most recent rebasing application was for a rate year other than 2013, that year should be used. An applicant must provide historical information back to the greater of: a) at least five (5) historical actual years; or b) to its last cost of service application."]
[null,"(3)","Consumption must be provided on a total distribution system basis as well as at a customer class level."]
[null,"(4)","Revenues exclude commodity charges."]

{"sheet":"App.2-IB_Load_Forecast_Analysis","index":30,"n_rows":489,"n_cols":21,"rows_kept":489,"cut":false,"hidden":false,"merged":[[211,5,211,7],[220,11,220,12],[220,17,220,18],[190,5,190,7],[199,11,199,12],[199,17,199,18],[210,5,210,8],[210,10,210,14],[210,16,210,20],[167,5,167,8],[167,10,167,14],[167,16,167,20],[168,5,168,7],[177,11,177,12],[177,17,177,18],[187,3,187,5],[189,5,189,8],[189,10,189,14],[189,16,189,20],[134,11,134,12],[134,17,134,18],[144,3,144,5],[146,5,146,8],[146,10,146,14],[146,16,146,20],[147,5,147,7],[156,11,156,12],[156,17,156,18],[70,17,70,18],[81,16,81,20],[91,17,91,18],[125,5,125,7],[46,11,46,12],[101,3,101,5],[103,5,103,8],[103,10,103,14],[113,11,113,12],[113,17,113,18],[124,5,124,8],[124,10,124,14],[124,16,124,20],[230,3,230,5],[232,5,232,8],[232,10,232,14],[232,16,232,20],[233,5,233,7],[24,1,24,21],[18,1,18,21],[20,1,20,21],[22,1,22,21],[26,1,26,21],[60,10,60,14],[60,16,60,20],[36,10,36,14],[37,5,37,7],[58,3,58,5],[61,5,61,7],[60,5,60,8],[103,16,103,20],[104,5,104,7],[70,11,70,12],[81,10,81,14],[91,11,91,12],[81,5,81,8],[82,5,82,7],[254,5,254,7],[263,11,263,12],[263,17,263,18],[273,3,273,5],[275,5,275,8],[275,10,275,14],[275,16,275,20],[242,11,242,12],[242,17,242,18],[253,5,253,8],[253,10,253,14],[253,16,253,20],[297,5,297,7],[306,11,306,12],[306,17,306,18],[316,3,316,5],[318,5,318,8],[318,10,318,14],[318,16,318,20],[276,5,276,7],[285,11,285,12],[285,17,285,18],[296,5,296,8],[296,10,296,14],[296,16,296,20],[340,5,340,7],[349,11,349,12],[349,17,349,18],[359,3,359,5],[361,5,361,8],[361,10,361,14],[361,16,361,20],[319,5,319,7],[328,11,328,12],[328,17,328,18],[339,5,339,8],[339,10,339,14],[339,16,339,20],[425,16,425,20],[383,5,383,7],[392,11,392,12],[392,17,392,18],[402,3,402,5],[404,5,404,8],[404,10,404,14],[404,16,404,20],[362,5,362,7],[371,11,371,12],[371,17,371,18],[382,5,382,8],[382,10,382,14],[382,16,382,20],[8,1,8,20],[9,1,9,20],[28,1,28,20],[469,5,469,7],[478,11,478,12],[478,17,478,18],[448,5,448,7],[457,11,457,12],[457,17,457,18],[468,5,468,8],[468,10,468,14],[468,16,468,20],[426,5,426,7],[435,11,435,12],[435,17,435,18],[445,3,445,5],[447,5,447,8],[447,10,447,14],[447,16,447,20],[405,5,405,7],[414,11,414,12],[414,17,414,18],[425,5,425,8],[425,10,425,14]]}
[null,null,null,null,null,null,null,null,null,null,null,null,null,null,null,null,null,null,null,"File Number:",{"$f":"EBNUMBER","v":"EB-2016-0085"}]
[null,null,null,null,null,null,null,null,null,null,null,null,null,null,null,null,null,null,null,"Exhibit:",3]
[null,null,null,null,null,null,null,null,null,null,null,null,null,null,null,null,null,null,null,"Tab:"]
[null,null,null,null,null,null,null,null,null,null,null,null,null,null,null,null,null,null,null,"Schedule:"]
[null,null,null,null,null,null,null,null,null,null,null,null,null,null,null,null,null,null,null,"Page:"]
[]
[null,null,null,null,null,null,null,null,null,null,null,null,null,null,null,null,null,null,null,"Date:","2016-11-28"]
[]
[null,"Appendix 2-IB"]
[null,"Customer, Connections, Load Forecast and Revenues Data and Analysis"]
[]
[null,"This sheet requires no inputs, but serves as a summary of the hiostorical and forecasted data to be provided with respect to:"]
[]
[null,"1)","Customers and connections"]
[null,"2)","Consumption (kWh)"]
[null,"3)","Demand (kW or kCA) for applicable demand-billed customer classes"]
[null,"4)","Revenues"]
[]
[null,"The spreadsheet summarizes the data provided and the analyses (variance or year-over-year) that are required. Data are required to be provided on a customer class level. Consumption (kWh) must also be provided on a total distribution system level."]
[]
[null,"Appendix 2-IB (formerly 2-IA) is the appendix spreadsheet that the distributor populates, and the spreadsheet is laid out for inputting the necessary data. The spreadsheet also calculates necessary statistics such as average consumption per customer/connection per year, and variances and % annual changes, as necessary."]
[]
[null,"The distributor is required to provide suitable documentation in Exhibit 3 of its Application, in accordance with section 2.3.2 of Chaoter 2 of the Filing Requirements. This would include explanations for material variations or of trends in the data."]
[]
[null,"The distributor is also required to input its test year customer/connection and load forecast in Sheet 10 - Load Forecast of the Revenue Requirement Work Form. This sheet should also be updated to reflect changes in the load forecast made through the stages of processing of the rates application."]
[]
[null,"The applicant must demonstrate the historical accuracy of its load forecast approach for at least the past 5 years. Such analysis will cover both customer/connections and consumption (kWh) and demand (kW or kVA) by providing the following, as shown in the following table:"]
[]
[null,"This sheet is to be filled in accordance with the instructions documented in section 2.3.2 of Chapter 2 of the Filing Requirements for Distribution Rate Applications, in terms of one set of tables per customer class."]
[]
[null,"Color coding for Cells:",null,null,null,"Data input",null,null,null,null,"Drop-down List"]
[]
[null,null,null,null,null,"No data entry required",null,null,null,null,"Blank or calculated value"]
[]
[null,"Distribution System (Total)"]
[]
[null,null,null,"Calendar Year",null,null,null,null,null,null,"Consumption (kWh) (3)"]
[null,null,null,{"$f":"CONCATENATE(\"(for \",TestYear,\" Cost of Service\")","v":"(for 2017 Cost of Service"},null,null,null,null,null,null,null,"Actual (Weather actual)","Weather-normalized",null,"Weather-normalized"]
[null,null,"Historical",{"$f":"D40-1","v":2011},null,null,null,null,null,null,"Actual",{"$f":"[18]Summary!$G$4","v":246758167.20000002},{"$f":"[18]Summary!$G$5","v":248011801.80632263},{"$f":"IF(D39=RebaseYear,\"Board-approved\",\"\")","v":""}]
[null,null,"Historical",2012,null,null,null,null,null,null,"Actual",{"$f":"[18]Summary!$H$4","v":245129838.40000004},{"$f":"[18]Summary!$H$5","v":245994875.49027348},""]
[null,null,"Historical",2013,null,null,null,null,null,null,"Actual",{"$f":"[18]Summary!$I$4","v":245129838.10000002},{"$f":"[18]Summary!$I$5","v":249473504.49720371},"Board-approved",233355655]
[null,null,"Historical",2014,null,null,null,null,null,null,"Actual",{"$f":"[18]Summary!$J$4","v":253254985},{"$f":"[18]Summary!$J$5","v":254225266.15011215},""]
[null,null,"Historical",2015,null,null,null,null,null,null,"Actual",{"$f":"[18]Summary!$K$4","v":255186387},{"$f":"[18]Summary!$K$5","v":255095713.96550572},""]
[null,null,"Bridge Year",2016,null,null,null,null,null,null,"Forecast",null,{"$f":"[18]Summary!$L$5","v":258773135.43857595},""]
[null,null,"Test Year",{"$f":"TestYear","v":2017},null,null,null,null,null,null,"Forecast",null,{"$f":"[18]Summary!$M$5","v":261762895.03097278},""]
[null,null,null,null,null,null,null,null,null,null,null,null,null,null,{"$f":"SUM(O39:O44)","v":233355655}]
[null,null,"Variance Analysis",null,null,null,null,null,null,null,"Year","Year-over-year",null,null,"Versus Board-approved"]
[null,null,null,{"$f":"D39","v":2011},null,null,null,null,null,null,{"$f":"D48","v":2011}]
[null,null,null,2012,null,null,null,null,null,null,{"$f":"D49","v":2012},{"$f":"IF(L39=0,\"\",L40/L39-1)","v":-6.5988851290186279E-3},-8.1323804002851885E-3]
[null,null,null,2013,null,null,null,null,null,null,2013,-1.2238412505638507E-9,1.4141062898148871E-2]
[null,null,null,2014,null,null,null,null,null,null,2014,3.3146298969468413E-2,1.9047159587088469E-2]
[null,null,null,2015,null,null,null,null,null,null,2015,7.6263138512357997E-3,3.4239233124830903E-3]
[null,null,null,2016,null,null,null,null,null,null,2016,{"$f":"IF(K44=\"Forecast\",\"\",IF(L43=0,\"\",L44/L43-1))","v":""},{"$f":"IF(M43=0,\"\",M44/M43-1)","v":1.4415849705603057E-2}]
[null,null,null,2017,null,null,null,null,null,null,2017,{"$f":"IF(K45=\"Forecast\",\"\",IF(L44=0,\"\",L45/L44-1))","v":""},{"$f":"IF(M44=0,\"\",M45/M44-1)","v":1.1553593410419838E-2},null,{"$f":"IF(O46=0,\"\",M45/O46-1)","v":0.12173366885397652}]
[null,null,null,"Geometric Mean",null,null,null,null,null,null,"Geometric Mean",{"$f":"IF(L39=0,\"\",(L43/L39)^(1/($D43-$D39-1))-1)","v":1.1258043698442854E-2},{"$f":"IF(M39=0,\"\",(M45/M39)^(1/($D45-$D39-1))-1)","v":1.0851005769667132E-2},null,{"$f":"IF(O46=0,\"\",(M45/O46)^(1/(TestYear-RebaseYear-1))-1)","v":3.9034381350432579E-2}]
[]
[null,"Customer Class Analysis (one for each Customer Class, excluding MicroFIT and Standby)"]
[]
[null,1,"Customer Class:","Residential",null,null,null,"Is the customer class billed on consumption (kWh) or demand (kW or kVA)?",null,null,null,null,null,"kWh"]
[]
[null,null,null,"Calendar Year",null,"Customers",null,null,null,null,"Consumption (kWh) (3)",null,null,null,null,null,{"$f":"CONCATENATE(\"Consumption (kWh) per \",LEFT(F61,LEN(F61)-1))","v":"Consumption (kWh) per Customer"}]
[null,null,null,{"$f":"CONCATENATE(\"(for \",TestYear,\" Cost of Service\")","v":"(for 2017 Cost of Service"},null,null,null,null,null,null,null,"Actual (Weather actual)","Weather-normalized",null,"Weather-normalized",null,null,{"$f":"L62","v":"Actual (Weather actual)"},{"$f":"M62","v":"Weather-normalized"},null,{"$f":"O62","v":"Weather-normalized"}]
[null,null,"Historical",{"$f":"D64-1","v":2011},null,{"$f":"K39","v":"Actual"},{"$f":"[18]Summary!$G$14","v":13779},{"$f":"IF(D63=RebaseYear,\"Board-approved\",\"\")","v":""},null,null,{"$f":"F63","v":"Actual"},{"$f":"[18]Summary!$G$15","v":150873412.88607672},null,{"$f":"H63","v":""},null,null,{"$f":"K63","v":"Actual"},{"$f":"IF(G63=0,\"\",L63/G63)","v":10949.518316719408},{"$f":"IF(G63=0,\"\",M63/G63)","v":0},{"$f":"N63","v":""},{"$f":"IF(T63=\"\",\"\",IF(I63=0,\"\",O63/I63))","v":""}]
[null,null,"Historical",2012,null,{"$f":"K40","v":"Actual"},{"$f":"[18]Summary!$H$14","v":13942.916666666666},"",null,null,{"$f":"F64","v":"Actual"},{"$f":"[18]Summary!$H$15","v":145610871.6009787},null,{"$f":"H64","v":""},null,null,{"$f":"K64","v":"Actual"},{"$f":"IF(G64=0,\"\",L64/G64)","v":10443.358092291453},{"$f":"IF(G64=0,\"\",M64/G64)","v":0},{"$f":"N64","v":""},{"$f":"IF(T64=\"\",\"\",IF(I64=0,\"\",O64/I64))","v":""}]
[null,null,"Historical",2013,null,"Actual",{"$f":"[18]Summary!$I$14","v":14181},"Board-approved",14189,null,"Actual",{"$f":"[18]Summary!$I$15","v":148570811.09520668},null,"Board-approved",148148873,null,"Actual",10476.751364163789,0,"Board-approved",10441.107407146381]
[null,null,"Historical",2014,null,"Actual",{"$f":"[18]Summary!$J$14","v":14509.166666666666},"",null,null,"Actual",{"$f":"[18]Summary!$J$15","v":152923211.90943465},null,"",null,null,"Actual",10539.765337506265,0,"",""]
[null,null,"Historical",2015,null,"Actual",{"$f":"[18]Summary!$K$14","v":14861.583333333334},"",null,null,"Actual",{"$f":"[18]Summary!$K$15","v":151526915.08366263},null,"",null,null,"Actual",10195.879650575316,0,"",""]
[null,null,"Bridge Year",2016,null,"Forecast",{"$f":"[18]Summary!$L$14","v":15419},"",null,null,"Forecast",null,{"$f":"[18]Summary!$L$15","v":149674173.61039653},"",null,null,"Forecast",{"$f":"IF(G68=0,\"\",L68/G68)","v":0},{"$f":"IF(G68=0,\"\",M68/G68)","v":9707.125858382291},"",""]
[null,null,"Test Year",{"$f":"TestYear","v":2017},null,"Forecast",{"$f":"[18]Summary!$M$14","v":15930},"",null,null,"Forecast",null,{"$f":"[18]Summary!$M$15","v":149932101.44827333},"",null,null,"Forecast",0,9411.9335497974462,"",""]
[null,null,null,null,null,null,null,null,{"$f":"SUM(I63:I68)","v":14189},null,null,null,null,null,{"$f":"SUM(O63:O68)","v":148148873},null,null,null,null,null,{"$f":"SUM(U63:U68)","v":10441.107407146381}]
[null,null,"Variance Analysis","Year",null,null,"Year-over-year",null,"Test Year Versus Board-approved",null,"Year","Year-over-year",null,null,{"$f":"I71","v":"Test Year Versus Board-approved"},null,"Year","Year-over-year",null,null,{"$f":"O71","v":"Test Year Versus Board-approved"}]
[null,null,null,{"$f":"D63","v":2011},null,null,null,null,null,null,{"$f":"D72","v":2011},null,null,null,null,null,{"$f":"K72","v":2011}]
[null,null,null,2012,null,null,{"$f":"IF(G63=0,\"\",G64/G63-1)","v":1.1896122118199237E-2},null,null,null,{"$f":"D73","v":2012},{"$f":"IF(L63=0,\"\",L64/L63-1)","v":-3.4880507999588528E-2},"",null,null,null,{"$f":"K73","v":2012},{"$f":"IF(R63=\"\",\"\",IF(R63=0,\"\",R64/R63-1))","v":-4.6226711512512009E-2},{"$f":"IF(S63=\"\",\"\",IF(S63=0,\"\",S64/S63-1))","v":""}]
[null,null,null,2013,null,null,1.7075576009323745E-2,null,null,null,2013,2.0327736944938835E-2,"",null,null,null,2013,{"$f":"IF(R64=\"\",\"\",IF(R64=0,\"\",R65/R64-1))","v":3.1975607440852816E-3},""]
[null,null,null,2014,null,null,2.314129233951534E-2,null,null,null,2014,2.9295127233564644E-2,"",null,null,null,2014,6.0146481625993342E-3,""]
[null,null,null,2015,null,null,2.4289242432944835E-2,null,null,null,2015,-9.1307055896716616E-3,"",null,null,null,2015,-3.2627451932655038E-2,""]
[null,null,null,2016,null,null,3.7507219396766711E-2,null,null,null,2016,{"$f":"IF(K68=\"Forecast\",\"\",IF(L67=0,\"\",L68/L67-1))","v":""},{"$f":"IF(M67=0,\"\",M68/M67-1)","v":""},null,null,null,2016,{"$f":"IF(Q68=\"Forecast\",\"\",IF(R67=0,\"\",R68/R67-1))","v":""},{"$f":"IF(S67=\"\",\"\",IF(S67=0,\"\",S68/S67-1))","v":""}]
[null,null,null,2017,null,null,3.314093002140206E-2,null,{"$f":"IF(I70=0,\"\",G69/I70-1)","v":0.12270068362816255},null,2017,{"$f":"IF(K69=\"Forecast\",\"\",IF(L68=0,\"\",L69/L68-1))","v":""},{"$f":"IF(M68=0,\"\",M69/M68-1)","v":1.7232621477383248E-3},null,{"$f":"IF(O70=0,\"\",M69/O70-1)","v":1.2036733133119037E-2},null,2017,{"$f":"IF(Q69=\"Forecast\",\"\",IF(R68=0,\"\",R69/R68-1))","v":""},-3.0409856933083956E-2,null,{"$f":"IF(U70=0,\"\",S69/U70-1)","v":-9.8569415792478132E-2}]
[null,null,null,"Geometric Mean",null,null,{"$f":"IF(G63=0,\"\",(G69/G63)^(1/($D69-$D63-1))-1)","v":2.9436624382741972E-2},null,{"$f":"IF(I70=0,\"\",(G69/I70)^(1/(TestYear-RebaseYear-1))-1)","v":3.9332869615592347E-2},null,"Geometric Mean",{"$f":"IF(L63=0,\"\",(L67/L63)^(1/($D67-$D63-1))-1)","v":1.4417404839868198E-3},{"$f":"IF(M63=0,\"\",(M69/M63)^(1/($D69-$D63-1))-1)","v":""},null,{"$f":"IF(O70=0,\"\",(M69/O70)^(1/(TestYear-RebaseYear-1))-1)","v":3.9962530657027262E-3},null,"Geometric Mean",{"$f":"IF(R63=\"\",\"\",IF(R63=0,\"\",(R67/R63)^(1/($D67-$D63-1))-1))","v":-2.3490299109786283E-2},{"$f":"IF(S63=\"\",\"\",IF(S63=0,\"\",(S69/S63)^(1/($D69-$D63-1))-1))","v":""},null,{"$f":"IF(U70=0,\"\",(S69/U70)^(1/(TestYear-RebaseYear-1))-1)","v":-3.3999325512488965E-2}]
[]
[]
[null,null,null,"Calendar Year",null,"Revenues",null,null,null,null,{"$f":"IF(ISBLANK(N59),\"\",CONCATENATE(\"Demand (\",N59,\")\"))","v":"Demand (kWh)"},null,null,null,null,null,{"$f":"CONCATENATE(\"Demand (\",N59,\") per \",LEFT(F61,LEN(F61)-1))","v":"Demand (kWh) per Customer"}]
[null,null,null,{"$f":"CONCATENATE(\"(for \",TestYear,\" Cost of Service\")","v":"(for 2017 Cost of Service"},null,null,null,null,null,null,null,"Actual (Weather actual)","Weather-normalized",null,{"$f":"M83","v":"Weather-normalized"},null,null,{"$f":"L83","v":"Actual (Weather actual)"},{"$f":"M83","v":"Weather-normalized"},null,{"$f":"O83","v":"Weather-normalized"}]
[null,null,"Historical",{"$f":"D85-1","v":2011},null,{"$f":"F63","v":"Actual"},5971858.5,{"$f":"IF(D84=RebaseYear,\"Board-approved\",\"\")","v":""},null,null,{"$f":"K63","v":"Actual"},null,null,{"$f":"N63","v":""},null,null,{"$f":"K84","v":"Actual"},{"$f":"IF(G84=0,\"\",L84/G84)","v":0},{"$f":"IF(G84=0,\"\",M84/G84)","v":0},{"$f":"N84","v":""},{"$f":"IF(T84=\"\",\"\",IF(I84=0,\"\",O84/I84))","v":""}]
[null,null,"Historical",2012,null,"Actual",7010702.5700000003,"",null,null,"Actual",null,null,"",null,null,{"$f":"K85","v":"Actual"},{"$f":"IF(G85=0,\"\",L85/G85)","v":0},{"$f":"IF(G85=0,\"\",M85/G85)","v":0},{"$f":"N85","v":""},{"$f":"IF(T85=\"\",\"\",IF(I85=0,\"\",O85/I85))","v":""}]
[null,null,"Historical",2013,null,"Actual",6000109.8200000003,"Board-approved",null,null,"Actual",null,null,"Board-approved",null,null,"Actual",0,0,"Board-approved",""]
[null,null,"Historical",2014,null,"Actual",6122232.6500000004,"",null,null,"Actual",null,null,"",null,null,"Actual",0,0,"",""]
[null,null,"Historical",2015,null,"Actual",7013018.9000000004,"",null,null,"Actual",null,null,"",null,null,"Actual",0,0,"",""]
[null,null,"Bridge Year (Forecast)",2016,null,"Forecast",{"$f":"[12]Revenue!$F$11","v":7479200},"",null,null,"Forecast",null,null,"",null,null,"Forecast",0,0,"",""]
[null,null,"Test Year (Forecast)",{"$f":"TestYear","v":2017},null,"Forecast",{"$f":"[12]Revenue!$G$11","v":8255205},"",null,null,"Forecast",null,null,"",null,null,"Forecast",0,0,"",""]
[null,null,null,null,null,null,null,null,{"$f":"SUM(I84:I89)","v":0},null,null,null,null,null,{"$f":"SUM(O84:O89)","v":0},null,null,null,null,null,{"$f":"SUM(U84:U89)","v":0}]
[null,null,"Variance Analysis","Year",null,null,"Year-over-year",null,{"$f":"I71","v":"Test Year Versus Board-approved"},null,"Year","Year-over-year",null,null,{"$f":"I92","v":"Test Year Versus Board-approved"},null,"Year","Year-over-year",null,null,{"$f":"O92","v":"Test Year Versus Board-approved"}]
[null,null,null,{"$f":"D84","v":2011},null,null,null,null,null,null,{"$f":"D93","v":2011},null,null,null,null,null,{"$f":"K93","v":2011}]
[null,null,null,{"$f":"D85","v":2012},null,null,{"$f":"IF(G84=0,\"\",G85/G84-1)","v":0.17395657817411458},null,null,null,{"$f":"D94","v":2012},{"$f":"IF(L84=0,\"\",L85/L84-1)","v":""},{"$f":"IF(M84=0,\"\",M85/M84-1)","v":""},null,null,null,{"$f":"K94","v":2012},{"$f":"IF(R84=\"\",\"\",IF(R84=0,\"\",R85/R84-1))","v":""},{"$f":"IF(S84=\"\",\"\",IF(S84=0,\"\",S85/S84-1))","v":""}]
[null,null,null,{"$f":"D86","v":2013},null,null,{"$f":"IF(G85=0,\"\",G86/G85-1)","v":-0.14414999636762516},null,null,null,2013,{"$f":"IF(L85=0,\"\",L86/L85-1)","v":""},"",null,null,null,2013,{"$f":"IF(R85=\"\",\"\",IF(R85=0,\"\",R86/R85-1))","v":""},""]
[null,null,null,2014,null,null,2.035343246434107E-2,null,null,null,2014,{"$f":"IF(L86=0,\"\",L87/L86-1)","v":""},"",null,null,null,2014,"",""]
[null,null,null,2015,null,null,0.14550022858082667,null,null,null,2015,{"$f":"IF(L87=0,\"\",L88/L87-1)","v":""},"",null,null,null,2015,"",""]
[null,null,null,2016,null,null,6.6473669420739734E-2,null,null,null,2016,{"$f":"IF(K89=\"Forecast\",\"\",IF(L88=0,\"\",L89/L88-1))","v":""},{"$f":"IF(M88=0,\"\",M89/M88-1)","v":""},null,null,null,2016,{"$f":"IF(Q89=\"Forecast\",\"\",IF(R88=0,\"\",R89/R88-1))","v":""},{"$f":"IF(S88=\"\",\"\",IF(S88=0,\"\",S89/S88-1))","v":""}]
[null,null,null,2017,null,null,0.10375508075730022,null,{"$f":"IF(I91=0,\"\",G90/I91-1)","v":""},null,2017,{"$f":"IF(K90=\"Forecast\",\"\",IF(L89=0,\"\",L90/L89-1))","v":""},{"$f":"IF(M89=0,\"\",M90/M89-1)","v":""},null,{"$f":"IF(O91=0,\"\",M90/O91-1)","v":""},null,2017,{"$f":"IF(Q90=\"Forecast\",\"\",IF(R89=0,\"\",R90/R89-1))","v":""},"",null,{"$f":"IF(U91=0,\"\",S90/U91-1)","v":""}]
[null,null,null,"Geometric Mean",null,null,{"$f":"IF(G84=0,\"\",(G90/G84)^(1/($D90-$D84-1))-1)","v":6.6899890947950125E-2},null,{"$f":"IF(I91=0,\"\",(G90/I91)^(1/(TestYear-RebaseYear-1))-1)","v":""},null,"Geometric Mean",{"$f":"IF(L84=0,\"\",(L88/L84)^(1/($D88-$D84-1))-1)","v":""},{"$f":"IF(M84=0,\"\",(M90/M84)^(1/($D90-$D84-1))-1)","v":""},null,{"$f":"IF(O91=0,\"\",(M90/O91)^(1/(TestYear-RebaseYear-1))-1)","v":""},null,"Geometric Mean",{"$f":"IF(R84=\"\",\"\",IF(R84=0,\"\",(R88/R84)^(1/($D88-$D84-1))-1))","v":""},{"$f":"IF(S84=\"\",\"\",IF(S84=0,\"\",(S90/S84)^(1/($D90-$D84-1))-1))","v":""},null,{"$f":"IF(U91=0,\"\",(S90/U91)^(1/(TestYear-RebaseYear-1))-1)","v":""}]
[]
[null,2,"Customer Class:","GS < 50 kW",null,null,null,"Is the customer class billed on consumption (kWh) or demand (kW or kVA)?",null,null,null,null,null,"kWh"]
[]
[null,null,null,"Calendar Year",null,"Customers",null,null,null,null,"Consumption (kWh) (3)",null,null,null,null,null,{"$f":"CONCATENATE(\"Consumption (kWh) per \",LEFT(F104,LEN(F104)-1))","v":"Consumption (kWh) per Customer"}]
[null,null,null,{"$f":"CONCATENATE(\"(for \",TestYear,\" Cost of Service\")","v":"(for 2017 Cost of Service"},null,null,null,null,null,null,null,"Actual (Weather actual)","Weather-normalized",null,"Weather-normalized",null,null,{"$f":"L105","v":"Actual (Weather actual)"},{"$f":"M105","v":"Weather-normalized"},null,{"$f":"O105","v":"Weather-normalized"}]
[null,null,"Historical",{"$f":"D107-1","v":2011},null,{"$f":"F63","v":"Actual"},{"$f":"[18]Summary!$G$18","v":896},{"$f":"IF(D106=RebaseYear,\"Board-approved\",\"\")","v":""},null,null,{"$f":"F106","v":"Actual"},{"$f":"[18]Summary!$G$19","v":30721964.274347447},null,{"$f":"H106","v":""},null,null,{"$f":"K106","v":"Actual"},{"$f":"IF(G106=0,\"\",L106/G106)","v":34287.906556191345},{"$f":"IF(G106=0,\"\",M106/G106)","v":0},{"$f":"N106","v":""},{"$f":"IF(T106=\"\",\"\",IF(I106=0,\"\",O106/I106))","v":""}]
[null,null,"Historical",2012,null,{"$f":"F64","v":"Actual"},{"$f":"[18]Summary!$H$18","v":913.75},"",null,null,{"$f":"F107","v":"Actual"},{"$f":"[18]Summary!$H$19","v":30872636.305821747},null,{"$f":"H107","v":""},null,null,{"$f":"K107","v":"Actual"},{"$f":"IF(G107=0,\"\",L107/G107)","v":33786.742879148289},{"$f":"IF(G107=0,\"\",M107/G107)","v":0},{"$f":"N107","v":""},{"$f":"IF(T107=\"\",\"\",IF(I107=0,\"\",O107/I107))","v":""}]
[null,null,"Historical",2013,null,"Actual",{"$f":"[18]Summary!$I$18","v":949.25},"Board-approved",910,null,"Actual",{"$f":"[18]Summary!$I$19","v":30978542.255071979},null,"Board-approved",31781016,null,"Actual",32634.756128598347,0,"Board-approved",34924.193406593404]
[null,null,"Historical",2014,null,"Actual",{"$f":"[18]Summary!$J$18","v":991.25},"",null,null,"Actual",{"$f":"[18]Summary!$J$19","v":32143896.404322214},null,"",null,null,"Actual",32427.638238912699,0,"",""]
[null,null,"Historical",2015,null,"Actual",{"$f":"[18]Summary!$K$18","v":1000.5833333333334},"",null,null,"Actual",{"$f":"[18]Summary!$K$19","v":34326840.153572448},null,"",null,null,"Actual",34306.827837334,0,"",""]
[null,null,"Bridge Year",2016,null,"Forecast",{"$f":"[18]Summary!$L$18","v":1026},"",null,null,"Forecast",null,{"$f":"[18]Summary!$L$19","v":33122069.126032144},"",null,null,"Forecast",0,32282.718446425093,"",""]
[null,null,"Test Year",{"$f":"TestYear","v":2017},null,"Forecast",{"$f":"[18]Summary!$M$18","v":1052},"",null,null,"Forecast",null,{"$f":"[18]Summary!$M$19","v":32368432.968739454},"",null,null,"Forecast",0,30768.472403744727,"",""]
[null,null,null,null,null,null,null,null,{"$f":"SUM(I106:I111)","v":910},null,null,null,null,null,{"$f":"SUM(O106:O111)","v":31781016},null,null,null,null,null,{"$f":"SUM(U106:U111)","v":34924.193406593404}]
[null,null,"Variance Analysis","Year",null,null,"Year-over-year",null,"Test Year Versus Board-approved",null,"Year","Year-over-year",null,null,{"$f":"I114","v":"Test Year Versus Board-approved"},null,"Year","Year-over-year",null,null,{"$f":"O114","v":"Test Year Versus Board-approved"}]
[null,null,null,{"$f":"D106","v":2011},null,null,null,null,null,null,{"$f":"D115","v":2011},null,null,null,null,null,{"$f":"K115","v":2011}]
[null,null,null,2012,null,null,{"$f":"IF(G106=0,\"\",G107/G106-1)","v":1.9810267857142794E-2},null,null,null,{"$f":"D116","v":2012},{"$f":"IF(L106=0,\"\",L107/L106-1)","v":4.9043749328263608E-3},"",null,null,null,{"$f":"K116","v":2012},{"$f":"IF(R106=\"\",\"\",IF(R106=0,\"\",R107/R106-1))","v":-1.4616339327154448E-2},{"$f":"IF(S106=\"\",\"\",IF(S106=0,\"\",S107/S106-1))","v":""}]
[null,null,null,2013,null,null,3.8850889192886484E-2,null,null,null,2013,{"$f":"IF(L107=0,\"\",L108/L107-1)","v":3.4304148243491372E-3},"",null,null,null,2013,{"$f":"IF(R107=\"\",\"\",IF(R107=0,\"\",R108/R107-1))","v":-3.4095821389782399E-2},""]
[null,null,null,2014,null,null,4.4245456939689287E-2,null,null,null,2014,{"$f":"IF(L108=0,\"\",L109/L108-1)","v":3.7618108032809072E-2},"",null,null,null,2014,{"$f":"IF(R108=\"\",\"\",IF(R108=0,\"\",R109/R108-1))","v":-6.3465432028814162E-3},""]
[null,null,null,2015,null,null,9.4157208911307411E-3,null,null,null,2015,{"$f":"IF(L109=0,\"\",L110/L109-1)","v":6.7911609774747195E-2},"",null,null,null,2015,{"$f":"IF(R109=\"\",\"\",IF(R109=0,\"\",R110/R109-1))","v":5.7950245545983048E-2},""]
[null,null,null,2016,null,null,2.5401848921462467E-2,null,null,null,2016,{"$f":"IF(K111=\"Forecast\",\"\",IF(L110=0,\"\",L111/L110-1))","v":""},{"$f":"IF(M110=0,\"\",M111/M110-1)","v":""},null,null,null,2016,{"$f":"IF(Q111=\"Forecast\",\"\",IF(R110=0,\"\",R111/R110-1))","v":""},""]
[null,null,null,2017,null,null,2.5341130604288553E-2,null,{"$f":"IF(I113=0,\"\",G112/I113-1)","v":0.15604395604395593},null,2017,{"$f":"IF(K112=\"Forecast\",\"\",IF(L111=0,\"\",L112/L111-1))","v":""},{"$f":"IF(M111=0,\"\",M112/M111-1)","v":-2.2753293413676712E-2},null,{"$f":"IF(O113=0,\"\",M112/O113-1)","v":1.8483265882357269E-2},null,2017,{"$f":"IF(Q112=\"Forecast\",\"\",IF(R111=0,\"\",R112/R111-1))","v":""},-4.6905778557445155E-2,null,{"$f":"IF(U113=0,\"\",S112/U113-1)","v":-0.11899261221202928}]
[null,null,null,"Geometric Mean",null,null,{"$f":"IF(G106=0,\"\",(G112/G106)^(1/($D112-$D106-1))-1)","v":3.2622410349110842E-2},null,{"$f":"IF(I113=0,\"\",(G112/I113)^(1/(TestYear-RebaseYear-1))-1)","v":4.952176438973277E-2},null,"Geometric Mean",{"$f":"IF(L106=0,\"\",(L110/L106)^(1/($D110-$D106-1))-1)","v":3.7675626646925808E-2},{"$f":"IF(M106=0,\"\",(M112/M106)^(1/($D112-$D106-1))-1)","v":""},null,{"$f":"IF(O113=0,\"\",(M112/O113)^(1/(TestYear-RebaseYear-1))-1)","v":6.1235146570068899E-3},null,"Geometric Mean",{"$f":"IF(R106=\"\",\"\",IF(R106=0,\"\",(R110/R106)^(1/($D110-$D106-1))-1))","v":1.8391131287653906E-4},{"$f":"IF(S106=\"\",\"\",IF(S106=0,\"\",(S112/S106)^(1/($D112-$D106-1))-1))","v":""},null,{"$f":"IF(U113=0,\"\",(S112/U113)^(1/(TestYear-RebaseYear-1))-1)","v":-4.1350500013652258E-2}]
[]
[]
[null,null,null,"Calendar Year",null,"Revenues",null,null,null,null,{"$f":"IF(ISBLANK(N102),\"\",CONCATENATE(\"Demand (\",N102,\")\"))","v":"Demand (kWh)"},null,null,null,null,null,{"$f":"CONCATENATE(\"Demand (\",N102,\") per \",LEFT(F104,LEN(F104)-1))","v":"Demand (kWh) per Customer"}]
[null,null,null,{"$f":"CONCATENATE(\"(for \",TestYear,\" Cost of Service\")","v":"(for 2017 Cost of Service"},null,null,null,null,null,null,null,"Actual (Weather actual)","Weather-normalized",null,{"$f":"M126","v":"Weather-normalized"},null,null,{"$f":"L126","v":"Actual (Weather actual)"},{"$f":"M126","v":"Weather-normalized"},null,{"$f":"O126","v":"Weather-normalized"}]
[null,null,"Historical",{"$f":"D128-1","v":2011},null,{"$f":"F106","v":"Actual"},579267.38,{"$f":"IF(D127=RebaseYear,\"Board-approved\",\"\")","v":""},null,null,{"$f":"K106","v":"Actual"},null,null,{"$f":"N106","v":""},null,null,{"$f":"K127","v":"Actual"},{"$f":"IF(G127=0,\"\",L127/G127)","v":0},{"$f":"IF(G127=0,\"\",M127/G127)","v":0},{"$f":"N127","v":""},{"$f":"IF(T127=\"\",\"\",IF(I127=0,\"\",O127/I127))","v":""}]
[null,null,"Historical",2012,null,"Actual",570966.86,"",null,null,"Actual",null,null,"",null,null,{"$f":"K128","v":"Actual"},{"$f":"IF(G128=0,\"\",L128/G128)","v":0},{"$f":"IF(G128=0,\"\",M128/G128)","v":0},{"$f":"N128","v":""},{"$f":"IF(T128=\"\",\"\",IF(I128=0,\"\",O128/I128))","v":""}]
[null,null,"Historical",2013,null,"Actual",622756.21,"Board-approved",null,null,"Actual",null,null,"Board-approved",null,null,"Actual",0,0,"Board-approved",""]
[null,null,"Historical",2014,null,"Actual",647909.04,"",null,null,"Actual",null,null,"",null,null,"Actual",0,0,"",""]
[null,null,"Historical",2015,null,"Actual",753742.81,"",null,null,"Actual",null,null,"",null,null,"Actual",0,0,"",""]
[null,null,"Bridge Year (Forecast)",2016,null,"Forecast",{"$f":"[12]Revenue!$F$12","v":801900},"",null,null,"Forecast",null,null,"",null,null,"Forecast",0,0,"",""]
[null,null,"Test Year (Forecast)",{"$f":"TestYear","v":2017},null,"Forecast",{"$f":"[12]Revenue!$G$12","v":885124},"",null,null,"Forecast",null,null,"",null,null,"Forecast",0,0,"",""]
[null,null,null,null,null,null,null,null,{"$f":"SUM(I127:I132)","v":0},null,null,null,null,null,{"$f":"SUM(O127:O132)","v":0},null,null,null,null,null,{"$f":"SUM(U127:U132)","v":0}]
[null,null,"Variance Analysis","Year",null,null,"Year-over-year",null,{"$f":"I114","v":"Test Year Versus Board-approved"},null,"Year","Year-over-year",null,null,{"$f":"I135","v":"Test Year Versus Board-approved"},null,"Year","Year-over-year",null,null,{"$f":"O135","v":"Test Year Versus Board-approved"}]
[null,null,null,{"$f":"D127","v":2011},null,null,null,null,null,null,{"$f":"D136","v":2011},null,null,null,null,null,{"$f":"K136","v":2011}]
[null,null,null,{"$f":"D128","v":2012},null,null,{"$f":"IF(G127=0,\"\",G128/G127-1)","v":-1.4329341313850663E-2},null,null,null,{"$f":"D137","v":2012},{"$f":"IF(L127=0,\"\",L128/L127-1)","v":""},{"$f":"IF(M127=0,\"\",M128/M127-1)","v":""},null,null,null,{"$f":"K137","v":2012},{"$f":"IF(R127=\"\",\"\",IF(R127=0,\"\",R128/R127-1))","v":""},{"$f":"IF(S127=\"\",\"\",IF(S127=0,\"\",S128/S127-1))","v":""}]
[null,null,null,{"$f":"D129","v":2013},null,null,{"$f":"IF(G128=0,\"\",G129/G128-1)","v":9.0704651404811765E-2},null,null,null,2013,{"$f":"IF(L128=0,\"\",L129/L128-1)","v":""},"",null,null,null,2013,{"$f":"IF(R128=\"\",\"\",IF(R128=0,\"\",R129/R128-1))","v":""},""]
[null,null,null,2014,null,null,4.0389528994018598E-2,null,null,null,2014,{"$f":"IF(L129=0,\"\",L130/L129-1)","v":""},"",null,null,null,2014,{"$f":"IF(R129=\"\",\"\",IF(R129=0,\"\",R130/R129-1))","v":""},""]
[null,null,null,2015,null,null,0.16334664816530431,null,null,null,2015,{"$f":"IF(L130=0,\"\",L131/L130-1)","v":""},"",null,null,null,2015,{"$f":"IF(R130=\"\",\"\",IF(R130=0,\"\",R131/R130-1))","v":""},""]
[null,null,null,2016,null,null,6.3890745438752505E-2,null,null,null,2016,{"$f":"IF(K132=\"Forecast\",\"\",IF(L131=0,\"\",L132/L131-1))","v":""},"",null,null,null,2016,{"$f":"IF(Q132=\"Forecast\",\"\",IF(R131=0,\"\",R132/R131-1))","v":""},""]
[null,null,null,2017,null,null,0.10378351415388454,null,{"$f":"IF(I134=0,\"\",G133/I134-1)","v":""},null,2017,{"$f":"IF(K133=\"Forecast\",\"\",IF(L132=0,\"\",L133/L132-1))","v":""},"",null,{"$f":"IF(O134=0,\"\",M133/O134-1)","v":""},null,2017,{"$f":"IF(Q133=\"Forecast\",\"\",IF(R132=0,\"\",R133/R132-1))","v":""},"",null,{"$f":"IF(U134=0,\"\",S133/U134-1)","v":""}]
[null,null,null,"Geometric Mean",null,null,{"$f":"IF(G127=0,\"\",(G133/G127)^(1/($D133-$D127-1))-1)","v":8.849141667727034E-2},null,{"$f":"IF(I134=0,\"\",(G133/I134)^(1/(TestYear-RebaseYear-1))-1)","v":""},null,"Geometric Mean",{"$f":"IF(L127=0,\"\",(L131/L127)^(1/($D131-$D127-1))-1)","v":""},{"$f":"IF(M127=0,\"\",(M133/M127)^(1/($D133-$D127-1))-1)","v":""},null,{"$f":"IF(O134=0,\"\",(M133/O134)^(1/(TestYear-RebaseYear-1))-1)","v":""},null,"Geometric Mean",{"$f":"IF(R127=\"\",\"\",IF(R127=0,\"\",(R131/R127)^(1/($D131-$D127-1))-1))","v":""},{"$f":"IF(S127=\"\",\"\",IF(S127=0,\"\",(S133/S127)^(1/($D133-$D127-1))-1))","v":""},null,{"$f":"IF(U134=0,\"\",(S133/U134)^(1/(TestYear-RebaseYear-1))-1)","v":""}]
[]
[null,3,"Customer Class:","GS > 50 kW",null,null,null,"Is the customer class billed on consumption (kWh) or demand (kW or kVA)?",null,null,null,null,null,"kW"]
[]
[null,null,null,"Calendar Year",null,"Customers",null,null,null,null,"Consumption (kWh) (3)",null,null,null,null,null,{"$f":"CONCATENATE(\"Consumption (kWh) per \",LEFT(F147,LEN(F147)-1))","v":"Consumption (kWh) per Customer"}]
[null,null,null,{"$f":"CONCATENATE(\"(for \",TestYear,\" Cost of Service\")","v":"(for 2017 Cost of Service"},null,null,null,null,null,null,null,"Actual (Weather actual)","Weather-normalized",null,"Weather-normalized",null,null,{"$f":"L148","v":"Actual (Weather actual)"},{"$f":"M148","v":"Weather-normalized"},null,{"$f":"O148","v":"Weather-normalized"}]
[null,null,"Historical",{"$f":"D150-1","v":2011},null,{"$f":"F106","v":"Actual"},{"$f":"[18]Summary!$G$22","v":67},{"$f":"IF(D149=RebaseYear,\"Board-approved\",\"\")","v":""},null,null,{"$f":"F149","v":"Actual"},{"$f":"[18]Summary!$G$23","v":49921685.450000003},null,{"$f":"H149","v":""},null,null,{"$f":"K149","v":"Actual"},{"$f":"IF(G149=0,\"\",L149/G149)","v":745099.78283582092},{"$f":"IF(G149=0,\"\",M149/G149)","v":0},{"$f":"N149","v":""},{"$f":"IF(T149=\"\",\"\",IF(I149=0,\"\",O149/I149))","v":""}]
[null,null,"Historical",2012,null,{"$f":"F107","v":"Actual"},{"$f":"[18]Summary!$H$22","v":67.916666666666671},"",null,null,{"$f":"F150","v":"Actual"},{"$f":"[18]Summary!$H$23","v":51138110},null,{"$f":"H150","v":""},null,null,{"$f":"K150","v":"Actual"},{"$f":"IF(G150=0,\"\",L150/G150)","v":752953.7668711656},{"$f":"IF(G150=0,\"\",M150/G150)","v":0},{"$f":"N150","v":""},{"$f":"IF(T150=\"\",\"\",IF(I150=0,\"\",O150/I150))","v":""}]
[null,null,"Historical",2013,null,"Actual",{"$f":"[18]Summary!$I$22","v":67},"Board-approved",66,null,"Actual",{"$f":"[18]Summary!$I$23","v":50921722},null,"Board-approved",51329341,null,"Actual",760025.70149253728,0,"Board-approved",777717.28787878784]
[null,null,"Historical",2014,null,"Actual",{"$f":"[18]Summary!$J$22","v":67.166666666666671},"",null,null,"Actual",{"$f":"[18]Summary!$J$23","v":50592266.850000001},null,"",null,null,"Actual",753234.74218362279,0,"",""]
[null,null,"Historical",2015,null,"Actual",{"$f":"[18]Summary!$K$22","v":71.5},"",null,null,"Actual",{"$f":"[18]Summary!$K$23","v":54636276},null,"",null,null,"Actual",764143.72027972026,0,"",""]
[null,null,"Bridge Year",2016,null,"Forecast",{"$f":"[18]Summary!$L$22","v":71.5},"",null,null,"Forecast",null,{"$f":"[18]Summary!$L$23","v":54889863.250576422},"",null,null,"Forecast",0,767690.39511295699,"",""]
[null,null,"Test Year",{"$f":"TestYear","v":2017},null,"Forecast",{"$f":"[18]Summary!$M$22","v":71.5},"",null,null,"Forecast",null,{"$f":"[18]Summary!$M$23","v":55988819.024951793},"",null,null,"Forecast",0,783060.40594338172,"",""]
[null,null,null,null,null,null,null,null,{"$f":"SUM(I149:I154)","v":66},null,null,null,null,null,{"$f":"SUM(O149:O154)","v":51329341},null,null,null,null,null,{"$f":"SUM(U149:U154)","v":777717.28787878784}]
[null,null,"Variance Analysis","Year",null,null,"Year-over-year",null,"Test Year Versus Board-approved",null,"Year","Year-over-year",null,null,{"$f":"I157","v":"Test Year Versus Board-approved"},null,"Year","Year-over-year",null,null,{"$f":"O157","v":"Test Year Versus Board-approved"}]
[null,null,null,{"$f":"D149","v":2011},null,null,null,null,null,null,{"$f":"D158","v":2011},null,null,null,null,null,{"$f":"K158","v":2011}]
[null,null,null,2012,null,null,{"$f":"IF(G149=0,\"\",G150/G149-1)","v":1.3681592039801016E-2},null,null,null,{"$f":"D159","v":2012},{"$f":"IF(L149=0,\"\",L150/L149-1)","v":2.4366656274422693E-2},"",null,null,null,{"$f":"K159","v":2012},{"$f":"IF(R149=\"\",\"\",IF(R149=0,\"\",R150/R149-1))","v":1.0540848643724843E-2},{"$f":"IF(S149=\"\",\"\",IF(S149=0,\"\",S150/S149-1))","v":""}]
[null,null,null,2013,null,null,-1.3496932515337456E-2,null,null,null,2013,{"$f":"IF(L150=0,\"\",L151/L150-1)","v":-4.2314430470739017E-3},"",null,null,null,2013,{"$f":"IF(R150=\"\",\"\",IF(R150=0,\"\",R151/R150-1))","v":9.3922561152173234E-3},""]
[null,null,null,2014,null,null,2.4875621890547706E-3,null,null,null,2014,{"$f":"IF(L151=0,\"\",L152/L151-1)","v":-6.4698352109929802E-3},"",null,null,null,2014,{"$f":"IF(R151=\"\",\"\",IF(R151=0,\"\",R152/R151-1))","v":-8.9351706074918269E-3},""]
[null,null,null,2015,null,null,6.4516129032258007E-2,null,null,null,2015,{"$f":"IF(L152=0,\"\",L153/L152-1)","v":7.9933345584019877E-2},"",null,null,null,2015,{"$f":"IF(R152=\"\",\"\",IF(R152=0,\"\",R153/R152-1))","v":1.4482839791049029E-2},""]
[null,null,null,2016,null,null,0,null,null,null,2016,{"$f":"IF(K154=\"Forecast\",\"\",IF(L153=0,\"\",L154/L153-1))","v":""},{"$f":"IF(M153=0,\"\",M154/M153-1)","v":""},null,null,null,2016,{"$f":"IF(Q154=\"Forecast\",\"\",IF(R153=0,\"\",R154/R153-1))","v":""},{"$f":"IF(S153=\"\",\"\",IF(S153=0,\"\",S154/S153-1))","v":""}]
[null,null,null,2017,null,null,0,null,{"$f":"IF(I156=0,\"\",G155/I156-1)","v":8.3333333333333259E-2},null,2017,{"$f":"IF(K155=\"Forecast\",\"\",IF(L154=0,\"\",L155/L154-1))","v":""},{"$f":"IF(M154=0,\"\",M155/M154-1)","v":2.0021106071234973E-2},null,{"$f":"IF(O156=0,\"\",M155/O156-1)","v":9.0776112339953752E-2},null,2017,{"$f":"IF(Q155=\"Forecast\",\"\",IF(R154=0,\"\",R155/R154-1))","v":""},{"$f":"IF(S154=\"\",\"\",IF(S154=0,\"\",S155/S154-1))","v":2.0021106071234973E-2},null,{"$f":"IF(U156=0,\"\",S155/U156-1)","v":6.870257544572711E-3}]
[null,null,null,"Geometric Mean",null,null,{"$f":"IF(G149=0,\"\",(G155/G149)^(1/($D155-$D149-1))-1)","v":1.3085846062871553E-2},null,{"$f":"IF(I156=0,\"\",(G155/I156)^(1/(TestYear-RebaseYear-1))-1)","v":2.7040024624839676E-2},null,"Geometric Mean",{"$f":"IF(L149=0,\"\",(L153/L149)^(1/($D153-$D149-1))-1)","v":3.0537856863402713E-2},{"$f":"IF(M149=0,\"\",(M155/M149)^(1/($D155-$D149-1))-1)","v":""},null,{"$f":"IF(O156=0,\"\",(M155/O156)^(1/(TestYear-RebaseYear-1))-1)","v":2.9386668611151245E-2},null,"Geometric Mean",{"$f":"IF(R149=\"\",\"\",IF(R149=0,\"\",(R153/R149)^(1/($D153-$D149-1))-1))","v":8.4480654983074555E-3},{"$f":"IF(S149=\"\",\"\",IF(S149=0,\"\",(S155/S149)^(1/($D155-$D149-1))-1))","v":""},null,{"$f":"IF(U156=0,\"\",(S155/U156)^(1/(TestYear-RebaseYear-1))-1)","v":2.2848612810086877E-3}]
[]
[]
[null,null,null,"Calendar Year",null,"Revenues",null,null,null,null,{"$f":"IF(ISBLANK(N145),\"\",CONCATENATE(\"Demand (\",N145,\")\"))","v":"Demand (kW)"},null,null,null,null,null,{"$f":"CONCATENATE(\"Demand (\",N145,\") per \",LEFT(F147,LEN(F147)-1))","v":"Demand (kW) per Customer"}]
[null,null,null,{"$f":"CONCATENATE(\"(for \",TestYear,\" Cost of Service\")","v":"(for 2017 Cost of Service"},null,null,null,null,null,null,null,"Actual (Weather actual)","Weather-normalized",null,{"$f":"M169","v":"Weather-normalized"},null,null,{"$f":"L169","v":"Actual (Weather actual)"},{"$f":"M169","v":"Weather-normalized"},null,{"$f":"O169","v":"Weather-normalized"}]
[null,null,"Historical",{"$f":"D171-1","v":2011},null,{"$f":"F149","v":"Actual"},578189.91,{"$f":"IF(D170=RebaseYear,\"Board-approved\",\"\")","v":""},null,null,{"$f":"K149","v":"Actual"},{"$f":"[18]Summary!$G$24","v":139425.35999999999},null,{"$f":"N149","v":""},null,null,{"$f":"K170","v":"Actual"},{"$f":"IF(G170=0,\"\",L170/G170)","v":0.24114111572787561},{"$f":"IF(G170=0,\"\",M170/G170)","v":0},{"$f":"N170","v":""},{"$f":"IF(T170=\"\",\"\",IF(I170=0,\"\",O170/I170))","v":""}]
[null,null,"Historical",2012,null,"Actual",670332.89,"",null,null,"Actual",{"$f":"[18]Summary!$H$24","v":144982},null,"",null,null,{"$f":"K171","v":"Actual"},{"$f":"IF(G171=0,\"\",L171/G171)","v":0.21628358411594573},{"$f":"IF(G171=0,\"\",M171/G171)","v":0},{"$f":"N171","v":""},{"$f":"IF(T171=\"\",\"\",IF(I171=0,\"\",O171/I171))","v":""}]
[null,null,"Historical",2013,null,"Actual",555695.19999999995,"Board-approved",null,null,"Actual",{"$f":"[18]Summary!$I$24","v":130935},null,"Board-approved",147666,null,"Actual",0.23562377360826584,0,"Board-approved",""]
[null,null,"Historical",2014,null,"Actual",521306.03,"",null,null,"Actual",{"$f":"[18]Summary!$J$24","v":135393.63999999998},null,"",null,null,"Actual",0.25972007267976543,0,"",""]
[null,null,"Historical",2015,null,"Actual",616408.31999999995,"",null,null,"Actual",{"$f":"[18]Summary!$K$24","v":141986.79999999999},null,"",null,null,"Actual",0.23034536587695637,0,"",""]
[null,null,"Bridge Year (Forecast)",2016,null,"Forecast",{"$f":"[12]Revenue!$F$13","v":628800},"",null,null,"Forecast",null,{"$f":"[18]Summary!$L$24","v":154174.11191583652},"",null,null,"Forecast",0,0.24518783701627944,"",""]
[null,null,"Test Year (Forecast)",{"$f":"TestYear","v":2017},null,"Forecast",{"$f":"[12]Revenue!$G$13","v":706041},"",null,null,"Forecast",null,{"$f":"[18]Summary!$M$24","v":157260.84816394193},"",null,null,"Forecast",0,0.22273614161775582,"",""]
[null,null,null,null,null,null,null,null,{"$f":"SUM(I170:I175)","v":0},null,null,null,null,null,{"$f":"SUM(O170:O175)","v":147666},null,null,null,null,null,{"$f":"SUM(U170:U175)","v":0}]
[null,null,"Variance Analysis","Year",null,null,"Year-over-year",null,{"$f":"I157","v":"Test Year Versus Board-approved"},null,"Year","Year-over-year",null,null,{"$f":"I178","v":"Test Year Versus Board-approved"},null,"Year","Year-over-year",null,null,{"$f":"O178","v":"Test Year Versus Board-approved"}]
[null,null,null,{"$f":"D170","v":2011},null,null,null,null,null,null,{"$f":"D179","v":2011},null,null,null,null,null,{"$f":"K179","v":2011}]
[null,null,null,{"$f":"D171","v":2012},null,null,{"$f":"IF(G170=0,\"\",G171/G170-1)","v":0.15936455895607038},null,null,null,{"$f":"D180","v":2012},{"$f":"IF(L170=0,\"\",L171/L170-1)","v":3.985386876533803E-2},{"$f":"IF(M170=0,\"\",M171/M170-1)","v":""},null,null,null,{"$f":"K180","v":2012},{"$f":"IF(R170=\"\",\"\",IF(R170=0,\"\",R171/R170-1))","v":-0.1030829252692903},{"$f":"IF(S170=\"\",\"\",IF(S170=0,\"\",S171/S170-1))","v":""}]
[null,null,null,{"$f":"D172","v":2013},null,null,{"$f":"IF(G171=0,\"\",G172/G171-1)","v":-0.17101606039351591},null,null,null,2013,{"$f":"IF(L171=0,\"\",L172/L171-1)","v":-9.6887889531114157E-2},"",null,null,null,2013,{"$f":"IF(R171=\"\",\"\",IF(R171=0,\"\",R172/R171-1))","v":8.9420515067626161E-2},""]
[null,null,null,2014,null,null,-6.1884950598817379E-2,null,null,null,2014,{"$f":"IF(L172=0,\"\",L173/L172-1)","v":3.4052316034673513E-2},"",null,null,null,2014,{"$f":"IF(R172=\"\",\"\",IF(R172=0,\"\",R173/R172-1))","v":0.10226599252909296},""]
[null,null,null,2015,null,null,0.18243082666816623,null,null,null,2015,{"$f":"IF(L173=0,\"\",L174/L173-1)","v":4.869623122622313E-2},"",null,null,null,2015,{"$f":"IF(R173=\"\",\"\",IF(R173=0,\"\",R174/R173-1))","v":-0.11310141145319963},""]
[null,null,null,2016,null,null,2.0103038193903799E-2,null,null,null,2016,{"$f":"IF(K175=\"Forecast\",\"\",IF(L174=0,\"\",L175/L174-1))","v":""},{"$f":"IF(M174=0,\"\",M175/M174-1)","v":""},null,null,null,2016,{"$f":"IF(Q175=\"Forecast\",\"\",IF(R174=0,\"\",R175/R174-1))","v":""},{"$f":"IF(S174=\"\",\"\",IF(S174=0,\"\",S175/S174-1))","v":""}]
[null,null,null,2017,null,null,0.12283874045801535,null,{"$f":"IF(I177=0,\"\",G176/I177-1)","v":""},null,2017,{"$f":"IF(K176=\"Forecast\",\"\",IF(L175=0,\"\",L176/L175-1))","v":""},{"$f":"IF(M175=0,\"\",M176/M175-1)","v":2.0021106071234973E-2},null,{"$f":"IF(O177=0,\"\",M176/O177-1)","v":6.4976691749908166E-2},null,2017,{"$f":"IF(Q176=\"Forecast\",\"\",IF(R175=0,\"\",R176/R175-1))","v":""},{"$f":"IF(S175=\"\",\"\",IF(S175=0,\"\",S176/S175-1))","v":-9.1569368496174364E-2},null,{"$f":"IF(U177=0,\"\",S176/U177-1)","v":""}]
[null,null,null,"Geometric Mean",null,null,{"$f":"IF(G170=0,\"\",(G176/G170)^(1/($D176-$D170-1))-1)","v":4.0763091733998724E-2},null,{"$f":"IF(I177=0,\"\",(G176/I177)^(1/(TestYear-RebaseYear-1))-1)","v":""},null,"Geometric Mean",{"$f":"IF(L170=0,\"\",(L174/L170)^(1/($D174-$D170-1))-1)","v":6.0866794183205286E-3},{"$f":"IF(M170=0,\"\",(M176/M170)^(1/($D176-$D170-1))-1)","v":""},null,{"$f":"IF(O177=0,\"\",(M176/O177)^(1/(TestYear-RebaseYear-1))-1)","v":2.1206023084459735E-2},null,"Geometric Mean",{"$f":"IF(R170=\"\",\"\",IF(R170=0,\"\",(R174/R170)^(1/($D174-$D170-1))-1))","v":-1.515155281936198E-2},{"$f":"IF(S170=\"\",\"\",IF(S170=0,\"\",(S176/S170)^(1/($D176-$D170-1))-1))","v":""},null,{"$f":"IF(U177=0,\"\",(S176/U177)^(1/(TestYear-RebaseYear-1))-1)","v":""}]
[]
[null,4,"Customer Class:","Streetlighting",null,null,null,"Is the customer class billed on consumption (kWh) or demand (kW or kVA)?",null,null,null,null,null,"kW"]
[]
[null,null,null,"Calendar Year",null,"Customers",null,null,null,null,"Consumption (kWh) (3)",null,null,null,null,null,{"$f":"CONCATENATE(\"Consumption (kWh) per \",LEFT(F190,LEN(F190)-1))","v":"Consumption (kWh) per Customer"}]
[null,null,null,{"$f":"CONCATENATE(\"(for \",TestYear,\" Cost of Service\")","v":"(for 2017 Cost of Service"},null,null,null,null,null,null,null,"Actual (Weather actual)","Weather-normalized",null,"Weather-normalized",null,null,{"$f":"L191","v":"Actual (Weather actual)"},{"$f":"M191","v":"Weather-normalized"},null,{"$f":"O191","v":"Weather-normalized"}]
[null,null,"Historical",{"$f":"D193-1","v":2011},null,{"$f":"F149","v":"Actual"},{"$f":"[18]Summary!$G$32","v":2728},{"$f":"IF(D192=RebaseYear,\"Board-approved\",\"\")","v":""},null,null,{"$f":"F192","v":"Actual"},{"$f":"[18]Summary!$G$33","v":1457369.41},null,{"$f":"H192","v":""},null,null,{"$f":"K192","v":"Actual"},{"$f":"IF(G192=0,\"\",L192/G192)","v":534.22632331378293},{"$f":"IF(G192=0,\"\",M192/G192)","v":0},{"$f":"N192","v":""},{"$f":"IF(T192=\"\",\"\",IF(I192=0,\"\",O192/I192))","v":""}]
[null,null,"Historical",2012,null,{"$f":"F150","v":"Actual"},{"$f":"[18]Summary!$H$32","v":2728},"",null,null,{"$f":"F193","v":"Actual"},{"$f":"[18]Summary!$H$33","v":1569708.8405002926},null,{"$f":"H193","v":""},null,null,{"$f":"K193","v":"Actual"},{"$f":"IF(G193=0,\"\",L193/G193)","v":575.40646645905156},{"$f":"IF(G193=0,\"\",M193/G193)","v":0},{"$f":"N193","v":""},{"$f":"IF(T193=\"\",\"\",IF(I193=0,\"\",O193/I193))","v":""}]
[null,null,"Historical",2013,null,"Actual",{"$f":"[18]Summary!$I$32","v":2843.3333333333335},"Board-approved",2889,null,"Actual",{"$f":"[18]Summary!$I$33","v":1472134.2629375483},null,"Board-approved",1516831,null,"Actual",517.74944769198646,0,"Board-approved",525.03669089650396]
[null,null,"Historical",2014,null,"Actual",{"$f":"[18]Summary!$J$32","v":2923.3333333333335},"",null,null,"Actual",{"$f":"[18]Summary!$J$33","v":1625553.4323642934},null,"",null,null,"Actual",556.06160742222119,0,"",""]
[null,null,"Historical",2015,null,"Actual",{"$f":"[18]Summary!$K$32","v":2897.6666666666665},"",null,null,"Actual",{"$f":"[18]Summary!$K$33","v":1106444},null,"",null,null,"Actual",381.83964109053261,0,"",""]
[null,null,"Bridge Year",2016,null,"Forecast",{"$f":"[18]Summary!$L$32","v":2963},"",null,null,"Forecast",null,{"$f":"[18]Summary!$L$33","v":657418.89922655048},"",null,null,"Forecast",0,221.87610503764782,"",""]
[null,null,"Test Year",{"$f":"TestYear","v":2017},null,"Forecast",{"$f":"[18]Summary!$M$32","v":3030},"",null,null,"Forecast",null,{"$f":"[18]Summary!$M$33","v":669627.3173472397},"",null,null,"Forecast",0,220.9991146360527,"",""]
[null,null,null,null,null,null,null,null,{"$f":"SUM(I192:I197)","v":2889},null,null,null,null,null,{"$f":"SUM(O192:O197)","v":1516831},null,null,null,null,null,{"$f":"SUM(U192:U197)","v":525.03669089650396}]
[null,null,"Variance Analysis","Year",null,null,"Year-over-year",null,"Test Year Versus Board-approved",null,"Year","Year-over-year",null,null,{"$f":"I200","v":"Test Year Versus Board-approved"},null,"Year","Year-over-year",null,null,{"$f":"O200","v":"Test Year Versus Board-approved"}]
[null,null,null,{"$f":"D192","v":2011},null,null,null,null,null,null,{"$f":"D201","v":2011},null,null,null,null,null,{"$f":"K201","v":2011}]
[null,null,null,2012,null,null,{"$f":"IF(G192=0,\"\",G193/G192-1)","v":0},null,null,null,{"$f":"D202","v":2012},{"$f":"IF(L192=0,\"\",L193/L192-1)","v":7.7083702820613498E-2},"",null,null,null,{"$f":"K202","v":2012},{"$f":"IF(R192=\"\",\"\",IF(R192=0,\"\",R193/R192-1))","v":7.7083702820613498E-2},{"$f":"IF(S192=\"\",\"\",IF(S192=0,\"\",S193/S192-1))","v":""}]
[null,null,null,2013,null,null,4.2277614858259982E-2,null,null,null,2013,{"$f":"IF(L193=0,\"\",L194/L193-1)","v":-6.2160940325497349E-2},"",null,null,null,2013,{"$f":"IF(R193=\"\",\"\",IF(R193=0,\"\",R194/R193-1))","v":-0.10020224333222405},""]
[null,null,null,2014,null,null,2.8135990621336537E-2,null,null,null,2014,{"$f":"IF(L194=0,\"\",L195/L194-1)","v":0.10421547360809802},"",null,null,null,2014,{"$f":"IF(R194=\"\",\"\",IF(R194=0,\"\",R195/R194-1))","v":7.3997490293851387E-2},""]
[null,null,null,2015,null,null,-8.7799315849488302E-3,null,null,null,2015,{"$f":"IF(L195=0,\"\",L196/L195-1)","v":-0.31934319846335191},"",null,null,null,2015,{"$f":"IF(R195=\"\",\"\",IF(R195=0,\"\",R196/R195-1))","v":-0.31331414362401877},""]
[null,null,null,2016,null,null,2.2546876797423288E-2,null,null,null,2016,{"$f":"IF(K197=\"Forecast\",\"\",IF(L196=0,\"\",L197/L196-1))","v":""},{"$f":"IF(M196=0,\"\",M197/M196-1)","v":""},null,null,null,2016,{"$f":"IF(Q197=\"Forecast\",\"\",IF(R196=0,\"\",R197/R196-1))","v":""},{"$f":"IF(S196=\"\",\"\",IF(S196=0,\"\",S197/S196-1))","v":""}]
[null,null,null,2017,null,null,2.2612217347283137E-2,null,{"$f":"IF(I199=0,\"\",G198/I199-1)","v":4.880581516095539E-2},null,2017,{"$f":"IF(K198=\"Forecast\",\"\",IF(L197=0,\"\",L198/L197-1))","v":""},{"$f":"IF(M197=0,\"\",M198/M197-1)","v":1.8570226890423092E-2},null,{"$f":"IF(O199=0,\"\",M198/O199-1)","v":-0.55853531649390098},null,2017,{"$f":"IF(Q198=\"Forecast\",\"\",IF(R197=0,\"\",R198/R197-1))","v":""},{"$f":"IF(S197=\"\",\"\",IF(S197=0,\"\",S198/S197-1))","v":-3.9526131101242923E-3},null,{"$f":"IF(U199=0,\"\",S198/U199-1)","v":-0.57907872255804616}]
[null,null,null,"Geometric Mean",null,null,{"$f":"IF(G192=0,\"\",(G198/G192)^(1/($D198-$D192-1))-1)","v":2.1220801568562875E-2},null,{"$f":"IF(I199=0,\"\",(G198/I199)^(1/(TestYear-RebaseYear-1))-1)","v":1.6010888384145217E-2},null,"Geometric Mean",{"$f":"IF(L192=0,\"\",(L196/L192)^(1/($D196-$D192-1))-1)","v":-8.7737275972080697E-2},{"$f":"IF(M192=0,\"\",(M198/M192)^(1/($D198-$D192-1))-1)","v":""},null,{"$f":"IF(O199=0,\"\",(M198/O199)^(1/(TestYear-RebaseYear-1))-1)","v":-0.23856648474272257},null,"Geometric Mean",{"$f":"IF(R192=\"\",\"\",IF(R192=0,\"\",(R196/R192)^(1/($D196-$D192-1))-1))","v":-0.10590175336680596},{"$f":"IF(S192=\"\",\"\",IF(S192=0,\"\",(S198/S192)^(1/($D198-$D192-1))-1))","v":""},null,{"$f":"IF(U199=0,\"\",(S198/U199)^(1/(TestYear-RebaseYear-1))-1)","v":-0.25056559534686229}]
[]
[]
[null,null,null,"Calendar Year",null,"Revenues",null,null,null,null,{"$f":"IF(ISBLANK(N188),\"\",CONCATENATE(\"Demand (\",N188,\")\"))","v":"Demand (kW)"},null,null,null,null,null,{"$f":"CONCATENATE(\"Demand (\",N188,\") per \",LEFT(F190,LEN(F190)-1))","v":"Demand (kW) per Customer"}]
[null,null,null,{"$f":"CONCATENATE(\"(for \",TestYear,\" Cost of Service\")","v":"(for 2017 Cost of Service"},null,null,null,null,null,null,null,"Actual (Weather actual)","Weather-normalized",null,{"$f":"M212","v":"Weather-normalized"},null,null,{"$f":"L212","v":"Actual (Weather actual)"},{"$f":"M212","v":"Weather-normalized"},null,{"$f":"O212","v":"Weather-normalized"}]
[null,null,"Historical",{"$f":"D214-1","v":2011},null,{"$f":"F192","v":"Actual"},305462.76,{"$f":"IF(D213=RebaseYear,\"Board-approved\",\"\")","v":""},null,null,{"$f":"K192","v":"Actual"},{"$f":"[18]Summary!$G$34","v":4416},null,{"$f":"N192","v":""},null,null,{"$f":"K213","v":"Actual"},{"$f":"IF(G213=0,\"\",L213/G213)","v":1.4456754073720803E-2},{"$f":"IF(G213=0,\"\",M213/G213)","v":0},{"$f":"N213","v":""},{"$f":"IF(T213=\"\",\"\",IF(I213=0,\"\",O213/I213))","v":""}]
[null,null,"Historical",2012,null,"Actual",336670.2,"",null,null,"Actual",{"$f":"[18]Summary!$H$34","v":4424},null,"",null,null,{"$f":"K214","v":"Actual"},{"$f":"IF(G214=0,\"\",L214/G214)","v":1.3140456149668132E-2},{"$f":"IF(G214=0,\"\",M214/G214)","v":0},{"$f":"N214","v":""},{"$f":"IF(T214=\"\",\"\",IF(I214=0,\"\",O214/I214))","v":""}]
[null,null,"Historical",2013,null,"Actual",351542.21,"Board-approved",null,null,"Actual",{"$f":"[18]Summary!$I$34","v":4149},null,"Board-approved",4432,null,"Actual",1.1802281154231806E-2,0,"Board-approved",""]
[null,null,"Historical",2014,null,"Actual",369057.74,"",null,null,"Actual",{"$f":"[18]Summary!$J$34","v":4581.3899999999994},null,"",null,null,"Actual",1.2413748591209603E-2,0,"",""]
[null,null,"Historical",2015,null,"Actual",346859.88,"",null,null,"Actual",{"$f":"[18]Summary!$K$34","v":3139.7699999999995},null,"",null,null,"Actual",9.0519837578217442E-3,0,"",""]
[null,null,"Bridge Year (Forecast)",2016,null,"Forecast",{"$f":"[12]Revenue!$F$15","v":412000},"",null,null,"Forecast",null,{"$f":"[18]Summary!$L$34","v":1854.1136637654336},"",null,null,"Forecast",0,4.5002758829258095E-3,"",""]
[null,null,"Test Year (Forecast)",{"$f":"TestYear","v":2017},null,"Forecast",{"$f":"[12]Revenue!$G$15","v":444963},"",null,null,"Forecast",null,{"$f":"[18]Summary!$M$34","v":1888.5449751821914},"",null,null,"Forecast",0,4.2442741872519545E-3,"",""]
[null,null,null,null,null,null,null,null,{"$f":"SUM(I213:I218)","v":0},null,null,null,null,null,{"$f":"SUM(O213:O218)","v":4432},null,null,null,null,null,{"$f":"SUM(U213:U218)","v":0}]
[null,null,"Variance Analysis","Year",null,null,"Year-over-year",null,{"$f":"I200","v":"Test Year Versus Board-approved"},null,"Year","Year-over-year",null,null,{"$f":"I221","v":"Test Year Versus Board-approved"},null,"Year","Year-over-year",null,null,{"$f":"O221","v":"Test Year Versus Board-approved"}]
[null,null,null,{"$f":"D213","v":2011},null,null,null,null,null,null,{"$f":"D222","v":2011},null,null,null,null,null,{"$f":"K222","v":2011}]
[null,null,null,{"$f":"D214","v":2012},null,null,{"$f":"IF(G213=0,\"\",G214/G213-1)","v":0.10216446679130375},null,null,null,{"$f":"D223","v":2012},{"$f":"IF(L213=0,\"\",L214/L213-1)","v":1.8115942028984477E-3},{"$f":"IF(M213=0,\"\",M214/M213-1)","v":""},null,null,null,{"$f":"K223","v":2012},{"$f":"IF(R213=\"\",\"\",IF(R213=0,\"\",R214/R213-1))","v":-9.1050723927400212E-2},{"$f":"IF(S213=\"\",\"\",IF(S213=0,\"\",S214/S213-1))","v":""}]
[null,null,null,{"$f":"D215","v":2013},null,null,{"$f":"IF(G214=0,\"\",G215/G214-1)","v":4.417382352224819E-2},null,null,null,2013,{"$f":"IF(L214=0,\"\",L215/L214-1)","v":-6.2160940325497238E-2},"",null,null,null,2013,{"$f":"IF(R214=\"\",\"\",IF(R214=0,\"\",R215/R214-1))","v":-0.10183626657968969},""]
[null,null,null,2014,null,null,4.9824827579026731E-2,null,null,null,2014,{"$f":"IF(L215=0,\"\",L216/L215-1)","v":0.10421547360809824},"",null,null,null,2014,{"$f":"IF(R215=\"\",\"\",IF(R215=0,\"\",R216/R215-1))","v":5.1809258649845757E-2},""]
[null,null,null,2015,null,null,-6.0147390486919416E-2,null,null,null,2015,{"$f":"IF(L216=0,\"\",L217/L216-1)","v":-0.31466869225278793},"",null,null,null,2015,{"$f":"IF(R216=\"\",\"\",IF(R216=0,\"\",R217/R216-1))","v":-0.27080980484560357},""]
[null,null,null,2016,null,null,0.1877995229658731,null,null,null,2016,{"$f":"IF(K218=\"Forecast\",\"\",IF(L217=0,\"\",L218/L217-1))","v":""},{"$f":"IF(M217=0,\"\",M218/M217-1)","v":""},null,null,null,2016,{"$f":"IF(Q218=\"Forecast\",\"\",IF(R217=0,\"\",R218/R217-1))","v":""},{"$f":"IF(S217=\"\",\"\",IF(S217=0,\"\",S218/S217-1))","v":""}]
[null,null,null,2017,null,null,8.0007281553398091E-2,null,{"$f":"IF(I220=0,\"\",G219/I220-1)","v":""},null,2017,{"$f":"IF(K219=\"Forecast\",\"\",IF(L218=0,\"\",L219/L218-1))","v":""},{"$f":"IF(M218=0,\"\",M219/M218-1)","v":1.8570226890423092E-2},null,{"$f":"IF(O220=0,\"\",M219/O220-1)","v":-0.57388425650221309},null,2017,{"$f":"IF(Q219=\"Forecast\",\"\",IF(R218=0,\"\",R219/R218-1))","v":""},{"$f":"IF(S218=\"\",\"\",IF(S218=0,\"\",S219/S218-1))","v":-5.6885778190873482E-2},null,{"$f":"IF(U220=0,\"\",S219/U220-1)","v":""}]
[null,null,null,"Geometric Mean",null,null,{"$f":"IF(G213=0,\"\",(G219/G213)^(1/($D219-$D213-1))-1)","v":7.8134951958980459E-2},null,{"$f":"IF(I220=0,\"\",(G219/I220)^(1/(TestYear-RebaseYear-1))-1)","v":""},null,"Geometric Mean",{"$f":"IF(L213=0,\"\",(L217/L213)^(1/($D217-$D213-1))-1)","v":-0.10746979257642619},{"$f":"IF(M213=0,\"\",(M219/M213)^(1/($D219-$D213-1))-1)","v":""},null,{"$f":"IF(O220=0,\"\",(M219/O220)^(1/(TestYear-RebaseYear-1))-1)","v":-0.24749534055251754},null,"Geometric Mean",{"$f":"IF(R213=\"\",\"\",IF(R213=0,\"\",(R217/R213)^(1/($D217-$D213-1))-1))","v":-0.14449150909254926},{"$f":"IF(S213=\"\",\"\",IF(S213=0,\"\",(S219/S213)^(1/($D219-$D213-1))-1))","v":""},null,{"$f":"IF(U220=0,\"\",(S219/U220)^(1/(TestYear-RebaseYear-1))-1)","v":""}]
[]
[null,5,"Customer Class:","Unmetered Scattered Load",null,null,null,"Is the customer class billed on consumption (kWh) or demand (kW or kVA)?",null,null,null,null,null,"kWh"]
[]
[null,null,null,"Calendar Year",null,"Customers",null,null,null,null,"Consumption (kWh) (3)",null,null,null,null,null,{"$f":"CONCATENATE(\"Consumption (kWh) per \",LEFT(F233,LEN(F233)-1))","v":"Consumption (kWh) per Customer"}]
[null,null,null,{"$f":"CONCATENATE(\"(for \",TestYear,\" Cost of Service\")","v":"(for 2017 Cost of Service"},null,null,null,null,null,null,null,"Actual (Weather actual)","Weather-normalized",null,"Weather-normalized",null,null,{"$f":"L234","v":"Actual (Weather actual)"},{"$f":"M234","v":"Weather-normalized"},null,{"$f":"O234","v":"Weather-normalized"}]
[null,null,"Historical",{"$f":"D236-1","v":2011},null,{"$f":"F192","v":"Actual"},{"$f":"[18]Summary!$G$37","v":81},{"$f":"IF(D235=RebaseYear,\"Board-approved\",\"\")","v":""},null,null,{"$f":"F235","v":"Actual"},{"$f":"[18]Summary!$G$38","v":492456.22757582989},null,{"$f":"H235","v":""},null,null,{"$f":"K235","v":"Actual"},{"$f":"IF(G235=0,\"\",L235/G235)","v":6079.7065132818507},{"$f":"IF(G235=0,\"\",M235/G235)","v":0},{"$f":"N235","v":""},{"$f":"IF(T235=\"\",\"\",IF(I235=0,\"\",O235/I235))","v":""}]
[null,null,"Historical",2012,null,{"$f":"F193","v":"Actual"},{"$f":"[18]Summary!$H$37","v":78.666666666666671},"",null,null,{"$f":"F236","v":"Actual"},{"$f":"[18]Summary!$H$38","v":481034.65506622108},null,{"$f":"H236","v":""},null,null,{"$f":"K236","v":"Actual"},{"$f":"IF(G236=0,\"\",L236/G236)","v":6114.8473101638265},{"$f":"IF(G236=0,\"\",M236/G236)","v":0},{"$f":"N236","v":""},{"$f":"IF(T236=\"\",\"\",IF(I236=0,\"\",O236/I236))","v":""}]
[null,null,"Historical",2013,null,"Actual",{"$f":"[18]Summary!$I$37","v":77.583333333333329},"Board-approved",78,null,"Actual",{"$f":"[18]Summary!$I$38","v":473256.31021658465},null,"Board-approved",474652,null,"Actual",6099.9739233072141,0,"Board-approved",6085.2820512820517]
[null,null,"Historical",2014,null,"Actual",{"$f":"[18]Summary!$J$37","v":75.583333333333329},"",null,null,"Actual",{"$f":"[18]Summary!$J$38","v":465477.96536694834},null,"",null,null,"Actual",6158.4736321977734,0,"",""]
[null,null,"Historical",2015,null,"Actual",{"$f":"[18]Summary!$K$37","v":76},"",null,null,"Actual",{"$f":"[18]Summary!$K$38","v":465054.82051731192},null,"",null,null,"Actual",6119.1423752277888,0,"",""]
[null,null,"Bridge Year",2016,null,"Forecast",{"$f":"[18]Summary!$L$37","v":75},"",null,null,"Forecast",null,{"$f":"[18]Summary!$L$38","v":496660.25825870311},"",null,null,"Forecast",0,6622.1367767827078,"",""]
[null,null,"Test Year",{"$f":"TestYear","v":2017},null,"Forecast",{"$f":"[18]Summary!$M$37","v":74},"",null,null,"Forecast",null,{"$f":"[18]Summary!$M$38","v":530366.92860140104},"",null,null,"Forecast",0,7167.1206567756899,"",""]
[null,null,null,null,null,null,null,null,{"$f":"SUM(I235:I240)","v":78},null,null,null,null,null,{"$f":"SUM(O235:O240)","v":474652},null,null,null,null,null,{"$f":"SUM(U235:U240)","v":6085.2820512820517}]
[null,null,"Variance Analysis","Year",null,null,"Year-over-year",null,"Test Year Versus Board-approved",null,"Year","Year-over-year",null,null,{"$f":"I243","v":"Test Year Versus Board-approved"},null,"Year","Year-over-year",null,null,{"$f":"O243","v":"Test Year Versus Board-approved"}]
[null,null,null,{"$f":"D235","v":2011},null,null,null,null,null,null,{"$f":"D244","v":2011},null,null,null,null,null,{"$f":"K244","v":2011}]
[null,null,null,2012,null,null,{"$f":"IF(G235=0,\"\",G236/G235-1)","v":-2.8806584362139898E-2},null,null,null,{"$f":"D245","v":2012},{"$f":"IF(L235=0,\"\",L236/L235-1)","v":-2.3193071526037445E-2},"",null,null,null,{"$f":"K245","v":2012},{"$f":"IF(R235=\"\",\"\",IF(R235=0,\"\",R236/R235-1))","v":5.780015335478117E-3},{"$f":"IF(S235=\"\",\"\",IF(S235=0,\"\",S236/S235-1))","v":""}]
[null,null,null,2013,null,null,-1.3771186440678096E-2,null,null,null,2013,{"$f":"IF(L236=0,\"\",L237/L236-1)","v":-1.6170030095993049E-2},"",null,null,null,2013,{"$f":"IF(R236=\"\",\"\",IF(R236=0,\"\",R237/R236-1))","v":-2.4323398610281988E-3},""]
[null,null,null,2014,null,null,-2.5778732545649885E-2,null,null,null,2014,{"$f":"IF(L237=0,\"\",L238/L237-1)","v":-1.6435797435171207E-2},"",null,null,null,2014,{"$f":"IF(R237=\"\",\"\",IF(R237=0,\"\",R238/R237-1))","v":9.5901572082202069E-3},""]
[null,null,null,2015,null,null,5.5126791620727644E-3,null,null,null,2015,{"$f":"IF(L238=0,\"\",L239/L238-1)","v":-9.0905452270517717E-4},"",null,null,null,2015,{"$f":"IF(R238=\"\",\"\",IF(R238=0,\"\",R239/R238-1))","v":-6.386526811506088E-3},""]
[null,null,null,2016,null,null,-1.3157894736842146E-2,null,null,null,2016,{"$f":"IF(K240=\"Forecast\",\"\",IF(L239=0,\"\",L240/L239-1))","v":""},{"$f":"IF(M239=0,\"\",M240/M239-1)","v":""},null,null,null,2016,{"$f":"IF(Q240=\"Forecast\",\"\",IF(R239=0,\"\",R240/R239-1))","v":""},{"$f":"IF(S239=\"\",\"\",IF(S239=0,\"\",S240/S239-1))","v":""}]
[null,null,null,2017,null,null,-1.3333333333333308E-2,null,{"$f":"IF(I242=0,\"\",G241/I242-1)","v":-5.1282051282051322E-2},null,2017,{"$f":"IF(K241=\"Forecast\",\"\",IF(L240=0,\"\",L241/L240-1))","v":""},{"$f":"IF(M240=0,\"\",M241/M240-1)","v":6.7866654885723854E-2},null,{"$f":"IF(O242=0,\"\",M241/O242-1)","v":0.11738058325131062},null,2017,{"$f":"IF(Q241=\"Forecast\",\"\",IF(R240=0,\"\",R241/R240-1))","v":""},{"$f":"IF(S240=\"\",\"\",IF(S240=0,\"\",S241/S240-1))","v":8.2297285357152639E-2},null,{"$f":"IF(U242=0,\"\",S241/U242-1)","v":0.17777953369732735}]
[null,null,null,"Geometric Mean",null,null,{"$f":"IF(G235=0,\"\",(G241/G235)^(1/($D241-$D235-1))-1)","v":-1.7914406785968229E-2},null,{"$f":"IF(I242=0,\"\",(G241/I242)^(1/(TestYear-RebaseYear-1))-1)","v":-1.7394843217379163E-2},null,"Geometric Mean",{"$f":"IF(L235=0,\"\",(L239/L235)^(1/($D239-$D235-1))-1)","v":-1.8902492965781947E-2},{"$f":"IF(M235=0,\"\",(M241/M235)^(1/($D241-$D235-1))-1)","v":""},null,{"$f":"IF(O242=0,\"\",(M241/O242)^(1/(TestYear-RebaseYear-1))-1)","v":3.7688586844278671E-2},null,"Geometric Mean",{"$f":"IF(R235=\"\",\"\",IF(R235=0,\"\",(R239/R235)^(1/($D239-$D235-1))-1))","v":2.1575000499050034E-3},{"$f":"IF(S235=\"\",\"\",IF(S235=0,\"\",(S241/S235)^(1/($D241-$D235-1))-1))","v":""},null,{"$f":"IF(U242=0,\"\",(S241/U242)^(1/(TestYear-RebaseYear-1))-1)","v":5.6058559922501638E-2}]
[]
[]
[null,null,null,"Calendar Year",null,"Revenues",null,null,null,null,{"$f":"IF(ISBLANK(N231),\"\",CONCATENATE(\"Demand (\",N231,\")\"))","v":"Demand (kWh)"},null,null,null,null,null,{"$f":"CONCATENATE(\"Demand (\",N231,\") per \",LEFT(F233,LEN(F233)-1))","v":"Demand (kWh) per Customer"}]
[null,null,null,{"$f":"CONCATENATE(\"(for \",TestYear,\" Cost of Service\")","v":"(for 2017 Cost of Service"},null,null,null,null,null,null,null,"Actual (Weather actual)","Weather-normalized",null,{"$f":"M255","v":"Weather-normalized"},null,null,{"$f":"L255","v":"Actual (Weather actual)"},{"$f":"M255","v":"Weather-normalized"},null,{"$f":"O255","v":"Weather-normalized"}]
[null,null,"Historical",{"$f":"D257-1","v":2011},null,{"$f":"F235","v":"Actual"},41668.94,{"$f":"IF(D256=RebaseYear,\"Board-approved\",\"\")","v":""},null,null,{"$f":"K235","v":"Actual"},null,null,{"$f":"N235","v":""},null,null,{"$f":"K256","v":"Actual"},{"$f":"IF(G256=0,\"\",L256/G256)","v":0},{"$f":"IF(G256=0,\"\",M256/G256)","v":0},{"$f":"N256","v":""},{"$f":"IF(T256=\"\",\"\",IF(I256=0,\"\",O256/I256))","v":""}]
[null,null,"Historical",2012,null,"Actual",40088.559999999998,"",null,null,"Actual",null,null,"",null,null,{"$f":"K257","v":"Actual"},{"$f":"IF(G257=0,\"\",L257/G257)","v":0},{"$f":"IF(G257=0,\"\",M257/G257)","v":0},{"$f":"N257","v":""},{"$f":"IF(T257=\"\",\"\",IF(I257=0,\"\",O257/I257))","v":""}]
[null,null,"Historical",2013,null,"Actual",25774.68,"Board-approved",null,null,"Actual",null,null,"Board-approved",null,null,"Actual",0,0,"Board-approved",""]
[null,null,"Historical",2014,null,"Actual",15942.1,"",null,null,"Actual",null,null,"",null,null,"Actual",0,0,"",""]
[null,null,"Historical",2015,null,"Actual",16740.72,"",null,null,"Actual",null,null,"",null,null,"Actual",0,0,"",""]
[null,null,"Bridge Year (Forecast)",2016,null,"Forecast",{"$f":"[12]Revenue!$F$16","v":19200},"",null,null,"Forecast",null,null,"",null,null,"Forecast",0,0,"",""]
[null,null,"Test Year (Forecast)",{"$f":"TestYear","v":2017},null,"Forecast",{"$f":"[12]Revenue!$G$16","v":20770},"",null,null,"Forecast",null,null,"",null,null,"Forecast",0,0,"",""]
[null,null,null,null,null,null,null,null,{"$f":"SUM(I256:I261)","v":0},null,null,null,null,null,{"$f":"SUM(O256:O261)","v":0},null,null,null,null,null,{"$f":"SUM(U256:U261)","v":0}]
[null,null,"Variance Analysis","Year",null,null,"Year-over-year",null,{"$f":"I243","v":"Test Year Versus Board-approved"},null,"Year","Year-over-year",null,null,{"$f":"I264","v":"Test Year Versus Board-approved"},null,"Year","Year-over-year",null,null,{"$f":"O264","v":"Test Year Versus Board-approved"}]
[null,null,null,{"$f":"D256","v":2011},null,null,null,null,null,null,{"$f":"D265","v":2011},null,null,null,null,null,{"$f":"K265","v":2011}]
[null,null,null,{"$f":"D257","v":2012},null,null,{"$f":"IF(G256=0,\"\",G257/G256-1)","v":-3.7927050700113929E-2},null,null,null,{"$f":"D266","v":2012},{"$f":"IF(L256=0,\"\",L257/L256-1)","v":""},{"$f":"IF(M256=0,\"\",M257/M256-1)","v":""},null,null,null,{"$f":"K266","v":2012},{"$f":"IF(R256=\"\",\"\",IF(R256=0,\"\",R257/R256-1))","v":""},{"$f":"IF(S256=\"\",\"\",IF(S256=0,\"\",S257/S256-1))","v":""}]
[null,null,null,{"$f":"D258","v":2013},null,null,{"$f":"IF(G257=0,\"\",G258/G257-1)","v":-0.35705647696001053},null,null,null,2013,{"$f":"IF(L257=0,\"\",L258/L257-1)","v":""},"",null,null,null,2013,{"$f":"IF(R257=\"\",\"\",IF(R257=0,\"\",R258/R257-1))","v":""},""]
[null,null,null,2014,null,null,-0.38148213673263842,null,null,null,2014,{"$f":"IF(L258=0,\"\",L259/L258-1)","v":""},"",null,null,null,2014,{"$f":"IF(R258=\"\",\"\",IF(R258=0,\"\",R259/R258-1))","v":""},""]
[null,null,null,2015,null,null,5.0095031394860268E-2,null,null,null,2015,{"$f":"IF(L259=0,\"\",L260/L259-1)","v":""},"",null,null,null,2015,{"$f":"IF(R259=\"\",\"\",IF(R259=0,\"\",R260/R259-1))","v":""},""]
[null,null,null,2016,null,null,0.14690407581035925,null,null,null,2016,{"$f":"IF(K261=\"Forecast\",\"\",IF(L260=0,\"\",L261/L260-1))","v":""},{"$f":"IF(M260=0,\"\",M261/M260-1)","v":""},null,null,null,2016,{"$f":"IF(Q261=\"Forecast\",\"\",IF(R260=0,\"\",R261/R260-1))","v":""},{"$f":"IF(S260=\"\",\"\",IF(S260=0,\"\",S261/S260-1))","v":""}]
[null,null,null,2017,null,null,8.1770833333333348E-2,null,{"$f":"IF(I263=0,\"\",G262/I263-1)","v":""},null,2017,{"$f":"IF(K262=\"Forecast\",\"\",IF(L261=0,\"\",L262/L261-1))","v":""},{"$f":"IF(M261=0,\"\",M262/M261-1)","v":""},null,{"$f":"IF(O263=0,\"\",M262/O263-1)","v":""},null,2017,{"$f":"IF(Q262=\"Forecast\",\"\",IF(R261=0,\"\",R262/R261-1))","v":""},{"$f":"IF(S261=\"\",\"\",IF(S261=0,\"\",S262/S261-1))","v":""},null,{"$f":"IF(U263=0,\"\",S262/U263-1)","v":""}]
[null,null,null,"Geometric Mean",null,null,{"$f":"IF(G256=0,\"\",(G262/G256)^(1/($D262-$D256-1))-1)","v":-0.12998886959951228},null,{"$f":"IF(I263=0,\"\",(G262/I263)^(1/(TestYear-RebaseYear-1))-1)","v":""},null,"Geometric Mean",{"$f":"IF(L256=0,\"\",(L260/L256)^(1/($D260-$D256-1))-1)","v":""},{"$f":"IF(M256=0,\"\",(M262/M256)^(1/($D262-$D256-1))-1)","v":""},null,{"$f":"IF(O263=0,\"\",(M262/O263)^(1/(TestYear-RebaseYear-1))-1)","v":""},null,"Geometric Mean",{"$f":"IF(R256=\"\",\"\",IF(R256=0,\"\",(R260/R256)^(1/($D260-$D256-1))-1))","v":""},{"$f":"IF(S256=\"\",\"\",IF(S256=0,\"\",(S262/S256)^(1/($D262-$D256-1))-1))","v":""},null,{"$f":"IF(U263=0,\"\",(S262/U263)^(1/(TestYear-RebaseYear-1))-1)","v":""}]
[]
[null,{"$f":"B231+1","v":6},"Customer Class:","Sentinels",null,null,null,"Is the customer class billed on consumption (kWh) or demand (kW or kVA)?",null,null,null,null,null,"kW"]
[]
[null,null,null,"Calendar Year",null,"Customers",null,null,null,null,"Consumption (kWh) (3)",null,null,null,null,null,{"$f":"CONCATENATE(\"Consumption (kWh) per \",LEFT(F276,LEN(F276)-1))","v":"Consumption (kWh) per Customer"}]
[null,null,null,{"$f":"CONCATENATE(\"(for \",TestYear,\" Cost of Service\")","v":"(for 2017 Cost of Service"},null,null,null,null,null,null,null,"Actual (Weather actual)","Weather-normalized",null,"Weather-normalized",null,null,{"$f":"L277","v":"Actual (Weather actual)"},{"$f":"M277","v":"Weather-normalized"},null,{"$f":"O277","v":"Weather-normalized"}]
[null,null,"Historical",{"$f":"D279-1","v":2011},null,{"$f":"F235","v":"Actual"},{"$f":"[18]Summary!$G$27","v":225},{"$f":"IF(D278=RebaseYear,\"Board-approved\",\"\")","v":""},null,null,{"$f":"F278","v":"Actual"},{"$f":"[18]Summary!$G$28","v":110240.82},null,{"$f":"H278","v":""},null,null,{"$f":"K278","v":"Actual"},{"$f":"IF(G278=0,\"\",L278/G278)","v":489.95920000000001},{"$f":"IF(G278=0,\"\",M278/G278)","v":0},{"$f":"N278","v":""},{"$f":"IF(T278=\"\",\"\",IF(I278=0,\"\",O278/I278))","v":""}]
[null,null,"Historical",2012,null,{"$f":"F236","v":"Actual"},{"$f":"[18]Summary!$H$27","v":172.08333333333334},"",null,null,{"$f":"F279","v":"Actual"},{"$f":"[18]Summary!$H$28","v":113359.85597714041},null,{"$f":"H279","v":""},null,null,{"$f":"K279","v":"Actual"},{"$f":"IF(G279=0,\"\",L279/G279)","v":658.7497683901621},{"$f":"IF(G279=0,\"\",M279/G279)","v":0},{"$f":"N279","v":""},{"$f":"IF(T279=\"\",\"\",IF(I279=0,\"\",O279/I279))","v":""}]
[null,null,"Historical",2013,null,"Actual",{"$f":"[18]Summary!$I$27","v":168},"Board-approved",237,null,"Actual",{"$f":"[18]Summary!$I$28","v":101843.93410009757},null,"Board-approved",104942,null,"Actual",606.21389345296177,0,"Board-approved",442.7932489451477]
[null,null,"Historical",2014,null,"Actual",{"$f":"[18]Summary!$J$27","v":169.41666666666666},"",null,null,"Actual",{"$f":"[18]Summary!$J$28","v":107980},null,"",null,null,"Actual",637.36350221347766,0,"",""]
[null,null,"Historical",2015,null,"Actual",{"$f":"[18]Summary!$K$27","v":165.75},"",null,null,"Actual",{"$f":"[18]Summary!$K$28","v":103536},null,"",null,null,"Actual",624.65158371040729,0,"",""]
[null,null,"Bridge Year",2016,null,"Forecast",{"$f":"[18]Summary!$L$27","v":163},"",null,null,"Forecast",null,{"$f":"[18]Summary!$L$28","v":100673.16794547772},"",null,null,"Forecast",0,617.62679721151972,"",""]
[null,null,"Test Year",{"$f":"TestYear","v":2017},null,"Forecast",{"$f":"[18]Summary!$M$27","v":161},"",null,null,"Forecast",null,{"$f":"[18]Summary!$M$28","v":98319.642763457639},"",null,null,"Forecast",0,610.68101095315308,"",""]
[null,null,null,null,null,null,null,null,{"$f":"SUM(I278:I283)","v":237},null,null,null,null,null,{"$f":"SUM(O278:O283)","v":104942},null,null,null,null,null,{"$f":"SUM(U278:U283)","v":442.7932489451477}]
[null,null,"Variance Analysis","Year",null,null,"Year-over-year",null,"Test Year Versus Board-approved",null,"Year","Year-over-year",null,null,{"$f":"I286","v":"Test Year Versus Board-approved"},null,"Year","Year-over-year",null,null,{"$f":"O286","v":"Test Year Versus Board-approved"}]
[null,null,null,{"$f":"D278","v":2011},null,null,null,null,null,null,{"$f":"D287","v":2011},null,null,null,null,null,{"$f":"K287","v":2011}]
[null,null,null,2012,null,null,{"$f":"IF(G278=0,\"\",G279/G278-1)","v":-0.23518518518518516},null,null,null,{"$f":"D288","v":2012},{"$f":"IF(L278=0,\"\",L279/L278-1)","v":2.8292931575984337E-2},"",null,null,null,{"$f":"K288","v":2012},{"$f":"IF(R278=\"\",\"\",IF(R278=0,\"\",R279/R278-1))","v":0.34449923256908344},{"$f":"IF(S278=\"\",\"\",IF(S278=0,\"\",S279/S278-1))","v":""}]
[null,null,null,2013,null,null,-2.3728813559322104E-2,null,null,null,2013,{"$f":"IF(L279=0,\"\",L280/L279-1)","v":-0.10158730158730167},"",null,null,null,2013,{"$f":"IF(R279=\"\",\"\",IF(R279=0,\"\",R280/R279-1))","v":-7.9750881834214971E-2},""]
[null,null,null,2014,null,null,8.4325396825395416E-3,null,null,null,2014,{"$f":"IF(L280=0,\"\",L281/L280-1)","v":6.0249694339886695E-2},"",null,null,null,2014,{"$f":"IF(R280=\"\",\"\",IF(R280=0,\"\",R281/R280-1))","v":5.1383858233748914E-2},""]
[null,null,null,2015,null,null,-2.1642892277422443E-2,null,null,null,2015,{"$f":"IF(L281=0,\"\",L282/L281-1)","v":-4.1155769586960544E-2},"",null,null,null,2015,{"$f":"IF(R281=\"\",\"\",IF(R281=0,\"\",R282/R281-1))","v":-1.9944534726139107E-2},""]
[null,null,null,2016,null,null,-1.6591251885369585E-2,null,null,null,2016,{"$f":"IF(K283=\"Forecast\",\"\",IF(L282=0,\"\",L283/L282-1))","v":""},{"$f":"IF(M282=0,\"\",M283/M282-1)","v":""},null,null,null,2016,{"$f":"IF(Q283=\"Forecast\",\"\",IF(R282=0,\"\",R283/R282-1))","v":""},{"$f":"IF(S282=\"\",\"\",IF(S282=0,\"\",S283/S282-1))","v":""}]
[null,null,null,2017,null,null,-1.2269938650306789E-2,null,{"$f":"IF(I285=0,\"\",G284/I285-1)","v":-0.32067510548523204},null,2017,{"$f":"IF(K284=\"Forecast\",\"\",IF(L283=0,\"\",L284/L283-1))","v":""},{"$f":"IF(M283=0,\"\",M284/M283-1)","v":-2.3377879429548609E-2},null,{"$f":"IF(O285=0,\"\",M284/O285-1)","v":-6.3104926879060441E-2},null,2017,{"$f":"IF(Q284=\"Forecast\",\"\",IF(R283=0,\"\",R284/R283-1))","v":""},{"$f":"IF(S283=\"\",\"\",IF(S283=0,\"\",S284/S283-1))","v":-1.1245927621219898E-2},null,{"$f":"IF(U285=0,\"\",S284/U285-1)","v":0.37915610142647638}]
[null,null,null,"Geometric Mean",null,null,{"$f":"IF(G278=0,\"\",(G284/G278)^(1/($D284-$D278-1))-1)","v":-6.4747944028415438E-2},null,{"$f":"IF(I285=0,\"\",(G284/I285)^(1/(TestYear-RebaseYear-1))-1)","v":-0.12092517406747483},null,"Geometric Mean",{"$f":"IF(L278=0,\"\",(L282/L278)^(1/($D282-$D278-1))-1)","v":-2.0698734245121586E-2},{"$f":"IF(M278=0,\"\",(M284/M278)^(1/($D284-$D278-1))-1)","v":""},null,{"$f":"IF(O285=0,\"\",(M284/O285)^(1/(TestYear-RebaseYear-1))-1)","v":-2.1493642437847016E-2},null,"Geometric Mean",{"$f":"IF(R278=\"\",\"\",IF(R278=0,\"\",(R282/R278)^(1/($D282-$D278-1))-1))","v":8.4324597050266625E-2},{"$f":"IF(S278=\"\",\"\",IF(S278=0,\"\",(S284/S278)^(1/($D284-$D278-1))-1))","v":""},null,{"$f":"IF(U285=0,\"\",(S284/U285)^(1/(TestYear-RebaseYear-1))-1)","v":0.11310929251574309}]
[]
[]
[null,null,null,"Calendar Year",null,"Revenues",null,null,null,null,{"$f":"IF(ISBLANK(N274),\"\",CONCATENATE(\"Demand (\",N274,\")\"))","v":"Demand (kW)"},null,null,null,null,null,{"$f":"CONCATENATE(\"Demand (\",N274,\") per \",LEFT(F276,LEN(F276)-1))","v":"Demand (kW) per Customer"}]
[null,null,null,{"$f":"CONCATENATE(\"(for \",TestYear,\" Cost of Service\")","v":"(for 2017 Cost of Service"},null,null,null,null,null,null,null,"Actual (Weather actual)","Weather-normalized",null,{"$f":"M298","v":"Weather-normalized"},null,null,{"$f":"L298","v":"Actual (Weather actual)"},{"$f":"M298","v":"Weather-normalized"},null,{"$f":"O298","v":"Weather-normalized"}]
[null,null,"Historical",{"$f":"D300-1","v":2011},null,{"$f":"F278","v":"Actual"},22989.61,{"$f":"IF(D299=RebaseYear,\"Board-approved\",\"\")","v":""},null,null,{"$f":"K278","v":"Actual"},{"$f":"[18]Summary!$G$29","v":306.31894444444447},null,{"$f":"N278","v":""},null,null,{"$f":"K299","v":"Actual"},{"$f":"IF(G299=0,\"\",L299/G299)","v":1.3324234053750562E-2},{"$f":"IF(G299=0,\"\",M299/G299)","v":0},{"$f":"N299","v":""},{"$f":"IF(T299=\"\",\"\",IF(I299=0,\"\",O299/I299))","v":""}]
[null,null,"Historical",2012,null,"Actual",25484.85,"",null,null,"Actual",{"$f":"[18]Summary!$H$29","v":315},null,"",null,null,{"$f":"K300","v":"Actual"},{"$f":"IF(G300=0,\"\",L300/G300)","v":1.2360284639697704E-2},{"$f":"IF(G300=0,\"\",M300/G300)","v":0},{"$f":"N300","v":""},{"$f":"IF(T300=\"\",\"\",IF(I300=0,\"\",O300/I300))","v":""}]
[null,null,"Historical",2013,null,"Actual",31111.7,"Board-approved",null,null,"Actual",{"$f":"[18]Summary!$I$29","v":283},null,"Board-approved",292,null,"Actual",9.0962563922897168E-3,0,"Board-approved",""]
[null,null,"Historical",2014,null,"Actual",35599.339999999997,"",null,null,"Actual",{"$f":"[18]Summary!$J$29","v":299.94344444444442},null,"",null,null,"Actual",8.4255338566513998E-3,0,"",""]
[null,null,"Historical",2015,null,"Actual",39171.08,"",null,null,"Actual",{"$f":"[18]Summary!$K$29","v":287.601},null,"",null,null,"Actual",7.3421769325737246E-3,0,"",""]
[null,null,"Bridge Year (Forecast)",2016,null,"Forecast",{"$f":"[12]Revenue!$F$14","v":39200},"",null,null,"Forecast",null,{"$f":"[18]Summary!$L$29","v":279.72691784487739},"",null,null,"Forecast",0,7.1358907613489134E-3,"",""]
[null,null,"Test Year (Forecast)",{"$f":"TestYear","v":2017},null,"Forecast",{"$f":"[12]Revenue!$G$14","v":42350},"",null,null,"Forecast",null,{"$f":"[18]Summary!$M$29","v":273.18749568630062},"",null,null,"Forecast",0,6.4507082806682554E-3,"",""]
[null,null,null,null,null,null,null,null,{"$f":"SUM(I299:I304)","v":0},null,null,null,null,null,{"$f":"SUM(O299:O304)","v":292},null,null,null,null,null,{"$f":"SUM(U299:U304)","v":0}]
[null,null,"Variance Analysis","Year",null,null,"Year-over-year",null,{"$f":"I286","v":"Test Year Versus Board-approved"},null,"Year","Year-over-year",null,null,{"$f":"I307","v":"Test Year Versus Board-approved"},null,"Year","Year-over-year",null,null,{"$f":"O307","v":"Test Year Versus Board-approved"}]
[null,null,null,{"$f":"D299","v":2011},null,null,null,null,null,null,{"$f":"D308","v":2011},null,null,null,null,null,{"$f":"K308","v":2011}]
[null,null,null,{"$f":"D300","v":2012},null,null,{"$f":"IF(G299=0,\"\",G300/G299-1)","v":0.10853772639031267},null,null,null,{"$f":"D309","v":2012},{"$f":"IF(L299=0,\"\",L300/L299-1)","v":2.8339923837554126E-2},{"$f":"IF(M299=0,\"\",M300/M299-1)","v":""},null,null,null,{"$f":"K309","v":2012},{"$f":"IF(R299=\"\",\"\",IF(R299=0,\"\",R300/R299-1))","v":-7.2345578002025679E-2},{"$f":"IF(S299=\"\",\"\",IF(S299=0,\"\",S300/S299-1))","v":""}]
[null,null,null,{"$f":"D301","v":2013},null,null,{"$f":"IF(G300=0,\"\",G301/G300-1)","v":0.22079196071391438},null,null,null,2013,{"$f":"IF(L300=0,\"\",L301/L300-1)","v":-0.10158730158730156},"",null,null,null,2013,{"$f":"IF(R300=\"\",\"\",IF(R300=0,\"\",R301/R300-1))","v":-0.26407387390779502},""]
[null,null,null,2014,null,null,0.14424284111765018,null,null,null,2014,{"$f":"IF(L301=0,\"\",L302/L301-1)","v":5.9870828425598654E-2},"",null,null,null,2014,{"$f":"IF(R301=\"\",\"\",IF(R301=0,\"\",R302/R301-1))","v":-7.373610710960643E-2},""]
[null,null,null,2015,null,null,0.10033163536177936,null,null,null,2015,{"$f":"IF(L302=0,\"\",L303/L302-1)","v":-4.1149238875032301E-2},"",null,null,null,2015,{"$f":"IF(R302=\"\",\"\",IF(R302=0,\"\",R303/R302-1))","v":-0.12858021135627351},""]
[null,null,null,2016,null,null,7.3829978647510508E-4,null,null,null,2016,{"$f":"IF(K304=\"Forecast\",\"\",IF(L303=0,\"\",L304/L303-1))","v":""},{"$f":"IF(M303=0,\"\",M304/M303-1)","v":""},null,null,null,2016,{"$f":"IF(Q304=\"Forecast\",\"\",IF(R303=0,\"\",R304/R303-1))","v":""},{"$f":"IF(S303=\"\",\"\",IF(S303=0,\"\",S304/S303-1))","v":""}]
[null,null,null,2017,null,null,8.0357142857142794E-2,null,{"$f":"IF(I306=0,\"\",G305/I306-1)","v":""},null,2017,{"$f":"IF(K305=\"Forecast\",\"\",IF(L304=0,\"\",L305/L304-1))","v":""},{"$f":"IF(M304=0,\"\",M305/M304-1)","v":-2.3377879429548498E-2},null,{"$f":"IF(O306=0,\"\",M305/O306-1)","v":-6.4426384635956735E-2},null,2017,{"$f":"IF(Q305=\"Forecast\",\"\",IF(R304=0,\"\",R305/R304-1))","v":""},{"$f":"IF(S304=\"\",\"\",IF(S304=0,\"\",S305/S304-1))","v":-9.6019194182722645E-2},null,{"$f":"IF(U306=0,\"\",S305/U306-1)","v":""}]
[null,null,null,"Geometric Mean",null,null,{"$f":"IF(G299=0,\"\",(G305/G299)^(1/($D305-$D299-1))-1)","v":0.12996336209387649},null,{"$f":"IF(I306=0,\"\",(G305/I306)^(1/(TestYear-RebaseYear-1))-1)","v":""},null,"Geometric Mean",{"$f":"IF(L299=0,\"\",(L303/L299)^(1/($D303-$D299-1))-1)","v":-2.0798255936902543E-2},{"$f":"IF(M299=0,\"\",(M305/M299)^(1/($D305-$D299-1))-1)","v":""},null,{"$f":"IF(O306=0,\"\",(M305/O306)^(1/(TestYear-RebaseYear-1))-1)","v":-2.1953908575261472E-2},null,"Geometric Mean",{"$f":"IF(R299=\"\",\"\",IF(R299=0,\"\",(R303/R299)^(1/($D303-$D299-1))-1))","v":-0.18016296887855254},{"$f":"IF(S299=\"\",\"\",IF(S299=0,\"\",(S305/S299)^(1/($D305-$D299-1))-1))","v":""},null,{"$f":"IF(U306=0,\"\",(S305/U306)^(1/(TestYear-RebaseYear-1))-1)","v":""}]
[]
[null,{"$f":"B274+1","v":7},"Customer Class:",null,null,null,null,"Is the customer class billed on consumption (kWh) or demand (kW or kVA)?"]
[]
[null,null,null,"Calendar Year",null,"Customers",null,null,null,null,"Consumption (kWh) (3)",null,null,null,null,null,{"$f":"CONCATENATE(\"Consumption (kWh) per \",LEFT(F319,LEN(F319)-1))","v":"Consumption (kWh) per Customer"}]
[null,null,null,{"$f":"CONCATENATE(\"(for \",TestYear,\" Cost of Service\")","v":"(for 2017 Cost of Service"},null,null,null,null,null,null,null,"Actual (Weather actual)","Weather-normalized",null,"Weather-normalized",null,null,{"$f":"L320","v":"Actual (Weather actual)"},{"$f":"M320","v":"Weather-normalized"},null,{"$f":"O320","v":"Weather-normalized"}]
[null,null,"Historical",{"$f":"D322-1","v":2011},null,{"$f":"F278","v":"Actual"},null,{"$f":"IF(D321=RebaseYear,\"Board-approved\",\"\")","v":""},null,null,{"$f":"F321","v":"Actual"},null,null,{"$f":"H321","v":""},null,null,{"$f":"K321","v":"Actual"},{"$f":"IF(G321=0,\"\",L321/G321)","v":""},{"$f":"IF(G321=0,\"\",M321/G321)","v":""},{"$f":"N321","v":""},{"$f":"IF(T321=\"\",\"\",IF(I321=0,\"\",O321/I321))","v":""}]
[null,null,"Historical",2012,null,{"$f":"F279","v":"Actual"},null,"",null,null,{"$f":"F322","v":"Actual"},null,null,{"$f":"H322","v":""},null,null,{"$f":"K322","v":"Actual"},{"$f":"IF(G322=0,\"\",L322/G322)","v":""},{"$f":"IF(G322=0,\"\",M322/G322)","v":""},{"$f":"N322","v":""},{"$f":"IF(T322=\"\",\"\",IF(I322=0,\"\",O322/I322))","v":""}]
[null,null,"Historical",2013,null,"Actual",null,"Board-approved",null,null,"Actual",null,null,"Board-approved",null,null,"Actual","","","Board-approved",""]
[null,null,"Historical",2014,null,"Actual",null,"",null,null,"Actual",null,null,"",null,null,"Actual","","","",""]
[null,null,"Historical",2015,null,"Actual",null,"",null,null,"Actual",null,null,"",null,null,"Actual","","","",""]
[null,null,"Bridge Year",2016,null,"Forecast",null,"",null,null,"Forecast",null,null,"",null,null,"Forecast","","","",""]
[null,null,"Test Year",{"$f":"TestYear","v":2017},null,"Forecast",null,"",null,null,"Forecast",null,null,"",null,null,"Forecast","","","",""]
[null,null,null,null,null,null,null,null,{"$f":"SUM(I321:I326)","v":0},null,null,null,null,null,{"$f":"SUM(O321:O326)","v":0},null,null,null,null,null,{"$f":"SUM(U321:U326)","v":0}]
[null,null,"Variance Analysis","Year",null,null,"Year-over-year",null,"Test Year Versus Board-approved",null,"Year","Year-over-year",null,null,{"$f":"I329","v":"Test Year Versus Board-approved"},null,"Year","Year-over-year",null,null,{"$f":"O329","v":"Test Year Versus Board-approved"}]
[null,null,null,{"$f":"D321","v":2011},null,null,null,null,null,null,{"$f":"D330","v":2011},null,null,null,null,null,{"$f":"K330","v":2011}]
[null,null,null,2012,null,null,{"$f":"IF(G321=0,\"\",G322/G321-1)","v":""},null,null,null,{"$f":"D331","v":2012},{"$f":"IF(L321=0,\"\",L322/L321-1)","v":""},"",null,null,null,{"$f":"K331","v":2012},{"$f":"IF(R321=\"\",\"\",IF(R321=0,\"\",R322/R321-1))","v":""},{"$f":"IF(S321=\"\",\"\",IF(S321=0,\"\",S322/S321-1))","v":""}]
[null,null,null,2013,null,null,"",null,null,null,2013,{"$f":"IF(L322=0,\"\",L323/L322-1)","v":""},"",null,null,null,2013,{"$f":"IF(R322=\"\",\"\",IF(R322=0,\"\",R323/R322-1))","v":""},""]
[null,null,null,2014,null,null,"",null,null,null,2014,{"$f":"IF(L323=0,\"\",L324/L323-1)","v":""},"",null,null,null,2014,{"$f":"IF(R323=\"\",\"\",IF(R323=0,\"\",R324/R323-1))","v":""},""]
[null,null,null,2015,null,null,"",null,null,null,2015,{"$f":"IF(L324=0,\"\",L325/L324-1)","v":""},"",null,null,null,2015,{"$f":"IF(R324=\"\",\"\",IF(R324=0,\"\",R325/R324-1))","v":""},""]
[null,null,null,2016,null,null,"",null,null,null,2016,{"$f":"IF(K326=\"Forecast\",\"\",IF(L325=0,\"\",L326/L325-1))","v":""},{"$f":"IF(M325=0,\"\",M326/M325-1)","v":""},null,null,null,2016,{"$f":"IF(Q326=\"Forecast\",\"\",IF(R325=0,\"\",R326/R325-1))","v":""},{"$f":"IF(S325=\"\",\"\",IF(S325=0,\"\",S326/S325-1))","v":""}]
[null,null,null,2017,null,null,"",null,{"$f":"IF(I328=0,\"\",G327/I328-1)","v":""},null,2017,{"$f":"IF(K327=\"Forecast\",\"\",IF(L326=0,\"\",L327/L326-1))","v":""},{"$f":"IF(M326=0,\"\",M327/M326-1)","v":""},null,{"$f":"IF(O328=0,\"\",M327/O328-1)","v":""},null,2017,{"$f":"IF(Q327=\"Forecast\",\"\",IF(R326=0,\"\",R327/R326-1))","v":""},{"$f":"IF(S326=\"\",\"\",IF(S326=0,\"\",S327/S326-1))","v":""},null,{"$f":"IF(U328=0,\"\",S327/U328-1)","v":""}]
[null,null,null,"Geometric Mean",null,null,{"$f":"IF(G321=0,\"\",(G327/G321)^(1/($D327-$D321-1))-1)","v":""},null,{"$f":"IF(I328=0,\"\",(G327/I328)^(1/(TestYear-RebaseYear-1))-1)","v":""},null,"Geometric Mean",{"$f":"IF(L321=0,\"\",(L325/L321)^(1/($D325-$D321-1))-1)","v":""},{"$f":"IF(M321=0,\"\",(M327/M321)^(1/($D327-$D321-1))-1)","v":""},null,{"$f":"IF(O328=0,\"\",(M327/O328)^(1/(TestYear-RebaseYear-1))-1)","v":""},null,"Geometric Mean",{"$f":"IF(R321=\"\",\"\",IF(R321=0,\"\",(R325/R321)^(1/($D325-$D321-1))-1))","v":""},{"$f":"IF(S321=\"\",\"\",IF(S321=0,\"\",(S327/S321)^(1/($D327-$D321-1))-1))","v":""},null,{"$f":"IF(U328=0,\"\",(S327/U328)^(1/(TestYear-RebaseYear-1))-1)","v":""}]
[]
[]
[null,null,null,"Calendar Year",null,"Revenues",null,null,null,null,{"$f":"IF(ISBLANK(N317),\"\",CONCATENATE(\"Demand (\",N317,\")\"))","v":""},null,null,null,null,null,{"$f":"CONCATENATE(\"Demand (\",N317,\") per \",LEFT(F319,LEN(F319)-1))","v":"Demand () per Customer"}]
[null,null,null,{"$f":"CONCATENATE(\"(for \",TestYear,\" Cost of Service\")","v":"(for 2017 Cost of Service"},null,null,null,null,null,null,null,"Actual (Weather actual)","Weather-normalized",null,{"$f":"M341","v":"Weather-normalized"},null,null,{"$f":"L341","v":"Actual (Weather actual)"},{"$f":"M341","v":"Weather-normalized"},null,{"$f":"O341","v":"Weather-normalized"}]
[null,null,"Historical",{"$f":"D343-1","v":2011},null,{"$f":"F321","v":"Actual"},null,{"$f":"IF(D342=RebaseYear,\"Board-approved\",\"\")","v":""},null,null,{"$f":"K321","v":"Actual"},null,null,{"$f":"N321","v":""},null,null,{"$f":"K342","v":"Actual"},{"$f":"IF(G342=0,\"\",L342/G342)","v":""},{"$f":"IF(G342=0,\"\",M342/G342)","v":""},{"$f":"N342","v":""},{"$f":"IF(T342=\"\",\"\",IF(I342=0,\"\",O342/I342))","v":""}]
[null,null,"Historical",2012,null,"Actual",null,"",null,null,"Actual",null,null,"",null,null,{"$f":"K343","v":"Actual"},{"$f":"IF(G343=0,\"\",L343/G343)","v":""},{"$f":"IF(G343=0,\"\",M343/G343)","v":""},{"$f":"N343","v":""},{"$f":"IF(T343=\"\",\"\",IF(I343=0,\"\",O343/I343))","v":""}]
[null,null,"Historical",2013,null,"Actual",null,"Board-approved",null,null,"Actual",null,null,"Board-approved",null,null,"Actual","","","Board-approved",""]
[null,null,"Historical",2014,null,"Actual",null,"",null,null,"Actual",null,null,"",null,null,"Actual","","","",""]
[null,null,"Historical",2015,null,"Actual",null,"",null,null,"Actual",null,null,"",null,null,"Actual","","","",""]
[null,null,"Bridge Year (Forecast)",2016,null,"Forecast",null,"",null,null,"Forecast",null,null,"",null,null,"Forecast","","","",""]
[null,null,"Test Year (Forecast)",{"$f":"TestYear","v":2017},null,"Forecast",null,"",null,null,"Forecast",null,null,"",null,null,"Forecast","","","",""]
[null,null,null,null,null,null,null,null,{"$f":"SUM(I342:I347)","v":0},null,null,null,null,null,{"$f":"SUM(O342:O347)","v":0},null,null,null,null,null,{"$f":"SUM(U342:U347)","v":0}]
[null,null,"Variance Analysis","Year",null,null,"Year-over-year",null,{"$f":"I329","v":"Test Year Versus Board-approved"},null,"Year","Year-over-year",null,null,{"$f":"I350","v":"Test Year Versus Board-approved"},null,"Year","Year-over-year",null,null,{"$f":"O350","v":"Test Year Versus Board-approved"}]
[null,null,null,{"$f":"D342","v":2011},null,null,null,null,null,null,{"$f":"D351","v":2011},null,null,null,null,null,{"$f":"K351","v":2011}]
[null,null,null,{"$f":"D343","v":2012},null,null,{"$f":"IF(G342=0,\"\",G343/G342-1)","v":""},null,null,null,{"$f":"D352","v":2012},{"$f":"IF(L342=0,\"\",L343/L342-1)","v":""},{"$f":"IF(M342=0,\"\",M343/M342-1)","v":""},null,null,null,{"$f":"K352","v":2012},{"$f":"IF(R342=\"\",\"\",IF(R342=0,\"\",R343/R342-1))","v":""},{"$f":"IF(S342=\"\",\"\",IF(S342=0,\"\",S343/S342-1))","v":""}]
[null,null,null,{"$f":"D344","v":2013},null,null,{"$f":"IF(G343=0,\"\",G344/G343-1)","v":""},null,null,null,2013,{"$f":"IF(L343=0,\"\",L344/L343-1)","v":""},"",null,null,null,2013,{"$f":"IF(R343=\"\",\"\",IF(R343=0,\"\",R344/R343-1))","v":""},""]
[null,null,null,2014,null,null,"",null,null,null,2014,{"$f":"IF(L344=0,\"\",L345/L344-1)","v":""},"",null,null,null,2014,{"$f":"IF(R344=\"\",\"\",IF(R344=0,\"\",R345/R344-1))","v":""},""]
[null,null,null,2015,null,null,"",null,null,null,2015,{"$f":"IF(L345=0,\"\",L346/L345-1)","v":""},"",null,null,null,2015,{"$f":"IF(R345=\"\",\"\",IF(R345=0,\"\",R346/R345-1))","v":""},""]
[null,null,null,2016,null,null,"",null,null,null,2016,{"$f":"IF(K347=\"Forecast\",\"\",IF(L346=0,\"\",L347/L346-1))","v":""},{"$f":"IF(M346=0,\"\",M347/M346-1)","v":""},null,null,null,2016,{"$f":"IF(Q347=\"Forecast\",\"\",IF(R346=0,\"\",R347/R346-1))","v":""},{"$f":"IF(S346=\"\",\"\",IF(S346=0,\"\",S347/S346-1))","v":""}]
[null,null,null,2017,null,null,"",null,{"$f":"IF(I349=0,\"\",G348/I349-1)","v":""},null,2017,{"$f":"IF(K348=\"Forecast\",\"\",IF(L347=0,\"\",L348/L347-1))","v":""},{"$f":"IF(M347=0,\"\",M348/M347-1)","v":""},null,{"$f":"IF(O349=0,\"\",M348/O349-1)","v":""},null,2017,{"$f":"IF(Q348=\"Forecast\",\"\",IF(R347=0,\"\",R348/R347-1))","v":""},{"$f":"IF(S347=\"\",\"\",IF(S347=0,\"\",S348/S347-1))","v":""},null,{"$f":"IF(U349=0,\"\",S348/U349-1)","v":""}]
[null,null,null,"Geometric Mean",null,null,{"$f":"IF(G342=0,\"\",(G348/G342)^(1/($D348-$D342-1))-1)","v":""},null,{"$f":"IF(I349=0,\"\",(G348/I349)^(1/(TestYear-RebaseYear-1))-1)","v":""},null,"Geometric Mean",{"$f":"IF(L342=0,\"\",(L346/L342)^(1/($D346-$D342-1))-1)","v":""},{"$f":"IF(M342=0,\"\",(M348/M342)^(1/($D348-$D342-1))-1)","v":""},null,{"$f":"IF(O349=0,\"\",(M348/O349)^(1/(TestYear-RebaseYear-1))-1)","v":""},null,"Geometric Mean",{"$f":"IF(R342=\"\",\"\",IF(R342=0,\"\",(R346/R342)^(1/($D346-$D342-1))-1))","v":""},{"$f":"IF(S342=\"\",\"\",IF(S342=0,\"\",(S348/S342)^(1/($D348-$D342-1))-1))","v":""},null,{"$f":"IF(U349=0,\"\",(S348/U349)^(1/(TestYear-RebaseYear-1))-1)","v":""}]
[]
[null,{"$f":"B317+1","v":8},"Customer Class:",null,null,null,null,"Is the customer class billed on consumption (kWh) or demand (kW or kVA)?"]
[]
[null,null,null,"Calendar Year",null,"Customers",null,null,null,null,"Consumption (kWh) (3)",null,null,null,null,null,{"$f":"CONCATENATE(\"Consumption (kWh) per \",LEFT(F362,LEN(F362)-1))","v":"Consumption (kWh) per Customer"}]
[null,null,null,{"$f":"CONCATENATE(\"(for \",TestYear,\" Cost of Service\")","v":"(for 2017 Cost of Service"},null,null,null,null,null,null,null,"Actual (Weather actual)","Weather-normalized",null,"Weather-normalized",null,null,{"$f":"L363","v":"Actual (Weather actual)"},{"$f":"M363","v":"Weather-normalized"},null,{"$f":"O363","v":"Weather-normalized"}]
[null,null,"Historical",{"$f":"D365-1","v":2011},null,{"$f":"F321","v":"Actual"},null,{"$f":"IF(D364=RebaseYear,\"Board-approved\",\"\")","v":""},null,null,{"$f":"F364","v":"Actual"},null,null,{"$f":"H364","v":""},null,null,{"$f":"K364","v":"Actual"},{"$f":"IF(G364=0,\"\",L364/G364)","v":""},{"$f":"IF(G364=0,\"\",M364/G364)","v":""},{"$f":"N364","v":""},{"$f":"IF(T364=\"\",\"\",IF(I364=0,\"\",O364/I364))","v":""}]
[null,null,"Historical",2012,null,{"$f":"F322","v":"Actual"},null,"",null,null,{"$f":"F365","v":"Actual"},null,null,{"$f":"H365","v":""},null,null,{"$f":"K365","v":"Actual"},{"$f":"IF(G365=0,\"\",L365/G365)","v":""},{"$f":"IF(G365=0,\"\",M365/G365)","v":""},{"$f":"N365","v":""},{"$f":"IF(T365=\"\",\"\",IF(I365=0,\"\",O365/I365))","v":""}]
[null,null,"Historical",2013,null,"Actual",null,"Board-approved",null,null,"Actual",null,null,"Board-approved",null,null,"Actual","","","Board-approved",""]
[null,null,"Historical",2014,null,"Actual",null,"",null,null,"Actual",null,null,"",null,null,"Actual","","","",""]
[null,null,"Historical",2015,null,"Actual",null,"",null,null,"Actual",null,null,"",null,null,"Actual","","","",""]
[null,null,"Bridge Year",2016,null,"Forecast",null,"",null,null,"Forecast",null,null,"",null,null,"Forecast","","","",""]
[null,null,"Test Year",{"$f":"TestYear","v":2017},null,"Forecast",null,"",null,null,"Forecast",null,null,"",null,null,"Forecast","","","",""]
[null,null,null,null,null,null,null,null,{"$f":"SUM(I364:I369)","v":0},null,null,null,null,null,{"$f":"SUM(O364:O369)","v":0},null,null,null,null,null,{"$f":"SUM(U364:U369)","v":0}]
[null,null,"Variance Analysis","Year",null,null,"Year-over-year",null,"Test Year Versus Board-approved",null,"Year","Year-over-year",null,null,{"$f":"I372","v":"Test Year Versus Board-approved"},null,"Year","Year-over-year",null,null,{"$f":"O372","v":"Test Year Versus Board-approved"}]
[null,null,null,{"$f":"D364","v":2011},null,null,null,null,null,null,{"$f":"D373","v":2011},null,null,null,null,null,{"$f":"K373","v":2011}]
[null,null,null,2012,null,null,{"$f":"IF(G364=0,\"\",G365/G364-1)","v":""},null,null,null,{"$f":"D374","v":2012},{"$f":"IF(L364=0,\"\",L365/L364-1)","v":""},"",null,null,null,{"$f":"K374","v":2012},{"$f":"IF(R364=\"\",\"\",IF(R364=0,\"\",R365/R364-1))","v":""},{"$f":"IF(S364=\"\",\"\",IF(S364=0,\"\",S365/S364-1))","v":""}]
[null,null,null,2013,null,null,"",null,null,null,2013,{"$f":"IF(L365=0,\"\",L366/L365-1)","v":""},"",null,null,null,2013,{"$f":"IF(R365=\"\",\"\",IF(R365=0,\"\",R366/R365-1))","v":""},""]
[null,null,null,2014,null,null,"",null,null,null,2014,{"$f":"IF(L366=0,\"\",L367/L366-1)","v":""},"",null,null,null,2014,{"$f":"IF(R366=\"\",\"\",IF(R366=0,\"\",R367/R366-1))","v":""},""]
[null,null,null,2015,null,null,"",null,null,null,2015,{"$f":"IF(L367=0,\"\",L368/L367-1)","v":""},"",null,null,null,2015,{"$f":"IF(R367=\"\",\"\",IF(R367=0,\"\",R368/R367-1))","v":""},""]
[null,null,null,2016,null,null,"",null,null,null,2016,{"$f":"IF(K369=\"Forecast\",\"\",IF(L368=0,\"\",L369/L368-1))","v":""},{"$f":"IF(M368=0,\"\",M369/M368-1)","v":""},null,null,null,2016,{"$f":"IF(Q369=\"Forecast\",\"\",IF(R368=0,\"\",R369/R368-1))","v":""},{"$f":"IF(S368=\"\",\"\",IF(S368=0,\"\",S369/S368-1))","v":""}]
[null,null,null,2017,null,null,"",null,{"$f":"IF(I371=0,\"\",G370/I371-1)","v":""},null,2017,{"$f":"IF(K370=\"Forecast\",\"\",IF(L369=0,\"\",L370/L369-1))","v":""},{"$f":"IF(M369=0,\"\",M370/M369-1)","v":""},null,{"$f":"IF(O371=0,\"\",M370/O371-1)","v":""},null,2017,{"$f":"IF(Q370=\"Forecast\",\"\",IF(R369=0,\"\",R370/R369-1))","v":""},{"$f":"IF(S369=\"\",\"\",IF(S369=0,\"\",S370/S369-1))","v":""},null,{"$f":"IF(U371=0,\"\",S370/U371-1)","v":""}]
[null,null,null,"Geometric Mean",null,null,{"$f":"IF(G364=0,\"\",(G370/G364)^(1/($D370-$D364-1))-1)","v":""},null,{"$f":"IF(I371=0,\"\",(G370/I371)^(1/(TestYear-RebaseYear-1))-1)","v":""},null,"Geometric Mean",{"$f":"IF(L364=0,\"\",(L368/L364)^(1/($D368-$D364-1))-1)","v":""},{"$f":"IF(M364=0,\"\",(M370/M364)^(1/($D370-$D364-1))-1)","v":""},null,{"$f":"IF(O371=0,\"\",(M370/O371)^(1/(TestYear-RebaseYear-1))-1)","v":""},null,"Geometric Mean",{"$f":"IF(R364=\"\",\"\",IF(R364=0,\"\",(R368/R364)^(1/($D368-$D364-1))-1))","v":""},{"$f":"IF(S364=\"\",\"\",IF(S364=0,\"\",(S370/S364)^(1/($D370-$D364-1))-1))","v":""},null,{"$f":"IF(U371=0,\"\",(S370/U371)^(1/(TestYear-RebaseYear-1))-1)","v":""}]
[]
[]
[null,null,null,"Calendar Year",null,"Revenues",null,null,null,null,{"$f":"IF(ISBLANK(N360),\"\",CONCATENATE(\"Demand (\",N360,\")\"))","v":""},null,null,null,null,null,{"$f":"CONCATENATE(\"Demand (\",N360,\") per \",LEFT(F362,LEN(F362)-1))","v":"Demand () per Customer"}]
[null,null,null,{"$f":"CONCATENATE(\"(for \",TestYear,\" Cost of Service\")","v":"(for 2017 Cost of Service"},null,null,null,null,null,null,null,"Actual (Weather actual)","Weather-normalized",null,{"$f":"M384","v":"Weather-normalized"},null,null,{"$f":"L384","v":"Actual (Weather actual)"},{"$f":"M384","v":"Weather-normalized"},null,{"$f":"O384","v":"Weather-normalized"}]
[null,null,"Historical",{"$f":"D386-1","v":2011},null,{"$f":"F364","v":"Actual"},null,{"$f":"IF(D385=RebaseYear,\"Board-approved\",\"\")","v":""},null,null,{"$f":"K364","v":"Actual"},null,null,{"$f":"N364","v":""},null,null,{"$f":"K385","v":"Actual"},{"$f":"IF(G385=0,\"\",L385/G385)","v":""},{"$f":"IF(G385=0,\"\",M385/G385)","v":""},{"$f":"N385","v":""},{"$f":"IF(T385=\"\",\"\",IF(I385=0,\"\",O385/I385))","v":""}]
[null,null,"Historical",2012,null,"Actual",null,"",null,null,"Actual",null,null,"",null,null,{"$f":"K386","v":"Actual"},{"$f":"IF(G386=0,\"\",L386/G386)","v":""},{"$f":"IF(G386=0,\"\",M386/G386)","v":""},{"$f":"N386","v":""},{"$f":"IF(T386=\"\",\"\",IF(I386=0,\"\",O386/I386))","v":""}]
[null,null,"Historical",2013,null,"Actual",null,"Board-approved",null,null,"Actual",null,null,"Board-approved",null,null,"Actual","","","Board-approved",""]
[null,null,"Historical",2014,null,"Actual",null,"",null,null,"Actual",null,null,"",null,null,"Actual","","","",""]
[null,null,"Historical",2015,null,"Actual",null,"",null,null,"Actual",null,null,"",null,null,"Actual","","","",""]
[null,null,"Bridge Year (Forecast)",2016,null,"Forecast",null,"",null,null,"Forecast",null,null,"",null,null,"Forecast","","","",""]
[null,null,"Test Year (Forecast)",{"$f":"TestYear","v":2017},null,"Forecast",null,"",null,null,"Forecast",null,null,"",null,null,"Forecast","","","",""]
[null,null,null,null,null,null,null,null,{"$f":"SUM(I385:I390)","v":0},null,null,null,null,null,{"$f":"SUM(O385:O390)","v":0},null,null,null,null,null,{"$f":"SUM(U385:U390)","v":0}]
[null,null,"Variance Analysis","Year",null,null,"Year-over-year",null,{"$f":"I372","v":"Test Year Versus Board-approved"},null,"Year","Year-over-year",null,null,{"$f":"I393","v":"Test Year Versus Board-approved"},null,"Year","Year-over-year",null,null,{"$f":"O393","v":"Test Year Versus Board-approved"}]
[null,null,null,{"$f":"D385","v":2011},null,null,null,null,null,null,{"$f":"D394","v":2011},null,null,null,null,null,{"$f":"K394","v":2011}]
[null,null,null,{"$f":"D386","v":2012},null,null,{"$f":"IF(G385=0,\"\",G386/G385-1)","v":""},null,null,null,{"$f":"D395","v":2012},{"$f":"IF(L385=0,\"\",L386/L385-1)","v":""},{"$f":"IF(M385=0,\"\",M386/M385-1)","v":""},null,null,null,{"$f":"K395","v":2012},{"$f":"IF(R385=\"\",\"\",IF(R385=0,\"\",R386/R385-1))","v":""},{"$f":"IF(S385=\"\",\"\",IF(S385=0,\"\",S386/S385-1))","v":""}]
[null,null,null,{"$f":"D387","v":2013},null,null,{"$f":"IF(G386=0,\"\",G387/G386-1)","v":""},null,null,null,2013,{"$f":"IF(L386=0,\"\",L387/L386-1)","v":""},"",null,null,null,2013,{"$f":"IF(R386=\"\",\"\",IF(R386=0,\"\",R387/R386-1))","v":""},""]
[null,null,null,2014,null,null,"",null,null,null,2014,{"$f":"IF(L387=0,\"\",L388/L387-1)","v":""},"",null,null,null,2014,{"$f":"IF(R387=\"\",\"\",IF(R387=0,\"\",R388/R387-1))","v":""},""]
[null,null,null,2015,null,null,"",null,null,null,2015,{"$f":"IF(L388=0,\"\",L389/L388-1)","v":""},"",null,null,null,2015,{"$f":"IF(R388=\"\",\"\",IF(R388=0,\"\",R389/R388-1))","v":""},""]
[null,null,null,2016,null,null,"",null,null,null,2016,{"$f":"IF(K390=\"Forecast\",\"\",IF(L389=0,\"\",L390/L389-1))","v":""},{"$f":"IF(M389=0,\"\",M390/M389-1)","v":""},null,null,null,2016,{"$f":"IF(Q390=\"Forecast\",\"\",IF(R389=0,\"\",R390/R389-1))","v":""},{"$f":"IF(S389=\"\",\"\",IF(S389=0,\"\",S390/S389-1))","v":""}]
[null,null,null,2017,null,null,"",null,{"$f":"IF(I392=0,\"\",G391/I392-1)","v":""},null,2017,{"$f":"IF(K391=\"Forecast\",\"\",IF(L390=0,\"\",L391/L390-1))","v":""},{"$f":"IF(M390=0,\"\",M391/M390-1)","v":""},null,{"$f":"IF(O392=0,\"\",M391/O392-1)","v":""},null,2017,{"$f":"IF(Q391=\"Forecast\",\"\",IF(R390=0,\"\",R391/R390-1))","v":""},{"$f":"IF(S390=\"\",\"\",IF(S390=0,\"\",S391/S390-1))","v":""},null,{"$f":"IF(U392=0,\"\",S391/U392-1)","v":""}]
[null,null,null,"Geometric Mean",null,null,{"$f":"IF(G385=0,\"\",(G391/G385)^(1/($D391-$D385-1))-1)","v":""},null,{"$f":"IF(I392=0,\"\",(G391/I392)^(1/(TestYear-RebaseYear-1))-1)","v":""},null,"Geometric Mean",{"$f":"IF(L385=0,\"\",(L389/L385)^(1/($D389-$D385-1))-1)","v":""},{"$f":"IF(M385=0,\"\",(M391/M385)^(1/($D391-$D385-1))-1)","v":""},null,{"$f":"IF(O392=0,\"\",(M391/O392)^(1/(TestYear-RebaseYear-1))-1)","v":""},null,"Geometric Mean",{"$f":"IF(R385=\"\",\"\",IF(R385=0,\"\",(R389/R385)^(1/($D389-$D385-1))-1))","v":""},{"$f":"IF(S385=\"\",\"\",IF(S385=0,\"\",(S391/S385)^(1/($D391-$D385-1))-1))","v":""},null,{"$f":"IF(U392=0,\"\",(S391/U392)^(1/(TestYear-RebaseYear-1))-1)","v":""}]
[]
[null,{"$f":"B360+1","v":9},"Customer Class:",null,null,null,null,"Is the customer class billed on consumption (kWh) or demand (kW or kVA)?"]
[]
[null,null,null,"Calendar Year",null,"Customers",null,null,null,null,"Consumption (kWh) (3)",null,null,null,null,null,{"$f":"CONCATENATE(\"Consumption (kWh) per \",LEFT(F405,LEN(F405)-1))","v":"Consumption (kWh) per Customer"}]
[null,null,null,{"$f":"CONCATENATE(\"(for \",TestYear,\" Cost of Service\")","v":"(for 2017 Cost of Service"},null,null,null,null,null,null,null,"Actual (Weather actual)","Weather-normalized",null,"Weather-normalized",null,null,{"$f":"L406","v":"Actual (Weather actual)"},{"$f":"M406","v":"Weather-normalized"},null,{"$f":"O406","v":"Weather-normalized"}]
[null,null,"Historical",{"$f":"D408-1","v":2011},null,{"$f":"F364","v":"Actual"},null,{"$f":"IF(D407=RebaseYear,\"Board-approved\",\"\")","v":""},null,null,{"$f":"F407","v":"Actual"},null,null,{"$f":"H407","v":""},null,null,{"$f":"K407","v":"Actual"},{"$f":"IF(G407=0,\"\",L407/G407)","v":""},{"$f":"IF(G407=0,\"\",M407/G407)","v":""},{"$f":"N407","v":""},{"$f":"IF(T407=\"\",\"\",IF(I407=0,\"\",O407/I407))","v":""}]
[null,null,"Historical",2012,null,{"$f":"F365","v":"Actual"},null,"",null,null,{"$f":"F408","v":"Actual"},null,null,{"$f":"H408","v":""},null,null,{"$f":"K408","v":"Actual"},{"$f":"IF(G408=0,\"\",L408/G408)","v":""},{"$f":"IF(G408=0,\"\",M408/G408)","v":""},{"$f":"N408","v":""},{"$f":"IF(T408=\"\",\"\",IF(I408=0,\"\",O408/I408))","v":""}]
[null,null,"Historical",2013,null,"Actual",null,"Board-approved",null,null,"Actual",null,null,"Board-approved",null,null,"Actual","","","Board-approved",""]
[null,null,"Historical",2014,null,"Actual",null,"",null,null,"Actual",null,null,"",null,null,"Actual","","","",""]
[null,null,"Historical",2015,null,"Actual",null,"",null,null,"Actual",null,null,"",null,null,"Actual","","","",""]
[null,null,"Bridge Year",2016,null,"Forecast",null,"",null,null,"Forecast",null,null,"",null,null,"Forecast","","","",""]
[null,null,"Test Year",{"$f":"TestYear","v":2017},null,"Forecast",null,"",null,null,"Forecast",null,null,"",null,null,"Forecast","","","",""]
[null,null,null,null,null,null,null,null,{"$f":"SUM(I407:I412)","v":0},null,null,null,null,null,{"$f":"SUM(O407:O412)","v":0},null,null,null,null,null,{"$f":"SUM(U407:U412)","v":0}]
[null,null,"Variance Analysis","Year",null,null,"Year-over-year",null,"Test Year Versus Board-approved",null,"Year","Year-over-year",null,null,{"$f":"I415","v":"Test Year Versus Board-approved"},null,"Year","Year-over-year",null,null,{"$f":"O415","v":"Test Year Versus Board-approved"}]
[null,null,null,{"$f":"D407","v":2011},null,null,null,null,null,null,{"$f":"D416","v":2011},null,null,null,null,null,{"$f":"K416","v":2011}]
[null,null,null,2012,null,null,{"$f":"IF(G407=0,\"\",G408/G407-1)","v":""},null,null,null,{"$f":"D417","v":2012},{"$f":"IF(L407=0,\"\",L408/L407-1)","v":""},"",null,null,null,{"$f":"K417","v":2012},{"$f":"IF(R407=\"\",\"\",IF(R407=0,\"\",R408/R407-1))","v":""},{"$f":"IF(S407=\"\",\"\",IF(S407=0,\"\",S408/S407-1))","v":""}]
[null,null,null,2013,null,null,"",null,null,null,2013,{"$f":"IF(L408=0,\"\",L409/L408-1)","v":""},"",null,null,null,2013,{"$f":"IF(R408=\"\",\"\",IF(R408=0,\"\",R409/R408-1))","v":""},""]
[null,null,null,2014,null,null,"",null,null,null,2014,{"$f":"IF(L409=0,\"\",L410/L409-1)","v":""},"",null,null,null,2014,{"$f":"IF(R409=\"\",\"\",IF(R409=0,\"\",R410/R409-1))","v":""},""]
[null,null,null,2015,null,null,"",null,null,null,2015,{"$f":"IF(L410=0,\"\",L411/L410-1)","v":""},"",null,null,null,2015,{"$f":"IF(R410=\"\",\"\",IF(R410=0,\"\",R411/R410-1))","v":""},""]
[null,null,null,2016,null,null,"",null,null,null,2016,{"$f":"IF(K412=\"Forecast\",\"\",IF(L411=0,\"\",L412/L411-1))","v":""},{"$f":"IF(M411=0,\"\",M412/M411-1)","v":""},null,null,null,2016,{"$f":"IF(Q412=\"Forecast\",\"\",IF(R411=0,\"\",R412/R411-1))","v":""},{"$f":"IF(S411=\"\",\"\",IF(S411=0,\"\",S412/S411-1))","v":""}]
[null,null,null,2017,null,null,"",null,{"$f":"IF(I414=0,\"\",G413/I414-1)","v":""},null,2017,{"$f":"IF(K413=\"Forecast\",\"\",IF(L412=0,\"\",L413/L412-1))","v":""},{"$f":"IF(M412=0,\"\",M413/M412-1)","v":""},null,{"$f":"IF(O414=0,\"\",M413/O414-1)","v":""},null,2017,{"$f":"IF(Q413=\"Forecast\",\"\",IF(R412=0,\"\",R413/R412-1))","v":""},{"$f":"IF(S412=\"\",\"\",IF(S412=0,\"\",S413/S412-1))","v":""},null,{"$f":"IF(U414=0,\"\",S413/U414-1)","v":""}]
[null,null,null,"Geometric Mean",null,null,{"$f":"IF(G407=0,\"\",(G413/G407)^(1/($D413-$D407-1))-1)","v":""},null,{"$f":"IF(I414=0,\"\",(G413/I414)^(1/(TestYear-RebaseYear-1))-1)","v":""},null,"Geometric Mean",{"$f":"IF(L407=0,\"\",(L411/L407)^(1/($D411-$D407-1))-1)","v":""},{"$f":"IF(M407=0,\"\",(M413/M407)^(1/($D413-$D407-1))-1)","v":""},null,{"$f":"IF(O414=0,\"\",(M413/O414)^(1/(TestYear-RebaseYear-1))-1)","v":""},null,"Geometric Mean",{"$f":"IF(R407=\"\",\"\",IF(R407=0,\"\",(R411/R407)^(1/($D411-$D407-1))-1))","v":""},{"$f":"IF(S407=\"\",\"\",IF(S407=0,\"\",(S413/S407)^(1/($D413-$D407-1))-1))","v":""},null,{"$f":"IF(U414=0,\"\",(S413/U414)^(1/(TestYear-RebaseYear-1))-1)","v":""}]
[]
[]
[null,null,null,"Calendar Year",null,"Revenues",null,null,null,null,{"$f":"IF(ISBLANK(N403),\"\",CONCATENATE(\"Demand (\",N403,\")\"))","v":""},null,null,null,null,null,{"$f":"CONCATENATE(\"Demand (\",N403,\") per \",LEFT(F405,LEN(F405)-1))","v":"Demand () per Customer"}]
[null,null,null,{"$f":"CONCATENATE(\"(for \",TestYear,\" Cost of Service\")","v":"(for 2017 Cost of Service"},null,null,null,null,null,null,null,"Actual (Weather actual)","Weather-normalized",null,{"$f":"M427","v":"Weather-normalized"},null,null,{"$f":"L427","v":"Actual (Weather actual)"},{"$f":"M427","v":"Weather-normalized"},null,{"$f":"O427","v":"Weather-normalized"}]
[null,null,"Historical",{"$f":"D429-1","v":2011},null,{"$f":"F407","v":"Actual"},null,{"$f":"IF(D428=RebaseYear,\"Board-approved\",\"\")","v":""},null,null,{"$f":"K407","v":"Actual"},null,null,{"$f":"N407","v":""},null,null,{"$f":"K428","v":"Actual"},{"$f":"IF(G428=0,\"\",L428/G428)","v":""},{"$f":"IF(G428=0,\"\",M428/G428)","v":""},{"$f":"N428","v":""},{"$f":"IF(T428=\"\",\"\",IF(I428=0,\"\",O428/I428))","v":""}]
[null,null,"Historical",2012,null,"Actual",null,"",null,null,"Actual",null,null,"",null,null,{"$f":"K429","v":"Actual"},{"$f":"IF(G429=0,\"\",L429/G429)","v":""},{"$f":"IF(G429=0,\"\",M429/G429)","v":""},{"$f":"N429","v":""},{"$f":"IF(T429=\"\",\"\",IF(I429=0,\"\",O429/I429))","v":""}]
[null,null,"Historical",2013,null,"Actual",null,"Board-approved",null,null,"Actual",null,null,"Board-approved",null,null,"Actual","","","Board-approved",""]
[null,null,"Historical",2014,null,"Actual",null,"",null,null,"Actual",null,null,"",null,null,"Actual","","","",""]
[null,null,"Historical",2015,null,"Actual",null,"",null,null,"Actual",null,null,"",null,null,"Actual","","","",""]
[null,null,"Bridge Year (Forecast)",2016,null,"Forecast",null,"",null,null,"Forecast",null,null,"",null,null,"Forecast","","","",""]
[null,null,"Test Year (Forecast)",{"$f":"TestYear","v":2017},null,"Forecast",null,"",null,null,"Forecast",null,null,"",null,null,"Forecast","","","",""]
[null,null,null,null,null,null,null,null,{"$f":"SUM(I428:I433)","v":0},null,null,null,null,null,{"$f":"SUM(O428:O433)","v":0},null,null,null,null,null,{"$f":"SUM(U428:U433)","v":0}]
[null,null,"Variance Analysis","Year",null,null,"Year-over-year",null,{"$f":"I415","v":"Test Year Versus Board-approved"},null,"Year","Year-over-year",null,null,{"$f":"I436","v":"Test Year Versus Board-approved"},null,"Year","Year-over-year",null,null,{"$f":"O436","v":"Test Year Versus Board-approved"}]
[null,null,null,{"$f":"D428","v":2011},null,null,null,null,null,null,{"$f":"D437","v":2011},null,null,null,null,null,{"$f":"K437","v":2011}]
[null,null,null,{"$f":"D429","v":2012},null,null,{"$f":"IF(G428=0,\"\",G429/G428-1)","v":""},null,null,null,{"$f":"D438","v":2012},{"$f":"IF(L428=0,\"\",L429/L428-1)","v":""},{"$f":"IF(M428=0,\"\",M429/M428-1)","v":""},null,null,null,{"$f":"K438","v":2012},{"$f":"IF(R428=\"\",\"\",IF(R428=0,\"\",R429/R428-1))","v":""},{"$f":"IF(S428=\"\",\"\",IF(S428=0,\"\",S429/S428-1))","v":""}]
[null,null,null,{"$f":"D430","v":2013},null,null,{"$f":"IF(G429=0,\"\",G430/G429-1)","v":""},null,null,null,2013,{"$f":"IF(L429=0,\"\",L430/L429-1)","v":""},"",null,null,null,2013,{"$f":"IF(R429=\"\",\"\",IF(R429=0,\"\",R430/R429-1))","v":""},""]
[null,null,null,2014,null,null,"",null,null,null,2014,{"$f":"IF(L430=0,\"\",L431/L430-1)","v":""},"",null,null,null,2014,{"$f":"IF(R430=\"\",\"\",IF(R430=0,\"\",R431/R430-1))","v":""},""]
[null,null,null,2015,null,null,"",null,null,null,2015,{"$f":"IF(L431=0,\"\",L432/L431-1)","v":""},"",null,null,null,2015,{"$f":"IF(R431=\"\",\"\",IF(R431=0,\"\",R432/R431-1))","v":""},""]
[null,null,null,2016,null,null,"",null,null,null,2016,{"$f":"IF(K433=\"Forecast\",\"\",IF(L432=0,\"\",L433/L432-1))","v":""},{"$f":"IF(M432=0,\"\",M433/M432-1)","v":""},null,null,null,2016,{"$f":"IF(Q433=\"Forecast\",\"\",IF(R432=0,\"\",R433/R432-1))","v":""},{"$f":"IF(S432=\"\",\"\",IF(S432=0,\"\",S433/S432-1))","v":""}]
[null,null,null,2017,null,null,"",null,{"$f":"IF(I435=0,\"\",G434/I435-1)","v":""},null,2017,{"$f":"IF(K434=\"Forecast\",\"\",IF(L433=0,\"\",L434/L433-1))","v":""},{"$f":"IF(M433=0,\"\",M434/M433-1)","v":""},null,{"$f":"IF(O435=0,\"\",M434/O435-1)","v":""},null,2017,{"$f":"IF(Q434=\"Forecast\",\"\",IF(R433=0,\"\",R434/R433-1))","v":""},{"$f":"IF(S433=\"\",\"\",IF(S433=0,\"\",S434/S433-1))","v":""},null,{"$f":"IF(U435=0,\"\",S434/U435-1)","v":""}]
[null,null,null,"Geometric Mean",null,null,{"$f":"IF(G428=0,\"\",(G434/G428)^(1/($D434-$D428-1))-1)","v":""},null,{"$f":"IF(I435=0,\"\",(G434/I435)^(1/(TestYear-RebaseYear-1))-1)","v":""},null,"Geometric Mean",{"$f":"IF(L428=0,\"\",(L432/L428)^(1/($D432-$D428-1))-1)","v":""},{"$f":"IF(M428=0,\"\",(M434/M428)^(1/($D434-$D428-1))-1)","v":""},null,{"$f":"IF(O435=0,\"\",(M434/O435)^(1/(TestYear-RebaseYear-1))-1)","v":""},null,"Geometric Mean",{"$f":"IF(R428=\"\",\"\",IF(R428=0,\"\",(R432/R428)^(1/($D432-$D428-1))-1))","v":""},{"$f":"IF(S428=\"\",\"\",IF(S428=0,\"\",(S434/S428)^(1/($D434-$D428-1))-1))","v":""},null,{"$f":"IF(U435=0,\"\",(S434/U435)^(1/(TestYear-RebaseYear-1))-1)","v":""}]
[]
[null,{"$f":"B403+1","v":10},"Customer Class:",null,null,null,null,"Is the customer class billed on consumption (kWh) or demand (kW or kVA)?"]
[]
[null,null,null,"Calendar Year",null,"Customers",null,null,null,null,"Consumption (kWh) (3)",null,null,null,null,null,{"$f":"CONCATENATE(\"Consumption (kWh) per \",LEFT(F448,LEN(F448)-1))","v":"Consumption (kWh) per Customer"}]
[null,null,null,{"$f":"CONCATENATE(\"(for \",TestYear,\" Cost of Service\")","v":"(for 2017 Cost of Service"},null,null,null,null,null,null,null,"Actual (Weather actual)","Weather-normalized",null,"Weather-normalized",null,null,{"$f":"L449","v":"Actual (Weather actual)"},{"$f":"M449","v":"Weather-normalized"},null,{"$f":"O449","v":"Weather-normalized"}]
[null,null,"Historical",{"$f":"D451-1","v":2011},null,{"$f":"F407","v":"Actual"},null,{"$f":"IF(D450=RebaseYear,\"Board-approved\",\"\")","v":""},null,null,{"$f":"F450","v":"Actual"},null,null,{"$f":"H450","v":""},null,null,{"$f":"K450","v":"Actual"},{"$f":"IF(G450=0,\"\",L450/G450)","v":""},{"$f":"IF(G450=0,\"\",M450/G450)","v":""},{"$f":"N450","v":""},{"$f":"IF(T450=\"\",\"\",IF(I450=0,\"\",O450/I450))","v":""}]
[null,null,"Historical",2012,null,{"$f":"F408","v":"Actual"},null,"",null,null,{"$f":"F451","v":"Actual"},null,null,{"$f":"H451","v":""},null,null,{"$f":"K451","v":"Actual"},{"$f":"IF(G451=0,\"\",L451/G451)","v":""},{"$f":"IF(G451=0,\"\",M451/G451)","v":""},{"$f":"N451","v":""},{"$f":"IF(T451=\"\",\"\",IF(I451=0,\"\",O451/I451))","v":""}]
[null,null,"Historical",2013,null,"Actual",null,"Board-approved",null,null,"Actual",null,null,"Board-approved",null,null,"Actual","","","Board-approved",""]
[null,null,"Historical",2014,null,"Actual",null,"",null,null,"Actual",null,null,"",null,null,"Actual","","","",""]
[null,null,"Historical",2015,null,"Actual",null,"",null,null,"Actual",null,null,"",null,null,"Actual","","","",""]
[null,null,"Bridge Year",2016,null,"Forecast",null,"",null,null,"Forecast",null,null,"",null,null,"Forecast","","","",""]
[null,null,"Test Year",{"$f":"TestYear","v":2017},null,"Forecast",null,"",null,null,"Forecast",null,null,"",null,null,"Forecast","","","",""]
[null,null,null,null,null,null,null,null,{"$f":"SUM(I450:I455)","v":0},null,null,null,null,null,{"$f":"SUM(O450:O455)","v":0},null,null,null,null,null,{"$f":"SUM(U450:U455)","v":0}]
[null,null,"Variance Analysis","Year",null,null,"Year-over-year",null,"Test Year Versus Board-approved",null,"Year","Year-over-year",null,null,{"$f":"I458","v":"Test Year Versus Board-approved"},null,"Year","Year-over-year",null,null,{"$f":"O458","v":"Test Year Versus Board-approved"}]
[null,null,null,{"$f":"D450","v":2011},null,null,null,null,null,null,{"$f":"D459","v":2011},null,null,null,null,null,{"$f":"K459","v":2011}]
[null,null,null,2012,null,null,{"$f":"IF(G450=0,\"\",G451/G450-1)","v":""},null,null,null,{"$f":"D460","v":2012},{"$f":"IF(L450=0,\"\",L451/L450-1)","v":""},"",null,null,null,{"$f":"K460","v":2012},{"$f":"IF(R450=\"\",\"\",IF(R450=0,\"\",R451/R450-1))","v":""},{"$f":"IF(S450=\"\",\"\",IF(S450=0,\"\",S451/S450-1))","v":""}]
[null,null,null,2013,null,null,"",null,null,null,2013,{"$f":"IF(L451=0,\"\",L452/L451-1)","v":""},"",null,null,null,2013,{"$f":"IF(R451=\"\",\"\",IF(R451=0,\"\",R452/R451-1))","v":""},""]
[null,null,null,2014,null,null,"",null,null,null,2014,{"$f":"IF(L452=0,\"\",L453/L452-1)","v":""},"",null,null,null,2014,{"$f":"IF(R452=\"\",\"\",IF(R452=0,\"\",R453/R452-1))","v":""},""]
[null,null,null,2015,null,null,"",null,null,null,2015,{"$f":"IF(L453=0,\"\",L454/L453-1)","v":""},"",null,null,null,2015,{"$f":"IF(R453=\"\",\"\",IF(R453=0,\"\",R454/R453-1))","v":""},""]
[null,null,null,2016,null,null,"",null,null,null,2016,{"$f":"IF(K455=\"Forecast\",\"\",IF(L454=0,\"\",L455/L454-1))","v":""},{"$f":"IF(M454=0,\"\",M455/M454-1)","v":""},null,null,null,2016,{"$f":"IF(Q455=\"Forecast\",\"\",IF(R454=0,\"\",R455/R454-1))","v":""},{"$f":"IF(S454=\"\",\"\",IF(S454=0,\"\",S455/S454-1))","v":""}]
[null,null,null,2017,null,null,"",null,{"$f":"IF(I457=0,\"\",G456/I457-1)","v":""},null,2017,{"$f":"IF(K456=\"Forecast\",\"\",IF(L455=0,\"\",L456/L455-1))","v":""},{"$f":"IF(M455=0,\"\",M456/M455-1)","v":""},null,{"$f":"IF(O457=0,\"\",M456/O457-1)","v":""},null,2017,{"$f":"IF(Q456=\"Forecast\",\"\",IF(R455=0,\"\",R456/R455-1))","v":""},{"$f":"IF(S455=\"\",\"\",IF(S455=0,\"\",S456/S455-1))","v":""},null,{"$f":"IF(U457=0,\"\",S456/U457-1)","v":""}]
[null,null,null,"Geometric Mean",null,null,{"$f":"IF(G450=0,\"\",(G456/G450)^(1/($D456-$D450-1))-1)","v":""},null,{"$f":"IF(I457=0,\"\",(G456/I457)^(1/(TestYear-RebaseYear-1))-1)","v":""},null,"Geometric Mean",{"$f":"IF(L450=0,\"\",(L454/L450)^(1/($D454-$D450-1))-1)","v":""},{"$f":"IF(M450=0,\"\",(M456/M450)^(1/($D456-$D450-1))-1)","v":""},null,{"$f":"IF(O457=0,\"\",(M456/O457)^(1/(TestYear-RebaseYear-1))-1)","v":""},null,"Geometric Mean",{"$f":"IF(R450=\"\",\"\",IF(R450=0,\"\",(R454/R450)^(1/($D454-$D450-1))-1))","v":""},{"$f":"IF(S450=\"\",\"\",IF(S450=0,\"\",(S456/S450)^(1/($D456-$D450-1))-1))","v":""},null,{"$f":"IF(U457=0,\"\",(S456/U457)^(1/(TestYear-RebaseYear-1))-1)","v":""}]
[]
[]
[null,null,null,"Calendar Year",null,"Revenues",null,null,null,null,{"$f":"IF(ISBLANK(N446),\"\",CONCATENATE(\"Demand (\",N446,\")\"))","v":""},null,null,null,null,null,{"$f":"CONCATENATE(\"Demand (\",N446,\") per \",LEFT(F448,LEN(F448)-1))","v":"Demand () per Customer"}]
[null,null,null,{"$f":"CONCATENATE(\"(for \",TestYear,\" Cost of Service\")","v":"(for 2017 Cost of Service"},null,null,null,null,null,null,null,"Actual (Weather actual)","Weather-normalized",null,{"$f":"M470","v":"Weather-normalized"},null,null,{"$f":"L470","v":"Actual (Weather actual)"},{"$f":"M470","v":"Weather-normalized"},null,{"$f":"O470","v":"Weather-normalized"}]
[null,null,"Historical",{"$f":"D472-1","v":2011},null,{"$f":"F450","v":"Actual"},null,{"$f":"IF(D471=RebaseYear,\"Board-approved\",\"\")","v":""},null,null,{"$f":"K450","v":"Actual"},null,null,{"$f":"N450","v":""},null,null,{"$f":"K471","v":"Actual"},{"$f":"IF(G471=0,\"\",L471/G471)","v":""},{"$f":"IF(G471=0,\"\",M471/G471)","v":""},{"$f":"N471","v":""},{"$f":"IF(T471=\"\",\"\",IF(I471=0,\"\",O471/I471))","v":""}]
[null,null,"Historical",2012,null,"Actual",null,"",null,null,"Actual",null,null,"",null,null,{"$f":"K472","v":"Actual"},{"$f":"IF(G472=0,\"\",L472/G472)","v":""},{"$f":"IF(G472=0,\"\",M472/G472)","v":""},{"$f":"N472","v":""},{"$f":"IF(T472=\"\",\"\",IF(I472=0,\"\",O472/I472))","v":""}]
[null,null,"Historical",2013,null,"Actual",null,"Board-approved",null,null,"Actual",null,null,"Board-approved",null,null,"Actual","","","Board-approved",""]
[null,null,"Historical",2014,null,"Actual",null,"",null,null,"Actual",null,null,"",null,null,"Actual","","","",""]
[null,null,"Historical",2015,null,"Actual",null,"",null,null,"Actual",null,null,"",null,null,"Actual","","","",""]
[null,null,"Bridge Year (Forecast)",2016,null,"Forecast",null,"",null,null,"Forecast",null,null,"",null,null,"Forecast","","","",""]
[null,null,"Test Year (Forecast)",{"$f":"TestYear","v":2017},null,"Forecast",null,"",null,null,"Forecast",null,null,"",null,null,"Forecast","","","",""]
[null,null,null,null,null,null,null,null,{"$f":"SUM(I471:I476)","v":0},null,null,null,null,null,{"$f":"SUM(O471:O476)","v":0},null,null,null,null,null,{"$f":"SUM(U471:U476)","v":0}]
[null,null,"Variance Analysis","Year",null,null,"Year-over-year",null,{"$f":"I458","v":"Test Year Versus Board-approved"},null,"Year","Year-over-year",null,null,{"$f":"I479","v":"Test Year Versus Board-approved"},null,"Year","Year-over-year",null,null,{"$f":"O479","v":"Test Year Versus Board-approved"}]
[null,null,null,{"$f":"D471","v":2011},null,null,null,null,null,null,{"$f":"D480","v":2011},null,null,null,null,null,{"$f":"K480","v":2011}]
[null,null,null,{"$f":"D472","v":2012},null,null,{"$f":"IF(G471=0,\"\",G472/G471-1)","v":""},null,null,null,{"$f":"D481","v":2012},{"$f":"IF(L471=0,\"\",L472/L471-1)","v":""},{"$f":"IF(M471=0,\"\",M472/M471-1)","v":""},null,null,null,{"$f":"K481","v":2012},{"$f":"IF(R471=\"\",\"\",IF(R471=0,\"\",R472/R471-1))","v":""},{"$f":"IF(S471=\"\",\"\",IF(S471=0,\"\",S472/S471-1))","v":""}]
[null,null,null,{"$f":"D473","v":2013},null,null,{"$f":"IF(G472=0,\"\",G473/G472-1)","v":""},null,null,null,2013,{"$f":"IF(L472=0,\"\",L473/L472-1)","v":""},"",null,null,null,2013,{"$f":"IF(R472=\"\",\"\",IF(R472=0,\"\",R473/R472-1))","v":""},""]
[null,null,null,2014,null,null,"",null,null,null,2014,{"$f":"IF(L473=0,\"\",L474/L473-1)","v":""},"",null,null,null,2014,{"$f":"IF(R473=\"\",\"\",IF(R473=0,\"\",R474/R473-1))","v":""},""]
[null,null,null,2015,null,null,"",null,null,null,2015,{"$f":"IF(L474=0,\"\",L475/L474-1)","v":""},"",null,null,null,2015,{"$f":"IF(R474=\"\",\"\",IF(R474=0,\"\",R475/R474-1))","v":""},""]
[null,null,null,2016,null,null,"",null,null,null,2016,{"$f":"IF(K476=\"Forecast\",\"\",IF(L475=0,\"\",L476/L475-1))","v":""},{"$f":"IF(M475=0,\"\",M476/M475-1)","v":""},null,null,null,2016,{"$f":"IF(Q476=\"Forecast\",\"\",IF(R475=0,\"\",R476/R475-1))","v":""},{"$f":"IF(S475=\"\",\"\",IF(S475=0,\"\",S476/S475-1))","v":""}]
[null,null,null,2017,null,null,"",null,{"$f":"IF(I478=0,\"\",G477/I478-1)","v":""},null,2017,{"$f":"IF(K477=\"Forecast\",\"\",IF(L476=0,\"\",L477/L476-1))","v":""},{"$f":"IF(M476=0,\"\",M477/M476-1)","v":""},null,{"$f":"IF(O478=0,\"\",M477/O478-1)","v":""},null,2017,{"$f":"IF(Q477=\"Forecast\",\"\",IF(R476=0,\"\",R477/R476-1))","v":""},{"$f":"IF(S476=\"\",\"\",IF(S476=0,\"\",S477/S476-1))","v":""},null,{"$f":"IF(U478=0,\"\",S477/U478-1)","v":""}]
[null,null,null,"Geometric Mean",null,null,{"$f":"IF(G471=0,\"\",(G477/G471)^(1/($D477-$D471-1))-1)","v":""},null,{"$f":"IF(I478=0,\"\",(G477/I478)^(1/(TestYear-RebaseYear-1))-1)","v":""},null,"Geometric Mean",{"$f":"IF(L471=0,\"\",(L475/L471)^(1/($D475-$D471-1))-1)","v":""},{"$f":"IF(M471=0,\"\",(M477/M471)^(1/($D477-$D471-1))-1)","v":""},null,{"$f":"IF(O478=0,\"\",(M477/O478)^(1/(TestYear-RebaseYear-1))-1)","v":""},null,"Geometric Mean",{"$f":"IF(R471=\"\",\"\",IF(R471=0,\"\",(R475/R471)^(1/($D475-$D471-1))-1))","v":""},{"$f":"IF(S471=\"\",\"\",IF(S471=0,\"\",(S477/S471)^(1/($D477-$D471-1))-1))","v":""},null,{"$f":"IF(U478=0,\"\",(S477/U478)^(1/(TestYear-RebaseYear-1))-1)","v":""}]
[]
[null,"Note: If there are more than ten (10) customer classes, please contact OEB Staff to add tables for additional customer classes."]

{"sheet":"App.2-JA_OM&A_Summary_Analys","index":31,"n_rows":61,"n_cols":12,"rows_kept":61,"cut":false,"hidden":false,"merged":[[63,1,64,5],[58,0,59,11],[8,0,8,6],[9,0,9,6],[12,7,12,8]]}
[null,null,null,null,null,null,null,null,null,null,"File Number:",{"$f":"EBNUMBER","v":"EB-2016-0085"}]
[null,null,null,null,null,null,null,null,null,null,"Exhibit:",4]
[null,null,null,null,null,null,null,null,null,null,"Tab:"]
[null,null,null,null,null,null,null,null,null,null,"Schedule:"]
[null,null,null,null,null,null,null,null,null,null,"Page:"]
[]
[null,null,null,null,null,null,null,null,null,null,"Date:","2016-11-28"]
[]
["Appendix 2-JA"]
["Summary of Recoverable OM&A Expenses"]
[]
[]
[null,{"$f":"\"Last Rebasing Year (\" & RebaseYear & \" Board-Approved)\"","v":"Last Rebasing Year (2013 Board-Approved)"},{"$f":"\"Last Rebasing Year (\" & RebaseYear & \" Actuals)\"","v":"Last Rebasing Year (2013 Actuals)"},{"$f":"BridgeYear -2 & \" Actuals\"","v":"2014 Actuals"},{"$f":"BridgeYear -1 & \" Actuals\"","v":"2015 Actuals"},{"$f":"BridgeYear & \" Bridge Year\"","v":"2016 Bridge Year"},{"$f":"TestYear & \" Test Year\"","v":"2017 Test Year"}]
["Reporting Basis","CGAAP","CGAAP","CGAAP","MIFRS","MIFRS","MIFRS"]
["Operations",{"$f":"'App.2-JC_OMA Programs'!B23","v":1234229.7228009999},{"$f":"'[11]Trial Balance'!$E$297","v":1323999},{"$f":"'[11]Trial Balance'!$G$297","v":1342978},{"$f":"'[11]Trial Balance'!$I$297","v":1377569.3099999998},{"$f":"'[11]Trial Balance'!$K$297","v":1455280},{"$f":"'[11]Trial Balance'!$L$297","v":1578482.5}]
["Maintenance",{"$f":"'App.2-JC_OMA Programs'!B30","v":506161.02514000004},{"$f":"'[11]Trial Balance'!$E$316","v":463151},{"$f":"'[11]Trial Balance'!$G$316","v":471477},{"$f":"'[11]Trial Balance'!$I$316","v":427524.86000000004},{"$f":"'[11]Trial Balance'!$K$316","v":530250},{"$f":"'[11]Trial Balance'!$L$316","v":667795}]
["SubTotal",{"$f":"SUM(B15:B16)","v":1740390.7479409999},{"$f":"SUM(C15:C16)","v":1787150},1814455,1805094.17,1985530,2246277.5]
["%Change (year over year)",null,null,{"$f":"IF(ISERROR((D17-C17)/C17), \"\", (D17-C17)/C17)","v":1.5278516073077246E-2},{"$f":"IF(ISERROR((E17-D17)/D17), \"\", (E17-D17)/D17)","v":-5.1590312242519518E-3},9.9959233705796124E-2,0.13132387825920536]
["%Change (Test Year vs \nLast Rebasing Year - Actual)",null,null,null,null,null,{"$f":"IF(ISERROR((G17-C17)/C17), \"\", (G17-C17)/C17)","v":0.25690484850180456}]
["Billing and Collecting",{"$f":"'App.2-JC_OMA Programs'!B40","v":997952.77534359996},{"$f":"'[11]Trial Balance'!$E$329","v":1054939},{"$f":"'[11]Trial Balance'!$G$329","v":1169535},{"$f":"'[11]Trial Balance'!$I$329","v":1096116.25},{"$f":"'[11]Trial Balance'!$K$329","v":1203967},{"$f":"'[11]Trial Balance'!$L$329","v":1184825}]
["Community Relations",{"$f":"'App.2-JC_OMA Programs'!B34","v":8586},{"$f":"'[11]Trial Balance'!$E$335","v":5419},{"$f":"'[11]Trial Balance'!$G$335","v":5663},{"$f":"'[11]Trial Balance'!$I$335","v":8066.26},{"$f":"'[11]Trial Balance'!$K$335","v":10250},{"$f":"'[11]Trial Balance'!$L$335","v":12000}]
["Administrative and General",{"$f":"'App.2-JC_OMA Programs'!B49","v":2143262.5086929998},{"$f":"'[11]Trial Balance'!$E$359","v":2147695},{"$f":"'[11]Trial Balance'!$G$359","v":2234998},{"$f":"'[11]Trial Balance'!$I$359","v":2648314.02},{"$f":"'[11]Trial Balance'!$K$359","v":2638335},{"$f":"'[11]Trial Balance'!$L$359","v":2744522}]
["SubTotal",{"$f":"SUM(B20:B22)","v":3149801.2840366},{"$f":"SUM(C20:C22)","v":3208053},3410196,3752496.5300000003,3852552,3941347]
["%Change (year over year)",null,null,{"$f":"IF(ISERROR((D23-C23)/C23), \"\", (D23-C23)/C23)","v":6.3011116088169367E-2},{"$f":"IF(ISERROR((E23-D23)/D23), \"\", (E23-D23)/D23)","v":0.10037561770643103},{"$f":"IF(ISERROR((F23-E23)/E23), \"\", (F23-E23)/E23)","v":2.6663707534460995E-2},{"$f":"IF(ISERROR((G23-F23)/F23), \"\", (G23-F23)/F23)","v":2.3048358594510859E-2}]
["%Change (Test Year vs \nLast Rebasing Year - Actual)",null,null,null,null,null,{"$f":"IF(ISERROR((G23-C23)/C23), \"\", (G23-C23)/C23)","v":0.22857914130471035}]
["Total",{"$f":"SUM(B23,B17)","v":4890192.0319775995},{"$f":"SUM(C23,C17)","v":4995203},5224651,5557590.7000000002,5838082,6187624.5]
["%Change (year over year)",null,null,{"$f":"IF(ISERROR((D26-C26)/C26), \"\", (D26-C26)/C26)","v":4.5933668761810077E-2},{"$f":"IF(ISERROR((E26-D26)/D26), \"\", (E26-D26)/D26)","v":6.3724773195377102E-2},{"$f":"IF(ISERROR((F26-E26)/E26), \"\", (F26-E26)/E26)","v":5.0469945546727617E-2},{"$f":"IF(ISERROR((G26-F26)/F26), \"\", (G26-F26)/F26)","v":5.9872831522407528E-2},{"$f":"AVERAGE(D27:G27)","v":5.5000304756580583E-2}]
[]
[]
[null,{"$f":"B13","v":"Last Rebasing Year (2013 Board-Approved)"},{"$f":"C13","v":"Last Rebasing Year (2013 Actuals)"},"2014 Actuals","2015 Actuals","2016 Bridge Year","2017 Test Year"]
["Operations",{"$f":"B15","v":1234229.7228009999},{"$f":"C15","v":1323999},1342978,1377569.3099999998,1455280,1578482.5]
["Maintenance",{"$f":"B16","v":506161.02514000004},{"$f":"C16","v":463151},471477,427524.86000000004,530250,667795]
["Billing and Collecting",{"$f":"B20","v":997952.77534359996},{"$f":"C20","v":1054939},1169535,1096116.25,1203967,1184825]
["Community Relations",{"$f":"B21","v":8586},{"$f":"C21","v":5419},5663,8066.26,10250,12000]
["Administrative and General",{"$f":"B22","v":2143262.5086929998},{"$f":"C22","v":2147695},2234998,2648314.02,2638335,2744522]
["Total",{"$f":"SUM(B31:B35)","v":4890192.0319775995},{"$f":"SUM(C31:C35)","v":4995203},5224651,5557590.6999999993,5838082,6187624.5]
["%Change (year over year)",null,null,{"$f":"IF(ISERROR((D36-C36)/C36), \"\", (D36-C36)/C36)","v":4.5933668761810077E-2},{"$f":"IF(ISERROR((E36-D36)/D36), \"\", (E36-D36)/D36)","v":6.3724773195376921E-2},{"$f":"IF(ISERROR((F36-E36)/E36), \"\", (F36-E36)/E36)","v":5.046994554672779E-2},{"$f":"IF(ISERROR((G36-F36)/F36), \"\", (G36-F36)/F36)","v":5.9872831522407528E-2}]
[]
[]
[null,{"$f":"B13","v":"Last Rebasing Year (2013 Board-Approved)"},{"$f":"C13","v":"Last Rebasing Year (2013 Actuals)"},{"$f":"\"Variance \" & 'LDC Info'!E28 & \"  BA – \" & 'LDC Info'!E28 & \" Actuals\"","v":"Variance 2013  BA – 2013 Actuals"},{"$f":"D13","v":"2014 Actuals"},{"$f":"\"Variance \" & 'LDC Info'!E26 -2 & \" Actuals vs. \" &  'LDC Info'!E28 & \" Actuals\"","v":"Variance 2014 Actuals vs. 2013 Actuals"},{"$f":"E13","v":"2015 Actuals"},{"$f":"\"Variance \" & 'LDC Info'!E26 -1 & \" Actuals vs. \" &  'LDC Info'!E26-2 & \" Actuals\"","v":"Variance 2015 Actuals vs. 2014 Actuals"},{"$f":"F13","v":"2016 Bridge Year"},{"$f":"\"Variance \" & 'LDC Info'!E26 & \" Bridge vs. \" & 'LDC Info'!E26 -1 & \" Actuals\"","v":"Variance 2016 Bridge vs. 2015 Actuals"},{"$f":"G13","v":"2017 Test Year"},{"$f":"\"Variance \" & TestYear & \" Test vs. \" & BridgeYear & \" Bridge\"","v":"Variance 2017 Test vs. 2016 Bridge"}]
["Operations",{"$f":"B15","v":1234229.7228009999},1323999,{"$f":"B41-C41","v":-89769.27719900012},{"$f":"D15","v":1342978},{"$f":"E41-C41","v":18979},{"$f":"E15","v":1377569.3099999998},{"$f":"G41-E41","v":34591.309999999823},{"$f":"F15","v":1455280},{"$f":"I41-G41","v":77710.690000000177},{"$f":"G15","v":1578482.5},{"$f":"K41-I41","v":123202.5}]
["Maintenance ",506161.02514000004,463151,{"$f":"B42-C42","v":43010.025140000042},{"$f":"D16","v":471477},{"$f":"E42-C42","v":8326},{"$f":"E16","v":427524.86000000004},{"$f":"G42-E42","v":-43952.139999999956},{"$f":"F16","v":530250},102725.13999999996,{"$f":"G16","v":667795},137545]
["Billing and Collecting ",{"$f":"B20","v":997952.77534359996},1054939,-56986.224656400038,{"$f":"D20","v":1169535},114596,{"$f":"E20","v":1096116.25},-73418.75,{"$f":"F20","v":1203967},107850.75,{"$f":"G20","v":1184825},-19142]
["Community Relations ",8586,5419,3167,{"$f":"D21","v":5663},244,{"$f":"E21","v":8066.26},2403.2600000000002,{"$f":"F21","v":10250},2183.7399999999998,{"$f":"G21","v":12000},1750]
["Administrative and General ",2143262.5086929998,2147695,-4432.4913070001639,2234998,87303,2648314.02,413316.02,2638335,-9979.0200000000186,2744522,106187]
["Total OM&A Expenses ",{"$f":"SUM(B41:B45)","v":4890192.0319775995},{"$f":"SUM(C41:C45)","v":4995203},-105010.96802240028,5224651,229448,5557590.6999999993,332939.6999999999,5838082,280491.3000000001,6187624.5,349542.5]
["Adjustments for Total non-recoverable items (from Appendices 2-JA and 2-JB)"]
["Total Recoverable OM&A Expenses ",{"$f":"B46-B47","v":4890192.0319775995},{"$f":"C46-C47","v":4995203},-105010.96802240028,5224651,229448,5557590.6999999993,332939.6999999999,5838082,280491.3000000001,6187624.5,349542.5]
["Variance from previous year ",null,null,null,{"$f":"E48-C48","v":229448},null,{"$f":"G48-E48","v":332939.69999999925},null,{"$f":"I48-G48","v":280491.30000000075},null,{"$f":"K48-I48","v":349542.5}]
["Percent change (year over year) ",null,null,null,{"$f":"IF(ISERROR(E49/C48), \"\", E49/C48)","v":4.5933668761810077E-2},null,{"$f":"IF(ISERROR(G49/E48), \"\", G49/E48)","v":6.3724773195376921E-2},null,{"$f":"IF(ISERROR(I49/G48), \"\", I49/G48)","v":5.046994554672779E-2},null,{"$f":"IF(ISERROR(K49/I48), \"\", K49/I48)","v":5.9872831522407528E-2}]
["Percent Change:                                                    Test year vs. Most Current Actual ",null,null,null,null,null,{"$f":"IF(ISERROR((K48-G48)/G48), \"\", (K48-G48)/G48)","v":0.11336455561579964}]
["Simple average of % variance for all years",null,null,null,null,null,{"$f":"IF(ISERROR((K46-C46)/C46), \"\", (K46-C46)/C46)","v":0.23871332156070535},null,null,null,null,{"$f":"IF(ISERROR(AVERAGE(E50,G50,I50,K50)), \"\", AVERAGE(E50,G50,I50,K50))","v":5.5000304756580576E-2}]
["Compound Annual Growth Rate for all years",null,null,null,null,null,{"$f":"IF(ISERROR((K49-C49)/C49), \"\", (K49-C49)/C49)","v":""},null,null,null,null,{"$f":"IF((K48-C48)=0, \"\", (K48/C48)^(1/5)-1)","v":4.3744407826785014E-2}]
[{"$f":"\"Compound Growth Rate                                                            (\" & E13 & \" vs. \" & 'LDC Info'!E28 & \" Actuals)\"","v":"Compound Growth Rate                                                            (2015 Actuals vs. 2013 Actuals)"},null,null,null,null,null,{"$f":"IF(ISERROR((G48/C48)^(1/(3)) - 1), \"\", (G48/C48)^(1/(3)) - 1)","v":3.6202110016186895E-2}]
[]
["Note:"]
[]
["1     \"BA\" = Board-Approved"]
["2     If it has been more than three years since the applicant last filed a cost of service application, additional years of historical actuals should be incorporated into the table, as necessary, to go back to the last cost of service application.  If the applicant last filed a cost of service application less than three years ago, a minimum of three years of actual information is required."]
[]
["3     Recoverable OM&A that is included on these tables should be identical to the recoverable OM&A that is shown for the corresponding periods on Appendix 2-JB."]

{"sheet":"App.2-JB_OM&A_Cost _Drivers","index":32,"n_rows":60,"n_cols":15,"rows_kept":60,"cut":false,"hidden":false,"merged":[[9,0,9,8],[10,0,10,8],[30,2,32,8],[33,2,34,8],[29,2,29,8]]}
[null,null,null,null,null,null,null,"File Number:",{"$f":"EBNUMBER","v":"EB-2016-0085"}]
[null,null,null,null,null,null,null,"Exhibit:",4]
[null,null,null,null,null,null,null,"Tab:"]
[null,null,null,null,null,null,null,"Schedule:"]
[null,null,null,null,null,null,null,"Page:"]
[]
[null,null,null,null,null,null,null,"Date:","2016-11-28"]
[]
[]
["Appendix 2-JB"]
["Recoverable OM&A Cost Driver Table"]
[]
["OM&A","Notes:",{"$f":"\"Last Rebasing Year (\" & RebaseYear & \" Actuals)\"","v":"Last Rebasing Year (2013 Actuals)"},"2009 Actuals","Last Rebasing Year (2013 Actuals)",{"$f":"BridgeYear -2 & \" Actuals\"","v":"2014 Actuals"},{"$f":"BridgeYear -1 & \" Actuals\"","v":"2015 Actuals"},{"$f":"BridgeYear & \" Bridge Year\"","v":"2016 Bridge Year"},{"$f":"TestYear & \" Test Year\"","v":"2017 Test Year"}]
["Reporting Basis",null,"CGAAP",null,null,"CGAAP","MIFRS","MIFRS","MIFRS"]
["Opening Balance",null,4890317,{"$f":"C25","v":5024216},{"$f":"'App.2-JA_OM&A_Summary_Analys'!B36","v":4890192.0319775995},{"$f":"E25","v":4995203.0319775995},{"$f":"F25","v":5224651.0319775995},{"$f":"G25","v":5557591.0319775995},{"$f":"H25","v":5838082.0319775995}]
["Locates/ON1CALL",1,132840,null,115997,30278,-2352,55130,10576]
["Human Resources",2,null,null,null,225603,93858,111457,114139]
["New Corporate Headquarters",3,null,null,null," ",114988,null,0]
["One time IFRS Adjustment to Emp Pensions/Benefits",4,null,null,null,0,60050,-60050]
["Operations Impact",5,null,null,null," ",25987,78033,138454]
["Maintenance Impacts",6,null,null,null,null,null,74435,142304]
["Outside Services Employed",7,null,null,null,null,null,0,0]
[]
["Other",null,1059,null,-10986,-26433,40409,21486,-55931]
["Closing Balance",null,{"$f":"SUM(C15:C24)","v":5024216},5024216,4995203.0319775995,5224651.0319775995,5557591.0319775995,5838082.0319775995,6187624.0319775995]
[]
["Notes:",null,4995203,null,{"$f":"'App.2-JA_OM&A_Summary_Analys'!C36","v":4995203},{"$f":"'App.2-JA_OM&A_Summary_Analys'!D36","v":5224651},{"$f":"'App.2-JA_OM&A_Summary_Analys'!E36","v":5557590.6999999993},{"$f":"'App.2-JA_OM&A_Summary_Analys'!F36","v":5838082},{"$f":"'App.2-JA_OM&A_Summary_Analys'!G36","v":6187624.5}]
[null,null,null,null,{"$f":"E27-E25","v":-3.1977599486708641E-2},{"$f":"F27-F25","v":-3.1977599486708641E-2},{"$f":"G27-G25","v":-0.3319776002317667},{"$f":"H27-H25","v":-3.1977599486708641E-2},{"$f":"I27-I25","v":0.46802240051329136}]
[1,null,"For each year, a detailed explanation for each cost driver and associated amount is requied in Exhibit 4."]
[2,null,"For purposes of assessing incremental cost drivers, the closing balance for each year becomes the opening balance for the next year."]
[3,null,"If it has been more than three years since the applicant last filed a cost of service application, additional years of historical actuals should be incorporated into the table, as necessary, to go back to the last cost of service application.  If the applicant last filed a cost of service application less than three years ago, a minimum of three years of actual information is required."]
[]
[]
[4,null,"Opening Balance for \"Last Rebasing Year\" (cell B15) should be equal to the Board-Approved amount."]
[]
[]
[]
["2013 Cost Drivers"]
[null,null,null,null,null,null,null,null,"Operations",null,2013,2014,2015,2016,2017]
["Locates/ON1Call",1,"With the implementation of ON1Call InnPower saw a dramatic increase in work volume.In order to meet the ",null,null,"ON1CALL Account 5040/5045/5070/5075"]
["Maintenance Underground Feeders",2,null,null,null,"Account 5155",null,null,"Maintenance Underground Feeders",null,null,60644]
["Overhead Lines & Feeders",3,"Same expalination as 2013, net overage $30,284",null,null,"Account 5020",null,null,"Increase Meter Expense due to Growth",11,null,null,25987,null,26911]
["Maintenance of Overhead lines",4,null,null,null,"Account 5130",null,null,"Misc Distribution Expense",13,null,null," ",78033,81130]
["Bad Debt",5,"5155 - the 5155 account was overspent due to an increased amount secondary cable faults, complexities in there repairs caused by a deep frost year",null,null,"Account 5335",null,null,"Line Supervision",null,null,null,null,null,30413]
["Customer Service Increases",6,null,null,null,"Account 5315/5340",null,null,"Total"]
["Office Supplies and Expense",7,null,null,null,"Account 5620",null,null,null,null,null,{"$f":"SUM(L41:L45)","v":60644},{"$f":"SUM(M41:M45)","v":25987},78033,138454]
["IFRS One time adjustment to Pensions/Benefits",8,null,null,null,"Account 5646"]
["Outside Services (IFRS)",9,null,null,null,"Account 5630"]
["Maintenance of General Plant - New Administrative Building",10,null,null,null,"Account 5675"]
["Increase Meter Expense due to Growth",11,null,null,null,"Account 5065",null,null,"Maintenance Cost Drivers",null,null,2014,2015,2016,2017]
["Increase Customer Service ",12,null,null,null,"Account 5315",null,5155,"Maintenance Underground Feeders",null,null," "]
["Misc Distribution Expense",13,null,null,null,"Account 5085",null,5130,"Overhead Lines & Feeders",null,null," ",null,null,11661]
["Increase in General Admin/Salaries",14,null,null,null,"Account 5615",null,5165,"Maintenance of Underground Services",null,null,null,null,40436]
["Maintenance of Underground Services",15,null,null,null,"Account 5155",null,5135,"Maintenance of Overhead lines - Right of Way",null,null,null,null,33999]
["Maintenance of Overhead lines - Right of Way",16,null,null,null,"Account 5135",null,5125,"Overhead Conductors and Devices",null,null,null,null,null,65875]
["Increase Collection Cost ",17,null,null,null,"Account 5320",null,5160,"Maintenance Line Transformers",null,null,null,null,null,50855]
["Overhead Conductors and Devices",18,null,null," ","Account 5125",null,5120,"Maintenance Poles/Towers/Fixtures",null,null,null,null,null,13913]
["Maintenance Line Transformers",19,null,null,null,"Account 5160",null,null,"Total",null,null," ",{"$f":"SUM(M51:M57)","v":0},74435,142304]
["Line Supervision",20,null,null,null,"Account 5005"]
[null,21,null,null,null,"Account 5120"]

{"sheet":"App.2-JC_OMA Programs","index":33,"n_rows":57,"n_cols":9,"rows_kept":57,"cut":false,"hidden":false,"merged":[[58,0,59,8],[8,0,8,7],[9,0,9,7],[11,0,11,7],[56,0,56,7],[54,0,54,8],[55,0,55,8]]}
[null,null,null,null,null,null,null,"File Number:",{"$f":"EBNUMBER","v":"EB-2016-0085"}]
[null,null,null,null,null,null,null,"Exhibit:",4]
[null,null,null,null,null,null,null,"Tab:"]
[null,null,null,null,null,null,null,"Schedule:"]
[null,null,null,null,null,null,null,"Page:"]
[]
[null,null,null,null,null,null,null,"Date:","November 28,2016"]
[]
["Appendix 2-JC"]
["OM&A Programs Table"]
[]
[]
["Programs",{"$f":"\"Last Rebasing Year (\" & RebaseYear & \" Board-Approved)\"","v":"Last Rebasing Year (2013 Board-Approved)"},{"$f":"\"Last Rebasing Year (\" & RebaseYear & \" Actuals)\"","v":"Last Rebasing Year (2013 Actuals)"},{"$f":"BridgeYear -2 & \" Actuals\"","v":"2014 Actuals"},{"$f":"BridgeYear -1 & \" Actuals\"","v":"2015 Actuals"},{"$f":"BridgeYear & \" Bridge Year\"","v":"2016 Bridge Year"},{"$f":"TestYear & \" Test Year\"","v":"2017 Test Year"},{"$f":"\"Variance \n(Test Year vs. \" & E13 &\")\"","v":"Variance \n(Test Year vs. 2015 Actuals)"},{"$f":"\"Variance \n(Test Year vs. \" & B13","v":"Variance \n(Test Year vs. Last Rebasing Year (2013 Board-Approved)"}]
["Reporting Basis","CGAAP","CGAAP","CGAAP","MIFRS","MIFRS","MIFRS"]
["Operations"]
["1) Distribution Station",{"$f":"SUMPRODUCT(('[19]2013'!$A$8:$A$30=1)*'[19]2013'!$E$8:$E$30)","v":54623.612459600008},{"$f":"SUMPRODUCT(('[11]Trial Balance'!$A$274:$A$296=1)*'[11]Trial Balance'!$E$274:$E$296)","v":65902},{"$f":"SUMPRODUCT(('[11]Trial Balance'!$A$274:$A$296=1)*'[11]Trial Balance'!$G$274:$G$296)","v":60220},{"$f":"SUMPRODUCT(('[11]Trial Balance'!$A$274:$A$296=1)*'[11]Trial Balance'!$I$274:$I$296)","v":63521.26},{"$f":"SUMPRODUCT(('[11]Trial Balance'!$A$274:$A$296=1)*'[11]Trial Balance'!$K$274:$K$296)","v":66600},{"$f":"SUMPRODUCT(('[11]Trial Balance'!$A$274:$A$296=1)*'[11]Trial Balance'!$L$274:$L$296)","v":68825},{"$f":"G16-E16","v":5303.739999999998},{"$f":"G16-B16","v":14201.387540399992}]
["2) Overhead Distribution Operations",{"$f":"SUMPRODUCT(('[19]2013'!$A$8:$A$30=2)*'[19]2013'!$E$8:$E$30)","v":101452.6449044},{"$f":"SUMPRODUCT(('[11]Trial Balance'!$A$274:$A$296=2)*'[11]Trial Balance'!$E$274:$E$296)","v":123146},{"$f":"SUMPRODUCT(('[11]Trial Balance'!$A$274:$A$296=2)*'[11]Trial Balance'!$G$274:$G$296)","v":125841},{"$f":"SUMPRODUCT(('[11]Trial Balance'!$A$274:$A$296=2)*'[11]Trial Balance'!$I$274:$I$296)","v":156658.28},{"$f":"SUMPRODUCT(('[11]Trial Balance'!$A$274:$A$296=2)*'[11]Trial Balance'!$K$274:$K$296)","v":162775},{"$f":"SUMPRODUCT(('[11]Trial Balance'!$A$274:$A$296=2)*'[11]Trial Balance'!$L$274:$L$296)","v":174836},{"$f":"G17-E17","v":18177.72},{"$f":"G17-B17","v":73383.355095599996}]
["3) Underground Distribution Operations",{"$f":"SUMPRODUCT(('[19]2013'!$A$8:$A$30=3)*'[19]2013'!$E$8:$E$30)","v":71932.134966800004},{"$f":"SUMPRODUCT(('[11]Trial Balance'!$A$274:$A$296=3)*'[11]Trial Balance'!$E$274:$E$296)","v":107020},{"$f":"SUMPRODUCT(('[11]Trial Balance'!$A$274:$A$296=3)*'[11]Trial Balance'!$G$274:$G$296)","v":121324},{"$f":"SUMPRODUCT(('[11]Trial Balance'!$A$274:$A$296=3)*'[11]Trial Balance'!$I$274:$I$296)","v":118115.82999999999},{"$f":"SUMPRODUCT(('[11]Trial Balance'!$A$274:$A$296=3)*'[11]Trial Balance'!$K$274:$K$296)","v":135550},{"$f":"SUMPRODUCT(('[11]Trial Balance'!$A$274:$A$296=3)*'[11]Trial Balance'!$L$274:$L$296)","v":140862.5},22746.670000000013,68930.365033199996]
["4) Distribution Meters",{"$f":"SUMPRODUCT(('[19]2013'!$A$8:$A$30=4)*'[19]2013'!$E$8:$E$30)","v":215731.96369179999},{"$f":"SUMPRODUCT(('[11]Trial Balance'!$A$274:$A$296=4)*'[11]Trial Balance'!$E$274:$E$296)","v":186719},{"$f":"SUMPRODUCT(('[11]Trial Balance'!$A$274:$A$296=4)*'[11]Trial Balance'!$G$274:$G$296)","v":215366},{"$f":"SUMPRODUCT(('[11]Trial Balance'!$A$274:$A$296=4)*'[11]Trial Balance'!$I$274:$I$296)","v":241352.71},{"$f":"SUMPRODUCT(('[11]Trial Balance'!$A$274:$A$296=4)*'[11]Trial Balance'!$K$274:$K$296)","v":253245},{"$f":"SUMPRODUCT(('[11]Trial Balance'!$A$274:$A$296=4)*'[11]Trial Balance'!$L$274:$L$296)","v":270856},29503.290000000008,55124.036308200011]
["5) Customer Workorders",{"$f":"SUMPRODUCT(('[19]2013'!$A$8:$A$30=5)*'[19]2013'!$E$8:$E$30)","v":42221.838598200004},{"$f":"SUMPRODUCT(('[11]Trial Balance'!$A$274:$A$296=5)*'[11]Trial Balance'!$E$274:$E$296)","v":139974},{"$f":"SUMPRODUCT(('[11]Trial Balance'!$A$274:$A$296=5)*'[11]Trial Balance'!$G$274:$G$296)","v":155948},{"$f":"SUMPRODUCT(('[11]Trial Balance'!$A$274:$A$296=5)*'[11]Trial Balance'!$I$274:$I$296)","v":156992.78},{"$f":"SUMPRODUCT(('[11]Trial Balance'!$A$274:$A$296=5)*'[11]Trial Balance'!$K$274:$K$296)","v":173300},{"$f":"SUMPRODUCT(('[11]Trial Balance'!$A$274:$A$296=5)*'[11]Trial Balance'!$L$274:$L$296)","v":178562.5},21569.72,136340.6614018]
["6) Engineering/Systems Ops/Line Constru/SCADA/Ops Admin",{"$f":"SUMPRODUCT(('[19]2013'!$A$8:$A$30=6)*'[19]2013'!$E$8:$E$30)","v":748267.52818019991},{"$f":"SUMPRODUCT(('[11]Trial Balance'!$A$274:$A$296=6)*'[11]Trial Balance'!$E$274:$E$296)","v":701238},{"$f":"SUMPRODUCT(('[11]Trial Balance'!$A$274:$A$296=6)*'[11]Trial Balance'!$G$274:$G$296)","v":664279},{"$f":"SUMPRODUCT(('[11]Trial Balance'!$A$274:$A$296=6)*'[11]Trial Balance'!$I$274:$I$296)+44000","v":684928.45},{"$f":"SUMPRODUCT(('[11]Trial Balance'!$A$274:$A$296=6)*'[11]Trial Balance'!$K$274:$K$296)","v":663810},{"$f":"SUMPRODUCT(('[11]Trial Balance'!$A$274:$A$296=6)*'[11]Trial Balance'!$L$274:$L$296)","v":744540.5},{"$f":"G21-E21","v":59612.050000000047},{"$f":"G21-B21","v":-3727.0281801999081}]
[]
["Sub-Total",{"$f":"SUM(B16:B21)","v":1234229.7228009999},{"$f":"SUM(C16:C21)","v":1323999},{"$f":"SUM(D16:D21)","v":1342978},1421569.31,1455280,1578482.5,156913.18999999994,344252.77719900012]
["Maintenance"]
["1) Overhead Distribution Lines/Feeders",{"$f":"SUMPRODUCT(('[19]2013'!$A$37:$A$58=1)*'[19]2013'!$E$37:$E$58)+('[19]2013'!$E$37/2)","v":379731.05015950004},{"$f":"SUMPRODUCT(('[11]Trial Balance'!$A$298:$A$315=1)*'[11]Trial Balance'!$E$298:$E$315)+('[11]Trial Balance'!$E$298/2)","v":326706.5},{"$f":"SUMPRODUCT(('[11]Trial Balance'!$A$298:$A$315=1)*'[11]Trial Balance'!$G$298:$G$315)+('[11]Trial Balance'!$G$298/2)","v":275314.5},{"$f":"SUMPRODUCT(('[11]Trial Balance'!$A$298:$A$315=1)*'[11]Trial Balance'!$I$298:$I$315)+('[11]Trial Balance'!$I$298/2)","v":281961.08},{"$f":"SUMPRODUCT(('[11]Trial Balance'!$A$298:$A$315=1)*'[11]Trial Balance'!$K$298:$K$315)+('[11]Trial Balance'!$K$298/2)","v":341175},{"$f":"SUMPRODUCT(('[11]Trial Balance'!$A$298:$A$315=1)*'[11]Trial Balance'!$L$298:$L$315)+('[11]Trial Balance'!$L$298/2)","v":422852.5},140891.41999999998,43121.449840499961]
["2) Underground Distribution Lines/Feeders",{"$f":"SUMPRODUCT(('[19]2013'!$A$37:$A$58=2)*'[19]2013'!$E$37:$E$58)+('[19]2013'!$E$37/2)","v":73103.065487300002},{"$f":"SUMPRODUCT(('[11]Trial Balance'!$A$298:$A$315=2)*'[11]Trial Balance'!$E$298:$E$315)+('[11]Trial Balance'!$E$298/2)","v":74485.5},{"$f":"SUMPRODUCT(('[11]Trial Balance'!$A$298:$A$315=2)*'[11]Trial Balance'!$G$298:$G$315)+('[11]Trial Balance'!$G$298/2)","v":142879.5},{"$f":"SUMPRODUCT(('[11]Trial Balance'!$A$298:$A$315=2)*'[11]Trial Balance'!$I$298:$I$315)+('[11]Trial Balance'!$I$298/2)","v":105036.76999999999},{"$f":"SUMPRODUCT(('[11]Trial Balance'!$A$298:$A$315=2)*'[11]Trial Balance'!$K$298:$K$315)+('[11]Trial Balance'!$K$298/2)","v":135275},{"$f":"SUMPRODUCT(('[11]Trial Balance'!$A$298:$A$315=2)*'[11]Trial Balance'!$L$298:$L$315)+('[11]Trial Balance'!$L$298/2)","v":140287.5},35250.73000000001,67184.434512699998]
["3) Distribution Meters",{"$f":"SUMPRODUCT(('[19]2013'!$A$37:$A$58=3)*'[19]2013'!$E$37:$E$58)","v":34731.942745599998},{"$f":"SUMPRODUCT(('[11]Trial Balance'!$A$298:$A$315=3)*'[11]Trial Balance'!$E$298:$E$315)","v":27299},{"$f":"SUMPRODUCT(('[11]Trial Balance'!$A$298:$A$315=3)*'[11]Trial Balance'!$G$298:$G$315)","v":23803},{"$f":"SUMPRODUCT(('[11]Trial Balance'!$A$298:$A$315=3)*'[11]Trial Balance'!$I$298:$I$315)","v":23318.880000000001},{"$f":"SUMPRODUCT(('[11]Trial Balance'!$A$298:$A$315=3)*'[11]Trial Balance'!$K$298:$K$315)","v":28750},{"$f":"SUMPRODUCT(('[11]Trial Balance'!$A$298:$A$315=3)*'[11]Trial Balance'!$L$298:$L$315)","v":28750},5431.119999999999,-5981.9427455999976]
["4) Distribution Transformers",{"$f":"SUMPRODUCT(('[19]2013'!$A$37:$A$58=4)*'[19]2013'!$E$37:$E$58)","v":18594.9667476},{"$f":"SUMPRODUCT(('[11]Trial Balance'!$A$298:$A$315=4)*'[11]Trial Balance'!$E$298:$E$315)","v":34660},{"$f":"SUMPRODUCT(('[11]Trial Balance'!$A$298:$A$315=4)*'[11]Trial Balance'!$G$298:$G$315)","v":29480},{"$f":"SUMPRODUCT(('[11]Trial Balance'!$A$298:$A$315=4)*'[11]Trial Balance'!$I$298:$I$315)","v":17208.129999999997},{"$f":"SUMPRODUCT(('[11]Trial Balance'!$A$298:$A$315=4)*'[11]Trial Balance'!$K$298:$K$315)","v":25050},{"$f":"SUMPRODUCT(('[11]Trial Balance'!$A$298:$A$315=4)*'[11]Trial Balance'!$L$298:$L$315)","v":75905},58696.87,57310.033252399997]
[null,null,null,null,null,null,null,0,0]
["Sub-Total",{"$f":"SUM(B25:B29)","v":506161.02514000004},463151,471477,427524.86,530250,667795,240270.14,161633.97485999996]
["Community Relations"]
["1) Community Relations",{"$f":"SUMPRODUCT(('[19]2013'!$A$79:$A$87=1)*'[19]2013'!$E$79:$E$87)","v":8586},{"$f":"SUMPRODUCT(('[11]Trial Balance'!$A$330:$A$334=1)*'[11]Trial Balance'!$E$330:$E$334)","v":5419},{"$f":"SUMPRODUCT(('[11]Trial Balance'!$A$330:$A$334=1)*'[11]Trial Balance'!$G$330:$G$334)","v":5663},{"$f":"SUMPRODUCT(('[11]Trial Balance'!$A$330:$A$334=1)*'[11]Trial Balance'!$I$330:$I$334)","v":8066.26},{"$f":"SUMPRODUCT(('[11]Trial Balance'!$A$330:$A$334=1)*'[11]Trial Balance'!$K$330:$K$334)","v":10250},{"$f":"SUMPRODUCT(('[11]Trial Balance'!$A$330:$A$334=1)*'[11]Trial Balance'!$L$330:$L$334)","v":12000},3933.74,3414]
[null,null,null,null,null,null,null,0,0]
["Sub-Total",{"$f":"SUM(B32:B33)","v":8586},5419,5663,8066.26,10250,12000,3933.74,3414]
["Customer Service",null,null,null,null,null,null,null,0]
["1) Bad Debts",{"$f":"SUMPRODUCT(('[19]2013'!$A$65:$A$72=1)*'[19]2013'!$E$65:$E$72)","v":60017.032275999998},{"$f":"SUMPRODUCT(('[11]Trial Balance'!$A$321:$A$328=1)*'[11]Trial Balance'!$E$321:$E$328)","v":86391},{"$f":"SUMPRODUCT(('[11]Trial Balance'!$A$321:$A$328=1)*'[11]Trial Balance'!$G$321:$G$328)","v":119440},{"$f":"SUMPRODUCT(('[11]Trial Balance'!$A$321:$A$328=1)*'[11]Trial Balance'!$I$321:$I$328)","v":59455.15},{"$f":"SUMPRODUCT(('[11]Trial Balance'!$A$321:$A$328=1)*'[11]Trial Balance'!$K$321:$K$328)","v":75000},{"$f":"SUMPRODUCT(('[11]Trial Balance'!$A$321:$A$328=1)*'[11]Trial Balance'!$L$321:$L$328)","v":80000},20544.849999999999,19982.967724000002]
["2) Customer Service & Billings",{"$f":"SUMPRODUCT(('[19]2013'!$A$65:$A$72=2)*'[19]2013'!$E$65:$E$72)","v":610762.40173040004},{"$f":"SUMPRODUCT(('[11]Trial Balance'!$A$321:$A$328=2)*'[11]Trial Balance'!$E$321:$E$328)","v":613080},{"$f":"SUMPRODUCT(('[11]Trial Balance'!$A$321:$A$328=2)*'[11]Trial Balance'!$G$321:$G$328)","v":690010},{"$f":"SUMPRODUCT(('[11]Trial Balance'!$A$321:$A$328=2)*'[11]Trial Balance'!$I$321:$I$328)","v":691348.04},{"$f":"SUMPRODUCT(('[11]Trial Balance'!$A$321:$A$328=2)*'[11]Trial Balance'!$K$321:$K$328)","v":757627},{"$f":"SUMPRODUCT(('[11]Trial Balance'!$A$321:$A$328=2)*'[11]Trial Balance'!$L$321:$L$328)","v":724679},33330.959999999963,113916.59826959996]
["3) Customer Collections",{"$f":"SUMPRODUCT(('[19]2013'!$A$65:$A$72=3)*'[19]2013'!$E$65:$E$72)","v":327173.34133719996},{"$f":"SUMPRODUCT(('[11]Trial Balance'!$A$321:$A$328=3)*'[11]Trial Balance'!$E$321:$E$328)","v":355468},{"$f":"SUMPRODUCT(('[11]Trial Balance'!$A$321:$A$328=3)*'[11]Trial Balance'!$G$321:$G$328)","v":360085},{"$f":"SUMPRODUCT(('[11]Trial Balance'!$A$321:$A$328=3)*'[11]Trial Balance'!$I$321:$I$328)","v":345313.06},{"$f":"SUMPRODUCT(('[11]Trial Balance'!$A$321:$A$328=3)*'[11]Trial Balance'!$K$321:$K$328)","v":371340},{"$f":"SUMPRODUCT(('[11]Trial Balance'!$A$321:$A$328=3)*'[11]Trial Balance'!$L$321:$L$328)","v":380146},34832.94,52972.658662800037]
[null,null,null,null,null,null,null,0,0]
["Sub-Total",{"$f":"SUM(B36:B39)","v":997952.77534359996},1054939,1169535,1096116.25,1203967,1184825,88708.75,186872.22465640004]
["Administration",null,null,null,null,null,null,null,0]
["1) Information Systems",{"$f":"SUMPRODUCT(('[19]2013'!$A$94:$A$123=1)*'[19]2013'!$E$94:$E$123)","v":193625.2462692},{"$f":"SUMPRODUCT(('[11]Trial Balance'!$A$341:$A$358=1)*'[11]Trial Balance'!$E$341:$E$358)","v":242079},{"$f":"SUMPRODUCT(('[11]Trial Balance'!$A$341:$A$358=1)*'[11]Trial Balance'!$G$341:$G$358)","v":233742},{"$f":"SUMPRODUCT(('[11]Trial Balance'!$A$341:$A$358=1)*'[11]Trial Balance'!$I$341:$I$358)","v":282147.84999999998},{"$f":"SUMPRODUCT(('[11]Trial Balance'!$A$341:$A$358=1)*'[11]Trial Balance'!$K$341:$K$358)","v":333500},{"$f":"SUMPRODUCT(('[11]Trial Balance'!$A$341:$A$358=1)*'[11]Trial Balance'!$L$341:$L$358)","v":345679},{"$f":"G42-E42","v":63531.150000000023},152053.7537308]
["2) Insurance",{"$f":"SUMPRODUCT(('[19]2013'!$A$94:$A$123=2)*'[19]2013'!$E$94:$E$123)","v":82174.447005199996},{"$f":"SUMPRODUCT(('[11]Trial Balance'!$A$341:$A$358=2)*'[11]Trial Balance'!$E$341:$E$358)","v":94194},{"$f":"SUMPRODUCT(('[11]Trial Balance'!$A$341:$A$358=2)*'[11]Trial Balance'!$G$341:$G$358)","v":95797},{"$f":"SUMPRODUCT(('[11]Trial Balance'!$A$341:$A$358=2)*'[11]Trial Balance'!$I$341:$I$358)","v":93838.42},{"$f":"SUMPRODUCT(('[11]Trial Balance'!$A$341:$A$358=2)*'[11]Trial Balance'!$K$341:$K$358)","v":104030},{"$f":"SUMPRODUCT(('[11]Trial Balance'!$A$341:$A$358=2)*'[11]Trial Balance'!$L$341:$L$358)","v":110000},16161.580000000002,{"$f":"G43-B43","v":27825.552994800004}]
["3) Audit, Legal and Consulting",{"$f":"SUMPRODUCT(('[19]2013'!$A$94:$A$123=3)*'[19]2013'!$E$94:$E$123)","v":132208.3054524},{"$f":"SUMPRODUCT(('[11]Trial Balance'!$A$341:$A$358=3)*'[11]Trial Balance'!$E$341:$E$358)","v":123227},{"$f":"SUMPRODUCT(('[11]Trial Balance'!$A$341:$A$358=3)*'[11]Trial Balance'!$G$341:$G$358)","v":131529},{"$f":"SUMPRODUCT(('[11]Trial Balance'!$A$341:$A$358=3)*'[11]Trial Balance'!$I$341:$I$358)","v":199341.52},{"$f":"SUMPRODUCT(('[11]Trial Balance'!$A$341:$A$358=3)*'[11]Trial Balance'!$K$341:$K$358)","v":186000},{"$f":"SUMPRODUCT(('[11]Trial Balance'!$A$341:$A$358=3)*'[11]Trial Balance'!$L$341:$L$358)","v":181100},{"$f":"G44-E44","v":-18241.51999999999},{"$f":"G44-B44","v":48891.694547599996}]
["4) Building and Office Supplies",{"$f":"SUMPRODUCT(('[19]2013'!$A$94:$A$123=4)*'[19]2013'!$E$94:$E$123)","v":239680.7707736},{"$f":"SUMPRODUCT(('[11]Trial Balance'!$A$341:$A$358=4)*'[11]Trial Balance'!$E$341:$E$358)","v":166531},{"$f":"SUMPRODUCT(('[11]Trial Balance'!$A$341:$A$358=4)*'[11]Trial Balance'!$G$341:$G$358)","v":221715},{"$f":"SUMPRODUCT(('[11]Trial Balance'!$A$341:$A$358=4)*'[11]Trial Balance'!$I$341:$I$358)","v":349376.61},{"$f":"SUMPRODUCT(('[11]Trial Balance'!$A$341:$A$358=4)*'[11]Trial Balance'!$K$341:$K$358)","v":321850},{"$f":"SUMPRODUCT(('[11]Trial Balance'!$A$341:$A$358=4)*'[11]Trial Balance'!$L$341:$L$358)","v":344550},-4826.609999999986,{"$f":"G45-B45","v":104869.2292264}]
["5) Management, Administrative, Finance, Regulatory and IT",{"$f":"SUMPRODUCT(('[19]2013'!$A$94:$A$123=5)*'[19]2013'!$E$94:$E$123)","v":1382509.2423288},{"$f":"SUMPRODUCT(('[11]Trial Balance'!$A$341:$A$358=5)*'[11]Trial Balance'!$E$341:$E$358)","v":1344476},{"$f":"SUMPRODUCT(('[11]Trial Balance'!$A$341:$A$358=5)*'[11]Trial Balance'!$G$341:$G$358)","v":1469885},{"$f":"SUMPRODUCT(('[11]Trial Balance'!$A$341:$A$358=5)*'[11]Trial Balance'!$I$341:$I$358)","v":1603270.93},{"$f":"SUMPRODUCT(('[11]Trial Balance'!$A$341:$A$358=5)*'[11]Trial Balance'!$K$341:$K$358)","v":1587505},{"$f":"SUMPRODUCT(('[11]Trial Balance'!$A$341:$A$358=5)*'[11]Trial Balance'!$L$341:$L$358)","v":1663193},59922.070000000065,{"$f":"G46-B46","v":280683.75767119997}]
["6) Regulatory Affairs (assessment & application costs)",{"$f":"SUMPRODUCT(('[19]2013'!$A$94:$A$123=6)*'[19]2013'!$E$94:$E$123)","v":113064.4968638},{"$f":"SUMPRODUCT(('[11]Trial Balance'!$A$341:$A$358=6)*'[11]Trial Balance'!$E$341:$E$358)","v":177188},{"$f":"SUMPRODUCT(('[11]Trial Balance'!$A$341:$A$358=6)*'[11]Trial Balance'!$G$341:$G$358)","v":82330},{"$f":"SUMPRODUCT(('[11]Trial Balance'!$A$341:$A$358=6)*'[11]Trial Balance'!$I$341:$I$358)","v":120338.69},{"$f":"SUMPRODUCT(('[11]Trial Balance'!$A$341:$A$358=6)*'[11]Trial Balance'!$K$341:$K$358)","v":105450},{"$f":"SUMPRODUCT(('[11]Trial Balance'!$A$341:$A$358=6)*'[11]Trial Balance'!$L$341:$L$358)","v":100000},-20338.690000000002,{"$f":"G47-B47","v":-13064.496863799999}]
[null,null,null,null,null,null,null,0,0]
["Sub-Total",{"$f":"SUM(B42:B48)","v":2143262.5086929998},2147695,2234998,2648314.02,{"$f":"SUM(F42:F48)","v":2638335},2744522,96207.979999999981,601259.49130700016]
["Miscellaneous",null,null,null,-44000,null,null,44000,{"$f":"G50-B50","v":0}]
["Total",{"$f":"SUMPRODUCT(--($A15:$A50=\"Sub-Total\"), B$15:B$50)+B50","v":4890192.0319775995},4995203,5224651,5557590.6999999993,5838082,6187624.5,{"$f":"G51-E51","v":630033.80000000075},{"$f":"G51-B51","v":1297432.4680224005}]
[]
["Notes:",{"$f":"'[19]2013'!$E$129","v":4890317.1884348001},{"$f":"'App.2-JA_OM&A_Summary_Analys'!C36","v":4995203},{"$f":"'App.2-JA_OM&A_Summary_Analys'!D36","v":5224651},{"$f":"'App.2-JA_OM&A_Summary_Analys'!E36","v":5557590.6999999993},{"$f":"'App.2-JA_OM&A_Summary_Analys'!F36","v":5838082},{"$f":"'App.2-JA_OM&A_Summary_Analys'!G36","v":6187624.5}]
[null,{"$f":"B53-B51","v":125.1564572006464},{"$f":"C53-C51","v":0},{"$f":"D53-D51","v":0},0,0,0]
["1   Please provide a breakdown of the major components of each OM&A Program undertaken in each year.  Please ensure that all Programs below the materiality threshold are included in the miscellaneous line.  Add more Programs as required."]
["2   The applicant should group projects appropriately and avoid presentations that result in classification of significant components of the OM&A budget in the miscellaneous category"]
["* $125 difference in the 2013 Board Approved column totals is due to account 5685 on the OM&A having $125 allotted to it that should not have been part of the forecasted budget, and therefore has not been added to this chart"]

{"sheet":"App.2-K_Employee Costs","index":34,"n_rows":34,"n_cols":7,"rows_kept":34,"cut":false,"hidden":false,"merged":[[31,0,31,6],[24,0,24,6],[8,0,8,6],[9,0,9,6],[12,0,12,6],[16,0,16,6],[20,0,20,6]]}
[null,null,null,null,null,"File Number:",{"$f":"EBNUMBER","v":"EB-2016-0085"}]
[null,null,null,null,null,"Exhibit:",4]
[null,null,null,null,null,"Tab:"]
[null,null,null,null,null,"Schedule:"]
[null,null,null,null,null,"Page:"]
[]
[null,null,null,null,null,"Date:","2016-11-28"]
[]
["Appendix 2-K"]
["Employee Costs"]
[]
[null,{"$f":"\"Last Rebasing Year - \"&RebaseYear&\"- Board Approved\"","v":"Last Rebasing Year - 2013- Board Approved"},{"$f":"\"Last Rebasing Year - \"&RebaseYear&\"-  Actual\"","v":"Last Rebasing Year - 2013-  Actual"},{"$f":"BridgeYear -2 & \" Actuals\"","v":"2014 Actuals"},{"$f":"BridgeYear -1 & \" Actuals\"","v":"2015 Actuals"},{"$f":"BridgeYear & \" Bridge Year\"","v":"2016 Bridge Year"},{"$f":"TestYear & \" Test Year\"","v":"2017 Test Year"}]
["Number of Employees (FTEs including Part-Time)1"]
["Management (including executive)",11,11,11,10,{"$f":"[20]Sheet1!$G$6","v":10},{"$f":"[20]Sheet1!$H$6","v":10}]
["Non-Management (union and non-union)",28,28.060000000000002,27.130000000000003,34,{"$f":"[20]Sheet1!$G$7","v":34},{"$f":"[20]Sheet1!$H$7","v":34}]
["Total",{"$f":"SUM(B14:B15)","v":39},39.06,38.130000000000003,44,44,44]
["Total Salary and Wages including ovetime and incentive pay"]
["Management (including executive)",1263246,1263246,1280059,1302820,{"$f":"[20]Sheet1!$G$10","v":1161540},{"$f":"[20]Sheet1!$H$10","v":1315900}]
["Non-Management (union and non-union)",1876914,1876914,2086628,2165000,{"$f":"[20]Sheet1!$G$11","v":2301581},{"$f":"[20]Sheet1!$H$11","v":2363053}]
["Total",{"$f":"SUM(B18:B19)","v":3140160},3140160,3366687,3467820,3463121,3678953]
["Total Benefits (Current + Accrued) 2"]
["Management (including executive)",252649.2,252649.2,256011.80000000002,260564,{"$f":"[20]Sheet1!$G$14","v":225513},{"$f":"[20]Sheet1!$H$14","v":232278}]
["Non-Management (union and non-union)",375382.80000000005,375382.80000000005,417325.60000000003,433000,{"$f":"[20]Sheet1!$G$15","v":402872},{"$f":"[20]Sheet1!$H$15","v":414958}]
["Total",{"$f":"SUM(B22:B23)","v":628032},{"$f":"SUM(C22:C23)","v":628032},673337.4,693564,628385,647236]
["Total Compensation (Salary, Wages, & Benefits)"]
["Management (including executive)",{"$f":"B18+B22","v":1515895.2},1515895.2,1536070.8,1563384,1387053,1548178]
["Non-Management (union and non-union)",2252296.7999999998,2252296.7999999998,2503953.6,2598000,2704453,2778011]
["Total",3768192,3768192,4040024.4,4161384,4091506,4326189]
[]
["Note:"]
["1 If an applicant wishes to use headcount, it must also file the same schedule on an FTE basis."]
["2 Current employee benefits, plus Pension and Other Post-Employment Benefits costs, as recorded for recovery in distribution rates. Should be consistent with OPEBs costs as documented in Appendix 2-KA."]
[]
["Data provided by Barb Cesarin"]

{"sheet":"App.2-KA_P_OPEBs","index":35,"n_rows":34,"n_cols":11,"rows_kept":34,"cut":false,"hidden":false,"merged":[[35,2,39,10],[8,1,8,10],[9,1,9,10],[11,2,11,9],[14,2,14,10],[16,2,21,10]]}
[null,null,null,null,null,null,null,null,null,"File Number:",{"$f":"EBNUMBER","v":"EB-2016-0085"}]
[null,null,null,null,null,null,null,null,null,"Exhibit:",4]
[null,null,null,null,null,null,null,null,null,"Tab:"]
[null,null,null,null,null,null,null,null,null,"Schedule:"]
[null,null,null,null,null,null,null,null,null,"Page:"]
[]
[null,null,null,null,null,null,null,null,null,"Date:","Novemeber 28, 2016"]
[]
[null,"Appendix 2-KA"]
[null,"OPEBs (Other Post-Employment Benefits) Costs"]
[]
[null,"A","Please indicate if OPEBs were recovered on a cash or accrual accounting basis for each year since the distributor started to recover OPEBs in distribution rates from customers:",null,null,null,null,null,null,null,"Accrual"]
[]
[null,null,"Notes: "]
[null,null,"(Please add any information to explain the accounting basis used for OPEBs cost recovery in rate setting. If basis is other than Cash or Accrual, an explanation is required.)"]
[]
[]
[]
[]
[]
[]
[]
[]
[null,"B","Please complete the following table:"]
[]
[null,null,"OPEBS",{"$f":"CONCATENATE(\"First Year of recovery to \",E26-1)","v":"First Year of recovery to 2011"},{"$f":"F26-1","v":2012},{"$f":"G26-1","v":2013},{"$f":"H26-1","v":2014},{"$f":"I26-1","v":2015},{"$f":"BridgeYear","v":2016},{"$f":"TestYear","v":2017},"Total"]
[null,null,"Amounts included in Rates"]
[null,null,"     OM&A",null,null,null,null," "," ",null,{"$f":"SUM(D28:J28)","v":0}]
[null,null,"     Capital",null,null,null,null,null,null,null,{"$f":"SUM(D29:J29)","v":0}]
[null,null,"     Total",{"$f":"SUM(D28:D29)","v":0},{"$f":"SUM(E28:E29)","v":0},0,0,0,0,0,0]
[null,null,"Paid benefit amounts",null,null,null,0,75073,161478,0,{"$f":"SUM(D31:J31)","v":236551}]
[null,null,"Net excess amount included in rates relative to amounts actually paid.",{"$f":"D30-D31","v":0},{"$f":"E30-E31","v":0},0,0,-75073,-161478,0,{"$f":"SUM(D32:J32)","v":-236551}]
[]
[null,"C","Please describe what the distributor has done with the recoveries in excess of cash payments:"]

{"sheet":"App.2-L_OM&A_per_Cust_FTE","index":36,"n_rows":38,"n_cols":9,"rows_kept":38,"cut":false,"hidden":false,"merged":[[13,1,13,2],[14,1,14,2],[15,1,15,2],[8,1,8,8],[9,1,9,8],[22,1,22,2],[25,1,25,2],[26,1,26,2],[16,1,16,2],[17,1,17,2],[18,1,18,2],[19,1,19,2],[20,1,20,2],[21,1,21,2],[37,2,37,8],[34,2,34,8],[35,2,35,8],[36,2,36,8],[32,2,33,8]]}
[null,null,null,null,null,null,null,"File Number:",{"$f":"EBNUMBER","v":"EB-2016-0085"}]
[null,null,null,null,null,null,null,"Exhibit:",4]
[null,null,null,null,null,null,null,"Tab:"]
[null,null,null,null,null,null,null,"Schedule:"]
[null,null,null,null,null,null,null,"Page:"]
[]
[null,null,null,null,null,null,null,"Date:","2016-11-28"]
[]
[null,"Appendix 2-L"]
[null,"Recoverable OM&A Cost per Customer and per FTE 1"]
[]
[]
[null,null,null,{"$f":"\"Last Rebasing Year - \"&RebaseYear&\"- Board Approved\"","v":"Last Rebasing Year - 2013- Board Approved"},{"$f":"\"Last Rebasing Year - \"&RebaseYear&\"-  Actual\"","v":"Last Rebasing Year - 2013-  Actual"},{"$f":"BridgeYear -2 & \" Actuals\"","v":"2014 Actuals"},{"$f":"BridgeYear -1 & \" Actuals\"","v":"2015 Actuals"},{"$f":"BridgeYear & \" Bridge Year\"","v":"2016 Bridge Year"},{"$f":"TestYear & \" Test Year\"","v":"2017 Test Year"}]
[null,"Reporting Basis",null,"CGAAP","CGAAP","MIFRS","MIFRS","MIFRS","MIFRS"]
[null,"OM&A Costs"]
[null,"     O&M",null,{"$f":"'App.2-JA_OM&A_Summary_Analys'!B17","v":1740390.7479409999},{"$f":"'App.2-JA_OM&A_Summary_Analys'!C17","v":1787150},{"$f":"'App.2-JA_OM&A_Summary_Analys'!D17","v":1814455},{"$f":"'App.2-JA_OM&A_Summary_Analys'!E17","v":1805094.17},{"$f":"'App.2-JA_OM&A_Summary_Analys'!F17","v":1985530},{"$f":"'App.2-JA_OM&A_Summary_Analys'!G17","v":2246277.5}]
[null,"     Admin Expenses",null,{"$f":"'App.2-JA_OM&A_Summary_Analys'!B23","v":3149801.2840366},{"$f":"'App.2-JA_OM&A_Summary_Analys'!C23","v":3208053},{"$f":"'App.2-JA_OM&A_Summary_Analys'!D23","v":3410196},{"$f":"'App.2-JA_OM&A_Summary_Analys'!E23","v":3752496.5300000003},{"$f":"'App.2-JA_OM&A_Summary_Analys'!F23","v":3852552},{"$f":"'App.2-JA_OM&A_Summary_Analys'!G23","v":3941347}]
[null,"Total Recoverable OM&A from Appendix 2-JB 5",null,{"$f":"SUM(D16:D17)","v":4890192.0319775995},{"$f":"SUM(E16:E17)","v":4995203},5224651,5557590.7000000002,5838082,6187624.5]
[null,"Number of Customers 2,4",null,15341,{"$f":"[18]Summary!$I$46","v":18286.166666666664},{"$f":"[18]Summary!$J$46","v":18735.916666666664},{"$f":"[18]Summary!$K$46","v":19073.083333333336},{"$f":"[18]Summary!$L$46","v":19717.5},{"$f":"[18]Summary!$M$46","v":20318.5}]
[null,"Number of FTEs 3,4",null,{"$f":"'App.2-K_Employee Costs'!B16","v":39},{"$f":"'App.2-K_Employee Costs'!C16","v":39.06},{"$f":"'App.2-K_Employee Costs'!D16","v":38.130000000000003},{"$f":"'App.2-K_Employee Costs'!E16","v":44},44,44]
[null,"Customers/FTEs",null,{"$f":"IF(D20=0,\"\",D19/D20)","v":393.35897435897436},{"$f":"IF(E20=0,\"\",E19/E20)","v":468.15582863969951},491.36943788792718,433.47916666666674,448.125,461.78409090909093]
[null,"OM&A cost per customer"]
[null,"     O&M per customer",null,{"$f":"IF(D19=0,\"\",D16/D19)","v":113.44702092047454},{"$f":"IF(E19=0,\"\",E16/E19)","v":97.732347767438057},96.843673692684746,94.640920843946731,100.69887156079625,110.55331348278662]
[null,"     Admin per customer",null,{"$f":"IF(D19=0,\"\",D17/D19)","v":205.31916329030702},{"$f":"IF(E19=0,\"\",E17/E19)","v":175.43605822251794},182.01383261205086,196.74304696408987,195.38744769874478,193.97824642567119]
[null,"     Total OM&A per customer",null,{"$f":"IF(D19=0,\"\",D18/D19)","v":318.76618421078155},{"$f":"IF(E19=0,\"\",E18/E19)","v":273.168405989956},278.85750630473558,291.38396780803663,296.08631925954103,304.53155990845784]
[null,"OM&A cost per FTE"]
[null,"     O&M per FTE",null,{"$f":"IF(D20=0,\"\",D16/D20)","v":44625.403793358972},{"$f":"IF(E20=0,\"\",E16/E20)","v":45753.968253968254},47586.021505376339,41024.8675,45125.681818181816,51051.76136363636]
[null,"     Admin per FTE",null,{"$f":"IF(D20=0,\"\",D17/D20)","v":80764.135488117943},{"$f":"IF(E20=0,\"\",E17/E20)","v":82131.413210445462},89436.034618410689,85284.012045454554,87558,89576.068181818177]
[null,"     Total OM&A per FTE",null,{"$f":"IF(D20=0,\"\",D18/D20)","v":125389.53928147691},{"$f":"IF(E20=0,\"\",E18/E20)","v":127885.38146441372},137022.05612378704,126308.87954545455,132683.68181818182,140627.82954545456]
[]
[null,"Notes:"]
[]
[null,1,"If it has been more than three years since the applicant last filed a cost of service application, additional years of historical actuals should be incorporated into the table, as necessary, to go back to the last cost of service application.  If the applicant last filed a cost of service application less than three years ago, a minimum of three years of actual information is required."]
[]
[null,2,"The method of calculating the number of customers must be identified. Should correspond with data provided in Appendix 2-IB"]
[null,3,"The method of calculating the number of FTEs must be identified.  See also Appendix 2-K"]
[null,4,"The number of customers and the number of FTEs should correspond to mid-year or average of January 1 and December 31 figures."]
[null,5,"For the test year, the applicant should take into account the system O&M (line 22 of Appendix 2-AB) in developing its forecasted OM&A."]

{"sheet":"App.2-L_OM&A_per_Cust_FTEE_exp","index":37,"n_rows":38,"n_cols":12,"rows_kept":38,"cut":false,"hidden":true,"merged":[[37,1,38,11],[36,1,36,11],[32,1,33,11],[19,0,19,1],[18,0,18,1],[20,0,20,1],[26,0,26,1],[8,0,8,11],[9,0,9,11],[34,1,34,6],[35,1,35,6],[21,0,21,1],[22,0,22,1],[25,0,25,1],[14,0,14,1],[13,0,13,1],[11,7,11,11],[15,0,15,1],[16,0,16,1],[17,0,17,1]]}
[null,null,null,null,null,null,null,null,null,null,"File Number:",{"$f":"EBNUMBER","v":"EB-2016-0085"}]
[null,null,null,null,null,null,null,null,null,null,"Exhibit:"]
[null,null,null,null,null,null,null,null,null,null,"Tab:"]
[null,null,null,null,null,null,null,null,null,null,"Schedule:"]
[null,null,null,null,null,null,null,null,null,null,"Page:"]
[]
[null,null,null,null,null,null,null,null,null,null,"Date:"]
[]
["Appendix 2-L"]
["Recoverable OM&A Cost per Customer and per FTE 1"]
[]
[null,null,null,null,null,null,null,"5-year Distribution System Plan Period"]
[null,null,{"$f":"\"Last Rebasing Year - \"&RebaseYear&\"- Board Approved\"","v":"Last Rebasing Year - 2013- Board Approved"},{"$f":"\"Last Rebasing Year - \"&RebaseYear&\"-  Actual\"","v":"Last Rebasing Year - 2013-  Actual"},{"$f":"BridgeYear -2 & \" Actuals\"","v":"2014 Actuals"},{"$f":"BridgeYear -1 & \" Actuals\"","v":"2015 Actuals"},{"$f":"BridgeYear & \" Bridge Year\"","v":"2016 Bridge Year"},{"$f":"TestYear & \" Test Year\"","v":"2017 Test Year"},{"$f":"TestYear+1 & \" Year\"","v":"2018 Year"},{"$f":"TestYear+2 & \" Year\"","v":"2019 Year"},{"$f":"TestYear+3 & \" Year\"","v":"2020 Year"},{"$f":"TestYear+4 & \" Year\"","v":"2021 Year"}]
["Reporting Basis"]
["OM&A Costs"]
["     O&M"]
["     Admin Expenses"]
["Total Recoverable OM&A from Appendix 2-JB 5",null,{"$f":"SUM(C16:C17)","v":0},{"$f":"SUM(D16:D17)","v":0},0,0,0,0,0,0,0,0]
["Number of Customers 2,4"]
["Number of FTEs 3,4"]
["Customers/FTEs",null,{"$f":"IF(C20=0,\"\",C19/C20)","v":""},{"$f":"IF(D20=0,\"\",D19/D20)","v":""},"","","","","","","",""]
["OM&A cost per customer"]
["     O&M per customer",null,{"$f":"IF(C19=0,\"\",C16/C19)","v":""},{"$f":"IF(D19=0,\"\",D16/D19)","v":""},"","","","","","","",""]
["     Admin per customer",null,{"$f":"IF(C19=0,\"\",C17/C19)","v":""},{"$f":"IF(D19=0,\"\",D17/D19)","v":""},"","","","","","","",""]
["     Total OM&A per customer",null,{"$f":"IF(C19=0,\"\",C18/C19)","v":""},{"$f":"IF(D19=0,\"\",D18/D19)","v":""},"","","","","","","",""]
["OM&A cost per FTE"]
["     O&M per FTE",null,{"$f":"IF(C20=0,\"\",C16/C20)","v":""},{"$f":"IF(D20=0,\"\",D16/D20)","v":""},"","","","","","","",""]
["     Admin per FTE",null,{"$f":"IF(C20=0,\"\",C17/C20)","v":""},{"$f":"IF(D20=0,\"\",D17/D20)","v":""},"","","","","","","",""]
["     Total OM&A per FTE",null,{"$f":"IF(C20=0,\"\",C18/C20)","v":""},{"$f":"IF(D20=0,\"\",D18/D20)","v":""},"","","","","","","",""]
[]
["Notes:"]
[]
[1,"If it has been more than three years since the applicant last filed a cost of service application, additional years of historical actuals should be incorporated into the table, as necessary, to go back to the last cost of service application.  If the applicant last filed a cost of service application less than three years ago, a minimum of three years of actual information is required."]
[]
[2,"The method of calculating the number of customers must be identified. Should be linked back to Appendix 2-IA"]
[3,"The method of calculating the number of FTEs must be identified.  See also Appendix 2-K"]
[4,"The number of customers and the number of FTEs should correspond to mid-year or average of January 1 and December 31 figures."]
[5,"For the test year and in the subsequent four years of the DSP period, the applicant should take into account the system O&M (line X of Appendix 2-AB) in developing its forecasted OM&A. Admin expenses beyond the test year also need to be forecasted (separately)."]

{"sheet":"App.2-M_Regulatory_Costs","index":38,"n_rows":44,"n_cols":11,"rows_kept":44,"cut":false,"hidden":false,"merged":[[12,0,12,1],[13,0,13,1],[8,0,8,10],[9,0,9,10]]}
[null,null,null,null,null,null,null,null,null,"File Number:",{"$f":"EBNUMBER","v":"EB-2016-0085"}]
[null,null,null,null,null,null,null,null,null,"Exhibit:"]
[null,null,null,null,null,null,null,null,null,"Tab:"]
[null,null,null,null,null,null,null,null,null,"Schedule:"]
[null,null,null,null,null,null,null,null,null,"Page:"]
[]
[null,null,null,null,null,null,null,null,null,"Date:","November 28, 2016, "]
[]
["Appendix 2-M"]
["Regulatory Cost Schedule"]
[]
[]
["Regulatory Cost Category",null,"USoA Account","USoA Account Balance","Ongoing or One-time Cost? 2",{"$f":"\"Last Rebasing Year (\" & RebaseYear & \" Board Approved)\"","v":"Last Rebasing Year (2013 Board Approved)"},{"$f":"\"Most Current Actuals               Year \" & TestYear - 2","v":"Most Current Actuals               Year 2015"},{"$f":"TestYear -1 & \" Bridge Year\"","v":"2016 Bridge Year"},"Annual % Change",{"$f":"TestYear & \" Test Year\"","v":"2017 Test Year"},"Annual % Change"]
["(A)",null,"(B)","(C )","(D)","(E)","(F)","(G)","(H) = [(G)-(F)]/(F)","(I)","(J) = [(I)-(G)]/(G)"]
[1,"OEB Annual Assessment",5655,null,"On-Going",49000,51535,50000,{"$f":"IF(G15=0,\"\",(H15-G15)/G15)","v":-2.978558261375764E-2},50000,{"$f":"IF(H15=0,\"\",(J15-H15)/H15)","v":0}]
[2,"OEB Section 30 Costs (Applicant-originated)",null,null,"On-Going",8000,null,8000,{"$f":"IF(G16=0,\"\",(H16-G16)/G16)","v":""},8000,{"$f":"IF(H16=0,\"\",(J16-H16)/H16)","v":0}]
[3,"OEB Section 30 Costs (OEB-initiated)",null,null,"On-Going",8000,7528,8000,6.2699256110520726E-2,8000,0]
[4,"Legal Costs of the Application",null,null,"One-Time",null,null,40000,"",40000,0]
[5,"Consultants Costs for the Application",null,null,"One-Time",null,null,100000,"",50000,-0.5]
[6,"OEB Cost of reveiwung Application",null,null,"One-Time",null,null,null,"",14000,""]
[7,"OEB Transcription Costs",null,null,"One-Time",null,null,null,"",2500,""]
[11,"Intervenor costs",null,null,null,null,null,null,"",45000,""]
[12,"Sub-total - Ongoing Costs 3",null,{"$f":"SUMIF($E15:$E22,$E11,D15:D22)","v":0},null,{"$f":"SUMIF($E15:$E22,$E11,F15:F22)","v":0},{"$f":"SUMIF($E15:$E22,$E11,G15:G22)","v":0},{"$f":"SUM(H15+H16+H17)","v":66000},"",{"$f":"SUM(J15+J16+J17)","v":66000},0]
[13,"Sub-total - One-time Costs 4",null,{"$f":"SUMIF($E15:$E22,$E12,D15:D22)","v":0},null,{"$f":"SUMIF($E15:$E22,$E12,F15:F22)","v":0},{"$f":"SUMIF($E15:$E22,$E12,G15:G22)","v":0},{"$f":"SUM(H18+H19+H20+H21+H22)","v":140000},"",{"$f":"SUM(J18+J19+J20+J21+J22)","v":151500},8.2142857142857142E-2]
[14,"Total",null,{"$f":"D23+D24","v":0},null,{"$f":"F23+F24","v":0},{"$f":"G23+G24","v":0},{"$f":"H23+H24","v":206000},"",{"$f":"J23+J24","v":217500},5.5825242718446605E-2]
[]
[]
["Please fill out the following table for all one-time costs related to this cost of service application to be amortized over the test year plus the IRM period."]
[]
[null,null,"Historical Year(s)",{"$f":"H13","v":"2016 Bridge Year"},{"$f":"J13","v":"2017 Test Year"}]
[" ","Expert Witness costs"]
[4,"Legal costs",null,{"$f":"H18","v":40000},40000]
[5,"Consultants' costs",null,{"$f":"H19","v":100000},50000]
[6,"OEB Cost to Review",null,null,14000]
[7,"OEB Transcription Cost",null,null,2500]
[11,"Intervenor costs",null,null,45000]
[" ","Total",null,{"$f":"SUM(D32:D36)","v":140000},{"$f":"SUM(E32:E36)","v":151500}]
[]
["Notes:"]
[]
["1","Please identify the resources involved."]
["2","Where a category's costs include both one-time and ongoing costs, the applicant should prove a separate breakdown between one-time and ongoing costs."]
["3","Sum of all ongoing costs identified in rows 1 to 11 inclusive."]
["4","Sum of all one-time costs identified in rows 1 to 11 inclusive."]

{"sheet":"App.2-N_Corp_Cost_Allocation","index":39,"n_rows":113,"n_cols":12,"rows_kept":113,"cut":false,"hidden":false,"merged":[[79,0,80,0],[79,1,80,1],[76,0,76,5],[78,0,78,1],[78,2,80,2],[78,3,80,3],[78,4,79,4],[78,5,79,5],[71,0,71,5],[72,0,72,5],[61,0,61,5],[63,0,63,1],[63,2,65,2],[63,3,65,3],[63,4,64,4],[63,5,64,5],[47,3,49,3],[47,4,48,4],[47,5,48,5],[64,0,65,0],[64,1,65,1],[40,0,40,5],[41,0,41,5],[89,0,89,1],[89,2,91,2],[89,3,91,3],[89,5,90,5],[89,4,90,4],[90,0,91,0],[90,1,91,1],[87,0,87,5],[48,0,49,0],[48,1,49,1],[56,0,56,5],[57,0,57,5],[47,0,47,1],[47,2,49,2],[24,0,24,5],[25,0,25,5],[29,0,29,5],[31,0,31,1],[31,2,33,2],[31,3,33,3],[31,4,32,4],[32,0,33,0],[32,1,33,1],[106,0,106,5],[109,0,109,5],[112,0,112,5],[13,0,13,5],[8,0,8,5],[9,0,9,5],[102,1,103,5],[16,0,17,0],[16,1,17,1],[15,2,17,2],[15,3,17,3],[15,0,15,1],[15,4,16,4],[15,5,16,5],[31,5,32,5],[45,0,45,5]]}
[null,null,null,null,null,"File Number:",{"$f":"EBNUMBER","v":"EB-2016-0085"}]
[null,null,null,null,null,"Exhibit:"]
[null,null,null,null,null,"Tab:"]
[null,null,null,null,null,"Schedule:"]
[null,null,null,null,null,"Page:"]
[]
[null,null,null,null,null,"Date:","2016-11-28"]
[]
["Appendix 2-N"]
["Shared Services and Corporate Cost Allocation 1"]
[]
[null,"Year:",2013]
[]
["Shared Services"]
[]
["Name of Company",null,"Service Offered","Pricing Methodology","Price for the Service","Cost for the Service"]
["From","To"]
[null,null,null,null,"$","$"]
["InnPower Corporation","Town of Innisifl","Water Waste Water Billing","Negoiated Agreement",251044,190269,null,null,{"$f":"F19/E19","v":0.75791096381510814}]
[]
[]
[]
[]
[]
["Appendix 2-N"]
["Shared Services and Corporate Cost Allocation 1"]
[]
[null,"Year:",2014]
[]
["Shared Services"]
[]
["Name of Company",null,"Service Offered","Pricing Methodology","Price for the Service","Cost for the Service"]
["From","To"]
[null,null,null,null,"$","$"]
["InnPower Corporation","Town of Innisifl","Water Waste Water Billing","Negoiated Agreement",{"$f":"[12]Revenue!$D$31","v":204916.1},172254,null,null,{"$f":"F35/E35","v":0.84060744860945524},null,null,{"$f":"I19+I35+I51","v":2.3716481436966985}]
[null,null,null,null,null,null,null,null,null,null,null,{"$f":"L35/3","v":0.79054938123223284}]
[]
[]
[]
[]
["Appendix 2-N"]
["Shared Services and Corporate Cost Allocation 1"]
[]
[null,"Year:",2015]
[]
["Shared Services"]
[]
["Name of Company",null,"Service Offered","Pricing Methodology","Price for the Service","Cost for the Service"]
["From","To"]
[null,null,null,null,"$","$"]
["InnPower Corporation","Town of Innisifl","Water Waste Water Billing","Negoiated Agreement",238308,184243,null,null,{"$f":"F51/E51","v":0.77312973127213525}]
["InnPower Corporation","InnServices (TOI)","Financial Services","Negoiated Agreement",31618,31305]
[]
[]
[]
[]
["Appendix 2-N"]
["Shared Services and Corporate Cost Allocation 1"]
[]
[null,"Year:",2016]
[]
["Shared Services"]
[]
["Name of Company",null,"Service Offered","Pricing Methodology","Price for the Service","Cost for the Service"]
["From","To"]
[null,null,null,null,"$","$"]
["InnPower Corporation","Town of Innisifl","Water Waste Water Billing","Negoiated Agreement",{"$f":"[12]Revenue!$F$31","v":235000},185650,null,null,{"$f":"E67*0.79","v":185650}]
["InnPower Corporation","InnServices (TOI)","Financial Services","Negoiated Agreement",227645,225391]
[]
[]
[]
["Appendix 2-N"]
["Shared Services and Corporate Cost Allocation 1"]
[]
[null,"Year:",2017]
[]
["Shared Services"]
[]
["Name of Company",null,"Service Offered","Pricing Methodology","Price for the Service","Cost for the Service"]
["From","To"]
[null,null,null,null,"$","$"]
["InnPower Corporation","Town of Innisifl","Water Waste Water Billing","Negoiated Agreement",{"$f":"[12]Revenue!$G$31","v":245000},193530,null,null,{"$f":"E82*0.79","v":193550}]
["InnPower Corporation","InnServices (TOI)","Financial Services","Negoiated Agreement",232198,229899]
[]
[]
[]
[]
["Corporate Cost Allocation"]
[]
["Name of Company",null,"Service Offered","Pricing Methodology","% of Corporate Costs Allocated","Amount Allocated"]
["From","To"]
[null,null,null,null,"%","$"]
["eg: parent company","eg: regulated entity"]
[]
[]
[]
[]
[]
[]
[]
[]
["Note: "]
[1,"This appendix must be completed in relation to each service provided or received for the Historical (actuals), Bridge and Test years. The required information includes:"]
[]
[]
["·         Type of Service:"]
["Services such as billing, accounting, payroll, etc.  The applicant must identify any costs related to the Board of Directors of the parent company that are allocated to the applicant."]
[]
["·         Pricing Methodology:"]
["Pricing Methodology includes approaches such as cost-base, market-base, tendering, etc.  The applicant must provide evidence demonstrating the pricing methodology used.  The applicant must also provide a description of why that pricing methodology was chosen, whether or not it is in conformity with ARC, and why it is appropriate."]
[]
["·         % Allocation:"]
["The applicant must provide the percentage of the costs allocated to the entity for the service being offered.  The Applicant must also provide a description of the allocator and why it is an appropriate allocator."]

{"sheet":"App.2-OA Capital Structure","index":40,"n_rows":70,"n_cols":15,"rows_kept":70,"cut":false,"hidden":false,"merged":[[73,2,73,14],[74,2,74,14],[75,2,75,14],[68,0,68,14],[69,2,69,14],[70,2,70,14],[71,2,71,14],[72,2,72,14],[44,2,44,14],[45,2,45,14],[47,0,47,14],[49,7,49,9],[51,0,52,0],[52,4,52,8],[40,2,40,14],[12,0,12,14],[34,2,34,14],[35,2,35,14],[36,2,36,14],[37,2,37,14],[38,2,38,14],[39,2,39,14],[33,0,33,14],[9,2,9,14],[10,2,10,14],[16,0,17,0],[17,4,17,8],[14,7,14,9]]}
[null,null,null,null,null,null,null,null,null,null,"File Number:",null,null,null,{"$f":"EBNUMBER","v":"EB-2016-0085"}]
[null,null,null,null,null,null,null,null,null,null,"Exhibit:"]
[null,null,null,null,null,null,null,null,null,null,"Tab:"]
[null,null,null,null,null,null,null,null,null,null,"Schedule:"]
[null,null,null,null,null,null,null,null,null,null,"Page:"]
[]
[null,null,null,null,null,null,null,null,null,null,"Date:",null,null,null,"2016-11-28"]
[]
[]
[null,null,"Appendix 2-OA"]
[null,null,"Capital Structure and Cost of Capital"]
[]
["This table must be completed for the last Board-approved year and the test year."]
[]
[null,null,null,null,null,null,"Year:",2013]
[]
["Line No."]
[null,null,"Particulars",null,"Capitalization Ratio",null,null,null,null,null,"Cost Rate",null,null,null,"Return"]
[]
[null,null,null,null,"(%)",null,null,null,"($)",null,"(%)",null,null,null,"($)"]
[null,null,"Debt"]
[1,null,"  Long-term Debt",null,0.56000000000000005,null,null,null,{"$f":"$I$31*E22","v":18586983.895199999},null,4.2340000000000003E-2,null,null,null,{"$f":"K22*I22","v":786972.89812276803}]
[2,null,"  Short-term Debt",null,0.04,null,"(1)",null,{"$f":"$I$31*E23","v":1327641.7068},null,2.07E-2,null,null,null,{"$f":"K23*I23","v":27482.183330759999}]
[3,null,"Total Debt",null,{"$f":"SUM(E22:E23)","v":0.60000000000000009},null,null,null,{"$f":"SUM(I22:I23)","v":19914625.601999998},null,{"$f":"IF(E24=0,0,SUMPRODUCT(E22:E23,K22:K23)/E24)","v":4.0897333333333327E-2},null,null,null,{"$f":"SUM(O22:O23)","v":814455.08145352802}]
[]
[null,null,"Equity"]
[4,null,"  Common Equity",null,0.4,null,null,null,{"$f":"$I$31*E27","v":13276417.068},null,8.9800000000000005E-2,null,null,null,{"$f":"K27*I27","v":1192222.2527064001}]
[5,null,"  Preferred Shares",null,null,null,null,null,{"$f":"$I$31*E28","v":0},null,null,null,null,null,{"$f":"K28*I28","v":0}]
[6,null,"Total Equity",null,{"$f":"SUM(E27:E28)","v":0.4},null,null,null,{"$f":"SUM(I27:I28)","v":13276417.068},null,{"$f":"IF(E29=0,0,SUMPRODUCT(E27:E28,K27:K28)/E29)","v":8.9799999999999991E-2},null,null,null,{"$f":"SUM(O27:O28)","v":1192222.2527064001}]
[]
[7,null,"Total",null,1,null,null,null,{"$f":"'[11]Debt & Capital Structure'!$D$98","v":33191042.669999998},null,{"$f":"(K24*E24)+(K29*E29)","v":6.0458399999999995E-2},null,null,null,{"$f":"O24+O29","v":2006677.3341599281}]
[]
[]
["Notes"]
["(1)",null,"4.0% unless an applicant has proposed or been approved for a different amount."]
[]
[]
[]
[]
[]
[]
[]
[]
[]
[null,null,"Appendix 2-OA"]
[null,null,"Capital Structure and Cost of Capital"]
[]
["This table must be completed for the last Board-approved year and the test year."]
[]
[null,null,null,null,null,null,"Year:",2017]
[]
["Line No."]
[null,null,"Particulars",null,"Capitalization Ratio",null,null,null,null,null,"Cost Rate",null,null,null,"Return"]
[]
[null,null,null,null,"(%)",null,null,null,"($)",null,"(%)",null,null,null,"($)"]
[null,null,"Debt"]
[1,null,"  Long-term Debt",null,0.56000000000000005,null,null,null,{"$f":"$I$66*E57","v":31515556.161240995},null,3.7199999999999997E-2,null,null,null,{"$f":"K57*I57","v":1172378.689198165}]
[2,null,"  Short-term Debt",null,0.04,null,"(1)",null,{"$f":"$I$66*E58","v":2251111.1543743568},null,1.7600000000000001E-2,null,null,null,{"$f":"K58*I58","v":39619.556316988681}]
[3,null,"Total Debt",null,{"$f":"SUM(E57:E58)","v":0.60000000000000009},null,null,null,{"$f":"SUM(I57:I58)","v":33766667.315615349},null,{"$f":"IF(E59=0,0,SUMPRODUCT(E57:E58,K57:K58)/E59)","v":3.5893333333333326E-2},null,null,null,{"$f":"SUM(O57:O58)","v":1211998.2455151537}]
[]
[null,null,"Equity"]
[4,null,"  Common Equity",null,0.4,null,null,null,{"$f":"$I$66*E62","v":22511111.543743566},null,8.7800000000000003E-2,null,null,null,{"$f":"K62*I62","v":1976475.5935406853}]
[5,null,"  Preferred Shares",null,null,null,null,null,{"$f":"$I$31*E63","v":0},null,0,null,null,null,{"$f":"K63*I63","v":0}]
[6,null,"Total Equity",null,{"$f":"SUM(E62:E63)","v":0.4},null,null,null,{"$f":"SUM(I62:I63)","v":22511111.543743566},null,{"$f":"IF(E64=0,0,SUMPRODUCT(E62:E63,K62:K63)/E64)","v":8.7800000000000003E-2},null,null,null,{"$f":"SUM(O62:O63)","v":1976475.5935406853}]
[]
[7,null,"Total",null,1,null,null,null,{"$f":"'[11]Debt & Capital Structure'!$D$150","v":56277778.859358914},null,{"$f":"(K59*E59)+(K64*E64)","v":5.6656000000000005E-2},null,null,null,{"$f":"O59+O64","v":3188473.839055839}]
[]
[]
["Notes"]
["(1)",null,"4.0% unless an applicant has proposed or been approved for a different amount."]

{"sheet":"App.2-OB_Debt Instruments","index":41,"n_rows":108,"n_cols":11,"rows_kept":108,"cut":false,"hidden":false,"merged":[[35,1,35,10],[9,0,9,10],[10,0,10,10],[10,11,10,14],[12,0,12,10],[34,1,34,10],[33,1,33,10]]}
[null,null,null,null,null,null,null,null,null,"File Number:",{"$f":"EBNUMBER","v":"EB-2016-0085"}]
[null,null,null,null,null,null,null,null,null,"Exhibit:",5]
[null,null,null,null,null,null,null,null,null,"Tab:"]
[null,null,null,null,null,null,null,null,null,"Schedule:"]
[null,null,null,null,null,null,null,null,null,"Page:"]
[]
[null,null,null,null,null,null,null,null,null,"Date:","2016-11-28"]
[]
[]
["Appendix 2-OB"]
["Debt Instruments"]
[]
["This table must be completed for all required historical years, the bridge year and the test year."]
[null,null,null,"Year",2013]
[]
["Row","Description","Lender","Affiliated or Third-Party Debt?","Fixed or Variable-Rate?","Start Date","Term              (years)","Principal                         ($)","Rate (%) 2","Interest ($) 1","Additional Comments, if any"]
[1,"Bank Loan","Toronto Dominion Bank","Third-Party","Fixed Rate","2010-10-29",20,1887048,4.53E-2,{"$f":"'[11]Debt & Capital Structure'!$M$12","v":87284}]
[2,"Debentures","Town of Innsfil","Third-Party","Fixed Rate","1995-04-01",20,2005000,6.2600000000000003E-2,{"$f":"'[11]Debt & Capital Structure'!$M$13","v":216718}]
[3,"Debentures","Infrastructure Ontario","Third-Party","Fixed Rate","2011-08-15",15,2166667,3.9100000000000003E-2,{"$f":"'[11]Debt & Capital Structure'!$M$14","v":87154}]
[4,"Commercial Loan","Toronto Dominion Bank","Third-Party","Fixed Rate","2012-03-14",24,3805466,4.0500000000000001E-2,{"$f":"'[11]Debt & Capital Structure'!$M$15","v":156390}]
[5,"Demand","Toronto Dominion Bank","Third-Party","Variable Rate","2013-01-01","Demand",3086936,4.1200000000000001E-2,{"$f":"H21*I21","v":127181.7632}]
[6,"Commercial Loan","Toronto Dominion Bank","Third-Party","Fixed Rate","2012-09-07",25,3877255,3.8100000000000002E-2,{"$f":"'[11]Debt & Capital Structure'!$M$16","v":149764}]
[7,"Commercial Loan","Toronto Dominion Bank","Third-Party","Fixed Rate","2013-11-26",25,2994564,4.5900000000000003E-2,{"$f":"'[11]Debt & Capital Structure'!$M$17","v":11318}]
[8,null,null,null,null,null,null,null,null,0]
[9,null,null,null,null,null,null,null,null,0]
[10,null,null,null,null,null,null,null,null,0]
[11,null,null,null,null,null,null,null,null,0]
[12,null,null,null,null,null,null,null,null,0]
[]
["Total",null,null,null,null,null,null,{"$f":"SUM(H17:H28)","v":19822936},{"$f":"IF(H30=0,\"\",J30/H30)","v":4.2163772470435262E-2},{"$f":"SUM(J17:J28)","v":835809.76320000004}]
[]
["Notes"]
[]
[1,"If financing is in place only part of the year, separately calculate the pro-rated interest in the year and input in the cell."]
[2,"Input actual or deemed long-term debt rate in accordance with the guidelines in The Report of the Board on the Cost of Capital for Ontario's Regulated Utilities, issued December 11, 2009, or with any subsequent update issued by the Board."]
[3,"Add more lines above row 12 if necessary."]
[]
[null,null,null,"Year",2014]
[]
["Row","Description","Lender","Affiliated or Third-Party Debt?","Fixed or Variable-Rate?","Start Date","Term              (years)","Principal                         ($)","Rate (%) 2","Interest ($) 1","Additional Comments, if any"]
[1,"Bank Loan","Toronto Dominion Bank","Third-Party","Fixed Rate","2010-10-29",20,1810535,4.53E-2,{"$f":"'[11]Debt & Capital Structure'!$M$18","v":80363}]
[2,"Debentures","Town of Innsfil","Third-Party","Fixed Rate","1995-04-01",20,1045000,6.2600000000000003E-2,{"$f":"'[11]Debt & Capital Structure'!$M$19","v":125288}]
[3,"Debentures","Infrastructure Ontario","Third-Party","Fixed Rate","2011-08-15",15,2000000,3.9100000000000003E-2,{"$f":"'[11]Debt & Capital Structure'!$M$20","v":80467}]
[4,"Commercial Loan","Toronto Dominion Bank","Third-Party","Fixed Rate","2012-03-14",24,3698493,4.0500000000000001E-2,{"$f":"'[11]Debt & Capital Structure'!$M$21","v":153343}]
[5,"Commercial Loan","Toronto Dominion Bank","Third-Party","Fixed Rate","2012-09-07",25,3774855,3.8100000000000002E-2,{"$f":"'[11]Debt & Capital Structure'!$M$22","v":145942}]
[6,"Commercial Loan","Toronto Dominion Bank","Third-Party","Fixed Rate","2013-11-26",25,2929602,4.5900000000000003E-2,{"$f":"'[11]Debt & Capital Structure'!$M$23","v":136090}]
[7,"Commercial Loan","Toronto Dominion Bank","Third-Party","Fixed Rate","2014-07-23",30,1985371,3.9600000000000003E-2,{"$f":"'[11]Debt & Capital Structure'!$M$24","v":32886}]
[8,"Commercial Loan","Toronto Dominion Bank","Third-Party","Fixed Rate","2014-11-25",30,1996985,3.9100000000000003E-2,{"$f":"'[11]Debt & Capital Structure'!$M$25","v":6434}]
[9,"Commercial Loan","Toronto Dominion Bank","Third-Party","Fixed Rate","2014-12-01",30,2000000,3.9100000000000003E-2,{"$f":"'[11]Debt & Capital Structure'!$M$26","v":0}]
[10,null,null,null,null,null,null,null,null,{"$f":"H50*I50","v":0}]
[11,null,null,null,null,null,null,null,null,0]
[12,null,null,null,null,null,null,null,null,0]
[]
["Total",null,null,null,null,null,null,{"$f":"SUM(H41:H52)","v":21240841},{"$f":"IF(H54=0,\"\",J54/H54)","v":3.5818402858907514E-2},{"$f":"SUM(J41:J52)","v":760813}]
[]
[null,null,null,"Year",2015]
[]
["Row","Description","Lender","Affiliated or Third-Party Debt?","Fixed or Variable-Rate?","Start Date","Term              (years)","Principal                         ($)","Rate (%) 2","Interest ($) 1","Additional Comments, if any"]
[1,"Bank Loan","Toronto Dominion Bank","Third-Party","Fixed Rate","2010-10-29",20,1730484,4.53E-2,{"$f":"'[11]Debt & Capital Structure'!$M28","v":80362}]
[2,"Debentures","Infrastructure Ontario","Third-Party","Fixed Rate","2011-08-15",15,1833333,3.9100000000000003E-2,{"$f":"'[11]Debt & Capital Structure'!$M29","v":74120}]
[3,"Commercial Loan","Toronto Dominion Bank","Third-Party","Fixed Rate","2012-03-14",24,3585388,4.0500000000000001E-2,{"$f":"'[11]Debt & Capital Structure'!$M30","v":147210}]
[4,"Demand","Toronto Dominion Bank","Third-Party","Variable Rate","2014-01-01","Demand",3681171,3.8100000000000002E-2,{"$f":"'[11]Debt & Capital Structure'!$M31","v":141972}]
[5,"Commercial Loan","Toronto Dominion Bank","Third-Party","Fixed Rate","2012-09-07",25,3668484,4.5900000000000003E-2,{"$f":"'[11]Debt & Capital Structure'!$M32","v":133045}]
[6,"Commercial Loan","Toronto Dominion Bank","Third-Party","Fixed Rate","2013-11-26",25,2861596,3.9600000000000003E-2,{"$f":"'[11]Debt & Capital Structure'!$M33","v":77968}]
[7,"Commercial Loan","Toronto Dominion Bank","Third-Party","Fixed Rate","2014-07-23",30,1949305,3.9100000000000003E-2,{"$f":"'[11]Debt & Capital Structure'!$M34","v":77520}]
[8,"Commercial Loan","Toronto Dominion Bank","Third-Party","Fixed Rate","2014-11-25",30,1961117,3.6799999999999999E-2,{"$f":"'[11]Debt & Capital Structure'!$M35","v":66615}]
[9,"Commercial Loan","Toronto Dominion Bank","Third-Party","Fixed Rate","2015-06-26",30,12193723,2.8139999999999998E-2,{"$f":"'[11]Debt & Capital Structure'!$M$36","v":173120}]
[10," "," "]
[11,null,null,null,null,null,null,null,null,{"$f":"H69*I69","v":0}]
[12,null,null,null,null,null,null,null,null,0]
[]
["Total",null,null,null,null,null,null,{"$f":"SUM(H59:H70)","v":33464601},{"$f":"IF(H72=0,\"\",J72/H72)","v":2.904358548903661E-2},{"$f":"SUM(J59:J70)","v":971932}]
[]
[null,null,null,"Year",2016]
[]
["Row","Description","Lender","Affiliated or Third-Party Debt?","Fixed or Variable-Rate?","Start Date","Term              (years)","Principal                         ($)","Rate (%) 2","Interest ($) 1","Additional Comments, if any"]
[1,"Bank Loan","Toronto Dominion Bank","Third-Party","Fixed Rate","2010-10-29",20,1646952,4.53E-2,{"$f":"'[11]Debt & Capital Structure'!$M39","v":76882}]
[2,"Debentures","Infrastructure Ontario","Third-Party","Fixed Rate","2011-08-15",15,1666667,3.9100000000000003E-2,{"$f":"'[11]Debt & Capital Structure'!$M40","v":67791}]
[3,"Commercial Loan","Toronto Dominion Bank","Third-Party","Fixed Rate","2012-03-14",24,3468067,4.0500000000000001E-2,{"$f":"'[11]Debt & Capital Structure'!$M41","v":142994}]
[4,"Commercial Loan","Toronto Dominion Bank","Third-Party","Fixed Rate","2012-09-07",25,3558381,3.8100000000000002E-2,{"$f":"'[11]Debt & Capital Structure'!$M42","v":138240}]
[5,"Commercial Loan","Toronto Dominion Bank","Third-Party","Fixed Rate","2013-11-26",25,2790772,4.5900000000000003E-2,{"$f":"'[11]Debt & Capital Structure'!$M43","v":130227}]
[6,"Commercial Loan","Toronto Dominion Bank","Third-Party","Fixed Rate","2014-07-23",30,1912002,3.9600000000000003E-2,{"$f":"'[11]Debt & Capital Structure'!$M44","v":76731}]
[7,"Commercial Loan","Toronto Dominion Bank","Third-Party","Fixed Rate","2014-11-25",30,1924037,3.9100000000000003E-2,{"$f":"'[11]Debt & Capital Structure'!$M45","v":76307}]
[8,"Commercial Loan","Toronto Dominion Bank","Third-Party","Fixed Rate","2015-01-09",30,1927282,3.6799999999999999E-2,{"$f":"'[11]Debt & Capital Structure'!$M46","v":71889}]
[9,"Commercial Loan","Toronto Dominion Bank","Third-Party","Fixed Rate","2015-06-26",30,11925553,2.8139999999999998E-2,{"$f":"'[11]Debt & Capital Structure'!$M47","v":340624}]
[10,"Commercial Loan","Toronto Dominion Bank","Third-Party","Fixed Rate",2015,30,3629591,0.04,{"$f":"'[11]Debt & Capital Structure'!$M48","v":145167}]
[11,"Commercial Loan","Toronto Dominion Bank","Third-Party","Fixed Rate",2016,30,4194184,0.02,{"$f":"'[11]Debt & Capital Structure'!$M49","v":33320}]
[12,null,null,null,null,null,null,null,null,{"$f":"H88*I88","v":0}]
[]
["Total",null,null,null,null,null,null,{"$f":"SUM(H77:H88)","v":38643488},{"$f":"IF(H90=0,\"\",J90/H90)","v":3.364530655203795E-2},{"$f":"SUM(J77:J88)","v":1300172}]
[]
[null,null,null,"Year",2017]
[]
["Row","Description","Lender","Affiliated or Third-Party Debt?","Fixed or Variable-Rate?","Start Date","Term              (years)","Principal                         ($)","Rate (%) 2","Interest ($) 1","Additional Comments, if any"]
[1,"Bank Loan","Toronto Dominion Bank","Third-Party","Fixed Rate","2010-10-29",null,1559335,4.53E-2,{"$f":"'[11]Debt & Capital Structure'!$M$51","v":72797}]
[2,"Debentures","Infrastructure Ontario","Third-Party","Fixed Rate","2011-08-15",null,1499999,3.9100000000000003E-2,{"$f":"'[11]Debt & Capital Structure'!$M$52","v":61087}]
[3,"Commercial Loan","Toronto Dominion Bank","Third-Party","Fixed Rate","2012-03-14",null,3345163,4.0500000000000001E-2,{"$f":"'[11]Debt & Capital Structure'!$M$53","v":137412}]
[4,"Commercial Loan","Toronto Dominion Bank","Third-Party","Fixed Rate","2012-09-07",null,3443617,3.8100000000000002E-2,{"$f":"'[11]Debt & Capital Structure'!$M$54","v":133578}]
[5,"Commercial Loan","Toronto Dominion Bank","Third-Party","Fixed Rate","2013-11-26",null,2716257,4.5900000000000003E-2,{"$f":"'[11]Debt & Capital Structure'!$M$55","v":126536}]
[6,"Commercial Loan","Toronto Dominion Bank","Third-Party","Fixed Rate","2014-07-23",null,1872979,3.9600000000000003E-2,{"$f":"'[11]Debt & Capital Structure'!$M$56","v":75009}]
[7,"Commercial Loan","Toronto Dominion Bank","Third-Party","Fixed Rate","2014-11-25",null,1885262,3.9100000000000003E-2,{"$f":"'[11]Debt & Capital Structure'!$M$57","v":74613}]
[8,"Commercial Loan","Toronto Dominion Bank","Third-Party","Fixed Rate","2015-01-09",null,1887331,3.6799999999999999E-2,{"$f":"'[11]Debt & Capital Structure'!$M$58","v":70252}]
[9,"Commercial Loan","Toronto Dominion Bank","Third-Party","Fixed Rate","2015-06-26",null,11648782,2.8139999999999998E-2,{"$f":"'[11]Debt & Capital Structure'!$M$59","v":332023}]
[10,"Commercial Loan","Toronto Dominion Bank","Third-Party","Fixed Rate",2015,null,3575432,0.04,{"$f":"'[11]Debt & Capital Structure'!$M$60","v":143000}]
[11,"Commercial Loan","Toronto Dominion Bank","Third-Party","Fixed Rate","2016",null,4120684,0.04,{"$f":"'[11]Debt & Capital Structure'!$M$61","v":64253}]
[12,"Demand","Toronto Dominion Bank","Third-Party","Fixed Rate",2017,null,4569829,0.02,{"$f":"'[11]Debt & Capital Structure'!$M$62","v":75842}]
[]
["Total",null,null,null,null,null,null,{"$f":"SUM(H95:H106)","v":42124670},{"$f":"IF(H108=0,\"\",J108/H108)","v":3.2437096836604298E-2},{"$f":"SUM(J95:J106)","v":1366402}]

{"sheet":"App.2-Q_Cost of Serv. Emb. Dx","index":42,"n_rows":60,"n_cols":7,"rows_kept":60,"cut":false,"hidden":false,"merged":[[9,7,9,11],[12,0,12,6],[11,0,11,6],[58,3,59,3],[58,4,59,4],[53,4,54,4],[8,0,8,6],[9,0,9,6],[15,0,15,1],[15,2,15,3],[53,3,54,3]]}
[null,null,null,null,null,"File Number:",{"$f":"EBNUMBER","v":"EB-2016-0085"}]
[null,null,null,null,null,"Exhibit:"]
[null,null,null,null,null,"Tab:"]
[null,null,null,null,null,"Schedule:"]
[null,null,null,null,null,"Page:"]
[]
[null,null,null,null,null,"Date:","2016-11-21"]
[]
["Appendix 2-Q"]
["Cost of Serving Embedded Distributor(s) "]
[]
["To be completed by Host Distributors ONLY"]
["(Not required if Host Distributor has an Embedded Distributor rate class, i.e. a separate row on Sheet 11 of the RRWF.)"]
[]
[]
["Proposed Rate Class for Billing Embedded Distributor(s)"]
[]
["Host's Distribution Facilities used by Embedded Distributor(s)"]
[]
["(1)","(2)","(3)","(4)","(5)","(6) = '(3) + (4)"]
["Asset Class","Total OM&A costs asociated with asset class ","Original cost of asset class ","Accumulated amortization of asset class","Annual amortization of asset class","Net Book Value of asset class"]
["Totals for Host Distributor:","($)","($)","($)","($)"]
["Distribution Stations",null,null,null,null,{"$f":"C23+D23","v":0}]
["Low Voltage Line",null,null,null,null,0]
["LV Line category # 2 (if applcable)",null,null,null,null,0]
["TS (owned by host)",null,null,null,null,0]
["add rows if necessary... ",null,null,null,null,0]
[null,null,null,null,null,0]
[null,null,null,null,null,0]
[]
["(1)","(7)","(8)","(9)","(10)","(11)"]
[{"$f":"A21","v":"Asset Class"},"Total line length or station capacity in asset class","Line length or capacity required to provide LV service to Embedded Distributor(s)","Annual total demand on station/line providing LV services (sum of 12 monthly peaks)","Annual billed Embedded Distributor demand on station/line providing LV services","Embedded Distributor(s)' Responsibility Share "]
["Embedded Distributor's share:","kW or kVa; km","kW or kVA; km","kW or kVA","kW or kVA","percent"]
["Distribution Stations",null,null,null,null,{"$f":"IF(D34=0,0,(C34/B34)*(E34/D34))","v":0}]
["Low Voltage Line",null,null,null,null,{"$f":"IF(D35=0,0,(C35/B35)*(E35/D35))","v":0}]
["LV Line # 2 (if applicable) ",null,null,null,null,{"$f":"IF(D36=0,0,(C36/B36)*(E36/D36))","v":0}]
["TS (owned by host)",null,null,null,null,{"$f":"IF(D37=0,0,(C37/B37)*(E37/D37))","v":0}]
["add rows if necessary ",null,null,null,null,{"$f":"IF(D38=0,0,(C38/B38)*(E38/D38))","v":0}]
[]
["(1)","(12)","(12a)","(13)","(14)","(15)","(16)"]
[{"$f":"A32","v":"Asset Class"},"Return on Assets used to Provide LV services","Taxes/PILs","Annual amortization on assets used to provide LV services","OM&A costs with burden associated with assets used to provide LV services","Total annual cost associated with assets used to provide LV services","Monthly cost associated with the delivery of LV services"]
[null,"($)","($)","($)","($)","($)","$/kW or $/kVA"]
["Distribution Stations",{"$f":"E$54*(F23+B23*E$59)*F34","v":0},{"$f":"(B43-(B$54*C$54*F34*(F23+B23*E57)+B$55*C$55*F34*(F23+B23*E$57)))*E$57/(1-E$57)","v":0},{"$f":"E23*F34","v":0},{"$f":"B23*F34","v":0},{"$f":"SUM(B43:E43)","v":0},{"$f":"IF(E34=0,0,(D43/E34))","v":0}]
["Low Voltage Line",{"$f":"E$54*(F24+B24*E$59)*F35","v":0},{"$f":"(B44-(B$54*C$54*F35*(F24+B24*E58)+B$55*C$55*F35*(F24+B24*E58)))*E$57/(1-E$57)","v":0},{"$f":"E24*F35","v":0},{"$f":"B24*F35","v":0},{"$f":"SUM(B44:E44)","v":0},{"$f":"IF(E35=0,0,(D44/E35))","v":0}]
["LV Line # 2 (if applicable) ",{"$f":"E$54*(F25+B25*E$59)*F36","v":0},{"$f":"(B45-(B$54*C$54*F36*(F25+B25*E59)+B$55*C$55*F36*(F25+B25*E$59)))*E$57/(1-E$57)","v":0},{"$f":"E25*F36","v":0},{"$f":"B25*F36","v":0},{"$f":"SUM(B45:E45)","v":0},{"$f":"IF(E36=0,0,(D45/E36))","v":0}]
["TS (owned by host)",{"$f":"E$54*(F26+B26*E$59)*F37","v":0},{"$f":"(B46-(B$54*C$54*F37*(F26+B26*E60)+B$55*C$55*F37*(F26+B26*E60)))*E$57/(1-E$57)","v":0},{"$f":"E26*F37","v":0},{"$f":"B26*F37","v":0},{"$f":"SUM(B46:E46)","v":0},{"$f":"IF(E37=0,0,(D46/E37))","v":0}]
["add rows if necessary ",{"$f":"E$54*(F27+B27*E$59)*F38","v":0},{"$f":"(B47-(B$54*C$54*F38*(F27+B27*I61)+B$55*C$55*F38*(F27+B27*I61)))*E$57/(1-E$57)","v":0},{"$f":"E27*F38","v":0},{"$f":"B27*F38","v":0},{"$f":"SUM(B47:E47)","v":0},{"$f":"IF(E38=0,0,(D47/E38))","v":0}]
[]
["Total",null,null,null,null,{"$f":"SUM(F43:F47)","v":0},{"$f":"SUM(G43:G47)","v":0}]
[]
["(17)","(18)","(19)","(20)","(21)"]
[null,"Capital Structure","Cost Rate"]
[null,"(%)","(%)",null,"(%)"]
["Long-Term Debt",null,null,"Weighted Average Cost of Capital",{"$f":"IF(B60=0%,0,SUMPRODUCT(B54:B58,C54:C58)/B60)","v":0}]
["Short-term Debt"]
[]
["Common Equity",null,null,"Tax/PILs Rate"]
["Preferred Shares"]
[null,null,null,"Working Capital Allowance Factor"]
["Total",{"$f":"SUM(B54:B58)","v":0}]

{"sheet":"App.2-R_Loss Factors","index":43,"n_rows":70,"n_cols":8,"rows_kept":70,"cut":false,"hidden":false,"merged":[[55,1,56,7],[58,1,58,7],[30,1,32,7],[68,1,68,7],[60,1,60,7],[62,1,62,7],[64,1,66,6],[50,1,50,7],[14,1,14,7],[23,1,23,7],[25,1,25,7],[52,1,53,7],[34,1,37,7],[41,1,43,7],[45,1,48,7],[8,0,8,7],[9,0,9,7],[10,0,10,7],[12,0,13,1],[12,2,12,6],[12,7,13,7]]}
[null,null,null,null,null,null,"File Number:",{"$f":"EBNUMBER","v":"EB-2016-0085"}]
[null,null,null,null,null,null,"Exhibit:",4]
[null,null,null,null,null,null,"Tab:"]
[null,null,null,null,null,null,"Schedule:"]
[null,null,null,null,null,null,"Page:"]
[]
[null,null,null,null,null,null,"Date:","Novemebr 28, 2016"]
[]
["Appendix 2-R"]
["Loss Factors"]
[]
[]
[null,null,"Historical Years",null,null,null,null,"5-Year Average"]
[null,null,{"$f":"IF(ISBLANK('LDC Info'!E26-5), \"Year 5\", 'LDC Info'!E26-5)","v":2011},{"$f":"IF(ISBLANK('LDC Info'!E26-4), \"Year 5\", 'LDC Info'!E26-4)","v":2012},{"$f":"IF(ISBLANK('LDC Info'!E26-3), \"Year 5\", 'LDC Info'!E26-3)","v":2013},{"$f":"IF(ISBLANK('LDC Info'!E26-2), \"Year 5\", 'LDC Info'!E26-2)","v":2014},{"$f":"IF(ISBLANK('LDC Info'!E26-1), \"Year 5\", 'LDC Info'!E26-1)","v":2015}]
[null,"Losses Within Distributor's System"]
["A(1)","\"Wholesale\" kWh delivered to distributor (higher value)",245129838,251758061,253254986,255774983,258773135,{"$f":"IF(SUM(C16:G16)=0,0,AVERAGE(C16:G16))","v":252938200.59999999}]
["A(2)","\"Wholesale\" kWh delivered to distributor (lower value)",239421445,246342457,248163153,251281174,256175578,{"$f":"IF(SUM(C17:G17)=0,0,AVERAGE(C17:G17))","v":248276761.40000001}]
["B","Portion of \"Wholesale\" kWh delivered to distributor for its Large Use Customer(s)",null,null,null,null,null,{"$f":"IF(SUM(C18:G18)=0,0,AVERAGE(C18:G18))","v":0}]
["C","Net \"Wholesale\" kWh delivered to distributor  = A(2) - B",{"$f":"C17-C18","v":239421445},246342457,248163153,251281174,256175578,248276761.40000001]
["D","\"Retail\" kWh delivered by distributor",230204043,235204529,237237862,240479726,241363660,{"$f":"IF(SUM(C20:G20)=0,0,AVERAGE(C20:G20))","v":236897964}]
["E","Portion of \"Retail\" kWh delivered by distributor to its Large Use Customer(s)",null,null,null,null,null,{"$f":"IF(SUM(C21:G21)=0,0,AVERAGE(C21:G21))","v":0}]
["F","Net \"Retail\" kWh delivered by distributor = D - E",{"$f":"C20-C21","v":230204043},235204529,237237862,240479726,241363660,236897964]
["G","Loss Factor in Distributor's system = C / F",{"$f":"IF(C22=0,\"\",C19/C22)","v":1.0400401395209207},1.0473542242037355,1.0460520547095471,1.0449162521085043,1.0613676391881031,1.0480324828794223]
[null,"Losses Upstream of Distributor's System"]
["H","Supply Facilities Loss Factor",1.0238,1.022,1.0205,1.0179,1.0101,{"$f":"IF(SUM(C25:G25)=0,0,AVERAGE(C25:G25))","v":1.0188600000000001}]
[null,"Total Losses"]
["I","Total Loss Factor = G x H",{"$f":"IF(C23=\"\",\"\",C23*C25)","v":1.0647930948415185},1.0703960171362177,1.0674961218310928,1.0636202530212464,1.0720874523439028,1.0677983755065283]
[]
["Notes:"]
[]
["A(1)","If directly connected to the IESO-controlled grid, kWh pertains to the virtual meter on the primary or high voltage side of the transformer at the interface with the transmission grid.  This corresponds to the \"With Losses\" kWh value provided by the IESO's MV-WEB.  It is the higher of the two values provided by MV-WEB."]
[]
[]
[]
[null,"If fully embedded within a host distributor, kWh pertains to the virtual meter on the primary or high voltage side of the transformer, at the interface between the host distributor and the transmission grid.  For example, if the host distributor is Hydro One Networks Inc., kWh from the Hydro One Networks' invoice corresponding to \"Total kWh w Losses\" should be reported.  This corresponds to the higher of the two kWh values provided in Hydro One Networks' invoice."]
[]
[]
[]
[]
[null,"If partially embedded, kWh pertains to the sum of the above."]
[]
["A(2)","If directly connected to the IESO-controlled grid, kWh pertains to a metering installation on the secondary or low voltage side of the transformer at the interface with the transmission grid.  This corresponds to the \"Without Losses\" kWh value provided by the IESO's MV-WEB.  It is the lower of the two kWh values provided by MV-WEB."]
[]
[]
[]
[null,"If fully embedded with the host distributor, kWh pertains to a metering installation on the secondary or low voltage side of the transformer at the interface between the embedded distributor and the host distributor.  For example, if the host distributor is Hydro One Networks Inc., kWh from the Hydro One Networks' invoice corresponding to \"Total kWh\" should be reported.  This corresponds to the lower of the two kWh values provided in Hydro One Networks' invoice."]
[]
[]
[]
[]
[null,"If partially embedded, kWh pertains to the sum of the above."]
[]
[null,"Additionally, kWh pertaining to distributed generation directly connected to the distributor's own distribution network should be included in A(2)."]
[]
[]
["B","If a Large Use Customer is metered on the secondary or low voltage side of the transformer, the default loss is 1%                         (i.e., B = 1.01 X E)."]
[]
[]
["D","kWh corresponding to D should equal metered or estimated kWh at the customer’s delivery point."]
[]
["G and I","These loss factors pertain to secondary-metered customers with demand less than 5,000 kW."]
[]
["H","If directly connected to the IESO-controlled grid, SFLF = 1.0045."]
[]
[null,"If fully embedded within a host distributor, SFLF = loss factor re losses in transformer at grid interface X loss factor re losses in host distributor's system.  If the host distributor is Hydro One Networks Inc., SFLF = 1.0060 X 1.0278 = 1.0340. If partially embedded, SFLF should be calculated as the weighted average of above."]
[]
[]
[]
[null,"Distributors that wish to propose a different SFLF should provide appropriate justification for any such proposal including supporting"]
[null,"calculations and any other relevant material."]

{"sheet":"App.2-S_Stranded Meters","index":44,"n_rows":92,"n_cols":8,"rows_kept":92,"cut":false,"hidden":false,"merged":[[8,0,8,7],[9,0,9,7],[29,0,32,7],[34,0,35,7],[54,2,55,7],[62,2,64,7],[66,0,67,7],[37,1,38,7],[40,1,42,7],[44,1,47,7],[49,1,52,7],[57,2,60,7],[91,0,94,7],[84,1,86,7],[88,1,89,7],[69,1,70,7],[76,1,78,7],[80,1,82,7],[72,1,74,7]]}
[null,null,null,null,null,null,"File Number:",{"$f":"EBNUMBER","v":"EB-2016-0085"}]
[null,null,null,null,null,null,"Exhibit:"]
[null,null,null,null,null,null,"Tab:"]
[null,null,null,null,null,null,"Schedule:"]
[null,null,null,null,null,null,"Page:"]
[]
[null,null,null,null,null,null,"Date:","Novemebr 28, 2016"]
[]
["Appendix 2-S"]
["Stranded Meter Treatment"]
[]
["Year","Notes","Gross Asset Value","Accumulated Amortization","Contributed Capital (Net of Amortization)","Net Asset","Proceeds on Disposition","Residual Net Book Value"]
[null,null,"(A)","(B)","(C)","(D ) = (A) - (B) - (C)","(E)","(F) = (D) - (E)"]
[2006,null,null,null,null,{"$f":"C14-D14-E14","v":0},null,{"$f":"F14-G14","v":0}]
[2007,null,null,null,null,0,null,0]
[2008,null,null,null,null,0,null,0]
[2009,null,null,null,null,0,null,0]
[2010,null,null,null,null,0,null,0]
[2011,null,null,null,null,0,null,0]
[2012,null,null,null,null,0,null,0]
[2013,null,null,null,null,{"$f":"C21-D21-E21","v":0},null,{"$f":"F21-G21","v":0}]
[2014,null,null,null,null,0,null,0]
[2015]
[2016,"(1)",null,null,null,0,null,0]
[]
["Notes:"]
[]
["(1)","For 2016, please indicate whether the amounts provided are on a forecast or actual basis."]
[]
["Some distributors have transferred the cost of stranded meters from Account 1860 - Meters to \"Sub-account Stranded Meter Costs of Account 1555\", while in some cases distributors have left these costs in Account 1860.  Depending on which treatment the applicant has chosen. please provide the information under either of the two scenarios (A and B below), as applicable."]
[]
[]
[]
[]
["Scenario A:  If the stranded meter costs were transferred to \"Sub-account Stranded Meter Costs\" of Account 1555, the above table should be completed and the following information should be provided in Exhibit 9."]
[]
[]
[1,"A description of the accounting treatment followed by the applicant on stranded meter costs for financial accounting and reporting purposes."]
[]
[]
[2,"The amount of the pooled residual net book value of the removed from service stranded meters, less any contributed capital (net of accumulated amortization), and less any net proceeds from sales, which were transferred to this sub-account as of December 31, 2010."]
[]
[]
[]
[3,"A statement as to whether or not, since transferring the removed stranded meter costs to the sub-account, the recording of depreciation expenses was continued in order to reduce the net book value through accumulated depreciation.  If so, the total depreciation expense amount for the period from the time the costs for the stranded meters were transferred to the sub-account to December 31, 2010 should be provided."]
[]
[]
[]
[]
[null,"If no depreciation expenses were recorded to reduce the net book value of stranded meter costs through accumulated depreciation, the total depreciation expense amount that would have been applicable from the time that the stranded meter costs were transferred to the sub-account of Account 1555 to December 31, 2010 should be provided.  In addition, the following information should be provided:"]
[]
[]
[]
[]
[null,"a)","Whether or not carrying charges were recorded for the stranded meter cost balances in the sub-account, and if so, the total carrying charges recorded to December 31, 2010."]
[]
[]
[null,"b)","The estimated amount of the pooled residual net book value of the removed from service meters, less any net proceeds from sales and contributed capital, at the time when the smart meters will have been fully deployed (e.g., as of December 31, 2010).  If the smart meters have been fully deployed, the actual amount should be provided."]
[]
[]
[]
[]
[null,"c)","A description as to how the applicant intends to recover in rates the remaining costs for stranded meters, including the proposed accounting treatment, the proposed disposition period, and the associated bill impacts."]
[]
[]
[]
["Scenario B:  If the stranded meter costs remained recorded in Account 1860, the above table should be completed and the following information should be provided in Exhibit 9:"]
[]
[]
[1,"A description of the accounting treatment followed by the applicant on stranded meter costs for financial accounting and reporting purposes."]
[]
[]
[2,"The amount of the pooled residual net book value of the removed from service stranded meters, less any contributed capital (net of accumulated amortization), and less any net proceeds from sales, as of December 31, 2010."]
[]
[]
[]
[3,"A statement as to whether or not the recording of depreciation expenses continued in order to reduce the net book value through accumulated depreciation.  If so, provision of the total (cumulative) depreciation expense for the period from the time that the meters became stranded to December 31, 2010."]
[]
[]
[]
[4,"If no depreciation expenses were recorded to reduce the net book value of stranded meters through accumulated depreciation, the total (cumulative) depreciation expense amount that would have been applicable for the period from the time that the meters became stranded to December 31, 2010."]
[]
[]
[]
[5,"The estimated amount of the pooled residual net book value of the removed from service meters, less any net proceeds from sales and contributed capital, at the time when smart meters will have been fully deployed.  If the smart meters have been fully deployed, please provide the actual amount."]
[]
[]
[]
[6,"A description as to how the applicant intends to recover in rates the costs for stranded meters, including the proposed accounting treatment, the proposed disposition period and the associated bill impacts."]
[]
[]
["Distributors should also provide the Net Book Value per class of meter as of December 31, 2010 as well as the number of meters that were removed / stranded.  In preparing this information, distributors should review the Board's letter of January 16, 2007 Stranded Meter Costs Related to the Installation of Smart Meters which stated that records were to be kept of the type and number of each meter to support the stranded meter costs."]

{"sheet":"App.2-Y_MIFRS Summary Impacts","index":45,"n_rows":37,"n_cols":9,"rows_kept":37,"cut":false,"hidden":false,"merged":[[8,0,8,8],[9,0,9,8],[10,0,10,8],[14,0,16,2],[14,6,14,8],[15,6,15,8],[17,0,17,2],[17,6,17,8],[18,0,18,2],[18,6,18,8],[19,0,19,2],[19,6,19,8],[20,0,20,2],[20,6,20,8],[21,0,21,2],[21,6,21,8],[22,0,22,2],[22,3,22,5],[22,6,22,8],[23,0,23,2],[23,6,23,8],[24,0,24,2],[24,6,24,8],[25,0,25,2],[25,6,25,8],[26,0,26,2],[26,6,26,8],[27,0,27,2],[27,6,27,8],[28,0,28,2],[28,6,28,8],[36,0,36,8],[29,0,29,2],[29,6,29,8],[30,0,30,2],[30,6,30,8],[31,0,31,2],[31,6,31,8],[32,0,32,2],[32,6,32,8],[33,0,33,2],[33,6,33,8],[34,0,34,2],[34,6,34,8]]}
[null,null,null,null,null,null,null,"File Number:",{"$f":"EBNUMBER","v":"EB-2016-0085"}]
[null,null,null,null,null,null,null,"Exhibit:"]
[null,null,null,null,null,null,null,"Tab:"]
[null,null,null,null,null,null,null,"Schedule:"]
[null,null,null,null,null,null,null,"Page:"]
[]
[null,null,null,null,null,null,null,"Date:","2017-11-28"]
[]
["Appendix 2-Y"]
["Summary of Impacts to Revenue Requirement"]
["from Transition to MIFRS"]
[]
[]
[]
["Revenue Requirement Component",null,null,{"$f":"TestYear","v":2017},{"$f":"TestYear","v":2017},"Difference","Reasons why the revenue requirement "]
[null,null,null,"MIFRS","CGAAP 1",null,"component is different under MIFRS"]
[]
["Closing NBV 2016",null,null,null,null,{"$f":"+D18-E18","v":0}]
["Closing NBV 2017",null,null,null,null,0]
["Average NBV",null,null,{"$f":"(D18+D19)/2","v":0},{"$f":"(E18+E19)/2","v":0},0]
["Working Capital",null,null,null,null,{"$f":"+D21-E21","v":0}]
["Rate Base",null,null,{"$f":"SUM(D20:D21)","v":0},{"$f":"SUM(E20:E21)","v":0},{"$f":"+D22-E22","v":0}]
[null,null,null,null,null,{"$f":"+D23-E23","v":0}]
["Return on Rate Base",null,null,null,null,0]
[null,null,null,null,null,0]
["OM&A",null,null,null,null,0]
["Depreciation",null,null,null,null,0]
["PILs or Income Taxes",null,null,null,null,0]
[null,null,null,null,null,0]
["Less: Revenue Offsets",null,null,null,null,0]
[null,null,null,null,null,0]
[null,null,null,null,null,0]
[null,null,null,null,null,0]
["Insert description of additional item(s) and new rows if needed.",null,null,null,null,0]
["Total Base Revenue Requirement",null,null,{"$f":"SUM(D24:D34)","v":0},{"$f":"SUM(E24:E34)","v":0},{"$f":"SUM(F24:F34)","v":0}]
[]
["1.  Applicants must provide a summary of the dollar impacts of MIFRS to each component of the revenue requirement (e.g. rate base, operating costs, etc.), including the overall impact on the proposed revenue requirement.  Accordingly, the applicants must identify financial differences and resulting revenue requirement impacts arising from the adoption of  MIFRS as compared to CGAAP.  If the applicant is reflecting the changes in capitalization and depreciation policies for the first time in a rebasing application, then the comparison in the above table should be between MIFRS and CGAAP before the change in accounting policies. If the applicant changed capitalization and depreciation policies and reflected these changes in a previous rebasing application, the comparison in the above table should be between MIFRS and CGAAP after the change in accounting policies.  "]

{"sheet":"Sheet19","index":46,"n_rows":72,"n_cols":9,"rows_kept":72,"cut":false,"hidden":true,"merged":[]}
[null,"CGAAP","CGAAP","CGAAP","MIFRS","USGAAP","ASPE","ASPE","ASPE"]
[null,"N/A",2012,2013,null,null,"N/A",2012,2013]
["LDC Info","x","x","x","x","x","x","x","x"]
["Table of Contents","x","x","x","x","x","x","x","x"]
["COS Flowchart","x","x","x","x","x","x","x","x"]
["List of Key References","x","x","x","x","x","x","x","x"]
["App.2-AA_Capital Projects","x","x","x","x","x","x","x","x"]
["App.2-AB_Capital Expenditures","x","x","x","x","x","x","x","x"]
["App.2-BA1_Fix Asset Cont.CGAAP","x","x","x","n","x","x","x","x"]
["App.2-BA2_Fix Asset Cont.MIFRS","n","n","n","x","n","n","n","n"]
["Appendix 2-BB Service Life Comp","x","x","x","x","x","x","x","x"]
["Instruction for App. 2-C MIFRS","n","n","n","x","n","n","n","n"]
["App.2-CA_CGAAP_DepExp_2011","n","n","n","x","n","n","n","n"]
["App.2-CB_MIFRS_DepExp_2011","n","n","n","x","n","n","n","n"]
["App.2-CC_MIFRS_DepExp_2012","n","n","n","x","n","n","n","n"]
["App.2-CD_MIFRS_DepExp_2013","n","n","n","x","n","n","n","n"]
["App.2-CE_MIFRS_DepExp_2014","n","n","n","x","n","n","n","n"]
["App.2-CF_CGAAP_DepExp_2012","n","n","n","x","n","n","n","n"]
["App.2-CG_MIFRS_DepExp_2012","n","n","n","x","n","n","n","n"]
["App.2-CH_MIFRS_DepExp_2013","n","n","n","x","n","n","n","n"]
["App.2-CI_MIFRS_DepExp_2014","n","n","n","x","n","n","n","n"]
["App.2-CJ_CGAAP_DepExp_2012","n","n","n","x","n","n","n","n"]
["App.2-CK_CGAAP_DepExp_2013","n","n","n","x","n","n","n","n"]
["App.2-CL_MIFRS_DepExp_2013","n","n","n","x","n","n","n","n"]
["App.2-CM_MIFRS_DepExp_2014","n","n","n","x","n","n","n","n"]
["Instruction for App. 2-C CGAAP","x","x","x","n","n","x","x","x"]
["App.2-CN_OldCGAAP_DepExp_2012","x","x","n","n","n","x","x","n"]
["App.2-CO_NewCGAAP_DepExp_2012","x","x","n","n","n","x","x","n"]
["App.2-CP_NewCGAAP_DepExp_2013","x","x","n","n","n","x","x","n"]
["App.2-CQ NewCGAAP_DepExp_2014","x","x","n","n","n","x","x","n"]
["App.2-CR_OldCGAAP_DepExp_2012","x","n","x","n","n","x","n","x"]
["App.2-CS_OldCGAAP_DepExp_2013","x","n","x","n","n","x","n","x"]
["App.2-CT_NewCGAAP_DepExp_2013","x","n","x","n","n","x","n","x"]
["App.2-CU_NewCGAAP_DepExp_2014","x","n","x","n","n","x","n","x"]
["App.2-CV_USGAAP_DepExp","n","n","n","n","x","n","n","n"]
["App.2-DA_Overhead","n","n","n","x","n","n","n","n"]
["App.2-DB_Overhead","x","x","x","n","n","x","x","x"]
["App.2-EA_PP&E Deferral Account","n","n","n","x","x","n","n","n"]
["App.2-EB_PP&E Deferral Account","n","n","n","x","x","n","n","n"]
["App.2-EC_PP&E Deferral Account","n","n","n","x","x","n","n","n"]
["App.2-ED_Account 1576 (2012)","x","x","n","x","x","x","x","n"]
["App.2-EE_Account 1576 (2013)","x","n","x","x","x","x","n","x"]
["App.2-FA Proposed REG Invest.","o","o","o","o","o","o","o","o"]
["App.2-FB Calc of REG Improvemnt","o","o","o","o","o","o","o","o"]
["App.2-FC Calc of REG Expansion","o","o","o","o","o","o","o","o"]
["App.2-G SQI","x","x","x","x","x","x","x","x"]
["App.2-H_Other_Oper_Rev","x","x","x","x","x","x","x","x"]
["App.2-I LF_CDM_WF","x","x","x","x","x","x","x","x"]
["App.2-JA_OM&A_Summary_Analys","x","x","x","x","x","x","x","x"]
["App.2-JB_OM&A_Cost _Drivers","x","x","x","x","x","x","x","x"]
["App.2-JC_OMA Programs","x","x","x","x","x","x","x","x"]
["App.2-K_Employee Costs","x","x","x","x","x","x","x","x"]
["App.2-L_OM&A_per_Cust_FTEE","x","x","x","x","x","x","x","x"]
["App.2-M_Regulatory_Costs","x","x","x","x","x","x","x","x"]
["App.2-N_Corp_Cost_Allocation","x","x","x","x","x","x","x","x"]
["App.2-OA Capital Structure","x","x","x","x","x","x","x","x"]
["App.2-OB_Debt Instruments","x","x","x","x","x","x","x","x"]
["App.2-P_Cost_Allocation","x","x","x","x","x","x","x","x"]
["App.2-Q_Cost of Serv. Emb. Dx","e","e","e","e","e","e","e","e"]
["App.2-R_Loss Factors","x","x","x","x","x","x","x","x"]
["App.2-S_Stranded Meters","x","x","x","x","x","x","x","x"]
["App.2-TA_1592_Tax_Variance","x","x","x","x","x","x","x","x"]
["App.2-TB_1592_HST-OVAT","x","x","x","x","x","x","x","x"]
["App.2-U_IFRS Transition Costs","x","x","x","x","x","x","x","x"]
["App.2-V_Rev_Reconciliation","x","x","x","x","x","x","x","x"]
["App.2-W_Bill Impacts","x","x","x","x","x","x","x","x"]
["App.2-YA_MIFRS Summary Impacts","n","n","n","x","n","n","n","n"]
["App. 2-YB_CGAAP Summary Impacts","x","x","x","n","n","x","x","x"]
["App. 2-Z_Tariff","x","x","x","x","x","x","x","x"]
["lists","n","n","n","n","n","n","n","n"]
["lists2","n","n","n","n","n","n","n","n"]
["Sheet19","n","n","n","n","n","n","n","n"]

{"sheet":"App.2-YA_IFRS Transition Costs","index":47,"n_rows":34,"n_cols":14,"rows_kept":34,"cut":false,"hidden":false,"merged":[[16,0,16,2],[8,0,8,15],[9,0,9,15],[13,0,15,2],[13,13,15,13],[13,10,14,10],[13,11,15,11],[13,12,15,12],[11,0,11,13],[13,9,14,9],[28,0,28,2],[17,0,17,2],[18,0,18,2],[19,0,19,2],[20,0,20,2],[21,0,21,2],[22,0,22,2],[23,0,23,2],[24,0,24,2],[25,0,25,2],[26,0,26,2],[27,0,27,2],[31,1,31,13],[39,0,42,0],[39,1,42,3],[44,0,45,0],[44,1,45,3],[33,0,34,0],[36,0,37,0],[36,1,37,3],[33,1,33,13],[32,1,32,4],[32,5,32,6]]}
[]
[null,null,null,null,null,null,null,null,null,null,null,null,"File Number:",{"$f":"EBNUMBER","v":"EB-2016-0085"}]
[null,null,null,null,null,null,null,null,null,null,null,null,"Exhibit:"]
[null,null,null,null,null,null,null,null,null,null,null,null,"Tab:"]
[null,null,null,null,null,null,null,null,null,null,null,null,"Schedule:"]
[null,null,null,null,null,null,null,null,null,null,null,null,"Page:"]
[]
[null,null,null,null,null,null,null,null,null,null,null,null,"Date:","Novemebr 28,2016"]
["Appendix 2-YA"]
["One-Time Incremental IFRS Transition Costs"]
[]
["The following table should be completed based on the information requested below. An explanation should be provided for any blank entries.  The entries should include one-time incremental IFRS transition costs that are currently included in Account 1508, Other Regulatory Assets, sub-account Deferred IFRS Transition Costs Account, or Account 1508, Other Regulatory Assets, sub-account IFRS Transition Costs Variance Account."]
[]
["Nature of One-Time Incremental IFRS Transition Costs 1",null,null,null,"Audited Actual Costs Incurred","Audited Actual Costs Incurred","Audited Actual Costs Incurred","Audited Actual Costs Incurred","Audited Carrying Charges ","Forecasted Costs ","Forecasted Costs ","Carrying Charges January 1, 2016 to December 31,2016/April 30, 2017 (As appropriate)","Total Costs and Carrying Charges","Reasons why the costs recorded meet the criteria of one-time IFRS administrative incremental costs"]
[]
[null,null,null,null,2012,2013,2014,2015,"To December 31, 2015",2016,"2017 3"]
["Professional accounting fees",null,null,null,null,null,null,null,null,null,null,null,{"$f":"SUM(E17:L17)","v":0}]
["Professional legal fees",null,null,null,null,null,null,null,null,null,null,null,{"$f":"SUM(E18:L18)","v":0}]
["Salaries, wages and benefits of staff added to support the transition to IFRS",null,null,null,null,null,null,null,null,null,null,null,0]
["Associated staff training and development costs",null,null,null,null,null,null,null,null,null,null,null,0]
["Costs related to system upgrades, or replacements or changes where IFRS was the major reason for conversion",null,null,null,null,null,null,null,null,null,null,null,0]
[null,null,null,null,null,null,null,null,null,null,null,null,0]
[null,null,null,null,null,null,null,null,null,null,null,null,0]
[null,null,null,null,null,null,null,null,null,null,null,null,0]
[null,null,null,null,null,null,null,null,null,null,null,null,0]
["Amounts, if any, included in previous Board approved rates (amounts should be negative) 2",null,null,null,null,null,null,null,null,null,null,null,0]
[null,null,null,null,null,null,null,null,null,null,null,null,0]
["Insert description of additional item(s) and new rows if needed.",null,null,null,null,null,null,null,null,null,null,null,0]
["Total",null,null,null,{"$f":"SUM(E17:E28)","v":0},0,null,{"$f":"SUM(H17:H28)","v":0},0,null,0,null,{"$f":"SUM(M17:M28)","v":0}]
[]
["Note:"]
[1,"The Deferred IFRS Transition Costs Account and the IFRS Transition Costs Variance Account are exclusively for necessary, incremental transition costs and shall not include ongoing IFRS compliance costs or impacts arising from adopting accounting policy changes that reflect changes in the timing of the recognition of income. The incremental costs in these accounts shall not include costs related to system upgrades, or replacements or changes where IFRS was not the major reason for conversion. In addition, incremental IFRS costs shall not include capital assets or expenditures."]
[2,"If there were any amounts approved in previous Board approved rates, please state the EB #:",null,null,null,"EB-2012-0139"]
[3,"Any forecasted One-time costs past 2015 should be fully explained in the application, since distributors were required to adopt IFRS or an alternative accounting standard by January 1, 2015."]

{"sheet":"Sheet1","index":48,"n_rows":0,"n_cols":0,"rows_kept":0,"cut":false,"hidden":false,"merged":[]}