{"text_format":"1","workbook":"xlsx","n_sheets":7,"sheets":["1. Information Sheet","2. 2015 Continuity Schedule","3. Appendix A","4. Billing Determinants","5. Allocation of Balances","6. Rate Rider Calculations","Summary Sheet"],"not_rendered":{"charts":0,"images":2,"macros":1,"external_links":4,"defined_names":76,"comments":1,"pivot_tables":0},"unopened":[],"bounds":{"document_bytes":16777216,"sheet_cells":100000,"rows_first":2000,"rows_last":500,"rows_between":2000,"halvings":0,"cell_chars":16384,"cell_head_chars":4096},"cells_cut":0,"cells_raw":0,"read":"whole","date_system":"1900"}

{"sheet":"1. Information Sheet","index":0,"n_rows":76,"n_cols":22,"rows_kept":76,"cut":false,"hidden":false,"merged":[[30,2,30,11],[32,2,32,13],[34,2,34,12],[26,1,26,12],[13,5,13,11],[15,5,15,9],[17,5,17,9],[19,5,19,9],[21,5,21,9],[23,5,23,9]]}
[null,null,null,null,null,null,null,null,null,null,null,null,null,null,null,null,null,null,null,null,null,"Algoma Power Inc."]
[null,null,null,null,null,null,null,null,null,null,null,null,null,null,null,null,null,null,null,null,null,"Atikokan Hydro Inc."]
[null,null,null,null,null,null,null,null,null,null,null,null,null,null,null,null,null,null,null,null,null,"Attawapiskat Power Corporation"]
[null,null,null,null,null,null,null,null,null,null,null,null,null,null,null,null,null,null,null,null,null,"Bluewater Power Distribution Corporation"]
[null,null,null,null,null,null,null,null,null,null,null,null,null,null,null,null,null,null,null,null,null,"Brant County Power Inc."]
[null,null,null,null,null,null,null,null,null,null,null,null,null,null,null,null,null,null,null,null,null,"Brantford Power Inc."]
{"$rows_left_out":71}
{"sheet":"2. 2015 Continuity Schedule","index":1,"n_rows":97,"n_cols":83,"rows_kept":97,"cut":false,"hidden":false,"merged":[[18,64,18,73],[19,64,21,64],[19,65,21,65],[19,66,21,66],[19,67,21,67],[19,68,21,68],[19,69,21,69],[19,70,21,70],[19,71,21,71],[19,72,21,72],[19,73,21,73],[18,54,18,63],[19,54,21,54],[19,55,21,55],[19,56,21,56],[19,57,21,57],[19,58,21,58],[19,59,21,59],[19,60,21,60],[19,61,21,61],[19,62,21,62],[19,63,21,63],[19,43,21,43],[19,40,21,40],[19,41,21,41],[19,42,21,42],[19,10,21,10],[19,29,21,29],[19,13,21,13],[19,15,21,15],[19,16,21,16],[19,24,21,24],[19,25,21,25],[19,26,21,26],[19,27,21,27],[19,28,21,28],[19,22,21,22],[19,33,21,33],[18,4,18,13],[19,4,21,4],[19,5,21,5],[18,34,18,43],[19,34,21,34],[19,35,21,35],[19,36,21,36],[19,37,21,37],[19,38,21,38],[19,39,21,39],[19,17,21,17],[19,18,21,18],[19,19,21,19],[18,14,18,23],[19,31,21,31],[19,32,21,32],[19,82,21,82],[18,78,18,80],[19,80,21,80],[19,79,21,79],[19,78,21,78],[19,81,21,81],[19,75,21,75],[18,74,18,77],[19,76,21,76],[19,77,21,77],[19,74,21,74],[19,20,21,20],[19,30,21,30],[19,23,21,23],[19,21,21,21],[19,14,21,14],[19,2,21,2],[19,3,21,3],[19,12,21,12],[19,8,21,8],[19,11,21,11],[19,9,21,9],[19,6,21,6],[19,7,21,7],[90,1,92,1],[96,2,96,8],[87,2,87,5],[100,2,100,8],[18,44,18,53],[19,44,21,44],[19,45,21,45],[19,46,21,46],[19,47,21,47],[19,48,21,48],[19,49,21,49],[19,50,21,50],[19,51,21,51],[19,52,21,52],[19,53,21,53],[18,24,18,33]]}
[]
[]
[]
[]
[]
[]
{"$rows_left_out":92}
{"sheet":"3. Appendix A","index":2,"n_rows":66,"n_cols":6,"rows_kept":66,"cut":false,"hidden":false,"merged":[[19,4,21,4],[19,5,21,5],[19,2,21,2],[19,3,21,3],[15,1,15,4]]}
[]
[]
[]
[]
[]
[]
{"$rows_left_out":61}
{"sheet":"4. Billing Determinants","index":3,"n_rows":48,"n_cols":26,"rows_kept":48,"cut":false,"hidden":false,"merged":[[47,0,47,7],[18,9,19,9],[18,10,19,10],[18,11,19,11],[18,12,19,12],[44,0,45,7],[46,0,46,7],[18,5,19,5],[18,4,19,4],[18,2,19,2],[18,1,19,1],[18,6,19,6],[18,7,19,7],[18,13,19,13],[15,1,16,8],[18,3,19,3],[18,20,19,20],[18,25,19,25],[18,8,19,8],[18,14,19,14],[18,18,19,18],[18,19,19,19],[18,21,19,21],[18,22,19,22],[18,24,19,24],[18,23,19,23],[18,15,19,15],[18,16,19,16],[18,17,19,17]]}
[]
[]
[]
[]
[]
[]
{"$rows_left_out":43}
{"sheet":"5. Allocation of Balances","index":4,"n_rows":58,"n_cols":27,"rows_kept":58,"cut":false,"hidden":false,"merged":[[49,1,49,2],[47,1,47,2],[40,1,40,2],[41,1,41,2],[45,1,45,2],[43,1,43,2],[44,1,44,2]]}
[null,null,null,null,null,null,null,null,null,null,null,null,null,null,null,null,null,null,null,null,null,null,null,null,null,null,21]
[null,null,null,null,null,null,null,null,null,null,null,null,null,null,null,null,null,null,null,null,null,null,null,null,null,null,22]
[]
[null,null,null,"Amounts from Sheet 2","Allocator",{"$f":"IF(LEN(TRIM('4. Billing Determinants'!$B21))=0, \"\", UPPER('4. Billing Determinants'!$B21))","v":"RESIDENTIAL"},{"$f":"IF(LEN(TRIM('4. Billing Determinants'!$B22))=0, \"\", '4. Billing Determinants'!$B22)","v":"GENERAL SERVICE LESS THAN 50 KW"},{"$f":"IF(LEN(TRIM('4. Billing Determinants'!$B23))=0, \"\", '4. Billing Determinants'!$B23)","v":"GENERAL SERVICE 50-2999 KW"},{"$f":"IF(LEN(TRIM('4. Billing Determinants'!$B24))=0, \"\", '4. Billing Determinants'!$B24)","v":"GENERAL SERVICE 3000-4999 KW"},{"$f":"IF(LEN(TRIM('4. Billing Determinants'!$B25))=0, \"\", '4. Billing Determinants'!$B25)","v":"STREET LIGHTING"},{"$f":"IF(LEN(TRIM('4. Billing Determinants'!$B26))=0, \"\", '4. Billing Determinants'!$B26)","v":"SENTINEL LIGHTS"},{"$f":"IF(LEN(TRIM('4. Billing Determinants'!$B27))=0, \"\", '4. Billing Determinants'!$B27)","v":"UNMETERED SCATTERED LOAD"},{"$f":"IF(LEN(TRIM('4. Billing Determinants'!$B28))=0, \"\", '4. Billing Determinants'!$B28)","v":""},{"$f":"IF(LEN(TRIM('4. Billing Determinants'!$B29))=0, \"\", '4. Billing Determinants'!$B29)","v":""},{"$f":"IF(LEN(TRIM('4. Billing Determinants'!$B30))=0, \"\", '4. Billing Determinants'!$B30)","v":""},{"$f":"IF(LEN(TRIM('4. Billing Determinants'!$B31))=0, \"\", '4. Billing Determinants'!$B31)","v":""},{"$f":"IF(LEN(TRIM('4. Billing Determinants'!$B32))=0, \"\", '4. Billing Determinants'!$B32)","v":""},{"$f":"IF(LEN(TRIM('4. Billing Determinants'!$B33))=0, \"\", '4. Billing Determinants'!$B33)","v":""},{"$f":"IF(LEN(TRIM('4. Billing Determinants'!$B34))=0, \"\", '4. Billing Determinants'!$B34)","v":""},{"$f":"IF(LEN(TRIM('4. Billing Determinants'!$B35))=0, \"\", '4. Billing Determinants'!$B35)","v":""},{"$f":"IF(LEN(TRIM('4. Billing Determinants'!$B36))=0, \"\", '4. Billing Determinants'!$B36)","v":""},{"$f":"IF(LEN(TRIM('4. Billing Determinants'!$B37))=0, \"\", '4. Billing Determinants'!$B37)","v":""},{"$f":"IF(LEN(TRIM('4. Billing Determinants'!$B38))=0, \"\", '4. Billing Determinants'!$B38)","v":""},{"$f":"IF(LEN(TRIM('4. Billing Determinants'!$B39))=0, \"\", '4. Billing Determinants'!$B39)","v":""},{"$f":"IF(LEN(TRIM('4. Billing Determinants'!$B40))=0, \"\", '4. Billing Determinants'!$B40)","v":""}]
[null,"LV Variance Account",1550,{"$f":"'2. 2015 Continuity Schedule'!CC24","v":312768.005},"kWh",{"$f":"IFERROR(IF(F$4=\"\",0,IF($E5=\"kWh\",VLOOKUP(F$4,'4. Billing Determinants'!$B$19:$Z$41,4,0)/'4. Billing Determinants'!$E$41*$D5,IF($E5=\"kW\",VLOOKUP(F$4,'4. Billing Determinants'!$B$19:$Z$41,5,0)/'4. Billing Determinants'!$F$41*$D5,IF($E5=\"Non-RPP kWh\",VLOOKUP(F$4,'4. Billing Determinants'!$B$19:$Z$41,6,0)/'4. Billing Determinants'!$G$41*$D5,IF($E5=\"Distribution Rev.\",VLOOKUP(F$4,'4. Billing Determinants'!$B$19:$Z$41,8,0)/'4. Billing Determinants'!$I$41*$D5, VLOOKUP(F$4,'4. Billing Determinants'!$B$19:$Z$41,3,0)/'4. Billing Determinants'!$D$41*$D5))))),0)","v":100540.9989431002},{"$f":"IFERROR(IF(G$4=\"\",0,IF($E5=\"kWh\",VLOOKUP(G$4,'4. Billing Determinants'!$B$19:$Z$41,4,0)/'4. Billing Determinants'!$E$41*$D5,IF($E5=\"kW\",VLOOKUP(G$4,'4. Billing Determinants'!$B$19:$Z$41,5,0)/'4. Billing Determinants'!$F$41*$D5,IF($E5=\"Non-RPP kWh\",VLOOKUP(G$4,'4. Billing Determinants'!$B$19:$Z$41,6,0)/'4. Billing Determinants'!$G$41*$D5,IF($E5=\"Distribution Rev.\",VLOOKUP(G$4,'4. Billing Determinants'!$B$19:$Z$41,8,0)/'4. Billing Determinants'!$I$41*$D5, VLOOKUP(G$4,'4. Billing Determinants'!$B$19:$Z$41,3,0)/'4. Billing Determinants'!$D$41*$D5))))),0)","v":41556.822165516234},{"$f":"IFERROR(IF(H$4=\"\",0,IF($E5=\"kWh\",VLOOKUP(H$4,'4. Billing Determinants'!$B$19:$Z$41,4,0)/'4. Billing Determinants'!$E$41*$D5,IF($E5=\"kW\",VLOOKUP(H$4,'4. Billing Determinants'!$B$19:$Z$41,5,0)/'4. Billing Determinants'!$F$41*$D5,IF($E5=\"Non-RPP kWh\",VLOOKUP(H$4,'4. Billing Determinants'!$B$19:$Z$41,6,0)/'4. Billing Determinants'!$G$41*$D5,IF($E5=\"Distribution Rev.\",VLOOKUP(H$4,'4. Billing Determinants'!$B$19:$Z$41,8,0)/'4. Billing Determinants'!$I$41*$D5, VLOOKUP(H$4,'4. Billing Determinants'!$B$19:$Z$41,3,0)/'4. Billing Determinants'!$D$41*$D5))))),0)","v":148770.10807319314},{"$f":"IFERROR(IF(I$4=\"\",0,IF($E5=\"kWh\",VLOOKUP(I$4,'4. Billing Determinants'!$B$19:$Z$41,4,0)/'4. Billing Determinants'!$E$41*$D5,IF($E5=\"kW\",VLOOKUP(I$4,'4. Billing Determinants'!$B$19:$Z$41,5,0)/'4. Billing Determinants'!$F$41*$D5,IF($E5=\"Non-RPP kWh\",VLOOKUP(I$4,'4. Billing Determinants'!$B$19:$Z$41,6,0)/'4. Billing Determinants'!$G$41*$D5,IF($E5=\"Distribution Rev.\",VLOOKUP(I$4,'4. Billing Determinants'!$B$19:$Z$41,8,0)/'4. Billing Determinants'!$I$41*$D5, VLOOKUP(I$4,'4. Billing Determinants'!$B$19:$Z$41,3,0)/'4. Billing Determinants'!$D$41*$D5))))),0)","v":19217.543220251388},{"$f":"IFERROR(IF(J$4=\"\",0,IF($E5=\"kWh\",VLOOKUP(J$4,'4. Billing Determinants'!$B$19:$Z$41,4,0)/'4. Billing Determinants'!$E$41*$D5,IF($E5=\"kW\",VLOOKUP(J$4,'4. Billing Determinants'!$B$19:$Z$41,5,0)/'4. Billing Determinants'!$F$41*$D5,IF($E5=\"Non-RPP kWh\",VLOOKUP(J$4,'4. Billing Determinants'!$B$19:$Z$41,6,0)/'4. Billing Determinants'!$G$41*$D5,IF($E5=\"Distribution Rev.\",VLOOKUP(J$4,'4. Billing Determinants'!$B$19:$Z$41,8,0)/'4. Billing Determinants'!$I$41*$D5, VLOOKUP(J$4,'4. Billing Determinants'!$B$19:$Z$41,3,0)/'4. Billing Determinants'!$D$41*$D5))))),0)","v":1851.7287141184568},{"$f":"IFERROR(IF(K$4=\"\",0,IF($E5=\"kWh\",VLOOKUP(K$4,'4. Billing Determinants'!$B$19:$Z$41,4,0)/'4. Billing Determinants'!$E$41*$D5,IF($E5=\"kW\",VLOOKUP(K$4,'4. Billing Determinants'!$B$19:$Z$41,5,0)/'4. Billing Determinants'!$F$41*$D5,IF($E5=\"Non-RPP kWh\",VLOOKUP(K$4,'4. Billing Determinants'!$B$19:$Z$41,6,0)/'4. Billing Determinants'!$G$41*$D5,IF($E5=\"Distribution Rev.\",VLOOKUP(K$4,'4. Billing Determinants'!$B$19:$Z$41,8,0)/'4. Billing Determinants'!$I$41*$D5, VLOOKUP(K$4,'4. Billing Determinants'!$B$19:$Z$41,3,0)/'4. Billing Determinants'!$D$41*$D5))))),0)","v":56.349183465649119},{"$f":"IFERROR(IF(L$4=\"\",0,IF($E5=\"kWh\",VLOOKUP(L$4,'4. Billing Determinants'!$B$19:$Z$41,4,0)/'4. Billing Determinants'!$E$41*$D5,IF($E5=\"kW\",VLOOKUP(L$4,'4. Billing Determinants'!$B$19:$Z$41,5,0)/'4. Billing Determinants'!$F$41*$D5,IF($E5=\"Non-RPP kWh\",VLOOKUP(L$4,'4. Billing Determinants'!$B$19:$Z$41,6,0)/'4. Billing Determinants'!$G$41*$D5,IF($E5=\"Distribution Rev.\",VLOOKUP(L$4,'4. Billing Determinants'!$B$19:$Z$41,8,0)/'4. Billing Determinants'!$I$41*$D5, VLOOKUP(L$4,'4. Billing Determinants'!$B$19:$Z$41,3,0)/'4. Billing Determinants'!$D$41*$D5))))),0)","v":774.45470035489836},{"$f":"IFERROR(IF(M$4=\"\",0,IF($E5=\"kWh\",VLOOKUP(M$4,'4. Billing Determinants'!$B$19:$Z$41,4,0)/'4. Billing Determinants'!$E$41*$D5,IF($E5=\"kW\",VLOOKUP(M$4,'4. Billing Determinants'!$B$19:$Z$41,5,0)/'4. Billing Determinants'!$F$41*$D5,IF($E5=\"Non-RPP kWh\",VLOOKUP(M$4,'4. Billing Determinants'!$B$19:$Z$41,6,0)/'4. Billing Determinants'!$G$41*$D5,IF($E5=\"Distribution Rev.\",VLOOKUP(M$4,'4. Billing Determinants'!$B$19:$Z$41,8,0)/'4. Billing Determinants'!$I$41*$D5, VLOOKUP(M$4,'4. Billing Determinants'!$B$19:$Z$41,3,0)/'4. Billing Determinants'!$D$41*$D5))))),0)","v":0},{"$f":"IFERROR(IF(N$4=\"\",0,IF($E5=\"kWh\",VLOOKUP(N$4,'4. Billing Determinants'!$B$19:$Z$41,4,0)/'4. Billing Determinants'!$E$41*$D5,IF($E5=\"kW\",VLOOKUP(N$4,'4. Billing Determinants'!$B$19:$Z$41,5,0)/'4. Billing Determinants'!$F$41*$D5,IF($E5=\"Non-RPP kWh\",VLOOKUP(N$4,'4. Billing Determinants'!$B$19:$Z$41,6,0)/'4. Billing Determinants'!$G$41*$D5,IF($E5=\"Distribution Rev.\",VLOOKUP(N$4,'4. Billing Determinants'!$B$19:$Z$41,8,0)/'4. Billing Determinants'!$I$41*$D5, VLOOKUP(N$4,'4. Billing Determinants'!$B$19:$Z$41,3,0)/'4. Billing Determinants'!$D$41*$D5))))),0)","v":0},{"$f":"IFERROR(IF(O$4=\"\",0,IF($E5=\"kWh\",VLOOKUP(O$4,'4. Billing Determinants'!$B$19:$Z$41,4,0)/'4. Billing Determinants'!$E$41*$D5,IF($E5=\"kW\",VLOOKUP(O$4,'4. Billing Determinants'!$B$19:$Z$41,5,0)/'4. Billing Determinants'!$F$41*$D5,IF($E5=\"Non-RPP kWh\",VLOOKUP(O$4,'4. Billing Determinants'!$B$19:$Z$41,6,0)/'4. Billing Determinants'!$G$41*$D5,IF($E5=\"Distribution Rev.\",VLOOKUP(O$4,'4. Billing Determinants'!$B$19:$Z$41,8,0)/'4. Billing Determinants'!$I$41*$D5, VLOOKUP(O$4,'4. Billing Determinants'!$B$19:$Z$41,3,0)/'4. Billing Determinants'!$D$41*$D5))))),0)","v":0},{"$f":"IFERROR(IF(P$4=\"\",0,IF($E5=\"kWh\",VLOOKUP(P$4,'4. Billing Determinants'!$B$19:$Z$41,4,0)/'4. Billing Determinants'!$E$41*$D5,IF($E5=\"kW\",VLOOKUP(P$4,'4. Billing Determinants'!$B$19:$Z$41,5,0)/'4. Billing Determinants'!$F$41*$D5,IF($E5=\"Non-RPP kWh\",VLOOKUP(P$4,'4. Billing Determinants'!$B$19:$Z$41,6,0)/'4. Billing Determinants'!$G$41*$D5,IF($E5=\"Distribution Rev.\",VLOOKUP(P$4,'4. Billing Determinants'!$B$19:$Z$41,8,0)/'4. Billing Determinants'!$I$41*$D5, VLOOKUP(P$4,'4. Billing Determinants'!$B$19:$Z$41,3,0)/'4. Billing Determinants'!$D$41*$D5))))),0)","v":0},{"$f":"IFERROR(IF(Q$4=\"\",0,IF($E5=\"kWh\",VLOOKUP(Q$4,'4. Billing Determinants'!$B$19:$Z$41,4,0)/'4. Billing Determinants'!$E$41*$D5,IF($E5=\"kW\",VLOOKUP(Q$4,'4. Billing Determinants'!$B$19:$Z$41,5,0)/'4. Billing Determinants'!$F$41*$D5,IF($E5=\"Non-RPP kWh\",VLOOKUP(Q$4,'4. Billing Determinants'!$B$19:$Z$41,6,0)/'4. Billing Determinants'!$G$41*$D5,IF($E5=\"Distribution Rev.\",VLOOKUP(Q$4,'4. Billing Determinants'!$B$19:$Z$41,8,0)/'4. Billing Determinants'!$I$41*$D5, VLOOKUP(Q$4,'4. Billing Determinants'!$B$19:$Z$41,3,0)/'4. Billing Determinants'!$D$41*$D5))))),0)","v":0},{"$f":"IFERROR(IF(R$4=\"\",0,IF($E5=\"kWh\",VLOOKUP(R$4,'4. Billing Determinants'!$B$19:$Z$41,4,0)/'4. Billing Determinants'!$E$41*$D5,IF($E5=\"kW\",VLOOKUP(R$4,'4. Billing Determinants'!$B$19:$Z$41,5,0)/'4. Billing Determinants'!$F$41*$D5,IF($E5=\"Non-RPP kWh\",VLOOKUP(R$4,'4. Billing Determinants'!$B$19:$Z$41,6,0)/'4. Billing Determinants'!$G$41*$D5,IF($E5=\"Distribution Rev.\",VLOOKUP(R$4,'4. Billing Determinants'!$B$19:$Z$41,8,0)/'4. Billing Determinants'!$I$41*$D5, VLOOKUP(R$4,'4. Billing Determinants'!$B$19:$Z$41,3,0)/'4. Billing Determinants'!$D$41*$D5))))),0)","v":0},{"$f":"IFERROR(IF(S$4=\"\",0,IF($E5=\"kWh\",VLOOKUP(S$4,'4. Billing Determinants'!$B$19:$Z$41,4,0)/'4. Billing Determinants'!$E$41*$D5,IF($E5=\"kW\",VLOOKUP(S$4,'4. Billing Determinants'!$B$19:$Z$41,5,0)/'4. Billing Determinants'!$F$41*$D5,IF($E5=\"Non-RPP kWh\",VLOOKUP(S$4,'4. Billing Determinants'!$B$19:$Z$41,6,0)/'4. Billing Determinants'!$G$41*$D5,IF($E5=\"Distribution Rev.\",VLOOKUP(S$4,'4. Billing Determinants'!$B$19:$Z$41,8,0)/'4. Billing Determinants'!$I$41*$D5, VLOOKUP(S$4,'4. Billing Determinants'!$B$19:$Z$41,3,0)/'4. Billing Determinants'!$D$41*$D5))))),0)","v":0},{"$f":"IFERROR(IF(T$4=\"\",0,IF($E5=\"kWh\",VLOOKUP(T$4,'4. Billing Determinants'!$B$19:$Z$41,4,0)/'4. Billing Determinants'!$E$41*$D5,IF($E5=\"kW\",VLOOKUP(T$4,'4. Billing Determinants'!$B$19:$Z$41,5,0)/'4. Billing Determinants'!$F$41*$D5,IF($E5=\"Non-RPP kWh\",VLOOKUP(T$4,'4. Billing Determinants'!$B$19:$Z$41,6,0)/'4. Billing Determinants'!$G$41*$D5,IF($E5=\"Distribution Rev.\",VLOOKUP(T$4,'4. Billing Determinants'!$B$19:$Z$41,8,0)/'4. Billing Determinants'!$I$41*$D5, VLOOKUP(T$4,'4. Billing Determinants'!$B$19:$Z$41,3,0)/'4. Billing Determinants'!$D$41*$D5))))),0)","v":0},{"$f":"IFERROR(IF(U$4=\"\",0,IF($E5=\"kWh\",VLOOKUP(U$4,'4. Billing Determinants'!$B$19:$Z$41,4,0)/'4. Billing Determinants'!$E$41*$D5,IF($E5=\"kW\",VLOOKUP(U$4,'4. Billing Determinants'!$B$19:$Z$41,5,0)/'4. Billing Determinants'!$F$41*$D5,IF($E5=\"Non-RPP kWh\",VLOOKUP(U$4,'4. Billing Determinants'!$B$19:$Z$41,6,0)/'4. Billing Determinants'!$G$41*$D5,IF($E5=\"Distribution Rev.\",VLOOKUP(U$4,'4. Billing Determinants'!$B$19:$Z$41,8,0)/'4. Billing Determinants'!$I$41*$D5, VLOOKUP(U$4,'4. Billing Determinants'!$B$19:$Z$41,3,0)/'4. Billing Determinants'!$D$41*$D5))))),0)","v":0},{"$f":"IFERROR(IF(V$4=\"\",0,IF($E5=\"kWh\",VLOOKUP(V$4,'4. Billing Determinants'!$B$19:$Z$41,4,0)/'4. Billing Determinants'!$E$41*$D5,IF($E5=\"kW\",VLOOKUP(V$4,'4. Billing Determinants'!$B$19:$Z$41,5,0)/'4. Billing Determinants'!$F$41*$D5,IF($E5=\"Non-RPP kWh\",VLOOKUP(V$4,'4. Billing Determinants'!$B$19:$Z$41,6,0)/'4. Billing Determinants'!$G$41*$D5,IF($E5=\"Distribution Rev.\",VLOOKUP(V$4,'4. Billing Determinants'!$B$19:$Z$41,8,0)/'4. Billing Determinants'!$I$41*$D5, VLOOKUP(V$4,'4. Billing Determinants'!$B$19:$Z$41,3,0)/'4. Billing Determinants'!$D$41*$D5))))),0)","v":0},{"$f":"IFERROR(IF(W$4=\"\",0,IF($E5=\"kWh\",VLOOKUP(W$4,'4. Billing Determinants'!$B$19:$Z$41,4,0)/'4. Billing Determinants'!$E$41*$D5,IF($E5=\"kW\",VLOOKUP(W$4,'4. Billing Determinants'!$B$19:$Z$41,5,0)/'4. Billing Determinants'!$F$41*$D5,IF($E5=\"Non-RPP kWh\",VLOOKUP(W$4,'4. Billing Determinants'!$B$19:$Z$41,6,0)/'4. Billing Determinants'!$G$41*$D5,IF($E5=\"Distribution Rev.\",VLOOKUP(W$4,'4. Billing Determinants'!$B$19:$Z$41,8,0)/'4. Billing Determinants'!$I$41*$D5, VLOOKUP(W$4,'4. Billing Determinants'!$B$19:$Z$41,3,0)/'4. Billing Determinants'!$D$41*$D5))))),0)","v":0},{"$f":"IFERROR(IF(X$4=\"\",0,IF($E5=\"kWh\",VLOOKUP(X$4,'4. Billing Determinants'!$B$19:$Z$41,4,0)/'4. Billing Determinants'!$E$41*$D5,IF($E5=\"kW\",VLOOKUP(X$4,'4. Billing Determinants'!$B$19:$Z$41,5,0)/'4. Billing Determinants'!$F$41*$D5,IF($E5=\"Non-RPP kWh\",VLOOKUP(X$4,'4. Billing Determinants'!$B$19:$Z$41,6,0)/'4. Billing Determinants'!$G$41*$D5,IF($E5=\"Distribution Rev.\",VLOOKUP(X$4,'4. Billing Determinants'!$B$19:$Z$41,8,0)/'4. Billing Determinants'!$I$41*$D5, VLOOKUP(X$4,'4. Billing Determinants'!$B$19:$Z$41,3,0)/'4. Billing Determinants'!$D$41*$D5))))),0)","v":0},{"$f":"IFERROR(IF(Y$4=\"\",0,IF($E5=\"kWh\",VLOOKUP(Y$4,'4. Billing Determinants'!$B$19:$Z$41,4,0)/'4. Billing Determinants'!$E$41*$D5,IF($E5=\"kW\",VLOOKUP(Y$4,'4. Billing Determinants'!$B$19:$Z$41,5,0)/'4. Billing Determinants'!$F$41*$D5,IF($E5=\"Non-RPP kWh\",VLOOKUP(Y$4,'4. Billing Determinants'!$B$19:$Z$41,6,0)/'4. Billing Determinants'!$G$41*$D5,IF($E5=\"Distribution Rev.\",VLOOKUP(Y$4,'4. Billing Determinants'!$B$19:$Z$41,8,0)/'4. Billing Determinants'!$I$41*$D5, VLOOKUP(Y$4,'4. Billing Determinants'!$B$19:$Z$41,3,0)/'4. Billing Determinants'!$D$41*$D5))))),0)","v":0}]
[null,"Smart Metering Entity Charge Variance Account",1551,{"$f":"'2. 2015 Continuity Schedule'!CC25","v":-1688.1900000000003},"# of Customers",{"$f":"(9171.11488735476/(9171.11488735476+1086.82913629529))*D6","v":-1509.3262749326564},{"$f":"(1086.82913629529/(9171.11488735476+1086.82913629529))*D6","v":-178.86372506734389},0,0,0,0,0,0,0,0,0,0,0,0,0,0,0,0,0,0]
{"$rows_left_out":53}
{"sheet":"6. Rate Rider Calculations","index":5,"n_rows":201,"n_cols":7,"rows_kept":201,"cut":false,"hidden":false,"merged":[[69,1,70,1],[69,2,70,2],[17,3,18,3],[17,4,18,4],[17,5,18,5],[69,4,70,4],[69,5,70,5],[69,3,70,3],[17,1,18,1],[17,2,18,2],[43,1,44,1],[43,2,44,2],[43,3,44,3],[43,4,44,4],[43,5,44,5],[150,1,151,1],[150,2,151,2],[150,3,151,3],[150,4,151,4],[150,5,151,5],[178,1,179,1],[178,2,179,2],[178,3,179,3],[178,4,179,4],[178,5,179,5],[95,1,96,1],[95,2,96,2],[95,3,96,3],[95,4,96,4],[95,5,96,5],[122,1,123,1],[122,2,123,2],[122,3,123,3],[122,4,123,4],[122,5,123,5]]}
[]
[]
[]
[]
[]
[]
{"$rows_left_out":196}
{"sheet":"Summary Sheet","index":6,"n_rows":44,"n_cols":10,"rows_kept":44,"cut":false,"hidden":true,"merged":[[0,8,2,8],[0,9,2,9],[0,2,2,2],[0,3,2,3],[0,5,2,5],[0,6,2,6],[0,7,2,7],[0,4,2,4]]}
[null,null,"Closing Principal Balances as of Dec 31-13 Adjusted for Dispositions during 2014","Closing Interest Balances as of Dec 31-13 Adjusted for Dispositions during 2014","December 31, 2013 Audited Balances","Projected Interest from Jan 1, 2014 to December 31, 2014 on                        Dec 31 -13 balance adjusted for disposition during 2014 6","Projected Interest from January 1, 2015 to April 30, 2015 on Dec 31 -13 balance adjusted for disposition during 2014  6","Total Claim","2.1.7\nAs of Dec 31-13","Variance                           RRR vs. 2013 Balance                        (Principal + Interest)"]
[]
[null,null,null,null,null,null,null,"Claim before Forecasted Transactions"]
["Other Regulatory Assets - Sub-Account - Deferred IFRS Transition Costs",1508,{"$f":"VLOOKUP(A4, '2. 2015 Continuity Schedule'!$C$20:$CE$84, MATCH('2. 2015 Continuity Schedule'!BY$20, '2. 2015 Continuity Schedule'!C$20:CE$20,0),FALSE)","v":0},{"$f":"VLOOKUP(A4, '2. 2015 Continuity Schedule'!$C$20:$CE$84, MATCH('2. 2015 Continuity Schedule'!BZ$20, '2. 2015 Continuity Schedule'!C$20:CE$20,0),FALSE)","v":0},{"$f":"SUM(C4:D4)","v":0},{"$f":"VLOOKUP(A4, '2. 2015 Continuity Schedule'!$C$20:$CE$84, MATCH('2. 2015 Continuity Schedule'!CA$20, '2. 2015 Continuity Schedule'!C$20:CE$20,0),FALSE)","v":0},{"$f":"VLOOKUP(A4, '2. 2015 Continuity Schedule'!$C$20:$CE$84, MATCH('2. 2015 Continuity Schedule'!CB$20, '2. 2015 Continuity Schedule'!C$20:CE$20,0),FALSE)","v":0},{"$f":"SUM(E4:G4)","v":0},{"$f":"VLOOKUP(A4, '2. 2015 Continuity Schedule'!$C$20:$CE$84, MATCH('2. 2015 Continuity Schedule'!CD$20, '2. 2015 Continuity Schedule'!C$20:CE$20,0),FALSE)","v":0},{"$f":"VLOOKUP(A4, '2. 2015 Continuity Schedule'!$C$20:$CE$84, MATCH('2. 2015 Continuity Schedule'!CE$20, '2. 2015 Continuity Schedule'!C$20:CE$20,0),FALSE)","v":0}]
["Other Regulatory Assets - Sub-Account - Incremental Capital Charges",1508,{"$f":"VLOOKUP(A5, '2. 2015 Continuity Schedule'!$C$20:$CE$84, MATCH('2. 2015 Continuity Schedule'!BY$20, '2. 2015 Continuity Schedule'!C$20:CE$20,0),FALSE)","v":0},{"$f":"VLOOKUP(A5, '2. 2015 Continuity Schedule'!$C$20:$CE$84, MATCH('2. 2015 Continuity Schedule'!BZ$20, '2. 2015 Continuity Schedule'!C$20:CE$20,0),FALSE)","v":0},{"$f":"SUM(C5:D5)","v":0},{"$f":"VLOOKUP(A5, '2. 2015 Continuity Schedule'!$C$20:$CE$84, MATCH('2. 2015 Continuity Schedule'!CA$20, '2. 2015 Continuity Schedule'!C$20:CE$20,0),FALSE)","v":0},{"$f":"VLOOKUP(A5, '2. 2015 Continuity Schedule'!$C$20:$CE$84, MATCH('2. 2015 Continuity Schedule'!CB$20, '2. 2015 Continuity Schedule'!C$20:CE$20,0),FALSE)","v":0},{"$f":"SUM(E5:G5)","v":0},{"$f":"VLOOKUP(A5, '2. 2015 Continuity Schedule'!$C$20:$CE$84, MATCH('2. 2015 Continuity Schedule'!CD$20, '2. 2015 Continuity Schedule'!C$20:CE$20,0),FALSE)","v":0},{"$f":"VLOOKUP(A5, '2. 2015 Continuity Schedule'!$C$20:$CE$84, MATCH('2. 2015 Continuity Schedule'!CE$20, '2. 2015 Continuity Schedule'!C$20:CE$20,0),FALSE)","v":0}]
["Other Regulatory Assets - Sub-Account - Financial Assistance Payment and Recovery Variance - Ontario Clean Energy Benefit Act8",1508,{"$f":"VLOOKUP(A6, '2. 2015 Continuity Schedule'!$C$20:$CE$84, MATCH('2. 2015 Continuity Schedule'!BY$20, '2. 2015 Continuity Schedule'!C$20:CE$20,0),FALSE)","v":0},{"$f":"VLOOKUP(A6, '2. 2015 Continuity Schedule'!$C$20:$CE$84, MATCH('2. 2015 Continuity Schedule'!BZ$20, '2. 2015 Continuity Schedule'!C$20:CE$20,0),FALSE)","v":0},0,{"$f":"VLOOKUP(A6, '2. 2015 Continuity Schedule'!$C$20:$CE$84, MATCH('2. 2015 Continuity Schedule'!CA$20, '2. 2015 Continuity Schedule'!C$20:CE$20,0),FALSE)","v":0},{"$f":"VLOOKUP(A6, '2. 2015 Continuity Schedule'!$C$20:$CE$84, MATCH('2. 2015 Continuity Schedule'!CB$20, '2. 2015 Continuity Schedule'!C$20:CE$20,0),FALSE)","v":0},0,{"$f":"VLOOKUP(A6, '2. 2015 Continuity Schedule'!$C$20:$CE$84, MATCH('2. 2015 Continuity Schedule'!CD$20, '2. 2015 Continuity Schedule'!C$20:CE$20,0),FALSE)","v":0},{"$f":"VLOOKUP(A6, '2. 2015 Continuity Schedule'!$C$20:$CE$84, MATCH('2. 2015 Continuity Schedule'!CE$20, '2. 2015 Continuity Schedule'!C$20:CE$20,0),FALSE)","v":0}]
{"$rows_left_out":38}