{"text_format":"1","workbook":"xlsx","n_sheets":57,"sheets":["LDC Info","Index","COS Flowchart","List of Key References","App.2-AA_Capital Projects","App.2-AB_Capital Expenditures","App. 2-AC_Customer Engagement","App.2-B_Acct Instructions","App.2-BA_Fixed Asset Cont","Appendix 2-BB Service Life  ","App.2-CA_OldCGAAP_DepExp_2012","App.2-CB_NewCGAAP_DepExp_2012","App.2-CC_NewCGAAP_DepExp_2013","App.2-CD_MIFRS_DepExp_2014","App.2-CE_MIFRS_DepExp_2015","App.2-CF_MIFRS_DepExp_2016","App.2-CG_OldCGAAP_DepExp_2013","App.2-CH_NewCGAAP_DepExp_2013","App.2-CI_MIFRS_DepExp_2014","App.2-CJ MIFRS_DepExp_2015","App.2-CK MIFRS_DepExp_2016","App.2-D_Overhead","App.2-EA_Account 1575 (2015)","App.2-EB_Account 1576 (2012)","App.2-EC_Account 1576 (2013)","App.2-FA Proposed REG Invest.","App.2-FB Calc of REG Improvemnt","App.2-FC Calc of REG Expansion","App.2-G SQI","App.2-H_Other_Oper_Rev","App_2-I LF_CDM","App.2-IA_Act_Frcst_Data","App.2-JA_OM&A_Summary_Analys","App.2-JB_OM&A_Cost _Drivers","App.2-JC_OMA Programs","App.2-K_Employee Costs","App.2-L_OM&A_per_Cust_FTEE","App.2-M_Regulatory_Costs","App.2-N_Corp_Cost_Allocation","App.2-OA Capital Structure","App.2-OB_Debt Instruments","App.2-P_Cost_Allocation","App.2-PA_Res_Rate_Design","App.2-Q_Cost of Serv. Emb. Dx","App.2-R_Loss Factors","App.2-S_Stranded Meters","App.2-TA_1592_Tax_Variance","App.2-TB_1592_HST-OVAT","App.2-U_IFRS Transition Costs","App.2-V_Rev_Reconciliation","App.2-W_Bill Impacts","App.2-W_Bill Impacts_hidden","App.2-Y_MIFRS Summary Impacts","App. 2-Z_Tariff","lists","lists2","Sheet19"],"not_rendered":{"charts":0,"images":4,"macros":1,"external_links":11,"defined_names":726,"comments":2,"pivot_tables":0},"unopened":[],"bounds":{"document_bytes":16777216,"sheet_cells":100000,"rows_first":2000,"rows_last":500,"rows_between":2000,"halvings":0,"cell_chars":16384,"cell_head_chars":4096},"cells_cut":0,"cells_raw":0,"read":"whole","date_system":"1900"}

{"sheet":"LDC Info","index":0,"n_rows":78,"n_cols":27,"rows_kept":78,"cut":false,"hidden":false,"merged":[[45,4,45,6],[45,0,45,3],[50,2,50,11],[54,2,54,12],[52,2,52,13],[27,4,27,6],[30,4,30,6],[29,0,30,3],[42,0,43,3],[38,0,39,3],[39,4,39,6],[32,0,33,3],[33,4,33,6],[35,0,36,3],[17,4,17,10],[13,4,13,10],[15,4,15,8],[19,4,19,8],[25,4,25,6],[23,4,23,6]]}
[]
[]
[null,null,null,null,null,null,null,null,null,null,null,null,null,null,null,null,null,null,null,null,null,null,null,null,null,null,"Algoma Power Inc."]
[null,null,null,null,null,null,null,null,null,null,null,null,null,null,null,null,null,null,null,null,null,null,null,null,null,null,"Atikokan Hydro Inc."]
[null,null,null,null,null,null,null,null,null,null,null,null,null,null,null,null,null,null,null,null,null,null,null,null,null,null,"Attawapiskat Power Corporation"]
[null,null,null,null,null,null,null,null,null,null,null,null,null,null,null,null,null,null,null,null,null,null,null,null,null,null,"Bluewater Power Distribution Corporation"]
[null,null,null,null,null,null,null,null,null,null,null,null,null,null,null,null,null,null,null,null,null,null,null,null,null,null,"Brant County Power Inc."]
[null,null,null,null,null,null,null,null,null,null,null,null,null,null,null,null,null,null,null,null,null,null,null,null,null,null,"Brantford Power Inc."]
[null,null,null,null,null,null,null,null,null,null,null,null,null,null,null,null,null,null,null,null,null,null,null,null,null,null,"Burlington Hydro Inc."]
[null,null,null,null,null,null,null,null,null,null,null,null,null,null,null,null,null,null,null,null,null,null,null,null,null,null,"Cambridge and North Dumfries Hydro Inc."]
[null,null,null,null,null,null,null,null,null,null,null,null,null,null,null,null,null,null,null,null,null,null,null,null,null,null,"Canadian Niagara Power Inc."]
[null,null,null,null,null,null,null,null,null,null,null,null,null,null,null,null,null,null,null,null,null,null,null,null,null,null,"Centre Wellington Hydro Ltd."]
[null,null,null,null,null,null,null,null,null,null,null,null,null,null,null,null,null,null,null,null,null,null,null,null,null,null,"Chapleau Public Utilities Corporation"]
[null,null,null,"Utility Name   ","Canadian Niagara Power Inc.",null,null,null,null,null,null,null,null,null,null,null,null,null,null,null,null,null,null,null,null,null,"COLLUS PowerStream Corp."]
[null,null,null,null,null,null,null,null,null,null,null,null,null,null,null,null,null,null,null,null,null,null,null,null,null,null,"Cooperative Hydro Embrun Inc."]
[null,null,null,"Assigned EB Number","EB-2016-0061",null,null,null,null,null,null,null,null,null,null,null,null,null,null,null,null,null,null,null,null,null,"E.L.K. Energy Inc."]
[null,null,null,null,null,null,null,null,null,null,null,null,null,null,null,null,null,null,null,null,null,null,null,null,null,null,"Enersource Hydro Mississauga Inc."]
[null,null,null,"Name of Contact and Title","Gregory Beharriell",null,null,null,null,null,null,null,null,null,null,null,null,null,null,null,null,null,null,null,null,null,"Entegrus Powerlines Inc."]
[null,null,null,null,null,null,null,null,null,null,null,null,null,null,null,null,null,null,null,null,null,null,null,null,null,null,"EnWin Utilities Ltd."]
[null,null,null,"Phone Number   ","905-871-0330  ext. 3278",null,null,null,null,null,null,null,null,null,null,null,null,null,null,null,null,null,null,null,null,null,"Erie Thames Powerlines Corporation"]
[null,null,null,null,null,null,null,null,null,null,null,null,null,null,null,null,null,null,null,null,null,null,null,null,null,null,"Espanola Regional Hydro Distribution Corporation"]
[null,null,null,"Email Address   ","greg.beharriel@cnpower.com",null,null,null,null,null,null,null,null,null,null,null,null,null,null,null,null,null,null,null,null,null,"Essex Powerlines Corporation"]
[null,null,null,null,null,null,null,null,null,null,null,null,null,null,null,null,null,null,null,null,null,null,null,null,null,null,"Festival Hydro Inc."]
[null,null,null,"Test Year",2017,null,null,null,null,null,null,null,null,null,null,null,null,null,null,null,null,null,null,null,null,null,"Fort Albany Power Corporation"]
[null,null,null,null,null,null,null,null,null,null,null,null,null,null,null,null,null,null,null,null,null,null,null,null,null,null,"Fort Frances Power Corporation"]
[null,null,null,"Bridge Year",2016,null,null,null,null,null,null,null,null,null,null,null,null,null,null,null,null,null,null,null,null,null,"Greater Sudbury Hydro Inc."]
[null,null,null,null,null,null,null,null,null,null,null,null,null,null,null,null,null,null,null,null,null,null,null,null,null,null,"Grimsby Power Inc."]
[null,null,null,"Last Rebasing Year",2013,null,null,null,null,null,null,null,null,null,null,null,null,null,null,null,null,null,null,null,null,null,"Guelph Hydro Electric Systems Inc."]
[null,null,null,null,null,null,null,null,null,null,null,null,null,null,null,null,null,null,null,null,null,null,null,null,null,null,"Haldimand County Hydro Inc."]
["Identify the accounting standard used for the test year",null,null,null,null,null,null,null,null,null,null,null,null,null,null,null,null,null,null,null,null,null,null,null,null,null,"Halton Hills Hydro Inc."]
[null,null,null,null,"MIFRS",null,null,null,null,null,null,null,null,null,null,null,null,null,null,null,null,null,null,null,null,null,"Hearst Power Distribution Company Limited"]
[null,null,null,null,null,null,null,null,null,null,null,null,null,null,null,null,null,null,null,null,null,null,null,null,null,null,"Horizon Utilities Corporation"]
["Did you update your depreciation and capitalization policies?",null,null,null,null,null,null,null,null,null,null,null,null,null,null,null,null,null,null,null,null,null,null,null,null,null,"Hydro 2000 Inc."]
[null,null,null,null,"No",null,null,null,null,null,null,null,null,null,null,null,null,null,null,null,null,null,null,null,null,null,"Hydro Hawkesbury Inc."]
[null,null,null,null,null,null,null,null,null,null,null,null,null,null,null,null,null,null,null,null,null,null,null,null,null,null,"Hydro One Brampton Networks Inc."]
["When did you update your depreciation and capitalization policies?",null,null,null,null,null,null,null,null,null,null,null,null,null,null,null,null,null,null,null,null,null,null,null,null,null,"Hydro One Networks Inc."]
[null,null,null,null,"2001-01-01",null,null,null,null,null,null,null,null,null,null,null,null,null,null,null,null,null,null,null,null,null,"Hydro One Remote Communities Inc."]
[null,null,null,null,null,null,null,null,null,null,null,null,null,null,null,null,null,null,null,null,null,null,null,null,null,null,"Hydro Ottawa Limited"]
["Identify the year that the applicant has adopted or is expected to adopt IFRS for financial reporting purposes",null,null,null,null,null,null,null,null,null,null,null,null,null,null,null,null,null,null,null,null,null,null,null,null,null,"Innpower Corporation"]
[null,null,null,null,2013,null,null,null,null,null,null,null,null,null,null,null,null,null,null,null,null,null,null,null,null,null,"Kashechewan Power Corporation"]
[null,null,null,null,null,null,null,null,null,null,null,null,null,null,null,null,null,null,null,null,null,null,null,null,null,null,"Kenora Hydro Electric Corporation Ltd."]
[null,null,null,null,null,null,null,null,null,null,null,null,null,null,null,null,null,null,null,null,null,null,null,null,null,null,"Kingston Hydro Corporation"]
["Are you applying for cost recovery for the test and/or future year(s) for Green Energy initiatives?",null,null,null,null,null,null,null,null,null,null,null,null,null,null,null,null,null,null,null,null,null,null,null,null,null,"Kitchener-Wilmot Hydro Inc."]
[null,null,null,null,"No",null,null,null,null,null,null,null,null,null,null,null,null,null,null,null,null,null,null,null,null,null,"Lakefront Utilities Inc."]
[null,null,null,null,null,null,null,null,null,null,null,null,null,null,null,null,null,null,null,null,null,null,null,null,null,null,"Lakeland Power Distribution Ltd."]
[{"$f":"\"Is \" & E14 & \" an embedded distributor?\"","v":"Is Canadian Niagara Power Inc. an embedded distributor?"},null,null,null,"No",null,null,null,null,null,null,null,null,null,null,null,null,null,null,null,null,null,null,null,null,null,"London Hydro Inc."]
[null,null,null,null,null,null,null,null,null,null,null,null,null,null,null,null,null,null,null,null,null,null,null,null,null,null,"Midland Power Utility Corporation"]
[null,null,null,null,null,null,null,null,null,null,null,null,null,null,null,null,null,null,null,null,null,null,null,null,null,null,"Milton Hydro Distribution Inc."]
[null,"Notes",null,null,null,null,null,null,null,null,null,null,null,null,null,null,null,null,null,null,null,null,null,null,null,null,"Newmarket-Tay Power Distribution Ltd."]
[null,null,null,null,null,null,null,null,null,null,null,null,null,null,null,null,null,null,null,null,null,null,null,null,null,null,"Niagara Peninsula Energy Inc."]
[null,null,"Pale green cells represent input cells.",null,null,null,null,null,null,null,null,null,null,null,null,null,null,null,null,null,null,null,null,null,null,null,"Niagara-on-the-Lake Hydro Inc."]
[null,null,null,null,null,null,null,null,null,null,null,null,null,null,null,null,null,null,null,null,null,null,null,null,null,null,"Norfolk Power Distribution Inc."]
[null,null,"Pale blue cells represent drop-down lists.  The applicant should select the appropriate item from the drop-down list.",null,null,null,null,null,null,null,null,null,null,null,null,null,null,null,null,null,null,null,null,null,null,null,"North Bay Hydro Distribution Limited"]
[null,null,null,null,null,null,null,null,null,null,null,null,null,null,null,null,null,null,null,null,null,null,null,null,null,null,"Northern Ontario Wires Inc."]
[null,null,"White cells contain fixed values, automatically generated values or formulae. ",null,null,null,null,null,null,null,null,null,null,null,null,null,null,null,null,null,null,null,null,null,null,null,"Oakville Hydro Electricity Distribution Inc."]
[null,null,null,null,null,null,null,null,null,null,null,null,null,null,null,null,null,null,null,null,null,null,null,null,null,null,"Orangeville Hydro Limited"]
[null,null,null,null,null,null,null,null,null,null,null,null,null,null,null,null,null,null,null,null,null,null,null,null,null,null,"Orillia Power Distribution Corporation"]
[null,null,null,null,null,null,null,null,null,null,null,null,null,null,null,null,null,null,null,null,null,null,null,null,null,null,"Oshawa PUC Networks Inc."]
[null,null,null,null,null,null,null,null,null,null,null,null,null,null,null,null,null,null,null,null,null,null,null,null,null,null,"Ottawa River Power Corporation"]
[null,null,null,null,null,null,null,null,null,null,null,null,null,null,null,null,null,null,null,null,null,null,null,null,null,null,"Peterborough Distribution Incorporated"]
[null,null,null,null,null,null,null,null,null,null,null,null,null,null,null,null,null,null,null,null,null,null,null,null,null,null,"PowerStream Inc."]
[null,null,null,null,null,null,null,null,null,null,null,null,null,null,null,null,null,null,null,null,null,null,null,null,null,null,"PUC Distribution Inc."]
[null,null,null,null,null,null,null,null,null,null,null,null,null,null,null,null,null,null,null,null,null,null,null,null,null,null,"Renfrew Hydro Inc."]
[null,null,null,null,null,null,null,null,null,null,null,null,null,null,null,null,null,null,null,null,null,null,null,null,null,null,"Rideau St. Lawrence Distribution Inc."]
[null,null,null,null,null,null,null,null,null,null,null,null,null,null,null,null,null,null,null,null,null,null,null,null,null,null,"Sioux Lookout Hydro Inc."]
[null,null,null,null,null,null,null,null,null,null,null,null,null,null,null,null,null,null,null,null,null,null,null,null,null,null,"St. Thomas Energy Inc."]
[null,null,null,null,null,null,null,null,null,null,null,null,null,null,null,null,null,null,null,null,null,null,null,null,null,null,"Thunder Bay Hydro Electricity Distribution Inc."]
[null,null,null,null,null,null,null,null,null,null,null,null,null,null,null,null,null,null,null,null,null,null,null,null,null,null,"Tillsonburg Hydro Inc."]
[null,null,null,null,null,null,null,null,null,null,null,null,null,null,null,null,null,null,null,null,null,null,null,null,null,null,"Toronto Hydro-Electric System Limited"]
[null,null,null,null,null,null,null,null,null,null,null,null,null,null,null,null,null,null,null,null,null,null,null,null,null,null,"Veridian Connections Inc."]
[null,null,null,null,null,null,null,null,null,null,null,null,null,null,null,null,null,null,null,null,null,null,null,null,null,null,"Wasaga Distribution Inc."]
[null,null,null,null,null,null,null,null,null,null,null,null,null,null,null,null,null,null,null,null,null,null,null,null,null,null,"Waterloo North Hydro Inc."]
[null,null,null,null,null,null,null,null,null,null,null,null,null,null,null,null,null,null,null,null,null,null,null,null,null,null,"Welland Hydro-Electric System Corp."]
[null,null,null,null,null,null,null,null,null,null,null,null,null,null,null,null,null,null,null,null,null,null,null,null,null,null,"Wellington North Power Inc."]
[null,null,null,null,null,null,null,null,null,null,null,null,null,null,null,null,null,null,null,null,null,null,null,null,null,null,"West Coast Huron Energy Inc."]
[null,null,null,null,null,null,null,null,null,null,null,null,null,null,null,null,null,null,null,null,null,null,null,null,null,null,"Westario Power Inc."]
[null,null,null,null,null,null,null,null,null,null,null,null,null,null,null,null,null,null,null,null,null,null,null,null,null,null,"Whitby Hydro Electric Corporation"]
[null,null,null,null,null,null,null,null,null,null,null,null,null,null,null,null,null,null,null,null,null,null,null,null,null,null,"Woodstock Hydro Services Inc."]

{"sheet":"Index","index":1,"n_rows":42,"n_cols":6,"rows_kept":42,"cut":false,"hidden":false,"merged":[]}
[]
[]
[]
[]
[]
[]
[]
[]
[]
[]
[]
[]
[]
[]
[1,"LDC Information Sheet",null,null,28,"App.2-G: Service Reliability Indicators"]
[2,"Index",null,null,29,"App.2-H: Other Operating Revenue"]
[3,"Cost of Service Application Flowchart",null,null,30,"App.2-I: Load Forecast CDM Adjustment Workform"]
[4,"List of Key References",null,null,31,"App.2-IA:  Actual and Forecast Load and Customer Data"]
[5,"App.2-AA: Capital Projects Table",null,null,32,"App.2-JA: OM&A Summary Analysis"]
[6,"App.2-AB: Capital Expenditures",null,null,33,"App.2-JB: Recoverable OM&A Cost Driver Table"]
[7,"App. 2-AC: Customer Engagement Worksheet",null,null,34,"App.2-JC: OM&A Programs Table"]
[8,"App.2-B: General Accounting Instructions",null,null,35,"App.2-K: Employee Costs"]
[9,"App.2-BA: Fixed Asset Continuity Schedule",null,null,36,"App.2-L: Recoverable OM&A Cost per Customer and per FTE"]
[10,"Appendix 2-BB: Service Life Comparison",null,null,37,"App.2-M: Regulatory Costs Schedule"]
[11,"App.2-CA: 2012 Depreciation and Amortization Expense (Old CGAAP)",null,null,38,"App.2-N: Shared Servcies and Corporate Cost Allocation"]
[12,"App.2-CB: 2012 Depreciation and Amortization Expense (New CGAAP)",null,null,39,"App.2-OA: Capital Structure and Cost of Capital"]
[13,"App.2-CC: 2013 Depreciation and Amortization Expense (New CGAAP)",null,null,40,"App.2-OB: Debt Instruments"]
[14,"App.2-CD: 2014 Depreciation and Amortization Expense (MIFRS)",null,null,41,"App.2-P: Cost Allocation"]
[15,"App.2-CE: 2015 Depreciation and Amortization Expense (MIFRS)",null,null,42,"App.2-PA:  New Rate Design Policy For Residential Customers"]
[16,"App.2-CF: 2015 Depreciation and Amortization Expense (MIFRS)",null,null,43,"App.2-Q: Cost of Serving Embedded Distributor(s)"]
[17,"App.2-CG: 2013 Depreciation and Amortization Expense (Old CGAAP)",null,null,44,"App.2-R: Loss Factors"]
[18,"App.2-CH: 2013 Depreciation and Amortization Expense (New CGAAP)",null,null,45,"App.2-S: Stranded Meter Treatment"]
[19,"App.2-CI: 2014 Depreciation and Amortization Expense (MIFRS)",null,null,46,"App.2-TA: Account 1592, PILs and Tax Variances"]
[20,"App.2-CJ: 2015 Depreciation and Amortization Expense (MIFRS)",null,null,47,"App.2-TB: Account 1592, HST-OVAT Input Tax Credits"]
[21,"App.2-CK: 2016 Depreciation and Amortization Expense (MIFRS)",null,null,48,"App.2-U: One-Time Incremental IFRS Transition Costs"]
[22,"App.2-D: Overhead Expenses",null,null,49,"App.2-V: Revenue Reconciliation"]
[23,"App.2-EA: Account 1575 PP&E Deferral Account (2015 IFRS Adopters)",null,null,50,"App.2-W: Bill Impacts"]
[24,"App.2-EB: Account 1576 - Accounting Changes Under CGAAP (2012 Changes)",null,null,51,"App.2-Y: Transition to MIFRS Summary Impact"]
[25,"App.2-EC: Account 1576 - Accounting Changes Under CGAAP (2013 Changes)",null,null,52,"App. 2-Z: Tariff Schedule"]
[26,"App.2-FA: Renewable Generation Connection Investment Summary"]
[27,"App.2-FB: Calculation of Renewable Generation Connection Direct Benefits/Provincial Amount: Renewable Enabling Improvement Investments"]
[28,"App.2-FC: Calculation of Renewable Generation Connection Direct Benefits/Provincial Amount: Renewable Expansion Investments"]

{"sheet":"COS Flowchart","index":2,"n_rows":6,"n_cols":2,"rows_kept":6,"cut":false,"hidden":false,"merged":[[5,1,5,6],[2,1,2,6],[3,1,3,6]]}
[]
[]
[]
[null,"Cost of Service Rate Application Schematic"]
[]
[null,"The Cost of Service Rate Application Schematic is a flowchart appended to Chapter 2 of the Filing Requirements as a guide for the components of an application and how demand and costs interrelate to derive the revenue requirement and then how the revenue requirement is allocated between classes and through fixed/variable splits to derive rates that will be compensatory for the annual revenue requirement, based on the the forecasted demand.  There is no form to be filled out; therefore, this Schedule is not required to be filed. "]

{"sheet":"List of Key References","index":3,"n_rows":5,"n_cols":2,"rows_kept":5,"cut":false,"hidden":false,"merged":[[2,1,2,11],[4,0,4,11]]}
[]
[]
[null,"List of Key References"]
[]
["A list of key references for understanding the Filing Requirements has been embedded in the document below. To access the list of references and associated hyperlinks double-click the icon below."]

{"sheet":"App.2-AA_Capital Projects","index":4,"n_rows":103,"n_cols":8,"rows_kept":103,"cut":false,"hidden":false,"merged":[[11,0,11,7],[105,0,106,8],[9,0,9,7],[8,0,8,7],[101,0,101,7],[103,0,103,7],[102,0,102,7],[14,0,14,6],[32,0,32,6],[63,0,63,6],[78,0,78,6]]}
[null,null,null,null,null,null,"File Number:",{"$f":"EBNUMBER","v":"EB-2016-0061"}]
[null,null,null,null,null,null,"Exhibit:",2]
[null,null,null,null,null,null,"Tab:",2]
[null,null,null,null,null,null,"Schedule:","1A"]
[null,null,null,null,null,null,"Page:"]
[]
[null,null,null,null,null,null,"Date:","2016-04-29"]
[]
["Appendix 2-AA"]
["Capital Projects Table"]
[]
[]
["Projects",{"$f":"C13-1","v":2012},{"$f":"D13-1","v":2013},{"$f":"E13-1","v":2014},{"$f":"BridgeYear - 1","v":2015},{"$f":"BridgeYear & \" Bridge Year\"","v":"2016 Bridge Year"},{"$f":"TestYear & \" Test Year\"","v":"2017 Test Year"}]
["Reporting Basis","CGAAP","ASPE","ASPE","ASPE","ASPE","ASPE"]
["System Access"]
["Overhead Services SA",156473.4,241748.43000000002,298463.95999999996,300145.22000000003,319182.56,212730.6]
["Underground Services SA",194341.72,137751.57999999999,154130.48000000001,211345.53,153037.44,159300.96]
["Nia. New Meters SA"]
["Dist. Upgrades & Expansions SA",{"$f":"789724.9025+92029","v":881753.90249999997},{"$f":"314578+186513","v":501091},{"$f":"938116+118204","v":1056320},{"$f":"908123.016+50336","v":958459.01599999995},{"$f":"1030649+180728","v":1211377},950202]
["New Dist Transformers & Reg SA",null,null,null,138084]
["New Smart Centre Garrison Rd SA",null,114004.41]
["Killaly St. Relocate from Knoll to King SA",null,512118.69]
["Sugarloaf & Lynwood Upgrade - 3rd Party Access SA",null,null,105986.21]
["Central Avenue Bridge Replacement SA",null,null,140773.65,164958.84]
["Ridgeway by The Lake Subdivision SA",null,null,null,111398.44]
["Spears Rd Expansion and Subdivision SA",null,null,null,181290.88]
["Gananoque System Conversion to Wye Ground SA"]
[]
["Miscellaneous SA",{"$f":"25418.4809480808","v":25418.4809480808},220635.57333618024,235695.27617567079,{"$f":"183161.208972401","v":183161.20897240099},69507.793642457851,136663.47882584599]
[]
["Capital Contributions SA",-558486.66,-1062493.07,-1658435.32,-1264311.3500000001,-1470207,-550000]
["Sub-Total",{"$f":"SUM(B16:B31)","v":699500.8434480807},664856.61333618034,332934.25617567054,984531.78497240087,282897.79364245781,908897.03882584604]
["System Renewal"]
["Station 19 Projects SR",121108.75,null,null,null,null,347848.68]
["M11 Line Rebuild SR",161690.66,218903.5]
["18L10 Line Rebuild Albany and Helena SR",null,213552.84999999998,194171.48]
["Dodd's Court Rebuild SR",293383.98]
["Royal Road Phase 2 SR",131826.1]
["Rose, Gaspare Rebuild SR",null,100367.51,183919.01]
["Barrick Conversion to 27.6kV and Rebuild SR",null,null,644010.93000000005,{"$f":"606649.72+147482","v":754131.72}]
["Fielden Station Projects SR",null,235171.93,573400.65,645003.91]
["Gilmore Station Projects SR",null,null,null,135529.51999999999,1604002]
["Gilmore Egress Project SR",null,null,null,null,519944]
["FE North Rebuilds Supporting Conversion SR",null,null,null,null,{"$f":"2875000-F42-F43","v":751054},884802]
["Port Colborne South New DS SR",null,null,null,null,null,{"$f":"409245","v":409245}]
["5/8 Line Rebuild SR",null,null,218192.96000000002,275833.25]
["Forks Road Canal Riser Rebuild SR",null,null,null,184826.25]
["Dist. Upgrades & Expansions SR",{"$f":"1198861.1175+345805","v":1544666.1174999999},{"$f":"1222370.98+419627","v":1641997.98},{"$f":"971142.906+326508","v":1297650.906},{"$f":"1111405.374+646886","v":1758291.3740000001},{"$f":"2309941.63+252413-374663-620000-80000","v":1487691.63},{"$f":"1546286.568+322627+249982-150000-294938+200000+200000","v":2073957.568}]
["FE Ridgeway Rebuilds Supporting Conversion SR",null,null,null,null,620000,294938]
["New Dist. Transformers & Reg SR",205998.96799999999,261400,261842,278843,306000,315000]
["New MIST Meters SR",null,null,null,234065]
["New Meters SR",131194.48000000001,164326.23200000002,132693.82399999999,127324.304,180072,189419.424]
["New Smart Meters SR",355960,{"$f":"4809490.1+69554.29","v":4879044.3899999997}]
["Ontario Street Rebuild SR",null,122900.51]
["Oak Alley Rebuild SR",null,186384.45,133332.67000000001]
["Elizabeth Street Pole Replacement SR",null,null,null,138805.31]
["Pine Street Pole Replacement SR",null,null,null,235265.87]
["Construct Herbert DS to Gananoque DS Intertie SR",null,null,null,null,380000]
["North Line Rebuild SR",null,null,null,null,null,257109.96]
["Substation TX Replacement (#1, #2, Leaky Creek) SR",null,328232.05]
[]
["Miscellaneous SR",51282.888883388077,494960.33514250047,393978.80405598937,{"$f":"461140.382044299-74229-234065","v":152846.38204429898},107943.70350299403,218496.44316946529]
["Sub-Total",{"$f":"SUM(B34:B62)","v":2997111.9443833879},{"$f":"SUM(C34:C62)","v":8847241.7371424995},4033193.234055989,4920765.890044298,5956707.3335029939,4990817.0751694646]
["System Service"]
["Distribution Automation SS",144333.25,180676.09000000003,null,null,308282.88,311432.40000000002]
["Delta to Wye Conversion Niagara SS",155910.07,156934.04999999999,null,127675.15]
["Ridgeway Delta to Wye Conversion Niagara SS",null,null,null,null,330000,450313]
["Stevensville Upgrades - Stepdown Load Relief SS",152380.51999999999]
["Station 18 New Feeder Configuration SS",null,102622.51]
["18L10 Extension Hwy 3 SS",null,null,507743.82,147428.76]
["Houck Cres. Conversion SS",null,null,null,268338.11]
["FE North Conversion SS",null,null,null,null,null,156031]
["SCADA and Communication Projects SS",null,null,118501.17,152677.24]
["Herbert Street Feeder Reinforcement Ph. 5 SS",178390.13]
["EOP Main Substation - Delta to Wye Conversion SS",null,null,null,null,null,{"$f":"801024.6*0.75+150000","v":750768.45}]
[]
["Miscellaneous SS",4912.2135501401444,114034.07883735748,236902.34286855863,188155.86222509993,{"$f":"15931.5322325619+68274","v":84205.532232561905},{"$f":"104779.14756315+68354","v":173133.14756315001}]
["Sub-Total",{"$f":"SUM(B65:B77)","v":635926.18355014012},554266.72883735748,863147.33286855859,884275.12222509994,722488.41223256197,1841677.99756315]
["General Plant"]
["Transportation GP",{"$f":"411213.17+312234","v":723447.16999999993},392686.15,365132.23,116592.81,327000,175000]
["S/C Leasehold Improvements GP",null,362239]
["PC Assets  GP",2881511.48,188964.57]
["General Expense Capital GP",{"$f":"871505.61+268547","v":1140052.6099999999}]
["Miscellaneous IT GP",{"$f":"21650+99952+46681","v":168283},{"$f":"77691+198011","v":275702},{"$f":"71612+79645+100547","v":251804},{"$f":"79875+97884","v":177759},323428,{"$f":"73071+35000+120000","v":228071}]
["Server Storage Replacements GP",417992,null,null,null,362339,246081]
["SAP Improvements GP",252000,352945,364081,248787,429195,540027]
["GIS/OMS GP",186000,288181,161052,287637,340000,300000]
["Environment Health & Safety GP",null,110386,120749,null,null,100000]
["Software Licensing GP",null,345544,177115,173000,214000,214000]
["Firewall Upgrades GP",null,null,121457]
["Smart Meter Technology GP",null,798570]
[]
["Miscellaneous GP",{"$f":"10422","v":10422},{"$f":"133307.080683962","v":133307.08068396201},93767.222899781962,{"$f":"236097.982758202","v":236097.98275820201},{"$f":"99169.6906219871+90000","v":189169.6906219871},212587.14644153847]
["Sub-Total",{"$f":"SUM(B80:B93)","v":5779708.2599999998},3248524.8006839617,1655157.452899782,1239873.7927582022,2185131.690621987,2015766.1464415384]
["Miscellaneous"]
["Total",{"$f":"SUMPRODUCT(--($A15:$A95=\"Sub-Total\"), B$15:B$95)+B95","v":10112247.231381608},13314889.879999999,6884432.2759999996,8029446.5900000017,9147225.2300000004,9757158.2579999994]
["Less Renewable Generation Facility Assets and Other Non-Rate-Regulated Utility Assets (input as negative)"]
["Total",{"$f":"B96+B97","v":10112247.231381608},13314889.879999999,6884432.2759999996,8029446.5900000017,9147225.2300000004,9757158.2579999994]
[]
["Notes:"]
[]
["1   Please provide a breakdown of the major components of each capital project undertaken in each year.  Please ensure that all projects below the materiality threshold are included in the miscellaneous line.  Add more projects as required."]
["2   The applicant should group projects appropriately and avoid presentations that result in classification of significant components of the capital budget in the miscellaneous category."]

{"sheet":"App.2-AB_Capital Expenditures","index":5,"n_rows":35,"n_cols":19,"rows_kept":35,"cut":false,"hidden":false,"merged":[[32,0,33,18],[35,0,36,18],[34,0,34,18],[27,0,27,18],[28,0,28,18],[29,0,30,18],[31,0,31,18],[15,13,15,18],[12,15,12,18],[12,0,15,0],[15,1,15,2],[15,4,15,5],[15,7,15,8],[15,10,15,11],[13,1,13,3],[13,4,13,6],[8,0,8,18],[9,0,9,18],[13,7,13,9],[13,10,13,12],[13,14,14,14],[13,15,14,15],[13,13,14,13],[12,1,12,12],[13,16,14,16],[13,17,14,17],[13,18,14,18]]}
[null,null,null,null,null,null,null,null,null,null,null,null,null,null,null,null,"File Number:",null,{"$f":"EBNUMBER","v":"EB-2016-0061"}]
[null,null,null,null,null,null,null,null,null,null,null,null,null,null,null,null,"Exhibit:",null,2]
[null,null,null,null,null,null,null,null,null,null,null,null,null,null,null,null,"Tab:",null,2]
[null,null,null,null,null,null,null,null,null,null,null,null,null,null,null,null,"Schedule:",null,"1B"]
[null,null,null,null,null,null,null,null,null,null,null,null,null,null,null,null,"Page:"]
[]
[null,null,null,null,null,null,null,null,null,null,null,null,null,null,null,null,"Date:",null,"2016-04-29"]
[]
["Appendix 2-AB"]
["Table 2 - Capital Expenditure Summary from Chapter 5 Consolidated\nDistribution System Plan Filing Requirements"]
[]
["First year of Forecast Period:",{"$f":"TestYear","v":2017}]
["CATEGORY","Historical Period (previous plan1 & actual)",null,null,null,null,null,null,null,null,null,null,null,"Bridge Year","Test Year","Forecast Period (planned)"]
[null,{"$f":"E14-1","v":2012},null,null,{"$f":"H14-1","v":2013},null,null,{"$f":"K14-1","v":2014},null,null,{"$f":"N14-1","v":2015},null,null,{"$f":"O14-1","v":2016},{"$f":"B12","v":2017},{"$f":"O14+1","v":2018},{"$f":"P14+1","v":2019},2020,2021]
[null,"Plan","Actual","Var","Plan","Actual","Var","Plan","Actual","Var","Plan","Actual","Var"]
[null,"$ '000",null,"%","$ '000",null,"%","$ '000",null,"%","$ '000",null,"%","$ '000"]
["System Access",null,699500.8434480807,{"$f":"IF(ISERROR((C17-B17)/B17),\"--\",(C17-B17)/B17)","v":"--"},null,664856.61333618034,{"$f":"IF(ISERROR((F17-E17)/E17),\"--\",(F17-E17)/E17)","v":"--"},null,332934.25617567054,{"$f":"IF(ISERROR((I17-H17)/H17),\"--\",(I17-H17)/H17)","v":"--"},null,984531.78497240087,{"$f":"IF(ISERROR((L17-K17)/K17),\"--\",(L17-K17)/K17)","v":"--"},282897.79364245798,908897.18882584595,536611.2080000001,547343.43216000008,559940.26080320007,571139.06601926405]
["System Renewal",null,2997111.9443833879,{"$f":"IF(ISERROR((C18-B18)/B18),\"--\",(C18-B18)/B18)","v":"--"},null,8847241.7371424995,{"$f":"IF(ISERROR((F18-E18)/E18),\"--\",(F18-E18)/E18)","v":"--"},null,4033193.234055989,{"$f":"IF(ISERROR((I18-H18)/H18),\"--\",(I18-H18)/H18)","v":"--"},null,4920765.890044298,{"$f":"IF(ISERROR((L18-K18)/K18),\"--\",(L18-K18)/K18)","v":"--"},5956707.3335029902,4990817.0751694646,5939119.5120000001,5496072,5460618,7043601.0900905002]
["System Service",null,635926.18355014012,"--",null,554266.72883735748,"--",null,863147.33286855859,"--",null,884275.12222509994,"--",722488.41223256197,1841677.99756315,1064435,1504806.1999999997,1179108.3515000001,835558.25453000027]
["General Plant",null,5779708.2599999998,"--",null,3248524.8006839617,"--",null,1655157.452899782,"--",null,1239873.7927582022,"--",2185131.6906219898,2015766.1464415384,1825260,1621292.7,2477611.429,2073683.6575799999]
["TOTAL EXPENDITURE",{"$f":"SUM(B17:B20)","v":0},{"$f":"SUM(C17:C20)","v":10112247.231381608},"--",0,13314889.879999999,"--",0,6884432.2759999996,"--",0,8029446.5900000017,"--",9147225.2300000004,9757158.407999998,9365425.7200000007,9169514.3321599998,9677278.0413032006,{"$f":"SUM(S17:S20)","v":10523982.068219764}]
["System O&M",null,3341251,"--",null,3472965.59,"--",null,3620493.3,"--",null,3615555.81,"--",3861772.92,4106945.96,4189084.8791999999,4272866.5767839998,4358323.90831968,4445490.386486074]
[]
["Notes to the Table:"]
["(1) This is Canadian Niagara Power's first Distribution System Plan and as such planned expenditures were not allocated to Chapter 5 Investment Categories."]
[]
[]
["Explanatory Notes on Variances (complete only if applicable)"]
["Notes on shifts in forecast vs. historical budgets by category"]
[]
[]
["Notes on year over year Plan vs. Actual variances for Total Expenditures"]
[]
[]
["Notes on Plan vs. Actual variance trends for individual expenditure categories"]

{"sheet":"App. 2-AC_Customer Engagement","index":6,"n_rows":58,"n_cols":3,"rows_kept":58,"cut":false,"hidden":false,"merged":[[9,0,9,2],[8,0,8,2],[12,0,16,0],[12,1,16,1],[19,0,22,0],[19,1,22,1],[23,0,25,0],[23,1,25,1],[26,0,28,0],[26,1,28,1],[29,0,31,0],[29,1,31,1],[33,0,34,0],[33,1,34,1],[35,0,36,0],[35,1,36,1],[35,2,36,2],[37,0,38,0],[37,1,38,1],[37,2,38,2],[39,0,40,0],[39,1,40,1],[39,2,40,2],[49,0,52,0],[49,1,52,1],[41,0,42,0],[41,1,42,1],[41,2,42,2],[46,0,48,0],[46,1,48,1]]}
[null,"File Number:",{"$f":"EBNUMBER","v":"EB-2016-0061"}]
[null,"Exhibit:",1]
[null,"Tab:",3]
[null,"Schedule:",2]
[null,"Page:"]
[]
[null,"Date:","2016-04-29"]
[]
["Appendix 2-AC"]
["Customer Engagement Activities Summary"]
[]
["Provide a list of customer engagement activities","Provide a list of customer needs and preferences identified through each engagement activity","Actions taken to respond to identified needs and preferences.  If no action was taken, explain why."]
["39,804 calls into call centre","Customer calls to inquire about high bills, to make payment arrangements, inquire as to low income assistance programs available, etc.","1.      Expanded training in 2015 for CSRs to deal with payment arrangements (AMP and LAMP)"]
[null,null,"2.      Website enhancement for low income programs (OESP)"]
[null,null,"3.      Updated website with current bill information"]
[null,null,"4.      Increased CDM activities to assist with conservation"]
[null,null,"5.      Promotion of MyHydroEye to assist customers with consumption management"]
["Community Outreach","Customers appreciate additional dialogue regarding the composition of their invoices","Customer Service staff attend community events (usually in conjunction with CDM staff) to interact and engage customers about their electrical invoices."]
["Accessibility for all customers","All customers should have the same level of service","CNPI is compliant with all accessibility legislation as outlined in the Company's Multi-year Accessibility Plan which is posted on the company website."]
["Low Income Customers","Low income customers require readily available information about programs available to them","1.      CSRs received training on OESP program and DSC requirements related to low income (AMP and LAMP)"]
[null,null,"2.      Website enhancement for low income programs (OESP)"]
[null,null,"3.      Participation in LEAP and OESP programs"]
[]
["Business Customers","Meeting the individualized needs of business customers","1.      CNPI held sessions for Class A global adjustment customers on site to ensure the needs of these customers are addressed"]
[null,null,"2.      On-site visits are ongoing to meet with customers on various topics, CDM, and online access to consumption"]
[null,null,"3.      Customers contacts form part of the Business Continuity Plan to ensure customers are informed during power outage events                                                                        4.     New key account service during power outages to be added in 2016"]
["Bill Inserts, Newsletters, on bill messaging","Calendar Monthly billing provides opportunity to frequently interact with customers.  Many customers indicate information  included with their monthly invoices as a preferred communication method","1.      Inserts are sent throughout the year with monthly invoices on various topics such as low income programs, rate changes, safety, new programs (e-Billing and MyHydroEye), and CDM"]
[null,null,"2.      Semi-annually customer newsletters are sent out to all customers"]
[null,null,"3.      On bill and envelope messages are updated as required"]
["Social Media","Some customers prefer to interact and receive information via social media","1.      Social media (Twitter and Facebook) were launched in 2014 and the Company's social media following continues to grow"]
[null,null,"2.      Website updated as required"]
[]
["Automated Phone Calls","Customers indicated automated phone calls to be a preferred method of communication specifically for planned power outages","CNPI began utilizing automated phone calls to assist in communications for planned power outages"]
["Large Customer Engagement","Large customers need to be kept informed of industry updates and initiatives specific to them","1.      CNPI participates in the annual industrial round table to provide information and seek feedback from the community’s large customers"]
[null,null,"2.      The CDM team meets regularly meets with large customers to identify opportunities to work together to reduce energy consumption"]
["Local Service Provider Information Night","Need for Local Service Providers to understand legislation and CNPI processes and for CNPI to seek feedback from these providers","CNPI hosts an annual information session for local service providers who work for customers and prospective customers in the CNPI service territories. Participants include local builders, electricians, realtors etc."]
[]
["Contractor Pre-Qualification Session","Need for CNP Contractors to understand legislation and CNPI processes and for CNPI to seek feedback from these contractors","CNPI hosts a bi-annual contractor information session for contractors employed by CNPI. As well, representatives from the local office of the ESA are present."]
[]
["Emergency Responder Information Night","Need for First Responders to engage and interact with CNPI","CNPI hosts training on a three (3) year rotation for staff of local fire, police and paramedical services. A review of electrical fundamentals and an overview of electrical safety and processes related to emergency situations are reviewed."]
[]
["Joint Use Partner Interaction","Need to meet with Joint Use customers to stay informed of upcoming projects","CNPI meets regularly with local representatives from Bell and other Joint Use customers to discuss each company's upcoming and ongoing capital and maintenance projects. "]
[]
["Annual Customer Surveys","Residential and General Service customers need to have an opportunity to provide feedback and report how CNPI rates as a service provider","For over ten years CNPI has conducted annual customer surveys. Results of the survey were studied and used in developing the 2017 Cost of Service Application and DSP to ensure both documents are meeting the needs and preferences of customers."]
["Customer Focus Groups","Residential and General Service customers need to have an opportunity to provide feedback on CNPI’s DSP and DAMP as it relates to the Cost of Service Applications","Results of the focus groups were studied and used in developing the 2017 Cost of Service Application to ensure needs and preferences of customers are addressed."]
["Electrical Safety – Elementary School Program","Elementary students need to understand electrical safety hazards and how and why to conserve electricity","Electrical safety and energy conservation school presentations offered via a third-party on a four-year rotation to all elementary schools within the service territory.  All students from grades 1-8 attend the presentation."]
["High School Students: Electricity and Careers","High School student need information about electricity and careers.","1.      Annually, CNPI hosts Grade 9 students for the Take Our Kids to WorkTM national program.  The students learn about the utility industry, various career opportunities, as well as complete the Passport to Safety Training.  The program supports career development by helping students connect school, the world of work, and their own futures."]
[null,null,"2.      CNPI participates in career days at local high schools to increase awareness of careers in the electrical industry."]
[]
["Conservation and Demand Management Activities","All customers need to be aware of CDM program and offerings","1.      saveONEnergy programs were promoted via various channels"]
[null,null,"2.      CDM staff conducts one on one site visits to a large number of business customers on an annual basis to promote conservation programs"]
[null,null,"3.      CDM and customer service staff participated in over 30 community outreach events between 2011-2014 to answer customer questions and promote conservation and related programs"]
[]
[]
[]
[]
[]
["Note:  Use \"ALT-ENTER\" to go to the next line within a cell"]

{"sheet":"App.2-B_Acct Instructions","index":7,"n_rows":67,"n_cols":6,"rows_kept":67,"cut":false,"hidden":false,"merged":[[58,0,58,13],[60,0,60,13],[0,0,0,10],[1,0,1,10],[66,0,68,10],[5,0,5,10],[9,4,9,5],[17,0,19,10],[20,0,22,10],[25,0,25,18],[34,0,36,10],[34,11,36,18],[42,0,44,10],[42,11,44,18],[28,0,30,10],[53,0,53,13],[56,0,56,18],[10,0,15,0],[73,0,73,10],[73,11,73,18],[74,0,74,10],[74,11,74,18],[83,0,83,10],[83,11,83,18],[84,0,84,10],[84,11,84,18],[85,0,85,10],[75,11,75,18],[75,0,75,10],[76,11,76,18],[77,0,77,10],[77,11,77,18],[78,0,78,10],[78,11,78,18],[79,0,79,10],[79,11,79,18],[85,11,85,18],[80,0,80,10],[80,11,80,18],[81,0,81,10],[81,11,81,18],[82,0,82,10],[82,11,82,18],[90,0,90,10],[90,11,90,18],[88,0,88,10],[88,11,88,18],[86,0,86,10],[86,11,86,18],[87,0,87,10],[87,11,87,18],[93,11,93,18],[94,0,94,10],[94,11,94,18],[95,0,95,10],[95,11,95,18],[91,11,91,18],[92,0,92,10],[92,11,92,18],[89,0,89,10],[89,11,89,18],[91,0,91,10],[99,0,99,10],[99,11,99,18],[100,0,100,10],[100,11,100,18],[101,0,101,10],[101,11,101,18],[96,0,96,10],[96,11,96,18],[97,0,97,10],[97,11,97,18],[98,0,98,10],[98,11,98,18],[105,0,105,10],[105,11,105,18],[106,0,106,10],[106,11,106,18],[107,0,107,10],[107,11,107,18],[102,0,102,10],[102,11,102,18],[103,0,103,10],[103,11,103,18],[104,0,104,10],[104,11,104,18],[126,0,126,10],[126,11,126,18],[123,0,123,10],[123,11,123,18],[124,0,124,10],[124,11,124,18],[125,0,125,10],[125,11,125,18],[120,0,120,10],[120,11,120,18],[121,0,121,10],[121,11,121,18],[122,0,122,10],[122,11,122,18],[117,0,117,10],[117,11,117,18],[118,0,118,10],[118,11,118,18],[119,0,119,10],[119,11,119,18],[114,0,114,10],[114,11,114,18],[115,0,115,10],[115,11,115,18],[116,0,116,10],[116,11,116,18],[111,0,111,10],[111,11,111,18],[112,0,112,10],[112,11,112,18],[113,0,113,10],[113,11,113,18],[108,0,108,10],[108,11,108,18],[109,0,109,10],[109,11,109,18],[110,0,110,10],[110,11,110,18]]}
["General Instructions to MIFRS Appendices"]
["Types of Schedules to File"]
[]
["The purpose of this tab is to provide general instructions.  The specific instructions to each appendix are listed in footnotes of each appendix."]
[]
["The typical applicant is expected to have made capitalization and depreciation policy changes under CGAAP as permitted by the Board on January 1, 2012 or mandated by the Board by January 1, 2013, and adopted IFRS for reporting purposes on January 1, 2015 (transition date January 1, 2014).  In general, applicants under the two scenarios should provide the following information in the appendices:"]
[]
[]
[null,null,null,null,"Accounting Policy Changes in 2012 and Adopted IFRS in 2015","Accounting Policy Changes in 2013 and Adopted IFRS in 2015"]
[null,null,null,null,"(Date of Transition to IFRS 2014)"]
["Information to be filed in 2016 CoS Application",2017,"Test",null,"MIFRS","MIFRS"]
[null,2016,"Bridge",null,"MIFRS","MIFRS"]
[null,2015,"Historical",null,"MIFRS","MIFRS"]
[null,2014,"Historical",null,"MIFRS","MIFRS"]
[null,2013,"Historical",null,"MIFRS","MIFRS"]
[null,2012,"Historical",null,"CGAAP","CGAAP"]
[]
["1) For the year that the applicant implemented changes to its capitalization and depreciation policies (2012 or 2013), the applicant must file two appendices, one before and one after the policy changes."]
[]
[]
["2)  For the transition year (2014), the applicant may file two appendices, one under Revised CGAAP and one under MIFRS, depending on the materiality of impacts.  See the specific instructions under each appendix below for further details."]
[]
[]
[]
[]
["Appendix 2-BA - Fixed Asset Schedule "]
[]
["Applicants are to provide Appendix 2-BA in accordance with the years and corresponding accounting standards noted in the above table to provide a year over year continuity in fixed assets."]
["*For the transition year (2014), the applicant should file two appendices, one under Revised CGAAP and one under MIFRS if the change between Revised CGAAP and MIFRS is material.  If the change from the accounting standards is not material, the applicant may choose to only provide one appendix under MIFRS.  However, the applicant must also indicate the fixed asset net book value balance under Revised CGAAP, the total dollar value of the change and explain why it is not material."]
[]
[]
[]
["Regulatory Gross Assets of Property, Plant and Equipment"]
[]
["For an applicant that adopted IFRS on January 1, 2015 for financial reporting purposes, the applicant must establish the continuity of historic cost by using the December 31, 2013 regulatory gross assets of property, plant and equipment as the opening January 1, 2014 regulatory gross assets.  The applicant must provide schedules (including Appendix 2-BA, Fixed Asset Continuity Schedule) which must identify the following details to substantiate the continuity of historic cost for regulatory purposes: "]
[]
[]
["·         December 31, 2013 regulatory gross assets of property, plant and equipment, by asset class; and"]
["·         January 1, 2014 regulatory gross assets of property, plant and equipment, by asset class."]
[]
["Accumulated Depreciation"]
[]
["For an applicant that adopted IFRS on January 1, 2015 for financial reporting purposes, the applicant must establish the continuity of historic cost by using the December 31, 2013 regulatory accumulated depreciation as the opening January 1, 2014 regulatory accumulated depreciation.  The applicant must provide schedules (including Appendix 2-BA, Fixed Asset Continuity Schedule) which must identify the following details to substantiate the continuity of historic cost for regulatory purposes: "]
[]
[]
["·         December 31, 2013 regulatory accumulated depreciation, by asset class; and"]
["·         January 1, 2014 regulatory accumulated depreciation, by asset class."]
[]
["Appendix 2-C - Depreciation and Amortization "]
[]
["Applicants are to provide Appendix 2-C starting in the year capitalization and depreciation policy changes were implemented in accordance with the years and corresponding accounting standards listed in the above table.  "]
["If an applicant changed capitalization and depreciation policies effective January 1, 2012 and adopted IFRS for reporting purposes effective January 1, 2015, the applicant must complete Appendix 2-CA to 2-CF (inclusive)."]
["If an applicant changed capitalization and depreciation policies effective January 1, 2013 and adopted IFRS for reporting purposes effective January 1, 2015, the applicant must complete Appendix 2-CG to 2-CK (inclusive)."]
["*Depreciation accounting policy changes were mandated by the Board by January 1, 2013.  These accounting changes should be implemented consistent with the Board’s regulatory accounting policies as set out for MIFRS as contained in the Report of the Board, Transition to International Financial Reporting Standards (EB-2008-0408), the Depreciation Study for Use by Electricity Distributors (EB-2010-0178) and the Revised 2012 Accounting Procedures Handbook for Electricity Distributors.  In general, no further changes to an applicant's depreciation policy (i.e.  assets' service lives) are expected after the Board mandated changes by January 1, 2013.  The set of Appendix CA to CK assumes this to be the case.  If the applicant has made any changes to its depreciation policy subsequent to the Board mandated changes,  applicants must identify the change, explain the nature of the change, the reason for the change, quantify the impact of the change, and quantify the depreciation expense before and after the change."]
[]
[]
["Appendix 2-E - Account 1575, IFRS-CGAAP Transitional PP&E Amounts (2-EA), Account 1576, Accounting Changes Under CGAAP (2-EB, 2-EC)"]
[]
["If an applicant changed capitalization and depreciation policies effective January 1, 2012 and  adopted IFRS for reporting purposes effective January 1, 2015, the applicant must complete Appendix 2-EA and 2-EB.  If the applicant did not make any further PP&E accounting policy changes beyond the capitalization and depreciation policy changes as permitted by the Board on January 1, 2012 (i.e. no further changes made on transition to IFRS), the applicant must indicate this and does not need to complete Appendix 2-EA."]
[]
["If an applicant changed capitalization and depreciation policies effective January 1, 2013 and adopted IFRS for reporting purposes effective January 1, 2015, the applicant must complete Appendix 2-EA  and 2-EC.   If the applicant did not make any further PP&E accounting policy changes beyond the capitalization and depreciation policy changes as mandated by the Board by January 1, 2013 (i.e. no further changes made on transition to IFRS), the applicant must indicate this and does not need to complete Appendix 2-EA."]
[]
["Please refer to section 2.12.4 and 2.12.5 of the Filing Requirements for further details."]
[]
["Appendix 2-YA - Summary of Impacts to Revenue Requirement from Transition to MIFRS"]
[]
["For  applicants adopting MIFRS, the applicants must provide a summary of the dollar impacts of  MIFRS to each component of the revenue requirement (e.g. rate base, operating costs, etc), including the overall impact on the proposed revenue requirement.  Accordingly, the applicants must identify financial differences and resulting revenue requirement impacts arising from the adoption of  MIFRS  as compared to CGAAP prior to capitalization and depreciation policy changes.  "]

{"sheet":"App.2-BA_Fixed Asset Cont","index":8,"n_rows":377,"n_cols":19,"rows_kept":377,"cut":false,"hidden":false,"merged":[[371,2,371,11],[300,2,300,11],[301,2,301,11],[309,0,309,18],[314,3,314,9],[370,2,370,11],[174,3,174,9],[230,2,230,11],[231,2,231,11],[239,0,239,18],[244,3,244,9],[98,0,98,18],[103,3,103,9],[159,2,159,11],[160,2,160,11],[169,0,169,18],[92,1,93,18],[83,1,84,18],[86,1,86,18],[8,0,8,18],[9,0,9,18],[14,3,14,9],[70,2,70,11],[71,2,71,11],[80,1,81,18]]}
[null,null,null,null,null,null,null,null,null,null,null,null,null,null,null,null,null,"File Number:",{"$f":"EBNUMBER","v":"EB-2016-0061"}]
[null,null,null,null,null,null,null,null,null,null,null,null,null,null,null,null,null,"Exhibit:",2]
[null,null,null,null,null,null,null,null,null,null,null,null,null,null,null,null,null,"Tab:",1]
[null,null,null,null,null,null,null,null,null,null,null,null,null,null,null,null,null,"Schedule:",2]
[null,null,null,null,null,null,null,null,null,null,null,null,null,null,null,null,null,"Page:"]
[]
[null,null,null,null,null,null,null,null,null,null,null,null,null,null,null,null,null,"Date:","2016-04-29"]
[]
["Appendix 2-BA"]
["Fixed Asset Continuity Schedule 1 "]
[]
[null,null,null,null,"Accounting Standard","MIFRS"]
[null,null,null,null,"Year ",2013]
[]
[null,null,null,"Cost",null,null,null,null,null,null,null,null,"Accumulated Depreciation"]
["CCA Class 2","OEB Account 3","Description 3","Opening Balance","Additions 4","Disposals","Adjustments","Cost End of Period","Allocations","Closing Balance",null,"Opening Balance","Additions","Disposals","Adjustments","Cost End of Period","Allocations","Closing Balance","Net Book Value"]
["ECE",1608,"Franchises & Consents",156053,0,0,0,{"$f":"D17+E17+F17+G17","v":156053},0,{"$f":"H17+I17","v":156053},null,-35111.970000000008,-3901.33,0,0,{"$f":"L17+M17+N17+O17","v":-39013.30000000001},0,{"$f":"P17+Q17","v":-39013.30000000001},{"$f":"J17+R17","v":117039.69999999998}]
[1,1610,"Misc. Intangible Plant",40575.65,0,0,0,40575.65,0,{"$f":"H18+I18","v":40575.65},null,-3680.6,-1014.4,0,0,{"$f":"L18+M18+N18+O18","v":-4695},0,{"$f":"P18+Q18","v":-4695},{"$f":"J18+R18","v":35880.65}]
[12,1611,"Computer Software (Formally known as Account 1925)",8351230.6200000001,1101559.29,-49302.74,-8931174.4499999993,{"$f":"D19+E19+F19+G19","v":472312.72000000067},0,472312.72000000067,null,-5405272.7300000004,-410331.68,16078.53,5604363.9000000004,-195161.97999999952,0,-195161.97999999952,277150.74000000115]
[12,"1611A","Computer Software (Formally known as Account 1925)",0,871757.81,0,8931174.4499999993,{"$f":"D20+E20+F20+G20","v":9802932.2599999998},-6048045.1264399989,3754887.1335600009,null,0,-355511.58,0,-5604363.9000000004,-5959875.4800000004,3532332.5474999994,-2427542.932500001,1327344.2010599999]
["CEC",1612,"Land Rights (Formally known as Account 1906)",308654.59000000003,8934.33,0,0,317588.92000000004,0,317588.92000000004,null,-85541.68,-6526.89,0,0,-92068.569999999992,0,-92068.569999999992,225520.35000000003]
["N/A",1805,"Land",211728.34999999998,0,-3644.54,0,208083.80999999997,0,208083.80999999997,null,0,0,0,0,0,0,0,208083.80999999997]
[47,1808,"Buildings",4074237.73,128.01,-107629.25,0,3966736.4899999998,0,3966736.4899999998,null,-980716.64999999991,-88374.91,19776.41,0,-1049315.1499999999,0,-1049315.1499999999,2917421.34]
[13,1810,"Leasehold Improvements",null,null,null,null,0,null,0,null,null,null,null,null,0,null,0,0]
[47,1815,"Transformer Station Equipment >50 kV",null,null,null,null,0,null,0,null,null,null,null,null,0,null,0,0]
[47,1820,"Distribution Station Equipment <50 kV",11690309.27,373771.5,0,-1602023.08,10462057.689999999,0,10462057.689999999,null,-2955034.42,-193775.96,0,208295.44,-2940514.94,0,-2940514.94,7521542.75]
[47,"1820A","Distribution Station Equipment <50 kV",0,58085.440000000002,0,1602023.08,1660108.52,0,1660108.52,null,0,-39141.31,0,-208295.44,-247436.75,0,-247436.75,1412671.77]
[47,1825,"Storage Battery Equipment",null,null,null,null,0,null,0,null,null,null,null,null,0,null,0,0]
[47,1830,"Poles, Towers & Fixtures",20707224.290000003,1288275.9900000002,-6778.3000000000011,0,21988721.98,0,21988721.98,null,-8898323.0800000019,-492070.68999999994,5414.03,0,-9384979.7400000021,0,-9384979.7400000021,12603742.239999998]
[47,1835,"Overhead Conductors & Devices",25832962.310000002,2055900.3399999999,-1029.49,0,27887833.160000004,0,27887833.160000004,null,-7933875.1700000009,-600219.9,1029.47,-10909.01,-8543974.6099999994,0,-8543974.6099999994,19343858.550000004]
[47,1840,"Underground Conduit",1059086.3299999998,2208.3000000000002,-0.01,0,1061294.6199999999,0,1061294.6199999999,null,-267543.32999999996,-66299.28,0,0,-333842.61,0,-333842.61,727452.00999999989]
[47,1845,"Underground Conductors & Devices",7757025.6899999995,227555.55,-903.52,0,7983677.7199999997,0,7983677.7199999997,null,-1666162.42,-200239.05,903.51,0,-1865497.96,0,-1865497.96,6118179.7599999998]
[47,1850,"Line Transformers",13457781.960000003,708846.21,-122089.58,0,14044538.590000002,0,14044538.590000002,null,-5044354.37,-388317.28999999992,122089.57,0,-5310582.09,0,-5310582.09,8733956.5000000019]
[47,1855,"Services (Overhead & Underground)",9243478.8399999999,509441.69999999995,-0.03,0,9752920.5099999998,0,9752920.5099999998,null,-2613314.37,-211241.11000000004,0,0,-2824555.48,0,-2824555.48,6928365.0299999993]
[47,1860,"Meters",4065255.1199999996,4854305.0199999996,-2959931.28,-5488008.7400000002,471620.11999999918,0,471620.11999999918,null,-2103744.0300000003,-1004281.11,1721470.2400000002,1245385.97,-141168.92999999993,0,-141168.92999999993,330451.18999999925]
[47,"1860A","Meters (Smart Meters)",0,101144.31,0,4963472.5999999996,5064616.9099999992,0,5064616.9099999992,null,0,-389045.32,0,-975186.94,-1364232.26,0,-1364232.26,3700384.6499999994]
[47,"1860B","Meters",0,24756.5,0,524536.14,549292.64,0,549292.64,null,0,-21299.49,0,-269447.28000000003,-290746.77,0,-290746.77,258545.87]
[1,1865,"D Other Install on Cust Prem",64217.84,69554.289999999994,0,0,133772.13,0,133772.13,null,-13830.27,-29493.440000000002,0,-751.75,-44075.460000000006,0,-44075.460000000006,89696.67]
[null,1875,"D St Lites & Signal Systems",0,0,0,0,0,0,0,null,0,0,0,0,0,0,0,0]
["N/A",1905,"Land",null,null,null,null,0,null,0,null,null,null,null,null,0,null,0,0]
[47,1908,"Buildings & Fixtures",1026043.76,193953.62,-329502.11,0,890495.2699999999,0,890495.2699999999,null,-193870.12999999998,-19400.25,25103.19,0,-188167.18999999997,0,-188167.18999999997,702328.08]
[13,1910,"Leasehold Improvements",418750.04000000004,276499.84000000003,0,0,695249.88000000012,0,695249.88000000012,null,-135374.12,-87505.39,0,0,-222879.51,0,-222879.51,472370.37000000011]
[8,1915,"Office Furniture & Equipment (10 years)",1366349.9699999997,-1485.33,0,0,1364864.6399999997,-266482.51799999992,1098382.1219999997,null,-1259197.9199999997,-26001.680000000004,0,0,-1285199.5999999996,251055.99799999993,-1034143.6019999997,64238.520000000019]
[8,1915,"Office Furniture & Equipment (5 years)",null,null,null,null,0,null,0,null,null,null,null,null,0,null,0,0]
[10,1920,"Computer Equipment - Hardware",3241343.7200000007,198011.09999999998,0,396.26,3439751.0800000005,-2139382.6003399999,1300368.4796600007,null,-2049420.6600000001,-421385.96,0,-396.26,-2471202.88,1534419.6120399998,-936783.26796000008,363585.21170000057]
[45,1920,"Computer Equip.-Hardware(Post Mar. 22/04)",null,null,null,null,0,null,0,null,null,null,null,null,0,null,0,0]
[45.1,1920,"Computer Equip.-Hardware(Post Mar. 19/07)",null,null,null,null,0,null,0,null,null,null,null,null,0,null,0,0]
[10,1930,"Transportation Equipment (5 years)",3505669.69,479487.18,-419550.53,-2982505.45,583100.88999999966,0,583100.88999999966,null,-2050964.7599999998,-109716.87,399965.93,1388989,-371726.69999999995,0,-371726.69999999995,211374.18999999971]
[10,"1930A","Transportation Equipment (10 years)",0,31526.799999999999,0,3038347.08,3069873.88,-529220.55599999987,2540653.324,null,0,-242440.04,0,-1433921.62,-1676361.6600000001,324150.31599999993,-1352211.3440000003,1188441.9799999997]
[8,1935,"Stores Equipment",166638.13,0,0,0,166638.13,-33327.625999999997,133310.50400000002,null,-154648.79,-4627.6499999999996,0,0,-159276.44,31855.287999999993,-127421.152,5889.3520000000135]
[8,1940,"Tools, Shop & Garage Equipment",757185.12000000011,8551.43,0,0,765736.55000000016,-145162.89599999995,620573.65400000021,null,-654528.20000000007,-16595.72,0,0,-671123.92,131359.44999999998,-539764.47000000009,80809.184000000125]
[8,1945,"Measurement & Testing Equipment",478243.76,0,0,0,478243.76,-91714.507999999973,386529.25200000004,null,-419318.3299999999,-18300.03,0,0,-437618.35999999987,84362.781999999977,-353255.57799999986,33273.674000000174]
[8,1950,"Power Operated Equipment",109339.40000000001,0,0,0,109339.40000000001,0,109339.40000000001,null,-92906.950000000012,-2413.6800000000003,0,0,-95320.63,0,-95320.63,14018.770000000004]
[8,1955,"Communications Equipment",1065540.9700000002,-2675.86,0,0,1062865.1100000001,-183433.25999999998,879431.85000000009,null,-516539.46,-95563.06,0,0,-612102.52,94196.133999999976,-517906.38600000006,361525.46400000004]
[8,1955,"Communication Equipment (Smart Meters)",null,null,null,null,0,null,0,null,null,null,null,null,0,null,0,0]
[8,1960,"Miscellaneous Equipment (10 years)",142549.50999999998,0,0,-67512.600000000006,75036.909999999974,-27797.535999999993,47239.373999999982,null,-99998.04,-7503.69,0,54059.27,-53442.46,22095.275999999994,-31347.184000000005,15892.189999999977]
[8,"1960A","Miscellaneous Equipment  (5 years)",0,0,0,67512.600000000006,67512.600000000006,0,67512.600000000006,null,0,-5455.37,0,-54059.27,-59514.64,0,-59514.64,7997.9600000000064]
[47,1975,"Load Management Controls Utility Premises",null,null,null,null,0,null,0,null,null,null,null,null,0,null,0,0]
[47,1980,"System Supervisor Equipment",776127.45,51051.040000000001,0,0,827178.49,-164997.93399999995,662180.5560000001,null,-690422.83,-7801.1799999999994,0,0,-698224.01,139207.03799999997,-559016.97200000007,103163.58400000003]
[47,1985,"Miscellaneous Fixed Assets",null,null,null,null,0,null,0,null,null,null,null,null,0,null,0,0]
[47,1990,"Other Tangible Property",null,null,null,null,0,null,0,null,null,null,null,null,0,null,0,0]
[47,1995,"Contributions & Grants",-9791083.3000000007,-1062493.0699999998,185285.2,-117411.35,-10785702.520000001,0,-10785702.520000001,null,1922691.4900000002,225553.89,-77035.81,12857.44,2084067.0100000002,0,2084067.0100000002,-8701635.5100000016]
[47,2440,"Deferred Revenue5",null,null,null,null,0,null,0,null,null,null,null,null,null,null,0,0]
[null,null,null,null,null,null,null,null,null,null,null,null,null,null,null,null,null,{"$f":"L64+M64+N64","v":0},{"$f":"J64+R64","v":0}]
[null,null,"Sub-Total",{"$f":"SUM(D17:D64)","v":110282519.81000005},12428651.339999998,-3815076.1799999997,{"$f":"SUM(G17:G64)","v":-61173.460000000807},{"$f":"SUM(H17:H64)","v":118834921.50999999},{"$f":"SUM(I17:I64)","v":-9629564.5607799981},{"$f":"SUM(J17:J64)","v":109205356.94921999},null,{"$f":"SUM(L17:L64)","v":-44401003.790000014},{"$f":"SUM(M17:M64)","v":-5340241.42},2234795.0700000003,-43380.450000000128,-47549830.590000011,6145034.4415399972,-41404796.148460008,67800560.800760001]
[]
[null,2055,"Asset Under Construction",2557005.8099999996,886238.52,0,104553.91,{"$f":"D67+E67+F67+G67","v":3547798.2399999998},null,{"$f":"H67+I67","v":3547798.2399999998},null,null,null,null,null,null,null,null,{"$f":"J67+R67","v":3547798.2399999998}]
[null,null,"Less Socialized Renewable Energy Generation Investments (input as negative)",null,null,null,null,null,null,{"$f":"D68+E68+F68","v":0},null,null,null,null,null,null,null,{"$f":"L68+M68+N68","v":0},{"$f":"J68+R68","v":0}]
[null,null,"Less Other Non Rate-Regulated Utility Assets (input as negative)",null,null,null,null,null,null,{"$f":"D69+E69+F69","v":0},null,null,null,null,null,null,null,0,0]
[null,null,"Total PP&E",{"$f":"SUM(D65:D69)","v":112839525.62000005},{"$f":"SUM(E65:E69)","v":13314889.859999998},{"$f":"SUM(F65:F69)","v":-3815076.1799999997},{"$f":"SUM(G65:G69)","v":43380.449999999197},122382719.74999999,-9629564.5607799981,{"$f":"SUM(J65:J69)","v":112753155.18921998},null,{"$f":"SUM(L65:L69)","v":-44401003.790000014},{"$f":"SUM(M65:M69)","v":-5340241.42},{"$f":"SUM(N65:N69)","v":2234795.0700000003},{"$f":"SUM(O65:O69)","v":-43380.450000000128},-47549830.590000011,6145034.4415399972,-41404796.148460008,71348359.040759996]
[null,null,"Depreciation Expense adj. from gain or loss on the retirement of assets (pool of like assets), if applicable6"]
[null,null,"Total",null,null,null,null,null,null,null,null,null,{"$f":"M70+M71","v":-5340241.42}]
[]
[null,null,null,null,null,null,null,null,null,null,null,"Less: Fully Allocated Depreciation"]
[10,null,"Transportation",null,null,null,null,null,null,null,null,"Transportation",null,{"$f":"M48+M49","v":-352156.91000000003}]
[8,null,"Stores Equipment",null,null,null,null,null,null,null,null,"Stores Equipment"]
[null,null,null,null,null,null,null,null,null,null,null,"Net Depreciation",null,{"$f":"M72-N75-N76","v":-4988084.51}]
[]
["Notes:"]
[]
[1,"Tables in the format outlined above covering all fixed asset accounts should be submitted for the Test Year, Bridge Year and all relevant historical years.  At a minimum , the applicant must provide data for the earlier of: 1) all historical years back to its last rebasing; or 2) at least three years of historical actuals, in addition to Bridge Year and Test Year forecasts."]
[]
[]
[2,"The \"CCA Class\" for fixed assets should agree with the CCA Class used for tax purposes in Tax Returns. Fixed Assets sub-components may be used where the underlying asset components are classified under multiple CCA Classes for tax purposes. If an applicant uses any different classes from those shown in the table, an explanation should be provided. (also see note 3)."]
[]
[]
[3,"The table may need to be customized for a utility's asset categories or for any new asset accounts announced or authorized by the Board."]
[]
[4,"The additions in column (E) must not include construction work in progress (CWIP)."]
[]
[5,"Effective on the date of IFRS adoption, customer contributions will no longer be recorded in Account 1995 Contributions & Grants, but will be recorded in Account 2440, Deferred Revenues.  "]
[]
[6,"Where a distributor for general financial reporting purposes under IFRS has accounted for the amount of gain or loss on the retirement of assets in a pool of like assets as a charge or credit to income, for reporting and rate application filings, the distributor shall reclassify such gains and losses as depreciation expense, and disclose the amount separately."]
[]
[]
[]
[]
[]
["Fixed Asset Continuity Schedule 1 "]
[]
[null,null,null,null,"Accounting Standard","MIFRS"]
[null,null,null,null,"Year ",2014]
[]
[null,null,null,"Cost",null,null,null,null,null,null,null,null,"Accumulated Depreciation"]
["CCA Class 2","OEB Account 3","Description 3","Opening Balance","Additions 4","Disposals","Adjustments","Cost End of Period","Allocations","Closing Balance",null,"Opening Balance","Additions","Disposals","Adjustments","Cost End of Period","Allocations","Closing Balance","Net Book Value"]
["ECE",1608,"Franchises & Consents",156053,0,0,0,{"$f":"D106+E106+F106+G106","v":156053},0,{"$f":"H106+I106","v":156053},null,-39013.30000000001,-3901.33,0,0,{"$f":"L106+M106+N106+O106","v":-42914.630000000012},0,{"$f":"P106+Q106","v":-42914.630000000012},{"$f":"J106+R106","v":113138.37}]
[1,1610,"Misc. Intangible Plant",40575.65,0,0,0,40575.65,0,{"$f":"H107+I107","v":40575.65},null,-4695,-1014.4,0,0,{"$f":"L107+M107+N107+O107","v":-5709.4},0,{"$f":"P107+Q107","v":-5709.4},34866.25]
[12,1611,"Computer Software (Formally known as Account 1925)",472312.72000000067,325866.36,0,0,{"$f":"D108+E108+F108+G108","v":798179.08000000066},0,798179.08000000066,null,-195161.97999999952,-87607.35,0,0,-282769.32999999949,0,-282769.32999999949,515409.75000000116]
[12,"1611A","Computer Software (Formally known as Account 1925)",9802932.2599999998,597677.69999999995,0,0,{"$f":"D109+E109+F109+G109","v":10400609.959999999},-6816712.9520000005,3583897.0079999985,null,-5959875.4800000004,-600946.42000000004,0,0,-6560821.9000000004,4064611.5448400001,-2496210.3551600003,1087686.6528399982]
["CEC",1612,"Land Rights (Formally known as Account 1906)",317588.92000000004,3463.31,0,0,321052.23000000004,0,321052.23000000004,null,-92068.569999999992,-6726.1,0,0,-98794.67,0,-98794.67,222257.56000000006]
["N/A",1805,"Land",208083.80999999997,0,0,0,208083.80999999997,0,208083.80999999997,null,0,0,0,0,0,0,0,208083.80999999997]
[47,1808,"Buildings",3966736.4899999998,0,0,0,3966736.4899999998,0,3966736.4899999998,null,-1049315.1499999999,-79334.740000000005,0,0,-1128649.8899999999,0,-1128649.8899999999,2838086.5999999996]
[13,1810,"Leasehold Improvements",null,null,null,null,0,null,0,null,null,null,null,null,0,null,0,0]
[47,1815,"Transformer Station Equipment >50 kV",null,null,null,null,0,null,0,null,null,null,null,null,0,null,0,0]
[47,1820,"Distribution Station Equipment <50 kV",10462057.689999999,68089.89,0,0,10530147.58,0,10530147.58,null,-2940514.94,-200610.62,0,0,-3141125.56,0,-3141125.56,7389022.0199999996]
[47,"1820A","Distribution Station Equipment <50 kV",1660108.52,39222.5,0,0,1699331.02,0,1699331.02,null,-247436.75,-40911.919999999998,0,0,-288348.67,0,-288348.67,1410982.35]
[47,1825,"Storage Battery Equipment",null,null,null,null,0,null,0,null,null,null,null,null,0,null,0,0]
[47,1830,"Poles, Towers & Fixtures",21988721.98,1151612.51,-22249.55,0,23118084.940000001,0,23118084.940000001,null,-9384979.7400000021,-521419.6,19026.580000000002,0,-9887372.7600000016,0,-9887372.7600000016,13230712.18]
[47,1835,"Overhead Conductors & Devices",27887833.160000004,1860391.7,-2659.95,0,29745564.910000004,0,29745564.910000004,null,-8543974.6099999994,-644336.75,2659.91,0,-9185651.4499999993,0,-9185651.4499999993,20559913.460000005]
[47,1840,"Underground Conduit",1061294.6199999999,7390.77,0,0,1068685.3899999999,0,1068685.3899999999,null,-333842.61,-66351.789999999994,0,0,-400194.39999999997,0,-400194.39999999997,668490.99]
[47,1845,"Underground Conductors & Devices",7983677.7199999997,514084.9,-352.47,0,8497410.1499999985,0,8497410.1499999985,null,-1865497.96,-203563.43,352.46,0,-2068708.93,0,-2068708.93,6428701.2199999988]
[47,1850,"Line Transformers",14044538.590000002,597714.12,-0.01,0,14642252.700000001,0,14642252.700000001,null,-5310582.09,-405854.86,0,0,-5716436.9500000002,0,-5716436.9500000002,8925815.75]
[47,1855,"Services (Overhead & Underground)",9752920.5099999998,555333.67000000004,0,0,10308254.18,0,10308254.18,null,-2824555.48,-223789.52,0,0,-3048345,0,-3048345,7259909.1799999997]
[47,1860,"Meters",471620.11999999918,47380.15,0,0,519000.2699999992,0,519000.2699999992,null,-141168.92999999993,-31847.72,0,-48.84,-173065.48999999993,0,-173065.48999999993,345934.77999999927]
[47,"1860A","Meters (Smart Meters)",5064616.9099999992,115923.85,0,0,5180540.7599999988,0,5180540.7599999988,null,-1364232.26,-399932.56,0,0,-1764164.82,0,-1764164.82,3416375.9399999985]
[47,"1860B","Meters",549292.64,30064.32,0,0,579356.96,0,579356.96,null,-290746.77,-20050.490000000002,0,0,-310797.26,0,-310797.26,268559.69999999995]
[1,1865,"D Other Install on Cust Prem",133772.13,165.84,0,0,133937.97,0,133937.97,null,-44075.460000000006,-13432.96,0,0,-57508.420000000006,0,-57508.420000000006,76429.549999999988]
[null,1875,"D St Lites & Signal Systems",0,0,0,0,0,0,0,null,0,0,0,0,0,0,0,0]
["N/A",1905,"Land",null,null,null,null,0,null,0,null,null,null,null,null,0,null,0,0]
[47,1908,"Buildings & Fixtures",890495.2699999999,15885,0,0,906380.2699999999,0,906380.2699999999,null,-188167.18999999997,-18004.2,0,0,-206171.38999999998,0,-206171.38999999998,700208.87999999989]
[13,1910,"Leasehold Improvements",695249.88000000012,144925.24,0,0,840175.12000000011,0,840175.12000000011,null,-222879.51,-151098.01,0,0,-373977.52,0,-373977.52,466197.60000000009]
[8,1915,"Office Furniture & Equipment (10 years)",1364864.6399999997,66159.600000000006,0,0,1431024.2399999998,-352440.19188,1078584.0481199997,null,-1285199.5999999996,-27878.32,0,0,-1313077.9199999997,323073.90612,-990004.01387999975,88580.03423999995]
[8,1915,"Office Furniture & Equipment (5 years)",null,null,null,null,0,null,0,null,null,null,null,null,0,null,0,0]
[10,1920,"Computer Equipment - Hardware",3439751.0800000005,272714.13,0,0,3712465.2100000004,-2376526.2936800001,1335938.9163200003,null,-2471202.88,-379764.07,0,0,-2850966.9499999997,1822643.65444,-1028323.2955599998,307615.62076000054]
[45,1920,"Computer Equip.-Hardware(Post Mar. 22/04)",null,null,null,null,0,null,0,null,null,null,null,null,0,null,0,0]
[45.1,1920,"Computer Equip.-Hardware(Post Mar. 19/07)",null,null,null,null,0,null,0,null,null,null,null,null,0,null,0,0]
[10,1930,"Transportation Equipment (5 years)",583100.88999999966,137343.59,-126115.75,0,594328.72999999963,0,594328.72999999963,null,-371726.69999999995,-94804.24,126115.75,0,-340415.18999999994,0,-340415.18999999994,253913.53999999969]
[10,"1930A","Transportation Equipment (10 years)",3069873.88,559753.64,-231596.1,0,3398031.42,-760284.91728000005,2637746.5027199998,null,-1676361.6600000001,-292107.19,221486.81,0,-1746982.04,399580.80372000003,-1347401.2362800001,1290345.2664399997]
[8,1935,"Stores Equipment",166638.13,0,0,0,166638.13,-41992.80876,124645.32124,null,-159276.44,-4627.6499999999996,0,0,-163904.09,41303.830679999999,-122600.25932,2045.0619200000074]
[8,1940,"Tools, Shop & Garage Equipment",765736.55000000016,60961.25,0,0,826697.80000000016,-195518.88215999998,631178.91784000024,null,-671123.92,-18490.84,0,0,-689614.76,169163.38152,-520451.37848000001,110727.53936000023]
[8,1945,"Measurement & Testing Equipment",478243.76,30925.59,0,0,509169.35000000003,-123353.52876,385815.82124000002,null,-437618.35999999987,-17061.27,0,0,-454679.62999999989,110102.68332,-344576.94667999988,41238.874560000142]
[8,1950,"Power Operated Equipment",109339.40000000001,0,0,0,109339.40000000001,0,109339.40000000001,null,-95320.63,-2413.6799999999998,0,0,-97734.31,0,-97734.31,11605.090000000011]
[8,1955,"Communications Equipment",1062865.1100000001,43238.53,0,0,1106103.6400000001,-270242.08344000002,835861.55656000017,null,-612102.52,-83360.2,0,0,-695462.72,166761.77615999998,-528700.94383999996,307160.61272000021]
[8,1955,"Communication Equipment (Smart Meters)",null,null,null,null,0,null,0,null,null,null,null,null,0,null,0,0]
[8,1960,"Miscellaneous Equipment (10 years)",75036.909999999974,0,0,0,75036.909999999974,-35024.895359999995,40012.014639999979,null,-53442.46,-7503.69,0,0,-60946.15,30926.213640000002,-30019.93636,9992.0782799999797]
[8,"1960A","Miscellaneous Equipment  (5 years)",67512.600000000006,20900,0,0,88412.6,0,88412.6,null,-59514.64,-5455.37,0,0,-64970.01,0,-64970.01,23442.590000000004]
[47,1975,"Load Management Controls Utility Premises",null,null,null,null,0,null,0,null,null,null,null,null,0,null,0,0]
[47,1980,"System Supervisor Equipment",827178.49,7683.35,0,0,834861.84,-209833.60104000001,625028.23895999999,null,-698224.01,-10656.19,0,0,-708880.2,178086.22776000001,-530793.97223999992,94234.266720000072]
[47,1985,"Miscellaneous Fixed Assets",null,null,null,null,0,null,0,null,null,null,null,null,0,null,0,0]
[47,1990,"Other Tangible Property",null,null,null,null,0,null,0,null,null,null,null,null,0,null,0,0]
[47,1995,"Contributions & Grants",-10785702.520000001,-1658435.32,9035.2099999999991,-8369.4699999999993,-12443472.100000001,0,-12443472.100000001,null,2084067.0100000002,240460.43,-576.5,0,2323950.9400000004,0,2323950.9400000004,-10119521.16]
[47,2440,"Deferred Revenue5",null,null,null,null,0,null,0,null,null,null,null,null,null,null,0,0]
[null,null,null,null,null,null,null,null,null,null,null,null,null,null,null,null,null,{"$f":"L153+M153+N153","v":0},0]
[null,null,"Sub-Total",{"$f":"SUM(D106:D153)","v":118834921.50999999},{"$f":"SUM(E106:E153)","v":5616436.1899999985},{"$f":"SUM(F106:F153)","v":-373938.62},{"$f":"SUM(G106:G153)","v":-8369.4699999999993},{"$f":"SUM(H106:H153)","v":124069049.60999998},{"$f":"SUM(I106:I153)","v":-11181930.15436},{"$f":"SUM(J106:J153)","v":112887119.45563996},null,{"$f":"SUM(L106:L153)","v":-47549830.590000011},{"$f":"SUM(M106:M153)","v":-4424397.0500000017},{"$f":"SUM(N106:N153)","v":369065.01},{"$f":"SUM(O106:O153)","v":-48.84},{"$f":"SUM(P106:P153)","v":-51605211.470000014},{"$f":"SUM(Q106:Q153)","v":7306254.0221999995},{"$f":"SUM(R106:R153)","v":-44298957.44780001},{"$f":"SUM(S106:S153)","v":68588162.007840008}]
[]
[null,2055,"Asset Under Construction",3547798.2399999998,1267995.79,0,0,{"$f":"D156+E156+F156+G156","v":4815794.0299999993},0,{"$f":"H156+I156","v":4815794.0299999993},null,null,null,null,null,null,null,null,{"$f":"J156+R156","v":4815794.0299999993}]
[null,null,"Less Socialized Renewable Energy Generation Investments (input as negative)",null,null,null,null,null,null,{"$f":"D157+E157+F157","v":0},null,null,null,null,null,null,null,{"$f":"L157+M157+N157","v":0},0]
[null,null,"Less Other Non Rate-Regulated Utility Assets (input as negative)",null,null,null,null,null,null,0,null,null,null,null,null,null,null,0,0]
[null,null,"Total PP&E",{"$f":"SUM(D154:D158)","v":122382719.74999999},{"$f":"SUM(E154:E158)","v":6884431.9799999986},{"$f":"SUM(F154:F158)","v":-373938.62},{"$f":"SUM(G154:G158)","v":-8369.4699999999993},{"$f":"SUM(H154:H158)","v":128884843.63999999},{"$f":"SUM(I154:I158)","v":-11181930.15436},{"$f":"SUM(J154:J158)","v":117702913.48563996},null,{"$f":"SUM(L154:L158)","v":-47549830.590000011},{"$f":"SUM(M154:M158)","v":-4424397.0500000017},{"$f":"SUM(N154:N158)","v":369065.01},{"$f":"SUM(O154:O158)","v":-48.84},{"$f":"SUM(P154:P158)","v":-51605211.470000014},{"$f":"SUM(Q154:Q158)","v":7306254.0221999995},{"$f":"SUM(R154:R158)","v":-44298957.44780001},{"$f":"SUM(S154:S158)","v":73403956.037840009}]
[null,null,"Depreciation Expense adj. from gain or loss on the retirement of assets (pool of like assets), if applicable6"]
[null,null,"Total",null,null,null,null,null,null,null,null,null,{"$f":"M159+M160","v":-4424397.0500000017}]
[]
[null,null,null,null,null,null,null,null,null,null,null,"Less: Fully Allocated Depreciation"]
[10,null,"Transportation",null,null,null,null,null,null,null,null,"Transportation",null,{"$f":"M137+M138","v":-386911.43}]
[8,null,"Stores Equipment",null,null,null,null,null,null,null,null,"Stores Equipment"]
[null,null,null,null,null,null,null,null,null,null,null,"Net Depreciation",null,{"$f":"M161-N164-N165","v":-4037485.6200000015}]
[]
[]
[]
["Fixed Asset Continuity Schedule 1 "]
[]
[null,null,null,null,"Accounting Standard","MIFRS"]
[null,null,null,null,"Year ",2015]
[]
[null,null,null,"Cost",null,null,null,null,null,null,null,null,"Accumulated Depreciation"]
["CCA Class 2","OEB Account 3","Description 3","Opening Balance","Additions 4","Disposals","Adjustments","Cost End of Period","Allocations","Closing Balance",null,"Opening Balance","Additions","Disposals","Adjustments","Cost End of Period","Allocations","Closing Balance","Net Book Value"]
["ECE",1608,"Franchises & Consents",156053,0,0,0,{"$f":"D177+E177+F177+G177","v":156053},0,{"$f":"H177+I177","v":156053},null,-42914.630000000012,-3901.3300000000017,0,0,{"$f":"L177+M177+N177+O177","v":-46815.960000000014},0,{"$f":"P177+Q177","v":-46815.960000000014},{"$f":"J177+R177","v":109237.03999999998}]
[1,1610,"Misc. Intangible Plant",40575.65,0,0,0,40575.65,0,{"$f":"H178+I178","v":40575.65},null,-5709.4,-1014.4000000000002,0,0,{"$f":"L178+M178+N178+O178","v":-6723.8},0,{"$f":"P178+Q178","v":-6723.8},33851.85]
[12,1611,"Computer Software (Formally known as Account 1925)",798179.08000000066,166492.41,0,0,{"$f":"D179+E179+F179+G179","v":964671.49000000069},0,964671.49000000069,null,-282769.32999999949,-136486.73000000001,0,0,-419256.05999999947,0,-419256.05999999947,545415.43000000122]
[12,"1611A","Computer Software (Formally known as Account 1925)",10400609.959999999,640815.11,-900,0,{"$f":"D180+E180+F180+G180","v":11040525.069999998},-7336039.3948799996,3704485.6751199989,null,-6560821.9000000004,-644279.27,82.5,0,-7205018.6699999999,4558255.06164,-2646763.60836,1057722.0667599989]
["CEC",1612,"Land Rights (Formally known as Account 1906)",321052.23000000004,4866.7200000000012,0,0,325918.95000000007,0,325918.95000000007,null,-98794.67,-6789.8399999999892,0,0,-105584.50999999998,0,-105584.50999999998,220334.44000000009]
["N/A",1805,"Land",208083.80999999997,0,-1430.11,0,206653.69999999998,0,206653.69999999998,null,0,0,0,0,0,0,0,206653.69999999998]
[47,1808,"Buildings",3966736.4899999998,0,-490886.25,0,3475850.2399999998,0,3475850.2399999998,null,-1128649.8899999999,-75244.010000000009,134265.94,0,-1069627.96,0,-1069627.96,2406222.2799999998]
[13,1810,"Leasehold Improvements",null,null,null,null,0,null,0,null,null,null,null,null,0,null,0,0]
[47,1815,"Transformer Station Equipment >50 kV",null,null,null,null,0,null,0,null,null,null,null,null,0,null,0,0]
[47,1820,"Distribution Station Equipment <50 kV",10530147.58,1182592,-34804,0,11677935.58,0,11677935.58,null,-3141125.56,-204090.59,17531.400000000001,0,-3327684.75,0,-3327684.75,8350250.8300000001]
[47,"1820A","Distribution Station Equipment <50 kV",1699331.02,514318.75,0,0,2213649.77,0,2213649.77,null,-288348.67,-42988.87,0,0,-331337.53999999998,0,-331337.53999999998,1882312.23]
[47,1825,"Storage Battery Equipment",null,null,null,null,0,null,0,null,null,null,null,null,0,null,0,0]
[47,1830,"Poles, Towers & Fixtures",23118084.940000001,2578593.3400000008,-29046.22,0,25667632.060000002,0,25667632.060000002,null,-9887372.7600000016,-554028.24999999965,28109.599999999999,0,-10413291.410000002,0,-10413291.410000002,15254340.65]
[47,1835,"Overhead Conductors & Devices",29745564.910000004,2777581.209999999,-5641.14,0,32517504.980000004,0,32517504.980000004,null,-9185651.4499999993,-692556.36999999965,5564.87,0,-9872642.9499999993,0,-9872642.9499999993,22644862.030000005]
[47,1840,"Underground Conduit",1068685.3899999999,104777.59,0,0,1173462.98,0,1173462.98,null,-400194.39999999997,-66671.549999999988,0,0,-466865.94999999995,0,-466865.94999999995,706597.03]
[47,1845,"Underground Conductors & Devices",8497410.1499999985,765723.70000000042,-415.24,0,9262718.6099999994,0,9262718.6099999994,null,-2068708.93,-222321.12999999977,401.93,0,-2290628.1299999994,0,-2290628.1299999994,6972090.4800000004]
[47,1850,"Line Transformers",14642252.700000001,590514.44999999972,0,0,15232767.15,0,15232767.15,null,-5716436.9500000002,-421231.11999999965,0,0,-6137668.0700000003,0,-6137668.0700000003,9095099.0800000001]
[47,1855,"Services (Overhead & Underground)",10308254.18,571681.77999999991,-0.02,0,10879935.939999999,0,10879935.939999999,null,-3048345,-239196.81999999995,0,0,-3287541.82,0,-3287541.82,7592394.1199999992]
[47,1860,"Meters",519000.2699999992,105090.82,0,0,624091.08999999915,0,624091.08999999915,null,-173065.48999999993,-27923.77,0,0,-200989.25999999992,0,-200989.25999999992,423101.82999999926]
[47,"1860A","Meters (Smart Meters)",5180540.7599999988,320626.28999999998,0,-234064.71,5267102.3399999989,0,5267102.3399999989,null,-1764164.82,-406153.45,0,7802,-2162516.27,0,-2162516.27,3104586.0699999989]
[47,"1860B","Meters",579356.96,13045.86,0,0,592402.81999999995,0,592402.81999999995,null,-310797.26,-18834.009999999998,0,0,-329631.27,0,-329631.27,262771.54999999993]
[1,1865,"D Other Install on Cust Prem",133937.97,0,0,0,133937.97,0,133937.97,null,-57508.420000000006,-13438.529999999999,0,0,-70946.950000000012,0,-70946.950000000012,62991.01999999999]
[null,1875,"D St Lites & Signal Systems",0,0,0,0,0,0,0,null,0,0,0,0,0,0,0,0]
["N/A",1905,"Land",null,null,null,null,0,null,0,null,null,null,null,null,0,null,0,0]
[47,1908,"Buildings & Fixtures",906380.2699999999,32713.799999999981,-26574.32,0,912519.74999999988,0,912519.74999999988,null,-206171.38999999998,-17906.18,5624.74,0,-218452.83,0,-218452.83,694066.91999999993]
[13,1910,"Leasehold Improvements",840175.12000000011,44967.329999999958,0,0,885142.45000000007,0,885142.45000000007,null,-373977.52,-172478.04999999993,0,0,-546455.56999999995,0,-546455.56999999995,338686.88000000012]
[8,1915,"Office Furniture & Equipment (10 years)",1431024.2399999998,69642.090000000098,0,0,1500666.3299999998,-369989.99856000004,1130676.3314399999,null,-1313077.9199999997,-24218.879999999899,0,0,-1337296.7999999996,329023.21535999997,-1008273.5846399995,122402.74680000031]
[8,1915,"Office Furniture & Equipment (5 years)",null,null,null,null,0,null,0,null,null,null,null,null,0,null,0,0]
[10,1920,"Computer Equipment - Hardware",3712465.2100000004,79875.579999999609,0,0,3792340.79,-2427966.1672,1364374.6228,null,-2850966.9499999997,-336959.06000000041,0,0,-3187926.0100000002,2039180.5786800003,-1148745.43132,215629.19148000004]
[45,1920,"Computer Equip.-Hardware(Post Mar. 22/04)",null,null,null,null,0,null,0,null,null,null,null,null,0,null,0,0]
[45.1,1920,"Computer Equip.-Hardware(Post Mar. 19/07)",null,null,null,null,0,null,0,null,null,null,null,null,0,null,0,0]
[10,1930,"Transportation Equipment (5 years)",594328.72999999963,0,0,0,594328.72999999963,0,594328.72999999963,null,-340415.18999999994,-92790.85,0,0,-433206.03999999992,0,-433206.03999999992,161122.68999999971]
[10,"1930A","Transportation Equipment (10 years)",3398031.42,125740.80999999968,-58856.9,0,3464915.3299999996,-774834.36659999995,2690080.9633999998,null,-1746982.04,-302489.88,58692.480000000003,0,-1990779.44,457512.60743999999,-1533266.83256,1156814.1308399998]
[8,1935,"Stores Equipment",166638.13,0,0,0,166638.13,-41992.80876,124645.32124,null,-163904.09,-2734.04000000001,0,0,-166638.13,41992.80876,-124645.32124,0]
[8,1940,"Tools, Shop & Garage Equipment",826697.80000000016,43094.500000000102,0,0,869792.30000000028,-205518.30012000003,664273.99988000025,null,-689614.76,-21200.9,0,0,-710815.66,173432.77560000002,-537382.88439999998,126891.11548000027]
[8,1945,"Measurement & Testing Equipment",509169.35000000003,6022,0,0,515191.35000000003,-124871.07276,390320.27724000002,null,-454679.62999999989,-16985.720000000023,0,0,-471665.34999999992,114062.94900000001,-357602.4009999999,32717.876240000129]
[8,1950,"Power Operated Equipment",109339.40000000001,0,0,0,109339.40000000001,0,109339.40000000001,null,-97734.31,-2413.6800000000094,0,0,-100147.99,0,-100147.99,9191.4100000000035]
[8,1955,"Communications Equipment",1106103.6400000001,7222.8800000001211,0,0,1113326.5200000003,-272062.24920000002,841264.27080000029,null,-695462.72,-78899.139999999985,0,0,-774361.86,186643.15487999999,-587718.70512000006,253545.56568000023]
[8,1955,"Communication Equipment (Smart Meters)",null,null,null,null,0,null,0,null,null,null,null,null,0,null,0,0]
[8,1960,"Miscellaneous Equipment (10 years)",75036.909999999974,9994.5,0,0,85031.409999999974,-37908.657359999997,47122.752639999977,null,-60946.15,-6537.15,0,0,-67483.3,33140.147039999996,-34343.152960000007,12779.59967999997]
[8,"1960A","Miscellaneous Equipment  (5 years)",88412.6,2974,0,0,91386.6,0,91386.6,null,-64970.01,-7013.89,0,0,-71983.900000000009,0,-71983.900000000009,19402.699999999997]
[47,1975,"Load Management Controls Utility Premises",null,null,null,null,0,null,0,null,null,null,null,null,0,null,0,0]
[47,1980,"System Supervisor Equipment",834861.84,211954.34999999998,0,0,1046816.19,-263246.09723999997,783570.09275999991,null,-708880.2,-10737.89,0,0,-719618.09,180792.17604000002,-538825.91395999992,244744.17879999999]
[47,1985,"Miscellaneous Fixed Assets",null,null,null,null,0,null,0,null,null,null,null,null,0,null,0,0]
[47,1990,"Other Tangible Property",null,null,null,null,0,null,0,null,null,null,null,null,0,null,0,0]
[47,1995,"Contributions & Grants",-12443472.100000001,-1264311.3500000001,7158.4,-7158.4,-13707783.450000001,0,-13707783.450000001,null,2323950.9400000004,276450.56,-78.56,0,2600322.9400000004,0,2600322.9400000004,-11107460.510000002]
[47,2440,"Deferred Revenue5",null,null,null,null,0,null,0,null,null,null,null,null,null,null,0,0]
[null,null,null,null,null,null,null,null,null,null,null,null,null,null,null,null,null,{"$f":"L224+M224+N224","v":0},0]
[null,null,"Sub-Total",{"$f":"SUM(D177:D224)","v":124069049.60999998},{"$f":"SUM(E177:E224)","v":9706610.5199999996},{"$f":"SUM(F177:F224)","v":-641395.79999999993},{"$f":"SUM(G177:G224)","v":-241223.11},{"$f":"SUM(H177:H224)","v":132893041.22000001},{"$f":"SUM(I177:I224)","v":-11854429.112679999},{"$f":"SUM(J177:J224)","v":121038612.10732003},null,{"$f":"SUM(L177:L224)","v":-51605211.470000014},{"$f":"SUM(M177:M224)","v":-4594064.7899999972},{"$f":"SUM(N177:N224)","v":250194.9},{"$f":"SUM(O177:O224)","v":7802},{"$f":"SUM(P177:P224)","v":-55941279.359999999},{"$f":"SUM(Q177:Q224)","v":8114035.4744400019},{"$f":"SUM(R177:R224)","v":-47827243.885560006},{"$f":"SUM(S177:S224)","v":73211368.221760005}]
[]
[null,2055,"Asset Under Construction",4815794.0299999993,-1677163.62,0,234064.71,{"$f":"D227+E227+F227+G227","v":3372695.1199999992},0,{"$f":"H227+I227","v":3372695.1199999992},null,null,null,null,-7802,{"$f":"L227+M227+N227+O227","v":-7802},null,{"$f":"P227+Q227","v":-7802},{"$f":"J227+R227","v":3364893.1199999992}]
[null,null,"Less Socialized Renewable Energy Generation Investments (input as negative)",null,null,null,null,null,null,{"$f":"D228+E228+F228","v":0},null,null,null,null,null,null,null,{"$f":"L228+M228+N228","v":0},0]
[null,null,"Less Other Non Rate-Regulated Utility Assets (input as negative)",null,null,null,null,null,null,0,null,null,null,null,null,null,null,0,0]
[null,null,"Total PP&E",{"$f":"SUM(D225:D229)","v":128884843.63999999},{"$f":"SUM(E225:E229)","v":8029446.8999999994},{"$f":"SUM(F225:F229)","v":-641395.79999999993},{"$f":"SUM(G225:G229)","v":-7158.3999999999942},{"$f":"SUM(H225:H229)","v":136265736.34},{"$f":"SUM(I225:I229)","v":-11854429.112679999},{"$f":"SUM(J225:J229)","v":124411307.22732003},null,{"$f":"SUM(L225:L229)","v":-51605211.470000014},{"$f":"SUM(M225:M229)","v":-4594064.7899999972},{"$f":"SUM(N225:N229)","v":250194.9},{"$f":"SUM(O225:O229)","v":0},{"$f":"SUM(P225:P229)","v":-55949081.359999999},{"$f":"SUM(Q225:Q229)","v":8114035.4744400019},{"$f":"SUM(R225:R229)","v":-47835045.885560006},{"$f":"SUM(S225:S229)","v":76576261.34176001}]
[null,null,"Depreciation Expense adj. from gain or loss on the retirement of assets (pool of like assets), if applicable6"]
[null,null,"Total",null,null,null,null,null,null,null,null,null,{"$f":"M230+M231","v":-4594064.7899999972}]
[]
[null,null,null,null,null,null,null,null,null,null,null,"Less: Fully Allocated Depreciation"]
[10,null,"Transportation",null,null,null,null,null,null,null,null,"Transportation",null,{"$f":"M208+M209","v":-395280.73}]
[8,null,"Stores Equipment",null,null,null,null,null,null,null,null,"Stores Equipment"]
[null,null,null,null,null,null,null,null,null,null,null,"Net Depreciation",null,{"$f":"M232-N235-N236","v":-4198784.0599999968}]
[]
[]
["Fixed Asset Continuity Schedule 1 "]
[]
[null,null,null,null,"Accounting Standard","MIFRS"]
[null,null,null,null,"Year ",2016]
[]
[null,null,null,"Cost",null,null,null,null,null,null,null,null,"Accumulated Depreciation"]
["CCA Class 2","OEB Account 3","Description 3","Opening Balance","Additions 4","Disposals","Adjustments","Cost End of Period","Allocations","Closing Balance",null,"Opening Balance","Additions","Disposals","Adjustments","Cost End of Period","Allocations","Closing Balance","Net Book Value"]
["ECE",1608,"Franchises & Consents",156053,0,0,0,{"$f":"D247+E247+F247+G247","v":156053},0,{"$f":"H247+I247","v":156053},null,-46815.960000000014,-3901.33,0,0,{"$f":"L247+M247+N247+O247","v":-50717.290000000015},0,{"$f":"P247+Q247","v":-50717.290000000015},{"$f":"J247+R247","v":105335.70999999999}]
[1,1610,"Misc. Intangible Plant",40575.65,0,0,0,40575.65,0,{"$f":"H248+I248","v":40575.65},null,-6723.8,-1014.4,0,0,{"$f":"L248+M248+N248+O248","v":-7738.2},0,{"$f":"P248+Q248","v":-7738.2},32837.450000000004]
[12,1611,"Computer Software (Formally known as Account 1925)",964671.49000000069,679304.76,0,0,{"$f":"D249+E249+F249+G249","v":1643976.2500000007},0,1643976.2500000007,null,-419256.05999999947,-224456.06599999999,0,0,-643712.12599999947,0,-643712.12599999947,1000264.1240000012]
[12,"1611A","Computer Software (Formally known as Account 1925)",11040525.069999998,{"$f":"889890.76-286000","v":603890.76},0,4500,{"$f":"D250+E250+F250+G250","v":11648915.829999998},0,11648915.829999998,null,-7205018.6699999999,-659095.41799999995,0,-225,-7864339.0879999995,0,-7864339.0879999995,3784576.7419999987]
["CEC",1612,"Land Rights (Formally known as Account 1906)",325918.95000000007,20377.439999999999,0,0,346296.39000000007,0,346296.39000000007,null,-105584.50999999998,-7145.7079999999996,0,0,-112730.21799999998,0,-112730.21799999998,233566.17200000008]
["N/A",1805,"Land",206653.69999999998,4862.28,0,0,211515.97999999998,0,211515.97999999998,null,0,0,0,0,0,0,0,211515.97999999998]
[47,1808,"Buildings",3475850.2399999998,233974.872,0,0,3709825.1119999997,0,3709825.1119999997,null,-1069627.96,-71856.748720000003,0,0,-1141484.70872,0,-1141484.70872,2568340.4032799997]
[13,1810,"Leasehold Improvements",null,null,null,null,0,null,0,null,null,null,null,null,0,null,0,0]
[47,1815,"Transformer Station Equipment >50 kV",null,null,null,null,0,null,0,null,null,null,null,null,0,null,0,0]
[47,1820,"Distribution Station Equipment <50 kV",11677935.58,342800.48800000001,0,0,12020736.068,0,12020736.068,null,-3327684.75,-228542.89488000001,0,0,-3556227.64488,0,-3556227.64488,8464508.4231199995]
[47,"1820A","Distribution Station Equipment <50 kV",2213649.77,1705161.08,0,0,3918810.85,0,3918810.85,null,-331337.53999999998,-76065.093500000003,0,0,-407402.6335,0,-407402.6335,3511408.2165000001]
[47,1825,"Storage Battery Equipment",null,null,null,null,0,null,0,null,null,null,null,null,0,null,0,0]
[47,1830,"Poles, Towers & Fixtures",25667632.060000002,2344592.7119999998,0,0,28012224.772000004,0,28012224.772000004,null,-10413291.410000002,-625580.50013333361,0,0,-11038871.910133336,0,-11038871.910133336,16973352.861866668]
[47,1835,"Overhead Conductors & Devices",32517504.980000004,1311266.1599999999,0,0,33828771.140000001,0,33828771.140000001,null,-9872642.9499999993,-754147.7439999996,0,0,-10626790.693999998,0,-10626790.693999998,23201980.446000002]
[47,1840,"Underground Conduit",1173462.98,208790.21400000001,0,0,1382253.1939999999,0,1382253.1939999999,null,-466865.94999999995,-33948.222139999998,0,0,-500814.17213999992,0,-500814.17213999992,881439.02185999998]
[47,1845,"Underground Conductors & Devices",9262718.6099999994,412826.87,0,0,9675545.4799999986,0,9675545.4799999986,null,-2290628.1299999994,-231806.49587499999,0,0,-2522434.6258749994,0,-2522434.6258749994,7153110.8541249987]
[47,1850,"Line Transformers",15232767.15,1714937.1880000001,0,0,16947704.338,0,16947704.338,null,-6137668.0700000003,-452735.75485000003,0,0,-6590403.8248500004,0,-6590403.8248500004,10357300.513149999]
[47,1855,"Services (Overhead & Underground)",10879935.939999999,724666.45600000001,0,0,11604602.396,0,11604602.396,null,-3287541.82,-258128.24069999999,0,0,-3545670.0606999998,0,-3545670.0606999998,8058932.3353000004]
[47,1860,"Meters",624091.08999999915,0,0,0,624091.08999999915,0,624091.08999999915,null,-200989.25999999992,-19815.34,0,0,-220804.59999999992,0,-220804.59999999992,403286.48999999923]
[47,"1860A","Meters (Smart Meters)",5267102.3399999989,228499.79399999999,-79179,244864.71,5661287.8439999986,0,5661287.8439999986,null,-2162516.27,-432949.29980000004,31289,-23767,-2587943.5698000002,0,-2587943.5698000002,3073344.2741999985]
[47,"1860B","Meters",592402.81999999995,79806.725999999995,0,0,672209.54599999997,0,672209.54599999997,null,-329631.27,-19359.502099999998,0,0,-348990.7721,0,-348990.7721,323218.77389999997]
[1,1865,"D Other Install on Cust Prem",133937.97,0,0,0,133937.97,0,133937.97,null,-70946.950000000012,-13393.79,0,0,-84340.74000000002,0,-84340.74000000002,49597.229999999981]
[null,1875,"D St Lites & Signal Systems",0,0,0,0,0,0,0,null,0,0,0,0,0,0,0,0]
["N/A",1905,"Land",null,null,null,null,0,null,0,null,null,null,null,null,0,null,0,0]
[47,1908,"Buildings & Fixtures",912519.74999999988,20000.04,0,0,932519.78999999992,0,932519.78999999992,null,-218452.83,-18450.420399999999,0,0,-236903.25039999999,0,-236903.25039999999,695616.5395999999]
[13,1910,"Leasehold Improvements",885142.45000000007,49746.12,0,0,934888.57000000007,0,934888.57000000007,null,-546455.56999999995,-131175.88200000001,0,0,-677631.45199999993,0,-677631.45199999993,257257.11800000013]
[8,1915,"Office Furniture & Equipment (10 years)",1500666.3299999998,23000.04,0,0,1523666.3699999999,0,1523666.3699999999,null,-1337296.7999999996,-24719.092000000001,0,0,-1362015.8919999995,0,-1362015.8919999995,161650.47800000035]
[8,1915,"Office Furniture & Equipment (5 years)",null,null,null,null,0,null,0,null,null,null,null,null,0,null,0,0]
[10,1920,"Computer Equipment - Hardware",3792340.79,{"$f":"522767.56-47000","v":475767.56},0,0,4268108.3499999996,0,4268108.3499999996,null,-3187926.0100000002,-298641.64600000001,0,0,-3486567.6560000004,0,-3486567.6560000004,781540.6939999992]
[45,1920,"Computer Equip.-Hardware(Post Mar. 22/04)",null,null,null,null,0,null,0,null,null,null,null,null,0,null,0,0]
[45.1,1920,"Computer Equip.-Hardware(Post Mar. 19/07)",null,null,null,null,0,null,0,null,null,null,null,null,0,null,0,0]
[10,1930,"Transportation Equipment (5 years)",594328.72999999963,72699.959999999992,0,0,667028.68999999959,0,667028.68999999959,null,-433206.03999999992,-75810.535999999993,0,0,-509016.57599999988,0,-509016.57599999988,158012.11399999971]
[10,"1930A","Transportation Equipment (10 years)",3464915.3299999996,294300,0,0,3759215.3299999996,0,3759215.3299999996,null,-1990779.44,-302671.96000000002,0,0,-2293451.4,0,-2293451.4,1465763.9299999997]
[8,1935,"Stores Equipment",166638.13,0,0,0,166638.13,0,166638.13,null,-166638.13,0,0,0,-166638.13,0,-166638.13,0]
[8,1940,"Tools, Shop & Garage Equipment",869792.30000000028,50000.04,0,0,919792.34000000032,0,919792.34000000032,null,-710815.66,-25395.082000000002,0,0,-736210.74200000009,0,-736210.74200000009,183581.59800000023]
[8,1945,"Measurement & Testing Equipment",515191.35000000003,0,0,0,515191.35000000003,0,515191.35000000003,null,-471665.34999999992,-12126.96,0,0,-483792.30999999994,0,-483792.30999999994,31399.040000000095]
[8,1950,"Power Operated Equipment",109339.40000000001,18000,0,0,127339.40000000001,0,127339.40000000001,null,-100147.99,-3313.68,0,0,-103461.67,0,-103461.67,23877.73000000001]
[8,1955,"Communications Equipment",1113326.5200000003,35160,0,0,1148486.5200000003,0,1148486.5200000003,null,-774361.86,-80212.259999999995,0,0,-854574.12,0,-854574.12,293912.40000000026]
[8,1955,"Communication Equipment (Smart Meters)",null,null,null,null,0,null,0,null,null,null,null,null,0,null,0,0]
[8,1960,"Miscellaneous Equipment (10 years)",85031.409999999974,0,0,0,85031.409999999974,0,85031.409999999974,null,-67483.3,-4358.0600000000004,0,0,-71841.36,0,-71841.36,13190.049999999974]
[8,"1960A","Miscellaneous Equipment  (5 years)",91386.6,0,0,0,91386.6,0,91386.6,null,-71983.900000000009,-4796.59,0,0,-76780.490000000005,0,-76780.490000000005,14606.11]
[47,1975,"Load Management Controls Utility Premises",null,null,null,null,0,null,0,null,null,null,null,null,0,null,0,0]
[47,1980,"System Supervisor Equipment",1046816.19,0,0,0,1046816.19,0,1046816.19,null,-719618.09,-21395.85,0,0,-741013.94,0,-741013.94,305802.25]
[47,1985,"Miscellaneous Fixed Assets",null,null,null,null,0,null,0,null,null,null,null,null,0,null,0,0]
[47,1990,"Other Tangible Property",null,null,null,null,0,null,0,null,null,null,null,null,0,null,0,0]
[47,1995,"Contributions & Grants",-13707783.450000001,-1470207,0,0,-15177990.450000001,0,-15177990.450000001,null,2600322.9400000004,309717.98030555557,0,0,2910040.9203055562,0,2910040.9203055562,-12267949.529694445]
[47,2440,"Deferred Revenue5",null,null,null,null,0,null,0,null,null,null,null,null,null,null,0,0]
[null,null,null,null,null,null,null,null,null,null,null,null,null,null,null,null,null,{"$f":"L294+M294+N294","v":0},0]
[null,null,"Sub-Total",{"$f":"SUM(D247:D294)","v":132893041.22000001},{"$f":"SUM(E247:E294)","v":10184224.559999999},{"$f":"SUM(F247:F294)","v":-79179},{"$f":"SUM(G247:G294)","v":249364.71},{"$f":"SUM(H247:H294)","v":143247451.49000004},{"$f":"SUM(I247:I294)","v":0},{"$f":"SUM(J247:J294)","v":143247451.49000004},null,{"$f":"SUM(L247:L294)","v":-55941279.359999999},{"$f":"SUM(M247:M294)","v":-4807292.5867927773},{"$f":"SUM(N247:N294)","v":31289},{"$f":"SUM(O247:O294)","v":-23992},{"$f":"SUM(P247:P294)","v":-60741274.946792774},{"$f":"SUM(Q247:Q294)","v":0},{"$f":"SUM(R247:R294)","v":-60741274.946792774},{"$f":"SUM(S247:S294)","v":82506176.543207228}]
[]
[null,2055,"Asset Under Construction",3372695.1199999992,-1037000,0,-234064.71,{"$f":"D297+E297+F297+G297","v":2101630.4099999992},0,{"$f":"H297+I297","v":2101630.4099999992},null,-7802,0,0,7802,{"$f":"L297+M297+N297+O297","v":0},null,{"$f":"P297+Q297","v":0},{"$f":"J297+R297","v":2101630.4099999992}]
[null,null,"Less Socialized Renewable Energy Generation Investments (input as negative)",null,null,null,null,null,null,{"$f":"D298+E298+F298","v":0},null,null,null,null,null,null,null,{"$f":"L298+M298+N298","v":0},0]
[null,null,"Less Other Non Rate-Regulated Utility Assets (input as negative)",null,null,null,null,null,null,0,null,null,null,null,null,null,null,0,0]
[null,null,"Total PP&E",{"$f":"SUM(D295:D299)","v":136265736.34},{"$f":"SUM(E295:E299)","v":9147224.5599999987},{"$f":"SUM(F295:F299)","v":-79179},{"$f":"SUM(G295:G299)","v":15300},{"$f":"SUM(H295:H299)","v":145349081.90000004},{"$f":"SUM(I295:I299)","v":0},{"$f":"SUM(J295:J299)","v":145349081.90000004},null,{"$f":"SUM(L295:L299)","v":-55949081.359999999},{"$f":"SUM(M295:M299)","v":-4807292.5867927773},{"$f":"SUM(N295:N299)","v":31289},{"$f":"SUM(O295:O299)","v":-16190},{"$f":"SUM(P295:P299)","v":-60741274.946792774},{"$f":"SUM(Q295:Q299)","v":0},{"$f":"SUM(R295:R299)","v":-60741274.946792774},{"$f":"SUM(S295:S299)","v":84607806.953207225}]
[null,null,"Depreciation Expense adj. from gain or loss on the retirement of assets (pool of like assets), if applicable6"]
[null,null,"Total",null,null,null,null,null,null,null,null,null,{"$f":"M300+M301","v":-4807292.5867927773}]
[]
[null,null,null,null,null,null,null,null,null,null,null,"Less: Fully Allocated Depreciation"]
[10,null,"Transportation",null,null,null,null,null,null,null,null,"Transportation",null,{"$f":"M278+M279","v":-378482.49600000004}]
[8,null,"Stores Equipment",null,null,null,null,null,null,null,null,"Stores Equipment"]
[null,null,null,null,null,null,null,null,null,null,null,"Net Depreciation",null,{"$f":"M302-N305-N306","v":-4428810.090792777}]
[]
[]
["Fixed Asset Continuity Schedule 1 "]
[]
[null,null,null,null,"Accounting Standard","MIFRS"]
[null,null,null,null,"Year ",2017]
[]
[null,null,null,"Cost",null,null,null,null,null,null,null,null,"Accumulated Depreciation"]
["CCA Class 2","OEB Account 3","Description 3","Opening Balance","Additions 4","Disposals","Adjustments","Cost End of Period","Allocations","Closing Balance",null,"Opening Balance","Additions","Disposals","Adjustments","Cost End of Period","Allocations","Closing Balance","Net Book Value"]
["ECE",1608,"Franchises & Consents",156053,0,0,0,{"$f":"D317+E317+F317+G317","v":156053},0,{"$f":"H317+I317","v":156053},null,-50717.290000000015,-3901.33,0,0,{"$f":"L317+M317+N317+O317","v":-54618.620000000017},0,{"$f":"P317+Q317","v":-54618.620000000017},{"$f":"J317+R317","v":101434.37999999998}]
[1,1610,"Misc. Intangible Plant",40575.65,0,0,0,40575.65,0,{"$f":"H318+I318","v":40575.65},null,-7738.2,-1014.4,0,0,{"$f":"L318+M318+N318+O318","v":-8752.6},0,{"$f":"P318+Q318","v":-8752.6},31823.050000000003]
[12,1611,"Computer Software (Formally known as Account 1925)",1643976.2500000007,300530.83999999997,0,0,{"$f":"D319+E319+F319+G319","v":1944507.0900000008},0,1944507.0900000008,null,-643712.12599999947,-320822.84599999996,0,0,-964534.97199999937,0,-964534.97199999937,979972.11800000141]
[12,"1611A","Computer Software (Formally known as Account 1925)",11648915.829999998,973496.48,0,0,{"$f":"D320+E320+F320+G320","v":12622412.309999999},0,12622412.309999999,null,-7864339.0879999995,-719152.58,0,0,-8583491.6679999996,0,-8583491.6679999996,4038920.6419999991]
["CEC",1612,"Land Rights (Formally known as Account 1906)",346296.39000000007,20517.36,0,0,366813.75000000006,0,366813.75000000006,null,-112730.21799999998,-7656.8929999999991,0,0,-120387.11099999998,0,-120387.11099999998,246426.63900000008]
["N/A",1805,"Land",211515.97999999998,123387.42,0,0,334903.39999999997,0,334903.39999999997,null,0,0,0,0,0,0,0,334903.39999999997]
[47,1808,"Buildings",3709825.1119999997,32472.252,0,0,3742297.3639999996,0,3742297.3639999996,null,-1141484.70872,-74521.219960000002,0,0,-1216005.9286799999,0,-1216005.9286799999,2526291.4353199997]
[13,1810,"Leasehold Improvements",null,null,null,null,0,null,0,null,null,null,null,null,0,null,0,0]
[47,1815,"Transformer Station Equipment >50 kV",null,null,null,null,0,null,0,null,null,null,null,null,0,null,0,0]
[47,1820,"Distribution Station Equipment <50 kV",12020736.068,118699.98,0,0,12139436.048,0,12139436.048,null,-3556227.64488,-233157.89955999999,0,0,-3789385.5444399999,0,-3789385.5444399999,8350050.503560001]
[47,"1820A","Distribution Station Equipment <50 kV",3918810.85,1350963.1919999998,0,0,5269774.0419999994,0,5269774.0419999994,null,-407402.6335,-114266.6269,0,0,-521669.26040000003,0,-521669.26040000003,4748104.7815999994]
[47,1825,"Storage Battery Equipment",null,null,null,null,0,null,0,null,null,null,null,null,0,null,0,0]
[47,1830,"Poles, Towers & Fixtures",28012224.772000004,2367461.1360000004,0,0,30379685.908000004,0,30379685.908000004,null,-11038871.910133336,-677934.25400000042,0,0,-11716806.164133336,0,-11716806.164133336,18662879.743866667]
[47,1835,"Overhead Conductors & Devices",33828771.140000001,1347941.04,0,0,35176712.18,0,35176712.18,null,-10626790.693999998,-783126.91066666634,0,0,-11409917.604666665,0,-11409917.604666665,23766794.575333335]
[47,1840,"Underground Conduit",1382253.1939999999,239208.94800000003,0,0,1621462.142,0,1621462.142,null,-500814.17213999992,-26179.303760000003,0,0,-526993.47589999996,0,-526993.47589999996,1094468.6661]
[47,1845,"Underground Conductors & Devices",9675545.4799999986,226194.21599999999,0,0,9901739.6959999986,0,9901739.6959999986,null,-2522434.6258749994,-237143.62945000001,0,0,-2759578.2553249993,0,-2759578.2553249993,7142161.4406749997]
[47,1850,"Line Transformers",16947704.338,1636696.7280000001,0,0,18584401.066,0,18584401.066,null,-6590403.8248500004,-494631.15879999998,0,0,-7085034.9836500008,0,-7085034.9836500008,11499366.082349999]
[47,1855,"Services (Overhead & Underground)",11604602.396,512630.08799999999,0,0,12117232.483999999,0,12117232.483999999,null,-3545670.0606999998,-273594.4975,0,0,-3819264.5581999999,0,-3819264.5581999999,8297967.9257999994]
[47,1860,"Meters",624091.08999999915,0,0,0,624091.08999999915,0,624091.08999999915,null,-220804.59999999992,-19060.7,0,0,-239865.29999999993,0,-239865.29999999993,384225.78999999922]
[47,"1860A","Meters (Smart Meters)",5661287.8439999986,196251.726,0,0,5857539.5699999984,0,5857539.5699999984,null,-2587943.5698000002,-457504.01713333331,0,0,-3045447.5869333334,0,-3045447.5869333334,2812091.983066665]
[47,"1860B","Meters",672209.54599999997,81202.194000000003,0,0,753411.74,0,753411.74,null,-348990.7721,-21123.494100000004,0,0,-370114.26620000001,0,-370114.26620000001,383297.47379999998]
[1,1865,"D Other Install on Cust Prem",133937.97,0,0,0,133937.97,0,133937.97,null,-84340.74000000002,-13393.8,0,0,-97734.540000000023,0,-97734.540000000023,36203.429999999978]
[null,1875,"D St Lites & Signal Systems",0,0,0,0,0,0,0,null,0,0,0,0,0,0,0,0]
["N/A",1905,"Land",null,null,null,null,0,null,0,null,null,null,null,null,0,null,0,0]
[47,1908,"Buildings & Fixtures",932519.78999999992,20000.04,0,0,952519.83,0,952519.83,null,-236903.25039999999,-18850.421200000001,0,0,-255753.6716,0,-255753.6716,696766.15839999996]
[13,1910,"Leasehold Improvements",934888.57000000007,85388.76,0,0,1020277.3300000001,0,1020277.3300000001,null,-677631.45199999993,-114297.5,0,0,-791928.95199999993,0,-791928.95199999993,228348.37800000014]
[8,1915,"Office Furniture & Equipment (10 years)",1523666.3699999999,23500.080000000002,0,0,1547166.45,0,1547166.45,null,-1362015.8919999995,-24963.998000000003,0,0,-1386979.8899999994,0,-1386979.8899999994,160186.56000000052]
[8,1915,"Office Furniture & Equipment (5 years)",null,null,null,null,0,null,0,null,null,null,null,null,0,null,0,0]
[10,1920,"Computer Equipment - Hardware",4268108.3499999996,354152.6,0,0,4622260.9499999993,0,4622260.9499999993,null,-3486567.6560000004,-311497.82199999999,0,0,-3798065.4780000006,0,-3798065.4780000006,824195.47199999867]
[45,1920,"Computer Equip.-Hardware(Post Mar. 22/04)",null,null,null,null,0,null,0,null,null,null,null,null,0,null,0,0]
[45.1,1920,"Computer Equip.-Hardware(Post Mar. 19/07)",null,null,null,null,0,null,0,null,null,null,null,null,0,null,0,0]
[10,1930,"Transportation Equipment (5 years)",667028.68999999959,17500,0,0,684528.68999999959,0,684528.68999999959,null,-509016.57599999988,-64416.551999999996,0,0,-573433.12799999991,0,-573433.12799999991,111095.56199999969]
[10,"1930A","Transportation Equipment (10 years)",3759215.3299999996,157500,0,0,3916715.3299999996,0,3916715.3299999996,null,-2293451.4,-301570.53000000003,0,0,-2595021.9299999997,0,-2595021.9299999997,1321693.3999999999]
[8,1935,"Stores Equipment",166638.13,0,0,0,166638.13,0,166638.13,null,-166638.13,0,0,0,-166638.13,0,-166638.13,0]
[8,1940,"Tools, Shop & Garage Equipment",919792.34000000032,60000,0,0,979792.34000000032,0,979792.34000000032,null,-736210.74200000009,-30699.874,0,0,-766910.61600000004,0,-766910.61600000004,212881.72400000028]
[8,1945,"Measurement & Testing Equipment",515191.35000000003,0,0,0,515191.35000000003,0,515191.35000000003,null,-483792.30999999994,-5281.71,0,0,-489074.01999999996,0,-489074.01999999996,26117.330000000075]
[8,1950,"Power Operated Equipment",127339.40000000001,18000,0,0,145339.40000000002,0,145339.40000000002,null,-103461.67,-5113.68,0,0,-108575.35,0,-108575.35,36764.050000000017]
[8,1955,"Communications Equipment",1148486.5200000003,43463.040000000001,0,0,1191949.5600000003,0,1191949.5600000003,null,-854574.12,-82203.012000000002,0,0,-936777.13199999998,0,-936777.13199999998,255172.42800000031]
[8,1955,"Communication Equipment (Smart Meters)",null,null,null,null,0,null,0,null,null,null,null,null,0,null,0,0]
[8,1960,"Miscellaneous Equipment (10 years)",85031.409999999974,0,0,0,85031.409999999974,0,85031.409999999974,null,-71841.36,-3087.6,0,0,-74928.960000000006,0,-74928.960000000006,10102.449999999968]
[8,"1960A","Miscellaneous Equipment  (5 years)",91386.6,0,0,0,91386.6,0,91386.6,null,-76780.490000000005,-4796.59,0,0,-81577.08,0,-81577.08,9809.5200000000041]
[47,1975,"Load Management Controls Utility Premises",null,null,null,null,0,null,0,null,null,null,null,null,0,null,0,0]
[47,1980,"System Supervisor Equipment",1046816.19,0,0,0,1046816.19,0,1046816.19,null,-741013.94,-21401.31,0,0,-762415.25,0,-762415.25,284400.93999999994]
[47,1985,"Miscellaneous Fixed Assets",null,null,null,null,0,null,0,null,null,null,null,null,0,null,0,0]
[47,1990,"Other Tangible Property",null,null,null,null,0,null,0,null,null,null,null,null,0,null,0,0]
[47,1995,"Contributions & Grants",-15177990.450000001,-550000,0,0,-15727990.450000001,0,-15727990.450000001,null,2910040.9203055562,332871.87172222225,0,0,3242912.7920277785,0,3242912.7920277785,-12485077.657972222]
[47,2440,"Deferred Revenue5",null,null,null,null,0,null,0,null,null,null,null,null,null,null,0,0]
[null,null,null,null,null,null,null,null,null,null,null,null,null,null,null,null,null,{"$f":"L364+M364+N364","v":0},0]
[null,null,"Sub-Total",{"$f":"SUM(D317:D364)","v":143247451.49000004},{"$f":"SUM(E317:E364)","v":9757158.1199999973},{"$f":"SUM(F317:F364)","v":0},{"$f":"SUM(G317:G364)","v":0},{"$f":"SUM(H317:H364)","v":153004609.61000004},{"$f":"SUM(I317:I364)","v":0},{"$f":"SUM(J317:J364)","v":153004609.61000004},null,{"$f":"SUM(L317:L364)","v":-60741274.946792774},{"$f":"SUM(M317:M364)","v":-5133494.2883077757},{"$f":"SUM(N317:N364)","v":0},{"$f":"SUM(O317:O364)","v":0},{"$f":"SUM(P317:P364)","v":-65874769.23510053},{"$f":"SUM(Q317:Q364)","v":0},{"$f":"SUM(R317:R364)","v":-65874769.23510053},{"$f":"SUM(S317:S364)","v":87129840.374899492}]
[]
[null,2055,"Asset Under Construction",2101630.4099999992,0,0,0,{"$f":"D367+E367+F367+G367","v":2101630.4099999992},0,{"$f":"H367+I367","v":2101630.4099999992},null,0,0,0,0,{"$f":"L367+M367+N367+O367","v":0},null,{"$f":"P367+Q367","v":0},{"$f":"J367+R367","v":2101630.4099999992}]
[null,null,"Less Socialized Renewable Energy Generation Investments (input as negative)",null,null,null,null,null,null,{"$f":"D368+E368+F368","v":0},null,null,null,null,null,null,null,{"$f":"L368+M368+N368","v":0},0]
[null,null,"Less Other Non Rate-Regulated Utility Assets (input as negative)",null,null,null,null,null,null,0,null,null,null,null,null,null,null,0,0]
[null,null,"Total PP&E",{"$f":"SUM(D365:D369)","v":145349081.90000004},{"$f":"SUM(E365:E369)","v":9757158.1199999973},{"$f":"SUM(F365:F369)","v":0},{"$f":"SUM(G365:G369)","v":0},{"$f":"SUM(H365:H369)","v":155106240.02000004},{"$f":"SUM(I365:I369)","v":0},{"$f":"SUM(J365:J369)","v":155106240.02000004},null,{"$f":"SUM(L365:L369)","v":-60741274.946792774},{"$f":"SUM(M365:M369)","v":-5133494.2883077757},{"$f":"SUM(N365:N369)","v":0},{"$f":"SUM(O365:O369)","v":0},{"$f":"SUM(P365:P369)","v":-65874769.23510053},{"$f":"SUM(Q365:Q369)","v":0},{"$f":"SUM(R365:R369)","v":-65874769.23510053},{"$f":"SUM(S365:S369)","v":89231470.784899488}]
[null,null,"Depreciation Expense adj. from gain or loss on the retirement of assets (pool of like assets), if applicable6"]
[null,null,"Total",null,null,null,null,null,null,null,null,null,{"$f":"M370+M371","v":-5133494.2883077757}]
[]
[null,null,null,null,null,null,null,null,null,null,null,"Less: Fully Allocated Depreciation"]
[10,null,"Transportation",null,null,null,null,null,null,null,null,"Transportation",null,{"$f":"M348+M349","v":-365987.08200000005}]
[8,null,"Stores Equipment",null,null,null,null,null,null,null,null,"Stores Equipment"]
[null,null,null,null,null,null,null,null,null,null,null,"Net Depreciation",null,{"$f":"M372-N375-N376","v":-4767507.2063077753}]

{"sheet":"Appendix 2-BB Service Life  ","index":9,"n_rows":109,"n_cols":17,"rows_kept":109,"cut":false,"hidden":false,"merged":[[88,15,88,16],[30,15,30,16],[102,2,102,4],[102,6,102,7],[105,0,105,7],[99,2,99,4],[99,6,99,7],[100,2,100,4],[100,6,100,7],[101,2,101,4],[101,6,101,7],[96,2,96,4],[96,6,96,7],[97,2,97,4],[97,6,97,7],[98,2,98,4],[98,6,98,7],[94,1,95,1],[94,2,95,2],[94,3,94,4],[94,6,94,7],[95,3,95,4],[95,6,95,7],[90,1,93,1],[90,2,93,2],[90,3,90,4],[90,6,90,7],[91,3,91,4],[91,6,91,7],[92,3,92,4],[92,6,92,7],[93,3,93,4],[93,6,93,7],[87,1,89,1],[87,2,89,2],[87,3,87,4],[87,6,87,7],[89,3,89,4],[89,6,89,7],[83,1,86,1],[83,2,86,2],[83,3,83,4],[83,6,83,7],[84,3,84,4],[84,6,84,7],[85,3,85,4],[85,6,85,7],[86,3,86,4],[86,6,86,7],[88,3,88,4],[88,5,88,7],[81,2,81,4],[81,6,81,7],[82,2,82,4],[82,5,82,7],[75,13,75,14],[75,15,75,16],[76,2,76,4],[77,2,77,4],[77,6,77,7],[75,10,76,10],[75,11,75,12],[78,6,78,7],[79,3,79,4],[73,0,73,7],[75,2,75,4],[75,5,76,7],[75,9,76,9],[79,6,79,7],[80,3,80,4],[80,6,80,7],[70,2,70,4],[61,2,61,4],[62,2,62,4],[63,1,64,1],[63,2,64,2],[63,3,63,4],[64,3,64,4],[78,1,80,1],[78,2,80,2],[78,3,78,4],[60,2,60,4],[50,2,50,4],[51,0,69,0],[51,2,51,4],[52,2,52,4],[53,2,53,4],[54,2,54,4],[55,2,55,4],[56,2,56,4],[65,2,65,4],[66,2,66,4],[67,2,67,4],[68,2,68,4],[69,2,69,4],[34,0,50,0],[34,1,36,1],[34,2,36,2],[34,3,34,4],[35,3,35,4],[44,2,44,4],[45,2,45,4],[46,2,46,4],[47,2,47,4],[48,2,48,4],[49,2,49,4],[57,2,57,4],[58,1,59,1],[58,2,59,2],[58,3,58,4],[59,3,59,4],[39,1,41,1],[39,2,41,2],[39,3,39,4],[40,3,40,4],[41,3,41,4],[42,1,43,1],[42,3,42,4],[43,3,43,4],[36,3,36,4],[37,2,37,4],[38,2,38,4],[16,0,33,0],[16,1,18,1],[16,2,18,2],[16,3,16,4],[17,3,18,3],[25,2,25,4],[26,2,26,4],[27,2,27,4],[28,2,28,4],[31,2,31,4],[19,1,21,1],[19,2,21,2],[19,3,19,4],[20,3,21,3],[22,1,24,1],[22,2,24,2],[22,3,22,4],[23,3,24,3],[14,11,14,12],[14,13,14,14],[32,2,32,4],[33,2,33,4],[14,2,14,4],[14,5,14,7],[14,9,15,9],[14,10,15,10],[8,0,8,16],[9,0,9,16],[10,0,10,16],[14,15,14,16],[15,2,15,4],[29,1,30,1],[29,2,30,2],[29,3,29,4],[30,3,30,4],[30,5,30,7]]}
[null,null,null,null,null,null,null,null,null,null,null,null,"File Number:",null,"EB-2016-0061"]
[null,null,null,null,null,null,null,null,null,null,null,null,"Exhibit:",null,4]
[null,null,null,null,null,null,null,null,null,null,null,null,"Tab:",null,11]
[null,null,null,null,null,null,null,null,null,null,null,null,"Schedule:",null,1]
[null,null,null,null,null,null,null,null,null,null,null,null,"Page:"]
[]
[null,null,null,null,null,null,null,null,null,null,null,null,"Date:",null,"2016-07-07"]
[]
["Appendix 2-BB"]
["Service Life Comparison"]
["Table F-1 from Kinetrics Report1"]
[]
[]
[]
[null,null,"Asset Details",null,null,"Useful Life",null,null,null,"USoA Account Number","USoA Account Description","Current",null,"Proposed",null,"Outside Range of Min, Max TUL?"]
["Parent*","#","Category| Component | Type",null,null,"MIN UL","TUL","MAX UL",null,null,null,"Years","Rate","Years","Rate","Below Min TUL","Above Max TUL"]
["OH",1,"Fully Dressed Wood Poles","Overall",null,35,45,75,null,1830,"Poles, Towers and Fixtures",45,{"$f":"IF(ISERROR(1/L17), \"\", 1/L17)","v":2.2222222222222223E-2},45,{"$f":"IF(ISERROR(1/N17), \"\", 1/N17)","v":2.2222222222222223E-2},{"$f":"IF(ISBLANK(N17),\"\",IF(N17<F17,\"Yes\",\"No\"))","v":"No"},{"$f":"IF(ISBLANK(N17),\"\",IF(N17>H17,\"Yes\",\"No\"))","v":"No"}]
[null,null,null,"Cross Arm","Wood",20,40,55,null,null,null,null,{"$f":"IF(ISERROR(1/L18), \"\", 1/L18)","v":""},null,{"$f":"IF(ISERROR(1/N18), \"\", 1/N18)","v":""},{"$f":"IF(ISBLANK(N18),\"\",IF(N18<F18,\"Yes\",\"No\"))","v":""},{"$f":"IF(ISBLANK(N18),\"\",IF(N18>H18,\"Yes\",\"No\"))","v":""}]
[null,null,null,null,"Steel",30,70,95,null,null,null,null,"",null,"","",""]
[null,2,"Fully Dressed Concrete Poles","Overall",null,50,60,80,null,null,null,null,"",null,"","",""]
[null,null,null,"Cross Arm","Wood",20,40,55,null,null,null,null,"",null,"","",""]
[null,null,null,null,"Steel",30,70,95,null,null,null,null,"",null,"","",""]
[null,3,"Fully Dressed Steel Poles","Overall",null,60,60,80,null,null,null,null,"",null,"","",""]
[null,null,null,"Cross Arm","Wood",20,40,55,null,null,null,null,"",null,"","",""]
[null,null,null,null,"Steel",30,70,95,null,null,null,null,"",null,"","",""]
[null,4,"OH Line Switch",null,null,30,45,55,null,1835,"Overhead Conductors and Devices",45,2.2222222222222223E-2,45,2.2222222222222223E-2,"No","No"]
[null,5,"OH Line Switch Motor",null,null,15,25,25,null,null,null,null,"",null,"","",""]
[null,6,"OH Line Switch RTU",null,null,15,20,20,null,null,null,null,"",null,"","",""]
[null,7,"OH Integral Switches",null,null,35,45,60,null,1835,"Overhead Conductors and Devices",45,2.2222222222222223E-2,45,2.2222222222222223E-2,"No","No"]
[null,8,"OH Conductors","Primary",null,50,60,75,null,1835,"Overhead Conductors and Devices",45,2.2222222222222223E-2,45,2.2222222222222223E-2,"Yes","No"]
[null,null,null,"Service Wire",null,"N/A",null,null,null,1855,"Services",40,2.5000000000000001E-2,40,2.5000000000000001E-2,"N/A"]
[null,9,"OH Transformers & Voltage Regulators",null,null,30,40,60,null,1850,"Line Transformers",40,2.5000000000000001E-2,40,2.5000000000000001E-2,"No","No"]
[null,10,"OH Shunt Capacitor Banks",null,null,25,30,40,null,null,null,null,"",null,"","",""]
[null,11,"Reclosers",null,null,25,40,55,null,1835,"Overhead Conductors and Devices",45,2.2222222222222223E-2,45,2.2222222222222223E-2,"No","No"]
["TS & MS",12,"Power Transformers","Overall",null,30,45,60,null,1820,"Station Equipment < 50 kV",50,0.02,50,0.02,"No","No"]
[null,null,null,"Bushing",null,10,20,30,null,null,null,null,"",null,"","",""]
[null,null,null,"Tap Changer",null,20,30,60,null,null,null,null,"",null,"","",""]
[null,13,"Station Service Transformer",null,null,30,45,55,null,null,null,null,"",null,"","",""]
[null,14,"Station Grounding Transformer",null,null,30,40,40,null,null,null,null,"",null,"","",""]
[null,15,"Station DC System","Overall",null,10,20,30,null,null,null,null,"",null,"","",""]
[null,null,null,"Battery Bank",null,10,15,15,null,null,null,null,"",null,"","",""]
[null,null,null,"Charger",null,20,20,30,null,null,null,null,"",null,"","",""]
[null,16,"Station Metal Clad Switchgear","Overall",null,30,40,60,null,"1820A","Station Equipment < 50 kV",40,2.5000000000000001E-2,40,2.5000000000000001E-2,"No","No"]
[null,null,null,"Removable Breaker",null,25,40,60,null,null,null,null,"",null,"","",""]
[null,17,"Station Independent Breakers",null,null,35,45,65,null,"1820A","Station Equipment < 50 kV",40,2.5000000000000001E-2,40,2.5000000000000001E-2,"No","No"]
[null,18,"Station Switch",null,null,30,50,60,null,"1820A","Station Equipment < 50 kV",40,2.5000000000000001E-2,40,2.5000000000000001E-2,"No","No"]
[null,19,"Electromechanical Relays",null,null,25,35,50,null,null,null,null,"",null,"","",""]
[null,20,"Solid State Relays",null,null,10,30,45,null,null,null,null,"",null,"","",""]
[null,21,"Digital & Numeric Relays",null,null,15,20,20,null,null,null,null,"",null,"","",""]
[null,22,"Rigid Busbars",null,null,30,55,60,null,null,null,null,"",null,"","",""]
[null,23,"Steel Structure",null,null,35,50,90,null,null,null,null,"",null,"","",""]
["UG",24,"Primary Paper Insulated Lead Covered (PILC) Cables",null,null,60,65,75,null,null,null,null,"",null,"","",""]
[null,25,"Primary Ethylene-Propylene Rubber (EPR) Cables",null,null,20,25,25,null,null,null,null,"",null,"","",""]
[null,26,"Primary Non-Tree Retardant (TR) Cross Linked \nPolyethylene (XLPE) Cables Direct Buried",null,null,20,25,30,null,1845,"UG Conductor & Devices",40,2.5000000000000001E-2,40,2.5000000000000001E-2,"No","Yes"]
[null,27,"Primary Non-TR XLPE Cables in Duct",null,null,20,25,30,null,null,null,null,"",null,"","",""]
[null,30,"Secondary PILC Cables",null,null,70,75,80,null,null,null,null,"",null,"","",""]
[null,31,"Secondary Cables Direct Buried",null,null,25,35,40,null,1855,"Services",40,2.5000000000000001E-2,40,2.5000000000000001E-2,"No","No"]
[null,32,"Secondary Cables in Duct",null,null,35,40,60,null,null,null,null,"",null,"","",""]
[null,33,"Network Tranformers","Overall",null,20,35,50,null,null,null,null,"",null,"","",""]
[null,null,null,"Protector",null,20,35,40,null,null,null,null,"",null,"","",""]
[null,34,"Pad-Mounted Transformers",null,null,25,40,45,null,1850,"Line Transformers",40,2.5000000000000001E-2,40,2.5000000000000001E-2,"No","No"]
[null,35,"Submersible/Vault Transformers",null,null,25,35,45,null,null,null,null,"",null,"","",""]
[null,36,"UG Foundation",null,null,35,55,70,null,null,null,null,"",null,"","",""]
[null,37,"UG Vaults","Overall",null,40,60,80,null,null,null,null,"",null,"","",""]
[null,null,null,"Roof",null,20,30,45,null,null,null,null,"",null,"","",""]
[null,38,"UG Vault Switches",null,null,20,35,50,null,null,null,null,"",null,"","",""]
[null,39,"Pad-Mounted Switchgear",null,null,20,30,45,null,null,null,null,"",null,"","",""]
[null,40,"Ducts",null,null,30,50,85,null,1840,"UG Conduit and Manholes",50,0.02,50,0.02,"No","No"]
[null,41,"Concrete Encased Duct Banks",null,null,35,55,80,null,null,null,null,"",null,"","",""]
[null,42,"Cable Chambers",null,null,50,60,80,null,null,null,null,"",null,"","",""]
["S",43,"Remote SCADA",null,null,15,20,30,null,1980,"System Supervisory Equipment",20,0.05,20,0.05,"No","No"]
[]
[]
["Table F-2 from Kinetrics Report1"]
[]
[null,null,"Asset Details",null,null,"Useful Life Range",null,null,null,"USoA Account Number","USoA Account Description","Current",null,"Proposed",null,"Outside Range of Min, Max TUL?"]
[null,"#","Category| Component | Type",null,null,null,null,null,null,null,null,"Years","Rate","Years","Rate","Below Min Range","Above Max Range"]
[null,1,"Office Equipment",null,null,5,15,null,null,1915,"Office Furniture & Equipment",10,{"$f":"IF(ISERROR(1/L78), \"\", 1/L78)","v":0.1},10,{"$f":"IF(ISERROR(1/N78), \"\", 1/N78)","v":0.1},{"$f":"IF(ISBLANK(N78),\"\",IF(N78<F78,\"Yes\",\"No\"))","v":"No"},{"$f":"IF(ISBLANK(N78),\"\",IF(N78>G78,\"Yes\",\"No\"))","v":"No"}]
[null,2,"Vehicles","Trucks & Buckets",null,5,15,null,null,"1930A","Transportation Equipment",10,{"$f":"IF(ISERROR(1/L79), \"\", 1/L79)","v":0.1},10,{"$f":"IF(ISERROR(1/N79), \"\", 1/N79)","v":0.1},{"$f":"IF(ISBLANK(N79),\"\",IF(N79<F79,\"Yes\",\"No\"))","v":"No"},{"$f":"IF(ISBLANK(N79),\"\",IF(N79>G79,\"Yes\",\"No\"))","v":"No"}]
[null,null,null,"Trailers",null,5,20,null,null,"1930A","Transportation Equipment",10,0.1,10,0.1,"No","No"]
[null,null,null,"Vans",null,5,10,null,null,1930,"Transportation Equipment",5,0.2,5,0.2,"No","No"]
[null,3,"Administrative Buildings",null,null,50,75,null,null,1908,"Buildings & Fixtures",50,0.02,50,0.02,"No","No"]
[null,4,"Leasehold Improvements",null,null,"Lease dependent",null,null,null,1910,"Leasehold Improvements",5,0.2,5,0.2]
[null,5,"Station Buildings","Station Buildings",null,50,75,null,null,1808,"Buildings & Fixtures",50,0.02,50,0.02,"No","No"]
[null,null,null,"Parking",null,25,30,null,null,null,null,null,"",null,"","",""]
[null,null,null,"Fence",null,25,60,null,null,null,null,null,"",null,"","",""]
[null,null,null,"Roof",null,20,30,null,null,null,null,null,"",null,"","",""]
[null,6,"Computer Equipment","Hardware",null,3,5,null,null,1920,"Computer Hardware",5,0.2,5,0.2,"No","No"]
[null,null,null,"Software - SAP",null,"N/A",null,null,null,"1611A","Computer Software",10,{"$f":"IF(ISERROR(1/L89), \"\", 1/L89)","v":0.1},10,{"$f":"IF(ISERROR(1/N89), \"\", 1/N89)","v":0.1},"N/A"]
[null,null,null,"Software - Other",null,2,5,null,null,1611,"Computer Software",5,0.2,5,0.2,"No","No"]
[null,7,"Equipment","Power Operated",null,5,10,null,null,1950,"Power Operated Equipment",10,0.1,10,0.1,"No","No"]
[null,null,null,"Stores",null,5,10,null,null,1935,"Stores Equipment",10,0.1,10,0.1,"No","No"]
[null,null,null,"Tools, Shop, Garage Equipment",null,5,10,null,null,1940,"Tools, Shop & Garage Equipment",10,0.1,10,0.1,"No","No"]
[null,null,null,"Measurement & Testing Equipment",null,5,10,null,null,1945,"Measurement & Test Equipment",10,0.1,10,0.1,"No","No"]
[null,8,"Communication","Towers",null,60,70,null,null,null,null,null,"",null,"","",""]
[null,null,null,"Wireless",null,2,10,null,null,1955,"Communication Equipment",10,0.1,10,0.1,"No","No"]
[null,9,"Residential Energy Meters",null,null,25,35,null,null,1860,"Meters",30,3.3333333333333333E-2,30,3.3333333333333333E-2,"No","No"]
[null,10,"Industrial/Commercial Energy Meters",null,null,25,35,null,null,1860,"Meters",30,3.3333333333333333E-2,30,3.3333333333333333E-2,"No","No"]
[null,11,"Wholesale Energy Meters",null,null,15,30,null,null,1860,"Meters",30,3.3333333333333333E-2,30,3.3333333333333333E-2,"No","No"]
[null,12,"Current & Potential Transformer (CT & PT)",null,null,35,50,null,null,"1860B","Meters",30,3.3333333333333333E-2,30,3.3333333333333333E-2,"Yes","No"]
[null,13,"Smart Meters",null,null,5,15,null,null,"1860A","Meters",15,6.6666666666666666E-2,15,6.6666666666666666E-2,"No","No"]
[null,14,"Repeaters - Smart Metering",null,null,10,15,null,null,null,null,null,"",null,"","",""]
[null,15,"Data Collectors - Smart Metering",null,null,15,20,null,null,null,null,null,"",null,"","",""]
[]
[]
["* TS & MS = Transformer and Municipal Stations UG = Underground Systems S = Monitoring and Control Systems"]
[]
["Note 1:","Tables F-1 and F-2 above are to be used as a reference in order to complete columns J, K, L and N."]
[null,"See pages 17-19 of Kinetrics Report"]

{"sheet":"App.2-CA_OldCGAAP_DepExp_2012","index":10,"n_rows":62,"n_cols":12,"rows_kept":62,"cut":false,"hidden":false,"merged":[[58,1,58,11],[59,1,60,9],[61,1,62,11],[8,0,8,11],[9,0,9,11],[14,0,15,0],[14,1,15,1],[14,10,15,10],[10,1,10,10]]}
[null,null,null,null,null,null,null,null,null,null,"File Number:",{"$f":"EBNUMBER","v":"EB-2016-0061"}]
[null,null,null,null,null,null,null,null,null,null,"Exhibit:"]
[null,null,null,null,null,null,null,null,null,null,"Tab:"]
[null,null,null,null,null,null,null,null,null,null,"Schedule:"]
[null,null,null,null,null,null,null,null,null,null,"Page:"]
[]
[null,null,null,null,null,null,null,null,null,null,"Date:"]
[]
["Appendix 2-CA"]
["Depreciation and Amortization Expense"]
[null,"Assumes the applicant made capitalization and depreciation expense accounting policy changes under CGAAP effective January 1, 2012 and has adopted IFRS for financial reporting purposes effective January 1, 2015."]
[]
[null,null,"Year",2012,"Former CGAAP"]
[]
["Account","Description","Opening Regulatory Gross PP&E as at Jan 1, 2012","Less Fully Depreciated","Net for Depreciation","Additions","Total for Depreciation 1","Years","Depreciation Rate","Depreciation Expense","2012 Depreciation Expense per Appendix 2-BA Fixed Assets, Column J \n (l)","Variance 2"]
[null,null,"(a)","(b)","(c)","(d)","(e) = (c) + ½ x (d) ","(f)","(g) = 1 / (f)","(h) = (e) / (f)",null,"(m) = (h) - (l)"]
[1611,"Computer Software (Formally known as Account 1925)",null,null,{"$f":"C17-D17","v":0},null,{"$f":"E17+0.5*F17","v":0},null,{"$f":"IF(H17=0,0,1/H17)","v":0},{"$f":"IF(H17=0,0,G17/H17)","v":0},null,{"$f":"IF(ISERROR(+J17-K17), 0, +J17-K17)","v":0}]
[1612,"Land Rights (Formally known as Account 1906)",null,null,{"$f":"C18-D18","v":0},null,{"$f":"E18+0.5*F18","v":0},null,0,0,null,0]
[1805,"Land",null,null,0,null,0,null,0,0,null,0]
[1808,"Buildings",null,null,0,null,0,null,0,0,null,0]
[1810,"Leasehold Improvements",null,null,0,null,0,null,0,0,null,0]
[1815,"Transformer Station Equipment >50 kV",null,null,0,null,0,null,0,0,null,0]
[1820,"Distribution Station Equipment <50 kV",null,null,0,null,0,null,0,0,null,0]
[1825,"Storage Battery Equipment",null,null,0,null,0,null,0,0,null,0]
[1830,"Poles, Towers & Fixtures",null,null,0,null,0,null,0,0,null,0]
[1835,"Overhead Conductors & Devices",null,null,0,null,0,null,0,0,null,0]
[1840,"Underground Conduit",null,null,0,null,0,null,0,0,null,0]
[1845,"Underground Conductors & Devices",null,null,0,null,0,null,0,0,null,0]
[1850,"Line Transformers",null,null,0,null,0,null,0,0,null,0]
[1855,"Services (Overhead & Underground)",null,null,0,null,0,null,0,0,null,0]
[1860,"Meters",null,null,0,null,0,null,0,0,null,0]
[1860,"Meters (Smart Meters)",null,null,0,null,0,null,0,0,null,0]
[1905,"Land",null,null,0,null,0,null,0,0,null,0]
[1908,"Buildings & Fixtures",null,null,0,null,0,null,0,0,null,0]
[1910,"Leasehold Improvements",null,null,0,null,0,null,0,0,null,0]
[1915,"Office Furniture & Equipment (10 years)",null,null,0,null,0,null,0,0,null,0]
[1915,"Office Furniture & Equipment (5 years)",null,null,0,null,0,null,0,0,null,0]
[1920,"Computer Equipment - Hardware",null,null,0,null,0,null,0,0,null,0]
[1920,"Computer Equip.-Hardware(Post Mar. 22/04)",null,null,0,null,0,null,0,0,null,0]
[1920,"Computer Equip.-Hardware(Post Mar. 19/07)",null,null,0,null,0,null,0,0,null,0]
[1930,"Transportation Equipment",null,null,0,null,0,null,0,0,null,0]
[1935,"Stores Equipment",null,null,0,null,0,null,0,0,null,0]
[1940,"Tools, Shop & Garage Equipment",null,null,0,null,0,null,0,0,null,0]
[1945,"Measurement & Testing Equipment",null,null,0,null,0,null,0,0,null,0]
[1950,"Power Operated Equipment",null,null,0,null,0,null,0,0,null,0]
[1955,"Communications Equipment",null,null,0,null,0,null,0,0,null,0]
[1955,"Communication Equipment (Smart Meters)",null,null,0,null,0,null,0,0,null,0]
[1960,"Miscellaneous Equipment ",null,null,0,null,0,null,0,0,null,0]
[1970,"Load Management Controls Customer Premises",null,null,0,null,0,null,0,0,null,0]
[1975,"Load Management Controls Utility Premises",null,null,0,null,0,null,0,0,null,0]
[1980,"System Supervisor Equipment",null,null,0,null,0,null,0,0,null,0]
[1985,"Miscellaneous Fixed Assets",null,null,0,null,0,null,0,0,null,0]
[1990,"Other Tangible Property",null,null,0,null,0,null,0,0,null,0]
[1995,"Contributions & Grants",null,null,0,null,0,null,0,0,null,0]
[null,"Total",{"$f":"SUM(C17:C54)","v":0},{"$f":"SUM(D17:D54)","v":0},{"$f":"SUM(E17:E54)","v":0},{"$f":"SUM(F17:F54)","v":0},{"$f":"SUM(G17:G54)","v":0},null,null,{"$f":"SUM(J17:J54)","v":0},{"$f":"SUM(K17:K54)","v":0},{"$f":"SUM(L17:L54)","v":0}]
[]
["Notes:"]
[]
[1,"Board policy of the \"half-year\" rule - the applicant must ensure that additions in the year attract a half-year depreciation expense in the first year.  Deviations from this standard practice must be supported in the application."]
[2,"The applicant must provide an explanation of material variances in evidence."]
[]
["General","Applicants must provide a breakdown of depreciation and amortization expense in the above format for all relevant accounts.  Asset Retirement Obligations (AROs), depreciation and accretion expense should be disclosed separately consistent with the Notes of historical Audited Financial Statements."]

{"sheet":"App.2-CB_NewCGAAP_DepExp_2012","index":11,"n_rows":66,"n_cols":15,"rows_kept":66,"cut":false,"hidden":false,"merged":[[8,0,8,14],[9,0,9,14],[10,0,10,14],[14,0,15,0],[14,1,15,1],[14,10,15,10],[14,13,15,13],[65,1,66,14],[58,1,58,14],[59,1,59,14],[60,1,60,14],[61,1,61,14],[62,1,62,14],[63,1,63,14]]}
[null,null,null,null,null,null,null,null,null,null,null,null,null,"File Number:",{"$f":"EBNUMBER","v":"EB-2016-0061"}]
[null,null,null,null,null,null,null,null,null,null,null,null,null,"Exhibit:"]
[null,null,null,null,null,null,null,null,null,null,null,null,null,"Tab:"]
[null,null,null,null,null,null,null,null,null,null,null,null,null,"Schedule:"]
[null,null,null,null,null,null,null,null,null,null,null,null,null,"Page:"]
[]
[null,null,null,null,null,null,null,null,null,null,null,null,null,"Date:"]
[]
["Appendix 2-CB"]
["Depreciation and Amortization Expense"]
["Assumes the applicant made capitalization and depreciation expense accounting policy changes under CGAAP effective January 1, 2012 and has adopted IFRS for financial reporting purposes effective January 1, 2015."]
[]
[null,null,"Year",2012,"Revised CGAAP "]
[]
["Account","Description","Opening NBV as at Jan 1, 2012 5","Additions","Average Remaining Life of Opening NBV 4","Years (new additions only) 3","Depreciation Rate on New Additions","Depreciation Expense on Opening NBV","Depreciation Expense on Additions 1","2012 Depreciation Expense","2012 Depreciation Expense per Appendix 2-BA Fixed Assets, Column J \n (l)","Variance 2","Depreciation Expense on 2012 Full Year Additions","Less Depreciation Expense on Assets Fully Depreciated during the year\n(o)","2012 Full Year Depreciation 6"]
[null,null,"(a)","(d)","(i)","(f)","(g) = 1 / (f)","(j) = (a) / (i)","(h)=((d)*0.5)/(f) ","(k) = (j) + (h)",null,"(m) = (k) - (l)","(n) = (d)/(f) ",null,"(p) = (j) + (n) - (o)"]
[1611,"Computer Software (Formally known as Account 1925)",null,null,null,null,{"$f":"IF(F17=0,0,1/F17)","v":0},{"$f":"IF(E17=0,0,+C17/E17)","v":0},{"$f":"IF(F17=0,0,+(D17*0.5)/F17)","v":0},{"$f":"IF(ISERROR(+H17+I17), 0, +H17+I17)","v":0},null,{"$f":"IF(ISERROR(+J17-K17), 0, +J17-K17)","v":0},{"$f":"IF(F17=0,0,+(D17)/F17)","v":0},null,{"$f":"IF(ISERROR(+M17+H17-N17), 0, +M17+H17-N17)","v":0}]
[1612,"Land Rights (Formally known as Account 1906)",null,null,null,null,0,0,0,0,null,0,0,null,{"$f":"IF(ISERROR(+M18+H18-N18), 0, +M18+H18-N18)","v":0}]
[1805,"Land",null,null,null,null,0,0,0,0,null,0,0,null,0]
[1808,"Buildings",null,null,null,null,0,0,0,0,null,0,0,null,0]
[1810,"Leasehold Improvements",null,null,null,null,0,0,0,0,null,0,0,null,0]
[1815,"Transformer Station Equipment >50 kV",null,null,null,null,0,0,0,0,null,0,0,null,0]
[1820,"Distribution Station Equipment <50 kV",null,null,null,null,0,0,0,0,null,0,0,null,0]
[1825,"Storage Battery Equipment",null,null,null,null,0,0,0,0,null,0,0,null,0]
[1830,"Poles, Towers & Fixtures",null,null,null,null,0,0,0,0,null,0,0,null,0]
[1835,"Overhead Conductors & Devices",null,null,null,null,0,0,0,0,null,0,0,null,0]
[1840,"Underground Conduit",null,null,null,null,0,0,0,0,null,0,0,null,0]
[1845,"Underground Conductors & Devices",null,null,null,null,0,0,0,0,null,0,0,null,0]
[1850,"Line Transformers",null,null,null,null,0,0,0,0,null,0,0,null,0]
[1855,"Services (Overhead & Underground)",null,null,null,null,0,0,0,0,null,0,0,null,0]
[1860,"Meters",null,null,null,null,0,0,0,0,null,0,0,null,0]
[1860,"Meters (Smart Meters)",null,null,null,null,0,0,0,0,null,0,0,null,0]
[1905,"Land",null,null,null,null,0,0,0,0,null,0,0,null,0]
[1908,"Buildings & Fixtures",null,null,null,null,0,0,0,0,null,0,0,null,0]
[1910,"Leasehold Improvements",null,null,null,null,0,0,0,0,null,0,0,null,0]
[1915,"Office Furniture & Equipment (10 years)",null,null,null,null,0,0,0,0,null,0,0,null,0]
[1915,"Office Furniture & Equipment (5 years)",null,null,null,null,0,0,0,0,null,0,0,null,0]
[1920,"Computer Equipment - Hardware",null,null,null,null,0,0,0,0,null,0,0,null,0]
[1920,"Computer Equip.-Hardware(Post Mar. 22/04)",null,null,null,null,0,0,0,0,null,0,0,null,0]
[1920,"Computer Equip.-Hardware(Post Mar. 19/07)",null,null,null,null,0,0,0,0,null,0,0,null,0]
[1930,"Transportation Equipment",null,null,null,null,0,0,0,0,null,0,0,null,0]
[1935,"Stores Equipment",null,null,null,null,0,0,0,0,null,0,0,null,0]
[1940,"Tools, Shop & Garage Equipment",null,null,null,null,0,0,0,0,null,0,0,null,0]
[1945,"Measurement & Testing Equipment",null,null,null,null,0,0,0,0,null,0,0,null,0]
[1950,"Power Operated Equipment",null,null,null,null,0,0,0,0,null,0,0,null,0]
[1955,"Communications Equipment",null,null,null,null,0,0,0,0,null,0,0,null,0]
[1955,"Communication Equipment (Smart Meters)",null,null,null,null,0,0,0,0,null,0,0,null,0]
[1960,"Miscellaneous Equipment ",null,null,null,null,0,0,0,0,null,0,0,null,0]
[1970,"Load Management Controls Customer Premises",null,null,null,null,0,0,0,0,null,0,0,null,0]
[1975,"Load Management Controls Utility Premises",null,null,null,null,0,0,0,0,null,0,0,null,0]
[1980,"System Supervisor Equipment",null,null,null,null,0,0,0,0,null,0,0,null,0]
[1985,"Miscellaneous Fixed Assets",null,null,null,null,0,0,0,0,null,0,0,null,0]
[1990,"Other Tangible Property",null,null,null,null,0,0,0,0,null,0,0,null,0]
[1995,"Contributions & Grants",null,null,null,null,0,0,0,0,null,0,0,null,0]
[null,"Total",{"$f":"SUM(C17:C54)","v":0},{"$f":"SUM(D17:D54)","v":0},null,null,null,{"$f":"SUM(H17:H54)","v":0},0,0,0,0,0,0,0]
[]
["Notes:"]
[]
[1,"Board policy of the \"half-year\" rule - the applicant must ensure that additions in the year attract a half-year depreciation expense in the first year.  Deviations from this standard practice must be supported in the application."]
[2,"The applicant must provide an explanation of material variances in evidence."]
[3,"The applicant should ensure that the years for new additions of assets are the asset useful lives determined by management in accordance with the Board's regulatory accounting policies.   The capitalization and depreciation expense accounting changes should be implemented consistent with the Board’s regulatory accounting policies as set out for modified IFRS as contained in the Report of the Board, Transition to International Financial Reporting Standards, EB-2008-0408, the Kinectrics Report, and the Revised 2012 Accounting Procedures Handbook for Electricity Distributors (“APH”)."]
[4,"A recalculation should be performed to determine the average remaining life of opening balance of assets (i.e. excluding 2012 additions) under the change in policies under CGAAP.  For example, Asset A had a useful life of 20 years under CGAAP without the change in policies.  On January 1, 2012, the effective date of the changes in policies, Asset A was 3 years depreciated. As a result, Asset A would have a remaining service life of 17 years (20 years less 3 years) as of January 1, 2012.  Due to making the change in policies under CGAAP, management re-assessed the asset useful lives and concluded that the revised useful life of Asset A is now 30 years. Therefore, the average remaining useful life of the opening balance of Asset A is determined to be 27 years (30 years less 3 years) under the revised CGAAP as of January 1, 2012."]
[5," NBV must exclude assets still on the books but which have been fully amortized or depreciated."]
[6,"This column refers to the calculated full year depreciation but excludes the depreciation expense on assets fully depreciated during the year.  This column is used for the purpose of calculating depreciation expense in the following year on the next worksheet."]
[]
["General:","Applicants must provide a breakdown of depreciation and amortization expense in the above format for all relevant accounts.  Asset Retirement Obligations (AROs), depreciation and accretion expense should be disclosed separately consistent with the Notes of historical Audited Financial Statements."]

{"sheet":"App.2-CC_NewCGAAP_DepExp_2013","index":12,"n_rows":62,"n_cols":11,"rows_kept":62,"cut":false,"hidden":false,"merged":[[57,1,57,10],[58,1,58,10],[59,1,59,10],[61,1,62,10],[8,0,8,10],[9,0,9,10],[10,0,10,10],[14,0,15,0],[14,1,15,1],[14,6,15,6],[14,9,15,9]]}
[null,null,null,null,null,null,null,null,null,"File Number:",{"$f":"EBNUMBER","v":"EB-2016-0061"}]
[null,null,null,null,null,null,null,null,null,"Exhibit:"]
[null,null,null,null,null,null,null,null,null,"Tab:"]
[null,null,null,null,null,null,null,null,null,"Schedule:"]
[null,null,null,null,null,null,null,null,null,"Page:"]
[]
[null,null,null,null,null,null,null,null,null,"Date:"]
[]
["Appendix 2-CC"]
["Depreciation and Amortization Expense"]
["Assumes the applicant made capitalization and depreciation expense accounting policy changes under CGAAP effective January 1, 2012 and has adopted IFRS for financial reporting purposes effective January 1, 2015."]
[]
[null,null,2013,"Revised CGAAP "]
[]
["Account","Description","Additions","Years (new additions only)","Depreciation Rate on New Additions","2013 Depreciation Expense 1","2013 Depreciation Expense per Apppendix 2-BA Fixed Assets, Column J\n (l)","Variance 2","Depreciation Expense on 2013 Full Year Additions","Less Depreciation Expense on Assets Fully Depreciated during the year\n(o)","2013 Full Year Depreciation 3"]
[null,null,"(d)","(f)","(g) = 1 / (f)","(h)=2012 Full Year Deprecation + ((d)*0.5)/(f) ",null,"(m) = (h) - (l)","(n)=((d))/(f) ",null,"(p) = 2012 Full Year Depreciation  + (n) - (o)"]
[1611,"Computer Software (Formally known as Account 1925)",null,null,{"$f":"IF(D17=0,0,1/D17)","v":0},{"$f":"IF(D17=0,+'App.2-CB_NewCGAAP_DepExp_2012'!O17,+'App.2-CB_NewCGAAP_DepExp_2012'!O17+((C17*0.5)/D17))","v":0},null,{"$f":"IF(ISERROR(+F17-G17), 0, +F17-G17)","v":0},{"$f":"IF(D17=0,0,+(C17)/D17)","v":0},null,{"$f":"IF(ISERROR(+I17+'App.2-CB_NewCGAAP_DepExp_2012'!O17-J17), 0, +I17+'App.2-CB_NewCGAAP_DepExp_2012'!O17-J17)","v":0}]
[1612,"Land Rights (Formally known as Account 1906)",null,null,0,{"$f":"IF(D18=0,+'App.2-CB_NewCGAAP_DepExp_2012'!O18,+'App.2-CB_NewCGAAP_DepExp_2012'!O18+((C18*0.5)/D18))","v":0},null,0,0,null,{"$f":"IF(ISERROR(+I18+'App.2-CB_NewCGAAP_DepExp_2012'!O18-J18), 0, +I18+'App.2-CB_NewCGAAP_DepExp_2012'!O18-J18)","v":0}]
[1805,"Land",null,null,0,{"$f":"IF(D19=0,+'App.2-CB_NewCGAAP_DepExp_2012'!O19,+'App.2-CB_NewCGAAP_DepExp_2012'!O19+((C19*0.5)/D19))","v":0},null,0,0,null,{"$f":"IF(ISERROR(+I19+'App.2-CB_NewCGAAP_DepExp_2012'!O19-J19), 0, +I19+'App.2-CB_NewCGAAP_DepExp_2012'!O19-J19)","v":0}]
[1808,"Buildings",null,null,0,{"$f":"IF(D20=0,+'App.2-CB_NewCGAAP_DepExp_2012'!O20,+'App.2-CB_NewCGAAP_DepExp_2012'!O20+((C20*0.5)/D20))","v":0},null,0,0,null,{"$f":"IF(ISERROR(+I20+'App.2-CB_NewCGAAP_DepExp_2012'!O20-J20), 0, +I20+'App.2-CB_NewCGAAP_DepExp_2012'!O20-J20)","v":0}]
[1810,"Leasehold Improvements",null,null,0,{"$f":"IF(D21=0,+'App.2-CB_NewCGAAP_DepExp_2012'!O21,+'App.2-CB_NewCGAAP_DepExp_2012'!O21+((C21*0.5)/D21))","v":0},null,0,0,null,{"$f":"IF(ISERROR(+I21+'App.2-CB_NewCGAAP_DepExp_2012'!O21-J21), 0, +I21+'App.2-CB_NewCGAAP_DepExp_2012'!O21-J21)","v":0}]
[1815,"Transformer Station Equipment >50 kV",null,null,0,{"$f":"IF(D22=0,+'App.2-CB_NewCGAAP_DepExp_2012'!O22,+'App.2-CB_NewCGAAP_DepExp_2012'!O22+((C22*0.5)/D22))","v":0},null,0,0,null,{"$f":"IF(ISERROR(+I22+'App.2-CB_NewCGAAP_DepExp_2012'!O22-J22), 0, +I22+'App.2-CB_NewCGAAP_DepExp_2012'!O22-J22)","v":0}]
[1820,"Distribution Station Equipment <50 kV",null,null,0,{"$f":"IF(D23=0,+'App.2-CB_NewCGAAP_DepExp_2012'!O23,+'App.2-CB_NewCGAAP_DepExp_2012'!O23+((C23*0.5)/D23))","v":0},null,0,0,null,{"$f":"IF(ISERROR(+I23+'App.2-CB_NewCGAAP_DepExp_2012'!O23-J23), 0, +I23+'App.2-CB_NewCGAAP_DepExp_2012'!O23-J23)","v":0}]
[1825,"Storage Battery Equipment",null,null,0,{"$f":"IF(D24=0,+'App.2-CB_NewCGAAP_DepExp_2012'!O24,+'App.2-CB_NewCGAAP_DepExp_2012'!O24+((C24*0.5)/D24))","v":0},null,0,0,null,{"$f":"IF(ISERROR(+I24+'App.2-CB_NewCGAAP_DepExp_2012'!O24-J24), 0, +I24+'App.2-CB_NewCGAAP_DepExp_2012'!O24-J24)","v":0}]
[1830,"Poles, Towers & Fixtures",null,null,0,{"$f":"IF(D25=0,+'App.2-CB_NewCGAAP_DepExp_2012'!O25,+'App.2-CB_NewCGAAP_DepExp_2012'!O25+((C25*0.5)/D25))","v":0},null,0,0,null,{"$f":"IF(ISERROR(+I25+'App.2-CB_NewCGAAP_DepExp_2012'!O25-J25), 0, +I25+'App.2-CB_NewCGAAP_DepExp_2012'!O25-J25)","v":0}]
[1835,"Overhead Conductors & Devices",null,null,0,{"$f":"IF(D26=0,+'App.2-CB_NewCGAAP_DepExp_2012'!O26,+'App.2-CB_NewCGAAP_DepExp_2012'!O26+((C26*0.5)/D26))","v":0},null,0,0,null,{"$f":"IF(ISERROR(+I26+'App.2-CB_NewCGAAP_DepExp_2012'!O26-J26), 0, +I26+'App.2-CB_NewCGAAP_DepExp_2012'!O26-J26)","v":0}]
[1840,"Underground Conduit",null,null,0,{"$f":"IF(D27=0,+'App.2-CB_NewCGAAP_DepExp_2012'!O27,+'App.2-CB_NewCGAAP_DepExp_2012'!O27+((C27*0.5)/D27))","v":0},null,0,0,null,{"$f":"IF(ISERROR(+I27+'App.2-CB_NewCGAAP_DepExp_2012'!O27-J27), 0, +I27+'App.2-CB_NewCGAAP_DepExp_2012'!O27-J27)","v":0}]
[1845,"Underground Conductors & Devices",null,null,0,{"$f":"IF(D28=0,+'App.2-CB_NewCGAAP_DepExp_2012'!O28,+'App.2-CB_NewCGAAP_DepExp_2012'!O28+((C28*0.5)/D28))","v":0},null,0,0,null,{"$f":"IF(ISERROR(+I28+'App.2-CB_NewCGAAP_DepExp_2012'!O28-J28), 0, +I28+'App.2-CB_NewCGAAP_DepExp_2012'!O28-J28)","v":0}]
[1850,"Line Transformers",null,null,0,{"$f":"IF(D29=0,+'App.2-CB_NewCGAAP_DepExp_2012'!O29,+'App.2-CB_NewCGAAP_DepExp_2012'!O29+((C29*0.5)/D29))","v":0},null,0,0,null,{"$f":"IF(ISERROR(+I29+'App.2-CB_NewCGAAP_DepExp_2012'!O29-J29), 0, +I29+'App.2-CB_NewCGAAP_DepExp_2012'!O29-J29)","v":0}]
[1855,"Services (Overhead & Underground)",null,null,0,{"$f":"IF(D30=0,+'App.2-CB_NewCGAAP_DepExp_2012'!O30,+'App.2-CB_NewCGAAP_DepExp_2012'!O30+((C30*0.5)/D30))","v":0},null,0,0,null,{"$f":"IF(ISERROR(+I30+'App.2-CB_NewCGAAP_DepExp_2012'!O30-J30), 0, +I30+'App.2-CB_NewCGAAP_DepExp_2012'!O30-J30)","v":0}]
[1860,"Meters",null,null,0,{"$f":"IF(D31=0,+'App.2-CB_NewCGAAP_DepExp_2012'!O31,+'App.2-CB_NewCGAAP_DepExp_2012'!O31+((C31*0.5)/D31))","v":0},null,0,0,null,{"$f":"IF(ISERROR(+I31+'App.2-CB_NewCGAAP_DepExp_2012'!O31-J31), 0, +I31+'App.2-CB_NewCGAAP_DepExp_2012'!O31-J31)","v":0}]
[1860,"Meters (Smart Meters)",null,null,0,{"$f":"IF(D32=0,+'App.2-CB_NewCGAAP_DepExp_2012'!O32,+'App.2-CB_NewCGAAP_DepExp_2012'!O32+((C32*0.5)/D32))","v":0},null,0,0,null,{"$f":"IF(ISERROR(+I32+'App.2-CB_NewCGAAP_DepExp_2012'!O32-J32), 0, +I32+'App.2-CB_NewCGAAP_DepExp_2012'!O32-J32)","v":0}]
[1905,"Land",null,null,0,{"$f":"IF(D33=0,+'App.2-CB_NewCGAAP_DepExp_2012'!O33,+'App.2-CB_NewCGAAP_DepExp_2012'!O33+((C33*0.5)/D33))","v":0},null,0,0,null,{"$f":"IF(ISERROR(+I33+'App.2-CB_NewCGAAP_DepExp_2012'!O33-J33), 0, +I33+'App.2-CB_NewCGAAP_DepExp_2012'!O33-J33)","v":0}]
[1908,"Buildings & Fixtures",null,null,0,{"$f":"IF(D34=0,+'App.2-CB_NewCGAAP_DepExp_2012'!O34,+'App.2-CB_NewCGAAP_DepExp_2012'!O34+((C34*0.5)/D34))","v":0},null,0,0,null,{"$f":"IF(ISERROR(+I34+'App.2-CB_NewCGAAP_DepExp_2012'!O34-J34), 0, +I34+'App.2-CB_NewCGAAP_DepExp_2012'!O34-J34)","v":0}]
[1910,"Leasehold Improvements",null,null,0,{"$f":"IF(D35=0,+'App.2-CB_NewCGAAP_DepExp_2012'!O35,+'App.2-CB_NewCGAAP_DepExp_2012'!O35+((C35*0.5)/D35))","v":0},null,0,0,null,{"$f":"IF(ISERROR(+I35+'App.2-CB_NewCGAAP_DepExp_2012'!O35-J35), 0, +I35+'App.2-CB_NewCGAAP_DepExp_2012'!O35-J35)","v":0}]
[1915,"Office Furniture & Equipment (10 years)",null,null,0,{"$f":"IF(D36=0,+'App.2-CB_NewCGAAP_DepExp_2012'!O36,+'App.2-CB_NewCGAAP_DepExp_2012'!O36+((C36*0.5)/D36))","v":0},null,0,0,null,{"$f":"IF(ISERROR(+I36+'App.2-CB_NewCGAAP_DepExp_2012'!O36-J36), 0, +I36+'App.2-CB_NewCGAAP_DepExp_2012'!O36-J36)","v":0}]
[1915,"Office Furniture & Equipment (5 years)",null,null,0,{"$f":"IF(D37=0,+'App.2-CB_NewCGAAP_DepExp_2012'!O37,+'App.2-CB_NewCGAAP_DepExp_2012'!O37+((C37*0.5)/D37))","v":0},null,0,0,null,{"$f":"IF(ISERROR(+I37+'App.2-CB_NewCGAAP_DepExp_2012'!O37-J37), 0, +I37+'App.2-CB_NewCGAAP_DepExp_2012'!O37-J37)","v":0}]
[1920,"Computer Equipment - Hardware",null,null,0,{"$f":"IF(D38=0,+'App.2-CB_NewCGAAP_DepExp_2012'!O38,+'App.2-CB_NewCGAAP_DepExp_2012'!O38+((C38*0.5)/D38))","v":0},null,0,0,null,{"$f":"IF(ISERROR(+I38+'App.2-CB_NewCGAAP_DepExp_2012'!O38-J38), 0, +I38+'App.2-CB_NewCGAAP_DepExp_2012'!O38-J38)","v":0}]
[1920,"Computer Equip.-Hardware(Post Mar. 22/04)",null,null,0,{"$f":"IF(D39=0,+'App.2-CB_NewCGAAP_DepExp_2012'!O39,+'App.2-CB_NewCGAAP_DepExp_2012'!O39+((C39*0.5)/D39))","v":0},null,0,0,null,{"$f":"IF(ISERROR(+I39+'App.2-CB_NewCGAAP_DepExp_2012'!O39-J39), 0, +I39+'App.2-CB_NewCGAAP_DepExp_2012'!O39-J39)","v":0}]
[1920,"Computer Equip.-Hardware(Post Mar. 19/07)",null,null,0,{"$f":"IF(D40=0,+'App.2-CB_NewCGAAP_DepExp_2012'!O40,+'App.2-CB_NewCGAAP_DepExp_2012'!O40+((C40*0.5)/D40))","v":0},null,0,0,null,{"$f":"IF(ISERROR(+I40+'App.2-CB_NewCGAAP_DepExp_2012'!O40-J40), 0, +I40+'App.2-CB_NewCGAAP_DepExp_2012'!O40-J40)","v":0}]
[1930,"Transportation Equipment",null,null,0,{"$f":"IF(D41=0,+'App.2-CB_NewCGAAP_DepExp_2012'!O41,+'App.2-CB_NewCGAAP_DepExp_2012'!O41+((C41*0.5)/D41))","v":0},null,0,0,null,{"$f":"IF(ISERROR(+I41+'App.2-CB_NewCGAAP_DepExp_2012'!O41-J41), 0, +I41+'App.2-CB_NewCGAAP_DepExp_2012'!O41-J41)","v":0}]
[1935,"Stores Equipment",null,null,0,{"$f":"IF(D42=0,+'App.2-CB_NewCGAAP_DepExp_2012'!O42,+'App.2-CB_NewCGAAP_DepExp_2012'!O42+((C42*0.5)/D42))","v":0},null,0,0,null,{"$f":"IF(ISERROR(+I42+'App.2-CB_NewCGAAP_DepExp_2012'!O42-J42), 0, +I42+'App.2-CB_NewCGAAP_DepExp_2012'!O42-J42)","v":0}]
[1940,"Tools, Shop & Garage Equipment",null,null,0,{"$f":"IF(D43=0,+'App.2-CB_NewCGAAP_DepExp_2012'!O43,+'App.2-CB_NewCGAAP_DepExp_2012'!O43+((C43*0.5)/D43))","v":0},null,0,0,null,{"$f":"IF(ISERROR(+I43+'App.2-CB_NewCGAAP_DepExp_2012'!O43-J43), 0, +I43+'App.2-CB_NewCGAAP_DepExp_2012'!O43-J43)","v":0}]
[1945,"Measurement & Testing Equipment",null,null,0,{"$f":"IF(D44=0,+'App.2-CB_NewCGAAP_DepExp_2012'!O44,+'App.2-CB_NewCGAAP_DepExp_2012'!O44+((C44*0.5)/D44))","v":0},null,0,0,null,{"$f":"IF(ISERROR(+I44+'App.2-CB_NewCGAAP_DepExp_2012'!O44-J44), 0, +I44+'App.2-CB_NewCGAAP_DepExp_2012'!O44-J44)","v":0}]
[1950,"Power Operated Equipment",null,null,0,{"$f":"IF(D45=0,+'App.2-CB_NewCGAAP_DepExp_2012'!O45,+'App.2-CB_NewCGAAP_DepExp_2012'!O45+((C45*0.5)/D45))","v":0},null,0,0,null,{"$f":"IF(ISERROR(+I45+'App.2-CB_NewCGAAP_DepExp_2012'!O45-J45), 0, +I45+'App.2-CB_NewCGAAP_DepExp_2012'!O45-J45)","v":0}]
[1955,"Communications Equipment",null,null,0,{"$f":"IF(D46=0,+'App.2-CB_NewCGAAP_DepExp_2012'!O46,+'App.2-CB_NewCGAAP_DepExp_2012'!O46+((C46*0.5)/D46))","v":0},null,0,0,null,{"$f":"IF(ISERROR(+I46+'App.2-CB_NewCGAAP_DepExp_2012'!O46-J46), 0, +I46+'App.2-CB_NewCGAAP_DepExp_2012'!O46-J46)","v":0}]
[1955,"Communication Equipment (Smart Meters)",null,null,0,{"$f":"IF(D47=0,+'App.2-CB_NewCGAAP_DepExp_2012'!O47,+'App.2-CB_NewCGAAP_DepExp_2012'!O47+((C47*0.5)/D47))","v":0},null,0,0,null,{"$f":"IF(ISERROR(+I47+'App.2-CB_NewCGAAP_DepExp_2012'!O47-J47), 0, +I47+'App.2-CB_NewCGAAP_DepExp_2012'!O47-J47)","v":0}]
[1960,"Miscellaneous Equipment ",null,null,0,{"$f":"IF(D48=0,+'App.2-CB_NewCGAAP_DepExp_2012'!O48,+'App.2-CB_NewCGAAP_DepExp_2012'!O48+((C48*0.5)/D48))","v":0},null,0,0,null,{"$f":"IF(ISERROR(+I48+'App.2-CB_NewCGAAP_DepExp_2012'!O48-J48), 0, +I48+'App.2-CB_NewCGAAP_DepExp_2012'!O48-J48)","v":0}]
[1970,"Load Management Controls Customer Premises",null,null,0,{"$f":"IF(D49=0,+'App.2-CB_NewCGAAP_DepExp_2012'!O49,+'App.2-CB_NewCGAAP_DepExp_2012'!O49+((C49*0.5)/D49))","v":0},null,0,0,null,{"$f":"IF(ISERROR(+I49+'App.2-CB_NewCGAAP_DepExp_2012'!O49-J49), 0, +I49+'App.2-CB_NewCGAAP_DepExp_2012'!O49-J49)","v":0}]
[1975,"Load Management Controls Utility Premises",null,null,0,{"$f":"IF(D50=0,+'App.2-CB_NewCGAAP_DepExp_2012'!O50,+'App.2-CB_NewCGAAP_DepExp_2012'!O50+((C50*0.5)/D50))","v":0},null,0,0,null,{"$f":"IF(ISERROR(+I50+'App.2-CB_NewCGAAP_DepExp_2012'!O50-J50), 0, +I50+'App.2-CB_NewCGAAP_DepExp_2012'!O50-J50)","v":0}]
[1980,"System Supervisor Equipment",null,null,0,{"$f":"IF(D51=0,+'App.2-CB_NewCGAAP_DepExp_2012'!O51,+'App.2-CB_NewCGAAP_DepExp_2012'!O51+((C51*0.5)/D51))","v":0},null,0,0,null,{"$f":"IF(ISERROR(+I51+'App.2-CB_NewCGAAP_DepExp_2012'!O51-J51), 0, +I51+'App.2-CB_NewCGAAP_DepExp_2012'!O51-J51)","v":0}]
[1985,"Miscellaneous Fixed Assets",null,null,0,{"$f":"IF(D52=0,+'App.2-CB_NewCGAAP_DepExp_2012'!O52,+'App.2-CB_NewCGAAP_DepExp_2012'!O52+((C52*0.5)/D52))","v":0},null,0,0,null,{"$f":"IF(ISERROR(+I52+'App.2-CB_NewCGAAP_DepExp_2012'!O52-J52), 0, +I52+'App.2-CB_NewCGAAP_DepExp_2012'!O52-J52)","v":0}]
[1990,"Other Tangible Property",null,null,0,{"$f":"IF(D53=0,+'App.2-CB_NewCGAAP_DepExp_2012'!O53,+'App.2-CB_NewCGAAP_DepExp_2012'!O53+((C53*0.5)/D53))","v":0},null,0,0,null,{"$f":"IF(ISERROR(+I53+'App.2-CB_NewCGAAP_DepExp_2012'!O53-J53), 0, +I53+'App.2-CB_NewCGAAP_DepExp_2012'!O53-J53)","v":0}]
[1995,"Contributions & Grants",null,null,0,{"$f":"IF(D54=0,+'App.2-CB_NewCGAAP_DepExp_2012'!O54,+'App.2-CB_NewCGAAP_DepExp_2012'!O54+((C54*0.5)/D54))","v":0},null,0,0,null,{"$f":"IF(ISERROR(+I54+'App.2-CB_NewCGAAP_DepExp_2012'!O54-J54), 0, +I54+'App.2-CB_NewCGAAP_DepExp_2012'!O54-J54)","v":0}]
[null,"Total",{"$f":"SUM(C17:C54)","v":0},null,null,{"$f":"SUM(F17:F54)","v":0},0,0,0,0,0]
[]
["Notes:"]
[1,"Board policy of the \"half-year\" rule - the applicant must ensure that additions in the year attract a half-year depreciation expense in the first year.  Deviations from this standard practice must be supported in the application."]
[2,"The applicant must provide an explanation of material variances in evidence."]
[3,"This column refers to the calculated full year depreciation but excludes the depreciation expense on assets fully depreciated during the year.  This column is used for the purpose of calculating depreciation expense in the following year on the next worksheet."]
[]
["General:","Applicants must provide a breakdown of depreciation and amortization expense in the above format for all relevant accounts.  Asset Retirement Obligations (AROs), depreciation and accretion expense should be disclosed separately consistent with the Notes of historical Audited Financial Statements."]

{"sheet":"App.2-CD_MIFRS_DepExp_2014","index":13,"n_rows":64,"n_cols":11,"rows_kept":64,"cut":false,"hidden":false,"merged":[[59,1,59,10],[60,1,60,10],[61,1,61,10],[63,1,64,10],[8,0,8,10],[9,0,9,10],[10,0,10,10],[14,0,15,0],[14,1,15,1],[14,6,15,6],[14,9,15,9]]}
[null,null,null,null,null,null,null,null,null,"File Number:",{"$f":"EBNUMBER","v":"EB-2016-0061"}]
[null,null,null,null,null,null,null,null,null,"Exhibit:"]
[null,null,null,null,null,null,null,null,null,"Tab:"]
[null,null,null,null,null,null,null,null,null,"Schedule:"]
[null,null,null,null,null,null,null,null,null,"Page:"]
[]
[null,null,null,null,null,null,null,null,null,"Date:"]
[]
["Appendix 2-CD"]
["Depreciation and Amortization Expense"]
["Assumes the applicant made capitalization and depreciation expense accounting policy changes under CGAAP effective January 1, 2012 and has adopted IFRS for financial reporting purposes effective January 1, 2015."]
[]
[null,null,null,null,2014,"MIFRS"]
[]
["Account","Description","Additions","Years (new additions only)","Depreciation Rate on New Additions","2014 Depreciation Expense 1","2014 Depreciation Expense per Apppendix 2-BA Fixed Assets, Column J\n (l)","Variance 2","Depreciation Expense on 2014 Full Year Additions","Less Depreciation Expense on Assets Fully Depreciated during the year\n(o)","2014 Full Year Depreciation 3"]
[null,null,"(d)","(f)","(g) = 1 / (f)","(h)=2013 Full Year Deprecation + ((d)*0.5)/(f) ",null,"(m) = (h) - (l)","(n)=((d))/(f) ",null,"(p) = 2013 Full Year Depreciation  + (n) - (o)"]
[1611,"Computer Software (Formally known as Account 1925)",null,null,{"$f":"IF(D17=0,0,1/D17)","v":0},{"$f":"IF(D17=0,+'App.2-CC_NewCGAAP_DepExp_2013'!K17,+'App.2-CC_NewCGAAP_DepExp_2013'!K17+((C17*0.5)/D17))","v":0},null,{"$f":"IF(ISERROR(+F17-G17), 0, +F17-G17)","v":0},{"$f":"IF(D17=0,0,+(C17)/D17)","v":0},null,{"$f":"IF(ISERROR(+I17+'App.2-CC_NewCGAAP_DepExp_2013'!K17-J17), 0, +I17+'App.2-CC_NewCGAAP_DepExp_2013'!K17-J17)","v":0}]
[1612,"Land Rights (Formally known as Account 1906)",null,null,0,{"$f":"IF(D18=0,+'App.2-CC_NewCGAAP_DepExp_2013'!K18,+'App.2-CC_NewCGAAP_DepExp_2013'!K18+((C18*0.5)/D18))","v":0},null,0,{"$f":"IF(D18=0,0,+(C18)/D18)","v":0},null,{"$f":"IF(ISERROR(+I18+'App.2-CC_NewCGAAP_DepExp_2013'!K18-J18), 0, +I18+'App.2-CC_NewCGAAP_DepExp_2013'!K18-J18)","v":0}]
[1805,"Land",null,null,0,{"$f":"IF(D19=0,+'App.2-CC_NewCGAAP_DepExp_2013'!K19,+'App.2-CC_NewCGAAP_DepExp_2013'!K19+((C19*0.5)/D19))","v":0},null,0,0,null,{"$f":"IF(ISERROR(+I19+'App.2-CC_NewCGAAP_DepExp_2013'!K19-J19), 0, +I19+'App.2-CC_NewCGAAP_DepExp_2013'!K19-J19)","v":0}]
[1808,"Buildings",null,null,0,{"$f":"IF(D20=0,+'App.2-CC_NewCGAAP_DepExp_2013'!K20,+'App.2-CC_NewCGAAP_DepExp_2013'!K20+((C20*0.5)/D20))","v":0},null,0,0,null,{"$f":"IF(ISERROR(+I20+'App.2-CC_NewCGAAP_DepExp_2013'!K20-J20), 0, +I20+'App.2-CC_NewCGAAP_DepExp_2013'!K20-J20)","v":0}]
[1810,"Leasehold Improvements",null,null,0,{"$f":"IF(D21=0,+'App.2-CC_NewCGAAP_DepExp_2013'!K21,+'App.2-CC_NewCGAAP_DepExp_2013'!K21+((C21*0.5)/D21))","v":0},null,0,0,null,{"$f":"IF(ISERROR(+I21+'App.2-CC_NewCGAAP_DepExp_2013'!K21-J21), 0, +I21+'App.2-CC_NewCGAAP_DepExp_2013'!K21-J21)","v":0}]
[1815,"Transformer Station Equipment >50 kV",null,null,0,{"$f":"IF(D22=0,+'App.2-CC_NewCGAAP_DepExp_2013'!K22,+'App.2-CC_NewCGAAP_DepExp_2013'!K22+((C22*0.5)/D22))","v":0},null,0,0,null,{"$f":"IF(ISERROR(+I22+'App.2-CC_NewCGAAP_DepExp_2013'!K22-J22), 0, +I22+'App.2-CC_NewCGAAP_DepExp_2013'!K22-J22)","v":0}]
[1820,"Distribution Station Equipment <50 kV",null,null,0,{"$f":"IF(D23=0,+'App.2-CC_NewCGAAP_DepExp_2013'!K23,+'App.2-CC_NewCGAAP_DepExp_2013'!K23+((C23*0.5)/D23))","v":0},null,0,0,null,{"$f":"IF(ISERROR(+I23+'App.2-CC_NewCGAAP_DepExp_2013'!K23-J23), 0, +I23+'App.2-CC_NewCGAAP_DepExp_2013'!K23-J23)","v":0}]
[1825,"Storage Battery Equipment",null,null,0,{"$f":"IF(D24=0,+'App.2-CC_NewCGAAP_DepExp_2013'!K24,+'App.2-CC_NewCGAAP_DepExp_2013'!K24+((C24*0.5)/D24))","v":0},null,0,0,null,{"$f":"IF(ISERROR(+I24+'App.2-CC_NewCGAAP_DepExp_2013'!K24-J24), 0, +I24+'App.2-CC_NewCGAAP_DepExp_2013'!K24-J24)","v":0}]
[1830,"Poles, Towers & Fixtures",null,null,0,{"$f":"IF(D25=0,+'App.2-CC_NewCGAAP_DepExp_2013'!K25,+'App.2-CC_NewCGAAP_DepExp_2013'!K25+((C25*0.5)/D25))","v":0},null,0,0,null,{"$f":"IF(ISERROR(+I25+'App.2-CC_NewCGAAP_DepExp_2013'!K25-J25), 0, +I25+'App.2-CC_NewCGAAP_DepExp_2013'!K25-J25)","v":0}]
[1835,"Overhead Conductors & Devices",null,null,0,{"$f":"IF(D26=0,+'App.2-CC_NewCGAAP_DepExp_2013'!K26,+'App.2-CC_NewCGAAP_DepExp_2013'!K26+((C26*0.5)/D26))","v":0},null,0,0,null,{"$f":"IF(ISERROR(+I26+'App.2-CC_NewCGAAP_DepExp_2013'!K26-J26), 0, +I26+'App.2-CC_NewCGAAP_DepExp_2013'!K26-J26)","v":0}]
[1840,"Underground Conduit",null,null,0,{"$f":"IF(D27=0,+'App.2-CC_NewCGAAP_DepExp_2013'!K27,+'App.2-CC_NewCGAAP_DepExp_2013'!K27+((C27*0.5)/D27))","v":0},null,0,0,null,{"$f":"IF(ISERROR(+I27+'App.2-CC_NewCGAAP_DepExp_2013'!K27-J27), 0, +I27+'App.2-CC_NewCGAAP_DepExp_2013'!K27-J27)","v":0}]
[1845,"Underground Conductors & Devices",null,null,0,{"$f":"IF(D28=0,+'App.2-CC_NewCGAAP_DepExp_2013'!K28,+'App.2-CC_NewCGAAP_DepExp_2013'!K28+((C28*0.5)/D28))","v":0},null,0,0,null,{"$f":"IF(ISERROR(+I28+'App.2-CC_NewCGAAP_DepExp_2013'!K28-J28), 0, +I28+'App.2-CC_NewCGAAP_DepExp_2013'!K28-J28)","v":0}]
[1850,"Line Transformers",null,null,0,{"$f":"IF(D29=0,+'App.2-CC_NewCGAAP_DepExp_2013'!K29,+'App.2-CC_NewCGAAP_DepExp_2013'!K29+((C29*0.5)/D29))","v":0},null,0,0,null,{"$f":"IF(ISERROR(+I29+'App.2-CC_NewCGAAP_DepExp_2013'!K29-J29), 0, +I29+'App.2-CC_NewCGAAP_DepExp_2013'!K29-J29)","v":0}]
[1855,"Services (Overhead & Underground)",null,null,0,{"$f":"IF(D30=0,+'App.2-CC_NewCGAAP_DepExp_2013'!K30,+'App.2-CC_NewCGAAP_DepExp_2013'!K30+((C30*0.5)/D30))","v":0},null,0,0,null,{"$f":"IF(ISERROR(+I30+'App.2-CC_NewCGAAP_DepExp_2013'!K30-J30), 0, +I30+'App.2-CC_NewCGAAP_DepExp_2013'!K30-J30)","v":0}]
[1860,"Meters",null,null,0,{"$f":"IF(D31=0,+'App.2-CC_NewCGAAP_DepExp_2013'!K31,+'App.2-CC_NewCGAAP_DepExp_2013'!K31+((C31*0.5)/D31))","v":0},null,0,0,null,{"$f":"IF(ISERROR(+I31+'App.2-CC_NewCGAAP_DepExp_2013'!K31-J31), 0, +I31+'App.2-CC_NewCGAAP_DepExp_2013'!K31-J31)","v":0}]
[1860,"Meters (Smart Meters)",null,null,0,{"$f":"IF(D32=0,+'App.2-CC_NewCGAAP_DepExp_2013'!K32,+'App.2-CC_NewCGAAP_DepExp_2013'!K32+((C32*0.5)/D32))","v":0},null,0,0,null,{"$f":"IF(ISERROR(+I32+'App.2-CC_NewCGAAP_DepExp_2013'!K32-J32), 0, +I32+'App.2-CC_NewCGAAP_DepExp_2013'!K32-J32)","v":0}]
[1905,"Land",null,null,0,{"$f":"IF(D33=0,+'App.2-CC_NewCGAAP_DepExp_2013'!K33,+'App.2-CC_NewCGAAP_DepExp_2013'!K33+((C33*0.5)/D33))","v":0},null,0,0,null,{"$f":"IF(ISERROR(+I33+'App.2-CC_NewCGAAP_DepExp_2013'!K33-J33), 0, +I33+'App.2-CC_NewCGAAP_DepExp_2013'!K33-J33)","v":0}]
[1908,"Buildings & Fixtures",null,null,0,{"$f":"IF(D34=0,+'App.2-CC_NewCGAAP_DepExp_2013'!K34,+'App.2-CC_NewCGAAP_DepExp_2013'!K34+((C34*0.5)/D34))","v":0},null,0,0,null,{"$f":"IF(ISERROR(+I34+'App.2-CC_NewCGAAP_DepExp_2013'!K34-J34), 0, +I34+'App.2-CC_NewCGAAP_DepExp_2013'!K34-J34)","v":0}]
[1910,"Leasehold Improvements",null,null,0,{"$f":"IF(D35=0,+'App.2-CC_NewCGAAP_DepExp_2013'!K35,+'App.2-CC_NewCGAAP_DepExp_2013'!K35+((C35*0.5)/D35))","v":0},null,0,0,null,{"$f":"IF(ISERROR(+I35+'App.2-CC_NewCGAAP_DepExp_2013'!K35-J35), 0, +I35+'App.2-CC_NewCGAAP_DepExp_2013'!K35-J35)","v":0}]
[1915,"Office Furniture & Equipment (10 years)",null,null,0,{"$f":"IF(D36=0,+'App.2-CC_NewCGAAP_DepExp_2013'!K36,+'App.2-CC_NewCGAAP_DepExp_2013'!K36+((C36*0.5)/D36))","v":0},null,0,0,null,{"$f":"IF(ISERROR(+I36+'App.2-CC_NewCGAAP_DepExp_2013'!K36-J36), 0, +I36+'App.2-CC_NewCGAAP_DepExp_2013'!K36-J36)","v":0}]
[1915,"Office Furniture & Equipment (5 years)",null,null,0,{"$f":"IF(D37=0,+'App.2-CC_NewCGAAP_DepExp_2013'!K37,+'App.2-CC_NewCGAAP_DepExp_2013'!K37+((C37*0.5)/D37))","v":0},null,0,0,null,{"$f":"IF(ISERROR(+I37+'App.2-CC_NewCGAAP_DepExp_2013'!K37-J37), 0, +I37+'App.2-CC_NewCGAAP_DepExp_2013'!K37-J37)","v":0}]
[1920,"Computer Equipment - Hardware",null,null,0,{"$f":"IF(D38=0,+'App.2-CC_NewCGAAP_DepExp_2013'!K38,+'App.2-CC_NewCGAAP_DepExp_2013'!K38+((C38*0.5)/D38))","v":0},null,0,0,null,{"$f":"IF(ISERROR(+I38+'App.2-CC_NewCGAAP_DepExp_2013'!K38-J38), 0, +I38+'App.2-CC_NewCGAAP_DepExp_2013'!K38-J38)","v":0}]
[1920,"Computer Equip.-Hardware(Post Mar. 22/04)",null,null,0,{"$f":"IF(D39=0,+'App.2-CC_NewCGAAP_DepExp_2013'!K39,+'App.2-CC_NewCGAAP_DepExp_2013'!K39+((C39*0.5)/D39))","v":0},null,0,0,null,{"$f":"IF(ISERROR(+I39+'App.2-CC_NewCGAAP_DepExp_2013'!K39-J39), 0, +I39+'App.2-CC_NewCGAAP_DepExp_2013'!K39-J39)","v":0}]
[1920,"Computer Equip.-Hardware(Post Mar. 19/07)",null,null,0,{"$f":"IF(D40=0,+'App.2-CC_NewCGAAP_DepExp_2013'!K40,+'App.2-CC_NewCGAAP_DepExp_2013'!K40+((C40*0.5)/D40))","v":0},null,0,0,null,{"$f":"IF(ISERROR(+I40+'App.2-CC_NewCGAAP_DepExp_2013'!K40-J40), 0, +I40+'App.2-CC_NewCGAAP_DepExp_2013'!K40-J40)","v":0}]
[1930,"Transportation Equipment",null,null,0,{"$f":"IF(D41=0,+'App.2-CC_NewCGAAP_DepExp_2013'!K41,+'App.2-CC_NewCGAAP_DepExp_2013'!K41+((C41*0.5)/D41))","v":0},null,0,0,null,{"$f":"IF(ISERROR(+I41+'App.2-CC_NewCGAAP_DepExp_2013'!K41-J41), 0, +I41+'App.2-CC_NewCGAAP_DepExp_2013'!K41-J41)","v":0}]
[1935,"Stores Equipment",null,null,0,{"$f":"IF(D42=0,+'App.2-CC_NewCGAAP_DepExp_2013'!K42,+'App.2-CC_NewCGAAP_DepExp_2013'!K42+((C42*0.5)/D42))","v":0},null,0,0,null,{"$f":"IF(ISERROR(+I42+'App.2-CC_NewCGAAP_DepExp_2013'!K42-J42), 0, +I42+'App.2-CC_NewCGAAP_DepExp_2013'!K42-J42)","v":0}]
[1940,"Tools, Shop & Garage Equipment",null,null,0,{"$f":"IF(D43=0,+'App.2-CC_NewCGAAP_DepExp_2013'!K43,+'App.2-CC_NewCGAAP_DepExp_2013'!K43+((C43*0.5)/D43))","v":0},null,0,0,null,{"$f":"IF(ISERROR(+I43+'App.2-CC_NewCGAAP_DepExp_2013'!K43-J43), 0, +I43+'App.2-CC_NewCGAAP_DepExp_2013'!K43-J43)","v":0}]
[1945,"Measurement & Testing Equipment",null,null,0,{"$f":"IF(D44=0,+'App.2-CC_NewCGAAP_DepExp_2013'!K44,+'App.2-CC_NewCGAAP_DepExp_2013'!K44+((C44*0.5)/D44))","v":0},null,0,0,null,{"$f":"IF(ISERROR(+I44+'App.2-CC_NewCGAAP_DepExp_2013'!K44-J44), 0, +I44+'App.2-CC_NewCGAAP_DepExp_2013'!K44-J44)","v":0}]
[1950,"Power Operated Equipment",null,null,0,{"$f":"IF(D45=0,+'App.2-CC_NewCGAAP_DepExp_2013'!K45,+'App.2-CC_NewCGAAP_DepExp_2013'!K45+((C45*0.5)/D45))","v":0},null,0,0,null,{"$f":"IF(ISERROR(+I45+'App.2-CC_NewCGAAP_DepExp_2013'!K45-J45), 0, +I45+'App.2-CC_NewCGAAP_DepExp_2013'!K45-J45)","v":0}]
[1955,"Communications Equipment",null,null,0,{"$f":"IF(D46=0,+'App.2-CC_NewCGAAP_DepExp_2013'!K46,+'App.2-CC_NewCGAAP_DepExp_2013'!K46+((C46*0.5)/D46))","v":0},null,0,0,null,{"$f":"IF(ISERROR(+I46+'App.2-CC_NewCGAAP_DepExp_2013'!K46-J46), 0, +I46+'App.2-CC_NewCGAAP_DepExp_2013'!K46-J46)","v":0}]
[1955,"Communication Equipment (Smart Meters)",null,null,0,{"$f":"IF(D47=0,+'App.2-CC_NewCGAAP_DepExp_2013'!K47,+'App.2-CC_NewCGAAP_DepExp_2013'!K47+((C47*0.5)/D47))","v":0},null,0,0,null,{"$f":"IF(ISERROR(+I47+'App.2-CC_NewCGAAP_DepExp_2013'!K47-J47), 0, +I47+'App.2-CC_NewCGAAP_DepExp_2013'!K47-J47)","v":0}]
[1960,"Miscellaneous Equipment ",null,null,0,{"$f":"IF(D48=0,+'App.2-CC_NewCGAAP_DepExp_2013'!K48,+'App.2-CC_NewCGAAP_DepExp_2013'!K48+((C48*0.5)/D48))","v":0},null,0,0,null,{"$f":"IF(ISERROR(+I48+'App.2-CC_NewCGAAP_DepExp_2013'!K48-J48), 0, +I48+'App.2-CC_NewCGAAP_DepExp_2013'!K48-J48)","v":0}]
[1970,"Load Management Controls Customer Premises",null,null,0,{"$f":"IF(D49=0,+'App.2-CC_NewCGAAP_DepExp_2013'!K49,+'App.2-CC_NewCGAAP_DepExp_2013'!K49+((C49*0.5)/D49))","v":0},null,0,0,null,{"$f":"IF(ISERROR(+I49+'App.2-CC_NewCGAAP_DepExp_2013'!K49-J49), 0, +I49+'App.2-CC_NewCGAAP_DepExp_2013'!K49-J49)","v":0}]
[1975,"Load Management Controls Utility Premises",null,null,0,{"$f":"IF(D50=0,+'App.2-CC_NewCGAAP_DepExp_2013'!K50,+'App.2-CC_NewCGAAP_DepExp_2013'!K50+((C50*0.5)/D50))","v":0},null,0,0,null,{"$f":"IF(ISERROR(+I50+'App.2-CC_NewCGAAP_DepExp_2013'!K50-J50), 0, +I50+'App.2-CC_NewCGAAP_DepExp_2013'!K50-J50)","v":0}]
[1980,"System Supervisor Equipment",null,null,0,{"$f":"IF(D51=0,+'App.2-CC_NewCGAAP_DepExp_2013'!K51,+'App.2-CC_NewCGAAP_DepExp_2013'!K51+((C51*0.5)/D51))","v":0},null,0,0,null,{"$f":"IF(ISERROR(+I51+'App.2-CC_NewCGAAP_DepExp_2013'!K51-J51), 0, +I51+'App.2-CC_NewCGAAP_DepExp_2013'!K51-J51)","v":0}]
[1985,"Miscellaneous Fixed Assets",null,null,0,{"$f":"IF(D52=0,+'App.2-CC_NewCGAAP_DepExp_2013'!K52,+'App.2-CC_NewCGAAP_DepExp_2013'!K52+((C52*0.5)/D52))","v":0},null,0,0,null,{"$f":"IF(ISERROR(+I52+'App.2-CC_NewCGAAP_DepExp_2013'!K52-J52), 0, +I52+'App.2-CC_NewCGAAP_DepExp_2013'!K52-J52)","v":0}]
[1990,"Other Tangible Property",null,null,0,{"$f":"IF(D53=0,+'App.2-CC_NewCGAAP_DepExp_2013'!K53,+'App.2-CC_NewCGAAP_DepExp_2013'!K53+((C53*0.5)/D53))","v":0},null,0,0,null,{"$f":"IF(ISERROR(+I53+'App.2-CC_NewCGAAP_DepExp_2013'!K53-J53), 0, +I53+'App.2-CC_NewCGAAP_DepExp_2013'!K53-J53)","v":0}]
[1995,"Contributions & Grants",null,null,{"$f":"IF(D54=0,0,1/D54)","v":0},{"$f":"IF(D54=0,+'App.2-CC_NewCGAAP_DepExp_2013'!K54,+'App.2-CC_NewCGAAP_DepExp_2013'!K54+((C54*0.5)/D54))","v":0},null,0,0,null,{"$f":"IF(ISERROR(+I54+'App.2-CC_NewCGAAP_DepExp_2013'!K54-J54), 0, +I54+'App.2-CC_NewCGAAP_DepExp_2013'!K54-J54)","v":0}]
[null,"Total",{"$f":"SUM(C17:C54)","v":0},null,null,{"$f":"SUM(F17:F54)","v":0},0,0,0,0,0]
[null,"Depreciation exp. adj. from gain or loss on the retirement of assets (pool of like assets)"]
[null,"Total Depreciation Expense",null,null,null,{"$f":"+F56+F55","v":0}]
[]
["Notes:"]
[1,"Board policy of the \"half-year\" rule - the applicant must ensure that additions in the year attract a half-year depreciation expense in the first year.  Deviations from this standard practice must be supported in the application."]
[2,"The applicant must provide an explanation of material variances in evidence."]
[3,"This column refers to the calculated full year depreciation but excludes the depreciation expense on assets fully depreciated during the year.  This column is used for the purpose of calculating depreciation expense in the following year on the next worksheet."]
[]
["General:","Applicants must provide a breakdown of depreciation and amortization expense in the above format for all relevant accounts.  Asset Retirement Obligations (AROs), depreciation and accretion expense should be disclosed separately consistent with the Notes of historical Audited Financial Statements."]

{"sheet":"App.2-CE_MIFRS_DepExp_2015","index":14,"n_rows":63,"n_cols":11,"rows_kept":63,"cut":false,"hidden":false,"merged":[[14,9,15,9],[64,1,65,7],[8,0,8,8],[9,0,9,8],[14,1,15,1],[14,6,15,6],[56,1,56,4],[58,1,58,7],[59,1,59,8],[61,1,61,8],[62,1,63,7],[10,0,10,7],[60,1,60,10]]}
[null,null,null,null,null,null,"File Number:",{"$f":"EBNUMBER","v":"EB-2016-0061"}]
[null,null,null,null,null,null,"Exhibit:"]
[null,null,null,null,null,null,"Tab:"]
[null,null,null,null,null,null,"Schedule:"]
[null,null,null,null,null,null,"Page:"]
[]
[null,null,null,null,null,null,"Date:"]
[]
["Appendix 2-CE"]
["Depreciation and Amortization Expense"]
["Assumes the applicant made capitalization and depreciation expense accounting policy changes under CGAAP effective January 1, 2012 and has adopted IFRS for financial reporting purposes effective January 1, 2015."]
[]
[null,null,2015,"MIFRS"]
[]
["Account","Description","Additions","Years (new additions only)","Depreciation Rate on New Additions","2015 Depreciation Expense 1","2015 Depreciation Expense per Appendix 2-BA Fixed Assets, Column J\n (l)","Variance 2","Depreciation Expense on 2015 Full Year Additions","Less Depreciation Expense on Assets Fully Depreciated during the year\n(o)","2015 Full Year Depreciation 3"]
[null,null,"(d)","(f)","(g) = 1 / (f)","(h)=2014 Full Year Depreciation + ((d)*0.5)/(f) ",null,"(m) = (h) - (l)","(n)=((d))/(f) ",null,"(p) = 2014 Full Year Depreciation  + (n) - (o)"]
[1611,"Computer Software (Formally known as Account 1925)",null,null,{"$f":"IF(D17=0,0,1/D17)","v":0},{"$f":"IF(D17=0,'App.2-CD_MIFRS_DepExp_2014'!K17,+'App.2-CD_MIFRS_DepExp_2014'!K17+((C17*0.5)/D17))","v":0},null,{"$f":"IF(ISERROR(+F17-G17), 0, +F17-G17)","v":0},{"$f":"IF(D17=0,0,+(C17)/D17)","v":0},null,{"$f":"IF(ISERROR(+I17+'App.2-CD_MIFRS_DepExp_2014'!K17-J17), 0, +I17+'App.2-CD_MIFRS_DepExp_2014'!K17-J17)","v":0}]
[1612,"Land Rights (Formally known as Account 1906)",null,null,0,{"$f":"IF(D18=0,'App.2-CD_MIFRS_DepExp_2014'!K18,+'App.2-CD_MIFRS_DepExp_2014'!K18+((C18*0.5)/D18))","v":0},null,0,{"$f":"IF(D18=0,0,+(C18)/D18)","v":0},null,{"$f":"IF(ISERROR(+I18+'App.2-CD_MIFRS_DepExp_2014'!K18-J18), 0, +I18+'App.2-CD_MIFRS_DepExp_2014'!K18-J18)","v":0}]
[1805,"Land",null,null,0,{"$f":"IF(D19=0,'App.2-CD_MIFRS_DepExp_2014'!K19,+'App.2-CD_MIFRS_DepExp_2014'!K19+((C19*0.5)/D19))","v":0},null,0,0,null,{"$f":"IF(ISERROR(+I19+'App.2-CD_MIFRS_DepExp_2014'!K19-J19), 0, +I19+'App.2-CD_MIFRS_DepExp_2014'!K19-J19)","v":0}]
[1808,"Buildings",null,null,0,{"$f":"IF(D20=0,'App.2-CD_MIFRS_DepExp_2014'!K20,+'App.2-CD_MIFRS_DepExp_2014'!K20+((C20*0.5)/D20))","v":0},null,0,0,null,{"$f":"IF(ISERROR(+I20+'App.2-CD_MIFRS_DepExp_2014'!K20-J20), 0, +I20+'App.2-CD_MIFRS_DepExp_2014'!K20-J20)","v":0}]
[1810,"Leasehold Improvements",null,null,0,{"$f":"IF(D21=0,'App.2-CD_MIFRS_DepExp_2014'!K21,+'App.2-CD_MIFRS_DepExp_2014'!K21+((C21*0.5)/D21))","v":0},null,0,0,null,{"$f":"IF(ISERROR(+I21+'App.2-CD_MIFRS_DepExp_2014'!K21-J21), 0, +I21+'App.2-CD_MIFRS_DepExp_2014'!K21-J21)","v":0}]
[1815,"Transformer Station Equipment >50 kV",null,null,0,{"$f":"IF(D22=0,'App.2-CD_MIFRS_DepExp_2014'!K22,+'App.2-CD_MIFRS_DepExp_2014'!K22+((C22*0.5)/D22))","v":0},null,0,0,null,{"$f":"IF(ISERROR(+I22+'App.2-CD_MIFRS_DepExp_2014'!K22-J22), 0, +I22+'App.2-CD_MIFRS_DepExp_2014'!K22-J22)","v":0}]
[1820,"Distribution Station Equipment <50 kV",null,null,0,{"$f":"IF(D23=0,'App.2-CD_MIFRS_DepExp_2014'!K23,+'App.2-CD_MIFRS_DepExp_2014'!K23+((C23*0.5)/D23))","v":0},null,0,0,null,{"$f":"IF(ISERROR(+I23+'App.2-CD_MIFRS_DepExp_2014'!K23-J23), 0, +I23+'App.2-CD_MIFRS_DepExp_2014'!K23-J23)","v":0}]
[1825,"Storage Battery Equipment",null,null,0,{"$f":"IF(D24=0,'App.2-CD_MIFRS_DepExp_2014'!K24,+'App.2-CD_MIFRS_DepExp_2014'!K24+((C24*0.5)/D24))","v":0},null,0,0,null,{"$f":"IF(ISERROR(+I24+'App.2-CD_MIFRS_DepExp_2014'!K24-J24), 0, +I24+'App.2-CD_MIFRS_DepExp_2014'!K24-J24)","v":0}]
[1830,"Poles, Towers & Fixtures",null,null,0,{"$f":"IF(D25=0,'App.2-CD_MIFRS_DepExp_2014'!K25,+'App.2-CD_MIFRS_DepExp_2014'!K25+((C25*0.5)/D25))","v":0},null,0,0,null,{"$f":"IF(ISERROR(+I25+'App.2-CD_MIFRS_DepExp_2014'!K25-J25), 0, +I25+'App.2-CD_MIFRS_DepExp_2014'!K25-J25)","v":0}]
[1835,"Overhead Conductors & Devices",null,null,0,{"$f":"IF(D26=0,'App.2-CD_MIFRS_DepExp_2014'!K26,+'App.2-CD_MIFRS_DepExp_2014'!K26+((C26*0.5)/D26))","v":0},null,0,0,null,{"$f":"IF(ISERROR(+I26+'App.2-CD_MIFRS_DepExp_2014'!K26-J26), 0, +I26+'App.2-CD_MIFRS_DepExp_2014'!K26-J26)","v":0}]
[1840,"Underground Conduit",null,null,0,{"$f":"IF(D27=0,'App.2-CD_MIFRS_DepExp_2014'!K27,+'App.2-CD_MIFRS_DepExp_2014'!K27+((C27*0.5)/D27))","v":0},null,0,0,null,{"$f":"IF(ISERROR(+I27+'App.2-CD_MIFRS_DepExp_2014'!K27-J27), 0, +I27+'App.2-CD_MIFRS_DepExp_2014'!K27-J27)","v":0}]
[1845,"Underground Conductors & Devices",null,null,0,{"$f":"IF(D28=0,'App.2-CD_MIFRS_DepExp_2014'!K28,+'App.2-CD_MIFRS_DepExp_2014'!K28+((C28*0.5)/D28))","v":0},null,0,0,null,{"$f":"IF(ISERROR(+I28+'App.2-CD_MIFRS_DepExp_2014'!K28-J28), 0, +I28+'App.2-CD_MIFRS_DepExp_2014'!K28-J28)","v":0}]
[1850,"Line Transformers",null,null,0,{"$f":"IF(D29=0,'App.2-CD_MIFRS_DepExp_2014'!K29,+'App.2-CD_MIFRS_DepExp_2014'!K29+((C29*0.5)/D29))","v":0},null,0,0,null,{"$f":"IF(ISERROR(+I29+'App.2-CD_MIFRS_DepExp_2014'!K29-J29), 0, +I29+'App.2-CD_MIFRS_DepExp_2014'!K29-J29)","v":0}]
[1855,"Services (Overhead & Underground)",null,null,0,{"$f":"IF(D30=0,'App.2-CD_MIFRS_DepExp_2014'!K30,+'App.2-CD_MIFRS_DepExp_2014'!K30+((C30*0.5)/D30))","v":0},null,0,0,null,{"$f":"IF(ISERROR(+I30+'App.2-CD_MIFRS_DepExp_2014'!K30-J30), 0, +I30+'App.2-CD_MIFRS_DepExp_2014'!K30-J30)","v":0}]
[1860,"Meters",null,null,0,{"$f":"IF(D31=0,'App.2-CD_MIFRS_DepExp_2014'!K31,+'App.2-CD_MIFRS_DepExp_2014'!K31+((C31*0.5)/D31))","v":0},null,0,0,null,{"$f":"IF(ISERROR(+I31+'App.2-CD_MIFRS_DepExp_2014'!K31-J31), 0, +I31+'App.2-CD_MIFRS_DepExp_2014'!K31-J31)","v":0}]
[1860,"Meters (Smart Meters)",null,null,0,{"$f":"IF(D32=0,'App.2-CD_MIFRS_DepExp_2014'!K32,+'App.2-CD_MIFRS_DepExp_2014'!K32+((C32*0.5)/D32))","v":0},null,0,0,null,{"$f":"IF(ISERROR(+I32+'App.2-CD_MIFRS_DepExp_2014'!K32-J32), 0, +I32+'App.2-CD_MIFRS_DepExp_2014'!K32-J32)","v":0}]
[1905,"Land",null,null,0,{"$f":"IF(D33=0,'App.2-CD_MIFRS_DepExp_2014'!K33,+'App.2-CD_MIFRS_DepExp_2014'!K33+((C33*0.5)/D33))","v":0},null,0,0,null,{"$f":"IF(ISERROR(+I33+'App.2-CD_MIFRS_DepExp_2014'!K33-J33), 0, +I33+'App.2-CD_MIFRS_DepExp_2014'!K33-J33)","v":0}]
[1908,"Buildings & Fixtures",null,null,0,{"$f":"IF(D34=0,'App.2-CD_MIFRS_DepExp_2014'!K34,+'App.2-CD_MIFRS_DepExp_2014'!K34+((C34*0.5)/D34))","v":0},null,0,0,null,{"$f":"IF(ISERROR(+I34+'App.2-CD_MIFRS_DepExp_2014'!K34-J34), 0, +I34+'App.2-CD_MIFRS_DepExp_2014'!K34-J34)","v":0}]
[1910,"Leasehold Improvements",null,null,0,{"$f":"IF(D35=0,'App.2-CD_MIFRS_DepExp_2014'!K35,+'App.2-CD_MIFRS_DepExp_2014'!K35+((C35*0.5)/D35))","v":0},null,0,0,null,{"$f":"IF(ISERROR(+I35+'App.2-CD_MIFRS_DepExp_2014'!K35-J35), 0, +I35+'App.2-CD_MIFRS_DepExp_2014'!K35-J35)","v":0}]
[1915,"Office Furniture & Equipment (10 years)",null,null,0,{"$f":"IF(D36=0,'App.2-CD_MIFRS_DepExp_2014'!K36,+'App.2-CD_MIFRS_DepExp_2014'!K36+((C36*0.5)/D36))","v":0},null,0,0,null,{"$f":"IF(ISERROR(+I36+'App.2-CD_MIFRS_DepExp_2014'!K36-J36), 0, +I36+'App.2-CD_MIFRS_DepExp_2014'!K36-J36)","v":0}]
[1915,"Office Furniture & Equipment (5 years)",null,null,0,{"$f":"IF(D37=0,'App.2-CD_MIFRS_DepExp_2014'!K37,+'App.2-CD_MIFRS_DepExp_2014'!K37+((C37*0.5)/D37))","v":0},null,0,0,null,{"$f":"IF(ISERROR(+I37+'App.2-CD_MIFRS_DepExp_2014'!K37-J37), 0, +I37+'App.2-CD_MIFRS_DepExp_2014'!K37-J37)","v":0}]
[1920,"Computer Equipment - Hardware",null,null,0,{"$f":"IF(D38=0,'App.2-CD_MIFRS_DepExp_2014'!K38,+'App.2-CD_MIFRS_DepExp_2014'!K38+((C38*0.5)/D38))","v":0},null,0,0,null,{"$f":"IF(ISERROR(+I38+'App.2-CD_MIFRS_DepExp_2014'!K38-J38), 0, +I38+'App.2-CD_MIFRS_DepExp_2014'!K38-J38)","v":0}]
[1920,"Computer Equip.-Hardware(Post Mar. 22/04)",null,null,0,{"$f":"IF(D39=0,'App.2-CD_MIFRS_DepExp_2014'!K39,+'App.2-CD_MIFRS_DepExp_2014'!K39+((C39*0.5)/D39))","v":0},null,0,0,null,{"$f":"IF(ISERROR(+I39+'App.2-CD_MIFRS_DepExp_2014'!K39-J39), 0, +I39+'App.2-CD_MIFRS_DepExp_2014'!K39-J39)","v":0}]
[1920,"Computer Equip.-Hardware(Post Mar. 19/07)",null,null,0,{"$f":"IF(D40=0,'App.2-CD_MIFRS_DepExp_2014'!K40,+'App.2-CD_MIFRS_DepExp_2014'!K40+((C40*0.5)/D40))","v":0},null,0,0,null,{"$f":"IF(ISERROR(+I40+'App.2-CD_MIFRS_DepExp_2014'!K40-J40), 0, +I40+'App.2-CD_MIFRS_DepExp_2014'!K40-J40)","v":0}]
[1930,"Transportation Equipment",null,null,0,{"$f":"IF(D41=0,'App.2-CD_MIFRS_DepExp_2014'!K41,+'App.2-CD_MIFRS_DepExp_2014'!K41+((C41*0.5)/D41))","v":0},null,0,0,null,{"$f":"IF(ISERROR(+I41+'App.2-CD_MIFRS_DepExp_2014'!K41-J41), 0, +I41+'App.2-CD_MIFRS_DepExp_2014'!K41-J41)","v":0}]
[1935,"Stores Equipment",null,null,0,{"$f":"IF(D42=0,'App.2-CD_MIFRS_DepExp_2014'!K42,+'App.2-CD_MIFRS_DepExp_2014'!K42+((C42*0.5)/D42))","v":0},null,0,0,null,{"$f":"IF(ISERROR(+I42+'App.2-CD_MIFRS_DepExp_2014'!K42-J42), 0, +I42+'App.2-CD_MIFRS_DepExp_2014'!K42-J42)","v":0}]
[1940,"Tools, Shop & Garage Equipment",null,null,0,{"$f":"IF(D43=0,'App.2-CD_MIFRS_DepExp_2014'!K43,+'App.2-CD_MIFRS_DepExp_2014'!K43+((C43*0.5)/D43))","v":0},null,0,0,null,{"$f":"IF(ISERROR(+I43+'App.2-CD_MIFRS_DepExp_2014'!K43-J43), 0, +I43+'App.2-CD_MIFRS_DepExp_2014'!K43-J43)","v":0}]
[1945,"Measurement & Testing Equipment",null,null,0,{"$f":"IF(D44=0,'App.2-CD_MIFRS_DepExp_2014'!K44,+'App.2-CD_MIFRS_DepExp_2014'!K44+((C44*0.5)/D44))","v":0},null,0,0,null,{"$f":"IF(ISERROR(+I44+'App.2-CD_MIFRS_DepExp_2014'!K44-J44), 0, +I44+'App.2-CD_MIFRS_DepExp_2014'!K44-J44)","v":0}]
[1950,"Power Operated Equipment",null,null,0,{"$f":"IF(D45=0,'App.2-CD_MIFRS_DepExp_2014'!K45,+'App.2-CD_MIFRS_DepExp_2014'!K45+((C45*0.5)/D45))","v":0},null,0,0,null,{"$f":"IF(ISERROR(+I45+'App.2-CD_MIFRS_DepExp_2014'!K45-J45), 0, +I45+'App.2-CD_MIFRS_DepExp_2014'!K45-J45)","v":0}]
[1955,"Communications Equipment",null,null,0,{"$f":"IF(D46=0,'App.2-CD_MIFRS_DepExp_2014'!K46,+'App.2-CD_MIFRS_DepExp_2014'!K46+((C46*0.5)/D46))","v":0},null,0,0,null,{"$f":"IF(ISERROR(+I46+'App.2-CD_MIFRS_DepExp_2014'!K46-J46), 0, +I46+'App.2-CD_MIFRS_DepExp_2014'!K46-J46)","v":0}]
[1955,"Communication Equipment (Smart Meters)",null,null,0,{"$f":"IF(D47=0,'App.2-CD_MIFRS_DepExp_2014'!K47,+'App.2-CD_MIFRS_DepExp_2014'!K47+((C47*0.5)/D47))","v":0},null,0,0,null,{"$f":"IF(ISERROR(+I47+'App.2-CD_MIFRS_DepExp_2014'!K47-J47), 0, +I47+'App.2-CD_MIFRS_DepExp_2014'!K47-J47)","v":0}]
[1960,"Miscellaneous Equipment ",null,null,0,{"$f":"IF(D48=0,'App.2-CD_MIFRS_DepExp_2014'!K48,+'App.2-CD_MIFRS_DepExp_2014'!K48+((C48*0.5)/D48))","v":0},null,0,0,null,{"$f":"IF(ISERROR(+I48+'App.2-CD_MIFRS_DepExp_2014'!K48-J48), 0, +I48+'App.2-CD_MIFRS_DepExp_2014'!K48-J48)","v":0}]
[1970,"Load Management Controls Customer Premises",null,null,0,{"$f":"IF(D49=0,'App.2-CD_MIFRS_DepExp_2014'!K49,+'App.2-CD_MIFRS_DepExp_2014'!K49+((C49*0.5)/D49))","v":0},null,0,0,null,{"$f":"IF(ISERROR(+I49+'App.2-CD_MIFRS_DepExp_2014'!K49-J49), 0, +I49+'App.2-CD_MIFRS_DepExp_2014'!K49-J49)","v":0}]
[1975,"Load Management Controls Utility Premises",null,null,0,{"$f":"IF(D50=0,'App.2-CD_MIFRS_DepExp_2014'!K50,+'App.2-CD_MIFRS_DepExp_2014'!K50+((C50*0.5)/D50))","v":0},null,0,0,null,{"$f":"IF(ISERROR(+I50+'App.2-CD_MIFRS_DepExp_2014'!K50-J50), 0, +I50+'App.2-CD_MIFRS_DepExp_2014'!K50-J50)","v":0}]
[1980,"System Supervisor Equipment",null,null,0,{"$f":"IF(D51=0,'App.2-CD_MIFRS_DepExp_2014'!K51,+'App.2-CD_MIFRS_DepExp_2014'!K51+((C51*0.5)/D51))","v":0},null,0,0,null,{"$f":"IF(ISERROR(+I51+'App.2-CD_MIFRS_DepExp_2014'!K51-J51), 0, +I51+'App.2-CD_MIFRS_DepExp_2014'!K51-J51)","v":0}]
[1985,"Miscellaneous Fixed Assets",null,null,0,{"$f":"IF(D52=0,'App.2-CD_MIFRS_DepExp_2014'!K52,+'App.2-CD_MIFRS_DepExp_2014'!K52+((C52*0.5)/D52))","v":0},null,0,0,null,{"$f":"IF(ISERROR(+I52+'App.2-CD_MIFRS_DepExp_2014'!K52-J52), 0, +I52+'App.2-CD_MIFRS_DepExp_2014'!K52-J52)","v":0}]
[1990,"Other Tangible Property",null,null,0,{"$f":"IF(D53=0,'App.2-CD_MIFRS_DepExp_2014'!K53,+'App.2-CD_MIFRS_DepExp_2014'!K53+((C53*0.5)/D53))","v":0},null,0,0,null,{"$f":"IF(ISERROR(+I53+'App.2-CD_MIFRS_DepExp_2014'!K53-J53), 0, +I53+'App.2-CD_MIFRS_DepExp_2014'!K53-J53)","v":0}]
[1995,"Contributions & Grants",null,null,0,{"$f":"IF(D54=0,'App.2-CD_MIFRS_DepExp_2014'!K54,+'App.2-CD_MIFRS_DepExp_2014'!K54+((C54*0.5)/D54))","v":0},null,0,0,null,{"$f":"IF(ISERROR(+I54+'App.2-CD_MIFRS_DepExp_2014'!K54-J54), 0, +I54+'App.2-CD_MIFRS_DepExp_2014'!K54-J54)","v":0}]
[null,"Total",{"$f":"SUM(C17:C54)","v":0},null,null,{"$f":"SUM(F17:F54)","v":0},{"$f":"SUM(G17:G54)","v":0},{"$f":"SUM(H17:H54)","v":0},{"$f":"SUM(I17:I54)","v":0},0,{"$f":"SUM(K17:K54)","v":0}]
[null,"Depreciation exp. adj. from gain or loss on the retirement of assets (pool of like assets)"]
[null,"Total Depreciation expense to be included in the test year revenue requirement",null,null,null,{"$f":"SUM(F55:F56)","v":0}]
["Notes:"]
[1,"Board policy of the \"half-year\" rule - the applicant must ensure that additions in the year attract a half-year depreciation expense in the first year.  Deviations from this standard practice must be supported in the application."]
[2,"The applicant must provide an explanation of material variances in evidence."]
[3,"This column refers to the calculated full year depreciation but excludes the depreciation expense on assets fully depreciated during the year.  This column is used for the purpose of calculating depreciation expense in the following year on the next worksheet."]
[]
["General:","Applicants must provide a breakdown of depreciation and amortization expense in the above format for all relevant accounts.  Asset Retirement Obligations (AROs), depreciation and accretion expense should be disclosed separately consistent with the Notes of historical Audited Financial Statements."]

{"sheet":"App.2-CF_MIFRS_DepExp_2016","index":15,"n_rows":63,"n_cols":8,"rows_kept":63,"cut":false,"hidden":false,"merged":[[56,1,56,4],[8,0,8,8],[9,0,9,8],[10,0,10,7],[14,1,15,1],[14,6,15,6],[58,1,58,7],[59,1,59,8],[61,1,61,8],[62,1,63,7],[64,1,65,7]]}
[null,null,null,null,null,null,"File Number:",{"$f":"EBNUMBER","v":"EB-2016-0061"}]
[null,null,null,null,null,null,"Exhibit:"]
[null,null,null,null,null,null,"Tab:"]
[null,null,null,null,null,null,"Schedule:"]
[null,null,null,null,null,null,"Page:"]
[]
[null,null,null,null,null,null,"Date:"]
[]
["Appendix 2-CF"]
["Depreciation and Amortization Expense"]
["Assumes the applicant made capitalization and depreciation expense accounting policy changes under CGAAP effective January 1, 2012 and has adopted IFRS for financial reporting purposes effective January 1, 2015."]
[]
[null,null,2016,"MIFRS"]
[]
["Account","Description","Additions","Years (new additions only)","Depreciation Rate on New Additions","2016 Depreciation Expense 1","2016 Depreciation Expense per Appendix 2-BA Fixed Assets, Column J\n (l)","Variance 2"]
[null,null,"(d)","(f)","(g) = 1 / (f)","(h)=2015 Full Year Depreciation + ((d)*0.5)/(f) ",null,"(m) = (h) - (l)"]
[1611,"Computer Software (Formally known as Account 1925)",null,null,{"$f":"IF(D17=0,0,1/D17)","v":0},{"$f":"IF(D17=0,'App.2-CE_MIFRS_DepExp_2015'!K17,+'App.2-CE_MIFRS_DepExp_2015'!K17+((C17*0.5)/D17))","v":0},null,{"$f":"IF(ISERROR(+F17-G17), 0, +F17-G17)","v":0}]
[1612,"Land Rights (Formally known as Account 1906)",null,null,0,{"$f":"IF(D18=0,'App.2-CE_MIFRS_DepExp_2015'!K18,+'App.2-CE_MIFRS_DepExp_2015'!K18+((C18*0.5)/D18))","v":0},null,0]
[1805,"Land",null,null,0,{"$f":"IF(D19=0,'App.2-CE_MIFRS_DepExp_2015'!K19,+'App.2-CE_MIFRS_DepExp_2015'!K19+((C19*0.5)/D19))","v":0},null,0]
[1808,"Buildings",null,null,0,{"$f":"IF(D20=0,'App.2-CE_MIFRS_DepExp_2015'!K20,+'App.2-CE_MIFRS_DepExp_2015'!K20+((C20*0.5)/D20))","v":0},null,0]
[1810,"Leasehold Improvements",null,null,0,{"$f":"IF(D21=0,'App.2-CE_MIFRS_DepExp_2015'!K21,+'App.2-CE_MIFRS_DepExp_2015'!K21+((C21*0.5)/D21))","v":0},null,0]
[1815,"Transformer Station Equipment >50 kV",null,null,0,{"$f":"IF(D22=0,'App.2-CE_MIFRS_DepExp_2015'!K22,+'App.2-CE_MIFRS_DepExp_2015'!K22+((C22*0.5)/D22))","v":0},null,0]
[1820,"Distribution Station Equipment <50 kV",null,null,0,{"$f":"IF(D23=0,'App.2-CE_MIFRS_DepExp_2015'!K23,+'App.2-CE_MIFRS_DepExp_2015'!K23+((C23*0.5)/D23))","v":0},null,0]
[1825,"Storage Battery Equipment",null,null,0,{"$f":"IF(D24=0,'App.2-CE_MIFRS_DepExp_2015'!K24,+'App.2-CE_MIFRS_DepExp_2015'!K24+((C24*0.5)/D24))","v":0},null,0]
[1830,"Poles, Towers & Fixtures",null,null,0,{"$f":"IF(D25=0,'App.2-CE_MIFRS_DepExp_2015'!K25,+'App.2-CE_MIFRS_DepExp_2015'!K25+((C25*0.5)/D25))","v":0},null,0]
[1835,"Overhead Conductors & Devices",null,null,0,{"$f":"IF(D26=0,'App.2-CE_MIFRS_DepExp_2015'!K26,+'App.2-CE_MIFRS_DepExp_2015'!K26+((C26*0.5)/D26))","v":0},null,0]
[1840,"Underground Conduit",null,null,0,{"$f":"IF(D27=0,'App.2-CE_MIFRS_DepExp_2015'!K27,+'App.2-CE_MIFRS_DepExp_2015'!K27+((C27*0.5)/D27))","v":0},null,0]
[1845,"Underground Conductors & Devices",null,null,0,{"$f":"IF(D28=0,'App.2-CE_MIFRS_DepExp_2015'!K28,+'App.2-CE_MIFRS_DepExp_2015'!K28+((C28*0.5)/D28))","v":0},null,0]
[1850,"Line Transformers",null,null,0,{"$f":"IF(D29=0,'App.2-CE_MIFRS_DepExp_2015'!K29,+'App.2-CE_MIFRS_DepExp_2015'!K29+((C29*0.5)/D29))","v":0},null,0]
[1855,"Services (Overhead & Underground)",null,null,0,{"$f":"IF(D30=0,'App.2-CE_MIFRS_DepExp_2015'!K30,+'App.2-CE_MIFRS_DepExp_2015'!K30+((C30*0.5)/D30))","v":0},null,0]
[1860,"Meters",null,null,0,{"$f":"IF(D31=0,'App.2-CE_MIFRS_DepExp_2015'!K31,+'App.2-CE_MIFRS_DepExp_2015'!K31+((C31*0.5)/D31))","v":0},null,0]
[1860,"Meters (Smart Meters)",null,null,0,{"$f":"IF(D32=0,'App.2-CE_MIFRS_DepExp_2015'!K32,+'App.2-CE_MIFRS_DepExp_2015'!K32+((C32*0.5)/D32))","v":0},null,0]
[1905,"Land",null,null,0,{"$f":"IF(D33=0,'App.2-CE_MIFRS_DepExp_2015'!K33,+'App.2-CE_MIFRS_DepExp_2015'!K33+((C33*0.5)/D33))","v":0},null,0]
[1908,"Buildings & Fixtures",null,null,0,{"$f":"IF(D34=0,'App.2-CE_MIFRS_DepExp_2015'!K34,+'App.2-CE_MIFRS_DepExp_2015'!K34+((C34*0.5)/D34))","v":0},null,0]
[1910,"Leasehold Improvements",null,null,0,{"$f":"IF(D35=0,'App.2-CE_MIFRS_DepExp_2015'!K35,+'App.2-CE_MIFRS_DepExp_2015'!K35+((C35*0.5)/D35))","v":0},null,0]
[1915,"Office Furniture & Equipment (10 years)",null,null,0,{"$f":"IF(D36=0,'App.2-CE_MIFRS_DepExp_2015'!K36,+'App.2-CE_MIFRS_DepExp_2015'!K36+((C36*0.5)/D36))","v":0},null,0]
[1915,"Office Furniture & Equipment (5 years)",null,null,0,{"$f":"IF(D37=0,'App.2-CE_MIFRS_DepExp_2015'!K37,+'App.2-CE_MIFRS_DepExp_2015'!K37+((C37*0.5)/D37))","v":0},null,0]
[1920,"Computer Equipment - Hardware",null,null,0,{"$f":"IF(D38=0,'App.2-CE_MIFRS_DepExp_2015'!K38,+'App.2-CE_MIFRS_DepExp_2015'!K38+((C38*0.5)/D38))","v":0},null,0]
[1920,"Computer Equip.-Hardware(Post Mar. 22/04)",null,null,0,{"$f":"IF(D39=0,'App.2-CE_MIFRS_DepExp_2015'!K39,+'App.2-CE_MIFRS_DepExp_2015'!K39+((C39*0.5)/D39))","v":0},null,0]
[1920,"Computer Equip.-Hardware(Post Mar. 19/07)",null,null,0,{"$f":"IF(D40=0,'App.2-CE_MIFRS_DepExp_2015'!K40,+'App.2-CE_MIFRS_DepExp_2015'!K40+((C40*0.5)/D40))","v":0},null,0]
[1930,"Transportation Equipment",null,null,0,{"$f":"IF(D41=0,'App.2-CE_MIFRS_DepExp_2015'!K41,+'App.2-CE_MIFRS_DepExp_2015'!K41+((C41*0.5)/D41))","v":0},null,0]
[1935,"Stores Equipment",null,null,0,{"$f":"IF(D42=0,'App.2-CE_MIFRS_DepExp_2015'!K42,+'App.2-CE_MIFRS_DepExp_2015'!K42+((C42*0.5)/D42))","v":0},null,0]
[1940,"Tools, Shop & Garage Equipment",null,null,0,{"$f":"IF(D43=0,'App.2-CE_MIFRS_DepExp_2015'!K43,+'App.2-CE_MIFRS_DepExp_2015'!K43+((C43*0.5)/D43))","v":0},null,0]
[1945,"Measurement & Testing Equipment",null,null,0,{"$f":"IF(D44=0,'App.2-CE_MIFRS_DepExp_2015'!K44,+'App.2-CE_MIFRS_DepExp_2015'!K44+((C44*0.5)/D44))","v":0},null,0]
[1950,"Power Operated Equipment",null,null,0,{"$f":"IF(D45=0,'App.2-CE_MIFRS_DepExp_2015'!K45,+'App.2-CE_MIFRS_DepExp_2015'!K45+((C45*0.5)/D45))","v":0},null,0]
[1955,"Communications Equipment",null,null,0,{"$f":"IF(D46=0,'App.2-CE_MIFRS_DepExp_2015'!K46,+'App.2-CE_MIFRS_DepExp_2015'!K46+((C46*0.5)/D46))","v":0},null,0]
[1955,"Communication Equipment (Smart Meters)",null,null,0,{"$f":"IF(D47=0,'App.2-CE_MIFRS_DepExp_2015'!K47,+'App.2-CE_MIFRS_DepExp_2015'!K47+((C47*0.5)/D47))","v":0},null,0]
[1960,"Miscellaneous Equipment ",null,null,0,{"$f":"IF(D48=0,'App.2-CE_MIFRS_DepExp_2015'!K48,+'App.2-CE_MIFRS_DepExp_2015'!K48+((C48*0.5)/D48))","v":0},null,0]
[1970,"Load Management Controls Customer Premises",null,null,0,{"$f":"IF(D49=0,'App.2-CE_MIFRS_DepExp_2015'!K49,+'App.2-CE_MIFRS_DepExp_2015'!K49+((C49*0.5)/D49))","v":0},null,0]
[1975,"Load Management Controls Utility Premises",null,null,0,{"$f":"IF(D50=0,'App.2-CE_MIFRS_DepExp_2015'!K50,+'App.2-CE_MIFRS_DepExp_2015'!K50+((C50*0.5)/D50))","v":0},null,0]
[1980,"System Supervisor Equipment",null,null,0,{"$f":"IF(D51=0,'App.2-CE_MIFRS_DepExp_2015'!K51,+'App.2-CE_MIFRS_DepExp_2015'!K51+((C51*0.5)/D51))","v":0},null,0]
[1985,"Miscellaneous Fixed Assets",null,null,0,{"$f":"IF(D52=0,'App.2-CE_MIFRS_DepExp_2015'!K52,+'App.2-CE_MIFRS_DepExp_2015'!K52+((C52*0.5)/D52))","v":0},null,0]
[1990,"Other Tangible Property",null,null,0,{"$f":"IF(D53=0,'App.2-CE_MIFRS_DepExp_2015'!K53,+'App.2-CE_MIFRS_DepExp_2015'!K53+((C53*0.5)/D53))","v":0},null,0]
[1995,"Contributions & Grants",null,null,0,{"$f":"IF(D54=0,'App.2-CE_MIFRS_DepExp_2015'!K54,+'App.2-CE_MIFRS_DepExp_2015'!K54+((C54*0.5)/D54))","v":0},null,0]
[null,"Total",{"$f":"SUM(C17:C54)","v":0},null,null,{"$f":"SUM(F17:F54)","v":0},{"$f":"SUM(G17:G54)","v":0},{"$f":"SUM(H17:H54)","v":0}]
[null,"Depreciation exp. adj. from gain or loss on the retirement of assets (pool of like assets)"]
[null,"Total Depreciation expense to be included in the test year revenue requirement",null,null,null,{"$f":"SUM(F55:F56)","v":0}]
["Notes:"]
[1,"Board policy of the \"half-year\" rule - the applicant must ensure that additions in the year attract a half-year depreciation expense in the first year.  Deviations from this standard practice must be supported in the application."]
[2,"The applicant must provide an explanation of material variances in evidence."]
[]
[]
["General:","Applicants must provide a breakdown of depreciation and amortization expense in the above format for all relevant accounts.  Asset Retirement Obligations (AROs), depreciation and accretion expense should be disclosed separately consistent with the Notes of historical Audited Financial Statements."]

{"sheet":"App.2-CG_OldCGAAP_DepExp_2013","index":16,"n_rows":62,"n_cols":12,"rows_kept":62,"cut":false,"hidden":false,"merged":[[58,1,58,11],[59,1,60,9],[61,1,62,11],[8,0,8,11],[9,0,9,11],[14,0,15,0],[14,1,15,1],[14,10,15,10],[10,1,10,10]]}
[null,null,null,null,null,null,null,null,null,null,"File Number:",{"$f":"EBNUMBER","v":"EB-2016-0061"}]
[null,null,null,null,null,null,null,null,null,null,"Exhibit:"]
[null,null,null,null,null,null,null,null,null,null,"Tab:"]
[null,null,null,null,null,null,null,null,null,null,"Schedule:"]
[null,null,null,null,null,null,null,null,null,null,"Page:"]
[]
[null,null,null,null,null,null,null,null,null,null,"Date:"]
[]
["Appendix 2-CG"]
["Depreciation and Amortization Expense"]
[null,"Assumes the applicant made capitalization and depreciation expense accounting policy changes under CGAAP effective January 1, 2013 and has adopted IFRS for financial reporting purposes effective January 1, 2015."]
[]
[null,null,"Year",2013,"Former CGAAP"]
[]
["Account","Description","Opening Regulatory Gross PP&E as at Jan 1, 2013","Less Fully Depreciated","Net for Depreciation","Additions","Total for Depreciation 1","Years","Depreciation Rate","Depreciation Expense","2013 Depreciation Expense per Appendix 2-BA Fixed Assets, Column J\n (l)","Variance 2"]
[null,null,"(a)","(b)","(c)","(d)","(e) = (c) + ½ x (d) ","(f)","(g) = 1 / (f)","(h) = (e) / (f)",null,"(m) = (h) - (l)"]
[1611,"Computer Software (Formally known as Account 1925)",null,null,{"$f":"C17-D17","v":0},null,{"$f":"E17+0.5*F17","v":0},null,{"$f":"IF(H17=0,0,1/H17)","v":0},{"$f":"IF(H17=0,0,G17/H17)","v":0},null,{"$f":"IF(ISERROR(+J17-K17), 0, +J17-K17)","v":0}]
[1612,"Land Rights (Formally known as Account 1906)",null,null,{"$f":"C18-D18","v":0},null,{"$f":"E18+0.5*F18","v":0},null,0,0,null,0]
[1805,"Land",null,null,0,null,0,null,0,0,null,0]
[1808,"Buildings",null,null,0,null,0,null,0,0,null,0]
[1810,"Leasehold Improvements",null,null,0,null,0,null,0,0,null,0]
[1815,"Transformer Station Equipment >50 kV",null,null,0,null,0,null,0,0,null,0]
[1820,"Distribution Station Equipment <50 kV",null,null,0,null,0,null,0,0,null,0]
[1825,"Storage Battery Equipment",null,null,0,null,0,null,0,0,null,0]
[1830,"Poles, Towers & Fixtures",null,null,0,null,0,null,0,0,null,0]
[1835,"Overhead Conductors & Devices",null,null,0,null,0,null,0,0,null,0]
[1840,"Underground Conduit",null,null,0,null,0,null,0,0,null,0]
[1845,"Underground Conductors & Devices",null,null,0,null,0,null,0,0,null,0]
[1850,"Line Transformers",null,null,0,null,0,null,0,0,null,0]
[1855,"Services (Overhead & Underground)",null,null,0,null,0,null,0,0,null,0]
[1860,"Meters",null,null,0,null,0,null,0,0,null,0]
[1860,"Meters (Smart Meters)",null,null,0,null,0,null,0,0,null,0]
[1905,"Land",null,null,0,null,0,null,0,0,null,0]
[1908,"Buildings & Fixtures",null,null,0,null,0,null,0,0,null,0]
[1910,"Leasehold Improvements",null,null,0,null,0,null,0,0,null,0]
[1915,"Office Furniture & Equipment (10 years)",null,null,0,null,0,null,0,0,null,0]
[1915,"Office Furniture & Equipment (5 years)",null,null,0,null,0,null,0,0,null,0]
[1920,"Computer Equipment - Hardware",null,null,0,null,0,null,0,0,null,0]
[1920,"Computer Equip.-Hardware(Post Mar. 22/04)",null,null,0,null,0,null,0,0,null,0]
[1920,"Computer Equip.-Hardware(Post Mar. 19/07)",null,null,0,null,0,null,0,0,null,0]
[1930,"Transportation Equipment",null,null,0,null,0,null,0,0,null,0]
[1935,"Stores Equipment",null,null,0,null,0,null,0,0,null,0]
[1940,"Tools, Shop & Garage Equipment",null,null,0,null,0,null,0,0,null,0]
[1945,"Measurement & Testing Equipment",null,null,0,null,0,null,0,0,null,0]
[1950,"Power Operated Equipment",null,null,0,null,0,null,0,0,null,0]
[1955,"Communications Equipment",null,null,0,null,0,null,0,0,null,0]
[1955,"Communication Equipment (Smart Meters)",null,null,0,null,0,null,0,0,null,0]
[1960,"Miscellaneous Equipment ",null,null,0,null,0,null,0,0,null,0]
[1970,"Load Management Controls - Customer Premises",null,null,0,null,0,null,0,0,null,0]
[1975,"Load Management Controls Utility Premises",null,null,0,null,0,null,0,0,null,0]
[1980,"System Supervisor Equipment",null,null,0,null,0,null,0,0,null,0]
[1985,"Miscellaneous Fixed Assets",null,null,0,null,0,null,0,0,null,0]
[1990,"Other Tangible Property",null,null,0,null,0,null,0,0,null,0]
[1995,"Contributions & Grants",null,null,0,null,0,null,0,0,null,0]
[null,"Total",{"$f":"SUM(C17:C54)","v":0},{"$f":"SUM(D17:D54)","v":0},{"$f":"SUM(E17:E54)","v":0},{"$f":"SUM(F17:F54)","v":0},{"$f":"SUM(G17:G54)","v":0},null,null,{"$f":"SUM(J17:J54)","v":0},{"$f":"SUM(K17:K54)","v":0},{"$f":"SUM(L17:L54)","v":0}]
[]
["Notes:"]
[]
[1,"Board policy of the \"half-year\" rule - the applicant must ensure that additions in the year attract a half-year depreciation expense in the first year.  Deviations from this standard practice must be supported in the application."]
[2,"The applicant must provide an explanation of material variances in evidence."]
[]
["General","Applicants must provide a breakdown of depreciation and amortization expense in the above format for all relevant accounts.  Asset Retirement Obligations (AROs), depreciation and accretion expense should be disclosed separately consistent with the Notes of historical Audited Financial Statements."]

{"sheet":"App.2-CH_NewCGAAP_DepExp_2013","index":17,"n_rows":66,"n_cols":15,"rows_kept":66,"cut":false,"hidden":false,"merged":[[65,1,66,14],[58,1,58,14],[59,1,59,14],[60,1,60,14],[61,1,61,14],[62,1,62,14],[63,1,63,14],[8,0,8,14],[9,0,9,14],[14,0,15,0],[14,1,15,1],[14,10,15,10],[14,13,15,13],[10,0,10,14]]}
[null,null,null,null,null,null,null,null,null,null,null,null,null,"File Number:",{"$f":"EBNUMBER","v":"EB-2016-0061"}]
[null,null,null,null,null,null,null,null,null,null,null,null,null,"Exhibit:"]
[null,null,null,null,null,null,null,null,null,null,null,null,null,"Tab:"]
[null,null,null,null,null,null,null,null,null,null,null,null,null,"Schedule:"]
[null,null,null,null,null,null,null,null,null,null,null,null,null,"Page:"]
[]
[null,null,null,null,null,null,null,null,null,null,null,null,null,"Date:"]
[]
["Appendix 2-CH"]
["Depreciation and Amortization Expense"]
["Assumes the applicant made capitalization and depreciation expense accounting policy changes under CGAAP effective January 1, 2013 and has adopted IFRS for financial reporting purposes effective January 1, 2015."]
[]
[null,null,"Year",2013,"Revised CGAAP "]
[]
["Account","Description","Opening NBV as at Jan 1, 2013 5","Additions","Average Remaining Life of Opening NBV 4","Years (new additions only) 3","Depreciation Rate on New Additions","Depreciation Expense on Opening NBV","Depreciation Expense on Additions 1","2013 Depreciation Expense","2013 Depreciation Expense per Appendix 2-BA Fixed Assets, Column J\n (l)","Variance 2","Depreciation Expense on 2013 Full Year Additions","Less Depreciation Expense on Assets Fully Depreciated during the year\n(o)","2013 Full Year Depreciation 6"]
[null,null,"(a)","(d)","(i)","(f)","(g) = 1 / (f)","(j) = (a) / (i)","(h)=((d)*0.5)/(f) ","(k) = (j) + (h)",null,"(m) = (k) - (l)","(n) = (d)/(f) ",null,"(p) = (j) + (n) - (o)"]
[1611,"Computer Software (Formally known as Account 1925)",null,null,null,null,{"$f":"IF(F17=0,0,1/F17)","v":0},{"$f":"IF(E17=0,0,+C17/E17)","v":0},{"$f":"IF(F17=0,0,+(D17*0.5)/F17)","v":0},{"$f":"IF(ISERROR(+H17+I17), 0, +H17+I17)","v":0},null,{"$f":"IF(ISERROR(+J17-K17), 0, +J17-K17)","v":0},{"$f":"IF(F17=0,0,+(D17)/F17)","v":0},null,{"$f":"IF(ISERROR(+M17+H17-N17), 0, +M17+H17-N17)","v":0}]
[1612,"Land Rights (Formally known as Account 1906)",null,null,null,null,0,0,0,0,null,0,0,null,{"$f":"IF(ISERROR(+M18+H18-N18), 0, +M18+H18-N18)","v":0}]
[1805,"Land",null,null,null,null,0,0,0,0,null,0,0,null,0]
[1808,"Buildings",null,null,null,null,0,0,0,0,null,0,0,null,0]
[1810,"Leasehold Improvements",null,null,null,null,0,0,0,0,null,0,0,null,0]
[1815,"Transformer Station Equipment >50 kV",null,null,null,null,0,0,0,0,null,0,0,null,0]
[1820,"Distribution Station Equipment <50 kV",null,null,null,null,0,0,0,0,null,0,0,null,0]
[1825,"Storage Battery Equipment",null,null,null,null,0,0,0,0,null,0,0,null,0]
[1830,"Poles, Towers & Fixtures",null,null,null,null,0,0,0,0,null,0,0,null,0]
[1835,"Overhead Conductors & Devices",null,null,null,null,0,0,0,0,null,0,0,null,0]
[1840,"Underground Conduit",null,null,null,null,0,0,0,0,null,0,0,null,0]
[1845,"Underground Conductors & Devices",null,null,null,null,0,0,0,0,null,0,0,null,0]
[1850,"Line Transformers",null,null,null,null,0,0,0,0,null,0,0,null,0]
[1855,"Services (Overhead & Underground)",null,null,null,null,0,0,0,0,null,0,0,null,0]
[1860,"Meters",null,null,null,null,0,0,0,0,null,0,0,null,0]
[1860,"Meters (Smart Meters)",null,null,null,null,0,0,0,0,null,0,0,null,0]
[1905,"Land",null,null,null,null,0,0,0,0,null,0,0,null,0]
[1908,"Buildings & Fixtures",null,null,null,null,0,0,0,0,null,0,0,null,0]
[1910,"Leasehold Improvements",null,null,null,null,0,0,0,0,null,0,0,null,0]
[1915,"Office Furniture & Equipment (10 years)",null,null,null,null,0,0,0,0,null,0,0,null,0]
[1915,"Office Furniture & Equipment (5 years)",null,null,null,null,0,0,0,0,null,0,0,null,0]
[1920,"Computer Equipment - Hardware",null,null,null,null,0,0,0,0,null,0,0,null,0]
[1920,"Computer Equip.-Hardware(Post Mar. 22/04)",null,null,null,null,0,0,0,0,null,0,0,null,0]
[1920,"Computer Equip.-Hardware(Post Mar. 19/07)",null,null,null,null,0,0,0,0,null,0,0,null,0]
[1930,"Transportation Equipment",null,null,null,null,0,0,0,0,null,0,0,null,0]
[1935,"Stores Equipment",null,null,null,null,0,0,0,0,null,0,0,null,0]
[1940,"Tools, Shop & Garage Equipment",null,null,null,null,0,0,0,0,null,0,0,null,0]
[1945,"Measurement & Testing Equipment",null,null,null,null,0,0,0,0,null,0,0,null,0]
[1950,"Power Operated Equipment",null,null,null,null,0,0,0,0,null,0,0,null,0]
[1955,"Communications Equipment",null,null,null,null,0,0,0,0,null,0,0,null,0]
[1955,"Communication Equipment (Smart Meters)",null,null,null,null,0,0,0,0,null,0,0,null,0]
[1960,"Miscellaneous Equipment ",null,null,null,null,0,0,0,0,null,0,0,null,0]
[1970,"Load Management Controls - Customer Premises",null,null,null,null,0,0,0,0,null,0,0,null,0]
[1975,"Load Management Controls Utility Premises",null,null,null,null,0,0,0,0,null,0,0,null,0]
[1980,"System Supervisor Equipment",null,null,null,null,0,0,0,0,null,0,0,null,0]
[1985,"Miscellaneous Fixed Assets",null,null,null,null,0,0,0,0,null,0,0,null,0]
[1990,"Other Tangible Property",null,null,null,null,0,0,0,0,null,0,0,null,0]
[1995,"Contributions & Grants",null,null,null,null,0,0,0,0,null,0,0,null,0]
[null,"Total",{"$f":"SUM(C17:C54)","v":0},{"$f":"SUM(D17:D54)","v":0},null,null,null,{"$f":"SUM(H17:H54)","v":0},0,0,0,0,0,0,0]
[]
["Notes:"]
[]
[1,"Board policy of the \"half-year\" rule - the applicant must ensure that additions in the year attract a half-year depreciation expense in the first year.  Deviations from this standard practice must be supported in the application."]
[2,"The applicant must provide an explanation of material variances in evidence."]
[3,"The applicant should ensure that the years for new additions of assets are the asset useful lives determined by management in accordance with the Board's regulatory accounting policies.   The capitalization and depreciation expense accounting changes should be implemented consistent with the Board’s regulatory accounting policies as set out for MIFRS as contained in the Report of the Board, Transition to International Financial Reporting Standards, EB-2008-0408, the Kinectrics Report, and the Revised 2012 Accounting Procedures Handbook for Electricity Distributors."]
[4,"A recalculation should be performed to determine the average remaining life of opening balance of assets (i.e. excluding 2013 additions) under the change in policies under CGAAP.  For example, Asset A had a useful life of 20 years under CGAAP without the change in policies.  On January 1, 2013, the effective date of the changes in policies, Asset A was 3 years depreciated. As a result, Asset A would have a remaining service life of 17 years (20 years less 3 years) as of January 1, 2013.  Due to making the change in policies under CGAAP, management re-assessed the asset useful lives and concluded that the revised useful life of Asset A is now 30 years. Therefore, the average remaining useful life of the opening balance of Asset A is determined to be 27 years (30 years less 3 years) under the revised CGAAP as of January 1, 2013."]
[5," NBV must exclude assets still on the books but which have been fully amortized or depreciated."]
[6,"This column refers to the calculated full year depreciation but excludes the depreciation expense on assets fully depreciated during the year.  This column is used for the purpose of calculating depreciation expense in the following year on the next worksheet."]
[]
["General:","Applicants must provide a breakdown of depreciation and amortization expense in the above format for all relevant accounts.  Asset Retirement Obligations (AROs), depreciation and accretion expense should be disclosed separately consistent with the Notes of historical Audited Financial Statements."]

{"sheet":"App.2-CI_MIFRS_DepExp_2014","index":18,"n_rows":64,"n_cols":11,"rows_kept":64,"cut":false,"hidden":false,"merged":[[59,1,59,10],[60,1,60,10],[61,1,61,10],[63,1,64,10],[8,0,8,10],[9,0,9,10],[14,0,15,0],[14,1,15,1],[14,6,15,6],[14,9,15,9],[10,0,10,10],[56,1,56,4]]}
[null,null,null,null,null,null,null,null,null,"File Number:",{"$f":"EBNUMBER","v":"EB-2016-0061"}]
[null,null,null,null,null,null,null,null,null,"Exhibit:"]
[null,null,null,null,null,null,null,null,null,"Tab:"]
[null,null,null,null,null,null,null,null,null,"Schedule:"]
[null,null,null,null,null,null,null,null,null,"Page:"]
[]
[null,null,null,null,null,null,null,null,null,"Date:"]
[]
["Appendix 2-CI"]
["Depreciation and Amortization Expense"]
["Assumes the applicant made capitalization and depreciation expense accounting policy changes under CGAAP effective January 1, 2013 and has adopted IFRS for financial reporting purposes effective January 1, 2015."]
[]
[null,null,null,null,2014,"MIFRS"]
[]
["Account","Description","Additions","Years (new additions only)","Depreciation Rate on New Additions","2014 Depreciation Expense 1","2014 Depreciation Expense per Apppendix 2-BA Fixed Assets, Column J\n (l)","Variance 2","Depreciation Expense on 2014 Full Year Additions","Less Depreciation Expense on Assets Fully Depreciated during the year\n(o)","2014 Full Year Depreciation 3"]
[null,null,"(d)","(f)","(g) = 1 / (f)","(h)=2013 Full Year Deprecation + ((d)*0.5)/(f) ",null,"(m) = (h) - (l)","(n)=((d))/(f) ",null,"(p) = 2013 Full Year Depreciation  + (n) - (o)"]
[1611,"Computer Software (Formally known as Account 1925)",null,null,{"$f":"IF(D17=0,0,1/D17)","v":0},{"$f":"IF(D17=0,+'App.2-CH_NewCGAAP_DepExp_2013'!O17,+'App.2-CH_NewCGAAP_DepExp_2013'!O17+((C17*0.5)/D17))","v":0},null,{"$f":"IF(ISERROR(+F17-G17), 0, +F17-G17)","v":0},{"$f":"IF(D17=0,0,+(C17)/D17)","v":0},null,{"$f":"IF(ISERROR(+I17+'App.2-CH_NewCGAAP_DepExp_2013'!O17-J17), 0, +I17+'App.2-CH_NewCGAAP_DepExp_2013'!O17-J17)","v":0}]
[1612,"Land Rights (Formally known as Account 1906)",null,null,0,{"$f":"IF(D18=0,+'App.2-CH_NewCGAAP_DepExp_2013'!O18,+'App.2-CH_NewCGAAP_DepExp_2013'!O18+((C18*0.5)/D18))","v":0},null,0,0,null,{"$f":"IF(ISERROR(+I18+'App.2-CH_NewCGAAP_DepExp_2013'!O18-J18), 0, +I18+'App.2-CH_NewCGAAP_DepExp_2013'!O18-J18)","v":0}]
[1805,"Land",null,null,0,{"$f":"IF(D19=0,+'App.2-CH_NewCGAAP_DepExp_2013'!O19,+'App.2-CH_NewCGAAP_DepExp_2013'!O19+((C19*0.5)/D19))","v":0},null,0,0,null,{"$f":"IF(ISERROR(+I19+'App.2-CH_NewCGAAP_DepExp_2013'!O19-J19), 0, +I19+'App.2-CH_NewCGAAP_DepExp_2013'!O19-J19)","v":0}]
[1808,"Buildings",null,null,0,{"$f":"IF(D20=0,+'App.2-CH_NewCGAAP_DepExp_2013'!O20,+'App.2-CH_NewCGAAP_DepExp_2013'!O20+((C20*0.5)/D20))","v":0},null,0,0,null,{"$f":"IF(ISERROR(+I20+'App.2-CH_NewCGAAP_DepExp_2013'!O20-J20), 0, +I20+'App.2-CH_NewCGAAP_DepExp_2013'!O20-J20)","v":0}]
[1810,"Leasehold Improvements",null,null,0,{"$f":"IF(D21=0,+'App.2-CH_NewCGAAP_DepExp_2013'!O21,+'App.2-CH_NewCGAAP_DepExp_2013'!O21+((C21*0.5)/D21))","v":0},null,0,0,null,{"$f":"IF(ISERROR(+I21+'App.2-CH_NewCGAAP_DepExp_2013'!O21-J21), 0, +I21+'App.2-CH_NewCGAAP_DepExp_2013'!O21-J21)","v":0}]
[1815,"Transformer Station Equipment >50 kV",null,null,0,{"$f":"IF(D22=0,+'App.2-CH_NewCGAAP_DepExp_2013'!O22,+'App.2-CH_NewCGAAP_DepExp_2013'!O22+((C22*0.5)/D22))","v":0},null,0,0,null,{"$f":"IF(ISERROR(+I22+'App.2-CH_NewCGAAP_DepExp_2013'!O22-J22), 0, +I22+'App.2-CH_NewCGAAP_DepExp_2013'!O22-J22)","v":0}]
[1820,"Distribution Station Equipment <50 kV",null,null,0,{"$f":"IF(D23=0,+'App.2-CH_NewCGAAP_DepExp_2013'!O23,+'App.2-CH_NewCGAAP_DepExp_2013'!O23+((C23*0.5)/D23))","v":0},null,0,0,null,{"$f":"IF(ISERROR(+I23+'App.2-CH_NewCGAAP_DepExp_2013'!O23-J23), 0, +I23+'App.2-CH_NewCGAAP_DepExp_2013'!O23-J23)","v":0}]
[1825,"Storage Battery Equipment",null,null,0,{"$f":"IF(D24=0,+'App.2-CH_NewCGAAP_DepExp_2013'!O24,+'App.2-CH_NewCGAAP_DepExp_2013'!O24+((C24*0.5)/D24))","v":0},null,0,0,null,{"$f":"IF(ISERROR(+I24+'App.2-CH_NewCGAAP_DepExp_2013'!O24-J24), 0, +I24+'App.2-CH_NewCGAAP_DepExp_2013'!O24-J24)","v":0}]
[1830,"Poles, Towers & Fixtures",null,null,0,{"$f":"IF(D25=0,+'App.2-CH_NewCGAAP_DepExp_2013'!O25,+'App.2-CH_NewCGAAP_DepExp_2013'!O25+((C25*0.5)/D25))","v":0},null,0,0,null,{"$f":"IF(ISERROR(+I25+'App.2-CH_NewCGAAP_DepExp_2013'!O25-J25), 0, +I25+'App.2-CH_NewCGAAP_DepExp_2013'!O25-J25)","v":0}]
[1835,"Overhead Conductors & Devices",null,null,0,{"$f":"IF(D26=0,+'App.2-CH_NewCGAAP_DepExp_2013'!O26,+'App.2-CH_NewCGAAP_DepExp_2013'!O26+((C26*0.5)/D26))","v":0},null,0,0,null,{"$f":"IF(ISERROR(+I26+'App.2-CH_NewCGAAP_DepExp_2013'!O26-J26), 0, +I26+'App.2-CH_NewCGAAP_DepExp_2013'!O26-J26)","v":0}]
[1840,"Underground Conduit",null,null,0,{"$f":"IF(D27=0,+'App.2-CH_NewCGAAP_DepExp_2013'!O27,+'App.2-CH_NewCGAAP_DepExp_2013'!O27+((C27*0.5)/D27))","v":0},null,0,0,null,{"$f":"IF(ISERROR(+I27+'App.2-CH_NewCGAAP_DepExp_2013'!O27-J27), 0, +I27+'App.2-CH_NewCGAAP_DepExp_2013'!O27-J27)","v":0}]
[1845,"Underground Conductors & Devices",null,null,0,{"$f":"IF(D28=0,+'App.2-CH_NewCGAAP_DepExp_2013'!O28,+'App.2-CH_NewCGAAP_DepExp_2013'!O28+((C28*0.5)/D28))","v":0},null,0,0,null,{"$f":"IF(ISERROR(+I28+'App.2-CH_NewCGAAP_DepExp_2013'!O28-J28), 0, +I28+'App.2-CH_NewCGAAP_DepExp_2013'!O28-J28)","v":0}]
[1850,"Line Transformers",null,null,0,{"$f":"IF(D29=0,+'App.2-CH_NewCGAAP_DepExp_2013'!O29,+'App.2-CH_NewCGAAP_DepExp_2013'!O29+((C29*0.5)/D29))","v":0},null,0,0,null,{"$f":"IF(ISERROR(+I29+'App.2-CH_NewCGAAP_DepExp_2013'!O29-J29), 0, +I29+'App.2-CH_NewCGAAP_DepExp_2013'!O29-J29)","v":0}]
[1855,"Services (Overhead & Underground)",null,null,0,{"$f":"IF(D30=0,+'App.2-CH_NewCGAAP_DepExp_2013'!O30,+'App.2-CH_NewCGAAP_DepExp_2013'!O30+((C30*0.5)/D30))","v":0},null,0,0,null,{"$f":"IF(ISERROR(+I30+'App.2-CH_NewCGAAP_DepExp_2013'!O30-J30), 0, +I30+'App.2-CH_NewCGAAP_DepExp_2013'!O30-J30)","v":0}]
[1860,"Meters",null,null,0,{"$f":"IF(D31=0,+'App.2-CH_NewCGAAP_DepExp_2013'!O31,+'App.2-CH_NewCGAAP_DepExp_2013'!O31+((C31*0.5)/D31))","v":0},null,0,0,null,{"$f":"IF(ISERROR(+I31+'App.2-CH_NewCGAAP_DepExp_2013'!O31-J31), 0, +I31+'App.2-CH_NewCGAAP_DepExp_2013'!O31-J31)","v":0}]
[1860,"Meters (Smart Meters)",null,null,0,{"$f":"IF(D32=0,+'App.2-CH_NewCGAAP_DepExp_2013'!O32,+'App.2-CH_NewCGAAP_DepExp_2013'!O32+((C32*0.5)/D32))","v":0},null,0,0,null,{"$f":"IF(ISERROR(+I32+'App.2-CH_NewCGAAP_DepExp_2013'!O32-J32), 0, +I32+'App.2-CH_NewCGAAP_DepExp_2013'!O32-J32)","v":0}]
[1905,"Land",null,null,0,{"$f":"IF(D33=0,+'App.2-CH_NewCGAAP_DepExp_2013'!O33,+'App.2-CH_NewCGAAP_DepExp_2013'!O33+((C33*0.5)/D33))","v":0},null,0,0,null,{"$f":"IF(ISERROR(+I33+'App.2-CH_NewCGAAP_DepExp_2013'!O33-J33), 0, +I33+'App.2-CH_NewCGAAP_DepExp_2013'!O33-J33)","v":0}]
[1908,"Buildings & Fixtures",null,null,0,{"$f":"IF(D34=0,+'App.2-CH_NewCGAAP_DepExp_2013'!O34,+'App.2-CH_NewCGAAP_DepExp_2013'!O34+((C34*0.5)/D34))","v":0},null,0,0,null,{"$f":"IF(ISERROR(+I34+'App.2-CH_NewCGAAP_DepExp_2013'!O34-J34), 0, +I34+'App.2-CH_NewCGAAP_DepExp_2013'!O34-J34)","v":0}]
[1910,"Leasehold Improvements",null,null,0,{"$f":"IF(D35=0,+'App.2-CH_NewCGAAP_DepExp_2013'!O35,+'App.2-CH_NewCGAAP_DepExp_2013'!O35+((C35*0.5)/D35))","v":0},null,0,0,null,{"$f":"IF(ISERROR(+I35+'App.2-CH_NewCGAAP_DepExp_2013'!O35-J35), 0, +I35+'App.2-CH_NewCGAAP_DepExp_2013'!O35-J35)","v":0}]
[1915,"Office Furniture & Equipment (10 years)",null,null,0,{"$f":"IF(D36=0,+'App.2-CH_NewCGAAP_DepExp_2013'!O36,+'App.2-CH_NewCGAAP_DepExp_2013'!O36+((C36*0.5)/D36))","v":0},null,0,0,null,{"$f":"IF(ISERROR(+I36+'App.2-CH_NewCGAAP_DepExp_2013'!O36-J36), 0, +I36+'App.2-CH_NewCGAAP_DepExp_2013'!O36-J36)","v":0}]
[1915,"Office Furniture & Equipment (5 years)",null,null,0,{"$f":"IF(D37=0,+'App.2-CH_NewCGAAP_DepExp_2013'!O37,+'App.2-CH_NewCGAAP_DepExp_2013'!O37+((C37*0.5)/D37))","v":0},null,0,0,null,{"$f":"IF(ISERROR(+I37+'App.2-CH_NewCGAAP_DepExp_2013'!O37-J37), 0, +I37+'App.2-CH_NewCGAAP_DepExp_2013'!O37-J37)","v":0}]
[1920,"Computer Equipment - Hardware",null,null,0,{"$f":"IF(D38=0,+'App.2-CH_NewCGAAP_DepExp_2013'!O38,+'App.2-CH_NewCGAAP_DepExp_2013'!O38+((C38*0.5)/D38))","v":0},null,0,0,null,{"$f":"IF(ISERROR(+I38+'App.2-CH_NewCGAAP_DepExp_2013'!O38-J38), 0, +I38+'App.2-CH_NewCGAAP_DepExp_2013'!O38-J38)","v":0}]
[1920,"Computer Equip.-Hardware(Post Mar. 22/04)",null,null,0,{"$f":"IF(D39=0,+'App.2-CH_NewCGAAP_DepExp_2013'!O39,+'App.2-CH_NewCGAAP_DepExp_2013'!O39+((C39*0.5)/D39))","v":0},null,0,0,null,{"$f":"IF(ISERROR(+I39+'App.2-CH_NewCGAAP_DepExp_2013'!O39-J39), 0, +I39+'App.2-CH_NewCGAAP_DepExp_2013'!O39-J39)","v":0}]
[1920,"Computer Equip.-Hardware(Post Mar. 19/07)",null,null,0,{"$f":"IF(D40=0,+'App.2-CH_NewCGAAP_DepExp_2013'!O40,+'App.2-CH_NewCGAAP_DepExp_2013'!O40+((C40*0.5)/D40))","v":0},null,0,0,null,{"$f":"IF(ISERROR(+I40+'App.2-CH_NewCGAAP_DepExp_2013'!O40-J40), 0, +I40+'App.2-CH_NewCGAAP_DepExp_2013'!O40-J40)","v":0}]
[1930,"Transportation Equipment",null,null,0,{"$f":"IF(D41=0,+'App.2-CH_NewCGAAP_DepExp_2013'!O41,+'App.2-CH_NewCGAAP_DepExp_2013'!O41+((C41*0.5)/D41))","v":0},null,0,0,null,{"$f":"IF(ISERROR(+I41+'App.2-CH_NewCGAAP_DepExp_2013'!O41-J41), 0, +I41+'App.2-CH_NewCGAAP_DepExp_2013'!O41-J41)","v":0}]
[1935,"Stores Equipment",null,null,0,{"$f":"IF(D42=0,+'App.2-CH_NewCGAAP_DepExp_2013'!O42,+'App.2-CH_NewCGAAP_DepExp_2013'!O42+((C42*0.5)/D42))","v":0},null,0,0,null,{"$f":"IF(ISERROR(+I42+'App.2-CH_NewCGAAP_DepExp_2013'!O42-J42), 0, +I42+'App.2-CH_NewCGAAP_DepExp_2013'!O42-J42)","v":0}]
[1940,"Tools, Shop & Garage Equipment",null,null,0,{"$f":"IF(D43=0,+'App.2-CH_NewCGAAP_DepExp_2013'!O43,+'App.2-CH_NewCGAAP_DepExp_2013'!O43+((C43*0.5)/D43))","v":0},null,0,0,null,{"$f":"IF(ISERROR(+I43+'App.2-CH_NewCGAAP_DepExp_2013'!O43-J43), 0, +I43+'App.2-CH_NewCGAAP_DepExp_2013'!O43-J43)","v":0}]
[1945,"Measurement & Testing Equipment",null,null,0,{"$f":"IF(D44=0,+'App.2-CH_NewCGAAP_DepExp_2013'!O44,+'App.2-CH_NewCGAAP_DepExp_2013'!O44+((C44*0.5)/D44))","v":0},null,0,0,null,{"$f":"IF(ISERROR(+I44+'App.2-CH_NewCGAAP_DepExp_2013'!O44-J44), 0, +I44+'App.2-CH_NewCGAAP_DepExp_2013'!O44-J44)","v":0}]
[1950,"Power Operated Equipment",null,null,0,{"$f":"IF(D45=0,+'App.2-CH_NewCGAAP_DepExp_2013'!O45,+'App.2-CH_NewCGAAP_DepExp_2013'!O45+((C45*0.5)/D45))","v":0},null,0,0,null,{"$f":"IF(ISERROR(+I45+'App.2-CH_NewCGAAP_DepExp_2013'!O45-J45), 0, +I45+'App.2-CH_NewCGAAP_DepExp_2013'!O45-J45)","v":0}]
[1955,"Communications Equipment",null,null,0,{"$f":"IF(D46=0,+'App.2-CH_NewCGAAP_DepExp_2013'!O46,+'App.2-CH_NewCGAAP_DepExp_2013'!O46+((C46*0.5)/D46))","v":0},null,0,0,null,{"$f":"IF(ISERROR(+I46+'App.2-CH_NewCGAAP_DepExp_2013'!O46-J46), 0, +I46+'App.2-CH_NewCGAAP_DepExp_2013'!O46-J46)","v":0}]
[1955,"Communication Equipment (Smart Meters)",null,null,0,{"$f":"IF(D47=0,+'App.2-CH_NewCGAAP_DepExp_2013'!O47,+'App.2-CH_NewCGAAP_DepExp_2013'!O47+((C47*0.5)/D47))","v":0},null,0,0,null,{"$f":"IF(ISERROR(+I47+'App.2-CH_NewCGAAP_DepExp_2013'!O47-J47), 0, +I47+'App.2-CH_NewCGAAP_DepExp_2013'!O47-J47)","v":0}]
[1960,"Miscellaneous Equipment ",null,null,0,{"$f":"IF(D48=0,+'App.2-CH_NewCGAAP_DepExp_2013'!O48,+'App.2-CH_NewCGAAP_DepExp_2013'!O48+((C48*0.5)/D48))","v":0},null,0,0,null,{"$f":"IF(ISERROR(+I48+'App.2-CH_NewCGAAP_DepExp_2013'!O48-J48), 0, +I48+'App.2-CH_NewCGAAP_DepExp_2013'!O48-J48)","v":0}]
[1970,"Load Management Controls - Customer Premises",null,null,0,{"$f":"IF(D49=0,+'App.2-CH_NewCGAAP_DepExp_2013'!O49,+'App.2-CH_NewCGAAP_DepExp_2013'!O49+((C49*0.5)/D49))","v":0},null,0,0,null,{"$f":"IF(ISERROR(+I49+'App.2-CH_NewCGAAP_DepExp_2013'!O49-J49), 0, +I49+'App.2-CH_NewCGAAP_DepExp_2013'!O49-J49)","v":0}]
[1975,"Load Management Controls Utility Premises",null,null,0,{"$f":"IF(D50=0,+'App.2-CH_NewCGAAP_DepExp_2013'!O50,+'App.2-CH_NewCGAAP_DepExp_2013'!O50+((C50*0.5)/D50))","v":0},null,0,0,null,{"$f":"IF(ISERROR(+I50+'App.2-CH_NewCGAAP_DepExp_2013'!O50-J50), 0, +I50+'App.2-CH_NewCGAAP_DepExp_2013'!O50-J50)","v":0}]
[1980,"System Supervisor Equipment",null,null,0,{"$f":"IF(D51=0,+'App.2-CH_NewCGAAP_DepExp_2013'!O51,+'App.2-CH_NewCGAAP_DepExp_2013'!O51+((C51*0.5)/D51))","v":0},null,0,0,null,{"$f":"IF(ISERROR(+I51+'App.2-CH_NewCGAAP_DepExp_2013'!O51-J51), 0, +I51+'App.2-CH_NewCGAAP_DepExp_2013'!O51-J51)","v":0}]
[1985,"Miscellaneous Fixed Assets",null,null,0,{"$f":"IF(D52=0,+'App.2-CH_NewCGAAP_DepExp_2013'!O52,+'App.2-CH_NewCGAAP_DepExp_2013'!O52+((C52*0.5)/D52))","v":0},null,0,0,null,{"$f":"IF(ISERROR(+I52+'App.2-CH_NewCGAAP_DepExp_2013'!O52-J52), 0, +I52+'App.2-CH_NewCGAAP_DepExp_2013'!O52-J52)","v":0}]
[1990,"Other Tangible Property",null,null,0,{"$f":"IF(D53=0,+'App.2-CH_NewCGAAP_DepExp_2013'!O53,+'App.2-CH_NewCGAAP_DepExp_2013'!O53+((C53*0.5)/D53))","v":0},null,0,0,null,{"$f":"IF(ISERROR(+I53+'App.2-CH_NewCGAAP_DepExp_2013'!O53-J53), 0, +I53+'App.2-CH_NewCGAAP_DepExp_2013'!O53-J53)","v":0}]
[1995,"Contributions & Grants",null,null,{"$f":"IF(D54=0,0,1/D54)","v":0},{"$f":"IF(D54=0,+'App.2-CH_NewCGAAP_DepExp_2013'!O54,+'App.2-CH_NewCGAAP_DepExp_2013'!O54+((C54*0.5)/D54))","v":0},null,0,0,null,{"$f":"IF(ISERROR(+I54+'App.2-CH_NewCGAAP_DepExp_2013'!O54-J54), 0, +I54+'App.2-CH_NewCGAAP_DepExp_2013'!O54-J54)","v":0}]
[null,"Total",{"$f":"SUM(C17:C54)","v":0},null,null,{"$f":"SUM(F17:F54)","v":0},0,0,0,0,0]
[null,"Depreciation exp. adj. from gain or loss on the retirement of assets (pool of like assets)"]
[null,"Total Depreciation Expense",null,null,null,{"$f":"SUM(F55:F56)","v":0}]
[]
["Notes:"]
[1,"Board policy of the \"half-year\" rule - the applicant must ensure that additions in the year attract a half-year depreciation expense in the first year.  Deviations from this standard practice must be supported in the application."]
[2,"The applicant must provide an explanation of material variances in evidence."]
[3,"This column refers to the calculated full year depreciation but excludes the depreciation expense on assets fully depreciated during the year.  This column is used for the purpose of calculating depreciation expense in the following year on the next worksheet."]
[]
["General:","Applicants must provide a breakdown of depreciation and amortization expense in the above format for all relevant accounts.  Asset Retirement Obligations (AROs), depreciation and accretion expense should be disclosed separately consistent with the Notes of historical Audited Financial Statements."]

{"sheet":"App.2-CJ MIFRS_DepExp_2015","index":19,"n_rows":64,"n_cols":11,"rows_kept":64,"cut":false,"hidden":false,"merged":[[8,0,8,7],[63,1,64,7],[58,1,58,7],[59,1,59,8],[56,1,56,4],[60,1,60,10],[14,9,15,9],[10,0,10,7],[9,0,9,8],[14,1,15,1],[14,6,15,6]]}
[null,null,null,null,null,null,"File Number:",{"$f":"EBNUMBER","v":"EB-2016-0061"}]
[null,null,null,null,null,null,"Exhibit:"]
[null,null,null,null,null,null,"Tab:"]
[null,null,null,null,null,null,"Schedule:"]
[null,null,null,null,null,null,"Page:"]
[]
[null,null,null,null,null,null,"Date:"]
[]
["Appendix 2-CJ"]
["Depreciation and Amortization Expense"]
["Assumes the applicant made capitalization and depreciation expense accounting policy changes under CGAAP effective January 1, 2013 and has adopted IFRS for financial reporting purposes effective January 1, 2015."]
[]
[null,null,null,2015,"MIFRS"]
[]
["Account","Description","Additions","Years (new additions only)","Depreciation Rate on New Additions","2015 Depreciation Expense 1","2015 Depreciation Expense per Appendix 2-BA Fixed Assets, Column J\n (l)","Variance 2","Depreciation Expense on 2015 Full Year Additions","Less Depreciation Expense on Assets Fully Depreciated during the year\n(o)","2015 Full Year Depreciation 3"]
[null,null,"(d)","(f)","(g) = 1 / (f)","(h)=2014 Full Year Depreciation + ((d)*0.5)/(f) ",null,"(m) = (h) - (l)","(n)=((d))/(f) ",null,"(p) = 2014 Full Year Depreciation  + (n) - (o)"]
[1611,"Computer Software (Formally known as Account 1925)",null,null,{"$f":"IF(D17=0,0,1/D17)","v":0},{"$f":"IF(D17=0,'App.2-CI_MIFRS_DepExp_2014'!K17,+'App.2-CI_MIFRS_DepExp_2014'!K17+((C17*0.5)/D17))","v":0},null,{"$f":"IF(ISERROR(+F17-G17), 0, +F17-G17)","v":0},{"$f":"IF(D17=0,0,+(C17)/D17)","v":0},null,{"$f":"IF(ISERROR(+I17+'App.2-CI_MIFRS_DepExp_2014'!K17-J17), 0, +I17+'App.2-CI_MIFRS_DepExp_2014'!K17-J17)","v":0}]
[1612,"Land Rights (Formally known as Account 1906)",null,null,0,{"$f":"IF(D18=0,'App.2-CI_MIFRS_DepExp_2014'!K18,+'App.2-CI_MIFRS_DepExp_2014'!K18+((C18*0.5)/D18))","v":0},null,0,{"$f":"IF(D18=0,0,+(C18)/D18)","v":0},null,{"$f":"IF(ISERROR(+I18+'App.2-CI_MIFRS_DepExp_2014'!K18-J18), 0, +I18+'App.2-CI_MIFRS_DepExp_2014'!K18-J18)","v":0}]
[1805,"Land",null,null,0,{"$f":"IF(D19=0,'App.2-CI_MIFRS_DepExp_2014'!K19,+'App.2-CI_MIFRS_DepExp_2014'!K19+((C19*0.5)/D19))","v":0},null,0,0,null,{"$f":"IF(ISERROR(+I19+'App.2-CI_MIFRS_DepExp_2014'!K19-J19), 0, +I19+'App.2-CI_MIFRS_DepExp_2014'!K19-J19)","v":0}]
[1808,"Buildings",null,null,0,{"$f":"IF(D20=0,'App.2-CI_MIFRS_DepExp_2014'!K20,+'App.2-CI_MIFRS_DepExp_2014'!K20+((C20*0.5)/D20))","v":0},null,0,0,null,{"$f":"IF(ISERROR(+I20+'App.2-CI_MIFRS_DepExp_2014'!K20-J20), 0, +I20+'App.2-CI_MIFRS_DepExp_2014'!K20-J20)","v":0}]
[1810,"Leasehold Improvements",null,null,0,{"$f":"IF(D21=0,'App.2-CI_MIFRS_DepExp_2014'!K21,+'App.2-CI_MIFRS_DepExp_2014'!K21+((C21*0.5)/D21))","v":0},null,0,0,null,{"$f":"IF(ISERROR(+I21+'App.2-CI_MIFRS_DepExp_2014'!K21-J21), 0, +I21+'App.2-CI_MIFRS_DepExp_2014'!K21-J21)","v":0}]
[1815,"Transformer Station Equipment >50 kV",null,null,0,{"$f":"IF(D22=0,'App.2-CI_MIFRS_DepExp_2014'!K22,+'App.2-CI_MIFRS_DepExp_2014'!K22+((C22*0.5)/D22))","v":0},null,0,0,null,{"$f":"IF(ISERROR(+I22+'App.2-CI_MIFRS_DepExp_2014'!K22-J22), 0, +I22+'App.2-CI_MIFRS_DepExp_2014'!K22-J22)","v":0}]
[1820,"Distribution Station Equipment <50 kV",null,null,0,{"$f":"IF(D23=0,'App.2-CI_MIFRS_DepExp_2014'!K23,+'App.2-CI_MIFRS_DepExp_2014'!K23+((C23*0.5)/D23))","v":0},null,0,0,null,{"$f":"IF(ISERROR(+I23+'App.2-CI_MIFRS_DepExp_2014'!K23-J23), 0, +I23+'App.2-CI_MIFRS_DepExp_2014'!K23-J23)","v":0}]
[1825,"Storage Battery Equipment",null,null,0,{"$f":"IF(D24=0,'App.2-CI_MIFRS_DepExp_2014'!K24,+'App.2-CI_MIFRS_DepExp_2014'!K24+((C24*0.5)/D24))","v":0},null,0,0,null,{"$f":"IF(ISERROR(+I24+'App.2-CI_MIFRS_DepExp_2014'!K24-J24), 0, +I24+'App.2-CI_MIFRS_DepExp_2014'!K24-J24)","v":0}]
[1830,"Poles, Towers & Fixtures",null,null,0,{"$f":"IF(D25=0,'App.2-CI_MIFRS_DepExp_2014'!K25,+'App.2-CI_MIFRS_DepExp_2014'!K25+((C25*0.5)/D25))","v":0},null,0,0,null,{"$f":"IF(ISERROR(+I25+'App.2-CI_MIFRS_DepExp_2014'!K25-J25), 0, +I25+'App.2-CI_MIFRS_DepExp_2014'!K25-J25)","v":0}]
[1835,"Overhead Conductors & Devices",null,null,0,{"$f":"IF(D26=0,'App.2-CI_MIFRS_DepExp_2014'!K26,+'App.2-CI_MIFRS_DepExp_2014'!K26+((C26*0.5)/D26))","v":0},null,0,0,null,{"$f":"IF(ISERROR(+I26+'App.2-CI_MIFRS_DepExp_2014'!K26-J26), 0, +I26+'App.2-CI_MIFRS_DepExp_2014'!K26-J26)","v":0}]
[1840,"Underground Conduit",null,null,0,{"$f":"IF(D27=0,'App.2-CI_MIFRS_DepExp_2014'!K27,+'App.2-CI_MIFRS_DepExp_2014'!K27+((C27*0.5)/D27))","v":0},null,0,0,null,{"$f":"IF(ISERROR(+I27+'App.2-CI_MIFRS_DepExp_2014'!K27-J27), 0, +I27+'App.2-CI_MIFRS_DepExp_2014'!K27-J27)","v":0}]
[1845,"Underground Conductors & Devices",null,null,0,{"$f":"IF(D28=0,'App.2-CI_MIFRS_DepExp_2014'!K28,+'App.2-CI_MIFRS_DepExp_2014'!K28+((C28*0.5)/D28))","v":0},null,0,0,null,{"$f":"IF(ISERROR(+I28+'App.2-CI_MIFRS_DepExp_2014'!K28-J28), 0, +I28+'App.2-CI_MIFRS_DepExp_2014'!K28-J28)","v":0}]
[1850,"Line Transformers",null,null,0,{"$f":"IF(D29=0,'App.2-CI_MIFRS_DepExp_2014'!K29,+'App.2-CI_MIFRS_DepExp_2014'!K29+((C29*0.5)/D29))","v":0},null,0,0,null,{"$f":"IF(ISERROR(+I29+'App.2-CI_MIFRS_DepExp_2014'!K29-J29), 0, +I29+'App.2-CI_MIFRS_DepExp_2014'!K29-J29)","v":0}]
[1855,"Services (Overhead & Underground)",null,null,0,{"$f":"IF(D30=0,'App.2-CI_MIFRS_DepExp_2014'!K30,+'App.2-CI_MIFRS_DepExp_2014'!K30+((C30*0.5)/D30))","v":0},null,0,0,null,{"$f":"IF(ISERROR(+I30+'App.2-CI_MIFRS_DepExp_2014'!K30-J30), 0, +I30+'App.2-CI_MIFRS_DepExp_2014'!K30-J30)","v":0}]
[1860,"Meters",null,null,0,{"$f":"IF(D31=0,'App.2-CI_MIFRS_DepExp_2014'!K31,+'App.2-CI_MIFRS_DepExp_2014'!K31+((C31*0.5)/D31))","v":0},null,0,0,null,{"$f":"IF(ISERROR(+I31+'App.2-CI_MIFRS_DepExp_2014'!K31-J31), 0, +I31+'App.2-CI_MIFRS_DepExp_2014'!K31-J31)","v":0}]
[1860,"Meters (Smart Meters)",null,null,0,{"$f":"IF(D32=0,'App.2-CI_MIFRS_DepExp_2014'!K32,+'App.2-CI_MIFRS_DepExp_2014'!K32+((C32*0.5)/D32))","v":0},null,0,0,null,{"$f":"IF(ISERROR(+I32+'App.2-CI_MIFRS_DepExp_2014'!K32-J32), 0, +I32+'App.2-CI_MIFRS_DepExp_2014'!K32-J32)","v":0}]
[1905,"Land",null,null,0,{"$f":"IF(D33=0,'App.2-CI_MIFRS_DepExp_2014'!K33,+'App.2-CI_MIFRS_DepExp_2014'!K33+((C33*0.5)/D33))","v":0},null,0,0,null,{"$f":"IF(ISERROR(+I33+'App.2-CI_MIFRS_DepExp_2014'!K33-J33), 0, +I33+'App.2-CI_MIFRS_DepExp_2014'!K33-J33)","v":0}]
[1908,"Buildings & Fixtures",null,null,0,{"$f":"IF(D34=0,'App.2-CI_MIFRS_DepExp_2014'!K34,+'App.2-CI_MIFRS_DepExp_2014'!K34+((C34*0.5)/D34))","v":0},null,0,0,null,{"$f":"IF(ISERROR(+I34+'App.2-CI_MIFRS_DepExp_2014'!K34-J34), 0, +I34+'App.2-CI_MIFRS_DepExp_2014'!K34-J34)","v":0}]
[1910,"Leasehold Improvements",null,null,0,{"$f":"IF(D35=0,'App.2-CI_MIFRS_DepExp_2014'!K35,+'App.2-CI_MIFRS_DepExp_2014'!K35+((C35*0.5)/D35))","v":0},null,0,0,null,{"$f":"IF(ISERROR(+I35+'App.2-CI_MIFRS_DepExp_2014'!K35-J35), 0, +I35+'App.2-CI_MIFRS_DepExp_2014'!K35-J35)","v":0}]
[1915,"Office Furniture & Equipment (10 years)",null,null,0,{"$f":"IF(D36=0,'App.2-CI_MIFRS_DepExp_2014'!K36,+'App.2-CI_MIFRS_DepExp_2014'!K36+((C36*0.5)/D36))","v":0},null,0,0,null,{"$f":"IF(ISERROR(+I36+'App.2-CI_MIFRS_DepExp_2014'!K36-J36), 0, +I36+'App.2-CI_MIFRS_DepExp_2014'!K36-J36)","v":0}]
[1915,"Office Furniture & Equipment (5 years)",null,null,0,{"$f":"IF(D37=0,'App.2-CI_MIFRS_DepExp_2014'!K37,+'App.2-CI_MIFRS_DepExp_2014'!K37+((C37*0.5)/D37))","v":0},null,0,0,null,{"$f":"IF(ISERROR(+I37+'App.2-CI_MIFRS_DepExp_2014'!K37-J37), 0, +I37+'App.2-CI_MIFRS_DepExp_2014'!K37-J37)","v":0}]
[1920,"Computer Equipment - Hardware",null,null,0,{"$f":"IF(D38=0,'App.2-CI_MIFRS_DepExp_2014'!K38,+'App.2-CI_MIFRS_DepExp_2014'!K38+((C38*0.5)/D38))","v":0},null,0,0,null,{"$f":"IF(ISERROR(+I38+'App.2-CI_MIFRS_DepExp_2014'!K38-J38), 0, +I38+'App.2-CI_MIFRS_DepExp_2014'!K38-J38)","v":0}]
[1920,"Computer Equip.-Hardware(Post Mar. 22/04)",null,null,0,{"$f":"IF(D39=0,'App.2-CI_MIFRS_DepExp_2014'!K39,+'App.2-CI_MIFRS_DepExp_2014'!K39+((C39*0.5)/D39))","v":0},null,0,0,null,{"$f":"IF(ISERROR(+I39+'App.2-CI_MIFRS_DepExp_2014'!K39-J39), 0, +I39+'App.2-CI_MIFRS_DepExp_2014'!K39-J39)","v":0}]
[1920,"Computer Equip.-Hardware(Post Mar. 19/07)",null,null,0,{"$f":"IF(D40=0,'App.2-CI_MIFRS_DepExp_2014'!K40,+'App.2-CI_MIFRS_DepExp_2014'!K40+((C40*0.5)/D40))","v":0},null,0,0,null,{"$f":"IF(ISERROR(+I40+'App.2-CI_MIFRS_DepExp_2014'!K40-J40), 0, +I40+'App.2-CI_MIFRS_DepExp_2014'!K40-J40)","v":0}]
[1930,"Transportation Equipment",null,null,0,{"$f":"IF(D41=0,'App.2-CI_MIFRS_DepExp_2014'!K41,+'App.2-CI_MIFRS_DepExp_2014'!K41+((C41*0.5)/D41))","v":0},null,0,0,null,{"$f":"IF(ISERROR(+I41+'App.2-CI_MIFRS_DepExp_2014'!K41-J41), 0, +I41+'App.2-CI_MIFRS_DepExp_2014'!K41-J41)","v":0}]
[1935,"Stores Equipment",null,null,0,{"$f":"IF(D42=0,'App.2-CI_MIFRS_DepExp_2014'!K42,+'App.2-CI_MIFRS_DepExp_2014'!K42+((C42*0.5)/D42))","v":0},null,0,0,null,{"$f":"IF(ISERROR(+I42+'App.2-CI_MIFRS_DepExp_2014'!K42-J42), 0, +I42+'App.2-CI_MIFRS_DepExp_2014'!K42-J42)","v":0}]
[1940,"Tools, Shop & Garage Equipment",null,null,0,{"$f":"IF(D43=0,'App.2-CI_MIFRS_DepExp_2014'!K43,+'App.2-CI_MIFRS_DepExp_2014'!K43+((C43*0.5)/D43))","v":0},null,0,0,null,{"$f":"IF(ISERROR(+I43+'App.2-CI_MIFRS_DepExp_2014'!K43-J43), 0, +I43+'App.2-CI_MIFRS_DepExp_2014'!K43-J43)","v":0}]
[1945,"Measurement & Testing Equipment",null,null,0,{"$f":"IF(D44=0,'App.2-CI_MIFRS_DepExp_2014'!K44,+'App.2-CI_MIFRS_DepExp_2014'!K44+((C44*0.5)/D44))","v":0},null,0,0,null,{"$f":"IF(ISERROR(+I44+'App.2-CI_MIFRS_DepExp_2014'!K44-J44), 0, +I44+'App.2-CI_MIFRS_DepExp_2014'!K44-J44)","v":0}]
[1950,"Power Operated Equipment",null,null,0,{"$f":"IF(D45=0,'App.2-CI_MIFRS_DepExp_2014'!K45,+'App.2-CI_MIFRS_DepExp_2014'!K45+((C45*0.5)/D45))","v":0},null,0,0,null,{"$f":"IF(ISERROR(+I45+'App.2-CI_MIFRS_DepExp_2014'!K45-J45), 0, +I45+'App.2-CI_MIFRS_DepExp_2014'!K45-J45)","v":0}]
[1955,"Communications Equipment",null,null,0,{"$f":"IF(D46=0,'App.2-CI_MIFRS_DepExp_2014'!K46,+'App.2-CI_MIFRS_DepExp_2014'!K46+((C46*0.5)/D46))","v":0},null,0,0,null,{"$f":"IF(ISERROR(+I46+'App.2-CI_MIFRS_DepExp_2014'!K46-J46), 0, +I46+'App.2-CI_MIFRS_DepExp_2014'!K46-J46)","v":0}]
[1955,"Communication Equipment (Smart Meters)",null,null,0,{"$f":"IF(D47=0,'App.2-CI_MIFRS_DepExp_2014'!K47,+'App.2-CI_MIFRS_DepExp_2014'!K47+((C47*0.5)/D47))","v":0},null,0,0,null,{"$f":"IF(ISERROR(+I47+'App.2-CI_MIFRS_DepExp_2014'!K47-J47), 0, +I47+'App.2-CI_MIFRS_DepExp_2014'!K47-J47)","v":0}]
[1960,"Miscellaneous Equipment ",null,null,0,{"$f":"IF(D48=0,'App.2-CI_MIFRS_DepExp_2014'!K48,+'App.2-CI_MIFRS_DepExp_2014'!K48+((C48*0.5)/D48))","v":0},null,0,0,null,{"$f":"IF(ISERROR(+I48+'App.2-CI_MIFRS_DepExp_2014'!K48-J48), 0, +I48+'App.2-CI_MIFRS_DepExp_2014'!K48-J48)","v":0}]
[1970,"Load Management Controls - Customer Premises",null,null,0,{"$f":"IF(D49=0,'App.2-CI_MIFRS_DepExp_2014'!K49,+'App.2-CI_MIFRS_DepExp_2014'!K49+((C49*0.5)/D49))","v":0},null,0,0,null,{"$f":"IF(ISERROR(+I49+'App.2-CI_MIFRS_DepExp_2014'!K49-J49), 0, +I49+'App.2-CI_MIFRS_DepExp_2014'!K49-J49)","v":0}]
[1975,"Load Management Controls Utility Premises",null,null,0,{"$f":"IF(D50=0,'App.2-CI_MIFRS_DepExp_2014'!K50,+'App.2-CI_MIFRS_DepExp_2014'!K50+((C50*0.5)/D50))","v":0},null,0,0,null,{"$f":"IF(ISERROR(+I50+'App.2-CI_MIFRS_DepExp_2014'!K50-J50), 0, +I50+'App.2-CI_MIFRS_DepExp_2014'!K50-J50)","v":0}]
[1980,"System Supervisor Equipment",null,null,0,{"$f":"IF(D51=0,'App.2-CI_MIFRS_DepExp_2014'!K51,+'App.2-CI_MIFRS_DepExp_2014'!K51+((C51*0.5)/D51))","v":0},null,0,0,null,{"$f":"IF(ISERROR(+I51+'App.2-CI_MIFRS_DepExp_2014'!K51-J51), 0, +I51+'App.2-CI_MIFRS_DepExp_2014'!K51-J51)","v":0}]
[1985,"Miscellaneous Fixed Assets",null,null,0,{"$f":"IF(D52=0,'App.2-CI_MIFRS_DepExp_2014'!K52,+'App.2-CI_MIFRS_DepExp_2014'!K52+((C52*0.5)/D52))","v":0},null,0,0,null,{"$f":"IF(ISERROR(+I52+'App.2-CI_MIFRS_DepExp_2014'!K52-J52), 0, +I52+'App.2-CI_MIFRS_DepExp_2014'!K52-J52)","v":0}]
[1990,"Other Tangible Property",null,null,0,{"$f":"IF(D53=0,'App.2-CI_MIFRS_DepExp_2014'!K53,+'App.2-CI_MIFRS_DepExp_2014'!K53+((C53*0.5)/D53))","v":0},null,0,0,null,{"$f":"IF(ISERROR(+I53+'App.2-CI_MIFRS_DepExp_2014'!K53-J53), 0, +I53+'App.2-CI_MIFRS_DepExp_2014'!K53-J53)","v":0}]
[1995,"Contributions & Grants",null,null,0,{"$f":"IF(D54=0,'App.2-CI_MIFRS_DepExp_2014'!K54,+'App.2-CI_MIFRS_DepExp_2014'!K54+((C54*0.5)/D54))","v":0},null,0,0,null,{"$f":"IF(ISERROR(+I54+'App.2-CI_MIFRS_DepExp_2014'!K54-J54), 0, +I54+'App.2-CI_MIFRS_DepExp_2014'!K54-J54)","v":0}]
[null,"Total",{"$f":"SUM(C17:C54)","v":0},null,null,{"$f":"SUM(F17:F54)","v":0},{"$f":"SUM(G17:G54)","v":0},{"$f":"SUM(H17:H54)","v":0},{"$f":"SUM(I17:I54)","v":0},0,{"$f":"SUM(K17:K54)","v":0}]
[null,"Depreciation exp. adj. from gain or loss on the retirement of assets (pool of like assets)"]
[null,"Total Depreciation expense to be included in the test year revenue requirement",null,null,null,{"$f":"SUM(F55:F56)","v":0}]
["Notes:"]
[1,"Board policy of the \"half-year\" rule - the applicant must ensure that additions in the year attract a half-year depreciation expense in the first year.  Deviations from this standard practice must be supported in the application."]
[2,"The applicant must provide an explanation of material variances in evidence."]
[3,"This column refers to the calculated full year depreciation but excludes the depreciation expense on assets fully depreciated during the year.  This column is used for the purpose of calculating depreciation expense in the following year on the next worksheet."]
[]
[]
["General:","Applicants must provide a breakdown of depreciation and amortization expense in the above format for all relevant accounts.  Asset Retirement Obligations (AROs), depreciation and accretion expense should be disclosed separately consistent with the Notes of historical Audited Financial Statements."]

{"sheet":"App.2-CK MIFRS_DepExp_2016","index":20,"n_rows":62,"n_cols":8,"rows_kept":62,"cut":false,"hidden":false,"merged":[[58,1,58,7],[59,1,59,8],[60,1,60,8],[61,1,62,7],[8,0,8,7],[9,0,9,8],[10,0,10,7],[14,1,15,1],[14,6,15,6],[56,1,56,4]]}
[null,null,null,null,null,null,"File Number:",{"$f":"EBNUMBER","v":"EB-2016-0061"}]
[null,null,null,null,null,null,"Exhibit:"]
[null,null,null,null,null,null,"Tab:"]
[null,null,null,null,null,null,"Schedule:"]
[null,null,null,null,null,null,"Page:"]
[]
[null,null,null,null,null,null,"Date:"]
[]
["Appendix 2-CK"]
["Depreciation and Amortization Expense"]
["Assumes the applicant made capitalization and depreciation expense accounting policy changes under CGAAP effective January 1, 2013 and has adopted IFRS for financial reporting purposes effective January 1, 2015."]
[]
[null,null,null,2016,"MIFRS"]
[]
["Account","Description","Additions","Years (new additions only)","Depreciation Rate on New Additions","2016 Depreciation Expense 1","2016 Depreciation Expense per Appendix 2-BA Fixed Assets, Column J\n (l)","Variance 2"]
[null,null,"(d)","(f)","(g) = 1 / (f)","(h)=2015 Full Year Depreciation + ((d)*0.5)/(f) ",null,"(m) = (h) - (l)"]
[1611,"Computer Software (Formally known as Account 1925)",null,null,{"$f":"IF(D17=0,0,1/D17)","v":0},{"$f":"IF(D17=0,'App.2-CJ MIFRS_DepExp_2015'!K17,+'App.2-CJ MIFRS_DepExp_2015'!K17+((C17*0.5)/D17))","v":0},null,{"$f":"IF(ISERROR(+F17-G17), 0, +F17-G17)","v":0}]
[1612,"Land Rights (Formally known as Account 1906)",null,null,0,{"$f":"IF(D18=0,'App.2-CJ MIFRS_DepExp_2015'!K18,+'App.2-CJ MIFRS_DepExp_2015'!K18+((C18*0.5)/D18))","v":0},null,0]
[1805,"Land",null,null,0,{"$f":"IF(D19=0,'App.2-CJ MIFRS_DepExp_2015'!K19,+'App.2-CJ MIFRS_DepExp_2015'!K19+((C19*0.5)/D19))","v":0},null,0]
[1808,"Buildings",null,null,0,{"$f":"IF(D20=0,'App.2-CJ MIFRS_DepExp_2015'!K20,+'App.2-CJ MIFRS_DepExp_2015'!K20+((C20*0.5)/D20))","v":0},null,0]
[1810,"Leasehold Improvements",null,null,0,{"$f":"IF(D21=0,'App.2-CJ MIFRS_DepExp_2015'!K21,+'App.2-CJ MIFRS_DepExp_2015'!K21+((C21*0.5)/D21))","v":0},null,0]
[1815,"Transformer Station Equipment >50 kV",null,null,0,{"$f":"IF(D22=0,'App.2-CJ MIFRS_DepExp_2015'!K22,+'App.2-CJ MIFRS_DepExp_2015'!K22+((C22*0.5)/D22))","v":0},null,0]
[1820,"Distribution Station Equipment <50 kV",null,null,0,{"$f":"IF(D23=0,'App.2-CJ MIFRS_DepExp_2015'!K23,+'App.2-CJ MIFRS_DepExp_2015'!K23+((C23*0.5)/D23))","v":0},null,0]
[1825,"Storage Battery Equipment",null,null,0,{"$f":"IF(D24=0,'App.2-CJ MIFRS_DepExp_2015'!K24,+'App.2-CJ MIFRS_DepExp_2015'!K24+((C24*0.5)/D24))","v":0},null,0]
[1830,"Poles, Towers & Fixtures",null,null,0,{"$f":"IF(D25=0,'App.2-CJ MIFRS_DepExp_2015'!K25,+'App.2-CJ MIFRS_DepExp_2015'!K25+((C25*0.5)/D25))","v":0},null,0]
[1835,"Overhead Conductors & Devices",null,null,0,{"$f":"IF(D26=0,'App.2-CJ MIFRS_DepExp_2015'!K26,+'App.2-CJ MIFRS_DepExp_2015'!K26+((C26*0.5)/D26))","v":0},null,0]
[1840,"Underground Conduit",null,null,0,{"$f":"IF(D27=0,'App.2-CJ MIFRS_DepExp_2015'!K27,+'App.2-CJ MIFRS_DepExp_2015'!K27+((C27*0.5)/D27))","v":0},null,0]
[1845,"Underground Conductors & Devices",null,null,0,{"$f":"IF(D28=0,'App.2-CJ MIFRS_DepExp_2015'!K28,+'App.2-CJ MIFRS_DepExp_2015'!K28+((C28*0.5)/D28))","v":0},null,0]
[1850,"Line Transformers",null,null,0,{"$f":"IF(D29=0,'App.2-CJ MIFRS_DepExp_2015'!K29,+'App.2-CJ MIFRS_DepExp_2015'!K29+((C29*0.5)/D29))","v":0},null,0]
[1855,"Services (Overhead & Underground)",null,null,0,{"$f":"IF(D30=0,'App.2-CJ MIFRS_DepExp_2015'!K30,+'App.2-CJ MIFRS_DepExp_2015'!K30+((C30*0.5)/D30))","v":0},null,0]
[1860,"Meters",null,null,0,{"$f":"IF(D31=0,'App.2-CJ MIFRS_DepExp_2015'!K31,+'App.2-CJ MIFRS_DepExp_2015'!K31+((C31*0.5)/D31))","v":0},null,0]
[1860,"Meters (Smart Meters)",null,null,0,{"$f":"IF(D32=0,'App.2-CJ MIFRS_DepExp_2015'!K32,+'App.2-CJ MIFRS_DepExp_2015'!K32+((C32*0.5)/D32))","v":0},null,0]
[1905,"Land",null,null,0,{"$f":"IF(D33=0,'App.2-CJ MIFRS_DepExp_2015'!K33,+'App.2-CJ MIFRS_DepExp_2015'!K33+((C33*0.5)/D33))","v":0},null,0]
[1908,"Buildings & Fixtures",null,null,0,{"$f":"IF(D34=0,'App.2-CJ MIFRS_DepExp_2015'!K34,+'App.2-CJ MIFRS_DepExp_2015'!K34+((C34*0.5)/D34))","v":0},null,0]
[1910,"Leasehold Improvements",null,null,0,{"$f":"IF(D35=0,'App.2-CJ MIFRS_DepExp_2015'!K35,+'App.2-CJ MIFRS_DepExp_2015'!K35+((C35*0.5)/D35))","v":0},null,0]
[1915,"Office Furniture & Equipment (10 years)",null,null,0,{"$f":"IF(D36=0,'App.2-CJ MIFRS_DepExp_2015'!K36,+'App.2-CJ MIFRS_DepExp_2015'!K36+((C36*0.5)/D36))","v":0},null,0]
[1915,"Office Furniture & Equipment (5 years)",null,null,0,{"$f":"IF(D37=0,'App.2-CJ MIFRS_DepExp_2015'!K37,+'App.2-CJ MIFRS_DepExp_2015'!K37+((C37*0.5)/D37))","v":0},null,0]
[1920,"Computer Equipment - Hardware",null,null,0,{"$f":"IF(D38=0,'App.2-CJ MIFRS_DepExp_2015'!K38,+'App.2-CJ MIFRS_DepExp_2015'!K38+((C38*0.5)/D38))","v":0},null,0]
[1920,"Computer Equip.-Hardware(Post Mar. 22/04)",null,null,0,{"$f":"IF(D39=0,'App.2-CJ MIFRS_DepExp_2015'!K39,+'App.2-CJ MIFRS_DepExp_2015'!K39+((C39*0.5)/D39))","v":0},null,0]
[1920,"Computer Equip.-Hardware(Post Mar. 19/07)",null,null,0,{"$f":"IF(D40=0,'App.2-CJ MIFRS_DepExp_2015'!K40,+'App.2-CJ MIFRS_DepExp_2015'!K40+((C40*0.5)/D40))","v":0},null,0]
[1930,"Transportation Equipment",null,null,0,{"$f":"IF(D41=0,'App.2-CJ MIFRS_DepExp_2015'!K41,+'App.2-CJ MIFRS_DepExp_2015'!K41+((C41*0.5)/D41))","v":0},null,0]
[1935,"Stores Equipment",null,null,0,{"$f":"IF(D42=0,'App.2-CJ MIFRS_DepExp_2015'!K42,+'App.2-CJ MIFRS_DepExp_2015'!K42+((C42*0.5)/D42))","v":0},null,0]
[1940,"Tools, Shop & Garage Equipment",null,null,0,{"$f":"IF(D43=0,'App.2-CJ MIFRS_DepExp_2015'!K43,+'App.2-CJ MIFRS_DepExp_2015'!K43+((C43*0.5)/D43))","v":0},null,0]
[1945,"Measurement & Testing Equipment",null,null,0,{"$f":"IF(D44=0,'App.2-CJ MIFRS_DepExp_2015'!K44,+'App.2-CJ MIFRS_DepExp_2015'!K44+((C44*0.5)/D44))","v":0},null,0]
[1950,"Power Operated Equipment",null,null,0,{"$f":"IF(D45=0,'App.2-CJ MIFRS_DepExp_2015'!K45,+'App.2-CJ MIFRS_DepExp_2015'!K45+((C45*0.5)/D45))","v":0},null,0]
[1955,"Communications Equipment",null,null,0,{"$f":"IF(D46=0,'App.2-CJ MIFRS_DepExp_2015'!K46,+'App.2-CJ MIFRS_DepExp_2015'!K46+((C46*0.5)/D46))","v":0},null,0]
[1955,"Communication Equipment (Smart Meters)",null,null,0,{"$f":"IF(D47=0,'App.2-CJ MIFRS_DepExp_2015'!K47,+'App.2-CJ MIFRS_DepExp_2015'!K47+((C47*0.5)/D47))","v":0},null,0]
[1960,"Miscellaneous Equipment ",null,null,0,{"$f":"IF(D48=0,'App.2-CJ MIFRS_DepExp_2015'!K48,+'App.2-CJ MIFRS_DepExp_2015'!K48+((C48*0.5)/D48))","v":0},null,0]
[1970,"Load Management Controls - Customer Premises",null,null,0,{"$f":"IF(D49=0,'App.2-CJ MIFRS_DepExp_2015'!K49,+'App.2-CJ MIFRS_DepExp_2015'!K49+((C49*0.5)/D49))","v":0},null,0]
[1975,"Load Management Controls Utility Premises",null,null,0,{"$f":"IF(D50=0,'App.2-CJ MIFRS_DepExp_2015'!K50,+'App.2-CJ MIFRS_DepExp_2015'!K50+((C50*0.5)/D50))","v":0},null,0]
[1980,"System Supervisor Equipment",null,null,0,{"$f":"IF(D51=0,'App.2-CJ MIFRS_DepExp_2015'!K51,+'App.2-CJ MIFRS_DepExp_2015'!K51+((C51*0.5)/D51))","v":0},null,0]
[1985,"Miscellaneous Fixed Assets",null,null,0,{"$f":"IF(D52=0,'App.2-CJ MIFRS_DepExp_2015'!K52,+'App.2-CJ MIFRS_DepExp_2015'!K52+((C52*0.5)/D52))","v":0},null,0]
[1990,"Other Tangible Property",null,null,0,{"$f":"IF(D53=0,'App.2-CJ MIFRS_DepExp_2015'!K53,+'App.2-CJ MIFRS_DepExp_2015'!K53+((C53*0.5)/D53))","v":0},null,0]
[1995,"Contributions & Grants",null,null,0,{"$f":"IF(D54=0,'App.2-CJ MIFRS_DepExp_2015'!K54,+'App.2-CJ MIFRS_DepExp_2015'!K54+((C54*0.5)/D54))","v":0},null,0]
[null,"Total",{"$f":"SUM(C17:C54)","v":0},null,null,{"$f":"SUM(F17:F54)","v":0},{"$f":"SUM(G17:G54)","v":0},{"$f":"SUM(H17:H54)","v":0}]
[null,"Depreciation exp. adj. from gain or loss on the retirement of assets (pool of like assets)"]
[null,"Total Depreciation expense to be included in the test year revenue requirement",null,null,null,{"$f":"SUM(F55:F56)","v":0}]
["Notes:"]
[1,"Board policy of the \"half-year\" rule - the applicant must ensure that additions in the year attract a half-year depreciation expense in the first year.  Deviations from this standard practice must be supported in the application."]
[2,"The applicant must provide an explanation of material variances in evidence."]
[]
["General:","Applicants must provide a breakdown of depreciation and amortization expense in the above format for all relevant accounts.  Asset Retirement Obligations (AROs), depreciation and accretion expense should be disclosed separately consistent with the Notes of historical Audited Financial Statements."]

{"sheet":"App.2-D_Overhead","index":21,"n_rows":53,"n_cols":8,"rows_kept":53,"cut":false,"hidden":false,"merged":[[8,0,8,7],[9,0,9,7],[13,0,15,0],[30,0,32,0],[30,7,32,7],[11,0,11,5],[28,0,28,5],[67,0,68,0],[53,0,54,0],[53,1,54,1],[56,0,57,0],[59,0,60,0],[62,0,65,0]]}
[null,null,null,null,null,"File Number:",{"$f":"EBNUMBER","v":"EB-2016-0061"}]
[null,null,null,null,null,"Exhibit:",2]
[null,null,null,null,null,"Tab:",4]
[null,null,null,null,null,"Schedule:",1]
[null,null,null,null,null,"Page:"]
[]
[null,null,null,null,null,"Date:","2016-04-29"]
[]
["Appendix 2-D"]
["Overhead Expense"]
[]
["Applicants are to provide a breakdown of OM&A before capitalization in the below table.  OM&A before capitalization may be broken down by cost center, program, drivers or another format best suited to focus on capitalized vs. uncapitalized OM&A."]
[]
[" OM&A Before Capitalization"]
[null,2013,2014,2015,2016,2017]
[null,"Historical Year","Historical Year","Historical Year","Bridge Year","Test Year"]
["Operations and Maintenance",4487625.4539771602,4645140.2844141498,4798379.3176871194,4979115.0549778203,5273058.9244737299]
["Billing and Collecting",1888565.7636001769,1777437.4804026727,1771187.5317139318,1888325.0198484063,1974575.1886860922]
["Community Relations",22684.63,14502.809999999998,22126.22,25300,40149.879999999997]
["Administrative and General",3623360.9301129845,4126783.125514443,4215170.31136165,4465819.1598983509,{"$f":"4545562.07763597-557723","v":3987839.07763597}]
[]
[]
[]
[]
[]
[]
["Total OM&A Before Capitalization (B)",{"$f":"SUM(B17:B26)","v":10022236.777690321},{"$f":"SUM(C17:C26)","v":10563863.700331265},10806863.3807627,11358559.234724578,11275623.070795793]
[]
["Applicants are to provide a breakdown of capitalized OM&A in the below table.  Capitalized OM&A may be broken down using the categories listed in the table below if possible.  Otherwise, applicants are to provide its own break down of capitalized OM&A."]
[]
["Capitalized OM&A",null,null,null,null,null,"Directly","Explanation for Change in Overhead Capitalized"]
[null,2013,2014,2015,2016,2017,"Attributable?"]
[null,"Historical Year","Historical Year","Historical Year","Bridge Year","Test Year","(Y/N)"]
["employee benefits"]
["costs of site preparation"]
["initial delivery and handling costs"]
["costs of testing whether the asset is functioning properly"]
["professional fees"]
[]
["costs of opening a new facility"]
["costs of introducing a new product or service (including costs of advertising and promotional activities)"]
["costs of conducting business in a new location or with a new class of customer (including costs of staff training)"]
["administration and other general overhead costs"]
[]
["Operational Departments",1014659.86397716,1024646.98441415,1182823.50768712,1117342.1349778201,1166112.96447373,"Y","No change since last CoS, costs are directly attributable to labour costs charged to capital and are included in burden rate"]
["Customer Service Department",13787.023600176901,9074.3004026723993,16582.001713931601,14065.699848406301,14548.9886860923,"Y","No change since last CoS, costs are directly attributable to labour costs charged to capital and are included in burden rate"]
["Administrative and General Departments",129726.960112984,95329.025514442896,88524.461361648995,96335.059898351101,107961.37763596899,"Y","No change since last CoS, costs are directly attributable to labour costs charged to capital and are included in burden rate"]
[]
[]
[]
["Total Capitalized OM&A (A)",{"$f":"SUM(B34:B50)","v":1158173.8476903208},{"$f":"SUM(C34:C50)","v":1129050.3103312652},{"$f":"SUM(D34:D50)","v":1287929.9707627005},{"$f":"SUM(E34:E50)","v":1227742.8947245774},{"$f":"SUM(F34:F50)","v":1288623.3307957912}]
[]
["% of Capitalized OM&A (=A/B)",{"$f":"IF(ISERROR(B51/B27),\"0%\",B51/B27)","v":0.11556041564178932},{"$f":"IF(ISERROR(C51/C27),\"0%\",C51/C27)","v":0.10687853822800271},{"$f":"IF(ISERROR(D51/D27),\"0%\",D51/D27)","v":0.1191770382750785},{"$f":"IF(ISERROR(E51/E27),\"0%\",E51/E27)","v":0.10808966783139268},{"$f":"IF(ISERROR(F51/F27),\"0%\",F51/F27)","v":0.11428400210835044}]

{"sheet":"App.2-EA_Account 1575 (2015)","index":22,"n_rows":47,"n_cols":10,"rows_kept":47,"cut":false,"hidden":false,"merged":[[20,1,20,6],[8,0,8,9],[9,0,9,9],[10,0,10,9],[12,0,12,9],[14,0,14,9],[47,0,47,10],[52,0,53,9],[25,1,26,6],[31,1,31,6],[37,7,38,8],[37,9,38,9]]}
[null,null,null,null,null,null,null,null,"File Number:",{"$f":"EBNUMBER","v":"EB-2016-0061"}]
[null,null,null,null,null,null,null,null,"Exhibit:"]
[null,null,null,null,null,null,null,null,"Tab:"]
[null,null,null,null,null,null,null,null,"Schedule:"]
[null,null,null,null,null,null,null,null,"Page:"]
[]
[null,null,null,null,null,null,null,null,"Date:"]
[]
["Appendix 2-EA"]
["Account 1575 - IFRS-CGAAP Transitional PP&E Amounts"]
["2015 Adopters of IFRS for Financial Reporting Purposes"]
[]
["For applicants that adopted IFRS on January 1, 2015 for financial reporting purposes"]
[]
[]
[]
[null,{"$f":"RebaseYear &\" Rebasing Year\"","v":"2013 Rebasing Year"},2012,2013,2014,2015,"2016 Rebasing Year"]
["Reporting Basis","CGAAP","CGAAP","CGAAP","CGAAP","MIFRS","MIFRS"]
[null,"Forecast","Actual","Actual","Actual","Forecast","Forecast"]
[null,null,null,null,"$","$"]
["PP&E Values under CGAAP"]
["            Opening net PP&E - Note 1",null,null,null,null,{"$f":"+E25","v":0}]
["            Net Additions - Note 4"]
["            Net Depreciation (amounts should be negative) - Note 4"]
["            Closing net PP&E (1)",null,null,null,{"$f":"E22+E23+E24","v":0},{"$f":"SUM(F22:F24)","v":0}]
[]
["PP&E Values under MIFRS (Starts from 2014, the transition year)"]
["            Opening net PP&E  - Note 1",null,null,null,null,{"$f":"+E31","v":0}]
["            Net Additions - Note 4"]
["            Net Depreciation (amounts should be negative) - Note 4"]
["            Closing net PP&E (2)",null,null,null,{"$f":"SUM(E28:E30)","v":0},{"$f":"SUM(F28:F30)","v":0}]
[]
["Difference in Closing net PP&E, former CGAAP vs. revised CGAAP ",null,null,null,{"$f":"E25-E31","v":0},{"$f":"F25-F31","v":0}]
[]
[]
["Effect on Deferral and Variance Account Rate Riders"]
["Closing balance in Account 1576",null,null,null,null,null,{"$f":"IF(ISERROR(F33), 0, F33)","v":0},null,"WACC"]
["Return on Rate Base Associated with Account 1576 balance at WACC  - Note 2",null,null,null,null,null,{"$f":"F33*J37*J38","v":0},"# of years of rate rider disposition period"]
["     Amount included in Deferral and Variance Account Rate Rider Calculation",null,null,null,null,null,{"$f":"G37+G38","v":0}]
[]
["Notes:"]
["1  For an applicant that adopted IFRS on January 1, 2015, the PP&E values as of January 1, 2014 under both CGAAP and MIFRS should be the same. "]
["2 Return on rate base associated with deferred balance is calculated as:"]
["     the deferral account closing balance as of 2015 rebasing year x WACC X # of years of rate rider disposition period"]
["     * Please note that the calculation should be adjusted once WACC is updated and finalized in the rate application."]
["3  The  PP&E deferral account is cleared by including the total balance in the deferral and variance account rate rider calculation."]
["4  Net additions are additions net of disposals; Net depreciation is additions to depreciation net of disposals."]

{"sheet":"App.2-EB_Account 1576 (2012)","index":23,"n_rows":47,"n_cols":10,"rows_kept":47,"cut":false,"hidden":false,"merged":[[8,0,8,9],[9,0,9,9],[10,0,10,9],[14,0,14,9],[12,0,12,9],[45,0,45,8],[41,0,41,10],[31,1,31,6],[25,1,26,6],[20,1,20,6],[37,7,38,8],[37,9,38,9]]}
[null,null,null,null,null,null,null,null,"File Number:",{"$f":"EBNUMBER","v":"EB-2016-0061"}]
[null,null,null,null,null,null,null,null,"Exhibit:"]
[null,null,null,null,null,null,null,null,"Tab:"]
[null,null,null,null,null,null,null,null,"Schedule:"]
[null,null,null,null,null,null,null,null,"Page:"]
[]
[null,null,null,null,null,null,null,null,"Date:"]
[]
["Appendix 2-EB"]
["Account 1576 - Accounting Changes under CGAAP"]
["2012 Changes in Accounting Policies under CGAAP"]
[]
["For applicants that made capitalization and depreciation expense accounting policy changes under CGAAP effective January 1, 2012"]
[]
[]
[]
[null,{"$f":"RebaseYear &\" Rebasing Year\"","v":"2013 Rebasing Year"},2012,2013,2014,2015,"2016 Rebasing Year"]
["Reporting Basis","CGAAP","CGAAP","CGAAP","CGAAP","MIFRS","MIFRS"]
[null,"Forecast","Actual","Actual","Actual","Forecast","Forecast"]
[null,null,"$","$","$","$"]
["PP&E Values under former CGAAP"]
["            Opening net PP&E - Note 1",null,null,{"$f":"+C25","v":0},{"$f":"+D25","v":0},{"$f":"+E25","v":0}]
["            Net Additions - Note 4"]
["            Net Depreciation (amounts should be negative) - Note 4"]
["            Closing net PP&E (1)",null,{"$f":"C22+C23+C24","v":0},{"$f":"D22+D23+D24","v":0},{"$f":"E22+E23+E24","v":0},{"$f":"F22+F23+F24","v":0}]
[]
["PP&E Values under revised CGAAP (Starts from 2012)"]
["            Opening net PP&E  - Note 1",null,null,{"$f":"+C31","v":0},{"$f":"+D31","v":0},{"$f":"+E31","v":0}]
["            Net Additions - Note 4"]
["            Net Depreciation (amounts should be negative) - Note 4"]
["            Closing net PP&E (2)",null,{"$f":"SUM(C28:C30)","v":0},{"$f":"SUM(D28:D30)","v":0},{"$f":"SUM(E28:E30)","v":0},{"$f":"SUM(F28:F30)","v":0}]
[]
["Difference in Closing net PP&E, former CGAAP vs. revised CGAAP ",null,{"$f":"C25-C31","v":0},{"$f":"D25-D31","v":0},{"$f":"E25-E31","v":0},{"$f":"F25-F31","v":0}]
[]
[]
["Effect on Deferral and Variance Account Rate Riders"]
["Closing balance in Account 1576",null,null,null,null,null,{"$f":"IF(ISERROR(F33), 0, F33)","v":0},null,"WACC"]
["Return on Rate Base Associated with Account 1576 balance at WACC  - Note 2",null,null,null,null,null,{"$f":"F33*J37*J38","v":0},"# of years of rate rider disposition period"]
["     Amount included in Deferral and Variance Account Rate Rider Calculation",null,null,null,null,null,{"$f":"G37+G38","v":0}]
[]
["Notes:"]
["1  For an applicant that made the capitalization and depreciation expense accounting policy changes on January 1, 2012, the PP&E values as of January 1, 2012 under both former CGAAP and revised CGAAP should be the same. "]
["2 Return on rate base associated with Account 1576 balance is calculated as:"]
["     the variance account ending balance as of 2015 rebasing year x WACC X # of years of rate rider disposition period"]
["     * Please note that the calculation should be adjusted once WACC is updated and finalized in the rate application."]
["3  Account 1576 is cleared by including the total balance in the deferral and variance account rate rider calculation."]
["4  Net additions are additions net of disposals; Net depreciation is additions to depreciation net of disposals."]

{"sheet":"App.2-EC_Account 1576 (2013)","index":24,"n_rows":47,"n_cols":10,"rows_kept":47,"cut":false,"hidden":false,"merged":[[37,9,38,9],[41,0,41,10],[8,0,8,9],[9,0,9,9],[10,0,10,9],[12,0,12,9],[14,0,14,9],[19,1,19,2],[45,0,45,8],[20,1,20,6],[25,1,26,6],[31,1,31,6],[37,7,38,8]]}
[null,null,null,null,null,null,null,null,"File Number:",{"$f":"EBNUMBER","v":"EB-2016-0061"}]
[null,null,null,null,null,null,null,null,"Exhibit:"]
[null,null,null,null,null,null,null,null,"Tab:"]
[null,null,null,null,null,null,null,null,"Schedule:"]
[null,null,null,null,null,null,null,null,"Page:"]
[]
[null,null,null,null,null,null,null,null,"Date:"]
[]
["Appendix 2-EC"]
["Account 1576 - Accounting Changes under CGAAP"]
["2013 Changes in Accounting Policies under CGAAP"]
[]
["For applicants that made capitalization and depreciation expense accounting policy changes under CGAAP effective January 1, 2013"]
[]
[]
[]
[null,{"$f":"RebaseYear &\" Rebasing Year\"","v":"2013 Rebasing Year"},2012,2013,2014,2015,"2016 Rebasing Year"]
["Reporting Basis","CGAAP","CGAAP","CGAAP","CGAAP","MIFRS","MIFRS"]
[null,"Forecast","Actual","Actual","Actual","Forecast","Forecast"]
[null,null,null,"$","$","$"]
["PP&E Values under former CGAAP"]
["            Opening net PP&E - Note 1",null,null,null,{"$f":"+D25","v":0},{"$f":"+E25","v":0}]
["            Net Additions - Note 4"]
["            Net Depreciation (amounts should be negative) - Note 4"]
["            Closing net PP&E (1)",null,null,{"$f":"D22+D23+D24","v":0},{"$f":"E22+E23+E24","v":0},{"$f":"F22+F23+F24","v":0}]
[]
["PP&E Values under revised CGAAP (Starts from 2012)"]
["            Opening net PP&E  - Note 1",null,null,null,{"$f":"+D31","v":0},{"$f":"+E31","v":0}]
["            Net Additions - Note 4"]
["            Net Depreciation (amounts should be negative) - Note 4"]
["            Closing net PP&E (2)",null,null,{"$f":"SUM(D28:D30)","v":0},{"$f":"SUM(E28:E30)","v":0},{"$f":"SUM(F28:F30)","v":0}]
[]
["Difference in Closing net PP&E, former CGAAP vs. revised CGAAP ",null,null,{"$f":"D25-D31","v":0},{"$f":"E25-E31","v":0},{"$f":"F25-F31","v":0}]
[]
[]
["Effect on Deferral and Variance Account Rate Riders"]
["Closing balance in Account 1576",null,null,null,null,null,{"$f":"IF(ISERROR(F33), 0, F33)","v":0},null,"WACC"]
["Return on Rate Base Associated with Account 1576 balance at WACC  - Note 2",null,null,null,null,null,{"$f":"F33*J37*J38","v":0},"# of years of rate rider disposition period"]
["     Amount included in Deferral and Variance Account Rate Rider Calculation",null,null,null,null,null,{"$f":"G37+G38","v":0}]
[]
["Notes:"]
["1  For an applicant that made the capitalization and depreciation expense accounting policy changes on January 1, 2013, the PP&E values as of January 1, 2013 under both former CGAAP and revised CGAAP should be the same. "]
["2 Return on rate base associated with Account 1576 balance is calculated as:"]
["     the variance account ending balance as of 2015 rebasing year x WACC X # of years of rate rider disposition period"]
["     * Please note that the calculation should be adjusted once WACC is updated and finalized in the rate application."]
["3  Account 1576 is cleared by including the total balance in the deferral and variance account rate rider calculation."]
["4  Net additions are additions net of disposals; Net depreciation is additions to depreciation net of disposals."]

{"sheet":"App.2-FA Proposed REG Invest.","index":25,"n_rows":101,"n_cols":11,"rows_kept":101,"cut":false,"hidden":false,"merged":[[8,0,8,10],[17,0,17,8],[16,0,16,9],[12,0,12,6],[13,0,13,5],[14,0,14,5],[11,0,11,6],[9,0,9,10]]}
[null,null,null,null,null,null,null,null,null,"File Number:",{"$f":"EBNUMBER","v":"EB-2016-0061"}]
[null,null,null,null,null,null,null,null,null,"Exhibit:",2]
[null,null,null,null,null,null,null,null,null,"Tab:",5]
[null,null,null,null,null,null,null,null,null,"Schedule:",1]
[null,null,null,null,null,null,null,null,null,"Page:"]
[]
[null,null,null,null,null,null,null,null,null,"Date:","2016-04-29"]
[]
["Appendix 2-FA"]
["Renewable Generation Connection Investment Summary (past investments or over the future rate setting period)"]
[]
["Enter the details of the Renewable Generation Connection projects as described in the appropriate section of the Filing Requirements."]
["All costs entered on this page will be transferred to the appropriate cells in the appendices that follow."]
["For Part A, Renewable Enabling Improvements (REI), these amounts will be transferred to Appendix 2 - FB"]
["For Part B, Expansions, these amounts will be transferred to Appendix 2 - FC"]
[]
["If there are more than five projects proposed to be in-service in a certain year, please amend the tables below and ensure that the formulae for the Total Amounts in any given rate year are updated."]
["Based on the current methodology and allocation, amounts allocated represent 6% for REI Connection Investments and 17% for Expansion Investments. (EB-2009-0349, 6-10-2010, p. 15, note 9)"]
[]
["There are two scenarios described below.  Separate sets of spreadsheets (2-FA, 2-FB, 2-FC) should be submited for each scenario as required."]
["Scenario 1:  Past Investments with No Recovery.  The distributor has made investments in the past (during the IRM Years), but has not received approval for these projects and therefore did not receive"]
["revenue from the IESO under Regulation 330/09 and did not receive ratepayer revenue for the direct benefit portion of the investment."]
["The WCA percentage, debt percentages, interest rates, kWh, tax rates, amortization period, CCA Class and percentage should correspond to the distributor's last Cost of Service approval. "]
["The Direct Benefit portion of the calculated Revenue Requirement for each year should be summed and can be applied for recovery from the distributor's ratepayers through a rate rider."]
["The Provincial Recovery portion of the calculated Revenue Requirement for each year should be summed and can be applied for recovery from the IESO through a separate order."]
[]
["Scenario 2:  Investments in the Test Year and Beyond.  Distributor plans to make investments in 2016 and/or beyond.  These investments should be added to 2-FA in the appropriate year."]
["The WCA percentage, debt percentages, interest rates, kWh, tax rates, amortization period, CCA Class and percentage should correspond to the distributor's current application. "]
[]
["Part A",null,null,null,null,null,"Test Year"]
["REI Investments (Direct Benefit at 6%)",null,2012,2013,2014,2015,2016,{"$f":"G31+1","v":2017},{"$f":"H31+1","v":2018},2019,2020]
["Project 1"]
["Name: REI Connection Project"]
["Capital Costs",null,0,0,0,0,0,0,0,0,0]
["OM&A (Start-Up)",null,0,0,0,0,0,0,0,0,0]
["OM&A (Ongoing)",null,0,0,0,0,0,0,0,0,0]
[]
["Project 2"]
["Name: REI Connection Project"]
["Capital Costs",null,0,0,0,0,0,0,0,0,0]
["OM&A (Start-Up)",null,0,0,0,0,0,0,0,0,0]
["OM&A (Ongoing)",null,0,0,0,0,0,0,0,0,0]
[]
["Project 3"]
["Name: REI Connection Project"]
["Capital Costs",null,0,0,0,0,0,0,0,0,0]
["OM&A (Start-Up)",null,0,0,0,0,0,0,0,0,0]
["OM&A (Ongoing)",null,0,0,0,0,0,0,0,0,0]
[]
["Project 4"]
["Name: REI Connection Project"]
["Capital Costs",null,0,0,0,0,0,0,0,0,0]
["OM&A (Start-Up)",null,0,0,0,0,0,0,0,0,0]
["OM&A (Ongoing)",null,0,0,0,0,0,0,0,0,0]
[]
["Project 5"]
["Name: REI Connection Project"]
["Capital Costs",null,0,0,0,0,0,0,0,0,0]
["OM&A (Start-Up)",null,0,0,0,0,0,0,0,0,0]
["OM&A (Ongoing)",null,0,0,0,0,0,0,0,0,0]
[]
["Total Capital Costs",null,{"$f":"SUM(C58,C52,C46,C40,C34)","v":0},0,0,0,{"$f":"SUM(G58,G52,G46,G40,G34)","v":0},{"$f":"SUM(H58,H52,H46,H40,H34)","v":0},0,0,0]
["Total OM&A (Start-Up)",null,0,0,0,0,{"$f":"SUM(G59,G53,G47,G41,G35)","v":0},0,0,0,0]
["Total OM&A (Ongoing)",null,0,0,0,0,{"$f":"SUM(G60,G54,G48,G42,G36)","v":0},0,0,0,0]
[]
[]
["Part B",null,null,null,null,null,"Test Year"]
["Expansion Investments (Direct Benefit at 17%)",null,2012,2013,2014,2015,2016,{"$f":"G68+1","v":2017},{"$f":"H68+1","v":2018},2019,2020]
["Project 1"]
["Name: Expansion Connection Project"]
["Capital Costs",null,0,0,0,0,0,0,0,0,0]
["OM&A (Start-Up)",null,0,0,0,0,0,0,0,0,0]
["OM&A (Ongoing)",null,0,0,0,0,0,0,0,0,0]
[]
["Project 2"]
["Name: Expansion Connection Project"]
["Capital Costs",null,0,0,0,0,0,0,0,0,0]
["OM&A (Start-Up)",null,0,0,0,0,0,0,0,0,0]
["OM&A (Ongoing)",null,0,0,0,0,0,0,0,0,0]
[]
["Project 3"]
["Name: Expansion Connection Project"]
["Capital Costs",null,0,0,0,0,0,0,0,0,0]
["OM&A (Start-Up)",null,0,0,0,0,0,0,0,0,0]
["OM&A (Ongoing)",null,0,0,0,0,0,0,0,0,0]
[]
["Project 4"]
["Name: Expansion Connection Project"]
["Capital Costs",null,0,0,0,0,0,0,0,0,0]
["OM&A (Start-Up)",null,0,0,0,0,0,0,0,0,0]
["OM&A (Ongoing)",null,0,0,0,0,0,0,0,0,0]
[]
["Project 5"]
["Name: Expansion Connection Project"]
["Capital Costs",null,0,0,0,0,0,0,0,0,0]
["OM&A (Start-Up)",null,0,0,0,0,0,0,0,0,0]
["OM&A (Ongoing)",null,0,0,0,0,0,0,0,0,0]
[]
["Total Capital Costs",null,{"$f":"SUM(C95,C89,C83,C77,C71)","v":0},0,0,0,{"$f":"SUM(G95,G89,G83,G77,G71)","v":0},{"$f":"SUM(H95,H89,H83,H77,H71)","v":0},0,0,0]
["Total OM&A (Start-Up)",null,0,0,0,0,{"$f":"SUM(G96,G90,G84,G78,G72)","v":0},0,0,0,0]
["Total OM&A (Ongoing)",null,0,0,0,0,{"$f":"SUM(G97,G91,G85,G79,G73)","v":0},0,0,0,0]

{"sheet":"App.2-FB Calc of REG Improvemnt","index":26,"n_rows":95,"n_cols":29,"rows_kept":95,"cut":false,"hidden":false,"merged":[[51,24,51,25],[51,27,51,28],[48,0,48,22],[49,0,49,1],[51,15,51,16],[51,18,51,19],[51,21,51,22],[51,12,51,13],[51,9,51,10],[51,6,51,7],[51,3,51,4],[46,0,46,22],[16,14,16,16],[16,17,16,19],[16,20,16,22],[16,23,16,25],[16,11,16,13],[16,8,16,10],[16,5,16,7],[16,2,16,4],[16,26,16,28],[8,0,8,17],[9,0,9,17],[11,0,11,17],[12,0,12,17],[14,0,14,17]]}
[null,null,null,null,null,null,null,null,null,null,null,null,null,"File Number:",{"$f":"EBNUMBER","v":"EB-2016-0061"}]
[null,null,null,null,null,null,null,null,null,null,null,null,null,"Exhibit:",2]
[null,null,null,null,null,null,null,null,null,null,null,null,null,"Tab:",5]
[null,null,null,null,null,null,null,null,null,null,null,null,null,"Schedule:",1]
[null,null,null,null,null,null,null,null,null,null,null,null,null,"Page:"]
[]
[null,null,null,null,null,null,null,null,null,null,null,null,null,"Date:","2016-04-29"]
[]
["Appendix 2-FB"]
["Calculation of Renewable Generation Connection Direct Benefits/Provincial Amount: Renewable Enabling Improvement Investments"]
[]
["This table will calculate the distributor/provincial shares of the investments entered in Part A of Appendix 2-FA."]
["Enter values in green shaded cells: WCA percentage, debt percentages, interest rates, kWh, tax rates, amortization period, CCA Class and percentage."]
["For historical investments, enter these variables for your last cost of service test year.  For 2016 and beyond, enter variables as in the application."]
["Rate Riders are not calculated for Test Year as these assets and costs are already in the distributor's rate base/revenue requirement."]
[]
[null,null,2012,null,null,2013,null,null,2014,null,null,2015,null,null,"2016 Test Year",null,null,2017,null,null,2018,2016,null,2019,null,null,2020]
[null,null,null,"Direct Benefit","Provincial",null,"Direct Benefit","Provincial",null,"Direct Benefit","Provincial",null,"Direct Benefit","Provincial",null,"Direct Benefit","Provincial",null,"Direct Benefit","Provincial",null,"Direct Benefit","Provincial",null,"Direct Benefit","Provincial",null,"Direct Benefit","Provincial"]
[null,null,"Total",0.06,0.94,"Total",0.06,0.94,"Total",0.06,0.94,"Total",0.06,0.94,"Total",0.06,0.94,"Total",0.06,0.94,"Total",0.06,0.94,"Total",0.06,0.94,"Total",0.06,0.94]
["Net Fixed Assets (average)",null,{"$f":"D82","v":0},{"$f":"C20*D19","v":0},{"$f":"C20*E19","v":0},{"$f":"E82","v":0},{"$f":"F20*G19","v":0},{"$f":"F20*H19","v":0},{"$f":"F82","v":0},{"$f":"I20*J19","v":0},{"$f":"I20*K19","v":0},{"$f":"G82","v":0},{"$f":"L20*M19","v":0},{"$f":"L20*N19","v":0},{"$f":"H82","v":0},{"$f":"O20*P19","v":0},{"$f":"O20*Q19","v":0},{"$f":"I82","v":0},{"$f":"R20*S19","v":0},{"$f":"R20*T19","v":0},{"$f":"J82","v":0},{"$f":"U20*V19","v":0},{"$f":"U20*W19","v":0},{"$f":"K82","v":0},{"$f":"X20*Y19","v":0},{"$f":"X20*Z19","v":0},{"$f":"L82","v":0},{"$f":"AA20*AB19","v":0},{"$f":"AA20*AC19","v":0}]
["Incremental OM&A (on-going, N/A for Provincial Recovery)",null,{"$f":"'App.2-FA Proposed REG Invest.'!C64","v":0},{"$f":"C21","v":0},null,{"$f":"'App.2-FA Proposed REG Invest.'!D64","v":0},{"$f":"F21","v":0},null,{"$f":"'App.2-FA Proposed REG Invest.'!E64","v":0},{"$f":"I21","v":0},null,{"$f":"'App.2-FA Proposed REG Invest.'!F64","v":0},{"$f":"L21","v":0},null,{"$f":"'App.2-FA Proposed REG Invest.'!G64","v":0},{"$f":"O21","v":0},null,{"$f":"'App.2-FA Proposed REG Invest.'!H64","v":0},{"$f":"R21","v":0},null,{"$f":"'App.2-FA Proposed REG Invest.'!I64","v":0},{"$f":"U21","v":0},null,{"$f":"'App.2-FA Proposed REG Invest.'!J64","v":0},{"$f":"X21","v":0},null,{"$f":"'App.2-FA Proposed REG Invest.'!K64","v":0},{"$f":"AA21","v":0}]
["Incremental OM&A (start-up, applicable for Provincial Recovery)",null,{"$f":"'App.2-FA Proposed REG Invest.'!C63","v":0},{"$f":"C22*D19","v":0},{"$f":"C22*E19","v":0},{"$f":"'App.2-FA Proposed REG Invest.'!D63","v":0},{"$f":"F22*G19","v":0},{"$f":"F22*H19","v":0},{"$f":"'App.2-FA Proposed REG Invest.'!E63","v":0},{"$f":"I22*J19","v":0},{"$f":"I22*K19","v":0},{"$f":"'App.2-FA Proposed REG Invest.'!F63","v":0},{"$f":"L22*M19","v":0},{"$f":"L22*N19","v":0},{"$f":"'App.2-FA Proposed REG Invest.'!G63","v":0},{"$f":"O22*P19","v":0},{"$f":"O22*Q19","v":0},{"$f":"'App.2-FA Proposed REG Invest.'!H63","v":0},{"$f":"R22*S19","v":0},{"$f":"R22*T19","v":0},{"$f":"'App.2-FA Proposed REG Invest.'!I63","v":0},{"$f":"U22*V19","v":0},{"$f":"U22*W19","v":0},{"$f":"'App.2-FA Proposed REG Invest.'!J63","v":0},{"$f":"X22*Y19","v":0},{"$f":"X22*Z19","v":0},{"$f":"'App.2-FA Proposed REG Invest.'!K63","v":0},{"$f":"AA22*AB19","v":0},{"$f":"AA22*AC19","v":0}]
["WCA",7.4999999999999997E-2,null,{"$f":"(D21+D22)*$B$23","v":0},{"$f":"E22*$B$23","v":0},null,{"$f":"(G21+G22)*$B$23","v":0},{"$f":"H22*$B$23","v":0},null,{"$f":"(J21+J22)*$B$23","v":0},{"$f":"K22*$B$23","v":0},null,{"$f":"(M21+M22)*$B$23","v":0},{"$f":"N22*$B$23","v":0},null,{"$f":"(P21+P22)*$B$23","v":0},{"$f":"Q22*$B$23","v":0},null,{"$f":"(S21+S22)*$B$23","v":0},{"$f":"T22*$B$23","v":0},null,{"$f":"(V21+V22)*$B$23","v":0},{"$f":"W22*$B$23","v":0},null,{"$f":"(Y21+Y22)*$B$23","v":0},{"$f":"Z22*$B$23","v":0},null,{"$f":"(AB21+AB22)*$B$23","v":0},{"$f":"AC22*$B$23","v":0}]
["Rate Base",null,null,{"$f":"SUM(D20+D23)","v":0},{"$f":"SUM(E20+E23)","v":0},null,{"$f":"SUM(G20+G23)","v":0},{"$f":"SUM(H20+H23)","v":0},null,{"$f":"SUM(J20+J23)","v":0},{"$f":"SUM(K20+K23)","v":0},null,{"$f":"SUM(M20+M23)","v":0},{"$f":"SUM(N20+N23)","v":0},null,{"$f":"SUM(P20+P23)","v":0},{"$f":"SUM(Q20+Q23)","v":0},null,{"$f":"SUM(S20+S23)","v":0},{"$f":"SUM(T20+T23)","v":0},null,{"$f":"SUM(V20+V23)","v":0},{"$f":"SUM(W20+W23)","v":0},null,{"$f":"SUM(Y20+Y23)","v":0},{"$f":"SUM(Z20+Z23)","v":0},null,{"$f":"SUM(AB20+AB23)","v":0},{"$f":"SUM(AC20+AC23)","v":0}]
[]
[]
["Deemed ST Debt",0.04,null,{"$f":"D24*$B$27","v":0},{"$f":"E24*$B$27","v":0},null,{"$f":"G24*$B$27","v":0},{"$f":"H24*$B$27","v":0},null,{"$f":"J24*$B$27","v":0},{"$f":"K24*$B$27","v":0},null,{"$f":"M24*$B$27","v":0},{"$f":"N24*$B$27","v":0},null,{"$f":"P24*$B$27","v":0},{"$f":"Q24*$B$27","v":0},null,{"$f":"S24*$B$27","v":0},{"$f":"T24*$B$27","v":0},null,{"$f":"V24*$B$27","v":0},{"$f":"W24*$B$27","v":0},null,{"$f":"Y24*$B$27","v":0},{"$f":"Z24*$B$27","v":0},null,{"$f":"AB24*$B$27","v":0},{"$f":"AC24*$B$27","v":0}]
["Deemed LT Debt",0.56000000000000005,null,{"$f":"D24*$B$28","v":0},{"$f":"E24*$B$28","v":0},null,{"$f":"G24*$B$28","v":0},{"$f":"H24*$B$28","v":0},null,{"$f":"J24*$B$28","v":0},{"$f":"K24*$B$28","v":0},null,{"$f":"M24*$B$28","v":0},{"$f":"N24*$B$28","v":0},null,{"$f":"P24*$B$28","v":0},{"$f":"Q24*$B$28","v":0},null,{"$f":"S24*$B$28","v":0},{"$f":"T24*$B$28","v":0},null,{"$f":"V24*$B$28","v":0},{"$f":"W24*$B$28","v":0},null,{"$f":"Y24*$B$28","v":0},{"$f":"Z24*$B$28","v":0},null,{"$f":"AB24*$B$28","v":0},{"$f":"AC24*$B$28","v":0}]
["Deemed Equity",0.4,null,{"$f":"D24*$B$29","v":0},{"$f":"E24*$B$29","v":0},null,{"$f":"G24*$B$29","v":0},{"$f":"H24*$B$29","v":0},null,{"$f":"J24*$B$29","v":0},{"$f":"K24*$B$29","v":0},null,{"$f":"M24*$B$29","v":0},{"$f":"N24*$B$29","v":0},null,{"$f":"P24*$B$29","v":0},{"$f":"Q24*$B$29","v":0},null,{"$f":"S24*$B$29","v":0},{"$f":"T24*$B$29","v":0},null,{"$f":"V24*$B$29","v":0},{"$f":"W24*$B$29","v":0},null,{"$f":"Y24*$B$29","v":0},{"$f":"Z24*$B$29","v":0},null,{"$f":"AB24*$B$29","v":0},{"$f":"AC24*$B$29","v":0}]
[]
["ST Interest",1.6500000000000001E-2,null,{"$f":"D27*$B31","v":0},{"$f":"E27*$B31","v":0},null,{"$f":"G27*$B31","v":0},{"$f":"H27*$B31","v":0},null,{"$f":"J27*$B31","v":0},{"$f":"K27*$B31","v":0},null,{"$f":"M27*$B31","v":0},{"$f":"N27*$B31","v":0},null,{"$f":"P27*$B31","v":0},{"$f":"Q27*$B31","v":0},null,{"$f":"S27*$B31","v":0},{"$f":"T27*$B31","v":0},null,{"$f":"V27*$B31","v":0},{"$f":"W27*$B31","v":0},null,{"$f":"Y27*$B31","v":0},{"$f":"Z27*$B31","v":0},null,{"$f":"AB27*$B31","v":0},{"$f":"AC27*$B31","v":0}]
["LT Interest",6.1400000000000003E-2,null,{"$f":"D28*$B32","v":0},0,null,{"$f":"G28*$B32","v":0},0,null,{"$f":"J28*$B32","v":0},0,null,{"$f":"M28*$B32","v":0},0,null,{"$f":"P28*$B32","v":0},0,null,{"$f":"S28*$B32","v":0},0,null,{"$f":"V28*$B32","v":0},0,null,{"$f":"Y28*$B32","v":0},0,null,{"$f":"AB28*$B32","v":0},0]
["ROE",9.1899999999999996E-2,null,0,0,null,0,0,null,0,0,null,0,0,null,0,0,null,0,0,null,0,0,null,0,0,null,0,0]
["Cost of Capital Total",null,null,{"$f":"SUM(D31:D33)","v":0},{"$f":"SUM(E31:E33)","v":0},null,{"$f":"SUM(G31:G33)","v":0},{"$f":"SUM(H31:H33)","v":0},null,{"$f":"SUM(J31:J33)","v":0},{"$f":"SUM(K31:K33)","v":0},null,{"$f":"SUM(M31:M33)","v":0},{"$f":"SUM(N31:N33)","v":0},null,{"$f":"SUM(P31:P33)","v":0},{"$f":"SUM(Q31:Q33)","v":0},null,{"$f":"SUM(S31:S33)","v":0},{"$f":"SUM(T31:T33)","v":0},null,{"$f":"SUM(V31:V33)","v":0},{"$f":"SUM(W31:W33)","v":0},null,{"$f":"SUM(Y31:Y33)","v":0},{"$f":"SUM(Z31:Z33)","v":0},null,{"$f":"SUM(AB31:AB33)","v":0},{"$f":"SUM(AC31:AC33)","v":0}]
[]
["OM&A",null,null,{"$f":"D21+D22","v":0},{"$f":"E22","v":0},null,{"$f":"G21+G22","v":0},{"$f":"H22","v":0},null,{"$f":"J21+J22","v":0},{"$f":"K22","v":0},null,{"$f":"M21+M22","v":0},{"$f":"N22","v":0},null,{"$f":"P21+P22","v":0},{"$f":"Q22","v":0},null,{"$f":"S21+S22","v":0},{"$f":"T22","v":0},null,{"$f":"V21+V22","v":0},{"$f":"W22","v":0},null,{"$f":"Y21+Y22","v":0},{"$f":"Z22","v":0},null,{"$f":"AB21+AB22","v":0},{"$f":"AC22","v":0}]
["Amortization",null,{"$f":"D77","v":0},{"$f":"C37*D$19","v":0},{"$f":"C37*E$19","v":0},{"$f":"E77","v":0},{"$f":"F37*G$19","v":0},{"$f":"F37*H$19","v":0},{"$f":"F77","v":0},{"$f":"I37*J$19","v":0},{"$f":"I37*K$19","v":0},{"$f":"G77","v":0},{"$f":"L37*M$19","v":0},{"$f":"L37*N$19","v":0},{"$f":"H77","v":0},{"$f":"O37*P$19","v":0},{"$f":"O37*Q$19","v":0},{"$f":"I76+I77","v":0},{"$f":"R37*S$19","v":0},{"$f":"R37*T$19","v":0},{"$f":"J76+J77","v":0},{"$f":"U37*V$19","v":0},{"$f":"U37*W$19","v":0},{"$f":"K76+K77","v":0},{"$f":"X37*Y$19","v":0},{"$f":"X37*Z$19","v":0},{"$f":"L76+L77","v":0},{"$f":"AA37*AB$19","v":0},{"$f":"AA37*AC$19","v":0}]
["Grossed-up PILs",null,null,{"$f":"D65","v":0},{"$f":"E65","v":0},null,{"$f":"G65","v":0},{"$f":"H65","v":0},null,{"$f":"J65","v":0},{"$f":"K65","v":0},null,{"$f":"M65","v":0},{"$f":"N65","v":0},null,{"$f":"P65","v":0},{"$f":"Q65","v":0},null,{"$f":"S65","v":0},{"$f":"T65","v":0},null,{"$f":"V65","v":0},{"$f":"W65","v":0},null,{"$f":"Y65","v":0},{"$f":"Z65","v":0},null,{"$f":"AB65","v":0},{"$f":"AC65","v":0}]
[]
["Revenue Requirement",null,null,{"$f":"SUM(D34:D38)","v":0},{"$f":"SUM(E34:E38)","v":0},null,{"$f":"SUM(G34:G38)","v":0},{"$f":"SUM(H34:H38)","v":0},null,{"$f":"SUM(J34:J38)","v":0},{"$f":"SUM(K34:K38)","v":0},null,{"$f":"SUM(M34:M38)","v":0},{"$f":"SUM(N34:N38)","v":0},null,{"$f":"SUM(P34:P38)","v":0},{"$f":"SUM(Q34:Q38)","v":0},null,{"$f":"SUM(S34:S38)","v":0},{"$f":"SUM(T34:T38)","v":0},null,{"$f":"SUM(V34:V38)","v":0},{"$f":"SUM(W34:W38)","v":0},null,{"$f":"SUM(Y34:Y38)","v":0},{"$f":"SUM(Z34:Z38)","v":0},null,{"$f":"SUM(AB34:AB38)","v":0},{"$f":"SUM(AC34:AC38)","v":0}]
[]
[]
["Provincial Rate Protection",null,null,null,{"$f":"E40","v":0},null,null,{"$f":"H40","v":0},null,null,{"$f":"K40","v":0},null,null,{"$f":"N40","v":0},null,null,{"$f":"Q40","v":0},null,null,{"$f":"T40","v":0},null,null,{"$f":"W40","v":0},null,null,{"$f":"Z40","v":0},null,null,{"$f":"AC40","v":0}]
[]
["Monthly Amount Paid by IESO",null,null,null,{"$f":"E43/12","v":0},null,null,{"$f":"H43/12","v":0},null,null,{"$f":"K43/12","v":0},null,null,{"$f":"N43/12","v":0},null,null,{"$f":"Q43/12","v":0},null,null,{"$f":"T43/12","v":0},null,null,{"$f":"W43/12","v":0},null,null,{"$f":"Z43/12","v":0},null,null,{"$f":"AC43/12","v":0}]
[]
["Note 1: The difference between the actual costs of approved eligible investments and revenue received from the IESO should be recorded in a variance account.  The Board may provide "]
["regulatory accounting guidance regarding a variance account either in an individual proceeding or on a generic basis."]
["Note 2: For the 2016 Test Year, Costs and Revenues of the Direct Benefit are to be included in the test year applicant Rate Base and Revenues.  "]
[]
["PILs Calculation"]
[null,null,null,2012,null,null,2013,null,null,2014,null,null,2015,null,null,2016,null,null,{"$f":"P52+1","v":2017},null,null,{"$f":"S52+1","v":2018},null,null,{"$f":"V52+1","v":2019},null,null,{"$f":"Y52+1","v":2020}]
["Income Tax",null,null,"Direct Benefit","Provincial",null,"Direct Benefit","Provincial",null,"Direct Benefit","Provincial",null,"Direct Benefit","Provincial",null,"Direct Benefit","Provincial",null,"Direct Benefit","Provincial",null,"Direct Benefit","Provincial",null,"Direct Benefit","Provincial",null,"Direct Benefit","Provincial"]
[null,null,null,null,null,null,null,null,null,null,null,null,null,null,null,null,null,null,null,null,null,null,null,"Total",null,null,"Total"]
["Net Income - ROE on Rate Base",null,null,{"$f":"D33","v":0},{"$f":"E33","v":0},null,{"$f":"G33","v":0},{"$f":"H33","v":0},null,{"$f":"J33","v":0},{"$f":"K33","v":0},null,{"$f":"M33","v":0},{"$f":"N33","v":0},null,{"$f":"P33","v":0},{"$f":"Q33","v":0},null,{"$f":"S33","v":0},{"$f":"T33","v":0},null,{"$f":"V33","v":0},{"$f":"W33","v":0},null,{"$f":"Y33","v":0},{"$f":"Z33","v":0},null,{"$f":"AB33","v":0},{"$f":"AC33","v":0}]
["Amortization (6% DB and 94% P)",null,null,{"$f":"D37","v":0},{"$f":"E37","v":0},null,{"$f":"G37","v":0},{"$f":"H37","v":0},null,{"$f":"J37","v":0},{"$f":"K37","v":0},null,{"$f":"M37","v":0},{"$f":"N37","v":0},null,{"$f":"P37","v":0},{"$f":"Q37","v":0},null,{"$f":"S37","v":0},{"$f":"T37","v":0},null,{"$f":"V37","v":0},{"$f":"W37","v":0},null,{"$f":"Y37","v":0},{"$f":"Z37","v":0},null,{"$f":"AB37","v":0},{"$f":"AC37","v":0}]
["CCA (6% DB and 94% P)",null,null,{"$f":"-D94*D$19","v":0},{"$f":"-D94*E$19","v":0},null,{"$f":"-E94*G19","v":0},{"$f":"-E94*H$19","v":0},null,{"$f":"-F94*J$19","v":0},{"$f":"-F94*K$19","v":0},null,{"$f":"-G94*M$19","v":0},{"$f":"-G94*N$19","v":0},null,{"$f":"-H94*P$19","v":0},{"$f":"-H94*Q$19","v":0},null,{"$f":"-I94*S$19","v":0},{"$f":"-I94*T$19","v":0},null,{"$f":"-J94*V$19","v":0},{"$f":"-J94*W$19","v":0},null,{"$f":"-K94*Y$19","v":0},{"$f":"-K94*Z$19","v":0},null,{"$f":"-L94*AB$19","v":0},{"$f":"-L94*AC$19","v":0}]
["Taxable income",null,null,{"$f":"SUM(D55:D57)","v":0},{"$f":"SUM(E55:E57)","v":0},null,{"$f":"SUM(G55:G57)","v":0},{"$f":"SUM(H55:H57)","v":0},null,{"$f":"SUM(J55:J57)","v":0},{"$f":"SUM(K55:K57)","v":0},null,{"$f":"SUM(M55:M57)","v":0},{"$f":"SUM(N55:N57)","v":0},null,{"$f":"SUM(P55:P57)","v":0},{"$f":"SUM(Q55:Q57)","v":0},null,{"$f":"SUM(S55:S57)","v":0},{"$f":"SUM(T55:T57)","v":0},null,{"$f":"SUM(V55:V57)","v":0},{"$f":"SUM(W55:W57)","v":0},null,{"$f":"SUM(Y55:Y57)","v":0},{"$f":"SUM(Z55:Z57)","v":0},null,{"$f":"SUM(AB55:AB57)","v":0},{"$f":"SUM(AC55:AC57)","v":0}]
[]
["Tax Rate  (to be entered)"]
[]
["Income Taxes Payable",null,null,{"$f":"D58*D60","v":0},{"$f":"E58*E60","v":0},null,{"$f":"G58*G60","v":0},{"$f":"H58*H60","v":0},null,{"$f":"J58*J60","v":0},{"$f":"K58*K60","v":0},null,{"$f":"M58*M60","v":0},{"$f":"N58*N60","v":0},null,{"$f":"P58*P60","v":0},{"$f":"Q58*Q60","v":0},null,{"$f":"S58*S60","v":0},{"$f":"T58*T60","v":0},null,{"$f":"V58*V60","v":0},{"$f":"W58*W60","v":0},null,{"$f":"Y58*Y60","v":0},{"$f":"Z58*Z60","v":0},null,{"$f":"AB58*AB60","v":0},{"$f":"AC58*AC60","v":0}]
["Gross Up"]
["Income Taxes Payable",null,null,{"$f":"D62/(1-D60)","v":0},{"$f":"E62/(1-E60)","v":0},null,{"$f":"G62/(1-G60)","v":0},{"$f":"H62/(1-H60)","v":0},null,{"$f":"J62/(1-J60)","v":0},{"$f":"K62/(1-K60)","v":0},null,{"$f":"M62/(1-M60)","v":0},{"$f":"N62/(1-N60)","v":0},null,{"$f":"P62/(1-P60)","v":0},{"$f":"Q62/(1-Q60)","v":0},null,{"$f":"S62/(1-S60)","v":0},{"$f":"T62/(1-T60)","v":0},null,{"$f":"V62/(1-V60)","v":0},{"$f":"W62/(1-W60)","v":0},null,{"$f":"Y62/(1-Y60)","v":0},{"$f":"Z62/(1-Z60)","v":0},null,{"$f":"AB62/(1-AB60)","v":0},{"$f":"AC62/(1-AC60)","v":0}]
["Grossed Up PILs",null,null,{"$f":"SUM(D64:D64)","v":0},{"$f":"SUM(E64:E64)","v":0},null,{"$f":"SUM(G64:G64)","v":0},{"$f":"SUM(H64:H64)","v":0},null,{"$f":"SUM(J64:J64)","v":0},{"$f":"SUM(K64:K64)","v":0},null,{"$f":"SUM(M64:M64)","v":0},{"$f":"SUM(N64:N64)","v":0},null,{"$f":"SUM(P64:P64)","v":0},{"$f":"SUM(Q64:Q64)","v":0},null,{"$f":"SUM(S64:S64)","v":0},{"$f":"SUM(T64:T64)","v":0},null,{"$f":"SUM(V64:V64)","v":0},{"$f":"SUM(W64:W64)","v":0},null,{"$f":"SUM(Y64:Y64)","v":0},{"$f":"SUM(Z64:Z64)","v":0},null,{"$f":"SUM(AB64:AB64)","v":0},{"$f":"SUM(AC64:AC64)","v":0}]
[]
[]
[null,null,null,2012,2013,2014,2015,2016,{"$f":"H68+1","v":2017},{"$f":"I68+1","v":2018},2019,2020]
["Net Fixed Assets"]
[null,"Enter applicable amortization in years:",25]
["Opening Gross Fixed Assets",null,null,null,{"$f":"D73","v":0},0,0,0,{"$f":"H73","v":0},{"$f":"I73","v":0},{"$f":"J73","v":0},{"$f":"K73","v":0}]
["Gross Capital Additions",null,null,{"$f":"'App.2-FA Proposed REG Invest.'!C62","v":0},{"$f":"'App.2-FA Proposed REG Invest.'!D62","v":0},{"$f":"'App.2-FA Proposed REG Invest.'!E62","v":0},{"$f":"'App.2-FA Proposed REG Invest.'!F62","v":0},{"$f":"'App.2-FA Proposed REG Invest.'!G62","v":0},{"$f":"'App.2-FA Proposed REG Invest.'!H62","v":0},{"$f":"'App.2-FA Proposed REG Invest.'!I62","v":0},{"$f":"'App.2-FA Proposed REG Invest.'!J62","v":0},{"$f":"'App.2-FA Proposed REG Invest.'!K62","v":0}]
["Closing Gross Fixed Assets",null,null,{"$f":"SUM(D71:D72)","v":0},0,0,0,{"$f":"SUM(H71:H72)","v":0},{"$f":"SUM(I71:I72)","v":0},0,0,0]
[]
["Opening Accumulated Amortization",null,null,null,{"$f":"+D78","v":0},{"$f":"E78","v":0},0,0,0,0,0,0]
["Current Year Amortization (before additions)",null,null,{"$f":"IF(ISERROR(D71/$C$70), 0, D71/$C$70)","v":0},0,0,0,0,{"$f":"IF(ISERROR(I71/$C$70), 0, I71/$C$70)","v":0},{"$f":"IF(ISERROR(J71/$C$70), 0, J71/$C$70)","v":0},{"$f":"IF(ISERROR(K71/$C$70), 0, K71/$C$70)","v":0},{"$f":"IF(ISERROR(L71/$C$70), 0, L71/$C$70)","v":0}]
["Additions (half year)",null,null,{"$f":"D72/$C$70/2","v":0},{"$f":"E72/$C$70/2","v":0},{"$f":"F72/$C$70/2","v":0},0,{"$f":"H72/$C$70/2","v":0},{"$f":"I72/C70/2","v":0},{"$f":"J72/C70/2","v":0},{"$f":"K72/C70/2","v":0},{"$f":"L72/C70/2","v":0}]
["Closing Accumulated Amortization",null,null,{"$f":"SUM(D75+D76+D77)","v":0},{"$f":"SUM(E75+E76+E77)","v":0},{"$f":"SUM(F75+F76+F77)","v":0},{"$f":"SUM(G75+G76+G77)","v":0},{"$f":"SUM(H75+H76+H77)","v":0},{"$f":"SUM(I75:I77)","v":0},{"$f":"SUM(J75:J77)","v":0},{"$f":"SUM(K75:K77)","v":0},{"$f":"SUM(L75:L77)","v":0}]
[]
["Opening Net Fixed Assets",null,null,{"$f":"D71-D75","v":0},0,{"$f":"F71-F75","v":0},0,{"$f":"H71-H75","v":0},{"$f":"H81","v":0},{"$f":"I81","v":0},{"$f":"J81","v":0},{"$f":"K81","v":0}]
["Closing Net Fixed Assets",null,null,{"$f":"D73-D78","v":0},{"$f":"E73-E78","v":0},0,0,{"$f":"H73-H78","v":0},{"$f":"I73-I78","v":0},{"$f":"J73-J78","v":0},{"$f":"K73-K78","v":0},{"$f":"L73-L78","v":0}]
["Average Net Fixed Assets",null,null,{"$f":"SUM(D80:D81)/2","v":0},0,0,0,{"$f":"SUM(H80:H81)/2","v":0},{"$f":"SUM(I80:I81)/2","v":0},{"$f":"SUM(J80:J81)/2","v":0},{"$f":"SUM(K80:K81)/2","v":0},{"$f":"SUM(L80:L81)/2","v":0}]
[]
["UCC for PILs Calculation"]
[null,null,null,2012,2013,2014,2015,2016,{"$f":"H85+1","v":2017},{"$f":"I85+1","v":2018},2019,2020]
[]
["Opening UCC",null,null,null,{"$f":"D95","v":0},0,0,0,0,0,0,0]
["Capital Additions (from Appendix 2-FA)",null,null,{"$f":"D72","v":0},0,0,0,{"$f":"H72","v":0},{"$f":"I72","v":0},0,0,0]
["UCC Before Half Year Rule",null,null,{"$f":"SUM(D87:D88)","v":0},0,0,0,{"$f":"SUM(H87:H88)","v":0},{"$f":"SUM(I87:I88)","v":0},{"$f":"SUM(J87:J88)","v":0},{"$f":"SUM(K87:K88)","v":0},{"$f":"SUM(L87:L88)","v":0}]
["Half Year Rule (1/2 Additions - Disposals)",null,null,{"$f":"D88/2","v":0},0,0,0,{"$f":"H88/2","v":0},{"$f":"I88/2","v":0},{"$f":"J88/2","v":0},{"$f":"K88/2","v":0},{"$f":"L88/2","v":0}]
["Reduced UCC",null,null,{"$f":"D89-D90","v":0},0,0,0,{"$f":"H89-H90","v":0},{"$f":"I89-I90","v":0},{"$f":"J89-J90","v":0},{"$f":"K89-K90","v":0},{"$f":"L89-L90","v":0}]
["CCA Rate Class (to be entered)",null,47,{"$f":"C92","v":47},{"$f":"D92","v":47},47,47,47,47,47,47,47]
["CCA Rate  (to be entered)",null,0.08,{"$f":"C93","v":0.08},0.08,0.08,0.08,0.08,0.08,0.08,0.08,0.08]
["CCA",null,null,{"$f":"D91*D93","v":0},0,0,0,{"$f":"H91*H93","v":0},{"$f":"I91*I93","v":0},0,0,{"$f":"L91*L93","v":0}]
["Closing UCC",null,null,{"$f":"D89-D94","v":0},0,0,0,{"$f":"H89-H94","v":0},{"$f":"I89-I94","v":0},{"$f":"J89-J94","v":0},{"$f":"K89-K94","v":0},{"$f":"L89-L94","v":0}]

{"sheet":"App.2-FC Calc of REG Expansion","index":27,"n_rows":95,"n_cols":30,"rows_kept":95,"cut":false,"hidden":false,"merged":[[17,18,17,20],[17,21,17,23],[17,24,17,26],[17,27,17,29],[52,22,52,23],[52,25,52,26],[52,28,52,29],[47,0,47,20],[49,0,49,21],[50,0,50,1],[52,4,52,5],[52,7,52,8],[52,10,52,11],[52,13,52,14],[52,16,52,17],[52,19,52,20],[17,3,17,5],[17,6,17,8],[17,9,17,11],[17,12,17,14],[17,15,17,17],[8,0,8,14],[9,0,9,14],[11,0,11,14],[12,0,12,14],[14,0,14,14]]}
[null,null,null,null,null,null,null,null,null,null,null,null,null,"File Number:",{"$f":"EBNUMBER","v":"EB-2016-0061"}]
[null,null,null,null,null,null,null,null,null,null,null,null,null,"Exhibit:",2]
[null,null,null,null,null,null,null,null,null,null,null,null,null,"Tab:",5]
[null,null,null,null,null,null,null,null,null,null,null,null,null,"Schedule:",1]
[null,null,null,null,null,null,null,null,null,null,null,null,null,"Page:"]
[]
[null,null,null,null,null,null,null,null,null,null,null,null,null,"Date:","2016-04-29"]
[]
["Appendix 2-FC"]
["Calculation of Renewable Generation Connection Direct Benefits/Provincial Amount: Renewable Expansion Investments"]
[]
["This table will calculate the distributor/provincial shares of the investments entered in Part B of Appendix 2-FA."]
["Enter values in green shaded cells: WCA percentage, debt percentages, interest rates, kWh, tax rates, amortization period, CCA Class and percentage."]
["For historical investments, enter these variables for your last cost of service test year.  For 2016 and beyond, enter variables as in the application."]
["Rate Riders are not calculated for Test Year as these assets and costs are already in the distributor's rate base."]
[]
[]
[null,null,null,2012,null,null,2013,null,null,2014,null,null,2015,null,null,"2016 TEST YEAR",null,null,2017,2016,null,2018,null,null,2019,null,null,2020]
[null,null,null,null,"Direct Benefit","Provincial",null,"Direct Benefit","Provincial",null,"Direct Benefit","Provincial",null,"Direct Benefit","Provincial",null,"Direct Benefit","Provincial",null,"Direct Benefit","Provincial",null,"Direct Benefit","Provincial",null,"Direct Benefit","Provincial",null,"Direct Benefit","Provincial"]
[null,null,null,"Total",0.17,0.83,"Total",0.17,0.83,"Total",0.17,0.83,"Total",0.17,0.83,"Total",0.17,0.83,"Total",0.17,0.83,"Total",0.17,0.83,"Total",0.17,0.83,"Total",0.17,0.83]
["Net Fixed Assets (average)",null,null,{"$f":"D82","v":0},{"$f":"D21*E20","v":0},{"$f":"D21*F20","v":0},{"$f":"E82","v":0},{"$f":"G21*H20","v":0},{"$f":"G21*I20","v":0},{"$f":"F82","v":0},{"$f":"J21*K20","v":0},{"$f":"J21*L20","v":0},{"$f":"G82","v":0},{"$f":"M21*N20","v":0},{"$f":"M21*O20","v":0},{"$f":"H82","v":0},{"$f":"P21*Q20","v":0},{"$f":"P21*R20","v":0},{"$f":"I82","v":0},{"$f":"S21*T20","v":0},{"$f":"S21*U20","v":0},{"$f":"J82","v":0},{"$f":"V21*W20","v":0},{"$f":"V21*X20","v":0},{"$f":"K82","v":0},{"$f":"Y21*Z20","v":0},{"$f":"Y21*AA20","v":0},{"$f":"L82","v":0},{"$f":"AB21*AC20","v":0},{"$f":"AB21*AD20","v":0}]
["Incremental OM&A (on-going, N/A for Provincial Recovery)",null,null,{"$f":"'App.2-FA Proposed REG Invest.'!C101","v":0},{"$f":"D22","v":0},null,{"$f":"'App.2-FA Proposed REG Invest.'!D$101","v":0},{"$f":"G22","v":0},null,{"$f":"'App.2-FA Proposed REG Invest.'!E$101","v":0},{"$f":"J22","v":0},null,{"$f":"'App.2-FA Proposed REG Invest.'!F$101","v":0},{"$f":"M22","v":0},null,{"$f":"'App.2-FA Proposed REG Invest.'!G$101","v":0},{"$f":"P22","v":0},null,{"$f":"'App.2-FA Proposed REG Invest.'!H$101","v":0},{"$f":"S22","v":0},null,{"$f":"'App.2-FA Proposed REG Invest.'!I$101","v":0},{"$f":"V22","v":0},null,{"$f":"'App.2-FA Proposed REG Invest.'!J$101","v":0},{"$f":"Y22","v":0},null,{"$f":"'App.2-FA Proposed REG Invest.'!K$101","v":0},{"$f":"AB22","v":0}]
["Incremental OM&A (start-up, applicable for Provincial Recovery)",null,null,{"$f":"'App.2-FA Proposed REG Invest.'!C100","v":0},{"$f":"D23*E20","v":0},{"$f":"D23*F20","v":0},{"$f":"'App.2-FA Proposed REG Invest.'!D$100","v":0},{"$f":"G23*H20","v":0},{"$f":"G23*I20","v":0},{"$f":"'App.2-FA Proposed REG Invest.'!E$100","v":0},{"$f":"J23*K20","v":0},{"$f":"J23*L20","v":0},{"$f":"'App.2-FA Proposed REG Invest.'!F$100","v":0},{"$f":"M23*N20","v":0},{"$f":"M23*O20","v":0},{"$f":"'App.2-FA Proposed REG Invest.'!G$100","v":0},{"$f":"P23*Q20","v":0},{"$f":"P23*R20","v":0},{"$f":"'App.2-FA Proposed REG Invest.'!H$100","v":0},{"$f":"S23*T20","v":0},{"$f":"S23*U20","v":0},{"$f":"'App.2-FA Proposed REG Invest.'!I$100","v":0},{"$f":"V23*W20","v":0},{"$f":"V23*X20","v":0},{"$f":"'App.2-FA Proposed REG Invest.'!J$100","v":0},{"$f":"Y23*Z20","v":0},{"$f":"Y23*AA20","v":0},{"$f":"'App.2-FA Proposed REG Invest.'!K$100","v":0},{"$f":"AB23*AC20","v":0},{"$f":"AB23*AD20","v":0}]
["WCA",7.4999999999999997E-2,null,null,{"$f":"(E22+E23)*$B$24","v":0},{"$f":"F23*$B$24","v":0},null,{"$f":"(H22+H23)*$B$24","v":0},{"$f":"I23*$B$24","v":0},null,{"$f":"(K22+K23)*$B$24","v":0},{"$f":"L23*$B$24","v":0},null,{"$f":"(N22+N23)*$B$24","v":0},{"$f":"O23*$B$24","v":0},null,{"$f":"(Q22+Q23)*$B$24","v":0},{"$f":"R23*$B$24","v":0},null,{"$f":"(T22+T23)*$B$24","v":0},{"$f":"U23*$B$24","v":0},null,{"$f":"(W22+W23)*$B$24","v":0},{"$f":"X23*$B$24","v":0},null,{"$f":"(Z22+Z23)*$B$24","v":0},{"$f":"AA23*$B$24","v":0},null,{"$f":"(AC22+AC23)*$B$24","v":0},{"$f":"AD23*$B$24","v":0}]
["Rate Base",null,null,null,{"$f":"SUM(E21+E24)","v":0},{"$f":"SUM(F21+F24)","v":0},null,{"$f":"SUM(H21+H24)","v":0},{"$f":"SUM(I21+I24)","v":0},null,{"$f":"SUM(K21+K24)","v":0},{"$f":"SUM(L21+L24)","v":0},null,{"$f":"SUM(N21+N24)","v":0},{"$f":"SUM(O21+O24)","v":0},null,{"$f":"SUM(Q21+Q24)","v":0},{"$f":"SUM(R21+R24)","v":0},null,{"$f":"SUM(T21+T24)","v":0},{"$f":"SUM(U21+U24)","v":0},null,{"$f":"SUM(W21+W24)","v":0},{"$f":"SUM(X21+X24)","v":0},null,{"$f":"SUM(Z21+Z24)","v":0},{"$f":"SUM(AA21+AA24)","v":0},null,{"$f":"SUM(AC21+AC24)","v":0},{"$f":"SUM(AD21+AD24)","v":0}]
[]
[]
["Deemed ST Debt",0.04,null,null,{"$f":"E25*$B$28","v":0},{"$f":"F25*$B$28","v":0},null,{"$f":"H25*$B$28","v":0},{"$f":"I25*$B$28","v":0},null,{"$f":"K25*$B$28","v":0},{"$f":"L25*$B$28","v":0},null,{"$f":"N25*$B$28","v":0},{"$f":"O25*$B$28","v":0},null,{"$f":"Q25*$B$28","v":0},{"$f":"R25*$B$28","v":0},null,{"$f":"T25*$B$28","v":0},{"$f":"U25*$B$28","v":0},null,{"$f":"W25*$B$28","v":0},{"$f":"X25*$B$28","v":0},null,{"$f":"Z25*$B$28","v":0},{"$f":"AA25*$B$28","v":0},null,{"$f":"AC25*$B$28","v":0},{"$f":"AD25*$B$28","v":0}]
["Deemed LT Debt",0.56000000000000005,null,null,{"$f":"E25*$B$29","v":0},{"$f":"F25*$B$29","v":0},null,{"$f":"H25*$B$29","v":0},{"$f":"I25*$B$29","v":0},null,{"$f":"K25*$B$29","v":0},{"$f":"L25*$B$29","v":0},null,{"$f":"N25*$B$29","v":0},{"$f":"O25*$B$29","v":0},null,{"$f":"Q25*$B$29","v":0},{"$f":"R25*$B$29","v":0},null,{"$f":"T25*$B$29","v":0},{"$f":"U25*$B$29","v":0},null,{"$f":"W25*$B$29","v":0},{"$f":"X25*$B$29","v":0},null,{"$f":"Z25*$B$29","v":0},{"$f":"AA25*$B$29","v":0},null,{"$f":"AC25*$B$29","v":0},{"$f":"AD25*$B$29","v":0}]
["Deemed Equity",0.4,null,null,{"$f":"E25*$B$30","v":0},{"$f":"F25*$B$30","v":0},null,{"$f":"H25*$B$30","v":0},{"$f":"I25*$B$30","v":0},null,{"$f":"K25*$B$30","v":0},{"$f":"L25*$B$30","v":0},null,{"$f":"N25*$B$30","v":0},{"$f":"O25*$B$30","v":0},null,{"$f":"Q25*$B$30","v":0},{"$f":"R25*$B$30","v":0},null,{"$f":"T25*$B$30","v":0},{"$f":"U25*$B$30","v":0},null,{"$f":"W25*$B$30","v":0},{"$f":"X25*$B$30","v":0},null,{"$f":"Z25*$B$30","v":0},{"$f":"AA25*$B$30","v":0},null,{"$f":"AC25*$B$30","v":0},{"$f":"AD25*$B$30","v":0}]
[]
["ST Interest",1.6500000000000001E-2,null,null,{"$f":"E28*$B$32","v":0},{"$f":"F28*$B$32","v":0},null,{"$f":"H28*$B$32","v":0},{"$f":"I28*$B$32","v":0},null,{"$f":"K28*$B$32","v":0},{"$f":"L28*$B$32","v":0},null,{"$f":"N28*$B$32","v":0},{"$f":"O28*$B$32","v":0},null,{"$f":"Q28*$B$32","v":0},{"$f":"R28*$B$32","v":0},null,{"$f":"T28*$B$32","v":0},{"$f":"U28*$B$32","v":0},null,{"$f":"W28*$B$32","v":0},{"$f":"X28*$B$32","v":0},null,{"$f":"Z28*$B$32","v":0},{"$f":"AA28*$B$32","v":0},null,{"$f":"AC28*$B$32","v":0},{"$f":"AD28*$B$32","v":0}]
["LT Interest",6.1400000000000003E-2,null,null,{"$f":"E29*$B$33","v":0},{"$f":"F29*$B$33","v":0},null,{"$f":"H29*$B$33","v":0},{"$f":"I29*$B$33","v":0},null,{"$f":"K29*$B$33","v":0},{"$f":"L29*$B$33","v":0},null,{"$f":"N29*$B$33","v":0},{"$f":"O29*$B$33","v":0},null,{"$f":"Q29*$B$33","v":0},{"$f":"R29*$B$33","v":0},null,{"$f":"T29*$B$33","v":0},{"$f":"U29*$B$33","v":0},null,{"$f":"W29*$B$33","v":0},{"$f":"X29*$B$33","v":0},null,{"$f":"Z29*$B$33","v":0},{"$f":"AA29*$B$33","v":0},null,{"$f":"AC29*$B$33","v":0},{"$f":"AD29*$B$33","v":0}]
["ROE",9.1899999999999996E-2,null,null,{"$f":"E30*$B$34","v":0},{"$f":"F30*$B$34","v":0},null,{"$f":"H30*$B$34","v":0},{"$f":"I30*$B$34","v":0},null,{"$f":"K30*$B$34","v":0},{"$f":"L30*$B$34","v":0},null,{"$f":"N30*$B$34","v":0},{"$f":"O30*$B$34","v":0},null,{"$f":"Q30*$B$34","v":0},{"$f":"R30*$B$34","v":0},null,{"$f":"T30*$B$34","v":0},{"$f":"U30*$B$34","v":0},null,{"$f":"W30*$B$34","v":0},{"$f":"X30*$B$34","v":0},null,{"$f":"Z30*$B$34","v":0},{"$f":"AA30*$B$34","v":0},null,{"$f":"AC30*$B$34","v":0},{"$f":"AD30*$B$34","v":0}]
["Cost of Capital Total",null,null,null,{"$f":"SUM(E32:E34)","v":0},{"$f":"SUM(F32:F34)","v":0},null,{"$f":"SUM(H32:H34)","v":0},{"$f":"SUM(I32:I34)","v":0},null,{"$f":"SUM(K32:K34)","v":0},{"$f":"SUM(L32:L34)","v":0},null,{"$f":"SUM(N32:N34)","v":0},{"$f":"SUM(O32:O34)","v":0},null,{"$f":"SUM(Q32:Q34)","v":0},{"$f":"SUM(R32:R34)","v":0},null,{"$f":"SUM(T32:T34)","v":0},{"$f":"SUM(U32:U34)","v":0},null,{"$f":"SUM(W32:W34)","v":0},{"$f":"SUM(X32:X34)","v":0},null,{"$f":"SUM(Z32:Z34)","v":0},{"$f":"SUM(AA32:AA34)","v":0},null,{"$f":"SUM(AC32:AC34)","v":0},{"$f":"SUM(AD32:AD34)","v":0}]
[]
["OM&A",null,null,null,{"$f":"E22+E23","v":0},{"$f":"F23","v":0},null,{"$f":"H22+H23","v":0},{"$f":"I23","v":0},null,{"$f":"K22+K23","v":0},{"$f":"L23","v":0},null,{"$f":"N22+N23","v":0},{"$f":"O23","v":0},null,{"$f":"Q22+Q23","v":0},{"$f":"R23","v":0},null,{"$f":"T22+T23","v":0},{"$f":"U23","v":0},null,{"$f":"W22+W23","v":0},{"$f":"X23","v":0},null,{"$f":"Z22+Z23","v":0},{"$f":"AA23","v":0},null,{"$f":"AC22+AC23","v":0},{"$f":"AD23","v":0}]
["Amortization",null,null,{"$f":"D78","v":0},{"$f":"D38*E$20","v":0},{"$f":"D38*F$20","v":0},{"$f":"E78","v":0},{"$f":"G38*H$20","v":0},{"$f":"G38*I$20","v":0},{"$f":"F78","v":0},{"$f":"J38*K$20","v":0},{"$f":"J38*L$20","v":0},{"$f":"G78","v":0},{"$f":"M38*N$20","v":0},{"$f":"M38*O$20","v":0},{"$f":"H76+H77","v":0},{"$f":"P38*Q$20","v":0},{"$f":"P38*R$20","v":0},{"$f":"I76+I77","v":0},{"$f":"S38*T$20","v":0},{"$f":"S38*U$20","v":0},{"$f":"J76+J77","v":0},{"$f":"V38*W$20","v":0},{"$f":"V38*X$20","v":0},{"$f":"K76+K77","v":0},{"$f":"Y38*Z$20","v":0},{"$f":"Y38*AA$20","v":0},{"$f":"L76+L77","v":0},{"$f":"AB38*AC$20","v":0},{"$f":"AB38*AD$20","v":0}]
["Grossed-up PILs",null,null,null,{"$f":"E66","v":0},{"$f":"F66","v":0},null,{"$f":"H66","v":0},{"$f":"I66","v":0},null,{"$f":"K66","v":0},{"$f":"L66","v":0},null,{"$f":"N66","v":0},{"$f":"O66","v":0},null,{"$f":"Q66","v":0},{"$f":"R66","v":0},null,{"$f":"T66","v":0},{"$f":"U66","v":0},null,{"$f":"W66","v":0},{"$f":"X66","v":0},null,{"$f":"Z66","v":0},{"$f":"AA66","v":0},null,{"$f":"AC66","v":0},{"$f":"AD66","v":0}]
[]
["Revenue Requirement",null,null,null,{"$f":"SUM(E35:E39)","v":0},{"$f":"SUM(F35:F39)","v":0},null,{"$f":"SUM(H35:H39)","v":0},{"$f":"SUM(I35:I39)","v":0},null,{"$f":"SUM(K35:K39)","v":0},{"$f":"SUM(L35:L39)","v":0},null,{"$f":"SUM(N35:N39)","v":0},{"$f":"SUM(O35:O39)","v":0},null,{"$f":"SUM(Q35:Q39)","v":0},{"$f":"SUM(R35:R39)","v":0},null,{"$f":"SUM(T35:T39)","v":0},{"$f":"SUM(U35:U39)","v":0},null,{"$f":"SUM(W35:W39)","v":0},{"$f":"SUM(X35:X39)","v":0},null,{"$f":"SUM(Z35:Z39)","v":0},{"$f":"SUM(AA35:AA39)","v":0},null,{"$f":"SUM(AC35:AC39)","v":0},{"$f":"SUM(AD35:AD39)","v":0}]
[]
[]
["Provincial Rate Protection",null,null,null,null,{"$f":"F41","v":0},null,null,{"$f":"I41","v":0},null,null,{"$f":"L41","v":0},null,null,{"$f":"O41","v":0},null,null,{"$f":"R41","v":0},null,null,{"$f":"U41","v":0},null,null,{"$f":"X41","v":0},null,null,{"$f":"AA41","v":0},null,null,{"$f":"AD41","v":0}]
[]
["Monthly Amount Paid by IESO",null,null,null,null,{"$f":"F44/12","v":0},null,null,{"$f":"I44/12","v":0},null,null,{"$f":"L44/12","v":0},null,null,{"$f":"O44/12","v":0},null,null,{"$f":"R44/12","v":0},null,null,{"$f":"U44/12","v":0},null,null,{"$f":"X44/12","v":0},null,null,{"$f":"AA44/12","v":0},null,null,{"$f":"AD44/12","v":0}]
[]
["Note 1: The difference between the actual costs of approved eligible investments and revenue received from the IESO should be recorded in a variance account.  The Board may provide "]
["regulatory accounting guidance regarding a variance account either in an individual proceeding or on a generic basis."]
["Note 2: For the 2016 Test Year, Costs and Revenues of the Direct Benefit are to be included in the test year applicant Rate Base and Revenues."]
[]
["PILs Calculation"]
[null,null,null,null,2012,null,null,2013,null,null,2014,null,null,2015,null,null,"2016 TEST YEAR",null,null,2017,null,null,2018,null,null,2019,null,null,2020]
["Income Tax",null,null,null,"Direct Benefit","Provincial",null,"Direct Benefit","Provincial",null,"Direct Benefit","Provincial",null,"Direct Benefit","Provincial",null,"Direct Benefit","Provincial",null,"Direct Benefit","Provincial",null,"Direct Benefit","Provincial",null,"Direct Benefit","Provincial",null,"Direct Benefit","Provincial"]
[null,null,null,null,null,null,null,null,null,null,null,null,null,null,null,null,null,null,null,null,null,"Total",null,null,"Total",null,null,"Total"]
["Net Income - ROE on Rate Base",null,null,null,{"$f":"E34","v":0},{"$f":"F34","v":0},null,{"$f":"H34","v":0},{"$f":"I34","v":0},null,{"$f":"K34","v":0},{"$f":"L34","v":0},null,{"$f":"N34","v":0},{"$f":"O34","v":0},null,{"$f":"Q34","v":0},{"$f":"R34","v":0},null,{"$f":"T34","v":0},{"$f":"U34","v":0},null,{"$f":"W34","v":0},{"$f":"X34","v":0},null,{"$f":"Z34","v":0},{"$f":"AA34","v":0},null,{"$f":"AC34","v":0},{"$f":"AD34","v":0}]
["Amortization (17% DB and 83% P)",null,null,null,{"$f":"E38","v":0},{"$f":"F38","v":0},null,{"$f":"H38","v":0},{"$f":"I38","v":0},null,{"$f":"K38","v":0},{"$f":"L38","v":0},null,{"$f":"N38","v":0},{"$f":"O38","v":0},null,{"$f":"Q38","v":0},{"$f":"R38","v":0},null,{"$f":"T38","v":0},{"$f":"U38","v":0},null,{"$f":"W38","v":0},{"$f":"X38","v":0},null,{"$f":"Z38","v":0},{"$f":"AA38","v":0},null,{"$f":"AC38","v":0},{"$f":"AD38","v":0}]
["CCA (17% DB and 83% P)",null,null,null,{"$f":"-D94*E$20","v":0},{"$f":"-D94*F$20","v":0},null,{"$f":"-E94*H$20","v":0},{"$f":"-E94*I$20","v":0},null,{"$f":"-F94*K$20","v":0},{"$f":"-F94*L$20","v":0},null,{"$f":"-G94*N$20","v":0},{"$f":"-G94*O$20","v":0},null,{"$f":"-H94*Q$20","v":0},{"$f":"-H94*R$20","v":0},null,{"$f":"-I94*T$20","v":0},{"$f":"-I94*U$20","v":0},null,{"$f":"-J94*W$20","v":0},{"$f":"-J94*X$20","v":0},null,{"$f":"-K94*Z$20","v":0},{"$f":"-K94*AA$20","v":0},null,{"$f":"-L94*AC$20","v":0},{"$f":"-L94*AD$20","v":0}]
["Taxable income",null,null,null,{"$f":"SUM(E56:E58)","v":0},{"$f":"SUM(F56:F58)","v":0},null,{"$f":"SUM(H56:H58)","v":0},{"$f":"SUM(I56:I58)","v":0},null,{"$f":"SUM(K56:K58)","v":0},{"$f":"SUM(L56:L58)","v":0},null,{"$f":"SUM(N56:N58)","v":0},{"$f":"SUM(O56:O58)","v":0},null,{"$f":"SUM(Q56:Q58)","v":0},{"$f":"SUM(R56:R58)","v":0},null,{"$f":"SUM(T56:T58)","v":0},{"$f":"SUM(U56:U58)","v":0},null,{"$f":"SUM(W56:W58)","v":0},{"$f":"SUM(X56:X58)","v":0},null,{"$f":"SUM(Z56:Z58)","v":0},{"$f":"SUM(AA56:AA58)","v":0},null,{"$f":"SUM(AC56:AC58)","v":0},{"$f":"SUM(AD56:AD58)","v":0}]
[]
["Tax Rate  (to be entered)"]
[]
["Income Taxes Payable",null,null,null,{"$f":"E59*E61","v":0},{"$f":"F59*F61","v":0},null,{"$f":"H59*H61","v":0},{"$f":"I59*I61","v":0},null,{"$f":"K59*K61","v":0},{"$f":"L59*L61","v":0},null,{"$f":"N59*N61","v":0},{"$f":"O59*O61","v":0},null,{"$f":"Q59*Q61","v":0},{"$f":"R59*R61","v":0},null,{"$f":"T59*T61","v":0},{"$f":"U59*U61","v":0},null,{"$f":"W59*W61","v":0},{"$f":"X59*X61","v":0},null,{"$f":"Z59*Z61","v":0},{"$f":"AA59*AA61","v":0},null,{"$f":"AC59*AC61","v":0},{"$f":"AD59*AD61","v":0}]
["Gross Up"]
["Income Taxes Payable",null,null,null,{"$f":"E63/(1-E61)","v":0},{"$f":"F63/(1-F61)","v":0},null,{"$f":"H63/(1-H61)","v":0},{"$f":"I63/(1-I61)","v":0},null,{"$f":"K63/(1-K61)","v":0},{"$f":"L63/(1-L61)","v":0},null,{"$f":"N63/(1-N61)","v":0},{"$f":"O63/(1-O61)","v":0},null,{"$f":"Q63/(1-Q61)","v":0},{"$f":"R63/(1-R61)","v":0},null,{"$f":"T63/(1-T61)","v":0},{"$f":"U63/(1-U61)","v":0},null,{"$f":"W63/(1-W61)","v":0},{"$f":"X63/(1-X61)","v":0},null,{"$f":"Z63/(1-Z61)","v":0},{"$f":"AA63/(1-AA61)","v":0},null,{"$f":"AC63/(1-AC61)","v":0},{"$f":"AD63/(1-AD61)","v":0}]
["Grossed Up PILs",null,null,null,{"$f":"SUM(E65:E65)","v":0},{"$f":"SUM(F65:F65)","v":0},null,{"$f":"SUM(H65:H65)","v":0},{"$f":"SUM(I65:I65)","v":0},null,{"$f":"SUM(K65:K65)","v":0},{"$f":"SUM(L65:L65)","v":0},null,{"$f":"SUM(N65:N65)","v":0},{"$f":"SUM(O65:O65)","v":0},null,{"$f":"SUM(Q65:Q65)","v":0},{"$f":"SUM(R65:R65)","v":0},null,{"$f":"SUM(T65:T65)","v":0},{"$f":"SUM(U65:U65)","v":0},null,{"$f":"SUM(W65:W65)","v":0},{"$f":"SUM(X65:X65)","v":0},null,{"$f":"SUM(Z65:Z65)","v":0},{"$f":"SUM(AA65:AA65)","v":0},null,{"$f":"SUM(AC65:AC65)","v":0},{"$f":"SUM(AD65:AD65)","v":0}]
[]
[]
["Net Fixed Assets",null,null,2011,2012,2013,2014,2015,2016,2017,2018,2019]
[null,"Enter applicable amortization in years:",25]
["Opening Gross Fixed Assets",null,null,null,{"$f":"D73","v":0},0,0,0,0,0,0,0]
["Gross Capital Additions",null,null,{"$f":"'App.2-FA Proposed REG Invest.'!C99","v":0},{"$f":"'App.2-FA Proposed REG Invest.'!D99","v":0},{"$f":"'App.2-FA Proposed REG Invest.'!E99","v":0},{"$f":"'App.2-FA Proposed REG Invest.'!F99","v":0},{"$f":"'App.2-FA Proposed REG Invest.'!G99","v":0},{"$f":"'App.2-FA Proposed REG Invest.'!H99","v":0},{"$f":"'App.2-FA Proposed REG Invest.'!I99","v":0},{"$f":"'App.2-FA Proposed REG Invest.'!J99","v":0},{"$f":"'App.2-FA Proposed REG Invest.'!K99","v":0}]
["Closing Gross Fixed Assets",null,null,{"$f":"SUM(D71:D72)","v":0},0,0,0,0,0,0,0,0]
[]
["Opening Accumulated Amortization",null,null,null,{"$f":"+D78","v":0},{"$f":"E78","v":0},0,{"$f":"G78","v":0},{"$f":"H78","v":0},{"$f":"I78","v":0},{"$f":"J78","v":0},{"$f":"K78","v":0}]
["Current Year Amortization (before additions)",null,null,null,{"$f":"IF(ISERROR(E71/$C$70), 0, E71/$C$70)","v":0},0,0,{"$f":"H71/$C$70","v":0},{"$f":"I71/$C$70","v":0},{"$f":"J71/$C$70","v":0},{"$f":"K71/$C$70","v":0},{"$f":"L71/$C$70","v":0}]
["Additions (half year)",null,null,{"$f":"D72/C70/2","v":0},{"$f":"E72/C70/2","v":0},{"$f":"F72/C70/2","v":0},{"$f":"G72/C70/2","v":0},{"$f":"H72/C70/2","v":0},{"$f":"I72/C70/2","v":0},{"$f":"J72/C70/2","v":0},{"$f":"K72/C70/2","v":0},{"$f":"L72/C70/2","v":0}]
["Closing Accumulated Amortization",null,null,{"$f":"SUM(D75+D77)","v":0},{"$f":"SUM(E75:E77)","v":0},0,0,0,0,0,0,0]
[]
["Opening Net Fixed Assets",null,null,{"$f":"D71-D75","v":0},{"$f":"E71-E75","v":0},{"$f":"F71-F75","v":0},{"$f":"G71-G75","v":0},{"$f":"G81","v":0},{"$f":"H81","v":0},{"$f":"I81","v":0},{"$f":"J81","v":0},{"$f":"K81","v":0}]
["Closing Net Fixed Assets",null,null,{"$f":"D73-D78","v":0},0,0,0,0,0,0,0,0]
["Average Net Fixed Assets",null,null,{"$f":"SUM(D80:D81)/2","v":0},0,0,0,0,0,0,0,0]
[]
["UCC for PILs Calculation"]
[null,null,null,2014,2014,2014,2014,2015,2016,2017,2018,2019]
[]
["Opening UCC",null,null,null,{"$f":"D95","v":0},0,0,0,0,0,0,0]
["Capital Additions (from Appendix 2-FA)",null,null,{"$f":"D72","v":0},0,0,0,0,0,0,0,0]
["UCC Before Half Year Rule",null,null,{"$f":"SUM(D87:D88)","v":0},0,0,0,0,0,0,0,0]
["Half Year Rule (1/2 Additions - Disposals)",null,null,{"$f":"D88/2","v":0},0,0,0,0,0,0,0,0]
["Reduced UCC",null,null,{"$f":"D89-D90","v":0},0,0,0,0,0,0,0,0]
["CCA Rate Class (to be entered)",null,47,{"$f":"$C$92","v":47},{"$f":"$C$92","v":47},47,47,47,47,47,47,47]
["CCA Rate  (to be entered)",null,0.08,{"$f":"$C$93","v":0.08},{"$f":"$C$93","v":0.08},0.08,0.08,0.08,0.08,0.08,0.08,0.08]
["CCA",null,null,{"$f":"D91*D$93","v":0},{"$f":"E91*E$93","v":0},{"$f":"F91*F$93","v":0},{"$f":"G91*G$93","v":0},{"$f":"H91*H$93","v":0},0,0,0,0]
["Closing UCC",null,null,{"$f":"D89-D94","v":0},0,0,0,0,0,0,0,0]

{"sheet":"App.2-G SQI","index":28,"n_rows":37,"n_cols":11,"rows_kept":37,"cut":false,"hidden":false,"merged":[[35,0,35,1],[36,0,36,1],[28,0,28,1],[29,0,29,1],[30,0,30,1],[31,0,31,1],[32,0,32,1],[25,0,25,1],[26,0,26,1],[27,0,27,1],[33,0,33,1],[34,0,34,1],[8,0,8,10],[9,0,9,10],[10,0,10,10],[12,0,13,0],[12,1,12,5],[12,6,12,10],[18,1,18,4],[18,6,18,9],[21,0,21,10],[22,0,22,10],[17,0,17,10],[19,1,19,4],[19,6,19,9]]}
[null,null,null,null,null,null,null,null,"File Number:",null,{"$f":"EBNUMBER","v":"EB-2016-0061"}]
[null,null,null,null,null,null,null,null,"Exhibit:",null,2]
[null,null,null,null,null,null,null,null,"Tab:",null,8]
[null,null,null,null,null,null,null,null,"Schedule:",null,"1A"]
[null,null,null,null,null,null,null,null,"Page:"]
[]
[null,null,null,null,null,null,null,null,"Date:",null,"2016-04-29"]
[]
["Appendix 2-G"]
["Service Reliability Indicators"]
["2011 - 2015"]
[]
["Index","Including outages caused by loss of supply",null,null,null,null,"Excluding outages caused by loss of supply"]
[null,2011,2012,2013,2014,2015,2011,2012,2013,2014,2015]
["SAIDI ",2.5232999999999999,7.7560000000000002,3.4611999999999998,1.9523999999999999,5.8697999999999997,2.4115000000000002,1.891,3.2248999999999999,1.9509000000000001,2.3607999999999998]
["SAIFI",2.0699999999999998,3.8250999999999999,2.9702999999999999,2.0672999999999999,3.5497999999999998,1.7970999999999999,2.2090000000000001,2.7187999999999999,2.0669,2.7829999999999999]
[]
["5 Year Historical Average"]
["SAIDI ",null,null,null,null,{"$f":"IF(ISERROR(AVERAGE(B15:F15)), \"\", AVERAGE(B15:F15))","v":4.3125400000000003},null,null,null,null,{"$f":"IF(ISERROR(AVERAGE(G15:K15)), \"\", AVERAGE(G15:K15))","v":2.36782}]
["SAIFI",null,null,null,null,{"$f":"IF(ISERROR(AVERAGE(B16:F16)), \"\", AVERAGE(B16:F16))","v":2.8964999999999996},null,null,null,null,{"$f":"IF(ISERROR(AVERAGE(G16:K16)), \"\", AVERAGE(G16:K16))","v":2.3149600000000001}]
[]
["SAIDI = System Average Interruption Duration Index"]
["SAIFI = System Average Interruption Frequency Index "]
[]
[]
["Indicator",null,"OEB Minimum Standard",2011,2012,2013,2014,2015]
["Low Voltage Connections",null,0.9,0.95930000000000004,0.95709999999999995,0.93100000000000005,0.96,0.9355]
["High Voltage Connections",null,0.9,"---",0,0,0,0]
["Telephone Accessibility",null,0.65,0.84630000000000005,0.84560000000000002,0.82569999999999999,0.78,0.76070000000000004]
["Appointments Met",null,0.9,1,1,1,1,1]
["Written Response to Enquires",null,0.8,1,1,1,1,1]
["Emergency Urban Response",null,0.8,1,1,1,1,1]
["Emergency Rural Response",null,0.8,1,1,1,1,1]
["Telephone Call Abandon Rate",null,0.1,2.3E-2,2.8299999999999999E-2,2.4500000000000001E-2,0.04,4.58E-2]
["Appointment Scheduling",null,0.9,0.99150000000000005,0.99529999999999996,0.99150000000000005,0.98,0.97]
["Rescheduling a Missed Appointment",null,1,"---",0,0,0,0]
["Reconnection Performance Standard",null,0.85,"---",1,1,1,1]

{"sheet":"App.2-H_Other_Oper_Rev","index":29,"n_rows":160,"n_cols":8,"rows_kept":160,"cut":false,"hidden":false,"merged":[[146,0,146,1],[147,0,147,1],[148,0,148,1],[158,0,158,1],[159,0,159,1],[149,0,149,1],[150,0,150,1],[151,0,151,1],[156,0,156,1],[157,0,157,1],[137,0,137,1],[138,0,138,1],[139,0,139,1],[140,0,140,1],[145,0,145,1],[128,0,128,1],[129,0,129,1],[134,0,134,1],[135,0,135,1],[136,0,136,1],[119,0,119,1],[124,0,124,1],[125,0,125,1],[126,0,126,1],[127,0,127,1],[114,0,114,1],[115,0,115,1],[116,0,116,1],[117,0,117,1],[118,0,118,1],[105,0,105,1],[106,0,106,1],[107,0,107,1],[108,0,108,1],[113,0,113,1],[96,0,96,1],[97,0,97,1],[98,0,98,1],[103,0,103,1],[104,0,104,1],[87,0,87,1],[92,0,92,1],[93,0,93,1],[94,0,94,1],[95,0,95,1],[82,0,82,1],[83,0,83,1],[84,0,84,1],[85,0,85,1],[86,0,86,1],[73,0,73,1],[74,0,74,1],[75,0,75,1],[76,0,76,1],[81,0,81,1],[64,0,64,1],[65,0,65,1],[66,0,66,1],[71,0,71,1],[72,0,72,1],[43,0,43,7],[30,0,30,1],[31,0,31,1],[8,0,8,7],[9,0,9,7],[28,0,28,7],[29,0,29,1],[38,2,38,7],[39,2,40,7],[32,0,32,1],[33,0,33,1],[36,0,36,1],[37,0,37,1],[38,0,38,1],[39,0,39,1],[49,0,49,1],[55,0,55,1],[51,0,51,1],[52,0,52,1],[53,0,53,1],[54,0,54,1],[60,0,60,1],[61,0,61,1],[62,0,62,1],[63,0,63,1],[50,0,50,1]]}
[null,null,null,null,null,null,"File Number:",{"$f":"EBNUMBER","v":"EB-2016-0061"}]
[null,null,null,null,null,null,"Exhibit:",3]
[null,null,null,null,null,null,"Tab:",4]
[null,null,null,null,null,null,"Schedule:",3]
[null,null,null,null,null,null,"Page:"]
[]
[null,null,null,null,null,null,"Date:","2016-04-29"]
[]
["Appendix 2-H"]
["Other Operating Revenue"]
[]
["USoA #","USoA Description",{"$f":"F13-3 & \" Actual\"","v":"2012 Actual"},{"$f":"F13-2 & \" Actual\"","v":"2013 Actual"},{"$f":"F13-1 & \" Actual\" & CHAR(178)","v":"2014 Actual²"},{"$f":"\"Actual Year\" & CHAR(178)","v":"Actual Year²"},{"$f":"\"Bridge Year\" & CHAR(178)","v":"Bridge Year²"},"Test Year"]
[null,null,{"$f":"D13","v":2013},2013,2014,{"$f":"G13-1","v":2015},2016,2017]
[null,"Reporting Basis"]
[4235,"Specific Service Charges",151354.91999999998,151021.51999999999,160714.45000000001,159803.01999999999,156538.92000000001,158263.91999999998]
[4225,"Late Payment Charges",361102.2,397362.51,391595.44,373070.05,340573.08,354100.08]
[4082,"Retail Services Revenues",33500.04,23309.8,25190.2,21397.3,24250.080000000002,24600]
[4084,"Service Transaction Requests (STR) Revenues",1400.04,791.25,821.25,579.25,806.40000000000009,799.92000000000007]
[4086,"SSS Administration Revenue",79562.240000000005,80384.800000000003,80806.5,81575.600000000006,80841.119999999995,81035.16]
[4210,"Rent from Electric Property",317100.12,320461.61,328193.3,322463.71000000002,324327.48000000004,327500.03999999998]
[4220,"Other Electric Revenues",9873,-946693.19000000006,26048.14,78960.490000000005,15540.96,15700.080000000002]
[4325,"Revenues from Merchandise, Jobbing, Etc.",556692,383707.05,575418.55000000005,773569.32000000007,437083.8,432851.88]
[4330,"Costs and Expenses of Merchandising, Jobbing, Etc.",-137400,-143739.66999999998,-235995.45,-166989.06,-108234.84,-109623.36]
[4360,"Loss on Disposition of Utility and Other Property",0,-19691.510000000002,74501.87,46779.14,0,0]
[4375,"Revenues from Non-Utility Operations",0,0,0,0,0,1132965.08]
[4390,"Miscellaneous Non-Operating Income",null,null,null,null,null,100000]
[4398,"Foreign Exchange Gains and Losses, Including Amortization",0,3712.87,-11746.49,-28154.75,0,0]
[4405,"Interest and Dividend Income",30000.040000000008,-54939.79,76420.549999999988,72102.81,30000,30000]
[]
["Specific Service Charges",null,{"$f":"C15","v":151354.91999999998},151021.51999999999,160714.45000000001,159803.01999999999,156538.92000000001,158263.91999999998]
["Late Payment Charges",null,361102.2,397362.51,391595.44,373070.05,340573.08,354100.08]
["Other Operating Revenues",null,441435.44,-521745.7300000001,461059.39,504976.35000000003,475766.04,479635.20000000001]
["Other Income or Deductions",null,449292.04000000004,169048.94999999998,478599.03,697307.46,328848.95999999996,{"$f":"1462445.60394432-6252+H26","v":1556193.60394432}]
["Total",null,{"$f":"SUM(C30:C33)","v":1403184.6},195687.24999999991,1491968.31,1735156.88,1301727,2548192.80394432]
[]
["Description",null,"Account(s)"]
["Specific Service Charges:",null,4235]
["Late Payment Charges:",null,4225]
["Other Distribution Revenues:",null,"4082, 4084, 4086, 4210, 4220"]
["Other Income and Expenses:",null,"4325, 4330, 4360, 4375, 4390, 4398, 4405"]
[]
[]
["Note: Add all applicable accounts listed above to the table and include all relevant information."]
[]
["Account Breakdown Details"]
[]
["Account 4082 - Retail Services Revenue"]
[null,null,"Board Approved","2013 Actual","2014 Actual","Actual Year","Bridge Year","Test Year"]
[null,null,2013,2013,2014,2015,2016,2017]
["Reporting Basis",null,"","","","","",""]
["Monthly fixed retail charge",null,2740,3560,3880,3620,3720,3700]
["Monthly variable service charge",null,19800,12490,13361,11163,12925,13100]
["Bill-ready charge",null,10960,7260,7849,6614,7555,7700]
["Other",null,0,0,100,0,50,100]
[]
["Total",null,{"$f":"SUM(C51:C55)","v":33500},23310,25190,21397,24250,24600]
[]
["Account 4084 - Service Transaction Requests (STR) Revenues"]
[null,null,"Board Approved","2013 Actual","2014 Actual","Actual Year","Bridge Year","Test Year"]
[null,null,2013,2013,2014,2015,2016,2017]
["Reporting Basis",null,"",null,null,null,"",""]
["STR request fee",null,550,340,332,225,336,300]
["STR processing fee",null,850,451,489,354,470,500]
[]
[]
[]
["Total",null,{"$f":"SUM(C62:C66)","v":1400},791,821,579,806,800]
[]
["Account 4086 - SSS Administrative Revenue"]
[null,null,"Board Approved","2013 Actual","2014 Actual","Actual Year","Bridge Year","Test Year"]
[null,null,2013,2013,2014,2015,2016,2017]
["Reporting Basis"]
["Administrative charge",null,79562,80385,80807,81576,80841,81035]
[]
[]
[]
["Total",null,{"$f":"SUM(C73:C76)","v":79562},80385,80807,81576,80841,81035]
[]
["Account 4210 - Rent from Electric Property"]
[null,null,"Board Approved","2013 Actual","2014 Actual","Actual Year","Bridge Year","Test Year"]
[null,null,2013,2013,2014,2015,2016,2017]
["Reporting Basis"]
["Pole rentals",null,317100,320462,328193,322464,324327,327500]
[]
[]
[]
[]
["Total",null,{"$f":"SUM(C83:C87)","v":317100},320462,328193,322464,324327,327500]
[]
["Account 4220 - Other Electric Revenues"]
[null,null,"Board Approved","2013 Actual","2014 Actual","Actual Year","Bridge Year","Test Year"]
[null,null,2013,2013,2014,2015,2016,2017]
["Reporting Basis"]
["Returned cheque",null,4100,3399,4225,2942,3541,3600]
["Other revenue",null,5773,54230,21823,76018,12000,12100]
["Smart meter ROE/disposition balances per OEB FAQ",null,0,-1004322,0,0,0,0]
[]
[]
["Total",null,{"$f":"SUM(C94:C98)","v":9873},-946693,26048,78960,15541,15700]
[]
["Account 4325 - Revenue from Merchandise, Jobbing, Etc."]
[null,null,"Board Approved","2013 Actual","2014 Actual","Actual Year","Bridge Year","Test Year"]
[null,null,2013,2013,2014,2015,2016,2017]
["Reporting Basis"]
["Job order revenue",null,0,121564,175307,365695,84429,74505]
["IT outside services with related parties",null,556692,262143,400112,407873.5,352655,358347]
[]
[]
["Total",null,{"$f":"SUM(C105:C108)","v":556692},{"$f":"SUM(D105:D108)","v":383707},575419,773568.5,437084,432852]
[]
["Account 4330 - Costs and Expenses of Merchandise, Jobbing, Etc."]
[null,null,"Board Approved","2013 Actual","2014 Actual","Actual Year","Bridge Year","Test Year"]
[null,null,2013,2013,2014,2015,2016,2017]
["Reporting Basis"]
["Job order costs",null,null,-110784,-148650,-105304,-75029,-75105]
["IT outside services with related parties",null,-137400,-32956,-87344.93,-61685,-33206,-34518]
[]
[]
[]
["Total",null,{"$f":"SUM(C115:C119)","v":-137400},-143740,-235994.93,-166989,-108235,-109623]
[]
["Account 4360 - Loss on Disposition of Utility and Other Property"]
[null,null,"Board Approved","2013 Actual","2014 Actual","Actual Year","Bridge Year","Test Year"]
[null,null,2013,2013,2014,2015,2016,2017]
["Reporting Basis"]
["Loss on disposals/retirement",null,0,-19692,74502,46779,0,0]
[]
[]
[]
["Total",null,{"$f":"SUM(C126:C129)","v":0},-19692,74502,46779,0,0]
[]
["Account 4375 - Revenues from Non-Utility Operations"]
[null,null,"Board Approved","2013 Actual","2014 Actual","Actual Year","Bridge Year","Test Year"]
[null,null,2013,2013,2014,2015,2016,2017]
["Reporting Basis"]
["Shared IT and equipment charges",null,0,0,0,0,0,1139217.0839443232]
[]
[]
[]
[]
["Total",null,{"$f":"SUM(C136:C140)","v":0},0,0,0,0,1139217.0839443232]
[]
["Account 4398 - Foreign Exchange Gains and Losses, Including Amortization"]
[null,null,"Board Approved","2013 Actual","2014 Actual","Actual Year","Bridge Year","Test Year"]
[null,null,2013,2013,2014,2015,2016,2017]
["Reporting Basis"]
["Gain/loss on foreign exchange",null,0,3713,-11746,-28155,0,0]
[]
[]
[]
[]
["Total",null,{"$f":"SUM(C147:C151)","v":0},3713,-11746,-28155,0,0]
[]
["Account 4405 - Interest and Dividend Income"]
[null,null,"Board Approved","2013 Actual","2014 Actual","Actual Year","Bridge Year","Test Year"]
[null,null,2013,2013,2014,2015,2016,2017]
["Reporting Basis"]
["Interest on regulatory assets",null,0,-81811.95,45678.720000000001,42361,0,0]
["Other interest",null,30000,26872.16,30741.829999999998,29742,30000,30000]
["Total",null,{"$f":"SUM(C158:C159)","v":30000},-54939.789999999994,76420.55,72103,30000,30000]

{"sheet":"App_2-I LF_CDM","index":30,"n_rows":96,"n_cols":14,"rows_kept":96,"cut":false,"hidden":false,"merged":[[95,0,95,7],[41,0,41,5],[22,0,22,7],[24,0,24,7],[82,0,82,7],[84,0,84,7],[67,0,67,5],[72,0,72,7],[74,0,74,7],[76,0,76,7],[78,0,78,7],[80,0,80,7],[70,4,70,6],[65,0,65,7],[43,0,43,7],[45,0,45,7],[47,0,47,7],[49,0,49,5],[51,0,51,4],[54,0,54,1],[63,0,63,7],[61,0,61,1],[17,0,17,7],[19,0,19,7],[21,0,21,7],[32,0,32,7],[8,0,8,7],[9,0,9,7],[11,0,11,7],[13,0,13,7],[15,0,15,7]]}
[null,null,null,null,null,null,"File Number:",{"$f":"EBNUMBER","v":"EB-2016-0061"}]
[null,null,null,null,null,null,"Exhibit:",3]
[null,null,null,null,null,null,"Tab:",2]
[null,null,null,null,null,null,"Schedule:","1A"]
[null,null,null,null,null,null,"Page:"]
[]
[null,null,null,null,null,null,"Date:","2016-04-29"]
[]
["Appendix 2-I"]
["Load Forecast CDM Adjustment Work Form (2017)"]
[]
["Appendix 2-I was initially developed to help determine what would be the amount of CDM savings needed in each year to cumulatively achieve the four year 2011-2014 CDM target.  This then determined the amount of kWh (and with translation, kW of demand) savings that were converted in dollars balances for the LRAMVA, and also to determine the related adjustment to the load forecast to account for OPA-reported savings.  Beginning for the 2015 year, it has been adjusted because of the persistence of 2011-2014 CDM programs will be an adjustment to the load forecast in addition to the estimated savings for the first year (2015) for the new 2015-2020 CDM plan."]
[]
["2017 is the third year of the six-year (2015-2020) Conservation First program. Final results for the 2011-14 program were issued in the fall of 2015, and the program in completed, although in some instances disdposition of the amounts has been deferred. For the purposes of the 2015-2020 LRAMVA, and the impact of CDM on the load forecast, CDM programs in 2014 and earlier are implicit in the historical data on which the base load forecast is developed. Only impacts of 2015 to 2017 CDM programs need to be reflected in for the manual load forecast adjustment and for the LRAMVA threshold amount in 2017 and carrying forward, although the half-year impact of 2015 CDM programs on the 2015 historical data is also assumed to be reflected in the base load forecast.  "]
[]
["The new six year (2015-2020) CDM program works similarly to the previous 2011-2014 CDM program, meaning that distributors will offer programs each year that, over the six years (from January 1, 2015 to December 31, 2020) will strive to cumulatively achieve savings meeting the new six year CDM target. In other words, distributors will be able to offer and execute programs on a basis so that cumulatively over the period, the measuyred impacts, including persistence, of the CDM programs will accumulate towards achieving each distributor's 2015-2020 CDM target."]
[]
["2015-2020 CDM Program - 2017, third year of the current CDM plan"]
[]
["For the first year of the new 2015-2020 CDM plan, it is assumed that each year's program will achieve an equal amount of new CDM savings.  The new targets for 2015-2020 do not take into account persistence beyond the first year, but the IESO will encourage distributors to promote and implement  CDM plans that will have longer term persistence of savings.  This results in each year's program being about 1/6 (18.67%) of the cumulative 2015-2020 CDM target for kWh savings.  A distributor may propose an alternative approach but would be expected to document in its application why it believes that its proposal is more reasonable.  In its proposal, the distributor should ensure that the sum of the results for each year's CDM program from 2015 to 2020 add up to its 2015-2020 CDM target as established by the IESO."]
[]
["6 Year (2015-2020) kWh Target:"]
[28534220]
[null,2015,2016,2017,2018,2019,2020,"Total",null,null,{"$f":"B24","v":2015},{"$f":"C24","v":2016},{"$f":"D24","v":2017},{"$f":"E24","v":2018}]
["%",null,null,null,null,null,null,null,null,{"$f":"A25","v":"%"},{"$f":"50%","v":0.5},1,1,1]
["2015 CDM Programs",{"$f":"B34/$H$40","v":0.22658127679677242},{"$f":"C34/$H$40","v":0},0,0,0,0,{"$f":"SUM(B26:G26)","v":0.22658127679677242},null,{"$f":"A26","v":"2015 CDM Programs"},null,0.5,1,1]
["2016 CDM Programs",null,0.22282017871874543,0,0,0,0,{"$f":"SUM(B27:G27)","v":0.22282017871874543},null,{"$f":"A27","v":"2016 CDM Programs"},null,null,0.5,1]
["2017 CDM Programs",null,null,0.18903618181958365,0,0,0,{"$f":"SUM(B28:G28)","v":0.18903618181958365},null,{"$f":"A28","v":"2017 CDM Programs"},null,null,null,0.5]
["2018 CDM Programs",null,null,null,0.14982011073020393,0,0,{"$f":"SUM(E29:G29)","v":0.14982011073020393}]
["2019 CDM Programs",null,null,null,null,0.11151347399718653,0,{"$f":"SUM(F30:G30)","v":0.11151347399718653}]
["2020 CDM Programs",null,null,null,null,null,{"$f":"G39/$H$40","v":0.10022877793750802},{"$f":"SUM(B31:G31)","v":0.10022877793750802}]
["Total in Year",{"$f":"SUM(B26:B31)","v":0.22658127679677242},{"$f":"SUM(C26:C31)","v":0.22282017871874543},{"$f":"SUM(D26:D31)","v":0.18903618181958365},{"$f":"SUM(E26:E29)","v":0.14982011073020393},{"$f":"SUM(F26:F30)","v":0.11151347399718653},{"$f":"SUM(G26:G31)","v":0.10022877793750802},{"$f":"SUM(B32:G32)","v":1}]
["kWh"]
[{"$f":"A26","v":"2015 CDM Programs"},6465320,null,null,null,null,null,{"$f":"SUM(B34:G34)","v":6465320}]
["2016 CDM Programs",null,6358000,null,null,null,null,{"$f":"SUM(B35:G35)","v":6358000}]
["2017 CDM Programs",null,null,5394000,null,null,null,{"$f":"SUM(B36:G36)","v":5394000}]
["2018 CDM Programs",null,null,null,4275000,null,null,{"$f":"SUM(E37:G37)","v":4275000}]
["2019 CDM Programs",null,null,null,null,3181950,null,{"$f":"SUM(F38:G38)","v":3181950}]
["2020 CDM Programs",null,null,null,null,null,2859950,{"$f":"SUM(B39:G39)","v":2859950}]
["Total in Year",{"$f":"SUM(B34:B39)","v":6465320},{"$f":"SUM(C34:C39)","v":6358000},5394000,{"$f":"SUM(E34:E37)","v":4275000},{"$f":"SUM(F34:F38)","v":3181950},{"$f":"SUM(G34:G39)","v":2859950},{"$f":"SUM(H34:H39)","v":28534220}]
[]
["Note: The default formulae in the above table assume that 1/21 of the 2015-2020 kWh CDM target is required each year so that, including persistence, 100% of the kWh target is achieved by the end of 2020.  The distributor can input the 2015 CDM savings, including persistence from 2016 to 2020, once the reports become available. The distributor can also input their estimates or forecasts of the 2016 nd 2017 CDM programs if it believes that these are more realistic; such information would typically be derived from the CDM plans that the distributor has filed with the IESO. Similarly, CDM savings and persistence into future years can be estimated for 2018, 2019 and 2020 CDM programs. However, the distributor will have to support its proposals for estimated or forecasted savings, particularly beyond the 2017 test year. The sum of cumulative savings, including persistence, should equal the target entered into cell A25."]
[]
["Determination of 2017 Load Forecast Adjustment"]
[]
["The Board determined that the \"net\" number should be used in its Decision and Order with respect to Centre Wellington Hydro Ltd.'s 2013 Cost of Service rates (EB-2012-0113).  This approach has also been used in Settlement Agreements accepted by the Board in other 2013 and 2-14 applications.  The distributor should select whether the adjustment is done on a \"net\" or \"gross\" basis, but must support a proposal for the adjustment being done on a \"gross\" basis.  Sheet 2-I defaults to the adjustment being done on a \"net\" basis consistent with Board policy and practice."]
[]
["From each of the 2006-2010 CDM Final Report,  and the 2011, 2012, 2013, 2014 and 2015 CDM Final Reports, issued by the OPA/IESO for the distributor, the distributor should input the \"gross\" and \"net\" results of the cumulative CDM savings for 2014 into cells D84 to E88.  The model will calculate the cumulative savings for all programs from 2006 to 2012 and determine the \"net\" to \"gross\" factor \"g\"."]
[]
["Net-to-Gross Conversion"]
[]
["Is CDM adjustment being done on a \"net\" or \"gross\" basis?",null,null,null,null,"net"]
[]
[null,null,"\"Gross\"","\"Net\"","Difference","\"Net-to-Gross\" Conversion Factor"]
["Persistence of Historical CDM programs to 2015",null,"kWh","kWh","kWh","('g')"]
["2006-2010 CDM programs",null,null,null,{"$f":"IF(ISBLANK(D56),\"\",C56-D56)","v":""}]
["2011 CDM program",null,null,null,{"$f":"IF(ISBLANK(D57),\"\",C57-D57)","v":""}]
["2012 CDM program",null,null,null,""]
["2013 CDM program",null,null,null,""]
["2014 CDM program",null,null,null,""]
["2015 CDM program",null,null,null,""]
["2006 to 2015 OPA CDM programs:  Persistence to 2017",null,{"$f":"SUM(C56:C61)","v":0},{"$f":"SUM(D56:D61)","v":0},{"$f":"C62-D62","v":0},{"$f":"IF(D62=0,0,IF(F52=\"net\",0,E62/D62))","v":0}]
[]
["The default values represent the factor that each year's CDM program is factored into the manual CDM adjustment.  Distributors can choose alternative weights of \"0\", \"0.5\" or \"1\" from the drop-down menu for each cell, but must support its alternatives."]
[]
["These factors do not mean that CDM programs are excluded, but the assumption that impacts of previous year CDM programs are already implicitly reflected in the actual data for the historical years that are the basis for the load forecast prior to any manual CDM adjustment for the 2017 test year."]
[]
["Weight Factor for Inclusion in CDM Adjustment to 2017 Load Forecast"]
[null,2015,2016,2017,2018,2019,2020]
["Weight Factor for each year's CDM program impact on 2014 load forecast",0,1,0.5,0,0,0,"Distributor can select \"0\", \"0.5\", or \"1\" from drop-down list"]
["Default Value selection rationale.  ","Default is 0, but one option is for full year impact of persistence of 2015 CDM programs on 2017 load forecast, but 50% impact in base forecast (first year impact of 2014 CDM programs on 2014 actuals, which is part of the data for the load forecast.","Full year impact of persistence of 2015 programs on 2015 load forecast.  2015 CDM program impacts are not in the base forecast.","Only 50% of 2016 CDM programs are assumed to impact the 2016 load forecast based on the \"half-year\" rule.","2018, 2019 and 2020 are future years beyond the 2017 test year. No impacts of CDM programs beyond the 2017 test year are factored into the test year load forecast."]
[]
["2015-2020 LRAMVA and 2017 CDM adjustment to Load Forecast"]
[]
["One manual adjustment for CDM impacts to the 2017 load forecast is made.  There is a different but related threshold amount that is used for the 2017 LRAMVA amount for Account 1568."]
[]
["The Amount used for the CDM threshold of the LRAMVA is the kWh that will be used to determine the base amount for the LRAMVA balance for 2014, for assessing performance against the four-year target.  The base amount for 2011-2013 is 0 (zero) for 2014 Cost of Service applications, as the utility rebased prior to the 2011-2014 CDM programs, and there was no adjustment to reflect the impacts of the 2011-2014 programs on the load forecast used to determine their last cost of service-based rates."]
[]
["If used to determine the manual CDM adjustment for the system purchased kWh, the proposed loss factor should correspond with the proposed total loss factor calculated in Appendix 2-R "]
[]
["The Manual Adjustment for the 2017 Load Forecast is the amount manually subtracted from the system-wide load forecast (either based on a purchased or billed basis) derived from the base forecast from historical data. "]
[]
["If the distributor has developed their load forecast on a system purchased basis, then the manual adjustment should be on system purchased basis, including the adjustment for losses.  If the load forecast has been developed on a billed basis, either on a system basis or on a class-specific basis, the manual adjustment should be on a billed basis, excluding losses."]
[]
["The distributor should determine the allocation of the savings to all customer classes in a reasonable manner (e.g. taking into account what programs and what OPA-measured impacts were directed at specific customer classes), for both the LRAMVA and for the load forecast adjustment."]
[]
[null,2015,2016,2017,2018,2019,2020,"Total for 2017"]
[]
["Amount used for CDM threshold for LRAMVA (2017)",0,6358000,5394000,null,null,null,11752000]
[]
["Manual Adjustment for 2017 Load Forecast (billed basis)",0,6358000,2697000,0,0,0,9055000]
[]
["Proposed Loss Factor (TLF)","N/A","- Load Forecast on Billed Basis"]
["Manual Adjustment for 2017 Load Forecast (system purchased basis)",0,0,0,0,0,0,0]
[]
["Manual adjustment uses \"gross\" versus \"net\" (i.e. numbers multiplied by (1 + g).  The Weight factor is also used calculate the impact of each year's program on the CDM adjustment to the 2017 load forecast."]

{"sheet":"App.2-IA_Act_Frcst_Data","index":31,"n_rows":114,"n_cols":7,"rows_kept":114,"cut":false,"hidden":false,"merged":[[8,0,8,6],[9,0,9,6]]}
[null,null,null,null,null,"File Number:",{"$f":"EBNUMBER","v":"EB-2016-0061"}]
[null,null,null,null,null,"Exhibit:",3]
[null,null,null,null,null,"Tab:",1]
[null,null,null,null,null,"Schedule:",1]
[null,null,null,null,null,"Page:"]
[]
[null,null,null,null,null,"Date:","2016-04-29"]
[]
["Appendix 2-IA"]
["Summary and Variances of Actual and Forecast Data"]
[]
["Replace \"Rate Class #\" with the appropriate rate classification."]
[]
[null,{"$f":"RebaseYear & \" Board Approved\"","v":"2013 Board Approved"},{"$f":"TestYear - 4","v":2013},{"$f":"TestYear - 3","v":2014},{"$f":"TestYear - 2","v":2015},{"$f":"TestYear -1  &\" Bridge\"","v":"2016 Bridge"},{"$f":"TestYear&\" Test\"","v":"2017 Test"}]
["Residential"]
["# of Customers",25689,25798,25861,25917,25995,26074]
["kWh",208287976,206257081,203019188,199982619,200579926,201294289]
["kW"]
["Variance Analysis"]
[{"$f":"A16","v":"# of Customers"},null,{"$f":"IF(ISERROR((C16-$B16)/$B16), 0, (C16-$B16)/$B16)","v":4.2430612324341156E-3},{"$f":"IF(ISERROR((D16-$B16)/$B16), 0, (D16-$B16)/$B16)","v":6.6954727704464949E-3},8.8753941375686093E-3,1.1911713184631554E-2,1.4986959398964538E-2]
["kWh",null,{"$f":"IF(ISERROR((C17-$B17)/$B17), 0, (C17-$B17)/$B17)","v":-9.7504188143822564E-3},-2.5295689656132624E-2,-3.9874394861852229E-2,-3.700669692042137E-2,-3.3577007824974019E-2]
["kW",null,{"$f":"IF(ISERROR((C18-$B18)/$B18), 0, (C18-$B18)/$B18)","v":0},0,0,0,0]
[]
["GS Less Than 50 kW"]
["# of Customers",2521,2525,2513,2492,2491,2489]
["kWh",72454602,69535541,69999358,69530292,69511463,69390323]
["kW"]
["Variance Analysis"]
[{"$f":"A25","v":"# of Customers"},null,{"$f":"IF(ISERROR((C25-$B25)/$B25), 0, (C25-$B25)/$B25)","v":1.5866719555731853E-3},{"$f":"IF(ISERROR((D25-$B25)/$B25), 0, (D25-$B25)/$B25)","v":-3.1733439111463705E-3},-1.1503371677905593E-2,-1.190003966679889E-2,-1.2693375644585482E-2]
["kWh",null,{"$f":"IF(ISERROR((C26-$B26)/$B26), 0, (C26-$B26)/$B26)","v":-4.0288137943259972E-2},-3.3886653604142357E-2,-4.0360583307047906E-2,-4.0620456379016477E-2,-4.2292399867160956E-2]
["kW",null,{"$f":"IF(ISERROR((C27-$B27)/$B27), 0, (C27-$B27)/$B27)","v":0},0,0,0,0]
[]
["GS 50 to 4,999 kW"]
["# of Customers",228,225,225,220,218,217]
["kWh",224300691,219499506,231604485,198759828,197811642,190144345]
["kW",691366,702804,673584,634964,631907,610067]
["Variance Analysis"]
[{"$f":"A34","v":"# of Customers"},null,{"$f":"IF(ISERROR((C34-$B34)/$B34), 0, (C34-$B34)/$B34)","v":-1.3157894736842105E-2},{"$f":"IF(ISERROR((D34-$B34)/$B34), 0, (D34-$B34)/$B34)","v":-1.3157894736842105E-2},-3.5087719298245612E-2,-4.3859649122807015E-2,-4.8245614035087717E-2]
["kWh",null,{"$f":"IF(ISERROR((C35-$B35)/$B35), 0, (C35-$B35)/$B35)","v":-2.1405127994010505E-2},3.2562512257262727E-2,-0.11386885562470246,-0.11809615423788418,-0.15227927229167565]
["kW",null,{"$f":"IF(ISERROR((C36-$B36)/$B36), 0, (C36-$B36)/$B36)","v":1.6544059152460492E-2},-2.5720096157462184E-2,-8.158052319610741E-2,-8.6002204331714321E-2,-0.11759183992270375]
[]
["Unmetred Scattered Load"]
["# of Customers",39,40,40,36,36,35]
["kWh",1527929,1532742,1506300,1506177,1484310,1462761]
["kW"]
["Variance Analysis"]
[{"$f":"A43","v":"# of Customers"},null,{"$f":"IF(ISERROR((C43-$B43)/$B43), 0, (C43-$B43)/$B43)","v":2.564102564102564E-2},{"$f":"IF(ISERROR((D43-$B43)/$B43), 0, (D43-$B43)/$B43)","v":2.564102564102564E-2},-7.6923076923076927E-2,-7.6923076923076927E-2,-0.10256410256410256]
["kWh",null,{"$f":"IF(ISERROR((C44-$B44)/$B44), 0, (C44-$B44)/$B44)","v":3.1500154784679132E-3},-1.4155762473256284E-2,-1.4236263596017878E-2,-2.8547792469414482E-2,-4.2651196488842087E-2]
["kW",null,{"$f":"IF(ISERROR((C45-$B45)/$B45), 0, (C45-$B45)/$B45)","v":0},0,0,0,0]
[]
["Sentinel Lighting"]
["# of Customers",961,768,775,763,728,695]
["kWh",761037,679025,700647,691109,659331,629014]
["kW",2334,2090.5439999999999,2137.5969999999998,2105.1350000000002,2008.3382236085947,1915.992285723873]
["Variance Analysis"]
[{"$f":"A52","v":"# of Customers"},null,{"$f":"IF(ISERROR((C52-$B52)/$B52), 0, (C52-$B52)/$B52)","v":-0.2008324661810614},{"$f":"IF(ISERROR((D52-$B52)/$B52), 0, (D52-$B52)/$B52)","v":-0.19354838709677419},-0.2060353798126951,-0.24245577523413112,-0.27679500520291361]
["kWh",null,{"$f":"IF(ISERROR((C53-$B53)/$B53), 0, (C53-$B53)/$B53)","v":-0.10776348587519398},-7.9352252255803599E-2,-9.1885151444673518E-2,-0.13364133412698725,-0.1734777678352038]
["kW",null,{"$f":"IF(ISERROR((C54-$B54)/$B54), 0, (C54-$B54)/$B54)","v":-0.10430848329048849},-8.4148671808054951E-2,-9.8056983718937354E-2,-0.13952946717712308,-0.17909499326312212]
[]
["Street Lighting"]
["# of Customers",5696,5723,5717,5713,5713,5713]
["kWh",4475403,4446822,4324650,3719644,3396850,2991556]
["kW",11789,13310.657999999998,13289.154,11488.54,10492,9240]
["Variance Analysis"]
[{"$f":"A61","v":"# of Customers"},null,{"$f":"IF(ISERROR((C61-$B61)/$B61), 0, (C61-$B61)/$B61)","v":4.740168539325843E-3},{"$f":"IF(ISERROR((D61-$B61)/$B61), 0, (D61-$B61)/$B61)","v":3.6867977528089887E-3},2.9845505617977527E-3,2.9845505617977527E-3,2.9845505617977527E-3]
["kWh",null,{"$f":"IF(ISERROR((C62-$B62)/$B62), 0, (C62-$B62)/$B62)","v":-6.3862405240377234E-3},-3.3684787716324091E-2,-0.16886948504972624,-0.24099572708871134,-0.33155606321933467]
["kW",null,{"$f":"IF(ISERROR((C63-$B63)/$B63), 0, (C63-$B63)/$B63)","v":0.12907439138179638},0.12725031809313772,-2.5486470438544333E-2,-0.11001781321570955,-0.2162185087793706]
[]
["Embedded Distributor"]
["# of Customers",0,0,0,0,0,1]
["kWh",0,0,0,0,0,5205754]
["kW",0,0,0,0,0,13921]
["Variance Analysis"]
[{"$f":"A70","v":"# of Customers"},null,{"$f":"IF(ISERROR((C70-$B70)/$B70), 0, (C70-$B70)/$B70)","v":0},{"$f":"IF(ISERROR((D70-$B70)/$B70), 0, (D70-$B70)/$B70)","v":0},0,0,{"$f":"IF(ISERROR((G70-$B70)/$B70), 0, (G70-$B70)/$B70)","v":0}]
["kWh",null,{"$f":"IF(ISERROR((C71-$B71)/$B71), 0, (C71-$B71)/$B71)","v":0},0,0,0,0]
["kW",null,{"$f":"IF(ISERROR((C72-$B72)/$B72), 0, (C72-$B72)/$B72)","v":0},0,0,0,0]
[]
["Rate Class 8"]
["# of Customers"]
["kWh"]
["kW"]
["Variance Analysis"]
[{"$f":"A79","v":"# of Customers"},null,{"$f":"IF(ISERROR((C79-$B79)/$B79), 0, (C79-$B79)/$B79)","v":0},{"$f":"IF(ISERROR((D79-$B79)/$B79), 0, (D79-$B79)/$B79)","v":0},0,0,0]
["kWh",null,{"$f":"IF(ISERROR((C80-$B80)/$B80), 0, (C80-$B80)/$B80)","v":0},0,0,0,0]
["kW",null,{"$f":"IF(ISERROR((C81-$B81)/$B81), 0, (C81-$B81)/$B81)","v":0},0,0,0,0]
[]
["Rate Class 9"]
["# of Customers"]
["kWh"]
["kW"]
["Variance Analysis"]
[{"$f":"A88","v":"# of Customers"},null,{"$f":"IF(ISERROR((C88-$B88)/$B88), 0, (C88-$B88)/$B88)","v":0},{"$f":"IF(ISERROR((D88-$B88)/$B88), 0, (D88-$B88)/$B88)","v":0},0,0,0]
["kWh",null,{"$f":"IF(ISERROR((C89-$B89)/$B89), 0, (C89-$B89)/$B89)","v":0},0,0,0,0]
["kW",null,{"$f":"IF(ISERROR((C90-$B90)/$B90), 0, (C90-$B90)/$B90)","v":0},0,0,0,0]
[]
["Rate Class 10"]
["# of Customers"]
["kWh"]
["kW"]
["Variance Analysis"]
[{"$f":"A97","v":"# of Customers"},null,{"$f":"IF(ISERROR((C97-$B97)/$B97), 0, (C97-$B97)/$B97)","v":0},{"$f":"IF(ISERROR((D97-$B97)/$B97), 0, (D97-$B97)/$B97)","v":0},0,0,0]
["kWh",null,{"$f":"IF(ISERROR((C98-$B98)/$B98), 0, (C98-$B98)/$B98)","v":0},0,0,0,0]
["kW",null,{"$f":"IF(ISERROR((C99-$B99)/$B99), 0, (C99-$B99)/$B99)","v":0},0,0,0,0]
[]
[]
["Totals"]
["Customers / Connections",{"$f":"SUM(B16,B25,B34,B43,B52,B61,B70,B79,B88,B97)","v":35134},{"$f":"SUM(C16,C25,C34,C43,C52,C61,C70,C79,C88,C97)","v":35079},35131,35141,35181,35224]
["kWh",{"$f":"SUM(B17,B26,B35,B44,B53,B62,B71,B80,B89,B98)","v":511807638},501950717,511154628,474189669,473443522,471118042]
["kW from applicable classes",705489,718205.20200000005,689010.75099999993,648557.67500000005,644407.33822360856,635143.99228572391]
[]
["Totals - Variance"]
["Customers / Connections",null,{"$f":"IF(ISERROR((C107-$B107)/$B107), 0, (C107-$B107)/$B107)","v":-1.5654351909830933E-3},-8.5387374053623268E-5,1.9923720612512096E-4,1.3377355268400979E-3,2.561621221608698E-3]
["kWh",null,-1.9259034582832856E-2,-1.2758895169126022E-3,-7.3500210248913872E-2,-7.4958076338829477E-2,-7.9501736548918012E-2]
["kW from applicable classes",null,1.8024663743871339E-2,-2.3357201884083335E-2,-8.0697679198399916E-2,-8.6580601223252868E-2,-9.9710991545263056E-2]

{"sheet":"App.2-JA_OM&A_Summary_Analys","index":32,"n_rows":61,"n_cols":12,"rows_kept":61,"cut":false,"hidden":false,"merged":[[63,1,64,5],[58,0,59,11],[8,0,8,6],[9,0,9,6],[12,7,12,8]]}
[null,null,null,null,null,null,null,null,null,null,"File Number:",{"$f":"EBNUMBER","v":"EB-2016-0061"}]
[null,null,null,null,null,null,null,null,null,null,"Exhibit:",4]
[null,null,null,null,null,null,null,null,null,null,"Tab:",2]
[null,null,null,null,null,null,null,null,null,null,"Schedule:",1]
[null,null,null,null,null,null,null,null,null,null,"Page:"]
[]
[null,null,null,null,null,null,null,null,null,null,"Date:","2016-04-29"]
[]
["Appendix 2-JA"]
["Summary of Recoverable OM&A Expenses"]
[]
[]
[null,{"$f":"\"Last Rebasing Year (\" & RebaseYear & \" Board-Approved)\"","v":"Last Rebasing Year (2013 Board-Approved)"},{"$f":"\"Last Rebasing Year (\" & RebaseYear & \" Actuals)\"","v":"Last Rebasing Year (2013 Actuals)"},{"$f":"BridgeYear -2 & \" Actuals\"","v":"2014 Actuals"},{"$f":"BridgeYear -1 & \" Actuals\"","v":"2015 Actuals"},{"$f":"BridgeYear & \" Bridge Year\"","v":"2016 Bridge Year"},{"$f":"TestYear & \" Test Year\"","v":"2017 Test Year"}]
["Reporting Basis"]
["Operations",1464547.5500000003,1533640.9499999997,1726743.85,1702685.14,1658103.12,1847897.1199999999]
["Maintenance",1912477.57,1939324.6400000004,1893749.45,1912870.67,2203669.8000000003,2259048.84]
["SubTotal",{"$f":"SUM(B15:B16)","v":3377025.12},{"$f":"SUM(C15:C16)","v":3472965.59},3620493.3,{"$f":"SUM(E15:E16)","v":3615555.8099999996},3861772.9200000004,4106945.96]
["%Change (year over year)",null,null,{"$f":"IF(ISERROR((D17-C17)/C17), \"\", (D17-C17)/C17)","v":4.2478886178656312E-2},{"$f":"IF(ISERROR((E17-D17)/D17), \"\", (E17-D17)/D17)","v":-1.3637616730295355E-3},6.8099380272047524E-2,6.3487171586463859E-2]
["%Change (Test Year vs \nLast Rebasing Year - Actual)",null,null,null,null,null,{"$f":"IF(ISERROR((G17-C17)/C17), \"\", (G17-C17)/C17)","v":0.18254726503063343}]
["Billing and Collecting",2061052.8399999999,1874778.74,1768363.1800000002,1754605.5300000003,1874259.32,1960026.2]
["Community Relations",35700,22684.63,14502.809999999998,22126.22,25300,40149.879999999997]
["Administrative and General",4362182.6800000006,3493633.9700000007,4031454.1,4126645.8500000006,4399484.0999999996,{"$f":"4467600.7-557723","v":3909877.7}]
["SubTotal",{"$f":"SUM(B20:B22)","v":6458935.5200000005},{"$f":"SUM(C20:C22)","v":5391097.3400000008},5814320.0899999999,{"$f":"SUM(E20:E22)","v":5903377.6000000006},6299043.4199999999,5910053.7800000003]
["%Change (year over year)",null,null,{"$f":"IF(ISERROR((D23-C23)/C23), \"\", (D23-C23)/C23)","v":7.8504008239628442E-2},{"$f":"IF(ISERROR((E23-D23)/D23), \"\", (E23-D23)/D23)","v":1.5316925903885129E-2},{"$f":"IF(ISERROR((F23-E23)/E23), \"\", (F23-E23)/E23)","v":6.7023634063319834E-2},{"$f":"IF(ISERROR((G23-F23)/F23), \"\", (G23-F23)/F23)","v":-6.1753763875467882E-2}]
["%Change (Test Year vs \nLast Rebasing Year - Actual)",null,null,null,null,null,{"$f":"IF(ISERROR((G23-C23)/C23), \"\", (G23-C23)/C23)","v":9.6261745479817182E-2}]
["Total",{"$f":"SUM(B23,B17)","v":9835960.6400000006},{"$f":"SUM(C23,C17)","v":8864062.9299999997},9434813.3900000006,{"$f":"SUM(E23,E17)","v":9518933.4100000001},10160816.34,10016999.74]
["%Change (year over year)",null,null,{"$f":"IF(ISERROR((D26-C26)/C26), \"\", (D26-C26)/C26)","v":6.4389260828499204E-2},{"$f":"IF(ISERROR((E26-D26)/D26), \"\", (E26-D26)/D26)","v":8.9159177317866961E-3},{"$f":"IF(ISERROR((F26-E26)/E26), \"\", (F26-E26)/E26)","v":6.7432232410164494E-2},{"$f":"IF(ISERROR((G26-F26)/F26), \"\", (G26-F26)/F26)","v":-1.4154039910537309E-2}]
[]
[]
[null,{"$f":"B13","v":"Last Rebasing Year (2013 Board-Approved)"},{"$f":"C13","v":"Last Rebasing Year (2013 Actuals)"},"2014 Actuals","2015 Actuals","2016 Bridge Year","2017 Test Year"]
["Operations",{"$f":"B15","v":1464547.5500000003},{"$f":"C15","v":1533640.9499999997},1726743.85,1702685.14,1658103.12,1847897.1199999999]
["Maintenance",{"$f":"B16","v":1912477.57},{"$f":"C16","v":1939324.6400000004},1893749.45,{"$f":"E16","v":1912870.67},2203669.8000000003,2259048.84]
["Billing and Collecting",{"$f":"B20","v":2061052.8399999999},{"$f":"C20","v":1874778.74},1768363.1800000002,1754605.5300000003,1874259.32,1960026.2]
["Community Relations",{"$f":"B21","v":35700},{"$f":"C21","v":22684.63},14502.809999999998,22126.22,25300,40149.879999999997]
["Administrative and General",{"$f":"B22","v":4362182.6800000006},{"$f":"C22","v":3493633.9700000007},4031454.1,4126645.8500000006,4399484.0999999996,3909877.7]
["Total",{"$f":"SUM(B31:B35)","v":9835960.6400000006},{"$f":"SUM(C31:C35)","v":8864062.9299999997},9434813.3900000006,9518933.4100000001,10160816.34,10016999.74]
["%Change (year over year)",null,null,{"$f":"IF(ISERROR((D36-C36)/C36), \"\", (D36-C36)/C36)","v":6.4389260828499204E-2},{"$f":"IF(ISERROR((E36-D36)/D36), \"\", (E36-D36)/D36)","v":8.9159177317866961E-3},{"$f":"IF(ISERROR((F36-E36)/E36), \"\", (F36-E36)/E36)","v":6.7432232410164494E-2},{"$f":"IF(ISERROR((G36-F36)/F36), \"\", (G36-F36)/F36)","v":-1.4154039910537309E-2}]
[]
[]
[null,{"$f":"B13","v":"Last Rebasing Year (2013 Board-Approved)"},{"$f":"C13","v":"Last Rebasing Year (2013 Actuals)"},{"$f":"\"Variance \" & 'LDC Info'!E28 & \"  BA – \" & 'LDC Info'!E28 & \" Actuals\"","v":"Variance 2013  BA – 2013 Actuals"},{"$f":"D13","v":"2014 Actuals"},{"$f":"\"Variance \" & 'LDC Info'!E26 -2 & \" Actuals vs. \" &  'LDC Info'!E28 & \" Actuals\"","v":"Variance 2014 Actuals vs. 2013 Actuals"},{"$f":"E13","v":"2015 Actuals"},{"$f":"\"Variance \" & 'LDC Info'!E26 -1 & \" Actuals vs. \" &  'LDC Info'!E26-2 & \" Actuals\"","v":"Variance 2015 Actuals vs. 2014 Actuals"},{"$f":"F13","v":"2016 Bridge Year"},{"$f":"\"Variance \" & 'LDC Info'!E26 & \" Bridge vs. \" & 'LDC Info'!E26 -1 & \" Actuals\"","v":"Variance 2016 Bridge vs. 2015 Actuals"},{"$f":"G13","v":"2017 Test Year"},{"$f":"\"Variance \" & TestYear & \" Test vs. \" & BridgeYear & \" Bridge\"","v":"Variance 2017 Test vs. 2016 Bridge"}]
["Operations",{"$f":"B15","v":1464547.5500000003},1533640.9499999997,{"$f":"B41-C41","v":-69093.399999999441},{"$f":"D15","v":1726743.85},{"$f":"E41-C41","v":193102.90000000037},{"$f":"E15","v":1702685.14},{"$f":"G41-E41","v":-24058.710000000196},{"$f":"F15","v":1658103.12},{"$f":"I41-G41","v":-44582.019999999786},{"$f":"G15","v":1847897.1199999999},{"$f":"K41-I41","v":189793.99999999977}]
["Maintenance ",1912477.57,1939324.6400000004,{"$f":"B42-C42","v":-26847.070000000298},{"$f":"D16","v":1893749.45},{"$f":"E42-C42","v":-45575.19000000041},{"$f":"E16","v":1912870.67},{"$f":"G42-E42","v":19121.219999999972},{"$f":"F16","v":2203669.8000000003},290799.13000000035,{"$f":"G16","v":2259048.84},55379.039999999572]
["Billing and Collecting ",{"$f":"B20","v":2061052.8399999999},1874778.74,186274.09999999986,{"$f":"D20","v":1768363.1800000002},-106415.55999999982,{"$f":"E20","v":1754605.5300000003},-13757.649999999907,{"$f":"F20","v":1874259.32},119653.7899999998,{"$f":"G20","v":1960026.2},85766.879999999888]
["Community Relations ",35700,22684.63,13015.369999999999,{"$f":"D21","v":14502.809999999998},{"$f":"E44-C44","v":-8181.8200000000033},{"$f":"E21","v":22126.22},7623.4100000000035,{"$f":"F21","v":25300},3173.7799999999988,{"$f":"G21","v":40149.879999999997},14849.879999999997]
["Administrative and General ",4362182.6800000006,3493633.9700000007,868548.71,4031454.1,537820.12999999942,4126645.8500000006,95191.750000000466,4399484.0999999996,272838.24999999907,3909877.7,-489606.39999999944]
["Total OM&A Expenses ",{"$f":"SUM(B41:B45)","v":9835960.6400000006},{"$f":"SUM(C41:C45)","v":8864062.9299999997},{"$f":"SUM(D41:D45)","v":971897.71000000008},9434813.3900000006,570750.4599999995,9518933.4100000001,84120.020000000339,10160816.34,641882.92999999947,10016999.74,-143816.60000000021]
["Adjustments for Total non-recoverable items (from Appendices 2-JA and 2-JB)"]
["Total Recoverable OM&A Expenses ",{"$f":"B46-B47","v":9835960.6400000006},{"$f":"C46-C47","v":8864062.9299999997},971897.71000000008,9434813.3900000006,{"$f":"F46-F47","v":570750.4599999995},9518933.4100000001,84120.020000000339,10160816.34,641882.92999999947,10016999.74,-143816.60000000021]
["Variance from previous year ",null,null,null,{"$f":"E48-C48","v":570750.46000000089},null,{"$f":"G48-E48","v":84120.019999999553},null,{"$f":"I48-G48","v":641882.9299999997},null,{"$f":"K48-I48","v":-143816.59999999963}]
["Percent change (year over year) ",null,null,null,{"$f":"IF(ISERROR(E49/C48), \"\", E49/C48)","v":6.4389260828499204E-2},null,{"$f":"IF(ISERROR(G49/E48), \"\", G49/E48)","v":8.9159177317866961E-3},null,{"$f":"IF(ISERROR(I49/G48), \"\", I49/G48)","v":6.7432232410164494E-2},null,{"$f":"IF(ISERROR(K49/I48), \"\", K49/I48)","v":-1.4154039910537309E-2}]
["Percent Change:                                                    Test year vs. Most Current Actual ",null,null,null,null,null,{"$f":"IF(ISERROR((K48-G48)/G48), \"\", (K48-G48)/G48)","v":5.2323753990837094E-2}]
["Simple average of % variance for all years",null,null,null,null,null,{"$f":"IF(ISERROR((K46-C46)/C46), \"\", (K46-C46)/C46)","v":0.13006866254276475},null,null,null,null,{"$f":"IF(ISERROR(AVERAGE(E50,G50,I50,K50)), \"\", AVERAGE(E50,G50,I50,K50))","v":3.1645842764978269E-2}]
["Compound Annual Growth Rate for all years",null,null,null,null,null,{"$f":"IF(ISERROR((K49-C49)/C49), \"\", (K49-C49)/C49)","v":""},null,null,null,null,{"$f":"IF((K48-C48)=0, \"\", (K48/C48)^(1/5)-1)","v":2.4757171672153744E-2}]
[{"$f":"\"Compound Growth Rate                                                            (\" & E13 & \" vs. \" & 'LDC Info'!E28 & \" Actuals)\"","v":"Compound Growth Rate                                                            (2015 Actuals vs. 2013 Actuals)"},null,null,null,null,null,{"$f":"IF(ISERROR((G48/C48)^(1/(3)) - 1), \"\", (G48/C48)^(1/(3)) - 1)","v":2.4043690379007776E-2}]
[]
["Note:"]
[]
["1     \"BA\" = Board-Approved"]
["2     If it has been more than three years since the applicant last filed a cost of service application, additional years of historical actuals should be incorporated into the table, as necessary, to go back to the last cost of service application.  If the applicant last filed a cost of service application less than three years ago, a minimum of three years of actual information is required."]
[]
["3     Recoverable OM&A that is included on these tables should be identical to the recoverable OM&A that is shown for the corresponding periods on Appendix 2-JB."]

{"sheet":"App.2-JB_OM&A_Cost _Drivers","index":33,"n_rows":48,"n_cols":7,"rows_kept":48,"cut":false,"hidden":false,"merged":[[9,0,9,6],[10,0,10,6],[44,1,46,6],[47,1,48,6],[43,1,43,6]]}
[null,null,null,null,null,"File Number:",{"$f":"EBNUMBER","v":"EB-2016-0061"}]
[null,null,null,null,null,"Exhibit:",4]
[null,null,null,null,null,"Tab:",2]
[null,null,null,null,null,"Schedule:",2]
[null,null,null,null,null,"Page:"]
[]
[null,null,null,null,null,"Date:","2016-04-29"]
[]
[]
["Appendix 2-JB"]
["Recoverable OM&A Cost Driver Table"]
[]
["OM&A",{"$f":"\"Last Rebasing Year (\" & RebaseYear & \" Actuals)\"","v":"Last Rebasing Year (2013 Actuals)"},null,{"$f":"BridgeYear -2 & \" Actuals\"","v":"2014 Actuals"},{"$f":"BridgeYear -1 & \" Actuals\"","v":"2015 Actuals"},{"$f":"BridgeYear & \" Bridge Year\"","v":"2016 Bridge Year"},{"$f":"TestYear & \" Test Year\"","v":"2017 Test Year"}]
["Reporting Basis"]
["Opening Balance",9835960.6400000006,null,8864062.9299999997,9434813.3900000006,9518933.4100000001,10160816.34]
[]
["CDM Staffing",-85000,null,56000,null,26000]
["Vehicle Depreciation Credit",-351000,null,351000]
["Approved IFRS Costs",-85000,null,85000]
["Port Colborne Service Center Closure",-35000,null,-20000]
["Regulatory Staffing",-100000]
["Customer Service Staffing and Charge-outs",-92000,null,-70000,-30000,30000]
["Collections and Bad Debts",-8000,null,-99000,29000,49000,38000]
["Shared Service Allocation",null,null,63000,null,45000,-11000]
["ON1Call Initiative",null,null,40000]
["Vacant IT Position",null,null,null,-40000,40000]
["IT Billable Costs",null,null,null,-28000,28000]
["Pole Testing Program",null,null,null,null,150000]
["MIST O&M",null,null,null,null,44000]
["EAB Program",null,null,null,null,null,100000]
["Load Dispatching",null,null,null,null,null,65000]
["Asset Management",null,null,null,null,null,30000]
[]
[]
[]
[]
["Miscellaneous",-215897.71000000089,null,164750.46000000089,153120.01999999955,229882.93,191906.399999999]
["OEB Decision",null,null,null,null,null,-557723]
["Closing Balance",{"$f":"SUM(B15:B38)","v":8864062.9299999997},null,{"$f":"SUM(D15:D38)","v":9434813.3900000006},{"$f":"SUM(E15:E38)","v":9518933.4100000001},10160816.34,10016999.739999998]
[]
["Notes:"]
[]
[1,"For each year, a detailed explanation for each cost driver and associated amount is requied in Exhibit 4."]
[2,"For purposes of assessing incremental cost drivers, the closing balance for each year becomes the opening balance for the next year."]
[3,"If it has been more than three years since the applicant last filed a cost of service application, additional years of historical actuals should be incorporated into the table, as necessary, to go back to the last cost of service application.  If the applicant last filed a cost of service application less than three years ago, a minimum of three years of actual information is required."]
[]
[]
[4,"Opening Balance for \"Last Rebasing Year\" (cell B15) should be equal to the Board-Approved amount."]

{"sheet":"App.2-JC_OMA Programs","index":34,"n_rows":61,"n_cols":9,"rows_kept":61,"cut":false,"hidden":false,"merged":[[63,0,64,8],[8,0,8,7],[9,0,9,7],[11,0,11,7],[61,0,61,7],[59,0,59,8],[60,0,60,8]]}
[null,null,null,null,null,null,null,"File Number:",{"$f":"EBNUMBER","v":"EB-2016-0061"}]
[null,null,null,null,null,null,null,"Exhibit:",4]
[null,null,null,null,null,null,null,"Tab:",3]
[null,null,null,null,null,null,null,"Schedule:","1A"]
[null,null,null,null,null,null,null,"Page:"]
[]
[null,null,null,null,null,null,null,"Date:","2016-04-29"]
[]
["Appendix 2-JC"]
["OM&A Programs Table"]
[]
[]
["Programs",{"$f":"\"Last Rebasing Year (\" & RebaseYear & \" Board-Approved)\"","v":"Last Rebasing Year (2013 Board-Approved)"},{"$f":"\"Last Rebasing Year (\" & RebaseYear & \" Actuals)\"","v":"Last Rebasing Year (2013 Actuals)"},{"$f":"BridgeYear -2 & \" Actuals\"","v":"2014 Actuals"},{"$f":"BridgeYear -1 & \" Actuals\"","v":"2015 Actuals"},{"$f":"BridgeYear & \" Bridge Year\"","v":"2016 Bridge Year"},{"$f":"TestYear & \" Test Year\"","v":"2017 Test Year"},{"$f":"\"Variance \n(Test Year vs. \" & E13 &\")\"","v":"Variance \n(Test Year vs. 2015 Actuals)"},{"$f":"\"Variance \n(Test Year vs. \" & B13","v":"Variance \n(Test Year vs. Last Rebasing Year (2013 Board-Approved)"}]
["Reporting Basis"]
["Operations"]
["Supervision and Engineering",151373.28,21436.25,95309.34,70273.77,64725.840000000004,125073.36,{"$f":"G16-E16","v":54799.59},{"$f":"G16-B16","v":-26299.919999999998}]
["Load Dispatching",259039.92,283868.43,272189.76,280923.67,163129.32,201457.2,{"$f":"G17-E17","v":-79466.469999999972},{"$f":"G17-B17","v":-57582.720000000001}]
["Distribution Stations",249151.44,281886.25,237483.43,248694.92,266057.80000000005,290003.99999999994,{"$f":"G18-E18","v":41309.079999999929},{"$f":"G18-B18","v":40852.559999999939}]
["Overhead",90367.92,166848.55000000002,184629.82000000004,147543.85999999999,210406.32,202592.16,55048.300000000017,112224.24]
["Underground",173332.32,276953.26,255654.62000000002,173168.92,182883,170516.52,-2652.4000000000233,-2815.8000000000175]
["Meters",324504.46999999997,289776.18,334674.33999999997,359286.58,405592.4,484963.04,125676.45999999996,160458.57]
["Miscellaneous Distribution Expense",216778.2,212872.03,346802.54,422793.42,365308.44,373290.83999999997,-49502.580000000016,156512.63999999996]
["Sub-Total",{"$f":"SUM(B16:B22)","v":1464547.55},{"$f":"SUM(C16:C22)","v":1533640.95},1726743.85,1702685.14,1658103.12,{"$f":"SUM(G16:G22)","v":1847897.12},{"$f":"G23-E23","v":145211.98000000021},383349.57000000007]
["Maintenance"]
["Supervision and Engineering",98182.56,123446.45999999999,24520,33811.9,10704.36,22192.92,-11618.980000000003,{"$f":"G25-B25","v":-75989.64}]
["Distribution Stations",189439.35999999999,133610.5,167171.1,237026.40000000002,201768.95999999999,165080.64000000001,{"$f":"G26-E26","v":-71945.760000000009},{"$f":"G26-B26","v":-24358.719999999972}]
["Overhead",1060694.8800000001,1049270.3400000001,1200792.43,1145708.8999999999,1445786.48,1504564.68,358855.78,443869.79999999981]
["Underground",84932.479999999996,71795.16,57766.34,95521.94,84350.92,103870.23999999999,8348.2999999999884,{"$f":"G28-B28","v":18937.759999999995}]
["Transformers",95141.290000000008,124816.38,76671.34,31679.25,29902.32,35140.76,3461.510000000002,-60000.530000000006]
["Meters",380487,431315.79000000004,366828.24,369007.02,411156.72000000003,408199.56,39192.539999999979,27712.559999999998]
["Miscellaneous Distribution Expense",3600,5070.01,0,115.26,20000.04,20000.04,19884.780000000002,16400.04]
["Sub-Total",{"$f":"SUM(B25:B31)","v":1912477.57},1939324.64,1893749.4500000002,1912870.67,2203669.8000000003,2259048.84,346178.16999999993,346571.26999999979]
["Customer Service"]
["Supervision",167556.72,148484.06,147871.82,135934.95000000001,158637.96000000002,165581.03999999998,29646.089999999967,{"$f":"G34-B34","v":-1975.6800000000221}]
["Meter Reading",93026.040000000008,29114.449999999997,98198.92,89466.54,80288.28,87471.48000000001,-1995.0599999999831,{"$f":"G35-B35","v":-5554.5599999999977}]
["Billing and Collections",967424.67999999993,888894,831248.27,835921.39999999991,847761.84000000008,879784.8,43863.40000000014,-87639.879999999888]
["Bad Debts",252000.04,208128.50999999998,188227.1,218238.82,240999.96,262000.04,{"$f":"G37-E37","v":43761.22},{"$f":"G37-B37","v":10000}]
["Community Relations",40700.04,26414.280000000002,17006.919999999998,34295.32,28300,43149.88,8854.5599999999977,2449.8399999999965]
["Miscellaneous Customer Accounts",581045.36,600157.72,502817.07,475043.82,546571.28,565188.84000000008,90145.020000000077,-15856.519999999902]
["Sub-Total",{"$f":"SUM(B34:B39)","v":2101752.88},1901193.02,1785370.1,1788900.85,1902559.32,2003176.08,214275.22999999998,-98576.799999999814]
["Administration"]
["Salaries and Related Expenses (net of transfers)",1147469.9600000009,777961.42000000039,1401197.0300000005,1373994.69,1495054.2000000002,1499684.3199999996,125689.62999999966,{"$f":"G42-B42","v":352214.35999999871}]
["General Admin",1208048.6000000001,851900.77,951312.37,926846.41,1028069.58,1084360.6200000001,157514.21000000008,{"$f":"G43-B43","v":-123687.97999999998}]
["Rent and Maintenance of Property",1082478.3600000001,1001422.3,907742.16999999993,976829.47,988741.72,952915.24,-23914.229999999981,-129563.12000000011]
["Other Services Purchased",460696.67999999993,447725.69,430876.79000000004,480141.32,542687.72,553333.88,73192.56,92637.20000000007]
["Regulatory Expenses",320690.16000000003,235111.40000000002,216054.52999999997,232673.24000000002,216171.96000000002,247406.64,14733.399999999994,-73283.520000000019]
["Sub-Total",{"$f":"SUM(B42:B46)","v":4219383.7600000007},3314121.58,3907182.89,3990485.1300000004,4270725.18,4337700.6999999993,347215.5699999989,118316.93999999855]
["Impact of OEB Decision"]
["Adjustment for Decision",null,null,null,null,null,-557723,{"$f":"G49-E49","v":-557723},{"$f":"G49-B49","v":-557723}]
[null,null,null,null,null,null,null,0,{"$f":"G50-B50","v":0}]
[null,null,null,null,null,null,null,0,0]
[null,null,null,null,null,null,null,0,0]
[null,null,null,null,null,null,null,0,0]
["Sub-Total",{"$f":"SUM(B49:B53)","v":0},0,0,0,0,-557723,-557723,-557723]
["Miscellaneous",137798.88,175782.74,121767.1,123991.62,125758.92000000001,126900,2908.3800000000047,{"$f":"G55-B55","v":-10898.880000000005}]
["Total",{"$f":"SUMPRODUCT(--($A15:$A55=\"Sub-Total\"), B$15:B$55)+B55","v":9835960.6400000025},{"$f":"SUMPRODUCT(--($A15:$A55=\"Sub-Total\"), C$15:C$55)+C55","v":8864062.9299999997},9434813.3900000006,9518933.4100000001,10160816.34,10016999.739999998,{"$f":"G56-E56","v":498066.32999999821},{"$f":"G56-B56","v":181039.0999999959}]
[]
["Notes:"]
[]
["1   Please provide a breakdown of the major components of each OM&A Program undertaken in each year.  Please ensure that all Programs below the materiality threshold are included in the miscellaneous line.  Add more Programs as required."]
["2   The applicant should group projects appropriately and avoid presentations that result in classification of significant components of the OM&A budget in the miscellaneous category"]

{"sheet":"App.2-K_Employee Costs","index":35,"n_rows":38,"n_cols":8,"rows_kept":38,"cut":false,"hidden":false,"merged":[[34,0,35,7],[24,0,24,7],[8,0,8,7],[9,0,9,7],[12,0,12,7],[16,0,16,7],[20,0,20,7]]}
[null,null,null,null,null,null,"File Number:",{"$f":"EBNUMBER","v":"EB-2016-0061"}]
[null,null,null,null,null,null,"Exhibit:",4]
[null,null,null,null,null,null,"Tab:",4]
[null,null,null,null,null,null,"Schedule:","1A"]
[null,null,null,null,null,null,"Page:"]
[]
[null,null,null,null,null,null,"Date:","2016-04-29"]
[]
["Appendix 2-K"]
["Employee Costs"]
[]
[null,"Last Rebasing Year - 2013- Board Approved  (1) ","2013 Approved Restated  (1)","2013 Actual ","2014 Actual","2015 Actual ","2016 Bridge Year","2017 Test Year"]
["Number of Employees (FTEs including Part-Time)1"]
["Management (including executive)",21.85,15.115430940099341,15.859980045174368,14.809038506106026,12.945555366893313,13.283940611065498,13.42730545909496]
["Non-Management (union and non-union)",66.349999999999994,55.565546362896129,55.385995440835707,54.533394920108258,56.502070802278681,57.829984652507662,57.977777615076398]
["Total",{"$f":"SUM(B14:B15)","v":88.199999999999989},70.680977302995473,71.245975486010082,69.342433426214285,69.447626169171997,71.113925263573165,71.405083074171358]
["Total Salary and Wages including ovetime and incentive pay"]
["Management (including executive)  (2) ",2783596,1541720,1669248.2100815852,1698156.4532594006,1593692.561197642,1609427.0400764369,1671147.1214883148]
["Non-Management (union and non-union)  (2) ",4629939,4365468,4440690.2054770282,4467959.5033954121,4944322.8802295532,5049736.9129013354,5215543.9555754671]
["Total",{"$f":"SUM(B18:B19)","v":7413535},5907188,6109938.4155586138,6166115.9566548131,6538015.4414271954,6659163.9529777728,6886691.0770637821]
["Total Benefits (Current + Accrued)"]
["Management (including executive)",657117,442739,491598.11092306848,457837.94033692253,411373.46011638589,417061.51543809986,452780.06566653703]
["Non-Management (union and non-union)",1466883,1406072,1525440.8066961083,1475996.6863495256,1567298.9225874641,1560882.6436630387,1701779.9143142374]
["Total",{"$f":"SUM(B22:B23)","v":2124000},{"$f":"SUM(C22:C23)","v":1848811},{"$f":"SUM(D22:D23)","v":2017038.9176191767},1933834.6266864482,1978672.38270385,1977944.1591011386,2154559.9799807742]
["Total Compensation (Salary, Wages, & Benefits)"]
["Management (including executive)",{"$f":"B18+B22","v":3440713},1984459,{"$f":"D18+D22","v":2160846.3210046538},2155994.3935963232,2005066.021314028,2026488.5555145368,2123927.1871548519]
["Non-Management (union and non-union)",6096822,5771540,{"$f":"D19+D23","v":5966131.0121731367},5943956.1897449382,6511621.8028170168,6610619.5565643739,6917323.8698897045]
["Total",9537535,7755999,{"$f":"D20+D24","v":8126977.33317779},8099950.5833412614,8516687.8241310455,8637108.1120789107,9041251.0570445564]
[]
["Total Compensation Capitalized",null,2467121,2954440.4062467027,2802048.4218612728,3354498.9854463027,3279609.4939987506,3402872.2503628563]
[]
["Note:"]
["1 If an applicant wishes to use headcount, it must also file the same schedule on an FTE basis."]
[]
["(1)  The 2013 Board Approved numbers in EB-2012-0112 as presented was based on all CNPI employees (i.e. headcount) whose time is allocated to CNPI Tx as well as other business units within FortisOntario. In this application, beginning with the Board Approved Restated, CNPI included FTEs allocated to CNPI Dx.\n\n"]
[]
[]
["(2) The allocation of management and non-management compensation is based on FTE ratios."]

{"sheet":"App.2-L_OM&A_per_Cust_FTEE","index":36,"n_rows":29,"n_cols":8,"rows_kept":29,"cut":false,"hidden":false,"merged":[[18,0,18,1],[13,0,13,1],[14,0,14,1],[12,0,12,1],[8,0,8,7],[9,0,9,7],[15,0,15,1],[16,0,16,1],[17,0,17,1]]}
[null,null,null,null,null,null,"File Number:",{"$f":"EBNUMBER","v":"EB-2016-0061"}]
[null,null,null,null,null,null,"Exhibit:",4]
[null,null,null,null,null,null,"Tab:",2]
[null,null,null,null,null,null,"Schedule:",3]
[null,null,null,null,null,null,"Page:"]
[]
[null,null,null,null,null,null,"Date:","2016-04-29"]
[]
["Appendix 2-L"]
["Recoverable OM&A Cost per Customer and per FTE"]
[]
[null,null,{"$f":"\"Last Rebasing Year - \"&RebaseYear&\"- Board Approved\"","v":"Last Rebasing Year - 2013- Board Approved"},{"$f":"\"Last Rebasing Year - \"&RebaseYear&\"-  Actual\"","v":"Last Rebasing Year - 2013-  Actual"},{"$f":"BridgeYear -2 & \" Actuals\"","v":"2014 Actuals"},{"$f":"BridgeYear -1 & \" Actuals\"","v":"2015 Actuals"},{"$f":"BridgeYear & \" Bridge Year\"","v":"2016 Bridge Year"},{"$f":"TestYear & \" Test Year\"","v":"2017 Test Year"}]
["Reporting Basis"]
["Number of Customers",null,28438,28584,28627,28670,28705,28781]
["Total Recoverable OM&A from Appendix 2-JB",null,9835960.6400000006,8864062.9299999997,9434813.3900000006,9518933.4100000001,10160816.34,{"$f":"10574723.34-557723","v":10017000.34}]
["OM&A cost per customer",null,{"$f":"IF(C14=0,\"\",C15/C14)","v":345.87385329488717},310.10575601735235,329.5774405281727,332.01720997558425,353.97374464379027,348.04212292832074]
["Number of FTEs",null,70.680977302995473,71.245975486010082,69.342433426214285,69.447626169171997,71.113925263573165,71.405083074171358]
["Customers/FTEs",null,{"$f":"IF(C17=0,\"\",C14/C17)","v":402.34305021125948},{"$f":"IF(D17=0,\"\",D14/D17)","v":401.20160900334332},412.83523789890273,412.82908547746297,403.64808852287644,403.06654317738145]
["OM&A Cost per FTE",null,{"$f":"IF(C17=0,\"\",C15/C17)","v":139159.94112298658},124414.92827535998,136061.18106655966,137066.36115699922,142880.82541275071,140284.1353688355]
[]
["Notes:"]
[]
[null,"The customer numbers for 2013 Board Approved are taken from the Elenchus report from EB-2012-0112.  2013 Actuals and 2014 Actuals are taken"]
[null,"from the Yearbook of Electricity Distributors.  2015 Actuals are taken as the average of OEB 2.1.2 RRR filings.  2016 Bridge and 2017 Test are taken"]
[null,"from the Elenchus report provided within this Application.  Consistent with the calculations within the OEB Yearbook, the number of customers is the"]
[null,"sum of residential, GS<50, GS>50, and Embedded Distrubutor rate classes. "]
[]
[null,"The FTEs for 2013 Board Approved, 2013 Actuals, 2014 Actuals, 2015 Actuals, 2016 Bridge and 2017 Test agree to the values in Appendix 2-K"]
[null,"(Exhibit 4, Tab 4, Schedule 1, Appendix A) of this Application. "]

{"sheet":"App.2-M_Regulatory_Costs","index":37,"n_rows":46,"n_cols":11,"rows_kept":46,"cut":false,"hidden":false,"merged":[[12,0,12,1],[13,0,13,1],[8,0,8,10],[9,0,9,10]]}
[null,null,null,null,null,null,null,null,null,"File Number:",{"$f":"EBNUMBER","v":"EB-2016-0061"}]
[null,null,null,null,null,null,null,null,null,"Exhibit:",4]
[null,null,null,null,null,null,null,null,null,"Tab:",8]
[null,null,null,null,null,null,null,null,null,"Schedule:",2]
[null,null,null,null,null,null,null,null,null,"Page:"]
[]
[null,null,null,null,null,null,null,null,null,"Date:","2016-04-29"]
[]
["Appendix 2-M"]
["Regulatory Cost Schedule"]
[]
[]
["Regulatory Cost Category",null,"USoA Account","USoA Account Balance","Ongoing or One-time Cost? 2",{"$f":"\"Last Rebasing Year (\" & RebaseYear & \" Board Approved)\"","v":"Last Rebasing Year (2013 Board Approved)"},{"$f":"\"Most Current Actuals               Year \" & TestYear - 2","v":"Most Current Actuals               Year 2015"},{"$f":"TestYear -1 & \" Bridge Year\"","v":"2016 Bridge Year"},"Annual % Change",{"$f":"TestYear & \" Test Year\"","v":"2017 Test Year"},"Annual % Change"]
["(A)",null,"(B)","(C )","(D)","(E)","(F)","(G)","(H) = [(G)-(F)]/(F)","(I)","(J) = [(I)-(G)]/(G)"]
[1,"OEB Annual Assessment",5655,null,"On-Going",102550,107180,109027,{"$f":"IF(G15=0,\"\",(H15-G15)/G15)","v":1.7232692666542267E-2},112067.96,{"$f":"IF(H15=0,\"\",(J15-H15)/H15)","v":2.7891806616709681E-2}]
[2,"OEB Section 30 Costs (Applicant-originated)",5655,null,"On-Going",2100,0,0,{"$f":"IF(G16=0,\"\",(H16-G16)/G16)","v":""},0,{"$f":"IF(H16=0,\"\",(J16-H16)/H16)","v":""}]
[3,"OEB Section 30 Costs (OEB-initiated)",5655,null,"On-Going",2150,9402.5400000000009,5814.3399999999992,-0.38162028558240657,9834.1799999999967,0.69136651795388604]
[4,"Expert Witness costs for regulatory matters",null,null,null,null,null,null,"",null,""]
[5,"Legal costs for regulatory matters",5655,null,"On-Going",34272,23765.64,23700,-2.761970643332114E-3,24070,1.5611814345991562E-2]
[6,"Consultants' costs for regulatory matters",5655,null,"On-Going",24973,16539.36,18597,0.12440868328641491,21456.999999999993,0.15378824541592692]
[7,"Operating expenses associated with staff resources allocated to regulatory matters","Multiple incl 5655",null,"On-Going",122350,91495.96000000005,143943.75999999998,0.573225309620227,164490.40000000002,{"$f":"IF(H21=0,\"\",(J21-H21)/H21)","v":0.14274074819221094}]
[8,"Operating expenses associated with other resources allocated to regulatory matters 1",null,null,null,null,null,null,"",null,""]
[9,"Other regulatory agency fees or assessments",5655,null,"On-Going",7296,0,0,"",0,""]
[10,"Any other costs for regulatory matters (please define)",null,null,null,null,null,null,"",null,""]
[11,"Intervenor costs",5655,null,"On-Going",24999,18385.740000000002,18385.740000000002,0,22385.74,{"$f":"IF(H25=0,\"\",(J25-H25)/H25)","v":0.21755991328061855}]
[12,"Sub-total - Ongoing Costs 3",null,{"$f":"SUMIF($E15:$E25,$E11,D15:D25)","v":0},null,{"$f":"SUMIF($E15:$E25,\"On-Going\",F15:F25)","v":320690},{"$f":"SUMIF($E15:$E25,\"On-Going\",G15:G25)","v":266769.24000000005},319467.83999999997,0.19754376479087285,354305.28000000003,0.10904834740172928]
[13,"Sub-total - One-time Costs 4",null,{"$f":"SUMIF($E15:$E25,$E12,D15:D25)","v":0},null,{"$f":"SUMIF($E15:$E25,\"One-time\",F15:F25)","v":0},{"$f":"SUMIF($E15:$E25,\"One-time\",G15:G25)","v":0},0,"",{"$f":"SUMIF($E15:$E25,\"One-time\",J15:J25)","v":0},""]
[14,"Total",null,{"$f":"D26+D27","v":0},null,{"$f":"F26+F27","v":320690},{"$f":"G26+G27","v":266769.24000000005},{"$f":"H26+H27","v":319467.83999999997},0.19754376479087285,{"$f":"J26+J27","v":354305.28000000003},0.10904834740172928]
[]
[]
["Please fill out the following table for all one-time costs related to this cost of service application to be amortized over the test year plus the IRM period."]
[]
[null,null,"Historical Year(s)",{"$f":"H13","v":"2016 Bridge Year"},{"$f":"J13","v":"2017 Test Year"}]
[4,"Expert Witness costs"]
[5,"Legal costs",null,null,105000]
[6,"Consultants' costs",null,null,90000]
[7,"Incremental operating expenses associated with staff resources allocated to this application."]
[8,"Incremental operating expenses associated with other resources allocated to this application. 1"]
[11,"Intervenor costs",null,null,105000]
[]
["Notes:"]
[]
["1","Please identify the resources involved."]
["2","Where a category's costs include both one-time and ongoing costs, the applicant should prove a separate breakdown between one-time and ongoing costs."]
["3","Sum of all ongoing costs identified in rows 1 to 11 inclusive."]
["4","Sum of all one-time costs identified in rows 1 to 11 inclusive."]

{"sheet":"App.2-N_Corp_Cost_Allocation","index":38,"n_rows":117,"n_cols":7,"rows_kept":117,"cut":false,"hidden":false,"merged":[[83,6,84,6],[84,0,85,0],[84,1,85,1],[83,0,83,1],[83,2,85,2],[83,3,85,3],[83,4,84,4],[83,5,84,5],[55,6,56,6],[56,0,57,0],[56,1,57,1],[69,0,69,1],[69,2,71,2],[69,3,71,3],[69,4,70,4],[69,5,70,5],[69,6,70,6],[70,0,71,0],[70,1,71,1],[55,0,55,1],[55,2,57,2],[55,3,57,3],[55,4,56,4],[55,5,56,5],[110,0,110,5],[113,0,113,5],[116,0,116,5],[8,0,8,5],[9,0,9,5],[106,1,107,5],[14,0,15,0],[14,1,15,1],[13,2,15,2],[13,3,15,3],[13,0,13,1],[13,4,14,4],[13,5,14,5],[27,0,27,1],[27,2,29,2],[66,0,66,5],[13,6,14,6],[41,0,41,1],[41,2,43,2],[41,3,43,3],[41,5,42,5],[41,4,42,4],[42,0,43,0],[42,1,43,1],[27,3,29,3],[27,4,28,4],[27,5,28,5],[27,6,28,6],[28,0,29,0],[28,1,29,1],[41,6,42,6]]}
[null,null,null,null,null,"File Number:",{"$f":"EBNUMBER","v":"EB-2016-0061"}]
[null,null,null,null,null,"Exhibit:",4]
[null,null,null,null,null,"Tab:",5]
[null,null,null,null,null,"Schedule:",2]
[null,null,null,null,null,"Page:"]
[]
[null,null,null,null,null,"Date:","2016-04-29"]
[]
["Appendix 2-N"]
["Shared Services and Corporate Cost Allocation 1"]
[]
[null,"Year:","2013 Board Approved"]
[]
["Name of Company",null,"Service Offered","Pricing Methodology","Price for the Service","Cost for the Service","Percentage Allocation"]
["From","To"]
[null,null,null,null,"$","$","%"]
["FortisOntario","CNPI-Distribution","corporate services","cost based",506043.823248,506043.823248,0.24260000000000001]
["FortisOntario","CNPI-Distribution","building rent","market based",342710.64812999999,342710.64812999999,0.66610000000000003]
["CNPI-Distribution","Cornwall Electric","administrative services","cost based",954582.82538800011,954582.82538800011,0.2]
["CNPI-Distribution","FortisOntario","administrative services","cost based",132731.97210399999,132731.97210399999,0.05]
["CNPI-Distribution","CNPI-Transmission","administrative services","cost based",388586.63874000002,388586.63874000002,0.1]
["CNPI-Distribution","Algoma Power","administrative services","cost based",1397111.5826600001,1397111.5826600001,0.3]
["Cornwall Electric","CNPI-Distribution","administrative services","cost based",71426.0334,71426.0334,0.33500000000000002]
["Fortis Inc.","CNPI-Distribution","administrative services","cost based",121352,121352,0.37]
[]
[null,"Year:","2013 Actual"]
[]
["Name of Company",null,"Service Offered","Pricing Methodology","Price for the Service","Cost for the Service","Percentage Allocation"]
["From","To"]
[null,null,null,null,"$","$","%"]
["FortisOntario","CNPI-Distribution","corporate services","cost based",443223.03844799998,443223.03844799998,0.24259999999999998]
["FortisOntario","CNPI-Distribution","building rent","market based",342710.64812999999,342710.64812999999,0.66610000000000003]
["CNPI-Distribution","Cornwall Electric","administrative services","cost based",950303.36198800011,950303.36198800011,0.17503392186557759]
["CNPI-Distribution","FortisOntario","administrative services","cost based",130681.513724,130681.513724,2.4069890497483957E-2]
["CNPI-Distribution","CNPI-Transmission","administrative services","cost based",382546.44094091997,382546.44094091997,7.0460240941937535E-2]
["CNPI-Distribution","Algoma Power","administrative services","cost based",1388927.7890800002,1388927.7890800002,0.25582302224226799]
["Cornwall Electric","CNPI-Distribution","administrative services","cost based",57822.433799999999,57822.433799999999,0.33499999999999996]
["Fortis Inc.","CNPI-Distribution","administrative services","cost based",135614,135614,0.36879791362426201]
[]
[null,"Year:","2014 Actual"]
[]
["Name of Company",null,"Service Offered","Pricing Methodology","Price for the Service","Cost for the Service","Percentage Allocation"]
["From","To"]
[null,null,null,null,"$","$","%"]
["FortisOntario","CNPI-Distribution","corporate services","cost based",488653.59887999995,488653.59887999995,0.24299999999999999]
["FortisOntario","CNPI-Distribution","building rent","market based",335867.75680000003,335867.75680000003,0.64]
["CNPI-Distribution","Cornwall Electric","administrative services","cost based",991802.85800000001,991802.85800000001,0.17500198952493232]
["CNPI-Distribution","FortisOntario","administrative services","cost based",79142.039000000004,79142.039000000004,1.3964483131243191E-2]
["CNPI-Distribution","CNPI-Transmission","administrative services","cost based",380374.56900000002,380374.56900000002,6.7116469571303294E-2]
["CNPI-Distribution","Algoma Power","administrative services","cost based",1377606.3870000001,1377606.3870000001,0.24307639019452582]
["Cornwall Electric","CNPI-Distribution","administrative services","cost based",28801.11,28801.11,0.19500000000000001]
["Fortis Inc.","CNPI-Distribution","administrative services","cost based",167084,167084,0.34483299486519059]
[]
[null,"Year:","2015 Actual"]
[]
["Name of Company",null,"Service Offered","Pricing Methodology","Price for the Service","Cost for the Service","Percentage Allocation"]
["From","To"]
[null,null,null,null,"$","$","%"]
["FortisOntario","CNPI-Distribution","corporate services","cost based",498468.08700000006,498468.08700000006,0.24300000000000005]
["FortisOntario","CNPI-Distribution","building rent","market based",342585.111936,342585.111936,0.64]
["CNPI-Distribution","Cornwall Electric","administrative services","cost based",1027036.8240000001,1027036.8240000001,0.17472760232316087]
["CNPI-Distribution","FortisOntario","administrative services","cost based",81977.433000000019,81977.433000000019,1.3946647265198318E-2]
["CNPI-Distribution","CNPI-Transmission","administrative services","cost based",397853.76899999997,397853.76899999997,6.7686020119374704E-2]
["CNPI-Distribution","Algoma Power","administrative services","cost based",1426760.544,1426760.544,0.24273175325056176]
["Cornwall Electric","CNPI-Distribution","administrative services","cost based",32535.165000000001,32535.165000000001,0.19499999999999998]
["Fortis Inc.","CNPI-Distribution","administrative services","cost based",160643,160643,0.3658427160763737]
[]
[null,"Year:","2016 Bridge"]
[]
["Name of Company",null,"Service Offered","Pricing Methodology","Price for the Service","Cost for the Service","Percentage Allocation"]
["From","To"]
[null,null,null,null,"$","$","%"]
["FortisOntario","CNPI-Distribution","corporate services","cost based",523207.58652000007,523207.58652000007,0.24300000000000005]
["FortisOntario","CNPI-Distribution","building rent","market based",349436.81417471997,349436.81417471997,0.64]
["CNPI-Distribution","Cornwall Electric","administrative services","cost based",1017801.38668,1017801.38668,0.17109911284159512]
["CNPI-Distribution","FortisOntario","administrative services","cost based",82217.78224,82217.78224,1.3821350398189512E-2]
["CNPI-Distribution","CNPI-Transmission","administrative services","cost based",414067.95471999998,414067.95471999998,6.9607548816398107E-2]
["CNPI-Distribution","Algoma Power","administrative services","cost based",1398625.5675599999,1398625.5675599999,0.23511816444628825]
["Cornwall Electric","CNPI-Distribution","administrative services","cost based",38678.3514,38678.3514,0.19499999999999998]
["Fortis Inc.","CNPI-Distribution","administrative services","cost based",197140,197140,0.37479158705624915]
[]
[null,"Year:","2017 Test"]
[]
["Name of Company",null,"Service Offered","Pricing Methodology","Price for the Service","Cost for the Service","Percentage Allocation"]
["From","To"]
[null,null,null,null,"$","$","%"]
["FortisOntario","CNPI-Distribution","corporate services","cost based",536686.10294640018,536686.10294640018,0.24199999999999999]
["FortisOntario","CNPI-Distribution","building rent","market based",342502.67739344033,342502.67739344033,0.61499999999999999]
["CNPI-Distribution","Cornwall Electric","administrative services","cost based",998396.16047999996,998396.16047999996,0.16261175629359451]
["CNPI-Distribution","FortisOntario","administrative services","cost based",100068.92431999998,100068.92431999998,1.6298523750594852E-2]
["CNPI-Distribution","CNPI-Transmission","administrative services","cost based",441904.05908000004,441904.05908000004,7.197423027520411E-2]
["CNPI-Distribution","Algoma Power","administrative services","cost based",1508302.1370400002,1508302.1370400002,0.245661661406569]
["Cornwall Electric","CNPI-Distribution","administrative services","cost based",25946.231521199999,25946.231521199999,0.127]
["Fortis Inc.","CNPI-Distribution","administrative services","cost based",197140,197140,0.37479158705624915]
["CNPI-Distribution","Cornwall Electric","shared IT","cost based (Note 1)",404139.26375940919,404139.26375940919,0.24460000000000001]
["CNPI-Distribution","FortisOntario","shared IT","cost based (Note 1)",14986.429641571991,14986.429641571991,9.1000000000000004E-3]
["CNPI-Distribution","CNPI-Transmission","shared IT","cost based (Note 1)",91116.737518482303,91116.737518482303,5.5800000000000002E-2]
["CNPI-Distribution","Algoma Power","shared IT","cost based (Note 1)",571402.19407030963,571402.19407030963,0.34799999999999998]
["CNPI-Distribution","Cornwall Electric","shared equipment","cost based (Note 1)",4605.7967163639996,4605.7967163639996,0.02]
["CNPI-Distribution","CNPI-Transmission","shared equipment","cost based (Note 1)",52966.662238186,52966.662238186,0.23]
[]
["Note 1:  Price for the Service is the depreciation cost plus cost of capital based on average NBV"]
[]
[]
[]
["Note: "]
[1,"This appendix must be completed in relation to each service provided or received for the Historical (actuals), Bridge and Test years. The required information includes:"]
[]
[]
["·         Type of Service:"]
["Services such as billing, accounting, payroll, etc.  The applicant must identify any costs related to the Board of Directors of the parent company that are allocated to the applicant."]
[]
["·         Pricing Methodology:"]
["Pricing Methodology includes approaches such as cost-base, market-base, tendering, etc.  The applicant must provide evidence demonstrating the pricing methodology used.  The applicant must also provide a description of why that pricing methodology was chosen, whether or not it is in conformity with ARC, and why it is appropriate."]
[]
["·         % Allocation:"]
["The applicant must provide the percentage of the costs allocated to the entity for the service being offered.  The Applicant must also provide a description of the allocator and why it is an appropriate allocator."]

{"sheet":"App.2-OA Capital Structure","index":39,"n_rows":60,"n_cols":15,"rows_kept":60,"cut":false,"hidden":false,"merged":[[39,2,39,14],[33,0,33,14],[43,7,43,9],[45,0,46,0],[46,4,46,8],[40,2,40,14],[34,2,34,14],[35,2,35,14],[36,2,36,14],[37,2,37,14],[38,2,38,14],[9,2,9,14],[10,2,10,14],[16,0,17,0],[17,4,17,8],[14,7,14,9],[12,0,12,14]]}
[null,null,null,null,null,null,null,null,null,null,"File Number:",null,null,null,{"$f":"EBNUMBER","v":"EB-2016-0061"}]
[null,null,null,null,null,null,null,null,null,null,"Exhibit:",null,null,null,5]
[null,null,null,null,null,null,null,null,null,null,"Tab:",null,null,null,1]
[null,null,null,null,null,null,null,null,null,null,"Schedule:",null,null,null,2]
[null,null,null,null,null,null,null,null,null,null,"Page:"]
[]
[null,null,null,null,null,null,null,null,null,null,"Date:",null,null,null,"2016-04-29"]
[]
[]
[null,null,"Appendix 2-OA"]
[null,null,"Capital Structure and Cost of Capital"]
[]
["This table must be completed for the last Board approved year and the test year."]
[]
[null,null,null,null,null,null,"Year:",2013]
[]
["Line No."]
[null,null,"Particulars",null,"Capitalization Ratio",null,null,null,null,null,"Cost Rate",null,null,null,"Return"]
[]
[null,null,null,null,"(%)",null,null,null,"($)",null,"(%)",null,null,null,"($)"]
[null,null,"Debt"]
[1,null,"  Long-term Debt",null,0.56000000000000005,null,null,null,{"$f":"$I$31*E22","v":41158761.280000001},null,5.67E-2,null,null,null,{"$f":"K22*I22","v":2333701.7645760002}]
[2,null,"  Short-term Debt",null,0.04,null,"(1)",null,{"$f":"$I$31*E23","v":2939911.52},null,2.0799999999999999E-2,null,null,null,{"$f":"K23*I23","v":61150.159615999997}]
[3,null,"Total Debt",null,{"$f":"SUM(E22:E23)","v":0.60000000000000009},null,null,null,{"$f":"SUM(I22:I23)","v":44098672.800000004},null,{"$f":"IF(E24=0,0,SUMPRODUCT(E22:E23,K22:K23)/E24)","v":5.4306666666666663E-2},null,null,null,{"$f":"SUM(O22:O23)","v":2394851.9241920002}]
[]
[null,null,"Equity"]
[4,null,"  Common Equity",null,0.4,null,null,null,{"$f":"$I$31*E27","v":29399115.200000003},null,8.9300000000000004E-2,null,null,null,{"$f":"K27*I27","v":2625340.9873600006}]
[5,null,"  Preferred Shares",null,null,null,null,null,{"$f":"$I$31*E28","v":0},null,null,null,null,null,{"$f":"K28*I28","v":0}]
[6,null,"Total Equity",null,{"$f":"SUM(E27:E28)","v":0.4},null,null,null,{"$f":"SUM(I27:I28)","v":29399115.200000003},null,{"$f":"IF(E29=0,0,SUMPRODUCT(E27:E28,K27:K28)/E29)","v":8.9300000000000004E-2},null,null,null,{"$f":"SUM(O27:O28)","v":2625340.9873600006}]
[]
[7,null,"Total",null,1,null,null,null,73497788,null,{"$f":"(K24*E24)+(K29*E29)","v":6.8304000000000004E-2},null,null,null,{"$f":"O24+O29","v":5020192.9115520008}]
[]
[]
["Notes"]
["(1)",null,"4.0% unless an applicant has proposed or been approved for a different amount."]
[]
[]
[]
[]
[]
[]
[]
[]
[null,null,null,null,null,null,"Year:","2017TY"]
[]
["Line No."]
[null,null,"Particulars",null,"Capitalization Ratio",null,null,null,null,null,"Cost Rate",null,null,null,"Return"]
[]
[null,null,null,null,"(%)",null,null,null,"($)",null,"(%)",null,null,null,"($)"]
[null,null,"Debt"]
[1,null,"  Long-term Debt",null,0.56000000000000005,null,null,null,{"$f":"$I$60*E51","v":50357709.360000007},null,6.1400000000000003E-2,null,null,null,{"$f":"K51*I51","v":3091963.3547040005}]
[2,null,"  Short-term Debt",null,0.04,null,"(1)",null,{"$f":"$I$60*E52","v":3596979.24},null,1.6500000000000001E-2,null,null,null,{"$f":"K52*I52","v":59350.157460000009}]
[3,null,"Total Debt",null,{"$f":"SUM(E51:E52)","v":0.60000000000000009},null,null,null,{"$f":"SUM(I51:I52)","v":53954688.600000009},null,{"$f":"IF(E53=0,0,SUMPRODUCT(E51:E52,K51:K52)/E53)","v":5.8406666666666669E-2},null,null,null,{"$f":"SUM(O51:O52)","v":3151313.5121640004}]
[]
[null,null,"Equity"]
[4,null,"  Common Equity",null,0.4,null,null,null,{"$f":"$I$60*E56","v":35969792.399999999},null,9.1899999999999996E-2,null,null,null,{"$f":"K56*I56","v":3305623.9215599997}]
[5,null,"  Preferred Shares",null,null,null,null,null,{"$f":"$I$60*E57","v":0},null,null,null,null,null,{"$f":"K57*I57","v":0}]
[6,null,"Total Equity",null,{"$f":"SUM(E56:E57)","v":0.4},null,null,null,{"$f":"SUM(I56:I57)","v":35969792.399999999},null,{"$f":"IF(E58=0,0,SUMPRODUCT(E56:E57,K56:K57)/E58)","v":9.1899999999999996E-2},null,null,null,{"$f":"SUM(O56:O57)","v":3305623.9215599997}]
[]
[7,null,"Total",null,1,null,null,null,89924481,null,{"$f":"(K53*E53)+(K58*E58)","v":7.1804000000000007E-2},null,null,null,{"$f":"O53+O58","v":6456937.4337240001}]

{"sheet":"App.2-OB_Debt Instruments","index":40,"n_rows":111,"n_cols":11,"rows_kept":111,"cut":false,"hidden":false,"merged":[[110,1,110,10],[9,0,9,10],[10,0,10,10],[10,11,10,14],[12,0,12,10],[109,1,109,10],[108,1,108,10]]}
[null,null,null,null,null,null,null,null,null,"File Number:",{"$f":"EBNUMBER","v":"EB-2016-0061"}]
[null,null,null,null,null,null,null,null,null,"Exhibit:",5]
[null,null,null,null,null,null,null,null,null,"Tab:",1]
[null,null,null,null,null,null,null,null,null,"Schedule:",3]
[null,null,null,null,null,null,null,null,null,"Page:"]
[]
[null,null,null,null,null,null,null,null,null,"Date:","2016-04-29"]
[]
[]
["Appendix 2-OB"]
["Debt Instruments"]
[]
["This table must be completed for all required historical years, the bridge year and the test year."]
[null,null,null,"Year",2013]
[]
["Row","Description","Lender","Affiliated or Third-Party Debt?","Fixed or Variable-Rate?","Start Date","Term              (years)","Principal                         ($)","Rate (%) 2","Interest ($) 1","Additional Comments, if any"]
[1,"Senior Unsecured Notes","Life insurance companies","Third-Party","Fixed Rate","2003-08-14",15,30000000,7.0919999999999997E-2,{"$f":"H17*I17","v":2127600}]
[2,"Senior Unsecured Notes","n/a","Third-Party","Fixed Rate","2003-08-14",15,null,null,32028,"Debt issue costs amort."]
[3,"Promissory Note","FortisOntario Inc.","Affiliated","Fixed Rate","2013-01-01","Demand",20000000,4.0300000000000002E-2,{"$f":"H19*I19","v":806000}]
[4,null,null,null,null,null,null,null,null,0]
[5,null,null,null,null,null,null,null,null,0]
[6,null,null,null,null,null,null,null,null,0]
[7,null,null,null,null,null,null,null,null,0]
[8,null,null,null,null,null,null,null,null,0]
[9,null,null,null,null,null,null,null,null,0]
[10,null,null,null,null,null,null,null,null,0]
[11,null,null,null,null,null,null,null,null,0]
[12,null,null,null,null,null,null,null,null,0]
[]
["Total",null,null,null,null,null,null,{"$f":"SUM(H17:H28)","v":50000000},{"$f":"IF(H30=0,\"\",J30/H30)","v":5.931256E-2},{"$f":"SUM(J17:J28)","v":2965628}]
[]
[]
[null,null,null,"Year",2014]
[]
["Row","Description","Lender","Affiliated or Third-Party Debt?","Fixed or Variable-Rate?","Start Date","Term              (years)","Principal                         ($)","Rate (%) 2","Interest ($) 1","Additional Comments, if any"]
[1,"Senior Unsecured Notes","Life insurance companies","Third-Party","Fixed Rate","2003-08-14",15,30000000,7.0919999999999997E-2,{"$f":"H36*I36","v":2127600}]
[2,"Senior Unsecured Notes","n/a","Third-Party","Fixed Rate","2003-08-14",15,null,null,32028,"Debt issue costs amort."]
[3,"Promissory Note","FortisOntario Inc.","Affiliated","Fixed Rate","2013-01-01","Demand",20000000,4.0300000000000002E-2,{"$f":"H38*I38","v":806000}]
[4,null,null,null,null,null,null,null,null,0]
[5,null,null,null,null,null,null,null,null,0]
[6,null,null,null,null,null,null,null,null,0]
[7,null,null,null,null,null,null,null,null,0]
[8,null,null,null,null,null,null,null,null,0]
[9,null,null,null,null,null,null,null,null,0]
[10,null,null,null,null,null,null,null,null,0]
[11,null,null,null,null,null,null,null,null,0]
[12,null,null,null,null,null,null,null,null,0]
[]
["Total",null,null,null,null,null,null,{"$f":"SUM(H36:H47)","v":50000000},{"$f":"IF(H49=0,\"\",J49/H49)","v":5.931256E-2},{"$f":"SUM(J36:J47)","v":2965628}]
[]
[null,null,null,"Year",2015]
[]
["Row","Description","Lender","Affiliated or Third-Party Debt?","Fixed or Variable-Rate?","Start Date","Term              (years)","Principal                         ($)","Rate (%) 2","Interest ($) 1","Additional Comments, if any"]
[1,"Senior Unsecured Notes","Life insurance companies","Third-Party","Fixed Rate","2003-08-14",15,30000000,7.0919999999999997E-2,{"$f":"H54*I54","v":2127600}]
[2,"Senior Unsecured Notes","n/a","Third-Party","Fixed Rate","2003-08-14",15,null,null,32028,"Debt issue costs amort."]
[3,"Promissory Note","FortisOntario Inc.","Affiliated","Fixed Rate","2013-01-01","Demand",20000000,4.0300000000000002E-2,{"$f":"H56*I56","v":806000}]
[4,null,null,null,null,null,null,null,null,0]
[5,null,null,null,null,null,null,null,null,0]
[6,null,null,null,null,null,null,null,null,0]
[7,null,null,null,null,null,null,null,null,0]
[8,null,null,null,null,null,null,null,null,0]
[9,null,null,null,null,null,null,null,null,0]
[10,null,null,null,null,null,null,null,null,0]
[11,null,null,null,null,null,null,null,null,0]
[12,null,null,null,null,null,null,null,null,0]
[]
["Total",null,null,null,null,null,null,{"$f":"SUM(H54:H65)","v":50000000},{"$f":"IF(H67=0,\"\",J67/H67)","v":5.931256E-2},{"$f":"SUM(J54:J65)","v":2965628}]
[]
[]
[null,null,null,"Year","2016BY"]
[]
["Row","Description","Lender","Affiliated or Third-Party Debt?","Fixed or Variable-Rate?","Start Date","Term              (years)","Principal                         ($)","Rate (%) 2","Interest ($) 1","Additional Comments, if any"]
[1,"Senior Unsecured Notes","Life insurance companies","Third-Party","Fixed Rate","2003-08-14",15,30000000,7.0919999999999997E-2,{"$f":"H73*I73","v":2127600}]
[2,"Senior Unsecured Notes","n/a","Third-Party","Fixed Rate","2003-08-14",15,null,null,32028,"Debt issue costs amort."]
[3,"Promissory Note","FortisOntario Inc.","Affiliated","Fixed Rate","2013-01-01","Demand",20000000,4.0300000000000002E-2,{"$f":"H75*I75","v":806000}]
[4,null,null,null,null,null,null,null,null,0]
[5,null,null,null,null,null,null,null,null,0]
[6,null,null,null,null,null,null,null,null,0]
[7,null,null,null,null,null,null,null,null,0]
[8,null,null,null,null,null,null,null,null,0]
[9,null,null,null,null,null,null,null,null,0]
[10,null,null,null,null,null,null,null,null,0]
[11,null,null,null,null,null,null,null,null,0]
[12,null,null,null,null,null,null,null,null,0]
[]
["Total",null,null,null,null,null,null,{"$f":"SUM(H73:H84)","v":50000000},{"$f":"IF(H86=0,\"\",J86/H86)","v":5.931256E-2},{"$f":"SUM(J73:J84)","v":2965628}]
[]
[null,null,null,"Year","2017TY"]
[]
["Row","Description","Lender","Affiliated or Third-Party Debt?","Fixed or Variable-Rate?","Start Date","Term              (years)","Principal                         ($)","Rate (%) 2","Interest ($) 1","Additional Comments, if any"]
[1,"Third Party Debt","Life insurance companies","Third-Party","Fixed Rate","2003-08-14",15,30000000,7.0919999999999997E-2,{"$f":"H91*I91","v":2127600}]
[2,"Affiliated debt","FortisOntario Inc.","Affiliated","Fixed Rate","2003-08-14",15,null,null,32028,"Debt issue costs amort."]
[3,"Affiliated debt","FortisOntario Inc.","Affiliated","Fixed Rate","2017-01-01","Demand",20000000,4.5400000000000003E-2,{"$f":"H93*I93","v":908000},"Updated  deemed "]
[4,null,null,null,null,null,null,null,null,0,"interest rate"]
[5,null,null,null,null,null,null,null,null,0]
[6,null,null,null,null,null,null,null,null,0]
[7,null,null,null,null,null,null,null,null,0]
[8,null,null,null,null,null,null,null,null,0]
[9,null,null,null,null,null,null,null,null,0]
[10,null,null,null,null,null,null,null,null,0]
[11,null,null,null,null,null,null,null,null,0]
[12,null,null,null,null,null,null,null,null,0]
[]
["Total",null,null,null,null,null,null,{"$f":"SUM(H91:H102)","v":50000000},{"$f":"IF(H104=0,\"\",J104/H104)","v":6.135256E-2},{"$f":"SUM(J91:J102)","v":3067628}]
[]
[]
["Notes"]
[]
[1,"If financing is in place only part of the year, separately calculate the pro-rated interest in the year and input in the cell."]
[2,"Input actual or deemed long-term debt rate in accordance with the guidelines in The Report of the Board on the Cost of Capital for Ontario's Regulated Utilities, issued December 11, 2009, or with any subsequent update issued by the Board."]
[3,"Add more lines above row 12 if necessary."]

{"sheet":"App.2-P_Cost_Allocation","index":41,"n_rows":13,"n_cols":6,"rows_kept":13,"cut":false,"hidden":false,"merged":[[8,0,8,5],[9,0,9,5]]}
[null,null,null,null,"File Number:",{"$f":"EBNUMBER","v":"EB-2016-0061"}]
[null,null,null,null,"Exhibit:",7]
[null,null,null,null,"Tab:",1]
[null,null,null,null,"Schedule:",3]
[null,null,null,null,"Page:"]
[]
[null,null,null,null,"Date:","2016-04-29"]
[]
["Appendix 2-P"]
["Cost Allocation"]
[]
[]
["**Tab 11 - Cost Allocation in 2017 RRWF Model filed in conjunction with IR Responses replaces Appendix 2-P**"]

{"sheet":"App.2-PA_Res_Rate_Design","index":42,"n_rows":13,"n_cols":6,"rows_kept":13,"cut":false,"hidden":false,"merged":[[8,0,8,5],[9,0,9,5]]}
[null,null,null,null,"File Number:",0]
[null,null,null,null,"Exhibit:",8]
[null,null,null,null,"Tab:",1]
[null,null,null,null,"Schedule:",1]
[null,null,null,null,"Page:"]
[]
[null,null,null,null,"Date:","2016-04-29"]
[]
["Appendix 2-PA"]
["New Rate Design Policy For Residential Customers"]
[]
[]
["**Tab 12 - Res Rate Design in 2017 RRWF Model filed in conjunction with IR Responses replaces Appendices 2-PA & 2-V**"]

{"sheet":"App.2-Q_Cost of Serv. Emb. Dx","index":43,"n_rows":60,"n_cols":7,"rows_kept":60,"cut":false,"hidden":false,"merged":[[8,0,8,6],[9,0,9,6],[15,0,15,1],[15,2,15,3],[53,3,54,3],[9,7,9,11],[12,0,12,6],[11,0,11,6],[58,3,59,3],[58,4,59,4],[53,4,54,4]]}
[null,null,null,null,null,"File Number:",{"$f":"EBNUMBER","v":"EB-2016-0061"}]
[null,null,null,null,null,"Exhibit:"]
[null,null,null,null,null,"Tab:"]
[null,null,null,null,null,"Schedule:"]
[null,null,null,null,null,"Page:"]
[]
[null,null,null,null,null,"Date:"]
[]
["Appendix 2-Q"]
["Cost of Serving Embedded Distributor(s) "]
[]
["To be completed by Host Distributors ONLY"]
["(Not required if Host Distributor has an Embedded Distributor rate class, i.e. a separate row in Appendix 2-P.)"]
[]
[]
["Proposed Rate Class for Billing Embedded Distributor(s)"]
[]
["Host's Distribution Facilities used by Embedded Distributor(s)"]
[]
["(1)","(2)","(3)","(4)","(5)","(6) = '(3) + (4)"]
["Asset Class","Total OM&A costs asociated with asset class ","Original cost of asset class ","Accumulated amortization of asset class","Annual amortization of asset class","Net Book Value of asset class"]
["Totals for Host Distributor:","($)","($)","($)","($)"]
["Distribution Stations",null,null,null,null,{"$f":"C23+D23","v":0}]
["Low Voltage Line",null,null,null,null,0]
["LV Line category # 2 (if applcable)",null,null,null,null,0]
["TS (owned by host)",null,null,null,null,0]
["add rows if necessary... ",null,null,null,null,0]
[null,null,null,null,null,0]
[null,null,null,null,null,0]
[]
["(1)","(7)","(8)","(9)","(10)","(11)"]
[{"$f":"A21","v":"Asset Class"},"Total line length or station capacity in asset class","Line length or capacity required to provide LV service to Embedded Distributor(s)","Annual total demand on station/line providing LV services (sum of 12 monthly peaks)","Annual billed Embedded Distributor demand on station/line providing LV services","Embedded Distributor(s)' Responsibility Share "]
["Embedded Distributor's share:","kW or kVa; km","kW or kVA; km","kW or kVA","kW or kVA","percent"]
["Distribution Stations",null,null,null,null,{"$f":"IF(D34=0,0,(C34/B34)*(E34/D34))","v":0}]
["Low Voltage Line",null,null,null,null,{"$f":"IF(D35=0,0,(C35/B35)*(E35/D35))","v":0}]
["LV Line # 2 (if applicable) ",null,null,null,null,{"$f":"IF(D36=0,0,(C36/B36)*(E36/D36))","v":0}]
["TS (owned by host)",null,null,null,null,{"$f":"IF(D37=0,0,(C37/B37)*(E37/D37))","v":0}]
["add rows if necessary ",null,null,null,null,{"$f":"IF(D38=0,0,(C38/B38)*(E38/D38))","v":0}]
[]
["(1)","(12)","(12a)","(13)","(14)","(15)","(16)"]
[{"$f":"A32","v":"Asset Class"},"Return on Assets used to Provide LV services","Taxes/PILs","Annual amortization on assets used to provide LV services","OM&A costs with burden associated with assets used to provide LV services","Total annual cost associated with assets used to provide LV services","Monthly cost associated with the delivery of LV services"]
[null,"($)","($)","($)","($)","($)","$/kW or $/kVA"]
["Distribution Stations",{"$f":"E$54*(F23+B23*E$59)*F34","v":0},{"$f":"(B43-(B$54*C$54*F34*(F23+B23*E57)+B$55*C$55*F34*(F23+B23*E$57)))*E$57/(1-E$57)","v":0},{"$f":"E23*F34","v":0},{"$f":"B23*F34","v":0},{"$f":"SUM(B43:E43)","v":0},{"$f":"IF(E34=0,0,(D43/E34))","v":0}]
["Low Voltage Line",{"$f":"E$54*(F24+B24*E$59)*F35","v":0},{"$f":"(B44-(B$54*C$54*F35*(F24+B24*E58)+B$55*C$55*F35*(F24+B24*E58)))*E$57/(1-E$57)","v":0},{"$f":"E24*F35","v":0},{"$f":"B24*F35","v":0},{"$f":"SUM(B44:E44)","v":0},{"$f":"IF(E35=0,0,(D44/E35))","v":0}]
["LV Line # 2 (if applicable) ",{"$f":"E$54*(F25+B25*E$59)*F36","v":0},{"$f":"(B45-(B$54*C$54*F36*(F25+B25*E59)+B$55*C$55*F36*(F25+B25*E$59)))*E$57/(1-E$57)","v":0},{"$f":"E25*F36","v":0},{"$f":"B25*F36","v":0},{"$f":"SUM(B45:E45)","v":0},{"$f":"IF(E36=0,0,(D45/E36))","v":0}]
["TS (owned by host)",{"$f":"E$54*(F26+B26*E$59)*F37","v":0},{"$f":"(B46-(B$54*C$54*F37*(F26+B26*E60)+B$55*C$55*F37*(F26+B26*E60)))*E$57/(1-E$57)","v":0},{"$f":"E26*F37","v":0},{"$f":"B26*F37","v":0},{"$f":"SUM(B46:E46)","v":0},{"$f":"IF(E37=0,0,(D46/E37))","v":0}]
["add rows if necessary ",{"$f":"E$54*(F27+B27*E$59)*F38","v":0},{"$f":"(B47-(B$54*C$54*F38*(F27+B27*I61)+B$55*C$55*F38*(F27+B27*I61)))*E$57/(1-E$57)","v":0},{"$f":"E27*F38","v":0},{"$f":"B27*F38","v":0},{"$f":"SUM(B47:E47)","v":0},{"$f":"IF(E38=0,0,(D47/E38))","v":0}]
[]
["Total",null,null,null,null,{"$f":"SUM(F43:F47)","v":0},{"$f":"SUM(G43:G47)","v":0}]
[]
["(17)","(18)","(19)","(20)","(21)"]
[null,"Capital Structure","Cost Rate"]
[null,"(%)","(%)",null,"(%)"]
["Long-Term Debt",null,null,"Weighted Average Cost of Capital",{"$f":"IF(B60=0%,0,SUMPRODUCT(B54:B58,C54:C58)/B60)","v":0}]
["Short-term Debt"]
[]
["Common Equity",null,null,"Tax/PILs Rate"]
["Preferred Shares"]
[null,null,null,"Working Capital Allowance Factor"]
["Total",{"$f":"SUM(B54:B58)","v":0}]

{"sheet":"App.2-R_Loss Factors","index":44,"n_rows":71,"n_cols":8,"rows_kept":71,"cut":false,"hidden":false,"merged":[[8,0,8,7],[9,0,9,7],[10,0,10,7],[12,0,13,1],[12,2,12,6],[12,7,13,7],[14,1,14,7],[23,1,23,7],[25,1,25,7],[53,1,54,7],[35,1,38,7],[42,1,44,7],[46,1,49,7],[56,1,57,7],[59,1,59,7],[31,1,33,7],[69,1,69,7],[61,1,61,7],[63,1,63,7],[65,1,67,6],[51,1,51,7]]}
[null,null,null,null,null,null,"File Number:",{"$f":"EBNUMBER","v":"EB-2016-0061"}]
[null,null,null,null,null,null,"Exhibit:",8]
[null,null,null,null,null,null,"Tab:",1]
[null,null,null,null,null,null,"Schedule:","8A"]
[null,null,null,null,null,null,"Page:"]
[]
[null,null,null,null,null,null,"Date:","2016-04-29"]
[]
["Appendix 2-R"]
["Loss Factors"]
[]
[]
[null,null,"Historical Years",null,null,null,null,"5-Year Average"]
[null,null,{"$f":"IF(ISBLANK('LDC Info'!E26-5), \"Year 5\", 'LDC Info'!E26-5)","v":2011},{"$f":"IF(ISBLANK('LDC Info'!E26-4), \"Year 5\", 'LDC Info'!E26-4)","v":2012},{"$f":"IF(ISBLANK('LDC Info'!E26-3), \"Year 5\", 'LDC Info'!E26-3)","v":2013},{"$f":"IF(ISBLANK('LDC Info'!E26-2), \"Year 5\", 'LDC Info'!E26-2)","v":2014},{"$f":"IF(ISBLANK('LDC Info'!E26-1), \"Year 5\", 'LDC Info'!E26-1)","v":2015}]
[null,"Losses Within Distributor's System"]
["A(1)","\"Wholesale\" kWh delivered to distributor (higher value)",570956950,563961180,533940710,536706901,499722580,{"$f":"IF(SUM(C16:G16)=0,0,AVERAGE(C16:G16))","v":541057664.20000005}]
["A(2)","\"Wholesale\" kWh delivered to distributor (lower value)",567150685.7393682,559993930.31759119,530349462.36649197,533188097.30028898,496129658.00617915,{"$f":"IF(SUM(C17:G17)=0,0,AVERAGE(C17:G17))","v":537362366.74598396}]
["B","Portion of \"Wholesale\" kWh delivered to distributor for its Large Use Customer(s)",null,null,null,null,null,{"$f":"IF(SUM(C18:G18)=0,0,AVERAGE(C18:G18))","v":0}]
["C","Net \"Wholesale\" kWh delivered to distributor  = A(2) - B",{"$f":"C17-C18","v":567150685.7393682},{"$f":"D17-D18","v":559993930.31759119},530349462.36649197,533188097.30028898,496129658.00617915,537362366.74598396]
["D","\"Retail\" kWh delivered by distributor",540401754,538207566,505167326,511155064,474175577,{"$f":"IF(SUM(C20:G20)=0,0,AVERAGE(C20:G20))","v":513821457.39999998}]
["E","Portion of \"Retail\" kWh delivered by distributor to its Large Use Customer(s)",null,null,null,null,null,{"$f":"IF(SUM(C21:G21)=0,0,AVERAGE(C21:G21))","v":0}]
["F","Net \"Retail\" kWh delivered by distributor = D - E",{"$f":"C20-C21","v":540401754},538207566,505167326,511155064,474175577,513821457.39999998]
["G","Loss Factor in Distributor's system = C / F",{"$f":"IF(C22=0,\"\",C19/C22)","v":1.0494982326415028},1.0404794835559616,1.0498490996357353,1.0431044018773312,1.0462994765463831,1.0458153489056372]
[null,"Losses Upstream of Distributor's System"]
["H","Supply Facilities Loss Factor",1.0067112045464068,1.0070844512192461,1.0067714740719891,1.0065995541114439,1.0072419012567397,{"$f":"IF(SUM(C25:G25)=0,0,AVERAGE(C25:G25))","v":1.006881717041165}]
[null,"Total Losses"]
["I","Total Loss Factor = G x H",{"$f":"IF(C23=\"\",\"\",C23*C25)","v":1.0565416299518524},1.0478507097018401,1.0569581255934197,1.0499884258214061,1.0538766740405106,1.053012354214113]
[]
["Notes:"]
[]
[]
["A(1)","If directly connected to the IESO-controlled grid, kWh pertains to the virtual meter on the primary or high voltage side of the transformer at the interface with the transmission grid.  This corresponds to the \"With Losses\" kWh value provided by the IESO's MV-WEB.  It is the higher of the two values provided by MV-WEB."]
[]
[]
[]
[null,"If fully embedded within a host distributor, kWh pertains to the virtual meter on the primary or high voltage side of the transformer, at the interface between the host distributor and the transmission grid.  For example, if the host distributor is Hydro One Networks Inc., kWh from the Hydro One Networks' invoice corresponding to \"Total kWh w Losses\" should be reported.  This corresponds to the higher of the two kWh values provided in Hydro One Networks' invoice."]
[]
[]
[]
[]
[null,"If partially embedded, kWh pertains to the sum of the above."]
[]
["A(2)","If directly connected to the IESO-controlled grid, kWh pertains to a metering installation on the secondary or low voltage side of the transformer at the interface with the transmission grid.  This corresponds to the \"Without Losses\" kWh value provided by the IESO's MV-WEB.  It is the lower of the two kWh values provided by MV-WEB."]
[]
[]
[]
[null,"If fully embedded with the host distributor, kWh pertains to a metering installation on the secondary or low voltage side of the transformer at the interface between the embedded distributor and the host distributor.  For example, if the host distributor is Hydro One Networks Inc., kWh from the Hydro One Networks' invoice corresponding to \"Total kWh\" should be reported.  This corresponds to the lower of the two kWh values provided in Hydro One Networks' invoice."]
[]
[]
[]
[]
[null,"If partially embedded, kWh pertains to the sum of the above."]
[]
[null,"Additionally, kWh pertaining to distributed generation directly connected to the distributor's own distribution network should be included in A(2)."]
[]
[]
["B","If a Large Use Customer is metered on the secondary or low voltage side of the transformer, the default loss is 1%                         (i.e., B = 1.01 X E)."]
[]
[]
["D","kWh corresponding to D should equal metered or estimated kWh at the customer’s delivery point."]
[]
["G and I","These loss factors pertain to secondary-metered customers with demand less than 5,000 kW."]
[]
["H","If directly connected to the IESO-controlled grid, SFLF = 1.0045."]
[]
[null,"If fully embedded within a host distributor, SFLF = loss factor re losses in transformer at grid interface X loss factor re losses in host distributor's system.  If the host distributor is Hydro One Networks Inc., SFLF = 1.0060 X 1.0278 = 1.0340. If partially embedded, SFLF should be calculated as the weighted average of above."]
[]
[]
[]
[null,"Distributors that wish to propose a different SFLF should provide appropriate justification for any such proposal including supporting"]
[null,"calculations and any other relevant material."]

{"sheet":"App.2-S_Stranded Meters","index":45,"n_rows":56,"n_cols":8,"rows_kept":56,"cut":false,"hidden":false,"merged":[[30,0,31,7],[8,0,8,7],[9,0,9,7],[55,0,58,7],[48,1,50,7],[52,1,53,7],[33,1,34,7],[40,1,42,7],[44,1,46,7],[36,1,38,7]]}
[null,null,null,null,null,null,"File Number:","EB-2016-0061"]
[null,null,null,null,null,null,"Exhibit:",2]
[null,null,null,null,null,null,"Tab:",1]
[null,null,null,null,null,null,"Schedule:",8]
[null,null,null,null,null,null,"Page:"]
[]
[null,null,null,null,null,null,"Date:","2016-04-29"]
[]
["Appendix 2-S"]
["Stranded Meter Treatment"]
[]
["Year","Notes","Gross Asset Value","Accumulated Amortization","Contributed Capital (Net of Amortization)","Net Asset","Proceeds on Disposition","Residual Net Book Value"]
[null,null,"(A)","(B)","(C)","(D ) = (A) - (B) - (C)","(E)","(F) = (D) - (E)"]
[2007,null,null,null,null,0,null,0]
[2008,null,null,null,null,0,null,0]
[2009,null,null,null,null,0,null,0]
[2010,null,null,null,null,0,null,0]
[2011,null,null,null,null,0,null,0]
[2012,null,null,null,null,0,null,0]
[2013,null,null,null,null,0,null,0]
[2014,null,null,null,null,0,null,0]
[2015,null,79179,25361,null,53818,null,53818]
[2016,"(1)",79179,31289,null,47890,1000,46890]
[]
["Notes:"]
[]
["(1)","For 2016, the amounts provided are on a forecasted basis"]
[]
["(2)","CNPI has followed scenario B.  The information required below can be found in Exhibit 2, Tab 1, Schedule 8"]
[]
["Scenario B:  If the stranded meter costs remained recorded in Account 1860, the above table should be completed and the following information should be provided in Exhibit 9:"]
[]
[]
[1,"A description of the accounting treatment followed by the applicant on stranded meter costs for financial accounting and reporting purposes."]
[]
[]
[2,"The amount of the pooled residual net book value of the removed from service stranded meters, less any contributed capital (net of accumulated amortization), and less any net proceeds from sales, as of December 31, 2010."]
[]
[]
[]
[3,"A statement as to whether or not the recording of depreciation expenses continued in order to reduce the net book value through accumulated depreciation.  If so, provision of the total (cumulative) depreciation expense for the period from the time that the meters became stranded to December 31, 2010."]
[]
[]
[]
[4,"If no depreciation expenses were recorded to reduce the net book value of stranded meters through accumulated depreciation, the total (cumulative) depreciation expense amount that would have been applicable for the period from the time that the meters became stranded to December 31, 2010."]
[]
[]
[]
[5,"The estimated amount of the pooled residual net book value of the removed from service meters, less any net proceeds from sales and contributed capital, at the time when smart meters will have been fully deployed.  If the smart meters have been fully deployed, please provide the actual amount."]
[]
[]
[]
[6,"A description as to how the applicant intends to recover in rates the costs for stranded meters, including the proposed accounting treatment, the proposed disposition period and the associated bill impacts."]
[]
[]
["Distributors should also provide the Net Book Value per class of meter as of December 31, 2010 as well as the number of meters that were removed / stranded.  In preparing this information, distributors should review the Board's letter of January 16, 2007 Stranded Meter Costs Related to the Installation of Smart Meters which stated that records were to be kept of the type and number of each meter to support the stranded meter costs."]

{"sheet":"App.2-TA_1592_Tax_Variance","index":46,"n_rows":51,"n_cols":5,"rows_kept":51,"cut":false,"hidden":false,"merged":[[50,0,51,0],[50,1,51,4],[39,0,40,0],[39,1,40,4],[42,0,43,0],[42,1,43,4],[45,0,48,0],[45,1,48,4],[29,0,29,2],[30,0,30,2],[34,0,35,0],[34,1,35,4],[37,0,38,0],[37,1,37,4],[18,0,18,2],[19,0,19,2],[20,0,20,2],[21,0,21,2],[28,0,28,2],[22,0,22,2],[23,0,23,2],[24,0,24,2],[17,0,17,2],[8,0,8,4],[9,0,9,4],[11,0,11,4],[13,0,15,2],[16,0,16,2]]}
[null,null,"File Number:",null,{"$f":"EBNUMBER","v":"EB-2016-0061"}]
[null,null,"Exhibit:",null,9]
[null,null,"Tab:",null,2]
[null,null,"Schedule:",null,2]
[null,null,"Page:"]
[]
[null,null,"Date:",null,"2016-04-29"]
[]
["Appendix 2-TA"]
["Account 1592, PILs and Tax Variances for 2006 and Subsequent Years\nand Subsequent Years"]
[]
["The following table should be completed based on the information requested below, in accordance with the notes following the table. An explanation should be provided for any blank entries."]
[]
["Tax Item",null,null,null,"Principal as of"]
[null,null,null,null,"December 31,"]
[null,null,null,null,2015]
["Large Corporation Tax decrease for 2007",null,null,null,-55724.666666666664]
["Ontario Capital Tax rate decrease and increase in capital deduction for 2007",null,null,null,-2992.6219499999934]
["Ontario Capital Tax rate decrease and increase in capital deduction for 2008",null,null,null,-2992.6219499999934]
["Ontario Capital Tax rate decrease and increase in capital deduction for 2009",null,null,null,"N/A"]
["Ontario Capital Tax rate decrease and increase in capital deduction for 2010",null,null,null,"N/A"]
["Capital Cost Allowance class changes from 2006 EDR application for 2006",null,null,null,"N/A"]
["Capital Cost Allowance class changes from 2006 EDR application for 2007",null,null,null,"N/A"]
["Capital Cost Allowance class changes from 2006 EDR application for 2008",null,null,null,"N/A"]
["Capital Cost Allowance class changes from 2006 EDR application for 2009",null,null,null,"N/A"]
["Federal Income Tax Rate change from 2007 EDR to 2008",null,null,null,"N/A"]
["Federal Income Tax Rate change from 2007 EDR to 2009",null,null,null,"N/A"]
["Carrying charges on above amounts",null,null,null,-9608.6612880874945]
[]
["Insert description of additional item(s) and new rows if needed."]
["Total",null,null,null,{"$f":"SUM(E17:E30)","v":-71318.571854754147}]
[]
["Notes:"]
[]
[1,"Revise the deferral and variance account continuity schedule to include account 1592 as a group 2 account and enter all relevant information for transactions, adjustments, etc., for all relevant years."]
[]
[]
[2,"Describe each type of tax item that has been recorded in account 1592."]
[]
[3,"Provide the calculations that show how each item was determined and provide any pertinent supporting evidence and documentation."]
[]
[]
[4,"Please state whether or not the applicant followed the guidance provided in the FAQ of July 2007.  If not, please provide an explanation."]
[]
[]
[5,"Identify the account balance as of December 31, 2012 as per the 2012 Audited Financial Statements.  Identify the account balance as of December 31, 2012 as per the April 2013 2.1.7 RRR filing to the Board.  Provide a reconciliation if the balances provided are not identical to each other and to the total shown on the continuity schedule."]
[]
[]
[]
[]
[6,"Complete the above table based on the answers to the previous.  Add rows as required to complete the analysis in an informative manner.  Please provide the completed table as a working Excel spreadsheet."]

{"sheet":"App.2-TB_1592_HST-OVAT","index":47,"n_rows":32,"n_cols":11,"rows_kept":32,"cut":false,"hidden":false,"merged":[[31,0,31,10],[8,0,8,9],[9,0,9,9],[10,0,10,9],[13,0,14,9],[16,0,16,9],[12,0,12,9]]}
[null,null,null,null,null,null,"File Number:",null,null,{"$f":"EBNUMBER","v":"EB-2016-0061"}]
[null,null,null,null,null,null,"Exhibit:"]
[null,null,null,null,null,null,"Tab:"]
[null,null,null,null,null,null,null,null,null,"Schedule:"]
[null,null,null,null,null,null,null,null,null,"Page:"]
[]
[null,null,null,null,null,null,null,null,null,"Date:"]
[]
["Appendix 2-TB"]
["Account 1592, PILs and Tax Variances for 2006 and Subsequent Years,\nand Subsequent Years"]
["Sub-account HST/OVAT Input Tax Credits (ITCs)"]
[]
["The following table should be completed based on the information requested below.  An explanation should be provided for any blank entries."]
["100% of the balance in Account 1592,  PILs and Tax Variances for 2006 and Subsequent Years, Sub-account HST/OVAT Input Tax Credits (ITCs), should be recorded in this table."]
[]
[]
["Summary of PST Savings from 2009 Historic Year Analysis"]
[]
[null,null,"Principal \n2010","Principal \n2011","Principal \n2012","Principal \n2013","Principal \n2014","Principal \n2015","Principal \nJan-April 2016 1","Carrying Charges to April 30, 2016","Total Account 1592, sub-account HST/OVAT Balance"]
[]
[]
[]
["OM&A Expenses PST Savings",null,null,null,null,null,null,null,null,null,{"$f":"SUM(C23:J23)","v":0}]
["Capital Items PST Savings",null,null,null,null,null,null,null,null,null,{"$f":"SUM(C24:J24)","v":0}]
["Total Annual PST Savings 2",null,{"$f":"SUM(C23:C24)","v":0},0,0,0,null,null,0,0,0]
[]
["Notes:"]
[]
["1 Include January to April 30, 2016 PST savings if the rate year begins May 1, 2016.  If the rate year begins Jan 1, 2016, include PST savings to December 31, 2015."]
["2 Derived PST savings proxy for each year per 2009 historical year analysis"]
[]
["Note: Assumes level OM&A and Capital Spending year over year.  An alternative detailed transactional analysis may also be performed using actual expenditures from 2010 to the start of the rate year."]

{"sheet":"App.2-U_IFRS Transition Costs","index":48,"n_rows":35,"n_cols":17,"rows_kept":35,"cut":false,"hidden":false,"merged":[[32,1,32,16],[40,0,43,0],[40,1,43,4],[45,0,46,0],[45,1,46,4],[33,1,33,4],[34,0,35,0],[37,0,38,0],[37,1,38,4],[34,1,34,16],[28,0,28,2],[17,0,17,2],[18,0,18,2],[19,0,19,2],[20,0,20,2],[21,0,21,2],[22,0,22,2],[23,0,23,2],[24,0,24,2],[25,0,25,2],[26,0,26,2],[27,0,27,2],[16,0,16,2],[8,0,8,18],[9,0,9,18],[13,0,15,2],[13,16,15,16],[13,11,14,11],[13,12,14,12],[13,13,15,13],[13,14,15,14],[13,15,15,15],[11,0,11,16]]}
[]
[null,null,null,null,null,null,null,null,null,null,null,null,null,null,null,"File Number:",{"$f":"EBNUMBER","v":"EB-2016-0061"}]
[null,null,null,null,null,null,null,null,null,null,null,null,null,null,null,"Exhibit:"]
[null,null,null,null,null,null,null,null,null,null,null,null,null,null,null,"Tab:"]
[null,null,null,null,null,null,null,null,null,null,null,null,null,null,null,"Schedule:"]
[null,null,null,null,null,null,null,null,null,null,null,null,null,null,null,"Page:"]
[]
[null,null,null,null,null,null,null,null,null,null,null,null,null,null,null,"Date:"]
["Appendix 2-U"]
["One-Time Incremental IFRS Transition Costs"]
[]
["The following table should be completed based on the information requested below. An explanation should be provided for any blank entries.  The entries should include one-time incremental IFRS transition costs that are currently included in Account 1508, Other Regulatory Assets, sub-account Deferred IFRS Transition Costs Account, or Account 1508, Other Regulatory Assets, sub-account IFRS Transition Costs Variance Account."]
[]
["Nature of One-Time Incremental IFRS Transition Costs 1",null,null,null,"Audited Actual","Audited Actual","Audited Actual","Audited Actual","Audited Actual","Audited Actual","Audited Carrying","Forecasted Costs ","Forecasted Costs ","Total Costs Including  Carrying Charges","Carrying Charges January 1, 2015 to December 31,2015/April 30, 2016 (As appropriate)","Total Costs and Carrying Charges","Reasons why the costs recorded meet the criteria of one-time IFRS administrative incremental costs"]
[null,null,null,null,"Costs Incurred","Costs Incurred","Costs Incurred","Costs Incurred","Costs Incurred","Costs Incurred","Charges"]
[null,null,null,null,2009,2010,2011,2012,2013,2014,"to Dec 31, 2014",2015,"2016 3"]
["professional accounting fees",null,null,null,null,null,null,null,null,null,null,null,null,{"$f":"SUM(E17:M17)","v":0},null,{"$f":"SUM(N17,O17)","v":0}]
["professional legal fees",null,null,null,null,null,null,null,null,null,null,null,null,{"$f":"SUM(E18:M18)","v":0},null,0]
["salaries, wages and benefits of staff added to support the transition to IFRS",null,null,null,null,null,null,null,null,null,null,null,null,0,null,0]
["associated staff training and development costs",null,null,null,null,null,null,null,null,null,null,null,null,0,null,0]
["costs related to system upgrades, or replacements or changes where IFRS was the major reason for conversion",null,null,null,null,null,null,null,null,null,null,null,null,0,null,0]
[null,null,null,null,null,null,null,null,null,null,null,null,null,0,null,0]
[null,null,null,null,null,null,null,null,null,null,null,null,null,0,null,0]
[null,null,null,null,null,null,null,null,null,null,null,null,null,0,null,0]
[null,null,null,null,null,null,null,null,null,null,null,null,null,0,null,0]
["Amounts, if any, included in previous Board approved rates (amounts should be negative) 3",null,null,null,null,null,null,null,null,null,null,null,null,0,null,0]
[null,null,null,null,null,null,null,null,null,null,null,null,null,0,null,0]
["Insert description of additional item(s) and new rows if needed.",null,null,null,null,null,null,null,null,null,null,null,null,0,null,0]
["Total",null,null,null,{"$f":"SUM(E17:E28)","v":0},{"$f":"SUM(F17:F28)","v":0},0,0,0,null,{"$f":"SUM(K17:K28)","v":0},0,0,{"$f":"SUM(N17:N28)","v":0},null,{"$f":"SUM(P17:P28)","v":0}]
[]
[]
["Note:"]
[1,"The Deferred IFRS Transition Costs Account and the IFRS Transition Costs Variance Account are exclusively for necessary, incremental transition costs and shall not include ongoing IFRS compliance costs or impacts arising from adopting accounting policy changes that reflect changes in the timing of the recognition of income. The incremental costs in these accounts shall not include costs related to system upgrades, or replacements or changes where IFRS was not the major reason for conversion. In addition, incremental IFRS costs shall not include capital assets or expenditures."]
[2,"If there were any amounts approved in previous Board approved rates, please state the EB #:"]
[3,"Any forecasted One-time costs past 2015 should be fully explained in the application, since distributors were required to adopt IFRS or an alternative accounting standard by January 1, 2015."]

{"sheet":"App.2-V_Rev_Reconciliation","index":49,"n_rows":13,"n_cols":16,"rows_kept":13,"cut":false,"hidden":false,"merged":[[8,0,8,15],[9,0,9,15]]}
[null,null,null,null,null,null,null,null,null,null,null,null,null,null,"File Number:",{"$f":"EBNUMBER","v":"EB-2016-0061"}]
[null,null,null,null,null,null,null,null,null,null,null,null,null,null,"Exhibit:",8]
[null,null,null,null,null,null,null,null,null,null,null,null,null,null,"Tab:",1]
[null,null,null,null,null,null,null,null,null,null,null,null,null,null,"Schedule:","10A"]
[null,null,null,null,null,null,null,null,null,null,null,null,null,null,"Page:"]
[]
[null,null,null,null,null,null,null,null,null,null,null,null,null,null,"Date:","2016-04-29"]
[]
["Appendix 2-V"]
["Revenue Reconciliation"]
[]
[]
["**Tab 12 - Res Rate Design in 2017 RRWF Model filed in conjunction with IR Responses replaces Appendices 2-PA & 2-V**"]

{"sheet":"App.2-W_Bill Impacts","index":50,"n_rows":74,"n_cols":21,"rows_kept":74,"cut":false,"hidden":false,"merged":[[34,3,34,5],[2,2,2,10],[9,3,9,12],[10,3,10,12],[10,13,10,14],[11,3,11,12],[28,3,28,5],[29,3,29,5],[30,3,30,5],[31,3,31,5],[32,3,32,5],[33,3,33,5],[51,6,53,6],[51,7,51,12],[51,13,51,14],[52,7,52,8],[52,9,52,10],[52,11,52,12],[52,13,52,14],[46,3,46,5],[35,3,35,5],[36,3,36,5],[37,3,37,5],[38,3,38,5],[39,3,39,5],[40,3,40,5],[41,3,41,5],[42,3,42,5],[43,3,43,5],[44,3,44,5],[45,3,45,5],[47,3,47,5],[48,3,48,5],[51,3,53,5],[54,3,54,5],[55,3,55,5],[56,3,56,5],[57,3,57,5],[58,3,58,5],[59,3,59,5],[60,3,60,5],[61,3,61,5],[62,3,62,5],[73,3,73,5],[71,3,71,5],[63,3,63,5],[64,3,64,5],[69,3,69,5],[70,3,70,5],[72,3,72,5],[66,3,66,5],[67,3,67,5],[68,3,68,5],[65,3,65,5]]}
[null,null,null,null,null,null,null,null,null,null,null,"File Number:",{"$f":"EBNUMBER","v":"EB-2016-0061"},null,null,null,null,null,null,1]
[null,null,null,null,null,null,null,null,null,null,null,"Exhibit:",8]
[null,null,null,null,null,null,null,null,null,null,null,"Tab:",1]
[null,null,null,null,null,null,null,null,null,null,null,"Schedule:",11]
[null,null,null,null,null,null,null,null,null,null,null,"Page:"]
[]
[null,null,null,null,null,null,null,null,null,null,null,"Date:","2016-04-29"]
[]
[]
[null,null,null,"Appendix 2-W"]
[null,null,null,"Bill Impacts"]
[null,null,null,"The bill comparisons below must be provided for typical customers and consumption levels.  Bill impacts must be provided for residential customers consuming 800 kWh per month and general service customers consuming 2,000 kWh per month and having a monthly demand of less than 50 kW.  In addition, distributors must provide a range that is relevant to their service territory, class by class.  A general guideline of consumption is provided below:\n\nResidential (kWh) - 100, 250, 500, 800, 1000, 1500, 2000 (for customers on TOU and customers on retailer contracts)\nGS<50kW (kWh) - 1000, 2000, 5000, 10000, 15000 (for customers on TOU and customers on retailer contracts)\nGS>50kW (kW) - 60, 100, 500, 1000 \nLarge User - range appropriate for utility \nLighting Classes and USL - 150 kWh and 1 kW, range appropriate for utility.\n\nFor certain classes where one or more customers have unique consumption and demand patterns and which may be significantly impacted by the proposed rate changes, the distributor must show a typical comparison, and provide an explanation.\n\nNote: The Ontario Clean Energy Benefit is applicable to eligible customers only.  Refer to the Ontario Clean Energy Benefit Act, 2010.  Effective until December 31, 2015."]
[null,null,null,"Note that cells with the highlighted color shown to the left indicate quantities that are loss adjusted."]
[]
[]
[]
[]
[]
[]
[]
[]
[]
[]
[]
[]
[]
[]
[null,null,null,"Table 1"]
[null,null,null,"RATE CLASSES / CATEGORIES \n(eg: Residential TOU, Residential Retailer)",null,null,"Units","RPP?\nNon-RPP Retailer?\nNon-RPP\nOther?","OCEB Applicable?","Current \nLoss Factor \n(eg: 1.0351)","Proposed/\nApproved Loss Factor \n(eg: 1.0351)","Consumption (kWh)","Demand kW\n(if applicable)"]
[null,null,1,"Bill impacts generated using the OEB's",null,null,null,null,null,null,null,null,null,null,null,null,null,null,null,{"$f":"SUM(J30:M30)","v":0},78]
[null,null,2,"\"2017_Tariff_Schedule_and_Bill_Impact_Model\"",null,null,null,null,null,null,null,null,null,null,null,null,null,null,null,{"$f":"SUM(J31:M31)","v":0},{"$f":"U30+68","v":146}]
[null,null,3,null,null,null,null,null,null,null,null,null,null,null,null,null,null,null,null,0,{"$f":"U31+68","v":214}]
[null,null,4,null,null,null,null,null,null,null,null,null,null,null,null,null,null,null,null,0,282]
[null,null,5,null,null,null,null,null,null,null,null,null,null,null,null,null,null,null,null,0,350]
[null,null,6,null,null,null,null,null,null,null,null,null,null,null,null,null,null,null,null,0,418]
[null,null,7,null,null,null,null,null,null,null,null,null,null,null,null,null,null,null,null,0,486]
[null,null,8,null,null,null,null,null,null,null,null,null,null,null,null,null,null,null,null,0,554]
[null,null,9,null,null,null,null,null,null,null,null,null,null,null,null,null,null,null,null,0,622]
[null,null,10,null,null,null,null,null,null,null,null,null,null,null,null,null,null,null,null,0,690]
[null,null,11,null,null,null,null,null,null,null,null,null,null,null,null,null,null,null,null,0,758]
[null,null,12,null,null,null,null,null,null,null,null,null,null,null,null,null,null,null,null,0,826]
[null,null,13,null,null,null,null,null,null,null,null,null,null,null,null,null,null,null,null,0,894]
[null,null,14,null,null,null,null,null,null,null,null,null,null,null,null,null,null,null,null,0,962]
[null,null,15,null,null,null,null,null,null,null,null,null,null,null,null,null,null,null,null,0,1030]
[null,null,16,null,null,null,null,null,null,null,null,null,null,null,null,null,null,null,null,0,1098]
[null,null,17,null,null,null,null,null,null,null,null,null,null,null,null,null,null,null,null,0,1166]
[null,null,18,null,null,null,null,null,null,null,null,null,null,null,null,null,null,null,null,0,1234]
[null,null,19,null,null,null,null,null,null,null,null,null,null,null,null,null,null,null,null,0,1302]
[null,null,20,null,null,null,null,null,null,null,null,null,null,null,null,null,null,null,null,0,1370]
[]
[null,null,null,"Table 2"]
[null,null,null,"RATE CLASSES / CATEGORIES \n(eg: Residential TOU, Residential Retailer)",null,null,"Units","Sub-Total",null,null,null,null,null,"Total"]
[null,null,null,null,null,null,null,"A",null,"B",null,"C",null,"A + B + C"]
[null,null,null,null,null,null,null,"$","%","$","%","$","%","$","%"]
[null,{"$f":"H30","v":0},1,{"$f":"IF(ISBLANK(D30), \"\", D30)","v":"Bill impacts generated using the OEB's"},null,null,{"$f":"IF(ISBLANK(G30), \"\", G30)","v":""},{"$f":"IF(LEN($G55)>1, (SUMPRODUCT(--($C$78:$C$1000=$C55), --($A$78:$A$1000=$D55), --($B$78:$B$1000=\"ST_A\"), $L$78:$L$1000)), \"\")","v":""},{"$f":"IF(LEN($G55)>1, (SUMPRODUCT(--($C$78:$C$1000=$C55),--($A$78:$A$1000=$D55), --($B$78:$B$1000=\"ST_A\"), $M$78:$M$1000)), \"\")","v":""},{"$f":"IF(LEN($G55)>1, (SUMPRODUCT(--($C$78:$C$1000=$C55),--($A$78:$A$1000=$D55), --($B$78:$B$1000=\"ST_B\"), $L$78:$L$1000)), \"\")","v":""},{"$f":"IF(LEN($G55)>1, (SUMPRODUCT(--($C$78:$C$1000=$C55),--($A$78:$A$1000=$D55), --($B$78:$B$1000=\"ST_B\"), $M$78:$M$1000)), \"\")","v":""},{"$f":"IF(LEN($G55)>1, (SUMPRODUCT(--($C$78:$C$1000=$C55),--($A$78:$A$1000=$D55), --($B$78:$B$1000=\"ST_C\"), $L$78:$L$1000)), \"\")","v":""},{"$f":"IF(LEN($G55)>1, (SUMPRODUCT(--($C$78:$C$1000=$C55),--($A$78:$A$1000=$D55), --($B$78:$B$1000=\"ST_C\"), $M$78:$M$1000)), \"\")","v":""},{"$f":"IF(LEN($G55)>1, (SUMPRODUCT(--($C$78:$C$1000=$C55),--($A$78:$A$1000=$D55), --($B$78:$B$1000=$B55&\"_TOTAL\"), $L$78:$L$1000)), \"\")","v":""},{"$f":"IF(LEN($G55)>1, (SUMPRODUCT(--($C$78:$C$1000=$C55),--($A$78:$A$1000=$D55), --($B$78:$B$1000=$B55&\"_TOTAL\"), $M$78:$M$1000)), \"\")","v":""}]
[null,{"$f":"H31","v":0},2,"\"2017_Tariff_Schedule_and_Bill_Impact_Model\"",null,null,"",{"$f":"IF(LEN($G56)>1, (SUMPRODUCT(--($C$78:$C$1000=$C56), --($A$78:$A$1000=$D56), --($B$78:$B$1000=\"ST_A\"), $L$78:$L$1000)), \"\")","v":""},{"$f":"IF(LEN($G56)>1, (SUMPRODUCT(--($C$78:$C$1000=$C56),--($A$78:$A$1000=$D56), --($B$78:$B$1000=\"ST_A\"), $M$78:$M$1000)), \"\")","v":""},{"$f":"IF(LEN($G56)>1, (SUMPRODUCT(--($C$78:$C$1000=$C56),--($A$78:$A$1000=$D56), --($B$78:$B$1000=\"ST_B\"), $L$78:$L$1000)), \"\")","v":""},{"$f":"IF(LEN($G56)>1, (SUMPRODUCT(--($C$78:$C$1000=$C56),--($A$78:$A$1000=$D56), --($B$78:$B$1000=\"ST_B\"), $M$78:$M$1000)), \"\")","v":""},{"$f":"IF(LEN($G56)>1, (SUMPRODUCT(--($C$78:$C$1000=$C56),--($A$78:$A$1000=$D56), --($B$78:$B$1000=\"ST_C\"), $L$78:$L$1000)), \"\")","v":""},{"$f":"IF(LEN($G56)>1, (SUMPRODUCT(--($C$78:$C$1000=$C56),--($A$78:$A$1000=$D56), --($B$78:$B$1000=\"ST_C\"), $M$78:$M$1000)), \"\")","v":""},{"$f":"IF(LEN($G56)>1, (SUMPRODUCT(--($C$78:$C$1000=$C56),--($A$78:$A$1000=$D56), --($B$78:$B$1000=$B56&\"_TOTAL\"), $L$78:$L$1000)), \"\")","v":""},{"$f":"IF(LEN($G56)>1, (SUMPRODUCT(--($C$78:$C$1000=$C56),--($A$78:$A$1000=$D56), --($B$78:$B$1000=$B56&\"_TOTAL\"), $M$78:$M$1000)), \"\")","v":""}]
[null,0,3,"",null,null,"","","","","","","","",""]
[null,0,4,"",null,null,"","","","","","","","",""]
[null,0,5,"",null,null,"","","","","","","","",""]
[null,0,6,"",null,null,"","","","","","","","",""]
[null,0,7,"",null,null,"","","","","","","","",""]
[null,0,8,"",null,null,"","","","","","","","",""]
[null,0,9,"",null,null,"","","","","","","","",""]
[null,0,10,"",null,null,"","","","","","","","",""]
[null,0,11,"",null,null,null,"","","","","","","",""]
[null,0,12,"",null,null,null,"","","","","","","",""]
[null,0,13,"",null,null,null,"","","","","","","",""]
[null,0,14,"",null,null,null,"","","","","","","",""]
[null,0,15,"",null,null,null,"","","","","","","",""]
[null,0,16,"",null,null,{"$f":"IF(ISBLANK(G45), \"\", G45)","v":""},"","","","","","","",""]
[null,0,17,"",null,null,{"$f":"IF(ISBLANK(G46), \"\", G46)","v":""},"","","","","","","",""]
[null,0,18,"",null,null,{"$f":"IF(ISBLANK(G47), \"\", G47)","v":""},"","","","","","","",""]
[null,0,19,"",null,null,{"$f":"IF(ISBLANK(G48), \"\", G48)","v":""},"","","","","","","",""]
[null,0,20,"",null,null,{"$f":"IF(ISBLANK(G49), \"\", G49)","v":""},"","","","","","","",""]

{"sheet":"App.2-W_Bill Impacts_hidden","index":51,"n_rows":69,"n_cols":13,"rows_kept":69,"cut":false,"hidden":true,"merged":[[9,11,9,12],[10,4,11,4],[10,11,11,11],[10,12,11,12],[67,3,67,4],[55,3,55,4],[60,3,60,4],[61,3,61,4],[66,3,66,4],[1,4,1,6],[2,4,2,6],[9,5,9,7],[9,8,9,10],[54,3,54,4]]}
[]
[null,null,null,"Customer Class:"]
[null,null,null,"RPP / Non-RPP:"]
[null,null,null,"Consumption",null,"kWh"]
[null,null,null,"Demand",null,"kW"]
[null,null,null,"Current Loss Factor"]
[null,null,null,"Proposed/Approved Loss Factor"]
[null,null,null,"Ontario Clean Energy Benefit Applied?"]
[]
[null,null,null,null,null,"Current Board-Approved",null,null,"Proposed",null,null,"Impact"]
[null,null,null,null,"Charge Unit","Rate","Volume","Charge","Rate","Volume","Charge","$ Change","% Change"]
[null,null,null,null,null,"($)",null,"($)","($)",null,"($)"]
[{"$f":"$E2","v":0},null,null,"Monthly Service Charge",null,null,1,{"$f":"G13*F13","v":0},null,1,{"$f":"J13*I13","v":0},{"$f":"K13-H13","v":0},{"$f":"IF(ISERROR(L13/H13), \"\", L13/H13)","v":""}]
[{"$f":"A13","v":0},null,null,"Smart Meter Rate Adder",null,null,1,{"$f":"G14*F14","v":0},null,1,{"$f":"J14*I14","v":0},0,{"$f":"IF(ISERROR(L14/H14), \"\", L14/H14)","v":""}]
[{"$f":"A14","v":0},null,null,null,null,null,1,0,null,1,{"$f":"J15*I15","v":0},0,""]
[0,null,null,null,null,null,1,0,null,1,0,0,""]
[0,null,null,null,null,null,1,0,null,1,0,0,""]
[0,null,null,null,null,null,1,0,null,1,0,0,""]
[0,null,null,"Distribution Volumetric Rate",null,null,{"$f":"IF($E5>0, $E5, $E4)","v":0},0,null,{"$f":"IF($E5>0, $E5, $E4)","v":0},0,0,""]
[0,null,null,"Smart Meter Disposition Rider",null,null,{"$f":"IF($E5>0, $E5, $E4)","v":0},0,null,{"$f":"IF($E5>0, $E5, $E4)","v":0},0,0,""]
[0,null,null,"LRAM & SSM Rate Rider",null,null,{"$f":"IF($E5>0, $E5, $E4)","v":0},0,null,{"$f":"IF($E5>0, $E5, $E4)","v":0},0,0,""]
[0,null,null,null,null,null,{"$f":"IF($E5>0, $E5, $E4)","v":0},0,null,{"$f":"IF($E5>0, $E5, $E4)","v":0},0,0,""]
[0,null,null,null,null,null,{"$f":"IF($E5>0, $E5, $E4)","v":0},0,null,{"$f":"IF($E5>0, $E5, $E4)","v":0},0,0,""]
[0,null,null,null,null,null,{"$f":"IF($E5>0, $E5, $E4)","v":0},0,null,{"$f":"IF($E5>0, $E5, $E4)","v":0},0,0,""]
[0,null,null,null,null,null,{"$f":"IF($E5>0, $E5, $E4)","v":0},0,null,{"$f":"IF($E5>0, $E5, $E4)","v":0},0,0,""]
[0,null,null,null,null,null,{"$f":"IF($E5>0, $E5, $E4)","v":0},0,null,{"$f":"IF($E5>0, $E5, $E4)","v":0},0,0,""]
[0,null,null,null,null,null,{"$f":"IF($E5>0, $E5, $E4)","v":0},0,null,{"$f":"IF($E5>0, $E5, $E4)","v":0},0,0,""]
[0,null,null,null,null,null,{"$f":"IF($E5>0, $E5, $E4)","v":0},0,null,{"$f":"IF($E5>0, $E5, $E4)","v":0},0,0,""]
[0,"ST_A",null,"Sub-Total A (excluding pass through)",null,null,null,{"$f":"SUM(H13:H28)","v":0},null,null,{"$f":"SUM(K13:K28)","v":0},0,{"$f":"IF((H29)=0,\"\",(L29/H29))","v":""}]
[0,null,null,"Deferral/Variance Account Disposition Rate Rider",null,null,{"$f":"IF($E5>0, $E5, $E4)","v":0},{"$f":"G30*F30","v":0},null,{"$f":"IF($E5>0, $E5, $E4)","v":0},{"$f":"J30*I30","v":0},0,""]
[0,null,null,null,null,null,{"$f":"IF($E5>0, $E5, $E4)","v":0},{"$f":"G31*F31","v":0},null,{"$f":"IF($E5>0, $E5, $E4)","v":0},{"$f":"J31*I31","v":0},0,""]
[0,null,null,null,null,null,{"$f":"IF($E5>0, $E5, $E4)","v":0},0,null,{"$f":"IF($E5>0, $E5, $E4)","v":0},0,0,""]
[0,null,null,null,null,null,{"$f":"IF($E5>0, $E5, $E4)","v":0},0,null,{"$f":"IF($E5>0, $E5, $E4)","v":0},0,0,""]
[0,null,null,"Low Voltage Service Charge",null,null,{"$f":"IF($E5>0, $E5, $E4)","v":0},{"$f":"G34*F34","v":0},null,{"$f":"IF($E5>0, $E5, $E4)","v":0},{"$f":"J34*I34","v":0},0,""]
[0,null,null,"Line Losses on Cost of Power",null,{"$f":"IF((E4*12>=150000), 0, IF(E3=\"RPP\",(F46*0.64+F47*0.18+F48*0.18),IF(E3=\"Non-RPP (Retailer)\",F49,F50)))","v":9.06E-2},{"$f":"IF(F35=0, 0, $E4*E6-E4)","v":0},0,{"$f":"IF((E4*12>=150000), 0, IF(E3=\"RPP\",(I46*0.64+I47*0.18+I48*0.18),IF(E3=\"Non-RPP (Retailer)\",I49,I50)))","v":9.06E-2},{"$f":"IF(I35=0, 0, E4*E7-E4)","v":0},0,0,""]
[0,null,null,"Smart Meter Entity Charge",null,0.79,1,{"$f":"G36*F36","v":0.79},0.79,1,{"$f":"J36*I36","v":0.79},0,0]
[0,"ST_B",null,"Sub-Total B - Distribution (includes Sub-Total A)",null,null,null,{"$f":"SUM(H30:H36)+H29","v":0.79},null,null,{"$f":"SUM(K30:K36)+K29","v":0.79},0,{"$f":"IF((H37)=0,\"\",(L37/H37))","v":0}]
[0,null,null,"RTSR - Network",null,null,{"$f":"IF($E5>0, $E5, $E4*$E6)","v":0},{"$f":"G38*F38","v":0},null,{"$f":"IF($E5>0, $E5, $E4*$E7)","v":0},{"$f":"J38*I38","v":0},0,""]
[0,null,null,"RTSR - Line and Transformation Connection",null,null,{"$f":"IF($E5>0, $E5, $E4*$E6)","v":0},{"$f":"G39*F39","v":0},null,{"$f":"IF($E5>0, $E5, $E4*$E7)","v":0},{"$f":"J39*I39","v":0},0,""]
[0,"ST_C",null,"Sub-Total C - Delivery (including Sub-Total B)",null,null,null,{"$f":"SUM(H37:H39)","v":0.79},null,null,{"$f":"SUM(K37:K39)","v":0.79},0,{"$f":"IF((H40)=0,\"\",(L40/H40))","v":0}]
[0,null,null,"Wholesale Market Service Charge (WMSC)",null,null,{"$f":"E4*E6","v":0},{"$f":"G41*F41","v":0},null,{"$f":"E4*E7","v":0},{"$f":"J41*I41","v":0},0,""]
[0,null,null,"Rural and Remote Rate Protection (RRRP)",null,null,{"$f":"E4*E6","v":0},0,null,{"$f":"E4*E7","v":0},0,0,""]
[0,null,null,"Standard Supply Service Charge",null,null,1,0,null,1,0,0,""]
[0,null,null,"Debt Retirement Charge (DRC)",null,null,{"$f":"E4","v":0},0,null,{"$f":"IF(ISNUMBER(SEARCH(\"RESIDENTIAL\", UPPER(E2),1)), \"\", E4)","v":0},{"$f":"IF(ISNUMBER(SEARCH(\"RESIDENTIAL\", UPPER(E2),1)), \"\", J44*I44)","v":0},{"$f":"IF(ISNUMBER(SEARCH(\"RESIDENTIAL\", UPPER(E2),1)), \"\", K44-H44)","v":0},""]
[0,null,null,"Ontario Electricity Support Program \n(OESP) ",null,null,null,null,null,{"$f":"E4*E7","v":0},{"$f":"J45*I45","v":0},null,{"$f":"IF(ISERROR(L45/H45), \"\", L45/H45)","v":""}]
[{"$f":"A44","v":0},"RPP",null,"TOU - Off Peak",null,0.08,{"$f":"IF(AND(E4*12>=150000),0.64*E4*E6,0.64*E4)","v":0},0,0.08,{"$f":"IF(AND(E4*12>=150000),0.64*E4*E7,0.64*E4)","v":0},0,{"$f":"K46-H46","v":0},""]
[0,"RPP",null,"TOU - Mid Peak",null,0.122,{"$f":"IF(AND(E4*12>=150000),0.18*E4*E6,0.18*E4)","v":0},0,0.122,{"$f":"IF(AND(E4*12>=150000),0.18*E4*E7,0.18*E4)","v":0},0,{"$f":"K47-H47","v":0},""]
[0,"RPP",null,"TOU - On Peak",null,0.161,{"$f":"IF(AND(E4*12>=150000),0.18*E4*E6,0.18*E4)","v":0},0,0.161,{"$f":"IF(AND(E4*12>=150000),0.18*E4*E7,0.18*E4)","v":0},0,{"$f":"K48-H48","v":0},""]
[0,"Non-RPP (Retailer)",null,"Non-RPP Retailer Avg. Price",null,8.5999999999999993E-2,{"$f":"IF(AND(E4*12>=150000),E4*E6,E4)","v":0},{"$f":"G49*F49","v":0},8.5999999999999993E-2,{"$f":"IF(AND(E4*12>=150000),E4*E7,E4)","v":0},{"$f":"J49*I49","v":0},{"$f":"K49-H49","v":0},""]
[0,"Non-RPP (Other)",null,"Average IESO Wholesale Market Price",null,{"$f":"0.0906","v":9.06E-2},{"$f":"IF(AND(E4*12>=150000),E4*E6,E4)","v":0},{"$f":"G50*F50","v":0},{"$f":"0.0906","v":9.06E-2},{"$f":"IF(AND(E4*12>=150000),E4*E7,E4)","v":0},{"$f":"J50*I50","v":0},{"$f":"K50-H50","v":0},""]
[0]
[0,"RPP",null,"Total Bill on TOU (before Taxes)",null,null,null,{"$f":"SUM(H41:H48,H40)","v":0.79},null,null,{"$f":"SUM(K41:K48,K40)","v":0.79},{"$f":"K52-H52","v":0},{"$f":"IF((H52)=0,\"\",(L52/H52))","v":0}]
[0,"RPP",null,"HST",null,0.13,null,{"$f":"H52*F53","v":0.10270000000000001},0.13,null,{"$f":"K52*I53","v":0.10270000000000001},{"$f":"K53-H53","v":0},{"$f":"IF((H53)=0,\"\",(L53/H53))","v":0}]
[0,"RPP",null,"Total Bill (including HST)",null,null,null,{"$f":"H52+H53","v":0.89270000000000005},null,null,{"$f":"K52+K53","v":0.89270000000000005},{"$f":"K54-H54","v":0},{"$f":"IF((H54)=0,\"\",(L54/H54))","v":0}]
[0,"RPP",null,"Ontario Clean Energy Benefit 1"]
[0,"RPP_TOTAL",null,"Total Bill on TOU",null,null,null,{"$f":"H54+H55","v":0.89270000000000005},null,null,{"$f":"K54+K55","v":0.89270000000000005},{"$f":"K56-H56","v":0},{"$f":"IF((H56)=0,\"\",(L56/H56))","v":0}]
[0,"RPP"]
[0,"Non-RPP (Retailer)",null,"Total Bill on Non-RPP Avg. Price",null,null,null,{"$f":"SUM(H49,H40,H41:H46)","v":0.79},null,null,{"$f":"SUM(K49,K40,K41:K46)","v":0.79},{"$f":"K58-H58","v":0},{"$f":"IF((H58)=0,\"\",(L58/H58))","v":0}]
[0,"Non-RPP (Retailer)",null,"HST",null,0.13,null,{"$f":"H58*F59","v":0.10270000000000001},0.13,null,{"$f":"K58*I59","v":0.10270000000000001},{"$f":"K59-H59","v":0},{"$f":"IF((H59)=0,\"\",(L59/H59))","v":0}]
[0,"Non-RPP (Retailer)",null,"Total Bill (including HST)",null,null,null,{"$f":"H58+H59","v":0.89270000000000005},null,null,{"$f":"K58+K59","v":0.89270000000000005},{"$f":"K60-H60","v":0},{"$f":"IF((H60)=0,\"\",(L60/H60))","v":0}]
[0,"Non-RPP (Retailer)",null,"Ontario Clean Energy Benefit 1"]
[0,"Non-RPP (Retailer)_TOTAL",null,"Total Bill on Non-RPP Avg. Price",null,null,null,{"$f":"SUM(H60:H61)","v":0.89270000000000005},null,null,{"$f":"SUM(K60:K61)","v":0.89270000000000005},{"$f":"K62-H62","v":0},{"$f":"IF((H62)=0,\"\",(L62/H62))","v":0}]
[0,"Non-RPP (Retailer)"]
[0,"Non-RPP (Other)",null,"Total Bill on Average IESO Wholesale Market Price",null,null,null,{"$f":"SUM(H50,H40:H44)","v":0.79},null,null,{"$f":"SUM(K50,K40:K44)","v":0.79},{"$f":"K64-H64","v":0},{"$f":"IF((H64)=0,\"\",(L64/H64))","v":0}]
[0,"Non-RPP (Other)",null,"HST",null,0.13,null,{"$f":"H64*F65","v":0.10270000000000001},0.13,null,{"$f":"K64*I65","v":0.10270000000000001},{"$f":"K65-H65","v":0},{"$f":"IF((H65)=0,\"\",(L65/H65))","v":0}]
[0,"Non-RPP (Other)",null,"Total Bill (including HST)",null,null,null,{"$f":"H64+H65","v":0.89270000000000005},null,null,{"$f":"K64+K65","v":0.89270000000000005},{"$f":"K66-H66","v":0},{"$f":"IF((H66)=0,\"\",(L66/H66))","v":0}]
[0,"Non-RPP (Other)",null,"Ontario Clean Energy Benefit 1"]
[0,"Non-RPP (Other)_TOTAL",null,"Total Bill on Average IESO Wholesale Market Price",null,null,null,{"$f":"SUM(H66:H67)","v":0.89270000000000005},null,null,{"$f":"SUM(K66:K67)","v":0.89270000000000005},{"$f":"K68-H68","v":0},{"$f":"IF((H68)=0,\"\",(L68/H68))","v":0}]
[0,"Non-RPP (Other)"]

{"sheet":"App.2-Y_MIFRS Summary Impacts","index":52,"n_rows":38,"n_cols":9,"rows_kept":38,"cut":false,"hidden":false,"merged":[[37,0,41,8],[32,0,32,2],[32,6,32,8],[33,0,33,2],[33,6,33,8],[34,0,34,2],[34,6,34,8],[29,0,29,2],[29,6,29,8],[30,0,30,2],[30,6,30,8],[31,0,31,2],[31,6,31,8],[26,0,26,2],[26,6,26,8],[27,0,27,2],[27,6,27,8],[28,0,28,2],[28,6,28,8],[23,0,23,2],[23,6,23,8],[24,0,24,2],[24,6,24,8],[25,0,25,2],[25,6,25,8],[20,0,20,2],[20,6,20,8],[21,0,21,2],[21,6,21,8],[22,0,22,2],[22,3,22,5],[22,6,22,8],[17,0,17,2],[17,6,17,8],[18,0,18,2],[18,6,18,8],[19,0,19,2],[19,6,19,8],[8,0,8,8],[9,0,9,8],[10,0,10,8],[14,0,16,2],[14,6,14,8],[15,6,15,8],[15,4,16,4]]}
[null,null,null,null,null,null,null,"File Number:",{"$f":"EBNUMBER","v":"EB-2016-0061"}]
[null,null,null,null,null,null,null,"Exhibit:"]
[null,null,null,null,null,null,null,"Tab:"]
[null,null,null,null,null,null,null,"Schedule:"]
[null,null,null,null,null,null,null,"Page:"]
[]
[null,null,null,null,null,null,null,"Date:"]
[]
["Appendix 2-Y"]
["Summary of Impacts to Revenue Requirement"]
["from Transition to MIFRS"]
[]
[]
[]
["Revenue Requirement Component",null,null,2016,2016,"Difference","Reasons why the revenue requirement "]
[null,null,null,"MIFRS","CGAAP without policy changes",null,"component is different under"]
[]
["Closing NBV 2015",null,null,null,null,{"$f":"+D18-E18","v":0}]
["Closing NBV 2016",null,null,null,null,0]
["Average NBV",null,null,{"$f":"(D18+D19)/2","v":0},{"$f":"(E18+E19)/2","v":0},0]
["Working Capital",null,null,null,null,{"$f":"+D21-E21","v":0}]
["Rate Base",null,null,{"$f":"SUM(D20:D21)","v":0},{"$f":"SUM(E20:E21)","v":0},{"$f":"+D22-E22","v":0}]
[null,null,null,null,null,{"$f":"+D23-E23","v":0}]
["Return on Rate Base",null,null,null,null,0]
[null,null,null,null,null,0]
["OM&A",null,null,null,null,0]
["Depreciation",null,null,null,null,0]
["PILs or Income Taxes",null,null,null,null,0]
[null,null,null,null,null,0]
["Less: Revenue Offsets",null,null,null,null,0]
[null,null,null,null,null,0]
[null,null,null,null,null,0]
[null,null,null,null,null,0]
["Insert description of additional item(s) and new rows if needed.",null,null,null,null,0]
["Total Base Revenue Requirement",null,null,{"$f":"SUM(D24:D34)","v":0},{"$f":"SUM(E24:E34)","v":0},{"$f":"SUM(F24:F34)","v":0}]
[]
[]
["Applicants must provide a summary of the dollar impacts of MIFRS to each component of the revenue requirement (e.g. rate base, operating costs, etc.), including the overall impact on the proposed revenue requirement.  Accordingly, the applicants must identify financial differences and resulting revenue requirement impacts arising from the adoption of  MIFRS as compared to CGAAP prior to capitalization and depreciation policy changes.  Applicants should explain the financial differences and may separate the differences arising from changes in capitalization and depreciation policy versus the adoption of IFRS.    "]

{"sheet":"App. 2-Z_Tariff","index":53,"n_rows":13,"n_cols":3,"rows_kept":13,"cut":false,"hidden":false,"merged":[[7,0,7,3],[2,2,2,3],[1,2,1,3],[3,2,3,3],[0,2,0,3],[6,2,6,3],[4,2,4,3]]}
[null,"File Number:",{"$f":"EBNUMBER","v":"EB-2016-0061"}]
[null,"Exhibit:",8]
[null,"Tab:",1]
[null,"Schedule:","9A"]
[null,"Page:"]
[]
[null,"Date:","2016-04-29"]
["Appendix 2-Z\nProposed Tariff of Rates and Charges"]
[]
[]
[]
[]
["**Tariff sheet for all service areas was generated using the OEB's \"2017_Tariff_Schedule_and_Bill_Impact_Model\""]

{"sheet":"lists","index":54,"n_rows":212,"n_cols":55,"rows_kept":212,"cut":false,"hidden":true,"merged":[[13,51,13,52],[14,51,14,52],[15,51,15,52],[16,51,16,52],[17,51,17,52],[12,51,12,52],[11,51,11,52],[0,51,0,52],[1,51,1,52],[2,51,2,52],[3,51,3,52],[4,51,4,52],[5,51,5,52],[6,51,6,52],[7,51,7,52],[8,51,8,52],[9,51,9,52],[10,51,10,52]]}
[null,"Embedded Distributor",{"$f":"COUNTA(B1:B17)","v":4},null,null,null,null,null,"A Standby Service Charge will be applied for a month where standby power is not provided. The applicable rate is the approved Distribution Volumetric Rate of the applicable service class and is applied to gross metered demand or contracted amount, whichever is greater. A monthly administration charge of $200, for simple metering arrangements, or $500, for complex metering arrangements, will also be applied.",null,null,"Loss Factors",null,"Units","Units1","Units2",null,null,null,null,null,null,null,null,null,"Account History","Account set up charge/change of occupancy charge (plus credit agency costs if applicable)","Total Loss Factor – Embedded Distributor – Hydro One Networks Inc.",null,null,null,null,null,null,null,null,null,"Algoma Power Inc.","Algoma Power Inc.",null,"DISTRIBUTED GENERATION [DGEN]","kW",null,null,null,"Sub-Total:  Delivery (Distribution and Retail Transmission)"]
["DISTRIBUTED GENERATION [DGEN]","General Service 3,000 to 4,999 kW",null,null,null,null,null,null,"Distribution Volumetric Rate",null,null,"Total Loss Factor – Primary Metered Customer",null,"$","$/kWh","$",null,null,null,null,null,null,null,null,null,"Account set up charge/change of occupancy charge","Administrative Billing Charge","Total Loss Factor – Primary Metered Customer",null,null,null,null,null,null,null,null,null,"Atikokan Hydro Inc.","Atikokan Hydro Inc.",null,"EMBEDDED DISTRIBUTOR","kW",null,null,null,"Wholesale Market Service Rate ",null,null,{"$f":"AU2*AV2","v":0},{"$f":"AU2","v":0},0,{"$f":"AX2*AY2","v":0},null,{"$f":"AZ2-AW2","v":0},{"$f":"BB2/AW2","v":{"$error":"#DIV/0!"}}]
["EMBEDDED DISTRIBUTOR","General Service 1,000 to 4,999 kW",null,null,null,null,null,null,"Distribution Volumetric Rate - $/kW of contracted amount",null,null,"Total Loss Factor – Primary Metered Customer < 5,000 kW",null,"$/kWh","$/kW","%",null,null,null,null,null,null,"MSC",null,null,"Account set up charge/change of occupancy charge (plus credit agency costs if applicable – Residential)","Bell Canada Pole Rentals","Total Loss Factor – Primary Metered Customer < 5,000 kW",null,null,null,null,null,null,null,null,null,"Attawapiskat Power Corp. ","Attawapiskat Power Corp. ",null,"EMBEDDED DISTRIBUTOR","kW",null,null,null,"Rural Rate Protection Charge",null,null,{"$f":"AU3*AV3","v":0},0,0,{"$f":"AX3*AY3","v":0},null,{"$f":"AZ3-AW3","v":0},{"$f":"BB3/AW3","v":{"$error":"#DIV/0!"}}]
["EMBEDDED DISTRIBUTOR","General Service Equal To Or Greater Than 1,500 kW - Interval Metered",null,null,null,null,null,null,"Distribution Wheeling Service Rate",null,null,"Total Loss Factor – Primary Metered Customer > 5,000 kW",null,"$/kW","$/kVA",null,null,null,null,null,null,null,"SM_Rate_Adder",null,null,"Account set up charge/change of occupancy charge (plus credit agency costs if applicable)","Clearance Pole Attachment charge $/pole/year","Total Loss Factor – Primary Metered Customer > 5,000 kW",null,null,null,null,null,null,null,null,null,"Bluewater Power Distribution Corporation","Bluewater Power Distribution Corporation",null,"FARMS - SINGLE PHASE ENERGY-BILLED [F1]","kWh",null,null,null,"Standard Supply Service – Administration Charge (if applicable)",null,null,{"$f":"AU4*AV4","v":0},0,0,{"$f":"AX4*AY4","v":0},null,{"$f":"AZ4-AW4","v":0},{"$f":"BB4/AW4","v":{"$error":"#DIV/0!"}}]
["FARMS - SINGLE PHASE ENERGY-BILLED [F1]",null,null,null,null,null,null,null,"Electricity Rate",null,null,"Total Loss Factor – Secondary Metered Customer",null,"$/kVA",null,null,null,null,null,null,null,null,"MSC_Rate_Rider_",null,null,"Arrears certificate","Collection of account charge – no disconnection","Total Loss Factor – Secondary Metered Customer",null,null,null,null,null,null,null,null,null,"Brant County Power Inc.","Brant County Power Inc.",null,"FARMS - THREE PHASE ENERGY-BILLED [F3]","kWh",null,null,null,"Sub-Total:  Regulatory",null,null,{"$f":"SUM(AW2:AW4)","v":0},null,null,{"$f":"SUM(AZ2:BA4)","v":0},null,{"$f":"AZ5-AW5","v":0},{"$f":"BB5/AW5","v":{"$error":"#DIV/0!"}}]
["FARMS - THREE PHASE ENERGY-BILLED [F3]",null,null,null,null,null,null,null,"Electricity Rate - All Additional kWh",null,null,"Total Loss Factor – Secondary Metered Customer < 5,000 kW",null,null,null,null,null,null,null,null,null,null,"VC",null,null,"Arrears certificate (credit reference)","Collection of account charge – no disconnection – after regular hours","Total Loss Factor – Secondary Metered Customer < 5,000 kW",null,null,null,null,null,null,null,null,null,"Brantford Power Inc.","Brantford Power Inc.",null,"GENERAL SERVICE - COMMERCIAL","kW",null,null,null,"Debt Retirement Charge (DRC)",null,null,{"$f":"AU6*AV6","v":0},{"$f":"AU6","v":0},{"$f":"AV6","v":0},{"$f":"AX6*AY6","v":0},null,{"$f":"AZ6-AW6","v":0},{"$f":"BB6/AW6","v":{"$error":"#DIV/0!"}}]
["GENERAL SERVICE - COMMERCIAL",null,null,null,null,null,null,null,"Electricity Rate - First 250 kWh",null,null,null,null,null,null,null,null,null,null,null,null,null,null,null,null,null,null,null,null,null,null,null,null,null,null,null,null,"Burlington Hydro Inc.","Burlington Hydro Inc.",null,"GENERAL SERVICE - INSTITUTIONAL","kW"]
["GENERAL SERVICE - INSTITUTIONAL",null,null,null,null,null,null,null,"Electricity Rate -All Additional kWh",null,null,"Total Loss Factor – Secondary Metered Customer > 5,000 kW",null,null,null,null,null,null,null,null,null,null,"VC_Rate_Rider_",null,null,"Charge to certify cheque","Collection of account charge – no disconnection - during regular business hours","Total Loss Factor – Secondary Metered Customer > 5,000 kW",null,null,null,null,null,null,null,null,null,"Cambridge and North Dumfries Hydro Inc.","Cambridge and North Dumfries Hydro Inc.",null,"GENERAL SERVICE 1,000 TO 2,999 KW","kW",null,null,null,"Total Bill on RPP (before taxes)",null,null,null,null,null,null,null,{"$f":"AZ8-AW8","v":0}]
["GENERAL SERVICE 1,000 TO 2,999 KW",null,null,null,null,null,null,null,"Electricity Rate First 1,000 kWh",null,null,"Distribution Loss Factor - Secondary Metered Customer < 5,000 kW",null,null,null,null,null,null,null,null,null,null,"VC_GA_Rate_Rider_kW_",null,null,"Collection of Account Charge – No Disconnection","Collection of account charge – no disconnection – during regular hours",null,null,null,null,null,null,null,null,null,null,"Canadian Niagara Power Inc.","Canadian Niagara Power Inc. - Eastern Ontario Power",null,"GENERAL SERVICE 1,000 TO 4,999 KW - INTERVAL METERS","kW",null,null,null,"HST",null,null,{"$f":"AV9*AW8","v":0},null,{"$f":"AV9","v":0},{"$f":"AY9*AZ8","v":0},null,{"$f":"AZ9-AW9","v":0},{"$f":"BB9/AW9","v":{"$error":"#DIV/0!"}}]
["GENERAL SERVICE 1,000 TO 4,999 KW",null,null,null,null,null,null,null,"Electricity Rate First 25,000 kWh",null,null,"Distribution Loss Factor - Secondary Metered Customer > 5,000 kW",null,null,null,null,null,null,null,null,null,null,"VC_LV_Rate",null,null,"Credit Card Convenience Charge","Collection/Disconnection/Load Limiter/Reconnection – if in Community",null,null,null,null,null,null,null,null,null,null,"Centre Wellington Hydro Ltd.","Canadian Niagara Power Inc. - Fort Erie",null,"GENERAL SERVICE 1,000 TO 4,999 KW (CO-GENERATION)","kW",null,null,null,"Total Bill (including HST)",null,null,{"$f":"AW9+AW8","v":0},null,null,{"$f":"AZ9+AZ8","v":0},null,{"$f":"AZ10-AW10","v":0},{"$f":"BB10/AW10","v":{"$error":"#DIV/0!"}}]
["GENERAL SERVICE 1,000 TO 4,999 KW - INTERVAL METERS",null,null,null,null,null,null,null,"Electricity Rate First 6,000 kWh",null,null,"Distribution Loss Factor - Primary Metered Customer < 5,000 kW",null,null,null,null,null,null,null,null,null,null,"RTSR_Network",null,null,"Credit check (plus credit agency costs)","Credit Card Convenience Charge",null,null,null,null,null,null,null,null,null,null,"Chapleau Public Utilities Corporation","Canadian Niagara Power Inc. - Port Colborne Hydro Inc.",null,"GENERAL SERVICE 1,000 TO 4,999 KW","kW",null,null,null,"Ontario Clean Energy Benefit (OCEB)",null,null,{"$f":"-0.1*AW10","v":0},null,{"$f":"AV11","v":0},{"$f":"-0.1*AZ10","v":0},null,{"$f":"AZ11-AW11","v":0},{"$f":"BB11/AW11","v":{"$error":"#DIV/0!"}}]
["GENERAL SERVICE 1,000 TO 4,999 KW (CO-GENERATION)",null,null,null,null,null,null,null,"Electricity Rate Next 1,500 kWh",null,null,"Distribution Loss Factor - Primary Metered Customer > 5,000 kW",null,null,null,null,null,null,null,null,null,null,"RTSR_Connection",null,null,"Credit reference Letter","Disconnect/Reconnect at meter – after regular hours",null,null,null,null,null,null,null,null,null,null,"Clinton Power Corporation","Centre Wellington Hydro Ltd.",null,"GENERAL SERVICE 1,500 TO 4,999 KW","kW",null,null,null,"Total Bill on RPP (including OCEB)",null,null,{"$f":"AW10+AW11","v":0},null,null,{"$f":"AZ10+AZ11","v":0},null,{"$f":"AZ12-AW12","v":0},{"$f":"BB12/AW12","v":{"$error":"#DIV/0!"}}]
["GENERAL SERVICE 1,500 TO 4,999 KW",null,null,null,null,null,null,null,"General Service 1,500 to 4,999 kW customer",null,null,null,null,null,null,null,null,null,null,null,null,null,null,null,null,null,null,null,null,null,null,null,null,null,null,null,null,"COLLUS Power Corporation","Chapleau Public Utilities Corporation",null,"GENERAL SERVICE 2,500 TO 4,999 KW","kW"]
["GENERAL SERVICE 2,500 TO 4,999 KW",null,null,null,null,null,null,null,"General Service 50 to 1,499 kW customer",null,null,"Total Loss Factor - Embedded Distributor",null,null,null,null,null,null,null,null,null,null,"RTSR_Network_Interval",null,null,"Credit reference/credit check (plus credit agency costs – General Service)","Disconnect/Reconnect at meter – during regular hours",null,null,null,null,null,null,null,null,null,null,"Cooperative Hydro Embrun Inc.","Clinton Power Corporation",null,"GENERAL SERVICE 3,000 TO 4,999 KW - INTERMEDIATE USE","kW",null,null,null,"Total Bill on TOU (before taxes)",null,null,null,null,null,null,null,{"$f":"AZ14-AW14","v":0}]
["GENERAL SERVICE 3,000 TO 4,999 KW",null,null,null,null,null,null,null,"General Service Large Use customer",null,null,"Total Loss Factor – Embedded Distributor – Hydro One Networks Inc.",null,null,null,null,null,null,null,null,null,null,"RTSR_Connection_Interval",null,null,"Credit Reference/credit check (plus credit agency costs)","Disconnect/Reconnect at pole – after regular hours",null,null,null,null,null,null,null,null,null,null,"E.L.K. Energy Inc.","COLLUS Power Corporation",null,"GENERAL SERVICE 3,000 TO 4,999 KW - INTERVAL METERED","kW",null,null,null,"HST",null,null,{"$f":"AV15*AW14","v":0},null,{"$f":"AV15","v":0},{"$f":"AY15*AZ14","v":0},null,{"$f":"AZ15-AW15","v":0},{"$f":"BB15/AW15","v":{"$error":"#DIV/0!"}}]
["GENERAL SERVICE 3,000 TO 4,999 KW - INTERMEDIATE USE",null,null,null,null,null,null,null,"Green Energy Act Initiatives Funding Adder - effective until the date of the next cost of service-based rate order",null,null,null,null,null,null,null,null,null,null,null,null,null,"RTSR_Network_Interval_GR1000kW",null,null,"Dispute Test – Commercial self contained -- MC","Disconnect/Reconnect at pole – during regular hours",null,null,null,null,null,null,null,null,null,null,"Enersource Hydro Mississauga Inc.","Cooperative Hydro Embrun Inc.",null,"GENERAL SERVICE 3,000 TO 4,999 KW - TIME OF USE","kW",null,null,null,"Total Bill (including HST)",null,null,{"$f":"AW15+AW14","v":0},null,null,{"$f":"AZ15+AZ14","v":0},null,{"$f":"AZ16-AW16","v":0},{"$f":"BB16/AW16","v":{"$error":"#DIV/0!"}}]
["GENERAL SERVICE 3,000 TO 4,999 KW - INTERVAL METERED",null,null,null,null,null,null,null,"Green Energy Act Plan Funding Adder",null,null,null,null,null,null,null,null,null,null,null,null,null,"RTSR_Connection_Interval_GR1000kW",null,null,"Dispute Test – Commercial TT -- MC","Disconnect/Reconnect Charge – At Meter – After Hours",null,null,null,null,null,null,null,null,null,null,"Entegrus Powerlines Inc.","E.L.K. Energy Inc.",null,"GENERAL SERVICE 3,000 TO 4,999 KW","kW",null,null,null,"Ontario Clean Energy Benefit (OCEB)",null,null,{"$f":"-0.1*AW16","v":0},null,{"$f":"AV17","v":0},{"$f":"-0.1*AZ16","v":0},null,{"$f":"AZ17-AW17","v":0},{"$f":"BB17/AW17","v":{"$error":"#DIV/0!"}}]
["GENERAL SERVICE 3,000 TO 4,999 KW - TIME OF USE",null,null,null,null,null,null,null,"Green Energy Act Plan Funding Adder - effective April 1, 2013 until March 31, 2014",null,null,null,null,null,null,null,null,null,null,null,null,null,"RTSR_Line_Connection",null,null,"Dispute Test – Residential","Disconnect/Reconnect Charge – At Meter – During Regular Hours",null,null,null,null,null,null,null,null,null,null,"ENWIN Utilities Ltd.","Enersource Hydro Mississauga Inc.",null,"GENERAL SERVICE 50 TO 1,000 KW - INTERVAL METERS","kW",null,null,null,"Total Bill on TOU (including OCEB)",null,null,{"$f":"AW16+AW17","v":0},null,null,{"$f":"AZ16+AZ17","v":0},null,{"$f":"AZ18-AW18","v":0},{"$f":"BB18/AW18","v":{"$error":"#DIV/0!"}}]
["GENERAL SERVICE 50 TO 1,000 KW",null,null,null,null,null,null,null,"Green Energy Act Plan Funding Adder - effective April 1, 2014 until March 31, 2015",null,null,null,null,null,null,null,null,null,null,null,null,null,"RTSR_Transformer_Connection",null,null,"Duplicate Invoices for previous billing","Disconnect/Reconnect Charge – At Pole – After Hours",null,null,null,null,null,null,null,null,null,null,"Erie Thames Powerlines Corporation","Entegrus Powerlines Inc. - Chatham-Kent",null,"GENERAL SERVICE 50 TO 1,000 KW - NON INTERVAL METERS","kW"]
["GENERAL SERVICE 50 TO 1,000 KW - INTERVAL METERS",null,null,null,null,null,null,null,"ICM Rate Rider (2014) - in effect until the effective date of the next cost of service rates",null,null,null,null,null,null,null,null,null,null,null,null,null,"WMSR",null,null,"Easement Letter","Disconnect/Reconnect Charge – At Pole – During Regular Hours",null,null,null,null,null,null,null,null,null,null,"Espanola Regional Hydro Distribution Corporation","Entegrus Powerlines Inc. - Dutton",null,"GENERAL SERVICE 50 TO 1,000 KW","kW"]
["GENERAL SERVICE 50 TO 1,000 KW - NON INTERVAL METERS",null,null,null,null,null,null,null,"Low Voltage Service Charge",null,null,null,null,null,null,null,null,null,null,null,null,null,"RRRP",null,null,"Income Tax Letter","Disconnect/Reconnect Charges for non payment of account - At Meter After Hours",null,null,null,null,null,null,null,null,null,null,"Essex Powerlines Corporation","Entegrus Powerlines Inc. - Newbury",null,"GENERAL SERVICE 50 TO 1,499 KW - INTERVAL METERED","kW"]
["GENERAL SERVICE 50 TO 1,499 KW",null,null,null,null,null,null,null,"Low Voltage Service Rate",null,null,null,null,null,null,null,null,null,null,null,null,null,"SPC",null,null,"Interval Meter Interrogation","Disconnect/Reconnect charges for non payment of account – at meter after regular hours",null,null,null,null,null,null,null,null,null,null,"Festival Hydro Inc.","Entegrus Powerlines Inc. - Strathroy, Mounth Brydges & Parkhill",null,"GENERAL SERVICE 50 TO 1,499 KW","kW"]
["GENERAL SERVICE 50 TO 1,499 KW - INTERVAL METERED",null,null,null,null,null,null,null,"Low Voltage Volumetric Rate",null,null,null,null,null,null,null,null,null,null,null,null,null,"DRC",null,null,"Interval meter request change","Disconnect/Reconnect Charges for non payment of account - At Meter During Regular Hours",null,null,null,null,null,null,null,null,null,null,"Fort Albany Power Corporation","ENWIN Utilities Ltd.",null,"GENERAL SERVICE 50 TO 2,499 KW","kW"]
["GENERAL SERVICE 50 TO 2,499 KW",null,null,null,null,null,null,null,"LRAM Rate Rider - Effective Until April 30, 2015",null,null,null,null,null,null,null,null,null,null,null,null,null,"SSS",null,null,"Legal letter","Disconnect/Reconnect charges for non payment of account – at meter during regular hours",null,null,null,null,null,null,null,null,null,null,"Fort Frances Power Corporation","Erie Thames Powerlines Corporation",null,"GENERAL SERVICE 50 TO 2,999 KW - INTERVAL METERED","kW"]
["GENERAL SERVICE 50 TO 2,999 KW",null,null,null,null,null,null,null,"Minimum Distribution Charge - per KW of maximum billing demand in the previous 11 months",null,null,null,null,null,null,null,null,null,null,null,null,null,"SFLF",null,null,"Legal letter charge","Disconnect/Reconnect charges for non payment of account – at pole after regular hours",null,null,null,null,null,null,null,null,null,null,"Greater Sudbury Hydro Inc.","Espanola Regional Hydro Distribution Corporation",null,"GENERAL SERVICE 50 TO 2,999 KW - TIME OF USE","kW"]
["GENERAL SERVICE 50 TO 2,999 KW - INTERVAL METERED","January",null,null,null,null,null,null,"Monthly Distribution Wheeling Service Rate - Dedicated LV Line",null,null,null,null,null,null,null,null,null,null,null,null,null,"DLF_Secondary_LT_5000kW",null,null,"Meter dispute charge plus Measurement Canada fees (if meter found correct)","Disconnect/Reconnect charges for non payment of account – at pole during regular hours",null,null,null,null,null,null,null,null,null,null,"Grimsby Power Inc.","Essex Powerlines Corporation",null,"GENERAL SERVICE 50 TO 2,999 KW","kW"]
["GENERAL SERVICE 50 TO 2,999 KW - TIME OF USE","February",null,null,null,null,null,null,"Monthly Distribution Wheeling Service Rate - Hydro One Networks",null,null,null,null,null,null,null,null,null,null,null,null,null,"DLF_Secondary_GT_5000kW",null,null,"Notification charge","Disconnect/Reconnection for >300 volts - after regular hours",null,null,null,null,null,null,null,null,null,null,"Guelph Hydro Electric Systems Inc.","Festival Hydro Inc.",null,"GENERAL SERVICE 50 TO 4,999 KW - INTERVAL METERED","kW"]
["GENERAL SERVICE 50 TO 4,999 KW","March",null,null,null,null,null,null,"Monthly Distribution Wheeling Service Rate - Shared LV Line",null,null,null,null,null,null,null,null,null,null,null,null,null,"DLF_Primary_LT_5000kW",null,null,"Pulling Post Dated Cheques","Disconnect/Reconnection for >300 volts - during regular hours",null,null,null,null,null,null,null,null,null,null,"Haldimand County Hydro Inc.","Festival Hydro Inc. - Hensall",null,"GENERAL SERVICE 50 TO 4,999 KW - TIME OF USE","kW"]
["GENERAL SERVICE 50 TO 4,999 KW - INTERVAL METERED","April",null,null,null,null,null,null,"Monthly Distribution Wheeling Service Rate - Waterloo North Hydro",null,null,null,null,null,null,null,null,null,null,null,null,null,"DLF_Primary_GT_5000kW",null,null,"Request for other billing information","Disposal of Concrete Poles",null,null,null,null,null,null,null,null,null,null,"Halton Hills Hydro Inc.","Fort Albany Power Corporation",null,"GENERAL SERVICE 50 TO 4,999 KW (COGENERATION)","kW"]
["GENERAL SERVICE 50 TO 4,999 KW - TIME OF USE","May",null,null,null,null,null,null,"Rate Rider for Application of Tax Change - effective until April 30, 2015",null,null,null,null,null,null,null,null,null,null,null,null,null,"TLF_Secondary_LT_5000kW",null,null,"Returned cheque (plus bank charges)","Dispute Test – Commercial TT -- MC",null,null,null,null,null,null,null,null,null,null,"Hearst Power Distribution Company Limited","Fort Frances Power Corporation",null,"GENERAL SERVICE 50 TO 4,999 KW (FORMERLY TIME OF USE)","kW"]
["GENERAL SERVICE 50 TO 4,999 KW (COGENERATION)","June",null,null,null,null,null,null,"Rate Rider for Application of Tax Change - effective until December 31, 2014",null,null,null,null,null,null,null,null,null,null,null,null,null,"TLF_Secondary_GT_5000kW",null,null,"Returned cheque charge (plus bank charges)","Install/Remove load control device – after regular hours",null,null,null,null,null,null,null,null,null,null,"Horizon Utilities Corporation","Greater Sudbury Hydro Inc.",null,"GENERAL SERVICE 50 TO 4,999 KW","kW"]
["GENERAL SERVICE 50 TO 4,999 KW (FORMERLY TIME OF USE)","July",null,null,null,null,null,null,"Rate Rider for Application of Tax Change (2014) - effective until April 30, 2015",null,null,null,null,null,null,null,null,null,null,null,null,null,"TLF_Primary_LT_5000kW",null,null,"Special Billing Service (aggregation)","Install/Remove load control device – during regular hours",null,null,null,null,null,null,null,null,null,null,"Hydro 2000 Inc.","Grimsby Power Inc.",null,"GENERAL SERVICE 50 TO 499 KW","kW"]
["GENERAL SERVICE 50 TO 499 KW","August",null,null,null,null,null,null,"Rate Rider for Application of Tax Change (per connection) - effective until April 30, 2015",null,null,null,null,null,null,null,null,null,null,null,null,null,"TLF_Primary_GT_5000kW",null,null,"Special Billing Service (sub-metering charge per meter)","Interval Meter Interrogation",null,null,null,null,null,null,null,null,null,null,"Hydro Hawkesbury Inc.","Guelph Hydro Electric Systems Inc.",null,"GENERAL SERVICE 50 TO 699 KW","kW"]
["GENERAL SERVICE 50 TO 699 KW","September",null,null,null,null,null,null,"Rate Rider for CGAAP Accounting Changes (2013) - effective until April 30, 2017",null,null,null,null,null,null,null,null,null,null,null,null,null,"TLF_EmbeddedDistributor",null,null,"Special meter reads","Interval Meter Load Management Tool Charge $/month",null,null,null,null,null,null,null,null,null,null,"Hydro One Brampton Networks Inc.","Haldimand County Hydro Inc.",null,"GENERAL SERVICE 50 TO 999 KW - INTERVAL METERED","kW"]
["GENERAL SERVICE 50 TO 999 KW","October",null,null,null,null,null,null,"Rate Rider for Deferral/Variance Account (2012) - effective unitl April 30, 2016",null,null,null,null,null,null,null,null,null,null,null,null,null,null,null,null,"Statement of Account","Interval meter request change",null,null,null,null,null,null,null,null,null,null,"Hydro One Networks Inc.","Halton Hills Hydro Inc.",null,"GENERAL SERVICE 50 TO 999 KW","kW"]
["GENERAL SERVICE 50 TO 999 KW - INTERVAL METERED","November",null,null,null,null,null,null,"Rate Rider for Deferral/Variance Account Disposition – effective until April 30, 2015",null,null,null,null,null,null,null,null,null,null,null,null,null,null,null,null,"Unprocessed Payment Charge (plus bank charges)","Late Payment – per annum",null,null,null,null,null,null,null,null,null,null,"Hydro Ottawa Limited","Hearst Power Distribution Company Limited",null,"GENERAL SERVICE 500 TO 4,999 KW","kW"]
["GENERAL SERVICE 500 TO 4,999 KW","December",null,null,null,null,null,null,"Rate Rider for Deferral/Variance Account Disposition (2012) - effective until April 30, 2016",null,null,null,null,null,null,null,null,null,null,null,null,null,null,null,null,null,"Late Payment – per month",null,null,null,null,null,null,null,null,null,null,"Innisfil Hydro Distribution Systems Limited","Horizon Utilities Corporation",null,"GENERAL SERVICE 700 TO 4,999 KW","kW"]
["GENERAL SERVICE 700 TO 4,999 KW",null,null,null,null,null,null,null,"Rate Rider for Deferral/Variance Account Disposition (2013) - effective until April 30, 2014",null,null,null,null,null,null,null,null,null,null,null,null,null,null,null,null,null,"Layout fees",null,null,null,null,null,null,null,null,null,null,"Kashechewan Power Corporation","Hydro 2000 Inc.",null,"GENERAL SERVICE DEMAND BILLED (50 KW AND ABOVE) [GSD]","kW"]
["GENERAL SERVICE DEMAND BILLED (50 KW AND ABOVE) [GSD]",null,null,null,null,null,null,null,"Rate Rider for Deferral/Variance Account Disposition (2014) - effective until April 28, 2016",null,null,null,null,null,null,null,null,null,null,null,null,null,null,null,null,null,"Meter dispute charge plus Measurement Canada fees (if meter found correct)",null,null,null,null,null,null,null,null,null,null,"Kenora Hydro Electric Corporation Ltd.","Hydro Hawkesbury Inc.",null,"GENERAL SERVICE ENERGY BILLED (LESS THAN 50 KW) [GSE-METERED]","kWh"]
["GENERAL SERVICE ENERGY BILLED (LESS THAN 50 KW) [GSE-METERED]",null,null,null,null,null,null,null,"Rate Rider for Deferral/Variance Account Disposition (2014) - effective until April 30, 2015",null,null,null,null,null,null,null,null,null,null,null,null,null,null,null,null,null,"Meter Interrogation Charge",null,null,null,null,null,null,null,null,null,null,"Kingston Hydro Corporation","Hydro One Brampton Networks Inc.",null,"GENERAL SERVICE ENERGY BILLED (LESS THAN TO 50 KW) [GSE-UNMETERED]","kWh"]
["GENERAL SERVICE ENERGY BILLED (LESS THAN TO 50 KW) [GSE-UNMETERED]",null,null,null,null,null,null,null,"Rate Rider for Deferral/Variance Account Disposition (2014) - effective until Decembeer 31, 2015",null,null,null,null,null,null,null,null,null,null,null,null,null,null,null,null,null,"Missed Service Appointment",null,null,null,null,null,null,null,null,null,null,"Kitchener-Wilmot Hydro Inc.","Hydro One Networks Inc.",null,"GENERAL SERVICE EQUAL TO OR GREATER THAN 1,500 KW - INTERVAL METERED","kW"]
["GENERAL SERVICE EQUAL TO OR GREATER THAN 1,500 KW",null,null,null,null,null,null,null,"Rate Rider for Deferral/Variance Account Disposition (2014) - effective until December 30, 2015",null,null,null,null,null,null,null,null,null,null,null,null,null,null,null,null,null,"Norfolk Pole Rentals – Billed",null,null,null,null,null,null,null,null,null,null,"Lakefront Utilities Inc.","Hydro Ottawa Limited",null,"GENERAL SERVICE EQUAL TO OR GREATER THAN 1,500 KW","kW"]
["GENERAL SERVICE EQUAL TO OR GREATER THAN 1,500 KW - INTERVAL METERED",null,null,null,null,null,null,null,"Rate Rider for Deferral/Variance Account Disposition (2014) - effective until December 31, 2014",null,null,null,null,null,null,null,null,null,null,null,null,null,null,null,null,null,"Optional Interval/TOU Meter charge $/month",null,null,null,null,null,null,null,null,null,null,"Lakeland Power Distribution Ltd.","Innisfil Hydro Distribution Systems Limited",null,"GENERAL SERVICE GREATER THAN 1,000 KW","kW"]
["GENERAL SERVICE GREATER THAN 1,000 KW",null,null,null,null,null,null,null,"Rate Rider for Deferral/Variance Account Disposition (2014) - effective until December 31, 2015",null,null,null,null,null,null,null,null,null,null,null,null,null,null,null,null,null,"Overtime Locate",null,null,null,null,null,null,null,null,null,null,"London Hydro Inc.","Kashechewan Power Corporation",null,"GENERAL SERVICE INTERMEDIATE 1,000 TO 4,999 KW","kW"]
["GENERAL SERVICE GREATER THAN 50 kW - WMP",null,null,null,null,null,null,null,"Rate Rider for Deferral/Variance Account Dispositon (2012) - effective until April 30, 2016",null,null,null,null,null,null,null,null,null,null,null,null,null,null,null,null,null,"Owner Requested Disconnection/Reconnection – after regular hours",null,null,null,null,null,null,null,null,null,null,"Midland Power Utility Corporation","Kenora Hydro Electric Corporation Ltd.",null,"GENERAL SERVICE INTERMEDIATE RATE CLASS 1,000 TO 4,999 KW (FORMERLY GENERAL SERVICE > 50 KW CUSTOMERS)","kW"]
["GENERAL SERVICE INTERMEDIATE 1,000 TO 4,999 KW",null,null,null,null,null,null,null,"Rate Rider for Disposition of Accounting Changes Under CGAAP Account 1576 - effective until April 30, 2016",null,null,null,null,null,null,null,null,null,null,null,null,null,null,null,null,null,"Owner Requested Disconnection/Reconnection – during regular hours",null,null,null,null,null,null,null,null,null,null,"Milton Hydro Distribution inc.","Kingston Hydro Corporation",null,"GENERAL SERVICE INTERMEDIATE RATE CLASS 1,000 TO 4,999 KW (FORMERLY LARGE USE CUSTOMERS)","kW"]
["GENERAL SERVICE INTERMEDIATE RATE CLASS 1,000 TO 4,999 KW (FORMERLY GENERAL SERVICE > 50 KW CUSTOMERS)",null,null,null,null,null,null,null,"Rate Rider for Disposition of Deferral/Variance Accounts (2010) - effective until December 31, 2014",null,null,null,null,null,null,null,null,null,null,null,null,null,null,null,null,null,"Returned cheque (plus bank charges)",null,null,null,null,null,null,null,null,null,null,"Newmarket - Tay Power Distribution Ltd.","Kitchener-Wilmot Hydro Inc.",null,"GENERAL SERVICE LESS THAN 50 KW - SINGLE PHASE ENERGY-BILLED [G1]","kWh"]
["GENERAL SERVICE INTERMEDIATE RATE CLASS 1,000 TO 4,999 KW (FORMERLY LARGE USE CUSTOMERS)",null,null,null,null,null,null,null,"Rate Rider for Disposition of Deferral/Variance Accounts (2011) - effective until April 30, 2015",null,null,null,null,null,null,null,null,null,null,null,null,null,null,null,null,null,"Rural system expansion / line connection fee",null,null,null,null,null,null,null,null,null,null,"Niagara Peninsula Energy Inc.","Lakefront Utilities Inc.",null,"GENERAL SERVICE LESS THAN 50 KW - THREE PHASE ENERGY-BILLED [G3]","kWh"]
["GENERAL SERVICE LESS THAN 50 KW",null,null,null,null,null,null,null,"Rate Rider for Disposition of Deferral/Variance Accounts (2011) - effective until April 30, 2016",null,null,null,null,null,null,null,null,null,null,null,null,null,null,null,null,null,"Same Day Open Trench",null,null,null,null,null,null,null,null,null,null,"Niagara-on-the-Lake Hydro Inc.","Lakeland Power Distribution Ltd.",null,"GENERAL SERVICE LESS THAN 50 KW - TRANSMISSION CLASS ENERGY-BILLED [T]","kWh"]
["GENERAL SERVICE LESS THAN 50 KW - SINGLE PHASE ENERGY-BILLED [G1]",null,null,null,null,null,null,null,"Rate Rider for Disposition of Deferral/Variance Accounts (2012) - effective until April 30, 2014",null,null,null,null,null,null,null,null,null,null,null,null,null,null,null,null,null,"Scheduled Day Open Trench",null,null,null,null,null,null,null,null,null,null,"Norfolk Power Distribution Inc.","London Hydro Inc.",null,"GENERAL SERVICE LESS THAN 50 KW - URBAN ENERGY-BILLED [UG]","kWh"]
["GENERAL SERVICE LESS THAN 50 KW - THREE PHASE ENERGY-BILLED [G3]",null,null,null,null,null,null,null,"Rate Rider for Disposition of Deferral/Variance Accounts (2012) - effective until April 30, 2015",null,null,null,null,null,null,null,null,null,null,null,null,null,null,null,null,null,"Service call – after regular hours",null,null,null,null,null,null,null,null,null,null,"North Bay Hydro Distribution Limited","Midland Power Utility Corporation",null,"GENERAL SERVICE LESS THAN 50 KW","kWh"]
["GENERAL SERVICE LESS THAN 50 KW - TRANSMISSION CLASS ENERGY-BILLED [T]",null,null,null,null,null,null,null,"Rate Rider for Disposition of Deferral/Variance Accounts (2012) - effective until April 30, 2016",null,null,null,null,null,null,null,null,null,null,null,null,null,null,null,null,null,"Service call – customer owned equipment",null,null,null,null,null,null,null,null,null,null,"Northern Ontario Wires Inc.","Milton Hydro Distribution inc.",null,"GENERAL SERVICE SINGLE PHASE - G1","kW"]
["GENERAL SERVICE LESS THAN 50 KW - URBAN ENERGY-BILLED [UG]",null,null,null,null,null,null,null,"Rate Rider for Disposition of Deferral/Variance Accounts (2012) - effective until August 31, 2014",null,null,null,null,null,null,null,null,null,null,null,null,null,null,null,null,null,"Service Call – Customer-owned Equipment – After Regular Hours",null,null,null,null,null,null,null,null,null,null,"Oakville Hydro Electricity Distribution Inc.","Newmarket - Tay Power Distribution Ltd. - Newmarket",null,"GENERAL SERVICE THREE PHASE - G3","kW"]
["GENERAL SERVICE SINGLE PHASE - G1",null,null,null,null,null,null,null,"Rate Rider for Disposition of Deferral/Variance Accounts (2012) - effective until December 31, 2015",null,null,null,null,null,null,null,null,null,null,null,null,null,null,null,null,null,"Service Call – Customer-owned Equipment – During Regular Hours",null,null,null,null,null,null,null,null,null,null,"Orangeville Hydro Limited","Newmarket - Tay Power Distribution Ltd. - Tay",null,"INTERMEDIATE USERS","kW"]
["GENERAL SERVICE THREE PHASE - G3",null,null,null,null,null,null,null,"Rate Rider for Disposition of Deferral/Variance Accounts (2012) - effective until December 31, 2016 Applicable only in the former service area of Clinton Power",null,null,null,null,null,null,null,null,null,null,null,null,null,null,null,null,null,"Service Charge for onsite interrogation of interval meter due to customer phone line failure - required weekly until line repaired $ 6",null,null,null,null,null,null,null,null,null,null,"Orillia Power Distribution Corporation","Niagara Peninsula Energy Inc. - Niagara Falls",null,"INTERMEDIATE WITH SELF GENERATION","kW"]
["INTERMEDIATE USERS",null,null,null,null,null,null,null,"Rate Rider for Disposition of Deferral/Variance Accounts (2012) – effective until December 31, 2016 Applicable only in the former service area of Clinton Power",null,null,null,null,null,null,null,null,null,null,null,null,null,null,null,null,null,"Service Layout - Commercial",null,null,null,null,null,null,null,null,null,null,"Oshawa PUC Networks Inc.","Niagara Peninsula Energy Inc. - Peninsula West",null,"LARGE USE - 3TS","kW"]
["INTERMEDIATE WITH SELF GENERATION",null,null,null,null,null,null,null,"Rate Rider for Disposition of Deferral/Variance Accounts (2012) - effective until January 31, 2014",null,null,null,null,null,null,null,null,null,null,null,null,null,null,null,null,null,"Service Layout - ResidentiaI",null,null,null,null,null,null,null,null,null,null,"Ottawa River Power Corporation","Niagara-on-the-Lake Hydro Inc.",null,"LARGE USE - FORD ANNEX","kW"]
["LARGE USE",null,null,null,null,null,null,null,"Rate Rider for Disposition of Deferral/Variance Accounts (2012) - effective until June 30, 2014",null,null,null,null,null,null,null,null,null,null,null,null,null,null,null,null,null,"Special Billing Service (sub-metering charge per meter)",null,null,null,null,null,null,null,null,null,null,"Parry Sound Power Corporation","Norfolk Power Distribution Inc.",null,"LARGE USE - REGULAR","kW"]
["LARGE USE - 3TS",null,null,null,null,null,null,null,"Rate Rider for Disposition of Deferral/Variance Accounts (2013) - Applicable only to Wholesale Market Participants - effective until April 30, 2015",null,null,null,null,null,null,null,null,null,null,null,null,null,null,null,null,null,"Special meter reads",null,null,null,null,null,null,null,null,null,null,"Peterborough Distribution Incorporated","North Bay Hydro Distribution Limited",null,"LARGE USE > 5000 KW","kW"]
["LARGE USE - FORD ANNEX",null,null,null,null,null,null,null,"Rate Rider for Disposition of Deferral/Variance Accounts (2013) - effective until April 30, 2014",null,null,null,null,null,null,null,null,null,null,null,null,null,null,null,null,null,"Specific Charge for Access to the Power Poles - $/pole/year",null,null,null,null,null,null,null,null,null,null,"PowerStream Inc.","Northern Ontario Wires Inc.",null,"LARGE USE","kW"]
["LARGE USE - REGULAR",null,null,null,null,null,null,null,"Rate Rider for Disposition of Deferral/Variance Accounts (2013) - effective until April 30, 2015",null,null,null,null,null,null,null,null,null,null,null,null,null,null,null,null,null,"Specific Charge for Bell Canada Access to the Power Poles – per pole/year",null,null,null,null,null,null,null,null,null,null,"PUC Distribution Inc.","Oakville Hydro Electricity Distribution Inc.",null,"microFIT","$"]
["LARGE USE > 5000 KW",null,null,null,null,null,null,null,"Rate Rider for Disposition of Deferral/Variance Accounts (2013) - effective until April 30, 2015, not applicable to Wholesale Market Participants",null,null,null,null,null,null,null,null,null,null,null,null,null,null,null,null,null,"Switching for company maintenance – Charge based on Time and Materials",null,null,null,null,null,null,null,null,null,null,"Renfrew Hydro Inc.","Orangeville Hydro Limited",null,"RESIDENTIAL - HENSALL","kWh"]
["microFIT",null,null,null,null,null,null,null,"Rate Rider for Disposition of Deferral/Variance Accounts (2013) - effective until April 30, 2017",null,null,null,null,null,null,null,null,null,null,null,null,null,null,null,null,null,"Temporary Service – Install & remove – overhead – no transformer",null,null,null,null,null,null,null,null,null,null,"Rideau St. Lawrence Distribution Inc.","Orillia Power Distribution Corporation",null,"RESIDENTIAL - HIGH DENSITY [R1]","kWh"]
["RESIDENTIAL",null,null,null,null,null,null,null,"Rate Rider for Disposition of Deferral/Variance Accounts (2013) - effective until August 31, 2014",null,null,null,null,null,null,null,null,null,null,null,null,null,null,null,null,null,"Temporary Service – Install & remove – overhead – with transformer",null,null,null,null,null,null,null,null,null,null,"Sioux Lookout Hydro Inc.","Oshawa PUC Networks Inc.",null,"RESIDENTIAL - LOW DENSITY [R2]","kWh"]
["RESIDENTIAL - HENSALL",null,null,null,null,null,null,null,"Rate Rider for Disposition of Deferral/Variance Accounts (2013) - effective until December 31, 2014",null,null,null,null,null,null,null,null,null,null,null,null,null,null,null,null,null,"Temporary Service – Install & remove – underground – no transformer",null,null,null,null,null,null,null,null,null,null,"St. Thomas Energy Inc.","Ottawa River Power Corporation",null,"RESIDENTIAL - MEDIUM DENSITY [R1]","kWh"]
["RESIDENTIAL - HIGH DENSITY [R1]",null,null,null,null,null,null,null,"Rate Rider for Disposition of Deferral/Variance Accounts (2013) - effective until May 31, 2014",null,null,null,null,null,null,null,null,null,null,null,null,null,null,null,null,null,"Temporary service install & remove – overhead – no transformer",null,null,null,null,null,null,null,null,null,null,"Thunder Bay Hydro Electricity Distribution Inc.","Parry Sound Power Corporation",null,"RESIDENTIAL - NORMAL DENSITY [R2]","kWh"]
["RESIDENTIAL - LOW DENSITY [R2]",null,null,null,null,null,null,null,"Rate Rider for Disposition of Deferred PILs Variance Account 1562 - effective until March 31, 2016",null,null,null,null,null,null,null,null,null,null,null,null,null,null,null,null,null,"Temporary Service Install & Remove – Overhead – With Transformer",null,null,null,null,null,null,null,null,null,null,"Tillsonburg Hydro Inc.","Peterborough Distribution Incorporated",null,"RESIDENTIAL - TIME OF USE","kWh"]
["RESIDENTIAL - MEDIUM DENSITY [R1]",null,null,null,null,null,null,null,"Rate Rider for Disposition of Deferred PILs Variance Account 1562 (2012) - effective until April 30, 2015",null,null,null,null,null,null,null,null,null,null,null,null,null,null,null,null,null,"Temporary Service Install & Remove – Underground – No Transformer",null,null,null,null,null,null,null,null,null,null,"Toronto Hydro-Electric System Limited","PowerStream Inc. - Barrie",null,"RESIDENTIAL - URBAN [UR]","kWh"]
["RESIDENTIAL - NORMAL DENSITY [R2]",null,null,null,null,null,null,null,"Rate Rider for Disposition of Deferred PILs Variance Account 1562 (2012) - effective until April 30, 2016",null,null,null,null,null,null,null,null,null,null,null,null,null,null,null,null,null,"Temporary service installation and removal – overhead – no transformer",null,null,null,null,null,null,null,null,null,null,"Veridian Connections Inc.","PowerStream Inc. - South",null,"RESIDENTIAL REGULAR","kWh"]
["RESIDENTIAL - TIME OF USE",null,null,null,null,null,null,null,"Rate Rider for Disposition of Deferred PILs Variance Account 1562 (2nd Installment - 2012) - effective until April 30, 2016",null,null,null,null,null,null,null,null,null,null,null,null,null,null,null,null,null,"Temporary service installation and removal – overhead – with transformer",null,null,null,null,null,null,null,null,null,null,"Wasaga Distribution Inc.","PUC Distribution Inc.",null,"RESIDENTIAL","kWh"]
["RESIDENTIAL - URBAN [UR]",null,null,null,null,null,null,null,"Rate Rider for Disposition of Deferred PILs Variance Account 1562 (per connection) (2012) - effective until April 30, 2015",null,null,null,null,null,null,null,null,null,null,null,null,null,null,null,null,null,"Temporary service installation and removal – underground – no transformer",null,null,null,null,null,null,null,null,null,null,"Waterloo North Hydro Inc.","Renfrew Hydro Inc.",null,"RESIDENTIAL SUBURBAN SEASONAL","kWh"]
["RESIDENTIAL REGULAR",null,null,null,null,null,null,null,"Rate Rider for Disposition of Deferred PILs Variance Account 1562 (per connection) (2012) - effective until April 30, 2016",null,null,null,null,null,null,null,null,null,null,null,null,null,null,null,null,null,null,null,null,null,null,null,null,null,null,null,null,"Welland Hydro-Electric System Corp.","Rideau St. Lawrence Distribution Inc.",null,"RESIDENTIAL SUBURBAN","kWh"]
["RESIDENTIAL SUBURBAN",null,null,null,null,null,null,null,"Rate Rider for Disposition of Global Adjustment Sub-Account (2011) - effective until April 30, 2015 Applicable only for Non-RPP Customers",null,null,null,null,null,null,null,null,null,null,null,null,null,null,null,null,null,null,null,null,null,null,null,null,null,null,null,null,"Wellington North Power Inc.","Sioux Lookout Hydro Inc.",null,"RESIDENTIAL SUBURBAN YEAR ROUND","kWh"]
["RESIDENTIAL SUBURBAN SEASONAL",null,null,null,null,null,null,null,"Rate Rider for Disposition of Global Adjustment Sub-Account (2011) - effective until April 30, 2016 Applicable only for Non-RPP Customers",null,null,null,null,null,null,null,null,null,null,null,null,null,null,null,null,null,null,null,null,null,null,null,null,null,null,null,null,"West Coast Huron Energy Inc.","St. Thomas Energy Inc.",null,"RESIDENTIAL URBAN","kWh"]
["RESIDENTIAL SUBURBAN YEAR ROUND",null,null,null,null,null,null,null,"Rate Rider for Disposition of Global Adjustment Sub-Account (2012) - effective until April 30, 2014 Applicable only for Non-RPP Customers",null,null,null,null,null,null,null,null,null,null,null,null,null,null,null,null,null,null,null,null,null,null,null,null,null,null,null,null,"West Perth Power Inc.","Thunder Bay Hydro Electricity Distribution Inc.",null,"RESIDENTIAL URBAN YEAR-ROUND","kWh"]
["RESIDENTIAL URBAN",null,null,null,null,null,null,null,"Rate Rider for Disposition of Global Adjustment Sub-Account (2012) - effective until April 30, 2015 Applicable only for Non-RPP Customers",null,null,null,null,null,null,null,null,null,null,null,null,null,null,null,null,null,null,null,null,null,null,null,null,null,null,null,null,"Westario Power Inc.","Tillsonburg Hydro Inc.",null,"SEASONAL RESIDENTIAL - HIGH DENSITY [R3]","kWh"]
["RESIDENTIAL URBAN YEAR-ROUND",null,null,null,null,null,null,null,"Rate Rider for Disposition of Global Adjustment Sub-Account (2012) - effective until April 30, 2015 Applicatble only for Non-RPP Customers",null,null,null,null,null,null,null,null,null,null,null,null,null,null,null,null,null,null,null,null,null,null,null,null,null,null,null,null,"Whitby Hydro Electric Corporation","Toronto Hydro-Electric System Limited",null,"SEASONAL RESIDENTIAL - NORMAL DENSITY [R4]","kWh"]
["SEASONAL RESIDENTIAL",null,null,null,null,null,null,null,"Rate Rider for Disposition of Global Adjustment Sub-Account (2012) - effective until April 30, 2016 Applicable only for Non-RPP Customers",null,null,null,null,null,null,null,null,null,null,null,null,null,null,null,null,null,null,null,null,null,null,null,null,null,null,null,null,"Woodstock Hydro Services Inc.","Veridian Connections Inc.",null,"SEASONAL RESIDENTIAL","kWh"]
["SEASONAL RESIDENTIAL - HIGH DENSITY [R3]",null,null,null,null,null,null,null,"Rate Rider for Disposition of Global Adjustment Sub-Account (2012) - effective until January 31, 2014. Applicable only for Non-RPP Customers",null,null,null,null,null,null,null,null,null,null,null,null,null,null,null,null,null,null,null,null,null,null,null,null,null,null,null,null,null,"Veridian Connections Inc. - Gravenhurst",null,"SENTINEL LIGHTING","kW"]
["SEASONAL RESIDENTIAL - NORMAL DENSITY [R4]",null,null,null,null,null,null,null,"Rate Rider for Disposition of Global Adjustment Sub-Account (2012) - effective until June 30, 2014 Applicable only for Non-RPP Customers",null,null,null,null,null,null,null,null,null,null,null,null,null,null,null,null,null,null,null,null,null,null,null,null,null,null,null,null,null,"Wasaga Distribution Inc.",null,"SMALL COMMERCIAL AND USL - PER CONNECTION","kW"]
["SENTINEL LIGHTING",null,null,null,null,null,null,null,"Rate Rider for Disposition of Global Adjustment Sub-Account (2012) Applicable only for Non-RPP Customers - effective until August 31, 2014",null,null,null,null,null,null,null,null,null,null,null,null,null,null,null,null,null,null,null,null,null,null,null,null,null,null,null,null,null,"Waterloo North Hydro Inc.",null,"SMALL COMMERCIAL AND USL - PER METER","kW"]
["SMALL COMMERCIAL AND USL - PER CONNECTION",null,null,null,null,null,null,null,"Rate Rider for Disposition of Global Adjustment Sub-Account (2012) Applicable only to Non-RPP Customers - effective until August 31, 2014",null,null,null,null,null,null,null,null,null,null,null,null,null,null,null,null,null,null,null,null,null,null,null,null,null,null,null,null,null,"Welland Hydro-Electric System Corp.",null,"STANDARD A GENERAL SERVICE AIR ACCESS","kW"]
["SMALL COMMERCIAL AND USL - PER METER",null,null,null,null,null,null,null,"Rate Rider for Disposition of Global Adjustment Sub-Account (2013) - effective until April 30, 2014 Applicable only for Non-RPP Customers",null,null,null,null,null,null,null,null,null,null,null,null,null,null,null,null,null,null,null,null,null,null,null,null,null,null,null,null,null,"Wellington North Power Inc.",null,"STANDARD A GENERAL SERVICE ROAD/RAIL","kW"]
["STANDARD A GENERAL SERVICE AIR ACCESS",null,null,null,null,null,null,null,"Rate Rider for Disposition of Global Adjustment Sub-Account (2013) - effective until April 30, 2015 Applicable only for Non-RPP Customers",null,null,null,null,null,null,null,null,null,null,null,null,null,null,null,null,null,null,null,null,null,null,null,null,null,null,null,null,null,"West Coast Huron Energy Inc.",null,"STANDARD A RESIDENTIAL AIR ACCESS","kW"]
["STANDARD A GENERAL SERVICE ROAD/RAIL",null,null,null,null,null,null,null,"Rate Rider for Disposition of Global Adjustment Sub-Account (2013) - effective until April 30, 2015 Applicable only for Non-RPP Customers and excluding Wholesale Market Participants",null,null,null,null,null,null,null,null,null,null,null,null,null,null,null,null,null,null,null,null,null,null,null,null,null,null,null,null,null,"West Perth Power Inc.",null,"STANDARD A RESIDENTIAL ROAD/RAIL","kW"]
["STANDARD A GRID CONNECTED",null,null,null,null,null,null,null,"Rate Rider for Disposition of Global Adjustment Sub-Account (2013) - effective until April 30, 2017 Applicable only for Non-RPP Customers",null,null,null,null,null,null,null,null,null,null,null,null,null,null,null,null,null,null,null,null,null,null,null,null,null,null,null,null,null,"Westario Power Inc.",null,"STANDBY - GENERAL SERVICE 1,000 - 5,000 KW","kW"]
["STANDARD A RESIDENTIAL AIR ACCESS",null,null,null,null,null,null,null,"Rate Rider For Disposition of Global Adjustment Sub-Account (2013) - effective until August 31, 2014 Applicable only for Non-RPP Customers",null,null,null,null,null,null,null,null,null,null,null,null,null,null,null,null,null,null,null,null,null,null,null,null,null,null,null,null,null,"Whitby Hydro Electric Corporation",null,"STANDBY - GENERAL SERVICE 50 - 1,000 KW","kW"]
["STANDARD A RESIDENTIAL ROAD/RAIL",null,null,null,null,null,null,null,"Rate Rider for Disposition of Global Adjustment Sub-Account (2013) - effective until December 31, 2014 Applicable only for Non-RPP Customers",null,null,null,null,null,null,null,null,null,null,null,null,null,null,null,null,null,null,null,null,null,null,null,null,null,null,null,null,null,"Woodstock Hydro Services Inc.",null,"STANDBY - LARGE USE","kW"]
["STANDBY - GENERAL SERVICE 1,000 - 5,000 KW",null,null,null,null,null,null,null,"Rate Rider for Disposition of Global Adjustment Sub-Account (2013) - effective until May 31, 2014 Applicable only for Non-RPP Customers",null,null,null,null,null,null,null,null,null,null,null,null,null,null,null,null,null,null,null,null,null,null,null,null,null,null,null,null,null,null,null,"STANDBY DISTRIBUTION SERVICE","kW"]
["STANDBY - GENERAL SERVICE 50 - 1,000 KW",null,null,null,null,null,null,null,"Rate Rider for Disposition of Global Adjustment Sub-Account (2014) - effective until December 31, 2014. Applicable only for Non-RPP - Class B Customers",null,null,null,null,null,null,null,null,null,null,null,null,null,null,null,null,null,null,null,null,null,null,null,null,null,null,null,null,null,null,null,"STANDBY POWER - APPROVED ON AN INTERIM BASIS","kW"]
["STANDBY - LARGE USE",null,null,null,null,null,null,null,"Rate Rider for Disposition of Global Adjustment Sub-Account (2014) - effective until December 31, 2014. Applicable only for Non-RPP Customers",null,null,null,null,null,null,null,null,null,null,null,null,null,null,null,null,null,null,null,null,null,null,null,null,null,null,null,null,null,null,null,"STANDBY POWER GENERAL SERVICE 1,500 TO 4,999 KW","kW"]
["STANDBY DISTRIBUTION SERVICE",null,null,null,null,null,null,null,"Rate Rider for Disposition of Global Adjustment Sub-Account (2014) - effective until December 31, 2014. Applicable only for Non-RPP Customers - Class A Customers",null,null,null,null,null,null,null,null,null,null,null,null,null,null,null,null,null,null,null,null,null,null,null,null,null,null,null,null,null,null,null,"STANDBY POWER GENERAL SERVICE 50 TO 1,499 KW","kW"]
["STANDBY POWER",null,null,null,null,null,null,null,"Rate Rider for Disposition of Global Adjustment Sub-Account (2014) - effective until December 31, 2014. Applicable only for Non-RPP Customers - Interval Metered",null,null,null,null,null,null,null,null,null,null,null,null,null,null,null,null,null,null,null,null,null,null,null,null,null,null,null,null,null,null,null,"STANDBY POWER GENERAL SERVICE LARGE USE","kW"]
["STANDBY POWER - APPROVED ON AN INTERIM BASIS",null,null,null,null,null,null,null,"Rate Rider for Disposition of Global Adjustment Sub-Account (2014) - effective until December 31, 2014. Applicable only for Non-RPP Customers - Non Interval Metered",null,null,null,null,null,null,null,null,null,null,null,null,null,null,null,null,null,null,null,null,null,null,null,null,null,null,null,null,null,null,null,"STANDBY POWER","kW"]
["STANDBY POWER GENERAL SERVICE 1,500 TO 4,999 KW",null,null,null,null,null,null,null,"Rate Rider for Disposition of Post Retirement Actuarial Gain - effective until March 31, 2025",null,null,null,null,null,null,null,null,null,null,null,null,null,null,null,null,null,null,null,null,null,null,null,null,null,null,null,null,null,null,null,"STREET LIGHTING","kWh"]
["STANDBY POWER GENERAL SERVICE 50 TO 1,499 KW",null,null,null,null,null,null,null,"Rate Rider for Disposition of Residual Hisotrical Smart Meter Costs - effective until April 30, 2015",null,null,null,null,null,null,null,null,null,null,null,null,null,null,null,null,null,null,null,null,null,null,null,null,null,null,null,null,null,null,null,"SUB TRANSMISSION [ST]","kW"]
["STANDBY POWER GENERAL SERVICE LARGE USE",null,null,null,null,null,null,null,"Rate Rider for Disposition of Residual Hisotrical Smart Meter Costs - effective until April 30, 2017",null,null,null,null,null,null,null,null,null,null,null,null,null,null,null,null,null,null,null,null,null,null,null,null,null,null,null,null,null,null,null,"UNMETERED SCATTERED LOAD","kWh"]
["STREET LIGHTING",null,null,null,null,null,null,null,"Rate Rider for Disposition of Residual Historical Smart Meter Costs - effective until April 30, 2014",null,null,null,null,null,null,null,null,null,null,null,null,null,null,null,null,null,null,null,null,null,null,null,null,null,null,null,null,null,null,null,"URBAN GENERAL SERVICE DEMAND BILLED (50 KW AND ABOVE) [UGD]","kW"]
["SUB TRANSMISSION [ST]",null,null,null,null,null,null,null,"Rate Rider for Disposition of Residual Historical Smart Meter Costs - effective until April 30, 2016",null,null,null,null,null,null,null,null,null,null,null,null,null,null,null,null,null,null,null,null,null,null,null,null,null,null,null,null,null,null,null,"URBAN GENERAL SERVICE ENERGY BILLED (LESS THAN 50 KW) [UGE]","kWh"]
["UNMETERED SCATTERED LOAD",null,null,null,null,null,null,null,"Rate Rider for Disposition of Residual Historical Smart Meter Costs - effective until August 31, 2014",null,null,null,null,null,null,null,null,null,null,null,null,null,null,null,null,null,null,null,null,null,null,null,null,null,null,null,null,null,null,null,"WESTPORT SEWAGE TREATMENT PLANT","kW"]
["URBAN GENERAL SERVICE DEMAND BILLED (50 KW AND ABOVE) [UGD]",null,null,null,null,null,null,null,"Rate Rider for Disposition of Residual Historical Smart Meter Costs - effective until August 31, 2015",null,null,null,null,null,null,null,null,null,null,null,null,null,null,null,null,null,null,null,null,null,null,null,null,null,null,null,null,null,null,null,"YEAR-ROUND RESIDENTIAL - R2","kWh"]
["URBAN GENERAL SERVICE ENERGY BILLED (LESS THAN 50 KW) [UGE]",null,null,null,null,null,null,null,"Rate Rider for Disposition of Residual Historical Smart Meter Costs - effective until December 31, 2014"]
["WESTPORT SEWAGE TREATMENT PLANT",null,null,null,null,null,null,null,"Rate Rider for Disposition of Residual Historical Smart Meter Costs – effective until December 31, 2014"]
["YEAR-ROUND RESIDENTIAL - R2",null,null,null,null,null,null,null,"Rate Rider for Disposition of Residual Historical Smart Meter Costs - effective until December 31, 2015"]
[null,null,null,null,null,null,null,null,"Rate Rider for Disposition of Residual Historical Smart Meter Costs - effective until December 31, 2016"]
[null,null,null,null,null,null,null,null,"Rate Rider for Disposition of Residual Historical Smart Meter Costs - effective until October 31, 2014"]
[null,null,null,null,null,null,null,null,"Rate Rider for Disposition of Residual Historical Smart Meter Costs - effective until September 30, 2014"]
[null,null,null,null,null,null,null,null,"Rate Rider for Disposition of Residual Historical Smart Meter Costs - Non-Interval Metered \n - effective until April 30, 2014"]
[null,null,null,null,null,null,null,null,"Rate Rider for Disposition of Residual Historical Smart Meter Costs 2 - in effect until the effective \n date of the next cost of service-based rate order"]
[null,null,null,null,null,null,null,null,"Rate Rider for Disposition of Residual Historical Smart Meter Costs 3 - in effect until the effective \n date of the next cost of service-based rate order"]
[null,null,null,null,null,null,null,null,"Rate Rider for Disposition of Residual Incremental Historical Smart Meter Costs - \n effective until August 31, 2015"]
[null,null,null,null,null,null,null,null,"Rate Rider for Disposition of Stranded Meter costs - effective until April 30, 2015"]
[null,null,null,null,null,null,null,null,"Rate Rider for Disposition of Stranded Meter Costs - effective until April 30, 2016"]
[null,null,null,null,null,null,null,null,"Rate Rider for Disposition of Stranded Meter Costs - effective until April 30, 2017"]
[null,null,null,null,null,null,null,null,"Rate Rider for Global Adjustment Sub Account Disposition - effective until April 30, 2016 Applicable only for Non RPP Customers"]
[null,null,null,null,null,null,null,null,"Rate Rider for Global Adjustment Sub-Account Disposition \n Applicable only for Non-RPP Customers – effective until April 30, 2015"]
[null,null,null,null,null,null,null,null,"Rate Rider for Global Adjustment Sub-Account Disposition (2014) - effective until April 28, 2016 Applicable only for Non-RPP Customers"]
[null,null,null,null,null,null,null,null,"Rate Rider for Global Adjustment Sub-Account Disposition (2014) - effective until April 30, 2015 Applicable only for Non-RPP Customers"]
[null,null,null,null,null,null,null,null,"Rate Rider for Global Adjustment Sub-Account Disposition (2014) - effective until December 30, 2015 Applicable only for Non-RPP Customers"]
[null,null,null,null,null,null,null,null,"Rate Rider for Global Adjustment Sub-Account Disposition (2014) - effective until December 31, 2014 Applicable only for Non-RPP Customers"]
[null,null,null,null,null,null,null,null,"Rate Rider for Global Adjustment Sub-Account Disposition (2014) - effective until December 31, 2015 Applicable only for Non-RPP Customers"]
[null,null,null,null,null,null,null,null,"Rate Rider for Global Adjustment Sub-Account Disposition (2014) - effective until December, 2015 Applicable only for Non-RPP Customers"]
[null,null,null,null,null,null,null,null,"Rate Rider for Incremental Capital - Distribution Volumetric - effective until April 30, 2016"]
[null,null,null,null,null,null,null,null,"Rate Rider for Incremental Capital - Service Charge - effective until April 30, 2016"]
[null,null,null,null,null,null,null,null,"Rate Rider for Incremental Capital (2012) - effective until April 30, 2015"]
[null,null,null,null,null,null,null,null,"Rate Rider for Lost Revenue Adjustment Mechanism Variance Account (LRAMVA) Recovery \n (2012 CDM Activities) - effective until April 30, 2015"]
[null,null,null,null,null,null,null,null,"Rate Rider for Recover of Residual Historical Smart meter Costs - effective until June 30, 2014"]
[null,null,null,null,null,null,null,null,"Rate Rider for Recovery of CGAAP/CWIP Differential - in effect until December 31, 2016"]
[null,null,null,null,null,null,null,null,"Rate Rider for Recovery of Foregone Revenue - effective until April 30, 2015"]
[null,null,null,null,null,null,null,null,"Rate Rider for Recovery of Forgone Revenue - effective until April 30, 2015"]
[null,null,null,null,null,null,null,null,"Rate Rider for Recovery of Forgone Revenue - effective until December 31, 2014"]
[null,null,null,null,null,null,null,null,"Rate Rider for Recovery of Green Energy Act related costs - effective until December 31, 2014"]
[null,null,null,null,null,null,null,null,"Rate Rider for Recovery of Incremental Capital (2013) - in effect until the effective date of the next cost of service-based rate order"]
[null,null,null,null,null,null,null,null,"Rate Rider for Recovery of Incremental Capital (2013) - in effect until the effective date of the\n next cost of service-based rate order"]
[null,null,null,null,null,null,null,null,"Rate Rider for Recovery of Incremental Capital (2013) (per connection) - in effect until the effective date of \n the next cost of service-based rate order"]
[null,null,null,null,null,null,null,null,"Rate Rider for Recovery of Incremental Capital (2013) (per connection)- in effect until the effective date of the next cost of service-based rate order"]
[null,null,null,null,null,null,null,null,"Rate Rider for Recovery of Incremental Capital Costs"]
[null,null,null,null,null,null,null,null,"Rate Rider for Recovery of Incremental Capital Costs - effective until April 30, 2015"]
[null,null,null,null,null,null,null,null,"Rate Rider for Recovery of Lost Revenue Adjustment Mechanism ( LRAM)/Shared Savings Mechanism (SSM) (2012) - effective until August 31, 2014"]
[null,null,null,null,null,null,null,null,"Rate Rider for Recovery of Lost Revenue Adjustment Mechanism (2013) - effective until December 31, 2014"]
[null,null,null,null,null,null,null,null,"Rate Rider for Recovery of Lost Revenue Adjustment Mechanism (LRAM) - effective until April 30, 2016"]
[null,null,null,null,null,null,null,null,"Rate Rider for Recovery of Lost Revenue Adjustment Mechanism (LRAM) (pre-2011 CDM Activities) - effective until April 30, 2015"]
[null,null,null,null,null,null,null,null,"Rate Rider for Recovery of Lost Revenue Adjustment Mechanism (LRAM) (pre-2011 CDM Activities) (2013) - effective until April 30, 2015"]
[null,null,null,null,null,null,null,null,"Rate Rider for Recovery of Lost Revenue Adjustment Mechanism (LRAM)/Shared Savings"]
[null,null,null,null,null,null,null,null,"Rate Rider for Recovery of Lost Revenue Adjustment Mechanism (LRAM)/Shared Savings Mechanism (SSM) - effective until December 31, 2014 and applicable in the service area excluding the former service area of Clinton Power"]
[null,null,null,null,null,null,null,null,"Rate Rider for Recovery of Lost Revenue Adjustment Mechanism (LRAM)/Shared Savings Mechanism (SSM) - effective until December 31, 2014 and applicable in the service area excluding the former service areas of Clinton Power and West Perth Power"]
[null,null,null,null,null,null,null,null,"Rate Rider for Recovery of Lost Revenue Adjustment Mechanism (LRAM)/Shared Savings Mechanism (SSM) - effective until December 31, 2014 and applicable only in the former service area of Clinton Power"]
[null,null,null,null,null,null,null,null,"Rate Rider for Recovery of Lost Revenue Adjustment Mechanism (LRAM)/Shared Savings Mechanism (SSM) - effective until December 31, 2014 and applicable only in the former service area of West Perth Power"]
[null,null,null,null,null,null,null,null,"Rate Rider for Recovery of Lost Revenue Adjustment Mechanism (LRAM)/Shared Savings Mechanism (SSM) - effective until March 31, 2016"]
[null,null,null,null,null,null,null,null,"Rate Rider for Recovery of Lost Revenue Adjustment Mechanism (LRAM)/Shared Savings Mechanism (SSM) (2012) - effective until August 31, 2014"]
[null,null,null,null,null,null,null,null,"Rate Rider for Recovery of Lost Revenue Adjustment Mechanism (LRAM)/Shared Savings Mechanism (SSM) Recovery - effective until April 30, 2015"]
[null,null,null,null,null,null,null,null,"Rate Rider for Recovery of Lost Revenue Adjustment Mechanism Variance Account (LRAMVA) (2014) - effective until April 30, 2015"]
[null,null,null,null,null,null,null,null,"Rate Rider for Recovery of Residual Historical Smart Meter Costs - effective July 1, 2012 - April 30, 2016"]
[null,null,null,null,null,null,null,null,"Rate Rider for Recovery of Smart Meter Incremental Revenue Requirement - effective until the date of the next cost of service-based rate order"]
[null,null,null,null,null,null,null,null,"Rate Rider for Recovery of Smart Meter Incremental Revenue Requirement - effective until the effective date of the next cost of service-based rate order, or October 31, 2017, whichever occurs earlier"]
[null,null,null,null,null,null,null,null,"Rate Rider for Recovery of Smart Meter Incremental Revenue Requirement - in effect until the effective date of the next cost of service-based rate order"]
[null,null,null,null,null,null,null,null,"Rate Rider for Recovery of Smart Meter Incremental Revenue Requirement - Non-Interval Metered - in effect until the effective date of the next cost of service-based rate order"]
[null,null,null,null,null,null,null,null,"Rate Rider for Recovery of Smart Meter Incremental Revenue Requirements - in effect until the effective date of the next cost of service application"]
[null,null,null,null,null,null,null,null,"Rate Rider for Recovery of Smart Meter Stranded Assets - effective until April 30, 2016"]
[null,null,null,null,null,null,null,null,"Rate Rider for Recovery of Storm Damage Costs - effective until August 31, 2017"]
[null,null,null,null,null,null,null,null,"Rate Rider for Recovery of Stranded Assets - effective until April 30, 2016"]
[null,null,null,null,null,null,null,null,"Rate Rider for Recovery of Stranded Meter Assets - effective July 1, 2012 - April 30, 2016"]
[null,null,null,null,null,null,null,null,"Rate Rider for Recovery of Stranded Meter Assets – effective until April 30, 2015"]
[null,null,null,null,null,null,null,null,"Rate Rider for Recovery of Stranded Meter Assets - effective until April 30, 2016"]
[null,null,null,null,null,null,null,null,"Rate Rider for Recovery of Stranded Meter Assets - effective until April 30, 2017"]
[null,null,null,null,null,null,null,null,"Rate Rider for Recovery of Stranded Meter Assets - effective until August 31, 2015"]
[null,null,null,null,null,null,null,null,"Rate Rider for Recovery of Stranded Meter Assets - effective until August 31, 2017"]
[null,null,null,null,null,null,null,null,"Rate Rider for Recovery of Stranded Meter Assets - effective until December 31, 2014"]
[null,null,null,null,null,null,null,null,"Rate Rider for Recovery of Stranded Meter Assets - effective until December 31, 2015"]
[null,null,null,null,null,null,null,null,"Rate Rider for Recovery of Stranded Meter Assets - effective until June 30, 2016"]
[null,null,null,null,null,null,null,null,"Rate Rider for Recovery of Stranded Meter Assets - effective until March 31, 2016"]
[null,null,null,null,null,null,null,null,"Rate Rider for Recovery of Stranded Meter Assets - effective until May 31, 2014"]
[null,null,null,null,null,null,null,null,"Rate Rider for Reversal of Deferral/Variance Account Disposition (2011) - effective until April 30, 2015"]
[null,null,null,null,null,null,null,null,"Rate Rider for Smart Meter Disposition - effective until April 30, 2016"]
[null,null,null,null,null,null,null,null,"Rate Rider for Smart Meter Incremental Revenue Requirement - in effect until the effective date of the next cost of service-based rate order"]
[null,null,null,null,null,null,null,null,"Rate Rider for Smart Metering Entity Charge - effective until October 31, 2018"]
[null,null,null,null,null,null,null,null,"Rate Rider for Stranded Meter Cost Recovery - effective until April 30, 2017"]
[null,null,null,null,null,null,null,null,"Rate Rider for Tax Change"]
[null,null,null,null,null,null,null,null,"Rate Rider for Tax Change - effective until April 30, 2015"]
[null,null,null,null,null,null,null,null,"Rate Rider for Tax Change (2014) - effective until April 30, 2015"]
[null,null,null,null,null,null,null,null,"Retail Transmission Rate - Line and Transformation Connection Service Rate"]
[null,null,null,null,null,null,null,null,"Retail Transmission Rate - Line and Transformation Connection Service Rate - (less than 1,000 kW)"]
[null,null,null,null,null,null,null,null,"Retail Transmission Rate - Line and Transformation Connection Service Rate - Interval Metered"]
[null,null,null,null,null,null,null,null,"Retail Transmission Rate - Line and Transformation Connection Service Rate - Interval Metered (1,000 to 4,999 kW)"]
[null,null,null,null,null,null,null,null,"Retail Transmission Rate - Line and Transformation Connection Service Rate - Interval Metered (less than 1,000 kW)"]
[null,null,null,null,null,null,null,null,"Retail Transmission Rate - Line and Transformation Connection Service Rate - Interval Metered < 1,000 kW"]
[null,null,null,null,null,null,null,null,"Retail Transmission Rate - Line and Transformation Connection Service Rate - Interval Metered > 1,000 kW"]
[null,null,null,null,null,null,null,null,"Retail Transmission Rate - Line and Transformation Connection Service Rate FOR ALL SERVICE AREAS EXCEPT HENSALL"]
[null,null,null,null,null,null,null,null,"Retail Transmission Rate - Line Connection Service Rate"]
[null,null,null,null,null,null,null,null,"Retail Transmission Rate - Network Service Rate"]
[null,null,null,null,null,null,null,null,"Retail Transmission Rate - Network Service Rate - (less than 1,000 kW)"]
[null,null,null,null,null,null,null,null,"Retail Transmission Rate - Network Service Rate - Interval Metered"]
[null,null,null,null,null,null,null,null,"Retail Transmission Rate - Network Service Rate - Interval Metered (1,000 to 4,999 kW)"]
[null,null,null,null,null,null,null,null,"Retail Transmission Rate - Network Service Rate - Interval Metered (less than 1,000 kW)"]
[null,null,null,null,null,null,null,null,"Retail Transmission Rate - Network Service Rate - Interval Metered > 1,000 kW"]
[null,null,null,null,null,null,null,null,"Retail Transmission Rate - Transformation Connection Service Rate"]
[null,null,null,null,null,null,null,null,"Rider for Global Adjustment Sub-Account Disposition (2012) - effective until April 30, 2016 Applicable only for Non-RPP Customers"]
[null,null,null,null,null,null,null,null,"Rural or Remote Electricity Rate Protection Charge (RRRP)"]
[null,null,null,null,null,null,null,null,"Sentinel lights (dusk-to-dawn) connected to unmetered wires will have a flat rate monthly energy charge added to the regular customer bill. Further servicing details are available in the distributor’s Conditions of Service."]
[null,null,null,null,null,null,null,null,"Service Charge"]
[null,null,null,null,null,null,null,null,"Service Charge (per connection)"]
[null,null,null,null,null,null,null,null,"Service Charge (per customer)"]
[null,null,null,null,null,null,null,null,"Service Charge (per light)"]
[null,null,null,null,null,null,null,null,"Smart Grid Funding Adder (2014) - in effect until December 31, 2014"]
[null,null,null,null,null,null,null,null,"Smart Meter Disposition Rider"]
[null,null,null,null,null,null,null,null,"Smart Meter Entity Charge"]
[null,null,null,null,null,null,null,null,"Smart Meter Incremental Revenue Requirement Rate Rider"]
[null,null,null,null,null,null,null,null,"Standard Supply Service - Administrative Charge (if applicable)"]
[null,null,null,null,null,null,null,null,"Standby Charge - for a month where standby power is not provided, the charge is based on the applicable General Service 50 to 4,999 kW or Large Use Distribution Volumetric Charge applied to the contracted amount (e.g. Nameplate rating of generating facility)."]
[null,null,null,null,null,null,null,null,"Standby Charge - for a month where standby power is not provided. The charge is applied to the amount of reserved load transfer capacity contracted or the amount of monthly peak load displaced by a generating facility"]
[null,null,null,null,null,null,null,null,"Standby Charge - for a month where standby power is not provided. The charge is applied to the contracted amount (e.g. nameplate rating of the generation facility)."]
[null,null,null,null,null,null,null,null,"Wholesale Market Service Rate"]

{"sheet":"lists2","index":55,"n_rows":187,"n_cols":4,"rows_kept":187,"cut":false,"hidden":true,"merged":[[168,4,168,7],[170,0,170,1],[170,4,170,5],[171,0,171,1],[148,0,148,1],[149,0,149,1],[150,0,150,1],[151,0,151,1],[153,0,153,1],[154,0,154,1],[155,0,155,1],[156,0,156,1],[152,0,152,1],[105,0,105,1],[109,0,109,1],[137,0,137,1],[138,0,138,1],[139,0,139,1],[140,0,140,1],[141,0,141,1],[142,0,142,1],[143,0,143,1],[129,0,129,1],[130,0,130,1],[132,0,132,1],[133,0,133,1],[131,0,131,1],[128,0,128,1],[136,0,136,1],[92,0,92,1],[93,0,93,1],[98,0,98,1],[99,0,99,1],[100,0,100,1],[101,0,101,1],[102,0,102,1],[103,0,103,1],[104,0,104,1],[83,0,83,1],[84,0,84,1],[85,0,85,1],[86,0,86,1],[87,0,87,1],[88,0,88,1],[89,0,89,1],[90,0,90,1],[91,0,91,1],[74,0,74,1],[75,0,75,1],[76,0,76,1],[77,0,77,1],[78,0,78,1],[79,0,79,1],[80,0,80,1],[81,0,81,1],[82,0,82,1],[36,0,36,1],[46,0,46,1],[65,0,65,3],[65,4,65,7],[67,0,67,3],[67,4,67,7],[71,0,71,1],[72,0,72,1],[73,0,73,1],[21,0,21,1],[22,0,22,1],[23,0,23,1],[24,0,24,1],[25,0,25,1],[26,0,26,1],[27,0,27,1],[28,0,28,1],[29,0,29,1],[12,0,12,1],[13,0,13,1],[14,0,14,1],[15,0,15,1],[16,0,16,1],[17,0,17,1],[18,0,18,1],[19,0,19,1],[20,0,20,1],[33,0,33,1],[34,0,34,1],[35,0,35,1],[54,0,54,1],[190,0,190,1],[110,0,110,1],[111,0,111,1],[112,0,112,1],[113,0,113,1],[114,0,114,1],[115,0,115,1],[116,0,116,1],[117,0,117,1],[118,0,118,1],[119,0,119,1],[120,0,120,1],[121,0,121,1],[122,0,122,1],[123,0,123,1],[124,0,124,1],[55,0,55,1],[56,0,56,1],[57,0,57,1],[63,0,63,3],[191,0,191,1],[144,0,144,1],[145,0,145,1],[146,0,146,1],[147,0,147,1],[168,0,168,3],[178,0,178,1],[179,0,179,1],[180,0,180,1],[175,0,175,1],[176,0,176,1],[177,0,177,1],[172,0,172,1],[173,0,173,1],[174,0,174,1],[192,0,192,1],[193,0,193,1],[194,0,194,1],[186,0,186,3],[186,4,186,7],[160,0,160,3],[160,4,160,7],[161,0,161,3],[161,4,161,7],[162,0,162,3],[162,4,162,7],[163,0,163,3],[163,4,163,7],[164,0,164,3],[164,4,164,7],[165,0,165,3],[165,4,165,7],[166,0,166,3],[166,4,166,7],[167,0,167,3],[181,0,181,1],[182,0,182,1],[189,0,189,1],[167,4,167,7],[0,0,0,3],[48,0,48,5],[94,0,94,1],[95,0,95,1],[96,0,96,1],[97,0,97,1],[125,0,125,1],[126,0,126,1],[127,0,127,1],[2,0,2,3],[5,0,5,3],[6,0,6,3],[7,0,7,3],[8,0,8,3],[37,0,37,1],[38,0,38,1],[39,0,39,1],[40,0,40,1],[41,0,41,1],[45,0,45,1],[47,0,47,1],[30,0,30,1],[31,0,31,1],[32,0,32,1]]}
["RESIDENTIAL Service Classification"]
[]
[]
["APPLICATION"]
[]
[]
[]
[]
[]
[]
["MONTHLY RATES AND CHARGES - Delivery Component"]
[]
[]
[]
[]
[]
[]
[]
[]
[]
[]
[]
[]
[]
[]
[]
[]
[]
[]
[]
[]
[]
[]
[]
[]
[]
[]
[]
[]
[]
[]
[]
[]
["MONTHLY RATES AND CHARGES - Regulatory Component"]
[]
["Wholesale Market Service Rate",null,"$/kWh",4.4000000000000003E-3]
["Rural Rate Protection Charge",null,"$/kWh",1.2999999999999999E-3]
["Standard Supply Service - Administrative Charge (if applicable)",null,"$",0.25]
[]
[]
[]
[]
["ALLOWANCES"]
[]
["Transformer Allowance for Ownership - per kW of billing demand/month"]
[]
[]
["Primary Metering Allowance for transformer losses – applied to measured demand and energy"]
[]
["SPECIFIC SERVICE CHARGES"]
[]
["APPLICATION"]
[]
["The application of these rates and charges shall be in accordance with the Licence of the Distributor and any Code or Order of the Board, and amendments thereto as approved by the Board, which may be applicable to the administration of this schedule."]
[]
["No charges to meet the costs of any work or service done or furnished for the purpose of the distribution of electricity shall be made except as permitted by this schedule, unless required by the Distributor’s Licence or a Code or Order of the Board, and amendments thereto as approved by the Board, or as specified herein."]
[]
["It should be noted that this schedule does not list any charges, assessments or credits that are required by law to be invoiced by a distributor and that are not subject to Board approval, such as the Debt Retirement Charge, the Global Adjustment, the Ontario Clean Energy Benefit and the HST."]
[]
["Customer Administration"]
[]
[]
[]
[]
[]
[]
[]
[]
[]
[]
[]
[]
[]
[]
[]
[]
[]
[]
[]
[]
[]
[]
[]
[]
[]
[]
[]
[]
[]
[]
[]
[]
[]
[]
[]
[]
[]
["Non-Payment of Account"]
[]
[]
[]
[]
[]
[]
[]
[]
[]
[]
[]
[]
[]
[]
[]
[]
[]
[]
[]
[]
[]
[]
[]
[]
[]
[]
[]
[]
[]
[]
[]
[]
[]
[]
[]
[]
[]
[]
[]
[]
[]
[]
[]
[]
[]
[]
[]
[]
[]
[]
["RETAIL SERVICE CHARGES (if applicable)"]
[]
["The application of these rates and charges shall be in accordance with the Licence of the Distributor and any Code or Order of the Board, and amendments thereto as approved by the Board, which may be applicable to the administration of this schedule."]
[]
["No rates and charges for the distribution of electricity and charges to meet the costs of any work or service done or furnished for the purpose of the distribution of electricity shall be made except as permitted by this schedule, unless required by the Distributor’s Licence or a Code or Order of the Board, and amendments thereto as approved by the Board, or as specified herein."]
[]
["Unless specifically noted, this schedule does not contain any charges for the electricity commodity, be it under the Regulated Price Plan, a contract with a retailer or the wholesale market price, as applicable."]
[]
["It should be noted that this schedule does not list any charges, assessments or credits that are required by law to be invoiced by a distributor and that are not subject to Board approval, such as the Debt Retirement Charge, the Global Adjustment, the Ontario Clean Energy Benefit and the HST."]
[]
["Retail Service Charges refer to services provided by a distributor to retailers or customers related to the supply of competitive electricity."]
[]
["One-time charge, per retailer, to establish the service agreement between the distributor and the retailer",null,"$",100]
["Monthly Fixed Charge, per retailer",null,"$",20]
["Monthly Variable Charge, per customer, per retailer",null,"$/cust.",0.5]
["Distributor-consolidated billing monthly charge, per customer, per retailer",null,"$/cust.",0.3]
["Retailer-consolidated billing monthly credit, per customer, per retailer",null,"$/cust.",-0.3]
["Service Transaction Requests (STR) "]
["Request fee, per request, applied to the requesting party",null,"$",0.25]
["Processing fee, per request, applied to the requesting party",null,"$",0.5]
["Request for customer information as outlined in Section 10.6.3 and Chapter 11 of the Retail"]
["Settlement Code directly to retailers and customers, if not delivered electronically through the"]
["Electronic Business Transaction (EBT) system, applied to the requesting party "]
["Up to twice a year",null,"$","no charge"]
["More than twice a year, per request (plus incremental delivery costs)",null,"$",2]
[]
["LOSS FACTORS"]
[]
["If the distributor is not capable of prorating changed loss factors jointly with distribution rates, the revised loss factors will be implemented upon the first subsequent billing for each billing cycle."]

{"sheet":"Sheet19","index":56,"n_rows":72,"n_cols":9,"rows_kept":72,"cut":false,"hidden":true,"merged":[]}
[null,"CGAAP","CGAAP","CGAAP","MIFRS","USGAAP","ASPE","ASPE","ASPE"]
[null,"N/A",2012,2013,null,null,"N/A",2012,2013]
["LDC Info","x","x","x","x","x","x","x","x"]
["Table of Contents","x","x","x","x","x","x","x","x"]
["COS Flowchart","x","x","x","x","x","x","x","x"]
["List of Key References","x","x","x","x","x","x","x","x"]
["App.2-AA_Capital Projects","x","x","x","x","x","x","x","x"]
["App.2-AB_Capital Expenditures","x","x","x","x","x","x","x","x"]
["App.2-BA1_Fix Asset Cont.CGAAP","x","x","x","n","x","x","x","x"]
["App.2-BA2_Fix Asset Cont.MIFRS","n","n","n","x","n","n","n","n"]
["Appendix 2-BB Service Life Comp","x","x","x","x","x","x","x","x"]
["Instruction for App. 2-C MIFRS","n","n","n","x","n","n","n","n"]
["App.2-CA_CGAAP_DepExp_2011","n","n","n","x","n","n","n","n"]
["App.2-CB_MIFRS_DepExp_2011","n","n","n","x","n","n","n","n"]
["App.2-CC_MIFRS_DepExp_2012","n","n","n","x","n","n","n","n"]
["App.2-CD_MIFRS_DepExp_2013","n","n","n","x","n","n","n","n"]
["App.2-CE_MIFRS_DepExp_2014","n","n","n","x","n","n","n","n"]
["App.2-CF_CGAAP_DepExp_2012","n","n","n","x","n","n","n","n"]
["App.2-CG_MIFRS_DepExp_2012","n","n","n","x","n","n","n","n"]
["App.2-CH_MIFRS_DepExp_2013","n","n","n","x","n","n","n","n"]
["App.2-CI_MIFRS_DepExp_2014","n","n","n","x","n","n","n","n"]
["App.2-CJ_CGAAP_DepExp_2012","n","n","n","x","n","n","n","n"]
["App.2-CK_CGAAP_DepExp_2013","n","n","n","x","n","n","n","n"]
["App.2-CL_MIFRS_DepExp_2013","n","n","n","x","n","n","n","n"]
["App.2-CM_MIFRS_DepExp_2014","n","n","n","x","n","n","n","n"]
["Instruction for App. 2-C CGAAP","x","x","x","n","n","x","x","x"]
["App.2-CN_OldCGAAP_DepExp_2012","x","x","n","n","n","x","x","n"]
["App.2-CO_NewCGAAP_DepExp_2012","x","x","n","n","n","x","x","n"]
["App.2-CP_NewCGAAP_DepExp_2013","x","x","n","n","n","x","x","n"]
["App.2-CQ NewCGAAP_DepExp_2014","x","x","n","n","n","x","x","n"]
["App.2-CR_OldCGAAP_DepExp_2012","x","n","x","n","n","x","n","x"]
["App.2-CS_OldCGAAP_DepExp_2013","x","n","x","n","n","x","n","x"]
["App.2-CT_NewCGAAP_DepExp_2013","x","n","x","n","n","x","n","x"]
["App.2-CU_NewCGAAP_DepExp_2014","x","n","x","n","n","x","n","x"]
["App.2-CV_USGAAP_DepExp","n","n","n","n","x","n","n","n"]
["App.2-DA_Overhead","n","n","n","x","n","n","n","n"]
["App.2-DB_Overhead","x","x","x","n","n","x","x","x"]
["App.2-EA_PP&E Deferral Account","n","n","n","x","x","n","n","n"]
["App.2-EB_PP&E Deferral Account","n","n","n","x","x","n","n","n"]
["App.2-EC_PP&E Deferral Account","n","n","n","x","x","n","n","n"]
["App.2-ED_Account 1576 (2012)","x","x","n","x","x","x","x","n"]
["App.2-EE_Account 1576 (2013)","x","n","x","x","x","x","n","x"]
["App.2-FA Proposed REG Invest.","o","o","o","o","o","o","o","o"]
["App.2-FB Calc of REG Improvemnt","o","o","o","o","o","o","o","o"]
["App.2-FC Calc of REG Expansion","o","o","o","o","o","o","o","o"]
["App.2-G SQI","x","x","x","x","x","x","x","x"]
["App.2-H_Other_Oper_Rev","x","x","x","x","x","x","x","x"]
["App.2-I LF_CDM_WF","x","x","x","x","x","x","x","x"]
["App.2-JA_OM&A_Summary_Analys","x","x","x","x","x","x","x","x"]
["App.2-JB_OM&A_Cost _Drivers","x","x","x","x","x","x","x","x"]
["App.2-JC_OMA Programs","x","x","x","x","x","x","x","x"]
["App.2-K_Employee Costs","x","x","x","x","x","x","x","x"]
["App.2-L_OM&A_per_Cust_FTEE","x","x","x","x","x","x","x","x"]
["App.2-M_Regulatory_Costs","x","x","x","x","x","x","x","x"]
["App.2-N_Corp_Cost_Allocation","x","x","x","x","x","x","x","x"]
["App.2-OA Capital Structure","x","x","x","x","x","x","x","x"]
["App.2-OB_Debt Instruments","x","x","x","x","x","x","x","x"]
["App.2-P_Cost_Allocation","x","x","x","x","x","x","x","x"]
["App.2-Q_Cost of Serv. Emb. Dx","e","e","e","e","e","e","e","e"]
["App.2-R_Loss Factors","x","x","x","x","x","x","x","x"]
["App.2-S_Stranded Meters","x","x","x","x","x","x","x","x"]
["App.2-TA_1592_Tax_Variance","x","x","x","x","x","x","x","x"]
["App.2-TB_1592_HST-OVAT","x","x","x","x","x","x","x","x"]
["App.2-U_IFRS Transition Costs","x","x","x","x","x","x","x","x"]
["App.2-V_Rev_Reconciliation","x","x","x","x","x","x","x","x"]
["App.2-W_Bill Impacts","x","x","x","x","x","x","x","x"]
["App.2-YA_MIFRS Summary Impacts","n","n","n","x","n","n","n","n"]
["App. 2-YB_CGAAP Summary Impacts","x","x","x","n","n","x","x","x"]
["App. 2-Z_Tariff","x","x","x","x","x","x","x","x"]
["lists","n","n","n","n","n","n","n","n"]
["lists2","n","n","n","n","n","n","n","n"]
["Sheet19","n","n","n","n","n","n","n","n"]