{"text_format":"1","workbook":"xlsx","n_sheets":49,"sheets":["LDC Info","Index","COS Flowchart","List of Key References","App.2-A_Requested_Approvals","App.2-AA_Capital Projects","App.2-AB_Capital Expenditures","App.2-AC_Customer Engagement","App.2-B_Acctg Instructions","App.2-BA_Fixed Asset Cont","Appendix 2-BB Service Life  ","App.2-CA_OldCGAAPDepExp_Yr1","App.2-CB_NewCGAAP_DepExp_Yr1","App.2-CC_DepExp_Yr2","App.2-CD_DepExp_Yr3","App.2-CE_DepExp_Yr4","App.2-CF_DepExp_Yr5","App.2-CG_DepExp_Yr6","App.2-CH_DepExp","App.2-D_Overhead","App.2-EA_Account 1575 (2015)","App.2-EB_Account 1576 (2012)","App.2-EC_Account 1576 (2013)","App.2-FA Proposed REG Invest.","App.2-FB Calc of REG Improvemnt","App.2-FC Calc of REG Expansion","App.2-G SQI","App.2-H_Other_Oper_Rev","App_2-I LF_CDM","App.2-IA_Load_Forecast_Instrct","App.2-IB_Load_Forecast_Analysis","App.2-JA_OM&A_Summary_Analys","App.2-JB_OM&A_Cost _Drivers","App.2-JC_OMA Programs","App.2-K_Employee Costs","App.2-KA_P_OPEBs","App.2-L_OM&A_per_Cust_FTE","App.2-L_OM&A_per_Cust_FTEE_exp","App.2-M_Regulatory_Costs","App.2-N_Corp_Cost_Allocation","App.2-OA Capital Structure","App.2-OB_Debt Instruments","App.2-Q_Cost of Serv. Emb. Dx","App.2-R_Loss Factors","App.2-S_Stranded Meters","App.2-Y_MIFRS Summary Impacts","Sheet19","App.2-YA_IFRS Transition Costs","Sheet1"],"not_rendered":{"charts":0,"images":4,"macros":1,"external_links":11,"defined_names":634,"comments":3,"pivot_tables":0},"unopened":[],"bounds":{"document_bytes":16777216,"sheet_cells":100000,"rows_first":2000,"rows_last":500,"rows_between":2000,"halvings":0,"cell_chars":16384,"cell_head_chars":4096},"cells_cut":0,"cells_raw":0,"read":"whole","date_system":"1900"}

{"sheet":"LDC Info","index":0,"n_rows":77,"n_cols":27,"rows_kept":77,"cut":false,"hidden":false,"merged":[[45,0,45,3],[50,2,50,11],[54,2,54,12],[52,2,52,13],[27,4,27,6],[30,4,30,6],[29,0,30,3],[42,0,43,3],[38,0,39,3],[39,4,39,6],[32,0,33,3],[33,4,33,6],[35,0,36,3],[17,4,17,10],[13,4,13,10],[15,4,15,8],[19,4,19,8],[25,4,25,6],[23,4,23,6]]}
[]
[]
[null,null,null,null,null,null,null,null,null,null,null,null,null,null,null,null,null,null,null,null,null,null,null,null,null,1,"Algoma Power Inc."]
[null,null,null,null,null,null,null,null,null,null,null,null,null,null,null,null,null,null,null,null,null,null,null,null,null,2,"Atikokan Hydro Inc."]
[null,null,null,null,null,null,null,null,null,null,null,null,null,null,null,null,null,null,null,null,null,null,null,null,null,3,"Attawapiskat Power Corporation"]
[null,null,null,null,null,null,null,null,null,null,null,null,null,null,null,null,null,null,null,null,null,null,null,null,null,4,"Bluewater Power Distribution Corporation"]
[null,null,null,null,null,null,null,null,null,null,null,null,null,null,null,null,null,null,null,null,null,null,null,null,null,5,"Brantford Power Inc."]
[null,null,null,null,null,null,null,null,null,null,null,null,null,null,null,null,null,null,null,null,null,null,null,null,null,6,"Burlington Hydro Inc."]
[null,null,null,null,null,null,null,null,null,null,null,null,null,null,null,null,null,null,null,null,null,null,null,null,null,7,"Canadian Niagara Power Inc."]
[null,null,null,null,null,null,null,null,null,null,null,null,null,null,null,null,null,null,null,null,null,null,null,null,null,8,"Centre Wellington Hydro Ltd."]
[null,null,null,null,null,null,null,null,null,null,null,null,null,null,null,null,null,null,null,null,null,null,null,null,null,9,"Chapleau Public Utilities Corporation"]
[null,null,null,null,null,null,null,null,null,null,null,null,null,null,null,null,null,null,null,null,null,null,null,null,null,10,"COLLUS PowerStream Corp."]
[null,null,null,null,null,null,null,null,null,null,null,null,null,null,null,null,null,null,null,null,null,null,null,null,null,11,"Cooperative Hydro Embrun Inc."]
[null,null,null,"Utility Name   ",null,null,null,null,null,null,null,null,null,null,null,null,null,null,null,null,null,null,null,null,null,12,"E.L.K. Energy Inc."]
[null,null,null,null,null,null,null,null,null,null,null,null,null,null,null,null,null,null,null,null,null,null,null,null,null,13,"Energy + Inc."]
[null,null,null,"Assigned EB Number",null,null,null,null,null,null,null,null,null,null,null,null,null,null,null,null,null,null,null,null,null,14,"Enersource Hydro Mississauga Inc."]
[null,null,null,null,null,null,null,null,null,null,null,null,null,null,null,null,null,null,null,null,null,null,null,null,null,15,"Entegrus Powerlines Inc."]
[null,null,null,"Name of Contact and Title",null,null,null,null,null,null,null,null,null,null,null,null,null,null,null,null,null,null,null,null,null,16,"ENWIN Utilities Ltd."]
[null,null,null,null,null,null,null,null,null,null,null,null,null,null,null,null,null,null,null,null,null,null,null,null,null,17,"Erie Thames Powerlines Corporation"]
[null,null,null,"Phone Number   ",null,null,null,null,null,null,null,null,null,null,null,null,null,null,null,null,null,null,null,null,null,18,"Espanola Regional Hydro Distribution Corporation"]
[null,null,null,null,null,null,null,null,null,null,null,null,null,null,null,null,null,null,null,null,null,null,null,null,null,19,"Essex Powerlines Corporation"]
[null,null,null,"Email Address   ",null,null,null,null,null,null,null,null,null,null,null,null,null,null,null,null,null,null,null,null,null,20,"Festival Hydro Inc."]
[null,null,null,null,null,null,null,null,null,null,null,null,null,null,null,null,null,null,null,null,null,null,null,null,null,21,"Fort Albany Power Corporation"]
[null,null,null,"Test Year",2018,null,null,null,null,null,null,null,null,null,null,null,null,null,null,null,null,null,null,null,null,22,"Fort Frances Power Corporation"]
[null,null,null,null,null,null,null,null,null,null,null,null,null,null,null,null,null,null,null,null,null,null,null,null,null,23,"Greater Sudbury Hydro Inc."]
[null,null,null,"Bridge Year",{"$f":"IF(ISBLANK(E24), \"\", E24-1)","v":2017},null,null,null,null,null,null,null,null,null,null,null,null,null,null,null,null,null,null,null,null,24,"Grimsby Power Inc."]
[null,null,null,null,null,null,null,null,null,null,null,null,null,null,null,null,null,null,null,null,null,null,null,null,null,25,"Guelph Hydro Electric Systems Inc."]
[null,null,null,"Last Rebasing Year",2014,null,null,null,null,null,null,null,null,null,null,null,null,null,null,null,null,null,null,null,null,26,"Haldimand County Hydro Inc."]
[null,null,null,null,null,null,null,null,null,null,null,null,null,null,null,null,null,null,null,null,null,null,null,null,null,27,"Halton Hills Hydro Inc."]
["Identify the accounting standard used for the test year",null,null,null,null,null,null,null,null,null,null,null,null,null,null,null,null,null,null,null,null,null,null,null,null,28,"Hearst Power Distribution Company Limited"]
[null,null,null,null,null,null,null,null,null,null,null,null,null,null,null,null,null,null,null,null,null,null,null,null,null,29,"Horizon Utilities Corporation"]
[null,null,null,null,null,null,null,null,null,null,null,null,null,null,null,null,null,null,null,null,null,null,null,null,null,30,"Hydro 2000 Inc."]
["Did you update your depreciation and capitalization policies and reflect the changes in policies in a prior rebasing application?",null,null,null,null,null,null,null,null,null,null,null,null,null,null,null,null,null,null,null,null,null,null,null,null,31,"Hydro Hawkesbury Inc."]
[null,null,null,null,null,null,null,null,null,null,null,null,null,null,null,null,null,null,null,null,null,null,null,null,null,32,"Hydro One Brampton Networks Inc."]
[null,null,null,null,null,null,null,null,null,null,null,null,null,null,null,null,null,null,null,null,null,null,null,null,null,33,"Hydro One Networks Inc."]
["When did you update your actual depreciation and capitalization policies?",null,null,null,null,null,null,null,null,null,null,null,null,null,null,null,null,null,null,null,null,null,null,null,null,34,"Hydro One Networks Inc. - Norfolk"]
[null,null,null,null,"2001-01-01",null,null,null,null,null,null,null,null,null,null,null,null,null,null,null,null,null,null,null,null,35,"Hydro One Remote Communities Inc."]
[null,null,null,null,null,null,null,null,null,null,null,null,null,null,null,null,null,null,null,null,null,null,null,null,null,36,"Hydro Ottawa Limited"]
["Identify the year the applicant adopted IFRS for financial reporting purposes",null,null,null,null,null,null,null,null,null,null,null,null,null,null,null,null,null,null,null,null,null,null,null,null,37,"Innpower Corporation"]
[null,null,null,null,null,null,null,null,null,null,null,null,null,null,null,null,null,null,null,null,null,null,null,null,null,38,"Kashechewan Power Corporation"]
[null,null,null,null,null,null,null,null,null,null,null,null,null,null,null,null,null,null,null,null,null,null,null,null,null,39,"Kenora Hydro Electric Corporation Ltd."]
[null,null,null,null,null,null,null,null,null,null,null,null,null,null,null,null,null,null,null,null,null,null,null,null,null,40,"Kingston Hydro Corporation"]
["Are you applying for cost recovery for the test and/or future year(s) for Green Energy initiatives?",null,null,null,null,null,null,null,null,null,null,null,null,null,null,null,null,null,null,null,null,null,null,null,null,41,"Kitchener-Wilmot Hydro Inc."]
[null,null,null,null,null,null,null,null,null,null,null,null,null,null,null,null,null,null,null,null,null,null,null,null,null,42,"Lakefront Utilities Inc."]
[null,null,null,null,null,null,null,null,null,null,null,null,null,null,null,null,null,null,null,null,null,null,null,null,null,43,"Lakeland Power Distribution Ltd."]
[{"$f":"\"Is \" & E14 & \" an embedded distributor?\"","v":"Is  an embedded distributor?"},null,null,null,null,null,null,null,null,null,null,null,null,null,null,null,null,null,null,null,null,null,null,null,null,44,"London Hydro Inc."]
[null,null,null,null,null,null,null,null,null,null,null,null,null,null,null,null,null,null,null,null,null,null,null,null,null,45,"Midland Power Utility Corporation"]
[null,null,null,null,null,null,null,null,null,null,null,null,null,null,null,null,null,null,null,null,null,null,null,null,null,46,"Milton Hydro Distribution Inc."]
[null,"Notes",null,null,null,null,null,null,null,null,null,null,null,null,null,null,null,null,null,null,null,null,null,null,null,47,"Newmarket-Tay Power Distribution Ltd."]
[null,null,null,null,null,null,null,null,null,null,null,null,null,null,null,null,null,null,null,null,null,null,null,null,null,48,"Niagara Peninsula Energy Inc."]
[null,null,"Pale green cells represent input cells.",null,null,null,null,null,null,null,null,null,null,null,null,null,null,null,null,null,null,null,null,null,null,49,"Niagara-on-the-Lake Hydro Inc."]
[null,null,null,null,null,null,null,null,null,null,null,null,null,null,null,null,null,null,null,null,null,null,null,null,null,50,"North Bay Hydro Distribution Limited"]
[null,null,"Pale blue cells represent drop-down lists.  The applicant should select the appropriate item from the drop-down list.",null,null,null,null,null,null,null,null,null,null,null,null,null,null,null,null,null,null,null,null,null,null,51,"Northern Ontario Wires Inc."]
[null,null,null,null,null,null,null,null,null,null,null,null,null,null,null,null,null,null,null,null,null,null,null,null,null,52,"Oakville Hydro Electricity Distribution Inc."]
[null,null,"White cells contain fixed values, automatically generated values or formulae. ",null,null,null,null,null,null,null,null,null,null,{"$f":"IF(LEN($G55)>1, (SUMPRODUCT(--($C$78:$C$1000=$C55),--($A$78:$A$1000=$D55), --($B$78:$B$1000=$B55&\"_TOTAL\"), $L$78:$L$1000)), \"\")","v":""},{"$f":"IF(LEN($G55)>1, (SUMPRODUCT(--($C$78:$C$1000=$C55),--($A$78:$A$1000=$D55), --($B$78:$B$1000=$B55&\"_TOTAL\"), $M$78:$M$1000)), \"\")","v":""},null,null,null,null,null,null,null,null,null,null,53,"Orangeville Hydro Limited"]
[null,null,null,null,null,null,null,null,null,null,null,null,null,{"$f":"IF(LEN($G56)>1, (SUMPRODUCT(--($C$78:$C$1000=$C56),--($A$78:$A$1000=$D56), --($B$78:$B$1000=$B56&\"_TOTAL\"), $L$78:$L$1000)), \"\")","v":""},{"$f":"IF(LEN($G56)>1, (SUMPRODUCT(--($C$78:$C$1000=$C56),--($A$78:$A$1000=$D56), --($B$78:$B$1000=$B56&\"_TOTAL\"), $M$78:$M$1000)), \"\")","v":""},null,null,null,null,null,null,null,null,null,null,54,"Orillia Power Distribution Corporation"]
[null,null,null,null,null,null,null,null,null,null,null,null,null,"","",null,null,null,null,null,null,null,null,null,null,55,"Oshawa PUC Networks Inc."]
[null,null,null,null,null,null,null,null,null,null,null,null,null,"","",null,null,null,null,null,null,null,null,null,null,56,"Ottawa River Power Corporation"]
[null,null,null,null,null,null,null,null,null,null,null,null,null,"","",null,null,null,null,null,null,null,null,null,null,57,"Peterborough Distribution Inc."]
[null,null,null,null,null,null,null,null,null,null,null,null,null,"","",null,null,null,null,null,null,null,null,null,null,58,"PowerStream Inc."]
[null,null,null,null,null,null,null,null,null,null,null,null,null,"","",null,null,null,null,null,null,null,null,null,null,59,"PUC Distribution Inc."]
[null,null,null,null,null,null,null,null,null,null,null,null,null,"","",null,null,null,null,null,null,null,null,null,null,60,"Renfrew Hydro Inc."]
[null,null,null,null,null,null,null,null,null,null,null,null,null,"","",null,null,null,null,null,null,null,null,null,null,61,"Rideau St. Lawrence Distribution Inc."]
[null,null,null,null,null,null,null,null,null,null,null,null,null,"","",null,null,null,null,null,null,null,null,null,null,62,"Sioux Lookout Hydro Inc."]
[null,null,null,null,null,null,null,null,null,null,null,null,null,"","",null,null,null,null,null,null,null,null,null,null,63,"St. Thomas Energy Inc."]
[null,null,null,null,null,null,null,null,null,null,null,null,null,"","",null,null,null,null,null,null,null,null,null,null,64,"Thunder Bay Hydro Electricity Distribution Inc."]
[null,null,null,null,null,null,null,null,null,null,null,null,null,"","",null,null,null,null,null,null,null,null,null,null,65,"Tillsonburg Hydro Inc."]
[null,null,null,null,null,null,null,null,null,null,null,null,null,"","",null,null,null,null,null,null,null,null,null,null,66,"Toronto Hydro-Electric System Limited"]
[null,null,null,null,null,null,null,null,null,null,null,null,null,"","",null,null,null,null,null,null,null,null,null,null,67,"Veridian Connections Inc."]
[null,null,null,null,null,null,null,null,null,null,null,null,null,"","",null,null,null,null,null,null,null,null,null,null,68,"Wasaga Distribution Inc."]
[null,null,null,null,null,null,null,null,null,null,null,null,null,"","",null,null,null,null,null,null,null,null,null,null,69,"Waterloo North Hydro Inc."]
[null,null,null,null,null,null,null,null,null,null,null,null,null,"","",null,null,null,null,null,null,null,null,null,null,70,"Welland Hydro-Electric System Corp."]
[null,null,null,null,null,null,null,null,null,null,null,null,null,"","",null,null,null,null,null,null,null,null,null,null,71,"Wellington North Power Inc."]
[null,null,null,null,null,null,null,null,null,null,null,null,null,"","",null,null,null,null,null,null,null,null,null,null,72,"West Coast Huron Energy Inc."]
[null,null,null,null,null,null,null,null,null,null,null,null,null,null,null,null,null,null,null,null,null,null,null,null,null,73,"Westario Power Inc."]
[null,null,null,null,null,null,null,null,null,null,null,null,null,null,null,null,null,null,null,null,null,null,null,null,null,74,"Whitby Hydro Electric Corporation"]
[null,null,null,null,null,null,null,null,null,null,null,null,null,null,null,null,null,null,null,null,null,null,null,null,null,75,"Woodstock Hydro Services Inc."]

{"sheet":"Index","index":1,"n_rows":42,"n_cols":6,"rows_kept":42,"cut":false,"hidden":false,"merged":[[41,1,41,5]]}
[]
[]
[]
[]
[]
[]
[]
[]
[]
[]
[]
[]
[]
[]
[1,"LDC Information Sheet",null,null,27,"App.2-G: Service Reliability Indicators"]
[2,"Index",null,null,28,"App.2-H: Other Operating Revenue"]
[3,"Cost of Service Application Flowchart",null,null,29,"App.2-I: Load Forecast CDM Adjustment Workform"]
[4,"List of Key References",null,null,30,"App.2-IA: Load Forecast Data Instructions"]
[5,"App.2-A: List of Requested Approvals",null,null,31,"App.2-IB:  Actual and Forecast Load and Customer Data"]
[6,"App.2-AA: Capital Projects Table",null,null,32,"App.2-JA: OM&A Summary Analysis"]
[7,"App.2-AB: Capital Expenditures",null,null,33,"App.2-JB: Recoverable OM&A Cost Driver Table"]
[8,"App. 2-AC: Customer Engagement Worksheet",null,null,34,"App.2-JC: OM&A Programs Table"]
[9,"App.2-B: General Accounting Instructions",null,null,35,"App.2-K: Employee Costs"]
[10,"App.2-BA: Fixed Asset Continuity Schedule",null,null,36,"App.2-KA: OPEBs (Other Post-Employment Benefits) Costs"]
[11,"Appendix 2-BB: Service Life Comparison",null,null,37,"App.2-L: Recoverable OM&A Cost per Customer and per FTE"]
[12,"App.2-CA: Year 1 Depreciation and Amortization Expense (Old CGAAP)",null,null,38,"App.2-M: Regulatory Costs Schedule"]
[13,"App.2-CB: Year 1 Depreciation and Amortization Expense (New CGAAP)",null,null,39,"App.2-N: Shared Services and Corporate Cost Allocation"]
[14,"App.2-CC: Year 2 Depreciation and Amortization Expense (New CGAAP)",null,null,40,"App.2-OA: Capital Structure and Cost of Capital"]
[15,"App.2-CD: Year 3 Depreciation and Amortization Expense (New CGAAP or MIFRS)",null,null,41,"App.2-OB: Debt Instruments"]
[16,"App.2-CE: Year 4 Depreciation and Amortization Expense (MIFRS)",null,null,42,"App.2-Q: Cost of Serving Embedded Distributor(s)"]
[17,"App.2-CF: Year 5 Depreciation and Amortization Expense (MIFRS)",null,null,43,"App.2-R: Loss Factors"]
[18,"App.2-CG: Year 6 Depreciation and Amortization Expense (Old CGAAP)",null,null,44,"App.2-S: Stranded Meter Treatment"]
[19,"App.2-CH: Depreciation and Amortization Expense (MIFRS)",null,null,45,"App.2-Y: Transition to MIFRS Summary Impact"]
[20,"App.2-D: Overhead Expenses",null,null,46,"App.2-YA: One-Time Incremental IFRS Transition Costs"]
[21,"App.2-EA: Account 1575 PP&E Deferral Account (2015 IFRS Adopters)"]
[22,"App.2-EB: Account 1576 - Accounting Changes Under CGAAP (2012 Changes)"]
[23,"App.2-EC: Account 1576 - Accounting Changes Under CGAAP (2013 Changes)"]
[24,"App.2-FA: Renewable Generation Connection Investment Summary"]
[25,"App.2-FB: Calculation of Renewable Generation Connection Direct Benefits/Provincial Amount: Renewable Enabling Improvement Investments"]
[26,"App.2-FC: Calculation of Renewable Generation Connection Direct Benefits/Provincial Amount: Renewable Expansion Investments"]
[]
["Note:","Appendices for the Tariff of Rates and Charges at Current and Proposed Rates, and for the Bill Impacts are now in a separate spreadsheet model. These appendices were formerly 2-Z and 2-W."]

{"sheet":"COS Flowchart","index":2,"n_rows":6,"n_cols":2,"rows_kept":6,"cut":false,"hidden":false,"merged":[[5,1,5,6],[2,1,2,6],[3,1,3,6]]}
[]
[]
[]
[null,"Cost of Service Rate Application Schematic"]
[]
[null,"The Cost of Service Rate Application Schematic is a flowchart that is included as a guide for the components of an application. The schematic demonstrates how demand and costs interrelate to derive the revenue requirement and how the revenue requirement is allocated between classes and through fixed/variable splits to derive rates that will be compensatory for the annual revenue requirement, based on the the forecasted demand.  There is no form to be filled out; therefore, this Schedule is not required to be filed."]

{"sheet":"List of Key References","index":3,"n_rows":5,"n_cols":2,"rows_kept":5,"cut":false,"hidden":false,"merged":[[2,1,2,11],[4,0,4,11]]}
[]
[]
[null,"List of Key References"]
[]
["A list of key references for understanding the Filing Requirements has been embedded in the document below. To access the list of references and associated hyperlinks double-click the icon below."]

{"sheet":"App.2-A_Requested_Approvals","index":4,"n_rows":38,"n_cols":6,"rows_kept":38,"cut":false,"hidden":false,"merged":[[8,1,8,7],[33,5,33,7],[35,5,35,7],[37,5,37,7],[39,5,39,7],[9,1,9,7],[41,5,41,7],[11,1,11,7],[29,5,29,7],[23,5,23,7],[25,5,25,7],[27,5,27,7],[31,5,31,7],[21,5,21,7],[13,1,13,7],[15,1,15,7],[17,1,17,7],[19,5,19,7]]}
[]
[]
[]
[]
[]
[]
[]
[]
[null,"Appendix 2-A"]
[null,"List of Requested Approvals"]
[]
[null,"The distributor must fill out the following sheet with the complete list of specific approvals requested and relevant section(s) of the legislation must be provided. All approvals, including accounting orders (deferral and variance accounts) new rate classes, revised specific service charges or retail service charges which the applicant is seeking, must be separately identified, as well being clearly documented in the appropriate sections of the application."]
[]
[null,"Additional requests may be added by copying and pasting blank input rows, as needed."]
[]
[null,"If additional requests arise, or requested approvals are removed, during the processing of the application, the distributor should update this list."]
[]
[null,{"$f":"CONCATENATE('LDC Info'!E14,\" is seeking the following approvals in this application:\")","v":" is seeking the following approvals in this application:"}]
[]
[null,1,null,null,null,"Approval to charge distribution rates effective January 1, 2018 to recover a service revenue requirement of $1,107,885 which includes a revenue deficiency of $198,507 as detailed in Exhibit 6.  The schedule of proposed rates is set out in Exhibit 8."]
[]
[null,2,null,null,null,"Approval of the Distribution System Plan as outlined in Exhibit 2 Section 2.5.2"]
[]
[null,3,null,null,null,"Approval of a revised Microfit monthly service charge as outlined in Exhibit 3 and 8.  "]
[]
[null,4,null,null,null,"Approval to adjust the Retail Transmission Rates – Network and Connection as detailed in Exhibit 8.  "]
[]
[null,5,null,null,null," Approval of the proposed loss factors as detailed in Exhibit 8."]
[]
[null,6,null,null,null,"Approval to continue to charge Wholesale Market and Rural Rate Protection Charges approved in the Board Decision and Order in the matter of CHEI 2017 Distribution Rates (EB-2016-0062)."]
[]
[null,7,null,null,null,"Approval to continue the Specific Service Charges, Retail Service Charges, and Transformer Allowance approved in the Board Decision and Order in the matter of CHEI’s 2017 Distribution Rates (EB-2016-0065)."]
[]
[null,8,null,null,null,"Approval of the rate riders for a one year disposition of the Group 1 and Group 2 and Other Deferral and Variance Accounts as detailed in Exhibit 9."]
[]
[null,9,null,null,null,"Approval to dispose of balances in the LRAM variance account as presented in Exhibit 9."]
[]
[null,10,null,null,null,"Such other approvals that CHEI may request and that the OEB accepts."]

{"sheet":"App.2-AA_Capital Projects","index":5,"n_rows":254,"n_cols":10,"rows_kept":254,"cut":false,"hidden":false,"merged":[[8,0,8,9],[9,0,9,9]]}
[null,null,null,null,null,{"$f":"EBNUMBER","v":0}]
[]
[]
[]
[]
[]
[]
[]
["Appendix 2-AA"]
["Capital Projects Table"]
[]
["Reporting Basis","Reporting Basis",null,"CGAAP","NEWGAAP","NEWGAAP","MIFRS","CGAAP","MIFRS","MIFRS"]
["Projects","Projects","USoA ",2012,2013,2014,2015,2016,2017,2018]
[]
["System Access","System Access"]
[null,"New O/H and U/G services",1855,5074]
[]
[null,"New O/H and U/G services",1855,null,5000]
[]
[null,"New O/H and U/G services",1855,null,null,12464]
[null,"Subdivision Faubourg Ste-Marie",1845,null,null,692811]
[null,"Subdivision Faubourg Ste-Marie",1850,null,null,288934]
[null,"Pumping Station Ste-Marie",1830,null,null,10425]
[null,"Pumping Station Ste-Marie",1835,null,null,10425]
[null,"Oligo Project East Entrance",1835,null,null,6577]
[null,"Oligo Project West Entrance",1835,null,null,5298]
[null,"Subdivision Faubourg Ste-Marie Relocate pole",1835,null,null,20181.5]
[null,"Line Relocated 950 Notre-Dame",1835,null,null,10000]
[null,"4th Feeder Cloutier Drive",1830,null,null,43996.37]
[null,"4th Feeder Cloutier Drive",1835,null,null,23362]
[null,"New Meter",1860,null,null,25716]
[]
[]
[]
[null,"New O/H and U/G services",1855,null,null,null,15074]
[null,"New Meters",1860,null,null,null,9244]
[null,"Oligo - Promenade Quatres Saison Project",1850,null,null,null,110238]
[null,"Oligo - Promenade Quatres Saison Project(Professional Fees)",1845,null,null,null,1864.25]
[null,"Oligo - Promenade Quatres Saison Project(Engineer)",1845,null,null,null,5898]
[null,"Oligo - Promenade Quatres Saison Project(Bollards)",1845,null,null,null,30774.2]
[null,"Oligo - Promenade Quatres Saison Project(Distribution System)",1845,null,null,null,35000]
[null,"Oligo - Promenade Quatres Saison Project(Distribution System)",1845,null,null,null,54875]
[null,"Oligo - Promenade Quatres Saison Project(Distribution System)",1845,null,null,null,694]
[null,"Oligo - Promenade Quatres Saison Project(Distribution System)",1845,null,null,null,525]
[null,"Enginneer Cost 4th Switching Cabinet",1820,null,null,null,73810]
[]
[]
[null,"New O/H and U/G services",1855,null,null,null,null,22175]
[null,"Facilities to New Bell pole",1835,null,null,null,null,2230.5]
[null,"Relocate Span Guy , Down Guy and Overhead Triplex",1835,null,null,null,null,2342]
[null,"New Measurement Units",1860,null,null,null,null,1321.46]
[null,"Oligo - Promenade Grounding all Metal objects",1845,null,null,null,null,1905.5]
[null,"New Meters",1860,null,null,null,null,5491.8]
[null,"Engineer Devcor",1845,null,null,null,null,1069]
[null,"Consultation ST-Jacques St. (Relocate Line)",1835,null,null,null,null,1907.46]
[null,"Relocate 2 U/G service",1845,null,null,null,null,12877.04]
[" ","New Meter",1860,null,null,null,null,507.6]
[null,"Gateway Communication",1860,null,null,null,null,558.71]
[null,"4th Feeder Ste-Marie",1830,null,null,null,null,28750]
[null,"4th Feeder Ste-Marie",1835,null,null,null,null,100000]
[null,"Installed Composite Crossarm",1835,null,null,null,null,3119.4]
[null,"Transformer Pharmacie JC",1850,null,null,null,null,2895]
[null,"Engineer Cost New Substation",1820,null,null,null,null,50012.77]
[null,"Pole Information",1830,null,null,null,null,3900]
[null,"Nameplate Pole Number",1830,null,null,null,null,1125]
[null,"Pole Information",1830,null,null,null,null,7524]
[null,"4th Feeder Notre-Dame",1830,null,null,null,null,28000]
[null,"4th Feeder Notre-Dame",1835,null,null,null,null,90850]
[null,"Load Flow Study",1835,null,null,null,null,12917.67]
[null,"Load Flow Study",1845,null,null,null,null,12917.77]
[null,"Overhead Amps Verification",1850,null,null,null,null,2722.5]
[null,"Transformer Data Collection",1850,null,null,null,null,2112]
[]
[]
[]
[]
[]
[]
[null,"New O/H and U/G services",1855,null,null,null,null,null,20000]
[null,"Meters",1860,null,null,null,null,null,8000]
[null,"Versaille III Project",1850,null,null,null,null,null,20675]
[null,"Versaille III Project",1845,null,null,null,null,null,160025]
[null,"New Substation - 1820",1820,null,null,null,null,null,1487396]
[null,"Engineer Consultant Substation 1820",1820,null,null,null,null,null,30000]
[]
[]
[null,"New O/H and U/G services",1855,null,null,null,null,null,null,20000]
[null,"Meters",1860,null,null,null,null,null,null,8000]
[null,"Replace pole with new 45` ",1830,null,null,null,null,null,null,6500]
[]
[]
[]
[]
[null,"Sub-Total  System Access ",null,{"$f":"SUM(D16:D89)","v":5074},5000,1150189.8700000001,337996.45,399232.18,1726096,34500]
["Contributed Capital"]
[null,null,1995,-1600,-8000,-905202,-148144,-6450,-132000," "]
[]
[]
[]
[null,"Contributed Capital",null,{"$f":"SUM(D96:D99)","v":-1600},-8000,-905202,-148144,-6450,-132000,0]
["Total  System Access","Total System Access",null,{"$f":"SUM(D94)+SUM(D100)","v":3474},-3000,244987.87000000011,189852.45,392782.18,1594096,34500]
[]
[]
["System Renewal","System Renewal","USoA ",2012,2013,2014,2015,2016,2017,2018]
[null,"Transformers Program (Elbow and Inserts)",1850,null,null,null,1879.25]
[null,"Transformers Program (Elbow and Inserts)",1850,null,null,null,12583]
[null,"Installation culverts",1820,null,null,null,1600]
[null," REPLACEMENT ROTTEN POLE  20 Bourrasa",1830,null,null,null,2662.5]
[null," REPLACE CONDUCTOR DEVICE 20 Bourrasa",1835,null,null,null,885]
[]
[null,"Future Addition Transformers and Replacement",1850,null,null,null,null,10045]
[null,"Straighten 2 dip poles and installed culvert",1835,null,null,null,null,12206.58]
[null,"Transformers Program (Elbow and Inserts)",1850,null,null,null,null,21844]
[]
[null,"Transformers Program (Elbow and Inserts)",1850,null,null,null,null,null,20000]
[]
[null,"Pole Repalcement  # 11 - 1830",1830,null,null,null,null,null,null,6800]
[null,"Pole Repalcement  # 48 - 1830",1830,null,null,null,null,null,null,4500]
[null,"Pole Repalcement  # 81 - 1830",1830,null,null,null,null,null,null,6500]
[null,"Pole Repalcement  # 108 -1830",1830,null,null,null,null,null,null,6200]
[null,"Pole Repalcement  # 139 - 1830",1830,null,null,null,null,null,null,6500]
[null,"Pole Repalcement  # 353 -1830",1830,null,null,null,null,null,null,2500]
[null,"Pole Repalcement  # 415 -1830",1830,null,null,null,null,null,null,4500]
[null,"Pole Repalcement  # 465 -1830",1830,null,null,null,null,null,null,4000]
[null,"Transformer Replacement #  431    -1850",1850,null,null,null,null,null,null,4875]
[null,"Transformer Replacement #  456    -1850",1850,null,null,null,null,null,null,5575]
[null,"Transformer Replacement # 474    -1850",1850,null,null,null,null,null,null,5135]
[null,"Transformer Replacement #  501    -1850",1850,null,null,null,null,null,null,5775]
[null,"Transformer Replacement # 504   -1850",1850,null,null,null,null,null,null,2725]
[null,"Transformer Replacement #  506    -1850",1850,null,null,null,null,null,null,4835]
[null,"Transformer Replacement #  520  -1850",1850,null,null,null,null,null,null,5035]
[null,"Transformer Replacement #  522   -1850",1850,null,null,null,null,null,null,3825]
[null,"Transformer Replacement #  525   -1850",1850,null,null,null,null,null,null,5675]
[null,"Transformer Replacement # 550    -1850",1850,null,null,null,null,null,null,2725]
[null,"Transformer Replacement # 35    -1850",1850,null,null,null,null,null,null,8100]
[null,"Transformers Program (Elbow and Inserts)",1850,null,null,null,null,null,null,20000]
[]
[]
[]
[null,"Sub-Total  System Renewal",null,{"$f":"SUM(D105:D136)","v":0},0,0,19609.75,44095.58,20000,115780]
["Contributed Capital"]
[null,null,1995]
[null,null,null,null,null,null,null,null,null,-5775]
[]
[]
[null,"Contributed Capital",null,{"$f":"SUM(D142:D145)","v":0},0,0,0,0,0,-5775]
["Total  System Renewal","Total System Renewal",null,{"$f":"SUM(D140)+SUM(D146)","v":0},0,0,19609.75,44095.58,20000,110005]
[]
[]
["System Service","System Service","USoA ",2012,2013,2014,2015,2016,2017,2018]
[null,"Pole Replacement",1830,3098.1]
[null,"Barriers for Transformers",1845,942.5]
[]
[null,"Pole replacement",1830,null,29050]
[null,"Transformers for replacing ",1850,null,12000]
[]
[null,"Pole Replacement 65 Forget Street",1830,null,null,5400]
[null,"Pole Replacement 1287 St-Jacques Street",1830,null,null,9850]
[null,"Pole Replacement 1179 Notre-Dame Street",1830,null,null,5500]
[null,"Pole Replacement 1216 Ste Marie Street",1830,null,null,3800]
[null,"Pole Replacement 1154 Notre-Dame Street",1830,null,null,8600]
[]
[]
[]
[]
[null,"Communication Modem",1860,null,null,null,null,643.16999999999996]
[null,"Phase Balancing",1835,null,null,null,null,1425]
[null,"Pole Replacement Entrance Elementry School",1830,null,null,null,null,4800]
[null,"In-Line Switches Remove -Blais Notre-Dame and Centenaire",1835,null,null,null,null,2396]
[]
[null,"Four Way Tie In Switch 1835",1835,null,null,null,null,null,39650]
[null,"336 MCM Conductors 1835",1835,null,null,null,null,null,46250]
[]
[]
[null,"Sub-Total  System Service",null,{"$f":"SUM(D151:D172)","v":4040.6},41050,33150,0,9264.17,85900,0]
["Contributed Capital"]
[null,null,1995]
[]
[]
[]
[null,"Contributed Capital",null,{"$f":"SUM(D177:D180)","v":0},0,0,0,0,0,0]
["Total  System Service","Total System Service",null,{"$f":"SUM(D175)+SUM(D181)","v":4040.6},41050,33150,0,9264.17,85900,0]
[]
[]
["General Plant","General Plant","USoA ",2012,2013,2014,2015,2016,2017,2018]
[null,"Hydro Vac Dip Pole 4th Feeders",1845,4898.5]
[null,"Future Addition Transformers and Replacement",1850,36088]
[null,"Ssmart meter deployment",1860,310212]
[null,"Stranded Meter",1860,-79072]
[null,"Smart Meter Toll Deployment",1940,4205]
[null,"New Computer",1920,2745.57]
[]
[null,"Grouding Study Substation",1820,null,10000]
[null,"Add New Switching Cabinet",1820,null,52400]
[null,"Ste-Therese Street 4th Feeder",1830,null,54800]
[null,"Ste-Therese Street 4th Feeder",1835,null,58750]
[null,"U/G Cable Substation to Ste-Therese",1845,null,52400]
[null,"Cell phone",1915,null,1500]
[null,"Computert Equipment Hardware Battery Back-up",1920,null,1500]
[null,"MOE Standard Bill Print",1611,null,25000]
[null,"Antivirus Protection",1611,null,1500]
[]
[null,"Time Clock Employee",1915,null,null,633]
[null,"Note Pad Computer",1920,null,null,430]
[null,"Harris Version 6.4",1611,null,null,20885]
[null,"Webpresentment",1611,null,null,16549.37]
[null,"Anti-Spam Consentment",1611,null,null,1419.95]
[null,"Software Upgrade Computer Office",1611,null,null,1651.03]
[]
[null,"New Cell Phone",1915,null,null,null,571]
[null,"New Camera ",1915,null,null,null,391]
[null,"New Computer Station",1920,null,null,null,1385]
[null,"Antivirus Software",1611,null,null,null,466]
[null,"ORPC- Membership Module",1611,null,null,null,840]
[]
[null,"Office Accessories",1915,null,null,null,null,1000]
[null,"Computert Equipment Hardware New Printer",1920,null,null,null,null,1839.95]
[null,"Computer Screen",1920,null,null,null,null,320]
[null,"Drill -Pole Inspection",1945,null,null,null,null,7415]
[null,"Ergotron Standing Desk",1915,null,null,null,null,563.15]
[null,"Upgrade CIS",1611,null,null,null,null,840]
[null,"Upgrade CIS",1611,null,null,null,null,525]
[]
[]
[]
[]
[]
[null,"Website - 1611",1611,null,null,null,null,null,3000]
[null,"Antivirus - 1611",1611,null,null,null,null,null,1500]
[null,"Office Equipment 1915",1915,null,null,null,null,null,1000]
[null,"Computer & Hardware -1920",1920,null,null,null,null,null,1500]
[]
[]
[]
[]
[]
[null,"Software - 1611",1611,null,null,null,null,null,null,3000]
[null,"Office Equipment 1915",1915,null,null,null,null,null,null,1200]
[null,"Computer & Hardware -1920",1920,null,null,null,null,null,null,1500]
[]
[null,"Sub-Total  General Plant",null,{"$f":"SUM(D186:D240)","v":279077.07},257850,41568.349999999991,3653,12503.1,7000,5700]
["Contributed Capital"]
[null,null,1995]
[]
[]
[]
[null,"Contributed Capital",null,{"$f":"SUM(D243:D246)","v":0},0,0,0,0,0,0]
["Total  System Service","Total System Service",null,{"$f":"SUM(D241)+SUM(D247)","v":279077.07},257850,41568.349999999991,3653,12503.1,7000,5700]
[]
["Total Capital Expenditures",null,null,{"$f":"D101+D147+D182+D248","v":286591.67},295900,319706.22000000009,213115.2,458645.02999999997,1706996,150205]
[]
["Reconciliation to yearly additions",null,null,286592,295900,{"$f":"F103+F149+F184+F250","v":319706.22000000009},{"$f":"G103+G149+G184+G250","v":213115.2},{"$f":"H103+H149+H184+H250","v":458645.02999999997},{"$f":"I103+I149+I184+I250","v":1706996},{"$f":"J103+J149+J184+J250","v":150205}]
["Variance to yearly additions",null,null,null,null,{"$f":"F250-F252","v":0},{"$f":"G250-G252","v":0},0,0,0]
[null,null,null,"* Note: Variance over $100 will be highlighted in red"]

{"sheet":"App.2-AB_Capital Expenditures","index":6,"n_rows":35,"n_cols":21,"rows_kept":35,"cut":false,"hidden":false,"merged":[[24,0,24,20],[32,0,33,20],[35,0,36,20],[34,0,34,20],[27,0,27,20],[28,0,28,20],[29,0,30,20],[31,0,31,20],[25,0,25,7],[15,16,15,20],[12,0,15,0],[12,1,12,15],[15,1,15,2],[15,4,15,5],[15,7,15,8],[15,10,15,11],[15,13,15,14],[12,16,12,20],[13,1,13,3],[13,4,13,6],[13,18,14,18],[13,19,14,19],[13,20,14,20],[8,0,8,20],[9,0,9,20],[13,7,13,9],[13,10,13,12],[13,13,13,15],[13,16,14,16],[13,17,14,17]]}
[null,null,null,null,null,null,null,null,null,null,null,null,null,null,null,null,null,null,"File Number:",null,{"$f":"EBNUMBER","v":0}]
[null,null,null,null,null,null,null,null,null,null,null,null,null,null,null,null,null,null,"Exhibit:"]
[null,null,null,null,null,null,null,null,null,null,null,null,null,null,null,null,null,null,"Tab:"]
[null,null,null,null,null,null,null,null,null,null,null,null,null,null,null,null,null,null,"Schedule:"]
[null,null,null,null,null,null,null,null,null,null,null,null,null,null,null,null,null,null,"Page:"]
[]
[null,null,null,null,null,null,null,null,null,null,null,null,null,null,null,null,null,null,"Date:"]
[]
["Appendix 2-AB"]
["Table 2 - Capital Expenditure Summary from Chapter 5 Consolidated\nDistribution System Plan Filing Requirements"]
[]
["First year of Forecast Period:",{"$f":"TestYear","v":2018}]
["CATEGORY","Historical Period (previous plan1 & actual)",null,null,null,null,null,null,null,null,null,null,null,null,null,null,"Forecast Period (planned)"]
[null,{"$f":"E14-1","v":2013},null,null,{"$f":"H14-1","v":2014},null,null,{"$f":"K14-1","v":2015},null,null,{"$f":"N14-1","v":2016},null,null,{"$f":"Q14-1","v":2017},null,null,{"$f":"B12","v":2018},{"$f":"Q14+1","v":2019},{"$f":"R14+1","v":2020},2021,2022]
[null,"Plan","Actual","Var","Plan","Actual","Var","Plan","Actual","Var","Plan","Actual","Var","Plan","Actual2","Var"]
[null,"$ '000",null,"%","$ '000",null,"%","$ '000",null,"%","$ '000",null,"%","$ '000",null,"%","$ '000"]
["System Access","n/a",233350,{"$f":"IF(ISERROR((C17-B17)/B17),\"--\",(C17-B17)/B17)","v":"--"},0,1150190,{"$f":"IF(ISERROR((F17-E17)/E17),\"--\",(F17-E17)/E17)","v":"--"},0,337996,{"$f":"IF(ISERROR((I17-H17)/H17),\"--\",(I17-H17)/H17)","v":"--"},0,399233,{"$f":"IF(ISERROR((L17-K17)/K17),\"--\",(L17-K17)/K17)","v":"--"},1726096,0,{"$f":"IF(ISERROR((O17-N17)/N17),\"--\",(O17-N17)/N17)","v":-1},34500,135000,53000,53000,78000]
["System Renewal","n/a",41050,{"$f":"IF(ISERROR((C18-B18)/B18),\"--\",(C18-B18)/B18)","v":"--"},0,33150,{"$f":"IF(ISERROR((F18-E18)/E18),\"--\",(F18-E18)/E18)","v":"--"},0,19609,{"$f":"IF(ISERROR((I18-H18)/H18),\"--\",(I18-H18)/H18)","v":"--"},0,44096,{"$f":"IF(ISERROR((L18-K18)/K18),\"--\",(L18-K18)/K18)","v":"--"},20000,0,{"$f":"IF(ISERROR((O18-N18)/N18),\"--\",(O18-N18)/N18)","v":-1},115780,20000,60000,62000,40000]
["System Service","n/a",0,"--",0,0,"--",0,0,"--",0,9264,"--",85900,0,-1,0,0,0,0,0]
["General Plant","n/a",29500,"--",0,41568,"--",0,3653,"--",0,12503,"--",7000,0,-1,5700,5700,5700,5700,5700]
["TOTAL EXPENDITURE",{"$f":"SUM(B17:B20)","v":0},{"$f":"SUM(C17:C20)","v":303900},"--",474595,1224908,1.5809542873397318,265000,361258,0.36323773584905661,425000,465096,9.4343529411764701E-2,1838996,0,-1,155980,160700,118700,120700,{"$f":"SUM(U17:U20)","v":123700}]
["System O&M",null,56969,"--",null,73506,"--",null,66015,"--",null,80432,"--",86475,0,-1,93984,96334,98742,101201,103741]
[]
["Notes to the Table:"]
["1. Historical “previous plan” data is not required unless a plan has previously been filed. However, use the last Board-approved, at least on a Total (Capital) Expenditure basis for the last cost of service rebasing year, and the applicant should include their planned budget in each subsequent historical year up to and including the Bridge Year."]
["2. Indicate the number of months of 'actual' data included in the last year of the Historical Period (normally a 'bridge' year):"]
[]
["Explanatory Notes on Variances (complete only if applicable)"]
["Notes on shifts in forecast vs. historical budgets by category"]
[]
[]
["Notes on year over year Plan vs. Actual variances for Total Expenditures"]
[]
[]
["Notes on Plan vs. Actual variance trends for individual expenditure categories"]

{"sheet":"App.2-AC_Customer Engagement","index":7,"n_rows":45,"n_cols":3,"rows_kept":45,"cut":false,"hidden":false,"merged":[[9,0,9,2],[8,0,8,2]]}
[null,"File Number:",{"$f":"EBNUMBER","v":0}]
[null,"Exhibit:"]
[null,"Tab:"]
[null,"Schedule:"]
[null,"Page:"]
[]
[null,"Date:"]
[]
["Appendix 2-AC"]
["Customer Engagement Activities Summary"]
[]
["Provide a list of customer engagement activities","Provide a list of customer needs and preferences identified through each engagement activity","Actions taken to respond to identified needs and preferences.  If no action was taken, explain why."]
[" Newsletter"," No comments received"," No action required"]
[" Annual General Assembly meeting"," No comments on proposed capital budget."," No action required"]
[" Customer Satisfaction Survey"," List of comments is presented at Appendix C of Exhibits 1 ","Comments were address on the utility’s website and notice posted on social media."]
[]
["Updated website to include capital projects","No comments received to date","No action required"]
[]
[]
[]
[]
[]
[]
[]
[]
[]
[]
[]
[]
[]
[]
[]
[]
[]
[]
[]
[]
[]
[]
[]
[]
[]
[]
[]
["Note:  Use \"ALT-ENTER\" to go to the next line within a cell"]

{"sheet":"App.2-B_Acctg Instructions","index":8,"n_rows":73,"n_cols":7,"rows_kept":73,"cut":false,"hidden":false,"merged":[[63,0,64,12],[72,0,72,12],[0,0,0,10],[1,0,1,10],[5,0,5,10],[31,0,33,10],[31,11,33,18],[39,0,41,10],[39,11,41,18],[25,0,27,10],[10,0,16,0],[8,4,8,5],[18,0,18,9],[19,0,19,8],[48,1,50,12],[52,1,53,12],[20,0,20,8],[51,1,51,12],[58,1,58,12],[59,1,59,12],[62,1,62,11],[75,0,75,10],[75,11,75,18],[76,0,76,10],[76,11,76,18],[85,0,85,10],[85,11,85,18],[86,0,86,10],[86,11,86,18],[87,0,87,10],[77,11,77,18],[77,0,77,10],[78,11,78,18],[79,0,79,10],[79,11,79,18],[80,0,80,10],[80,11,80,18],[81,0,81,10],[81,11,81,18],[87,11,87,18],[82,0,82,10],[82,11,82,18],[83,0,83,10],[83,11,83,18],[84,0,84,10],[91,0,91,10],[91,11,91,18],[93,0,93,10],[84,11,84,18],[92,0,92,10],[92,11,92,18],[90,0,90,10],[90,11,90,18],[88,0,88,10],[88,11,88,18],[89,0,89,10],[89,11,89,18],[95,11,95,18],[96,0,96,10],[96,11,96,18],[97,0,97,10],[97,11,97,18],[93,11,93,18],[94,0,94,10],[94,11,94,18],[102,11,102,18],[128,0,128,10],[128,11,128,18],[125,0,125,10],[125,11,125,18],[126,0,126,10],[126,11,126,18],[127,0,127,10],[127,11,127,18],[122,0,122,10],[122,11,122,18],[123,0,123,10],[123,11,123,18],[124,0,124,10],[124,11,124,18],[120,0,120,10],[120,11,120,18],[121,0,121,10],[121,11,121,18],[116,0,116,10],[116,11,116,18],[117,0,117,10],[117,11,117,18],[118,0,118,10],[118,11,118,18],[115,0,115,10],[115,11,115,18],[110,0,110,10],[110,11,110,18],[111,0,111,10],[111,11,111,18],[112,0,112,10],[112,11,112,18],[119,0,119,10],[119,11,119,18],[113,0,113,10],[113,11,113,18],[114,0,114,10],[114,11,114,18],[107,0,107,10],[107,11,107,18],[108,0,108,10],[108,11,108,18],[109,0,109,10],[109,11,109,18],[104,0,104,10],[104,11,104,18],[105,0,105,10],[105,11,105,18],[106,0,106,10],[106,11,106,18],[103,0,103,10],[103,11,103,18],[98,0,98,10],[98,11,98,18],[99,0,99,10],[99,11,99,18],[100,0,100,10],[100,11,100,18],[101,0,101,10],[101,11,101,18],[102,0,102,10]]}
["General Instructions to MIFRS Appendices"]
["Types of Schedules to File"]
[]
["The purpose of this tab is to provide general instructions.  The specific instructions to each appendix are listed in footnotes of each appendix."]
[]
["The typical applicant is expected to have made capitalization and depreciation policy changes under CGAAP as permitted by the Board on January 1, 2012 or mandated by the Board by January 1, 2013, and adopted IFRS for reporting purposes on January 1, 2015 (transition date January 1, 2014).  Some distributors filing for 2017 rates have rebased with these accounting changes reflected in a prior rebasing application.  If that is the case, information relating to pre-accounting policy changes is not generally required.  The information to be provided by applicants will depend on when the accounting policy changes were made and when they last rebased.  In general, applicants should provide the following information in the appendices: "]
[]
[]
[null,null,null,null,"Reflecting Accounting Policy Changes in Current Application",null,"Reflected Accounting Policy Changes in Prior Application3"]
[null,null,null,null,"Accounting Policy Changes in 2012 and Adopted IFRS in 2015","Accounting Policy Changes in 2013 and Adopted IFRS in 2015","Adopted IFRS in 2015"]
["Information to be filed in 2017 CoS Application",2017,"Test",null,"MIFRS","MIFRS","MIFRS"]
[null,2016,"Bridge",null,"MIFRS","MIFRS","MIFRS"]
[null,2015,"Historical",null,"MIFRS","MIFRS","MIFRS"]
[null,2014,"Historical",null," MIFRS and Revised CGAAP1"," MIFRS and Revised CGAAP1"," MIFRS and Revised CGAAP1"]
[null,2013,"Historical",null,"Revised CGAAP","CGAAP and Revised CGAAP2","Rebased under Revised CGAAP"]
[null,2012,"Historical",null,"CGAAP and Revised CGAAP2","CGAAP","Rebased under Revised CGAAP"]
[null,"Prior","Historicals",null,"Rebased under CGAAP","Rebased under CGAAP","N/A"]
[]
["1)  For the transition year (2014), the applicant may file two appendices, one under Revised CGAAP and one under MIFRS, depending on the materiality of impacts.  See the specific instructions under each appendix below for further details."]
["2) For applicants that are reflecting accounting policy changes for the first time in a rebasing application, the applicant must file two appendices in the year that the applicant implemented changes to its capitalization and depreciation policies (2012 or 2013), one before and one after the policy changes."]
["3) Applicants should provide CGGAP and Revised CGAAP schedules (i.e. as indicated in the first two columns of the above table) to support balances in Account 1576 if the account has yet to be disposed of."]
[]
["Appendix 2-BA - Fixed Asset Schedule "]
[]
["Applicants are to provide Appendix 2-BA in accordance with the years and corresponding accounting standards noted in the above table to provide a year over year continuity in fixed assets."]
["For the transition year (2014), the applicant should file two appendices, one under Revised CGAAP and one under MIFRS if the change between Revised CGAAP and MIFRS is material.  If the change from the accounting standards is not material, the applicant may choose to only provide one appendix under MIFRS.  However, the applicant must also indicate the fixed asset net book value balance under Revised CGAAP, the total dollar value of the change and explain why it is not material."]
[]
[]
[]
["Regulatory Gross Assets of Property, Plant and Equipment"]
[]
["For an applicant that adopted IFRS on January 1, 2015 for financial reporting purposes, the applicant must establish the continuity of historic cost by using the December 31, 2013 regulatory gross assets of property, plant and equipment as the opening January 1, 2014 regulatory gross assets.  The applicant must provide schedules (including Appendix 2-BA, Fixed Asset Continuity Schedule) which must identify the following details to substantiate the continuity of historic cost for regulatory purposes: "]
[]
[]
["·         December 31, 2013 regulatory gross assets of property, plant and equipment, by asset class; and"]
["·         January 1, 2014 regulatory gross assets of property, plant and equipment, by asset class."]
[]
["Accumulated Depreciation"]
[]
["For an applicant that adopted IFRS on January 1, 2015 for financial reporting purposes, the applicant must establish the continuity of historic cost by using the December 31, 2013 regulatory accumulated depreciation as the opening January 1, 2014 regulatory accumulated depreciation.  The applicant must provide schedules (including Appendix 2-BA, Fixed Asset Continuity Schedule) which must identify the following details to substantiate the continuity of historic cost for regulatory purposes: "]
[]
[]
["·         December 31, 2013 regulatory accumulated depreciation, by asset class; and"]
["·         January 1, 2014 regulatory accumulated depreciation, by asset class."]
[]
["Appendix 2-Cx - Depreciation and Amortization "]
[]
["Applicants are to provide Appendix 2-Cx in accordance with the years and corresponding accounting standards listed in the above table.  "]
["·       ","If an applicant is reflecting changes to its depreciation policies for the first time in a rebasing application, the applicant should complete Appendix 2-CA to 2-CG (changes made in 2012) or Appendix 2-CA to 2-CF (changes made in 2013).   In this set of appendices, the applicant will need to indicate the year it made the accounting policy changes.  The applicant must provide data starting from the year it made changes to its capitalization and depreciation policies."]
[]
[]
[null,"*Depreciation accounting policy changes were mandated by the Board by January 1, 2013. In general, no further changes to an applicant's depreciation policy (i.e.  assets' service lives) are expected after the Board mandated changes by January 1, 2013.  The set of Appendix 2-CA to 2-CG assumes this to be the case.  If the applicant has made any changes to its depreciation policy subsequent to the Board mandated changes,  applicants must identify the change, explain the nature of the change, the reason for the change, quantify the impact of the change, and quantify the depreciation expense before and after the change."]
["·       "," If an applicant changed depreciation policies and reflected these changes in a prior rebasing application, the applicant should complete Appendix 2-CH. The applicant must provide data starting from the earlier of 1) all historical years back to its last rebasing; or 2) at least three years of historical actuals, in addition to Bridge Year and Test Year forecasts."]
[]
[]
["Appendix 2-E - Account 1575, IFRS-CGAAP Transitional PP&E Amounts (2-EA), Account 1576, Accounting Changes Under CGAAP (2-EB, 2-EC)"]
[]
["1) For an applicant that has a balance in Account 1576 to dispose:"]
["·       ","If an applicant changed capitalization and depreciation policies effective January 1, 2012, the applicant must complete Appendix 2-EB "]
["·       ","If an applicant changed capitalization and depreciation policies effective January 1, 2013, the applicant must complete Appendix 2-EC"]
[]
["2) For an applicant that has a balance in Account 1575 to dispose:"]
["·       ","The applicant must complete 2-EA"]
[" If the applicant did not make any further PP&E accounting policy changes beyond the capitalization and depreciation policy changes as mandated by the Board by January 1, 2013 (i.e. no further changes made on transition to IFRS), the applicant must indicate this and does not need to complete Appendix 2-EA."]
[]
[]
[]
[]
["Please refer to section 2.12.4 and 2.12.5 of the Filing Requirements for further details."]
[]
["Appendix 2-Y - Summary of Impacts to Revenue Requirement from Transition to MIFRS"]
[]
["An applicant must provide a summary of the dollar impacts of MIFRS to each component of the revenue requirement (e.g. rate base, operating costs, etc.), including the overall impact on the proposed revenue requirement.  Accordingly,  the applicant must identify financial differences and resulting revenue requirement impacts arising from the adoption of  MIFRS as compared to CGAAP.  If the applicant is reflecting the changes in capitalization and depreciation policies for the first time in a rebasing application, then a comparison between MIFRS and CGAAP before the change in accounting policies should be completed.  If the applicant changed capitalization and depreciation policies and  reflected these changes in a prior rebasing application, then a comparison between MIFRS and CGAAP after the change in accounting policies should be completed.  "]

{"sheet":"App.2-BA_Fixed Asset Cont","index":9,"n_rows":355,"n_cols":16,"rows_kept":355,"cut":false,"hidden":false,"merged":[[82,3,82,6],[8,0,8,12],[9,0,9,12],[13,3,13,6],[69,2,69,8],[70,2,70,8],[138,2,138,8],[139,2,139,8],[151,3,151,6],[207,2,207,8],[208,2,208,8],[346,2,346,8],[221,3,221,6],[276,2,276,8],[277,2,277,8],[290,3,290,6],[345,2,345,8]]}
[null,null,null,null,null,null,null,null,null,null,null,"File Number:",{"$f":"EBNUMBER","v":0}]
[null,null,null,null,null,null,null,null,null,null,null,"Exhibit:"]
[null,null,null,null,null,null,null,null,null,null,null,"Tab:"]
[null,null,null,null,null,null,null,null,null,null,null,"Schedule:"]
[null,null,null,null,null,null,null,null,null,null,null,"Page:"]
[]
[null,null,null,null,null,null,null,null,null,null,null,"Date:"]
[]
["Appendix 2-BA"]
["Fixed Asset Continuity Schedule 1 "]
[]
[null,null,null,null,"Year ",2014,"CGAAP - with changes to policies"]
[]
[null,null,null,"Cost",null,null,null,null,null,"Accumulated Depreciation"]
["CCA Class","OEB","Description","Opening Balance","Additions","Disposals","Closing Balance",null,"Opening Balance","Additions","Disposals","Closing Balance","Net Book Value",null,"AVG Gross Bal","AVG AccDep"]
[12,1611,"Computer Software (Formally known as Account 1925)",85405.66,40505.350000000006,0,{"$f":"D16+E16+F16","v":125911.01000000001},null,72106.73,16714.52,0,{"$f":"I16+J16+K16","v":88821.25},{"$f":"G16-L16","v":37089.760000000009},null,{"$f":"AVERAGE(G16,D16)","v":105658.33500000001},{"$f":"AVERAGE(L16,I16)","v":80463.989999999991}]
["CEC",1612,"Land Rights (Formally known as Account 1906 and 1806)",0,0,0,{"$f":"D17+E17+F17","v":0},null,0,0,0,{"$f":"I17+J17+K17","v":0},{"$f":"G17-L17","v":0},null,0,0]
["N/A",1805,"Land",50000,0,0,50000,null,0,0,0,{"$f":"I18+J18+K18","v":0},50000,null,50000,0]
[47,1808,"Buildings",0,0,0,0,null,0,0,0,{"$f":"I19+J19+K19","v":0},0,null,0,0]
[13,1810,"Leasehold Improvements",0,0,0,0,null,0,0,0,0,0,null,0,0]
[47,1815,"Transformer Station Equipment >50 kV",0,0,0,0,null,0,0,0,0,0,null,0,0]
[47,1820,"Distribution Station Equipment <50 kV",284888,0,0,284888,null,86469.58,5179.7700000000004,0,91649.35,193238.65,null,284888,89059.464999999997]
[47,1825,"Storage Battery Equipment",0,0,0,0,null,0,0,0,0,0,null,0,0]
[47,1830,"Poles, Towers & Fixtures",638783.24,107752.87,0,746536.11,null,226474.49,17316.490000000002,0,243790.97999999998,502745.13,null,692659.67500000005,235132.73499999999]
[47,1835,"Overhead Conductors & Devices",605736.69000000006,55661.820000000065,0,661398.51000000013,null,237379.06,10559.43,0,247938.49,413460.02000000014,null,633567.60000000009,242658.77499999999]
[47,1840,"Underground Conduit",0,0,0,0,null,0,0,0,0,0,null,0,0]
[47,1845,"Underground Conductors & Devices",1016362.74,692811.42999999993,0,1709174.17,null,436345,38936.239999999998,0,475281.24,1233892.93,null,1362768.4550000001,455813.12]
[47,1850,"Line Transformers",751064.44000000006,288934.39,0,1039998.8300000001,null,290065.56,22388.28,0,312453.83999999997,727544.99000000011,null,895531.63500000001,301259.69999999995]
[47,1855,"Services (Overhead & Underground)",193249.96000000002,12464,0,205713.96000000002,null,58936.36,4987.0499999999993,0,63923.41,141790.55000000002,null,199481.96000000002,61429.885000000002]
[47,1860,"Meters",79072,0,-79072,0,null,39311,0,-39311,0,0,null,39536,19655.5]
[47,1860,"Meters (Smart Meters)",310212,25716,0,335928,null,23677,21538,3163,48378,287550,null,323070,36027.5]
["N/A",1905,"Land",0,0,0,0,null,0,0,0,0,0,null,0,0]
[47,1908,"Buildings & Fixtures",0,0,0,0,null,0,0,0,0,0,null,0,0]
[13,1910,"Leasehold Improvements",0,0,0,0,null,0,0,0,0,0,null,0,0]
[8,1915,"Office Furniture & Equipment (10 years)",50362.82,631.93000000000029,0,50994.75,null,31808.21,4308.6499999999996,0,36116.86,14877.89,null,50678.785000000003,33962.535000000003]
[8,1915,"Office Furniture & Equipment (5 years)",0,0,0,0,null,0,0,0,0,0,null,0,0]
[10,1920,"Computer Equipment - Hardware",26623.670000000002,429.98999999999796,0,27053.66,null,21555.5,2089.1799999999998,0,23644.68,3408.9799999999996,null,26838.665000000001,22600.09]
[45,1920,"Computer Equip.-Hardware(Post Mar. 22/04)",0,0,0,0,null,0,0,0,0,0,null,0,0]
[45.1,1920,"Computer Equip.-Hardware(Post Mar. 19/07)",0,0,0,0,null,0,0,0,0,0,null,0,0]
[10,1930,"Transportation Equipment",0,0,0,0,null,0,0,0,0,0,null,0,0]
[8,1935,"Stores Equipment",4320,0,0,4320,null,4017.6,151.19999999999999,0,4168.8,151.19999999999982,null,4320,4093.2]
[8,1940,"Tools, Shop & Garage Equipment",0,0,0,0,null,0,0,0,0,0,null,0,0]
[8,1945,"Measurement & Testing Equipment",8486,0,0,8486,null,4543.3999999999996,578.6,0,5122,3364,null,8486,4832.7]
[8,1950,"Power Operated Equipment",0,0,0,0,null,0,0,0,0,0,null,0,0]
[8,1955,"Communications Equipment",0,0,0,0,null,0,0,0,0,0,null,0,0]
[8,1955,"Communication Equipment (Smart Meters)",0,0,0,0,null,0,0,0,0,0,null,0,0]
[8,1960,"Miscellaneous Equipment ",0,0,0,0,null,0,0,0,0,0,null,0,0]
[47,1970,"Load Management Controls Customer Premises",0,0,0,0,null,0,0,0,0,0,null,0,0]
[47,1975,"Load Management Controls Utility Premises",0,0,0,0,null,0,0,0,0,0,null,0,0]
[47,1980,"System Supervisor Equipment",0,0,0,0,null,0,0,0,0,0,null,0,0]
[47,1985,"Miscellaneous Fixed Assets",0,0,0,0,null,0,0,0,0,0,null,0,0]
[47,1990,"Other Tangible Property",0,0,0,0,null,0,0,0,0,0,null,0,0]
[47,1995,"Contributions & Grants",-555962.93999999994,-905202,0,-1461164.94,null,-190516.64,-25214.1,0,-215730.74000000002,{"$f":"G53-L53","v":-1245434.2},null,-1008563.94,-203123.69]
[null,"etc.",null,0,0,0,0,null,0,0,0,0,0,null,0,0]
[null,"etc.",null,0,0,0,0,null,0,0,0,0,0,null,0,0]
[null,"etc.",null,0,0,0,0,null,0,0,0,0,0,null,0,0]
[null,"etc.",null,0,0,0,0,null,0,0,0,0,0,null,0,0]
[null,"etc.",null,0,0,0,0,null,0,0,0,0,0,null,0,0]
[null,"etc.",null,0,0,0,0,null,0,0,0,0,0,null,0,0]
[null,"etc.",null,0,0,0,0,null,0,0,0,0,0,null,0,0]
[null,"etc.",null,0,0,0,0,null,0,0,0,0,0,null,0,0]
[null,"etc.",null,0,0,0,0,null,0,0,0,0,0,null,0,0]
[null,"etc.",null,0,0,0,0,null,0,0,0,0,0,null,0,0]
[null,"etc.",null,0,0,0,{"$f":"D64+E64+F64","v":0},null,0,0,0,0,0,null,0,0]
[null,null,null,null,null,null,{"$f":"D65+E65+F65","v":0},null,0,0,0,0,0,null,0,0]
[null,null,"Sub-Total",{"$f":"SUM(D16:D65)","v":3548604.28},{"$f":"SUM(E16:E65)","v":319705.7799999998},{"$f":"SUM(F16:F65)","v":-79072},{"$f":"SUM(G16:G65)","v":3789238.060000001},null,{"$f":"SUM(I16:I65)","v":1342172.8500000001},{"$f":"SUM(J16:J65)","v":119533.31},{"$f":"SUM(K16:K65)","v":-36148},{"$f":"SUM(L16:L65)","v":1425558.16},{"$f":"SUM(M16:M65)","v":2363679.9000000004},null,{"$f":"SUM(O16:O65)","v":3668921.1700000004},{"$f":"SUM(P16:P65)","v":1383865.5049999999}]
[null,null,"Less Socialized Renewable Energy Generation Investments (input as negative)Less Socialized Renewable Energy Generation Investments (input as negative)",null,null,null,{"$f":"D67+E67+F67","v":0},null,null,null,null,{"$f":"I67+J67+K67","v":0},{"$f":"G67+L67","v":0},null,null,{"$f":"O66-P66","v":2285055.6650000005}]
[null,null,"Less Other Non Rate-Regulated Utility Assets (input as negative)Less Other Non Rate-Regulated Utility Assets (input as negative)",null,null,null,0,null,null,null,null,{"$f":"I68+J68+K68","v":0},{"$f":"G68+L68","v":0}]
[null,null,"Total PP&E",{"$f":"SUM(D66:D68)","v":3548604.28},{"$f":"SUM(E66:E68)","v":319705.7799999998},{"$f":"SUM(F66:F68)","v":-79072},{"$f":"SUM(G66:G68)","v":3789238.060000001},null,{"$f":"SUM(I66:I68)","v":1342172.8500000001},{"$f":"SUM(J66:J68)","v":119533.31},{"$f":"SUM(K66:K68)","v":-36148},{"$f":"SUM(L66:L68)","v":1425558.16},{"$f":"SUM(M66:M68)","v":2363679.9000000004}]
[null,null,"Depreciation Expense adj. from gain or loss on the retirement of assets (pool of like assets)",null,null,null,null,null,null,null,null,0,null,null,"From RRR year value Account 2105"]
[null,null,"Total",null,null,null,null,null,null,{"$f":"J69+J70","v":119533.31}]
[null,null,null," ",null,null," ",null,null,null,null,null," "]
[null,null,null,null,null,null,"Less: Fully Allocated Depreciation"]
[10,null,"Transportation",null,null,null,"Transportation"]
[8,null,"Stores Equipment",null,null,null,"Stores Equipment"]
[8,null,"Tools, Shop",null,null,null,"Tools, Shop"]
[8,null,"Meas/Testing",null,null,null,"Meas/Testing"]
[8,null,"Communication",null,null,null,"Communication"]
[null,null,null,null,null,null,"Net Depreciation",null,null,{"$f":"J71+J74+J78+J75+J76+J77","v":119533.31}]
[]
[null,null,null,null,"Year ",2015,"IFRS"]
[]
[null,null,null,"Cost",null,null,null,null,null,"Accumulated Depreciation"]
["CCA Class","OEB","Description","Opening Balance","Additions","Disposals","Closing Balance",null,"Opening Balance","Additions","Disposals","Closing Balance","Net Book Value",null,"AVG Gross Bal","AVG AccDep"]
[12,1611,"Computer Software (Formally known as Account 1925)",{"$f":"G16","v":125911.01000000001},1307.82,0,{"$f":"D85+E85+F85","v":127218.83000000002},null,{"$f":"L16","v":88821.25},8627.5519999999997,0,{"$f":"I85+J85+K85","v":97448.801999999996},{"$f":"G85-L85","v":29770.02800000002},null,{"$f":"AVERAGE(G85,D85)","v":126564.92000000001},{"$f":"AVERAGE(L85,I85)","v":93135.025999999998}]
["CEC",1612,"Land Rights (Formally known as Account 1906 and 1806)",0,0,0,{"$f":"D86+E86+F86","v":0},null,0,0,0,{"$f":"I86+J86+K86","v":0},{"$f":"G86-L86","v":0},null,0,0]
["N/A",1805,"Land",50000,0,0,{"$f":"D87+E87+F87","v":50000},null,0,0,0,{"$f":"I87+J87+K87","v":0},50000,null,50000,0]
[47,1808,"Buildings",0,0,0,{"$f":"D88+E88+F88","v":0},null,0,0,0,{"$f":"I88+J88+K88","v":0},0,null,0,0]
[13,1810,"Leasehold Improvements",0,0,0,0,null,0,0,0,0,0,null,0,0]
[47,1815,"Transformer Station Equipment >50 kV",0,0,0,0,null,0,0,0,0,0,null,0,0]
[47,1820,"Distribution Station Equipment <50 kV",284888,75410,0,360298,null,91649.35,5865.3163636363633,0,97514.666363636366,262783.33363636362,null,322593,94582.008181818179]
[47,1825,"Storage Battery Equipment",0,0,0,0,null,0,0,0,0,0,null,0,0]
[47,1830,"Poles, Towers & Fixtures",746536.11,2662.5,0,749198.61,null,243790.97999999998,18696.686500000003,0,262487.66649999999,486710.94349999999,null,747867.36,253139.32324999999]
[47,1835,"Overhead Conductors & Devices",661398.51000000013,884.5,0,662283.01000000013,null,247938.49,11030.679333333333,0,258969.16933333332,403313.8406666668,null,661840.76000000013,253453.82966666666]
[47,1840,"Underground Conduit",0,0,0,0,null,0,0,0,0,0,null,0,0]
[47,1845,"Underground Conductors & Devices",1709174.17,144092.15,0,1853266.3199999998,null,475281.24,50892.006999999998,0,526173.24699999997,1327093.0729999999,null,1781220.2449999999,500727.24349999998]
[47,1850,"Line Transformers",1039998.8300000001,110237.5,0,1150236.33,null,312453.83999999997,27377.927000000003,0,339831.76699999999,810404.56300000008,null,1095117.58,326142.80349999998]
[47,1855,"Services (Overhead & Underground)",205713.96000000002,15074,0,220787.96000000002,null,63923.41,5331.2740000000013,0,69254.684000000008,151533.27600000001,null,213250.96000000002,66589.047000000006]
[47,1860,"Meters",0,0,0,0,null,0,0,0,0,0,null,0,0]
[47,1860,"Meters (Smart Meters)",335928,9244,0,345172,null,48378,22703,0,71081,274091,null,340550,59729.5]
["N/A",1905,"Land",0,0,0,0,null,0,0,0,0,0,null,0,0]
[47,1908,"Buildings & Fixtures",0,0,0,0,null,0,0,0,0,0,null,0,0]
[13,1910,"Leasehold Improvements",0,0,0,0,null,0,0,0,0,0,null,0,0]
[8,1915,"Office Furniture & Equipment (10 years)",50994.75,961.6,0,51956.35,null,36116.86,3812.9330000000004,0,39929.792999999998,12026.557000000001,null,51475.55,38023.326499999996]
[8,1915,"Office Furniture & Equipment (5 years)",0,0,0,0,null,0,0,0,0,0,null,0,0]
[10,1920,"Computer Equipment - Hardware",27053.66,1384.95,0,28438.61,null,23644.68,1654.5830000000001,0,25299.262999999999,3139.3470000000016,null,27746.135000000002,24471.9715]
[45,1920,"Computer Equip.-Hardware(Post Mar. 22/04)",0,0,0,0,null,0,0,0,0,0,null,0,0]
[45.1,1920,"Computer Equip.-Hardware(Post Mar. 19/07)",0,0,0,0,null,0,0,0,0,0,null,0,0]
[10,1930,"Transportation Equipment",0,0,0,0,null,0,0,0,0,0,null,0,0]
[8,1935,"Stores Equipment",4320,0,0,4320,null,4168.8,151.4,0,4320.2,-0.1999999999998181,null,4320,4244.5]
[8,1940,"Tools, Shop & Garage Equipment",0,0,0,0,null,0,0,0,0,0,null,0,0]
[8,1945,"Measurement & Testing Equipment",8486,0,0,8486,null,5122,420.5,0,5542.5,2943.5,null,8486,5332.25]
[8,1950,"Power Operated Equipment",0,0,0,0,null,0,0,0,0,0,null,0,0]
[8,1955,"Communications Equipment",0,0,0,0,null,0,0,0,0,0,null,0,0]
[8,1955,"Communication Equipment (Smart Meters)",0,0,0,0,null,0,0,0,0,0,null,0,0]
[8,1960,"Miscellaneous Equipment ",0,0,0,0,null,0,0,0,0,0,null,0,0]
[47,1970,"Load Management Controls Customer Premises",0,0,0,0,null,0,0,0,0,0,null,0,0]
[47,1975,"Load Management Controls Utility Premises",0,0,0,0,null,0,0,0,0,0,null,0,0]
[47,1980,"System Supervisor Equipment",0,0,0,0,null,0,0,0,0,0,null,0,0]
[47,1985,"Miscellaneous Fixed Assets",0,0,0,0,null,0,0,0,0,0,null,0,0]
[47,1990,"Other Tangible Property",0,0,0,0,null,0,0,0,0,0,null,0,0]
[47,1995,"Contributions & Grants",-1461164.94,-148144.20000000001,0,-1609309.14,null,-215730.74000000002,-38380.923749999994,0,-254111.66375000001,-1355197.4762499998,null,-1535237.04,-234921.20187500003]
[null,"etc."]
[null,"etc.",null,{"$f":"G55","v":0},0,0,{"$f":"D124+E124+F124","v":0},null,null,0,0,{"$f":"I124+J124+K124","v":0},0,null,0,0]
[null,"etc.",null,0,0,0,0,null,null,0,0,0,0,null,0,0]
[null,"etc.",null,0,0,0,0,null,null,0,0,0,0,null,0,0]
[null,"etc.",null,0,0,0,0,null,null,0,0,0,0,null,0,0]
[null,"etc.",null,0,0,0,0,null,null,0,0,0,0,null,0,0]
[null,"etc.",null,0,0,0,0,null,null,0,0,0,0,null,0,0]
[null,"etc.",null,0,0,0,0,null,null,0,0,0,0,null,0,0]
[null,"etc.",null,0,0,0,0,null,null,0,0,0,0,null,0,0]
[null,"etc.",null,0,0,0,0,null,null,0,0,0,0,null,0,0]
[null,"etc.",null,0,0,0,{"$f":"D133+E133+F133","v":0},null,null,0,0,0,0,null,0,0]
[null,null,null,0,null,null,{"$f":"D134+E134+F134","v":0},null,{"$f":"L65","v":0},0,0,0,0,null,0,0]
[null,null,"Sub-Total",{"$f":"SUM(D85:D134)","v":3789238.060000001},{"$f":"SUM(E85:E134)","v":213114.81999999995},{"$f":"SUM(F85:F134)","v":0},{"$f":"SUM(G85:G134)","v":4002352.88},null,{"$f":"SUM(I85:I134)","v":1425558.16},{"$f":"SUM(J85:J134)","v":118182.93444696971},{"$f":"SUM(K85:K134)","v":0},{"$f":"SUM(L85:L134)","v":1543741.0944469695},{"$f":"SUM(M85:M134)","v":2458611.7855530307},null,{"$f":"SUM(O85:O134)","v":3895795.4699999997},{"$f":"SUM(P85:P134)","v":1484649.6272234847}]
[null,null,"Less Socialized Renewable Energy Generation Investments (input as negative)Less Socialized Renewable Energy Generation Investments (input as negative)",null,null,null,{"$f":"D136+E136+F136","v":0},null,null,null,null,{"$f":"I136+J136+K136","v":0},{"$f":"G136+L136","v":0},null,null,{"$f":"O135-P135","v":2411145.8427765151}]
[null,null,"Less Other Non Rate-Regulated Utility Assets (input as negative)Less Other Non Rate-Regulated Utility Assets (input as negative)",null,null,null,{"$f":"D137+E137+F137","v":0},null,null,null,null,{"$f":"I137+J137+K137","v":0},{"$f":"G137+L137","v":0},null,null,{"$f":"AVERAGE(M138,M69)","v":2411145.8427765155}]
[null,null,"Total PP&E",{"$f":"SUM(D135:D137)","v":3789238.060000001},{"$f":"SUM(E135:E137)","v":213114.81999999995},{"$f":"SUM(F135:F137)","v":0},{"$f":"SUM(G135:G137)","v":4002352.88},null,{"$f":"SUM(I135:I137)","v":1425558.16},{"$f":"SUM(J135:J137)","v":118182.93444696971},{"$f":"SUM(K135:K137)","v":0},{"$f":"SUM(L135:L137)","v":1543741.0944469695},{"$f":"SUM(M135:M137)","v":2458611.7855530307}]
[null,null,"Depreciation Expense adj. from gain or loss on the retirement of assets (pool of like assets)",null,null,null,null,null,null,null,null,0,null,null,"From RRR year value Account 2105"]
[null,null,"Total",null,null,null,null,null,null,{"$f":"J138+J139","v":118182.93444696971}]
[]
[null,null,null,null,null,null,"Less: Fully Allocated Depreciation"]
[10,null,"Transportation",null,null,null,"Transportation"]
[8,null,"Stores Equipment",null,null,null,"Stores Equipment"]
[8,null,"Tools, Shop",null,null,null,"Tools, Shop"]
[8,null,"Meas/Testing",null,null,null,"Meas/Testing"]
[8,null,"Communication",null,null,null,"Communication"]
[null,null,null,null,null,null,"Net Depreciation",null,null,{"$f":"J140+J143+J147+J144+J145+J146","v":118182.93444696971}]
[]
[null,null,null,null,"Year ",2016,"IFRS"]
[]
[null,null,null,"Cost",null,null,null,null,null,"Accumulated Depreciation"]
["CCA Class","OEB","Description","Opening Balance","Additions","Disposals","Closing Balance",null,"Opening Balance","Additions","Disposals","Closing Balance","Net Book Value",null,"AVG Gross Bal","AVG AccDep"]
[12,1611,"Computer Software (Formally known as Account 1925)",{"$f":"G85","v":127218.83000000002},1365,0,{"$f":"D154+E154+F154","v":128583.83000000002},null,{"$f":"L85","v":97448.801999999996},0,0,{"$f":"I154+J154+K154","v":97448.801999999996},{"$f":"G154-L154","v":31135.02800000002},null,{"$f":"AVERAGE(G154,D154)","v":127901.33000000002},{"$f":"AVERAGE(L154,I154)","v":97448.801999999996}]
["CEC",1612,"Land Rights (Formally known as Account 1906 and 1806)",0,0,0,{"$f":"D155+E155+F155","v":0},null,0,0,0,{"$f":"I155+J155+K155","v":0},{"$f":"G155-L155","v":0},null,0,0]
["N/A",1805,"Land",50000,0,0,{"$f":"D156+E156+F156","v":50000},null,0,0,0,{"$f":"I156+J156+K156","v":0},50000,null,50000,0]
[47,1808,"Buildings",0,0,0,{"$f":"D157+E157+F157","v":0},null,0,0,0,{"$f":"I157+J157+K157","v":0},0,null,0,0]
[13,1810,"Leasehold Improvements",0,0,0,0,null,0,0,0,0,0,null,0,0]
[47,1815,"Transformer Station Equipment >50 kV",0,0,0,0,null,0,0,0,0,0,null,0,0]
[47,1820,"Distribution Station Equipment <50 kV",360297,50012.77,0,410309.77,null,97514.666363636366,18979.926749999999,0,116494.59311363637,293815.17688636365,null,385303.38500000001,107004.62973863637]
[47,1825,"Storage Battery Equipment",{"$f":"G92","v":0},0,0,0,null,0,12949.67275,0,12949.67275,-12949.67275,null,0,6474.8363749999999]
[47,1830,"Poles, Towers & Fixtures",749198.61,74099,-27052,796245.61,null,262487.66649999999,0,-15194,247293.66649999999,548951.94350000005,null,772722.11,254890.66649999999]
[47,1835,"Overhead Conductors & Devices",662283.01000000013,229395,0,891678.01000000013,null,258969.16933333332,53361.45485714286,0,312330.6241904762,579347.38580952398,null,776980.51000000013,285649.89676190476]
[47,1840,"Underground Conduit",0,0,0,0,null,0,29251.127,0,29251.127,-29251.127,null,0,14625.5635]
[47,1845,"Underground Conductors & Devices",1853266.3199999998,28769,0,1882035.3199999998,null,526173.24699999997,5796.8864999999996,0,531970.1335,1350065.1864999998,null,1867650.8199999998,529071.69024999999]
[47,1850,"Line Transformers",1150236.33,39618.5,0,1189854.83,null,339831.76699999999,0,0,339831.76699999999,850023.06300000008,null,1170045.58,339831.76699999999]
[47,1855,"Services (Overhead & Underground)",220787.96000000002,22175,0,242962.96000000002,null,69254.684000000008,23295.565999999999,0,92550.25,150412.71000000002,null,231875.46000000002,80902.467000000004]
[47,1860,"Meters",0,0,0,0,null,0,0,0,0,0,null,0,0]
[47,1860,"Meters (Smart Meters)",345172,8523,0,353695,null,71081,0,0,71081,282614,null,349433.5,71081]
["N/A",1905,"Land",0,0,0,0,null,0,0,0,0,0,null,0,0]
[47,1908,"Buildings & Fixtures",0,0,0,0,null,0,0,0,0,0,null,0,0]
[13,1910,"Leasehold Improvements",0,0,0,0,null,0,0,0,0,0,null,0,0]
[8,1915,"Office Furniture & Equipment (10 years)",51956.35,1563.15,0,53519.5,null,39929.792999999998,2861.6575000000003,0,42791.450499999999,10728.049500000001,null,52737.925000000003,41360.621749999998]
[8,1915,"Office Furniture & Equipment (5 years)",0,0,0,0,null,0,0,0,0,0,null,0,0]
[10,1920,"Computer Equipment - Hardware",28438.61,2159.94,0,30598.55,null,25299.262999999999,1545.0959999999998,0,26844.359,3754.1909999999989,null,29518.58,26071.811000000002]
[45,1920,"Computer Equip.-Hardware(Post Mar. 22/04)",0,0,0,0,null,0,0,0,0,0,null,0,0]
[45.1,1920,"Computer Equip.-Hardware(Post Mar. 19/07)",0,0,0,0,null,0,0,0,0,0,null,0,0]
[10,1930,"Transportation Equipment",0,0,0,0,null,0,0,0,0,0,null,0,0]
[8,1935,"Stores Equipment",4320,0,0,4320,null,4320.2,0,0,4320.2,-0.1999999999998181,null,4320,4320.2]
[8,1940,"Tools, Shop & Garage Equipment",0,0,0,0,null,0,0,0,0,0,null,0,0]
[8,1945,"Measurement & Testing Equipment",8486,7415.08,0,15901.08,null,5542.5,791.25400000000002,0,6333.7539999999999,9567.3260000000009,null,12193.54,5938.1270000000004]
[8,1950,"Power Operated Equipment",0,0,0,0,null,0,0,0,0,0,null,0,0]
[8,1955,"Communications Equipment",0,0,0,0,null,0,0,0,0,0,null,0,0]
[8,1955,"Communication Equipment (Smart Meters)",0,0,0,0,null,0,0,0,0,0,null,0,0]
[8,1960,"Miscellaneous Equipment ",0,0,0,0,null,0,0,0,0,0,null,0,0]
[47,1970,"Load Management Controls Customer Premises",0,0,0,0,null,0,0,0,0,0,null,0,0]
[47,1975,"Load Management Controls Utility Premises",0,0,0,0,null,0,0,0,0,0,null,0,0]
[47,1980,"System Supervisor Equipment",0,0,0,0,null,0,0,0,0,0,null,0,0]
[47,1985,"Miscellaneous Fixed Assets",0,0,0,0,null,0,0,0,0,0,null,0,0]
[47,1990,"Other Tangible Property",0,0,0,0,null,0,0,0,0,0,null,0,0]
[47,1995,"Contributions & Grants",-1609309.14,-6450.5,0,-1615759.64,null,-254111.66375000001,-40313,0,-294424.66375000001,-1321334.9762499998,null,-1612534.39,-274268.16375000001]
[null,"etc.",null,0,0,0,0,null,0,0,0,0,0,null,0,0]
[null,"etc.",null,0,0,0,0,null,0,0,0,0,0,null,0,0]
[null,"etc.",null,0,0,0,0,null,0,0,0,0,0,null,0,0]
[null,"etc.",null,0,0,0,0,null,0,0,0,0,0,null,0,0]
[null,"etc.",null,0,0,0,0,null,0,0,0,0,0,null,0,0]
[null,"etc.",null,0,0,0,0,null,0,0,0,0,0,null,0,0]
[null,"etc.",null,0,0,0,0,null,0,0,0,0,0,null,0,0]
[null,"etc.",null,0,0,0,0,null,0,0,0,0,0,null,0,0]
[null,"etc.",null,0,0,0,0,null,0,0,0,0,0,null,0,0]
[null,"etc.",null,0,0,0,0,null,0,0,0,0,0,null,0,0]
[null,"etc.",null,0,0,0,{"$f":"D202+E202+F202","v":0},null,0,0,0,0,0,null,0,0]
[null,null,null,0,null,null,{"$f":"D203+E203+F203","v":0},null,0,0,0,0,0,null,0,0]
[null,null,"Sub-Total",{"$f":"SUM(D154:D203)","v":4002351.88},{"$f":"SUM(E154:E203)","v":458644.94000000006},{"$f":"SUM(F154:F203)","v":-27052},{"$f":"SUM(G154:G203)","v":4433944.82},null,{"$f":"SUM(I154:I203)","v":1543741.0944469695},{"$f":"SUM(J154:J203)","v":108519.64135714283},{"$f":"SUM(K154:K203)","v":-15194},{"$f":"SUM(L154:L203)","v":1637066.7358041124},{"$f":"SUM(M154:M203)","v":2796878.0841958877},null,{"$f":"SUM(O154:O203)","v":4218148.3500000006},{"$f":"SUM(P154:P203)","v":1590403.9151255412}]
[null,null,"Less Socialized Renewable Energy Generation Investments (input as negative)Less Socialized Renewable Energy Generation Investments (input as negative)",null,null,null,{"$f":"D205+E205+F205","v":0},null,null,null,null,{"$f":"I205+J205+K205","v":0},{"$f":"G205+L205","v":0},null,null,{"$f":"O204-P204","v":2627744.4348744592}]
[null,null,"Less Other Non Rate-Regulated Utility Assets (input as negative)Less Other Non Rate-Regulated Utility Assets (input as negative)",null,null,null,{"$f":"D206+E206+F206","v":0},null,null,null,null,{"$f":"I206+J206+K206","v":0},{"$f":"G206+L206","v":0},null,null,{"$f":"AVERAGE(M207,M138)","v":2627744.9348744592}]
[null,null,"Total PP&E",{"$f":"SUM(D204:D206)","v":4002351.88},{"$f":"SUM(E204:E206)","v":458644.94000000006},{"$f":"SUM(F204:F206)","v":-27052},{"$f":"SUM(G204:G206)","v":4433944.82},null,{"$f":"SUM(I204:I206)","v":1543741.0944469695},{"$f":"SUM(J204:J206)","v":108519.64135714283},{"$f":"SUM(K204:K206)","v":-15194},{"$f":"SUM(L204:L206)","v":1637066.7358041124},{"$f":"SUM(M204:M206)","v":2796878.0841958877}]
[null,null,"Depreciation Expense adj. from gain or loss on the retirement of assets (pool of like assets)"]
[null,null,"Total",null,null,null,null,null,null,{"$f":"J207+J208","v":108519.64135714283}]
[]
[null,null,null,null,null,null,"Less: Fully Allocated Depreciation"]
[10,null,"Transportation",null,null,null,"Transportation"]
[8,null,"Stores Equipment",null,null,null,"Stores Equipment"]
[8,null,"Tools, Shop",null,null,null,"Tools, Shop"]
[8,null,"Meas/Testing",null,null,null,"Meas/Testing"]
[8,null,"Communication",null,null,null,"Communication"]
[null,null,null,null,null,null,"Net Depreciation",null,null,{"$f":"J209+J212+J216+J213+J214+J215","v":108519.64135714283}]
[]
[]
[null,null,null,null,"Year ",2017,"IFRS"]
[]
[null,null,null,"Cost",null,null,null,null,null,"Accumulated Depreciation"]
["CCA Class","OEB","Description","Opening Balance","Additions","Disposals","Closing Balance",null,"Opening Balance","Additions","Disposals","Closing Balance","Net Book Value",null,"AVG Gross Bal","AVG AccDep"]
[12,1611,"Computer Software (Formally known as Account 1925)",{"$f":"G154","v":128583.83000000002},4500,0,{"$f":"D224+E224+F224","v":133083.83000000002},null,{"$f":"L154","v":97448.801999999996},9181.366,0,{"$f":"I224+J224+K224","v":106630.16799999999},{"$f":"G224-L224","v":26453.662000000026},null,{"$f":"AVERAGE(G224,D224)","v":130833.83000000002},{"$f":"AVERAGE(L224,I224)","v":102039.48499999999}]
["CEC",1612,"Land Rights (Formally known as Account 1906 and 1806)",0,0,0,{"$f":"D225+E225+F225","v":0},null,0,0,0,{"$f":"I225+J225+K225","v":0},{"$f":"G225-L225","v":0},null,0,0]
["N/A",1805,"Land",50000,0,0,{"$f":"D226+E226+F226","v":50000},null,0,0,0,{"$f":"I226+J226+K226","v":0},50000,null,50000,0]
[47,1808,"Buildings",0,0,0,{"$f":"D227+E227+F227","v":0},null,0,0,0,{"$f":"I227+J227+K227","v":0},0,null,0,0]
[13,1810,"Leasehold Improvements",0,0,0,0,null,0,0,0,0,0,null,0,0]
[47,1815,"Transformer Station Equipment >50 kV",0,0,0,0,null,0,0,0,0,0,null,0,0]
[47,1820,"Distribution Station Equipment <50 kV",410309.77,1517396,0,1927705.77,null,116494.59311363637,21254.69,0,137749.28311363637,1789956.4868863637,null,1169007.77,127121.93811363637]
[47,1825,"Storage Battery Equipment",0,0,0,0,null,12949.67275,null,0,12949.67275,-12949.67275,null,0,12949.67275]
[47,1830,"Poles, Towers & Fixtures",796245.61,0,0,796245.61,null,247293.66649999999,19906.164249999998,0,267199.83074999996,529045.77925000002,null,796245.61,257246.74862499998]
[47,1835,"Overhead Conductors & Devices",891678.01000000013,85900,0,977578.01000000013,null,312330.6241904762,15577.13,0,327907.7541904762,649670.25580952386,null,934628.01000000013,320119.1891904762]
[47,1840,"Underground Conduit",0,0,0,0,null,29251.127,null,0,29251.127,-29251.127,null,0,29251.127]
[47,1845,"Underground Conductors & Devices",1882035.3199999998,160025,0,2042060.3199999998,null,531970.1335,56058.51,0,588028.64350000001,1454031.6764999998,null,1962047.8199999998,559999.3885]
[47,1850,"Line Transformers",1189854.83,40675,0,1230529.83,null,339831.76699999999,30254.799999999999,0,370086.56699999998,860443.26300000004,null,1210192.33,354959.16700000002]
[47,1855,"Services (Overhead & Underground)",242962.96000000002,20000,0,262962.96000000002,null,92550.25,6324.07,0,98874.32,164088.64000000001,null,252962.96000000002,95712.285000000003]
[47,1860,"Meters",0,8000,0,8000,null,0,null,0,0,8000,null,4000,0]
[47,1860,"Meters (Smart Meters)",353695,0,0,353695,null,71081,23846.32,0,94927.32,258767.68,null,353695,83004.160000000003]
["N/A",1905,"Land",0,0,0,0,null,0,0,0,0,0,null,0,0]
[47,1908,"Buildings & Fixtures",0,0,0,0,null,0,0,0,0,0,null,0,0]
[13,1910,"Leasehold Improvements",0,0,0,0,null,0,0,0,0,0,null,0,0]
[8,1915,"Office Furniture & Equipment (10 years)",53519.5,1000,0,54519.5,null,42791.450499999999,2505.61,0,45297.0605,9222.4395000000004,null,54019.5,44044.255499999999]
[8,1915,"Office Furniture & Equipment (5 years)",0,0,0,0,null,0,null,0,0,0,null,0,0]
[10,1920,"Computer Equipment - Hardware",30598.55,1500,0,32098.55,null,26844.359,1361.98,0,28206.339,3892.2109999999993,null,31348.55,27525.349000000002]
[45,1920,"Computer Equip.-Hardware(Post Mar. 22/04)",0,0,0,0,null,0,0,0,0,0,null,0,0]
[45.1,1920,"Computer Equip.-Hardware(Post Mar. 19/07)",0,0,0,0,null,0,0,0,0,0,null,0,0]
[10,1930,"Transportation Equipment",0,0,0,0,null,0,0,0,0,0,null,0,0]
[8,1935,"Stores Equipment",4320,0,0,4320,null,4320.2,0,0,4320.2,-0.1999999999998181,null,4320,4320.2]
[8,1940,"Tools, Shop & Garage Equipment",0,0,0,0,null,0,0,0,0,0,null,0,0]
[8,1945,"Measurement & Testing Equipment",15901.08,0,0,15901.08,null,6333.7539999999999,1590.1079999999999,0,7923.8620000000001,7977.2179999999998,null,15901.08,7128.808]
[8,1950,"Power Operated Equipment",0,0,0,0,null,0,0,0,0,0,null,0,0]
[8,1955,"Communications Equipment",0,0,0,0,null,0,0,0,0,0,null,0,0]
[8,1955,"Communication Equipment (Smart Meters)",0,0,0,0,null,0,0,0,0,0,null,0,0]
[8,1960,"Miscellaneous Equipment ",0,0,0,{"$f":"D255+E255+F255","v":0},null,0,0,0,0,0,null,0,0]
[47,1970,"Load Management Controls Customer Premises",0,0,0,{"$f":"D256+E256+F256","v":0},null,0,0,0,0,0,null,0,0]
[47,1975,"Load Management Controls Utility Premises",0,0,0,0,null,0,0,0,0,0,null,0,0]
[47,1980,"System Supervisor Equipment",0,0,0,0,null,0,0,0,0,0,null,0,0]
[47,1985,"Miscellaneous Fixed Assets",0,0,0,0,null,0,0,0,0,0,null,0,0]
[47,1990,"Other Tangible Property",0,0,0,0,null,0,0,0,0,0,null,0,0]
[47,1995,"Contributions & Grants",-1615759.64,-132000,0,-1747759.64,null,-294424.66375000001,-42043.99,0,-336468.65375,-1411290.9862499998,null,-1681759.64,-315446.65875]
[null,"etc.",null,0,0,0,0,null,0,0,0,0,0,null,0,0]
[null,"etc.",null,0,0,0,0,null,0,0,0,0,0,null,0,0]
[null,"etc.",null,0,0,0,0,null,0,0,0,0,0,null,0,0]
[null,"etc.",null,0,0,0,0,null,0,0,0,0,0,null,0,0]
[null,"etc.",null,0,0,0,0,null,0,0,0,0,0,null,0,0]
[null,"etc.",null,0,0,0,0,null,0,0,0,0,0,null,0,0]
[null,"etc.",null,0,0,0,0,null,0,0,0,0,0,null,0,0]
[null,"etc.",null,0,0,0,0,null,0,0,0,0,0,null,0,0]
[null,"etc.",null,0,0,0,0,null,0,0,0,0,0,null,0,0]
[null,"etc.",null,0,0,0,0,null,0,0,0,0,0,null,0,0]
[null,null,null,0,0,0,0,null,0,0,0,0,0,null,0,0]
[null,null,"Sub-Total",{"$f":"SUM(D224:D272)","v":4433944.82},{"$f":"SUM(E224:E272)","v":1706996},{"$f":"SUM(F224:F272)","v":0},{"$f":"SUM(G224:G272)","v":6140940.8200000003},null,{"$f":"SUM(I224:I272)","v":1637066.7358041124},{"$f":"SUM(J224:J272)","v":145816.75825000001},0,{"$f":"SUM(L224:L272)","v":1782883.494054113},{"$f":"SUM(M224:M272)","v":4358057.3259458877},null,{"$f":"SUM(O224:O272)","v":5287442.82},{"$f":"SUM(P224:P272)","v":1709975.1149291121}]
[null,null,"Less Socialized Renewable Energy Generation Investments (input as negative)Less Socialized Renewable Energy Generation Investments (input as negative)",null,null,null,{"$f":"D274+E274+F274","v":0},null,null,null,null,{"$f":"I274+J274+K274","v":0},{"$f":"G274+L274","v":0},null,null,{"$f":"O273-P273","v":3577467.7050708882}]
[null,null,"Less Other Non Rate-Regulated Utility Assets (input as negative)Less Other Non Rate-Regulated Utility Assets (input as negative)",null,null,null,{"$f":"D275+E275+F275","v":0},null,null,null,null,{"$f":"I275+J275+K275","v":0},{"$f":"G275+L275","v":0},null,null,{"$f":"AVERAGE(M276,M207)","v":3577467.7050708877}]
[null,null,"Total PP&E",{"$f":"SUM(D273:D275)","v":4433944.82},{"$f":"SUM(E273:E275)","v":1706996},{"$f":"SUM(F273:F275)","v":0},{"$f":"SUM(G273:G275)","v":6140940.8200000003},null,{"$f":"SUM(I273:I275)","v":1637066.7358041124},{"$f":"SUM(J273:J275)","v":145816.75825000001},{"$f":"SUM(K273:K275)","v":0},{"$f":"SUM(L273:L275)","v":1782883.494054113},{"$f":"SUM(M273:M275)","v":4358057.3259458877}]
[null,null,"Depreciation Expense adj. from gain or loss on the retirement of assets (pool of like assets)"]
[null,null,"Total",null,null,null,null,null,null,{"$f":"J276+J277","v":145816.75825000001}]
[]
[null,null,null,null,null,null,"Less: Fully Allocated Depreciation"]
[10,null,"Transportation",null,null,null,"Transportation"]
[8,null,"Stores Equipment",null,null,null,"Stores Equipment"]
[8,null,"Tools, Shop",null,null,null,"Tools, Shop"]
[8,null,"Meas/Testing",null,null,null,"Meas/Testing"]
[8,null,"Communication",null,null,null,"Communication"]
[null,null,null,null,null,null,"Net Depreciation",null,null,{"$f":"J278+J281+J285+J282+J283+J284","v":145816.75825000001}]
[]
[]
[null,null,null,null,"Year ",2018,"IFRS"]
[]
[null,null,null,"Cost",null,null,null,null,null,"Accumulated Depreciation"]
["CCA Class","OEB","Description","Opening Balance","Additions","Disposals","Closing Balance",null,"Opening Balance","Additions","Disposals","Closing Balance","Net Book Value",null,"AVG Gross Bal","AVG AccDep"]
[12,1611,"Computer Software (Formally known as Account 1925)",{"$f":"G224","v":133083.83000000002},3000,0,{"$f":"D293+E293+F293","v":136083.83000000002},null,{"$f":"L224","v":106630.16799999999},9931.366,0,{"$f":"I293+J293+K293","v":116561.53399999999},{"$f":"G293-L293","v":19522.296000000031},null,{"$f":"AVERAGE(G293,D293)","v":134583.83000000002},{"$f":"AVERAGE(L293,I293)","v":111595.851}]
["CEC",1612,"Land Rights (Formally known as Account 1906 and 1806)",{"$f":"G225","v":0},0,0,{"$f":"D294+E294+F294","v":0},null,{"$f":"L225","v":0},0,0,{"$f":"I294+J294+K294","v":0},{"$f":"G294-L294","v":0},null,0,0]
["N/A",1805,"Land",50000,0,0,{"$f":"D295+E295+F295","v":50000},null,0,0,0,{"$f":"I295+J295+K295","v":0},50000,null,50000,0]
[47,1808,"Buildings",0,0,0,{"$f":"D296+E296+F296","v":0},null,0,0,0,{"$f":"I296+J296+K296","v":0},0,null,0,0]
[13,1810,"Leasehold Improvements",0,0,0,0,null,0,0,0,0,0,null,0,0]
[47,1815,"Transformer Station Equipment >50 kV",0,0,0,0,null,0,0,0,0,0,null,0,0]
[47,1820,"Distribution Station Equipment <50 kV",1927705.77,0,0,1927705.77,null,137749.28311363637,35049.199999999997,0,172798.48311363638,1754907.2868863638,null,1927705.77,155273.88311363637]
[47,1825,"Storage Battery Equipment",0,0,0,0,null,12949.67275,null,0,12949.67275,-12949.67275,null,0,12949.67275]
[47,1830,"Poles, Towers & Fixtures",796245.61,48000,0,844245.61,null,267199.83074999996,20506.164249999998,0,287705.99499999994,556539.61499999999,null,820245.61,277452.91287499992]
[47,1835,"Overhead Conductors & Devices",977578.01000000013,0,0,977578.01000000013,null,327907.7541904762,16292.96,0,344200.71419047622,633377.2958095239,null,977578.01000000013,336054.23419047624]
[47,1840,"Underground Conduit",0,0,0,0,null,29251.127,null,0,29251.127,-29251.127,null,0,29251.127]
[47,1845,"Underground Conductors & Devices",2042060.3199999998,0,0,2042060.3199999998,null,588028.64350000001,58344.59,0,646373.23349999997,1395687.0864999997,null,2042060.3199999998,617200.93849999993]
[47,1850,"Line Transformers",1230529.83,74280,0,1304809.83,null,370086.56699999998,31691.73,0,401778.29699999996,903031.53300000005,null,1267669.83,385932.43199999997]
[47,1855,"Services (Overhead & Underground)",262962.96000000002,20000,0,282962.96000000002,null,98874.32,6824.07,0,105698.39000000001,177264.57,null,272962.96000000002,102286.35500000001]
[47,1860,"Meters",8000,8000,0,16000,null,0,null,0,0,16000,null,12000,0]
[47,1860,"Meters (Smart Meters)",353695,0,0,353695,null,94927.32,24379.66,0,119306.98000000001,234388.02,null,353695,107117.15000000001]
["N/A",1905,"Land",0,0,0,0,null,0,0,0,0,0,null,0,0]
[47,1908,"Buildings & Fixtures",0,0,0,0,null,0,0,0,0,0,null,0,0]
[13,1910,"Leasehold Improvements",0,0,0,0,null,0,0,0,0,0,null,0,0]
[8,1915,"Office Furniture & Equipment (10 years)",54519.5,1200,0,55719.5,null,45297.0605,2615.6080000000002,0,47912.6685,7806.8315000000002,null,55119.5,46604.864499999996]
[8,1915,"Office Furniture & Equipment (5 years)",0,0,0,0,null,0,0,0,0,0,null,0,0]
[10,1920,"Computer Equipment - Hardware",32098.55,1500,0,33598.550000000003,null,28206.339,1661.9759999999994,0,29868.314999999999,3730.2350000000042,null,32848.550000000003,29037.326999999997]
[45,1920,"Computer Equip.-Hardware(Post Mar. 22/04)",0,0,0,0,null,0,0,0,0,0,null,0,0]
[45.1,1920,"Computer Equip.-Hardware(Post Mar. 19/07)",0,0,0,0,null,0,0,0,0,0,null,0,0]
[10,1930,"Transportation Equipment",0,0,0,0,null,0,0,0,0,0,null,0,0]
[8,1935,"Stores Equipment",4320,0,0,4320,null,4320.2,0,0,4320.2,-0.1999999999998181,null,4320,4320.2]
[8,1940,"Tools, Shop & Garage Equipment",0,0,0,0,null,0,0,0,0,0,null,0,0]
[8,1945,"Measurement & Testing Equipment",15901.08,0,0,15901.08,null,7923.8620000000001,1590.11,0,9513.9719999999998,6387.1080000000002,null,15901.08,8718.9169999999995]
[8,1950,"Power Operated Equipment",0,0,0,0,null,0,0,0,0,0,null,0,0]
[8,1955,"Communications Equipment",0,0,0,0,null,0,0,0,0,0,null,0,0]
[8,1955,"Communication Equipment (Smart Meters)",0,0,0,0,null,0,0,0,0,0,null,0,0]
[8,1960,"Miscellaneous Equipment ",0,0,0,{"$f":"D324+E324+F324","v":0},null,0,0,0,0,0,null,0,0]
[47,1970,"Load Management Controls Customer Premises",0,0,0,{"$f":"D325+E325+F325","v":0},null,0,0,0,0,0,null,0,0]
[47,1975,"Load Management Controls Utility Premises",0,0,0,0,null,0,0,0,0,0,null,0,0]
[47,1980,"System Supervisor Equipment",0,0,0,0,null,0,0,0,0,0,null,0,0]
[47,1985,"Miscellaneous Fixed Assets",0,0,0,0,null,0,0,0,0,0,null,0,0]
[47,1990,"Other Tangible Property",0,0,0,0,null,0,0,0,0,0,null,0,0]
[47,1995,"Contributions & Grants",-1747759.64,-5775,0,-1753534.64,null,-336468.65375,-43766.12,0,-380234.77374999999,-1373299.86625,null,-1750647.14,-358351.71375]
[null,"etc.",null,0,0,0,0,null,0,0,0,0,0,null,0,0]
[null,"etc.",null,0,0,0,0,null,0,0,0,0,0,null,0,0]
[null,"etc.",null,0,0,0,0,null,0,0,0,0,0,null,0,0]
[null,"etc.",null,0,0,0,0,null,0,0,0,0,0,null,0,0]
[null,"etc.",null,0,0,0,0,null,0,0,0,0,0,null,0,0]
[null,"etc.",null,0,0,0,0,null,0,0,0,0,0,null,0,0]
[null,"etc.",null,0,0,0,0,null,0,0,0,0,0,null,0,0]
[null,"etc.",null,0,0,0,0,null,0,0,0,0,0,null,0,0]
[null,"etc.",null,0,0,0,0,null,0,0,0,0,0,null,0,0]
[null,"etc.",null,{"$f":"G271","v":0},0,0,0,null,0,0,0,0,0,null,0,0]
[null,null,null,{"$f":"G272","v":0},0,0,0,null,{"$f":"L272","v":0},0,0,0,0,null,0,0]
[null,null,"Sub-Total",{"$f":"SUM(D293:D341)","v":6140940.8200000003},{"$f":"SUM(E293:E341)","v":150205},{"$f":"SUM(F293:F341)","v":0},{"$f":"SUM(G293:G341)","v":6291145.8200000003},null,{"$f":"SUM(I293:I341)","v":1782883.494054113},{"$f":"SUM(J293:J341)","v":165121.31425},0,{"$f":"SUM(L293:L341)","v":1948004.8083041126},{"$f":"SUM(M293:M341)","v":4343141.0116958879},null,{"$f":"SUM(O293:O341)","v":6216043.3200000003},{"$f":"SUM(P293:P341)","v":1865444.1511791125}]
[null,null,"Less Socialized Renewable Energy Generation Investments (input as negative)Less Socialized Renewable Energy Generation Investments (input as negative)",null,null,null,{"$f":"D343+E343+F343","v":0},null,null,null,null,{"$f":"I343+J343+K343","v":0},{"$f":"G343+L343","v":0},null,null,{"$f":"O342-P342","v":4350599.1688208878}]
[null,null,"Less Other Non Rate-Regulated Utility Assets (input as negative)Less Other Non Rate-Regulated Utility Assets (input as negative)",null,null,null,{"$f":"D344+E344+F344","v":0},null,null,null,null,{"$f":"I344+J344+K344","v":0},{"$f":"G344+L344","v":0},null,null,{"$f":"AVERAGE(M345,M276)","v":4350599.1688208878}]
[null,null,"Total PP&E",{"$f":"SUM(D342:D344)","v":6140940.8200000003},{"$f":"SUM(E342:E344)","v":150205},{"$f":"SUM(F342:F344)","v":0},{"$f":"SUM(G342:G344)","v":6291145.8200000003},null,{"$f":"SUM(I342:I344)","v":1782883.494054113},{"$f":"SUM(J342:J344)","v":165121.31425},{"$f":"SUM(K342:K344)","v":0},{"$f":"SUM(L342:L344)","v":1948004.8083041126},{"$f":"SUM(M342:M344)","v":4343141.0116958879}]
[null,null,"Depreciation Expense adj. from gain or loss on the retirement of assets (pool of like assets)"]
[null,null,"Total",null,null,null,null,null,null,{"$f":"J345+J346","v":165121.31425}]
[]
[null,null,null,null,null,null,"Less: Fully Allocated Depreciation"]
[10,null,"Transportation",null,null,null,"Transportation"]
[8,null,"Stores Equipment",null,null,null,"Stores Equipment"]
[8,null,"Tools, Shop",null,null,null,"Tools, Shop"]
[8,null,"Meas/Testing",null,null,null,"Meas/Testing"]
[8,null,"Communication",null,null,null,"Communication"]
[null,null,null,null,null,null,"Net Depreciation",null,null,{"$f":"J347+J350+J354+J351+J352+J353","v":165121.31425}]

{"sheet":"Appendix 2-BB Service Life  ","index":10,"n_rows":107,"n_cols":17,"rows_kept":107,"cut":false,"hidden":false,"merged":[[100,2,100,4],[100,6,100,7],[103,0,103,7],[97,2,97,4],[97,6,97,7],[98,2,98,4],[98,6,98,7],[99,2,99,4],[99,6,99,7],[94,2,94,4],[94,6,94,7],[95,2,95,4],[95,6,95,7],[96,2,96,4],[96,6,96,7],[92,1,93,1],[92,2,93,2],[92,3,92,4],[92,6,92,7],[93,3,93,4],[93,6,93,7],[88,1,91,1],[88,2,91,2],[88,3,88,4],[88,6,88,7],[89,3,89,4],[89,6,89,7],[90,3,90,4],[90,6,90,7],[91,3,91,4],[91,6,91,7],[86,1,87,1],[86,2,87,2],[86,3,86,4],[86,6,86,7],[87,3,87,4],[87,6,87,7],[82,1,85,1],[82,2,85,2],[82,3,82,4],[82,6,82,7],[83,3,83,4],[83,6,83,7],[84,3,84,4],[84,6,84,7],[85,3,85,4],[85,6,85,7],[80,2,80,4],[80,6,80,7],[81,2,81,4],[81,5,81,7],[74,13,74,14],[74,15,74,16],[75,2,75,4],[76,2,76,4],[76,6,76,7],[74,10,75,10],[74,11,74,12],[77,6,77,7],[78,3,78,4],[72,0,72,7],[74,2,74,4],[74,5,75,7],[74,9,75,9],[78,6,78,7],[79,3,79,4],[79,6,79,7],[69,2,69,4],[60,2,60,4],[61,2,61,4],[62,1,63,1],[62,2,63,2],[62,3,62,4],[63,3,63,4],[77,1,79,1],[77,2,79,2],[77,3,77,4],[59,2,59,4],[49,2,49,4],[50,0,68,0],[50,2,50,4],[51,2,51,4],[52,2,52,4],[53,2,53,4],[54,2,54,4],[55,2,55,4],[64,2,64,4],[65,2,65,4],[66,2,66,4],[67,2,67,4],[68,2,68,4],[33,0,49,0],[33,1,35,1],[33,2,35,2],[33,3,33,4],[34,3,34,4],[43,2,43,4],[44,2,44,4],[45,2,45,4],[46,2,46,4],[47,2,47,4],[48,2,48,4],[56,2,56,4],[57,1,58,1],[57,2,58,2],[57,3,57,4],[58,3,58,4],[38,1,40,1],[38,2,40,2],[38,3,38,4],[39,3,39,4],[40,3,40,4],[41,1,42,1],[41,3,41,4],[42,3,42,4],[35,3,35,4],[36,2,36,4],[37,2,37,4],[16,0,32,0],[16,1,18,1],[16,2,18,2],[16,3,16,4],[17,3,18,3],[25,2,25,4],[26,2,26,4],[27,2,27,4],[28,2,28,4],[29,2,29,4],[30,2,30,4],[19,1,21,1],[19,2,21,2],[19,3,19,4],[20,3,21,3],[22,1,24,1],[22,2,24,2],[22,3,22,4],[23,3,24,3],[32,2,32,4],[0,15,0,16],[1,15,1,16],[2,15,2,16],[3,15,3,16],[4,15,4,16],[6,15,6,16],[14,11,14,12],[14,13,14,14],[31,2,31,4],[14,2,14,4],[14,5,14,7],[14,9,15,9],[14,10,15,10],[8,0,8,16],[9,0,9,16],[10,0,10,16],[14,15,14,16],[15,2,15,4]]}
[null,null,null,null,null,null,null,null,null,null,null,null,null,"File Number:",null,0]
["NOT APPLICABLE",null,null,null,null,null,null,null,null,null,null,null,null,"Exhibit:"]
[null,null,null,null,null,null,null,null,null,null,null,null,null,"Tab:"]
[null,null,null,null,null,null,null,null,null,null,null,null,null,"Schedule:"]
[null,null,null,null,null,null,null,null,null,null,null,null,null,"Page:"]
[]
[null,null,null,null,null,null,null,null,null,null,null,null,null,"Date:"]
[]
["Appendix 2-BB"]
["Service Life Comparison"]
["Table F-1 from Kinetrics Report1"]
[]
[]
[]
[null,null,"Asset Details",null,null,"Useful Life",null,null,null,"USoA Account Number","USoA Account Description","Current",null,"Proposed",null,"Outside Range of Min, Max TUL?"]
["Parent*","#","Category| Component | Type",null,null,"MIN UL","TUL","MAX UL",null,null,null,"Years","Rate","Years","Rate","Below Min TUL","Above Max TUL"]
["OH",1,"Fully Dressed Wood Poles","Overall",null,35,45,75,null,null,null,null,{"$f":"IF(ISERROR(1/L17), \"\", 1/L17)","v":""},null,{"$f":"IF(ISERROR(1/N17), \"\", 1/N17)","v":""},{"$f":"IF(ISBLANK(N17),\"\",IF(N17<F17,\"Yes\",\"No\"))","v":""},{"$f":"IF(ISBLANK(N17),\"\",IF(N17>H17,\"Yes\",\"No\"))","v":""}]
[null,null,null,"Cross Arm","Wood",20,40,55,null,null,null,null,{"$f":"IF(ISERROR(1/L18), \"\", 1/L18)","v":""},null,{"$f":"IF(ISERROR(1/N18), \"\", 1/N18)","v":""},{"$f":"IF(ISBLANK(N18),\"\",IF(N18<F18,\"Yes\",\"No\"))","v":""},{"$f":"IF(ISBLANK(N18),\"\",IF(N18>H18,\"Yes\",\"No\"))","v":""}]
[null,null,null,null,"Steel",30,70,95,null,null,null,null,"",null,"","",""]
[null,2,"Fully Dressed Concrete Poles","Overall",null,50,60,80,null,null,null,null,"",null,"","",""]
[null,null,null,"Cross Arm","Wood",20,40,55,null,null,null,null,"",null,"","",""]
[null,null,null,null,"Steel",30,70,95,null,null,null,null,"",null,"","",""]
[null,3,"Fully Dressed Steel Poles","Overall",null,60,60,80,null,null,null,null,"",null,"","",""]
[null,null,null,"Cross Arm","Wood",20,40,55,null,null,null,null,"",null,"","",""]
[null,null,null,null,"Steel",30,70,95,null,null,null,null,"",null,"","",""]
[null,4,"OH Line Switch",null,null,30,45,55,null,null,null,null,"",null,"","",""]
[null,5,"OH Line Switch Motor",null,null,15,25,25,null,null,null,null,"",null,"","",""]
[null,6,"OH Line Switch RTU",null,null,15,20,20,null,null,null,null,"",null,"","",""]
[null,7,"OH Integral Switches",null,null,35,45,60,null,null,null,null,"",null,"","",""]
[null,8,"OH Conductors",null,null,50,60,75,null,null,null,null,"",null,"","",""]
[null,9,"OH Transformers & Voltage Regulators",null,null,30,40,60,null,null,null,null,"",null,"","",""]
[null,10,"OH Shunt Capacitor Banks",null,null,25,30,40,null,null,null,null,"",null,"","",""]
[null,11,"Reclosers",null,null,25,40,55,null,null,null,null,"",null,"","",""]
["TS & MS",12,"Power Transformers","Overall",null,30,45,60,null,null,null,null,"",null,"","",""]
[null,null,null,"Bushing",null,10,20,30,null,null,null,null,"",null,"","",""]
[null,null,null,"Tap Changer",null,20,30,60,null,null,null,null,"",null,"","",""]
[null,13,"Station Service Transformer",null,null,30,45,55,null,null,null,null,"",null,"","",""]
[null,14,"Station Grounding Transformer",null,null,30,40,40,null,null,null,null,"",null,"","",""]
[null,15,"Station DC System","Overall",null,10,20,30,null,null,null,null,"",null,"","",""]
[null,null,null,"Battery Bank",null,10,15,15,null,null,null,null,"",null,"","",""]
[null,null,null,"Charger",null,20,20,30,null,null,null,null,"",null,"","",""]
[null,16,"Station Metal Clad Switchgear","Overall",null,30,40,60,null,null,null,null,"",null,"","",""]
[null,null,null,"Removable Breaker",null,25,40,60,null,null,null,null,"",null,"","",""]
[null,17,"Station Independent Breakers",null,null,35,45,65,null,null,null,null,"",null,"","",""]
[null,18,"Station Switch",null,null,30,50,60,null,null,null,null,"",null,"","",""]
[null,19,"Electromechanical Relays",null,null,25,35,50,null,null,null,null,"",null,"","",""]
[null,20,"Solid State Relays",null,null,10,30,45,null,null,null,null,"",null,"","",""]
[null,21,"Digital & Numeric Relays",null,null,15,20,20,null,null,null,null,"",null,"","",""]
[null,22,"Rigid Busbars",null,null,30,55,60,null,null,null,null,"",null,"","",""]
[null,23,"Steel Structure",null,null,35,50,90,null,null,null,null,"",null,"","",""]
["UG",24,"Primary Paper Insulated Lead Covered (PILC) Cables",null,null,60,65,75,null,null,null,null,"",null,"","",""]
[null,25,"Primary Ethylene-Propylene Rubber (EPR) Cables",null,null,20,25,25,null,null,null,null,"",null,"","",""]
[null,26,"Primary Non-Tree Retardant (TR) Cross Linked \nPolyethylene (XLPE) Cables Direct Buried",null,null,20,25,30,null,null,null,null,"",null,"","",""]
[null,27,"Primary Non-TR XLPE Cables in Duct",null,null,20,25,30,null,null,null,null,"",null,"","",""]
[null,30,"Secondary PILC Cables",null,null,70,75,80,null,null,null,null,"",null,"","",""]
[null,31,"Secondary Cables Direct Buried",null,null,25,35,40,null,null,null,null,"",null,"","",""]
[null,32,"Secondary Cables in Duct",null,null,35,40,60,null,null,null,null,"",null,"","",""]
[null,33,"Network Tranformers","Overall",null,20,35,50,null,null,null,null,"",null,"","",""]
[null,null,null,"Protector",null,20,35,40,null,null,null,null,"",null,"","",""]
[null,34,"Pad-Mounted Transformers",null,null,25,40,45,null,null,null,null,"",null,"","",""]
[null,35,"Submersible/Vault Transformers",null,null,25,35,45,null,null,null,null,"",null,"","",""]
[null,36,"UG Foundation",null,null,35,55,70,null,null,null,null,"",null,"","",""]
[null,37,"UG Vaults","Overall",null,40,60,80,null,null,null,null,"",null,"","",""]
[null,null,null,"Roof",null,20,30,45,null,null,null,null,"",null,"","",""]
[null,38,"UG Vault Switches",null,null,20,35,50,null,null,null,null,"",null,"","",""]
[null,39,"Pad-Mounted Switchgear",null,null,20,30,45,null,null,null,null,"",null,"","",""]
[null,40,"Ducts",null,null,30,50,85,null,null,null,null,"",null,"","",""]
[null,41,"Concrete Encased Duct Banks",null,null,35,55,80,null,null,null,null,"",null,"","",""]
[null,42,"Cable Chambers",null,null,50,60,80,null,null,null,null,"",null,"","",""]
["S",43,"Remote SCADA",null,null,15,20,30,null,null,null,null,"",null,"","",""]
[]
[]
["Table F-2 from Kinetrics Report1"]
[]
[null,null,"Asset Details",null,null,"Useful Life Range",null,null,null,"USoA Account Number","USoA Account Description","Current",null,"Proposed",null,"Outside Range of Min, Max TUL?"]
[null,"#","Category| Component | Type",null,null,null,null,null,null,null,null,"Years","Rate","Years","Rate","Below Min Range","Above Max Range"]
[null,1,"Office Equipment",null,null,5,15,null,null,null,null,null,{"$f":"IF(ISERROR(1/L77), \"\", 1/L77)","v":""},null,{"$f":"IF(ISERROR(1/N77), \"\", 1/N77)","v":""},{"$f":"IF(ISBLANK(N77),\"\",IF(N77<F77,\"Yes\",\"No\"))","v":""},{"$f":"IF(ISBLANK(N77),\"\",IF(N77>G77,\"Yes\",\"No\"))","v":""}]
[null,2,"Vehicles","Trucks & Buckets",null,5,15,null,null,null,null,null,{"$f":"IF(ISERROR(1/L78), \"\", 1/L78)","v":""},null,{"$f":"IF(ISERROR(1/N78), \"\", 1/N78)","v":""},{"$f":"IF(ISBLANK(N78),\"\",IF(N78<F78,\"Yes\",\"No\"))","v":""},{"$f":"IF(ISBLANK(N78),\"\",IF(N78>G78,\"Yes\",\"No\"))","v":""}]
[null,null,null,"Trailers",null,5,20,null,null,null,null,null,"",null,"","",""]
[null,null,null,"Vans",null,5,10,null,null,null,null,null,"",null,"","",""]
[null,3,"Administrative Buildings",null,null,50,75,null,null,null,null,null,"",null,"","",""]
[null,4,"Leasehold Improvements",null,null,"Lease dependent",null,null,null,null,null,null,"",null,""]
[null,5,"Station Buildings","Station Buildings",null,50,75,null,null,null,null,null,"",null,"","",""]
[null,null,null,"Parking",null,25,30,null,null,null,null,null,"",null,"","",""]
[null,null,null,"Fence",null,25,60,null,null,null,null,null,"",null,"","",""]
[null,null,null,"Roof",null,20,30,null,null,null,null,null,"",null,"","",""]
[null,6,"Computer Equipment","Hardware",null,3,5,null,null,null,null,null,"",null,"","",""]
[null,null,null,"Software",null,2,5,null,null,null,null,null,"",null,"","",""]
[null,7,"Equipment","Power Operated",null,5,10,null,null,null,null,null,"",null,"","",""]
[null,null,null,"Stores",null,5,10,null,null,null,null,null,"",null,"","",""]
[null,null,null,"Tools, Shop, Garage Equipment",null,5,10,null,null,null,null,null,"",null,"","",""]
[null,null,null,"Measurement & Testing Equipment",null,5,10,null,null,null,null,null,"",null,"","",""]
[null,8,"Communication","Towers",null,60,70,null,null,null,null,null,"",null,"","",""]
[null,null,null,"Wireless",null,2,10,null,null,null,null,null,"",null,"","",""]
[null,9,"Residential Energy Meters",null,null,25,35,null,null,null,null,null,"",null,"","",""]
[null,10,"Industrial/Commercial Energy Meters",null,null,25,35,null,null,null,null,null,"",null,"","",""]
[null,11,"Wholesale Energy Meters",null,null,15,30,null,null,null,null,null,"",null,"","",""]
[null,12,"Current & Potential Transformer (CT & PT)",null,null,35,50,null,null,null,null,null,"",null,"","",""]
[null,13,"Smart Meters",null,null,5,15,null,null,null,null,null,"",null,"","",""]
[null,14,"Repeaters - Smart Metering",null,null,10,15,null,null,null,null,null,"",null,"","",""]
[null,15,"Data Collectors - Smart Metering",null,null,15,20,null,null,null,null,null,"",null,"","",""]
[]
[]
["* TS & MS = Transformer and Municipal Stations UG = Underground Systems S = Monitoring and Control Systems"]
[]
["Note 1:","Tables F-1 and F-2 above are to be used as a reference in order to complete columns J, K, L and N."]
[null,"See pages 17-19 of Kinetrics Report"]

{"sheet":"App.2-CA_OldCGAAPDepExp_Yr1","index":11,"n_rows":65,"n_cols":12,"rows_kept":65,"cut":false,"hidden":false,"merged":[[13,2,13,9],[61,1,61,11],[62,1,63,9],[64,1,65,11],[8,0,8,11],[9,0,9,11],[17,0,18,0],[17,1,18,1],[17,10,18,10],[10,1,10,10],[12,0,12,1],[13,0,13,1],[14,0,14,1],[14,2,14,9]]}
[null,null,null,null,null,null,null,null,null,null,"File Number:",{"$f":"EBNUMBER","v":0}]
["NOT APPLICABLE",null,null,null,null,null,null,null,null,null,"Exhibit:"]
[null,null,null,null,null,null,null,null,null,null,"Tab:"]
[null,null,null,null,null,null,null,null,null,null,"Schedule:"]
[null,null,null,null,null,null,null,null,null,null,"Page:"]
[]
[null,null,null,null,null,null,null,null,null,null,"Date:"]
[]
["Appendix 2-CA"]
["Depreciation and Amortization Expense"]
[null,"Former CGAAP (Year 1)"]
[]
["Select the set of appendices that apply",null,null,null,null,null,null,null,null,null,"Year Reflected in Schedule Below","Accounting Standard"]
["2012 Set of Appendices (2-CA to 2-CG)",null,"Assumes the applicant made capitalization and depreciation expense accounting policy changes under CGAAP effective January 1, 2012 and has adopted IFRS for financial reporting purposes effective January 1, 2015.  Assumes that the applicant is reflecting these changes in a rebasing application for the first time.",null,null,null,null,null,null,null,2012,"Former CGAAP"]
["2013 Set of Appendices (2-CA to 2-CF)",null,"Assumes the applicant made capitalization and depreciation expense accounting policy changes under CGAAP effective January 1, 2013 and has adopted IFRS for financial reporting purposes effective January 1, 2015.  Assumes that the applicant is reflecting these changes in a rebasing application for the first time.",null,null,null,null,null,null,null,2013,"Former CGAAP"]
[]
[]
["Account","Description","Opening Regulatory Gross PP&E as at Jan. 1","Less Fully Depreciated","Net for Depreciation","Additions","Total for Depreciation 1","Years","Depreciation Rate","Current Year Depreciation Expense","Depreciation Expense per Appendix 2-BA Fixed Assets, Column J \n (l)","Variance 2"]
[null,null,"(a)","(b)","(c)","(d)","(e) = (c) + ½ x (d) ","(f)","(g) = 1 / (f)","(h) = (e) / (f)",null,"(m) = (h) - (l)"]
[1611,"Computer Software (Formally known as Account 1925)",null,null,{"$f":"C20-D20","v":0},null,{"$f":"E20+0.5*F20","v":0},null,{"$f":"IF(H20=0,0,1/H20)","v":0},{"$f":"IF(H20=0,0,G20/H20)","v":0},null,{"$f":"IF(ISERROR(+J20-K20), 0, +J20-K20)","v":0}]
[1612,"Land Rights (Formally known as Account 1906)",null,null,{"$f":"C21-D21","v":0},null,{"$f":"E21+0.5*F21","v":0},null,0,0,null,0]
[1805,"Land",null,null,0,null,0,null,0,0,null,0]
[1808,"Buildings",null,null,0,null,0,null,0,0,null,0]
[1810,"Leasehold Improvements",null,null,0,null,0,null,0,0,null,0]
[1815,"Transformer Station Equipment >50 kV",null,null,0,null,0,null,0,0,null,0]
[1820,"Distribution Station Equipment <50 kV",null,null,0,null,0,null,0,0,null,0]
[1825,"Storage Battery Equipment",null,null,0,null,0,null,0,0,null,0]
[1830,"Poles, Towers & Fixtures",null,null,0,null,0,null,0,0,null,0]
[1835,"Overhead Conductors & Devices",null,null,0,null,0,null,0,0,null,0]
[1840,"Underground Conduit",null,null,0,null,0,null,0,0,null,0]
[1845,"Underground Conductors & Devices",null,null,0,null,0,null,0,0,null,0]
[1850,"Line Transformers",null,null,0,null,0,null,0,0,null,0]
[1855,"Services (Overhead & Underground)",null,null,0,null,0,null,0,0,null,0]
[1860,"Meters",null,null,0,null,0,null,0,0,null,0]
[1860,"Meters (Smart Meters)",null,null,0,null,0,null,0,0,null,0]
[1905,"Land",null,null,0,null,0,null,0,0,null,0]
[1908,"Buildings & Fixtures",null,null,0,null,0,null,0,0,null,0]
[1910,"Leasehold Improvements",null,null,0,null,0,null,0,0,null,0]
[1915,"Office Furniture & Equipment (10 years)",null,null,0,null,0,null,0,0,null,0]
[1915,"Office Furniture & Equipment (5 years)",null,null,0,null,0,null,0,0,null,0]
[1920,"Computer Equipment - Hardware",null,null,0,null,0,null,0,0,null,0]
[1920,"Computer Equip.-Hardware(Post Mar. 22/04)",null,null,0,null,0,null,0,0,null,0]
[1920,"Computer Equip.-Hardware(Post Mar. 19/07)",null,null,0,null,0,null,0,0,null,0]
[1930,"Transportation Equipment",null,null,0,null,0,null,0,0,null,0]
[1935,"Stores Equipment",null,null,0,null,0,null,0,0,null,0]
[1940,"Tools, Shop & Garage Equipment",null,null,0,null,0,null,0,0,null,0]
[1945,"Measurement & Testing Equipment",null,null,0,null,0,null,0,0,null,0]
[1950,"Power Operated Equipment",null,null,0,null,0,null,0,0,null,0]
[1955,"Communications Equipment",null,null,0,null,0,null,0,0,null,0]
[1955,"Communication Equipment (Smart Meters)",null,null,0,null,0,null,0,0,null,0]
[1960,"Miscellaneous Equipment ",null,null,0,null,0,null,0,0,null,0]
[1970,"Load Management Controls Customer Premises",null,null,0,null,0,null,0,0,null,0]
[1975,"Load Management Controls Utility Premises",null,null,0,null,0,null,0,0,null,0]
[1980,"System Supervisor Equipment",null,null,0,null,0,null,0,0,null,0]
[1985,"Miscellaneous Fixed Assets",null,null,0,null,0,null,0,0,null,0]
[1990,"Other Tangible Property",null,null,0,null,0,null,0,0,null,0]
[1995,"Contributions & Grants",null,null,0,null,0,null,0,0,null,0]
[null,"Total",{"$f":"SUM(C20:C57)","v":0},{"$f":"SUM(D20:D57)","v":0},{"$f":"SUM(E20:E57)","v":0},{"$f":"SUM(F20:F57)","v":0},{"$f":"SUM(G20:G57)","v":0},null,null,{"$f":"SUM(J20:J57)","v":0},{"$f":"SUM(K20:K57)","v":0},{"$f":"SUM(L20:L57)","v":0}]
[]
["Notes:"]
[]
[1,"Board policy of the \"half-year\" rule - the applicant must ensure that additions in the year attract a half-year depreciation expense in the first year.  Deviations from this standard practice must be supported in the application."]
[2,"The applicant must provide an explanation of material variances."]
[]
["General","Applicants must provide a breakdown of depreciation and amortization expense in the above format for all relevant accounts.  Asset Retirement Obligations (AROs), depreciation and accretion expense should be disclosed separately consistent with the Notes of historical Audited Financial Statements."]

{"sheet":"App.2-CB_NewCGAAP_DepExp_Yr1","index":12,"n_rows":69,"n_cols":15,"rows_kept":69,"cut":false,"hidden":false,"merged":[[8,0,8,14],[9,0,9,14],[17,0,18,0],[17,1,18,1],[17,10,18,10],[17,13,18,13],[10,0,10,14],[12,0,12,1],[12,11,12,12],[13,0,13,1],[13,2,13,10],[13,11,13,12],[14,0,14,1],[14,2,14,10],[14,11,14,12],[68,1,69,14],[61,1,61,14],[62,1,62,14],[63,1,63,14],[64,1,64,14],[65,1,65,14],[66,1,66,14]]}
[null,null,null,null,null,null,null,null,null,null,null,null,null,"File Number:",{"$f":"EBNUMBER","v":0}]
[null,"NOT APPLICABLE",null,null,null,null,null,null,null,null,null,null,null,"Exhibit:"]
[null,null,null,null,null,null,null,null,null,null,null,null,null,"Tab:"]
[null,null,null,null,null,null,null,null,null,null,null,null,null,"Schedule:"]
[null,null,null,null,null,null,null,null,null,null,null,null,null,"Page:"]
[]
[null,null,null,null,null,null,null,null,null,null,null,null,null,"Date:"]
[]
["Appendix 2-CB"]
["Depreciation and Amortization Expense"]
["Revised CGAAP (Year 1)"]
[]
["Select the set of appendices that apply",null,null,null,null,null,null,null,null,null,null,"Year Reflected in Schedule Below",null,"Accounting Standard"]
["2012 Set of Appendices (2-CA to 2-CG)",null,"Assumes the applicant made capitalization and depreciation expense accounting policy changes under CGAAP effective January 1, 2012 and has adopted IFRS for financial reporting purposes effective January 1, 2015.  Assumes that the applicant is reflecting these changes in a rebasing application for the first time.",null,null,null,null,null,null,null,null,2012,null,"Revised CGAAP"]
["2013 Set of Appendices (2-CA to 2-CF)",null,"Assumes the applicant made capitalization and depreciation expense accounting policy changes under CGAAP effective January 1, 2013 and has adopted IFRS for financial reporting purposes effective January 1, 2015.  Assumes that the applicant is reflecting these changes in a rebasing application for the first time.",null,null,null,null,null,null,null,null,2013,null,"Revised CGAAP"]
[]
[]
["Account","Description","Opening NBV as at Jan 15","Additions","Average Remaining Life of Opening NBV 4","Years (new additions only) 3","Depreciation Rate on New Additions","Depreciation Expense on Opening NBV","Depreciation Expense on Additions 1","Current Year Depreciation Expense ","Depreciation Expense per Appendix 2-BA Fixed Assets, Column J \n (l)","Variance 2","Depreciation Expense on Current Full Year Additions","Less Depreciation Expense on Assets Fully Depreciated During the Year\n(o)","Current Full Year Depreciation 6"]
[null,null,"(a)","(d)","(i)","(f)","(g) = 1 / (f)","(j) = (a) / (i)","(h)=((d)*0.5)/(f) ","(k) = (j) + (h)",null,"(m) = (k) - (l)","(n) = (d)/(f) ",null,"(p) = (j) + (n) - (o)"]
[1611,"Computer Software (Formally known as Account 1925)",null,null,null,null,{"$f":"IF(F20=0,0,1/F20)","v":0},{"$f":"IF(E20=0,0,+C20/E20)","v":0},{"$f":"IF(F20=0,0,+(D20*0.5)/F20)","v":0},{"$f":"IF(ISERROR(+H20+I20), 0, +H20+I20)","v":0},null,{"$f":"IF(ISERROR(+J20-K20), 0, +J20-K20)","v":0},{"$f":"IF(F20=0,0,+(D20)/F20)","v":0},null,{"$f":"IF(ISERROR(+M20+H20-N20), 0, +M20+H20-N20)","v":0}]
[1612,"Land Rights (Formally known as Account 1906)",null,null,null,null,0,0,0,0,null,0,0,null,{"$f":"IF(ISERROR(+M21+H21-N21), 0, +M21+H21-N21)","v":0}]
[1805,"Land",null,null,null,null,0,0,0,0,null,0,0,null,0]
[1808,"Buildings",null,null,null,null,0,0,0,0,null,0,0,null,0]
[1810,"Leasehold Improvements",null,null,null,null,0,0,0,0,null,0,0,null,0]
[1815,"Transformer Station Equipment >50 kV",null,null,null,null,0,0,0,0,null,0,0,null,0]
[1820,"Distribution Station Equipment <50 kV",null,null,null,null,0,0,0,0,null,0,0,null,0]
[1825,"Storage Battery Equipment",null,null,null,null,0,0,0,0,null,0,0,null,0]
[1830,"Poles, Towers & Fixtures",null,null,null,null,0,0,0,0,null,0,0,null,0]
[1835,"Overhead Conductors & Devices",null,null,null,null,0,0,0,0,null,0,0,null,0]
[1840,"Underground Conduit",null,null,null,null,0,0,0,0,null,0,0,null,0]
[1845,"Underground Conductors & Devices",null,null,null,null,0,0,0,0,null,0,0,null,0]
[1850,"Line Transformers",null,null,null,null,0,0,0,0,null,0,0,null,0]
[1855,"Services (Overhead & Underground)",null,null,null,null,0,0,0,0,null,0,0,null,0]
[1860,"Meters",null,null,null,null,0,0,0,0,null,0,0,null,0]
[1860,"Meters (Smart Meters)",null,null,null,null,0,0,0,0,null,0,0,null,0]
[1905,"Land",null,null,null,null,0,0,0,0,null,0,0,null,0]
[1908,"Buildings & Fixtures",null,null,null,null,0,0,0,0,null,0,0,null,0]
[1910,"Leasehold Improvements",null,null,null,null,0,0,0,0,null,0,0,null,0]
[1915,"Office Furniture & Equipment (10 years)",null,null,null,null,0,0,0,0,null,0,0,null,0]
[1915,"Office Furniture & Equipment (5 years)",null,null,null,null,0,0,0,0,null,0,0,null,0]
[1920,"Computer Equipment - Hardware",null,null,null,null,0,0,0,0,null,0,0,null,0]
[1920,"Computer Equip.-Hardware(Post Mar. 22/04)",null,null,null,null,0,0,0,0,null,0,0,null,0]
[1920,"Computer Equip.-Hardware(Post Mar. 19/07)",null,null,null,null,0,0,0,0,null,0,0,null,0]
[1930,"Transportation Equipment",null,null,null,null,0,0,0,0,null,0,0,null,0]
[1935,"Stores Equipment",null,null,null,null,0,0,0,0,null,0,0,null,0]
[1940,"Tools, Shop & Garage Equipment",null,null,null,null,0,0,0,0,null,0,0,null,0]
[1945,"Measurement & Testing Equipment",null,null,null,null,0,0,0,0,null,0,0,null,0]
[1950,"Power Operated Equipment",null,null,null,null,0,0,0,0,null,0,0,null,0]
[1955,"Communications Equipment",null,null,null,null,0,0,0,0,null,0,0,null,0]
[1955,"Communication Equipment (Smart Meters)",null,null,null,null,0,0,0,0,null,0,0,null,0]
[1960,"Miscellaneous Equipment ",null,null,null,null,0,0,0,0,null,0,0,null,0]
[1970,"Load Management Controls Customer Premises",null,null,null,null,0,0,0,0,null,0,0,null,0]
[1975,"Load Management Controls Utility Premises",null,null,null,null,0,0,0,0,null,0,0,null,0]
[1980,"System Supervisor Equipment",null,null,null,null,0,0,0,0,null,0,0,null,0]
[1985,"Miscellaneous Fixed Assets",null,null,null,null,0,0,0,0,null,0,0,null,0]
[1990,"Other Tangible Property",null,null,null,null,0,0,0,0,null,0,0,null,0]
[1995,"Contributions & Grants",null,null,null,null,0,0,0,0,null,0,0,null,0]
[null,"Total",{"$f":"SUM(C20:C57)","v":0},{"$f":"SUM(D20:D57)","v":0},null,null,null,{"$f":"SUM(H20:H57)","v":0},0,0,0,0,0,0,0]
[]
["Notes:"]
[]
[1,"Board policy of the \"half-year\" rule - the applicant must ensure that additions in the year attract a half-year depreciation expense in the first year.  Deviations from this standard practice must be supported in the application."]
[2,"The applicant must provide an explanation of material variances in evidence."]
[3,"The applicant should ensure that the years for new additions of assets are the asset useful lives determined by management in accordance with the Board's regulatory accounting policies.   The capitalization and depreciation expense accounting changes should be implemented consistent with the Board’s regulatory accounting policies as set out for modified IFRS as contained in the Report of the Board, Transition to International Financial Reporting Standards, EB-2008-0408, the Kinectrics Report, and the Revised 2012 Accounting Procedures Handbook for Electricity Distributors (“APH”)."]
[4,"A recalculation should be performed to determine the average remaining life of opening balance of assets (i.e. excluding current year's additions) under the change in policies under CGAAP.  For example, Asset A had a useful life of 20 years under CGAAP without the change in policies.  On January 1 of the year of policy changes, Asset A was 3 years depreciated. As a result, Asset A would have a remaining service life of 17 years (20 years less 3 years) as at January 1 of the year of policy changes.  Due to making the change in policies under CGAAP, management re-assessed the asset useful lives and concluded that the revised useful life of Asset A is now 30 years. Therefore, the average remaining useful life of the opening balance of Asset A is determined to be 27 years (30 years less 3 years) under the revised CGAAP as at January 1 of the year of policy changes."]
[5," NBV must exclude assets still on the books but which have been fully amortized or depreciated."]
[6,"This column refers to the calculated full year depreciation but excludes the depreciation expense on assets fully depreciated during the year.  This column is used for the purpose of calculating depreciation expense in the following year on the next worksheet."]
[]
["General:","Applicants must provide a breakdown of depreciation and amortization expense in the above format for all relevant accounts.  Asset Retirement Obligations (AROs), depreciation and accretion expense should be disclosed separately consistent with the Notes of historical Audited Financial Statements."]

{"sheet":"App.2-CC_DepExp_Yr2","index":13,"n_rows":65,"n_cols":11,"rows_kept":65,"cut":false,"hidden":false,"merged":[[64,1,65,10],[8,0,8,10],[9,0,9,10],[10,0,10,10],[17,0,18,0],[17,1,18,1],[17,6,18,6],[17,9,18,9],[12,0,12,1],[13,0,13,1],[14,0,14,1],[14,2,14,8],[13,2,13,8],[60,1,60,10],[61,1,61,10],[62,1,62,10]]}
[null,null,null,null,null,null,null,null,null,"File Number:",{"$f":"EBNUMBER","v":0}]
["NOT APPLICABLE",null,null,null,null,null,null,null,null,"Exhibit:"]
[null,null,null,null,null,null,null,null,null,"Tab:"]
[null,null,null,null,null,null,null,null,null,"Schedule:"]
[null,null,null,null,null,null,null,null,null,"Page:"]
[]
[null,null,null,null,null,null,null,null,null,"Date:"]
[]
["Appendix 2-CC"]
["Depreciation and Amortization Expense"]
["Revised CGAAP (Year 2)"]
[]
["Select the set of appendices that apply",null,null,null,null,null,null,null,null,"Year Reflected in Schedule Below","Accounting Standard"]
["2012 Set of Appendices (2-CA to 2-CG)",null,"Assumes the applicant made capitalization and depreciation expense accounting policy changes under CGAAP effective January 1, 2012 and has adopted IFRS for financial reporting purposes effective January 1, 2015.  Assumes that the applicant is reflecting these changes in a rebasing application for the first time.",null,null,null,null,null,null,2013,"Revised CGAAP"]
["2013 Set of Appendices (2-CA to 2-CF)",null,"Assumes the applicant made capitalization and depreciation expense accounting policy changes under CGAAP effective January 1, 2013 and has adopted IFRS for financial reporting purposes effective January 1, 2015.  Assumes that the applicant is reflecting these changes in a rebasing application for the first time.",null,null,null,null,null,null,2014,"Revised CGAAP"]
[]
[]
["Account","Description","Additions","Years (new additions only)","Depreciation Rate on New Additions","Current Year Depreciation Expense 1"," Depreciation Expense per Apppendix 2-BA Fixed Assets, Column J\n (l)","Variance 2","Depreciation Expense on Current Full Year Additions","Less Depreciation Expense on Assets Fully Depreciated During the Year\n(o)","Current Full Year Depreciation 3"]
[null,null,"(d)","(f)","(g) = 1 / (f)","(h)= Prior Full Year Deprecation + ((d)*0.5)/(f) ",null,"(m) = (h) - (l)","(n)=((d))/(f) ",null,"(p) = Prior Full Year Depreciation  + (n) - (o)"]
[1611,"Computer Software (Formally known as Account 1925)",null,null,{"$f":"IF(D20=0,0,1/D20)","v":0},{"$f":"IF(D20=0,+'App.2-CB_NewCGAAP_DepExp_Yr1'!O20,+'App.2-CB_NewCGAAP_DepExp_Yr1'!O20+((C20*0.5)/D20))","v":0},null,{"$f":"IF(ISERROR(+F20-G20), 0, +F20-G20)","v":0},{"$f":"IF(D20=0,0,+(C20)/D20)","v":0},null,{"$f":"IF(ISERROR(+I20+'App.2-CB_NewCGAAP_DepExp_Yr1'!O20-J20), 0, +I20+'App.2-CB_NewCGAAP_DepExp_Yr1'!O20-J20)","v":0}]
[1612,"Land Rights (Formally known as Account 1906)",null,null,0,{"$f":"IF(D21=0,+'App.2-CB_NewCGAAP_DepExp_Yr1'!O21,+'App.2-CB_NewCGAAP_DepExp_Yr1'!O21+((C21*0.5)/D21))","v":0},null,0,0,null,{"$f":"IF(ISERROR(+I21+'App.2-CB_NewCGAAP_DepExp_Yr1'!O21-J21), 0, +I21+'App.2-CB_NewCGAAP_DepExp_Yr1'!O21-J21)","v":0}]
[1805,"Land",null,null,0,{"$f":"IF(D22=0,+'App.2-CB_NewCGAAP_DepExp_Yr1'!O22,+'App.2-CB_NewCGAAP_DepExp_Yr1'!O22+((C22*0.5)/D22))","v":0},null,0,0,null,{"$f":"IF(ISERROR(+I22+'App.2-CB_NewCGAAP_DepExp_Yr1'!O22-J22), 0, +I22+'App.2-CB_NewCGAAP_DepExp_Yr1'!O22-J22)","v":0}]
[1808,"Buildings",null,null,0,{"$f":"IF(D23=0,+'App.2-CB_NewCGAAP_DepExp_Yr1'!O23,+'App.2-CB_NewCGAAP_DepExp_Yr1'!O23+((C23*0.5)/D23))","v":0},null,0,0,null,{"$f":"IF(ISERROR(+I23+'App.2-CB_NewCGAAP_DepExp_Yr1'!O23-J23), 0, +I23+'App.2-CB_NewCGAAP_DepExp_Yr1'!O23-J23)","v":0}]
[1810,"Leasehold Improvements",null,null,0,{"$f":"IF(D24=0,+'App.2-CB_NewCGAAP_DepExp_Yr1'!O24,+'App.2-CB_NewCGAAP_DepExp_Yr1'!O24+((C24*0.5)/D24))","v":0},null,0,0,null,{"$f":"IF(ISERROR(+I24+'App.2-CB_NewCGAAP_DepExp_Yr1'!O24-J24), 0, +I24+'App.2-CB_NewCGAAP_DepExp_Yr1'!O24-J24)","v":0}]
[1815,"Transformer Station Equipment >50 kV",null,null,0,{"$f":"IF(D25=0,+'App.2-CB_NewCGAAP_DepExp_Yr1'!O25,+'App.2-CB_NewCGAAP_DepExp_Yr1'!O25+((C25*0.5)/D25))","v":0},null,0,0,null,{"$f":"IF(ISERROR(+I25+'App.2-CB_NewCGAAP_DepExp_Yr1'!O25-J25), 0, +I25+'App.2-CB_NewCGAAP_DepExp_Yr1'!O25-J25)","v":0}]
[1820,"Distribution Station Equipment <50 kV",null,null,0,{"$f":"IF(D26=0,+'App.2-CB_NewCGAAP_DepExp_Yr1'!O26,+'App.2-CB_NewCGAAP_DepExp_Yr1'!O26+((C26*0.5)/D26))","v":0},null,0,0,null,{"$f":"IF(ISERROR(+I26+'App.2-CB_NewCGAAP_DepExp_Yr1'!O26-J26), 0, +I26+'App.2-CB_NewCGAAP_DepExp_Yr1'!O26-J26)","v":0}]
[1825,"Storage Battery Equipment",null,null,0,{"$f":"IF(D27=0,+'App.2-CB_NewCGAAP_DepExp_Yr1'!O27,+'App.2-CB_NewCGAAP_DepExp_Yr1'!O27+((C27*0.5)/D27))","v":0},null,0,0,null,{"$f":"IF(ISERROR(+I27+'App.2-CB_NewCGAAP_DepExp_Yr1'!O27-J27), 0, +I27+'App.2-CB_NewCGAAP_DepExp_Yr1'!O27-J27)","v":0}]
[1830,"Poles, Towers & Fixtures",null,null,0,{"$f":"IF(D28=0,+'App.2-CB_NewCGAAP_DepExp_Yr1'!O28,+'App.2-CB_NewCGAAP_DepExp_Yr1'!O28+((C28*0.5)/D28))","v":0},null,0,0,null,{"$f":"IF(ISERROR(+I28+'App.2-CB_NewCGAAP_DepExp_Yr1'!O28-J28), 0, +I28+'App.2-CB_NewCGAAP_DepExp_Yr1'!O28-J28)","v":0}]
[1835,"Overhead Conductors & Devices",null,null,0,{"$f":"IF(D29=0,+'App.2-CB_NewCGAAP_DepExp_Yr1'!O29,+'App.2-CB_NewCGAAP_DepExp_Yr1'!O29+((C29*0.5)/D29))","v":0},null,0,0,null,{"$f":"IF(ISERROR(+I29+'App.2-CB_NewCGAAP_DepExp_Yr1'!O29-J29), 0, +I29+'App.2-CB_NewCGAAP_DepExp_Yr1'!O29-J29)","v":0}]
[1840,"Underground Conduit",null,null,0,{"$f":"IF(D30=0,+'App.2-CB_NewCGAAP_DepExp_Yr1'!O30,+'App.2-CB_NewCGAAP_DepExp_Yr1'!O30+((C30*0.5)/D30))","v":0},null,0,0,null,{"$f":"IF(ISERROR(+I30+'App.2-CB_NewCGAAP_DepExp_Yr1'!O30-J30), 0, +I30+'App.2-CB_NewCGAAP_DepExp_Yr1'!O30-J30)","v":0}]
[1845,"Underground Conductors & Devices",null,null,0,{"$f":"IF(D31=0,+'App.2-CB_NewCGAAP_DepExp_Yr1'!O31,+'App.2-CB_NewCGAAP_DepExp_Yr1'!O31+((C31*0.5)/D31))","v":0},null,0,0,null,{"$f":"IF(ISERROR(+I31+'App.2-CB_NewCGAAP_DepExp_Yr1'!O31-J31), 0, +I31+'App.2-CB_NewCGAAP_DepExp_Yr1'!O31-J31)","v":0}]
[1850,"Line Transformers",null,null,0,{"$f":"IF(D32=0,+'App.2-CB_NewCGAAP_DepExp_Yr1'!O32,+'App.2-CB_NewCGAAP_DepExp_Yr1'!O32+((C32*0.5)/D32))","v":0},null,0,0,null,{"$f":"IF(ISERROR(+I32+'App.2-CB_NewCGAAP_DepExp_Yr1'!O32-J32), 0, +I32+'App.2-CB_NewCGAAP_DepExp_Yr1'!O32-J32)","v":0}]
[1855,"Services (Overhead & Underground)",null,null,0,{"$f":"IF(D33=0,+'App.2-CB_NewCGAAP_DepExp_Yr1'!O33,+'App.2-CB_NewCGAAP_DepExp_Yr1'!O33+((C33*0.5)/D33))","v":0},null,0,0,null,{"$f":"IF(ISERROR(+I33+'App.2-CB_NewCGAAP_DepExp_Yr1'!O33-J33), 0, +I33+'App.2-CB_NewCGAAP_DepExp_Yr1'!O33-J33)","v":0}]
[1860,"Meters",null,null,0,{"$f":"IF(D34=0,+'App.2-CB_NewCGAAP_DepExp_Yr1'!O34,+'App.2-CB_NewCGAAP_DepExp_Yr1'!O34+((C34*0.5)/D34))","v":0},null,0,0,null,{"$f":"IF(ISERROR(+I34+'App.2-CB_NewCGAAP_DepExp_Yr1'!O34-J34), 0, +I34+'App.2-CB_NewCGAAP_DepExp_Yr1'!O34-J34)","v":0}]
[1860,"Meters (Smart Meters)",null,null,0,{"$f":"IF(D35=0,+'App.2-CB_NewCGAAP_DepExp_Yr1'!O35,+'App.2-CB_NewCGAAP_DepExp_Yr1'!O35+((C35*0.5)/D35))","v":0},null,0,0,null,{"$f":"IF(ISERROR(+I35+'App.2-CB_NewCGAAP_DepExp_Yr1'!O35-J35), 0, +I35+'App.2-CB_NewCGAAP_DepExp_Yr1'!O35-J35)","v":0}]
[1905,"Land",null,null,0,{"$f":"IF(D36=0,+'App.2-CB_NewCGAAP_DepExp_Yr1'!O36,+'App.2-CB_NewCGAAP_DepExp_Yr1'!O36+((C36*0.5)/D36))","v":0},null,0,0,null,{"$f":"IF(ISERROR(+I36+'App.2-CB_NewCGAAP_DepExp_Yr1'!O36-J36), 0, +I36+'App.2-CB_NewCGAAP_DepExp_Yr1'!O36-J36)","v":0}]
[1908,"Buildings & Fixtures",null,null,0,{"$f":"IF(D37=0,+'App.2-CB_NewCGAAP_DepExp_Yr1'!O37,+'App.2-CB_NewCGAAP_DepExp_Yr1'!O37+((C37*0.5)/D37))","v":0},null,0,0,null,{"$f":"IF(ISERROR(+I37+'App.2-CB_NewCGAAP_DepExp_Yr1'!O37-J37), 0, +I37+'App.2-CB_NewCGAAP_DepExp_Yr1'!O37-J37)","v":0}]
[1910,"Leasehold Improvements",null,null,0,{"$f":"IF(D38=0,+'App.2-CB_NewCGAAP_DepExp_Yr1'!O38,+'App.2-CB_NewCGAAP_DepExp_Yr1'!O38+((C38*0.5)/D38))","v":0},null,0,0,null,{"$f":"IF(ISERROR(+I38+'App.2-CB_NewCGAAP_DepExp_Yr1'!O38-J38), 0, +I38+'App.2-CB_NewCGAAP_DepExp_Yr1'!O38-J38)","v":0}]
[1915,"Office Furniture & Equipment (10 years)",null,null,0,{"$f":"IF(D39=0,+'App.2-CB_NewCGAAP_DepExp_Yr1'!O39,+'App.2-CB_NewCGAAP_DepExp_Yr1'!O39+((C39*0.5)/D39))","v":0},null,0,0,null,{"$f":"IF(ISERROR(+I39+'App.2-CB_NewCGAAP_DepExp_Yr1'!O39-J39), 0, +I39+'App.2-CB_NewCGAAP_DepExp_Yr1'!O39-J39)","v":0}]
[1915,"Office Furniture & Equipment (5 years)",null,null,0,{"$f":"IF(D40=0,+'App.2-CB_NewCGAAP_DepExp_Yr1'!O40,+'App.2-CB_NewCGAAP_DepExp_Yr1'!O40+((C40*0.5)/D40))","v":0},null,0,0,null,{"$f":"IF(ISERROR(+I40+'App.2-CB_NewCGAAP_DepExp_Yr1'!O40-J40), 0, +I40+'App.2-CB_NewCGAAP_DepExp_Yr1'!O40-J40)","v":0}]
[1920,"Computer Equipment - Hardware",null,null,0,{"$f":"IF(D41=0,+'App.2-CB_NewCGAAP_DepExp_Yr1'!O41,+'App.2-CB_NewCGAAP_DepExp_Yr1'!O41+((C41*0.5)/D41))","v":0},null,0,0,null,{"$f":"IF(ISERROR(+I41+'App.2-CB_NewCGAAP_DepExp_Yr1'!O41-J41), 0, +I41+'App.2-CB_NewCGAAP_DepExp_Yr1'!O41-J41)","v":0}]
[1920,"Computer Equip.-Hardware(Post Mar. 22/04)",null,null,0,{"$f":"IF(D42=0,+'App.2-CB_NewCGAAP_DepExp_Yr1'!O42,+'App.2-CB_NewCGAAP_DepExp_Yr1'!O42+((C42*0.5)/D42))","v":0},null,0,0,null,{"$f":"IF(ISERROR(+I42+'App.2-CB_NewCGAAP_DepExp_Yr1'!O42-J42), 0, +I42+'App.2-CB_NewCGAAP_DepExp_Yr1'!O42-J42)","v":0}]
[1920,"Computer Equip.-Hardware(Post Mar. 19/07)",null,null,0,{"$f":"IF(D43=0,+'App.2-CB_NewCGAAP_DepExp_Yr1'!O43,+'App.2-CB_NewCGAAP_DepExp_Yr1'!O43+((C43*0.5)/D43))","v":0},null,0,0,null,{"$f":"IF(ISERROR(+I43+'App.2-CB_NewCGAAP_DepExp_Yr1'!O43-J43), 0, +I43+'App.2-CB_NewCGAAP_DepExp_Yr1'!O43-J43)","v":0}]
[1930,"Transportation Equipment",null,null,0,{"$f":"IF(D44=0,+'App.2-CB_NewCGAAP_DepExp_Yr1'!O44,+'App.2-CB_NewCGAAP_DepExp_Yr1'!O44+((C44*0.5)/D44))","v":0},null,0,0,null,{"$f":"IF(ISERROR(+I44+'App.2-CB_NewCGAAP_DepExp_Yr1'!O44-J44), 0, +I44+'App.2-CB_NewCGAAP_DepExp_Yr1'!O44-J44)","v":0}]
[1935,"Stores Equipment",null,null,0,{"$f":"IF(D45=0,+'App.2-CB_NewCGAAP_DepExp_Yr1'!O45,+'App.2-CB_NewCGAAP_DepExp_Yr1'!O45+((C45*0.5)/D45))","v":0},null,0,0,null,{"$f":"IF(ISERROR(+I45+'App.2-CB_NewCGAAP_DepExp_Yr1'!O45-J45), 0, +I45+'App.2-CB_NewCGAAP_DepExp_Yr1'!O45-J45)","v":0}]
[1940,"Tools, Shop & Garage Equipment",null,null,0,{"$f":"IF(D46=0,+'App.2-CB_NewCGAAP_DepExp_Yr1'!O46,+'App.2-CB_NewCGAAP_DepExp_Yr1'!O46+((C46*0.5)/D46))","v":0},null,0,0,null,{"$f":"IF(ISERROR(+I46+'App.2-CB_NewCGAAP_DepExp_Yr1'!O46-J46), 0, +I46+'App.2-CB_NewCGAAP_DepExp_Yr1'!O46-J46)","v":0}]
[1945,"Measurement & Testing Equipment",null,null,0,{"$f":"IF(D47=0,+'App.2-CB_NewCGAAP_DepExp_Yr1'!O47,+'App.2-CB_NewCGAAP_DepExp_Yr1'!O47+((C47*0.5)/D47))","v":0},null,0,0,null,{"$f":"IF(ISERROR(+I47+'App.2-CB_NewCGAAP_DepExp_Yr1'!O47-J47), 0, +I47+'App.2-CB_NewCGAAP_DepExp_Yr1'!O47-J47)","v":0}]
[1950,"Power Operated Equipment",null,null,0,{"$f":"IF(D48=0,+'App.2-CB_NewCGAAP_DepExp_Yr1'!O48,+'App.2-CB_NewCGAAP_DepExp_Yr1'!O48+((C48*0.5)/D48))","v":0},null,0,0,null,{"$f":"IF(ISERROR(+I48+'App.2-CB_NewCGAAP_DepExp_Yr1'!O48-J48), 0, +I48+'App.2-CB_NewCGAAP_DepExp_Yr1'!O48-J48)","v":0}]
[1955,"Communications Equipment",null,null,0,{"$f":"IF(D49=0,+'App.2-CB_NewCGAAP_DepExp_Yr1'!O49,+'App.2-CB_NewCGAAP_DepExp_Yr1'!O49+((C49*0.5)/D49))","v":0},null,0,0,null,{"$f":"IF(ISERROR(+I49+'App.2-CB_NewCGAAP_DepExp_Yr1'!O49-J49), 0, +I49+'App.2-CB_NewCGAAP_DepExp_Yr1'!O49-J49)","v":0}]
[1955,"Communication Equipment (Smart Meters)",null,null,0,{"$f":"IF(D50=0,+'App.2-CB_NewCGAAP_DepExp_Yr1'!O50,+'App.2-CB_NewCGAAP_DepExp_Yr1'!O50+((C50*0.5)/D50))","v":0},null,0,0,null,{"$f":"IF(ISERROR(+I50+'App.2-CB_NewCGAAP_DepExp_Yr1'!O50-J50), 0, +I50+'App.2-CB_NewCGAAP_DepExp_Yr1'!O50-J50)","v":0}]
[1960,"Miscellaneous Equipment ",null,null,0,{"$f":"IF(D51=0,+'App.2-CB_NewCGAAP_DepExp_Yr1'!O51,+'App.2-CB_NewCGAAP_DepExp_Yr1'!O51+((C51*0.5)/D51))","v":0},null,0,0,null,{"$f":"IF(ISERROR(+I51+'App.2-CB_NewCGAAP_DepExp_Yr1'!O51-J51), 0, +I51+'App.2-CB_NewCGAAP_DepExp_Yr1'!O51-J51)","v":0}]
[1970,"Load Management Controls Customer Premises",null,null,0,{"$f":"IF(D52=0,+'App.2-CB_NewCGAAP_DepExp_Yr1'!O52,+'App.2-CB_NewCGAAP_DepExp_Yr1'!O52+((C52*0.5)/D52))","v":0},null,0,0,null,{"$f":"IF(ISERROR(+I52+'App.2-CB_NewCGAAP_DepExp_Yr1'!O52-J52), 0, +I52+'App.2-CB_NewCGAAP_DepExp_Yr1'!O52-J52)","v":0}]
[1975,"Load Management Controls Utility Premises",null,null,0,{"$f":"IF(D53=0,+'App.2-CB_NewCGAAP_DepExp_Yr1'!O53,+'App.2-CB_NewCGAAP_DepExp_Yr1'!O53+((C53*0.5)/D53))","v":0},null,0,0,null,{"$f":"IF(ISERROR(+I53+'App.2-CB_NewCGAAP_DepExp_Yr1'!O53-J53), 0, +I53+'App.2-CB_NewCGAAP_DepExp_Yr1'!O53-J53)","v":0}]
[1980,"System Supervisor Equipment",null,null,0,{"$f":"IF(D54=0,+'App.2-CB_NewCGAAP_DepExp_Yr1'!O54,+'App.2-CB_NewCGAAP_DepExp_Yr1'!O54+((C54*0.5)/D54))","v":0},null,0,0,null,{"$f":"IF(ISERROR(+I54+'App.2-CB_NewCGAAP_DepExp_Yr1'!O54-J54), 0, +I54+'App.2-CB_NewCGAAP_DepExp_Yr1'!O54-J54)","v":0}]
[1985,"Miscellaneous Fixed Assets",null,null,0,{"$f":"IF(D55=0,+'App.2-CB_NewCGAAP_DepExp_Yr1'!O55,+'App.2-CB_NewCGAAP_DepExp_Yr1'!O55+((C55*0.5)/D55))","v":0},null,0,0,null,{"$f":"IF(ISERROR(+I55+'App.2-CB_NewCGAAP_DepExp_Yr1'!O55-J55), 0, +I55+'App.2-CB_NewCGAAP_DepExp_Yr1'!O55-J55)","v":0}]
[1990,"Other Tangible Property",null,null,0,{"$f":"IF(D56=0,+'App.2-CB_NewCGAAP_DepExp_Yr1'!O56,+'App.2-CB_NewCGAAP_DepExp_Yr1'!O56+((C56*0.5)/D56))","v":0},null,0,0,null,{"$f":"IF(ISERROR(+I56+'App.2-CB_NewCGAAP_DepExp_Yr1'!O56-J56), 0, +I56+'App.2-CB_NewCGAAP_DepExp_Yr1'!O56-J56)","v":0}]
[1995,"Contributions & Grants",null,null,0,{"$f":"IF(D57=0,+'App.2-CB_NewCGAAP_DepExp_Yr1'!O57,+'App.2-CB_NewCGAAP_DepExp_Yr1'!O57+((C57*0.5)/D57))","v":0},null,0,0,null,{"$f":"IF(ISERROR(+I57+'App.2-CB_NewCGAAP_DepExp_Yr1'!O57-J57), 0, +I57+'App.2-CB_NewCGAAP_DepExp_Yr1'!O57-J57)","v":0}]
[null,"Total",{"$f":"SUM(C20:C57)","v":0},null,null,{"$f":"SUM(F20:F57)","v":0},0,0,0,0,0]
[]
["Notes:"]
[1,"Board policy of the \"half-year\" rule - the applicant must ensure that additions in the year attract a half-year depreciation expense in the first year.  Deviations from this standard practice must be supported in the application."]
[2,"The applicant must provide an explanation of material variances in evidence."]
[3,"This column refers to the calculated full year depreciation but excludes the depreciation expense on assets fully depreciated during the year.  This column is used for the purpose of calculating depreciation expense in the following year on the next worksheet."]
[]
["General:","Applicants must provide a breakdown of depreciation and amortization expense in the above format for all relevant accounts.  Asset Retirement Obligations (AROs), depreciation and accretion expense should be disclosed separately consistent with the Notes of historical Audited Financial Statements."]

{"sheet":"App.2-CD_DepExp_Yr3","index":14,"n_rows":67,"n_cols":11,"rows_kept":67,"cut":false,"hidden":false,"merged":[[8,0,8,10],[9,0,9,10],[10,0,10,10],[17,0,18,0],[17,1,18,1],[17,6,18,6],[17,9,18,9],[12,0,12,1],[13,0,13,1],[14,0,14,1],[13,2,13,8],[14,2,14,8],[62,1,62,10],[63,1,63,10],[64,1,64,10],[66,1,67,10],[58,1,58,4]]}
[null,null,null,null,null,null,null,null,null,"File Number:",{"$f":"EBNUMBER","v":0}]
["NOT APPLICABLE",null,null,null,null,null,null,null,null,"Exhibit:"]
[null,null,null,null,null,null,null,null,null,"Tab:"]
[null,null,null,null,null,null,null,null,null,"Schedule:"]
[null,null,null,null,null,null,null,null,null,"Page:"]
[]
[null,null,null,null,null,null,null,null,null,"Date:"]
[]
["Appendix 2-CD"]
["Depreciation and Amortization Expense"]
["Revised CGAAP or MIFRS (Year 3)"]
[]
["Select the set of appendices that apply",null,null,null,null,null,null,null,null,"Year Reflected in Schedule Below","Accounting Standard"]
["2012 Set of Appendices (2-CA to 2-CG)",null,"Assumes the applicant made capitalization and depreciation expense accounting policy changes under CGAAP effective January 1, 2012 and has adopted IFRS for financial reporting purposes effective January 1, 2015.  Assumes that the applicant is reflecting these changes in a rebasing application for the first time.",null,null,null,null,null,null,2014,"Revised CGAAP"]
["2013 Set of Appendices (2-CA to 2-CF)",null,"Assumes the applicant made capitalization and depreciation expense accounting policy changes under CGAAP effective January 1, 2013 and has adopted IFRS for financial reporting purposes effective January 1, 2015.  Assumes that the applicant is reflecting these changes in a rebasing application for the first time.",null,null,null,null,null,null,2015,"MIFRS"]
[]
[]
["Account","Description","Additions","Years (new additions only)","Depreciation Rate on New Additions","Current Year Depreciation Expense1","Depreciation Expense per Apppendix 2-BA Fixed Assets, Column J\n (l)","Variance 2","Depreciation Expense on Current Full Year Additions","Less Depreciation Expense on Assets Fully Depreciated During the Year\n(o)","Current Full Year Depreciation 3"]
[null,null,"(d)","(f)","(g) = 1 / (f)","(h) = Prior Full Year Deprecation + ((d)*0.5)/(f) ",null,"(m) = (h) - (l)","(n)=((d))/(f) ",null,"(p) = Prior Full Year Depreciation  + (n) - (o)"]
[1611,"Computer Software (Formally known as Account 1925)",null,null,{"$f":"IF(D20=0,0,1/D20)","v":0},{"$f":"IF(D20=0,+'App.2-CC_DepExp_Yr2'!K20,+'App.2-CC_DepExp_Yr2'!K20+((C20*0.5)/D20))","v":0},null,{"$f":"IF(ISERROR(+F20-G20), 0, +F20-G20)","v":0},{"$f":"IF(D20=0,0,+(C20)/D20)","v":0},null,{"$f":"IF(ISERROR(+I20+'App.2-CC_DepExp_Yr2'!K20-J20), 0, +I20+'App.2-CC_DepExp_Yr2'!K20-J20)","v":0}]
[1612,"Land Rights (Formally known as Account 1906)",null,null,0,{"$f":"IF(D21=0,+'App.2-CC_DepExp_Yr2'!K21,+'App.2-CC_DepExp_Yr2'!K21+((C21*0.5)/D21))","v":0},null,0,{"$f":"IF(D21=0,0,+(C21)/D21)","v":0},null,{"$f":"IF(ISERROR(+I21+'App.2-CC_DepExp_Yr2'!K21-J21), 0, +I21+'App.2-CC_DepExp_Yr2'!K21-J21)","v":0}]
[1805,"Land",null,null,0,{"$f":"IF(D22=0,+'App.2-CC_DepExp_Yr2'!K22,+'App.2-CC_DepExp_Yr2'!K22+((C22*0.5)/D22))","v":0},null,0,0,null,{"$f":"IF(ISERROR(+I22+'App.2-CC_DepExp_Yr2'!K22-J22), 0, +I22+'App.2-CC_DepExp_Yr2'!K22-J22)","v":0}]
[1808,"Buildings",null,null,0,{"$f":"IF(D23=0,+'App.2-CC_DepExp_Yr2'!K23,+'App.2-CC_DepExp_Yr2'!K23+((C23*0.5)/D23))","v":0},null,0,0,null,{"$f":"IF(ISERROR(+I23+'App.2-CC_DepExp_Yr2'!K23-J23), 0, +I23+'App.2-CC_DepExp_Yr2'!K23-J23)","v":0}]
[1810,"Leasehold Improvements",null,null,0,{"$f":"IF(D24=0,+'App.2-CC_DepExp_Yr2'!K24,+'App.2-CC_DepExp_Yr2'!K24+((C24*0.5)/D24))","v":0},null,0,0,null,{"$f":"IF(ISERROR(+I24+'App.2-CC_DepExp_Yr2'!K24-J24), 0, +I24+'App.2-CC_DepExp_Yr2'!K24-J24)","v":0}]
[1815,"Transformer Station Equipment >50 kV",null,null,0,{"$f":"IF(D25=0,+'App.2-CC_DepExp_Yr2'!K25,+'App.2-CC_DepExp_Yr2'!K25+((C25*0.5)/D25))","v":0},null,0,0,null,{"$f":"IF(ISERROR(+I25+'App.2-CC_DepExp_Yr2'!K25-J25), 0, +I25+'App.2-CC_DepExp_Yr2'!K25-J25)","v":0}]
[1820,"Distribution Station Equipment <50 kV",null,null,0,{"$f":"IF(D26=0,+'App.2-CC_DepExp_Yr2'!K26,+'App.2-CC_DepExp_Yr2'!K26+((C26*0.5)/D26))","v":0},null,0,0,null,{"$f":"IF(ISERROR(+I26+'App.2-CC_DepExp_Yr2'!K26-J26), 0, +I26+'App.2-CC_DepExp_Yr2'!K26-J26)","v":0}]
[1825,"Storage Battery Equipment",null,null,0,{"$f":"IF(D27=0,+'App.2-CC_DepExp_Yr2'!K27,+'App.2-CC_DepExp_Yr2'!K27+((C27*0.5)/D27))","v":0},null,0,0,null,{"$f":"IF(ISERROR(+I27+'App.2-CC_DepExp_Yr2'!K27-J27), 0, +I27+'App.2-CC_DepExp_Yr2'!K27-J27)","v":0}]
[1830,"Poles, Towers & Fixtures",null,null,0,{"$f":"IF(D28=0,+'App.2-CC_DepExp_Yr2'!K28,+'App.2-CC_DepExp_Yr2'!K28+((C28*0.5)/D28))","v":0},null,0,0,null,{"$f":"IF(ISERROR(+I28+'App.2-CC_DepExp_Yr2'!K28-J28), 0, +I28+'App.2-CC_DepExp_Yr2'!K28-J28)","v":0}]
[1835,"Overhead Conductors & Devices",null,null,0,{"$f":"IF(D29=0,+'App.2-CC_DepExp_Yr2'!K29,+'App.2-CC_DepExp_Yr2'!K29+((C29*0.5)/D29))","v":0},null,0,0,null,{"$f":"IF(ISERROR(+I29+'App.2-CC_DepExp_Yr2'!K29-J29), 0, +I29+'App.2-CC_DepExp_Yr2'!K29-J29)","v":0}]
[1840,"Underground Conduit",null,null,0,{"$f":"IF(D30=0,+'App.2-CC_DepExp_Yr2'!K30,+'App.2-CC_DepExp_Yr2'!K30+((C30*0.5)/D30))","v":0},null,0,0,null,{"$f":"IF(ISERROR(+I30+'App.2-CC_DepExp_Yr2'!K30-J30), 0, +I30+'App.2-CC_DepExp_Yr2'!K30-J30)","v":0}]
[1845,"Underground Conductors & Devices",null,null,0,{"$f":"IF(D31=0,+'App.2-CC_DepExp_Yr2'!K31,+'App.2-CC_DepExp_Yr2'!K31+((C31*0.5)/D31))","v":0},null,0,0,null,{"$f":"IF(ISERROR(+I31+'App.2-CC_DepExp_Yr2'!K31-J31), 0, +I31+'App.2-CC_DepExp_Yr2'!K31-J31)","v":0}]
[1850,"Line Transformers",null,null,0,{"$f":"IF(D32=0,+'App.2-CC_DepExp_Yr2'!K32,+'App.2-CC_DepExp_Yr2'!K32+((C32*0.5)/D32))","v":0},null,0,0,null,{"$f":"IF(ISERROR(+I32+'App.2-CC_DepExp_Yr2'!K32-J32), 0, +I32+'App.2-CC_DepExp_Yr2'!K32-J32)","v":0}]
[1855,"Services (Overhead & Underground)",null,null,0,{"$f":"IF(D33=0,+'App.2-CC_DepExp_Yr2'!K33,+'App.2-CC_DepExp_Yr2'!K33+((C33*0.5)/D33))","v":0},null,0,0,null,{"$f":"IF(ISERROR(+I33+'App.2-CC_DepExp_Yr2'!K33-J33), 0, +I33+'App.2-CC_DepExp_Yr2'!K33-J33)","v":0}]
[1860,"Meters",null,null,0,{"$f":"IF(D34=0,+'App.2-CC_DepExp_Yr2'!K34,+'App.2-CC_DepExp_Yr2'!K34+((C34*0.5)/D34))","v":0},null,0,0,null,{"$f":"IF(ISERROR(+I34+'App.2-CC_DepExp_Yr2'!K34-J34), 0, +I34+'App.2-CC_DepExp_Yr2'!K34-J34)","v":0}]
[1860,"Meters (Smart Meters)",null,null,0,{"$f":"IF(D35=0,+'App.2-CC_DepExp_Yr2'!K35,+'App.2-CC_DepExp_Yr2'!K35+((C35*0.5)/D35))","v":0},null,0,0,null,{"$f":"IF(ISERROR(+I35+'App.2-CC_DepExp_Yr2'!K35-J35), 0, +I35+'App.2-CC_DepExp_Yr2'!K35-J35)","v":0}]
[1905,"Land",null,null,0,{"$f":"IF(D36=0,+'App.2-CC_DepExp_Yr2'!K36,+'App.2-CC_DepExp_Yr2'!K36+((C36*0.5)/D36))","v":0},null,0,0,null,{"$f":"IF(ISERROR(+I36+'App.2-CC_DepExp_Yr2'!K36-J36), 0, +I36+'App.2-CC_DepExp_Yr2'!K36-J36)","v":0}]
[1908,"Buildings & Fixtures",null,null,0,{"$f":"IF(D37=0,+'App.2-CC_DepExp_Yr2'!K37,+'App.2-CC_DepExp_Yr2'!K37+((C37*0.5)/D37))","v":0},null,0,0,null,{"$f":"IF(ISERROR(+I37+'App.2-CC_DepExp_Yr2'!K37-J37), 0, +I37+'App.2-CC_DepExp_Yr2'!K37-J37)","v":0}]
[1910,"Leasehold Improvements",null,null,0,{"$f":"IF(D38=0,+'App.2-CC_DepExp_Yr2'!K38,+'App.2-CC_DepExp_Yr2'!K38+((C38*0.5)/D38))","v":0},null,0,0,null,{"$f":"IF(ISERROR(+I38+'App.2-CC_DepExp_Yr2'!K38-J38), 0, +I38+'App.2-CC_DepExp_Yr2'!K38-J38)","v":0}]
[1915,"Office Furniture & Equipment (10 years)",null,null,0,{"$f":"IF(D39=0,+'App.2-CC_DepExp_Yr2'!K39,+'App.2-CC_DepExp_Yr2'!K39+((C39*0.5)/D39))","v":0},null,0,0,null,{"$f":"IF(ISERROR(+I39+'App.2-CC_DepExp_Yr2'!K39-J39), 0, +I39+'App.2-CC_DepExp_Yr2'!K39-J39)","v":0}]
[1915,"Office Furniture & Equipment (5 years)",null,null,0,{"$f":"IF(D40=0,+'App.2-CC_DepExp_Yr2'!K40,+'App.2-CC_DepExp_Yr2'!K40+((C40*0.5)/D40))","v":0},null,0,0,null,{"$f":"IF(ISERROR(+I40+'App.2-CC_DepExp_Yr2'!K40-J40), 0, +I40+'App.2-CC_DepExp_Yr2'!K40-J40)","v":0}]
[1920,"Computer Equipment - Hardware",null,null,0,{"$f":"IF(D41=0,+'App.2-CC_DepExp_Yr2'!K41,+'App.2-CC_DepExp_Yr2'!K41+((C41*0.5)/D41))","v":0},null,0,0,null,{"$f":"IF(ISERROR(+I41+'App.2-CC_DepExp_Yr2'!K41-J41), 0, +I41+'App.2-CC_DepExp_Yr2'!K41-J41)","v":0}]
[1920,"Computer Equip.-Hardware(Post Mar. 22/04)",null,null,0,{"$f":"IF(D42=0,+'App.2-CC_DepExp_Yr2'!K42,+'App.2-CC_DepExp_Yr2'!K42+((C42*0.5)/D42))","v":0},null,0,0,null,{"$f":"IF(ISERROR(+I42+'App.2-CC_DepExp_Yr2'!K42-J42), 0, +I42+'App.2-CC_DepExp_Yr2'!K42-J42)","v":0}]
[1920,"Computer Equip.-Hardware(Post Mar. 19/07)",null,null,0,{"$f":"IF(D43=0,+'App.2-CC_DepExp_Yr2'!K43,+'App.2-CC_DepExp_Yr2'!K43+((C43*0.5)/D43))","v":0},null,0,0,null,{"$f":"IF(ISERROR(+I43+'App.2-CC_DepExp_Yr2'!K43-J43), 0, +I43+'App.2-CC_DepExp_Yr2'!K43-J43)","v":0}]
[1930,"Transportation Equipment",null,null,0,{"$f":"IF(D44=0,+'App.2-CC_DepExp_Yr2'!K44,+'App.2-CC_DepExp_Yr2'!K44+((C44*0.5)/D44))","v":0},null,0,0,null,{"$f":"IF(ISERROR(+I44+'App.2-CC_DepExp_Yr2'!K44-J44), 0, +I44+'App.2-CC_DepExp_Yr2'!K44-J44)","v":0}]
[1935,"Stores Equipment",null,null,0,{"$f":"IF(D45=0,+'App.2-CC_DepExp_Yr2'!K45,+'App.2-CC_DepExp_Yr2'!K45+((C45*0.5)/D45))","v":0},null,0,0,null,{"$f":"IF(ISERROR(+I45+'App.2-CC_DepExp_Yr2'!K45-J45), 0, +I45+'App.2-CC_DepExp_Yr2'!K45-J45)","v":0}]
[1940,"Tools, Shop & Garage Equipment",null,null,0,{"$f":"IF(D46=0,+'App.2-CC_DepExp_Yr2'!K46,+'App.2-CC_DepExp_Yr2'!K46+((C46*0.5)/D46))","v":0},null,0,0,null,{"$f":"IF(ISERROR(+I46+'App.2-CC_DepExp_Yr2'!K46-J46), 0, +I46+'App.2-CC_DepExp_Yr2'!K46-J46)","v":0}]
[1945,"Measurement & Testing Equipment",null,null,0,{"$f":"IF(D47=0,+'App.2-CC_DepExp_Yr2'!K47,+'App.2-CC_DepExp_Yr2'!K47+((C47*0.5)/D47))","v":0},null,0,0,null,{"$f":"IF(ISERROR(+I47+'App.2-CC_DepExp_Yr2'!K47-J47), 0, +I47+'App.2-CC_DepExp_Yr2'!K47-J47)","v":0}]
[1950,"Power Operated Equipment",null,null,0,{"$f":"IF(D48=0,+'App.2-CC_DepExp_Yr2'!K48,+'App.2-CC_DepExp_Yr2'!K48+((C48*0.5)/D48))","v":0},null,0,0,null,{"$f":"IF(ISERROR(+I48+'App.2-CC_DepExp_Yr2'!K48-J48), 0, +I48+'App.2-CC_DepExp_Yr2'!K48-J48)","v":0}]
[1955,"Communications Equipment",null,null,0,{"$f":"IF(D49=0,+'App.2-CC_DepExp_Yr2'!K49,+'App.2-CC_DepExp_Yr2'!K49+((C49*0.5)/D49))","v":0},null,0,0,null,{"$f":"IF(ISERROR(+I49+'App.2-CC_DepExp_Yr2'!K49-J49), 0, +I49+'App.2-CC_DepExp_Yr2'!K49-J49)","v":0}]
[1955,"Communication Equipment (Smart Meters)",null,null,0,{"$f":"IF(D50=0,+'App.2-CC_DepExp_Yr2'!K50,+'App.2-CC_DepExp_Yr2'!K50+((C50*0.5)/D50))","v":0},null,0,0,null,{"$f":"IF(ISERROR(+I50+'App.2-CC_DepExp_Yr2'!K50-J50), 0, +I50+'App.2-CC_DepExp_Yr2'!K50-J50)","v":0}]
[1960,"Miscellaneous Equipment ",null,null,0,{"$f":"IF(D51=0,+'App.2-CC_DepExp_Yr2'!K51,+'App.2-CC_DepExp_Yr2'!K51+((C51*0.5)/D51))","v":0},null,0,0,null,{"$f":"IF(ISERROR(+I51+'App.2-CC_DepExp_Yr2'!K51-J51), 0, +I51+'App.2-CC_DepExp_Yr2'!K51-J51)","v":0}]
[1970,"Load Management Controls Customer Premises",null,null,0,{"$f":"IF(D52=0,+'App.2-CC_DepExp_Yr2'!K52,+'App.2-CC_DepExp_Yr2'!K52+((C52*0.5)/D52))","v":0},null,0,0,null,{"$f":"IF(ISERROR(+I52+'App.2-CC_DepExp_Yr2'!K52-J52), 0, +I52+'App.2-CC_DepExp_Yr2'!K52-J52)","v":0}]
[1975,"Load Management Controls Utility Premises",null,null,0,{"$f":"IF(D53=0,+'App.2-CC_DepExp_Yr2'!K53,+'App.2-CC_DepExp_Yr2'!K53+((C53*0.5)/D53))","v":0},null,0,0,null,{"$f":"IF(ISERROR(+I53+'App.2-CC_DepExp_Yr2'!K53-J53), 0, +I53+'App.2-CC_DepExp_Yr2'!K53-J53)","v":0}]
[1980,"System Supervisor Equipment",null,null,0,{"$f":"IF(D54=0,+'App.2-CC_DepExp_Yr2'!K54,+'App.2-CC_DepExp_Yr2'!K54+((C54*0.5)/D54))","v":0},null,0,0,null,{"$f":"IF(ISERROR(+I54+'App.2-CC_DepExp_Yr2'!K54-J54), 0, +I54+'App.2-CC_DepExp_Yr2'!K54-J54)","v":0}]
[1985,"Miscellaneous Fixed Assets",null,null,0,{"$f":"IF(D55=0,+'App.2-CC_DepExp_Yr2'!K55,+'App.2-CC_DepExp_Yr2'!K55+((C55*0.5)/D55))","v":0},null,0,0,null,{"$f":"IF(ISERROR(+I55+'App.2-CC_DepExp_Yr2'!K55-J55), 0, +I55+'App.2-CC_DepExp_Yr2'!K55-J55)","v":0}]
[1990,"Other Tangible Property",null,null,0,{"$f":"IF(D56=0,+'App.2-CC_DepExp_Yr2'!K56,+'App.2-CC_DepExp_Yr2'!K56+((C56*0.5)/D56))","v":0},null,0,0,null,{"$f":"IF(ISERROR(+I56+'App.2-CC_DepExp_Yr2'!K56-J56), 0, +I56+'App.2-CC_DepExp_Yr2'!K56-J56)","v":0}]
[1995,"Contributions & Grants",null,null,{"$f":"IF(D57=0,0,1/D57)","v":0},{"$f":"IF(D57=0,+'App.2-CC_DepExp_Yr2'!K57,+'App.2-CC_DepExp_Yr2'!K57+((C57*0.5)/D57))","v":0},null,0,0,null,{"$f":"IF(ISERROR(+I57+'App.2-CC_DepExp_Yr2'!K57-J57), 0, +I57+'App.2-CC_DepExp_Yr2'!K57-J57)","v":0}]
[null,"Total",{"$f":"SUM(C20:C57)","v":0},null,null,{"$f":"SUM(F20:F57)","v":0},0,0,0,0,0]
[null,"Depreciation exp. adj. from gain or loss on the retirement of assets (pool of like assets) (under MIFRS) "]
[null,"Total Depreciation Expense",null,null,null,{"$f":"+F59+F58","v":0}]
[]
["Notes:"]
[1,"Board policy of the \"half-year\" rule - the applicant must ensure that additions in the year attract a half-year depreciation expense in the first year.  Deviations from this standard practice must be supported in the application."]
[2,"The applicant must provide an explanation of material variances in evidence."]
[3,"This column refers to the calculated full year depreciation but excludes the depreciation expense on assets fully depreciated during the year.  This column is used for the purpose of calculating depreciation expense in the following year on the next worksheet."]
[]
["General:","Applicants must provide a breakdown of depreciation and amortization expense in the above format for all relevant accounts.  Asset Retirement Obligations (AROs), depreciation and accretion expense should be disclosed separately consistent with the Notes of historical Audited Financial Statements."]

{"sheet":"App.2-CE_DepExp_Yr4","index":15,"n_rows":66,"n_cols":11,"rows_kept":66,"cut":false,"hidden":false,"merged":[[8,0,8,8],[9,0,9,8],[17,1,18,1],[17,6,18,6],[59,1,59,4],[10,0,10,7],[12,0,12,1],[13,0,13,1],[13,2,13,8],[14,0,14,1],[14,2,14,8],[17,9,18,9],[67,1,68,7],[61,1,61,7],[62,1,62,8],[64,1,64,8],[65,1,66,7],[63,1,63,10]]}
[null,null,null,null,null,null,null,null,null,"File Number:",{"$f":"EBNUMBER","v":0}]
["NOT APPLICABLE",null,null,null,null,null,null,null,null,"Exhibit:"]
[null,null,null,null,null,null,null,null,null,"Tab:"]
[null,null,null,null,null,null,null,null,null,"Schedule:"]
[null,null,null,null,null,null,null,null,null,"Page:"]
[]
[null,null,null,null,null,null,null,null,null,"Date:"]
[]
["Appendix 2-CE"]
["Depreciation and Amortization Expense"]
["MIFRS (Year 4)"]
[]
["Select the set of appendices that apply",null,null,null,null,null,null,null,null,"Year Reflected in Schedule Below","Accounting Standard"]
["2012 Set of Appendices (2-CA to 2-CG)",null,"Assumes the applicant made capitalization and depreciation expense accounting policy changes under CGAAP effective January 1, 2012 and has adopted IFRS for financial reporting purposes effective January 1, 2015.  Assumes that the applicant is reflecting these changes in a rebasing application for the first time.",null,null,null,null,null,null,2015,"MIFRS"]
["2013 Set of Appendices (2-CA to 2-CF)",null,"Assumes the applicant made capitalization and depreciation expense accounting policy changes under CGAAP effective January 1, 2013 and has adopted IFRS for financial reporting purposes effective January 1, 2015.  Assumes that the applicant is reflecting these changes in a rebasing application for the first time.",null,null,null,null,null,null,2016,"MIFRS"]
[]
[]
["Account","Description","Additions","Years (new additions only)","Depreciation Rate on New Additions","Current Year Depreciation Expense1","Depreciation Expense per Appendix 2-BA Fixed Assets, Column J\n (l)","Variance 2","Depreciation Expense on Current Full Year Additions","Less Depreciation Expense on Assets Fully Depreciated During the Year\n(o)","Current Full Year Depreciation 3"]
[null,null,"(d)","(f)","(g) = 1 / (f)","(h)=Prior Full Year Depreciation + ((d)*0.5)/(f) ",null,"(m) = (h) - (l)","(n)=((d))/(f) ",null,"(p) = Prior Full Year Depreciation  + (n) - (o)"]
[1611,"Computer Software (Formally known as Account 1925)",null,null,{"$f":"IF(D20=0,0,1/D20)","v":0},{"$f":"IF(D20=0,'App.2-CD_DepExp_Yr3'!K20,+'App.2-CD_DepExp_Yr3'!K20+((C20*0.5)/D20))","v":0},null,{"$f":"IF(ISERROR(+F20-G20), 0, +F20-G20)","v":0},{"$f":"IF(D20=0,0,+(C20)/D20)","v":0},null,{"$f":"IF(ISERROR(+I20+'App.2-CD_DepExp_Yr3'!K20-J20), 0, +I20+'App.2-CD_DepExp_Yr3'!K20-J20)","v":0}]
[1612,"Land Rights (Formally known as Account 1906)",null,null,0,{"$f":"IF(D21=0,'App.2-CD_DepExp_Yr3'!K21,+'App.2-CD_DepExp_Yr3'!K21+((C21*0.5)/D21))","v":0},null,0,{"$f":"IF(D21=0,0,+(C21)/D21)","v":0},null,{"$f":"IF(ISERROR(+I21+'App.2-CD_DepExp_Yr3'!K21-J21), 0, +I21+'App.2-CD_DepExp_Yr3'!K21-J21)","v":0}]
[1805,"Land",null,null,0,{"$f":"IF(D22=0,'App.2-CD_DepExp_Yr3'!K22,+'App.2-CD_DepExp_Yr3'!K22+((C22*0.5)/D22))","v":0},null,0,0,null,{"$f":"IF(ISERROR(+I22+'App.2-CD_DepExp_Yr3'!K22-J22), 0, +I22+'App.2-CD_DepExp_Yr3'!K22-J22)","v":0}]
[1808,"Buildings",null,null,0,{"$f":"IF(D23=0,'App.2-CD_DepExp_Yr3'!K23,+'App.2-CD_DepExp_Yr3'!K23+((C23*0.5)/D23))","v":0},null,0,0,null,{"$f":"IF(ISERROR(+I23+'App.2-CD_DepExp_Yr3'!K23-J23), 0, +I23+'App.2-CD_DepExp_Yr3'!K23-J23)","v":0}]
[1810,"Leasehold Improvements",null,null,0,{"$f":"IF(D24=0,'App.2-CD_DepExp_Yr3'!K24,+'App.2-CD_DepExp_Yr3'!K24+((C24*0.5)/D24))","v":0},null,0,0,null,{"$f":"IF(ISERROR(+I24+'App.2-CD_DepExp_Yr3'!K24-J24), 0, +I24+'App.2-CD_DepExp_Yr3'!K24-J24)","v":0}]
[1815,"Transformer Station Equipment >50 kV",null,null,0,{"$f":"IF(D25=0,'App.2-CD_DepExp_Yr3'!K25,+'App.2-CD_DepExp_Yr3'!K25+((C25*0.5)/D25))","v":0},null,0,0,null,{"$f":"IF(ISERROR(+I25+'App.2-CD_DepExp_Yr3'!K25-J25), 0, +I25+'App.2-CD_DepExp_Yr3'!K25-J25)","v":0}]
[1820,"Distribution Station Equipment <50 kV",null,null,0,{"$f":"IF(D26=0,'App.2-CD_DepExp_Yr3'!K26,+'App.2-CD_DepExp_Yr3'!K26+((C26*0.5)/D26))","v":0},null,0,0,null,{"$f":"IF(ISERROR(+I26+'App.2-CD_DepExp_Yr3'!K26-J26), 0, +I26+'App.2-CD_DepExp_Yr3'!K26-J26)","v":0}]
[1825,"Storage Battery Equipment",null,null,0,{"$f":"IF(D27=0,'App.2-CD_DepExp_Yr3'!K27,+'App.2-CD_DepExp_Yr3'!K27+((C27*0.5)/D27))","v":0},null,0,0,null,{"$f":"IF(ISERROR(+I27+'App.2-CD_DepExp_Yr3'!K27-J27), 0, +I27+'App.2-CD_DepExp_Yr3'!K27-J27)","v":0}]
[1830,"Poles, Towers & Fixtures",null,null,0,{"$f":"IF(D28=0,'App.2-CD_DepExp_Yr3'!K28,+'App.2-CD_DepExp_Yr3'!K28+((C28*0.5)/D28))","v":0},null,0,0,null,{"$f":"IF(ISERROR(+I28+'App.2-CD_DepExp_Yr3'!K28-J28), 0, +I28+'App.2-CD_DepExp_Yr3'!K28-J28)","v":0}]
[1835,"Overhead Conductors & Devices",null,null,0,{"$f":"IF(D29=0,'App.2-CD_DepExp_Yr3'!K29,+'App.2-CD_DepExp_Yr3'!K29+((C29*0.5)/D29))","v":0},null,0,0,null,{"$f":"IF(ISERROR(+I29+'App.2-CD_DepExp_Yr3'!K29-J29), 0, +I29+'App.2-CD_DepExp_Yr3'!K29-J29)","v":0}]
[1840,"Underground Conduit",null,null,0,{"$f":"IF(D30=0,'App.2-CD_DepExp_Yr3'!K30,+'App.2-CD_DepExp_Yr3'!K30+((C30*0.5)/D30))","v":0},null,0,0,null,{"$f":"IF(ISERROR(+I30+'App.2-CD_DepExp_Yr3'!K30-J30), 0, +I30+'App.2-CD_DepExp_Yr3'!K30-J30)","v":0}]
[1845,"Underground Conductors & Devices",null,null,0,{"$f":"IF(D31=0,'App.2-CD_DepExp_Yr3'!K31,+'App.2-CD_DepExp_Yr3'!K31+((C31*0.5)/D31))","v":0},null,0,0,null,{"$f":"IF(ISERROR(+I31+'App.2-CD_DepExp_Yr3'!K31-J31), 0, +I31+'App.2-CD_DepExp_Yr3'!K31-J31)","v":0}]
[1850,"Line Transformers",null,null,0,{"$f":"IF(D32=0,'App.2-CD_DepExp_Yr3'!K32,+'App.2-CD_DepExp_Yr3'!K32+((C32*0.5)/D32))","v":0},null,0,0,null,{"$f":"IF(ISERROR(+I32+'App.2-CD_DepExp_Yr3'!K32-J32), 0, +I32+'App.2-CD_DepExp_Yr3'!K32-J32)","v":0}]
[1855,"Services (Overhead & Underground)",null,null,0,{"$f":"IF(D33=0,'App.2-CD_DepExp_Yr3'!K33,+'App.2-CD_DepExp_Yr3'!K33+((C33*0.5)/D33))","v":0},null,0,0,null,{"$f":"IF(ISERROR(+I33+'App.2-CD_DepExp_Yr3'!K33-J33), 0, +I33+'App.2-CD_DepExp_Yr3'!K33-J33)","v":0}]
[1860,"Meters",null,null,0,{"$f":"IF(D34=0,'App.2-CD_DepExp_Yr3'!K34,+'App.2-CD_DepExp_Yr3'!K34+((C34*0.5)/D34))","v":0},null,0,0,null,{"$f":"IF(ISERROR(+I34+'App.2-CD_DepExp_Yr3'!K34-J34), 0, +I34+'App.2-CD_DepExp_Yr3'!K34-J34)","v":0}]
[1860,"Meters (Smart Meters)",null,null,0,{"$f":"IF(D35=0,'App.2-CD_DepExp_Yr3'!K35,+'App.2-CD_DepExp_Yr3'!K35+((C35*0.5)/D35))","v":0},null,0,0,null,{"$f":"IF(ISERROR(+I35+'App.2-CD_DepExp_Yr3'!K35-J35), 0, +I35+'App.2-CD_DepExp_Yr3'!K35-J35)","v":0}]
[1905,"Land",null,null,0,{"$f":"IF(D36=0,'App.2-CD_DepExp_Yr3'!K36,+'App.2-CD_DepExp_Yr3'!K36+((C36*0.5)/D36))","v":0},null,0,0,null,{"$f":"IF(ISERROR(+I36+'App.2-CD_DepExp_Yr3'!K36-J36), 0, +I36+'App.2-CD_DepExp_Yr3'!K36-J36)","v":0}]
[1908,"Buildings & Fixtures",null,null,0,{"$f":"IF(D37=0,'App.2-CD_DepExp_Yr3'!K37,+'App.2-CD_DepExp_Yr3'!K37+((C37*0.5)/D37))","v":0},null,0,0,null,{"$f":"IF(ISERROR(+I37+'App.2-CD_DepExp_Yr3'!K37-J37), 0, +I37+'App.2-CD_DepExp_Yr3'!K37-J37)","v":0}]
[1910,"Leasehold Improvements",null,null,0,{"$f":"IF(D38=0,'App.2-CD_DepExp_Yr3'!K38,+'App.2-CD_DepExp_Yr3'!K38+((C38*0.5)/D38))","v":0},null,0,0,null,{"$f":"IF(ISERROR(+I38+'App.2-CD_DepExp_Yr3'!K38-J38), 0, +I38+'App.2-CD_DepExp_Yr3'!K38-J38)","v":0}]
[1915,"Office Furniture & Equipment (10 years)",null,null,0,{"$f":"IF(D39=0,'App.2-CD_DepExp_Yr3'!K39,+'App.2-CD_DepExp_Yr3'!K39+((C39*0.5)/D39))","v":0},null,0,0,null,{"$f":"IF(ISERROR(+I39+'App.2-CD_DepExp_Yr3'!K39-J39), 0, +I39+'App.2-CD_DepExp_Yr3'!K39-J39)","v":0}]
[1915,"Office Furniture & Equipment (5 years)",null,null,0,{"$f":"IF(D40=0,'App.2-CD_DepExp_Yr3'!K40,+'App.2-CD_DepExp_Yr3'!K40+((C40*0.5)/D40))","v":0},null,0,0,null,{"$f":"IF(ISERROR(+I40+'App.2-CD_DepExp_Yr3'!K40-J40), 0, +I40+'App.2-CD_DepExp_Yr3'!K40-J40)","v":0}]
[1920,"Computer Equipment - Hardware",null,null,0,{"$f":"IF(D41=0,'App.2-CD_DepExp_Yr3'!K41,+'App.2-CD_DepExp_Yr3'!K41+((C41*0.5)/D41))","v":0},null,0,0,null,{"$f":"IF(ISERROR(+I41+'App.2-CD_DepExp_Yr3'!K41-J41), 0, +I41+'App.2-CD_DepExp_Yr3'!K41-J41)","v":0}]
[1920,"Computer Equip.-Hardware(Post Mar. 22/04)",null,null,0,{"$f":"IF(D42=0,'App.2-CD_DepExp_Yr3'!K42,+'App.2-CD_DepExp_Yr3'!K42+((C42*0.5)/D42))","v":0},null,0,0,null,{"$f":"IF(ISERROR(+I42+'App.2-CD_DepExp_Yr3'!K42-J42), 0, +I42+'App.2-CD_DepExp_Yr3'!K42-J42)","v":0}]
[1920,"Computer Equip.-Hardware(Post Mar. 19/07)",null,null,0,{"$f":"IF(D43=0,'App.2-CD_DepExp_Yr3'!K43,+'App.2-CD_DepExp_Yr3'!K43+((C43*0.5)/D43))","v":0},null,0,0,null,{"$f":"IF(ISERROR(+I43+'App.2-CD_DepExp_Yr3'!K43-J43), 0, +I43+'App.2-CD_DepExp_Yr3'!K43-J43)","v":0}]
[1930,"Transportation Equipment",null,null,0,{"$f":"IF(D44=0,'App.2-CD_DepExp_Yr3'!K44,+'App.2-CD_DepExp_Yr3'!K44+((C44*0.5)/D44))","v":0},null,0,0,null,{"$f":"IF(ISERROR(+I44+'App.2-CD_DepExp_Yr3'!K44-J44), 0, +I44+'App.2-CD_DepExp_Yr3'!K44-J44)","v":0}]
[1935,"Stores Equipment",null,null,0,{"$f":"IF(D45=0,'App.2-CD_DepExp_Yr3'!K45,+'App.2-CD_DepExp_Yr3'!K45+((C45*0.5)/D45))","v":0},null,0,0,null,{"$f":"IF(ISERROR(+I45+'App.2-CD_DepExp_Yr3'!K45-J45), 0, +I45+'App.2-CD_DepExp_Yr3'!K45-J45)","v":0}]
[1940,"Tools, Shop & Garage Equipment",null,null,0,{"$f":"IF(D46=0,'App.2-CD_DepExp_Yr3'!K46,+'App.2-CD_DepExp_Yr3'!K46+((C46*0.5)/D46))","v":0},null,0,0,null,{"$f":"IF(ISERROR(+I46+'App.2-CD_DepExp_Yr3'!K46-J46), 0, +I46+'App.2-CD_DepExp_Yr3'!K46-J46)","v":0}]
[1945,"Measurement & Testing Equipment",null,null,0,{"$f":"IF(D47=0,'App.2-CD_DepExp_Yr3'!K47,+'App.2-CD_DepExp_Yr3'!K47+((C47*0.5)/D47))","v":0},null,0,0,null,{"$f":"IF(ISERROR(+I47+'App.2-CD_DepExp_Yr3'!K47-J47), 0, +I47+'App.2-CD_DepExp_Yr3'!K47-J47)","v":0}]
[1950,"Power Operated Equipment",null,null,0,{"$f":"IF(D48=0,'App.2-CD_DepExp_Yr3'!K48,+'App.2-CD_DepExp_Yr3'!K48+((C48*0.5)/D48))","v":0},null,0,0,null,{"$f":"IF(ISERROR(+I48+'App.2-CD_DepExp_Yr3'!K48-J48), 0, +I48+'App.2-CD_DepExp_Yr3'!K48-J48)","v":0}]
[1955,"Communications Equipment",null,null,0,{"$f":"IF(D49=0,'App.2-CD_DepExp_Yr3'!K49,+'App.2-CD_DepExp_Yr3'!K49+((C49*0.5)/D49))","v":0},null,0,0,null,{"$f":"IF(ISERROR(+I49+'App.2-CD_DepExp_Yr3'!K49-J49), 0, +I49+'App.2-CD_DepExp_Yr3'!K49-J49)","v":0}]
[1955,"Communication Equipment (Smart Meters)",null,null,0,{"$f":"IF(D50=0,'App.2-CD_DepExp_Yr3'!K50,+'App.2-CD_DepExp_Yr3'!K50+((C50*0.5)/D50))","v":0},null,0,0,null,{"$f":"IF(ISERROR(+I50+'App.2-CD_DepExp_Yr3'!K50-J50), 0, +I50+'App.2-CD_DepExp_Yr3'!K50-J50)","v":0}]
[1960,"Miscellaneous Equipment ",null,null,0,{"$f":"IF(D51=0,'App.2-CD_DepExp_Yr3'!K51,+'App.2-CD_DepExp_Yr3'!K51+((C51*0.5)/D51))","v":0},null,0,0,null,{"$f":"IF(ISERROR(+I51+'App.2-CD_DepExp_Yr3'!K51-J51), 0, +I51+'App.2-CD_DepExp_Yr3'!K51-J51)","v":0}]
[1970,"Load Management Controls Customer Premises",null,null,0,{"$f":"IF(D52=0,'App.2-CD_DepExp_Yr3'!K52,+'App.2-CD_DepExp_Yr3'!K52+((C52*0.5)/D52))","v":0},null,0,0,null,{"$f":"IF(ISERROR(+I52+'App.2-CD_DepExp_Yr3'!K52-J52), 0, +I52+'App.2-CD_DepExp_Yr3'!K52-J52)","v":0}]
[1975,"Load Management Controls Utility Premises",null,null,0,{"$f":"IF(D53=0,'App.2-CD_DepExp_Yr3'!K53,+'App.2-CD_DepExp_Yr3'!K53+((C53*0.5)/D53))","v":0},null,0,0,null,{"$f":"IF(ISERROR(+I53+'App.2-CD_DepExp_Yr3'!K53-J53), 0, +I53+'App.2-CD_DepExp_Yr3'!K53-J53)","v":0}]
[1980,"System Supervisor Equipment",null,null,0,{"$f":"IF(D54=0,'App.2-CD_DepExp_Yr3'!K54,+'App.2-CD_DepExp_Yr3'!K54+((C54*0.5)/D54))","v":0},null,0,0,null,{"$f":"IF(ISERROR(+I54+'App.2-CD_DepExp_Yr3'!K54-J54), 0, +I54+'App.2-CD_DepExp_Yr3'!K54-J54)","v":0}]
[1985,"Miscellaneous Fixed Assets",null,null,0,{"$f":"IF(D55=0,'App.2-CD_DepExp_Yr3'!K55,+'App.2-CD_DepExp_Yr3'!K55+((C55*0.5)/D55))","v":0},null,0,0,null,{"$f":"IF(ISERROR(+I55+'App.2-CD_DepExp_Yr3'!K55-J55), 0, +I55+'App.2-CD_DepExp_Yr3'!K55-J55)","v":0}]
[1990,"Other Tangible Property",null,null,0,{"$f":"IF(D56=0,'App.2-CD_DepExp_Yr3'!K56,+'App.2-CD_DepExp_Yr3'!K56+((C56*0.5)/D56))","v":0},null,0,0,null,{"$f":"IF(ISERROR(+I56+'App.2-CD_DepExp_Yr3'!K56-J56), 0, +I56+'App.2-CD_DepExp_Yr3'!K56-J56)","v":0}]
[1995,"Contributions & Grants",null,null,0,{"$f":"IF(D57=0,'App.2-CD_DepExp_Yr3'!K57,+'App.2-CD_DepExp_Yr3'!K57+((C57*0.5)/D57))","v":0},null,0,0,null,{"$f":"IF(ISERROR(+I57+'App.2-CD_DepExp_Yr3'!K57-J57), 0, +I57+'App.2-CD_DepExp_Yr3'!K57-J57)","v":0}]
[null,"Total",{"$f":"SUM(C20:C57)","v":0},null,null,{"$f":"SUM(F20:F57)","v":0},{"$f":"SUM(G20:G57)","v":0},{"$f":"SUM(H20:H57)","v":0},{"$f":"SUM(I20:I57)","v":0},0,{"$f":"SUM(K20:K57)","v":0}]
[null,"Depreciation exp. adj. from gain or loss on the retirement of assets (pool of like assets)"]
[null,"Total Depreciation Expense ",null,null,null,{"$f":"SUM(F58:F59)","v":0}]
["Notes:"]
[1,"Board policy of the \"half-year\" rule - the applicant must ensure that additions in the year attract a half-year depreciation expense in the first year.  Deviations from this standard practice must be supported in the application."]
[2,"The applicant must provide an explanation of material variances in evidence."]
[3,"This column refers to the calculated full year depreciation but excludes the depreciation expense on assets fully depreciated during the year.  This column is used for the purpose of calculating depreciation expense in the following year on the next worksheet."]
[]
["General:","Applicants must provide a breakdown of depreciation and amortization expense in the above format for all relevant accounts.  Asset Retirement Obligations (AROs), depreciation and accretion expense should be disclosed separately consistent with the Notes of historical Audited Financial Statements."]

{"sheet":"App.2-CF_DepExp_Yr5","index":16,"n_rows":66,"n_cols":11,"rows_kept":66,"cut":false,"hidden":false,"merged":[[61,1,61,7],[62,1,62,8],[64,1,64,8],[65,1,66,7],[67,1,68,7],[63,1,63,10],[17,9,18,9],[59,1,59,4],[8,0,8,8],[9,0,9,8],[10,0,10,7],[17,1,18,1],[17,6,18,6],[12,0,12,1],[13,0,13,1],[13,2,13,8],[14,0,14,1],[14,2,14,8]]}
[null,null,null,null,null,null,null,null,null,"File Number:",{"$f":"EBNUMBER","v":0}]
["NOT APPLICABLE",null,null,null,null,null,null,null,null,"Exhibit:"]
[null,null,null,null,null,null,null,null,null,"Tab:"]
[null,null,null,null,null,null,null,null,null,"Schedule:"]
[null,null,null,null,null,null,null,null,null,"Page:"]
[]
[null,null,null,null,null,null,null,null,null,"Date:"]
[]
["Appendix 2-CF"]
["Depreciation and Amortization Expense"]
["MIFRS (Year 5)"]
[]
["Select the set of appendices that apply",null,null,null,null,null,null,null,null,"Year Reflected in Schedule Below","Accounting Standard"]
["2012 Set of Appendices (2-CA to 2-CG)",null,"Assumes the applicant made capitalization and depreciation expense accounting policy changes under CGAAP effective January 1, 2012 and has adopted IFRS for financial reporting purposes effective January 1, 2015.  Assumes that the applicant is reflecting these changes in a rebasing application for the first time.",null,null,null,null,null,null,2016,"MIFRS"]
["2013 Set of Appendices (2-CA to 2-CF)",null,"Assumes the applicant made capitalization and depreciation expense accounting policy changes under CGAAP effective January 1, 2013 and has adopted IFRS for financial reporting purposes effective January 1, 2015.  Assumes that the applicant is reflecting these changes in a rebasing application for the first time.",null,null,null,null,null,null,2017,"MIFRS"]
[]
[]
["Account","Description","Additions","Years (new additions only)","Depreciation Rate on New Additions","Current Depreciation Expense1"," Depreciation Expense per Appendix 2-BA Fixed Assets, Column J\n (l)","Variance 2","Depreciation Expense on Current Full Year Additions","Less Depreciation Expense on Assets Fully Depreciated During the Year\n(o)","Current Full Year Depreciation 3"]
[null,null,"(d)","(f)","(g) = 1 / (f)","(h)= Prior Full Year Depreciation + ((d)*0.5)/(f) ",null,"(m) = (h) - (l)","(n)=((d))/(f) ",null,"(p) = Prior Full Year Depreciation  + (n) - (o)"]
[1611,"Computer Software (Formally known as Account 1925)",null,null,{"$f":"IF(D20=0,0,1/D20)","v":0},{"$f":"IF(D20=0,'App.2-CE_DepExp_Yr4'!K20,+'App.2-CE_DepExp_Yr4'!K20+((C20*0.5)/D20))","v":0},null,{"$f":"IF(ISERROR(+F20-G20), 0, +F20-G20)","v":0},{"$f":"IF(D20=0,0,+(C20)/D20)","v":0},null,{"$f":"IF(ISERROR(+I20+'App.2-CE_DepExp_Yr4'!K20-J20), 0, +'App.2-CE_DepExp_Yr4'!K20-J20)","v":0}]
[1612,"Land Rights (Formally known as Account 1906)",null,null,0,{"$f":"IF(D21=0,'App.2-CE_DepExp_Yr4'!K21,+'App.2-CE_DepExp_Yr4'!K21+((C21*0.5)/D21))","v":0},null,0,{"$f":"IF(D21=0,0,+(C21)/D21)","v":0},null,{"$f":"IF(ISERROR(+I21+'App.2-CE_DepExp_Yr4'!K21-J21), 0, +'App.2-CE_DepExp_Yr4'!K21-J21)","v":0}]
[1805,"Land",null,null,0,{"$f":"IF(D22=0,'App.2-CE_DepExp_Yr4'!K22,+'App.2-CE_DepExp_Yr4'!K22+((C22*0.5)/D22))","v":0},null,0,0,null,{"$f":"IF(ISERROR(+I22+'App.2-CE_DepExp_Yr4'!K22-J22), 0, +'App.2-CE_DepExp_Yr4'!K22-J22)","v":0}]
[1808,"Buildings",null,null,0,{"$f":"IF(D23=0,'App.2-CE_DepExp_Yr4'!K23,+'App.2-CE_DepExp_Yr4'!K23+((C23*0.5)/D23))","v":0},null,0,0,null,{"$f":"IF(ISERROR(+I23+'App.2-CE_DepExp_Yr4'!K23-J23), 0, +'App.2-CE_DepExp_Yr4'!K23-J23)","v":0}]
[1810,"Leasehold Improvements",null,null,0,{"$f":"IF(D24=0,'App.2-CE_DepExp_Yr4'!K24,+'App.2-CE_DepExp_Yr4'!K24+((C24*0.5)/D24))","v":0},null,0,0,null,{"$f":"IF(ISERROR(+I24+'App.2-CE_DepExp_Yr4'!K24-J24), 0, +'App.2-CE_DepExp_Yr4'!K24-J24)","v":0}]
[1815,"Transformer Station Equipment >50 kV",null,null,0,{"$f":"IF(D25=0,'App.2-CE_DepExp_Yr4'!K25,+'App.2-CE_DepExp_Yr4'!K25+((C25*0.5)/D25))","v":0},null,0,0,null,{"$f":"IF(ISERROR(+I25+'App.2-CE_DepExp_Yr4'!K25-J25), 0, +'App.2-CE_DepExp_Yr4'!K25-J25)","v":0}]
[1820,"Distribution Station Equipment <50 kV",null,null,0,{"$f":"IF(D26=0,'App.2-CE_DepExp_Yr4'!K26,+'App.2-CE_DepExp_Yr4'!K26+((C26*0.5)/D26))","v":0},null,0,0,null,{"$f":"IF(ISERROR(+I26+'App.2-CE_DepExp_Yr4'!K26-J26), 0, +'App.2-CE_DepExp_Yr4'!K26-J26)","v":0}]
[1825,"Storage Battery Equipment",null,null,0,{"$f":"IF(D27=0,'App.2-CE_DepExp_Yr4'!K27,+'App.2-CE_DepExp_Yr4'!K27+((C27*0.5)/D27))","v":0},null,0,0,null,{"$f":"IF(ISERROR(+I27+'App.2-CE_DepExp_Yr4'!K27-J27), 0, +'App.2-CE_DepExp_Yr4'!K27-J27)","v":0}]
[1830,"Poles, Towers & Fixtures",null,null,0,{"$f":"IF(D28=0,'App.2-CE_DepExp_Yr4'!K28,+'App.2-CE_DepExp_Yr4'!K28+((C28*0.5)/D28))","v":0},null,0,0,null,{"$f":"IF(ISERROR(+I28+'App.2-CE_DepExp_Yr4'!K28-J28), 0, +'App.2-CE_DepExp_Yr4'!K28-J28)","v":0}]
[1835,"Overhead Conductors & Devices",null,null,0,{"$f":"IF(D29=0,'App.2-CE_DepExp_Yr4'!K29,+'App.2-CE_DepExp_Yr4'!K29+((C29*0.5)/D29))","v":0},null,0,0,null,{"$f":"IF(ISERROR(+I29+'App.2-CE_DepExp_Yr4'!K29-J29), 0, +'App.2-CE_DepExp_Yr4'!K29-J29)","v":0}]
[1840,"Underground Conduit",null,null,0,{"$f":"IF(D30=0,'App.2-CE_DepExp_Yr4'!K30,+'App.2-CE_DepExp_Yr4'!K30+((C30*0.5)/D30))","v":0},null,0,0,null,{"$f":"IF(ISERROR(+I30+'App.2-CE_DepExp_Yr4'!K30-J30), 0, +'App.2-CE_DepExp_Yr4'!K30-J30)","v":0}]
[1845,"Underground Conductors & Devices",null,null,0,{"$f":"IF(D31=0,'App.2-CE_DepExp_Yr4'!K31,+'App.2-CE_DepExp_Yr4'!K31+((C31*0.5)/D31))","v":0},null,0,0,null,{"$f":"IF(ISERROR(+I31+'App.2-CE_DepExp_Yr4'!K31-J31), 0, +'App.2-CE_DepExp_Yr4'!K31-J31)","v":0}]
[1850,"Line Transformers",null,null,0,{"$f":"IF(D32=0,'App.2-CE_DepExp_Yr4'!K32,+'App.2-CE_DepExp_Yr4'!K32+((C32*0.5)/D32))","v":0},null,0,0,null,{"$f":"IF(ISERROR(+I32+'App.2-CE_DepExp_Yr4'!K32-J32), 0, +'App.2-CE_DepExp_Yr4'!K32-J32)","v":0}]
[1855,"Services (Overhead & Underground)",null,null,0,{"$f":"IF(D33=0,'App.2-CE_DepExp_Yr4'!K33,+'App.2-CE_DepExp_Yr4'!K33+((C33*0.5)/D33))","v":0},null,0,0,null,{"$f":"IF(ISERROR(+I33+'App.2-CE_DepExp_Yr4'!K33-J33), 0, +'App.2-CE_DepExp_Yr4'!K33-J33)","v":0}]
[1860,"Meters",null,null,0,{"$f":"IF(D34=0,'App.2-CE_DepExp_Yr4'!K34,+'App.2-CE_DepExp_Yr4'!K34+((C34*0.5)/D34))","v":0},null,0,0,null,{"$f":"IF(ISERROR(+I34+'App.2-CE_DepExp_Yr4'!K34-J34), 0, +'App.2-CE_DepExp_Yr4'!K34-J34)","v":0}]
[1860,"Meters (Smart Meters)",null,null,0,{"$f":"IF(D35=0,'App.2-CE_DepExp_Yr4'!K35,+'App.2-CE_DepExp_Yr4'!K35+((C35*0.5)/D35))","v":0},null,0,0,null,{"$f":"IF(ISERROR(+I35+'App.2-CE_DepExp_Yr4'!K35-J35), 0, +'App.2-CE_DepExp_Yr4'!K35-J35)","v":0}]
[1905,"Land",null,null,0,{"$f":"IF(D36=0,'App.2-CE_DepExp_Yr4'!K36,+'App.2-CE_DepExp_Yr4'!K36+((C36*0.5)/D36))","v":0},null,0,0,null,{"$f":"IF(ISERROR(+I36+'App.2-CE_DepExp_Yr4'!K36-J36), 0, +'App.2-CE_DepExp_Yr4'!K36-J36)","v":0}]
[1908,"Buildings & Fixtures",null,null,0,{"$f":"IF(D37=0,'App.2-CE_DepExp_Yr4'!K37,+'App.2-CE_DepExp_Yr4'!K37+((C37*0.5)/D37))","v":0},null,0,0,null,{"$f":"IF(ISERROR(+I37+'App.2-CE_DepExp_Yr4'!K37-J37), 0, +'App.2-CE_DepExp_Yr4'!K37-J37)","v":0}]
[1910,"Leasehold Improvements",null,null,0,{"$f":"IF(D38=0,'App.2-CE_DepExp_Yr4'!K38,+'App.2-CE_DepExp_Yr4'!K38+((C38*0.5)/D38))","v":0},null,0,0,null,{"$f":"IF(ISERROR(+I38+'App.2-CE_DepExp_Yr4'!K38-J38), 0, +'App.2-CE_DepExp_Yr4'!K38-J38)","v":0}]
[1915,"Office Furniture & Equipment (10 years)",null,null,0,{"$f":"IF(D39=0,'App.2-CE_DepExp_Yr4'!K39,+'App.2-CE_DepExp_Yr4'!K39+((C39*0.5)/D39))","v":0},null,0,0,null,{"$f":"IF(ISERROR(+I39+'App.2-CE_DepExp_Yr4'!K39-J39), 0, +'App.2-CE_DepExp_Yr4'!K39-J39)","v":0}]
[1915,"Office Furniture & Equipment (5 years)",null,null,0,{"$f":"IF(D40=0,'App.2-CE_DepExp_Yr4'!K40,+'App.2-CE_DepExp_Yr4'!K40+((C40*0.5)/D40))","v":0},null,0,0,null,{"$f":"IF(ISERROR(+I40+'App.2-CE_DepExp_Yr4'!K40-J40), 0, +'App.2-CE_DepExp_Yr4'!K40-J40)","v":0}]
[1920,"Computer Equipment - Hardware",null,null,0,{"$f":"IF(D41=0,'App.2-CE_DepExp_Yr4'!K41,+'App.2-CE_DepExp_Yr4'!K41+((C41*0.5)/D41))","v":0},null,0,0,null,{"$f":"IF(ISERROR(+I41+'App.2-CE_DepExp_Yr4'!K41-J41), 0, +'App.2-CE_DepExp_Yr4'!K41-J41)","v":0}]
[1920,"Computer Equip.-Hardware(Post Mar. 22/04)",null,null,0,{"$f":"IF(D42=0,'App.2-CE_DepExp_Yr4'!K42,+'App.2-CE_DepExp_Yr4'!K42+((C42*0.5)/D42))","v":0},null,0,0,null,{"$f":"IF(ISERROR(+I42+'App.2-CE_DepExp_Yr4'!K42-J42), 0, +'App.2-CE_DepExp_Yr4'!K42-J42)","v":0}]
[1920,"Computer Equip.-Hardware(Post Mar. 19/07)",null,null,0,{"$f":"IF(D43=0,'App.2-CE_DepExp_Yr4'!K43,+'App.2-CE_DepExp_Yr4'!K43+((C43*0.5)/D43))","v":0},null,0,0,null,{"$f":"IF(ISERROR(+I43+'App.2-CE_DepExp_Yr4'!K43-J43), 0, +'App.2-CE_DepExp_Yr4'!K43-J43)","v":0}]
[1930,"Transportation Equipment",null,null,0,{"$f":"IF(D44=0,'App.2-CE_DepExp_Yr4'!K44,+'App.2-CE_DepExp_Yr4'!K44+((C44*0.5)/D44))","v":0},null,0,0,null,{"$f":"IF(ISERROR(+I44+'App.2-CE_DepExp_Yr4'!K44-J44), 0, +'App.2-CE_DepExp_Yr4'!K44-J44)","v":0}]
[1935,"Stores Equipment",null,null,0,{"$f":"IF(D45=0,'App.2-CE_DepExp_Yr4'!K45,+'App.2-CE_DepExp_Yr4'!K45+((C45*0.5)/D45))","v":0},null,0,0,null,{"$f":"IF(ISERROR(+I45+'App.2-CE_DepExp_Yr4'!K45-J45), 0, +'App.2-CE_DepExp_Yr4'!K45-J45)","v":0}]
[1940,"Tools, Shop & Garage Equipment",null,null,0,{"$f":"IF(D46=0,'App.2-CE_DepExp_Yr4'!K46,+'App.2-CE_DepExp_Yr4'!K46+((C46*0.5)/D46))","v":0},null,0,0,null,{"$f":"IF(ISERROR(+I46+'App.2-CE_DepExp_Yr4'!K46-J46), 0, +'App.2-CE_DepExp_Yr4'!K46-J46)","v":0}]
[1945,"Measurement & Testing Equipment",null,null,0,{"$f":"IF(D47=0,'App.2-CE_DepExp_Yr4'!K47,+'App.2-CE_DepExp_Yr4'!K47+((C47*0.5)/D47))","v":0},null,0,0,null,{"$f":"IF(ISERROR(+I47+'App.2-CE_DepExp_Yr4'!K47-J47), 0, +'App.2-CE_DepExp_Yr4'!K47-J47)","v":0}]
[1950,"Power Operated Equipment",null,null,0,{"$f":"IF(D48=0,'App.2-CE_DepExp_Yr4'!K48,+'App.2-CE_DepExp_Yr4'!K48+((C48*0.5)/D48))","v":0},null,0,0,null,{"$f":"IF(ISERROR(+I48+'App.2-CE_DepExp_Yr4'!K48-J48), 0, +'App.2-CE_DepExp_Yr4'!K48-J48)","v":0}]
[1955,"Communications Equipment",null,null,0,{"$f":"IF(D49=0,'App.2-CE_DepExp_Yr4'!K49,+'App.2-CE_DepExp_Yr4'!K49+((C49*0.5)/D49))","v":0},null,0,0,null,{"$f":"IF(ISERROR(+I49+'App.2-CE_DepExp_Yr4'!K49-J49), 0, +'App.2-CE_DepExp_Yr4'!K49-J49)","v":0}]
[1955,"Communication Equipment (Smart Meters)",null,null,0,{"$f":"IF(D50=0,'App.2-CE_DepExp_Yr4'!K50,+'App.2-CE_DepExp_Yr4'!K50+((C50*0.5)/D50))","v":0},null,0,0,null,{"$f":"IF(ISERROR(+I50+'App.2-CE_DepExp_Yr4'!K50-J50), 0, +'App.2-CE_DepExp_Yr4'!K50-J50)","v":0}]
[1960,"Miscellaneous Equipment ",null,null,0,{"$f":"IF(D51=0,'App.2-CE_DepExp_Yr4'!K51,+'App.2-CE_DepExp_Yr4'!K51+((C51*0.5)/D51))","v":0},null,0,0,null,{"$f":"IF(ISERROR(+I51+'App.2-CE_DepExp_Yr4'!K51-J51), 0, +'App.2-CE_DepExp_Yr4'!K51-J51)","v":0}]
[1970,"Load Management Controls Customer Premises",null,null,0,{"$f":"IF(D52=0,'App.2-CE_DepExp_Yr4'!K52,+'App.2-CE_DepExp_Yr4'!K52+((C52*0.5)/D52))","v":0},null,0,0,null,{"$f":"IF(ISERROR(+I52+'App.2-CE_DepExp_Yr4'!K52-J52), 0, +'App.2-CE_DepExp_Yr4'!K52-J52)","v":0}]
[1975,"Load Management Controls Utility Premises",null,null,0,{"$f":"IF(D53=0,'App.2-CE_DepExp_Yr4'!K53,+'App.2-CE_DepExp_Yr4'!K53+((C53*0.5)/D53))","v":0},null,0,0,null,{"$f":"IF(ISERROR(+I53+'App.2-CE_DepExp_Yr4'!K53-J53), 0, +'App.2-CE_DepExp_Yr4'!K53-J53)","v":0}]
[1980,"System Supervisor Equipment",null,null,0,{"$f":"IF(D54=0,'App.2-CE_DepExp_Yr4'!K54,+'App.2-CE_DepExp_Yr4'!K54+((C54*0.5)/D54))","v":0},null,0,0,null,{"$f":"IF(ISERROR(+I54+'App.2-CE_DepExp_Yr4'!K54-J54), 0, +'App.2-CE_DepExp_Yr4'!K54-J54)","v":0}]
[1985,"Miscellaneous Fixed Assets",null,null,0,{"$f":"IF(D55=0,'App.2-CE_DepExp_Yr4'!K55,+'App.2-CE_DepExp_Yr4'!K55+((C55*0.5)/D55))","v":0},null,0,0,null,{"$f":"IF(ISERROR(+I55+'App.2-CE_DepExp_Yr4'!K55-J55), 0, +'App.2-CE_DepExp_Yr4'!K55-J55)","v":0}]
[1990,"Other Tangible Property",null,null,0,{"$f":"IF(D56=0,'App.2-CE_DepExp_Yr4'!K56,+'App.2-CE_DepExp_Yr4'!K56+((C56*0.5)/D56))","v":0},null,0,0,null,{"$f":"IF(ISERROR(+I56+'App.2-CE_DepExp_Yr4'!K56-J56), 0, +'App.2-CE_DepExp_Yr4'!K56-J56)","v":0}]
[1995,"Contributions & Grants",null,null,0,{"$f":"IF(D57=0,'App.2-CE_DepExp_Yr4'!K57,+'App.2-CE_DepExp_Yr4'!K57+((C57*0.5)/D57))","v":0},null,0,0,null,{"$f":"IF(ISERROR(+I57+'App.2-CE_DepExp_Yr4'!K57-J57), 0, +'App.2-CE_DepExp_Yr4'!K57-J57)","v":0}]
[null,"Total",{"$f":"SUM(C20:C57)","v":0},null,null,{"$f":"SUM(F20:F57)","v":0},{"$f":"SUM(G20:G57)","v":0},{"$f":"SUM(H20:H57)","v":0},{"$f":"SUM(I20:I57)","v":0},0,0]
[null,"Depreciation exp. adj. from gain or loss on the retirement of assets (pool of like assets)"]
[null,"Total Depreciation Expense ",null,null,null,{"$f":"SUM(F58:F59)","v":0}]
["Notes:"]
[1,"Board policy of the \"half-year\" rule - the applicant must ensure that additions in the year attract a half-year depreciation expense in the first year.  Deviations from this standard practice must be supported in the application."]
[2,"The applicant must provide an explanation of material variances in evidence."]
[3,"This column refers to the calculated full year depreciation but excludes the depreciation expense on assets fully depreciated during the year.  This column is used for the purpose of calculating depreciation expense in the following year on the next worksheet."]
[]
["General:","Applicants must provide a breakdown of depreciation and amortization expense in the above format for all relevant accounts.  Asset Retirement Obligations (AROs), depreciation and accretion expense should be disclosed separately consistent with the Notes of historical Audited Financial Statements."]

{"sheet":"App.2-CG_DepExp_Yr6","index":17,"n_rows":66,"n_cols":11,"rows_kept":66,"cut":false,"hidden":false,"merged":[[61,1,61,7],[62,1,62,8],[64,1,64,8],[65,1,66,7],[67,1,68,7],[14,2,14,8],[17,1,18,1],[17,6,18,6],[17,9,18,9],[59,1,59,4],[8,0,8,8],[9,0,9,8],[10,0,10,7],[12,0,12,1],[13,0,13,1],[13,2,13,8]]}
[null,null,null,null,null,null,null,null,null,"File Number:",{"$f":"EBNUMBER","v":0}]
["NOT APPLICABLE",null,null,null,null,null,null,null,null,"Exhibit:"]
[null,null,null,null,null,null,null,null,null,"Tab:"]
[null,null,null,null,null,null,null,null,null,"Schedule:"]
[null,null,null,null,null,null,null,null,null,"Page:"]
[]
[null,null,null,null,null,null,null,null,null,"Date:"]
[]
["Appendix 2-CG"]
["Depreciation and Amortization Expense"]
["MIFRS (Year 6)"]
[]
["Select the set of appendices that apply",null,null,null,null,null,null,null,null,"Year Reflected in Schedule Below","Accounting Standard"]
["2012 Set of Appendices (2-CA to 2-CG)",null,"Assumes the applicant made capitalization and depreciation expense accounting policy changes under CGAAP effective January 1, 2012 and has adopted IFRS for financial reporting purposes effective January 1, 2015.  Assumes that the applicant is reflecting these changes in a rebasing application for the first time.",null,null,null,null,null,null,2017,"MIFRS"]
["N/A","         2013 Set of Appendices","Not applicable as the test year depreciation is already calculated in Appendix 2-CF.  Note that this appendix is not to be used even though depreciation expense calculations will flow through from previous years to this appendix.",null,null,null,null,null,null,"N/A","N/A"]
[]
[]
["Account","Description","Additions","Years (new additions only)","Depreciation Rate on New Additions","Current Depreciation Expense1"," Depreciation Expense per Appendix 2-BA Fixed Assets, Column J\n (l)","Variance 2"]
[null,null,"(d)","(f)","(g) = 1 / (f)","(h)= Prior Full Year Depreciation + ((d)*0.5)/(f) ",null,"(m) = (h) - (l)"]
[1611,"Computer Software (Formally known as Account 1925)",null,null,{"$f":"IF(D20=0,0,1/D20)","v":0},{"$f":"IF(D20=0,'App.2-CF_DepExp_Yr5'!K20,+'App.2-CF_DepExp_Yr5'!K20+((C20*0.5)/D20))","v":0},null,{"$f":"IF(ISERROR(+F20-G20), 0, +F20-G20)","v":0}]
[1612,"Land Rights (Formally known as Account 1906)",null,null,0,{"$f":"IF(D21=0,'App.2-CF_DepExp_Yr5'!K21,+'App.2-CF_DepExp_Yr5'!K21+((C21*0.5)/D21))","v":0},null,0]
[1805,"Land",null,null,0,{"$f":"IF(D22=0,'App.2-CF_DepExp_Yr5'!K22,+'App.2-CF_DepExp_Yr5'!K22+((C22*0.5)/D22))","v":0},null,0]
[1808,"Buildings",null,null,0,{"$f":"IF(D23=0,'App.2-CF_DepExp_Yr5'!K23,+'App.2-CF_DepExp_Yr5'!K23+((C23*0.5)/D23))","v":0},null,0]
[1810,"Leasehold Improvements",null,null,0,{"$f":"IF(D24=0,'App.2-CF_DepExp_Yr5'!K24,+'App.2-CF_DepExp_Yr5'!K24+((C24*0.5)/D24))","v":0},null,0]
[1815,"Transformer Station Equipment >50 kV",null,null,0,{"$f":"IF(D25=0,'App.2-CF_DepExp_Yr5'!K25,+'App.2-CF_DepExp_Yr5'!K25+((C25*0.5)/D25))","v":0},null,0]
[1820,"Distribution Station Equipment <50 kV",null,null,0,{"$f":"IF(D26=0,'App.2-CF_DepExp_Yr5'!K26,+'App.2-CF_DepExp_Yr5'!K26+((C26*0.5)/D26))","v":0},null,0]
[1825,"Storage Battery Equipment",null,null,0,{"$f":"IF(D27=0,'App.2-CF_DepExp_Yr5'!K27,+'App.2-CF_DepExp_Yr5'!K27+((C27*0.5)/D27))","v":0},null,0]
[1830,"Poles, Towers & Fixtures",null,null,0,{"$f":"IF(D28=0,'App.2-CF_DepExp_Yr5'!K28,+'App.2-CF_DepExp_Yr5'!K28+((C28*0.5)/D28))","v":0},null,0]
[1835,"Overhead Conductors & Devices",null,null,0,{"$f":"IF(D29=0,'App.2-CF_DepExp_Yr5'!K29,+'App.2-CF_DepExp_Yr5'!K29+((C29*0.5)/D29))","v":0},null,0]
[1840,"Underground Conduit",null,null,0,{"$f":"IF(D30=0,'App.2-CF_DepExp_Yr5'!K30,+'App.2-CF_DepExp_Yr5'!K30+((C30*0.5)/D30))","v":0},null,0]
[1845,"Underground Conductors & Devices",null,null,0,{"$f":"IF(D31=0,'App.2-CF_DepExp_Yr5'!K31,+'App.2-CF_DepExp_Yr5'!K31+((C31*0.5)/D31))","v":0},null,0]
[1850,"Line Transformers",null,null,0,{"$f":"IF(D32=0,'App.2-CF_DepExp_Yr5'!K32,+'App.2-CF_DepExp_Yr5'!K32+((C32*0.5)/D32))","v":0},null,0]
[1855,"Services (Overhead & Underground)",null,null,0,{"$f":"IF(D33=0,'App.2-CF_DepExp_Yr5'!K33,+'App.2-CF_DepExp_Yr5'!K33+((C33*0.5)/D33))","v":0},null,0]
[1860,"Meters",null,null,0,{"$f":"IF(D34=0,'App.2-CF_DepExp_Yr5'!K34,+'App.2-CF_DepExp_Yr5'!K34+((C34*0.5)/D34))","v":0},null,0]
[1860,"Meters (Smart Meters)",null,null,0,{"$f":"IF(D35=0,'App.2-CF_DepExp_Yr5'!K35,+'App.2-CF_DepExp_Yr5'!K35+((C35*0.5)/D35))","v":0},null,0]
[1905,"Land",null,null,0,{"$f":"IF(D36=0,'App.2-CF_DepExp_Yr5'!K36,+'App.2-CF_DepExp_Yr5'!K36+((C36*0.5)/D36))","v":0},null,0]
[1908,"Buildings & Fixtures",null,null,0,{"$f":"IF(D37=0,'App.2-CF_DepExp_Yr5'!K37,+'App.2-CF_DepExp_Yr5'!K37+((C37*0.5)/D37))","v":0},null,0]
[1910,"Leasehold Improvements",null,null,0,{"$f":"IF(D38=0,'App.2-CF_DepExp_Yr5'!K38,+'App.2-CF_DepExp_Yr5'!K38+((C38*0.5)/D38))","v":0},null,0]
[1915,"Office Furniture & Equipment (10 years)",null,null,0,{"$f":"IF(D39=0,'App.2-CF_DepExp_Yr5'!K39,+'App.2-CF_DepExp_Yr5'!K39+((C39*0.5)/D39))","v":0},null,0]
[1915,"Office Furniture & Equipment (5 years)",null,null,0,{"$f":"IF(D40=0,'App.2-CF_DepExp_Yr5'!K40,+'App.2-CF_DepExp_Yr5'!K40+((C40*0.5)/D40))","v":0},null,0]
[1920,"Computer Equipment - Hardware",null,null,0,{"$f":"IF(D41=0,'App.2-CF_DepExp_Yr5'!K41,+'App.2-CF_DepExp_Yr5'!K41+((C41*0.5)/D41))","v":0},null,0]
[1920,"Computer Equip.-Hardware(Post Mar. 22/04)",null,null,0,{"$f":"IF(D42=0,'App.2-CF_DepExp_Yr5'!K42,+'App.2-CF_DepExp_Yr5'!K42+((C42*0.5)/D42))","v":0},null,0]
[1920,"Computer Equip.-Hardware(Post Mar. 19/07)",null,null,0,{"$f":"IF(D43=0,'App.2-CF_DepExp_Yr5'!K43,+'App.2-CF_DepExp_Yr5'!K43+((C43*0.5)/D43))","v":0},null,0]
[1930,"Transportation Equipment",null,null,0,{"$f":"IF(D44=0,'App.2-CF_DepExp_Yr5'!K44,+'App.2-CF_DepExp_Yr5'!K44+((C44*0.5)/D44))","v":0},null,0]
[1935,"Stores Equipment",null,null,0,{"$f":"IF(D45=0,'App.2-CF_DepExp_Yr5'!K45,+'App.2-CF_DepExp_Yr5'!K45+((C45*0.5)/D45))","v":0},null,0]
[1940,"Tools, Shop & Garage Equipment",null,null,0,{"$f":"IF(D46=0,'App.2-CF_DepExp_Yr5'!K46,+'App.2-CF_DepExp_Yr5'!K46+((C46*0.5)/D46))","v":0},null,0]
[1945,"Measurement & Testing Equipment",null,null,0,{"$f":"IF(D47=0,'App.2-CF_DepExp_Yr5'!K47,+'App.2-CF_DepExp_Yr5'!K47+((C47*0.5)/D47))","v":0},null,0]
[1950,"Power Operated Equipment",null,null,0,{"$f":"IF(D48=0,'App.2-CF_DepExp_Yr5'!K48,+'App.2-CF_DepExp_Yr5'!K48+((C48*0.5)/D48))","v":0},null,0]
[1955,"Communications Equipment",null,null,0,{"$f":"IF(D49=0,'App.2-CF_DepExp_Yr5'!K49,+'App.2-CF_DepExp_Yr5'!K49+((C49*0.5)/D49))","v":0},null,0]
[1955,"Communication Equipment (Smart Meters)",null,null,0,{"$f":"IF(D50=0,'App.2-CF_DepExp_Yr5'!K50,+'App.2-CF_DepExp_Yr5'!K50+((C50*0.5)/D50))","v":0},null,0]
[1960,"Miscellaneous Equipment ",null,null,0,{"$f":"IF(D51=0,'App.2-CF_DepExp_Yr5'!K51,+'App.2-CF_DepExp_Yr5'!K51+((C51*0.5)/D51))","v":0},null,0]
[1970,"Load Management Controls Customer Premises",null,null,0,{"$f":"IF(D52=0,'App.2-CF_DepExp_Yr5'!K52,+'App.2-CF_DepExp_Yr5'!K52+((C52*0.5)/D52))","v":0},null,0]
[1975,"Load Management Controls Utility Premises",null,null,0,{"$f":"IF(D53=0,'App.2-CF_DepExp_Yr5'!K53,+'App.2-CF_DepExp_Yr5'!K53+((C53*0.5)/D53))","v":0},null,0]
[1980,"System Supervisor Equipment",null,null,0,{"$f":"IF(D54=0,'App.2-CF_DepExp_Yr5'!K54,+'App.2-CF_DepExp_Yr5'!K54+((C54*0.5)/D54))","v":0},null,0]
[1985,"Miscellaneous Fixed Assets",null,null,0,{"$f":"IF(D55=0,'App.2-CF_DepExp_Yr5'!K55,+'App.2-CF_DepExp_Yr5'!K55+((C55*0.5)/D55))","v":0},null,0]
[1990,"Other Tangible Property",null,null,0,{"$f":"IF(D56=0,'App.2-CF_DepExp_Yr5'!K56,+'App.2-CF_DepExp_Yr5'!K56+((C56*0.5)/D56))","v":0},null,0]
[1995,"Contributions & Grants",null,null,0,{"$f":"IF(D57=0,'App.2-CF_DepExp_Yr5'!K57,+'App.2-CF_DepExp_Yr5'!K57+((C57*0.5)/D57))","v":0},null,0]
[null,"Total",{"$f":"SUM(C20:C57)","v":0},null,null,{"$f":"SUM(F20:F57)","v":0},{"$f":"SUM(G20:G57)","v":0},{"$f":"SUM(H20:H57)","v":0}]
[null,"Depreciation exp. adj. from gain or loss on the retirement of assets (pool of like assets)"]
[null,"Total Depreciation Expense ",null,null,null,{"$f":"SUM(F58:F59)","v":0}]
["Notes:"]
[1,"Board policy of the \"half-year\" rule - the applicant must ensure that additions in the year attract a half-year depreciation expense in the first year.  Deviations from this standard practice must be supported in the application."]
[2,"The applicant must provide an explanation of material variances in evidence."]
[]
[]
["General:","Applicants must provide a breakdown of depreciation and amortization expense in the above format for all relevant accounts.  Asset Retirement Obligations (AROs), depreciation and accretion expense should be disclosed separately consistent with the Notes of historical Audited Financial Statements."]

{"sheet":"App.2-CH_DepExp","index":18,"n_rows":356,"n_cols":12,"rows_kept":356,"cut":false,"hidden":false,"merged":[[8,0,8,11],[9,0,9,11],[10,0,10,11],[14,2,14,11],[17,0,18,0],[17,1,18,1],[17,10,18,10],[83,0,84,0],[83,1,84,1],[83,10,84,10],[291,0,292,0],[291,1,292,1],[291,10,292,10],[152,0,153,0],[152,1,153,1],[152,10,153,10],[222,0,223,0],[222,1,223,1],[222,10,223,10]]}
[null,null,null,null,null,null,null,null,null,null,"File Number:",{"$f":"EBNUMBER","v":0}]
[null,null,null,null,null,null,null,null,null,null,"Exhibit:"]
[null,null,null,null,null,null,null,null,null,null,"Tab:"]
[null,null,null,null,null,null,null,null,null,null,"Schedule:"]
[null,null,null,null,null,null,null,null,null,null,"Page:"]
[]
[null,null,null,null,null,null,null,null,null,null,"Date:"]
[]
["Appendix 2-CH1"]
["Depreciation and Amortization Expense"]
["Revised CGAAP or MIFRS"]
[]
["Assumes the applicant changed capitalization and depreciation policies and reflected these changes in a prior rebasing application"]
[]
[null,null,"Determination of Depreciation Expenses"]
[null,null,"Year",2014,"CGAAP - with changes to policies"]
[]
["Account","Description","Opening Regulatory Gross PP&E as at Jan 1, 2010","Less Fully Depreciated","Net for Depreciation","Additions","Total for Depreciation","Years","Depreciation Rate","2010 Depreciation Expense","2010 Depreciation Expense per Appendix 2-B Fixed Assets, Column K\n (l)","Variance 2"]
[null,null,"(a)","(b)","(c)","(d)","(e) = (c) + ½ x (d) 1","(f)","(g) = 1 / (f)","(h) = (e) / (f)",null,"(m) = (h) - (l)"]
[1611,"Computer Software (Formally known as Account 1925)",85405.66,22085.77,{"$f":"C20-D20","v":63319.89},40505.350000000006,{"$f":"E20+0.5*F20","v":83572.565000000002},5,{"$f":"IF(H20=0,\"\",1/H20)","v":0.2},{"$f":"IF(H20=0,0,G20/H20)","v":16714.512999999999},5179.7700000000004,{"$f":"IF(ISERROR(+J20-K20), \"\", +J20-K20)","v":11534.742999999999}]
[1612,"Land Rights (Formally known as Account 1906)",null,null,{"$f":"C21-D21","v":0},null,{"$f":"E21+0.5*F21","v":0},35,2.8571428571428571E-2,0,null,{"$f":"IF(ISERROR(+J21-K21), \"\", +J21-K21)","v":0}]
[1612,"Land Rights (Formally known as Account 1906)",null,null,0,null,0,70,1.4285714285714285E-2,0,null,0]
[1805,"Land",50000,null,50000,null,50000,0,"",0,null,0]
[1808,"Buildings - Equipment",0,null,0,null,0,10,0.1,0,null,0]
[1808,"Buildings - Equipment",null,null,0,null,0,20,0.05,0]
[1808,"Buildings - Major Repairs",null,null,0,null,0,25,0.04,0,null,0]
[1808,"Buildings - Major Repairs",null,null,0,null,0,30,3.3333333333333333E-2,0,null,0]
[1808,"Buildings - Brick, Stone, Concrete and Steel",null,null,0,null,0,50,0.02,0,null,0]
[1810,"Leasehold Improvements",0,null,0,null,0,null,"",0,null,0]
[1815,"Transformer Station Equipment >50 kV",0,null,0,null,0,null,"",0,null,0]
[1820,"Distribution Station Equipment <50 kV",284887.52,null,284887.52,0,284887.52,55,1.8181818181818181E-2,5179.7730909090915,22388.28,-17208.506909090909]
[1825,"Storage Battery Equipment",0,null,0,null,0,null,"",0,4987.0499999999993,-4987.0499999999993]
[1830,"Poles, Towers & Fixtures",638783.24,null,638783.24,107752.87,692659.67500000005,40,2.5000000000000001E-2,17316.491875,0,17316.491875]
[1835,"Overhead Conductors & Devices",605736.69000000006,null,605736.69000000006,55661.820000000065,633567.60000000009,60,1.6666666666666666E-2,10559.460000000001,21538,-10978.539999999999]
[1840,"Underground Conduit",0,null,0,null,0,null,"",0,0,0]
[1845,"Underground Conductors & Devices",1016362.74,null,1016362.74,692811.42999999993,1362768.4550000001,35,2.8571428571428571E-2,38936.241571428574,0,38936.241571428574]
[1850,"Line Transformers",751064.44000000006,null,751064.44000000006,288934.39,895531.63500000001,40,2.5000000000000001E-2,22388.290874999999,0,22388.290874999999]
[1855,"Services (Overhead & Underground)",193249.96000000002,null,193249.96000000002,12464,199481.96000000002,40,2.5000000000000001E-2,4987.0490000000009,4308.6499999999996,678.39900000000125]
[1860,"Meters",79072.179999999993,79072.179999999993,0,null,0,15,6.6666666666666666E-2,0,null,0]
[1860,"Meters (Smart Meters)",310212.82,null,310212.82,25716.04,323070.84000000003,15,6.6666666666666666E-2,21538.056,21537.99,6.5999999998894054E-2]
[1905,"Land",null,null,0,null,0,0,"",0,null,0]
[1908,"Buildings & Fixtures - Equipment",null,null,0,null,0,10,0.1,0,null,0]
[1908,"Buildings & Fixtures - Driveways",null,null,0,null,0,20,0.05,0,null,0]
[1908,"Buildings & Fixtures - Major Repairs",null,null,0,null,0,25,0.04,0,null,0]
[1908,"Buildings & Fixtures - Brick Store etc",null,null,0,null,0,50,0.02,0,null,0]
[1910,"Leasehold Improvements",null,null,0,null,0,null,"",0,null,0]
[1915,"Office Furniture & Equipment (10 years)",50362.82,7592.64,42770.18,631.93000000000029,43086.145000000004,10,0.1,4308.6145000000006,151.19999999999999,4157.4145000000008]
[1915,"Office Furniture & Equipment (5 years)",0,null,0,null,0,null,"",0,0,0]
[1920,"Computer Equipment - Hardware",26623.670000000002,16392.439999999999,10231.230000000003,429.98999999999796,10446.225000000002,5,0.2,2089.2450000000003,578.6,1510.6450000000004]
[1920,"Computer Equip.-Hardware(Post Mar. 22/04)",0,null,0,null,0,null,"",0,null,0]
[1920,"Computer Equip.-Hardware(Post Mar. 19/07)",0,null,0,null,0,null,"",0,null,0]
[1930,"Transportation Equipment - under 3 Tons",0,null,0,null,0,5,0.2,0,null,0]
[1930,"Transportation Equipment - 3 Tons & Over",null,null,0,null,0,8,null,0,null,0]
[1935,"Stores Equipment",4320,2808,1512,0,1512,10,0.1,151.19999999999999,0,151.19999999999999]
[1940,"Tools, Shop & Garage Equipment",null,null,0,null,0,10,0.1,0,0,0]
[1945,"Measurement & Testing Equipment",8486,2700,5786,0,5786,10,0.1,578.6,0,578.6]
[1950,"Power Operated Equipment",null,null,0,null,0,null,"",0,null,0]
[1955,"Communications Equipment",null,null,0,null,0,null,"",0,null,0]
[1955,"Communication Equipment (Smart Meters)",null,null,0,null,0,null,"",0,null,0]
[1960,"Miscellaneous Equipment ",null,null,0,null,0,null,"",0,null,0]
[1970,"Load Management Controls Customer Premises",null,null,{"$f":"C61-D61","v":0},null,{"$f":"E61+0.5*F61","v":0},null,{"$f":"IF(H61=0,\"\",1/H61)","v":""},{"$f":"IF(H61=0,0,G61/H61)","v":0},null,{"$f":"IF(ISERROR(+J61-K61), \"\", +J61-K61)","v":0}]
[1975,"Load Management Controls Utility Premises",null,null,{"$f":"C62-D62","v":0},null,{"$f":"E62+0.5*F62","v":0},null,{"$f":"IF(H62=0,\"\",1/H62)","v":""},{"$f":"IF(H62=0,0,G62/H62)","v":0},null,{"$f":"IF(ISERROR(+J62-K62), \"\", +J62-K62)","v":0}]
[1980,"System Supervisor Equipment",null,null,0,null,0,15,6.6666666666666666E-2,0,null,0]
[1985,"Miscellaneous Fixed Assets",null,null,0,null,0,null,"",0,null,0]
[1990,"Other Tangible Property",null,null,{"$f":"C65-D65","v":0},null,{"$f":"E65+0.5*F65","v":0},null,{"$f":"IF(H65=0,\"\",1/H65)","v":""},{"$f":"IF(H65=0,0,G65/H65)","v":0},null,{"$f":"IF(ISERROR(+J65-K65), \"\", +J65-K65)","v":0}]
[1995,"Contributions & Grants",-555962.93999999994,null,-555962.93999999994,-905202,-1008563.94,40,2.5000000000000001E-2,-25214.0985,0,-25214.0985]
["etc.",null,null,null,{"$f":"C67-D67","v":0},null,{"$f":"E67+0.5*F67","v":0},null,{"$f":"IF(H67=0,\"\",1/H67)","v":""},{"$f":"IF(H67=0,0,G67/H67)","v":0},null,{"$f":"IF(ISERROR(+J67-K67), \"\", +J67-K67)","v":0}]
["etc.",null,null,null,{"$f":"C68-D68","v":0},null,{"$f":"E68+0.5*F68","v":0},null,{"$f":"IF(H68=0,\"\",1/H68)","v":""},{"$f":"IF(H68=0,0,G68/H68)","v":0},null,{"$f":"IF(ISERROR(+J68-K68), \"\", +J68-K68)","v":0}]
["etc.",null,null,null,0,null,0,null,"",0,null,0]
["etc.",null,null,null,0,null,0,null,"",0,null,0]
["etc.",null,null,null,0,null,0,null,"",0,null,0]
["etc.",null,null,null,0,null,0,null,"",0,null,0]
["etc.",null,null,null,0,null,0,null,"",0,null,0]
["etc.",null,null,null,0,null,0,null,"",0,null,0]
["etc.",null,null,null,0,null,0,null,"",0,null,0]
["etc.",null,null,null,0,null,0,null,"",0,null,0]
[null,null,null,null,0,null,0,null,"",0,null,0]
[null,"Total",{"$f":"SUM(C20:C77)","v":3548604.7999999993},{"$f":"SUM(D20:D77)","v":130651.03},{"$f":"SUM(E20:E77)","v":3417953.77},{"$f":"SUM(F20:F77)","v":319705.81999999983},{"$f":"SUM(G20:G77)","v":3577806.6799999992},null,null,{"$f":"SUM(J20:J77)","v":119533.4364123377},{"$f":"SUM(K20:K77)","v":80669.540000000008},{"$f":"SUM(L20:L77)","v":38863.89641233765}]
[null,null,null,null,null,null,null,24]
[]
[]
[null,null,"Year",2015,"CGAAP - with changes to policies"]
[]
["Account","Description","Opening Regulatory Gross PP&E as at Jan 1, 2011","Less Fully Depreciated","Net for Depreciation","Additions","Total for Depreciation","Years","Depreciation Rate","2011 Depreciation Expense","2011 Depreciation Expense per Appendix 2-B Fixed Assets, Column K\n (l)","Variance 2"]
[null,null,"(a)","(b)","(c)","(d)","(e) = (c) + ½ x (d) 1","(f)","(g) = 1 / (f)","(h) = (e) / (f)",null,"(m) = (h) - (l)"]
[1611,"Computer Software (Formally known as Account 1925)",125911.01,83427.17,{"$f":"C86-D86","v":42483.839999999997},1307.82,{"$f":"E86+0.5*F86","v":43137.75},5,{"$f":"IF(H86=0,\"\",1/H86)","v":0.2},{"$f":"IF(H86=0,0,G86/H86)","v":8627.5499999999993},8627.5499999999993,{"$f":"IF(ISERROR(+J86-K86), \"\", +J86-K86)","v":0}]
[1612,"Land Rights (Formally known as Account 1906)",null,null,{"$f":"C87-D87","v":0},null,{"$f":"E87+0.5*F87","v":0},35,2.8571428571428571E-2,0,null,{"$f":"IF(ISERROR(+J87-K87), \"\", +J87-K87)","v":0}]
[1612,"Land Rights (Formally known as Account 1906)",null,null,0,null,0,70,1.4285714285714285E-2,0,null,0]
[1805,"Land",50000,null,50000,null,50000,0,"",0,null,0]
[1808,"Buildings - Equipment",null,null,0,null,0,10,0.1,0,null,0]
[1808,"Buildings - Equipment",null,null,0,null,{"$f":"E91+0.5*F91","v":0},20,0.05,0,null,0]
[1808,"Buildings - Equipment",null,null,0,null,0,25,0.04,0,null,0]
[1808,"Buildings - Major Repairs",null,null,0,null,0,30,3.3333333333333333E-2,0,null,0]
[1808,"Buildings - Major Repairs",null,null,0,null,0,50,0.02,0,null,0]
[1808,"Buildings - Brick, Stone, Concrete and Steel",null,null,0,null,0,0,"",0,null,0]
[1810,"Leasehold Improvements",null,null,0,null,0,0,"",0,null,0]
[1815,"Transformer Station Equipment >50 kV",284887.52,null,284887.52,75409.759999999995,322592.40000000002,55,1.8181818181818181E-2,5865.3163636363643,5865.32,-3.6363636354508344E-3]
[1820,"Distribution Station Equipment <50 kV",null,null,0,null,0,0,"",0,null,0]
[1825,"Storage Battery Equipment",746536.11,null,746536.11,2662.5,747867.36,40,2.5000000000000001E-2,18696.684000000001,18696.09,0.59400000000096043]
[1830,"Poles, Towers & Fixtures",661398.51,null,661398.51,884.5,661840.76,60,1.6666666666666666E-2,11030.679333333333,11030.68,-6.6666666680248454E-4]
[1835,"Overhead Conductors & Devices",null,null,0,null,0,null,"",0,null,0]
[1840,"Underground Conduit",1709174.17,null,1709174.17,144092.15,1781220.2449999999,35,2.8571428571428571E-2,50892.006999999998,50892.01,-3.0000000042491592E-3]
[1845,"Underground Conductors & Devices",1039998.63,null,1039998.63,110237.5,1095117.3799999999,40,2.5000000000000001E-2,27377.934499999996,27377.93,4.4999999954598024E-3]
[1850,"Line Transformers",205713.96,null,205713.96,15074,213250.96,40,2.5000000000000001E-2,5331.2739999999994,5331.27,3.9999999989959178E-3]
[1855,"Services (Overhead & Underground)",335927.86,null,335927.86,9244.26,340549.99,15,6.6666666666666666E-2,22703.332666666665,22703.33,2.6666666635719594E-3]
[1860,"Meters",null,null,0,null,0,null,"",0,null,0]
[1860,"Meters (Smart Meters)",null,null,0,null,0,0,"",0,null,0]
[1905,"Land",null,null,0,null,0,0,"",0,null,0]
[1908,"Buildings & Fixtures - Equipment",null,null,0,null,0,0,"",0,null,0]
[1908,"Buildings & Fixtures - Equipment",null,null,0,null,0,0,"",0,null,0]
[1908,"Buildings & Fixtures - Driveways",null,null,0,null,0,0,"",0,null,0]
[1908,"Buildings & Fixtures - Major Repairs",null,null,0,null,0,0,"",0,null,0]
[1908,"Buildings & Fixtures - Brick Store etc",null,null,0,null,0,null,"",0,null,0]
[1910,"Leasehold Improvements",null,null,0,null,0,null,"",0,null,0]
[1915,"Office Furniture & Equipment (10 years)",50994.75,13346.76,37647.99,961.6,38128.79,10,0.1,3812.8789999999999,3812.93,-5.0999999999930878E-2]
[1915,"Office Furniture & Equipment (5 years)",null,null,0,null,0,null,"",0,null,0]
[1920,"Computer Equipment - Hardware",27053.66,19472.93,7580.73,1384.95,8273.2049999999999,5,0.2,1654.6410000000001,1654.58,6.1000000000149157E-2]
[1920,"Computer Equip.-Hardware(Post Mar. 22/04)",null,null,0,null,0,null,"",0,null,0]
[1920,"Computer Equip.-Hardware(Post Mar. 19/07)",null,null,0,null,0,0,"",0,null,0]
[1930,"Transportation Equipment - under 3 Tons",null,null,0,null,0,0,"",0,null,0]
[1930,"Transportation Equipment - 3 Tons & Over"]
[1935,"Stores Equipment",4320,2808,{"$f":"C122-D122","v":1512},0,{"$f":"E122+0.5*F122","v":1512},10,{"$f":"IF(H122=0,\"\",1/H122)","v":0.1},{"$f":"IF(H122=0,0,G122/H122)","v":151.19999999999999},151.4,{"$f":"IF(ISERROR(+J122-K122), \"\", +J122-K122)","v":-0.20000000000001705}]
[1940,"Tools, Shop & Garage Equipment",4205,null,{"$f":"C123-D123","v":4205},null,{"$f":"E123+0.5*F123","v":4205},10,{"$f":"IF(H123=0,\"\",1/H123)","v":0.1},{"$f":"IF(H123=0,0,G123/H123)","v":420.5},420.5,{"$f":"IF(ISERROR(+J124-K124), \"\", +J124-K124)","v":0}]
[1945,"Measurement & Testing Equipment",4281,4281,{"$f":"C124-D124","v":0},null,{"$f":"E124+0.5*F124","v":0},10,{"$f":"IF(H124=0,\"\",1/H124)","v":0.1},{"$f":"IF(H124=0,0,G124/H124)","v":0},0,{"$f":"IF(ISERROR(+#REF!-#REF!), \"\", +#REF!-#REF!)","v":""}]
[1950,"Power Operated Equipment",null,null,0,null,0,null,"",0,null,0]
[1955,"Communications Equipment",null,null,0,null,0,null,"",0,null,0]
[1955,"Communication Equipment (Smart Meters)",null,null,0,null,0,null,"",0,null,0]
[1960,"Miscellaneous Equipment ",null,null,{"$f":"C128-D128","v":0},null,{"$f":"E128+0.5*F128","v":0},null,{"$f":"IF(H128=0,\"\",1/H128)","v":""},{"$f":"IF(H128=0,0,G128/H128)","v":0},null,{"$f":"IF(ISERROR(+J128-K128), \"\", +J128-K128)","v":0}]
[1970,"Load Management Controls Customer Premises",null,null,{"$f":"C129-D129","v":0},null,{"$f":"E129+0.5*F129","v":0},null,{"$f":"IF(H129=0,\"\",1/H129)","v":""},{"$f":"IF(H129=0,0,G129/H129)","v":0},null,{"$f":"IF(ISERROR(+J129-K129), \"\", +J129-K129)","v":0}]
[1975,"Load Management Controls Utility Premises",null,null,0,null,0,15,6.6666666666666666E-2,0,null,0]
[1980,"System Supervisor Equipment",null,null,0,null,0,null,"",0,null,0]
[1985,"Miscellaneous Fixed Assets",null,null,{"$f":"C132-D132","v":0},null,{"$f":"E132+0.5*F132","v":0},null,{"$f":"IF(H132=0,\"\",1/H132)","v":""},{"$f":"IF(H132=0,0,G132/H132)","v":0},null,{"$f":"IF(ISERROR(+J132-K132), \"\", +J132-K132)","v":0}]
[1990,"Other Tangible Property"]
[1995,"Contributions & Grants",-1461164.94,null,{"$f":"C134-D134","v":-1461164.94},-148144.20000000001,{"$f":"E134+0.5*F134","v":-1535237.04},40,{"$f":"IF(H134=0,\"\",1/H134)","v":2.5000000000000001E-2},{"$f":"IF(H134=0,0,G134/H134)","v":-38380.925999999999},-38380.92,{"$f":"IF(ISERROR(+J134-K134), \"\", +J134-K134)","v":-6.0000000012223609E-3}]
[1609,"Other Tangible Property",null,null,0,null,0,null,"",0,null,0]
["etc.",null,null,null,0,null,0,null,"",0,null,0]
["etc.",null,null,null,0,null,0,null,"",0,null,0]
["etc.",null,null,null,0,null,0,null,"",0,null,0]
["etc.",null,null,null,0,null,0,null,"",0,null,0]
["etc.",null,null,null,0,null,0,null,"",0,null,0]
["etc.",null,null,null,0,null,0,null,"",0,null,0]
["etc.",null,null,null,0,null,0,null,"",0,null,0]
["etc.",null,null,null,0,null,0,null,"",0,null,0]
["etc.",null,null,null,0,null,0,null,"",0,null,0]
["etc.",null,null,null,0,null,0,null,"",0,null,0]
[null,null,null,null,0,null,0,null,"",0,null,0]
[null,"Total",{"$f":"SUM(C86:C146)","v":3789237.2400000007},{"$f":"SUM(D86:D146)","v":123335.85999999999},{"$f":"SUM(E86:E146)","v":3665901.3800000013},{"$f":"SUM(F86:F146)","v":213114.83999999997},{"$f":"SUM(G86:G146)","v":3772458.8},null,null,{"$f":"SUM(J86:J146)","v":118183.07186363635},{"$f":"SUM(K86:K146)","v":118182.66999999997},{"$f":"SUM(L86:L146)","v":0.40186363635146449}]
[]
[]
[]
[null,null,"Year",2016,"CGAAP - with changes to policies"]
[]
["Account","Description","Opening Regulatory Gross PP&E as at Jan 1, 2012","Less Fully Depreciated","Net for Depreciation","Additions","Total for Depreciation","Years","Depreciation Rate","2012 Depreciation Expense","2012 Depreciation Expense per Appendix 2-B Fixed Assets, Column K\n (l)","Variance 2"]
[null,null,"(a)","(b)","(c)","(d)","(e) = (c) + ½ x (d) 1","(f)","(g) = 1 / (f)","(h) = (e) / (f)",null,"(m) = (h) - (l)"]
[1611,"Computer Software (Formally known as Account 1925)",127219,85377.13,{"$f":"C155-D155","v":41841.869999999995},1365,{"$f":"E155+0.5*F155","v":42524.369999999995},5,{"$f":"IF(H155=0,\"\",1/H155)","v":0.2},8594.83,8594.83,{"$f":"IF(ISERROR(+J155-K155), \"\", +J155-K155)","v":0}]
[1612,"Land Rights (Formally known as Account 1906)",null,null,{"$f":"C156-D156","v":0},null,{"$f":"E156+0.5*F156","v":0},35,2.8571428571428571E-2,{"$f":"IF(H156=0,0,G156/H156)","v":0},null,{"$f":"IF(ISERROR(+J156-K156), \"\", +J156-K156)","v":0}]
[1612,"Land Rights (Formally known as Account 1906)",null,null,0,null,0,70,1.4285714285714285E-2,0,null,0]
[1805,"Land",50000,null,50000,null,50000,null,"",0,null,0]
[1808,"Buildings",null,null,0,null,0,10,0.1,0,null,0]
[1808,"Buildings",null,null,0,null,0,15,6.6666666666666666E-2,0,null,0]
[1808,"Buildings",null,null,0,null,0,20,0.05,0,null,0]
[1808,"Buildings",null,null,0,null,0,25,0.04,0,null,0]
[1808,"Buildings",null,null,0,null,0,30,3.3333333333333333E-2,0,null,0]
[1808,"Buildings",null,null,0,null,0,50,0.02,0,null,0]
[1810,"Leasehold Improvements",null,null,0,null,0,null,"",0,null,0]
[1815,"Transformer Station Equipment >50 kV",null,null,0,null,0,null,"",0,null,0]
[1820,"Distribution Station Equipment <50 kV",360297.28,null,360297.28,50012.77,{"$f":"E167+0.5*F167","v":385303.66500000004},55,1.8181818181818181E-2,7005.5211818181824,7005.52,1.1818181819762685E-3]
[1825,"Storage Battery Equipment",null,null,0,null,0,null,"",0,null,0]
[1830,"Poles, Towers & Fixtures",749198.71,27051.14,722147.57,74099,759197.07,40,2.5000000000000001E-2,18979.926749999999,18979.91,1.6749999998864951E-2]
[1835,"Overhead Conductors & Devices",662283.01,null,662283.01,229394.71,776980.36499999999,60,1.6666666666666666E-2,12949.67275,12949.67,2.749999999650754E-3]
[1840,"Underground Conduit",null,null,0,null,0,25,0.04,0,null,0]
[1845,"Underground Conductors & Devices",1853266.32,null,1853266.32,28769.200000000001,1867650.9200000002,35,2.8571428571428571E-2,53361.45485714286,53361.45,4.8571428633295E-3]
[1850,"Line Transformers",1150235.83,null,1150235.83,39618.5,1170045.08,40,2.5000000000000001E-2,29251.127,29251.13,-3.0000000006111804E-3]
[1855,"Services (Overhead & Underground)",220787.96,null,220787.96,22175,231875.46,40,2.5000000000000001E-2,5796.8864999999996,5796.89,-3.5000000007130438E-3]
[1860,"Meters",null,null,0,null,0,25,0.04,0,null,0]
[1860,"Meters (Smart Meters)",345172.12,null,345172.12,8522.74,349433.49,15,6.6666666666666666E-2,23295.565999999999,23295.57,-4.0000000008149073E-3]
[1905,"Land",null,null,0,null,0,null,"",0,null,0]
[1908,"Buildings & Fixtures",null,null,0,null,0,5,0.2,0,null,0]
[1908,"Buildings & Fixtures",null,null,0,null,0,10,0.1,0,null,0]
[1908,"Buildings & Fixtures",null,null,0,null,0,15,6.6666666666666666E-2,0,null,0]
[1908,"Buildings & Fixtures",null,null,0,null,0,20,0.05,0,null,0]
[1908,"Buildings & Fixtures",null,null,0,null,0,25,0.04,0,null,0]
[1908,"Buildings & Fixtures",null,null,0,null,0,50,0.02,0,null,0]
[1910,"Leasehold Improvements",null,null,0,null,0,null,"",0,null,0]
[1915,"Office Furniture & Equipment (10 years)",51956.5,24121.5,27835,1563.15,28616.575000000001,10,0.1,2861.6575000000003,2861.63,2.7500000000145519E-2]
[1915,"Office Furniture & Equipment (5 years)",null,null,0,null,0,null,"",0,null,0]
[1920,"Computer Equipment - Hardware",28438.34,21792.83,6645.5099999999984,2159.94,7725.4799999999987,5,0.2,1545.0959999999998,1545.11,-1.4000000000123691E-2]
[1920,"Computer Equip.-Hardware(Post Mar. 22/04)",null,null,0,null,0,null,"",0,null,0]
[1920,"Computer Equip.-Hardware(Post Mar. 19/07)",null,null,0,null,0,null,"",0,null,0]
[1930,"Transportation Equipment",null,null,0,null,0,5,0.2,0,null,0]
[1930,"Transportation Equipment",null,null,0,null,0,8,0.125,0,null,0]
[1935,"Stores Equipment",null,null,0,null,0,null,"",0,null,0]
[1940,"Tools, Shop & Garage Equipment",4320.2,4320,0,null,0,10,0.1,0,null,0]
[1945,"Measurement & Testing Equipment",8486,4281,4205,7415.08,7912.54,10,0.1,791.25400000000002,791.25,4.0000000000190994E-3]
[1950,"Power Operated Equipment",null,null,0,null,0,null,"",0,null,0]
[1955,"Communications Equipment",null,null,0,null,0,null,"",0,null,0]
[1955,"Communication Equipment (Smart Meters)",null,null,0,null,0,null,"",0,null,0]
[1960,"Miscellaneous Equipment ",null,null,0,null,0,null,"",0,null,0]
[1970,"Load Management Controls Customer Premises",null,null,{"$f":"C199-D199","v":0},null,{"$f":"E199+0.5*F199","v":0},null,{"$f":"IF(H199=0,\"\",1/H199)","v":""},{"$f":"IF(H199=0,0,G199/H199)","v":0},null,0]
[1975,"Load Management Controls Utility Premises",null,null,{"$f":"C200-D200","v":0},null,{"$f":"E200+0.5*F200","v":0},null,{"$f":"IF(H200=0,\"\",1/H200)","v":""},{"$f":"IF(H200=0,0,G200/H200)","v":0},null,0]
[1980,"System Supervisor Equipment",null,null,0,null,0,15,6.6666666666666666E-2,0,null,0]
[1985,"Miscellaneous Fixed Assets",null,null,0,null,0,null,"",0,null,0]
[1990,"Other Tangible Property",null,null,{"$f":"C203-D203","v":0},null,{"$f":"E203+0.5*F203","v":0},null,{"$f":"IF(H203=0,\"\",1/H203)","v":""},{"$f":"IF(H203=0,0,G203/H203)","v":0},null,0]
[1995,"Contributions & Grants",-1609309.14,null,-1609309.14,-6450.5,-1612534.39,40,2.5000000000000001E-2,{"$f":"IF(H204=0,0,G204/H204)","v":-40313.359749999996},-40313.360000000001,2.5000000459840521E-4]
[1609,"Other Tangible Property",null,null,0,null,0,null,"",0,null,0]
["etc.",null,null,null,0,null,0,null,"",0,null,0]
["etc.",null,null,null,0,null,0,null,"",0,null,0]
["etc.",null,null,null,0,null,0,null,"",0,null,0]
["etc.",null,null,null,0,null,0,null,"",0,null,0]
["etc.",null,null,null,0,null,0,null,"",0,null,0]
["etc.",null,null,null,0,null,0,null,"",0,null,0]
["etc.",null,null,null,0,null,0,null,"",0,null,0]
["etc.",null,null,null,0,null,0,null,"",0,null,0]
["etc.",null,null,null,0,null,0,null,"",0,null,0]
["etc.",null,null,null,0,null,0,null,"",0,null,0]
[null,null,null,null,0,null,0,null,"",0,0,{"$f":"IF(ISERROR(+J216-K216), \"\", +J216-K216)","v":0}]
[null,"Total",{"$f":"SUM(C155:C216)","v":4002352.1300000008},{"$f":"SUM(D155:D216)","v":166943.60000000003},{"$f":"SUM(E155:E216)","v":3835408.33},{"$f":"SUM(F155:F216)","v":458644.59},{"$f":"SUM(G155:G216)","v":4064730.6250000019},null,null,{"$f":"SUM(J155:J216)","v":124119.632788961},{"$f":"SUM(K155:K216)","v":124119.60000000002},{"$f":"SUM(L155:L216)","v":3.2788961046321674E-2}]
[]
[]
[]
[null,null,"Year",2017,"CGAAP - with changes to policies"]
[]
["Account","Description","Opening Regulatory Gross PP&E as at Jan 1, 2013","Less Fully Depreciated","Net for Depreciation","Additions","Total for Depreciation","Years","Depreciation Rate","2013 Depreciation Expense","2013 Depreciation Expense per Appendix 2-B Fixed Assets, Column K\n (l)","Variance 2"]
[null,null,"(a)","(b)","(c)","(d)","(e) = (c) + ½ x (d) 1","(f)","(g) = 1 / (f)","(h) = (e) / (f)",null,"(m) = (h) - (l)"]
[1611,"Computer Software (Formally known as Account 1925)",128584,84927.17,{"$f":"C225-D225","v":43656.83},4500,{"$f":"E225+0.5*F225","v":45906.83},5,{"$f":"IF(H225=0,\"\",1/H225)","v":0.2},{"$f":"IF(H225=0,0,G225/H225)","v":9181.366},9181.3700000000008,{"$f":"IF(ISERROR(+J225-K225),\"\",+J225-K225)","v":-4.0000000008149073E-3}]
[1612,"Land Rights (Formally known as Account 1906)",null,null,{"$f":"C226-D226","v":0},null,{"$f":"E226+0.5*F226","v":0},35,{"$f":"IF(H226=0,\"\",1/H226)","v":2.8571428571428571E-2},{"$f":"IF(H226=0,0,G226/H226)","v":0},null,{"$f":"IF(ISERROR(+J226-K226),\"\",+J226-K226)","v":0}]
[1612,"Land Rights (Formally known as Account 1906)",null,null,0,null,0,70,1.4285714285714285E-2,{"$f":"IF(H227=0,0,G227/H227)","v":0},null,0]
[1805,"Land",50000,null,50000,null,50000,null,"",0,null,0]
[1808,"Buildings",null,null,0,null,0,10,0.1,0,null,0]
[1808,"Buildings",null,null,0,null,0,15,6.6666666666666666E-2,0,null,0]
[1808,"Buildings",null,null,0,null,0,20,0.05,0,null,0]
[1808,"Buildings",null,null,0,null,0,25,0.04,0,null,0]
[1808,"Buildings",null,null,0,null,0,30,3.3333333333333333E-2,0,null,0]
[1808,"Buildings",null,null,0,null,0,50,0.02,0,null,0]
[1810,"Leasehold Improvements",null,null,0,null,0,null,"",0,null,0]
[1815,"Transformer Station Equipment >50 kV",null,null,0,null,0,null,"",0,null,0]
[1820,"Distribution Station Equipment <50 kV",410310.05000000005,null,410310.05000000005,1517396,{"$f":"E237+0.5*F237","v":1169008.05},55,1.8181818181818181E-2,21254.691818181818,21254.69,1.8181818195444066E-3]
[1825,"Storage Battery Equipment",null,null,0,0,0,null,"",0,null,0]
[1830,"Poles, Towers & Fixtures",823297.71,null,823297.71,0,823297.71,40,2.5000000000000001E-2,20582.442749999998,20582.439999999999,2.749999999650754E-3]
[1835,"Overhead Conductors & Devices",891677.72,null,891677.72,85900,934627.72,60,1.6666666666666666E-2,15577.128666666666,15577.13,-1.3333333336049691E-3]
[1840,"Underground Conduit",null,null,0,0,0,25,0.04,0,null,0]
[1845,"Underground Conductors & Devices",1882035.52,null,1882035.52,160025,1962048.02,35,2.8571428571428571E-2,56058.514857142858,56058.51,4.8571428560535423E-3]
[1850,"Line Transformers",1189854.33,null,1189854.33,40675,1210191.83,40,2.5000000000000001E-2,30254.795750000001,30254.799999999999,-4.2499999981373549E-3]
[1855,"Services (Overhead & Underground)",242962.96,null,242962.96,20000,252962.96,40,2.5000000000000001E-2,6324.0739999999996,6324.07,3.9999999999054126E-3]
[1860,"Meters",null,null,0,null,0,25,0.04,0,null,0]
[1860,"Meters (Smart Meters)",353694.86,null,353694.86,8000,357694.86,15,6.6666666666666666E-2,23846.324000000001,23846.32,4.0000000008149073E-3]
[1905,"Land",null,null,0,null,0,null,"",0,null,0]
[1908,"Buildings & Fixtures",null,null,0,null,0,5,0.2,0,null,0]
[1908,"Buildings & Fixtures",null,null,0,null,0,10,0.1,0,null,0]
[1908,"Buildings & Fixtures",null,null,0,null,0,15,6.6666666666666666E-2,0,null,0]
[1908,"Buildings & Fixtures",null,null,0,null,0,20,0.05,0,null,0]
[1908,"Buildings & Fixtures",null,null,0,null,0,25,0.04,0,null,0]
[1908,"Buildings & Fixtures",null,null,0,null,0,50,0.02,0,null,0]
[1910,"Leasehold Improvements",null,null,0,null,0,null,"",0,null,0]
[1915,"Office Furniture & Equipment (10 years)",53519.65,28963.57,24556.080000000002,1000,25056.080000000002,10,0.1,2505.6080000000002,2505.61,-1.9999999999527063E-3]
[1915,"Office Furniture & Equipment (5 years)",null,null,0,0,0,null,"",0,null,0]
[1920,"Computer Equipment - Hardware",30598.28,24538.400000000001,6059.8799999999974,1500,6809.8799999999974,5,0.2,1361.9759999999994,1361.98,-4.0000000005875336E-3]
[1920,"Computer Equip.-Hardware(Post Mar. 22/04)",null,null,0,null,0,null,"",0,null,0]
[1920,"Computer Equip.-Hardware(Post Mar. 19/07)",null,null,0,null,0,null,"",0,null,0]
[1930,"Transportation Equipment",null,null,0,null,0,5,0.2,0,null,0]
[1930,"Transportation Equipment",null,null,0,null,0,8,0.125,0,null,0]
[1935,"Stores Equipment",null,null,0,null,0,null,"",0,null,0]
[1940,"Tools, Shop & Garage Equipment",4320,null,4320,null,4320,10,0.1,null,null,0]
[1945,"Measurement & Testing Equipment",15901.08,null,15901.08,null,15901.08,10,0.1,1590.1079999999999,1590.11,-1.9999999999527063E-3]
[1950,"Power Operated Equipment",null,null,0,null,0,null,"",0,null,0]
[1955,"Communications Equipment",null,null,0,null,0,null,"",0,null,0]
[1955,"Communication Equipment (Smart Meters)",null,null,0,null,0,null,"",0,null,0]
[1960,"Miscellaneous Equipment ",null,null,0,null,0,null,"",0,null,0]
[1970,"Load Management Controls Customer Premises",null,null,{"$f":"C269-D269","v":0},null,{"$f":"E269+0.5*F269","v":0},null,{"$f":"IF(H269=0,\"\",1/H269)","v":""},{"$f":"IF(H269=0,0,G269/H269)","v":0},null,{"$f":"IF(ISERROR(+J269-K269),\"\",+J269-K269)","v":0}]
[1975,"Load Management Controls Utility Premises",null,null,0,null,0,null,"",0,null,0]
[1980,"System Supervisor Equipment",null,null,0,null,0,15,6.6666666666666666E-2,0,null,0]
[1985,"Miscellaneous Fixed Assets",null,null,0,null,0,null,"",0,null,0]
[1990,"Miscellaneous Fixed Assets",null,null,{"$f":"C273-D273","v":0},null,{"$f":"E273+0.5*F273","v":0},null,{"$f":"IF(H273=0,\"\",1/H273)","v":""},{"$f":"IF(H273=0,0,G273/H273)","v":0},null,{"$f":"IF(ISERROR(+J273-K273),\"\",+J273-K273)","v":0}]
[1995,"Contributions & Grants",-1615759.64,null,-1615759.64,-132000,-1681759.64,40,2.5000000000000001E-2,-42043.990999999995,-42043.99,-9.9999999656574801E-4]
[1609,"Other Tangible Property",null,null,0,null,0,null,"",0,null,0]
["etc.",null,null,null,0,null,0,null,"",0,null,{"$f":"IF(ISERROR(+J276-K276), \"\", +J276-K276)","v":0}]
["etc.",null,null,null,0,null,0,null,"",0,null,{"$f":"IF(ISERROR(+J277-K277), \"\", +J277-K277)","v":0}]
["etc.",null,null,null,0,null,0,null,"",0,null,0]
["etc.",null,null,null,0,null,0,null,"",0,null,0]
["etc.",null,null,null,0,null,0,null,"",0,null,0]
["etc.",null,null,null,0,null,0,null,"",0,null,0]
["etc.",null,null,null,0,null,0,null,"",0,null,0]
["etc.",null,null,null,0,null,0,null,"",0,null,0]
["etc.",null,null,null,0,null,0,null,"",0,null,0]
["etc.",null,null,null,0,null,0,null,"",0,null,0]
[null,null,null,null,0,null,0,null,null,0,null,0]
[null,"Total",{"$f":"SUM(C225:C286)","v":4460996.5200000014},{"$f":"SUM(D225:D286)","v":138429.13999999998},4322567.3800000008,1706996,5176065.3800000008,null,null,{"$f":"SUM(J225:J286)","v":146493.03884199134},146493.04,-1.1580086536469025E-3]
[]
[]
[null,null,"Year",2018,"CGAAP - with changes to policies"]
[]
["Account","Description","Opening Regulatory Gross PP&E as at Jan 1, 2013","Less Fully Depreciated","Net for Depreciation","Additions","Total for Depreciation","Years","Depreciation Rate","2013 Depreciation Expense","2013 Depreciation Expense per Appendix 2-B Fixed Assets, Column K\n (l)","Variance 2"]
[null,null,"(a)","(b)","(c)","(d)","(e) = (c) + ½ x (d) 1","(f)","(g) = 1 / (f)","(h) = (e) / (f)",null,"(m) = (h) - (l)"]
[1611,"Computer Software (Formally known as Account 1925)",133084,84927.17,{"$f":"C294-D294","v":48156.83},3000,{"$f":"E294+0.5*F294","v":49656.83},5,{"$f":"IF(H294=0,\"\",1/H294)","v":0.2},{"$f":"IF(H294=0,0,G294/H294)","v":9931.366},9931.3700000000008,{"$f":"IF(ISERROR(+J294-K294),\"\",+J294-K294)","v":-4.0000000008149073E-3}]
[1612,"Land Rights (Formally known as Account 1906)",null,null,{"$f":"C295-D295","v":0},null,{"$f":"E295+0.5*F295","v":0},35,{"$f":"IF(H295=0,\"\",1/H295)","v":2.8571428571428571E-2},{"$f":"IF(H295=0,0,G295/H295)","v":0},null,{"$f":"IF(ISERROR(+J295-K295),\"\",+J295-K295)","v":0}]
[1612,"Land Rights (Formally known as Account 1906)",null,null,0,null,0,70,1.4285714285714285E-2,{"$f":"IF(H296=0,0,G296/H296)","v":0},null,0]
[1805,"Land",50000,null,50000,null,50000,null,"",0,null,0]
[1808,"Buildings",null,null,0,null,0,10,0.1,0,null,0]
[1808,"Buildings",null,null,0,null,0,15,6.6666666666666666E-2,0,null,0]
[1808,"Buildings",null,null,0,null,0,20,0.05,0,null,0]
[1808,"Buildings",null,null,0,null,0,25,0.04,0,null,0]
[1808,"Buildings",null,null,0,null,0,30,3.3333333333333333E-2,0,null,0]
[1808,"Buildings",null,null,0,null,0,50,0.02,0,null,0]
[1810,"Leasehold Improvements",null,null,0,null,0,null,"",0,null,0]
[1815,"Transformer Station Equipment >50 kV",null,null,0,null,0,null,"",0,null,0]
[1820,"Distribution Station Equipment <50 kV",{"$f":"C237+F237","v":1927706.05},null,1927706.05,null,1927706.05,55,1.8181818181818181E-2,35049.200909090912,35049.199999999997,9.0909091522917151E-4]
[1825,"Storage Battery Equipment",null,null,0,null,0,null,"",0,null,0]
[1830,"Poles, Towers & Fixtures",{"$f":"C239+F239","v":823297.71},null,823297.71,48000,847297.71,40,2.5000000000000001E-2,21182.442749999998,21182.44,2.749999999650754E-3]
[1835,"Overhead Conductors & Devices",{"$f":"C240+F240","v":977577.72},null,977577.72,null,977577.72,60,1.6666666666666666E-2,16292.962,16292.96,2.0000000004074536E-3]
[1840,"Underground Conduit",null,null,0,null,0,25,0.04,0,null,0]
[1845,"Underground Conductors & Devices",{"$f":"C242+F242","v":2042060.52},null,2042060.52,null,2042060.52,35,2.8571428571428571E-2,58344.586285714286,58344.59,-3.7142857108847238E-3]
[1850,"Line Transformers",{"$f":"C243+F243","v":1230529.33},null,1230529.33,74280,1267669.33,40,2.5000000000000001E-2,31691.733250000001,31691.73,3.2500000015716068E-3]
[1855,"Services (Overhead & Underground)",262962.96000000002,null,262962.96000000002,20000,272962.96000000002,40,2.5000000000000001E-2,6824.0740000000005,6824.07,4.0000000008149073E-3]
[1860,"Meters",null,null,0,null,0,25,0.04,0,null,0]
[1860,"Meters (Smart Meters)",361694.86,null,361694.86,8000,365694.86,15,6.6666666666666666E-2,24379.657333333333,24379.66,-2.6666666672099382E-3]
[1905,"Land",null,null,0,null,0,null,"",0,null,0]
[1908,"Buildings & Fixtures",null,null,0,null,0,5,0.2,0,null,0]
[1908,"Buildings & Fixtures",null,null,0,null,0,10,0.1,0,null,0]
[1908,"Buildings & Fixtures",null,null,0,null,0,15,6.6666666666666666E-2,0,null,0]
[1908,"Buildings & Fixtures",null,null,0,null,0,20,0.05,0,null,0]
[1908,"Buildings & Fixtures",null,null,0,null,0,25,0.04,0,null,0]
[1908,"Buildings & Fixtures",null,null,0,null,0,50,0.02,0,null,0]
[1910,"Leasehold Improvements",null,null,0,null,0,null,"",0,null,0]
[1915,"Office Furniture & Equipment (10 years)",54519.65,28963.57,25556.080000000002,1200,26156.080000000002,10,0.1,2615.6080000000002,2615.5700000000002,3.8000000000010914E-2]
[1915,"Office Furniture & Equipment (5 years)",null,null,0,null,0,null,"",0,null,0]
[1920,"Computer Equipment - Hardware",32098.28,24538.400000000001,7559.8799999999974,1500,8309.8799999999974,5,0.2,1661.9759999999994,1661.98,-4.0000000005875336E-3]
[1920,"Computer Equip.-Hardware(Post Mar. 22/04)",null,null,0,null,0,null,"",0,null,0]
[1920,"Computer Equip.-Hardware(Post Mar. 19/07)",null,null,0,null,0,null,"",0,null,0]
[1930,"Transportation Equipment",null,null,0,null,0,5,0.2,0,null,0]
[1930,"Transportation Equipment",null,null,0,null,0,8,0.125,0,null,0]
[1935,"Stores Equipment",4320,4320,0,null,0,null,"",0,null,0]
[1940,"Tools, Shop & Garage Equipment",null,null,0,null,0,10,0.1,0,null,0]
[1945,"Measurement & Testing Equipment",15901.08,null,15901.08,null,15901.08,10,0.1,1590.1079999999999,1590.11,-1.9999999999527063E-3]
[1950,"Power Operated Equipment",null,null,0,null,0,null,"",0,null,0]
[1955,"Communications Equipment",null,null,0,null,0,null,"",0,null,0]
[1955,"Communication Equipment (Smart Meters)",null,null,0,null,0,null,"",0,null,0]
[1960,"Miscellaneous Equipment ",null,null,0,null,0,null,"",0,null,0]
[1970,"Load Management Controls Customer Premises",null,null,{"$f":"C338-D338","v":0},null,{"$f":"E338+0.5*F338","v":0},null,{"$f":"IF(H338=0,\"\",1/H338)","v":""},{"$f":"IF(H338=0,0,G338/H338)","v":0},null,{"$f":"IF(ISERROR(+J338-K338),\"\",+J338-K338)","v":0}]
[1975,"Load Management Controls Utility Premises",null,null,{"$f":"C339-D339","v":0},null,{"$f":"E339+0.5*F339","v":0},null,{"$f":"IF(H339=0,\"\",1/H339)","v":""},{"$f":"IF(H339=0,0,G339/H339)","v":0},null,{"$f":"IF(ISERROR(+J339-K339),\"\",+J339-K339)","v":0}]
[1980,"System Supervisor Equipment",null,null,0,null,0,15,6.6666666666666666E-2,0,null,0]
[1985,"Miscellaneous Fixed Assets",null,null,0,null,0,null,"",0,null,0]
[1990,"Miscellaneous Fixed Assets",null,null,{"$f":"C342-D342","v":0},null,{"$f":"E342+0.5*F342","v":0},null,{"$f":"IF(H342=0,\"\",1/H342)","v":""},{"$f":"IF(H342=0,0,G342/H342)","v":0},null,{"$f":"IF(ISERROR(+J342-K342),\"\",+J342-K342)","v":0}]
[1995,"Contributions & Grants",-1747759.64,null,{"$f":"C343-D343","v":-1747759.64},-5775,{"$f":"E343+0.5*F343","v":-1750647.14},40,{"$f":"IF(H343=0,\"\",1/H343)","v":2.5000000000000001E-2},{"$f":"IF(H343=0,0,G343/H343)","v":-43766.178499999995},-43766.12,{"$f":"IF(ISERROR(+J343-K343),\"\",+J343-K343)","v":-5.8499999991909135E-2}]
[1609,"Other Tangible Property",null,null,0,null,0,null,"",0,null,0]
["etc.",null,null,null,0,null,0,null,"",0,null,{"$f":"IF(ISERROR(+J345-K345), \"\", +J345-K345)","v":0}]
["etc.",null,null,null,0,null,0,null,"",0,null,{"$f":"IF(ISERROR(+J346-K346), \"\", +J346-K346)","v":0}]
["etc.",null,null,null,0,null,0,null,"",0,null,0]
["etc.",null,null,null,0,null,0,null,"",0,null,0]
["etc.",null,null,null,0,null,0,null,"",0,null,0]
["etc.",null,null,null,0,null,0,null,"",0,null,0]
["etc.",null,null,null,0,null,0,null,"",0,null,0]
["etc.",null,null,null,0,null,0,null,"",0,null,0]
["etc.",null,null,null,0,null,0,null,"",0,null,0]
["etc.",null,null,null,0,null,0,null,"",0,null,0]
[null,null,null,null,0,null,0,null,null,0,null,0]
[null,"Total",{"$f":"SUM(C294:C355)","v":6167992.5200000014},{"$f":"SUM(D294:D355)","v":142749.13999999998},6025243.3800000008,150205,6100345.8800000008,null,null,{"$f":"SUM(J294:J355)","v":165797.53602813854},{"$f":"SUM(K294:K355)","v":165797.56000000003},-2.3971861453674137E-2]

{"sheet":"App.2-D_Overhead","index":19,"n_rows":49,"n_cols":8,"rows_kept":49,"cut":false,"hidden":false,"merged":[[63,0,64,0],[52,0,53,0],[55,0,56,0],[58,0,61,0],[8,0,8,7],[9,0,9,7],[11,0,11,5]]}
[null,null,null,null,null,"File Number:",{"$f":"EBNUMBER","v":0}]
["NOT APPLICABLE",null,null,null,null,"Exhibit:"]
[null,null,null,null,null,"Tab:"]
[null,null,null,null,null,"Schedule:"]
[null,null,null,null,null,"Page:"]
[]
[null,null,null,null,null,"Date:"]
[]
["Appendix 2-D"]
["Overhead Expense"]
[]
["Applicants are to provide a breakdown of OM&A before capitalization in the below table.  OM&A before capitalization may be broken down by cost center, program, drivers or another format best suited to focus on capitalized vs. uncapitalized OM&A."]
[]
[" OM&A Before Capitalization"]
[null,{"$f":"F15-4","v":2014},{"$f":"F15-3","v":2015},{"$f":"F15-2","v":2016},{"$f":"F15-1","v":2017},{"$f":"TestYear","v":2018}]
[null,"Historical Year","Historical Year","Historical Year","Bridge Year","Test Year"]
[]
[]
[]
[]
[]
[]
[]
[]
[]
[]
["Total OM&A Before Capitalization (B)",{"$f":"SUM(B17:B26)","v":0},{"$f":"SUM(C17:C26)","v":0},0,0,0]
[]
["Applicants are to provide a breakdown of capitalized OM&A in the below table.  Capitalized OM&A may be broken down using the categories listed in the table below if possible.  Otherwise, applicants are to provide its own break down of capitalized OM&A."]
[]
["Capitalized OM&A",null,null,null,null,null,"Directly","Explanation for Change in Overhead Capitalized"]
[null,{"$f":"F32-4","v":2014},{"$f":"F32-3","v":2015},{"$f":"F32-2","v":2016},{"$f":"F32-1","v":2017},{"$f":"TestYear","v":2018},"Attributable?"]
[null,"Historical Year","Historical Year","Historical Year","Bridge Year","Test Year","(Yes/No)"]
["employee benefits"]
["costs of site preparation"]
["initial delivery and handling costs"]
["costs of testing whether the asset is functioning properly"]
["professional fees"]
[]
["costs of opening a new facility"]
["costs of introducing a new product or service (including costs of advertising and promotional activities)"]
["costs of conducting business in a new location or with a new class of customer (including costs of staff training)"]
["administration and other general overhead costs"]
[]
["Insert description of additional item(s) and new rows if needed"]
[]
["Total Capitalized OM&A (A)",{"$f":"SUM(B34:B46)","v":0},{"$f":"SUM(C34:C46)","v":0},{"$f":"SUM(D34:D46)","v":0},{"$f":"SUM(E34:E46)","v":0},{"$f":"SUM(F34:F46)","v":0}]
[]
["% of Capitalized OM&A (=A/B)",{"$f":"IF(ISERROR(B47/B27),\"0%\",B47/B27)","v":"0%"},{"$f":"IF(ISERROR(C47/C27),\"0%\",C47/C27)","v":"0%"},"0%","0%","0%"]

{"sheet":"App.2-EA_Account 1575 (2015)","index":20,"n_rows":47,"n_cols":9,"rows_kept":47,"cut":false,"hidden":false,"merged":[[20,1,20,5],[8,0,8,8],[9,0,9,8],[10,0,10,8],[12,0,12,8],[14,0,14,8],[47,0,47,9],[52,0,53,8],[25,1,26,5],[31,1,31,5],[37,6,38,7],[37,8,38,8]]}
[null,null,null,null,null,null,null,"File Number:",{"$f":"EBNUMBER","v":0}]
["NOT APPLICABLE",null,null,null,null,null,null,"Exhibit:"]
[null,null,null,null,null,null,null,"Tab:"]
[null,null,null,null,null,null,null,"Schedule:"]
[null,null,null,null,null,null,null,"Page:"]
[]
[null,null,null,null,null,null,null,"Date:"]
[]
["Appendix 2-EA"]
["Account 1575 - IFRS-CGAAP Transitional PP&E Amounts"]
["2015 Adopters of IFRS for Financial Reporting Purposes"]
[]
["For applicants that adopted IFRS on January 1, 2015 for financial reporting purposes"]
[]
[]
[]
[null,{"$f":"RebaseYear &\" Rebasing Year\"","v":"2014 Rebasing Year"},{"$f":"TestYear-3","v":2015},{"$f":"TestYear-2","v":2016},{"$f":"CONCATENATE(TestYear-1,\" Bridge Year\")","v":"2017 Bridge Year"},{"$f":"CONCATENATE(TestYear,\" Rebasing Year\")","v":"2018 Rebasing Year"}]
["Reporting Basis","CGAAP","CGAAP","CGAAP","MIFRS","MIFRS"]
[null,"Forecast","Actual","Actual","Forecast","Forecast"]
[null,null,null,"$","$"]
["PP&E Values under CGAAP"]
["            Opening net PP&E - Note 1",null,null,{"$f":"+C25","v":0},{"$f":"+D25","v":0}]
["            Net Additions - Note 4"]
["            Net Depreciation (amounts should be negative) - Note 4"]
["            Closing net PP&E (1)",null,{"$f":"C22+C23+C24","v":0},{"$f":"SUM(D22:D24)","v":0},{"$f":"SUM(E22:E24)","v":0}]
[]
["PP&E Values under MIFRS (Starts from 2014, the transition year)"]
["            Opening net PP&E  - Note 1",null,null,{"$f":"+C31","v":0},{"$f":"+D31","v":0}]
["            Net Additions - Note 4"]
["            Net Depreciation (amounts should be negative) - Note 4"]
["            Closing net PP&E (2)",null,{"$f":"SUM(C28:C30)","v":0},{"$f":"SUM(D28:D30)","v":0},{"$f":"SUM(E28:E30)","v":0}]
[]
["Difference in Closing net PP&E, former CGAAP vs. revised CGAAP ",null,{"$f":"C25-C31","v":0},{"$f":"D25-D31","v":0},{"$f":"E25-E31","v":0}]
[]
[]
["Effect on Deferral and Variance Account Rate Riders"]
["Closing balance in Account 1576",null,null,null,null,{"$f":"IF(ISERROR(E33), 0, E33)","v":0},null,"WACC"]
["Return on Rate Base Associated with Account 1576 balance at WACC  - Note 2",null,null,null,null,{"$f":"E33*I37*I38","v":0},"# of years of rate rider disposition period"]
["     Amount included in Deferral and Variance Account Rate Rider Calculation",null,null,null,null,{"$f":"F37+F38","v":0}]
[]
["Notes:"]
["1  For an applicant that adopted IFRS on January 1, 2015, the PP&E values as of January 1, 2014 under both CGAAP and MIFRS should be the same. "]
["2 Return on rate base associated with deferred balance is calculated as:"]
["     the deferral account closing balance as of 2016 x WACC X # of years of rate rider disposition period"]
["     * Please note that the calculation should be adjusted once WACC is updated and finalized in the rate application."]
["3  The  PP&E deferral account is cleared by including the total balance in the deferral and variance account rate rider calculation."]
["4  Net additions are additions net of disposals; Net depreciation is additions to depreciation net of disposals."]

{"sheet":"App.2-EB_Account 1576 (2012)","index":21,"n_rows":48,"n_cols":11,"rows_kept":48,"cut":false,"hidden":false,"merged":[[8,0,8,10],[9,0,9,10],[10,0,10,10],[14,0,14,10],[12,0,13,10],[45,0,45,9],[41,0,41,11],[31,1,31,7],[25,1,26,7],[20,1,20,7],[37,8,38,9],[37,10,38,10]]}
[null,null,null,null,null,null,null,null,null,"File Number:",{"$f":"EBNUMBER","v":0}]
["NOT APPLICABLE",null,null,null,null,null,null,null,null,"Exhibit:"]
[null,null,null,null,null,null,null,null,null,"Tab:"]
[null,null,null,null,null,null,null,null,null,"Schedule:"]
[null,null,null,null,null,null,null,null,null,"Page:"]
[]
[null,null,null,null,null,null,null,null,null,"Date:"]
[]
["Appendix 2-EB"]
["Account 1576 - Accounting Changes under CGAAP"]
["2012 Changes in Accounting Policies under CGAAP"]
[]
["For applicants with a balance in Account 1576 and made capitalization and depreciation expense accounting policy changes under CGAAP effective January 1, 2012 "]
[]
[]
[]
[null,"2011 Rebasing Year",2012,2013,2014,2015,2016,"2017 Rebasing Year"]
["Reporting Basis","CGAAP","CGAAP","CGAAP","CGAAP","MIFRS - Note 5","MIFRS","MIFRS"]
[null,"Forecast","Actual","Actual","Actual","Actual","Forecast","Forecast"]
[null,null,"$","$","$",null,"$"]
["PP&E Values under former CGAAP"]
["            Opening net PP&E - Note 1",null,null,{"$f":"+C25","v":0},{"$f":"+D25","v":0},{"$f":"+D25","v":0},{"$f":"+E25","v":0}]
["            Net Additions - Note 4"]
["            Net Depreciation (amounts should be negative) - Note 4"]
["            Closing net PP&E (1)",null,{"$f":"C22+C23+C24","v":0},{"$f":"D22+D23+D24","v":0},{"$f":"E22+E23+E24","v":0},{"$f":"F22+F23+F24","v":0},{"$f":"G22+G23+G24","v":0}]
[]
["PP&E Values under revised CGAAP (Starts from 2012)"]
["            Opening net PP&E  - Note 1",null,null,{"$f":"+C31","v":0},{"$f":"+D31","v":0},{"$f":"+D31","v":0},{"$f":"+E31","v":0}]
["            Net Additions - Note 4"]
["            Net Depreciation (amounts should be negative) - Note 4"]
["            Closing net PP&E (2)",null,{"$f":"SUM(C28:C30)","v":0},{"$f":"SUM(D28:D30)","v":0},{"$f":"SUM(E28:E30)","v":0},{"$f":"SUM(F28:F30)","v":0},{"$f":"SUM(G28:G30)","v":0}]
[]
["Difference in Closing net PP&E, former CGAAP vs. revised CGAAP ",null,{"$f":"C25-C31","v":0},{"$f":"D25-D31","v":0},{"$f":"E25-E31","v":0},{"$f":"F25-F31","v":0},{"$f":"G25-G31","v":0}]
[]
[]
["Effect on Deferral and Variance Account Rate Riders"]
["Closing balance in Account 1576",null,null,null,null,null,null,{"$f":"IF(ISERROR(G33), 0, G33)","v":0},null,"WACC"]
["Return on Rate Base Associated with Account 1576 balance at WACC  - Note 2",null,null,null,null,null,null,{"$f":"G33*K37*K38","v":0},"# of years of rate rider disposition period"]
["     Amount included in Deferral and Variance Account Rate Rider Calculation",null,null,null,null,null,null,{"$f":"H37+H38","v":0}]
[]
["Notes:"]
["1  For an applicant that made the capitalization and depreciation expense accounting policy changes on January 1, 2012, the PP&E values as of January 1, 2012 under both former CGAAP and revised CGAAP should be the same. "]
["2 Return on rate base associated with Account 1576 balance is calculated as:"]
["     the variance account ending balance as of 2016 x WACC X # of years of rate rider disposition period"]
["     * Please note that the calculation should be adjusted once WACC is updated and finalized in the rate application."]
["3  Account 1576 is cleared by including the total balance in the deferral and variance account rate rider calculation."]
["4  Net additions are additions net of disposals; Net depreciation is additions to depreciation net of disposals."]
["5 Differences due to the adoption of MIFRS are to be shown separately in Account 1575 in Appendix 2-EA as Accounts 1575 and 1576 cannot be used interchangably."]

{"sheet":"App.2-EC_Account 1576 (2013)","index":22,"n_rows":48,"n_cols":10,"rows_kept":48,"cut":false,"hidden":false,"merged":[[37,9,38,9],[41,0,41,10],[8,0,8,9],[9,0,9,9],[10,0,10,9],[12,0,12,9],[14,0,14,9],[45,0,45,8],[20,1,20,6],[25,1,26,6],[31,1,31,6],[37,7,38,8]]}
[null,null,null,null,null,null,null,null,"File Number:",{"$f":"EBNUMBER","v":0}]
["NOT APPLICABLE",null,null,null,null,null,null,null,"Exhibit:"]
[null,null,null,null,null,null,null,null,"Tab:"]
[null,null,null,null,null,null,null,null,"Schedule:"]
[null,null,null,null,null,null,null,null,"Page:"]
[]
[null,null,null,null,null,null,null,null,"Date:"]
[]
["Appendix 2-EC"]
["Account 1576 - Accounting Changes under CGAAP"]
["2013 Changes in Accounting Policies under CGAAP"]
[]
["For applicants with a balance in Account 1576 and made capitalization and depreciation expense accounting policy changes under CGAAP effective January 1, 2013"]
[]
[]
[]
[null,"2012 Rebasing Year",2013,2014,2015,2016,"2017 Rebasing Year"]
["Reporting Basis","CGAAP","CGAAP","CGAAP","MIFRS - Note 5","MIFRS","MIFRS"]
[null,"Actual","Actual","Actual","Actual","Forecast","Forecast"]
[null,null,"$","$",null,"$"]
["PP&E Values under former CGAAP"]
["            Opening net PP&E - Note 1",null,null,{"$f":"+C25","v":0},{"$f":"+D25","v":0},{"$f":"+D25","v":0}]
["            Net Additions - Note 4"]
["            Net Depreciation (amounts should be negative) - Note 4"]
["            Closing net PP&E (1)",null,{"$f":"C22+C23+C24","v":0},{"$f":"D22+D23+D24","v":0},{"$f":"E22+E23+E24","v":0},{"$f":"F22+F23+F24","v":0}]
[]
["PP&E Values under revised CGAAP (Starts from 2012)"]
["            Opening net PP&E  - Note 1",null,null,{"$f":"+C31","v":0},{"$f":"+D31","v":0},{"$f":"+D31","v":0}]
["            Net Additions - Note 4"]
["            Net Depreciation (amounts should be negative) - Note 4"]
["            Closing net PP&E (2)",null,{"$f":"SUM(C28:C30)","v":0},{"$f":"SUM(D28:D30)","v":0},{"$f":"SUM(E28:E30)","v":0},{"$f":"SUM(F28:F30)","v":0}]
[]
["Difference in Closing net PP&E, former CGAAP vs. revised CGAAP ",null,{"$f":"C25-C31","v":0},{"$f":"D25-D31","v":0},{"$f":"E25-E31","v":0},{"$f":"F25-F31","v":0}]
[]
[]
["Effect on Deferral and Variance Account Rate Riders"]
["Closing balance in Account 1576",null,null,null,null,null,{"$f":"IF(ISERROR(F33), 0, F33)","v":0},null,"WACC"]
["Return on Rate Base Associated with Account 1576 balance at WACC  - Note 2",null,null,null,null,null,{"$f":"F33*J37*J38","v":0},"# of years of rate rider disposition period"]
["     Amount included in Deferral and Variance Account Rate Rider Calculation",null,null,null,null,null,{"$f":"G37+G38","v":0}]
[]
["Notes:"]
["1  For an applicant that made the capitalization and depreciation expense accounting policy changes on January 1, 2013, the PP&E values as of January 1, 2013 under both former CGAAP and revised CGAAP should be the same. "]
["2 Return on rate base associated with Account 1576 balance is calculated as:"]
["     the variance account ending balance as of 2016 x WACC X # of years of rate rider disposition period"]
["     * Please note that the calculation should be adjusted once WACC is updated and finalized in the rate application."]
["3  Account 1576 is cleared by including the total balance in the deferral and variance account rate rider calculation."]
["4  Net additions are additions net of disposals; Net depreciation is additions to depreciation net of disposals."]
["5 Differences due to the adoption of MIFRS are to be shown separately in Account 1575 in Appendix 2-EA as Accounts 1575 and 1576 cannot be used interchangably."]

{"sheet":"App.2-FA Proposed REG Invest.","index":23,"n_rows":101,"n_cols":11,"rows_kept":101,"cut":false,"hidden":false,"merged":[[8,0,8,10],[17,0,17,8],[16,0,16,9],[12,0,12,6],[13,0,13,5],[14,0,14,5],[11,0,11,6],[9,0,9,10]]}
[null,null,null,null,null,null,null,null,null,"File Number:",{"$f":"EBNUMBER","v":0}]
["NOT APPLICABLE",null,null,null,null,null,null,null,null,"Exhibit:"]
[null,null,null,null,null,null,null,null,null,"Tab:"]
[null,null,null,null,null,null,null,null,null,"Schedule:"]
[null,null,null,null,null,null,null,null,null,"Page:"]
[]
[null,null,null,null,null,null,null,null,null,"Date:"]
[]
["Appendix 2-FA"]
["Renewable Generation Connection Investment Summary (past investments or over the future rate setting period)"]
[]
["Enter the details of the Renewable Generation Connection projects as described in the appropriate section of the Filing Requirements."]
["All costs entered on this page will be transferred to the appropriate cells in the appendices that follow."]
["For Part A, Renewable Enabling Improvements (REI), these amounts will be transferred to Appendix 2 - FB"]
["For Part B, Expansions, these amounts will be transferred to Appendix 2 - FC"]
[]
["If there are more than five projects proposed to be in-service in a certain year, please amend the tables below and ensure that the formulae for the Total Amounts in any given rate year are updated."]
["Based on the current methodology and allocation, amounts allocated represent 6% for REI Connection Investments and 17% for Expansion Investments. (EB-2009-0349, 6-10-2010, p. 15, note 9)"]
[]
["There are two scenarios described below.  Separate sets of spreadsheets (2-FA, 2-FB, 2-FC) should be submited for each scenario as required."]
["Scenario 1:  Past Investments with No Recovery.  The distributor has made investments in the past (during the IRM Years), but has not received approval for these projects and therefore did not receive"]
["revenue from the IESO under Regulation 330/09 and did not receive ratepayer revenue for the direct benefit portion of the investment."]
["The WCA percentage, debt percentages, interest rates, kWh, tax rates, amortization period, CCA Class and percentage should correspond to the distributor's last Cost of Service approval. "]
["The Direct Benefit portion of the calculated Revenue Requirement for each year should be summed and can be applied for recovery from the distributor's ratepayers through a rate rider."]
["The Provincial Recovery portion of the calculated Revenue Requirement for each year should be summed and can be applied for recovery from the IESO through a separate order."]
[]
["Scenario 2:  Investments in the Test Year and Beyond.  Distributor plans to make investments in 2017 and/or beyond.  These investments should be added to 2-FA in the appropriate year."]
["The WCA percentage, debt percentages, interest rates, kWh, tax rates, amortization period, CCA Class and percentage should correspond to the distributor's current application. "]
[]
["Part A",null,null,null,null,null,"Test Year"]
["REI Investments (Direct Benefit at 6%)",null,{"$f":"D31-1","v":2014},{"$f":"E31-1","v":2015},{"$f":"F31-1","v":2016},{"$f":"G31-1","v":2017},{"$f":"TestYear","v":2018},{"$f":"G31+1","v":2019},{"$f":"H31+1","v":2020},{"$f":"I31+1","v":2021},{"$f":"J31+1","v":2022}]
["Project 1"]
["Name: REI Connection Project"]
["Capital Costs",null,0,0,0,0,0,0,0,0,0]
["OM&A (Start-Up)",null,0,0,0,0,0,0,0,0,0]
["OM&A (Ongoing)",null,0,0,0,0,0,0,0,0,0]
[]
["Project 2"]
["Name: REI Connection Project"]
["Capital Costs",null,0,0,0,0,0,0,0,0,0]
["OM&A (Start-Up)",null,0,0,0,0,0,0,0,0,0]
["OM&A (Ongoing)",null,0,0,0,0,0,0,0,0,0]
[]
["Project 3"]
["Name: REI Connection Project"]
["Capital Costs",null,0,0,0,0,0,0,0,0,0]
["OM&A (Start-Up)",null,0,0,0,0,0,0,0,0,0]
["OM&A (Ongoing)",null,0,0,0,0,0,0,0,0,0]
[]
["Project 4"]
["Name: REI Connection Project"]
["Capital Costs",null,0,0,0,0,0,0,0,0,0]
["OM&A (Start-Up)",null,0,0,0,0,0,0,0,0,0]
["OM&A (Ongoing)",null,0,0,0,0,0,0,0,0,0]
[]
["Project 5"]
["Name: REI Connection Project"]
["Capital Costs",null,0,0,0,0,0,0,0,0,0]
["OM&A (Start-Up)",null,0,0,0,0,0,0,0,0,0]
["OM&A (Ongoing)",null,0,0,0,0,0,0,0,0,0]
[]
["Total Capital Costs",null,{"$f":"SUM(C58,C52,C46,C40,C34)","v":0},0,0,0,{"$f":"SUM(G58,G52,G46,G40,G34)","v":0},{"$f":"SUM(H58,H52,H46,H40,H34)","v":0},0,0,0]
["Total OM&A (Start-Up)",null,0,0,0,0,{"$f":"SUM(G59,G53,G47,G41,G35)","v":0},0,0,0,0]
["Total OM&A (Ongoing)",null,0,0,0,0,{"$f":"SUM(G60,G54,G48,G42,G36)","v":0},0,0,0,0]
[]
[]
["Part B",null,null,null,null,null,"Test Year"]
["Expansion Investments (Direct Benefit at 17%)",null,{"$f":"D68-1","v":2014},{"$f":"E68-1","v":2015},{"$f":"F68-1","v":2016},{"$f":"G68-1","v":2017},{"$f":"TestYear","v":2018},{"$f":"G68+1","v":2019},{"$f":"H68+1","v":2020},2021,2022]
["Project 1"]
["Name: Expansion Connection Project"]
["Capital Costs",null,0,0,0,0,0,0,0,0,0]
["OM&A (Start-Up)",null,0,0,0,0,0,0,0,0,0]
["OM&A (Ongoing)",null,0,0,0,0,0,0,0,0,0]
[]
["Project 2"]
["Name: Expansion Connection Project"]
["Capital Costs",null,0,0,0,0,0,0,0,0,0]
["OM&A (Start-Up)",null,0,0,0,0,0,0,0,0,0]
["OM&A (Ongoing)",null,0,0,0,0,0,0,0,0,0]
[]
["Project 3"]
["Name: Expansion Connection Project"]
["Capital Costs",null,0,0,0,0,0,0,0,0,0]
["OM&A (Start-Up)",null,0,0,0,0,0,0,0,0,0]
["OM&A (Ongoing)",null,0,0,0,0,0,0,0,0,0]
[]
["Project 4"]
["Name: Expansion Connection Project"]
["Capital Costs",null,0,0,0,0,0,0,0,0,0]
["OM&A (Start-Up)",null,0,0,0,0,0,0,0,0,0]
["OM&A (Ongoing)",null,0,0,0,0,0,0,0,0,0]
[]
["Project 5"]
["Name: Expansion Connection Project"]
["Capital Costs",null,0,0,0,0,0,0,0,0,0]
["OM&A (Start-Up)",null,0,0,0,0,0,0,0,0,0]
["OM&A (Ongoing)",null,0,0,0,0,0,0,0,0,0]
[]
["Total Capital Costs",null,{"$f":"SUM(C95,C89,C83,C77,C71)","v":0},0,0,0,{"$f":"SUM(G95,G89,G83,G77,G71)","v":0},{"$f":"SUM(H95,H89,H83,H77,H71)","v":0},0,0,0]
["Total OM&A (Start-Up)",null,0,0,0,0,{"$f":"SUM(G96,G90,G84,G78,G72)","v":0},0,0,0,0]
["Total OM&A (Ongoing)",null,0,0,0,0,{"$f":"SUM(G97,G91,G85,G79,G73)","v":0},0,0,0,0]

{"sheet":"App.2-FB Calc of REG Improvemnt","index":24,"n_rows":95,"n_cols":29,"rows_kept":95,"cut":false,"hidden":false,"merged":[[51,24,51,25],[51,27,51,28],[48,0,48,22],[49,0,49,1],[51,15,51,16],[51,18,51,19],[51,21,51,22],[51,12,51,13],[51,9,51,10],[51,6,51,7],[51,3,51,4],[46,0,46,22],[16,14,16,16],[16,17,16,19],[16,20,16,22],[16,23,16,25],[16,11,16,13],[16,8,16,10],[16,5,16,7],[16,2,16,4],[16,26,16,28],[8,0,8,17],[9,0,9,17],[11,0,11,17],[12,0,12,17],[14,0,14,17]]}
[null,null,null,null,null,null,null,null,null,null,null,null,null,"File Number:",{"$f":"EBNUMBER","v":0}]
["NOT APPLICABLE",null,null,null,null,null,null,null,null,null,null,null,null,"Exhibit:"]
[null,null,null,null,null,null,null,null,null,null,null,null,null,"Tab:"]
[null,null,null,null,null,null,null,null,null,null,null,null,null,"Schedule:"]
[null,null,null,null,null,null,null,null,null,null,null,null,null,"Page:"]
[]
[null,null,null,null,null,null,null,null,null,null,null,null,null,"Date:"]
[]
["Appendix 2-FB"]
["Calculation of Renewable Generation Connection Direct Benefits/Provincial Amount: Renewable Enabling Improvement Investments"]
[]
["This table will calculate the distributor/provincial shares of the investments entered in Part A of Appendix 2-FA."]
["Enter values in green shaded cells: WCA percentage, debt percentages, interest rates, kWh, tax rates, amortization period, CCA Class and percentage."]
["For historical investments, enter these variables for your last cost of service test year.  For 2017 and beyond, enter variables as in the application."]
["Rate Riders are not calculated for the Test Year as these assets and costs are already in the distributor's rate base/revenue requirement."]
[]
[null,null,{"$f":"F17-1","v":2014},null,null,{"$f":"I17-1","v":2015},null,null,{"$f":"L17-1","v":2016},null,null,{"$f":"BridgeYear","v":2017},null,null,{"$f":"CONCATENATE(TestYear,\" Test Year\")","v":"2018 Test Year"},null,null,{"$f":"TestYear+1","v":2019},null,null,{"$f":"R17+1","v":2020},2016,null,{"$f":"U17+1","v":2021},null,null,{"$f":"X17+1","v":2022}]
[null,null,null,"Direct Benefit","Provincial",null,"Direct Benefit","Provincial",null,"Direct Benefit","Provincial",null,"Direct Benefit","Provincial",null,"Direct Benefit","Provincial",null,"Direct Benefit","Provincial",null,"Direct Benefit","Provincial",null,"Direct Benefit","Provincial",null,"Direct Benefit","Provincial"]
[null,null,"Total",0.06,0.94,"Total",0.06,0.94,"Total",0.06,0.94,"Total",0.06,0.94,"Total",0.06,0.94,"Total",0.06,0.94,"Total",0.06,0.94,"Total",0.06,0.94,"Total",0.06,0.94]
["Net Fixed Assets (average)",null,{"$f":"D82","v":0},{"$f":"C20*D19","v":0},{"$f":"C20*E19","v":0},{"$f":"E82","v":0},{"$f":"F20*G19","v":0},{"$f":"F20*H19","v":0},{"$f":"F82","v":0},{"$f":"I20*J19","v":0},{"$f":"I20*K19","v":0},{"$f":"G82","v":0},{"$f":"L20*M19","v":0},{"$f":"L20*N19","v":0},{"$f":"H82","v":0},{"$f":"O20*P19","v":0},{"$f":"O20*Q19","v":0},{"$f":"I82","v":0},{"$f":"R20*S19","v":0},{"$f":"R20*T19","v":0},{"$f":"J82","v":0},{"$f":"U20*V19","v":0},{"$f":"U20*W19","v":0},{"$f":"K82","v":0},{"$f":"X20*Y19","v":0},{"$f":"X20*Z19","v":0},{"$f":"L82","v":0},{"$f":"AA20*AB19","v":0},{"$f":"AA20*AC19","v":0}]
["Incremental OM&A (on-going, N/A for Provincial Recovery)",null,{"$f":"'App.2-FA Proposed REG Invest.'!C64","v":0},{"$f":"C21","v":0},null,{"$f":"'App.2-FA Proposed REG Invest.'!D64","v":0},{"$f":"F21","v":0},null,{"$f":"'App.2-FA Proposed REG Invest.'!E64","v":0},{"$f":"I21","v":0},null,{"$f":"'App.2-FA Proposed REG Invest.'!F64","v":0},{"$f":"L21","v":0},null,{"$f":"'App.2-FA Proposed REG Invest.'!G64","v":0},{"$f":"O21","v":0},null,{"$f":"'App.2-FA Proposed REG Invest.'!H64","v":0},{"$f":"R21","v":0},null,{"$f":"'App.2-FA Proposed REG Invest.'!I64","v":0},{"$f":"U21","v":0},null,{"$f":"'App.2-FA Proposed REG Invest.'!J64","v":0},{"$f":"X21","v":0},null,{"$f":"'App.2-FA Proposed REG Invest.'!K64","v":0},{"$f":"AA21","v":0}]
["Incremental OM&A (start-up, applicable for Provincial Recovery)",null,{"$f":"'App.2-FA Proposed REG Invest.'!C63","v":0},{"$f":"C22*D19","v":0},{"$f":"C22*E19","v":0},{"$f":"'App.2-FA Proposed REG Invest.'!D63","v":0},{"$f":"F22*G19","v":0},{"$f":"F22*H19","v":0},{"$f":"'App.2-FA Proposed REG Invest.'!E63","v":0},{"$f":"I22*J19","v":0},{"$f":"I22*K19","v":0},{"$f":"'App.2-FA Proposed REG Invest.'!F63","v":0},{"$f":"L22*M19","v":0},{"$f":"L22*N19","v":0},{"$f":"'App.2-FA Proposed REG Invest.'!G63","v":0},{"$f":"O22*P19","v":0},{"$f":"O22*Q19","v":0},{"$f":"'App.2-FA Proposed REG Invest.'!H63","v":0},{"$f":"R22*S19","v":0},{"$f":"R22*T19","v":0},{"$f":"'App.2-FA Proposed REG Invest.'!I63","v":0},{"$f":"U22*V19","v":0},{"$f":"U22*W19","v":0},{"$f":"'App.2-FA Proposed REG Invest.'!J63","v":0},{"$f":"X22*Y19","v":0},{"$f":"X22*Z19","v":0},{"$f":"'App.2-FA Proposed REG Invest.'!K63","v":0},{"$f":"AA22*AB19","v":0},{"$f":"AA22*AC19","v":0}]
["WCA",null,null,{"$f":"(D21+D22)*$B$23","v":0},{"$f":"E22*$B$23","v":0},null,{"$f":"(G21+G22)*$B$23","v":0},{"$f":"H22*$B$23","v":0},null,{"$f":"(J21+J22)*$B$23","v":0},{"$f":"K22*$B$23","v":0},null,{"$f":"(M21+M22)*$B$23","v":0},{"$f":"N22*$B$23","v":0},null,{"$f":"(P21+P22)*$B$23","v":0},{"$f":"Q22*$B$23","v":0},null,{"$f":"(S21+S22)*$B$23","v":0},{"$f":"T22*$B$23","v":0},null,{"$f":"(V21+V22)*$B$23","v":0},{"$f":"W22*$B$23","v":0},null,{"$f":"(Y21+Y22)*$B$23","v":0},{"$f":"Z22*$B$23","v":0},null,{"$f":"(AB21+AB22)*$B$23","v":0},{"$f":"AC22*$B$23","v":0}]
["Rate Base",null,null,{"$f":"SUM(D20+D23)","v":0},{"$f":"SUM(E20+E23)","v":0},null,{"$f":"SUM(G20+G23)","v":0},{"$f":"SUM(H20+H23)","v":0},null,{"$f":"SUM(J20+J23)","v":0},{"$f":"SUM(K20+K23)","v":0},null,{"$f":"SUM(M20+M23)","v":0},{"$f":"SUM(N20+N23)","v":0},null,{"$f":"SUM(P20+P23)","v":0},{"$f":"SUM(Q20+Q23)","v":0},null,{"$f":"SUM(S20+S23)","v":0},{"$f":"SUM(T20+T23)","v":0},null,{"$f":"SUM(V20+V23)","v":0},{"$f":"SUM(W20+W23)","v":0},null,{"$f":"SUM(Y20+Y23)","v":0},{"$f":"SUM(Z20+Z23)","v":0},null,{"$f":"SUM(AB20+AB23)","v":0},{"$f":"SUM(AC20+AC23)","v":0}]
[]
[]
["Deemed ST Debt",null,null,{"$f":"D24*$B$27","v":0},{"$f":"E24*$B$27","v":0},null,{"$f":"G24*$B$27","v":0},{"$f":"H24*$B$27","v":0},null,{"$f":"J24*$B$27","v":0},{"$f":"K24*$B$27","v":0},null,{"$f":"M24*$B$27","v":0},{"$f":"N24*$B$27","v":0},null,{"$f":"P24*$B$27","v":0},{"$f":"Q24*$B$27","v":0},null,{"$f":"S24*$B$27","v":0},{"$f":"T24*$B$27","v":0},null,{"$f":"V24*$B$27","v":0},{"$f":"W24*$B$27","v":0},null,{"$f":"Y24*$B$27","v":0},{"$f":"Z24*$B$27","v":0},null,{"$f":"AB24*$B$27","v":0},{"$f":"AC24*$B$27","v":0}]
["Deemed LT Debt",null,null,{"$f":"D24*$B$28","v":0},{"$f":"E24*$B$28","v":0},null,{"$f":"G24*$B$28","v":0},{"$f":"H24*$B$28","v":0},null,{"$f":"J24*$B$28","v":0},{"$f":"K24*$B$28","v":0},null,{"$f":"M24*$B$28","v":0},{"$f":"N24*$B$28","v":0},null,{"$f":"P24*$B$28","v":0},{"$f":"Q24*$B$28","v":0},null,{"$f":"S24*$B$28","v":0},{"$f":"T24*$B$28","v":0},null,{"$f":"V24*$B$28","v":0},{"$f":"W24*$B$28","v":0},null,{"$f":"Y24*$B$28","v":0},{"$f":"Z24*$B$28","v":0},null,{"$f":"AB24*$B$28","v":0},{"$f":"AC24*$B$28","v":0}]
["Deemed Equity",null,null,{"$f":"D24*$B$29","v":0},{"$f":"E24*$B$29","v":0},null,{"$f":"G24*$B$29","v":0},{"$f":"H24*$B$29","v":0},null,{"$f":"J24*$B$29","v":0},{"$f":"K24*$B$29","v":0},null,{"$f":"M24*$B$29","v":0},{"$f":"N24*$B$29","v":0},null,{"$f":"P24*$B$29","v":0},{"$f":"Q24*$B$29","v":0},null,{"$f":"S24*$B$29","v":0},{"$f":"T24*$B$29","v":0},null,{"$f":"V24*$B$29","v":0},{"$f":"W24*$B$29","v":0},null,{"$f":"Y24*$B$29","v":0},{"$f":"Z24*$B$29","v":0},null,{"$f":"AB24*$B$29","v":0},{"$f":"AC24*$B$29","v":0}]
[]
["ST Interest",null,null,{"$f":"D27*$B31","v":0},{"$f":"E27*$B31","v":0},null,{"$f":"G27*$B31","v":0},{"$f":"H27*$B31","v":0},null,{"$f":"J27*$B31","v":0},{"$f":"K27*$B31","v":0},null,{"$f":"M27*$B31","v":0},{"$f":"N27*$B31","v":0},null,{"$f":"P27*$B31","v":0},{"$f":"Q27*$B31","v":0},null,{"$f":"S27*$B31","v":0},{"$f":"T27*$B31","v":0},null,{"$f":"V27*$B31","v":0},{"$f":"W27*$B31","v":0},null,{"$f":"Y27*$B31","v":0},{"$f":"Z27*$B31","v":0},null,{"$f":"AB27*$B31","v":0},{"$f":"AC27*$B31","v":0}]
["LT Interest",null,null,{"$f":"D28*$B32","v":0},0,null,{"$f":"G28*$B32","v":0},0,null,{"$f":"J28*$B32","v":0},0,null,{"$f":"M28*$B32","v":0},0,null,{"$f":"P28*$B32","v":0},0,null,{"$f":"S28*$B32","v":0},0,null,{"$f":"V28*$B32","v":0},0,null,{"$f":"Y28*$B32","v":0},0,null,{"$f":"AB28*$B32","v":0},0]
["ROE",null,null,0,0,null,0,0,null,0,0,null,0,0,null,0,0,null,0,0,null,0,0,null,0,0,null,0,0]
["Cost of Capital Total",null,null,{"$f":"SUM(D31:D33)","v":0},{"$f":"SUM(E31:E33)","v":0},null,{"$f":"SUM(G31:G33)","v":0},{"$f":"SUM(H31:H33)","v":0},null,{"$f":"SUM(J31:J33)","v":0},{"$f":"SUM(K31:K33)","v":0},null,{"$f":"SUM(M31:M33)","v":0},{"$f":"SUM(N31:N33)","v":0},null,{"$f":"SUM(P31:P33)","v":0},{"$f":"SUM(Q31:Q33)","v":0},null,{"$f":"SUM(S31:S33)","v":0},{"$f":"SUM(T31:T33)","v":0},null,{"$f":"SUM(V31:V33)","v":0},{"$f":"SUM(W31:W33)","v":0},null,{"$f":"SUM(Y31:Y33)","v":0},{"$f":"SUM(Z31:Z33)","v":0},null,{"$f":"SUM(AB31:AB33)","v":0},{"$f":"SUM(AC31:AC33)","v":0}]
[]
["OM&A",null,null,{"$f":"D21+D22","v":0},{"$f":"E22","v":0},null,{"$f":"G21+G22","v":0},{"$f":"H22","v":0},null,{"$f":"J21+J22","v":0},{"$f":"K22","v":0},null,{"$f":"M21+M22","v":0},{"$f":"N22","v":0},null,{"$f":"P21+P22","v":0},{"$f":"Q22","v":0},null,{"$f":"S21+S22","v":0},{"$f":"T22","v":0},null,{"$f":"V21+V22","v":0},{"$f":"W22","v":0},null,{"$f":"Y21+Y22","v":0},{"$f":"Z22","v":0},null,{"$f":"AB21+AB22","v":0},{"$f":"AC22","v":0}]
["Amortization",null,{"$f":"D77","v":0},{"$f":"C37*D$19","v":0},{"$f":"C37*E$19","v":0},{"$f":"E77","v":0},{"$f":"F37*G$19","v":0},{"$f":"F37*H$19","v":0},{"$f":"F77","v":0},{"$f":"I37*J$19","v":0},{"$f":"I37*K$19","v":0},{"$f":"G77","v":0},{"$f":"L37*M$19","v":0},{"$f":"L37*N$19","v":0},{"$f":"H77","v":0},{"$f":"O37*P$19","v":0},{"$f":"O37*Q$19","v":0},{"$f":"I76+I77","v":0},{"$f":"R37*S$19","v":0},{"$f":"R37*T$19","v":0},{"$f":"J76+J77","v":0},{"$f":"U37*V$19","v":0},{"$f":"U37*W$19","v":0},{"$f":"K76+K77","v":0},{"$f":"X37*Y$19","v":0},{"$f":"X37*Z$19","v":0},{"$f":"L76+L77","v":0},{"$f":"AA37*AB$19","v":0},{"$f":"AA37*AC$19","v":0}]
["Grossed-up PILs",null,null,{"$f":"D65","v":0},{"$f":"E65","v":0},null,{"$f":"G65","v":0},{"$f":"H65","v":0},null,{"$f":"J65","v":0},{"$f":"K65","v":0},null,{"$f":"M65","v":0},{"$f":"N65","v":0},null,{"$f":"P65","v":0},{"$f":"Q65","v":0},null,{"$f":"S65","v":0},{"$f":"T65","v":0},null,{"$f":"V65","v":0},{"$f":"W65","v":0},null,{"$f":"Y65","v":0},{"$f":"Z65","v":0},null,{"$f":"AB65","v":0},{"$f":"AC65","v":0}]
[]
["Revenue Requirement",null,null,{"$f":"SUM(D34:D38)","v":0},{"$f":"SUM(E34:E38)","v":0},null,{"$f":"SUM(G34:G38)","v":0},{"$f":"SUM(H34:H38)","v":0},null,{"$f":"SUM(J34:J38)","v":0},{"$f":"SUM(K34:K38)","v":0},null,{"$f":"SUM(M34:M38)","v":0},{"$f":"SUM(N34:N38)","v":0},null,{"$f":"SUM(P34:P38)","v":0},{"$f":"SUM(Q34:Q38)","v":0},null,{"$f":"SUM(S34:S38)","v":0},{"$f":"SUM(T34:T38)","v":0},null,{"$f":"SUM(V34:V38)","v":0},{"$f":"SUM(W34:W38)","v":0},null,{"$f":"SUM(Y34:Y38)","v":0},{"$f":"SUM(Z34:Z38)","v":0},null,{"$f":"SUM(AB34:AB38)","v":0},{"$f":"SUM(AC34:AC38)","v":0}]
[]
[]
["Provincial Rate Protection",null,null,null,{"$f":"E40","v":0},null,null,{"$f":"H40","v":0},null,null,{"$f":"K40","v":0},null,null,{"$f":"N40","v":0},null,null,{"$f":"Q40","v":0},null,null,{"$f":"T40","v":0},null,null,{"$f":"W40","v":0},null,null,{"$f":"Z40","v":0},null,null,{"$f":"AC40","v":0}]
[]
["Monthly Amount Paid by IESO",null,null,null,{"$f":"E43/12","v":0},null,null,{"$f":"H43/12","v":0},null,null,{"$f":"K43/12","v":0},null,null,{"$f":"N43/12","v":0},null,null,{"$f":"Q43/12","v":0},null,null,{"$f":"T43/12","v":0},null,null,{"$f":"W43/12","v":0},null,null,{"$f":"Z43/12","v":0},null,null,{"$f":"AC43/12","v":0}]
[]
["Note 1: The difference between the actual costs of approved eligible investments and revenue received from the IESO should be recorded in a variance account.  The Board may provide "]
["regulatory accounting guidance regarding a variance account either in an individual proceeding or on a generic basis."]
["Note 2: For the 2016 Test Year, Costs and Revenues of the Direct Benefit are to be included in the test year applicant Rate Base and Revenues.  "]
[]
["PILs Calculation"]
[null,null,null,{"$f":"C17","v":2014},null,null,{"$f":"F17","v":2015},null,null,{"$f":"I17","v":2016},null,null,{"$f":"L17","v":2017},null,null,{"$f":"O17","v":"2018 Test Year"},null,null,{"$f":"R17","v":2019},null,null,{"$f":"U17","v":2020},null,null,{"$f":"X17","v":2021},null,null,{"$f":"AA17","v":2022}]
["Income Tax",null,null,"Direct Benefit","Provincial",null,"Direct Benefit","Provincial",null,"Direct Benefit","Provincial",null,"Direct Benefit","Provincial",null,"Direct Benefit","Provincial",null,"Direct Benefit","Provincial",null,"Direct Benefit","Provincial",null,"Direct Benefit","Provincial",null,"Direct Benefit","Provincial"]
[null,null,null,null,null,null,null,null,null,null,null,null,null,null,null,null,null,null,null,null,null,null,null,"Total",null,null,"Total"]
["Net Income - ROE on Rate Base",null,null,{"$f":"D33","v":0},{"$f":"E33","v":0},null,{"$f":"G33","v":0},{"$f":"H33","v":0},null,{"$f":"J33","v":0},{"$f":"K33","v":0},null,{"$f":"M33","v":0},{"$f":"N33","v":0},null,{"$f":"P33","v":0},{"$f":"Q33","v":0},null,{"$f":"S33","v":0},{"$f":"T33","v":0},null,{"$f":"V33","v":0},{"$f":"W33","v":0},null,{"$f":"Y33","v":0},{"$f":"Z33","v":0},null,{"$f":"AB33","v":0},{"$f":"AC33","v":0}]
["Amortization (6% DB and 94% P)",null,null,{"$f":"D37","v":0},{"$f":"E37","v":0},null,{"$f":"G37","v":0},{"$f":"H37","v":0},null,{"$f":"J37","v":0},{"$f":"K37","v":0},null,{"$f":"M37","v":0},{"$f":"N37","v":0},null,{"$f":"P37","v":0},{"$f":"Q37","v":0},null,{"$f":"S37","v":0},{"$f":"T37","v":0},null,{"$f":"V37","v":0},{"$f":"W37","v":0},null,{"$f":"Y37","v":0},{"$f":"Z37","v":0},null,{"$f":"AB37","v":0},{"$f":"AC37","v":0}]
["CCA (6% DB and 94% P)",null,null,{"$f":"-D94*D$19","v":0},{"$f":"-D94*E$19","v":0},null,{"$f":"-E94*G19","v":0},{"$f":"-E94*H$19","v":0},null,{"$f":"-F94*J$19","v":0},{"$f":"-F94*K$19","v":0},null,{"$f":"-G94*M$19","v":0},{"$f":"-G94*N$19","v":0},null,{"$f":"-H94*P$19","v":0},{"$f":"-H94*Q$19","v":0},null,{"$f":"-I94*S$19","v":0},{"$f":"-I94*T$19","v":0},null,{"$f":"-J94*V$19","v":0},{"$f":"-J94*W$19","v":0},null,{"$f":"-K94*Y$19","v":0},{"$f":"-K94*Z$19","v":0},null,{"$f":"-L94*AB$19","v":0},{"$f":"-L94*AC$19","v":0}]
["Taxable income",null,null,{"$f":"SUM(D55:D57)","v":0},{"$f":"SUM(E55:E57)","v":0},null,{"$f":"SUM(G55:G57)","v":0},{"$f":"SUM(H55:H57)","v":0},null,{"$f":"SUM(J55:J57)","v":0},{"$f":"SUM(K55:K57)","v":0},null,{"$f":"SUM(M55:M57)","v":0},{"$f":"SUM(N55:N57)","v":0},null,{"$f":"SUM(P55:P57)","v":0},{"$f":"SUM(Q55:Q57)","v":0},null,{"$f":"SUM(S55:S57)","v":0},{"$f":"SUM(T55:T57)","v":0},null,{"$f":"SUM(V55:V57)","v":0},{"$f":"SUM(W55:W57)","v":0},null,{"$f":"SUM(Y55:Y57)","v":0},{"$f":"SUM(Z55:Z57)","v":0},null,{"$f":"SUM(AB55:AB57)","v":0},{"$f":"SUM(AC55:AC57)","v":0}]
[]
["Tax Rate  (to be entered)"]
[]
["Income Taxes Payable",null,null,{"$f":"D58*D60","v":0},{"$f":"E58*E60","v":0},null,{"$f":"G58*G60","v":0},{"$f":"H58*H60","v":0},null,{"$f":"J58*J60","v":0},{"$f":"K58*K60","v":0},null,{"$f":"M58*M60","v":0},{"$f":"N58*N60","v":0},null,{"$f":"P58*P60","v":0},{"$f":"Q58*Q60","v":0},null,{"$f":"S58*S60","v":0},{"$f":"T58*T60","v":0},null,{"$f":"V58*V60","v":0},{"$f":"W58*W60","v":0},null,{"$f":"Y58*Y60","v":0},{"$f":"Z58*Z60","v":0},null,{"$f":"AB58*AB60","v":0},{"$f":"AC58*AC60","v":0}]
["Gross Up"]
["Income Taxes Payable",null,null,{"$f":"D62/(1-D60)","v":0},{"$f":"E62/(1-E60)","v":0},null,{"$f":"G62/(1-G60)","v":0},{"$f":"H62/(1-H60)","v":0},null,{"$f":"J62/(1-J60)","v":0},{"$f":"K62/(1-K60)","v":0},null,{"$f":"M62/(1-M60)","v":0},{"$f":"N62/(1-N60)","v":0},null,{"$f":"P62/(1-P60)","v":0},{"$f":"Q62/(1-Q60)","v":0},null,{"$f":"S62/(1-S60)","v":0},{"$f":"T62/(1-T60)","v":0},null,{"$f":"V62/(1-V60)","v":0},{"$f":"W62/(1-W60)","v":0},null,{"$f":"Y62/(1-Y60)","v":0},{"$f":"Z62/(1-Z60)","v":0},null,{"$f":"AB62/(1-AB60)","v":0},{"$f":"AC62/(1-AC60)","v":0}]
["Grossed Up PILs",null,null,{"$f":"SUM(D64:D64)","v":0},{"$f":"SUM(E64:E64)","v":0},null,{"$f":"SUM(G64:G64)","v":0},{"$f":"SUM(H64:H64)","v":0},null,{"$f":"SUM(J64:J64)","v":0},{"$f":"SUM(K64:K64)","v":0},null,{"$f":"SUM(M64:M64)","v":0},{"$f":"SUM(N64:N64)","v":0},null,{"$f":"SUM(P64:P64)","v":0},{"$f":"SUM(Q64:Q64)","v":0},null,{"$f":"SUM(S64:S64)","v":0},{"$f":"SUM(T64:T64)","v":0},null,{"$f":"SUM(V64:V64)","v":0},{"$f":"SUM(W64:W64)","v":0},null,{"$f":"SUM(Y64:Y64)","v":0},{"$f":"SUM(Z64:Z64)","v":0},null,{"$f":"SUM(AB64:AB64)","v":0},{"$f":"SUM(AC64:AC64)","v":0}]
[]
[]
[null,null,null,{"$f":"E68-1","v":2014},{"$f":"F68-1","v":2015},{"$f":"G68-1","v":2016},{"$f":"H68-1","v":2017},{"$f":"TestYear","v":2018},{"$f":"H68+1","v":2019},{"$f":"I68+1","v":2020},{"$f":"J68+1","v":2021},{"$f":"K68+1","v":2022}]
["Net Fixed Assets"]
[null,"Enter applicable amortization in years:",25]
["Opening Gross Fixed Assets",null,null,null,{"$f":"D73","v":0},0,0,0,{"$f":"H73","v":0},{"$f":"I73","v":0},{"$f":"J73","v":0},{"$f":"K73","v":0}]
["Gross Capital Additions",null,null,{"$f":"'App.2-FA Proposed REG Invest.'!C62","v":0},{"$f":"'App.2-FA Proposed REG Invest.'!D62","v":0},{"$f":"'App.2-FA Proposed REG Invest.'!E62","v":0},{"$f":"'App.2-FA Proposed REG Invest.'!F62","v":0},{"$f":"'App.2-FA Proposed REG Invest.'!G62","v":0},{"$f":"'App.2-FA Proposed REG Invest.'!H62","v":0},{"$f":"'App.2-FA Proposed REG Invest.'!I62","v":0},{"$f":"'App.2-FA Proposed REG Invest.'!J62","v":0},{"$f":"'App.2-FA Proposed REG Invest.'!K62","v":0}]
["Closing Gross Fixed Assets",null,null,{"$f":"SUM(D71:D72)","v":0},0,0,0,{"$f":"SUM(H71:H72)","v":0},{"$f":"SUM(I71:I72)","v":0},0,0,0]
[]
["Opening Accumulated Amortization",null,null,null,{"$f":"+D78","v":0},{"$f":"E78","v":0},0,0,0,0,0,0]
["Current Year Amortization (before additions)",null,null,{"$f":"IF(ISERROR(D71/$C$70), 0, D71/$C$70)","v":0},0,0,0,0,{"$f":"IF(ISERROR(I71/$C$70), 0, I71/$C$70)","v":0},{"$f":"IF(ISERROR(J71/$C$70), 0, J71/$C$70)","v":0},{"$f":"IF(ISERROR(K71/$C$70), 0, K71/$C$70)","v":0},{"$f":"IF(ISERROR(L71/$C$70), 0, L71/$C$70)","v":0}]
["Additions (half year)",null,null,{"$f":"D72/$C$70/2","v":0},{"$f":"E72/$C$70/2","v":0},{"$f":"F72/$C$70/2","v":0},0,{"$f":"H72/$C$70/2","v":0},{"$f":"I72/C70/2","v":0},{"$f":"J72/C70/2","v":0},{"$f":"K72/C70/2","v":0},{"$f":"L72/C70/2","v":0}]
["Closing Accumulated Amortization",null,null,{"$f":"SUM(D75+D76+D77)","v":0},{"$f":"SUM(E75+E76+E77)","v":0},{"$f":"SUM(F75+F76+F77)","v":0},{"$f":"SUM(G75+G76+G77)","v":0},{"$f":"SUM(H75+H76+H77)","v":0},{"$f":"SUM(I75:I77)","v":0},{"$f":"SUM(J75:J77)","v":0},{"$f":"SUM(K75:K77)","v":0},{"$f":"SUM(L75:L77)","v":0}]
[]
["Opening Net Fixed Assets",null,null,{"$f":"D71-D75","v":0},0,{"$f":"F71-F75","v":0},0,{"$f":"H71-H75","v":0},{"$f":"H81","v":0},{"$f":"I81","v":0},{"$f":"J81","v":0},{"$f":"K81","v":0}]
["Closing Net Fixed Assets",null,null,{"$f":"D73-D78","v":0},{"$f":"E73-E78","v":0},0,0,{"$f":"H73-H78","v":0},{"$f":"I73-I78","v":0},{"$f":"J73-J78","v":0},{"$f":"K73-K78","v":0},{"$f":"L73-L78","v":0}]
["Average Net Fixed Assets",null,null,{"$f":"SUM(D80:D81)/2","v":0},0,0,0,{"$f":"SUM(H80:H81)/2","v":0},{"$f":"SUM(I80:I81)/2","v":0},{"$f":"SUM(J80:J81)/2","v":0},{"$f":"SUM(K80:K81)/2","v":0},{"$f":"SUM(L80:L81)/2","v":0}]
[]
["UCC for PILs Calculation"]
[null,null,null,{"$f":"D68","v":2014},{"$f":"E68","v":2015},2016,2017,2018,2019,2020,2021,2022]
[]
["Opening UCC",null,null,null,{"$f":"D95","v":0},0,0,0,0,0,0,0]
["Capital Additions (from Appendix 2-FA)",null,null,{"$f":"D72","v":0},0,0,0,{"$f":"H72","v":0},{"$f":"I72","v":0},0,0,0]
["UCC Before Half Year Rule",null,null,{"$f":"SUM(D87:D88)","v":0},0,0,0,{"$f":"SUM(H87:H88)","v":0},{"$f":"SUM(I87:I88)","v":0},{"$f":"SUM(J87:J88)","v":0},{"$f":"SUM(K87:K88)","v":0},{"$f":"SUM(L87:L88)","v":0}]
["Half Year Rule (1/2 Additions - Disposals)",null,null,{"$f":"D88/2","v":0},0,0,0,{"$f":"H88/2","v":0},{"$f":"I88/2","v":0},{"$f":"J88/2","v":0},{"$f":"K88/2","v":0},{"$f":"L88/2","v":0}]
["Reduced UCC",null,null,{"$f":"D89-D90","v":0},0,0,0,{"$f":"H89-H90","v":0},{"$f":"I89-I90","v":0},{"$f":"J89-J90","v":0},{"$f":"K89-K90","v":0},{"$f":"L89-L90","v":0}]
["CCA Rate Class (to be entered)",null,47,{"$f":"C92","v":47},{"$f":"D92","v":47},47,47,47,47,47,47,47]
["CCA Rate  (to be entered)",null,0.08,{"$f":"C93","v":0.08},0.08,0.08,0.08,0.08,0.08,0.08,0.08,0.08]
["CCA",null,null,{"$f":"D91*D93","v":0},0,0,0,{"$f":"H91*H93","v":0},{"$f":"I91*I93","v":0},0,0,{"$f":"L91*L93","v":0}]
["Closing UCC",null,null,{"$f":"D89-D94","v":0},0,0,0,{"$f":"H89-H94","v":0},{"$f":"I89-I94","v":0},{"$f":"J89-J94","v":0},{"$f":"K89-K94","v":0},{"$f":"L89-L94","v":0}]

{"sheet":"App.2-FC Calc of REG Expansion","index":25,"n_rows":95,"n_cols":30,"rows_kept":95,"cut":false,"hidden":false,"merged":[[17,18,17,20],[17,21,17,23],[17,24,17,26],[17,27,17,29],[52,22,52,23],[52,25,52,26],[52,28,52,29],[47,0,47,20],[49,0,49,21],[50,0,50,1],[52,4,52,5],[52,7,52,8],[52,10,52,11],[52,13,52,14],[52,16,52,17],[52,19,52,20],[17,3,17,5],[17,6,17,8],[17,9,17,11],[17,12,17,14],[17,15,17,17],[8,0,8,14],[9,0,9,14],[11,0,11,14],[12,0,12,14],[14,0,14,14]]}
[null,null,null,null,null,null,null,null,null,null,null,null,null,"File Number:",{"$f":"EBNUMBER","v":0}]
["NOT APPLICABLE",null,null,null,null,null,null,null,null,null,null,null,null,"Exhibit:"]
[null,null,null,null,null,null,null,null,null,null,null,null,null,"Tab:"]
[null,null,null,null,null,null,null,null,null,null,null,null,null,"Schedule:"]
[null,null,null,null,null,null,null,null,null,null,null,null,null,"Page:"]
[]
[null,null,null,null,null,null,null,null,null,null,null,null,null,"Date:"]
[]
["Appendix 2-FC"]
["Calculation of Renewable Generation Connection Direct Benefits/Provincial Amount: Renewable Expansion Investments"]
[]
["This table will calculate the distributor/provincial shares of the investments entered in Part B of Appendix 2-FA."]
["Enter values in green shaded cells: WCA percentage, debt percentages, interest rates, kWh, tax rates, amortization period, CCA Class and percentage."]
["For historical investments, enter these variables for your last cost of service test year.  For 2016 and beyond, enter variables as in the application."]
["Rate Riders are not calculated for the Test Year as these assets and costs are already in the distributor's rate base."]
[]
[]
[null,null,null,{"$f":"G18-1","v":2014},null,null,{"$f":"J18-1","v":2015},null,null,{"$f":"M18-1","v":2016},null,null,{"$f":"BridgeYear","v":2017},null,null,{"$f":"CONCATENATE(TestYear,\" Test Year\")","v":"2018 Test Year"},null,null,{"$f":"TestYear+1","v":2019},2016,null,{"$f":"S18+1","v":2020},null,null,{"$f":"V18+1","v":2021},null,null,{"$f":"Y18+1","v":2022}]
[null,null,null,null,"Direct Benefit","Provincial",null,"Direct Benefit","Provincial",null,"Direct Benefit","Provincial",null,"Direct Benefit","Provincial",null,"Direct Benefit","Provincial",null,"Direct Benefit","Provincial",null,"Direct Benefit","Provincial",null,"Direct Benefit","Provincial",null,"Direct Benefit","Provincial"]
[null,null,null,"Total",0.17,0.83,"Total",0.17,0.83,"Total",0.17,0.83,"Total",0.17,0.83,"Total",0.17,0.83,"Total",0.17,0.83,"Total",0.17,0.83,"Total",0.17,0.83,"Total",0.17,0.83]
["Net Fixed Assets (average)",null,null,{"$f":"D82","v":0},{"$f":"D21*E20","v":0},{"$f":"D21*F20","v":0},{"$f":"E82","v":0},{"$f":"G21*H20","v":0},{"$f":"G21*I20","v":0},{"$f":"F82","v":0},{"$f":"J21*K20","v":0},{"$f":"J21*L20","v":0},{"$f":"G82","v":0},{"$f":"M21*N20","v":0},{"$f":"M21*O20","v":0},{"$f":"H82","v":0},{"$f":"P21*Q20","v":0},{"$f":"P21*R20","v":0},{"$f":"I82","v":0},{"$f":"S21*T20","v":0},{"$f":"S21*U20","v":0},{"$f":"J82","v":0},{"$f":"V21*W20","v":0},{"$f":"V21*X20","v":0},{"$f":"K82","v":0},{"$f":"Y21*Z20","v":0},{"$f":"Y21*AA20","v":0},{"$f":"L82","v":0},{"$f":"AB21*AC20","v":0},{"$f":"AB21*AD20","v":0}]
["Incremental OM&A (on-going, N/A for Provincial Recovery)",null,null,{"$f":"'App.2-FA Proposed REG Invest.'!C101","v":0},{"$f":"D22","v":0},null,{"$f":"'App.2-FA Proposed REG Invest.'!D$101","v":0},{"$f":"G22","v":0},null,{"$f":"'App.2-FA Proposed REG Invest.'!E$101","v":0},{"$f":"J22","v":0},null,{"$f":"'App.2-FA Proposed REG Invest.'!F$101","v":0},{"$f":"M22","v":0},null,{"$f":"'App.2-FA Proposed REG Invest.'!G$101","v":0},{"$f":"P22","v":0},null,{"$f":"'App.2-FA Proposed REG Invest.'!H$101","v":0},{"$f":"S22","v":0},null,{"$f":"'App.2-FA Proposed REG Invest.'!I$101","v":0},{"$f":"V22","v":0},null,{"$f":"'App.2-FA Proposed REG Invest.'!J$101","v":0},{"$f":"Y22","v":0},null,{"$f":"'App.2-FA Proposed REG Invest.'!K$101","v":0},{"$f":"AB22","v":0}]
["Incremental OM&A (start-up, applicable for Provincial Recovery)",null,null,{"$f":"'App.2-FA Proposed REG Invest.'!C100","v":0},{"$f":"D23*E20","v":0},{"$f":"D23*F20","v":0},{"$f":"'App.2-FA Proposed REG Invest.'!D$100","v":0},{"$f":"G23*H20","v":0},{"$f":"G23*I20","v":0},{"$f":"'App.2-FA Proposed REG Invest.'!E$100","v":0},{"$f":"J23*K20","v":0},{"$f":"J23*L20","v":0},{"$f":"'App.2-FA Proposed REG Invest.'!F$100","v":0},{"$f":"M23*N20","v":0},{"$f":"M23*O20","v":0},{"$f":"'App.2-FA Proposed REG Invest.'!G$100","v":0},{"$f":"P23*Q20","v":0},{"$f":"P23*R20","v":0},{"$f":"'App.2-FA Proposed REG Invest.'!H$100","v":0},{"$f":"S23*T20","v":0},{"$f":"S23*U20","v":0},{"$f":"'App.2-FA Proposed REG Invest.'!I$100","v":0},{"$f":"V23*W20","v":0},{"$f":"V23*X20","v":0},{"$f":"'App.2-FA Proposed REG Invest.'!J$100","v":0},{"$f":"Y23*Z20","v":0},{"$f":"Y23*AA20","v":0},{"$f":"'App.2-FA Proposed REG Invest.'!K$100","v":0},{"$f":"AB23*AC20","v":0},{"$f":"AB23*AD20","v":0}]
["WCA",null,null,null,{"$f":"(E22+E23)*$B$24","v":0},{"$f":"F23*$B$24","v":0},null,{"$f":"(H22+H23)*$B$24","v":0},{"$f":"I23*$B$24","v":0},null,{"$f":"(K22+K23)*$B$24","v":0},{"$f":"L23*$B$24","v":0},null,{"$f":"(N22+N23)*$B$24","v":0},{"$f":"O23*$B$24","v":0},null,{"$f":"(Q22+Q23)*$B$24","v":0},{"$f":"R23*$B$24","v":0},null,{"$f":"(T22+T23)*$B$24","v":0},{"$f":"U23*$B$24","v":0},null,{"$f":"(W22+W23)*$B$24","v":0},{"$f":"X23*$B$24","v":0},null,{"$f":"(Z22+Z23)*$B$24","v":0},{"$f":"AA23*$B$24","v":0},null,{"$f":"(AC22+AC23)*$B$24","v":0},{"$f":"AD23*$B$24","v":0}]
["Rate Base",null,null,null,{"$f":"SUM(E21+E24)","v":0},{"$f":"SUM(F21+F24)","v":0},null,{"$f":"SUM(H21+H24)","v":0},{"$f":"SUM(I21+I24)","v":0},null,{"$f":"SUM(K21+K24)","v":0},{"$f":"SUM(L21+L24)","v":0},null,{"$f":"SUM(N21+N24)","v":0},{"$f":"SUM(O21+O24)","v":0},null,{"$f":"SUM(Q21+Q24)","v":0},{"$f":"SUM(R21+R24)","v":0},null,{"$f":"SUM(T21+T24)","v":0},{"$f":"SUM(U21+U24)","v":0},null,{"$f":"SUM(W21+W24)","v":0},{"$f":"SUM(X21+X24)","v":0},null,{"$f":"SUM(Z21+Z24)","v":0},{"$f":"SUM(AA21+AA24)","v":0},null,{"$f":"SUM(AC21+AC24)","v":0},{"$f":"SUM(AD21+AD24)","v":0}]
[]
[]
["Deemed ST Debt",null,null,null,{"$f":"E25*$B$28","v":0},{"$f":"F25*$B$28","v":0},null,{"$f":"H25*$B$28","v":0},{"$f":"I25*$B$28","v":0},null,{"$f":"K25*$B$28","v":0},{"$f":"L25*$B$28","v":0},null,{"$f":"N25*$B$28","v":0},{"$f":"O25*$B$28","v":0},null,{"$f":"Q25*$B$28","v":0},{"$f":"R25*$B$28","v":0},null,{"$f":"T25*$B$28","v":0},{"$f":"U25*$B$28","v":0},null,{"$f":"W25*$B$28","v":0},{"$f":"X25*$B$28","v":0},null,{"$f":"Z25*$B$28","v":0},{"$f":"AA25*$B$28","v":0},null,{"$f":"AC25*$B$28","v":0},{"$f":"AD25*$B$28","v":0}]
["Deemed LT Debt",null,null,null,{"$f":"E25*$B$29","v":0},{"$f":"F25*$B$29","v":0},null,{"$f":"H25*$B$29","v":0},{"$f":"I25*$B$29","v":0},null,{"$f":"K25*$B$29","v":0},{"$f":"L25*$B$29","v":0},null,{"$f":"N25*$B$29","v":0},{"$f":"O25*$B$29","v":0},null,{"$f":"Q25*$B$29","v":0},{"$f":"R25*$B$29","v":0},null,{"$f":"T25*$B$29","v":0},{"$f":"U25*$B$29","v":0},null,{"$f":"W25*$B$29","v":0},{"$f":"X25*$B$29","v":0},null,{"$f":"Z25*$B$29","v":0},{"$f":"AA25*$B$29","v":0},null,{"$f":"AC25*$B$29","v":0},{"$f":"AD25*$B$29","v":0}]
["Deemed Equity",null,null,null,{"$f":"E25*$B$30","v":0},{"$f":"F25*$B$30","v":0},null,{"$f":"H25*$B$30","v":0},{"$f":"I25*$B$30","v":0},null,{"$f":"K25*$B$30","v":0},{"$f":"L25*$B$30","v":0},null,{"$f":"N25*$B$30","v":0},{"$f":"O25*$B$30","v":0},null,{"$f":"Q25*$B$30","v":0},{"$f":"R25*$B$30","v":0},null,{"$f":"T25*$B$30","v":0},{"$f":"U25*$B$30","v":0},null,{"$f":"W25*$B$30","v":0},{"$f":"X25*$B$30","v":0},null,{"$f":"Z25*$B$30","v":0},{"$f":"AA25*$B$30","v":0},null,{"$f":"AC25*$B$30","v":0},{"$f":"AD25*$B$30","v":0}]
[]
["ST Interest",null,null,null,{"$f":"E28*$B$32","v":0},{"$f":"F28*$B$32","v":0},null,{"$f":"H28*$B$32","v":0},{"$f":"I28*$B$32","v":0},null,{"$f":"K28*$B$32","v":0},{"$f":"L28*$B$32","v":0},null,{"$f":"N28*$B$32","v":0},{"$f":"O28*$B$32","v":0},null,{"$f":"Q28*$B$32","v":0},{"$f":"R28*$B$32","v":0},null,{"$f":"T28*$B$32","v":0},{"$f":"U28*$B$32","v":0},null,{"$f":"W28*$B$32","v":0},{"$f":"X28*$B$32","v":0},null,{"$f":"Z28*$B$32","v":0},{"$f":"AA28*$B$32","v":0},null,{"$f":"AC28*$B$32","v":0},{"$f":"AD28*$B$32","v":0}]
["LT Interest",null,null,null,{"$f":"E29*$B$33","v":0},{"$f":"F29*$B$33","v":0},null,{"$f":"H29*$B$33","v":0},{"$f":"I29*$B$33","v":0},null,{"$f":"K29*$B$33","v":0},{"$f":"L29*$B$33","v":0},null,{"$f":"N29*$B$33","v":0},{"$f":"O29*$B$33","v":0},null,{"$f":"Q29*$B$33","v":0},{"$f":"R29*$B$33","v":0},null,{"$f":"T29*$B$33","v":0},{"$f":"U29*$B$33","v":0},null,{"$f":"W29*$B$33","v":0},{"$f":"X29*$B$33","v":0},null,{"$f":"Z29*$B$33","v":0},{"$f":"AA29*$B$33","v":0},null,{"$f":"AC29*$B$33","v":0},{"$f":"AD29*$B$33","v":0}]
["ROE",null,null,null,{"$f":"E30*$B$34","v":0},{"$f":"F30*$B$34","v":0},null,{"$f":"H30*$B$34","v":0},{"$f":"I30*$B$34","v":0},null,{"$f":"K30*$B$34","v":0},{"$f":"L30*$B$34","v":0},null,{"$f":"N30*$B$34","v":0},{"$f":"O30*$B$34","v":0},null,{"$f":"Q30*$B$34","v":0},{"$f":"R30*$B$34","v":0},null,{"$f":"T30*$B$34","v":0},{"$f":"U30*$B$34","v":0},null,{"$f":"W30*$B$34","v":0},{"$f":"X30*$B$34","v":0},null,{"$f":"Z30*$B$34","v":0},{"$f":"AA30*$B$34","v":0},null,{"$f":"AC30*$B$34","v":0},{"$f":"AD30*$B$34","v":0}]
["Cost of Capital Total",null,null,null,{"$f":"SUM(E32:E34)","v":0},{"$f":"SUM(F32:F34)","v":0},null,{"$f":"SUM(H32:H34)","v":0},{"$f":"SUM(I32:I34)","v":0},null,{"$f":"SUM(K32:K34)","v":0},{"$f":"SUM(L32:L34)","v":0},null,{"$f":"SUM(N32:N34)","v":0},{"$f":"SUM(O32:O34)","v":0},null,{"$f":"SUM(Q32:Q34)","v":0},{"$f":"SUM(R32:R34)","v":0},null,{"$f":"SUM(T32:T34)","v":0},{"$f":"SUM(U32:U34)","v":0},null,{"$f":"SUM(W32:W34)","v":0},{"$f":"SUM(X32:X34)","v":0},null,{"$f":"SUM(Z32:Z34)","v":0},{"$f":"SUM(AA32:AA34)","v":0},null,{"$f":"SUM(AC32:AC34)","v":0},{"$f":"SUM(AD32:AD34)","v":0}]
[]
["OM&A",null,null,null,{"$f":"E22+E23","v":0},{"$f":"F23","v":0},null,{"$f":"H22+H23","v":0},{"$f":"I23","v":0},null,{"$f":"K22+K23","v":0},{"$f":"L23","v":0},null,{"$f":"N22+N23","v":0},{"$f":"O23","v":0},null,{"$f":"Q22+Q23","v":0},{"$f":"R23","v":0},null,{"$f":"T22+T23","v":0},{"$f":"U23","v":0},null,{"$f":"W22+W23","v":0},{"$f":"X23","v":0},null,{"$f":"Z22+Z23","v":0},{"$f":"AA23","v":0},null,{"$f":"AC22+AC23","v":0},{"$f":"AD23","v":0}]
["Amortization",null,null,{"$f":"D78","v":0},{"$f":"D38*E$20","v":0},{"$f":"D38*F$20","v":0},{"$f":"E78","v":0},{"$f":"G38*H$20","v":0},{"$f":"G38*I$20","v":0},{"$f":"F78","v":0},{"$f":"J38*K$20","v":0},{"$f":"J38*L$20","v":0},{"$f":"G78","v":0},{"$f":"M38*N$20","v":0},{"$f":"M38*O$20","v":0},{"$f":"H76+H77","v":0},{"$f":"P38*Q$20","v":0},{"$f":"P38*R$20","v":0},{"$f":"I76+I77","v":0},{"$f":"S38*T$20","v":0},{"$f":"S38*U$20","v":0},{"$f":"J76+J77","v":0},{"$f":"V38*W$20","v":0},{"$f":"V38*X$20","v":0},{"$f":"K76+K77","v":0},{"$f":"Y38*Z$20","v":0},{"$f":"Y38*AA$20","v":0},{"$f":"L76+L77","v":0},{"$f":"AB38*AC$20","v":0},{"$f":"AB38*AD$20","v":0}]
["Grossed-up PILs",null,null,null,{"$f":"E66","v":0},{"$f":"F66","v":0},null,{"$f":"H66","v":0},{"$f":"I66","v":0},null,{"$f":"K66","v":0},{"$f":"L66","v":0},null,{"$f":"N66","v":0},{"$f":"O66","v":0},null,{"$f":"Q66","v":0},{"$f":"R66","v":0},null,{"$f":"T66","v":0},{"$f":"U66","v":0},null,{"$f":"W66","v":0},{"$f":"X66","v":0},null,{"$f":"Z66","v":0},{"$f":"AA66","v":0},null,{"$f":"AC66","v":0},{"$f":"AD66","v":0}]
[]
["Revenue Requirement",null,null,null,{"$f":"SUM(E35:E39)","v":0},{"$f":"SUM(F35:F39)","v":0},null,{"$f":"SUM(H35:H39)","v":0},{"$f":"SUM(I35:I39)","v":0},null,{"$f":"SUM(K35:K39)","v":0},{"$f":"SUM(L35:L39)","v":0},null,{"$f":"SUM(N35:N39)","v":0},{"$f":"SUM(O35:O39)","v":0},null,{"$f":"SUM(Q35:Q39)","v":0},{"$f":"SUM(R35:R39)","v":0},null,{"$f":"SUM(T35:T39)","v":0},{"$f":"SUM(U35:U39)","v":0},null,{"$f":"SUM(W35:W39)","v":0},{"$f":"SUM(X35:X39)","v":0},null,{"$f":"SUM(Z35:Z39)","v":0},{"$f":"SUM(AA35:AA39)","v":0},null,{"$f":"SUM(AC35:AC39)","v":0},{"$f":"SUM(AD35:AD39)","v":0}]
[]
[]
["Provincial Rate Protection",null,null,null,null,{"$f":"F41","v":0},null,null,{"$f":"I41","v":0},null,null,{"$f":"L41","v":0},null,null,{"$f":"O41","v":0},null,null,{"$f":"R41","v":0},null,null,{"$f":"U41","v":0},null,null,{"$f":"X41","v":0},null,null,{"$f":"AA41","v":0},null,null,{"$f":"AD41","v":0}]
[]
["Monthly Amount Paid by IESO",null,null,null,null,{"$f":"F44/12","v":0},null,null,{"$f":"I44/12","v":0},null,null,{"$f":"L44/12","v":0},null,null,{"$f":"O44/12","v":0},null,null,{"$f":"R44/12","v":0},null,null,{"$f":"U44/12","v":0},null,null,{"$f":"X44/12","v":0},null,null,{"$f":"AA44/12","v":0},null,null,{"$f":"AD44/12","v":0}]
[]
["Note 1: The difference between the actual costs of approved eligible investments and revenue received from the IESO should be recorded in a variance account.  The Board may provide "]
["regulatory accounting guidance regarding a variance account either in an individual proceeding or on a generic basis."]
["Note 2: For the 2016 Test Year, Costs and Revenues of the Direct Benefit are to be included in the test year applicant Rate Base and Revenues."]
[]
["PILs Calculation"]
[null,null,null,null,{"$f":"D18","v":2014},null,null,{"$f":"G18","v":2015},null,null,{"$f":"J18","v":2016},null,null,{"$f":"M18","v":2017},null,null,{"$f":"P18","v":"2018 Test Year"},null,null,{"$f":"S18","v":2019},null,null,{"$f":"V18","v":2020},null,null,{"$f":"Y18","v":2021},null,null,{"$f":"AB18","v":2022}]
["Income Tax",null,null,null,"Direct Benefit","Provincial",null,"Direct Benefit","Provincial",null,"Direct Benefit","Provincial",null,"Direct Benefit","Provincial",null,"Direct Benefit","Provincial",null,"Direct Benefit","Provincial",null,"Direct Benefit","Provincial",null,"Direct Benefit","Provincial",null,"Direct Benefit","Provincial"]
[null,null,null,null,null,null,null,null,null,null,null,null,null,null,null,null,null,null,null,null,null,"Total",null,null,"Total",null,null,"Total"]
["Net Income - ROE on Rate Base",null,null,null,{"$f":"E34","v":0},{"$f":"F34","v":0},null,{"$f":"H34","v":0},{"$f":"I34","v":0},null,{"$f":"K34","v":0},{"$f":"L34","v":0},null,{"$f":"N34","v":0},{"$f":"O34","v":0},null,{"$f":"Q34","v":0},{"$f":"R34","v":0},null,{"$f":"T34","v":0},{"$f":"U34","v":0},null,{"$f":"W34","v":0},{"$f":"X34","v":0},null,{"$f":"Z34","v":0},{"$f":"AA34","v":0},null,{"$f":"AC34","v":0},{"$f":"AD34","v":0}]
["Amortization (17% DB and 83% P)",null,null,null,{"$f":"E38","v":0},{"$f":"F38","v":0},null,{"$f":"H38","v":0},{"$f":"I38","v":0},null,{"$f":"K38","v":0},{"$f":"L38","v":0},null,{"$f":"N38","v":0},{"$f":"O38","v":0},null,{"$f":"Q38","v":0},{"$f":"R38","v":0},null,{"$f":"T38","v":0},{"$f":"U38","v":0},null,{"$f":"W38","v":0},{"$f":"X38","v":0},null,{"$f":"Z38","v":0},{"$f":"AA38","v":0},null,{"$f":"AC38","v":0},{"$f":"AD38","v":0}]
["CCA (17% DB and 83% P)",null,null,null,{"$f":"-D94*E$20","v":0},{"$f":"-D94*F$20","v":0},null,{"$f":"-E94*H$20","v":0},{"$f":"-E94*I$20","v":0},null,{"$f":"-F94*K$20","v":0},{"$f":"-F94*L$20","v":0},null,{"$f":"-G94*N$20","v":0},{"$f":"-G94*O$20","v":0},null,{"$f":"-H94*Q$20","v":0},{"$f":"-H94*R$20","v":0},null,{"$f":"-I94*T$20","v":0},{"$f":"-I94*U$20","v":0},null,{"$f":"-J94*W$20","v":0},{"$f":"-J94*X$20","v":0},null,{"$f":"-K94*Z$20","v":0},{"$f":"-K94*AA$20","v":0},null,{"$f":"-L94*AC$20","v":0},{"$f":"-L94*AD$20","v":0}]
["Taxable income",null,null,null,{"$f":"SUM(E56:E58)","v":0},{"$f":"SUM(F56:F58)","v":0},null,{"$f":"SUM(H56:H58)","v":0},{"$f":"SUM(I56:I58)","v":0},null,{"$f":"SUM(K56:K58)","v":0},{"$f":"SUM(L56:L58)","v":0},null,{"$f":"SUM(N56:N58)","v":0},{"$f":"SUM(O56:O58)","v":0},null,{"$f":"SUM(Q56:Q58)","v":0},{"$f":"SUM(R56:R58)","v":0},null,{"$f":"SUM(T56:T58)","v":0},{"$f":"SUM(U56:U58)","v":0},null,{"$f":"SUM(W56:W58)","v":0},{"$f":"SUM(X56:X58)","v":0},null,{"$f":"SUM(Z56:Z58)","v":0},{"$f":"SUM(AA56:AA58)","v":0},null,{"$f":"SUM(AC56:AC58)","v":0},{"$f":"SUM(AD56:AD58)","v":0}]
[]
["Tax Rate  (to be entered)"]
[]
["Income Taxes Payable",null,null,null,{"$f":"E59*E61","v":0},{"$f":"F59*F61","v":0},null,{"$f":"H59*H61","v":0},{"$f":"I59*I61","v":0},null,{"$f":"K59*K61","v":0},{"$f":"L59*L61","v":0},null,{"$f":"N59*N61","v":0},{"$f":"O59*O61","v":0},null,{"$f":"Q59*Q61","v":0},{"$f":"R59*R61","v":0},null,{"$f":"T59*T61","v":0},{"$f":"U59*U61","v":0},null,{"$f":"W59*W61","v":0},{"$f":"X59*X61","v":0},null,{"$f":"Z59*Z61","v":0},{"$f":"AA59*AA61","v":0},null,{"$f":"AC59*AC61","v":0},{"$f":"AD59*AD61","v":0}]
["Gross Up"]
["Income Taxes Payable",null,null,null,{"$f":"E63/(1-E61)","v":0},{"$f":"F63/(1-F61)","v":0},null,{"$f":"H63/(1-H61)","v":0},{"$f":"I63/(1-I61)","v":0},null,{"$f":"K63/(1-K61)","v":0},{"$f":"L63/(1-L61)","v":0},null,{"$f":"N63/(1-N61)","v":0},{"$f":"O63/(1-O61)","v":0},null,{"$f":"Q63/(1-Q61)","v":0},{"$f":"R63/(1-R61)","v":0},null,{"$f":"T63/(1-T61)","v":0},{"$f":"U63/(1-U61)","v":0},null,{"$f":"W63/(1-W61)","v":0},{"$f":"X63/(1-X61)","v":0},null,{"$f":"Z63/(1-Z61)","v":0},{"$f":"AA63/(1-AA61)","v":0},null,{"$f":"AC63/(1-AC61)","v":0},{"$f":"AD63/(1-AD61)","v":0}]
["Grossed Up PILs",null,null,null,{"$f":"SUM(E65:E65)","v":0},{"$f":"SUM(F65:F65)","v":0},null,{"$f":"SUM(H65:H65)","v":0},{"$f":"SUM(I65:I65)","v":0},null,{"$f":"SUM(K65:K65)","v":0},{"$f":"SUM(L65:L65)","v":0},null,{"$f":"SUM(N65:N65)","v":0},{"$f":"SUM(O65:O65)","v":0},null,{"$f":"SUM(Q65:Q65)","v":0},{"$f":"SUM(R65:R65)","v":0},null,{"$f":"SUM(T65:T65)","v":0},{"$f":"SUM(U65:U65)","v":0},null,{"$f":"SUM(W65:W65)","v":0},{"$f":"SUM(X65:X65)","v":0},null,{"$f":"SUM(Z65:Z65)","v":0},{"$f":"SUM(AA65:AA65)","v":0},null,{"$f":"SUM(AC65:AC65)","v":0},{"$f":"SUM(AD65:AD65)","v":0}]
[]
[]
["Net Fixed Assets",null,null,2011,2012,2013,2014,2015,2016,2017,2018,2019]
[null,"Enter applicable amortization in years:",25]
["Opening Gross Fixed Assets",null,null,null,{"$f":"D73","v":0},0,0,0,0,0,0,0]
["Gross Capital Additions",null,null,{"$f":"'App.2-FA Proposed REG Invest.'!C99","v":0},{"$f":"'App.2-FA Proposed REG Invest.'!D99","v":0},{"$f":"'App.2-FA Proposed REG Invest.'!E99","v":0},{"$f":"'App.2-FA Proposed REG Invest.'!F99","v":0},{"$f":"'App.2-FA Proposed REG Invest.'!G99","v":0},{"$f":"'App.2-FA Proposed REG Invest.'!H99","v":0},{"$f":"'App.2-FA Proposed REG Invest.'!I99","v":0},{"$f":"'App.2-FA Proposed REG Invest.'!J99","v":0},{"$f":"'App.2-FA Proposed REG Invest.'!K99","v":0}]
["Closing Gross Fixed Assets",null,null,{"$f":"SUM(D71:D72)","v":0},0,0,0,0,0,0,0,0]
[]
["Opening Accumulated Amortization",null,null,null,{"$f":"+D78","v":0},{"$f":"E78","v":0},0,{"$f":"G78","v":0},{"$f":"H78","v":0},{"$f":"I78","v":0},{"$f":"J78","v":0},{"$f":"K78","v":0}]
["Current Year Amortization (before additions)",null,null,null,{"$f":"IF(ISERROR(E71/$C$70), 0, E71/$C$70)","v":0},0,0,{"$f":"H71/$C$70","v":0},{"$f":"I71/$C$70","v":0},{"$f":"J71/$C$70","v":0},{"$f":"K71/$C$70","v":0},{"$f":"L71/$C$70","v":0}]
["Additions (half year)",null,null,{"$f":"D72/C70/2","v":0},{"$f":"E72/C70/2","v":0},{"$f":"F72/C70/2","v":0},{"$f":"G72/C70/2","v":0},{"$f":"H72/C70/2","v":0},{"$f":"I72/C70/2","v":0},{"$f":"J72/C70/2","v":0},{"$f":"K72/C70/2","v":0},{"$f":"L72/C70/2","v":0}]
["Closing Accumulated Amortization",null,null,{"$f":"SUM(D75+D77)","v":0},{"$f":"SUM(E75:E77)","v":0},0,0,0,0,0,0,0]
[]
["Opening Net Fixed Assets",null,null,{"$f":"D71-D75","v":0},{"$f":"E71-E75","v":0},{"$f":"F71-F75","v":0},{"$f":"G71-G75","v":0},{"$f":"G81","v":0},{"$f":"H81","v":0},{"$f":"I81","v":0},{"$f":"J81","v":0},{"$f":"K81","v":0}]
["Closing Net Fixed Assets",null,null,{"$f":"D73-D78","v":0},0,0,0,0,0,0,0,0]
["Average Net Fixed Assets",null,null,{"$f":"SUM(D80:D81)/2","v":0},0,0,0,0,0,0,0,0]
[]
["UCC for PILs Calculation"]
[null,null,null,2014,2014,2014,2014,2015,2016,2017,2018,2019]
[]
["Opening UCC",null,null,null,{"$f":"D95","v":0},0,0,0,0,0,0,0]
["Capital Additions (from Appendix 2-FA)",null,null,{"$f":"D72","v":0},0,0,0,0,0,0,0,0]
["UCC Before Half Year Rule",null,null,{"$f":"SUM(D87:D88)","v":0},0,0,0,0,0,0,0,0]
["Half Year Rule (1/2 Additions - Disposals)",null,null,{"$f":"D88/2","v":0},0,0,0,0,0,0,0,0]
["Reduced UCC",null,null,{"$f":"D89-D90","v":0},0,0,0,0,0,0,0,0]
["CCA Rate Class (to be entered)",null,47,{"$f":"$C$92","v":47},{"$f":"$C$92","v":47},47,47,47,47,47,47,47]
["CCA Rate  (to be entered)",null,0.08,{"$f":"$C$93","v":0.08},{"$f":"$C$93","v":0.08},0.08,0.08,0.08,0.08,0.08,0.08,0.08]
["CCA",null,null,{"$f":"D91*D$93","v":0},{"$f":"E91*E$93","v":0},{"$f":"F91*F$93","v":0},{"$f":"G91*G$93","v":0},{"$f":"H91*H$93","v":0},0,0,0,0]
["Closing UCC",null,null,{"$f":"D89-D94","v":0},0,0,0,0,0,0,0,0]

{"sheet":"App.2-G SQI","index":26,"n_rows":41,"n_cols":16,"rows_kept":41,"cut":false,"hidden":false,"merged":[[21,6,21,9],[14,0,15,0],[14,1,14,5],[14,6,14,10],[0,14,0,15],[1,14,1,15],[2,14,2,15],[3,14,3,15],[4,14,4,15],[28,0,28,3],[6,14,6,15],[14,11,14,15],[20,11,20,14],[21,11,21,14],[19,0,19,15],[8,0,8,15],[9,0,9,15],[10,0,10,15],[12,0,12,15],[20,1,20,4],[20,6,20,9],[23,0,23,10],[24,0,24,10],[26,0,26,10],[21,1,21,4],[32,4,32,5],[33,4,33,5],[34,4,34,5],[28,4,28,5],[29,4,29,5],[30,4,30,5],[31,4,31,5],[34,0,34,3],[35,0,35,3],[36,0,36,3],[37,0,37,3],[38,0,38,3],[29,0,29,3],[30,0,30,3],[31,0,31,3],[32,0,32,3],[33,0,33,3],[40,0,40,3],[35,4,35,5],[36,4,36,5],[40,4,40,5],[37,4,37,5],[38,4,38,5],[39,4,39,5],[39,0,39,3]]}
[null,null,null,null,null,null,null,null,null,null,null,null,"File Number:",null,{"$f":"EBNUMBER","v":0}]
[null,null,null,null,null,null,null,null,null,null,null,null,"Exhibit:"]
[null,null,null,null,null,null,null,null,null,null,null,null,"Tab:"]
[null,null,null,null,null,null,null,null,null,null,null,null,"Schedule:"]
[null,null,null,null,null,null,null,null,null,null,null,null,"Page:"]
[]
[null,null,null,null,null,null,null,null,null,null,null,null,"Date:"]
[]
["Appendix 2-G"]
["Service Reliability and Quality Indicators"]
["2011 - 2015"]
[]
["Service Reliability"]
[]
["Index","Including outages caused by loss of supply",null,null,null,null,"Excluding outages caused by loss of supply",null,null,null,null,"Excluding Major Event Days"]
[null,{"$f":"TestYear-6","v":2012},{"$f":"TestYear-5","v":2013},{"$f":"TestYear-4","v":2014},{"$f":"TestYear-3","v":2015},{"$f":"TestYear-2","v":2016},{"$f":"B16","v":2012},2013,2014,2015,2016,2012,2013,2014,2015,2016]
["SAIDI ",3.08,1.54,0.01,0.03,125.59,0.08,0.04,0.01,0.03,0.37,0.08,0.04,0.01,0.03,0.37]
["SAIFI",1.02,1.02,1.1399999999999999,0.01,26.24,0.02,0.02,0.13,0.01,2.0699999999999998,0.02,0.02,0.13,0.01,2.0699999999999998]
[]
["5 Year Historical Average"]
["SAIDI ",null,null,null,null,{"$f":"IF(ISERROR(AVERAGE(B17:F17)), \"\", AVERAGE(B17:F17))","v":26.05},null,null,null,null,{"$f":"IF(ISERROR(AVERAGE(G17:K17)), \"\", AVERAGE(G17:K17))","v":0.10600000000000001},null,null,null,null,{"$f":"IF(ISERROR(AVERAGE(L17:P17)), \"\", AVERAGE(L17:P17))","v":0.10600000000000001}]
["SAIFI",null,null,null,null,{"$f":"IF(ISERROR(AVERAGE(B18:F18)), \"\", AVERAGE(B18:F18))","v":5.8860000000000001},null,null,null,null,{"$f":"IF(ISERROR(AVERAGE(G18:K18)), \"\", AVERAGE(G18:K18))","v":0.45},null,null,null,null,{"$f":"IF(ISERROR(AVERAGE(L18:P18)), \"\", AVERAGE(L18:P18))","v":0.45}]
[]
["SAIDI = System Average Interruption Duration Index"]
["SAIFI = System Average Interruption Frequency Index "]
[]
["Service Quality"]
[]
["Indicator",null,null,null,"OEB Minimum Standard",null,{"$f":"B16","v":2012},{"$f":"C16","v":2013},{"$f":"D16","v":2014},{"$f":"E16","v":2015},{"$f":"F16","v":2016}]
["Low Voltage Connections",null,null,null,0.9,null,1,1,1,0.90500000000000003,1]
["High Voltage Connections",null,null,null,0.9,null,"n/a","n/a","n/a","n/a","n/a"]
["Appointment Scheduling",null,null,null,0.65,null,1,1,1,1,1]
["Appointments Met",null,null,null,0.9,null,1,1,1,1,1]
["Telephone Accessibility",null,null,null,0.8,null,0.96,0.97,0.97599999999999998,0.92800000000000005,0.95199999999999996]
["Rescheduling a Missed Appointment",null,null,null,0.8,null,"n/a","n/a","n/a","n/a","n/a"]
["Telephone Call Abandon Rate",null,null,null,0.1,null,0.04,0.03,2.4E-2,7.1999999999999995E-2,4.8000000000000001E-2]
["Written Response to Enquires",null,null,null,0.8,null,1,1,1,0.91400000000000003,1]
["Emergency Urban Response",null,null,null,0.9,null,1,1,1,0.88900000000000001,1]
["Emergency Rural Response",null,null,null,1,null,"n/a","n/a","n/a","n/a","n/a"]
["Reconnection Performance Standard",null,null,null,0.85,null,0.93,0,0,1,1]
["Micro-embedded generation facilities",null,null,null,0.9,null,"n/a",1,1,1,1]

{"sheet":"App.2-H_Other_Oper_Rev","index":27,"n_rows":63,"n_cols":17,"rows_kept":63,"cut":false,"hidden":false,"merged":[[42,0,42,7],[8,0,8,7],[9,0,9,7],[37,2,37,7],[38,2,39,7],[35,0,35,1],[36,0,36,1],[37,0,37,1],[38,0,38,1],[68,1,68,7],[66,1,66,7],[67,1,67,7],[52,0,52,1],[45,0,46,7],[51,0,51,1],[57,0,57,1],[53,0,53,1],[54,0,54,1],[55,0,55,1],[56,0,56,1],[62,1,62,7],[49,0,49,1]]}
[null,null,null,null,null,null,"File Number:",{"$f":"EBNUMBER","v":0}]
[null,null,null,null,null,null,"Exhibit:"]
[null,null,null,null,null,null,"Tab:"]
[null,null,null,null,null,null,"Schedule:"]
[null,null,null,null,null,null,"Page:"]
[]
[null,null,null,null,null,null,"Date:"]
[]
["Appendix 2-H"]
["Other Operating Revenue"]
[]
[null,null,2014,2014,"Var",2014,2015,"Var",2015,2016,"Var",2016,2017,"Var",2017,2018,"Var"]
[null,"USoA Description","Board Approved"]
[4235,"4235-Miscellaneous Service Revenues\n",-14200,-14580,{"$f":"D14-C14","v":-380},{"$f":"D14","v":-14580},-16185,{"$f":"G14-F14","v":-1605},{"$f":"G14","v":-16185},-18595,{"$f":"J14-I14","v":-2410},{"$f":"J14","v":-18595},-19721.2,{"$f":"M14-L14","v":-1126.2000000000007},{"$f":"M14","v":-19721.2},-20041.2,{"$f":"P14-O14","v":-320}]
[4225,"4225-Late Payment Charges\n",-6000,-7963.1399999999994,{"$f":"D15-C15","v":-1963.1399999999994},-7963.1399999999994,-9946.1299999999992,{"$f":"G15-F15","v":-1982.9899999999998},-9946.1299999999992,-11282.8,{"$f":"J15-I15","v":-1336.67},-11282.8,-11320,{"$f":"M15-L15","v":-37.200000000000728},-11320,-11400,{"$f":"P15-O15","v":-80}]
[{"$f":"LEFT(B16,4)","v":"4082"},"4082-Retail Services Revenues\n",-4130,-3343.2,786.80000000000018,-3343.2,-3397.6,-54.400000000000091,-3397.6,-3151.2,246.40000000000009,-3151.2,-3238.5,-87.300000000000182,-3238.5,-3245,-6.5]
["4084","4084-Service Transaction Requests (STR) Revenues\n",13,-1.75,-14.75,-1.75,-2.25,-0.5,-2.25,-7.75,-5.5,-7.75,-8.75,-1,-8.75,-10,-1.25]
["4210","4210-Rent from Electric Property\n",0,-6561.26,-6561.26,-6561.26,-5917.42,643.84000000000015,-5917.42,-6451.64,-534.22000000000025,-6451.64,-6481.5,-29.859999999999673,-6481.5,-6593.25,-111.75]
["4240","4240-Provision for Rate Refunds\n",0,21935,21935,21935,20000,-1935,20000,20000,0,20000,20000,0,20000,20000,0]
["4245","4245-Government Assistance Directly Credited to Income\n",0,0,0,0,0,0,0,0,0,0,0,0,0,0,0]
["",null,-6000,0,6000,0,0,0,0,0,0,0,0,0,0,0,0]
["4375","4375-Revenues from Non-Utility Operations\n",0,-31129.1,-31129.1,-31129.1,-9347.0400000000009,21782.059999999998,-9347.0400000000009,-3214.85,6132.1900000000005,-3214.85,-75000,-71785.149999999994,-75000,-30000,45000]
["4380","4380-Expenses of Non-Utility Operations\n",0,21859,21859,21859,0,-21859,0,3214.85,3214.85,3214.85,75000,71785.149999999994,75000,30000,-45000]
["4390","4390-Miscellaneous Non-Operating Income\n",0,0,0,0,-7443.44,-7443.44,-7443.44,-12330.66,-4887.22,-12330.66,-5000,7330.66,-5000,-5500,-500]
["4405","4405-Interest and Dividend Income\n",0,-28722.65,-28722.65,-28722.65,-23485.64,5237.010000000002,-23485.64,-22160.59,1325.0499999999993,-22160.59,-11000,11160.59,-11000,-2000,9000]
[null,"Total",{"$f":"SUM(C14:C21)+SUM(C22:C25)","v":-30317},{"$f":"SUM(D14:D21)+SUM(D22:D25)","v":-48507.1},-18190.099999999999,{"$f":"SUM(F14:F21)+SUM(F22:F25)","v":-48507.1},{"$f":"SUM(G14:G21)+SUM(G22:G25)","v":-55724.51999999999},-7217.419999999991,{"$f":"SUM(I14:I21)+SUM(I22:I25)","v":-55724.51999999999},{"$f":"SUM(J14:J21)+SUM(J22:J25)","v":-53979.64},1744.8799999999901,{"$f":"SUM(L14:L21)+SUM(L22:L25)","v":-53979.64},{"$f":"SUM(M14:M21)+SUM(M22:M25)","v":-36769.949999999997},17209.690000000002,{"$f":"SUM(O14:O21)+SUM(O22:O25)","v":-36769.949999999997},{"$f":"SUM(P14:P21)+SUM(P22:P25)","v":-28789.449999999997},7980.5]
[]
[null,"Specific Service Charges",{"$f":"C14","v":-14200},{"$f":"D14","v":-14580},{"$f":"D28-C28","v":-380},{"$f":"F14","v":-14580},{"$f":"G14","v":-16185},{"$f":"G28-F28","v":-1605},{"$f":"I14","v":-16185},{"$f":"J14","v":-18595},{"$f":"J28-I28","v":-2410},{"$f":"L14","v":-18595},{"$f":"M14","v":-19721.2},{"$f":"M28-L28","v":-1126.2000000000007},{"$f":"O14","v":-19721.2},{"$f":"P14","v":-20041.2},{"$f":"P28-O28","v":-320}]
[null,"Late Payment Charges",{"$f":"C15","v":-6000},{"$f":"D15","v":-7963.1399999999994},{"$f":"D29-C29","v":-1963.1399999999994},{"$f":"F15","v":-7963.1399999999994},{"$f":"G15","v":-9946.1299999999992},{"$f":"G29-F29","v":-1982.9899999999998},{"$f":"I15","v":-9946.1299999999992},{"$f":"J15","v":-11282.8},{"$f":"J29-I29","v":-1336.67},{"$f":"L15","v":-11282.8},{"$f":"M15","v":-11320},{"$f":"M29-L29","v":-37.200000000000728},{"$f":"O15","v":-11320},{"$f":"P15","v":-11400},{"$f":"P29-O29","v":-80}]
[null,"Other Distribution/Operating Revenues",{"$f":"SUM(C16:C20)","v":-4117},{"$f":"SUM(D16:D20)","v":12028.79},{"$f":"D30-C30","v":16145.79},{"$f":"SUM(F16:F20)","v":12028.79},{"$f":"SUM(G16:G20)","v":10682.73},{"$f":"G30-F30","v":-1346.0600000000013},{"$f":"SUM(I16:I20)","v":10682.73},{"$f":"SUM(J16:J20)","v":10389.41},{"$f":"J30-I30","v":-293.31999999999971},{"$f":"SUM(L16:L20)","v":10389.41},{"$f":"SUM(M16:M20)","v":10271.25},{"$f":"M30-L30","v":-118.15999999999985},{"$f":"SUM(O16:O20)","v":10271.25},{"$f":"SUM(P16:P20)","v":10151.75},{"$f":"P30-O30","v":-119.5}]
[null,"Other Income or Deductions",{"$f":"SUM(C22:C25)","v":0},{"$f":"SUM(D22:D25)","v":-37992.75},{"$f":"D31-C31","v":-37992.75},{"$f":"SUM(F22:F25)","v":-37992.75},{"$f":"SUM(G22:G25)","v":-40276.119999999995},{"$f":"G31-F31","v":-2283.3699999999953},{"$f":"SUM(I22:I25)","v":-40276.119999999995},{"$f":"SUM(J22:J25)","v":-34491.25},{"$f":"J31-I31","v":5784.8699999999953},{"$f":"SUM(L22:L25)","v":-34491.25},{"$f":"SUM(M22:M25)","v":-16000},{"$f":"M31-L31","v":18491.25},{"$f":"SUM(O22:O25)","v":-16000},{"$f":"SUM(P22:P25)","v":-7500},{"$f":"P31-O31","v":8500}]
[null,"Total",{"$f":"SUM(C28:C31)","v":-24317},{"$f":"SUM(D28:D31)","v":-48507.1},{"$f":"D32-C32","v":-24190.1},{"$f":"D32","v":-48507.1},{"$f":"SUM(G28:G31)","v":-55724.51999999999},{"$f":"G32-F32","v":-7217.419999999991},{"$f":"G32","v":-55724.51999999999},{"$f":"SUM(J28:J31)","v":-53979.64},{"$f":"J32-I32","v":1744.8799999999901},{"$f":"J32","v":-53979.64},{"$f":"SUM(M28:M31)","v":-36769.949999999997},{"$f":"M32-L32","v":17209.690000000002},{"$f":"M32","v":-36769.949999999997},{"$f":"SUM(P28:P31)","v":-28789.45},{"$f":"P32-O32","v":7980.4999999999964}]
[]
[]
["Description",null,"Account(s)"]
["Specific Service Charges:",null,4235]
["Late Payment Charges:",null,4225]
["Other Distribution Revenues:",null,"4080, 4082, 4084, 4090, 4205, 4210, 4215, 4220, 4240, 4245"]
["Other Income and Expenses:",null,"4305, 4310, 4315, 4320, 4325, 4330, 4335, 4340, 4345, 4350, 4355, 4360, 4365, 4370, 4375, 4380, 4385, 4390, 4395, 4398, 4405, 4415"]
[]
[]
["Note: Add all applicable accounts listed above to the table and include all relevant information."]
[]
["Account Breakdown Details"]
[]
["For each \"Other Operating Revenue\" and \"Other Income or Deductions\" Account, a detailed breakdown of the account components is required.  See the example below for Account 4405, Interest and Dividend Income."]
[]
[]
["Account 4405 - Interest and Dividend Income"]
["Total from Trial Balance",null,{"$f":"C25","v":0},{"$f":"D25","v":-28722.65},{"$f":"G25","v":-23485.64},{"$f":"J25","v":-22160.59},{"$f":"O25","v":-11000},{"$f":"P25","v":-2000}]
[null,null,"2014 BA",2014,2015,2016,2017,2018]
["Reporting Basis",null,"NewCGAAP","MIFRS","MIFRS","MIFRS","MIFRS","MIFRS"]
["Short-term Investment Interest"]
["Bank Deposit Interest"]
["Miscellaneous Interest Revenue"]
["etc.1"]
[]
["Total",null,{"$f":"SUM(C53:C57)","v":0},{"$f":"SUM(D53:D57)","v":0},0,0,0,0]
["Difference between 2.1.7 and total",null,null,{"$f":"D50-D58","v":-28722.65},{"$f":"E50-E58","v":-23485.64},-22160.59,-11000,-2000]
[]
["Notes:"]
[1,"List and specify any other interest revenue."]
[2,"In the transition year to IFRS, the applicant is to present information in both MIFRS and CGAAP.  For the typical applicant that adopted IFRS on January 1, 2015, 2014 must be presented in both a CGAAP and MIFRS basis."]

{"sheet":"App_2-I LF_CDM","index":28,"n_rows":60,"n_cols":10,"rows_kept":60,"cut":false,"hidden":false,"merged":[[4,0,4,5],[22,0,22,7],[5,0,5,5],[23,0,23,7],[50,0,50,9],[6,0,6,5],[24,0,24,7],[13,0,13,5],[34,0,34,7],[44,0,44,6]]}
[]
["NOTE: REVISED CALCULATIONS IN THIS TABLE WERE DONE BY KEITH RICHIE FROM THE OEB AFTER THE TABLES WERE FOUND TO BE INCORRECT FOR 2018 FILERS"]
[]
[]
["2011-2014 CDM Program - 2014, last year of the current CDM plan"]
["4 Year (2011-2014) kWh Target:"]
[1200000]
[null,2011,2012,2013,2014,"Total"]
["2011 CDM Programs",{"$f":"B15/$F$19","v":4.6254071661237788E-2},{"$f":"C15/$F$19","v":4.6254071661237788E-2},{"$f":"D15/$F$19","v":4.6254071661237788E-2},{"$f":"E15/$F$19","v":4.6254071661237788E-2},{"$f":"SUM(B9:E9)","v":0.18501628664495115}]
["2012 CDM Programs",null,{"$f":"C16/$F$19","v":0.14592833876221498},{"$f":"D16/$F$19","v":0.14592833876221498},{"$f":"E16/$F$19","v":0.14332247557003258},{"$f":"SUM(B10:E10)","v":0.43517915309446253}]
["2013 CDM Programs",null,null,{"$f":"D17/$F$19","v":0.14332247557003258},{"$f":"E17/$F$19","v":0.14332247557003258},{"$f":"SUM(B11:E11)","v":0.28664495114006516}]
["2014 CDM Programs",null,null,null,{"$f":"E18/$F$19","v":9.3811074918566772E-2},{"$f":"SUM(B12:E12)","v":9.3811074918566772E-2}]
["Total in Year",{"$f":"SUM(B9:B12)","v":4.6254071661237788E-2},{"$f":"SUM(C9:C12)","v":0.19218241042345277},{"$f":"SUM(D9:D12)","v":0.33550488599348538},{"$f":"SUM(E9:E12)","v":0.42671009771986973},{"$f":"SUM(B13:E13)","v":1.0006514657980456}]
["kWh"]
["2011 CDM Programs",{"$f":"0.071*1000000","v":71000},{"$f":"0.071*1000000","v":71000},{"$f":"0.071*1000000","v":71000},{"$f":"0.071*1000000","v":71000},{"$f":"SUM(B15:E15)","v":284000}]
["2012 CDM Programs",{"$f":"-0.002*1000000","v":-2000},{"$f":"0.224*1000000","v":224000},{"$f":"0.224*1000000","v":224000},{"$f":"0.22*1000000","v":220000},{"$f":"SUM(B16:E16)","v":666000}]
["2013 CDM Programs",0,0,{"$f":"0.22*1000000","v":220000},{"$f":"0.22*1000000","v":220000},{"$f":"SUM(B17:E17)","v":440000}]
["2014 CDM Programs",0,0,{"$f":"0.001*1000000","v":1000},{"$f":"0.144*1000000","v":144000},{"$f":"SUM(B18:E18)","v":145000}]
["Total in Year",{"$f":"SUM(B15:B18)","v":69000},{"$f":"SUM(C15:C18)","v":295000},{"$f":"SUM(D15:D18)","v":516000},{"$f":"SUM(E15:E18)","v":655000},{"$f":"SUM(F15:F18)","v":1535000}]
[]
[]
[]
["2015-2020 CDM Program - 2015, first year of the current CDM plan"]
["6 Year (2015-2020) kWh Target:"]
[1790000]
[null,2015,2016,2017,2018,2019,2020,"Total"]
["%"]
["2015 CDM Programs",{"$f":"B36/$H$42","v":0.96128826815642454},0.96128826815642454,0.96128826815642454,0.96128826815642454,0.96128826815642454,0.88325642458100562,{"$f":"SUM(B28:G28)","v":5.6896977653631282}]
["2016 CDM Programs",null,{"$f":"C37/$H$42","v":2.3348715083798884E-2},{"$f":"D37/$H$42","v":2.3348715083798884E-2},{"$f":"E37/$H$42","v":2.3348715083798884E-2},{"$f":"F37/$H$42","v":2.3348715083798884E-2},{"$f":"G37/$H$42","v":2.3348715083798884E-2},{"$f":"SUM(B29:G29)","v":0.11674357541899441}]
["2017 CDM Programs",null,null,{"$f":"D38/$H$42","v":2.334871508379889E-2},{"$f":"E38/$H$42","v":2.334871508379889E-2},{"$f":"F38/$H$42","v":2.334871508379889E-2},{"$f":"G38/$H$42","v":2.334871508379889E-2},{"$f":"SUM(B30:G30)","v":9.3394860335195562E-2}]
["2018 CDM Programs",null,null,null,{"$f":"E39/$H$42","v":2.3348715083798897E-2},{"$f":"F39/$H$42","v":2.3348715083798897E-2},{"$f":"G39/$H$42","v":2.3348715083798897E-2},{"$f":"SUM(E31:G31)","v":7.0046145251396685E-2}]
["2019 CDM Programs",null,null,null,null,{"$f":"F40/$H$42","v":2.3348715083798897E-2},{"$f":"G40/$H$42","v":2.3348715083798922E-2},{"$f":"SUM(F32:G32)","v":4.6697430167597823E-2}]
["2020 CDM Programs",null,null,null,null,null,{"$f":"G41/$H$42","v":2.3348715083798988E-2},{"$f":"SUM(B33:G33)","v":2.3348715083798988E-2}]
["Total in Year",{"$f":"SUM(B28:B33)","v":0.96128826815642454},{"$f":"SUM(C28:C33)","v":0.98463698324022342},{"$f":"SUM(D28:D33)","v":1.0079856983240223},{"$f":"SUM(E28:E31)","v":1.0313344134078213},{"$f":"SUM(F28:F32)","v":1.0546831284916203},{"$f":"SUM(G28:G33)","v":1},{"$f":"SUM(B34:G34)","v":6.0399284916201115}]
["kWh"]
[{"$f":"A28","v":"2015 CDM Programs"},1720706,{"$f":"B36","v":1720706},{"$f":"C36","v":1720706},{"$f":"D36","v":1720706},{"$f":"E36","v":1720706},1581029,{"$f":"SUM(G36)","v":1581029}]
["2016 CDM Programs",null,{"$f":"D37","v":41794.200000000004},{"$f":"E37","v":41794.200000000004},{"$f":"F37","v":41794.200000000004},{"$f":"G37","v":41794.200000000004},{"$f":"1/5*(A25-H36)","v":41794.200000000004},41794.200000000004]
["2017 CDM Programs",null,null,{"$f":"E38","v":41794.200000000012},{"$f":"F38","v":41794.200000000012},{"$f":"G38","v":41794.200000000012},{"$f":"1/4*(A25-(H36+H37))","v":41794.200000000012},41794.200000000012]
["2018 CDM Programs",null,null,null,{"$f":"F39","v":41794.200000000026},{"$f":"G39","v":41794.200000000026},{"$f":"1/3*(A25-(H37+H38+H36))","v":41794.200000000026},41794.200000000026]
["2019 CDM Programs",null,null,null,null,{"$f":"E39","v":41794.200000000026},{"$f":"1/2*(A25-(H37+H38+H36+H39))","v":41794.20000000007},41794.20000000007]
["2020 CDM Programs",null,null,null,null,null,{"$f":"A25-(H37+H38+H36+H39+H40)","v":41794.200000000186},41794.200000000186]
["Total in Year",{"$f":"SUM(B36:B41)","v":1720706},{"$f":"SUM(C36:C41)","v":1762500.2},{"$f":"SUM(D36:D41)","v":1804294.4},{"$f":"SUM(E36:E39)","v":1846088.5999999999},{"$f":"SUM(F36:F40)","v":1887882.7999999998},{"$f":"SUM(G36:G41)","v":1790000},{"$f":"A25","v":1790000}]
[]
[]
["Weight Factor for Inclusion in CDM Adjustment to 2014 Load Forecast"]
[null,2011,2012,2013,2014,2015,2016,2017,2018]
["Weight Factor for each year's CDM program impact on 2014 load forecast",0,0,0,0,0,0.5,1,0.5,"Distributor can select \"0\", \"0.5\", or \"1\" from drop-down list"]
["Default Value selection rationale.  "]
[]
[]
["2011-2014 and 2015-2020 LRAMVA and 2015 CDM adjustment to Load Forecast"]
[null,2011,2012,2013,2014,2015,2016,2017,2018,"Total for 2018"]
[null,"kWh"]
["Amount used for CDM threshold for LRAMVA (2014)",0,0,{"$f":"E17","v":220000},{"$f":"E18","v":144000},{"$f":"E36","v":1720706},null,null,null,{"$f":"SUM(D54:I54)","v":2084706}]
[]
["2011 CDM adjustment (per Board Decision in 2011 Cost of Service Application)",0,{"$f":"B56","v":0},{"$f":"B56","v":0},{"$f":"B56","v":0},null,{"$f":"SUM(B56:E57)","v":0}]
[]
["Amount used for CDM threshold for LRAMVA (2015)",null,null,null,null,null,{"$f":"E37","v":41794.200000000004},{"$f":"E38","v":41794.200000000012},{"$f":"E39","v":41794.200000000026},{"$f":"SUM(F58:I58)","v":125382.60000000005}]
[]
["Manual Adjustment for 2015 Load Forecast (billed basis)",0,null,null,null,{"$f":"F58*F47","v":0},{"$f":"G58*G47","v":20897.100000000002},{"$f":"H58*H47","v":41794.200000000012},{"$f":"I58*I47","v":20897.100000000013},{"$f":"SUM(F60:I60)","v":83588.400000000023}]

{"sheet":"App.2-IA_Load_Forecast_Instrct","index":29,"n_rows":45,"n_cols":18,"rows_kept":45,"cut":false,"hidden":false,"merged":[[24,1,24,17],[26,1,26,17],[43,2,43,17],[44,2,44,17],[28,8,28,10],[28,12,28,14],[29,13,29,14],[29,9,29,10],[41,2,41,17],[42,2,42,17],[28,16,28,17],[9,1,9,17],[8,1,8,17],[18,1,18,17],[20,1,20,17],[22,1,22,17]]}
[null,null,null,null,null,null,null,null,null,null,null,null,null,null,null,null,"File Number:",{"$f":"EBNUMBER","v":0}]
[null,null,null,null,null,null,null,null,null,null,null,null,null,null,null,null,"Exhibit:"]
[null,null,null,null,null,null,null,null,null,null,null,null,null,null,null,null,"Tab:"]
[null,null,null,null,null,null,null,null,null,null,null,null,null,null,null,null,"Schedule:"]
[null,null,null,null,null,null,null,null,null,null,null,null,null,null,null,null,"Page:"]
[]
[null,null,null,null,null,null,null,null,null,null,null,null,null,null,null,null,"Date:"]
[]
[null,"Appendix 2-IA"]
[null,"Instructions on Customer, Connections, Load Forecast and Revenues Data and Analysis"]
[]
[null,"This sheet requires no inputs, but serves as a summary of the hiostorical and forecasted data to be provided with respect to:"]
[]
[null,"1)","Customers and connections"]
[null,"2)","Consumption (kWh)"]
[null,"3)","Demand (kW or kCA) for applicable demand-billed customer classes"]
[null,"4)","Revenues"]
[]
[null,"The spreadsheet summarizes the data provided and the analyses (variance or year-over-year) that are required. Data are required to be provided on a customer class level. Consumption (kWh) must also be provided on a total distribution system level."]
[]
[null,"Appendix 2-IB (formerly 2-IA) is the appendix spreadsheet that the distributor populates, and the spreadsheet is laid out for inputting the necessary data. The spreadsheet also calculates necessary statistics such as average consumption per customer/connection per year, and variances and % annual changes, as necessary."]
[]
[null,"The distributor is required to provide suitable documentation in Exhibit 3 of its Application, in accordance with section 2.3.2 of Chaoter 2 of the Filing Requirements. This would include explanations for material variations or of trends in the data."]
[]
[null,"The distributor is also required to input its test year customer/connection and load forecast in Sheet 10 - Load Forecast of the Revenue Requirement Work Form. This sheet should also be updated to reflect changes in the load forecast made through the stages of processing of the rates application."]
[]
[null,"The applicant must demonstrate the historical accuracy of its load forecast approach for at least the past 5 years. Such analysis will cover both customer/connections and consumption (kWh) and demand (kW or kVA) by providing the following, as shown in the following table:"]
[]
[null,null,null,"Calendar Year",null,"Customers / Connections",null,null,"Consumption (kWh) (3)",null,null,null,"Demand (kW or kVA)",null,null,null,"Revenues"]
[null,null,null,"(for 2017 Cost of Service)",null,null,null,null,"Weather-actual","Weather-normalized",null,null,"Weather-actual","Weather-normalized",null,null,"Weather-actual","Weather-normalized"]
[null,null,"Historical",2012,null,2384,null,null,30091478.346228234,30243327.409775119,null,null,13489,13489]
[null,null,"Historical",2013,null,2388,null,null,30301350.396518376,30138225.78876619,null,null,13642,13642,null,null,769895]
[null,null,"Historical",2014,null,2397.5,"Board-approved (2)",null,30157452.240000002,30476269.162412532,"Board-approved (2)",null,13217,19738,"Board-approved (2)",null,792808.4761999998]
[null,null,"Historical",2015,null,2471,null,null,29896471.900000002,30222148.144213807,null,null,13288,13288,null,null,792971.20079999999]
[null,null,"Historical",2016,null,2622.5,null,null,29672838.790000003,31427034.153894901,null,null,12978,12978,null,null,829111.68460000004]
[null,null,"Bridge Year (Forecast)",2017,null,2751.4531507187403,null,null,null,30047092.145880107,null,null,null,13290.709899802026,null,null,null,820815.34231596917]
[null,null,"Test Year (Forecast)",2018,null,2828.0981433098127,null,null,null,29963503.745880112,null,null,null,13339.320805544068,null,null,null,1107885.2613482226]
[]
[]
[null,"Notes:"]
[]
[null,"(1)","“Weather-normalized actuals” are estimated by replacing the actual weather-related values (typically Heating Degree Days (HDD) and Cooling Degree Days (CDD)) by the “typical” or “weather-normalized” values. These “weather-normalized HDD and CDD values would be the same as used to estimate the Bridge Year and Test Year forecasts."]
[null,"(2)","For 2017 Cost of Service rebasers, the typical situation is that 2013 would have been the most recent cost of service rebasing application. If the most recent rebasing application was for a rate year other than 2013, that year should be used. An applicant must provide historical information back to the greater of: a) at least five (5) historical actual years; or b) to its last cost of service application."]
[null,"(3)","Consumption must be provided on a total distribution system basis as well as at a customer class level."]
[null,"(4)","Revenues exclude commodity charges."]

{"sheet":"App.2-IB_Load_Forecast_Analysis","index":30,"n_rows":277,"n_cols":21,"rows_kept":277,"cut":false,"hidden":false,"merged":[[231,3,231,5],[233,5,233,8],[233,10,233,14],[233,16,233,20],[234,5,234,7],[255,5,255,7],[264,11,264,12],[264,17,264,18],[243,11,243,12],[243,17,243,18],[254,5,254,8],[254,10,254,14],[254,16,254,20],[26,1,26,21],[60,10,60,14],[60,16,60,20],[36,10,36,14],[37,5,37,7],[28,1,28,21],[58,3,58,5],[60,5,60,8],[46,11,46,12],[24,1,24,21],[8,1,8,21],[9,1,9,21],[18,1,18,21],[20,1,20,21],[22,1,22,21],[123,5,123,8],[123,10,123,14],[123,16,123,20],[61,5,61,7],[102,16,102,20],[103,5,103,7],[70,11,70,12],[80,10,80,14],[70,17,70,18],[100,3,100,5],[102,5,102,8],[102,10,102,14],[112,11,112,12],[146,5,146,7],[155,11,155,12],[155,17,155,18],[90,11,90,12],[80,5,80,8],[81,5,81,7],[133,11,133,12],[133,17,133,18],[143,3,143,5],[145,5,145,8],[145,10,145,14],[145,16,145,20],[80,16,80,20],[90,17,90,18],[124,5,124,7],[112,17,112,18],[165,5,165,8],[165,10,165,14],[165,16,165,20],[166,5,166,7],[186,3,186,5],[175,17,175,18],[175,11,175,12],[209,5,209,7],[218,11,218,12],[218,17,218,18],[189,5,189,7],[198,11,198,12],[198,17,198,18],[208,5,208,8],[208,10,208,14],[208,16,208,20],[188,5,188,8],[188,10,188,14],[188,16,188,20]]}
[null,null,null,null,null,null,null,null,null,null,null,null,null,null,null,null,null,null,null,"File Number:",{"$f":"EBNUMBER","v":0}]
[null,null,null,null,null,null,null,null,null,null,null,null,null,null,null,null,null,null,null,"Exhibit:"]
[null,null,null,null,null,null,null,null,null,null,null,null,null,null,null,null,null,null,null,"Tab:"]
[null,null,null,null,null,null,null,null,null,null,null,null,null,null,null,null,null,null,null,"Schedule:"]
[null,null,null,null,null,null,null,null,null,null,null,null,null,null,null,null,null,null,null,"Page:"]
[]
[null,null,null,null,null,null,null,null,null,null,null,null,null,null,null,null,null,null,null,"Date:"]
[]
[null,"Appendix 2-IB"]
[null,"Customer, Connections, Load Forecast and Revenues Data and Analysis"]
[]
[null,"This sheet requires no inputs, but serves as a summary of the hiostorical and forecasted data to be provided with respect to:"]
[]
[null,"1)","Customers and connections"]
[null,"2)","Consumption (kWh)"]
[null,"3)","Demand (kW or kCA) for applicable demand-billed customer classes"]
[null,"4)","Revenues"]
[]
[null,"The spreadsheet summarizes the data provided and the analyses (variance or year-over-year) that are required. Data are required to be provided on a customer class level. Consumption (kWh) must also be provided on a total distribution system level."]
[]
[null,"Appendix 2-IB (formerly 2-IA) is the appendix spreadsheet that the distributor populates, and the spreadsheet is laid out for inputting the necessary data. The spreadsheet also calculates necessary statistics such as average consumption per customer/connection per year, and variances and % annual changes, as necessary."]
[]
[null,"The distributor is required to provide suitable documentation in Exhibit 3 of its Application, in accordance with section 2.3.2 of Chaoter 2 of the Filing Requirements. This would include explanations for material variations or of trends in the data."]
[]
[null,"The distributor is also required to input its test year customer/connection and load forecast in Sheet 10 - Load Forecast of the Revenue Requirement Work Form. This sheet should also be updated to reflect changes in the load forecast made through the stages of processing of the rates application."]
[]
[null,"The applicant must demonstrate the historical accuracy of its load forecast approach for at least the past 5 years. Such analysis will cover both customer/connections and consumption (kWh) and demand (kW or kVA) by providing the following, as shown in the following table:"]
[]
[null,"This sheet is to be filled in accordance with the instructions documented in section 2.3.2 of Chapter 2 of the Filing Requirements for Distribution Rate Applications, in terms of one set of tables per customer class."]
[]
[null,"Color coding for Cells:",null,null,null,"Data input",null,null,null,null,"Drop-down List"]
[]
[null,null,null,null,null,"No data entry required",null,null,null,null,"Blank or calculated value"]
[]
[null,"Distribution System (Total)"]
[]
[null,null,null,"Calendar Year",null,null,null,null,null,null,"Consumption (kWh) (3)"]
[null,null,null,{"$f":"CONCATENATE(\"(for \",TestYear,\" Cost of Service\")","v":"(for 2018 Cost of Service"},null,null,null,null,null,null,null,"Actual (Weather actual)","Weather-normalized",null,"Weather-normalized"]
[null,null,"Historical",{"$f":"D40-1","v":2012},null,null,null,null,null,null,"Actual",30091478.346228234,30243327.409775119,{"$f":"IF(D39=RebaseYear,\"Board-approved\",\"\")","v":""}]
[null,null,"Historical",2013,null,null,null,null,null,null,"Actual",30301350.396518376,30138225.78876619,""]
[null,null,"Historical",2014,null,null,null,null,null,null,"Actual",30157452.240000002,30476269.162412532,"Board-approved"]
[null,null,"Historical",2015,null,null,null,null,null,null,"Actual",29896471.900000002,30222148.144213807,""]
[null,null,"Historical",2016,null,null,null,null,null,null,"Actual",29672838.790000003,31427034.153894901,""]
[null,null,"Bridge Year",2017,null,null,null,null,null,null,"Forecast",null,30476293.179080136,""]
[null,null,"Test Year",{"$f":"TestYear","v":2018},null,null,null,null,null,null,"Forecast",null,2959106.3809896521,""]
[null,null,null,null,null,null,null,null,null,null,null,null,null,null,{"$f":"SUM(O39:O44)","v":0}]
[null,null,"Variance Analysis",null,null,null,null,null,null,null,"Year","Year-over-year",null,null,"Versus Board-approved"]
[null,null,null,{"$f":"D39","v":2012},null,null,null,null,null,null,{"$f":"D48","v":2012}]
[null,null,null,2013,null,null,null,null,null,null,{"$f":"D49","v":2013},{"$f":"IF(L39=0,\"\",L40/L39-1)","v":6.9744679166434675E-3},-3.4752003172427992E-3]
[null,null,null,2014,null,null,null,null,null,null,2014,-4.7489024296061277E-3,1.1216432447471503E-2]
[null,null,null,2015,null,null,null,null,null,null,2015,-8.6539253357033052E-3,-8.3383243809954655E-3]
[null,null,null,2016,null,null,null,null,null,null,2016,-7.4802508720100969E-3,3.9867649510935799E-2]
[null,null,null,2017,null,null,null,null,null,null,2017,{"$f":"IF(K44=\"Forecast\",\"\",IF(L43=0,\"\",L44/L43-1))","v":""},{"$f":"IF(M43=0,\"\",M44/M43-1)","v":-3.0252328939443851E-2}]
[null,null,null,2018,null,null,null,null,null,null,2018,{"$f":"IF(K45=\"Forecast\",\"\",IF(L44=0,\"\",L45/L44-1))","v":""},{"$f":"IF(M44=0,\"\",M45/M44-1)","v":-0.90290464907914481},null,{"$f":"IF(O46=0,\"\",M45/O46-1)","v":""}]
[null,null,null,"Geometric Mean",null,null,null,null,null,null,"Geometric Mean",null,{"$f":"IF(M39=0,\"\",(M45/M39)^(1/(K54-K48-1)-1))","v":6.420593785429034},null,{"$f":"IF(O46=0,\"\",(M45/O46)^(1/(TestYear-RebaseYear-1))-1)","v":""}]
[]
[null,"Customer Class Analysis (one for each Customer Class, excluding MicroFIT and Standby)"]
[]
[null,1,"Customer Class:","Residential",null,null,null,"Is the customer class billed on consumption (kWh) or demand (kW or kVA)?",null,null,null,null,null,"kWh"]
[]
[null,null,null,"Calendar Year",null,"Customers",null,null,null,null,"Consumption (kWh) (3)",null,null,null,null,null,{"$f":"CONCATENATE(\"Consumption (kWh) per \",LEFT(F61,LEN(F61)-1))","v":"Consumption (kWh) per Customer"}]
[null,null,null,{"$f":"CONCATENATE(\"(for \",TestYear,\" Cost of Service\")","v":"(for 2018 Cost of Service"},null,null,null,null,null,null,null,"Actual (Weather actual)","Weather-normalized",null,"Weather-normalized",null,null,{"$f":"L62","v":"Actual (Weather actual)"},{"$f":"M62","v":"Weather-normalized"},null,{"$f":"O62","v":"Weather-normalized"}]
[null,null,"Historical",{"$f":"D64-1","v":2012},null,{"$f":"K39","v":"Actual"},1788,{"$f":"IF(D63=RebaseYear,\"Board-approved\",\"\")","v":""},null,null,{"$f":"F63","v":"Actual"},19634780,19709811.810000539,{"$f":"H63","v":""},null,null,{"$f":"K63","v":"Actual"},{"$f":"IF(G63=0,\"\",L63/G63)","v":10981.42058165548},{"$f":"IF(G63=0,\"\",M63/G63)","v":11023.384681208356},{"$f":"N63","v":""},{"$f":"IF(T63=\"\",\"\",IF(I63=0,\"\",O63/I63))","v":""}]
[null,null,"Historical",2013,null,{"$f":"K40","v":"Actual"},1790,"",null,null,{"$f":"F64","v":"Actual"},19650696,19506513.661336016,{"$f":"H64","v":""},null,null,{"$f":"K64","v":"Actual"},{"$f":"IF(G64=0,\"\",L64/G64)","v":10978.042458100559},{"$f":"IF(G64=0,\"\",M64/G64)","v":10897.493665550846},{"$f":"N64","v":""},{"$f":"IF(T64=\"\",\"\",IF(I64=0,\"\",O64/I64))","v":""}]
[null,null,"Historical",2014,null,"Actual",1799.5,"Board-approved",2048,null,"Actual",19479913,19630955.184352223,"Board-approved",22293395.204927601,null,"Actual",10825.180883578772,10909.116523674478,"Board-approved",10885.446877406055]
[null,null,"Historical",2015,null,"Actual",1846.5,"",null,null,"Actual",19377540,19528753.171989657,"",null,null,"Actual",10494.199837530463,10576.091617649421,"",""]
[null,null,"Historical",2016,null,"Actual",1926.5,"",null,null,"Actual",19268403,20463869.23662981,"",null,null,"Actual",10001.766415779912,10622.304301391025,"",""]
[null,null,"Bridge Year",2017,null,"Forecast",2040,"",null,null,"Forecast",null,21046899.584874082,"",null,null,"Forecast",0,10317.107639644159,"",""]
[null,null,"Test Year",{"$f":"TestYear","v":2018},null,"Forecast",2100,"",null,null,"Forecast",null,21676646.194792069,"",null,null,"Forecast",0,10322.21247371051,"",""]
[null,null,null,null,null,null,null,null,{"$f":"SUM(I63:I68)","v":2048},null,null,null,null,null,{"$f":"SUM(O63:O68)","v":22293395.204927601},null,null,null,null,null,{"$f":"SUM(U63:U68)","v":10885.446877406055}]
[null,null,"Variance Analysis","Year",null,null,"Year-over-year",null,"Test Year Versus Board-approved",null,"Year","Year-over-year",null,null,{"$f":"I71","v":"Test Year Versus Board-approved"},null,"Year","Year-over-year",null,null,{"$f":"O71","v":"Test Year Versus Board-approved"}]
[null,null,null,{"$f":"D63","v":2012},null,null,null,null,null,null,{"$f":"D72","v":2012},null,null,null,null,null,{"$f":"K72","v":2012}]
[null,null,null,2013,null,null,{"$f":"IF(G63=0,\"\",G64/G63-1)","v":1.1185682326622093E-3},null,null,null,{"$f":"D73","v":2013},{"$f":"IF(L63=0,\"\",L64/L63-1)","v":8.1060241062025362E-4},-1.0314565690646149E-2,null,null,null,{"$f":"K73","v":2013},{"$f":"IF(R63=\"\",\"\",IF(R63=0,\"\",R64/R63-1))","v":-3.0762172615117489E-4},{"$f":"IF(S63=\"\",\"\",IF(S63=0,\"\",S64/S63-1))","v":-1.1420359471997488E-2}]
[null,null,null,2014,null,null,5.3072625698324938E-3,null,null,null,2014,-8.6909389876063114E-3,6.3794856003849265E-3,null,null,null,2014,{"$f":"IF(R64=\"\",\"\",IF(R64=0,\"\",R65/R64-1))","v":-1.3924301632573077E-2},1.0665625033006165E-3]
[null,null,null,2015,null,null,2.6118366212836808E-2,null,null,null,2015,-5.2553109451771718E-3,-5.2061660475914984E-3,null,null,null,2015,-3.0575105359245347E-2,-3.0527211374297925E-2]
[null,null,null,2016,null,null,4.3325209856485136E-2,null,null,null,2016,-5.6321390640917679E-3,4.788406389310107E-2,null,null,null,2016,-4.6924341957874538E-2,4.3695426829022388E-3]
[null,null,null,2017,null,null,5.8915131066701321E-2,null,null,null,2017,{"$f":"IF(K68=\"Forecast\",\"\",IF(L67=0,\"\",L68/L67-1))","v":""},{"$f":"IF(M67=0,\"\",M68/M67-1)","v":2.849071900834188E-2},null,null,null,2017,{"$f":"IF(Q68=\"Forecast\",\"\",IF(R67=0,\"\",R68/R67-1))","v":""},{"$f":"IF(S67=\"\",\"\",IF(S67=0,\"\",S68/S67-1))","v":-2.8731681289426048E-2}]
[null,null,null,2018,null,null,2.9411764705882248E-2,null,{"$f":"IF(I70=0,\"\",G69/I70-1)","v":2.5390625E-2},null,2018,{"$f":"IF(K69=\"Forecast\",\"\",IF(L68=0,\"\",L69/L68-1))","v":""},{"$f":"IF(M68=0,\"\",M69/M68-1)","v":2.9921110583459587E-2},null,{"$f":"IF(O70=0,\"\",M69/O70-1)","v":-2.7665100109973806E-2},null,2018,{"$f":"IF(Q69=\"Forecast\",\"\",IF(R68=0,\"\",R69/R68-1))","v":""},4.9479313821776394E-4,null,{"$f":"IF(U70=0,\"\",S69/U70-1)","v":-5.1741964297726817E-2}]
[null,null,null,"Geometric Mean",null,null,{"$f":"IF(G63=0,\"\",GEOMEAN(G73:G78))","v":1.5054324672186498E-2},null,{"$f":"IF(I70=0,\"\",(G69/I70)^(1/(TestYear-RebaseYear-1))-1)","v":8.3929037653398542E-3},null,"Geometric Mean",null,{"$f":"IF(M63=0,\"\",(M69/M63)^(1/(K78-K72-1)-1))","v":0.92672805524267776},null,{"$f":"IF(O70=0,\"\",(M69/O70)^(1/(TestYear-RebaseYear-1))-1)","v":-9.30807141237322E-3},null,"Geometric Mean",null,{"$f":"IF(S63=\"\",\"\",IF(S63=0,\"\",(S69/S63)^(1/(Q78-Q72-1)-1)))","v":1.0539833129598388},null,{"$f":"IF(U70=0,\"\",(S69/U70)^(1/(TestYear-RebaseYear-1))-1)","v":-1.7553649090168766E-2}]
[]
[null,null,null,"Calendar Year",null,"Revenues",null,null,null,null,{"$f":"IF(ISBLANK(N59),\"\",CONCATENATE(\"Demand (\",N59,\")\"))","v":"Demand (kWh)"},null,null,null,null,null,{"$f":"CONCATENATE(\"Demand (\",N59,\") per \",LEFT(F61,LEN(F61)-1))","v":"Demand (kWh) per Customer"}]
[null,null,null,{"$f":"CONCATENATE(\"(for \",TestYear,\" Cost of Service\")","v":"(for 2018 Cost of Service"},null,null,null,null,null,null,null,"Actual (Weather actual)","Weather-normalized",null,{"$f":"M82","v":"Weather-normalized"},null,null,{"$f":"L82","v":"Actual (Weather actual)"},{"$f":"M82","v":"Weather-normalized"},null,{"$f":"O82","v":"Weather-normalized"}]
[null,null,"Historical",{"$f":"D84-1","v":2012},null,{"$f":"F63","v":"Actual"},null,{"$f":"IF(D83=RebaseYear,\"Board-approved\",\"\")","v":""},null,null,{"$f":"K63","v":"Actual"},null,null,{"$f":"N63","v":""},null,null,{"$f":"K83","v":"Actual"},{"$f":"IF(G83=0,\"\",L83/G83)","v":""},{"$f":"IF(G83=0,\"\",M83/G83)","v":""},{"$f":"N83","v":""},{"$f":"IF(T83=\"\",\"\",IF(I83=0,\"\",O83/I83))","v":""}]
[null,null,"Historical",2013,null,"Actual",null,"",null,null,"Actual",null,null,"",null,null,{"$f":"K84","v":"Actual"},{"$f":"IF(G84=0,\"\",L84/G84)","v":""},{"$f":"IF(G84=0,\"\",M84/G84)","v":""},{"$f":"N84","v":""},{"$f":"IF(T84=\"\",\"\",IF(I84=0,\"\",O84/I84))","v":""}]
[null,null,"Historical",2014,null,"Actual",580995.29679999989,"Board-approved",661016.73478701536,null,"Actual",null,null,"Board-approved",null,null,"Actual",0,0,"Board-approved",0]
[null,null,"Historical",2015,null,"Actual",601330.21200000006,"",null,null,"Actual",null,null,"",null,null,"Actual",0,0,"",""]
[null,null,"Historical",2016,null,"Actual",634580.07180000003,"",null,null,"Actual",null,null,"",null,null,"Actual",0,0,"",""]
[null,null,"Bridge Year (Forecast)",2017,null,"Forecast",686915.27701109345,"",null,null,"Forecast",null,null,"",null,null,"Forecast",0,0,"",""]
[null,null,"Test Year (Forecast)",{"$f":"TestYear","v":2018},null,"Forecast",905860.48023320164,"",null,null,"Forecast",null,null,"",null,null,"Forecast",0,0,"",""]
[null,null,null,null,null,null,null,null,{"$f":"SUM(I83:I88)","v":661016.73478701536},null,null,null,null,null,{"$f":"SUM(O83:O88)","v":0},null,null,null,null,null,{"$f":"SUM(U83:U88)","v":0}]
[null,null,"Variance Analysis","Year",null,null,"Year-over-year",null,{"$f":"I71","v":"Test Year Versus Board-approved"},null,"Year","Year-over-year",null,null,{"$f":"I91","v":"Test Year Versus Board-approved"},null,"Year","Year-over-year",null,null,{"$f":"O91","v":"Test Year Versus Board-approved"}]
[null,null,null,{"$f":"D83","v":2012},null,null,null,null,null,null,{"$f":"D92","v":2012},null,null,null,null,null,{"$f":"K92","v":2012}]
[null,null,null,{"$f":"D84","v":2013},null,null,{"$f":"IF(G83=0,\"\",G84/G83-1)","v":""},null,null,null,{"$f":"D93","v":2013},{"$f":"IF(L83=0,\"\",L84/L83-1)","v":""},{"$f":"IF(M83=0,\"\",M84/M83-1)","v":""},null,null,null,{"$f":"K93","v":2013},{"$f":"IF(R83=\"\",\"\",IF(R83=0,\"\",R84/R83-1))","v":""},{"$f":"IF(S83=\"\",\"\",IF(S83=0,\"\",S84/S83-1))","v":""}]
[null,null,null,{"$f":"D85","v":2014},null,null,{"$f":"IF(G84=0,\"\",G85/G84-1)","v":""},null,null,null,2014,{"$f":"IF(L84=0,\"\",L85/L84-1)","v":""},"",null,null,null,2014,{"$f":"IF(R84=\"\",\"\",IF(R84=0,\"\",R85/R84-1))","v":""},""]
[null,null,null,2015,null,null,3.500013737116392E-2,null,null,null,2015,{"$f":"IF(L85=0,\"\",L86/L85-1)","v":""},"",null,null,null,2015,"",""]
[null,null,null,2016,null,null,5.5293845438785238E-2,null,null,null,2016,{"$f":"IF(L86=0,\"\",L87/L86-1)","v":""},"",null,null,null,2016,"",""]
[null,null,null,2017,null,null,8.2472185208469329E-2,null,null,null,2017,{"$f":"IF(K88=\"Forecast\",\"\",IF(L87=0,\"\",L88/L87-1))","v":""},{"$f":"IF(M87=0,\"\",M88/M87-1)","v":""},null,null,null,2017,{"$f":"IF(Q88=\"Forecast\",\"\",IF(R87=0,\"\",R88/R87-1))","v":""},{"$f":"IF(S87=\"\",\"\",IF(S87=0,\"\",S88/S87-1))","v":""}]
[null,null,null,2018,null,null,0.31873683778701611,null,{"$f":"IF(I90=0,\"\",G89/I90-1)","v":0.37040476066778671},null,2018,{"$f":"IF(K89=\"Forecast\",\"\",IF(L88=0,\"\",L89/L88-1))","v":""},{"$f":"IF(M88=0,\"\",M89/M88-1)","v":""},null,{"$f":"IF(O90=0,\"\",M89/O90-1)","v":""},null,2018,{"$f":"IF(Q89=\"Forecast\",\"\",IF(R88=0,\"\",R89/R88-1))","v":""},"",null,{"$f":"IF(U90=0,\"\",S89/U90-1)","v":""}]
[null,null,null,"Geometric Mean",null,null,{"$f":"IF(G83=0,\"\",GEOMEAN(G93:G98))","v":""},null,{"$f":"IF(I90=0,\"\",(G89/I90)^(1/(TestYear-RebaseYear-1))-1)","v":0.11074990871331192},null,"Geometric Mean",null,{"$f":"IF(M83=0,\"\",GEOMEAN(M93:M98))","v":""},null,{"$f":"IF(O90=0,\"\",(M89/O90)^(1/(TestYear-RebaseYear-1))-1)","v":""},null,"Geometric Mean",null,{"$f":"IF(S83=\"\",\"\",IF(S83=0,\"\",(S89/S83)^(1/(Q98-Q92-1)-1)))","v":""},null,{"$f":"IF(U90=0,\"\",(S89/U90)^(1/(TestYear-RebaseYear-1))-1)","v":""}]
[]
[null,2,"Customer Class:","GS < 50 kW",null,null,null,"Is the customer class billed on consumption (kWh) or demand (kW or kVA)?",null,null,null,null,null,"kWh"]
[]
[null,null,null,"Calendar Year",null,"Customers",null,null,null,null,"Consumption (kWh) (3)",null,null,null,null,null,{"$f":"CONCATENATE(\"Consumption (kWh) per \",LEFT(F103,LEN(F103)-1))","v":"Consumption (kWh) per Customer"}]
[null,null,null,{"$f":"CONCATENATE(\"(for \",TestYear,\" Cost of Service\")","v":"(for 2018 Cost of Service"},null,null,null,null,null,null,null,"Actual (Weather actual)","Weather-normalized",null,"Weather-normalized",null,null,{"$f":"L104","v":"Actual (Weather actual)"},{"$f":"M104","v":"Weather-normalized"},null,{"$f":"O104","v":"Weather-normalized"}]
[null,null,"Historical",{"$f":"D106-1","v":2012},null,{"$f":"F63","v":"Actual"},157,{"$f":"IF(D105=RebaseYear,\"Board-approved\",\"\")","v":""},null,null,{"$f":"F105","v":"Actual"},4742923,4761047.4759240076,{"$f":"H105","v":""},null,null,{"$f":"K105","v":"Actual"},{"$f":"IF(G105=0,\"\",L105/G105)","v":30209.700636942674},{"$f":"IF(G105=0,\"\",M105/G105)","v":30325.143158751642},{"$f":"N105","v":""},{"$f":"IF(T105=\"\",\"\",IF(I105=0,\"\",O105/I105))","v":""}]
[null,null,"Historical",2013,null,"Actual",159,"",null,null,{"$f":"F106","v":"Actual"},4699450,4664968.8960515978,{"$f":"H106","v":""},null,null,{"$f":"K106","v":"Actual"},{"$f":"IF(G106=0,\"\",L106/G106)","v":29556.289308176099},{"$f":"IF(G106=0,\"\",M106/G106)","v":29339.427019192441},{"$f":"N106","v":""},{"$f":"IF(T106=\"\",\"\",IF(I106=0,\"\",O106/I106))","v":""}]
[null,null,"Historical",2014,null,"Actual",159,"Board-approved",168,null,"Actual",4701954,4738411.7297077086,"Board-approved",null,null,"Actual",29572.037735849055,29801.331633381815,"Board-approved",0]
[null,null,"Historical",2015,null,"Actual",165,"",null,null,"Actual",4594197,4630047.9439854277,"",null,null,"Actual",27843.618181818183,28060.896630214713,"",""]
[null,null,"Historical",2016,null,"Actual",163,"",null,null,"Actual",4538610,4792042.1284143776,"",null,null,"Actual",27844.233128834356,29399.031462664894,"",""]
[null,null,"Bridge Year",2017,null,"Forecast",168,"",null,null,"Forecast",null,4941574.8881222326,"",null,null,"Forecast",0,29414.136238822812,"",""]
[null,null,"Test Year",{"$f":"TestYear","v":2018},null,"Forecast",172,"",null,null,"Forecast",null,5057633.0220973389,"",null,null,"Forecast",0,29404.843151728714,"",""]
[null,null,null,null,null,null,null,null,{"$f":"SUM(I105:I110)","v":168},null,null,null,null,null,{"$f":"SUM(O105:O110)","v":0},null,null,null,null,null,{"$f":"SUM(U105:U110)","v":0}]
[null,null,"Variance Analysis","Year",null,null,"Year-over-year",null,"Test Year Versus Board-approved",null,"Year","Year-over-year",null,null,{"$f":"I113","v":"Test Year Versus Board-approved"},null,"Year","Year-over-year",null,null,{"$f":"O113","v":"Test Year Versus Board-approved"}]
[null,null,null,{"$f":"D105","v":2012},null,null,null,null,null,null,{"$f":"D114","v":2012},null,null,null,null,null,{"$f":"K114","v":2012}]
[null,null,null,2013,null,null,{"$f":"IF(G105=0,\"\",G106/G105-1)","v":1.2738853503184711E-2},null,null,null,{"$f":"D115","v":2013},{"$f":"IF(L105=0,\"\",L106/L105-1)","v":-9.1658667028750029E-3},-2.0180134804004046E-2,null,null,null,{"$f":"K115","v":2013},{"$f":"IF(R105=\"\",\"\",IF(R105=0,\"\",R106/R105-1))","v":-2.1629189134285354E-2},{"$f":"IF(S105=\"\",\"\",IF(S105=0,\"\",S106/S105-1))","v":-3.2504912982570078E-2}]
[null,null,null,2014,null,null,0,null,null,null,2014,{"$f":"IF(L106=0,\"\",L107/L106-1)","v":5.3282830969592077E-4},1.5743477672117479E-2,null,null,null,2014,{"$f":"IF(R106=\"\",\"\",IF(R106=0,\"\",R107/R106-1))","v":5.3282830969569872E-4},1.5743477672117479E-2]
[null,null,null,2015,null,null,3.7735849056603765E-2,null,null,null,2015,{"$f":"IF(L107=0,\"\",L108/L107-1)","v":-2.2917493450595239E-2},-2.286922114490153E-2,null,null,null,2015,{"$f":"IF(R107=\"\",\"\",IF(R107=0,\"\",R108/R107-1))","v":-5.8447766416028002E-2},-5.8401249466905059E-2]
[null,null,null,2016,null,null,-1.2121212121212088E-2,null,null,null,2016,{"$f":"IF(L108=0,\"\",L109/L108-1)","v":-1.2099394083449178E-2},3.4987582502117531E-2,null,null,null,2016,{"$f":"IF(R108=\"\",\"\",IF(R108=0,\"\",R109/R108-1))","v":2.2085743747624065E-5},4.7686816643247809E-2]
[null,null,null,2017,null,null,3.0674846625766916E-2,null,null,null,2017,{"$f":"IF(K110=\"Forecast\",\"\",IF(L109=0,\"\",L110/L109-1))","v":""},{"$f":"IF(M109=0,\"\",M110/M109-1)","v":3.1204391718762547E-2},null,null,null,2017,{"$f":"IF(Q110=\"Forecast\",\"\",IF(R109=0,\"\",R110/R109-1))","v":""},5.1378482237085521E-4]
[null,null,null,2018,null,null,2.3809523809523725E-2,null,{"$f":"IF(I112=0,\"\",G111/I112-1)","v":2.3809523809523725E-2},null,2018,{"$f":"IF(K111=\"Forecast\",\"\",IF(L110=0,\"\",L111/L110-1))","v":""},{"$f":"IF(M110=0,\"\",M111/M110-1)","v":2.3486061954473003E-2},null,{"$f":"IF(O112=0,\"\",M111/O112-1)","v":""},null,2018,{"$f":"IF(Q111=\"Forecast\",\"\",IF(R110=0,\"\",R111/R110-1))","v":""},-3.1593948632879787E-4,null,{"$f":"IF(U112=0,\"\",S111/U112-1)","v":""}]
[null,null,null,"Geometric Mean",null,null,{"$f":"IF(G105=0,\"\",GEOMEAN(G115:G120))","v":{"$error":"#NUM!"}},null,{"$f":"IF(I112=0,\"\",(G111/I112)^(1/(TestYear-RebaseYear-1))-1)","v":7.8743399566687522E-3},null,"Geometric Mean",null,{"$f":"IF(M105=0,\"\",(M111/M105)^(1/(K120-K114-1)-1))","v":0.95280528730516945},null,{"$f":"IF(O112=0,\"\",(M111/O112)^(1/(TestYear-RebaseYear-1))-1)","v":""},null,"Geometric Mean",null,{"$f":"IF(S105=\"\",\"\",IF(S105=0,\"\",(S111/S105)^(1/(Q120-Q114-1)-1)))","v":1.0249606539306162},null,{"$f":"IF(U112=0,\"\",(S111/U112)^(1/(TestYear-RebaseYear-1))-1)","v":""}]
[]
[]
[null,null,null,"Calendar Year",null,"Revenues",null,null,null,null,{"$f":"IF(ISBLANK(N101),\"\",CONCATENATE(\"Demand (\",N101,\")\"))","v":"Demand (kWh)"},null,null,null,null,null,{"$f":"CONCATENATE(\"Demand (\",N101,\") per \",LEFT(F103,LEN(F103)-1))","v":"Demand (kWh) per Customer"}]
[null,null,null,{"$f":"CONCATENATE(\"(for \",TestYear,\" Cost of Service\")","v":"(for 2018 Cost of Service"},null,null,null,null,null,null,null,"Actual (Weather actual)","Weather-normalized",null,{"$f":"M125","v":"Weather-normalized"},null,null,{"$f":"L125","v":"Actual (Weather actual)"},{"$f":"M125","v":"Weather-normalized"},null,{"$f":"O125","v":"Weather-normalized"}]
[null,null,"Historical",{"$f":"D127-1","v":2012},null,{"$f":"F105","v":"Actual"},null,{"$f":"IF(D126=RebaseYear,\"Board-approved\",\"\")","v":""},null,null,{"$f":"K105","v":"Actual"},null,null,{"$f":"N105","v":""},null,null,{"$f":"K126","v":"Actual"},{"$f":"IF(G126=0,\"\",L126/G126)","v":""},{"$f":"IF(G126=0,\"\",M126/G126)","v":""},{"$f":"N126","v":""},{"$f":"IF(T126=\"\",\"\",IF(I126=0,\"\",O126/I126))","v":""}]
[null,null,"Historical",2013,null,"Actual",null,"",null,null,"Actual",null,null,"",null,null,{"$f":"K127","v":"Actual"},{"$f":"IF(G127=0,\"\",L127/G127)","v":""},{"$f":"IF(G127=0,\"\",M127/G127)","v":""},{"$f":"N127","v":""},{"$f":"IF(T127=\"\",\"\",IF(I127=0,\"\",O127/I127))","v":""}]
[null,null,"Historical",2014,null,"Actual",99413,"Board-approved",105010,null,"Actual",null,null,"Board-approved",null,null,"Actual",0,0,"Board-approved",0]
[null,null,"Historical",2015,null,"Actual",99353,"",null,null,"Actual",null,null,"",null,null,"Actual",0,0,"",""]
[null,null,"Historical",2016,null,"Actual",99888,"",null,null,"Actual",null,null,"",null,null,"Actual",0,0,"",""]
[null,null,"Bridge Year (Forecast)",2017,null,"Forecast",109246,"",null,null,"Forecast",null,null,"",null,null,"Forecast",0,0,"",""]
[null,null,"Test Year (Forecast)",{"$f":"TestYear","v":2018},null,"Forecast",101117,"",null,null,"Forecast",null,null,"",null,null,"Forecast",0,0,"",""]
[null,null,null,null,null,null,null,null,{"$f":"SUM(I126:I131)","v":105010},null,null,null,null,null,{"$f":"SUM(O126:O131)","v":0},null,null,null,null,null,{"$f":"SUM(U126:U131)","v":0}]
[null,null,"Variance Analysis","Year",null,null,"Year-over-year",null,{"$f":"I113","v":"Test Year Versus Board-approved"},null,"Year","Year-over-year",null,null,{"$f":"I134","v":"Test Year Versus Board-approved"},null,"Year","Year-over-year",null,null,{"$f":"O134","v":"Test Year Versus Board-approved"}]
[null,null,null,{"$f":"D126","v":2012},null,null,null,null,null,null,{"$f":"D135","v":2012},null,null,null,null,null,{"$f":"K135","v":2012}]
[null,null,null,{"$f":"D127","v":2013},null,null,{"$f":"IF(G126=0,\"\",G127/G126-1)","v":""},null,null,null,{"$f":"D136","v":2013},{"$f":"IF(L126=0,\"\",L127/L126-1)","v":""},{"$f":"IF(M126=0,\"\",M127/M126-1)","v":""},null,null,null,{"$f":"K136","v":2013},{"$f":"IF(R126=\"\",\"\",IF(R126=0,\"\",R127/R126-1))","v":""},{"$f":"IF(S126=\"\",\"\",IF(S126=0,\"\",S127/S126-1))","v":""}]
[null,null,null,{"$f":"D128","v":2014},null,null,{"$f":"IF(G127=0,\"\",G128/G127-1)","v":""},null,null,null,2014,{"$f":"IF(L127=0,\"\",L128/L127-1)","v":""},"",null,null,null,2014,{"$f":"IF(R127=\"\",\"\",IF(R127=0,\"\",R128/R127-1))","v":""},""]
[null,null,null,2015,null,null,-6.0354279621377405E-4,null,null,null,2015,{"$f":"IF(L128=0,\"\",L129/L128-1)","v":""},"",null,null,null,2015,{"$f":"IF(R128=\"\",\"\",IF(R128=0,\"\",R129/R128-1))","v":""},""]
[null,null,null,2016,null,null,5.3848399142450987E-3,null,null,null,2016,{"$f":"IF(L129=0,\"\",L130/L129-1)","v":""},"",null,null,null,2016,{"$f":"IF(R129=\"\",\"\",IF(R129=0,\"\",R130/R129-1))","v":""},""]
[null,null,null,2017,null,null,9.3684927118372618E-2,null,null,null,2017,{"$f":"IF(K131=\"Forecast\",\"\",IF(L130=0,\"\",L131/L130-1))","v":""},"",null,null,null,2017,{"$f":"IF(Q131=\"Forecast\",\"\",IF(R130=0,\"\",R131/R130-1))","v":""},""]
[null,null,null,2018,null,null,-7.4410047049777606E-2,null,{"$f":"IF(I133=0,\"\",G132/I133-1)","v":-3.7072659746690828E-2},null,2018,{"$f":"IF(K132=\"Forecast\",\"\",IF(L131=0,\"\",L132/L131-1))","v":""},"",null,{"$f":"IF(O133=0,\"\",M132/O133-1)","v":""},null,2018,{"$f":"IF(Q132=\"Forecast\",\"\",IF(R131=0,\"\",R132/R131-1))","v":""},"",null,{"$f":"IF(U133=0,\"\",S132/U133-1)","v":""}]
[null,null,null,"Geometric Mean",null,null,{"$f":"IF(G126=0,\"\",GEOMEAN(G136:G141))","v":""},null,{"$f":"IF(I133=0,\"\",(G132/I133)^(1/(TestYear-RebaseYear-1))-1)","v":-1.2513487466103257E-2},null,"Geometric Mean",null,{"$f":"IF(M126=0,\"\",GEOMEAN(M136:M141))","v":""},null,{"$f":"IF(O133=0,\"\",(M132/O133)^(1/(TestYear-RebaseYear-1))-1)","v":""},null,"Geometric Mean",null,{"$f":"IF(S126=\"\",\"\",IF(S126=0,\"\",(S132/S126)^(1/(Q141-Q135-1)-1)))","v":""},null,{"$f":"IF(U133=0,\"\",(S132/U133)^(1/(TestYear-RebaseYear-1))-1)","v":""}]
[]
[null,3,"Customer Class:","GS > 50 kW",null,null,null,"Is the customer class billed on consumption (kWh) or demand (kW or kVA)?",null,null,null,null,null,"kW"]
[]
[null,null,null,"Calendar Year",null,"Customers",null,null,null,null,"Consumption (kWh) (3)",null,null,null,null,null,{"$f":"CONCATENATE(\"Consumption (kWh) per \",LEFT(F146,LEN(F146)-1))","v":"Consumption (kWh) per Customer"}]
[null,null,null,{"$f":"CONCATENATE(\"(for \",TestYear,\" Cost of Service\")","v":"(for 2018 Cost of Service"},null,null,null,null,null,null,null,"Actual (Weather actual)","Weather-normalized",null,"Weather-normalized",null,null,{"$f":"L147","v":"Actual (Weather actual)"},{"$f":"M147","v":"Weather-normalized"},null,{"$f":"O147","v":"Weather-normalized"}]
[null,null,"Historical",{"$f":"D149-1","v":2012},null,{"$f":"F105","v":"Actual"},11,{"$f":"IF(D148=RebaseYear,\"Board-approved\",\"\")","v":""},null,null,{"$f":"F148","v":"Actual"},4292894,4309298.7474410431,{"$f":"H148","v":""},null,null,{"$f":"K148","v":"Actual"},{"$f":"IF(G148=0,\"\",L148/G148)","v":390263.09090909088},{"$f":"IF(G148=0,\"\",M148/G148)","v":391754.43158554938},{"$f":"N148","v":""},{"$f":"IF(T148=\"\",\"\",IF(I148=0,\"\",O148/I148))","v":""}]
[null,null,"Historical",2013,null,{"$f":"F106","v":"Actual"},11,"",null,null,{"$f":"F149","v":"Actual"},4289465,4257992.0641143033,{"$f":"H149","v":""},null,null,{"$f":"K149","v":"Actual"},{"$f":"IF(G149=0,\"\",L149/G149)","v":389951.36363636365},{"$f":"IF(G149=0,\"\",M149/G149)","v":387090.18764675484},{"$f":"N149","v":""},{"$f":"IF(T149=\"\",\"\",IF(I149=0,\"\",O149/I149))","v":""}]
[null,null,"Historical",2014,null,"Actual",11,"Board-approved",null,null,"Actual",4346251,4379950.7010604218,"Board-approved",null,null,"Actual",395113.72727272729,398177.33646003832,"Board-approved",""]
[null,null,"Historical",2015,null,"Actual",11,"",null,null,"Actual",4316369,4350051.9054651847,"",null,null,"Actual",392397.18181818182,395459.26413319859,"",""]
[null,null,"Historical",2016,null,"Actual",11,"",null,null,"Actual",4274953,4513662.7454201682,"",null,null,"Actual",388632.09090909088,410332.9768563789,"",""]
[null,null,"Bridge Year",2017,null,"Forecast",9,"",null,null,"Forecast",null,3657935.6759345969,"",null,null,"Forecast",0,406437.2973260663,"",""]
[null,null,"Test Year",{"$f":"TestYear","v":2018},null,"Forecast",9,"",null,null,"Forecast",null,2835388.39942984,"",null,null,"Forecast",0,315043.15549220447,"",""]
[null,null,null,null,null,null,null,null,{"$f":"SUM(I148:I153)","v":0},null,null,null,null,null,{"$f":"SUM(O148:O153)","v":0},null,null,null,null,null,{"$f":"SUM(U148:U153)","v":0}]
[null,null,"Variance Analysis","Year",null,null,"Year-over-year",null,"Test Year Versus Board-approved",null,"Year","Year-over-year",null,null,{"$f":"I156","v":"Test Year Versus Board-approved"},null,"Year","Year-over-year",null,null,{"$f":"O156","v":"Test Year Versus Board-approved"}]
[null,null,null,{"$f":"D148","v":2012},null,null,null,null,null,null,{"$f":"D157","v":2012},null,null,null,null,null,{"$f":"K157","v":2012}]
[null,null,null,2013,null,null,{"$f":"IF(G148=0,\"\",G149/G148-1)","v":0},null,null,null,{"$f":"D158","v":2013},{"$f":"IF(L148=0,\"\",L149/L148-1)","v":-7.9876186087990408E-4},-1.1906040015723374E-2,null,null,null,{"$f":"K158","v":2013},{"$f":"IF(R148=\"\",\"\",IF(R148=0,\"\",R149/R148-1))","v":-7.9876186087979306E-4},{"$f":"IF(S148=\"\",\"\",IF(S148=0,\"\",S149/S148-1))","v":-1.1906040015723374E-2}]
[null,null,null,2014,null,null,0,null,null,null,2014,{"$f":"IF(L149=0,\"\",L150/L149-1)","v":1.3238480789562246E-2},2.8642288456563136E-2,null,null,null,2014,{"$f":"IF(R149=\"\",\"\",IF(R149=0,\"\",R150/R149-1))","v":1.3238480789562468E-2},2.8642288456563136E-2]
[null,null,null,2015,null,null,0,null,null,null,2015,{"$f":"IF(L150=0,\"\",L151/L150-1)","v":-6.8753507333101371E-3},-6.8262858730346876E-3,null,null,null,2015,{"$f":"IF(R150=\"\",\"\",IF(R150=0,\"\",R151/R150-1))","v":-6.8753507333102482E-3},-6.8262858730346876E-3]
[null,null,null,2016,null,null,0,null,null,null,2016,{"$f":"IF(L151=0,\"\",L152/L151-1)","v":-9.5951018089509565E-3},3.7611238557735627E-2,null,null,null,2016,{"$f":"IF(R151=\"\",\"\",IF(R151=0,\"\",R152/R151-1))","v":-9.5951018089510676E-3},3.7611238557735627E-2]
[null,null,null,2017,null,null,-0.18181818181818177,null,null,null,2017,{"$f":"IF(K153=\"Forecast\",\"\",IF(L152=0,\"\",L153/L152-1))","v":""},{"$f":"IF(M152=0,\"\",M153/M152-1)","v":-0.18958595662776156},null,null,null,2017,{"$f":"IF(Q153=\"Forecast\",\"\",IF(R152=0,\"\",R153/R152-1))","v":""},{"$f":"IF(S152=\"\",\"\",IF(S152=0,\"\",S153/S152-1))","v":-9.4939469894863571E-3}]
[null,null,null,2018,null,null,0,null,{"$f":"IF(I155=0,\"\",G154/I155-1)","v":""},null,2018,{"$f":"IF(K154=\"Forecast\",\"\",IF(L153=0,\"\",L154/L153-1))","v":""},{"$f":"IF(M153=0,\"\",M154/M153-1)","v":-0.22486652291790155},null,{"$f":"IF(O155=0,\"\",M154/O155-1)","v":""},null,2018,{"$f":"IF(Q154=\"Forecast\",\"\",IF(R153=0,\"\",R154/R153-1))","v":""},{"$f":"IF(S153=\"\",\"\",IF(S153=0,\"\",S154/S153-1))","v":-0.22486652291790143},null,{"$f":"IF(U155=0,\"\",S154/U155-1)","v":""}]
[null,null,null,"Geometric Mean",null,null,{"$f":"IF(G148=0,\"\",GEOMEAN(G158:G163))","v":{"$error":"#NUM!"}},null,{"$f":"IF(I155=0,\"\",(G154/I155)^(1/(TestYear-RebaseYear-1))-1)","v":""},null,"Geometric Mean",null,{"$f":"IF(M148=0,\"\",(M154/M148)^(1/(K163-K157-1)-1))","v":1.3977684579740131},null,{"$f":"IF(O155=0,\"\",(M154/O155)^(1/(TestYear-RebaseYear-1))-1)","v":""},null,"Geometric Mean",null,{"$f":"IF(S148=\"\",\"\",IF(S148=0,\"\",(S154/S148)^(1/(Q163-Q157-1)-1)))","v":1.1904607891629448},null,{"$f":"IF(U155=0,\"\",(S154/U155)^(1/(TestYear-RebaseYear-1))-1)","v":""}]
[]
[null,null,null,"Calendar Year",null,"Revenues",null,null,null,null,{"$f":"IF(ISBLANK(N144),\"\",CONCATENATE(\"Demand (\",N144,\")\"))","v":"Demand (kW)"},null,null,null,null,null,{"$f":"CONCATENATE(\"Demand (\",N144,\") per \",LEFT(F146,LEN(F146)-1))","v":"Demand (kW) per Customer"}]
[null,null,null,{"$f":"CONCATENATE(\"(for \",TestYear,\" Cost of Service\")","v":"(for 2018 Cost of Service"},null,null,null,null,null,null,null,"Actual (Weather actual)","Weather-normalized",null,{"$f":"M167","v":"Weather-normalized"},null,null,{"$f":"L167","v":"Actual (Weather actual)"},{"$f":"M167","v":"Weather-normalized"},null,{"$f":"O167","v":"Weather-normalized"}]
[null,null,"Historical",{"$f":"D169-1","v":2012},null,{"$f":"F148","v":"Actual"},null,{"$f":"IF(D168=RebaseYear,\"Board-approved\",\"\")","v":""},null,null,{"$f":"K148","v":"Actual"},12485.499999999998,12485.499999999998,{"$f":"N148","v":""},null,null,{"$f":"K168","v":"Actual"},{"$f":"IF(G168=0,\"\",L168/G168)","v":""},{"$f":"IF(G168=0,\"\",M168/G168)","v":""},{"$f":"N168","v":""},{"$f":"IF(T168=\"\",\"\",IF(I168=0,\"\",O168/I168))","v":""}]
[null,null,"Historical",2013,null,"Actual",null,"",null,null,"Actual",12638.95,12638.95,"",null,null,{"$f":"K169","v":"Actual"},{"$f":"IF(G169=0,\"\",L169/G169)","v":""},{"$f":"IF(G169=0,\"\",M169/G169)","v":""},{"$f":"N169","v":""},{"$f":"IF(T169=\"\",\"\",IF(I169=0,\"\",O169/I169))","v":""}]
[null,null,"Historical",2014,null,"Actual",90677,"Board-approved",null,null,"Actual",12213.6,12213.6,"Board-approved",null,null,"Actual",0.13469347243512689,0.13469347243512689,"Board-approved",""]
[null,null,"Historical",2015,null,"Actual",68878,"",null,null,"Actual",12238.480000000001,12238.480000000001,"",null,null,"Actual",0.17768344028572261,0.17768344028572261,"",""]
[null,null,"Historical",2016,null,"Actual",69568,"",null,null,"Actual",12169.340000000002,12169.340000000002,"",null,null,"Actual",0.17492726540938366,0.17492726540938366,"",""]
[null,null,"Bridge Year (Forecast)",2017,null,"Forecast",68479,"",null,null,"Forecast",null,12700.709899802026,"",null,null,"Forecast",0,0.18546868236688657,"",""]
[null,null,"Test Year (Forecast)",{"$f":"TestYear","v":2018},null,"Forecast",71906,"",null,null,"Forecast",null,12771.533158701381,"",null,null,"Forecast",0,0.17761429030541792,"",""]
[null,null,null,null,null,null,null,null,{"$f":"SUM(I168:I173)","v":0},null,null,null,null,null,{"$f":"SUM(O168:O173)","v":0},null,null,null,null,null,{"$f":"SUM(U168:U173)","v":0}]
[null,null,"Variance Analysis","Year",null,null,"Year-over-year",null,{"$f":"I156","v":"Test Year Versus Board-approved"},null,"Year","Year-over-year",null,null,{"$f":"I176","v":"Test Year Versus Board-approved"},null,"Year","Year-over-year",null,null,{"$f":"O176","v":"Test Year Versus Board-approved"}]
[null,null,null,{"$f":"D168","v":2012},null,null,null,null,null,null,{"$f":"D177","v":2012},null,null,null,null,null,{"$f":"K177","v":2012}]
[null,null,null,{"$f":"D169","v":2013},null,null,{"$f":"IF(G168=0,\"\",G169/G168-1)","v":""},null,null,null,{"$f":"D178","v":2013},{"$f":"IF(L168=0,\"\",L169/L168-1)","v":1.2290256697769619E-2},{"$f":"IF(M168=0,\"\",M169/M168-1)","v":1.2290256697769619E-2},null,null,null,{"$f":"K178","v":2013},{"$f":"IF(R168=\"\",\"\",IF(R168=0,\"\",R169/R168-1))","v":""},{"$f":"IF(S168=\"\",\"\",IF(S168=0,\"\",S169/S168-1))","v":""}]
[null,null,null,{"$f":"D170","v":2014},null,null,{"$f":"IF(G169=0,\"\",G170/G169-1)","v":""},null,null,null,2014,{"$f":"IF(L169=0,\"\",L170/L169-1)","v":-3.3653903211896541E-2},-3.3653903211896541E-2,null,null,null,2014,{"$f":"IF(R169=\"\",\"\",IF(R169=0,\"\",R170/R169-1))","v":""},""]
[null,null,null,2015,null,null,-0.24040274821619589,null,null,null,2015,{"$f":"IF(L170=0,\"\",L171/L170-1)","v":2.0370734263444046E-3},2.0370734263444046E-3,null,null,null,2015,{"$f":"IF(R170=\"\",\"\",IF(R170=0,\"\",R171/R170-1))","v":0.31916890309069146},0.31916890309069146]
[null,null,null,2016,null,null,1.0017712477133456E-2,null,null,null,2016,{"$f":"IF(L171=0,\"\",L172/L171-1)","v":-5.6493943692353943E-3},-5.6493943692353943E-3,null,null,null,2016,{"$f":"IF(R171=\"\",\"\",IF(R171=0,\"\",R172/R171-1))","v":-1.5511714946012445E-2},-1.5511714946012445E-2]
[null,null,null,2017,null,null,-1.5653748850046001E-2,null,null,null,2017,{"$f":"IF(K173=\"Forecast\",\"\",IF(L172=0,\"\",L173/L172-1))","v":""},{"$f":"IF(M172=0,\"\",M173/M172-1)","v":4.3664644081110815E-2},null,null,null,2017,{"$f":"IF(Q173=\"Forecast\",\"\",IF(R172=0,\"\",R173/R172-1))","v":""},{"$f":"IF(S172=\"\",\"\",IF(S172=0,\"\",S173/S172-1))","v":6.0261714677999123E-2}]
[null,null,null,2018,null,null,5.0044539201799187E-2,null,{"$f":"IF(I175=0,\"\",G174/I175-1)","v":""},null,2018,{"$f":"IF(K174=\"Forecast\",\"\",IF(L173=0,\"\",L174/L173-1))","v":""},{"$f":"IF(M173=0,\"\",M174/M173-1)","v":5.576322855815885E-3},null,{"$f":"IF(O175=0,\"\",M174/O175-1)","v":""},null,2018,{"$f":"IF(Q174=\"Forecast\",\"\",IF(R173=0,\"\",R174/R173-1))","v":""},{"$f":"IF(S173=\"\",\"\",IF(S173=0,\"\",S174/S173-1))","v":-4.234888586705654E-2},null,{"$f":"IF(U175=0,\"\",S174/U175-1)","v":""}]
[null,null,null,"Geometric Mean",null,null,{"$f":"IF(G168=0,\"\",GEOMEAN(G178:G183))","v":""},null,{"$f":"IF(I175=0,\"\",(G174/I175)^(1/(TestYear-RebaseYear-1))-1)","v":""},null,"Geometric Mean",null,{"$f":"IF(M168=0,\"\",GEOMEAN(M178:M183))","v":{"$error":"#NUM!"}},null,{"$f":"IF(O175=0,\"\",(M174/O175)^(1/(TestYear-RebaseYear-1))-1)","v":""},null,"Geometric Mean",null,{"$f":"IF(S168=\"\",\"\",IF(S168=0,\"\",(S174/S168)^(1/(Q183-Q177-1)-1)))","v":""},null,{"$f":"IF(U175=0,\"\",(S174/U175)^(1/(TestYear-RebaseYear-1))-1)","v":""}]
[]
[]
[null,4,"Customer Class:","Street Lighting",null,null,null,"Is the customer class billed on consumption (kWh) or demand (kW or kVA)?",null,null,null,null,null,"kW"]
[]
[null,null,null,"Calendar Year",null,"Customers",null,null,null,null,"Consumption (kWh) (3)",null,null,null,null,null,{"$f":"CONCATENATE(\"Consumption (kWh) per \",LEFT(F189,LEN(F189)-1))","v":"Consumption (kWh) per Customer"}]
[null,null,null,{"$f":"CONCATENATE(\"(for \",TestYear,\" Cost of Service\")","v":"(for 2018 Cost of Service"},null,null,null,null,null,null,null,"Actual (Weather actual)","Weather-normalized",null,"Weather-normalized",null,null,{"$f":"L190","v":"Actual (Weather actual)"},{"$f":"M190","v":"Weather-normalized"},null,{"$f":"O190","v":"Weather-normalized"}]
[null,null,"Historical",{"$f":"D192-1","v":2012},null,{"$f":"F148","v":"Actual"},409,{"$f":"IF(D191=RebaseYear,\"Board-approved\",\"\")","v":""},null,null,{"$f":"F191","v":"Actual"},355537,355537,{"$f":"H191","v":""},null,null,{"$f":"K191","v":"Actual"},{"$f":"IF(G191=0,\"\",L191/G191)","v":869.28361858190704},{"$f":"IF(G191=0,\"\",M191/G191)","v":869.28361858190704},{"$f":"N191","v":""},{"$f":"IF(T191=\"\",\"\",IF(I191=0,\"\",O191/I191))","v":""}]
[null,null,"Historical",2013,null,"Actual",409,"",null,null,{"$f":"F192","v":"Actual"},359464,359464,{"$f":"H192","v":""},null,null,{"$f":"K192","v":"Actual"},{"$f":"IF(G192=0,\"\",L192/G192)","v":878.88508557457214},{"$f":"IF(G192=0,\"\",M192/G192)","v":878.88508557457214},{"$f":"N192","v":""},{"$f":"IF(T192=\"\",\"\",IF(I192=0,\"\",O192/I192))","v":""}]
[null,null,"Historical",2014,null,"Actual",409,"Board-approved",null,null,"Actual",359464,359464,"Board-approved",null,null,"Actual",878.88508557457214,878.88508557457214,"Board-approved",""]
[null,null,"Historical",2015,null,"Actual",430,"",null,null,"Actual",373173,373173,"",null,null,"Actual",867.8441860465116,867.8441860465116,"",""]
[null,null,"Historical",2016,null,"Actual",504.5,"",null,null,"Actual",376348,376348,"",null,null,"Actual",745.98216055500495,745.98216055500495,"",""]
[null,null,"Bridge Year",2017,null,"Forecast",517,"",null,null,"Forecast",null,385594.43570312636,"",null,null,"Forecast",0,745.83062998670482,"",""]
[null,null,"Test Year",{"$f":"TestYear","v":2018},null,"Forecast",530,"",null,null,"Forecast",null,395068.04565246124,"",null,null,"Forecast",0,745.41140689143629,"",""]
[null,null,null,null,null,null,null,null,{"$f":"SUM(I191:I196)","v":0},null,null,null,null,null,{"$f":"SUM(O191:O196)","v":0},null,null,null,null,null,{"$f":"SUM(U191:U196)","v":0}]
[null,null,"Variance Analysis","Year",null,null,"Year-over-year",null,"Test Year Versus Board-approved",null,"Year","Year-over-year",null,null,{"$f":"I199","v":"Test Year Versus Board-approved"},null,"Year","Year-over-year",null,null,{"$f":"O199","v":"Test Year Versus Board-approved"}]
[null,null,null,{"$f":"D191","v":2012},null,null,null,null,null,null,{"$f":"D200","v":2012},null,null,null,null,null,{"$f":"K200","v":2012}]
[null,null,null,2013,null,null,{"$f":"IF(G191=0,\"\",G192/G191-1)","v":0},null,null,null,{"$f":"D201","v":2013},{"$f":"IF(L191=0,\"\",L192/L191-1)","v":1.1045263924711168E-2},1.1045263924711168E-2,null,null,null,{"$f":"K201","v":2013},{"$f":"IF(R191=\"\",\"\",IF(R191=0,\"\",R192/R191-1))","v":1.1045263924711168E-2},{"$f":"IF(S191=\"\",\"\",IF(S191=0,\"\",S192/S191-1))","v":1.1045263924711168E-2}]
[null,null,null,2014,null,null,0,null,null,null,2014,{"$f":"IF(L192=0,\"\",L193/L192-1)","v":0},0,null,null,null,2014,{"$f":"IF(R192=\"\",\"\",IF(R192=0,\"\",R193/R192-1))","v":0},0]
[null,null,null,2015,null,null,5.1344743276283689E-2,null,null,null,2015,{"$f":"IF(L193=0,\"\",L194/L193-1)","v":3.8137337814078798E-2},3.8137337814078798E-2,null,null,null,2015,{"$f":"IF(R193=\"\",\"\",IF(R193=0,\"\",R194/R193-1))","v":-1.2562392637306519E-2},-1.2562392637306519E-2]
[null,null,null,2016,null,null,0.17325581395348832,null,null,null,2016,{"$f":"IF(L194=0,\"\",L195/L194-1)","v":8.508118218627736E-3},8.508118218627736E-3,null,null,null,2016,{"$f":"IF(R194=\"\",\"\",IF(R194=0,\"\",R195/R194-1))","v":-0.14041924512584747},-0.14041924512584747]
[null,null,null,2017,null,null,2.4777006937561907E-2,null,null,null,2017,{"$f":"IF(K196=\"Forecast\",\"\",IF(L195=0,\"\",L196/L195-1))","v":""},{"$f":"IF(M195=0,\"\",M196/M195-1)","v":2.4568845066604172E-2},null,null,null,2017,{"$f":"IF(Q196=\"Forecast\",\"\",IF(R195=0,\"\",R196/R195-1))","v":""},{"$f":"IF(S195=\"\",\"\",IF(S195=0,\"\",S196/S195-1))","v":-2.0312894371010692E-4}]
[null,null,null,2018,null,null,2.5145067698259194E-2,null,{"$f":"IF(I198=0,\"\",G197/I198-1)","v":""},null,2018,{"$f":"IF(K197=\"Forecast\",\"\",IF(L196=0,\"\",L197/L196-1))","v":""},{"$f":"IF(M196=0,\"\",M197/M196-1)","v":2.4568845066604394E-2},null,{"$f":"IF(O198=0,\"\",M197/O198-1)","v":""},null,2018,{"$f":"IF(Q197=\"Forecast\",\"\",IF(R196=0,\"\",R197/R196-1))","v":""},{"$f":"IF(S196=\"\",\"\",IF(S196=0,\"\",S197/S196-1))","v":-5.6208886899167254E-4},null,{"$f":"IF(U198=0,\"\",S197/U198-1)","v":""}]
[null,null,null,"Geometric Mean",null,null,{"$f":"IF(G191=0,\"\",GEOMEAN(G201:G206))","v":{"$error":"#NUM!"}},null,{"$f":"IF(I198=0,\"\",(G197/I198)^(1/(TestYear-RebaseYear-1))-1)","v":""},null,"Geometric Mean",null,{"$f":"IF(M191=0,\"\",(M197/M191)^(1/(K206-K200-1)-1))","v":0.91911598573135622},null,{"$f":"IF(O198=0,\"\",(M197/O198)^(1/(TestYear-RebaseYear-1))-1)","v":""},null,"Geometric Mean",null,{"$f":"IF(S191=\"\",\"\",IF(S191=0,\"\",(S197/S191)^(1/(Q206-Q200-1)-1)))","v":1.1308691817527199},null,{"$f":"IF(U198=0,\"\",(S197/U198)^(1/(TestYear-RebaseYear-1))-1)","v":""}]
[]
[null,null,null,"Calendar Year",null,"Revenues",null,null,null,null,{"$f":"IF(ISBLANK(N187),\"\",CONCATENATE(\"Demand (\",N187,\")\"))","v":"Demand (kW)"},null,null,null,null,null,{"$f":"CONCATENATE(\"Demand (\",N187,\") per \",LEFT(F189,LEN(F189)-1))","v":"Demand (kW) per Customer"}]
[null,null,null,{"$f":"CONCATENATE(\"(for \",TestYear,\" Cost of Service\")","v":"(for 2018 Cost of Service"},null,null,null,null,null,null,null,"Actual (Weather actual)","Weather-normalized",null,{"$f":"M210","v":"Weather-normalized"},null,null,{"$f":"L210","v":"Actual (Weather actual)"},{"$f":"M210","v":"Weather-normalized"},null,{"$f":"O210","v":"Weather-normalized"}]
[null,null,"Historical",{"$f":"D212-1","v":2012},null,{"$f":"F191","v":"Actual"},null,{"$f":"IF(D211=RebaseYear,\"Board-approved\",\"\")","v":""},null,null,{"$f":"K191","v":"Actual"},1003,1003,{"$f":"N191","v":""},null,null,{"$f":"K211","v":"Actual"},{"$f":"IF(G211=0,\"\",L211/G211)","v":""},{"$f":"IF(G211=0,\"\",M211/G211)","v":""},{"$f":"N211","v":""},{"$f":"IF(T211=\"\",\"\",IF(I211=0,\"\",O211/I211))","v":""}]
[null,null,"Historical",2013,null,"Actual",null,"",null,null,"Actual",1003,1003,"",null,null,{"$f":"K212","v":"Actual"},{"$f":"IF(G212=0,\"\",L212/G212)","v":""},{"$f":"IF(G212=0,\"\",M212/G212)","v":""},{"$f":"N212","v":""},{"$f":"IF(T212=\"\",\"\",IF(I212=0,\"\",O212/I212))","v":""}]
[null,null,"Historical",2014,null,"Actual",16923,"Board-approved",null,null,"Actual",1003,1003,"Board-approved",null,null,"Actual",5.9268451220232818E-2,5.9268451220232818E-2,"Board-approved",""]
[null,null,"Historical",2015,null,"Actual",18510,"",null,null,"Actual",1050,1050,"",null,null,"Actual",5.6726094003241488E-2,5.6726094003241488E-2,"",""]
[null,null,"Historical",2016,null,"Actual",20334,"",null,null,"Actual",576,576,"",null,null,"Actual",2.832694010032458E-2,2.832694010032458E-2,"",""]
[null,null,"Bridge Year (Forecast)",2017,null,"Forecast",17115,"",null,null,"Forecast",null,590,"",null,null,"Forecast",0,3.4472684779433244E-2,"",""]
[null,null,"Test Year (Forecast)",{"$f":"TestYear","v":2018},null,"Forecast",23154,"",null,null,"Forecast",null,605,"",null,null,"Forecast",0,2.6129394489073161E-2,"",""]
[null,null,null,null,null,null,null,null,{"$f":"SUM(I211:I216)","v":0},null,null,null,null,null,{"$f":"SUM(O211:O216)","v":0},null,null,null,null,null,{"$f":"SUM(U211:U216)","v":0}]
[null,null,"Variance Analysis","Year",null,null,"Year-over-year",null,{"$f":"I199","v":"Test Year Versus Board-approved"},null,"Year","Year-over-year",null,null,{"$f":"I219","v":"Test Year Versus Board-approved"},null,"Year","Year-over-year",null,null,{"$f":"O219","v":"Test Year Versus Board-approved"}]
[null,null,null,{"$f":"D211","v":2012},null,null,null,null,null,null,{"$f":"D220","v":2012},null,null,null,null,null,{"$f":"K220","v":2012}]
[null,null,null,{"$f":"D212","v":2013},null,null,{"$f":"IF(G211=0,\"\",G212/G211-1)","v":""},null,null,null,{"$f":"D221","v":2013},{"$f":"IF(L211=0,\"\",L212/L211-1)","v":0},{"$f":"IF(M211=0,\"\",M212/M211-1)","v":0},null,null,null,{"$f":"K221","v":2013},{"$f":"IF(R211=\"\",\"\",IF(R211=0,\"\",R212/R211-1))","v":""},{"$f":"IF(S211=\"\",\"\",IF(S211=0,\"\",S212/S211-1))","v":""}]
[null,null,null,{"$f":"D213","v":2014},null,null,{"$f":"IF(G212=0,\"\",G213/G212-1)","v":""},null,null,null,2014,{"$f":"IF(L212=0,\"\",L213/L212-1)","v":0},0,null,null,null,2014,{"$f":"IF(R212=\"\",\"\",IF(R212=0,\"\",R213/R212-1))","v":""},""]
[null,null,null,2015,null,null,9.3777698989540914E-2,null,null,null,2015,{"$f":"IF(L213=0,\"\",L214/L213-1)","v":4.6859421734795514E-2},4.6859421734795514E-2,null,null,null,2015,{"$f":"IF(R213=\"\",\"\",IF(R213=0,\"\",R214/R213-1))","v":-4.2895624310213654E-2},-4.2895624310213654E-2]
[null,null,null,2016,null,null,9.8541329011345269E-2,null,null,null,2016,{"$f":"IF(L214=0,\"\",L215/L214-1)","v":-0.4514285714285714},-0.4514285714285714,null,null,null,2016,{"$f":"IF(R214=\"\",\"\",IF(R214=0,\"\",R215/R214-1))","v":-0.50063651308856383},-0.50063651308856383]
[null,null,null,2017,null,null,-0.15830628503983479,null,null,null,2017,{"$f":"IF(K216=\"Forecast\",\"\",IF(L215=0,\"\",L216/L215-1))","v":""},{"$f":"IF(M215=0,\"\",M216/M215-1)","v":2.430555555555558E-2},null,null,null,2017,{"$f":"IF(Q216=\"Forecast\",\"\",IF(R215=0,\"\",R216/R215-1))","v":""},{"$f":"IF(S215=\"\",\"\",IF(S215=0,\"\",S216/S215-1))","v":0.21695759080728405}]
[null,null,null,2018,null,null,0.35284837861524987,null,{"$f":"IF(I218=0,\"\",G217/I218-1)","v":""},null,2018,{"$f":"IF(K217=\"Forecast\",\"\",IF(L216=0,\"\",L217/L216-1))","v":""},{"$f":"IF(M216=0,\"\",M217/M216-1)","v":2.5423728813559254E-2},null,{"$f":"IF(O218=0,\"\",M217/O218-1)","v":""},null,2018,{"$f":"IF(Q217=\"Forecast\",\"\",IF(R216=0,\"\",R217/R216-1))","v":""},{"$f":"IF(S216=\"\",\"\",IF(S216=0,\"\",S217/S216-1))","v":-0.24202612427036074},null,{"$f":"IF(U218=0,\"\",S217/U218-1)","v":""}]
[null,null,null,"Geometric Mean",null,null,{"$f":"IF(G211=0,\"\",GEOMEAN(G221:G226))","v":""},null,{"$f":"IF(I218=0,\"\",(G217/I218)^(1/(TestYear-RebaseYear-1))-1)","v":""},null,"Geometric Mean",null,{"$f":"IF(M211=0,\"\",GEOMEAN(M221:M226))","v":{"$error":"#NUM!"}},null,{"$f":"IF(O218=0,\"\",(M217/O218)^(1/(TestYear-RebaseYear-1))-1)","v":""},null,"Geometric Mean",null,{"$f":"IF(S211=\"\",\"\",IF(S211=0,\"\",(S217/S211)^(1/(Q226-Q220-1)-1)))","v":""},null,{"$f":"IF(U218=0,\"\",(S217/U218)^(1/(TestYear-RebaseYear-1))-1)","v":""}]
[]
[]
[]
[]
[null,5,"Customer Class:","Unmetered Scattered Load",null,null,null,"Is the customer class billed on consumption (kWh) or demand (kW or kVA)?",null,null,null,null,null,"kWh"]
[]
[null,null,null,"Calendar Year",null,"Customers",null,null,null,null,"Consumption (kWh) (3)",null,null,null,null,null,{"$f":"CONCATENATE(\"Consumption (kWh) per \",LEFT(F234,LEN(F234)-1))","v":"Consumption (kWh) per Customer"}]
[null,null,null,{"$f":"CONCATENATE(\"(for \",TestYear,\" Cost of Service\")","v":"(for 2018 Cost of Service"},null,null,null,null,null,null,null,"Actual (Weather actual)","Weather-normalized",null,"Weather-normalized",null,null,{"$f":"L235","v":"Actual (Weather actual)"},{"$f":"M235","v":"Weather-normalized"},null,{"$f":"O235","v":"Weather-normalized"}]
[null,null,"Historical",{"$f":"D237-1","v":2012},null,{"$f":"F191","v":"Actual"},19,{"$f":"IF(D236=RebaseYear,\"Board-approved\",\"\")","v":""},null,null,{"$f":"F236","v":"Actual"},89208,89208,{"$f":"H236","v":""},null,null,{"$f":"K236","v":"Actual"},{"$f":"IF(G236=0,\"\",L236/G236)","v":4695.1578947368425},{"$f":"IF(G236=0,\"\",M236/G236)","v":4695.1578947368425},{"$f":"N236","v":""},{"$f":"IF(T236=\"\",\"\",IF(I236=0,\"\",O236/I236))","v":""}]
[null,null,"Historical",2013,null,"Actual",19,"",null,null,{"$f":"F237","v":"Actual"},89208,89208,{"$f":"H237","v":""},null,null,{"$f":"K237","v":"Actual"},{"$f":"IF(G237=0,\"\",L237/G237)","v":4695.1578947368425},{"$f":"IF(G237=0,\"\",M237/G237)","v":4695.1578947368425},{"$f":"N237","v":""},{"$f":"IF(T237=\"\",\"\",IF(I237=0,\"\",O237/I237))","v":""}]
[null,null,"Historical",2014,null,"Actual",19,"Board-approved",null,null,"Actual",89075,89075,"Board-approved",null,null,"Actual",4688.1578947368425,4688.1578947368425,"Board-approved",""]
[null,null,"Historical",2015,null,"Actual",18.5,"",null,null,"Actual",94284,94284,"",null,null,"Actual",5096.4324324324325,5096.4324324324325,"",""]
[null,null,"Historical",2016,null,"Actual",17.5,"",null,null,"Actual",94284,94284,"",null,null,"Actual",5387.6571428571433,5387.6571428571433,"",""]
[null,null,"Bridge Year",2017,null,"Forecast",17,"",null,null,"Forecast",null,82356.483908401628,"",null,null,"Forecast",0,4844.4990534353901,"",""]
[null,null,"Test Year",{"$f":"TestYear","v":2018},null,"Forecast",17,"",null,null,"Forecast",null,82356.483908401628,"",null,null,"Forecast",0,4844.4990534353901,"",""]
[null,null,null,null,null,null,null,null,{"$f":"SUM(I236:I241)","v":0},null,null,null,null,null,{"$f":"SUM(O236:O241)","v":0},null,null,null,null,null,{"$f":"SUM(U236:U241)","v":0}]
[null,null,"Variance Analysis","Year",null,null,"Year-over-year",null,"Test Year Versus Board-approved",null,"Year","Year-over-year",null,null,{"$f":"I244","v":"Test Year Versus Board-approved"},null,"Year","Year-over-year",null,null,{"$f":"O244","v":"Test Year Versus Board-approved"}]
[null,null,null,{"$f":"D236","v":2012},null,null,null,null,null,null,{"$f":"D245","v":2012},null,null,null,null,null,{"$f":"K245","v":2012}]
[null,null,null,2013,null,null,{"$f":"IF(G236=0,\"\",G237/G236-1)","v":0},null,null,null,{"$f":"D246","v":2013},{"$f":"IF(L236=0,\"\",L237/L236-1)","v":0},0,null,null,null,{"$f":"K246","v":2013},{"$f":"IF(R236=\"\",\"\",IF(R236=0,\"\",R237/R236-1))","v":0},{"$f":"IF(S236=\"\",\"\",IF(S236=0,\"\",S237/S236-1))","v":0}]
[null,null,null,2014,null,null,0,null,null,null,2014,{"$f":"IF(L237=0,\"\",L238/L237-1)","v":-1.4908976773383431E-3},-1.4908976773383431E-3,null,null,null,2014,{"$f":"IF(R237=\"\",\"\",IF(R237=0,\"\",R238/R237-1))","v":-1.4908976773383431E-3},-1.4908976773383431E-3]
[null,null,null,2015,null,null,-2.6315789473684181E-2,null,null,null,2015,{"$f":"IF(L238=0,\"\",L239/L238-1)","v":5.8478809991580061E-2},5.8478809991580061E-2,null,null,null,2015,{"$f":"IF(R238=\"\",\"\",IF(R238=0,\"\",R239/R238-1))","v":8.7086345396757858E-2},8.7086345396757858E-2]
[null,null,null,2016,null,null,-5.4054054054054057E-2,null,null,null,2016,{"$f":"IF(L239=0,\"\",L240/L239-1)","v":0},0,null,null,null,2016,{"$f":"IF(R239=\"\",\"\",IF(R239=0,\"\",R240/R239-1))","v":5.7142857142857162E-2},5.7142857142857162E-2]
[null,null,null,2017,null,null,-2.8571428571428581E-2,null,null,null,2017,{"$f":"IF(K241=\"Forecast\",\"\",IF(L240=0,\"\",L241/L240-1))","v":""},{"$f":"IF(M240=0,\"\",M241/M240-1)","v":-0.12650625866104925},null,null,null,2017,{"$f":"IF(Q241=\"Forecast\",\"\",IF(R240=0,\"\",R241/R240-1))","v":""},{"$f":"IF(S240=\"\",\"\",IF(S240=0,\"\",S241/S240-1))","v":-0.10081526626872728}]
[null,null,null,2018,null,null,0,null,{"$f":"IF(I243=0,\"\",G242/I243-1)","v":""},null,2018,{"$f":"IF(K242=\"Forecast\",\"\",IF(L241=0,\"\",L242/L241-1))","v":""},{"$f":"IF(M241=0,\"\",M242/M241-1)","v":0},null,{"$f":"IF(O243=0,\"\",M242/O243-1)","v":""},null,2018,{"$f":"IF(Q242=\"Forecast\",\"\",IF(R241=0,\"\",R242/R241-1))","v":""},{"$f":"IF(S241=\"\",\"\",IF(S241=0,\"\",S242/S241-1))","v":0},null,{"$f":"IF(U243=0,\"\",S242/U243-1)","v":""}]
[null,null,null,"Geometric Mean",null,null,{"$f":"IF(G236=0,\"\",GEOMEAN(G246:G251))","v":{"$error":"#NUM!"}},null,{"$f":"IF(I243=0,\"\",(G242/I243)^(1/(TestYear-RebaseYear-1))-1)","v":""},null,"Geometric Mean",null,{"$f":"IF(M236=0,\"\",(M242/M236)^(1/(K251-K245-1)-1))","v":1.0660186551409845},null,{"$f":"IF(O243=0,\"\",(M242/O243)^(1/(TestYear-RebaseYear-1))-1)","v":""},null,"Geometric Mean",null,{"$f":"IF(S236=\"\",\"\",IF(S236=0,\"\",(S242/S236)^(1/(Q251-Q245-1)-1)))","v":0.9752614575285854},null,{"$f":"IF(U243=0,\"\",(S242/U243)^(1/(TestYear-RebaseYear-1))-1)","v":""}]
[]
[]
[null,null,null,"Calendar Year",null,"Revenues",null,null,null,null,{"$f":"IF(ISBLANK(N232),\"\",CONCATENATE(\"Demand (\",N232,\")\"))","v":"Demand (kWh)"},null,null,null,null,null,{"$f":"CONCATENATE(\"Demand (\",N232,\") per \",LEFT(F234,LEN(F234)-1))","v":"Demand (kWh) per Customer"}]
[null,null,null,{"$f":"CONCATENATE(\"(for \",TestYear,\" Cost of Service\")","v":"(for 2018 Cost of Service"},null,null,null,null,null,null,null,"Actual (Weather actual)","Weather-normalized",null,{"$f":"M256","v":"Weather-normalized"},null,null,{"$f":"L256","v":"Actual (Weather actual)"},{"$f":"M256","v":"Weather-normalized"},null,{"$f":"O256","v":"Weather-normalized"}]
[null,null,"Historical",{"$f":"D258-1","v":2012},null,{"$f":"F236","v":"Actual"},null,{"$f":"IF(D257=RebaseYear,\"Board-approved\",\"\")","v":""},null,null,{"$f":"K236","v":"Actual"},null,null,{"$f":"N236","v":""},null,null,{"$f":"K257","v":"Actual"},{"$f":"IF(G257=0,\"\",L257/G257)","v":""},{"$f":"IF(G257=0,\"\",M257/G257)","v":""},{"$f":"N257","v":""},{"$f":"IF(T257=\"\",\"\",IF(I257=0,\"\",O257/I257))","v":""}]
[null,null,"Historical",2013,null,"Actual",null,"",null,null,"Actual",null,null,"",null,null,{"$f":"K258","v":"Actual"},{"$f":"IF(G258=0,\"\",L258/G258)","v":""},{"$f":"IF(G258=0,\"\",M258/G258)","v":""},{"$f":"N258","v":""},{"$f":"IF(T258=\"\",\"\",IF(I258=0,\"\",O258/I258))","v":""}]
[null,null,"Historical",2014,null,"Actual",4800,"Board-approved",null,null,"Actual",null,null,"Board-approved",null,null,"Actual",0,0,"Board-approved",""]
[null,null,"Historical",2015,null,"Actual",4900,"",null,null,"Actual",null,null,"",null,null,"Actual",0,0,"",""]
[null,null,"Historical",2016,null,"Actual",4741,"",null,null,"Actual",null,null,"",null,null,"Actual",0,0,"",""]
[null,null,"Bridge Year (Forecast)",2017,null,"Forecast",4883,"",null,null,"Forecast",null,null,"",null,null,"Forecast",0,0,"",""]
[null,null,"Test Year (Forecast)",{"$f":"TestYear","v":2018},null,"Forecast",5847,"",null,null,"Forecast",null,null,"",null,null,"Forecast",0,0,"",""]
[null,null,null,null,null,null,null,null,{"$f":"SUM(I257:I262)","v":0},null,null,null,null,null,{"$f":"SUM(O257:O262)","v":0},null,null,null,null,null,{"$f":"SUM(U257:U262)","v":0}]
[null,null,"Variance Analysis","Year",null,null,"Year-over-year",null,{"$f":"I244","v":"Test Year Versus Board-approved"},null,"Year","Year-over-year",null,null,{"$f":"I265","v":"Test Year Versus Board-approved"},null,"Year","Year-over-year",null,null,{"$f":"O265","v":"Test Year Versus Board-approved"}]
[null,null,null,{"$f":"D257","v":2012},null,null,null,null,null,null,{"$f":"D266","v":2012},null,null,null,null,null,{"$f":"K266","v":2012}]
[null,null,null,{"$f":"D258","v":2013},null,null,{"$f":"IF(G257=0,\"\",G258/G257-1)","v":""},null,null,null,{"$f":"D267","v":2013},{"$f":"IF(L257=0,\"\",L258/L257-1)","v":""},{"$f":"IF(M257=0,\"\",M258/M257-1)","v":""},null,null,null,{"$f":"K267","v":2013},{"$f":"IF(R257=\"\",\"\",IF(R257=0,\"\",R258/R257-1))","v":""},{"$f":"IF(S257=\"\",\"\",IF(S257=0,\"\",S258/S257-1))","v":""}]
[null,null,null,{"$f":"D259","v":2014},null,null,{"$f":"IF(G258=0,\"\",G259/G258-1)","v":""},null,null,null,2014,{"$f":"IF(L258=0,\"\",L259/L258-1)","v":""},"",null,null,null,2014,{"$f":"IF(R258=\"\",\"\",IF(R258=0,\"\",R259/R258-1))","v":""},""]
[null,null,null,2015,null,null,2.0833333333333259E-2,null,null,null,2015,{"$f":"IF(L259=0,\"\",L260/L259-1)","v":""},"",null,null,null,2015,{"$f":"IF(R259=\"\",\"\",IF(R259=0,\"\",R260/R259-1))","v":""},""]
[null,null,null,2016,null,null,-3.244897959183668E-2,null,null,null,2016,{"$f":"IF(L260=0,\"\",L261/L260-1)","v":""},"",null,null,null,2016,{"$f":"IF(R260=\"\",\"\",IF(R260=0,\"\",R261/R260-1))","v":""},""]
[null,null,null,2017,null,null,2.9951487028053059E-2,null,null,null,2017,{"$f":"IF(K262=\"Forecast\",\"\",IF(L261=0,\"\",L262/L261-1))","v":""},{"$f":"IF(M261=0,\"\",M262/M261-1)","v":""},null,null,null,2017,{"$f":"IF(Q262=\"Forecast\",\"\",IF(R261=0,\"\",R262/R261-1))","v":""},{"$f":"IF(S261=\"\",\"\",IF(S261=0,\"\",S262/S261-1))","v":""}]
[null,null,null,2018,null,null,0.19741961908662709,null,{"$f":"IF(I264=0,\"\",G263/I264-1)","v":""},null,2018,{"$f":"IF(K263=\"Forecast\",\"\",IF(L262=0,\"\",L263/L262-1))","v":""},{"$f":"IF(M262=0,\"\",M263/M262-1)","v":""},null,{"$f":"IF(O264=0,\"\",M263/O264-1)","v":""},null,2018,{"$f":"IF(Q263=\"Forecast\",\"\",IF(R262=0,\"\",R263/R262-1))","v":""},{"$f":"IF(S262=\"\",\"\",IF(S262=0,\"\",S263/S262-1))","v":""},null,{"$f":"IF(U264=0,\"\",S263/U264-1)","v":""}]
[null,null,null,"Geometric Mean",null,null,{"$f":"IF(G257=0,\"\",GEOMEAN(G267:G272))","v":""},null,{"$f":"IF(I264=0,\"\",(G263/I264)^(1/(TestYear-RebaseYear-1))-1)","v":""},null,"Geometric Mean",null,{"$f":"IF(M257=0,\"\",GEOMEAN(M267:M272))","v":""},null,{"$f":"IF(O264=0,\"\",(M263/O264)^(1/(TestYear-RebaseYear-1))-1)","v":""},null,"Geometric Mean",null,{"$f":"IF(S257=\"\",\"\",IF(S257=0,\"\",(S263/S257)^(1/(Q272-Q266-1)-1)))","v":""},null,{"$f":"IF(U264=0,\"\",(S263/U264)^(1/(TestYear-RebaseYear-1))-1)","v":""}]
[]
[]
[]
[null,"Note: If there are more than ten (10) customer classes, please contact OEB Staff to add tables for additional customer classes."]

{"sheet":"App.2-JA_OM&A_Summary_Analys","index":31,"n_rows":61,"n_cols":12,"rows_kept":61,"cut":false,"hidden":false,"merged":[[63,1,64,5],[58,0,59,11],[8,0,8,6],[9,0,9,6],[12,7,12,8]]}
[null,null,null,null,null,null,null,null,null,null,"File Number:",{"$f":"EBNUMBER","v":0}]
[null,null,null,null,null,null,null,null,null,null,"Exhibit:"]
[null,null,null,null,null,null,null,null,null,null,"Tab:"]
[null,null,null,null,null,null,null,null,null,null,"Schedule:"]
[null,null,null,null,null,null,null,null,null,null,"Page:"]
[]
[null,null,null,null,null,null,null,null,null,null,"Date:"]
[]
["Appendix 2-JA"]
["Summary of Recoverable OM&A Expenses"]
[]
[]
[null,{"$f":"\"Last Rebasing Year (\" & RebaseYear & \" Board-Approved)\"","v":"Last Rebasing Year (2014 Board-Approved)"},{"$f":"\"Last Rebasing Year (\" & RebaseYear & \" Actuals)\"","v":"Last Rebasing Year (2014 Actuals)"},{"$f":"BridgeYear -2 & \" Actuals\"","v":"2015 Actuals"},{"$f":"BridgeYear -1 & \" Actuals\"","v":"2016 Actuals"},{"$f":"BridgeYear & \" Bridge Year\"","v":"2017 Bridge Year"},{"$f":"TestYear & \" Test Year\"","v":"2018 Test Year"}]
["Reporting Basis"]
["Operations",20900,28850.979999999996,39763.949999999997,34208.83,35830,37769]
["Maintenance",40300,44654.86,26250.54,46222.76,50645,56215]
["SubTotal",{"$f":"SUM(B15:B16)","v":61200},{"$f":"SUM(C15:C16)","v":73505.84},66014.489999999991,80431.59,86475,93984]
["%Change (year over year)",null,null,{"$f":"IF(ISERROR((D17-C17)/C17), \"\", (D17-C17)/C17)","v":-0.10191503151314243},{"$f":"IF(ISERROR((E17-D17)/D17), \"\", (E17-D17)/D17)","v":0.21839296190881741},7.5137268826837855E-2,8.6834345186470083E-2]
["%Change (Test Year vs \nLast Rebasing Year - Actual)",null,null,null,null,null,{"$f":"IF(ISERROR((G17-C17)/C17), \"\", (G17-C17)/C17)","v":0.27859228600067704}]
["Billing and Collecting",170174,166890.58000000002,210564.67,177779.02,198023,209970]
["Community Relations",4000,6981.6100000000006,8362.7000000000007,7862.84,7500,7875]
["Administrative and General",320905,321703.07999999996,328130.52,334951.92000000004,359618,410142]
["SubTotal",{"$f":"SUM(B20:B22)","v":495079},{"$f":"SUM(C20:C22)","v":495575.26999999996},547057.89,520593.78,565141,627987]
["%Change (year over year)",null,null,{"$f":"IF(ISERROR((D23-C23)/C23), \"\", (D23-C23)/C23)","v":0.10388456227850122},{"$f":"IF(ISERROR((E23-D23)/D23), \"\", (E23-D23)/D23)","v":-4.837533738888216E-2},{"$f":"IF(ISERROR((F23-E23)/E23), \"\", (F23-E23)/E23)","v":8.5570019680219711E-2},{"$f":"IF(ISERROR((G23-F23)/F23), \"\", (G23-F23)/F23)","v":0.11120410658579009}]
["%Change (Test Year vs \nLast Rebasing Year - Actual)",null,null,null,null,null,{"$f":"IF(ISERROR((G23-C23)/C23), \"\", (G23-C23)/C23)","v":0.2671879288891878}]
["Total",{"$f":"SUM(B23,B17)","v":556279},{"$f":"SUM(C23,C17)","v":569081.11},613072.38,601025.37,651616,721971]
["%Change (year over year)",null,null,{"$f":"IF(ISERROR((D26-C26)/C26), \"\", (D26-C26)/C26)","v":7.7302284730554519E-2},{"$f":"IF(ISERROR((E26-D26)/D26), \"\", (E26-D26)/D26)","v":-1.9650224660259542E-2},{"$f":"IF(ISERROR((F26-E26)/E26), \"\", (F26-E26)/E26)","v":8.4173867735400268E-2},{"$f":"IF(ISERROR((G26-F26)/F26), \"\", (G26-F26)/F26)","v":0.10797003142955361}]
[]
[]
[null,{"$f":"B13","v":"Last Rebasing Year (2014 Board-Approved)"},{"$f":"C13","v":"Last Rebasing Year (2014 Actuals)"},"2015 Actuals","2016 Actuals","2017 Bridge Year","2018 Test Year"]
["Operations",{"$f":"B15","v":20900},{"$f":"C15","v":28850.979999999996},39763.949999999997,34208.83,35830,37769]
["Maintenance",{"$f":"B16","v":40300},{"$f":"C16","v":44654.86},26250.54,46222.76,50645,56215]
["Billing and Collecting",{"$f":"B20","v":170174},{"$f":"C20","v":166890.58000000002},210564.67,177779.02,198023,209970]
["Community Relations",{"$f":"B21","v":4000},{"$f":"C21","v":6981.6100000000006},8362.7000000000007,7862.84,7500,7875]
["Administrative and General",{"$f":"B22","v":320905},{"$f":"C22","v":321703.07999999996},328130.52,334951.92000000004,359618,410142]
["Total",{"$f":"SUM(B31:B35)","v":556279},{"$f":"SUM(C31:C35)","v":569081.11},613072.38000000012,601025.37000000011,651616,721971]
["%Change (year over year)",null,null,{"$f":"IF(ISERROR((D36-C36)/C36), \"\", (D36-C36)/C36)","v":7.7302284730554727E-2},{"$f":"IF(ISERROR((E36-D36)/D36), \"\", (E36-D36)/D36)","v":-1.9650224660259539E-2},{"$f":"IF(ISERROR((F36-E36)/E36), \"\", (F36-E36)/E36)","v":8.417386773540006E-2},{"$f":"IF(ISERROR((G36-F36)/F36), \"\", (G36-F36)/F36)","v":0.10797003142955361}]
[]
[]
[null,{"$f":"B13","v":"Last Rebasing Year (2014 Board-Approved)"},{"$f":"C13","v":"Last Rebasing Year (2014 Actuals)"},{"$f":"\"Variance \" & 'LDC Info'!E28 & \"  BA – \" & 'LDC Info'!E28 & \" Actuals\"","v":"Variance 2014  BA – 2014 Actuals"},{"$f":"D13","v":"2015 Actuals"},{"$f":"\"Variance \" & 'LDC Info'!E26 -2 & \" Actuals vs. \" &  'LDC Info'!E28 & \" Actuals\"","v":"Variance 2015 Actuals vs. 2014 Actuals"},{"$f":"E13","v":"2016 Actuals"},{"$f":"\"Variance \" & 'LDC Info'!E26 -1 & \" Actuals vs. \" &  'LDC Info'!E26-2 & \" Actuals\"","v":"Variance 2016 Actuals vs. 2015 Actuals"},{"$f":"F13","v":"2017 Bridge Year"},{"$f":"\"Variance \" & 'LDC Info'!E26 & \" Bridge vs. \" & 'LDC Info'!E26 -1 & \" Actuals\"","v":"Variance 2017 Bridge vs. 2016 Actuals"},{"$f":"G13","v":"2018 Test Year"},{"$f":"\"Variance \" & TestYear & \" Test vs. \" & BridgeYear & \" Bridge\"","v":"Variance 2018 Test vs. 2017 Bridge"}]
["Operations",{"$f":"B15","v":20900},28850.979999999996,{"$f":"B41-C41","v":-7950.9799999999959},{"$f":"D15","v":39763.949999999997},{"$f":"E41-C41","v":10912.970000000001},{"$f":"E15","v":34208.83},{"$f":"G41-E41","v":-5555.1199999999953},{"$f":"F15","v":35830},{"$f":"I41-G41","v":1621.1699999999983},{"$f":"G15","v":37769},{"$f":"K41-I41","v":1939}]
["Maintenance ",40300,44654.86,{"$f":"B42-C42","v":-4354.8600000000006},{"$f":"D16","v":26250.54},{"$f":"E42-C42","v":-18404.32},{"$f":"E16","v":46222.76},{"$f":"G42-E42","v":19972.22},{"$f":"F16","v":50645},4422.239999999998,{"$f":"G16","v":56215},5570]
["Billing and Collecting ",{"$f":"B20","v":170174},166890.58000000002,3283.4199999999837,{"$f":"D20","v":210564.67},43674.09,{"$f":"E20","v":177779.02},-32785.650000000023,{"$f":"F20","v":198023},20243.98000000001,{"$f":"G20","v":209970},11947]
["Community Relations ",4000,6981.6100000000006,-2981.6100000000006,{"$f":"D21","v":8362.7000000000007},1381.0900000000001,{"$f":"E21","v":7862.84},-499.86000000000058,{"$f":"F21","v":7500},-362.84000000000015,{"$f":"G21","v":7875},375]
["Administrative and General ",320905,321703.07999999996,-798.07999999995809,328130.52,6427.4400000000605,334951.92000000004,6821.4000000000233,359618,24666.079999999958,410142,50524]
["Total OM&A Expenses ",{"$f":"SUM(B41:B45)","v":556279},{"$f":"SUM(C41:C45)","v":569081.11},-12802.109999999971,613072.38000000012,43991.270000000062,601025.37000000011,-12047.009999999995,651616,50590.629999999961,721971,70355]
["Adjustments for Total non-recoverable items (from Appendices 2-JA and 2-JB)"]
["Total Recoverable OM&A Expenses ",{"$f":"B46-B47","v":556279},{"$f":"C46-C47","v":569081.11},-12802.109999999971,613072.38000000012,43991.270000000062,601025.37000000011,-12047.009999999995,651616,50590.629999999961,721971,70355]
["Variance from previous year ",null,null,null,{"$f":"E48-C48","v":43991.270000000135},null,{"$f":"G48-E48","v":-12047.010000000009},null,{"$f":"I48-G48","v":50590.629999999888},null,{"$f":"K48-I48","v":70355}]
["Percent change (year over year) ",null,null,null,{"$f":"IF(ISERROR(E49/C48), \"\", E49/C48)","v":7.7302284730554727E-2},null,{"$f":"IF(ISERROR(G49/E48), \"\", G49/E48)","v":-1.9650224660259539E-2},null,{"$f":"IF(ISERROR(I49/G48), \"\", I49/G48)","v":8.417386773540006E-2},null,{"$f":"IF(ISERROR(K49/I48), \"\", K49/I48)","v":0.10797003142955361}]
["Percent Change:                                                    Test year vs. Most Current Actual ",null,null,null,null,null,{"$f":"IF(ISERROR((K48-G48)/G48), \"\", (K48-G48)/G48)","v":0.20123215430989189}]
["Simple average of % variance for all years",null,null,null,null,null,{"$f":"IF(ISERROR((K46-C46)/C46), \"\", (K46-C46)/C46)","v":0.2686609822631435},null,null,null,null,{"$f":"IF(ISERROR(AVERAGE(E50,G50,I50,K50)), \"\", AVERAGE(E50,G50,I50,K50))","v":6.2448989808812215E-2}]
["Compound Annual Growth Rate for all years",null,null,null,null,null,{"$f":"IF(ISERROR((K49-C49)/C49), \"\", (K49-C49)/C49)","v":""},null,null,null,null,{"$f":"IF((K48-C48)=0, \"\", (K48/C48)^(1/5)-1)","v":4.8743100419584851E-2}]
[{"$f":"\"Compound Growth Rate                                                            (\" & E13 & \" vs. \" & 'LDC Info'!E28 & \" Actuals)\"","v":"Compound Growth Rate                                                            (2016 Actuals vs. 2014 Actuals)"},null,null,null,null,null,{"$f":"IF(ISERROR((G48/C48)^(1/(3)) - 1), \"\", (G48/C48)^(1/(3)) - 1)","v":1.837144091422882E-2}]
[]
["Note:"]
[]
["1     \"BA\" = Board-Approved"]
["2     If it has been more than three years since the applicant last filed a cost of service application, additional years of historical actuals should be incorporated into the table, as necessary, to go back to the last cost of service application.  If the applicant last filed a cost of service application less than three years ago, a minimum of three years of actual information is required."]
[]
["3     Recoverable OM&A that is included on these tables should be identical to the recoverable OM&A that is shown for the corresponding periods on Appendix 2-JB."]

{"sheet":"App.2-JB_OM&A_Cost _Drivers","index":32,"n_rows":34,"n_cols":6,"rows_kept":34,"cut":false,"hidden":false,"merged":[[9,0,9,5],[10,0,10,5],[30,1,32,5],[33,1,34,5],[29,1,29,5]]}
[null,null,null,null,"File Number:",{"$f":"EBNUMBER","v":0}]
[null,null,null,null,"Exhibit:"]
[null,null,null,null,"Tab:"]
[null,null,null,null,"Schedule:"]
[null,null,null,null,"Page:"]
[]
[null,null,null,null,"Date:"]
[]
[]
["Appendix 2-JB"]
["Recoverable OM&A Cost Driver Table"]
[]
["OM&A",{"$f":"\"Last Rebasing Year (\" & RebaseYear & \" Actuals)\"","v":"Last Rebasing Year (2014 Actuals)"},{"$f":"BridgeYear -2 & \" Actuals\"","v":"2015 Actuals"},{"$f":"BridgeYear -1 & \" Actuals\"","v":"2016 Actuals"},{"$f":"BridgeYear & \" Bridge Year\"","v":"2017 Bridge Year"},{"$f":"TestYear & \" Test Year\"","v":"2018 Test Year"}]
["Reporting Basis"]
["Opening Balance",630975,{"$f":"B25","v":569081.18000000005},{"$f":"C25","v":613072.44999999995},601025.16,651615.92999999993]
["5315-Customer Billing\n",-84569.049999999988,44203.31,-33024.210000000021,14828.820000000007,11732]
["5605-Executive Salaries and Expenses\n",10559.809999999998]
["5610-Management Salaries and Expenses\n",null,11903.989999999991,null,11858]
["5655-Regulatory Expenses\n",null,null,null,null,38300]
[]
[]
["Total of Variances < $5000",12115.420000000013,-12116.030000000008,{"$f":"32834.92-11858","v":20976.92},23903.950000000012,20323]
[]
[]
["Closing Balance",{"$f":"SUM(B15:B24)","v":569081.18000000005},{"$f":"SUM(C15:C24)","v":613072.44999999995},{"$f":"SUM(D15:D24)","v":601025.16},{"$f":"SUM(E15:E24)","v":651615.92999999993},{"$f":"SUM(F15:F24)","v":721970.92999999993}]
[]
["Notes:"]
[]
[1,"For each year, a detailed explanation for each cost driver and associated amount is requied in Exhibit 4."]
[2,"For purposes of assessing incremental cost drivers, the closing balance for each year becomes the opening balance for the next year."]
[3,"If it has been more than three years since the applicant last filed a cost of service application, additional years of historical actuals should be incorporated into the table, as necessary, to go back to the last cost of service application.  If the applicant last filed a cost of service application less than three years ago, a minimum of three years of actual information is required."]
[]
[]
[4,"Opening Balance for \"Last Rebasing Year\" (cell B15) should be equal to the Board-Approved amount."]

{"sheet":"App.2-JC_OMA Programs","index":33,"n_rows":94,"n_cols":9,"rows_kept":94,"cut":false,"hidden":false,"merged":[[47,0,47,8],[76,0,76,8],[8,0,8,7],[9,0,9,7]]}
[null,null,null,null,null,null,null,"File Number:",{"$f":"EBNUMBER","v":0}]
[null,null,null,null,null,null,null,"Exhibit:"]
[null,null,null,null,null,null,null,"Tab:"]
[null,null,null,null,null,null,null,"Schedule:"]
[null,null,null,null,null,null,null,"Page:"]
[]
[null,null,null,null,null,null,null,"Date:"]
[]
["Appendix 2-JC"]
["OM&A Programs Table"]
[]
[]
["Reporting Basis",null,"CGAAP","CGAAP","CGAAP","NEWGAAP","NEWGAAP"]
["Programs","USoA",2014,2015,2016,2017,2018,"Variance ($)","Variance ($)"]
[]
["Customer Focus"]
["Customer Service, Mailing Costs, Billing  and  Collections",null,213225.58000000005,255933.13000000003,218475.63,234817,249104,35878.419999999955,30628.369999999995]
["Bad Debts",null,5472.6500000000005,5001.28,4959.84,10000,10000,4527.3499999999995,5040.16]
["Service Locates",null,15890.89,25524.58,19441.63,20400,21420,5529.1100000000006,1978.369999999999]
["Sub-Total",null,{"$f":"SUM(C17:C19)","v":234589.12000000005},286458.99000000005,242877.1,265217,280524,45934.879999999954,37646.899999999994]
[]
["Operational Effectiveness"]
[]
["Administrative Effecitveness ",null,208690.57000000004,214735.91,219074.67,236409,244771,36080.429999999964,25696.329999999987]
["      Regulation Consultant-Services",null,37868.31,42412.13,45071.360000000001,47325,49691,11822.690000000002,4619.6399999999994]
["      Distribution Operating & Maintenance",null,48099.5,29358.04,50315.4,55195,61115,13015.5,10799.599999999999]
[]
[]
["Sub-Total",null,{"$f":"SUM(C24:C28)","v":294658.38},286506.08,314461.43000000005,338929,355577,60918.619999999966,41115.569999999985]
[]
["Public and Regulatory Responsiveness"]
["Regulatory & Compliance ",null,35941.629999999997,36194.21,39811.699999999997,43500,81800,45858.37,41988.3]
["Electrical safety Authorithy",null,1891.98,1913.1,1875.14,1970,2070,178.01999999999998,194.8599999999999]
[]
[]
["Sub-Total",null,{"$f":"SUM(C32:C35)","v":37833.61},38107.31,41686.839999999997,45470,83870,46036.39,42183.16]
[]
[]
["Miscellaneous"]
["Donation Leap",null,2000,2000,2000,2000,2000,0,0]
[]
["Sub-Total",null,{"$f":"SUM(C40:C41)","v":2000},{"$f":"SUM(D40:D41)","v":2000},2000,2000,2000,0,0]
[]
[]
[]
["TOTAL OM&A",null,{"$f":"SUM(C20+C29+C36+C42)","v":569081.11},{"$f":"SUM(D20+D29+D36+D42)","v":613072.38000000012},{"$f":"SUM(E20+E29+E36+E42)","v":601025.37},{"$f":"SUM(F20+F29+F36+F42)","v":651616},{"$f":"SUM(G20+G29+G36+G42)","v":721971},{"$f":"SUM(H20+H29+H36)","v":152889.8899999999},{"$f":"SUM(I20+I29+I36)","v":120945.62999999998}]
[]
["Normalized OM&A Programs Table"]
[null,null,null,null,null,null,null,"Test Year Versus Last Rebasing","Test Year Versus Most Current Actuals"]
["Programs",null,2014,2015,2016,2017,2018,"Variance ($)","Variance ($)"]
["Reporting Basis",null,"CGAAP","CGAAP","CGAAP","CGAAP","CGAAP","CGAAP","CGAAP"]
[]
["Normalized OM&A"]
["Customer Focus"]
["Specify"]
["Specify"]
["Sub-Total",null,{"$f":"SUM(C55:C56)","v":0},0,0,0,0,0,0]
[]
["Operational effectiveness"]
["Specify"]
["Specify"]
["Sub-Total",null,{"$f":"SUM(C60:C61)","v":0},0,0,0,0,0,0]
[]
["Public Policy"]
["Specify"]
["Specify"]
["Sub-Total",null,{"$f":"SUM(C65:C66)","v":0},0,0,0,0,0,0]
[]
["Miscellaneous"]
["Specify"]
["Specify"]
["Sub-Total",null,{"$f":"SUM(C69)","v":0},0,0,0,0,0,0]
[]
["TOTAL Normalized OM&A",null,{"$f":"C46-C73","v":569081.11},613072.38000000012,601025.37,651616,721971,152889.8899999999,120945.62999999998]
[]
[]
["Summarized OM&A Programs Table"]
[]
[null,null,null,null,null,null,null,"Test Year Versus Last Rebasing","Test Year Versus Most Current Actuals"]
["Programs",null,2014,2015,2016,2017,2018,"Variance ($)","Variance ($)"]
["Reporting Basis",null,"CGAAP","CGAAP","CGAAP","CGAAP","CGAAP","CGAAP","CGAAP"]
[]
["Normalized OM&A"]
[]
["Customer Focus",null,{"$f":"C57-C20","v":-234589.12000000005},-286458.99000000005,-242877.1,-265217,-280524,-45934.879999999954,-37646.899999999994]
[]
["Operational effectiveness",null,{"$f":"C62-C29","v":-294658.38},-286506.08,-314461.43000000005,-338929,-355577,-60918.619999999966,-41115.569999999985]
[]
["Public Policy",null,{"$f":"C67-C36","v":-37833.61},-38107.31,-41686.839999999997,-45470,-83870,-46036.39,-42183.16]
[]
["Miscellaneous",null,{"$f":"C72-C42","v":-2000},{"$f":"D72-D42","v":-2000},{"$f":"E72-E42","v":-2000},{"$f":"F72-F42","v":-2000},{"$f":"G72-G42","v":-2000}]
[]
[]
["TOTAL Normalized OM&A",null,{"$f":"C85+C87+C89+C91","v":-569081.11},-613072.38000000012,-601025.37,-651616,{"$f":"G85+G87+G89+G91","v":-721971},{"$f":"H85+H87+H89","v":-152889.8899999999},-120945.62999999998]

{"sheet":"App.2-K_Employee Costs","index":34,"n_rows":32,"n_cols":7,"rows_kept":32,"cut":false,"hidden":false,"merged":[[31,0,31,6],[24,0,24,6],[8,0,8,6],[9,0,9,6],[12,0,12,6],[16,0,16,6],[20,0,20,6]]}
[null,null,null,null,null,"File Number:",{"$f":"EBNUMBER","v":0}]
[null,null,null,null,null,"Exhibit:"]
[null,null,null,null,null,"Tab:"]
[null,null,null,null,null,"Schedule:"]
[null,null,null,null,null,"Page:"]
[]
[null,null,null,null,null,"Date:"]
[]
["Appendix 2-K"]
["Employee Costs"]
[]
[null,{"$f":"\"Last Rebasing Year - \"&RebaseYear&\"- Board Approved\"","v":"Last Rebasing Year - 2014- Board Approved"},{"$f":"\"Last Rebasing Year - \"&RebaseYear&\"-  Actual\"","v":"Last Rebasing Year - 2014-  Actual"},{"$f":"BridgeYear -2 & \" Actuals\"","v":"2015 Actuals"},{"$f":"BridgeYear -1 & \" Actuals\"","v":"2016 Actuals"},{"$f":"BridgeYear & \" Bridge Year\"","v":"2017 Bridge Year"},{"$f":"TestYear & \" Test Year\"","v":"2018 Test Year"}]
["Number of Employees (FTEs including Part-Time)1"]
["Management (including executive)",1,1,1,1,1,1]
["Non-Management (union and non-union)",2,2,2,2,2,2]
["Total",{"$f":"SUM(B14:B15)","v":3},3,3,3,3,3]
["Total Salary and Wages including ovetime and incentive pay"]
["Management (including executive)",null,188050.43,213055.37,233873.83,215007,225000]
["Non-Management (union and non-union)",null,0]
["Total",{"$f":"SUM(B18:B19)","v":0},188050.43,213055.37,233873.83,215007,225000]
["Total Benefits (Current + Accrued) 2"]
["Management (including executive)",null,30053.21,30752.94,26894.33,30136,31650]
["Non-Management (union and non-union)",null,0]
["Total",{"$f":"SUM(B22:B23)","v":0},{"$f":"SUM(C22:C23)","v":30053.21},30752.94,26894.33,30136,31650]
["Total Compensation (Salary, Wages, & Benefits)"]
["Management (including executive)",{"$f":"B18+B22","v":0},218103.63999999998,243808.31,260768.15999999997,245143,256650]
["Non-Management (union and non-union)",0,0,0,0,0,0]
["Total",0,218103.63999999998,243808.31,260768.15999999997,245143,256650]
[]
["Note:"]
["1 If an applicant wishes to use headcount, it must also file the same schedule on an FTE basis."]
["2 Current employee benefits, plus Pension and Other Post-Employment Benefits costs, as recorded for recovery in distribution rates. Should be consistent with OPEBs costs as documented in Appendix 2-KA."]

{"sheet":"App.2-KA_P_OPEBs","index":35,"n_rows":34,"n_cols":11,"rows_kept":34,"cut":false,"hidden":false,"merged":[[35,2,39,10],[8,1,8,10],[9,1,9,10],[11,2,11,9],[14,2,14,10],[16,2,21,10]]}
[null,null,null,null,null,null,null,null,null,"File Number:",{"$f":"EBNUMBER","v":0}]
["NOT APPLICABLE",null,null,null,null,null,null,null,null,"Exhibit:"]
[null,null,null,null,null,null,null,null,null,"Tab:"]
[null,null,null,null,null,null,null,null,null,"Schedule:"]
[null,null,null,null,null,null,null,null,null,"Page:"]
[]
[null,null,null,null,null,null,null,null,null,"Date:"]
[]
[null,"Appendix 2-KA"]
[null,"OPEBs (Other Post-Employment Benefits) Costs"]
[]
[null,"A","Please indicate if OPEBs were recovered on a cash or accrual accounting basis for each year since the distributor started to recover OPEBs in distribution rates from customers:"]
[]
[null,null,"Notes: "]
[null,null,"(Please add any information to explain the accounting basis used for OPEBs cost recovery in rate setting. If basis is other than Cash or Accrual, an explanation is required.)"]
[]
[]
[]
[]
[]
[]
[]
[]
[null,"B","Please complete the following table:"]
[]
[null,null,"OPEBS",{"$f":"CONCATENATE(\"First Year of recovery to \",E26-1)","v":"First Year of recovery to 2012"},{"$f":"F26-1","v":2013},{"$f":"G26-1","v":2014},{"$f":"H26-1","v":2015},{"$f":"I26-1","v":2016},{"$f":"BridgeYear","v":2017},{"$f":"TestYear","v":2018},"Total"]
[null,null,"Amounts included in Rates"]
[null,null,"     OM&A",null,null,null,null,null,null,null,{"$f":"SUM(D28:J28)","v":0}]
[null,null,"     Capital",null,null,null,null,null,null,null,{"$f":"SUM(D29:J29)","v":0}]
[null,null,"     Total",{"$f":"SUM(D28:D29)","v":0},{"$f":"SUM(E28:E29)","v":0},0,0,0,0,0,0]
[null,null,"Paid benefit amounts",null,null,null,null,null,null,null,{"$f":"SUM(D31:J31)","v":0}]
[null,null,"Net excess amount included in rates relative to amounts actually paid.",{"$f":"D30-D31","v":0},{"$f":"E30-E31","v":0},0,0,0,0,0,{"$f":"SUM(D32:J32)","v":0}]
[]
[null,"C","Please describe what the distributor has done with the recoveries in excess of cash payments:"]

{"sheet":"App.2-L_OM&A_per_Cust_FTE","index":36,"n_rows":38,"n_cols":9,"rows_kept":38,"cut":false,"hidden":false,"merged":[[37,2,37,8],[34,2,34,8],[35,2,35,8],[36,2,36,8],[32,2,33,8],[22,1,22,2],[25,1,25,2],[26,1,26,2],[16,1,16,2],[17,1,17,2],[18,1,18,2],[19,1,19,2],[20,1,20,2],[21,1,21,2],[13,1,13,2],[14,1,14,2],[15,1,15,2],[8,1,8,8],[9,1,9,8]]}
[null,null,null,null,null,null,null,"File Number:",{"$f":"EBNUMBER","v":0}]
[null,null,null,null,null,null,null,"Exhibit:"]
[null,null,null,null,null,null,null,"Tab:"]
[null,null,null,null,null,null,null,"Schedule:"]
[null,null,null,null,null,null,null,"Page:"]
[]
[null,null,null,null,null,null,null,"Date:"]
[]
[null,"Appendix 2-L"]
[null,"Recoverable OM&A Cost per Customer and per FTE 1"]
[]
[]
[null,null,null,{"$f":"\"Last Rebasing Year - \"&RebaseYear&\"- Board Approved\"","v":"Last Rebasing Year - 2014- Board Approved"},{"$f":"\"Last Rebasing Year - \"&RebaseYear&\"-  Actual\"","v":"Last Rebasing Year - 2014-  Actual"},{"$f":"BridgeYear -2 & \" Actuals\"","v":"2015 Actuals"},{"$f":"BridgeYear -1 & \" Actuals\"","v":"2016 Actuals"},{"$f":"BridgeYear & \" Bridge Year\"","v":"2017 Bridge Year"},{"$f":"TestYear & \" Test Year\"","v":"2018 Test Year"}]
[null,"Reporting Basis"]
[null,"OM&A Costs"]
[null,"     O&M",null,61200,73505.84,66014.489999999991,80431.59,86475,93984]
[null,"     Admin Expenses",null,320905,321703.07999999996,328130.52,334951.92000000004,359618,410142]
[null,"Total Recoverable OM&A from Appendix 2-JB 5",null,{"$f":"SUM(D16:D17)","v":382105},{"$f":"SUM(E16:E17)","v":395208.91999999993},394145.01,415383.51,446093,504126]
[null,"Number of Customers 2,4",null,2227,1985,2078,2137,2217.1128594490151,2281.1128594490151]
[null,"Number of FTEs 3,4",null,3,3,3,3,3,3]
[null,"Customers/FTEs",null,{"$f":"IF(D20=0,\"\",D19/D20)","v":742.33333333333337},{"$f":"IF(E20=0,\"\",E19/E20)","v":661.66666666666663},692.66666666666663,712.33333333333337,739.03761981633841,760.37095314967166]
[null,"OM&A cost per customer"]
[null,"     O&M per customer",null,{"$f":"IF(D19=0,\"\",D16/D19)","v":27.480916030534353},{"$f":"IF(E19=0,\"\",E16/E19)","v":37.030649874055413},31.768282001924923,37.637618156293868,39.003427196525436,41.200942606014287]
[null,"     Admin per customer",null,{"$f":"IF(D19=0,\"\",D17/D19)","v":144.09744050291872},{"$f":"IF(E19=0,\"\",E17/E19)","v":162.06704282115868},157.90689124157845,156.7393167992513,162.20103476796862,179.79908284724965]
[null,"     Total OM&A per customer",null,{"$f":"IF(D19=0,\"\",D18/D19)","v":171.57835653345307},{"$f":"IF(E19=0,\"\",E18/E19)","v":199.09769269521408},189.67517324350337,194.37693495554515,201.20446196449404,221.00002545326393]
[null,"OM&A cost per FTE"]
[null,"     O&M per FTE",null,{"$f":"IF(D20=0,\"\",D16/D20)","v":20400},{"$f":"IF(E20=0,\"\",E16/E20)","v":24501.946666666667},22004.829999999998,26810.53,28825,31328]
[null,"     Admin per FTE",null,{"$f":"IF(D20=0,\"\",D17/D20)","v":106968.33333333333},{"$f":"IF(E20=0,\"\",E17/E20)","v":107234.35999999999},109376.84000000001,111650.64000000001,119872.66666666667,136714]
[null,"     Total OM&A per FTE",null,{"$f":"IF(D20=0,\"\",D18/D20)","v":127368.33333333333},{"$f":"IF(E20=0,\"\",E18/E20)","v":131736.30666666664},131381.67000000001,138461.17000000001,148697.66666666666,168042]
[]
[null,"Notes:"]
[]
[null,1,"If it has been more than three years since the applicant last filed a cost of service application, additional years of historical actuals should be incorporated into the table, as necessary, to go back to the last cost of service application.  If the applicant last filed a cost of service application less than three years ago, a minimum of three years of actual information is required."]
[]
[null,2,"The method of calculating the number of customers must be identified. Should correspond with data provided in Appendix 2-IB"]
[null,3,"The method of calculating the number of FTEs must be identified.  See also Appendix 2-K"]
[null,4,"The number of customers and the number of FTEs should correspond to mid-year or average of January 1 and December 31 figures."]
[null,5,"For the test year, the applicant should take into account the system O&M (line 22 of Appendix 2-AB) in developing its forecasted OM&A."]

{"sheet":"App.2-L_OM&A_per_Cust_FTEE_exp","index":37,"n_rows":38,"n_cols":12,"rows_kept":38,"cut":false,"hidden":true,"merged":[[8,0,8,11],[9,0,9,11],[34,1,34,6],[35,1,35,6],[21,0,21,1],[22,0,22,1],[25,0,25,1],[14,0,14,1],[13,0,13,1],[11,7,11,11],[15,0,15,1],[16,0,16,1],[17,0,17,1],[37,1,38,11],[36,1,36,11],[32,1,33,11],[19,0,19,1],[18,0,18,1],[20,0,20,1],[26,0,26,1]]}
[null,null,null,null,null,null,null,null,null,null,"File Number:",{"$f":"EBNUMBER","v":0}]
[null,null,null,null,null,null,null,null,null,null,"Exhibit:"]
[null,null,null,null,null,null,null,null,null,null,"Tab:"]
[null,null,null,null,null,null,null,null,null,null,"Schedule:"]
[null,null,null,null,null,null,null,null,null,null,"Page:"]
[]
[null,null,null,null,null,null,null,null,null,null,"Date:"]
[]
["Appendix 2-L"]
["Recoverable OM&A Cost per Customer and per FTE 1"]
[]
[null,null,null,null,null,null,null,"5-year Distribution System Plan Period"]
[null,null,{"$f":"\"Last Rebasing Year - \"&RebaseYear&\"- Board Approved\"","v":"Last Rebasing Year - 2014- Board Approved"},{"$f":"\"Last Rebasing Year - \"&RebaseYear&\"-  Actual\"","v":"Last Rebasing Year - 2014-  Actual"},{"$f":"BridgeYear -2 & \" Actuals\"","v":"2015 Actuals"},{"$f":"BridgeYear -1 & \" Actuals\"","v":"2016 Actuals"},{"$f":"BridgeYear & \" Bridge Year\"","v":"2017 Bridge Year"},{"$f":"TestYear & \" Test Year\"","v":"2018 Test Year"},{"$f":"TestYear+1 & \" Year\"","v":"2019 Year"},{"$f":"TestYear+2 & \" Year\"","v":"2020 Year"},{"$f":"TestYear+3 & \" Year\"","v":"2021 Year"},{"$f":"TestYear+4 & \" Year\"","v":"2022 Year"}]
["Reporting Basis"]
["OM&A Costs"]
["     O&M"]
["     Admin Expenses"]
["Total Recoverable OM&A from Appendix 2-JB 5",null,{"$f":"SUM(C16:C17)","v":0},{"$f":"SUM(D16:D17)","v":0},0,0,0,0,0,0,0,0]
["Number of Customers 2,4"]
["Number of FTEs 3,4"]
["Customers/FTEs",null,{"$f":"IF(C20=0,\"\",C19/C20)","v":""},{"$f":"IF(D20=0,\"\",D19/D20)","v":""},"","","","","","","",""]
["OM&A cost per customer"]
["     O&M per customer",null,{"$f":"IF(C19=0,\"\",C16/C19)","v":""},{"$f":"IF(D19=0,\"\",D16/D19)","v":""},"","","","","","","",""]
["     Admin per customer",null,{"$f":"IF(C19=0,\"\",C17/C19)","v":""},{"$f":"IF(D19=0,\"\",D17/D19)","v":""},"","","","","","","",""]
["     Total OM&A per customer",null,{"$f":"IF(C19=0,\"\",C18/C19)","v":""},{"$f":"IF(D19=0,\"\",D18/D19)","v":""},"","","","","","","",""]
["OM&A cost per FTE"]
["     O&M per FTE",null,{"$f":"IF(C20=0,\"\",C16/C20)","v":""},{"$f":"IF(D20=0,\"\",D16/D20)","v":""},"","","","","","","",""]
["     Admin per FTE",null,{"$f":"IF(C20=0,\"\",C17/C20)","v":""},{"$f":"IF(D20=0,\"\",D17/D20)","v":""},"","","","","","","",""]
["     Total OM&A per FTE",null,{"$f":"IF(C20=0,\"\",C18/C20)","v":""},{"$f":"IF(D20=0,\"\",D18/D20)","v":""},"","","","","","","",""]
[]
["Notes:"]
[]
[1,"If it has been more than three years since the applicant last filed a cost of service application, additional years of historical actuals should be incorporated into the table, as necessary, to go back to the last cost of service application.  If the applicant last filed a cost of service application less than three years ago, a minimum of three years of actual information is required."]
[]
[2,"The method of calculating the number of customers must be identified. Should be linked back to Appendix 2-IA"]
[3,"The method of calculating the number of FTEs must be identified.  See also Appendix 2-K"]
[4,"The number of customers and the number of FTEs should correspond to mid-year or average of January 1 and December 31 figures."]
[5,"For the test year and in the subsequent four years of the DSP period, the applicant should take into account the system O&M (line X of Appendix 2-AB) in developing its forecasted OM&A. Admin expenses beyond the test year also need to be forecasted (separately)."]

{"sheet":"App.2-M_Regulatory_Costs","index":38,"n_rows":60,"n_cols":11,"rows_kept":60,"cut":false,"hidden":false,"merged":[[12,0,12,1],[13,0,13,1],[8,0,8,10],[9,0,9,10]]}
[null,null,null,null,null,null,null,null,null,"File Number:",{"$f":"EBNUMBER","v":0}]
[null,null,null,null,null,null,null,null,null,"Exhibit:"]
[null,null,null,null,null,null,null,null,null,"Tab:"]
[null,null,null,null,null,null,null,null,null,"Schedule:"]
[null,null,null,null,null,null,null,null,null,"Page:"]
[]
[null,null,null,null,null,null,null,null,null,"Date:"]
[]
["Appendix 2-M"]
["Regulatory Cost Schedule"]
[]
[]
["Regulatory Cost Category",null,"USoA Account","USoA Account Balance","Ongoing or One-time Cost? 2",{"$f":"\"Last Rebasing Year (\" & RebaseYear & \" Board Approved)\"","v":"Last Rebasing Year (2014 Board Approved)"},{"$f":"\"Most Current Actuals               Year \" & TestYear - 2","v":"Most Current Actuals               Year 2016"},{"$f":"TestYear -1 & \" Bridge Year\"","v":"2017 Bridge Year"},"Annual % Change",{"$f":"TestYear & \" Test Year\"","v":"2018 Test Year"},"Annual % Change"]
["(A)",null,"(B)","(C )","(D)","(E)","(F)","(G)","(H) = [(G)-(F)]/(F)","(I)","(J) = [(I)-(G)]/(G)"]
[1,"OEB Annual Assessment",null,null,"On-Going",6500,9012,9700,{"$f":"IF(G15=0,\"\",(H15-G15)/G15)","v":7.6342654238792718E-2},9200,{"$f":"IF(H15=0,\"\",(J15-H15)/H15)","v":-5.1546391752577317E-2}]
[2,"OEB Section 30 Costs (Applicant-originated)",null,null,null,null,null,null,{"$f":"IF(G16=0,\"\",(H16-G16)/G16)","v":""},null,{"$f":"IF(H16=0,\"\",(J16-H16)/H16)","v":""}]
[3,"OEB Section 30 Costs (OEB-initiated)",null,null,null,null,null,null,"",null,""]
[4,"Expert Witness costs for regulatory matters",null,null,null,null,null,null,"",null,""]
[5,"Legal costs for regulatory matters",null,null,null,null,null,null,"",null,""]
[6,"Consultants' costs for regulatory matters",null,null,"On-Going",30000,30000,33000,0.1,33000,0]
[7,"Operating expenses associated with staff resources allocated to regulatory matters",null,null,null,null,null,null,"",null,""]
[8,"Operating expenses associated with other resources allocated to regulatory matters 1",null,null,null,null,null,null,"",null,""]
[9,"Other regulatory agency fees or assessments",null,null,null,null,800,800,0,800,0]
[10,"Any other costs for regulatory matters (please define)",null,null,"On-Going",9700,null,null,"",32800,""]
[11,"Intervenor costs",null,null,null,null,null,null,"",6000,""]
[12,"Sub-total - Ongoing Costs 3",null,{"$f":"SUMIF($E15:$E25,$E11,D15:D25)","v":0},null,{"$f":"SUM(F15:F24)","v":46200},{"$f":"SUM(G15:G24)","v":39812},43500,9.2635386315683715E-2,75800,0.74252873563218391]
[13,"Sub-total - One-time Costs 4",null,{"$f":"SUMIF($E15:$E25,$E12,D15:D25)","v":0},null,{"$f":"SUMIF($E15:$E25,$E12,F15:F25)","v":0},{"$f":"SUMIF($E15:$E25,$E12,G15:G25)","v":0},{"$f":"SUMIF($E15:$E25,$E12,H15:H25)","v":0},"",{"$f":"SUMIF($E15:$E25,$E12,J15:J25)","v":0},""]
[14,"Total",null,{"$f":"D26+D27","v":0},null,{"$f":"F26+F27","v":46200},{"$f":"G26+G27","v":39812},{"$f":"H26+H27","v":43500},9.2635386315683715E-2,{"$f":"J26+J27","v":75800},0.74252873563218391]
[]
[]
["Please fill out the following table for all one-time costs related to this cost of service application to be amortized over the test year plus the IRM period."]
[]
[null,"See detailed Table below","Historical Year(s)",{"$f":"H13","v":"2017 Bridge Year"},{"$f":"J13","v":"2018 Test Year"}]
[4,"Expert Witness costs"]
[5,"Legal costs"]
[6,"Consultants' costs"]
[7,"Incremental operating expenses associated with staff resources allocated to this application."]
[8,"Incremental operating expenses associated with other resources allocated to this application. 1"]
[11,"Intervenor costs"]
[]
[]
[null,null,"Worst Case"]
[null,"AESI (DSP)",25000]
[null,"BDO (PILs + DVAs + IRs)",10000]
[null,"Production & Submission  (Print)",1000]
[null,"Public Notice (OEB)",1000]
[null,"Legal - Review, IR, Settlement, DRO",32000]
[null,"Legal - Oral hearing",45000]
[null,"Intervenor costs ",40000]
[null,"Community Meeting",10000]
[null,"Total Cost of Service Filing costs ",{"$f":"SUM(C43:C50)","v":164000},"($164,000/5)"]
[]
[]
[]
["Notes:"]
[]
["1","Please identify the resources involved."]
["2","Where a category's costs include both one-time and ongoing costs, the applicant should prove a separate breakdown between one-time and ongoing costs."]
["3","Sum of all ongoing costs identified in rows 1 to 11 inclusive."]
["4","Sum of all one-time costs identified in rows 1 to 11 inclusive."]

{"sheet":"App.2-N_Corp_Cost_Allocation","index":39,"n_rows":53,"n_cols":7,"rows_kept":53,"cut":false,"hidden":false,"merged":[[46,0,46,5],[49,0,49,5],[52,0,52,5],[13,0,13,5],[8,0,8,5],[9,0,9,5],[42,1,43,5],[16,0,17,0],[16,1,17,1],[15,2,17,2],[15,3,17,3],[15,0,15,1],[15,4,16,4],[15,5,16,5],[15,6,16,6],[29,0,29,1],[29,2,31,2],[29,3,31,3],[29,5,30,5],[29,4,30,4],[30,0,31,0],[30,1,31,1],[27,0,27,5]]}
[null,null,null,null,null,"File Number:",{"$f":"EBNUMBER","v":0}]
["NOT APPLICABLE",null,null,null,null,"Exhibit:"]
[null,null,null,null,null,"Tab:"]
[null,null,null,null,null,"Schedule:"]
[null,null,null,null,null,"Page:"]
[]
[null,null,null,null,null,"Date:"]
[]
["Appendix 2-N"]
["Shared Services and Corporate Cost Allocation 1"]
[]
[null,"Year:"]
[]
["Shared Services"]
[]
["Name of Company",null,"Service Offered","Pricing Methodology","Price for the Service","Cost for the Service"]
["From","To"]
[null,null,null,null,"$","$"]
[]
[]
[]
[]
[]
[]
[]
[]
[]
["Corporate Cost Allocation"]
[]
["Name of Company",null,"Service Offered","Pricing Methodology","% of Corporate Costs Allocated","Amount Allocated"]
["From","To"]
[null,null,null,null,"%","$"]
["eg: parent company","eg: regulated entity"]
[]
[]
[]
[]
[]
[]
[]
[]
["Note: "]
[1,"This appendix must be completed in relation to each service provided or received for the Historical (actuals), Bridge and Test years. The required information includes:"]
[]
[]
["·         Type of Service:"]
["Services such as billing, accounting, payroll, etc.  The applicant must identify any costs related to the Board of Directors of the parent company that are allocated to the applicant."]
[]
["·         Pricing Methodology:"]
["Pricing Methodology includes approaches such as cost-base, market-base, tendering, etc.  The applicant must provide evidence demonstrating the pricing methodology used.  The applicant must also provide a description of why that pricing methodology was chosen, whether or not it is in conformity with ARC, and why it is appropriate."]
[]
["·         % Allocation:"]
["The applicant must provide the percentage of the costs allocated to the entity for the service being offered.  The Applicant must also provide a description of the allocator and why it is an appropriate allocator."]

{"sheet":"App.2-OA Capital Structure","index":40,"n_rows":125,"n_cols":15,"rows_kept":125,"cut":false,"hidden":false,"merged":[]}
[null,null,null,null,null,null,null,null,null,null,"File Number:",null,null,null,{"$f":"EBNUMBER","v":0}]
[null,null,null,null,null,null,null,null,null,null,"Exhibit:"]
[null,null,null,null,null,null,null,null,null,null,"Tab:"]
[null,null,null,null,null,null,null,null,null,null,"Schedule:"]
[null,null,null,null,null,null,null,null,null,null,"Page:"]
[]
[null,null,null,null,null,null,null,null,null,null,"Date:"]
[]
[]
[null,null,null,null,null,null,"Appendix 2-OA"]
[null,null,null,null,null,null,"Capital Structure and Cost of Capital"]
[]
[null,null,null,null,"This table must be completed for the last Board-approved year and the test year."]
[]
[null,null,null,null,null,null,"Year:",2018,2018]
[]
["Line No."]
[null,null,"Particulars",null,"Capitalization Ratio",null,null,null,null,null,"Cost Rate",null,null,null,"Return"]
[]
[null,null,null,null,"(%)",null,null,null,"($)",null,"(%)",null,null,null,"($)"]
[null,null,"Debt"]
[1,null,"  Long-term Debt",null,0.56000000000000016,null,null,null,{"$f":"I31*E22","v":2634701.9168283702},null,2.9000000000000001E-2,null,null,null,{"$f":"K22*I22","v":76406.355588022736}]
[2,null,"  Short-term Debt",null,0.04,null,"(1)",null,{"$f":"I31*E23","v":188192.99405916926},null,1.7600000000000001E-2,null,null,null,{"$f":"K23*I23","v":3312.1966954413792}]
[3,null,"Total Debt",null,{"$f":"SUM(E22:E23)","v":0.6000000000000002},null,null,null,{"$f":"SUM(I22:I23)","v":2822894.9108875394},null,{"$f":"IF(E24=0,0,SUMPRODUCT(E22:E23,K22:K23)/E24)","v":2.8239999999999998E-2},null,null,null,{"$f":"SUM(O22:O23)","v":79718.552283464116}]
[]
[null,null,"Equity"]
[4,null,"  Common Equity",null,0.4,null,null,null,{"$f":"I31*E27","v":1881929.9405916927},null,8.7800000000000003E-2,null,null,null,{"$f":"K27*I27","v":165233.44878395062}]
[5,null,"  Preferred Shares",null,null,null,null,null,{"$f":"I31*E28","v":0},null,null,null,null,null,{"$f":"K28*I28","v":0}]
[6,null,"Total Equity",null,{"$f":"SUM(E27:E28)","v":0.4},null,null,null,{"$f":"SUM(I27:I28)","v":1881929.9405916927},null,{"$f":"IF(E29=0,0,SUMPRODUCT(E27:E28,K27:K28)/E29)","v":8.7800000000000003E-2},null,null,null,{"$f":"SUM(O27:O28)","v":165233.44878395062}]
[]
[7,null,"Total",null,1,null,null,null,4704824.8514792314,null,{"$f":"(K24*E24)+(K29*E29)","v":5.2064000000000013E-2},null,null,null,{"$f":"O24+O29","v":244952.00106741473}]
[]
[]
[null,null,null,null,null,null,"Year:",2017,2017]
[]
["Line No."]
[null,null,"Particulars",null,"Capitalization Ratio",null,null,null,null,null,"Cost Rate",null,null,null,"Return"]
[]
[null,null,null,null,"(%)",null,null,null,"($)",null,"(%)",null,null,null,"($)"]
[null,null,"Debt"]
[1,null,"  Long-term Debt",null,0.56000000000000016,null,null,null,{"$f":"$I$50*E41","v":2342226.2235728055},null,4.8800000000000003E-2,null,null,null,{"$f":"K41*I41","v":114300.63971035292}]
[2,null,"  Short-term Debt",null,0.04,null,"(1)",null,{"$f":"$I$50*E42","v":167301.87311234322},null,2.1100000000000001E-2,null,null,null,{"$f":"K42*I42","v":3530.069522670442}]
[3,null,"Total Debt",null,{"$f":"SUM(E41:E42)","v":0.6000000000000002},null,null,null,{"$f":"SUM(I41:I42)","v":2509528.0966851488},null,{"$f":"IF(E43=0,0,SUMPRODUCT(E41:E42,K41:K42)/E43)","v":4.6953333333333333E-2},null,null,null,{"$f":"SUM(O41:O42)","v":117830.70923302336}]
[]
[null,null,"Equity"]
[4,null,"  Common Equity",null,0.4,null,null,null,{"$f":"$I$50*E46","v":1673018.7311234323},null,9.3600000000000003E-2,null,null,null,{"$f":"K46*I46","v":156594.55323315327}]
[5,null,"  Preferred Shares",null,null,null,null,null,{"$f":"$I$50*E47","v":0},null,null,null,null,null,{"$f":"K47*I47","v":0}]
[6,null,"Total Equity",null,{"$f":"SUM(E46:E47)","v":0.4},null,null,null,{"$f":"SUM(I46:I47)","v":1673018.7311234323},null,{"$f":"IF(E48=0,0,SUMPRODUCT(E46:E47,K46:K47)/E48)","v":9.3600000000000003E-2},null,null,null,{"$f":"SUM(O46:O47)","v":156594.55323315327}]
[]
[7,null,"Total",null,1,null,null,null,4182546.8278085804,null,{"$f":"(K43*E43)+(K48*E48)","v":6.5612000000000004E-2},null,null,null,{"$f":"O43+O48","v":274425.26246617665}]
[]
[]
[null,null,null,null,null,null,"Year:",2016,2016]
[]
[]
[]
[null,null,null,null,"(%)",null,null,null,"($)",null,"(%)",null,null,null,"($)"]
[null,null,"Debt"]
[1,null,"  Long-term Debt",null,0.56000000000000016,null,null,null,{"$f":"$I$68*E59","v":1790362.0676947886},null,4.8800000000000003E-2,null,null,null,{"$f":"K59*I59","v":87369.668903505692}]
[2,null,"  Short-term Debt",null,0.04,null,"(1)",null,{"$f":"$I$68*E60","v":127883.004835342},null,2.1100000000000001E-2,null,null,null,{"$f":"K60*I60","v":2698.3314020257162}]
[3,null,"Total Debt",null,{"$f":"SUM(E59:E60)","v":0.6000000000000002},null,null,null,{"$f":"SUM(I59:I60)","v":1918245.0725301306},null,{"$f":"IF(E61=0,0,SUMPRODUCT(E59:E60,K59:K60)/E61)","v":4.6953333333333333E-2},null,null,null,{"$f":"SUM(O59:O60)","v":90068.000305531401}]
[]
[null,null,"Equity"]
[4,null,"  Common Equity",null,0.4,null,null,null,{"$f":"$I$68*E64","v":1278830.0483534201},null,9.3600000000000003E-2,null,null,null,{"$f":"K64*I64","v":119698.49252588012}]
[5,null,"  Preferred Shares",null,null,null,null,null,{"$f":"$I$68*E65","v":0},null,null,null,null,null,{"$f":"K65*I65","v":0}]
[6,null,"Total Equity",null,{"$f":"SUM(E64:E65)","v":0.4},null,null,null,{"$f":"SUM(I64:I65)","v":1278830.0483534201},null,{"$f":"IF(E66=0,0,SUMPRODUCT(E64:E65,K64:K65)/E66)","v":9.3600000000000003E-2},null,null,null,{"$f":"SUM(O64:O65)","v":119698.49252588012}]
[]
[7,null,"Total",null,1,null,null,null,3197075.12088355,null,{"$f":"(K61*E61)+(K66*E66)","v":6.5612000000000004E-2},null,null,null,{"$f":"O61+O66","v":209766.49283141154}]
[]
[]
[null,null,null,null,null,null,"Year:",2015,2015]
[]
["Line No."]
[null,null,"Particulars",null,"Capitalization Ratio",null,null,null,null,null,"Cost Rate",null,null,null,"Return"]
[]
[null,null,null,null,"(%)",null,null,null,"($)",null,"(%)",null,null,null,"($)"]
[null,null,"Debt"]
[1,null,"  Long-term Debt",null,0.56000000000000016,null,null,null,{"$f":"$I$87*E78","v":1643995.1377788493},null,4.8800000000000003E-2,null,null,null,{"$f":"K78*I78","v":80226.962723607852}]
[2,null,"  Short-term Debt",null,0.04,null,"(1)",null,{"$f":"$I$87*E79","v":117428.22412706065},null,2.1100000000000001E-2,null,null,null,{"$f":"K79*I79","v":2477.7355290809796}]
[3,null,"Total Debt",null,{"$f":"SUM(E78:E79)","v":0.6000000000000002},null,null,null,{"$f":"SUM(I78:I79)","v":1761423.3619059101},null,{"$f":"IF(E80=0,0,SUMPRODUCT(E78:E79,K78:K79)/E80)","v":4.6953333333333333E-2},null,null,null,{"$f":"SUM(O78:O79)","v":82704.698252688831}]
[]
[null,null,"Equity"]
[4,null,"  Common Equity",null,0.4,null,null,null,{"$f":"$I$87*E83","v":1174282.2412706064},null,9.3600000000000003E-2,null,null,null,{"$f":"K83*I83","v":109912.81778292876}]
[5,null,"  Preferred Shares",null,null,null,null,null,{"$f":"$I$87*E84","v":0},null,null,null,null,null,{"$f":"K84*I84","v":0}]
[6,null,"Total Equity",null,{"$f":"SUM(E83:E84)","v":0.4},null,null,null,{"$f":"SUM(I83:I84)","v":1174282.2412706064},null,{"$f":"IF(E85=0,0,SUMPRODUCT(E83:E84,K83:K84)/E85)","v":9.3600000000000003E-2},null,null,null,{"$f":"SUM(O83:O84)","v":109912.81778292876}]
[]
[7,null,"Total",null,1,null,null,null,2935705.603176516,null,{"$f":"(K80*E80)+(K85*E85)","v":6.5612000000000004E-2},null,null,null,{"$f":"O80+O85","v":192617.51603561759}]
[]
[]
[null,null,null,null,null,null,"Year:",2014,2014]
[]
["Line No."]
[null,null,"Particulars",null,"Capitalization Ratio",null,null,null,null,null,"Cost Rate",null,null,null,"Return"]
[]
[null,null,null,null,"(%)",null,null,null,"($)",null,"(%)",null,null,null,"($)"]
[null,null,"Debt"]
[1,null,"  Long-term Debt",null,0.56000000000000016,null,null,null,{"$f":"$I$106*E97","v":1548263.0377200008},null,4.8800000000000003E-2,null,null,null,{"$f":"K97*I97","v":75555.236240736049}]
[2,null,"  Short-term Debt",null,0.04,null,"(1)",null,{"$f":"$I$106*E98","v":110590.21698000003},null,2.1100000000000001E-2,null,null,null,{"$f":"K98*I98","v":2333.4535782780008}]
[3,null,"Total Debt",null,{"$f":"SUM(E97:E98)","v":0.6000000000000002},null,null,null,{"$f":"SUM(I97:I98)","v":1658853.2547000009},null,{"$f":"IF(E99=0,0,SUMPRODUCT(E97:E98,K97:K98)/E99)","v":4.6953333333333333E-2},null,null,null,{"$f":"SUM(O97:O98)","v":77888.689819014049}]
[]
[null,null,"Equity"]
[4,null,"  Common Equity",null,0.4,null,null,null,{"$f":"$I$106*E102","v":1105902.1698000003},null,9.3600000000000003E-2,null,null,null,{"$f":"K102*I102","v":103512.44309328003}]
[5,null,"  Preferred Shares",null,null,null,null,null,{"$f":"$I$106*E103","v":0},null,null,null,null,null,{"$f":"K103*I103","v":0}]
[6,null,"Total Equity",null,{"$f":"SUM(E102:E103)","v":0.4},null,null,null,{"$f":"SUM(I102:I103)","v":1105902.1698000003},null,{"$f":"IF(E104=0,0,SUMPRODUCT(E102:E103,K102:K103)/E104)","v":9.3600000000000003E-2},null,null,null,{"$f":"SUM(O102:O103)","v":103512.44309328003}]
[]
[7,null,"Total",null,1,null,null,null,2764755.4245000007,null,{"$f":"(K99*E99)+(K104*E104)","v":6.5612000000000004E-2},null,null,null,{"$f":"O99+O104","v":181401.13291229407}]
[]
[]
[null,null,null,null,null,null,"Year:",2014,2014,null,"Board Approved"]
[]
["Line No."]
[null,null,"Particulars",null,"Capitalization Ratio",null,null,null,null,null,"Cost Rate",null,null,null,"Return"]
[]
[null,null,null,null,"(%)",null,null,null,"($)",null,"(%)",null,null,null,"($)"]
[null,null,"Debt"]
[1,null,"  Long-term Debt",null,0.56000000000000016,null,null,null,{"$f":"$I$125*E116","v":1628438.8532767},null,4.8800000000000003E-2,null,null,null,{"$f":"K116*I116","v":79467.816039902973}]
[2,null,"  Short-term Debt",null,0.04,null,"(1)",null,{"$f":"$I$125*E117","v":116317.06094833568},null,2.1100000000000001E-2,null,null,null,{"$f":"K117*I117","v":2454.2899860098828}]
[3,null,"Total Debt",null,{"$f":"SUM(E116:E117)","v":0.6000000000000002},null,null,null,{"$f":"SUM(I116:I117)","v":1744755.9142250358},null,{"$f":"IF(E118=0,0,SUMPRODUCT(E116:E117,K116:K117)/E118)","v":4.6953333333333333E-2},null,null,null,{"$f":"SUM(O116:O117)","v":81922.106025912857}]
[]
[null,null,"Equity"]
[4,null,"  Common Equity",null,0.4,null,null,null,{"$f":"$I$125*E121","v":1163170.6094833568},null,9.3600000000000003E-2,null,null,null,{"$f":"K121*I121","v":108872.7690476422}]
[5,null,"  Preferred Shares",null,null,null,null,null,{"$f":"$I$125*E122","v":0},null,null,null,null,null,{"$f":"K122*I122","v":0}]
[6,null,"Total Equity",null,{"$f":"SUM(E121:E122)","v":0.4},null,null,null,{"$f":"SUM(I121:I122)","v":1163170.6094833568},null,{"$f":"IF(E123=0,0,SUMPRODUCT(E121:E122,K121:K122)/E123)","v":9.3600000000000003E-2},null,null,null,{"$f":"SUM(O121:O122)","v":108872.7690476422}]
[]
[7,null,"Total",null,1,null,null,null,2907926.5237083919,null,{"$f":"(K118*E118)+(K123*E123)","v":6.5612000000000004E-2},null,null,null,{"$f":"O118+O123","v":190794.87507355504}]

{"sheet":"App.2-OB_Debt Instruments","index":41,"n_rows":51,"n_cols":11,"rows_kept":51,"cut":false,"hidden":false,"merged":[[9,0,9,10],[10,0,10,10],[10,11,10,14],[12,0,12,10]]}
[null,null,null,null,null,null,null,null,null,"File Number:",{"$f":"EBNUMBER","v":0}]
[null,null,null,null,null,null,null,null,null,"Exhibit:"]
[null,null,null,null,null,null,null,null,null,"Tab:"]
[null,null,null,null,null,null,null,null,null,"Schedule:"]
[null,null,null,null,null,null,null,null,null,"Page:"]
["Notes","There were no debts prior to 2017"]
[null,null,null,null,null,null,null,null,null,"Date:"]
[]
[]
["Appendix 2-OB"]
["Debt Instruments"]
[]
["This table must be completed for all required historical years, the bridge year and the test year."]
[null,null,null,"Year",2018]
[]
["Row","Description","Lender","Affiliated or Third-Party Debt?","Fixed or Variable-Rate?","Start Date","Term              (years)","Principal                         ($)","Rate (%) 2","Interest ($) 1","Additional Comments, if any"]
[1,"Funding for 44kV Substation","Caisse Populaire Nouvel Horizon","Third-Party","Fixed Rate","Mar 29-17",20,1000000,2.9000000000000001E-2,29000]
[]
["Total",null,null,null,null,null,null,{"$f":"SUM(H17:H17)","v":1000000},{"$f":"IF(H19=0,\"\",J19/H19)","v":2.9000000000000001E-2},{"$f":"SUM(J17:J17)","v":29000}]
[]
[]
[null,null,null,"Year",2017]
[]
["Row","Description","Lender","Affiliated or Third-Party Debt?","Fixed or Variable-Rate?","Start Date","Term              (years)","Principal                         ($)","Rate (%) 2","Interest ($) 1","Additional Comments, if any"]
[1,"Funding for 44kV Substation","Caisse Populaire Nouvel Horizon","Third-Party","Fixed Rate","Mar 29-17",20,1000000,2.9000000000000001E-2,29000]
[]
["Total",null,null,null,null,null,null,{"$f":"SUM(H25:H25)","v":1000000},{"$f":"IF(H27=0,\"\",J27/H27)","v":2.9000000000000001E-2},{"$f":"SUM(J25:J25)","v":29000}]
[]
[]
[null,null,null,"Year",2016]
[]
["Row","Description","Lender","Affiliated or Third-Party Debt?","Fixed or Variable-Rate?","Start Date","Term              (years)","Principal                         ($)","Rate (%) 2","Interest ($) 1","Additional Comments, if any"]
[1]
[]
["Total",null,null,null,null,null,null,{"$f":"SUM(H33:H33)","v":0},{"$f":"IF(H35=0,\"\",J35/H35)","v":""},{"$f":"SUM(J33:J33)","v":0}]
[]
[]
[null,null,null,"Year",2015]
[]
["Row","Description","Lender","Affiliated or Third-Party Debt?","Fixed or Variable-Rate?","Start Date","Term              (years)","Principal                         ($)","Rate (%) 2","Interest ($) 1","Additional Comments, if any"]
[1]
[]
["Total",null,null,null,null,null,null,{"$f":"SUM(H41:H41)","v":0},{"$f":"IF(H43=0,\"\",J43/H43)","v":""},{"$f":"SUM(J41:J41)","v":0}]
[]
[]
[null,null,null,"Year",2014]
[]
["Row","Description","Lender","Affiliated or Third-Party Debt?","Fixed or Variable-Rate?","Start Date","Term              (years)","Principal                         ($)","Rate (%) 2","Interest ($) 1","Additional Comments, if any"]
[1]
[]
["Total",null,null,null,null,null,null,{"$f":"SUM(H49:H49)","v":0},{"$f":"IF(H51=0,\"\",J51/H51)","v":""},{"$f":"SUM(J49:J49)","v":0}]

{"sheet":"App.2-Q_Cost of Serv. Emb. Dx","index":42,"n_rows":60,"n_cols":7,"rows_kept":60,"cut":false,"hidden":false,"merged":[[8,0,8,6],[9,0,9,6],[15,0,15,1],[15,2,15,3],[53,3,54,3],[9,7,9,11],[12,0,12,6],[11,0,11,6],[58,3,59,3],[58,4,59,4],[53,4,54,4]]}
[null,null,null,null,null,"File Number:",{"$f":"EBNUMBER","v":0}]
["NOT APPLICABLE",null,null,null,null,"Exhibit:"]
[null,null,null,null,null,"Tab:"]
[null,null,null,null,null,"Schedule:"]
[null,null,null,null,null,"Page:"]
[]
[null,null,null,null,null,"Date:"]
[]
["Appendix 2-Q"]
["Cost of Serving Embedded Distributor(s) "]
[]
["To be completed by Host Distributors ONLY"]
["(Not required if Host Distributor has an Embedded Distributor rate class, i.e. a separate row on Sheet 11 of the RRWF.)"]
[]
[]
["Proposed Rate Class for Billing Embedded Distributor(s)"]
[]
["Host's Distribution Facilities used by Embedded Distributor(s)"]
[]
["(1)","(2)","(3)","(4)","(5)","(6) = '(3) + (4)"]
["Asset Class","Total OM&A costs asociated with asset class ","Original cost of asset class ","Accumulated amortization of asset class","Annual amortization of asset class","Net Book Value of asset class"]
["Totals for Host Distributor:","($)","($)","($)","($)"]
["Distribution Stations",null,null,null,null,{"$f":"C23+D23","v":0}]
["Low Voltage Line",null,null,null,null,0]
["LV Line category # 2 (if applcable)",null,null,null,null,0]
["TS (owned by host)",null,null,null,null,0]
["add rows if necessary... ",null,null,null,null,0]
[null,null,null,null,null,0]
[null,null,null,null,null,0]
[]
["(1)","(7)","(8)","(9)","(10)","(11)"]
[{"$f":"A21","v":"Asset Class"},"Total line length or station capacity in asset class","Line length or capacity required to provide LV service to Embedded Distributor(s)","Annual total demand on station/line providing LV services (sum of 12 monthly peaks)","Annual billed Embedded Distributor demand on station/line providing LV services","Embedded Distributor(s)' Responsibility Share "]
["Embedded Distributor's share:","kW or kVa; km","kW or kVA; km","kW or kVA","kW or kVA","percent"]
["Distribution Stations",null,null,null,null,{"$f":"IF(D34=0,0,(C34/B34)*(E34/D34))","v":0}]
["Low Voltage Line",null,null,null,null,{"$f":"IF(D35=0,0,(C35/B35)*(E35/D35))","v":0}]
["LV Line # 2 (if applicable) ",null,null,null,null,{"$f":"IF(D36=0,0,(C36/B36)*(E36/D36))","v":0}]
["TS (owned by host)",null,null,null,null,{"$f":"IF(D37=0,0,(C37/B37)*(E37/D37))","v":0}]
["add rows if necessary ",null,null,null,null,{"$f":"IF(D38=0,0,(C38/B38)*(E38/D38))","v":0}]
[]
["(1)","(12)","(12a)","(13)","(14)","(15)","(16)"]
[{"$f":"A32","v":"Asset Class"},"Return on Assets used to Provide LV services","Taxes/PILs","Annual amortization on assets used to provide LV services","OM&A costs with burden associated with assets used to provide LV services","Total annual cost associated with assets used to provide LV services","Monthly cost associated with the delivery of LV services"]
[null,"($)","($)","($)","($)","($)","$/kW or $/kVA"]
["Distribution Stations",{"$f":"E$54*(F23+B23*E$59)*F34","v":0},{"$f":"(B43-(B$54*C$54*F34*(F23+B23*E57)+B$55*C$55*F34*(F23+B23*E$57)))*E$57/(1-E$57)","v":0},{"$f":"E23*F34","v":0},{"$f":"B23*F34","v":0},{"$f":"SUM(B43:E43)","v":0},{"$f":"IF(E34=0,0,(D43/E34))","v":0}]
["Low Voltage Line",{"$f":"E$54*(F24+B24*E$59)*F35","v":0},{"$f":"(B44-(B$54*C$54*F35*(F24+B24*E58)+B$55*C$55*F35*(F24+B24*E58)))*E$57/(1-E$57)","v":0},{"$f":"E24*F35","v":0},{"$f":"B24*F35","v":0},{"$f":"SUM(B44:E44)","v":0},{"$f":"IF(E35=0,0,(D44/E35))","v":0}]
["LV Line # 2 (if applicable) ",{"$f":"E$54*(F25+B25*E$59)*F36","v":0},{"$f":"(B45-(B$54*C$54*F36*(F25+B25*E59)+B$55*C$55*F36*(F25+B25*E$59)))*E$57/(1-E$57)","v":0},{"$f":"E25*F36","v":0},{"$f":"B25*F36","v":0},{"$f":"SUM(B45:E45)","v":0},{"$f":"IF(E36=0,0,(D45/E36))","v":0}]
["TS (owned by host)",{"$f":"E$54*(F26+B26*E$59)*F37","v":0},{"$f":"(B46-(B$54*C$54*F37*(F26+B26*E60)+B$55*C$55*F37*(F26+B26*E60)))*E$57/(1-E$57)","v":0},{"$f":"E26*F37","v":0},{"$f":"B26*F37","v":0},{"$f":"SUM(B46:E46)","v":0},{"$f":"IF(E37=0,0,(D46/E37))","v":0}]
["add rows if necessary ",{"$f":"E$54*(F27+B27*E$59)*F38","v":0},{"$f":"(B47-(B$54*C$54*F38*(F27+B27*I61)+B$55*C$55*F38*(F27+B27*I61)))*E$57/(1-E$57)","v":0},{"$f":"E27*F38","v":0},{"$f":"B27*F38","v":0},{"$f":"SUM(B47:E47)","v":0},{"$f":"IF(E38=0,0,(D47/E38))","v":0}]
[]
["Total",null,null,null,null,{"$f":"SUM(F43:F47)","v":0},{"$f":"SUM(G43:G47)","v":0}]
[]
["(17)","(18)","(19)","(20)","(21)"]
[null,"Capital Structure","Cost Rate"]
[null,"(%)","(%)",null,"(%)"]
["Long-Term Debt",null,null,"Weighted Average Cost of Capital",{"$f":"IF(B60=0%,0,SUMPRODUCT(B54:B58,C54:C58)/B60)","v":0}]
["Short-term Debt"]
[]
["Common Equity",null,null,"Tax/PILs Rate"]
["Preferred Shares"]
[null,null,null,"Working Capital Allowance Factor"]
["Total",{"$f":"SUM(B54:B58)","v":0}]

{"sheet":"App.2-R_Loss Factors","index":43,"n_rows":70,"n_cols":8,"rows_kept":70,"cut":false,"hidden":false,"merged":[[8,0,8,7],[9,0,9,7],[10,0,10,7],[12,0,13,1],[12,2,12,6],[12,7,13,7],[14,1,14,7],[23,1,23,7],[25,1,25,7],[52,1,53,7],[34,1,37,7],[41,1,43,7],[45,1,48,7],[55,1,56,7],[58,1,58,7],[30,1,32,7],[68,1,68,7],[60,1,60,7],[62,1,62,7],[64,1,66,6],[50,1,50,7]]}
[null,null,null,null,null,null,"File Number:",{"$f":"EBNUMBER","v":0}]
[null,null,null,null,null,null,"Exhibit:"]
[null,null,null,null,null,null,"Tab:"]
[null,null,null,null,null,null,"Schedule:"]
[null,null,null,null,null,null,"Page:"]
[]
[null,null,null,null,null,null,"Date:"]
[]
["Appendix 2-R"]
["Loss Factors"]
[]
[]
[null,null,"Historical Years",null,null,null,null,"5-Year Average"]
[null,null,{"$f":"IF(ISBLANK('LDC Info'!E26-5), \"Year 5\", 'LDC Info'!E26-5)","v":2012},{"$f":"IF(ISBLANK('LDC Info'!E26-4), \"Year 5\", 'LDC Info'!E26-4)","v":2013},{"$f":"IF(ISBLANK('LDC Info'!E26-3), \"Year 5\", 'LDC Info'!E26-3)","v":2014},{"$f":"IF(ISBLANK('LDC Info'!E26-2), \"Year 5\", 'LDC Info'!E26-2)","v":2015},{"$f":"IF(ISBLANK('LDC Info'!E26-1), \"Year 5\", 'LDC Info'!E26-1)","v":2016}]
[null,"Losses Within Distributor's System"]
["A(1)","\"Wholesale\" kWh delivered to distributor (higher value)",0,0,0,0,0,{"$f":"IF(SUM(C16:G16)=0,0,AVERAGE(C16:G16))","v":0}]
["A(2)","\"Wholesale\" kWh delivered to distributor (lower value)",30091478.346228234,30301350.396518376,30157452.240000002,29896471.900000002,29672838.790000003,{"$f":"IF(SUM(C17:G17)=0,0,AVERAGE(C17:G17))","v":30023918.334549319}]
["B","Portion of \"Wholesale\" kWh delivered to distributor for its Large Use Customer(s)",0,0,0,0,0,{"$f":"IF(SUM(C18:G18)=0,0,AVERAGE(C18:G18))","v":0}]
["C","Net \"Wholesale\" kWh delivered to distributor  = A(2) - B",{"$f":"C17-C18","v":30091478.346228234},30301350.396518376,30157452.240000002,29896471.900000002,29672838.790000003,30023918.334549319]
["D","\"Retail\" kWh delivered by distributor",29115342,29088283,28976657,28755563,28472872,{"$f":"IF(SUM(C20:G20)=0,0,AVERAGE(C20:G20))","v":28881743.399999999}]
["E","Portion of \"Retail\" kWh delivered by distributor to its Large Use Customer(s)",null,null,null,null,null,{"$f":"IF(SUM(C21:G21)=0,0,AVERAGE(C21:G21))","v":0}]
["F","Net \"Retail\" kWh delivered by distributor = D - E",{"$f":"C20-C21","v":29115342},29088283,28976657,28755563,28472872,28881743.399999999]
["G","Loss Factor in Distributor's system = C / F",{"$f":"IF(C22=0,\"\",C19/C22)","v":1.0335265285988477},1.0417029563593827,1.0407498780828996,1.0396761106711769,1.0421442132707934,1.039546606267173]
[null,"Losses Upstream of Distributor's System"]
["H","Supply Facilities Loss Factor",1.0034000000000001,1.0034000000000001,1.0034000000000001,1.0034000000000001,1.0034000000000001,{"$f":"IF(SUM(C25:G25)=0,0,AVERAGE(C25:G25))","v":1.0034000000000001}]
[null,"Total Losses"]
["I","Total Loss Factor = G x H",{"$f":"IF(C23=\"\",\"\",C23*C25)","v":1.0370405187960838},1.0452447464110046,1.0442884276683815,1.0432110094474589,1.0456875035959141,1.0430810647284814]
[]
["Notes:"]
[]
["A(1)","If directly connected to the IESO-controlled grid, kWh pertains to the virtual meter on the primary or high voltage side of the transformer at the interface with the transmission grid.  This corresponds to the \"With Losses\" kWh value provided by the IESO's MV-WEB.  It is the higher of the two values provided by MV-WEB."]
[]
[]
[]
[null,"If fully embedded within a host distributor, kWh pertains to the virtual meter on the primary or high voltage side of the transformer, at the interface between the host distributor and the transmission grid.  For example, if the host distributor is Hydro One Networks Inc., kWh from the Hydro One Networks' invoice corresponding to \"Total kWh w Losses\" should be reported.  This corresponds to the higher of the two kWh values provided in Hydro One Networks' invoice."]
[]
[]
[]
[]
[null,"If partially embedded, kWh pertains to the sum of the above."]
[]
["A(2)","If directly connected to the IESO-controlled grid, kWh pertains to a metering installation on the secondary or low voltage side of the transformer at the interface with the transmission grid.  This corresponds to the \"Without Losses\" kWh value provided by the IESO's MV-WEB.  It is the lower of the two kWh values provided by MV-WEB."]
[]
[]
[]
[null,"If fully embedded with the host distributor, kWh pertains to a metering installation on the secondary or low voltage side of the transformer at the interface between the embedded distributor and the host distributor.  For example, if the host distributor is Hydro One Networks Inc., kWh from the Hydro One Networks' invoice corresponding to \"Total kWh\" should be reported.  This corresponds to the lower of the two kWh values provided in Hydro One Networks' invoice."]
[]
[]
[]
[]
[null,"If partially embedded, kWh pertains to the sum of the above."]
[]
[null,"Additionally, kWh pertaining to distributed generation directly connected to the distributor's own distribution network should be included in A(2)."]
[]
[]
["B","If a Large Use Customer is metered on the secondary or low voltage side of the transformer, the default loss is 1%                         (i.e., B = 1.01 X E)."]
[]
[]
["D","kWh corresponding to D should equal metered or estimated kWh at the customer’s delivery point."]
[]
["G and I","These loss factors pertain to secondary-metered customers with demand less than 5,000 kW."]
[]
["H","If directly connected to the IESO-controlled grid, SFLF = 1.0045."]
[]
[null,"If fully embedded within a host distributor, SFLF = loss factor re losses in transformer at grid interface X loss factor re losses in host distributor's system.  If the host distributor is Hydro One Networks Inc., SFLF = 1.0060 X 1.0278 = 1.0340. If partially embedded, SFLF should be calculated as the weighted average of above."]
[]
[]
[]
[null,"Distributors that wish to propose a different SFLF should provide appropriate justification for any such proposal including supporting"]
[null,"calculations and any other relevant material."]

{"sheet":"App.2-S_Stranded Meters","index":44,"n_rows":92,"n_cols":8,"rows_kept":92,"cut":false,"hidden":false,"merged":[[91,0,94,7],[84,1,86,7],[88,1,89,7],[69,1,70,7],[76,1,78,7],[80,1,82,7],[72,1,74,7],[62,2,64,7],[66,0,67,7],[37,1,38,7],[40,1,42,7],[44,1,47,7],[49,1,52,7],[57,2,60,7],[8,0,8,7],[9,0,9,7],[29,0,32,7],[34,0,35,7],[54,2,55,7]]}
[null,null,null,null,null,null,"File Number:",{"$f":"EBNUMBER","v":0}]
["NOT APPLICABLE",null,null,null,null,null,"Exhibit:"]
[null,null,null,null,null,null,"Tab:"]
[null,null,null,null,null,null,"Schedule:"]
[null,null,null,null,null,null,"Page:"]
[]
[null,null,null,null,null,null,"Date:"]
[]
["Appendix 2-S"]
["Stranded Meter Treatment"]
[]
["Year","Notes","Gross Asset Value","Accumulated Amortization","Contributed Capital (Net of Amortization)","Net Asset","Proceeds on Disposition","Residual Net Book Value"]
[null,null,"(A)","(B)","(C)","(D ) = (A) - (B) - (C)","(E)","(F) = (D) - (E)"]
[2006,null,null,null,null,{"$f":"C14-D14-E14","v":0},null,{"$f":"F14-G14","v":0}]
[2007,null,null,null,null,0,null,0]
[2008,null,null,null,null,0,null,0]
[2009,null,null,null,null,0,null,0]
[2010,null,null,null,null,0,null,0]
[2011,null,null,null,null,0,null,0]
[2012,null,null,null,null,0,null,0]
[2013,null,null,null,null,{"$f":"C21-D21-E21","v":0},null,{"$f":"F21-G21","v":0}]
[2014,null,null,null,null,0,null,0]
[2015]
[2016,"(1)",null,null,null,0,null,0]
[]
["Notes:"]
[]
["(1)","For 2016, please indicate whether the amounts provided are on a forecast or actual basis."]
[]
["Some distributors have transferred the cost of stranded meters from Account 1860 - Meters to \"Sub-account Stranded Meter Costs of Account 1555\", while in some cases distributors have left these costs in Account 1860.  Depending on which treatment the applicant has chosen. please provide the information under either of the two scenarios (A and B below), as applicable."]
[]
[]
[]
[]
["Scenario A:  If the stranded meter costs were transferred to \"Sub-account Stranded Meter Costs\" of Account 1555, the above table should be completed and the following information should be provided in Exhibit 9."]
[]
[]
[1,"A description of the accounting treatment followed by the applicant on stranded meter costs for financial accounting and reporting purposes."]
[]
[]
[2,"The amount of the pooled residual net book value of the removed from service stranded meters, less any contributed capital (net of accumulated amortization), and less any net proceeds from sales, which were transferred to this sub-account as of December 31, 2010."]
[]
[]
[]
[3,"A statement as to whether or not, since transferring the removed stranded meter costs to the sub-account, the recording of depreciation expenses was continued in order to reduce the net book value through accumulated depreciation.  If so, the total depreciation expense amount for the period from the time the costs for the stranded meters were transferred to the sub-account to December 31, 2010 should be provided."]
[]
[]
[]
[]
[null,"If no depreciation expenses were recorded to reduce the net book value of stranded meter costs through accumulated depreciation, the total depreciation expense amount that would have been applicable from the time that the stranded meter costs were transferred to the sub-account of Account 1555 to December 31, 2010 should be provided.  In addition, the following information should be provided:"]
[]
[]
[]
[]
[null,"a)","Whether or not carrying charges were recorded for the stranded meter cost balances in the sub-account, and if so, the total carrying charges recorded to December 31, 2010."]
[]
[]
[null,"b)","The estimated amount of the pooled residual net book value of the removed from service meters, less any net proceeds from sales and contributed capital, at the time when the smart meters will have been fully deployed (e.g., as of December 31, 2010).  If the smart meters have been fully deployed, the actual amount should be provided."]
[]
[]
[]
[]
[null,"c)","A description as to how the applicant intends to recover in rates the remaining costs for stranded meters, including the proposed accounting treatment, the proposed disposition period, and the associated bill impacts."]
[]
[]
[]
["Scenario B:  If the stranded meter costs remained recorded in Account 1860, the above table should be completed and the following information should be provided in Exhibit 9:"]
[]
[]
[1,"A description of the accounting treatment followed by the applicant on stranded meter costs for financial accounting and reporting purposes."]
[]
[]
[2,"The amount of the pooled residual net book value of the removed from service stranded meters, less any contributed capital (net of accumulated amortization), and less any net proceeds from sales, as of December 31, 2010."]
[]
[]
[]
[3,"A statement as to whether or not the recording of depreciation expenses continued in order to reduce the net book value through accumulated depreciation.  If so, provision of the total (cumulative) depreciation expense for the period from the time that the meters became stranded to December 31, 2010."]
[]
[]
[]
[4,"If no depreciation expenses were recorded to reduce the net book value of stranded meters through accumulated depreciation, the total (cumulative) depreciation expense amount that would have been applicable for the period from the time that the meters became stranded to December 31, 2010."]
[]
[]
[]
[5,"The estimated amount of the pooled residual net book value of the removed from service meters, less any net proceeds from sales and contributed capital, at the time when smart meters will have been fully deployed.  If the smart meters have been fully deployed, please provide the actual amount."]
[]
[]
[]
[6,"A description as to how the applicant intends to recover in rates the costs for stranded meters, including the proposed accounting treatment, the proposed disposition period and the associated bill impacts."]
[]
[]
["Distributors should also provide the Net Book Value per class of meter as of December 31, 2010 as well as the number of meters that were removed / stranded.  In preparing this information, distributors should review the Board's letter of January 16, 2007 Stranded Meter Costs Related to the Installation of Smart Meters which stated that records were to be kept of the type and number of each meter to support the stranded meter costs."]

{"sheet":"App.2-Y_MIFRS Summary Impacts","index":45,"n_rows":37,"n_cols":9,"rows_kept":37,"cut":false,"hidden":false,"merged":[[36,0,36,8],[29,0,29,2],[29,6,29,8],[30,0,30,2],[30,6,30,8],[31,0,31,2],[31,6,31,8],[32,0,32,2],[32,6,32,8],[33,0,33,2],[33,6,33,8],[34,0,34,2],[34,6,34,8],[26,0,26,2],[26,6,26,8],[27,0,27,2],[27,6,27,8],[28,0,28,2],[28,6,28,8],[23,0,23,2],[23,6,23,8],[24,0,24,2],[24,6,24,8],[25,0,25,2],[25,6,25,8],[20,0,20,2],[20,6,20,8],[21,0,21,2],[21,6,21,8],[22,0,22,2],[22,3,22,5],[22,6,22,8],[17,0,17,2],[17,6,17,8],[18,0,18,2],[18,6,18,8],[19,0,19,2],[19,6,19,8],[8,0,8,8],[9,0,9,8],[10,0,10,8],[14,0,16,2],[14,6,14,8],[15,6,15,8]]}
[null,null,null,null,null,null,null,"File Number:",{"$f":"EBNUMBER","v":0}]
[null,null,null,null,null,null,null,"Exhibit:"]
[null,null,null,null,null,null,null,"Tab:"]
[null,null,null,null,null,null,null,"Schedule:"]
[null,null,null,null,null,null,null,"Page:"]
[]
[null,null,null,null,null,null,null,"Date:"]
[]
["Appendix 2-Y"]
["Summary of Impacts to Revenue Requirement"]
["from Transition to MIFRS"]
[]
[]
[]
["Revenue Requirement Component",null,null,{"$f":"TestYear","v":2018},{"$f":"TestYear","v":2018},"Difference","Reasons why the revenue requirement "]
[null,null,null,"MIFRS","NEWCGAAP",null,"component is different under MIFRS"]
[]
["Closing NBV 2017",null,null,4342456.9747640705,4342456.9747640705,{"$f":"+D18-E18","v":0},"no change"]
["Closing NBV 2018",null,null,4327540.6605140707,4327540.6605140707,0,"no change"]
["Average NBV",null,null,{"$f":"(D18+D19)/2","v":4334998.8176390706},{"$f":"(E18+E19)/2","v":4334998.8176390706},0]
["Working Capital",null,null,369826.03384016111,369826.03384016111,0,"no change"]
["Rate Base",null,null,{"$f":"SUM(D20:D21)","v":4704824.8514792314},{"$f":"SUM(E20:E21)","v":4704824.8514792314},{"$f":"+D22-E22","v":0}]
[null,null,null,null,null,{"$f":"+D23-E23","v":0}]
["Return on Rate Base",null,null,244952,244952,0,"no change"]
[null,null,null,null,null,0]
["OM&A",null,null,721971,721971,0,"no change"]
["Depreciation",null,null,165121,165121,0,"no change"]
["PILs or Income Taxes",null,null,4630,4630,0,"no change"]
[null,null,null,null,null,0]
["Less: Revenue Offsets",null,null,-28789,-28789,0,"no change"]
[null,null,null,null,null,0]
[null,null,null,null,null,0]
[null,null,null,null,null,0]
["Insert description of additional item(s) and new rows if needed.",null,null,null,null,0]
["Total Base Revenue Requirement",null,null,{"$f":"SUM(D24:D34)","v":1107885},{"$f":"SUM(E24:E34)","v":1107885},{"$f":"SUM(F24:F34)","v":0},"no change"]
[]
["1.  Applicants must provide a summary of the dollar impacts of MIFRS to each component of the revenue requirement (e.g. rate base, operating costs, etc.), including the overall impact on the proposed revenue requirement.  Accordingly, the applicants must identify financial differences and resulting revenue requirement impacts arising from the adoption of  MIFRS as compared to CGAAP.  If the applicant is reflecting the changes in capitalization and depreciation policies for the first time in a rebasing application, then the comparison in the above table should be between MIFRS and CGAAP before the change in accounting policies. If the applicant changed capitalization and depreciation policies and reflected these changes in a previous rebasing application, the comparison in the above table should be between MIFRS and CGAAP after the change in accounting policies.  "]

{"sheet":"Sheet19","index":46,"n_rows":72,"n_cols":9,"rows_kept":72,"cut":false,"hidden":true,"merged":[]}
[null,"CGAAP","CGAAP","CGAAP","MIFRS","USGAAP","ASPE","ASPE","ASPE"]
[null,"N/A",2012,2013,null,null,"N/A",2012,2013]
["LDC Info","x","x","x","x","x","x","x","x"]
["Table of Contents","x","x","x","x","x","x","x","x"]
["COS Flowchart","x","x","x","x","x","x","x","x"]
["List of Key References","x","x","x","x","x","x","x","x"]
["App.2-AA_Capital Projects","x","x","x","x","x","x","x","x"]
["App.2-AB_Capital Expenditures","x","x","x","x","x","x","x","x"]
["App.2-BA1_Fix Asset Cont.CGAAP","x","x","x","n","x","x","x","x"]
["App.2-BA2_Fix Asset Cont.MIFRS","n","n","n","x","n","n","n","n"]
["Appendix 2-BB Service Life Comp","x","x","x","x","x","x","x","x"]
["Instruction for App. 2-C MIFRS","n","n","n","x","n","n","n","n"]
["App.2-CA_CGAAP_DepExp_2011","n","n","n","x","n","n","n","n"]
["App.2-CB_MIFRS_DepExp_2011","n","n","n","x","n","n","n","n"]
["App.2-CC_MIFRS_DepExp_2012","n","n","n","x","n","n","n","n"]
["App.2-CD_MIFRS_DepExp_2013","n","n","n","x","n","n","n","n"]
["App.2-CE_MIFRS_DepExp_2014","n","n","n","x","n","n","n","n"]
["App.2-CF_CGAAP_DepExp_2012","n","n","n","x","n","n","n","n"]
["App.2-CG_MIFRS_DepExp_2012","n","n","n","x","n","n","n","n"]
["App.2-CH_MIFRS_DepExp_2013","n","n","n","x","n","n","n","n"]
["App.2-CI_MIFRS_DepExp_2014","n","n","n","x","n","n","n","n"]
["App.2-CJ_CGAAP_DepExp_2012","n","n","n","x","n","n","n","n"]
["App.2-CK_CGAAP_DepExp_2013","n","n","n","x","n","n","n","n"]
["App.2-CL_MIFRS_DepExp_2013","n","n","n","x","n","n","n","n"]
["App.2-CM_MIFRS_DepExp_2014","n","n","n","x","n","n","n","n"]
["Instruction for App. 2-C CGAAP","x","x","x","n","n","x","x","x"]
["App.2-CN_OldCGAAP_DepExp_2012","x","x","n","n","n","x","x","n"]
["App.2-CO_NewCGAAP_DepExp_2012","x","x","n","n","n","x","x","n"]
["App.2-CP_NewCGAAP_DepExp_2013","x","x","n","n","n","x","x","n"]
["App.2-CQ NewCGAAP_DepExp_2014","x","x","n","n","n","x","x","n"]
["App.2-CR_OldCGAAP_DepExp_2012","x","n","x","n","n","x","n","x"]
["App.2-CS_OldCGAAP_DepExp_2013","x","n","x","n","n","x","n","x"]
["App.2-CT_NewCGAAP_DepExp_2013","x","n","x","n","n","x","n","x"]
["App.2-CU_NewCGAAP_DepExp_2014","x","n","x","n","n","x","n","x"]
["App.2-CV_USGAAP_DepExp","n","n","n","n","x","n","n","n"]
["App.2-DA_Overhead","n","n","n","x","n","n","n","n"]
["App.2-DB_Overhead","x","x","x","n","n","x","x","x"]
["App.2-EA_PP&E Deferral Account","n","n","n","x","x","n","n","n"]
["App.2-EB_PP&E Deferral Account","n","n","n","x","x","n","n","n"]
["App.2-EC_PP&E Deferral Account","n","n","n","x","x","n","n","n"]
["App.2-ED_Account 1576 (2012)","x","x","n","x","x","x","x","n"]
["App.2-EE_Account 1576 (2013)","x","n","x","x","x","x","n","x"]
["App.2-FA Proposed REG Invest.","o","o","o","o","o","o","o","o"]
["App.2-FB Calc of REG Improvemnt","o","o","o","o","o","o","o","o"]
["App.2-FC Calc of REG Expansion","o","o","o","o","o","o","o","o"]
["App.2-G SQI","x","x","x","x","x","x","x","x"]
["App.2-H_Other_Oper_Rev","x","x","x","x","x","x","x","x"]
["App.2-I LF_CDM_WF","x","x","x","x","x","x","x","x"]
["App.2-JA_OM&A_Summary_Analys","x","x","x","x","x","x","x","x"]
["App.2-JB_OM&A_Cost _Drivers","x","x","x","x","x","x","x","x"]
["App.2-JC_OMA Programs","x","x","x","x","x","x","x","x"]
["App.2-K_Employee Costs","x","x","x","x","x","x","x","x"]
["App.2-L_OM&A_per_Cust_FTEE","x","x","x","x","x","x","x","x"]
["App.2-M_Regulatory_Costs","x","x","x","x","x","x","x","x"]
["App.2-N_Corp_Cost_Allocation","x","x","x","x","x","x","x","x"]
["App.2-OA Capital Structure","x","x","x","x","x","x","x","x"]
["App.2-OB_Debt Instruments","x","x","x","x","x","x","x","x"]
["App.2-P_Cost_Allocation","x","x","x","x","x","x","x","x"]
["App.2-Q_Cost of Serv. Emb. Dx","e","e","e","e","e","e","e","e"]
["App.2-R_Loss Factors","x","x","x","x","x","x","x","x"]
["App.2-S_Stranded Meters","x","x","x","x","x","x","x","x"]
["App.2-TA_1592_Tax_Variance","x","x","x","x","x","x","x","x"]
["App.2-TB_1592_HST-OVAT","x","x","x","x","x","x","x","x"]
["App.2-U_IFRS Transition Costs","x","x","x","x","x","x","x","x"]
["App.2-V_Rev_Reconciliation","x","x","x","x","x","x","x","x"]
["App.2-W_Bill Impacts","x","x","x","x","x","x","x","x"]
["App.2-YA_MIFRS Summary Impacts","n","n","n","x","n","n","n","n"]
["App. 2-YB_CGAAP Summary Impacts","x","x","x","n","n","x","x","x"]
["App. 2-Z_Tariff","x","x","x","x","x","x","x","x"]
["lists","n","n","n","n","n","n","n","n"]
["lists2","n","n","n","n","n","n","n","n"]
["Sheet19","n","n","n","n","n","n","n","n"]

{"sheet":"App.2-YA_IFRS Transition Costs","index":47,"n_rows":34,"n_cols":14,"rows_kept":34,"cut":false,"hidden":false,"merged":[[31,1,31,13],[39,0,42,0],[39,1,42,3],[44,0,45,0],[44,1,45,3],[33,0,34,0],[36,0,37,0],[36,1,37,3],[33,1,33,13],[32,1,32,4],[32,5,32,6],[28,0,28,2],[17,0,17,2],[18,0,18,2],[19,0,19,2],[20,0,20,2],[21,0,21,2],[22,0,22,2],[23,0,23,2],[24,0,24,2],[25,0,25,2],[26,0,26,2],[27,0,27,2],[16,0,16,2],[8,0,8,15],[9,0,9,15],[13,0,15,2],[13,13,15,13],[13,10,14,10],[13,11,15,11],[13,12,15,12],[11,0,11,13],[13,9,14,9]]}
[]
[null,null,null,null,null,null,null,null,null,null,null,null,"File Number:",{"$f":"EBNUMBER","v":0}]
[null,null,null,null,null,null,null,null,null,null,null,null,"Exhibit:"]
[null,null,null,null,null,null,null,null,null,null,null,null,"Tab:"]
[null,null,null,null,null,null,null,null,null,null,null,null,"Schedule:"]
[null,null,null,null,null,null,null,null,null,null,null,null,"Page:"]
[]
[null,null,null,null,null,null,null,null,null,null,null,null,"Date:"]
["Appendix 2-YA"]
["One-Time Incremental IFRS Transition Costs"]
[]
["The following table should be completed based on the information requested below. An explanation should be provided for any blank entries.  The entries should include one-time incremental IFRS transition costs that are currently included in Account 1508, Other Regulatory Assets, sub-account Deferred IFRS Transition Costs Account, or Account 1508, Other Regulatory Assets, sub-account IFRS Transition Costs Variance Account."]
[]
["Nature of One-Time Incremental IFRS Transition Costs 1",null,null,null,"Audited Actual Costs Incurred","Audited Actual Costs Incurred","Audited Actual Costs Incurred","Audited Actual Costs Incurred","Audited Carrying Charges ","Forecasted Costs ","Forecasted Costs ","Carrying Charges January 1, 2016 to December 31,2016/April 30, 2017 (As appropriate)","Total Costs and Carrying Charges","Reasons why the costs recorded meet the criteria of one-time IFRS administrative incremental costs"]
[]
[null,null,null,null,2012,2013,2014,2015,"To December 31, 2015",2016,"2017 3"]
["Professional accounting fees",null,null,null,null,null,null,21571,null,null,null,null,{"$f":"SUM(E17:L17)","v":21571}]
["Professional legal fees",null,null,null,null,null,null,null,null,null,null,null,{"$f":"SUM(E18:L18)","v":0}]
["Salaries, wages and benefits of staff added to support the transition to IFRS",null,null,null,null,null,null,null,null,null,null,null,0]
["Associated staff training and development costs",null,null,null,null,null,null,null,null,null,null,null,0]
["Costs related to system upgrades, or replacements or changes where IFRS was the major reason for conversion",null,null,null,null,null,null,null,null,null,null,null,0]
[null,null,null,null,null,null,null,null,null,null,null,null,0]
[null,null,null,null,null,null,null,null,null,null,null,null,0]
[null,null,null,null,null,null,null,null,null,null,null,null,0]
[null,null,null,null,null,null,null,null,null,null,null,null,0]
["Amounts, if any, included in previous Board approved rates (amounts should be negative) 2",null,null,null,null,null,null,null,null,null,null,null,0]
[null,null,null,null,null,null,null,null,null,null,null,null,0]
["Insert description of additional item(s) and new rows if needed.",null,null,null,null,null,null,null,null,null,null,null,0]
["Total",null,null,null,{"$f":"SUM(E17:E28)","v":0},0,null,{"$f":"SUM(H17:H28)","v":21571},0,null,0,null,{"$f":"SUM(M17:M28)","v":21571}]
[]
["Note:"]
[1,"The Deferred IFRS Transition Costs Account and the IFRS Transition Costs Variance Account are exclusively for necessary, incremental transition costs and shall not include ongoing IFRS compliance costs or impacts arising from adopting accounting policy changes that reflect changes in the timing of the recognition of income. The incremental costs in these accounts shall not include costs related to system upgrades, or replacements or changes where IFRS was not the major reason for conversion. In addition, incremental IFRS costs shall not include capital assets or expenditures."]
[2,"If there were any amounts approved in previous Board approved rates, please state the EB #:"]
[3,"Any forecasted One-time costs past 2015 should be fully explained in the application, since distributors were required to adopt IFRS or an alternative accounting standard by January 1, 2015."]

{"sheet":"Sheet1","index":48,"n_rows":0,"n_cols":0,"rows_kept":0,"cut":false,"hidden":false,"merged":[]}