{"text_format":"1","workbook":"xlsx","n_sheets":41,"sheets":["LDC Info","Index","COS Flowchart","List of Key References","App.2-A_Requested_Approvals","App.2-AA_Capital Projects","App.2-AB_Capital Expenditures","App.2-AC_Customer Engagement","App.2-B_Acctg Instructions","App.2-BA_Fixed Asset Cont","Appendix 2-BB Service Life  ","App.2-C_DepExp","App.2-D_Overhead","App.2-EA_Account 1575 (2015)","App.2-EB_Account 1576 (2012)","App.2-EC_Account 1576 (2013)","App.2-FA Proposed REG Invest.","App.2-FB Calc of REG Improvemnt","App.2-FC Calc of REG Expansion","App.2-G SQI","App.2-H_Other_Oper_Rev","App_2-I LF_CDM","App.2-IA_Load_Forecast_Instrct","App.2-IB_Load_Forecast_Analysis","App.2-JA_OM&A_Summary_Analys","App.2-JB_OM&A_Cost _Drivers","App.2-JC_OMA Programs","App.2-K_Employee Costs","App.2-L_OM&A_per_Cust_FTE","App.2-L_OM&A_per_Cust_FTEE_exp","App.2-M_Regulatory_Costs","App.2-N_Corp_Cost_Allocation","App.2-OA Capital Structure","App.2-OB_Debt Instruments","App.2-Q_Cost of Serv. Emb. Dx","App.2-R_Loss Factors","App.2-S_Stranded Meters","App.2-Y_MIFRS Summary Impacts","Sheet19","App.2-YA_IFRS Transition Costs","Sheet1"],"not_rendered":{"charts":0,"images":4,"macros":1,"external_links":14,"defined_names":508,"comments":4,"pivot_tables":0},"unopened":[],"bounds":{"document_bytes":16777216,"sheet_cells":100000,"rows_first":2000,"rows_last":500,"rows_between":2000,"halvings":0,"cell_chars":16384,"cell_head_chars":4096},"cells_cut":0,"cells_raw":0,"read":"whole","date_system":"1900"}

{"sheet":"LDC Info","index":0,"n_rows":77,"n_cols":27,"rows_kept":77,"cut":false,"hidden":false,"merged":[[45,0,45,3],[50,2,50,11],[54,2,54,12],[52,2,52,13],[27,4,27,6],[30,4,30,6],[29,0,30,3],[42,0,43,3],[38,0,39,3],[39,4,39,6],[32,0,33,3],[33,4,33,6],[35,0,36,3],[17,4,17,10],[13,4,13,10],[15,4,15,8],[19,4,19,8],[25,4,25,6],[23,4,23,6],[21,4,21,8]]}
[]
[]
[null,null,null,null,null,null,null,null,null,null,null,null,null,null,null,null,null,null,null,null,null,null,null,null,null,1,"Alectra Utilities Corporation"]
[null,null,null,null,null,null,null,null,null,null,null,null,null,null,null,null,null,null,null,null,null,null,null,null,null,2,"Alectra Utilities Corporation - Brampton service territory"]
[null,null,null,null,null,null,null,null,null,null,null,null,null,null,null,null,null,null,null,null,null,null,null,null,null,3,"Alectra Utilities Corporation - Horizon Utilities service territory"]
[null,null,null,null,null,null,null,null,null,null,null,null,null,null,null,null,null,null,null,null,null,null,null,null,null,4,"Alectra Utilities Corporation - Mississauga service territory"]
[null,null,null,null,null,null,null,null,null,null,null,null,null,null,null,null,null,null,null,null,null,null,null,null,null,5,"Alectra Utilities Corporation - PowerStream service territory"]
[null,null,null,null,null,null,null,null,null,null,null,null,null,null,null,null,null,null,null,null,null,null,null,null,null,6,"Algoma Power Inc."]
[null,null,null,null,null,null,null,null,null,null,null,null,null,null,null,null,null,null,null,null,null,null,null,null,null,7,"Atikokan Hydro Inc."]
[null,null,null,null,null,null,null,null,null,null,null,null,null,null,null,null,null,null,null,null,null,null,null,null,null,8,"Attawapiskat Power Corporation"]
[null,null,null,null,null,null,null,null,null,null,null,null,null,null,null,null,null,null,null,null,null,null,null,null,null,9,"Bluewater Power Distribution Corporation"]
[null,null,null,null,null,null,null,null,null,null,null,null,null,null,null,null,null,null,null,null,null,null,null,null,null,10,"Brantford Power Inc."]
[null,null,null,null,null,null,null,null,null,null,null,null,null,null,null,null,null,null,null,null,null,null,null,null,null,11,"Burlington Hydro Inc."]
[null,null,null,"Utility Name   ","Sioux Lookout Hydro Inc.",null,null,null,null,null,null,null,null,null,null,null,null,null,null,null,null,null,null,null,null,12,"Canadian Niagara Power Inc. (Eastern Ontario Power/Fort Erie/Port Colborne)"]
[null,null,null,null,null,null,null,null,null,null,null,null,null,null,null,null,null,null,null,null,null,null,null,null,null,13,"Centre Wellington Hydro Ltd."]
[null,null,null,"Assigned EB Number","EB-2017-0073",null,null,null,null,null,null,null,null,null,null,null,null,null,null,null,null,null,null,null,null,14,"Chapleau Public Utilities Corporation"]
[null,null,null,null,null,null,null,null,null,null,null,null,null,null,null,null,null,null,null,null,null,null,null,null,null,15,"COLLUS PowerStream Corp."]
[null,null,null,"Name of Contact and Title","Deanne Kulchyski, President/CEO",null,null,null,null,null,null,null,null,null,null,null,null,null,null,null,null,null,null,null,null,16,"Cooperative Hydro Embrun Inc."]
[null,null,null,null,null,null,null,null,null,null,null,null,null,null,null,null,null,null,null,null,null,null,null,null,null,17,"E.L.K. Energy Inc."]
[null,null,null,"Phone Number   ","807-737-3800",null,null,null,null,null,null,null,null,null,null,null,null,null,null,null,null,null,null,null,null,18,"Energy + Inc."]
[null,null,null,null,null,null,null,null,null,null,null,null,null,null,null,null,null,null,null,null,null,null,null,null,null,19,"Enersource Hydro Mississauga Inc."]
[null,null,null,"Email Address   ","dkulchyski@tbaytel.net",null,null,null,null,null,null,null,null,null,null,null,null,null,null,null,null,null,null,null,null,20,"Entegrus Powerlines Inc."]
[null,null,null,null,null,null,null,null,null,null,null,null,null,null,null,null,null,null,null,null,null,null,null,null,null,21,"ENWIN Utilities Ltd."]
[null,null,null,"Test Year",2018,null,null,null,null,null,null,null,null,null,null,null,null,null,null,null,null,null,null,null,null,22,"Erie Thames Powerlines Corporation"]
[null,null,null,null,null,null,null,null,null,null,null,null,null,null,null,null,null,null,null,null,null,null,null,null,null,23,"Espanola Regional Hydro Distribution Corporation"]
[null,null,null,"Bridge Year",{"$f":"IF(ISBLANK(E24), \"\", E24-1)","v":2017},null,null,null,null,null,null,null,null,null,null,null,null,null,null,null,null,null,null,null,null,24,"Essex Powerlines Corporation"]
[null,null,null,null,null,null,null,null,null,null,null,null,null,null,null,null,null,null,null,null,null,null,null,null,null,25,"Festival Hydro Inc."]
[null,null,null,"Last Rebasing Year",2013,null,null,null,null,null,null,null,null,null,null,null,null,null,null,null,null,null,null,null,null,26,"Fort Albany Power Corporation"]
[null,null,null,null,null,null,null,null,null,null,null,null,null,null,null,null,null,null,null,null,null,null,null,null,null,27,"Fort Frances Power Corporation"]
["Identify the accounting standard used for the test year",null,null,null,null,null,null,null,null,null,null,null,null,null,null,null,null,null,null,null,null,null,null,null,null,28,"Greater Sudbury Hydro Inc."]
[null,null,null,null,"MIFRS",null,null,null,null,null,null,null,null,null,null,null,null,null,null,null,null,null,null,null,null,29,"Grimsby Power Inc."]
[null,null,null,null,null,null,null,null,null,null,null,null,null,null,null,null,null,null,null,null,null,null,null,null,null,30,"Guelph Hydro Electric Systems Inc."]
["Did you update your depreciation and capitalization policies and reflect the changes in policies in a prior rebasing application?",null,null,null,null,null,null,null,null,null,null,null,null,null,null,null,null,null,null,null,null,null,null,null,null,31,"Halton Hills Hydro Inc."]
[null,null,null,null,"Yes",null,null,null,null,null,null,null,null,null,null,null,null,null,null,null,null,null,null,null,null,32,"Hearst Power Distribution Company Limited"]
[null,null,null,null,null,null,null,null,null,null,null,null,null,null,null,null,null,null,null,null,null,null,null,null,null,33,"Hydro 2000 Inc."]
["When did you update your actual depreciation and capitalization policies?",null,null,null,null,null,null,null,null,null,null,null,null,null,null,null,null,null,null,null,null,null,null,null,null,34,"Hydro Hawkesbury Inc."]
[null,null,null,null,"2001-01-01",2012,null,null,null,null,null,null,null,null,null,null,null,null,null,null,null,null,null,null,null,35,"Hydro One Networks Inc."]
[null,null,null,null,null,null,null,null,null,null,null,null,null,null,null,null,null,null,null,null,null,null,null,null,null,36,"Hydro One Networks Inc. - Norfolk, Haldimand, Woodstock"]
["Identify the year the applicant adopted IFRS for financial reporting purposes",null,null,null,null,null,null,null,null,null,null,null,null,null,null,null,null,null,null,null,null,null,null,null,null,37,"Hydro One Remote Communities Inc."]
[null,null,null,null,2015,null,null,null,null,null,null,null,null,null,null,null,null,null,null,null,null,null,null,null,null,38,"Hydro Ottawa Limited"]
[null,null,null,null,null,null,null,null,null,null,null,null,null,null,null,null,null,null,null,null,null,null,null,null,null,39,"Innpower Corporation"]
[null,null,null,null,null,null,null,null,null,null,null,null,null,null,null,null,null,null,null,null,null,null,null,null,null,40,"Kashechewan Power Corporation"]
["Are you applying for cost recovery for the test and/or future year(s) for Green Energy initiatives?",null,null,null,null,null,null,null,null,null,null,null,null,null,null,null,null,null,null,null,null,null,null,null,null,41,"Kenora Hydro Electric Corporation Ltd."]
[null,null,null,null,"No",null,null,null,null,null,null,null,null,null,null,null,null,null,null,null,null,null,null,null,null,42,"Kingston Hydro Corporation"]
[null,null,null,null,null,null,null,null,null,null,null,null,null,null,null,null,null,null,null,null,null,null,null,null,null,43,"Kitchener-Wilmot Hydro Inc."]
[{"$f":"\"Is \" & E14 & \" an embedded distributor?\"","v":"Is Sioux Lookout Hydro Inc. an embedded distributor?"},null,null,null,"Yes",null,null,null,null,null,null,null,null,null,null,null,null,null,null,null,null,null,null,null,null,44,"Lakefront Utilities Inc."]
[null,null,null,null,null,null,null,null,null,null,null,null,null,null,null,null,null,null,null,null,null,null,null,null,null,45,"Lakeland Power Distribution Ltd."]
[null,null,null,null,null,null,null,null,null,null,null,null,null,null,null,null,null,null,null,null,null,null,null,null,null,46,"London Hydro Inc."]
[null,"Notes",null,null,null,null,null,null,null,null,null,null,null,null,null,null,null,null,null,null,null,null,null,null,null,47,"Midland Power Utility Corporation"]
[null,null,null,null,null,null,null,null,null,null,null,null,null,null,null,null,null,null,null,null,null,null,null,null,null,48,"Milton Hydro Distribution Inc."]
[null,null,"Pale green cells represent input cells.",null,null,null,null,null,null,null,null,null,null,null,null,null,null,null,null,null,null,null,null,null,null,49,"Newmarket-Tay Power Distribution Ltd."]
[null,null,null,null,null,null,null,null,null,null,null,null,null,null,null,null,null,null,null,null,null,null,null,null,null,50,"Niagara Peninsula Energy Inc."]
[null,null,"Pale blue cells represent drop-down lists.  The applicant should select the appropriate item from the drop-down list.",null,null,null,null,null,null,null,null,null,null,null,null,null,null,null,null,null,null,null,null,null,null,51,"Niagara-on-the-Lake Hydro Inc."]
[null,null,null,null,null,null,null,null,null,null,null,null,null,null,null,null,null,null,null,null,null,null,null,null,null,52,"North Bay Hydro Distribution Limited"]
[null,null,"White cells contain fixed values, automatically generated values or formulae. ",null,null,null,null,null,null,null,null,null,null,{"$f":"IF(LEN($G55)>1, (SUMPRODUCT(--($C$78:$C$1000=$C55),--($A$78:$A$1000=$D55), --($B$78:$B$1000=$B55&\"_TOTAL\"), $L$78:$L$1000)), \"\")","v":""},{"$f":"IF(LEN($G55)>1, (SUMPRODUCT(--($C$78:$C$1000=$C55),--($A$78:$A$1000=$D55), --($B$78:$B$1000=$B55&\"_TOTAL\"), $M$78:$M$1000)), \"\")","v":""},null,null,null,null,null,null,null,null,null,null,53,"Northern Ontario Wires Inc."]
[null,null,null,null,null,null,null,null,null,null,null,null,null,{"$f":"IF(LEN($G56)>1, (SUMPRODUCT(--($C$78:$C$1000=$C56),--($A$78:$A$1000=$D56), --($B$78:$B$1000=$B56&\"_TOTAL\"), $L$78:$L$1000)), \"\")","v":""},{"$f":"IF(LEN($G56)>1, (SUMPRODUCT(--($C$78:$C$1000=$C56),--($A$78:$A$1000=$D56), --($B$78:$B$1000=$B56&\"_TOTAL\"), $M$78:$M$1000)), \"\")","v":""},null,null,null,null,null,null,null,null,null,null,54,"Oakville Hydro Electricity Distribution Inc."]
[null,null,null,null,null,null,null,null,null,null,null,null,null,"","",null,null,null,null,null,null,null,null,null,null,55,"Orangeville Hydro Limited"]
[null,null,null,null,null,null,null,null,null,null,null,null,null,"","",null,null,null,null,null,null,null,null,null,null,56,"Orillia Power Distribution Corporation"]
[null,null,null,null,null,null,null,null,null,null,null,null,null,"","",null,null,null,null,null,null,null,null,null,null,57,"Oshawa PUC Networks Inc."]
[null,null,null,null,null,null,null,null,null,null,null,null,null,"","",null,null,null,null,null,null,null,null,null,null,58,"Ottawa River Power Corporation"]
[null,null,null,null,null,null,null,null,null,null,null,null,null,"","",null,null,null,null,null,null,null,null,null,null,59,"Peterborough Distribution Inc."]
[null,null,null,null,null,null,null,null,null,null,null,null,null,"","",null,null,null,null,null,null,null,null,null,null,60,"PUC Distribution Inc."]
[null,null,null,null,null,null,null,null,null,null,null,null,null,"","",null,null,null,null,null,null,null,null,null,null,61,"Renfrew Hydro Inc."]
[null,null,null,null,null,null,null,null,null,null,null,null,null,"","",null,null,null,null,null,null,null,null,null,null,62,"Rideau St. Lawrence Distribution Inc."]
[null,null,null,null,null,null,null,null,null,null,null,null,null,"","",null,null,null,null,null,null,null,null,null,null,63,"Sioux Lookout Hydro Inc."]
[null,null,null,null,null,null,null,null,null,null,null,null,null,"","",null,null,null,null,null,null,null,null,null,null,64,"St. Thomas Energy Inc."]
[null,null,null,null,null,null,null,null,null,null,null,null,null,"","",null,null,null,null,null,null,null,null,null,null,65,"Thunder Bay Hydro Electricity Distribution Inc."]
[null,null,null,null,null,null,null,null,null,null,null,null,null,"","",null,null,null,null,null,null,null,null,null,null,66,"Tillsonburg Hydro Inc."]
[null,null,null,null,null,null,null,null,null,null,null,null,null,"","",null,null,null,null,null,null,null,null,null,null,67,"Toronto Hydro-Electric System Limited"]
[null,null,null,null,null,null,null,null,null,null,null,null,null,"","",null,null,null,null,null,null,null,null,null,null,68,"Veridian Connections Inc."]
[null,null,null,null,null,null,null,null,null,null,null,null,null,"","",null,null,null,null,null,null,null,null,null,null,69,"Wasaga Distribution Inc."]
[null,null,null,null,null,null,null,null,null,null,null,null,null,"","",null,null,null,null,null,null,null,null,null,null,70,"Waterloo North Hydro Inc."]
[null,null,null,null,null,null,null,null,null,null,null,null,null,"","",null,null,null,null,null,null,null,null,null,null,71,"Welland Hydro-Electric System Corp."]
[null,null,null,null,null,null,null,null,null,null,null,null,null,"","",null,null,null,null,null,null,null,null,null,null,72,"Wellington North Power Inc."]
[null,null,null,null,null,null,null,null,null,null,null,null,null,null,null,null,null,null,null,null,null,null,null,null,null,73,"West Coast Huron Energy Inc."]
[null,null,null,null,null,null,null,null,null,null,null,null,null,null,null,null,null,null,null,null,null,null,null,null,null,74,"Westario Power Inc."]
[null,null,null,null,null,null,null,null,null,null,null,null,null,null,null,null,null,null,null,null,null,null,null,null,null,75,"Whitby Hydro Electric Corporation"]

{"sheet":"Index","index":1,"n_rows":42,"n_cols":6,"rows_kept":42,"cut":false,"hidden":false,"merged":[[41,1,41,5]]}
[]
[]
[]
[]
[]
[]
[]
[]
[]
[]
[]
[]
[]
[]
[1,"LDC Information Sheet",null,null,20,"App.2-G: Service Reliability Indicators"]
[2,"Index",null,null,21,"App.2-H: Other Operating Revenue"]
[3,"Cost of Service Application Flowchart",null,null,22,"App.2-I: Load Forecast CDM Adjustment Workform"]
[4,"List of Key References",null,null,23,"App.2-IA: Load Forecast Data Instructions"]
[5,"App.2-A: List of Requested Approvals",null,null,24,"App.2-IB:  Actual and Forecast Load and Customer Data"]
[6,"App.2-AA: Capital Projects Table",null,null,25,"App.2-JA: OM&A Summary Analysis"]
[7,"App.2-AB: Capital Expenditures",null,null,26,"App.2-JB: Recoverable OM&A Cost Driver Table"]
[8,"App. 2-AC: Customer Engagement Worksheet",null,null,27,"App.2-JC: OM&A Programs Table"]
[9,"App.2-B: General Accounting Instructions",null,null,28,"App.2-K: Employee Costs"]
[10,"App.2-BA: Fixed Asset Continuity Schedule",null,null,29,"App.2-L: Recoverable OM&A Cost per Customer and per FTE"]
[11,"Appendix 2-BB: Service Life Comparison",null,null,30,"App.2-M: Regulatory Costs Schedule"]
[12,"App.2-C_DepExp: Depreciation and Amortization Expense",null,null,31,"App.2-N: Shared Services and Corporate Cost Allocation"]
[13,"App.2-D: Overhead Expenses",null,null,32,"App.2-OA: Capital Structure and Cost of Capital"]
[14,"App.2-EA: Account 1575 PP&E Deferral Account (2015 IFRS Adopters)",null,null,33,"App.2-OB: Debt Instruments"]
[15,"App.2-EB: Account 1576 - Accounting Changes Under CGAAP (2012 Changes)",null,null,34,"App.2-Q: Cost of Serving Embedded Distributor(s)"]
[16,"App.2-EC: Account 1576 - Accounting Changes Under CGAAP (2013 Changes)",null,null,35,"App.2-R: Loss Factors"]
[17,"App.2-FA: Renewable Generation Connection Investment Summary",null,null,36,"App.2-S: Stranded Meter Treatment"]
[18,"App.2-FB: Calculation of Renewable Generation Connection Direct Benefits/Provincial Amount: Renewable Enabling Improvement Investments",null,null,37,"App.2-Y: Transition to MIFRS Summary Impact"]
[19,"App.2-FC: Calculation of Renewable Generation Connection Direct Benefits/Provincial Amount: Renewable Expansion Investments",null,null,38,"App.2-YA: One-Time Incremental IFRS Transition Costs"]
[]
[]
[]
[]
[]
[]
[]
[]
["Note:","Appendices for the Tariff of Rates and Charges at Current and Proposed Rates, and for the Bill Impacts are now in a separate spreadsheet model. These appendices were formerly 2-Z and 2-W."]

{"sheet":"COS Flowchart","index":2,"n_rows":6,"n_cols":2,"rows_kept":6,"cut":false,"hidden":false,"merged":[[5,1,5,6],[2,1,2,6],[3,1,3,6]]}
[]
[]
[]
[null,"Cost of Service Rate Application Schematic"]
[]
[null,"The Cost of Service Rate Application Schematic is a flowchart that is included as a guide for the components of an application. The schematic demonstrates how demand and costs interrelate to derive the revenue requirement and how the revenue requirement is allocated between classes and through fixed/variable splits to derive rates that will be compensatory for the annual revenue requirement, based on the the forecasted demand.  There is no form to be filled out; therefore, this Schedule is not required to be filed."]

{"sheet":"List of Key References","index":3,"n_rows":5,"n_cols":2,"rows_kept":5,"cut":false,"hidden":false,"merged":[[2,1,2,11],[4,0,4,11]]}
[]
[]
[null,"List of Key References"]
[]
["A list of key references for understanding the Filing Requirements has been embedded in the document below. To access the list of references and associated hyperlinks double-click the icon below."]

{"sheet":"App.2-A_Requested_Approvals","index":4,"n_rows":46,"n_cols":8,"rows_kept":46,"cut":false,"hidden":false,"merged":[[8,1,8,7],[33,5,33,7],[35,5,35,7],[37,5,37,7],[39,5,39,7],[9,1,9,7],[43,5,43,7],[45,5,45,7],[41,5,41,7],[11,1,11,7],[29,5,29,7],[23,5,23,7],[25,5,25,7],[27,5,27,7],[31,5,31,7],[21,5,21,7],[13,1,13,7],[15,1,15,7],[17,1,17,7],[19,5,19,7]]}
[null,null,null,null,null,null,"File Number:",{"$f":"EBNUMBER","v":"EB-2017-0073"}]
[null,null,null,null,null,null,"Exhibit:",1]
[null,null,null,null,null,null,"Tab:"]
[null,null,null,null,null,null,"Schedule:"]
[null,null,null,null,null,null,"Page:"]
[]
[null,null,null,null,null,null,"Date:","2017-08-28"]
[]
[null,"Appendix 2-A"]
[null,"List of Requested Approvals"]
[]
[null,"The distributor must fill out the following sheet with the complete list of specific approvals requested and relevant section(s) of the legislation must be provided. All approvals, including accounting orders (deferral and variance accounts) new rate classes, revised specific service charges or retail service charges which the applicant is seeking, must be separately identified, as well being clearly documented in the appropriate sections of the application."]
[]
[null,"Additional requests may be added by copying and pasting blank input rows, as needed."]
[]
[null,"If additional requests arise, or requested approvals are removed, during the processing of the application, the distributor should update this list."]
[]
[null,{"$f":"CONCATENATE('LDC Info'!E14,\" is seeking the following approvals in this application:\")","v":"Sioux Lookout Hydro Inc. is seeking the following approvals in this application:"}]
[]
[null,1,null,null,null,"Approval under Section 78 of the Ontario Energy Board Act, 1998 to charge distribution rates effective May 1, 2018 to recover a service revenue Requirement of $2,190,155 which includes a revenue deficiency of $112,317 as detailed in Exhibit 6. The schedule of proposed rates is set out in Exhibit 8."]
[]
[null,2,null,null,null,"Approval of the Distribution System Plan as outlined in Exhibit 2."]
[]
[null,3,null,null,null,"Approval of revised low voltage rates as proposed and described in Exhibit 8."]
[]
[null,4,null,null,null,"Approval to adjust the Retail Transmission Rates - Network and Connection as detailed in Exhibit 8."]
[]
[null,5,null,null,null,"Approval to continue to charge Wholesale Market and Rural Rate Protection Charges approved in the Board Decision and Order in the matter of SLHI's 2017 Distribution Rates (EB-2016-00103)."]
[]
[null,6,null,null,null,"Approval to continue the Specific Service Charges and Transformer Allowance approved in the Board Decision and Order in the matter of SLHI's 2017 Distribution Rates (EB-2016-0103)."]
[]
[null,7,null,null,null,"Approval to remove the Unmetered Scattered Load Class."]
[]
[null,8,null,null,null,"Approval of the proposed loss factors as detailed in Exhibit 8."]
[]
[null,9,null,null,null,"Approval of the rate riders for a one year disposition of the Group 1 Deferral and Variance Accounts as detailed in Exhibit 9."]
[]
[null,10,null,null,null,"Approval to dispose of the Lost Revenue Adjustment Mechanism Variance Account (\"LRAMVA\") for lost revenue from 2011 to 2015 resulting from 2011 to 2015 IESO (formally OPA) programs as detailed in Exhibit 4."]
[]
[null,11,null,null,null,"Approval to dispose of Group 2 Accounts 1508, Sub Account IFRS, 1518 Retail Cost Variance Account - Retail, 1548 Retails Cost Variance Account - STR as outlined in Exhibit 9 over a one year dispostion."]
[]
[null,12,null,null,null,"Approval to dispose of Account 1575 IFRS-CGAAP Transition PP&E Amounts over a five year disposition period as outlined in Exhibit 9."]
[]
[null,13,null,null,null,"Approval to change the wording under Specific Service Charges from Returned Cheque (plus bank charges) to Returned Item (plus Bank Charges)."]
[]
[null,14,null,null,null,"SLHI may request such other approvals as counsel for SLHI may submit and the Board may allow."]

{"sheet":"App.2-AA_Capital Projects","index":5,"n_rows":61,"n_cols":8,"rows_kept":61,"cut":false,"hidden":false,"merged":[[11,0,11,7],[63,0,64,8],[9,0,9,7],[8,0,8,7],[59,0,59,7],[61,0,61,7],[60,0,60,7]]}
[null,null,null,null,null,null,"File Number:",{"$f":"EBNUMBER","v":"EB-2017-0073"}]
[null,null,null,null,null,null,"Exhibit:",2]
[null,null,null,null,null,null,"Tab:"]
[null,null,null,null,null,null,"Schedule:"]
[null,null,null,null,null,null,"Page:"]
[]
[null,null,null,null,null,null,"Date:","2017-08-28"]
[]
["Appendix 2-AA"]
["Capital Projects Table"]
[]
[]
["Projects",{"$f":"C13-1","v":2013},{"$f":"D13-1","v":2014},{"$f":"E13-1","v":2015},{"$f":"BridgeYear - 1","v":2016},{"$f":"BridgeYear & \" Bridge Year\"","v":"2017 Bridge Year"},{"$f":"TestYear & \" Test Year\"","v":"2018 Test Year"}]
["Reporting Basis","CGAAP","CGAAP","MIFRS","MIFRS","MIFRS","MIFRS"]
["System Renewal"]
["Pole Replacements",66424,111358,34940,76244,105500,130304]
["Winoga Submarine Cable",null,null,33317]
["Smart Meter Modem Upgrade",null,12125]
["Sam Lake Modems",null,null,1118]
["Cross Arm Replacements",null,null,null,31907]
["Transformer Replacements",null,null,null,null,23600,24025]
["Meter Reverification Program",null,null,null,4330,16712]
["Spare Transformers",null,9823,4025]
["Sub-Total",{"$f":"SUM(B16:B23)","v":66424},133306,73400,112481,145812,154329]
["System Access"]
["New Connections",85799,69175,68629,68561,140000,60000]
["General Upgrades",57585,61284,64180,41593,25000,40000]
["LTLT Elimination",null,null,null,null,147842]
[]
[]
["Sub-Total",{"$f":"SUM(B26:B30)","v":143384},130459,132809,110154,312842,100000]
["System Service"]
["South Shore Drive Conversion",10254]
["Rear Front Street",null,null,25353]
["F2 Blue Phase Reconductoring",null,null,45184,52039,48000]
["Hudson Upgrade",null,null,25108]
[]
["Sub-Total",{"$f":"SUM(B33:B37)","v":10254},0,95645,52039,48000,0]
["General Plant"]
["Backhoe",85090]
["Amcorder Recording Meter",6145]
["Tools - General",1357,3504,1005,5323,5000,5000]
["Computers",3155,1000,1830,null,2000,2000]
["Vehicle Replacements",null,54539,14234,null,35000,355000]
["Mapping Upgrade",null,33600]
["Web Presentment",null,7250]
["Shop internet upgrade",null,4441]
["Office Equipment",null,278,2318,299,2000,2000]
["Pole testing equipment",null,null,null,15389]
["Mapping Software Conversion",null,null,null,null,45000]
["Phone System Upgrade",null,null,11167]
["Sub-Total",{"$f":"SUM(B40:B51)","v":95747},104612,30554,21011,89000,364000]
["Miscellaneous",4134,2056,1523]
["Total",{"$f":"SUMPRODUCT(--($A15:$A53=\"Sub-Total\"), B$15:B$53)+B53","v":319943},370433,333931,295685,595654,618329]
["Less Renewable Generation Facility Assets and Other Non-Rate-Regulated Utility Assets (input as negative)",-1067,null,-1523]
["Total",{"$f":"B54+B55","v":318876},370433,332408,295685,595654,618329]
[]
["Notes:"]
[]
["1   Please provide a breakdown of the major components of each capital project undertaken in each year.  Please ensure that all projects below the materiality threshold are included in the miscellaneous line.  Add more projects as required."]
["2   The applicant should group projects appropriately and avoid presentations that result in classification of significant components of the capital budget in the miscellaneous category."]

{"sheet":"App.2-AB_Capital Expenditures","index":6,"n_rows":35,"n_cols":21,"rows_kept":35,"cut":false,"hidden":false,"merged":[[24,0,24,20],[32,0,33,20],[35,0,36,20],[34,0,34,20],[27,0,27,20],[28,0,28,20],[29,0,30,20],[31,0,31,20],[25,0,25,7],[15,16,15,20],[12,0,15,0],[12,1,12,15],[15,1,15,2],[15,4,15,5],[15,7,15,8],[15,10,15,11],[15,13,15,14],[12,16,12,20],[13,1,13,3],[13,4,13,6],[13,18,14,18],[13,19,14,19],[13,20,14,20],[8,0,8,20],[9,0,9,20],[13,7,13,9],[13,10,13,12],[13,13,13,15],[13,16,14,16],[13,17,14,17]]}
[null,null,null,null,null,null,null,null,null,null,null,null,null,null,null,null,null,null,"File Number:",null,{"$f":"EBNUMBER","v":"EB-2017-0073"}]
[null,null,null,null,null,null,null,null,null,null,null,null,null,null,null,null,null,null,"Exhibit:",null,2]
[null,null,null,null,null,null,null,null,null,null,null,null,null,null,null,null,null,null,"Tab:"]
[null,null,null,null,null,null,null,null,null,null,null,null,null,null,null,null,null,null,"Schedule:"]
[null,null,null,null,null,null,null,null,null,null,null,null,null,null,null,null,null,null,"Page:"]
[]
[null,null,null,null,null,null,null,null,null,null,null,null,null,null,null,null,null,null,"Date:",null,"2017-08-28"]
[]
["Appendix 2-AB"]
["Table 2 - Capital Expenditure Summary from Chapter 5 Consolidated\nDistribution System Plan Filing Requirements"]
[]
["First year of Forecast Period:",{"$f":"TestYear","v":2018}]
["CATEGORY","Historical Period (previous plan1 & actual)",null,null,null,null,null,null,null,null,null,null,null,null,null,null,"Forecast Period (planned)"]
[null,{"$f":"E14-1","v":2013},null,null,{"$f":"H14-1","v":2014},null,null,{"$f":"K14-1","v":2015},null,null,{"$f":"N14-1","v":2016},null,null,{"$f":"Q14-1","v":2017},null,null,{"$f":"B12","v":2018},{"$f":"Q14+1","v":2019},{"$f":"R14+1","v":2020},{"$f":"S14+1","v":2021},{"$f":"T14+1","v":2022}]
[null,"Plan","Actual","Var","Plan","Actual","Var","Plan","Actual","Var","Plan","Actual","Var","Plan","Actual2","Var"]
[null,"$ '000",null,"%","$ '000",null,"%","$ '000",null,"%","$ '000",null,"%","$ '000",null,"%","$ '000"]
["System Access",97818,143384,{"$f":"IF(ISERROR((C17-B17)/B17),\"--\",(C17-B17)/B17)","v":0.46582428591874708},113000,130459,{"$f":"IF(ISERROR((F17-E17)/E17),\"--\",(F17-E17)/E17)","v":0.15450442477876106},102700,132809,{"$f":"IF(ISERROR((I17-H17)/H17),\"--\",(I17-H17)/H17)","v":0.29317429406036999},102700,110154,{"$f":"IF(ISERROR((L17-K17)/K17),\"--\",(L17-K17)/K17)","v":7.258033106134372E-2},312842,null,{"$f":"IF(ISERROR((O17-N17)/N17),\"--\",(O17-N17)/N17)","v":-1},100000,101800,103632,105498,107397]
["System Renewal",119122,69491,-0.41664008327596919,105325,133306,0.26566342273914073,80000,73400,-8.2500000000000004E-2,50000,112481,1.24962,145812,null,-1,154329,220456,138836,141335,143879]
["System Service",null,10254,"--",37000,0,-1,116140,95645,-0.17646805579473049,48126,52039,8.1307401404646137E-2,48000,null,-1]
["General Plant",103000,96814,-6.0058252427184468E-2,108500,106668,-1.688479262672811E-2,39000,30554,-0.21656410256410255,36900,21011,-0.43059620596205961,89000,null,-1,364000,79000,315000,44000,9000]
["TOTAL EXPENDITURE",{"$f":"SUM(B17:B20)","v":319940},{"$f":"SUM(C17:C20)","v":319943},9.3767581421516542E-6,363825,370433,1.8162578162578161E-2,337840,332408,-1.607861709685058E-2,237726,295685,0.24380589418069543,595654,0,-1,618329,401256,557468,290833,{"$f":"SUM(U17:U20)","v":260276}]
["System O&M",null,750206,"--",null,772525,"--",null,686231,"--",null,769028,"--",null,777712,"--",742406,767525,746462,752364,768225]
[]
["Notes to the Table:"]
["1. Historical “previous plan” data is not required unless a plan has previously been filed. However, use the last Board-approved, at least on a Total (Capital) Expenditure basis for the last cost of service rebasing year, and the applicant should include their planned budget in each subsequent historical year up to and including the Bridge Year."]
["2. Indicate the number of months of 'actual' data included in the last year of the Historical Period (normally a 'bridge' year):"]
[]
["Explanatory Notes on Variances (complete only if applicable)"]
["Notes on shifts in forecast vs. historical budgets by category"]
["System Access is  largely new connections. The 2017 planned includes $147,000 for the Long Term Load Transfer Assets acquired. System Renewal - pole replacements are majority of this budget. In 2015 SLHI underwent an asset condition assessment which was not completed until April 2016. The budgeted figure does not represent the findings of the study since the budget is developed in Q4 of 2015 for 2016, therefore much more was spent on pole replacements than was budgeted for after the ACA was completed. System Service - see notes on year over year explanations."]
[]
["Notes on year over year Plan vs. Actual variances for Total Expenditures"]
["The 2016 planned vs. actual variance is mainly due to the increased number of pole replacements mentioned above."]
[]
["Notes on Plan vs. Actual variance trends for individual expenditure categories"]

{"sheet":"App.2-AC_Customer Engagement","index":7,"n_rows":26,"n_cols":3,"rows_kept":26,"cut":false,"hidden":false,"merged":[[9,0,9,2],[8,0,8,2]]}
[null,"File Number:",{"$f":"EBNUMBER","v":"EB-2017-0073"}]
[null,"Exhibit:",1]
[null,"Tab:"]
[null,"Schedule:"]
[null,"Page:"]
[]
[null,"Date:","2017-08-28"]
[]
["Appendix 2-AC"]
["Customer Engagement Activities Summary"]
[]
["Provide a list of customer engagement activities","Provide a list of customer needs and preferences identified through each engagement activity","Actions taken to respond to identified needs and preferences.  If no action was taken, explain why."]
["2014 Customer Satisfaction Survey","Overall Customer Satisfaction, Reliability, Conservation Programs Offered, Planned Outage Communication, Satisfaction with unplanned outages, Impact of Power Outages on Customers, Customer Expectations with respect to Unplanned outages, Customer needs with respect to Electric Vehicles, Renewable Generation, Energy Storage and Outage Management Systems","Customers indicated they were generally satisfied overall with SLHI. There was a very low level of interest with respect to customer needs (Electric Vehicles etc.) Therefore no action was taken."]
["2016 Customer Satisfaction Survey","Overall Customer Satisfaction, Power Quality and Reliability, Price, Billing Accuracy, Payment Options, Customer Service, Communications and Suggestions for Improvements","There were no identifed needs of the customer in this survey, except for Lower costs and less power outages. The DSP sets out SLHI's plan for continued system renewal in order to decrease the number of power outages due to equipment failure and aging infrastructure."]
["Facebook","As a communication tool mainly for unexpected power outages to provide customers with information on restoration times etc. It is also used to promote conservation programs and any other important industry related news.","No needs identified"]
["In Office Customer Service and Face-to-face interaction","Customers need local office for customer payments and inquiries including assistance and suppport for arrears management. ","Local office open five days a week accepting bill payments and handling inquiries face to face. "]
["Electrical Safety Awareness Survey","Good general knowledge of electrical hazards and safety","No concerns at this time. "]
["Leap Funds to Social Agency","Low-income customers need assistance to pay high heating costs.","SLHI, among other LDCs are mandated to contribute funds  to social agencys for the LEAP to support low-income customers in need of resources for paying bills in arrears. The distribution of these funds show this program is highly utillized and needed. "]
["E-Billing and Online Account Services","SLHI provides on-line access to consumption information for customer who sign up for e-billing","Customers find it useful to be able to see their hourly consumption patterns and when they use on, mid and off peak consumption in order to more effectively  manage their bill."]
["Website","Responds to the customers' need for information about the utility, programs offered and other regulatory information.","Important information is found on the SLHI website relating to contact information, scheduled power outage notices, rate information, information on our Online management tool, Programs available for financial assistance (OESP). SLHI Scorecard and Regulatory proceedings."]
["CDM Programs - RESA","SLHI was under-target in the last Conservation Framework, and identified a need for greater communication with customers","A regional energy services advisor was hired in order to provide customers with on-going information about conservation programs offered in our area, as well as assistance completing paper work for the programs."]
["Face to Face with large customers","Meeting with the hospital to discuss future plans for retrofits with respect to conservation.","There were no needs identified."]
["Annual Shareholder's Meeting","As a major customer with several large facilities along with the Street Lighting Account. The Annual Shareholder's Meeting allows SLHI to communicate issues and allows the Shareholder to voice concerns and ask questions on their needs and preferences. At the Shareholder's meeting in June 2017, SLHI made the Municipality aware that the Street Lighting rate class would be materially affected as a result of updated the Cost Allocation Study from 2013.","No needs identifed."]
["2018 Investment and Bill Impact Survey","Inform customers of planned capital expenditures, OM&A costs and bill impacts for the 2018 cost of service and ask if they are acceptable to our customers. Just over 50% of Customers indicated SLHI should decrease their capital investment and did not feel the proposed budget was reasonable. 47% indicated that the rate increase was unreasonable.","The increased costs were determined to be necessary in order to operate SLHI going forward. The majority of responses were received by residential customers, and in order to lessen the impact the revenue to cost ratios for the residential and general service classes were adjusted downward from what was initially proposed in the survey to decrease the impact.  SLHI has kept increases as low as possible in light of customers' concerns."]
[]
["Note:  Use \"ALT-ENTER\" to go to the next line within a cell"]

{"sheet":"App.2-B_Acctg Instructions","index":8,"n_rows":54,"n_cols":7,"rows_kept":54,"cut":false,"hidden":false,"merged":[[19,0,19,8],[20,0,20,8],[26,0,28,10],[30,0,30,9],[36,0,36,10],[37,0,37,11],[0,0,0,10],[1,0,1,10],[5,0,5,10],[8,4,8,5],[10,0,16,0],[18,0,18,9],[57,0,57,10],[57,11,57,18],[58,0,58,10],[58,11,58,18],[59,11,59,18],[60,0,60,10],[60,11,60,18],[42,1,42,12],[43,1,43,12],[46,1,46,11],[47,0,48,12],[53,0,53,12],[56,0,56,10],[56,11,56,18],[64,0,64,10],[64,11,64,18],[65,0,65,10],[65,11,65,18],[66,0,66,10],[66,11,66,18],[61,0,61,10],[61,11,61,18],[62,0,62,10],[62,11,62,18],[63,0,63,10],[63,11,63,18],[70,0,70,10],[70,11,70,18],[71,0,71,10],[71,11,71,18],[72,0,72,10],[72,11,72,18],[67,0,67,10],[67,11,67,18],[68,0,68,10],[68,11,68,18],[69,0,69,10],[69,11,69,18],[76,11,76,18],[77,0,77,10],[77,11,77,18],[78,0,78,10],[78,11,78,18],[79,0,79,10],[79,11,79,18],[73,0,73,10],[73,11,73,18],[74,0,74,10],[74,11,74,18],[75,0,75,10],[75,11,75,18],[83,0,83,10],[83,11,83,18],[84,0,84,10],[84,11,84,18],[85,0,85,10],[85,11,85,18],[80,0,80,10],[80,11,80,18],[81,0,81,10],[81,11,81,18],[82,0,82,10],[82,11,82,18],[89,0,89,10],[89,11,89,18],[90,0,90,10],[90,11,90,18],[91,0,91,10],[91,11,91,18],[86,0,86,10],[86,11,86,18],[87,0,87,10],[87,11,87,18],[88,0,88,10],[88,11,88,18],[95,0,95,10],[95,11,95,18],[96,0,96,10],[96,11,96,18],[97,0,97,10],[97,11,97,18],[92,0,92,10],[92,11,92,18],[93,0,93,10],[93,11,93,18],[94,0,94,10],[94,11,94,18],[101,0,101,10],[101,11,101,18],[102,0,102,10],[102,11,102,18],[103,0,103,10],[103,11,103,18],[98,0,98,10],[98,11,98,18],[99,0,99,10],[99,11,99,18],[100,0,100,10],[100,11,100,18],[107,0,107,10],[107,11,107,18],[108,0,108,10],[108,11,108,18],[109,0,109,10],[109,11,109,18],[104,0,104,10],[104,11,104,18],[105,0,105,10],[105,11,105,18],[106,0,106,10],[106,11,106,18]]}
["General Instructions to MIFRS Appendices"]
["Types of Schedules to File"]
[]
["The purpose of this tab is to provide general instructions.  The specific instructions to each appendix are listed in footnotes of each appendix."]
[]
["The typical applicant is expected to have made capitalization and depreciation policy changes under CGAAP as permitted by the Board on January 1, 2012 or mandated by the Board by January 1, 2013, and adopted IFRS for reporting purposes on January 1, 2015 (transition date January 1, 2014).  Some distributors filing for 2018 rates have rebased with these accounting changes reflected in a prior rebasing application.  If that is the case, information relating to pre-accounting policy changes is not generally required.  The information to be provided by applicants will depend on when the accounting policy changes were made and when they last rebased.  In general, applicants should provide the following information in the appendices: "]
[]
[]
[null,null,null,null,"Reflecting Accounting Policy Changes in Current Application",null,"Reflected Accounting Policy Changes in Prior Application3"]
[null,null,null,null,"Accounting Policy Changes in 2012 and Adopted IFRS in 2015","Accounting Policy Changes in 2013 and Adopted IFRS in 2015","Adopted IFRS in 2015"]
["Information to be filed in 2018 CoS Application",2018,"Test",null,"MIFRS","MIFRS","MIFRS"]
[null,2017,"Bridge",null,"MIFRS","MIFRS","MIFRS"]
[null,2016,"Historical",null,"MIFRS","MIFRS","MIFRS"]
[null,2015,"Historical",null,"MIFRS","MIFRS","MIFRS"]
[null,2014,"Historical",null," MIFRS and Revised CGAAP1"," MIFRS and Revised CGAAP1"," MIFRS and Revised CGAAP1"]
[null,2013,"Historical",null,"Revised CGAAP","CGAAP and Revised CGAAP2","N/A"]
[null,2012,"Historical",null,"CGAAP and Revised CGAAP2","N/A","N/A"]
[]
["1)  For the transition year (2014), the applicant may file two appendices, one under Revised CGAAP and one under MIFRS, depending on the materiality of impacts.  See the specific instructions under each appendix below for further details."]
["2) For applicants that are reflecting accounting policy changes for the first time in a rebasing application, the applicant must file two appendices in the year that the applicant implemented changes to its capitalization and depreciation policies (2012 or 2013), one before and one after the policy changes."]
["3) Applicants should provide CGAAP and Revised CGAAP schedules (i.e. as indicated in the first two columns of the above table) to support balances in Account 1576 if the account has yet to be disposed of."]
[]
[]
["Appendix 2-BA - Fixed Asset Schedule "]
[]
["Applicants are to provide Appendix 2-BA in accordance with the years and corresponding accounting standards noted in the above table to provide a year over year continuity in fixed assets."]
["For the transition year (2014), the applicant should file two appendices, one under Revised CGAAP and one under MIFRS if the change between Revised CGAAP and MIFRS is material.  If the change from the accounting standards is not material, the applicant may choose to only provide one appendix under MIFRS.  However, the applicant must also indicate the fixed asset net book value balance under Revised CGAAP, the total dollar value of the change and explain why it is not material."]
[]
[]
[]
["The applicant must establish the continuity of historic cost for gross assets and accumulated depreciation by asset class by ensuring that the opening balance in the year agrees to the closing balance in the prior year."]
[]
[]
["Appendix 2-Cx - Depreciation and Amortization "]
[]
["Applicants are to provide Appendix 2-C in accordance with the years and corresponding accounting standards listed in the above table.  "]
["Appendix 2-C is to be used under all three of the scenarios presented in the table above. In the appendix, the applicant will need to indicate which scenario applies. The appendix is to be duplicated for each year and accounting standard required under the scenario."]
["Depreciation accounting policy changes were mandated by the Board by January 1, 2013. In general, no further changes to an applicant's depreciation policy (i.e.  assets' service lives) are expected after the Board mandated changes by January 1, 2013.    If the applicant has made any changes to its depreciation policy subsequent to the Board mandated changes, for the year of the change, applicants must complete Appendix 2-C before and after the change. Applicants must also  explain the nature of the change, the reason for the change, quantify the impact of the change, and quantify the depreciation expense before and after the change."]
[]
["Appendix 2-E - Account 1575, IFRS-CGAAP Transitional PP&E Amounts (2-EA), Account 1576, Accounting Changes Under CGAAP (2-EB, 2-EC)"]
[]
["1) For an applicant that has a balance in Account 1576 to dispose:"]
["·       ","If an applicant changed capitalization and depreciation policies effective January 1, 2012, the applicant must complete Appendix 2-EB "]
["·       ","If an applicant changed capitalization and depreciation policies effective January 1, 2013, the applicant must complete Appendix 2-EC"]
[]
["2) For an applicant that has a balance in Account 1575 to dispose:"]
["·       ","The applicant must complete 2-EA"]
[" If the applicant did not make any further PP&E accounting policy changes beyond the capitalization and depreciation policy changes as mandated by the Board by January 1, 2013 (i.e. no further changes made on transition to IFRS), the applicant must indicate this and does not need to complete Appendix 2-EA."]
[]
[]
[]
["Appendix 2-Y - Summary of Impacts to Revenue Requirement from Transition to MIFRS"]
[]
["An applicant must provide a summary of the dollar impacts of MIFRS to each component of the revenue requirement (e.g. rate base, operating costs, etc.), including the overall impact on the proposed revenue requirement.  Accordingly,  the applicant must identify financial differences and resulting revenue requirement impacts arising from the adoption of  MIFRS as compared to CGAAP.  If the applicant is reflecting the changes in capitalization and depreciation policies for the first time in a rebasing application, then a comparison between MIFRS and CGAAP before the change in accounting policies should be completed.  If the applicant changed capitalization and depreciation policies and  reflected these changes in a prior rebasing application, then a comparison between MIFRS and CGAAP after the change in accounting policies should be completed.  "]

{"sheet":"App.2-BA_Fixed Asset Cont","index":9,"n_rows":439,"n_cols":13,"rows_kept":439,"cut":false,"hidden":false,"merged":[[442,1,443,12],[438,1,440,12],[429,1,430,12],[432,1,432,12],[8,0,8,12],[9,0,9,12],[14,3,14,6],[60,2,60,8],[61,2,61,8],[426,1,427,12],[73,3,73,6],[119,2,119,8],[120,2,120,8],[132,3,132,6],[178,2,178,8],[179,2,179,8],[192,3,192,6],[238,2,238,8],[239,2,239,8],[251,3,251,6],[297,2,297,8],[416,2,416,8],[417,2,417,8],[298,2,298,8],[311,3,311,6],[357,2,357,8],[358,2,358,8],[370,3,370,6]]}
[null,null,null,null,null,null,null,null,null,null,null,"File Number:",{"$f":"EBNUMBER","v":"EB-2017-0073"}]
[null,null,null,null,null,null,null,null,null,null,null,"Exhibit:",2]
[null,null,null,null,null,null,null,null,null,null,null,"Tab:"]
[null,null,null,null,null,null,null,null,null,null,null,"Schedule:"]
[null,null,null,null,null,null,null,null,null,null,null,"Page:"]
[]
[null,null,null,null,null,null,null,null,null,null,null,"Date:","2017-08-28"]
[]
["Appendix 2-BA"]
["Fixed Asset Continuity Schedule 1 "]
[]
[null,null,null,null,"Accounting Standard","CGAAP"]
[null,null,null,null,"Year ",2013]
[]
[null,null,null,"Cost",null,null,null,null,null,"Accumulated Depreciation"]
["CCA Class 2","OEB Account 3","Description 3","Opening Balance","Additions 4","Disposals 6","Closing Balance",null,"Opening Balance","Additions","Disposals 6","Closing Balance","Net Book Value"]
[12,1611,"Computer Software (Formally known as Account 1925)",79784.639999999999,null,null,{"$f":"D17+E17+F17","v":79784.639999999999},null,-44205.81,-15106.93,null,{"$f":"I17+J17+K17","v":-59312.74},{"$f":"G17+L17","v":20471.900000000001}]
["CEC",1612,"Land Rights (Formally known as Account 1906)",null,null,null,{"$f":"D18+E18+F18","v":0},null,null,null,null,{"$f":"I18+J18+K18","v":0},{"$f":"G18+L18","v":0}]
["N/A",1805,"Land",null,null,null,{"$f":"D19+E19+F19","v":0},null,null,null,null,{"$f":"I19+J19+K19","v":0},{"$f":"G19+L19","v":0}]
[47,1808,"Buildings",91864.15,null,null,{"$f":"D20+E20+F20","v":91864.15},null,-44696.31,-3674.56,null,{"$f":"I20+J20+K20","v":-48370.869999999995},{"$f":"G20+L20","v":43493.279999999999}]
[13,1810,"Leasehold Improvements",null,null,null,0,null,null,null,null,0,0]
[47,1815,"Transformer Station Equipment >50 kV",null,null,null,0,null,null,null,null,0,0]
[47,1820,"Distribution Station Equipment <50 kV",null,null,null,0,null,null,null,null,0,0]
[47,1825,"Storage Battery Equipment",null,null,null,0,null,null,null,null,0,0]
[47,1830,"Poles, Towers & Fixtures",3655776.24,127422.73,null,3783198.97,null,-1241689.93,-72737.61,null,-1314427.54,2468771.4300000002]
[47,1835,"Overhead Conductors & Devices",1088276.8899999999,6123.93,null,1094400.8199999998,null,-492762.28,-18049.22,null,-510811.5,583589.31999999983]
[47,1840,"Underground Conduit",178423.97,6296.95,null,184720.92,null,-70500.399999999994,-2863.2,null,-73363.599999999991,111357.32000000002]
[47,1845,"Underground Conductors & Devices",910424.32,28048.73,null,938473.04999999993,null,-322427.07,-20994.95,null,-343422.02,595051.02999999991]
[47,1850,"Line Transformers",1696557.12,50705.77,null,1747262.8900000001,null,-618303.37,-38037.17,null,-656340.54,1090922.3500000001]
[47,1855,"Services (Overhead & Underground)",null,null,null,0,null,null,null,null,0,0]
[47,1860,"Meters",167758.66,1569.21,null,169327.87,null,-25456.98,-12236.58,null,-37693.56,131634.31]
[47,1860,"Meters (Smart Meters)",647486.43000000005,2962.76,-536.03,649913.16,null,-147660.57999999999,-43264.52,160.82,-190764.27999999997,459148.88000000006]
["N/A",1905,"Land",null,null,null,0,null,null,null,null,0,0]
[47,1908,"Buildings & Fixtures",null,null,null,0,null,null,null,null,0,0]
[13,1910,"Leasehold Improvements",null,null,null,0,null,null,null,null,0,0]
[8,1915,"Office Furniture & Equipment (10 years)",21741.25,null,null,21741.25,null,-8175.84,-1850.58,null,-10026.42,11714.83]
[8,1915,"Office Furniture & Equipment (5 years)",null,null,null,0,null,null,null,null,0,0]
[10,1920,"Computer Equipment - Hardware",68885.259999999995,3155.45,-880,71160.709999999992,null,-41286.54,-9569.99,88,-50768.53,20392.179999999993]
[45,1920,"Computer Equip.-Hardware(Post Mar. 22/04)",null,null,null,0,null,null,null,null,0,0]
[45.1,1920,"Computer Equip.-Hardware(Post Mar. 19/07)",null,null,null,0,null,null,null,null,0,0]
[10,1930,"Transportation Equipment(8 years)",382970.8,null,null,382970.8,null,-321540.65999999997,-12981.89,null,-334522.55,48448.25]
[10,1930,"Transportation Equipment(5 years)",90317.119999999995,null,null,90317.119999999995,null,-78363.69,-6236.59,null,-84600.28,5716.8399999999965]
[8,1940,"Tools, Shop & Garage Equipment",84767.65,1356.74,null,86124.39,null,-58692.2,-7854.41,null,-66546.61,19577.78]
[8,1945,"Measurement & Testing Equipment",12693.24,6144.75,null,18837.989999999998,null,-10561.21,-1250.67,null,-11811.88,7026.1099999999988]
[8,1950,"Power Operated Equipment(8 years)",37613.379999999997,85090,null,122703.38,null,-20307.13,-13561.25,null,-33868.380000000005,88835]
[8,1950,"Power Operated Equipment(5 years)",98907.97,null,null,98907.97,null,-96657.17,-987.05,null,-97644.22,1263.75]
[8,1955,"Communication Equipment ",38568.68,null,null,38568.68,null,-31948.82,-1627.48,null,-33576.300000000003,4992.3799999999974]
[8,1960,"Miscellaneous Equipment ",null,null,null,0,null,null,null,null,0,0]
[47,1970,"Load Management Controls Customer Premises",null,null,null,0,null,null,null,null,0,0]
[47,1975,"Load Management Controls Utility Premises",null,null,null,0,null,null,null,null,0,0]
[47,1980,"System Supervisor Equipment",null,null,null,0,null,null,null,null,0,0]
[47,1985,"Miscellaneous Fixed Assets",29441.15,1067.26,null,30508.41,null,-22198.45,-1419.8,null,-23618.25,6890.16]
[47,1990,"Other Tangible Property",null,null,null,0,null,null,null,null,0,0]
[47,1995,"Contributions & Grants",-975244.14,-62891.12,null,-1038135.26,null,231762.49,30851.48,null,262613.96999999997,-775521.29]
[47,2440,"Deferred Revenue5"]
[null,null,null,null,null,null,0,null,null,null,null,0,0]
[null,null,"Sub-Total",{"$f":"SUM(D17:D56)","v":8407014.7800000012},{"$f":"SUM(E17:E56)","v":257053.16000000003},{"$f":"SUM(F17:F56)","v":-1416.03},{"$f":"SUM(G17:G56)","v":8662651.910000002},null,{"$f":"SUM(I17:I56)","v":-3465671.95},{"$f":"SUM(J17:J56)","v":-253452.96999999988},{"$f":"SUM(K17:K56)","v":248.82},{"$f":"SUM(L17:L56)","v":-3718876.0999999987},{"$f":"SUM(M17:M56)","v":4943775.8099999996}]
[null,null,"Less Socialized Renewable Energy Generation Investments (input as negative)",null,null,null,{"$f":"D58+E58+F58","v":0},null,null,null,null,{"$f":"I58+J58+K58","v":0},{"$f":"G58+L58","v":0}]
[null,null,"Less Other Non Rate-Regulated Utility Assets (input as negative)",-29441.15,-1067.26,null,-30508.41,null,22198.45,1419.8,null,{"$f":"I59+J59+K59","v":23618.25},-6890.16]
[null,null,"Total PP&E",{"$f":"SUM(D57:D59)","v":8377573.6300000008},{"$f":"SUM(E57:E59)","v":255985.90000000002},{"$f":"SUM(F57:F59)","v":-1416.03},{"$f":"SUM(G57:G59)","v":8632143.5000000019},null,{"$f":"SUM(I57:I59)","v":-3443473.5},{"$f":"SUM(J57:J59)","v":-252033.1699999999},{"$f":"SUM(K57:K59)","v":248.82},{"$f":"SUM(L57:L59)","v":-3695257.8499999987},{"$f":"SUM(M57:M59)","v":4936885.6499999994}]
[null,null,"Depreciation Expense adj. from gain or loss on the retirement of assets (pool of like assets), if applicable6"]
[null,null,"Total",null,null,null,null,null,null,{"$f":"J60+J61","v":-252033.1699999999}]
[]
[null,null,null,null,null,null,null,null,"Less: Fully Allocated Depreciation"]
[null,"2013 COS Decision EB_2012-0165",null,null,null,null,null,null,"OEB 1576",null,-24296]
[10,null,"Transportation",null,null,null,null,null,"Transportation",null,{"$f":"SUM(J41:J42)","v":-19218.48}]
[8,null,"Tools and Equipment",null,null,null,null,null,"Tools",null,{"$f":"SUM(J43,J44,J45,J46,J47)","v":-25280.86}]
[null,null,null,null,null,null,null,null,"Net Depreciation",null,{"$f":"J62-K65-K66-K67","v":-183237.8299999999}]
[]
[]
[null,null,null,null,"Accounting Standard","CGAAP"]
[null,null,null,null,"Year ",2014]
[]
[null,null,null,"Cost",null,null,null,null,null,"Accumulated Depreciation"]
["CCA Class 2","OEB Account 3","Description 3","Opening Balance","Additions 4","Disposals 6","Closing Balance",null,"Opening Balance","Additions","Disposals 6","Closing Balance","Net Book Value"]
[12,1611,"Computer Software (Formally known as Account 1925)",{"$f":"G17","v":79784.639999999999},40850,null,{"$f":"D76+E76+F76","v":120634.64},null,{"$f":"L17","v":-59312.74},-16310.26,null,{"$f":"I76+J76+K76","v":-75623},{"$f":"G76+L76","v":45011.64}]
["CEC",1612,"Land Rights (Formally known as Account 1906)",0,null,null,{"$f":"D77+E77+F77","v":0},null,0,null,null,{"$f":"I77+J77+K77","v":0},{"$f":"G77+L77","v":0}]
["N/A",1805,"Land",0,null,null,{"$f":"D78+E78+F78","v":0},null,0,null,null,{"$f":"I78+J78+K78","v":0},{"$f":"G78+L78","v":0}]
[47,1808,"Buildings",91864.15,null,null,{"$f":"D79+E79+F79","v":91864.15},null,-48370.869999999995,-3674.56,null,{"$f":"I79+J79+K79","v":-52045.429999999993},{"$f":"G79+L79","v":39818.720000000001}]
[13,1810,"Leasehold Improvements",0,null,null,0,null,0,null,null,0,0]
[47,1815,"Transformer Station Equipment >50 kV",0,null,null,0,null,0,null,null,0,0]
[47,1820,"Distribution Station Equipment <50 kV",0,null,null,0,null,0,null,null,0,0]
[47,1825,"Storage Battery Equipment",0,null,null,0,null,0,null,null,0,0]
[47,1830,"Poles, Towers & Fixtures",3783198.97,174466.81,null,3957665.7800000003,null,-1314427.54,-76091.94,null,-1390519.48,2567146.3000000003]
[47,1835,"Overhead Conductors & Devices",1094400.8199999998,5330.07,null,1099730.8899999999,null,-510811.5,-18235.7,null,-529047.19999999995,570683.68999999994]
[47,1840,"Underground Conduit",184720.92,905.4,null,185626.32,null,-73363.599999999991,-2935.23,null,-76298.829999999987,109327.49000000002]
[47,1845,"Underground Conductors & Devices",938473.04999999993,13197.21,null,951670.25999999989,null,-343422.02,-21510.53,null,-364932.55000000005,586737.70999999985]
[47,1850,"Line Transformers",1747262.8900000001,54575.69,null,1801838.58,null,-656340.54,-39353.19,null,-695693.73,1106144.8500000001]
[47,1855,"Services (Overhead & Underground)",0,null,null,0,null,0,null,null,0,0]
[47,1860,"Meters",169327.87,5221.32,null,174549.19,null,-37693.56,-12372.4,null,-50065.96,124483.23000000001]
[47,1860,"Meters (Smart Meters)",649913.16,12125.32,-15905.24,646133.24,null,-190764.27999999997,-43731.72,5211.84,-229284.15999999997,416849.08]
["N/A",1905,"Land",0,null,null,0,null,0,null,null,0,0]
[47,1908,"Buildings & Fixtures",0,null,null,0,null,0,null,null,0,0]
[13,1910,"Leasehold Improvements",0,null,null,0,null,0,null,null,0,0]
[8,1915,"Office Furniture & Equipment (10 years)",21741.25,277.99,-475.15,21544.09,null,-10026.42,-1766.47,320.73,-11472.16,10071.93]
[8,1915,"Office Furniture & Equipment (5 years)",0,null,null,0,null,0,null,null,0,0]
[10,1920,"Computer Equipment - Hardware",71160.709999999992,1000,null,72160.709999999992,null,-50768.53,-4789.2,null,-55557.729999999996,16602.979999999996]
[45,1920,"Computer Equip.-Hardware(Post Mar. 22/04)",0,null,null,0,null,0,null,null,0,0]
[45.1,1920,"Computer Equip.-Hardware(Post Mar. 19/07)",0,null,null,0,null,0,null,null,0,0]
[10,1930,"Transportation Equipment(8 years)",382970.8,null,null,382970.8,null,-334522.55,-12981.89,null,-347504.44,35466.359999999986]
[10,1930,"Transportation Equipment(5 years)",90317.119999999995,54538.75,-34497.199999999997,110358.67,null,-84600.28,-11170.72,34497.199999999997,-61273.8,49084.869999999995]
[8,1940,"Tools, Shop & Garage Equipment",86124.39,3504.33,null,89628.72,null,-66546.61,-7659.28,null,-74205.89,15422.830000000002]
[8,1945,"Measurement & Testing Equipment",18837.989999999998,null,null,18837.989999999998,null,-11811.88,-1354.26,null,-13166.14,5671.8499999999985]
[8,1950,"Power Operated Equipment(8 years)",122703.38,null,null,122703.38,null,-33868.380000000005,-13561.25,null,-47429.630000000005,75273.75]
[8,1950,"Power Operated Equipment(5 years)",98907.97,null,null,98907.97,null,-97644.22,-916.78,null,-98561,346.97000000000116]
[8,1955,"Communication Equipment ",38568.68,4441.46,null,43010.14,null,-33576.300000000003,-1819.28,null,-35395.58,7614.5599999999977]
[8,1960,"Miscellaneous Equipment ",0,null,null,0,null,0,null,null,0,0]
[47,1970,"Load Management Controls Customer Premises",0,null,null,0,null,0,null,null,0,0]
[47,1975,"Load Management Controls Utility Premises",0,null,null,0,null,0,null,null,0,0]
[47,1980,"System Supervisor Equipment",0,null,null,0,null,0,null,null,0,0]
[47,1985,"Miscellaneous Fixed Assets",30508.41,178.42,null,30686.829999999998,null,-23618.25,-1313.73,null,-24931.98,5754.8499999999985]
[47,1990,"Other Tangible Property",0,null,null,0,null,0,null,null,0,0]
[47,1995,"Contributions & Grants",-1038135.26,-43493.51,null,-1081628.77,null,262613.96999999997,32190.05,null,294804.01999999996,-786824.75]
[47,2440,"Deferred Revenue5",0,null,null,0,null,0,null,null,0,0]
[null,null,null,0,null,null,{"$f":"D115+E115+F115","v":0},null,0,null,null,{"$f":"I115+J115+K115","v":0},{"$f":"G115+L115","v":0}]
[null,null,"Sub-Total",{"$f":"SUM(D76:D115)","v":8662651.910000002},{"$f":"SUM(E76:E115)","v":327119.26},{"$f":"SUM(F76:F115)","v":-50877.59},{"$f":"SUM(G76:G115)","v":8938893.5800000057},null,{"$f":"SUM(I76:I115)","v":-3718876.0999999987},{"$f":"SUM(J76:J115)","v":-259358.34000000008},{"$f":"SUM(K76:K115)","v":40029.769999999997},{"$f":"SUM(L76:L115)","v":-3938204.6700000004},{"$f":"SUM(M76:M115)","v":5000688.91}]
[null,null,"Less Socialized Renewable Energy Generation Investments (input as negative)",null,null,null,{"$f":"D117+E117+F117","v":0},null,null,null,null,{"$f":"I117+J117+K117","v":0},{"$f":"G117+L117","v":0}]
[null,null,"Less Other Non Rate-Regulated Utility Assets (input as negative)",{"$f":"G59","v":-30508.41},-178.42,null,{"$f":"D118+E118+F118","v":-30686.829999999998},null,{"$f":"L59","v":23618.25},1313.73,null,{"$f":"I118+J118+K118","v":24931.98},{"$f":"G118+L118","v":-5754.8499999999985}]
[null,null,"Total PP&E",{"$f":"SUM(D116:D118)","v":8632143.5000000019},{"$f":"SUM(E116:E118)","v":326940.84000000003},{"$f":"SUM(F116:F118)","v":-50877.59},{"$f":"SUM(G116:G118)","v":8908206.7500000056},null,{"$f":"SUM(I116:I118)","v":-3695257.8499999987},{"$f":"SUM(J116:J118)","v":-258044.61000000007},{"$f":"SUM(K116:K118)","v":40029.769999999997},{"$f":"SUM(L116:L118)","v":-3913272.6900000004},{"$f":"SUM(M116:M118)","v":4994934.0600000005}]
[null,null,"Depreciation Expense adj. from gain or loss on the retirement of assets (pool of like assets), if applicable6"]
[null,null,"Total",null,null,null,null,null,null,{"$f":"J119+J120","v":-258044.61000000007}]
[]
[null,null,null,null,null,null,null,null,"Less: Fully Allocated Depreciation"]
[null,"2013 COS Decision EB_2012-0165",null,null,null,null,null,null,"OEB 1576",null,-24296]
[10,null,"Transportation",null,null,null,null,null,"Transportation",null,{"$f":"SUM(J100:J101)","v":-24152.61}]
[8,null,"Tools and Equipment",null,null,null,null,null,"Tools and Equipment",null,{"$f":"SUM(J102:J106)","v":-25310.85}]
[null,null,null,null,null,null,null,null,"Net Depreciation",null,{"$f":"J121-K124-K125-K126","v":-184285.15000000005}]
[]
[]
[null,null,null,null,"Accounting Standard","MIFRS"]
[null,null,null,null,"Year ",2014]
[]
[null,null,null,"Cost",null,null,null,null,null,"Accumulated Depreciation"]
["CCA Class 2","OEB Account 3","Description 3","Opening Balance","Additions 4","Disposals 6","Closing Balance",null,"Opening Balance","Additions","Disposals 6","Closing Balance","Net Book Value"]
[12,1611,"Computer Software (Formally known as Account 1925)",{"$f":"G17","v":79784.639999999999},40850,null,{"$f":"D135+E135+F135","v":120634.64},null,{"$f":"L17","v":-59312.74},-16310.26,null,{"$f":"I135+J135+K135","v":-75623},{"$f":"G135+L135","v":45011.64}]
["CEC",1612,"Land Rights (Formally known as Account 1906)",0,null,null,{"$f":"D136+E136+F136","v":0},null,0,null,null,0,0]
["N/A",1805,"Land",0,null,null,{"$f":"D137+E137+F137","v":0},null,0,null,null,0,0]
[47,1808,"Buildings",91864.15,null,null,{"$f":"D138+E138+F138","v":91864.15},null,-48370.869999999995,-3674.56,null,-52045.429999999993,39818.720000000001]
[13,1810,"Leasehold Improvements",0,null,null,0,null,0,null,null,0,0]
[47,1815,"Transformer Station Equipment >50 kV",0,null,null,0,null,0,null,null,0,0]
[47,1820,"Distribution Station Equipment <50 kV",0,null,null,0,null,0,null,null,0,0]
[47,1825,"Storage Battery Equipment",0,null,null,0,null,0,null,null,0,0]
[47,1830,"Poles, Towers & Fixtures",3783198.97,174466.81,-53473,3904192.7800000003,null,-1314427.54,-75122,36566,-1352983.54,2551209.2400000002]
[47,1835,"Overhead Conductors & Devices",1094400.8199999998,5330.07,null,1099730.8899999999,null,-510811.5,-18180.12,null,-528991.62,570739.2699999999]
[47,1840,"Underground Conduit",184720.92,905.4,null,185626.32,null,-73363.599999999991,-2938,null,-76301.599999999991,109324.72000000002]
[47,1845,"Underground Conductors & Devices",938473.04999999993,13197.21,null,951670.25999999989,null,-343422.02,-21535,null,-364957.02,586713.23999999987]
[47,1850,"Line Transformers",1747262.8900000001,54575.69,-38945,1762893.58,null,-656340.54,-37959,18027,-676272.54,1086621.04]
[47,1855,"Services (Overhead & Underground)",0,null,null,0,null,0,null,null,0,0]
[47,1860,"Meters",169327.87,5221.32,null,174549.19,null,-37693.56,-12372.4,null,-50065.96,124483.23000000001]
[47,1860,"Meters (Smart Meters)",649913.16,12125.32,-15905.24,646133.24,null,-190764.27999999997,-43731.72,5211.84,-229284.15999999997,416849.08]
["N/A",1905,"Land",0,null,null,0,null,0,null,null,0,0]
[47,1908,"Buildings & Fixtures",0,null,null,0,null,0,null,null,0,0]
[13,1910,"Leasehold Improvements",0,null,null,0,null,0,null,null,0,0]
[8,1915,"Office Furniture & Equipment (10 years)",21741.25,277.99,-475.15,21544.09,null,-10026.42,-1766.47,320.73,-11472.16,10071.93]
[8,1915,"Office Furniture & Equipment (5 years)",0,null,null,0,null,0,null,null,0,0]
[10,1920,"Computer Equipment - Hardware",71160.709999999992,1000,null,72160.709999999992,null,-50768.53,-4789.2,null,-55557.729999999996,16602.979999999996]
[45,1920,"Computer Equip.-Hardware(Post Mar. 22/04)",0,null,null,0,null,0,null,null,0,0]
[45.1,1920,"Computer Equip.-Hardware(Post Mar. 19/07)",0,null,null,0,null,0,null,null,0,0]
[10,1930,"Transportation Equipment(8 years)",382970.8,null,null,382970.8,null,-334522.55,-12981.89,null,-347504.44,35466.359999999986]
[10,1930,"Transportation Equipment(5 years)",90317.119999999995,54538.75,-34497.199999999997,110358.67,null,-84600.28,-11170.72,34497.199999999997,-61273.8,49084.869999999995]
[8,1940,"Tools, Shop & Garage Equipment",86124.39,3504.33,null,89628.72,null,-66546.61,-7659.28,null,-74205.89,15422.830000000002]
[8,1945,"Measurement & Testing Equipment",18837.989999999998,null,null,18837.989999999998,null,-11811.88,-1354.26,null,-13166.14,5671.8499999999985]
[8,1950,"Power Operated Equipment(8 years)",122703.38,null,null,122703.38,null,-33868.380000000005,-13561.25,null,-47429.630000000005,75273.75]
[8,1950,"Power Operated Equipment(5 years)",98907.97,null,null,98907.97,null,-97644.22,-916.78,null,-98561,346.97000000000116]
[8,1955,"Communication Equipment ",38568.68,4441.46,null,43010.14,null,-33576.300000000003,-1819.28,null,-35395.58,7614.5599999999977]
[8,1960,"Miscellaneous Equipment ",0,null,null,0,null,0,null,null,0,0]
[47,1970,"Load Management Controls Customer Premises",0,null,null,0,null,0,null,null,0,0]
[47,1975,"Load Management Controls Utility Premises",0,null,null,0,null,0,null,null,0,0]
[47,1980,"System Supervisor Equipment",0,null,null,0,null,0,null,null,0,0]
[47,1985,"Miscellaneous Fixed Assets",30508.41,178.42,null,30686.829999999998,null,-23618.25,-1313.73,null,-24931.98,5754.8499999999985]
[47,1990,"Other Tangible Property",0,null,null,0,null,0,null,null,0,0]
[47,1995,"Contributions & Grants",-1038135.26,null,null,-1038135.26,null,262613.96999999997,30897.49,null,293511.45999999996,-744623.8]
[47,2440,"Deferred Revenue5",0,-43493.51,null,-43493.51,null,0,1292.55,null,1292.55,-42200.959999999999]
[null,null,null,null,null,null,{"$f":"D174+E174+F174","v":0},null,0,null,null,{"$f":"I174+J174+K174","v":0}]
[null,null,"Sub-Total",{"$f":"SUM(D135:D174)","v":8662651.910000002},{"$f":"SUM(E135:E174)","v":327119.26},{"$f":"SUM(F135:F174)","v":-143295.59},{"$f":"SUM(G135:G174)","v":8846475.5800000057},null,{"$f":"SUM(I135:I174)","v":-3718876.0999999987},{"$f":"SUM(J135:J174)","v":-256965.88000000006},{"$f":"SUM(K135:K174)","v":94622.76999999999},{"$f":"SUM(L135:L174)","v":-3881219.2100000004},{"$f":"SUM(M135:M174)","v":4965256.37}]
[null,null,"Less Socialized Renewable Energy Generation Investments (input as negative)",null,null,null,{"$f":"D176+E176+F176","v":0},null,null,null,null,{"$f":"I176+J176+K176","v":0},{"$f":"G176+L176","v":0}]
[null,null,"Less Other Non Rate-Regulated Utility Assets (input as negative)",{"$f":"G59","v":-30508.41},-178.42,null,{"$f":"D177+E177+F177","v":-30686.829999999998},null,{"$f":"L59","v":23618.25},1313.73,null,{"$f":"I177+J177+K177","v":24931.98},{"$f":"G177+L177","v":-5754.8499999999985}]
[null,null,"Total PP&E",{"$f":"SUM(D175:D177)","v":8632143.5000000019},{"$f":"SUM(E175:E177)","v":326940.84000000003},{"$f":"SUM(F175:F177)","v":-143295.59},{"$f":"SUM(G175:G177)","v":8815788.7500000056},null,{"$f":"SUM(I175:I177)","v":-3695257.8499999987},{"$f":"SUM(J175:J177)","v":-255652.15000000005},{"$f":"SUM(K175:K177)","v":94622.76999999999},{"$f":"SUM(L175:L177)","v":-3856287.2300000004},{"$f":"SUM(M175:M177)","v":4959501.5200000005}]
[null,null,"Depreciation Expense adj. from gain or loss on the retirement of assets (pool of like assets), if applicable6"]
[null,null,"Total",null,null,null,null,null,null,{"$f":"J178+J179","v":-255652.15000000005}]
[]
[null,null,null,null,null,null,null,null,"Less: Fully Allocated Depreciation"]
[null,null,null,null,null,null,null,null,"Deferred Revenue",null,{"$f":"J173","v":1292.55}]
[null,"2013 COS Decision EB_2012-0165",null,null,null,null,null,null,"OEB 1576",null,-24296]
[10,null,"Transportation",null,null,null,null,null,"Transportation",null,{"$f":"SUM(J159:J160)","v":-24152.61}]
[8,null,"Tools and Equipment",null,null,null,null,null,"Tools and Equipment",null,{"$f":"SUM(J161:J165)","v":-25310.85}]
[null,null,null,null,null,null,null,null,"Net Depreciation",null,{"$f":"J180-K183-K184-K185-K186","v":-183185.24000000002}]
[]
[]
[null,null,null,null,"Accounting Standard","MIFRS"]
[null,null,null,null,"Year ",2015]
[]
[null,null,null,"Cost",null,null,null,null,null,"Accumulated Depreciation"]
["CCA Class 2","OEB Account 3","Description 3","Opening Balance","Additions 4","Disposals 6","Closing Balance",null,"Opening Balance","Additions","Disposals 6","Closing Balance","Net Book Value"]
[12,1611,"Computer Software (Formally known as Account 1925)",{"$f":"G135","v":120634.64},1163,null,{"$f":"D195+E195+F195","v":121797.64},null,{"$f":"L135","v":-75623},-13846.26,null,{"$f":"I195+J195+K195","v":-89469.26},{"$f":"G195+L195","v":32328.380000000005}]
["CEC",1612,"Land Rights (Formally known as Account 1906)",0,null,null,{"$f":"D196+E196+F196","v":0},null,0,null,null,0,0]
["N/A",1805,"Land",0,null,null,{"$f":"D197+E197+F197","v":0},null,0,null,null,0,0]
[47,1808,"Buildings",91864.15,null,null,{"$f":"D198+E198+F198","v":91864.15},null,-52045.429999999993,-3674.56,null,-55719.989999999991,36144.160000000003]
[13,1810,"Leasehold Improvements",0,null,null,0,null,0,null,null,0,0]
[47,1815,"Transformer Station Equipment >50 kV",0,null,null,0,null,0,null,null,0,0]
[47,1820,"Distribution Station Equipment <50 kV",0,null,null,0,null,0,null,null,0,0]
[47,1825,"Storage Battery Equipment",0,null,null,0,null,0,null,null,0,0]
[47,1830,"Poles, Towers & Fixtures",3904192.7800000003,170006.31,-15438.46,4058760.6300000004,null,-1352983.54,-79315.62,8740.27,-1423558.8900000001,2635201.7400000002]
[47,1835,"Overhead Conductors & Devices",1099730.8899999999,26651.11,-10418.58,1115963.42,null,-528991.62,-18509.21,9562.89,-537937.93999999994,578025.48]
[47,1840,"Underground Conduit",185626.32,1730.03,null,187356.35,null,-76301.599999999991,-2964.08,null,-79265.679999999993,108090.67000000001]
[47,1845,"Underground Conductors & Devices",951670.25999999989,24992.91,null,976663.16999999993,null,-364957.02,-22008.41,null,-386965.43,589697.74]
[47,1850,"Line Transformers",1762893.58,40013.040000000001,-4174.46,1798732.1600000001,null,-676272.54,-39781.160000000003,2393.61,-713660.09000000008,1085072.07]
[47,1855,"Services (Overhead & Underground)",0,null,null,0,null,0,null,null,0,0]
[47,1860,"Meters",174549.19,4025.4,null,178574.59,null,-50065.96,-12557.33,null,-62623.29,115951.29999999999]
[47,1860,"Meters (Smart Meters)",646133.24,null,-3457.33,642675.91,null,-229284.15999999997,-43075.55,1415.7,-270944.00999999995,371731.90000000008]
["N/A",1905,"Land",0,null,null,0,null,0,null,null,0,0]
[47,1908,"Buildings & Fixtures",0,null,null,0,null,0,null,null,0,0]
[13,1910,"Leasehold Improvements",0,null,null,0,null,0,null,null,0,0]
[8,1915,"Office Furniture & Equipment (10 years)",21544.09,2317.9,null,23861.99,null,-11472.16,-1784.91,null,-13257.07,10604.920000000002]
[8,1915,"Office Furniture & Equipment (5 years)",0,null,null,0,null,0,null,null,0,0]
[10,1920,"Computer Equipment - Hardware",72160.709999999992,1830,null,73990.709999999992,null,-55557.729999999996,-5101.17,null,-60658.899999999994,13331.809999999998]
[45,1920,"Computer Equip.-Hardware(Post Mar. 22/04)",0,null,null,0,null,0,null,null,0,0]
[45.1,1920,"Computer Equip.-Hardware(Post Mar. 19/07)",0,null,null,0,null,0,null,null,0,0]
[10,1930,"Transportation Equipment(8 years)",382970.8,null,null,382970.8,null,-347504.44,-12981.89,null,-360486.33,22484.469999999972]
[10,1930,"Transportation Equipment(5 years)",110358.67,null,null,110358.67,null,-61273.8,-10907.75,null,-72181.55,38177.119999999995]
[8,1940,"Tools, Shop & Garage Equipment",89628.72,1004.95,null,90633.67,null,-74205.89,-7395.85,null,-81601.740000000005,9031.929999999993]
[8,1945,"Measurement & Testing Equipment",18837.989999999998,null,null,18837.989999999998,null,-13166.14,-946.75,null,-14112.89,4725.0999999999985]
[8,1950,"Power Operated Equipment(8 years)",122703.38,null,null,122703.38,null,-47429.630000000005,-13561.25,null,-60990.880000000005,61712.5]
[8,1950,"Power Operated Equipment(5 years)",98907.97,14234,null,113141.97,null,-98561,-381.22,null,-98942.22,14199.75]
[8,1955,"Communication Equipment ",43010.14,11122.47,null,54132.61,null,-35395.58,-2431.98,null,-37827.560000000005,16305.049999999996]
[8,1960,"Miscellaneous Equipment ",0,null,null,0,null,0,null,null,0,0]
[47,1970,"Load Management Controls Customer Premises",0,null,null,0,null,0,null,null,0,0]
[47,1975,"Load Management Controls Utility Premises",0,null,null,0,null,0,null,null,0,0]
[47,1980,"System Supervisor Equipment",0,null,null,0,null,0,null,null,0,0]
[47,1985,"Miscellaneous Fixed Assets",30686.829999999998,1523.16,null,32209.989999999998,null,-24931.98,-1263.1500000000001,null,-26195.13,6014.8599999999969]
[47,1990,"Other Tangible Property",0,null,null,0,null,0,null,null,0,0]
[47,1995,"Contributions & Grants",-1038135.26,null,null,-1038135.26,null,293511.45999999996,30758,null,324269.45999999996,-713865.8]
[47,2440,"Deferred Revenue5",-43493.51,-40513.19,null,-84006.700000000012,null,1292.55,2496.52,null,3789.0699999999997,-80217.63]
[null,null,null,0,null,null,{"$f":"D234+E234+F234","v":0},null,null,null,null,{"$f":"I234+J234+K234","v":0},{"$f":"G234+L234","v":0}]
[null,null,"Sub-Total",{"$f":"SUM(D195:D234)","v":8846475.5800000057},{"$f":"SUM(E195:E234)","v":260101.08999999997},{"$f":"SUM(F195:F234)","v":-33488.83},{"$f":"SUM(G195:G234)","v":9073087.8400000036},null,{"$f":"SUM(I195:I234)","v":-3881219.2100000004},{"$f":"SUM(J195:J234)","v":-259233.58},{"$f":"SUM(K195:K234)","v":22112.47},{"$f":"SUM(L195:L234)","v":-4118340.3199999989},{"$f":"SUM(M195:M234)","v":4954747.5199999996}]
[null,null,"Less Socialized Renewable Energy Generation Investments (input as negative)",null,null,null,{"$f":"D236+E236+F236","v":0},null,null,null,null,{"$f":"I236+J236+K236","v":0},{"$f":"G236+L236","v":0}]
[null,null,"Less Other Non Rate-Regulated Utility Assets (input as negative)",{"$f":"G177","v":-30686.829999999998},-1523.16,null,{"$f":"D237+E237+F237","v":-32209.989999999998},null,{"$f":"L177","v":24931.98},1263.1500000000001,null,{"$f":"I237+J237+K237","v":26195.13},{"$f":"G237+L237","v":-6014.8599999999969}]
[null,null,"Total PP&E",{"$f":"SUM(D235:D237)","v":8815788.7500000056},{"$f":"SUM(E235:E237)","v":258577.92999999996},{"$f":"SUM(F235:F237)","v":-33488.83},{"$f":"SUM(G235:G237)","v":9040877.8500000034},null,{"$f":"SUM(I235:I237)","v":-3856287.2300000004},{"$f":"SUM(J235:J237)","v":-257970.43},{"$f":"SUM(K235:K237)","v":22112.47},{"$f":"SUM(L235:L237)","v":-4092145.189999999},{"$f":"SUM(M235:M237)","v":4948732.6599999992}]
[null,null,"Depreciation Expense adj. from gain or loss on the retirement of assets (pool of like assets), if applicable6"]
[null,null,"Total",null,null,null,null,null,null,{"$f":"J238+J239","v":-257970.43}]
[]
[null,null,null,null,null,null,null,null,"Less: Fully Allocated Depreciation"]
[null,null,null,null,null,null,null,null,"Deferred Revenue",null,{"$f":"J233","v":2496.52}]
[null,"2013 COS Decision EB_2012-0165",null,null,null,null,null,null,"OEB 1576",null,-24296]
[10,null,"Transportation",null,null,null,null,null,"Transportation",null,{"$f":"SUM(J219:J220)","v":-23889.64}]
[8,null,"Tools and Equipment",null,null,null,null,null,"Tools and Equipment",null,{"$f":"SUM(J221:J225)","v":-24717.05}]
[null,null,null,null,null,null,null,null,"Net Depreciation",null,{"$f":"J240-K243-K244-K245-K246","v":-187564.26}]
[]
[null,null,null,null,"Accounting Standard","MIFRS"]
[null,null,null,null,"Year ",2016]
[]
[null,null,null,"Cost",null,null,null,null,null,"Accumulated Depreciation"]
["CCA Class 2","OEB Account 3","Description 3","Opening Balance","Additions 4","Disposals 6","Closing Balance",null,"Opening Balance","Additions","Disposals 6","Closing Balance","Net Book Value"]
[12,1611,"Computer Software (Formally known as Account 1925)",{"$f":"G195","v":121797.64},null,null,{"$f":"D254+E254+F254","v":121797.64},null,{"$f":"L195","v":-89469.26},-12527.6,null,{"$f":"I254+J254+K254","v":-101996.86},{"$f":"G254+L254","v":19800.78}]
["CEC",1612,"Land Rights (Formally known as Account 1906)",0,null,null,{"$f":"D255+E255+F255","v":0},null,0,null,null,0,0]
["N/A",1805,"Land",0,null,null,{"$f":"D256+E256+F256","v":0},null,0,null,null,0,0]
[47,1808,"Buildings",91864.15,null,null,{"$f":"D257+E257+F257","v":91864.15},null,-55719.989999999991,-3674.56,null,-59394.549999999988,32469.600000000006]
[13,1810,"Leasehold Improvements",0,null,null,0,null,0,null,null,0,0]
[47,1815,"Transformer Station Equipment >50 kV",0,null,null,0,null,0,null,null,0,0]
[47,1820,"Distribution Station Equipment <50 kV",0,null,null,0,null,0,null,null,0,0]
[47,1825,"Storage Battery Equipment",0,null,null,0,null,0,null,null,0,0]
[47,1830,"Poles, Towers & Fixtures",4058760.6300000004,204058.9,-18058.310000000001,4244761.2200000007,null,-1423558.8900000001,-83342.75,12895.85,-1494005.79,2750755.4300000006]
[47,1835,"Overhead Conductors & Devices",1115963.42,28065.54,-3435.72,1140593.24,null,-537937.93999999994,-19109.490000000002,3003.1,-554044.32999999996,586548.91]
[47,1840,"Underground Conduit",187356.35,5827.43,null,193183.78,null,-79265.679999999993,-3040,null,-82305.679999999993,110878.1]
[47,1845,"Underground Conductors & Devices",976663.16999999993,46334.51,null,1022997.6799999999,null,-386965.43,-22908.02,null,-409873.45,613124.23]
[47,1850,"Line Transformers",1798732.1600000001,20392.310000000001,null,1819124.4700000002,null,-713660.09000000008,-40549.050000000003,null,-754209.14000000013,1064915.33]
[47,1855,"Services (Overhead & Underground)",0,null,null,0,null,0,null,null,0,0]
[47,1860,"Meters",178574.59,799.15,null,179373.74,null,-62623.29,-12653.83,null,-75277.119999999995,104096.62]
[47,1860,"Meters (Smart Meters)",642675.91,4330.08,-3382.63,643623.36,null,-270944.00999999995,-42989.39,1602.82,-312330.57999999996,331292.78000000003]
["N/A",1905,"Land",0,null,null,0,null,0,null,null,0,0]
[47,1908,"Buildings & Fixtures",0,null,null,0,null,0,null,null,0,0]
[13,1910,"Leasehold Improvements",0,null,null,0,null,0,null,null,0,0]
[8,1915,"Office Furniture & Equipment (10 years)",23861.99,298.95,-652.69000000000005,23508.250000000004,null,-13257.07,-1915.73,652.59,-14520.21,8988.0400000000045]
[8,1915,"Office Furniture & Equipment (5 years)",0,null,null,0,null,0,null,null,0,0]
[10,1920,"Computer Equipment - Hardware",73990.709999999992,null,null,73990.709999999992,null,-60658.899999999994,-5069.7299999999996,null,-65728.62999999999,8262.0800000000017]
[45,1920,"Computer Equip.-Hardware(Post Mar. 22/04)",0,null,null,0,null,0,null,null,0,0]
[45.1,1920,"Computer Equip.-Hardware(Post Mar. 19/07)",0,null,null,0,null,0,null,null,0,0]
[10,1930,"Transportation Equipment(8 years)",382970.8,null,null,382970.8,null,-360486.33,-5140.92,null,-365627.25,17343.549999999988]
[10,1930,"Transportation Equipment(5 years)",110358.67,null,-24637,85721.67,null,-72181.55,-10907.75,24637,-58452.3,27269.369999999995]
[8,1940,"Tools, Shop & Garage Equipment",90633.67,3944.75,null,94578.42,null,-81601.740000000005,-7466.34,null,-89068.08,5510.3399999999965]
[8,1945,"Measurement & Testing Equipment",18837.989999999998,15389.3,null,34227.289999999994,null,-14112.89,-1342.97,null,-15455.859999999999,18771.429999999993]
[8,1950,"Power Operated Equipment(8 years)",122703.38,null,null,122703.38,null,-60990.880000000005,-13561.25,null,-74552.13,48151.25]
[8,1950,"Power Operated Equipment(5 years)",113141.97,779,null,113920.97,null,-98942.22,-3107.64,null,-102049.86,11871.11]
[8,1955,"Communication Equipment ",54132.61,599,null,54731.61,null,-37827.560000000005,-2839.03,null,-40666.590000000004,14065.019999999997]
[8,1960,"Miscellaneous Equipment ",0,null,null,0,null,0,null,null,0,0]
[47,1970,"Load Management Controls Customer Premises",0,null,null,0,null,0,null,null,0,0]
[47,1975,"Load Management Controls Utility Premises",0,null,null,0,null,0,null,null,0,0]
[47,1980,"System Supervisor Equipment",0,null,null,0,null,0,null,null,0,0]
[47,1985,"Miscellaneous Fixed Assets",32209.989999999998,0,null,32209.989999999998,null,-26195.13,-1240.45,null,-27435.58,4774.4099999999962]
[47,1990,"Other Tangible Property",0,null,null,0,null,0,null,null,0,0]
[47,1995,"Contributions & Grants",-1038135.26,null,null,-1038135.26,null,324269.45999999996,31626.400000000001,null,355895.86,-682239.4]
[47,2440,"Deferred Revenue5",-84006.700000000012,-29695.84,null,-113702.54000000001,null,3789.0699999999997,2477.2600000000002,null,6266.33,-107436.21]
[null,null,null,null,null,null,{"$f":"D293+E293+F293","v":0},null,null,null,null,{"$f":"I293+J293+K293","v":0},{"$f":"G293+L293","v":0}]
[null,null,"Sub-Total",{"$f":"SUM(D254:D293)","v":9073087.8400000036},{"$f":"SUM(E254:E293)","v":301123.08},{"$f":"SUM(F254:F293)","v":-50166.350000000006},{"$f":"SUM(G254:G293)","v":9324044.570000004},null,{"$f":"SUM(I254:I293)","v":-4118340.3199999989},{"$f":"SUM(J254:J293)","v":-259282.84000000011},{"$f":"SUM(K254:K293)","v":42791.360000000001},{"$f":"SUM(L254:L293)","v":-4334831.8},{"$f":"SUM(M254:M293)","v":4989212.7700000005}]
[null,null,"Less Socialized Renewable Energy Generation Investments (input as negative)",null,null,null,{"$f":"D295+E295+F295","v":0},null,null,null,null,{"$f":"I295+J295+K295","v":0},{"$f":"G295+L295","v":0}]
[null,null,"Less Other Non Rate-Regulated Utility Assets (input as negative)",{"$f":"G237","v":-32209.989999999998},null,null,{"$f":"D296+E296+F296","v":-32209.989999999998},null,{"$f":"L237","v":26195.13},1240.45,null,{"$f":"I296+J296+K296","v":27435.58},{"$f":"G296+L296","v":-4774.4099999999962}]
[null,null,"Total PP&E",{"$f":"SUM(D294:D296)","v":9040877.8500000034},{"$f":"SUM(E294:E296)","v":301123.08},{"$f":"SUM(F294:F296)","v":-50166.350000000006},{"$f":"SUM(G294:G296)","v":9291834.5800000038},null,{"$f":"SUM(I294:I296)","v":-4092145.189999999},{"$f":"SUM(J294:J296)","v":-258042.3900000001},{"$f":"SUM(K294:K296)","v":42791.360000000001},{"$f":"SUM(L294:L296)","v":-4307396.22},{"$f":"SUM(M294:M296)","v":4984438.3600000003}]
[null,null,"Depreciation Expense adj. from gain or loss on the retirement of assets (pool of like assets), if applicable6"]
[null,null,"Total",null,null,null,null,null,null,{"$f":"J297+J298","v":-258042.3900000001}]
[]
[null,null,null,null,null,null,null,null,"Less: Fully Allocated Depreciation"]
[null,null,null,null,null,null,null,null,"Deferred Revenue",null,{"$f":"J292","v":2477.2600000000002}]
[null,"2013 COS Decision EB_2012-0165",null,null,null,null,null,null,"OEB 1576",null,-24296]
[10,null,"Transportation",null,null,null,null,null,"Transportation",null,{"$f":"SUM(J278:J279)","v":-16048.67}]
[8,null,"Tools and Equipment",null,null,null,null,null,"Tools and Equipment",null,{"$f":"SUM(J280:J284)","v":-28317.229999999996}]
[null,null,null,null,null,null,null,null,"Net Depreciation",null,{"$f":"J299-K302-K303-K304-K305","v":-191857.75000000012}]
[]
[]
[null,null,null,null,"Accounting Standard","MIFRS"]
[null,null,null,null,"Year ",2017]
[]
[null,null,null,"Cost",null,null,null,null,null,"Accumulated Depreciation"]
["CCA Class 2","OEB Account 3","Description 3","Opening Balance","Additions 4","Disposals 6","Closing Balance",null,"Opening Balance","Additions","Disposals 6","Closing Balance","Net Book Value"]
[12,1611,"Computer Software (Formally known as Account 1925)",{"$f":"G254","v":121797.64},45000,null,{"$f":"D314+E314+F314","v":166797.64000000001},null,{"$f":"L254","v":-101996.86},-8403,null,{"$f":"I314+J314+K314","v":-110399.86},{"$f":"G314+L314","v":56397.780000000013}]
["CEC",1612,"Land Rights (Formally known as Account 1906)",0,null,null,{"$f":"D315+E315+F315","v":0},null,0,null,null,0,0]
["N/A",1805,"Land",0,null,null,{"$f":"D316+E316+F316","v":0},null,0,null,null,0,0]
[47,1808,"Buildings",91864.15,null,null,{"$f":"D317+E317+F317","v":91864.15},null,-59394.549999999988,-3675,null,-63069.549999999988,28794.600000000006]
[13,1810,"Leasehold Improvements",0,null,null,0,null,0,null,null,0,0]
[47,1815,"Transformer Station Equipment >50 kV",0,null,null,0,null,0,null,null,0,0]
[47,1820,"Distribution Station Equipment <50 kV",0,null,null,0,null,0,null,null,0,0]
[47,1825,"Storage Battery Equipment",0,null,null,0,null,0,null,null,0,0]
[47,1830,"Poles, Towers & Fixtures",4244761.2200000007,177309,-17079,4404991.2200000007,null,-1494005.79,-87458,12048,-1569415.79,2835575.4300000006]
[47,1835,"Overhead Conductors & Devices",1140593.24,116126,-3185,1253534.24,null,-554044.32999999996,-20705,2778,-571971.32999999996,681562.91]
[47,1840,"Underground Conduit",193183.78,2800,null,195983.78,null,-82305.679999999993,-3187,null,-85492.68,110491.1]
[47,1845,"Underground Conductors & Devices",1022997.6799999999,49012,null,1072009.68,null,-409873.45,-24115,null,-433988.45,638021.23]
[47,1850,"Line Transformers",1819124.4700000002,143477,null,1962601.4700000002,null,-754209.14000000013,-42604,null,-796813.14000000013,1165788.33]
[47,1855,"Services (Overhead & Underground)",0,null,null,0,null,0,null,null,0,0]
[47,1860,"Meters",179373.74,918,null,180291.74,null,-75277.119999999995,-12688,null,-87965.119999999995,92326.62]
[47,1860,"Meters (Smart Meters)",643623.36,16712,null,660335.35999999999,null,-312330.57999999996,-43465,null,-355795.57999999996,304539.78000000003]
["N/A",1905,"Land",0,null,null,0,null,0,null,null,0,0]
[47,1908,"Buildings & Fixtures",0,null,null,0,null,0,null,null,0,0]
[13,1910,"Leasehold Improvements",0,null,null,0,null,0,null,null,0,0]
[8,1915,"Office Furniture & Equipment (10 years)",23508.250000000004,2000,null,25508.250000000004,null,-14520.21,-1921,null,-16441.21,9067.0400000000045]
[8,1915,"Office Furniture & Equipment (5 years)",0,null,null,0,null,0,null,null,0,0]
[10,1920,"Computer Equipment - Hardware",73990.709999999992,2000,null,75990.709999999992,null,-65728.62999999999,-4958,null,-70686.62999999999,5304.0800000000017]
[45,1920,"Computer Equip.-Hardware(Post Mar. 22/04)",0,null,null,0,null,0,null,null,0,0]
[45.1,1920,"Computer Equip.-Hardware(Post Mar. 19/07)",0,null,null,0,null,0,null,null,0,0]
[10,1930,"Transportation Equipment(8 years)",382970.8,null,null,382970.8,null,-365627.25,-4428,null,-370055.25,12915.549999999988]
[10,1930,"Transportation Equipment(5 years)",85721.67,35000,null,120721.67,null,-58452.3,-14408,null,-72860.3,47861.369999999995]
[8,1940,"Tools, Shop & Garage Equipment",94578.42,5000,null,99578.42,null,-89068.08,-2703.87,null,-91771.95,7806.4700000000012]
[8,1945,"Measurement & Testing Equipment",34227.289999999994,null,null,34227.289999999994,null,-15455.859999999999,-2153,null,-17608.86,16618.429999999993]
[8,1950,"Power Operated Equipment(8 years)",122703.38,null,null,122703.38,null,-74552.13,-13561.25,null,-88113.38,34590]
[8,1950,"Power Operated Equipment(5 years)",113920.97,null,null,113920.97,null,-102049.86,-3062.59,null,-105112.45,8808.5200000000041]
[8,1955,"Communication Equipment ",54731.61,null,null,54731.61,null,-40666.590000000004,-2082,null,-42748.590000000004,11983.019999999997]
[8,1960,"Miscellaneous Equipment ",0,null,null,0,null,0,null,null,0,0]
[47,1970,"Load Management Controls Customer Premises",0,null,null,0,null,0,null,null,0,0]
[47,1975,"Load Management Controls Utility Premises",0,null,null,0,null,0,null,null,0,0]
[47,1980,"System Supervisor Equipment",0,null,null,0,null,0,null,null,0,0]
[47,1985,"Miscellaneous Fixed Assets",32209.989999999998,300,null,32509.989999999998,null,-27435.58,-1033,null,-28468.58,4041.4099999999962]
[47,1990,"Other Tangible Property",0,null,null,0,null,0,null,null,0,0]
[47,1995,"Contributions & Grants",-1038135.26,null,null,-1038135.26,null,355895.86,31626,null,387521.86,-650613.4]
[47,2440,"Deferred Revenue5",-113702.54000000001,-170000,null,-283702.54000000004,null,6266.33,4955,null,11221.33,-272481.21000000002]
[null,null,null,0,null,null,{"$f":"D353+E353+F353","v":0},null,null,null,null,{"$f":"I353+J353+K353","v":0},{"$f":"G353+L353","v":0}]
[null,null,"Sub-Total",{"$f":"SUM(D314:D353)","v":9324044.570000004},{"$f":"SUM(E314:E353)","v":425654},{"$f":"SUM(F314:F353)","v":-20264},{"$f":"SUM(G314:G353)","v":9729434.570000004},null,{"$f":"SUM(I314:I353)","v":-4334831.8},{"$f":"SUM(J314:J353)","v":-260029.71000000002},{"$f":"SUM(K314:K353)","v":14826},{"$f":"SUM(L314:L353)","v":-4580035.51},{"$f":"SUM(M314:M353)","v":5149399.0599999996}]
[null,null,"Less Socialized Renewable Energy Generation Investments (input as negative)",null,null,null,{"$f":"D355+E355+F355","v":0},null,null,null,null,{"$f":"I355+J355+K355","v":0},{"$f":"G355+L355","v":0}]
[null,null,"Less Other Non Rate-Regulated Utility Assets (input as negative)",{"$f":"G296","v":-32209.989999999998},-300,null,{"$f":"D356+E356+F356","v":-32509.989999999998},null,{"$f":"L296","v":27435.58},1033,null,{"$f":"I356+J356+K356","v":28468.58},{"$f":"G356+L356","v":-4041.4099999999962}]
[null,null,"Total PP&E",{"$f":"SUM(D354:D356)","v":9291834.5800000038},{"$f":"SUM(E354:E356)","v":425354},{"$f":"SUM(F354:F356)","v":-20264},{"$f":"SUM(G354:G356)","v":9696924.5800000038},null,{"$f":"SUM(I354:I356)","v":-4307396.22},{"$f":"SUM(J354:J356)","v":-258996.71000000002},{"$f":"SUM(K354:K356)","v":14826},{"$f":"SUM(L354:L356)","v":-4551566.93},{"$f":"SUM(M354:M356)","v":5145357.6499999994}]
[null,null,"Depreciation Expense adj. from gain or loss on the retirement of assets (pool of like assets), if applicable6"]
[null,null,"Total",null,null,null,null,null,null,{"$f":"J357+J358","v":-258996.71000000002}]
[]
[null,null,null,null,null,null,null,null,"Less: Fully Allocated Depreciation"]
[null,null,null,null,null,null,null,null,"Deferred Revenue",null,{"$f":"J352","v":4955}]
[10,null,"Transportation",null,null,null,null,null,"Transportation",null,{"$f":"SUM(J338:J339)","v":-18836}]
[8,null,"Tools and Equipment",null,null,null,null,null,"Tools and Equipment",null,{"$f":"SUM(J340:J344)","v":-23562.71}]
[null,null,null,null,null,null,null,null,"Net Depreciation",null,{"$f":"J359-K362-K363-K364","v":-221553.00000000003}]
[]
[]
[null,null,null,null,"Accounting Standard","MIFRS"]
[null,null,null,null,"Year ",2018]
[]
[null,null,null,"Cost",null,null,null,null,null,"Accumulated Depreciation"]
["CCA Class 2","OEB Account 3","Description 3","Opening Balance","Additions 4","Disposals 6","Closing Balance",null,"Opening Balance","Additions","Disposals 6","Closing Balance","Net Book Value"]
[12,1611,"Computer Software (Formally known as Account 1925)",{"$f":"G314","v":166797.64000000001},null,null,{"$f":"D373+E373+F373","v":166797.64000000001},null,{"$f":"L314","v":-110399.86},-12903,null,{"$f":"I373+J373+K373","v":-123302.86},{"$f":"G373+L373","v":43494.780000000013}]
["CEC",1612,"Land Rights (Formally known as Account 1906)",{"$f":"G315","v":0},null,null,{"$f":"D374+E374+F374","v":0},null,{"$f":"L315","v":0},null,null,0,0]
["N/A",1805,"Land",0,null,null,{"$f":"D375+E375+F375","v":0},null,0,null,null,0,0]
[47,1808,"Buildings",91864.15,null,null,{"$f":"D376+E376+F376","v":91864.15},null,-63069.549999999988,-3675,null,-66744.549999999988,25119.600000000006]
[13,1810,"Leasehold Improvements",0,null,null,0,null,0,null,null,0,0]
[47,1815,"Transformer Station Equipment >50 kV",0,null,null,0,null,0,null,null,0,0]
[47,1820,"Distribution Station Equipment <50 kV",0,null,null,0,null,0,null,null,0,0]
[47,1825,"Storage Battery Equipment",0,null,null,0,null,0,null,null,0,0]
[47,1830,"Poles, Towers & Fixtures",4404991.2200000007,173504,-16256,4562239.2200000007,null,-1569415.79,-91299,13400,-1647314.79,2914924.4300000006]
[47,1835,"Overhead Conductors & Devices",1253534.24,3200,-3185,1253549.24,null,-571971.32999999996,-22046,2792,-591225.32999999996,662323.91]
[47,1840,"Underground Conduit",195983.78,1200,null,197183.78,null,-85492.68,-3168,null,-88660.68,108523.1]
[47,1845,"Underground Conductors & Devices",1072009.68,35000,null,1107009.68,null,-433988.45,-25181,null,-459169.45,647840.23]
[47,1850,"Line Transformers",1962601.4700000002,41425,null,2004026.4700000002,null,-796813.14000000013,-44961,null,-841774.14000000013,1162252.33]
[47,1855,"Services (Overhead & Underground)",0,null,null,0,null,0,null,null,0,0]
[47,1860,"Meters",180291.74,null,null,180291.74,null,-87965.119999999995,-12707,null,-100672.12,79619.62]
[47,1860,"Meters (Smart Meters)",660335.35999999999,null,null,660335.35999999999,null,-355795.57999999996,-43797,null,-399592.57999999996,260742.78000000003]
["N/A",1905,"Land",0,null,null,0,null,0,null,null,0,0]
[47,1908,"Buildings & Fixtures",0,null,null,0,null,0,null,null,0,0]
[13,1910,"Leasehold Improvements",0,null,null,0,null,0,null,null,0,0]
[8,1915,"Office Furniture & Equipment (10 years)",25508.250000000004,2000,null,27508.250000000004,null,-16441.21,-2031,null,-18472.21,9036.0400000000045]
[8,1915,"Office Furniture & Equipment (5 years)",0,null,null,0,null,0,null,null,0,0]
[10,1920,"Computer Equipment - Hardware",75990.709999999992,2000,null,77990.709999999992,null,-70686.62999999999,-4700,null,-75386.62999999999,2604.0800000000017]
[45,1920,"Computer Equip.-Hardware(Post Mar. 22/04)",0,null,null,0,null,0,null,null,0,0]
[45.1,1920,"Computer Equip.-Hardware(Post Mar. 19/07)",0,null,null,0,null,0,null,null,0,0]
[10,1930,"Transportation Equipment(8 years)",382970.8,355000,-276065,461905.80000000005,null,-370055.25,-22187.5,263150,-129092.75,332813.05000000005]
[10,1930,"Transportation Equipment(5 years)",120721.67,null,null,120721.67,null,-72860.3,-17908,null,-90768.3,29953.369999999995]
[8,1940,"Tools, Shop & Garage Equipment",99578.42,5000,null,104578.42,null,-91771.95,-2894.92,null,-94666.87,9911.5500000000029]
[8,1945,"Measurement & Testing Equipment",34227.289999999994,null,null,34227.289999999994,null,-17608.86,-2153,null,-19761.86,14465.429999999993]
[8,1950,"Power Operated Equipment(8 years)",122703.38,null,null,122703.38,null,-88113.38,-13317.5,null,-101430.88,21272.5]
[8,1950,"Power Operated Equipment(5 years)",113920.97,null,null,113920.97,null,-105112.45,-3002.6,null,-108115.05,5805.9199999999983]
[8,1955,"Communication Equipment ",54731.61,null,null,54731.61,null,-42748.590000000004,-1955,null,-44703.590000000004,10028.019999999997]
[8,1960,"Miscellaneous Equipment ",0,null,null,0,null,0,null,null,0,0]
[47,1970,"Load Management Controls Customer Premises",0,null,null,0,null,0,null,null,0,0]
[47,1975,"Load Management Controls Utility Premises",0,null,null,0,null,0,null,null,0,0]
[47,1980,"System Supervisor Equipment",0,null,null,0,null,0,null,null,0,0]
[47,1985,"Miscellaneous Fixed Assets",32509.989999999998,null,null,32509.989999999998,null,-28468.58,-893,null,-29361.58,3148.4099999999962]
[47,1990,"Other Tangible Property",0,null,null,0,null,0,null,null,0,0]
[47,1995,"Contributions & Grants",-1038135.26,null,null,-1038135.26,null,387521.86,31626,null,419147.86,-618987.4]
[47,2440,"Deferred Revenue5",-283702.54000000004,-30000,null,-313702.54000000004,null,11221.33,7468,null,18689.330000000002,-295013.21000000002]
[null,null,null,0,null,null,{"$f":"D412+E412+F412","v":0},null,0,null,null,{"$f":"I412+J412+K412","v":0},{"$f":"G412+L412","v":0}]
[null,null,"Sub-Total",{"$f":"SUM(D373:D412)","v":9729434.570000004},{"$f":"SUM(E373:E412)","v":588329},{"$f":"SUM(F373:F412)","v":-295506},{"$f":"SUM(G373:G412)","v":10022257.570000004},null,{"$f":"SUM(I373:I412)","v":-4580035.51},{"$f":"SUM(J373:J412)","v":-291685.51999999996},{"$f":"SUM(K373:K412)","v":279342},{"$f":"SUM(L373:L412)","v":-4592379.0299999993},{"$f":"SUM(M373:M412)","v":5429878.54}]
[null,null,"Less Socialized Renewable Energy Generation Investments (input as negative)",null,null,null,{"$f":"D414+E414+F414","v":0},null,null,null,null,{"$f":"I414+J414+K414","v":0},{"$f":"G414+L414","v":0}]
[null,null,"Less Other Non Rate-Regulated Utility Assets (input as negative)",{"$f":"G356","v":-32509.989999999998},null,null,{"$f":"D415+E415+F415","v":-32509.989999999998},null,{"$f":"L356","v":28468.58},893,null,{"$f":"I415+J415+K415","v":29361.58},{"$f":"G415+L415","v":-3148.4099999999962}]
[null,null,"Total PP&E",{"$f":"SUM(D413:D415)","v":9696924.5800000038},{"$f":"SUM(E413:E415)","v":588329},{"$f":"SUM(F413:F415)","v":-295506},{"$f":"SUM(G413:G415)","v":9989747.5800000038},null,{"$f":"SUM(I413:I415)","v":-4551566.93},{"$f":"SUM(J413:J415)","v":-290792.51999999996},{"$f":"SUM(K413:K415)","v":279342},{"$f":"SUM(L413:L415)","v":-4563017.4499999993},{"$f":"SUM(M413:M415)","v":5426730.1299999999}]
[null,null,"Depreciation Expense adj. from gain or loss on the retirement of assets (pool of like assets), if applicable6"]
[null,null,"Total",null,null,null,null,null,null,{"$f":"J416+J417","v":-290792.51999999996}]
[]
[null,null,null,null,null,null,null,null,"Less: Fully Allocated Depreciation"]
[null,null,null,null,null,null,null,null,"Deferred Revenue",null,{"$f":"J411","v":7468}]
[10,null,"Transportation",null,null,null,null,null,"Transportation",null,{"$f":"SUM(J397:J398)","v":-40095.5}]
[8,null,"Tools and Equipment",null,null,null,null,null,"Tools and Equipment",null,{"$f":"SUM(J399:J403)","v":-23323.019999999997}]
[null,null,null,null,null,null,null,null,"Net Depreciation",null,{"$f":"J418-K421-K422-K423","v":-234841.99999999997}]
["Notes:"]
[]
[1,"Tables in the format outlined above covering all fixed asset accounts should be submitted for the Test Year, Bridge Year and all relevant historical years.  At a minimum , the applicant must provide data for the earlier of: 1) all historical years back to its last rebasing; or 2) at least three years of historical actuals, in addition to Bridge Year and Test Year forecasts."]
[]
[]
[2,"The \"CCA Class\" for fixed assets should agree with the CCA Class used for tax purposes in Tax Returns. Fixed Assets sub-components may be used where the underlying asset components are classified under multiple CCA Classes for tax purposes. If an applicant uses any different classes from those shown in the table, an explanation should be provided. (also see note 3)."]
[]
[]
[3,"The table may need to be customized for a utility's asset categories or for any new asset accounts announced or authorized by the Board."]
[]
[4,"The additions in column (E) must not include construction work in progress (CWIP)."]
[]
[5,"Effective on the date of IFRS adoption, customer contributions will no longer be recorded in Account 1995 Contributions & Grants, but will be recorded in Account 2440, Deferred Revenues.  "]
[]
[6,"The applicant must ensure that all asset disposals have been clearly identified in the Chapter 2 Appendices for all historic, bridge and test years.  Where a distributor for general financial reporting purposes under IFRS has accounted for the amount of gain or loss on the retirement of assets in a pool of like assets as a charge or credit to income, for reporting and rate application filings, the distributor shall reclassify such gains and losses as depreciation expense, and disclose the amount separately."]

{"sheet":"Appendix 2-BB Service Life  ","index":10,"n_rows":107,"n_cols":17,"rows_kept":107,"cut":false,"hidden":false,"merged":[[100,2,100,4],[100,6,100,7],[103,0,103,7],[97,2,97,4],[97,6,97,7],[98,2,98,4],[98,6,98,7],[99,2,99,4],[99,6,99,7],[94,2,94,4],[94,6,94,7],[95,2,95,4],[95,6,95,7],[96,2,96,4],[96,6,96,7],[92,1,93,1],[92,2,93,2],[92,3,92,4],[92,6,92,7],[93,3,93,4],[93,6,93,7],[88,1,91,1],[88,2,91,2],[88,3,88,4],[88,6,88,7],[89,3,89,4],[89,6,89,7],[90,3,90,4],[90,6,90,7],[91,3,91,4],[91,6,91,7],[86,1,87,1],[86,2,87,2],[86,3,86,4],[86,6,86,7],[87,3,87,4],[87,6,87,7],[82,1,85,1],[82,2,85,2],[82,3,82,4],[82,6,82,7],[83,3,83,4],[83,6,83,7],[84,3,84,4],[84,6,84,7],[85,3,85,4],[85,6,85,7],[80,2,80,4],[80,6,80,7],[81,2,81,4],[81,5,81,7],[74,13,74,14],[74,15,74,16],[75,2,75,4],[76,2,76,4],[76,6,76,7],[74,10,75,10],[74,11,74,12],[77,6,77,7],[78,3,78,4],[72,0,72,7],[74,2,74,4],[74,5,75,7],[74,9,75,9],[78,6,78,7],[79,3,79,4],[79,6,79,7],[69,2,69,4],[60,2,60,4],[61,2,61,4],[62,1,63,1],[62,2,63,2],[62,3,62,4],[63,3,63,4],[77,1,79,1],[77,2,79,2],[77,3,77,4],[59,2,59,4],[49,2,49,4],[50,0,68,0],[50,2,50,4],[51,2,51,4],[52,2,52,4],[53,2,53,4],[54,2,54,4],[55,2,55,4],[64,2,64,4],[65,2,65,4],[66,2,66,4],[67,2,67,4],[68,2,68,4],[33,0,49,0],[33,1,35,1],[33,2,35,2],[33,3,33,4],[34,3,34,4],[43,2,43,4],[44,2,44,4],[45,2,45,4],[46,2,46,4],[47,2,47,4],[48,2,48,4],[56,2,56,4],[57,1,58,1],[57,2,58,2],[57,3,57,4],[58,3,58,4],[38,1,40,1],[38,2,40,2],[38,3,38,4],[39,3,39,4],[40,3,40,4],[41,1,42,1],[41,3,41,4],[42,3,42,4],[19,1,21,1],[19,2,21,2],[19,3,19,4],[20,3,21,3],[22,1,24,1],[22,2,24,2],[22,3,22,4],[23,3,24,3],[32,2,32,4],[16,2,18,2],[16,3,16,4],[17,3,18,3],[25,2,25,4],[26,2,26,4],[27,2,27,4],[28,2,28,4],[29,2,29,4],[30,2,30,4],[106,1,106,2],[0,15,0,16],[1,15,1,16],[2,15,2,16],[3,15,3,16],[4,15,4,16],[6,15,6,16],[14,11,14,12],[14,13,14,14],[31,2,31,4],[14,2,14,4],[14,5,14,7],[14,9,15,9],[14,10,15,10],[8,0,8,16],[9,0,9,16],[10,0,10,16],[14,15,14,16],[15,2,15,4],[35,3,35,4],[36,2,36,4],[37,2,37,4],[16,0,32,0],[16,1,18,1]]}
[null,null,null,null,null,null,null,null,null,null,null,null,null,"File Number:",null,{"$f":"'LDC Info'!E16","v":"EB-2017-0073"}]
[null,null,null,null,null,null,null,null,null,null,null,null,null,"Exhibit:",null,4]
[null,null,null,null,null,null,null,null,null,null,null,null,null,"Tab:"]
[null,null,null,null,null,null,null,null,null,null,null,null,null,"Schedule:"]
[null,null,null,null,null,null,null,null,null,null,null,null,null,"Page:"]
[]
[null,null,null,null,null,null,null,null,null,null,null,null,null,"Date:",null,"2017-08-28"]
[]
["Appendix 2-BB"]
["Service Life Comparison"]
["Table F-1 from Kinetrics Report1"]
[]
[]
[]
[null,null,"Asset Details",null,null,"Useful Life",null,null,null,"USoA Account Number","USoA Account Description","Current",null,"Proposed",null,"Outside Range of Min, Max TUL?"]
["Parent*","#","Category| Component | Type",null,null,"MIN UL","TUL","MAX UL",null,null,null,"Years","Rate","Years","Rate","Below Min TUL","Above Max TUL"]
["OH",1,"Fully Dressed Wood Poles","Overall",null,35,45,75,null,1830,"Poles, Towers and Fixtures",45,{"$f":"IF(ISERROR(1/L17), \"\", 1/L17)","v":2.2222222222222223E-2},45,{"$f":"IF(ISERROR(1/N17), \"\", 1/N17)","v":2.2222222222222223E-2},{"$f":"IF(ISBLANK(N17),\"\",IF(N17<F17,\"Yes\",\"No\"))","v":"No"},{"$f":"IF(ISBLANK(N17),\"\",IF(N17>H17,\"Yes\",\"No\"))","v":"No"}]
[null,null,null,"Cross Arm","Wood",20,40,55,null,null,null,null,{"$f":"IF(ISERROR(1/L18), \"\", 1/L18)","v":""},null,{"$f":"IF(ISERROR(1/N18), \"\", 1/N18)","v":""},{"$f":"IF(ISBLANK(N18),\"\",IF(N18<F18,\"Yes\",\"No\"))","v":""},{"$f":"IF(ISBLANK(N18),\"\",IF(N18>H18,\"Yes\",\"No\"))","v":""}]
[null,null,null,null,"Steel",30,70,95,null,null,null,null,"",null,"","",""]
[null,2,"Fully Dressed Concrete Poles","Overall",null,50,60,80,null,null,null,null,"",null,"","",""]
[null,null,null,"Cross Arm","Wood",20,40,55,null,null,null,null,"",null,"","",""]
[null,null,null,null,"Steel",30,70,95,null,null,null,null,"",null,"","",""]
[null,3,"Fully Dressed Steel Poles","Overall",null,60,60,80,null,null,null,null,"",null,"","",""]
[null,null,null,"Cross Arm","Wood",20,40,55,null,null,null,null,"",null,"","",""]
[null,null,null,null,"Steel",30,70,95,null,null,null,null,"",null,"","",""]
[null,4,"OH Line Switch",null,null,30,45,55,null,null,null,null,"",null,"","",""]
[null,5,"OH Line Switch Motor",null,null,15,25,25,null,null,null,null,"",null,"","",""]
[null,6,"OH Line Switch RTU",null,null,15,20,20,null,null,null,null,"",null,"","",""]
[null,7,"OH Integral Switches",null,null,35,45,60,null,null,null,null,"",null,"","",""]
[null,8,"OH Conductors",null,null,50,60,75,null,1835,"Overhead Conductors & Devices",45,2.2222222222222223E-2,45,2.2222222222222223E-2,"Yes","No"]
[null,9,"OH Transformers & Voltage Regulators",null,null,30,40,60,null,1850,"Line Transformers",40,2.5000000000000001E-2,40,2.5000000000000001E-2,"No","No"]
[null,10,"OH Shunt Capacitor Banks",null,null,25,30,40,null,null,null,null,"",null,"","",""]
[null,11,"Reclosers",null,null,25,40,55,null,null,null,null,"",null,"","",""]
["TS & MS",12,"Power Transformers","Overall",null,30,45,60,null,null,null,null,"",null,"","",""]
[null,null,null,"Bushing",null,10,20,30,null,null,null,null,"",null,"","",""]
[null,null,null,"Tap Changer",null,20,30,60,null,null,null,null,"",null,"","",""]
[null,13,"Station Service Transformer",null,null,30,45,55,null,null,null,null,"",null,"","",""]
[null,14,"Station Grounding Transformer",null,null,30,40,40,null,null,null,null,"",null,"","",""]
[null,15,"Station DC System","Overall",null,10,20,30,null,null,null,null,"",null,"","",""]
[null,null,null,"Battery Bank",null,10,15,15,null,null,null,null,"",null,"","",""]
[null,null,null,"Charger",null,20,20,30,null,null,null,null,"",null,"","",""]
[null,16,"Station Metal Clad Switchgear","Overall",null,30,40,60,null,null,null,null,"",null,"","",""]
[null,null,null,"Removable Breaker",null,25,40,60,null,null,null,null,"",null,"","",""]
[null,17,"Station Independent Breakers",null,null,35,45,65,null,null,null,null,"",null,"","",""]
[null,18,"Station Switch",null,null,30,50,60,null,null,null,null,"",null,"","",""]
[null,19,"Electromechanical Relays",null,null,25,35,50,null,null,null,null,"",null,"","",""]
[null,20,"Solid State Relays",null,null,10,30,45,null,null,null,null,"",null,"","",""]
[null,21,"Digital & Numeric Relays",null,null,15,20,20,null,null,null,null,"",null,"","",""]
[null,22,"Rigid Busbars",null,null,30,55,60,null,null,null,null,"",null,"","",""]
[null,23,"Steel Structure",null,null,35,50,90,null,null,null,null,"",null,"","",""]
["UG",24,"Primary Paper Insulated Lead Covered (PILC) Cables",null,null,60,65,75,null,null,null,null,"",null,"","",""]
[null,25,"Primary Ethylene-Propylene Rubber (EPR) Cables",null,null,20,25,25,null,null,null,null,"",null,"","",""]
[null,26,"Primary Non-Tree Retardant (TR) Cross Linked \nPolyethylene (XLPE) Cables Direct Buried",null,null,20,25,30,null,null,null,null,"",null,"","",""]
[null,27,"Primary Non-TR XLPE Cables in Duct",null,null,20,25,30,null,null,null,null,"",null,"","",""]
[null,30,"Secondary PILC Cables",null,null,70,75,80,null,null,null,null,"",null,"","",""]
[null,31,"Secondary Cables Direct Buried",null,null,25,35,40,null,null,null,null,"",null,"","",""]
[null,32,"Secondary Cables in Duct",null,null,35,40,60,null,1845,"Underground Conductors & Devices",40,2.5000000000000001E-2,40,2.5000000000000001E-2,"No","No"]
[null,33,"Network Tranformers","Overall",null,20,35,50,null,null,null,null,"",null,"","",""]
[null,null,null,"Protector",null,20,35,40,null,null,null,null,"",null,"","",""]
[null,34,"Pad-Mounted Transformers",null,null,25,40,45,null,1850,"Line Transformers",40,2.5000000000000001E-2,40,2.5000000000000001E-2,"No","No"]
[null,35,"Submersible/Vault Transformers",null,null,25,35,45,null,null,null,null,"",null,"","",""]
[null,36,"UG Foundation",null,null,35,55,70,null,null,null,null,"",null,"","",""]
[null,37,"UG Vaults","Overall",null,40,60,80,null,null,null,null,"",null,"","",""]
[null,null,null,"Roof",null,20,30,45,null,null,null,null,"",null,"","",""]
[null,38,"UG Vault Switches",null,null,20,35,50,null,null,null,null,"",null,"","",""]
[null,39,"Pad-Mounted Switchgear",null,null,20,30,45,null,null,null,null,"",null,"","",""]
[null,40,"Ducts",null,null,30,50,85,null,1840,"Underground Conduit",50,0.02,50,0.02,"No","No"]
[null,41,"Concrete Encased Duct Banks",null,null,35,55,80,null,null,null,null,"",null,"","",""]
[null,42,"Cable Chambers",null,null,50,60,80,null,null,null,null,"",null,"","",""]
["S",43,"Remote SCADA",null,null,15,20,30,null,null,null,null,"",null,"","",""]
[]
[]
["Table F-2 from Kinetrics Report1"]
[]
[null,null,"Asset Details",null,null,"Useful Life Range",null,null,null,"USoA Account Number","USoA Account Description","Current",null,"Proposed",null,"Outside Range of Min, Max TUL?"]
[null,"#","Category| Component | Type",null,null,null,null,null,null,null,null,"Years","Rate","Years","Rate","Below Min Range","Above Max Range"]
[null,1,"Office Equipment",null,null,5,15,null,null,1915,"Office Furniture & Equipment",10,{"$f":"IF(ISERROR(1/L77), \"\", 1/L77)","v":0.1},10,{"$f":"IF(ISERROR(1/N77), \"\", 1/N77)","v":0.1},{"$f":"IF(ISBLANK(N77),\"\",IF(N77<F77,\"Yes\",\"No\"))","v":"No"},{"$f":"IF(ISBLANK(N77),\"\",IF(N77>G77,\"Yes\",\"No\"))","v":"No"}]
[null,2,"Vehicles","Trucks & Buckets",null,5,15,null,null,1930,"Transportation Equipment > 3 tons",8,{"$f":"IF(ISERROR(1/L78), \"\", 1/L78)","v":0.125},8,{"$f":"IF(ISERROR(1/N78), \"\", 1/N78)","v":0.125},{"$f":"IF(ISBLANK(N78),\"\",IF(N78<F78,\"Yes\",\"No\"))","v":"No"},{"$f":"IF(ISBLANK(N78),\"\",IF(N78>G78,\"Yes\",\"No\"))","v":"No"}]
[null,null,null,"Trailers",null,5,20,null,null,1930,"Transportation Equipment < 3 tons",5,0.2,5,0.2,"No","No"]
[null,null,null,"Vans",null,5,10,null,null,null,null,null,"",null,"","",""]
[null,3,"Administrative Buildings",null,null,50,75,null,null,null,null,null,"",null,"","",""]
[null,4,"Leasehold Improvements",null,null,"Lease dependent",null,null,null,null,null,null,"",null,""]
[null,5,"Station Buildings","Station Buildings",null,50,75,null,null,null,null,null,"",null,"","",""]
[null,null,null,"Parking",null,25,30,null,null,null,null,null,"",null,"","",""]
[null,null,null,"Fence",null,25,60,null,null,null,null,null,"",null,"","",""]
[null,null,null,"Roof",null,20,30,null,null,null,null,null,"",null,"","",""]
[null,6,"Computer Equipment","Hardware",null,3,5,null,null,1920,"Computer Hardware",5,0.2,5,0.2,"No","No"]
[null,null,null,"Software",null,2,5,null,null,1925,"Computer Software",5,0.2,5,0.2,"No","No"]
[null,7,"Equipment","Power Operated",null,5,10,null,null,1950,"Power Operated Equipment",5,0.2,5,0.2,"No","No"]
[null,null,null,"Stores",null,5,10,null,null,1950,"Power Operated Equipment",8,0.125,8,0.125,"No","No"]
[null,null,null,"Tools, Shop, Garage Equipment",null,5,10,null,null,1940,"Tools, Shop and Garage Equipment",10,0.1,10,0.1,"No","No"]
[null,null,null,"Measurement & Testing Equipment",null,5,10,null,null,1945,"Measurement and Testing Equipment",10,0.1,10,0.1,"No","No"]
[null,8,"Communication","Towers",null,60,70,null,null,null,null,null,"",null,"","",""]
[null,null,null,"Wireless",null,2,10,null,null,1955,"Communication Equipment",10,0.1,10,0.1,"No","No"]
[null,9,"Residential Energy Meters",null,null,25,35,null,null,null,null,null,"",null,"","",""]
[null,10,"Industrial/Commercial Energy Meters",null,null,25,35,null,null,null,null,null,"",null,"","",""]
[null,11,"Wholesale Energy Meters",null,null,15,30,null,null,null,null,null,"",null,"","",""]
[null,12,"Current & Potential Transformer (CT & PT)",null,null,35,50,null,null,1860,"Meters - CTs & PTs",25,0.04,25,0.04,"Yes","No"]
[null,13,"Smart Meters",null,null,5,15,null,null,1860,"Meters - Smart Meters",15,6.6666666666666666E-2,15,6.6666666666666666E-2,"No","No"]
[null,14,"Repeaters - Smart Metering",null,null,10,15,null,null,null,null,null,"",null,"","",""]
[null,15,"Data Collectors - Smart Metering",null,null,15,20,null,null,null,null,null,"",null,"","",""]
[]
[]
["* TS & MS = Transformer and Municipal Stations UG = Underground Systems S = Monitoring and Control Systems"]
[]
["Note 1:","Tables F-1 and F-2 above are to be used as a reference in order to complete columns J, K, L and N."]
[null,"See pages 17-19 of Kinetrics Report"]

{"sheet":"App.2-C_DepExp","index":11,"n_rows":372,"n_cols":25,"rows_kept":372,"cut":false,"hidden":false,"merged":[[14,0,14,1],[14,2,14,16],[8,0,8,18],[9,0,9,18],[10,0,10,18],[13,0,13,1],[13,2,13,16],[72,1,72,18],[74,1,74,18],[20,0,21,0],[20,1,21,1],[65,1,65,18],[69,1,69,18],[70,1,70,18],[71,1,71,18],[15,0,15,1],[15,2,15,16],[16,0,16,1],[16,2,16,16],[19,2,19,8],[19,9,19,12],[19,13,19,16],[86,0,86,1],[86,2,86,16],[87,0,87,1],[87,2,87,16],[88,0,88,1],[88,2,88,16],[80,0,80,18],[81,0,81,18],[82,0,82,18],[85,0,85,1],[85,2,85,16],[138,1,138,18],[142,1,142,18],[143,1,143,18],[144,1,144,18],[145,1,145,18],[91,2,91,8],[91,9,91,12],[91,13,91,16],[92,0,93,0],[92,1,93,1],[159,0,159,1],[159,2,159,16],[160,0,160,1],[160,2,160,16],[161,0,161,1],[161,2,161,16],[147,1,147,18],[153,0,153,18],[154,0,154,18],[155,0,155,18],[158,0,158,1],[158,2,158,16],[211,1,211,18],[215,1,215,18],[216,1,216,18],[217,1,217,18],[218,1,218,18],[164,2,164,8],[164,9,164,12],[164,13,164,16],[165,0,166,0],[165,1,166,1],[234,0,234,1],[234,2,234,16],[235,0,235,1],[235,2,235,16],[236,0,236,1],[236,2,236,16],[220,1,220,18],[228,0,228,18],[229,0,229,18],[230,0,230,18],[233,0,233,1],[233,2,233,16],[286,1,286,18],[290,1,290,18],[291,1,291,18],[292,1,292,18],[293,1,293,18],[239,2,239,8],[239,9,239,12],[239,13,239,16],[240,0,241,0],[240,1,241,1],[314,0,315,0],[314,1,315,1],[308,0,308,1],[308,2,308,16],[309,0,309,1],[309,2,309,16],[310,0,310,1],[310,2,310,16],[295,1,295,18],[302,0,302,18],[303,0,303,18],[304,0,304,18],[307,0,307,1],[307,2,307,16],[369,1,369,18],[360,1,360,18],[364,1,364,18],[365,1,365,18],[366,1,366,18],[367,1,367,18],[313,2,313,8],[313,9,313,12],[313,13,313,16]]}
[]
[]
[]
[]
[]
[]
[]
[null,"  "]
["Appendix 2-C",null,null,null,null,null,null,null,null,null,null,null,null,null,null,null,null,null,null,null,null,null,null,null,"CGAAP"]
["Depreciation and Amortization Expense",null,null,null,null,null,null,null,null,null,null,null,null,null,null,null,null,null,null,null,null,null,null,null,"Revised CGAAP"]
[null,null,null,null,null,null,null,null,null,null,null,null,null,null,null,null,null,null,null,null,null,null,null,null,"MIFRS"]
["This appendix is to be completed in conjunction with the accounting instructions in Appendix 2-B"]
[]
["Scenario that applies",null,"Applicable Years and Accounting Standard",null,null,null,null,null,null,null,null,null,null,null,null,null,null,"Year Reflected in Schedule Below","Accounting Standard Reflected in Schedule Below",null,null,null,null,null,2012]
["Rebasing for the first time with depreciation policy changes made in 2012.",null,"This appendix must be duplicated and completed for the years 2012 to 2018. The appendix for 2012 is to be completed under CGAAP (prior to changes in depreciation policies). The appendix for 2012 to 2014 must be completed under Revised CGAAP (after changes in depreciation policies). The appendix for 2014 to 2018 is to be completed under MIFRS (2014 if changes to MIFRS are material).",null,null,null,null,null,null,null,null,null,null,null,null,null,null,null,null,null,null,null,null,null,2013]
["Rebasing for the first time with depreciation policy changes made in 2013.",null,"This appendix must be duplicated and completed for the years 2013 to 2018. The appendix for 2013 is to be completed under CGAAP (prior to changes in depreciation policies). The appendix for 2013 to 2014 must be completed under Revised CGAAP (after changes in depreciation policies). The appendix for 2014 to 2018 is to be completed under MIFRS (2014 if changes to MIFRS are material).",null,null,null,null,null,null,null,null,null,null,null,null,null,null,null,null,null,null,null,null,null,2014]
["Already rebased with depreciation policy changes in a prior rate application",null,"This appendix must be completed for 2014 to 2018. The appendix for 2014 is to be completed under Revised CGAAP (after changes in depreciation policies). The appendix for 2014 to 2018 is to be completed under MIFRS (2014 if changes to MIFRS are material).",null,null,null,null,null,null,null,null,null,null,null,null,null,null,2014,"Revised CGAAP",null,null,null,null,null,2015]
[null,null,null,null,null,null,null,null,null,null,null,null,null,null,null,null,null,null,null,null,null,null,null,null,2016]
[null,null,null,null,null,null,null,null,null,null,null,null,null,null,null,null,null,null,null,null,null,null,null,null,2017]
[null,null,"Book Values",null,null,null,null,null,null,"Service Lives",null,null,null,"Depreciation Expense",null,null,null,null,null,null,null,null,null,null,2018]
["Account","Description","Opening Net  Book Value of Existing Assets as at Date of Policy Change (Jan. 1) 1","Less Fully Depreciated 7","Net Amount of Existing Assets Before Policy Change to be Depreciated ","Opening Gross Book Value of Assets Acquired After Policy Change 2","Less Fully Depreciated 8","Net Amount of Assets Acquired After Policy Change to be Depreciated ","Current Year Additions","Average Remaining Life of Assets Existing Before Policy Change 3","Depreciation Rate Assets Acquired After Policy Change","Life of Assets Acquired After Policy Change 4","Depreciation Rate on New Additions","Depreciation Expense on Assets Existing Before Policy Change","Depreciation Expense on Assets Acquired After Policy Change","Depreciation Expense on Current Year Additions 5","Total Current Year Depreciation Expense ","Depreciation Expense per Appendix 2-BA Fixed Assets, Column J \n ","Variance 6"]
[null,null,"a","b","c = a-b","d","e","f = d- e","g","h","i = 1/h","j","k = 1/j","l = c/h","m = f/j","n = g*0.5/j","o = l+m+n","p","q = p-o"]
[1611,"Computer Software (Formally known as Account 1925)",24240,14825.68,{"$f":"C23-D23","v":9414.32},50739.64,4250,{"$f":"F23-G23","v":46489.64},40850,3.27,{"$f":"IF(J23=0,0,1/J23)","v":0.3058103975535168},5,{"$f":"IF(L23=0,0,1/L23)","v":0.2},{"$f":"IF(J23=0,0,+E23/J23)","v":2878.9969418960245},{"$f":"IF(L23=0,0,+H23/L23)","v":9297.9279999999999},{"$f":"IF(L23=0,0,+(I23*0.5)/L23)","v":4085},{"$f":"IF(ISERROR(+N23+O23+P23), 0, +N23+O23+P23)","v":16261.924941896024},{"$f":"-'App.2-BA_Fixed Asset Cont'!J76","v":16310.26},{"$f":"IF(ISERROR(+R23-122), 0, +R23-Q23)","v":48.335058103975825}]
[1612,"Land Rights (Formally known as Account 1906)",null,null,{"$f":"C24-D24","v":0},null,null,{"$f":"F24-G24","v":0},null,null,{"$f":"IF(J24=0,0,1/J24)","v":0},null,{"$f":"IF(L24=0,0,1/L24)","v":0},{"$f":"IF(J24=0,0,+E24/J24)","v":0},{"$f":"IF(L24=0,0,+H24/L24)","v":0},{"$f":"IF(L24=0,0,+(I24*0.5)/L24)","v":0},{"$f":"IF(ISERROR(+N24+O24+P24), 0, +N24+O24+P24)","v":0},null,{"$f":"IF(ISERROR(+R24-122), 0, +R24-Q24)","v":0}]
[1805,"Land",null,null,0,null,null,0,null,null,0,null,0,0,{"$f":"IF(L25=0,0,+H25/L25)","v":0},0,0,null,0]
[1808,"Buildings",50840,null,50840,0,0,0,null,14,7.1428571428571425E-2,25,0.04,3631.4285714285716,{"$f":"IF(L26=0,0,+H26/L26)","v":0},0,3631.4285714285716,{"$f":"-'App.2-BA_Fixed Asset Cont'!J79","v":3674.56},43.131428571428387]
[1810,"Leasehold Improvements",null,null,0,null,null,0,null,null,0,null,0,0,0,0,0,null,0]
[1815,"Transformer Station Equipment >50 kV",null,null,0,null,null,0,null,null,0,null,0,0,0,0,0,null,0]
[1820,"Distribution Station Equipment <50 kV",null,null,0,null,null,0,null,null,0,null,0,0,0,0,0,null,0]
[1825,"Storage Battery Equipment",null,null,0,null,null,0,null,null,0,null,0,0,0,0,0,null,0]
[1830,"Poles, Towers & Fixtures",2287202,null,2287202,309725.24,null,309725.24,174467,34,2.9411764705882353E-2,45,2.2222222222222223E-2,67270.647058823524,6882.7831111111109,1938.5222222222221,76091.952392156862,{"$f":"-'App.2-BA_Fixed Asset Cont'!J84","v":76091.94},-1.2392156859277748E-2]
[1835,"Overhead Conductors & Devices",605093,null,605093,14419.08,null,14419.08,5330,34,2.9411764705882353E-2,45,2.2222222222222223E-2,17796.852941176472,320.42399999999998,59.222222222222221,18176.499163398694,{"$f":"-'App.2-BA_Fixed Asset Cont'!J85","v":18235.7},59.200836601306946]
[1840,"Underground Conduit",105284,null,105284,11328.13,null,11328.13,905,39,2.564102564102564E-2,50,0.02,2699.5897435897436,226.56259999999997,9.0500000000000007,2935.2023435897436,{"$f":"-'App.2-BA_Fixed Asset Cont'!J86","v":2935.23},2.7656410256440722E-2]
[1845,"Underground Conductors & Devices",582212,null,582212,50771.79,null,50771.79,13197,29,3.4482758620689655E-2,40,2.5000000000000001E-2,20076.275862068964,1269.29475,164.96250000000001,21510.533112068966,{"$f":"-'App.2-BA_Fixed Asset Cont'!J87","v":21510.53},-3.1120689673116431E-3]
[1850,"Line Transformers",1020305,null,1020305,139522.45000000001,null,139522.45000000001,54576,29,3.4482758620689655E-2,40,2.5000000000000001E-2,35182.931034482761,3488.0612500000002,682.2,39353.192284482757,{"$f":"-'App.2-BA_Fixed Asset Cont'!J88","v":39353.19},-2.2844827544759028E-3]
[1855,"Services (Overhead & Underground)",null,null,0,null,null,0,null,null,0,null,0,0,0,0,0,null,0]
[1860,"Meters",327572,181593,145979,9707.01,null,9707.01,5221,14,7.1428571428571425E-2,25,0.04,10427.071428571429,388.28039999999999,104.42,10919.771828571429,{"$f":"-'App.2-BA_Fixed Asset Cont'!J90","v":12372.4},1452.6281714285706]
[1860,"Meters (Smart Meters)",null,null,0,650449,375,650074,12125,12,8.3333333333333329E-2,15,6.6666666666666666E-2,0,43338.26666666667,404.16666666666669,43742.433333333334,{"$f":"-'App.2-BA_Fixed Asset Cont'!J91","v":43731.72},-10.713333333333139]
[1905,"Land",null,null,0,null,null,0,null,null,0,null,0,0,0,0,0,null,0]
[1908,"Buildings & Fixtures",null,null,0,null,null,0,null,null,0,null,0,0,0,0,0,null,0]
[1910,"Leasehold Improvements",null,null,0,null,null,0,null,null,0,null,0,0,0,0,0,null,0]
[1915,"Office Furniture & Equipment (10 years)",9103,null,9103,6000.35,null,6000.35,278,7.79,0.12836970474967907,10,0.1,1168.5494223363287,600.03500000000008,13.9,1782.4844223363289,{"$f":"-'App.2-BA_Fixed Asset Cont'!J95","v":1766.47},-16.014422336328835]
[1915,"Office Furniture & Equipment (5 years)",null,null,0,null,null,0,null,null,0,null,0,0,0,0,0,null,0]
[1920,"Computer Equipment - Hardware",null,null,0,null,null,0,null,null,0,null,0,0,0,0,0,null,0]
[1920,"Computer Equip.-Hardware(Post Mar. 22/04)",12678,1752.84,10925.16,32132.26,26690,5442.2599999999984,1000,2.83,0.35335689045936397,5,0.2,3860.4805653710246,{"$f":"IF(L45=0,0,+H45/L45)","v":1088.4519999999998},100,5048.9325653710239,{"$f":"-'App.2-BA_Fixed Asset Cont'!J97","v":4789.2},-259.73256537102407]
[1920,"Computer Equip.-Hardware(Post Mar. 19/07)",null,null,0,null,null,0,null,null,0,null,0,0,0,0,0,null,0]
[1930,"Transportation Equipment (8 years)",34927.42,null,34927.42,35425.160000000003,null,35425.160000000003,null,4.0999999999999996,0.24390243902439027,8,0.125,8518.8829268292684,4428.1450000000004,0,12947.027926829269,{"$f":"-'App.2-BA_Fixed Asset Cont'!J100","v":12981.89},34.862073170730582]
[1930,"Transportation Equipment ( 5 years)",18189.09,null,18189.09,null,null,0,54538.75,3,0.33333333333333331,5,0.2,6063.03,0,5453.875,11516.904999999999,{"$f":"-'App.2-BA_Fixed Asset Cont'!J101","v":11170.72},-346.18499999999949]
[1940,"Tools, Shop & Garage Equipment",15953,null,15953,18913.05,null,18913.05,3504.33,6.17,0.16207455429497569,10,0.1,2585.5753646677472,{"$f":"IF(L49=0,0,+H49/L49)","v":1891.3049999999998},175.2165,4652.0968646677466,{"$f":"-'App.2-BA_Fixed Asset Cont'!J102","v":7659.28},3007.1831353322532]
[1945,"Measurement & Testing Equipment",3220,null,3220,6144.75,null,6144.75,null,2.69,0.37174721189591081,10,0.1,1197.0260223048328,614.47500000000002,0,1811.501022304833,{"$f":"-'App.2-BA_Fixed Asset Cont'!J103","v":1354.26},-457.241022304833]
[1950,"Power Operated Equipment(8 years)",20231.25,null,20231.25,85090,null,85090,null,5.87,0.17035775127768313,8,0.125,3446.550255536627,10636.25,0,14082.800255536627,{"$f":"-'App.2-BA_Fixed Asset Cont'!J104","v":13561.25},-521.55025553662745]
[1950,"Power Operated Equipment(5 years)",2458.91,null,2458.91,719.95,null,719.95,null,3.65,0.27397260273972601,5,0.2,673.6739726027397,143.99,0,817.6639726027397,{"$f":"-'App.2-BA_Fixed Asset Cont'!J105","v":916.78},99.116027397260268]
[1955,"Communications Equipment",6980,null,6980,1235.04,null,1235.04,4441.26,4.55,0.21978021978021978,10,0.1,1534.065934065934,123.50399999999999,222.06300000000002,1879.632934065934,{"$f":"-'App.2-BA_Fixed Asset Cont'!J106","v":1819.28},-60.352934065934051]
[1955,"Communication Equipment (Smart Meters)",null,null,0,null,null,0,null,null,0,null,0,0,0,0,0,null,0]
[1960,"Miscellaneous Equipment ",null,null,0,null,null,0,null,null,0,null,0,0,0,0,0,null,0]
[1970,"Load Management Controls Customer Premises",null,null,0,null,null,0,null,null,0,null,0,0,0,0,0,null,0]
[1975,"Load Management Controls Utility Premises",null,null,0,null,null,0,null,null,0,null,0,0,0,0,0,null,0]
[1980,"System Supervisor Equipment",null,null,0,null,null,0,null,null,0,null,0,0,0,0,0,null,0]
[1985,"Miscellaneous Fixed Assets",6711,276.06,6434.94,2819.09,1683.29,1135.8000000000002,178.42,5.37,0.18621973929236499,10,0.1,1198.3128491620112,113.58000000000001,8.9209999999999994,1320.8138491620111,{"$f":"-'App.2-BA_Fixed Asset Cont'!J111","v":1313.73},-7.0838491620111199]
[1990,"Other Tangible Property",null,null,0,null,null,0,null,null,0,null,0,0,0,0,0,null,0]
[1995,"Contributions & Grants",-681468,null,-681468,-146944.07999999999,null,-146944.07999999999,-43494,29,3.4482758620689655E-2,40,2.5000000000000001E-2,-23498.896551724138,-3673.6019999999999,-543.67499999999995,-27716.173551724136,{"$f":"-'App.2-BA_Fixed Asset Cont'!J113","v":-32190.05},-4473.8764482758634]
[null,"Total",{"$f":"SUM(C23:C61)","v":4451731.67},198447.58,4253284.0900000008,1278197.9100000001,32998.29,1245199.6200000001,327117.76,null,null,null,null,{"$f":"SUM(N23:N61)","v":166711.04434318983},81177.734777777805,12877.844111111111,260766.62323207871,259358.34000000008,-1408.2832320787534]
[]
[]
["General:","Applicants are to complete this appendix to show the reasonability of the depreciation expense that is included in rate base via. Accumulated depreciation and the revenue requirement."]
[null,"Applicants must provide a breakdown of depreciation and amortization expense in the above format for all relevant accounts.  Balances presented in the table should exclude asset retirement obligations (AROs) and the related depreciation and accretion expense. These should be disclosed separately consistent with the Notes of historical Audited Financial Statements."]
[]
[]
["Notes:"]
[1,"This is the net book value of assets that existed as at the date of the utility's change in depreciation policies (i.e. as at Jan. 1, 2012 or Jan. 1, 2013).  These assets are to be depreciated at the average remaining service life. This amount will not change in years subsequent to the date of the utility's change in depreciation policies.  This column is expected to be used until the assets that existed as at the date of the utility's change in depreciation policies are fully depreciated."]
[2,"This is the opening gross book value of assets that have been acquired after the date of the utilities change in depreciation policies (i.e. additions starting in 2012/2013 for those who changed policies Jan. 1, 2012/2013). These assets are to be depreciated at the revised service life. The amount is expected to be equal to the gross book value of the prior year plus the prior year's additions."]
[3,"A recalculation should be performed to determine the average remaining life of opening balance of assets (i.e. excluding current year's additions) under the change in policies under CGAAP.  For example, Asset A had a useful life of 20 years under CGAAP without the change in policies.  On January 1 of the year of policy changes, Asset A was 3 years depreciated. As a result, Asset A would have a remaining service life of 17 years (20 years less 3 years) as at January 1 of the year of policy changes.  Due to making the change in policies under CGAAP, management re-assessed the asset useful lives and concluded that the revised useful life of Asset A is now 30 years. Therefore, the average remaining useful life of the opening balance of Asset A is determined to be 27 years (30 years less 3 years) under the revised CGAAP as at January 1 of the year of policy changes."]
[4,"The useful life used should be consistent with the OEB's regulatory accounting policies as set out in the  Accounting Procedures Handbook for Electricity Distributors, effective Jan. 1, 2012 and also with the Report of the Board, Transition to International Financial Reporting Standards, EB-2008-0408, and the Kinectrics Report."]
[5,"Board policy of the \"half-year\" rule - the applicant must ensure that additions in the year attract a half-year depreciation expense in the first year.  Deviations from this standard practice must be supported in the application."]
[6,"The applicant must provide an explanation of material variances in evidence."]
[7,"This should include assets in column a (excel column C) that become fully depreciated since the date of the policy change.  The amount input in b (excel column D) should equal the net book value of the asset as at the date of depreciation policy change"]
[8,"This should include assets in column d (excel column f) that have become fully depreciated.  The amount input in e (excel column G) should equal the gross book value of the asset"]
[]
[]
[]
["Appendix 2-C"]
["Depreciation and Amortization Expense"]
[]
["This appendix is to be completed in conjunction with the accounting instructions in Appendix 2-B"]
[]
["Scenario that applies",null,"Applicable Years and Accounting Standard",null,null,null,null,null,null,null,null,null,null,null,null,null,null,"Year Reflected in Schedule Below","Accounting Standard Reflected in Schedule Below"]
["Rebasing for the first time with depreciation policy changes made in 2012.",null,"This appendix must be duplicated and completed for the years 2012 to 2018. The appendix for 2012 is to be completed under CGAAP (prior to changes in depreciation policies). The appendix for 2012 to 2014 must be completed under Revised CGAAP (after changes in depreciation policies). The appendix for 2014 to 2018 is to be completed under MIFRS (2014 if changes to MIFRS are material)."]
["Rebasing for the first time with depreciation policy changes made in 2013.",null,"This appendix must be duplicated and completed for the years 2013 to 2018. The appendix for 2013 is to be completed under CGAAP (prior to changes in depreciation policies). The appendix for 2013 to 2014 must be completed under Revised CGAAP (after changes in depreciation policies). The appendix for 2014 to 2018 is to be completed under MIFRS (2014 if changes to MIFRS are material)."]
["Already rebased with depreciation policy changes in a prior rate application",null,"This appendix must be completed for 2014 to 2018. The appendix for 2014 is to be completed under Revised CGAAP (after changes in depreciation policies). The appendix for 2014 to 2018 is to be completed under MIFRS (2014 if changes to MIFRS are material).",null,null,null,null,null,null,null,null,null,null,null,null,null,null,2015,"MIFRS"]
[]
[]
[null,null,"Book Values",null,null,null,null,null,null,"Service Lives",null,null,null,"Depreciation Expense"]
["Account","Description","Opening Net  Book Value of Existing Assets as at Date of Policy Change (Jan. 1) 1","Less Fully Depreciated 7","Net Amount of Existing Assets Before Policy Change to be Depreciated ","Opening Gross Book Value of Assets Acquired After Policy Change 2","Less Fully Depreciated 8","Net Amount of Assets Acquired After Policy Change to be Depreciated ","Current Year Additions","Average Remaining Life of Assets Existing Before Policy Change 3","Depreciation Rate Assets Acquired After Policy Change","Life of Assets Acquired After Policy Change 4","Depreciation Rate on New Additions","Depreciation Expense on Assets Existing Before Policy Change","Depreciation Expense on Assets Acquired After Policy Change","Depreciation Expense on Current Year Additions 5","Total Current Year Depreciation Expense ","Depreciation Expense per Appendix 2-BA Fixed Assets, Column J \n ","Variance 6"]
[null,null,"a","b","c = a-b","d","e","f = d- e","g","h","i = 1/h","j","k = 1/j","l = c/h","m = f/j","n = g*0.5/j","o = l+m+n","p","q = p-o"]
[1611,"Computer Software (Formally known as Account 1925)",24240,14825.68,{"$f":"C95-D95","v":9414.32},{"$f":"SUM(F23,I23)","v":91589.64},48407.74,{"$f":"F95-G95","v":43181.9},1163,3.27,{"$f":"IF(J95=0,0,1/J95)","v":0.3058103975535168},5,{"$f":"IF(L95=0,0,1/L95)","v":0.2},{"$f":"IF(J95=0,0,+E95/J95)","v":2878.9969418960245},{"$f":"IF(L95=0,0,+H95/L95)","v":8636.380000000001},{"$f":"IF(L95=0,0,+(I95*0.5)/L95)","v":116.3},{"$f":"IF(ISERROR(+N95+O95+P95), 0, +N95+O95+P95)","v":11631.676941896025},{"$f":"-'App.2-BA_Fixed Asset Cont'!J195","v":13846.26},{"$f":"IF(ISERROR(+R95-122), 0, +R95-Q95)","v":2214.5830581039754}]
[1612,"Land Rights (Formally known as Account 1906)",null,null,{"$f":"C96-D96","v":0},null,null,{"$f":"F96-G96","v":0},null,null,{"$f":"IF(J96=0,0,1/J96)","v":0},null,{"$f":"IF(L96=0,0,1/L96)","v":0},{"$f":"IF(J96=0,0,+E96/J96)","v":0},{"$f":"IF(L96=0,0,+H96/L96)","v":0},{"$f":"IF(L96=0,0,+(I96*0.5)/L96)","v":0},{"$f":"IF(ISERROR(+N96+O96+P96), 0, +N96+O96+P96)","v":0},null,{"$f":"IF(ISERROR(+R96-122), 0, +R96-Q96)","v":0}]
[1805,"Land",null,null,0,null,null,0,null,null,0,null,0,0,{"$f":"IF(L97=0,0,+H97/L97)","v":0},0,0,null,0]
[1808,"Buildings",50840,null,50840,null,null,0,null,14,7.1428571428571425E-2,25,0.04,3631.4285714285716,0,0,3631.4285714285716,{"$f":"-'App.2-BA_Fixed Asset Cont'!J198","v":3674.56},43.131428571428387]
[1810,"Leasehold Improvements",null,null,0,null,null,0,null,null,0,null,0,0,0,0,0,null,0]
[1815,"Transformer Station Equipment >50 kV",null,null,0,null,null,0,null,null,0,null,0,0,0,0,0,null,0]
[1820,"Distribution Station Equipment <50 kV",null,null,0,null,null,0,null,null,0,null,0,0,0,0,0,null,0]
[1825,"Storage Battery Equipment",null,null,0,null,null,0,null,null,0,null,0,0,0,0,0,null,0]
[1830,"Poles, Towers & Fixtures",2287202,null,2287202,{"$f":"SUM(F31,I31)","v":484192.24},null,484192.24,170006,34,2.9411764705882353E-2,45,2.2222222222222223E-2,67270.647058823524,10759.827555555556,1888.9555555555555,79919.43016993464,{"$f":"-'App.2-BA_Fixed Asset Cont'!J203","v":79315.62},-603.81016993464436]
[1835,"Overhead Conductors & Devices",605093,null,605093,{"$f":"SUM(F32,I32)","v":19749.080000000002},null,19749.080000000002,26651,34,2.9411764705882353E-2,45,2.2222222222222223E-2,17796.852941176472,438.86844444444449,296.12222222222221,18531.843607843137,{"$f":"-'App.2-BA_Fixed Asset Cont'!J204","v":18509.21},-22.633607843137725]
[1840,"Underground Conduit",105284,null,105284,{"$f":"SUM(F33,I33)","v":12233.13},null,12233.13,1730,39,2.564102564102564E-2,50,0.02,2699.5897435897436,244.6626,17.3,2961.5523435897439,{"$f":"-'App.2-BA_Fixed Asset Cont'!J205","v":2964.08},2.527656410255986]
[1845,"Underground Conductors & Devices",582212,null,582212,{"$f":"SUM(F34,I34)","v":63968.79},null,63968.79,24993,29,3.4482758620689655E-2,40,2.5000000000000001E-2,20076.275862068964,1599.21975,312.41250000000002,21987.908112068963,{"$f":"-'App.2-BA_Fixed Asset Cont'!J206","v":22008.41},20.501887931037345]
[1850,"Line Transformers",1020305,null,1020305,{"$f":"SUM(F35,I35)","v":194098.45},null,194098.45,40013,29,3.4482758620689655E-2,40,2.5000000000000001E-2,35182.931034482761,4852.4612500000003,500.16250000000002,40535.55478448276,{"$f":"-'App.2-BA_Fixed Asset Cont'!J207","v":39781.160000000003},-754.39478448275622]
[1855,"Services (Overhead & Underground)",null,null,0,null,null,0,null,null,0,null,0,0,0,0,0,null,0]
[1860,"Meters",327572,181593,145979,{"$f":"SUM(F37,I37)","v":14928.01},null,14928.01,4025,14,7.1428571428571425E-2,25,0.04,10427.071428571429,597.12040000000002,80.5,11104.691828571429,{"$f":"-'App.2-BA_Fixed Asset Cont'!J209","v":12557.33},1452.6381714285708]
[1860,"Meters (Smart Meters)",null,null,0,{"$f":"SUM(F38,I38)","v":662574},11068,651506,0,12,8.3333333333333329E-2,15,6.6666666666666666E-2,0,43433.73333333333,0,43433.73333333333,{"$f":"-'App.2-BA_Fixed Asset Cont'!J210","v":43075.55},-358.18333333332703]
[1905,"Land",null,null,0,null,null,0,null,null,0,null,0,0,0,0,0,null,0]
[1908,"Buildings & Fixtures",null,null,0,null,null,0,null,null,0,null,0,0,0,0,0,null,0]
[1910,"Leasehold Improvements",null,null,0,null,null,0,null,null,0,null,0,0,0,0,0,null,0]
[1915,"Office Furniture & Equipment (10 years)",9103,null,9103,{"$f":"SUM(F42,I42)","v":6278.35},753.84,5524.51,2318,7.79,0.12836970474967907,10,0.1,1168.5494223363287,552.45100000000002,115.9,1836.9004223363288,{"$f":"-'App.2-BA_Fixed Asset Cont'!J214","v":1784.91},-51.99042233632872]
[1915,"Office Furniture & Equipment (5 years)",null,null,0,null,null,0,null,null,0,null,0,0,0,0,0,null,0]
[1920,"Computer Equipment - Hardware",null,null,0,null,null,0,null,null,0,null,0,0,0,0,0,null,0]
[1920,"Computer Equip.-Hardware(Post Mar. 22/04)",12678,1752.84,10925.16,{"$f":"SUM(F45,I45)","v":33132.259999999995},26690,6442.2599999999948,1830,2.83,0.35335689045936397,5,0.2,3860.4805653710246,1288.4519999999989,183,5331.9325653710239,{"$f":"-'App.2-BA_Fixed Asset Cont'!J216","v":5101.17},-230.76256537102381]
[1920,"Computer Equip.-Hardware(Post Mar. 19/07)",null,null,0,null,null,0,null,null,0,null,0,0,0,0,0,null,0]
[1930,"Transportation Equipment (8 years)",34927.42,null,34927.42,{"$f":"SUM(F47,I47)","v":35425.160000000003},null,35425.160000000003,0,4.0999999999999996,0.24390243902439027,8,0.125,8518.8829268292684,4428.1450000000004,0,12947.027926829269,{"$f":"-'App.2-BA_Fixed Asset Cont'!J219","v":12981.89},34.862073170730582]
[1930,"Transportation Equipment ( 5 years)",18189.09,null,18189.09,54538.75,31182.92,23355.83,0,3,0.33333333333333331,5,0.2,6063.03,4671.1660000000002,0,10734.196,{"$f":"-'App.2-BA_Fixed Asset Cont'!J220","v":10907.75},173.55400000000009]
[1940,"Tools, Shop & Garage Equipment",15953,null,15953,22417.379999999997,null,22417.379999999997,1005,6.17,0.16207455429497569,10,0.1,2585.5753646677472,2241.7379999999998,50.25,4877.563364667747,{"$f":"-'App.2-BA_Fixed Asset Cont'!J221","v":7395.85},2518.2866353322534]
[1945,"Measurement & Testing Equipment",3220,null,3220,6144.75,6111.67,33.079999999999927,0,2.69,0.37174721189591081,10,0.1,1197.0260223048328,3.3079999999999927,0,1200.3340223048328,{"$f":"-'App.2-BA_Fixed Asset Cont'!J222","v":946.75},-253.58402230483284]
[1950,"Power Operated Equipment(8 years)",20231.25,null,20231.25,85090,null,85090,0,5.87,0.17035775127768313,8,0.125,3446.550255536627,10636.25,0,14082.800255536627,{"$f":"-'App.2-BA_Fixed Asset Cont'!J223","v":13561.25},-521.55025553662745]
[1950,"Power Operated Equipment(5 years)",2458.91,null,2458.91,719.95,4215.29,-3495.34,14234,3.65,0.27397260273972601,5,0.2,673.6739726027397,-699.06799999999998,1423.4,1398.0059726027398,{"$f":"-'App.2-BA_Fixed Asset Cont'!J224","v":381.22},-1016.7859726027398,"Bought snowmobile in December 2015"]
[1955,"Communications Equipment",6980,null,6980,5676.3,1653.77,4022.53,11122,4.55,0.21978021978021978,10,0.1,1534.065934065934,402.25300000000004,556.1,2492.4189340659341,{"$f":"-'App.2-BA_Fixed Asset Cont'!J225","v":2431.98},-60.438934065934063]
[1955,"Communication Equipment (Smart Meters)",null,null,0,null,null,0,null,null,0,null,0,0,0,0,0,null,0]
[1960,"Miscellaneous Equipment ",null,null,0,null,null,0,null,null,0,null,0,0,0,0,0,null,0]
[1970,"Load Management Controls Customer Premises",null,null,0,null,null,0,null,null,0,null,0,0,0,0,0,null,0]
[1975,"Load Management Controls Utility Premises",null,null,0,null,null,0,null,null,0,null,0,0,0,0,0,null,0]
[1980,"System Supervisor Equipment",null,null,0,null,null,0,null,null,0,null,0,0,0,0,0,null,0]
[1985,"Miscellaneous Fixed Assets",6711,276.06,6434.94,{"$f":"SUM(F59,I59)","v":2997.51},3038.85,-41.339999999999691,1523,5.37,0.18621973929236499,10,0.1,1198.3128491620112,-4.1339999999999693,76.150000000000006,1270.3288491620112,{"$f":"-'App.2-BA_Fixed Asset Cont'!J230","v":1263.1500000000001},-7.1788491620111472]
[1990,"Other Tangible Property",null,null,0,null,null,0,null,null,0,null,0,0,0,0,0,null,0]
[1995,"Contributions & Grants",-681468,null,{"$f":"C133-D133","v":-681468},{"$f":"SUM(F61,I61)","v":-190438.08},null,{"$f":"F133-G133","v":-190438.08},null,29,{"$f":"IF(J133=0,0,1/J133)","v":3.4482758620689655E-2},40,{"$f":"IF(L133=0,0,1/L133)","v":2.5000000000000001E-2},{"$f":"IF(J133=0,0,+E133/J133)","v":-23498.896551724138},{"$f":"IF(L133=0,0,+H133/L133)","v":-4760.9519999999993},{"$f":"IF(L133=0,0,+(I133*0.5)/L133)","v":0},{"$f":"IF(ISERROR(+N133+O133+P133), 0, +N133+O133+P133)","v":-28259.848551724135},{"$f":"-'App.2-BA_Fixed Asset Cont'!J232","v":-30758},{"$f":"IF(ISERROR(+R133-122), 0, +R133-Q133)","v":-2498.1514482758648}]
[2440,"Deferred Revenue",null,null,0,null,null,0,-40513,null,0,40,2.5000000000000001E-2,0,0,-506.41250000000002,-506.41250000000002,{"$f":"-SUM('App.2-BA_Fixed Asset Cont'!J233)","v":-2496.52},-1990.1075000000001,"average 40 years, but different for each type of asset"]
[null,"Total",{"$f":"SUM(C95:C134)","v":4451731.67},198447.58,4253284.0900000008,1605315.67,133122.07999999999,1472193.5899999999,260100,null,null,null,null,{"$f":"SUM(N95:N134)","v":166711.04434318983},89321.882333333328,5110.1402777777776,261143.06695430103,259233.58,-1909.4869543009763]
[]
[]
["General:","Applicants are to complete this appendix to show the reasonability of the depreciation expense that is included in rate base via. Accumulated depreciation and the revenue requirement."]
[null,"Applicants must provide a breakdown of depreciation and amortization expense in the above format for all relevant accounts.  Balances presented in the table should exclude asset retirement obligations (AROs) and the related depreciation and accretion expense. These should be disclosed separately consistent with the Notes of historical Audited Financial Statements."]
[]
[]
["Notes:"]
[1,"This is the net book value of assets that existed as at the date of the utility's change in depreciation policies (i.e. as at Jan. 1, 2012 or Jan. 1, 2013).  These assets are to be depreciated at the average remaining service life. This amount will not change in years subsequent to the date of the utility's change in depreciation policies.  This column is expected to be used until the assets that existed as at the date of the utility's change in depreciation policies are fully depreciated."]
[2,"This is the opening gross book value of assets that have been acquired after the date of the utilities change in depreciation policies (i.e. additions starting in 2012/2013 for those who changed policies Jan. 1, 2012/2013). These assets are to be depreciated at the revised service life. The amount is expected to be equal to the gross book value of the prior year plus the prior year's additions."]
[3,"A recalculation should be performed to determine the average remaining life of opening balance of assets (i.e. excluding current year's additions) under the change in policies under CGAAP.  For example, Asset A had a useful life of 20 years under CGAAP without the change in policies.  On January 1 of the year of policy changes, Asset A was 3 years depreciated. As a result, Asset A would have a remaining service life of 17 years (20 years less 3 years) as at January 1 of the year of policy changes.  Due to making the change in policies under CGAAP, management re-assessed the asset useful lives and concluded that the revised useful life of Asset A is now 30 years. Therefore, the average remaining useful life of the opening balance of Asset A is determined to be 27 years (30 years less 3 years) under the revised CGAAP as at January 1 of the year of policy changes."]
[4,"The useful life used should be consistent with the OEB's regulatory accounting policies as set out in the  Accounting Procedures Handbook for Electricity Distributors, effective Jan. 1, 2012 and also with the Report of the Board, Transition to International Financial Reporting Standards, EB-2008-0408, and the Kinectrics Report."]
[5,"Board policy of the \"half-year\" rule - the applicant must ensure that additions in the year attract a half-year depreciation expense in the first year.  Deviations from this standard practice must be supported in the application."]
[6,"The applicant must provide an explanation of material variances in evidence."]
[7,"This should include assets in column a (excel column C) that become fully depreciated since the date of the policy change.  The amount input in b (excel column D) should equal the net book value of the asset as at the date of depreciation policy change"]
[8,"This should include assets in column d (excel column f) that have become fully depreciated.  The amount input in e (excel column G) should equal the gross book value of the asset"]
[]
[]
[]
["Appendix 2-C"]
["Depreciation and Amortization Expense"]
[]
["This appendix is to be completed in conjunction with the accounting instructions in Appendix 2-B"]
[]
["Scenario that applies",null,"Applicable Years and Accounting Standard",null,null,null,null,null,null,null,null,null,null,null,null,null,null,"Year Reflected in Schedule Below","Accounting Standard Reflected in Schedule Below"]
["Rebasing for the first time with depreciation policy changes made in 2012.",null,"This appendix must be duplicated and completed for the years 2012 to 2018. The appendix for 2012 is to be completed under CGAAP (prior to changes in depreciation policies). The appendix for 2012 to 2014 must be completed under Revised CGAAP (after changes in depreciation policies). The appendix for 2014 to 2018 is to be completed under MIFRS (2014 if changes to MIFRS are material)."]
["Rebasing for the first time with depreciation policy changes made in 2013.",null,"This appendix must be duplicated and completed for the years 2013 to 2018. The appendix for 2013 is to be completed under CGAAP (prior to changes in depreciation policies). The appendix for 2013 to 2014 must be completed under Revised CGAAP (after changes in depreciation policies). The appendix for 2014 to 2018 is to be completed under MIFRS (2014 if changes to MIFRS are material)."]
["Already rebased with depreciation policy changes in a prior rate application",null,"This appendix must be completed for 2014 to 2018. The appendix for 2014 is to be completed under Revised CGAAP (after changes in depreciation policies). The appendix for 2014 to 2018 is to be completed under MIFRS (2014 if changes to MIFRS are material).",null,null,null,null,null,null,null,null,null,null,null,null,null,null,2016,"MIFRS"]
[]
[]
[null,null,"Book Values",null,null,null,null,null,null,"Service Lives",null,null,null,"Depreciation Expense"]
["Account","Description","Opening Net  Book Value of Existing Assets as at Date of Policy Change (Jan. 1) 1","Less Fully Depreciated 7","Net Amount of Existing Assets Before Policy Change to be Depreciated ","Opening Gross Book Value of Assets Acquired After Policy Change 2","Less Fully Depreciated 8","Net Amount of Assets Acquired After Policy Change to be Depreciated ","Current Year Additions","Average Remaining Life of Assets Existing Before Policy Change 3","Depreciation Rate Assets Acquired After Policy Change","Life of Assets Acquired After Policy Change 4","Depreciation Rate on New Additions","Depreciation Expense on Assets Existing Before Policy Change","Depreciation Expense on Assets Acquired After Policy Change","Depreciation Expense on Current Year Additions 5","Total Current Year Depreciation Expense ","Depreciation Expense per Appendix 2-BA Fixed Assets, Column J \n ","Variance 6"]
[null,null,"a","b","c = a-b","d","e","f = d- e","g","h","i = 1/h","j","k = 1/j","l = c/h","m = f/j","n = g*0.5/j","o = l+m+n","p","q = p-o"]
[1611,"Computer Software (Formally known as Account 1925)",24240,14825.68,{"$f":"C168-D168","v":9414.32},{"$f":"SUM(F95,I95)","v":92752.639999999999},57284.639999999999,{"$f":"F168-G168","v":35468},0,3.27,{"$f":"IF(J168=0,0,1/J168)","v":0.3058103975535168},5,{"$f":"IF(L168=0,0,1/L168)","v":0.2},{"$f":"IF(J168=0,0,+E168/J168)","v":2878.9969418960245},{"$f":"IF(L168=0,0,+H168/L168)","v":7093.6},{"$f":"IF(L168=0,0,+(I168*0.5)/L168)","v":0},{"$f":"IF(ISERROR(+N168+O168+P168), 0, +N168+O168+P168)","v":9972.5969418960249},{"$f":"-'App.2-BA_Fixed Asset Cont'!J254","v":12527.6},{"$f":"IF(ISERROR(+R168-122), 0, +R168-Q168)","v":2555.0030581039755}]
[1612,"Land Rights (Formally known as Account 1906)",null,null,{"$f":"C169-D169","v":0},null,null,{"$f":"F169-G169","v":0},null,null,{"$f":"IF(J169=0,0,1/J169)","v":0},null,{"$f":"IF(L169=0,0,1/L169)","v":0},{"$f":"IF(J169=0,0,+E169/J169)","v":0},{"$f":"IF(L169=0,0,+H169/L169)","v":0},{"$f":"IF(L169=0,0,+(I169*0.5)/L169)","v":0},{"$f":"IF(ISERROR(+N169+O169+P169), 0, +N169+O169+P169)","v":0},null,{"$f":"IF(ISERROR(+R169-122), 0, +R169-Q169)","v":0}]
[1805,"Land",null,null,0,null,null,0,null,null,0,null,0,0,{"$f":"IF(L170=0,0,+H170/L170)","v":0},0,0,null,0]
[1808,"Buildings",50840,null,50840,null,null,0,null,14,7.1428571428571425E-2,25,0.04,3631.4285714285716,0,0,3631.4285714285716,{"$f":"-'App.2-BA_Fixed Asset Cont'!J257","v":3674.56},43.131428571428387]
[1810,"Leasehold Improvements",null,null,0,null,null,0,null,null,0,null,0,0,0,0,0,null,0]
[1815,"Transformer Station Equipment >50 kV",null,null,0,null,null,0,null,null,0,null,0,0,0,0,0,null,0]
[1820,"Distribution Station Equipment <50 kV",null,null,0,null,null,0,null,null,0,null,0,0,0,0,0,null,0]
[1825,"Storage Battery Equipment",null,null,0,null,null,0,null,null,0,null,0,0,0,0,0,null,0]
[1830,"Poles, Towers & Fixtures",2287202,null,2287202,{"$f":"SUM(F103,I103)","v":654198.24},null,654198.24,204058.9,34,2.9411764705882353E-2,45,2.2222222222222223E-2,67270.647058823524,14537.738666666666,2267.3211111111109,84075.706836601312,{"$f":"-'App.2-BA_Fixed Asset Cont'!J262","v":83342.75},-732.95683660131181]
[1835,"Overhead Conductors & Devices",605093,null,605093,{"$f":"SUM(F104,I104)","v":46400.08},null,46400.08,28065.54,34,2.9411764705882353E-2,45,2.2222222222222223E-2,17796.852941176472,1031.1128888888888,311.83933333333334,19139.805163398694,{"$f":"-'App.2-BA_Fixed Asset Cont'!J263","v":19109.490000000002},-30.315163398692675]
[1840,"Underground Conduit",105284,null,105284,{"$f":"SUM(F105,I105)","v":13963.13},null,13963.13,5827.43,39,2.564102564102564E-2,50,0.02,2699.5897435897436,279.26259999999996,58.274300000000004,3037.1266435897437,{"$f":"-'App.2-BA_Fixed Asset Cont'!J264","v":3040},2.8733564102562923]
[1845,"Underground Conductors & Devices",582212,null,582212,{"$f":"SUM(F106,I106)","v":88961.790000000008},null,88961.790000000008,46334.51,29,3.4482758620689655E-2,40,2.5000000000000001E-2,20076.275862068964,2224.04475,579.181375,22879.501987068965,{"$f":"-'App.2-BA_Fixed Asset Cont'!J265","v":22908.02},28.518012931035628]
[1850,"Line Transformers",1020305,null,1020305,{"$f":"SUM(F107,I107)","v":234111.45},null,234111.45,20392.310000000001,29,3.4482758620689655E-2,40,2.5000000000000001E-2,35182.931034482761,5852.7862500000001,254.90387500000003,41290.621159482762,{"$f":"-'App.2-BA_Fixed Asset Cont'!J266","v":40549.050000000003},-741.57115948275896]
[1855,"Services (Overhead & Underground)",null,null,0,null,null,0,null,null,0,null,0,0,0,0,0,null,0]
[1860,"Meters",327572,181593,145979,{"$f":"SUM(F109,I109)","v":18953.010000000002},null,18953.010000000002,799.15,14,7.1428571428571425E-2,25,0.04,10427.071428571429,758.12040000000013,15.982999999999999,11201.174828571429,{"$f":"-'App.2-BA_Fixed Asset Cont'!J268","v":12653.83},1452.6551714285706]
[1860,"Meters (Smart Meters)",null,null,0,{"$f":"SUM(F110,I110)","v":662574},14890.08,647683.92000000004,4330.08,12,8.3333333333333329E-2,15,6.6666666666666666E-2,0,43178.928,144.33599999999998,43323.264000000003,{"$f":"-'App.2-BA_Fixed Asset Cont'!J269","v":42989.39},-333.87400000000343]
[1905,"Land",null,null,0,null,null,0,null,null,0,null,0,0,0,0,0,null,0]
[1908,"Buildings & Fixtures",null,null,0,null,null,0,null,null,0,null,0,0,0,0,0,null,0]
[1910,"Leasehold Improvements",null,null,0,null,null,0,null,null,0,null,0,0,0,0,0,null,0]
[1915,"Office Furniture & Equipment (10 years)",9103,null,9103,{"$f":"SUM(F114,I114)","v":8596.35},753.84,7842.51,298.95,7.79,0.12836970474967907,10,0.1,1168.5494223363287,784.25099999999998,14.9475,1967.7479223363287,{"$f":"-'App.2-BA_Fixed Asset Cont'!J273","v":1915.73},-52.017922336328638]
[1915,"Office Furniture & Equipment (5 years)",null,null,0,null,null,0,null,null,0,null,0,0,0,0,0,null,0]
[1920,"Computer Equipment - Hardware",null,null,0,null,null,0,null,null,0,null,0,0,0,0,0,null,0]
[1920,"Computer Equip.-Hardware(Post Mar. 22/04)",12678,1752.84,10925.16,{"$f":"SUM(F117,I117)","v":34962.259999999995},27009.85,7952.4099999999962,0,2.83,0.35335689045936397,5,0.2,3860.4805653710246,1590.4819999999993,0,5450.9625653710236,{"$f":"-'App.2-BA_Fixed Asset Cont'!J275","v":5069.7299999999996},-381.23256537102407]
[1920,"Computer Equip.-Hardware(Post Mar. 19/07)",null,null,0,null,null,0,null,null,0,null,0,0,0,0,0,null,0]
[1930,"Transportation Equipment (8 years)",34927.42,null,34927.42,{"$f":"SUM(F119,I119)","v":35425.160000000003},68429.88,-33004.720000000001,0,4.0999999999999996,0.24390243902439027,8,0.125,8518.8829268292684,-4125.59,0,4393.2929268292683,{"$f":"-'App.2-BA_Fixed Asset Cont'!J278","v":5140.92},747.62707317073182]
[1930,"Transportation Equipment ( 5 years)",18189.09,null,18189.09,54538.75,31183,23355.75,0,3,0.33333333333333331,5,0.2,6063.03,4671.1499999999996,0,10734.18,{"$f":"-'App.2-BA_Fixed Asset Cont'!J279","v":10907.75},173.56999999999971]
[1940,"Tools, Shop & Garage Equipment",15953,null,15953,23422.379999999997,null,23422.379999999997,3944.75,6.17,0.16207455429497569,10,0.1,2585.5753646677472,2342.2379999999998,197.23750000000001,5125.0508646677472,{"$f":"-'App.2-BA_Fixed Asset Cont'!J280","v":7466.34},2341.289135332253]
[1945,"Measurement & Testing Equipment",3220,null,3220,6144.75,8948.2900000000009,-2803.5400000000009,15389.3,2.69,0.37174721189591081,10,0.1,1197.0260223048328,-280.3540000000001,769.46499999999992,1686.1370223048327,{"$f":"-'App.2-BA_Fixed Asset Cont'!J281","v":1342.97},-343.1670223048327]
[1950,"Power Operated Equipment(8 years)",20231.25,null,20231.25,85090,null,85090,0,5.87,0.17035775127768313,8,0.125,3446.550255536627,10636.25,0,14082.800255536627,{"$f":"-'App.2-BA_Fixed Asset Cont'!J282","v":13561.25},-521.55025553662745]
[1950,"Power Operated Equipment(5 years)",2458.91,null,2458.91,14953.95,4215.29,10738.66,779,3.65,0.27397260273972601,5,{"$f":"IF(L197=0,0,1/L197)","v":0.2},{"$f":"IF(J197=0,0,+E197/J197)","v":673.6739726027397},{"$f":"IF(L197=0,0,+H197/L197)","v":2147.732},{"$f":"IF(L197=0,0,+(I197*0.5)/L197)","v":77.900000000000006},{"$f":"IF(ISERROR(+N197+O197+P197), 0, +N197+O197+P197)","v":2899.30597260274},{"$f":"-'App.2-BA_Fixed Asset Cont'!J283","v":3107.64},208.33402739725989]
[1955,"Communications Equipment",6980,null,6980,{"$f":"SUM(F125,I125)","v":16798.3},3494.5,13303.8,599,4.55,0.21978021978021978,10,0.1,1534.065934065934,1330.3799999999999,29.95,2894.3959340659339,{"$f":"-'App.2-BA_Fixed Asset Cont'!J284","v":2839.03},-55.365934065933743]
[1955,"Communication Equipment (Smart Meters)",null,null,0,null,null,0,null,null,0,null,0,0,0,0,0,null,0]
[1960,"Miscellaneous Equipment ",null,null,0,null,null,0,null,null,0,null,0,0,0,0,0,null,0]
[1970,"Load Management Controls Customer Premises",null,null,0,null,null,0,null,null,0,null,0,0,0,0,0,null,0]
[1975,"Load Management Controls Utility Premises",null,null,0,null,null,0,null,null,0,null,0,0,0,0,0,null,0]
[1980,"System Supervisor Equipment",null,null,0,null,null,0,null,null,0,null,0,0,0,0,0,null,0]
[1985,"Miscellaneous Fixed Assets",6711,276.06,6434.94,{"$f":"SUM(F131,I131)","v":4520.51},4028.3,492.21000000000004,0,5.37,0.18621973929236499,10,0.1,1198.3128491620112,49.221000000000004,0,1247.5338491620112,{"$f":"-'App.2-BA_Fixed Asset Cont'!J289","v":1240.45},-7.0838491620111199]
[1990,"Other Tangible Property",null,null,0,null,null,0,null,null,0,null,0,0,0,0,0,null,0]
[1995,"Contributions & Grants",-681468,null,{"$f":"C206-D206","v":-681468},{"$f":"SUM(F133,I133)","v":-190438.08},null,{"$f":"F206-G206","v":-190438.08},null,29,{"$f":"IF(J206=0,0,1/J206)","v":3.4482758620689655E-2},40,{"$f":"IF(L206=0,0,1/L206)","v":2.5000000000000001E-2},{"$f":"IF(J206=0,0,+E206/J206)","v":-23498.896551724138},{"$f":"IF(L206=0,0,+H206/L206)","v":-4760.9519999999993},{"$f":"IF(L206=0,0,+(I206*0.5)/L206)","v":0},{"$f":"IF(ISERROR(+N206+O206+P206), 0, +N206+O206+P206)","v":-28259.848551724135},{"$f":"-'App.2-BA_Fixed Asset Cont'!J291","v":-31626.400000000001},{"$f":"IF(ISERROR(+R206-122), 0, +R206-Q206)","v":-3366.5514482758663}]
[2440,"Deferred Revenue",null,null,0,{"$f":"SUM(F134,I134)","v":-40513},null,-40513,-29695.84,null,0,40,2.5000000000000001E-2,0,-1012.825,-371.19799999999998,-1384.0230000000001,{"$f":"-'App.2-BA_Fixed Asset Cont'!J292","v":-2477.2600000000002},-1093.2370000000001]
[null,"Total",{"$f":"SUM(C168:C207)","v":4451731.67},198447.58,4253284.0900000008,1865415.67,220237.67,1645177.9999999998,301123.08,null,null,null,null,{"$f":"SUM(N168:N207)","v":166711.04434318983},88327.57655555557,4350.140994444444,259388.76189318983,259282.84000000011,-105.92189318987857]
[]
[]
["General:","Applicants are to complete this appendix to show the reasonability of the depreciation expense that is included in rate base via. Accumulated depreciation and the revenue requirement."]
[null,"Applicants must provide a breakdown of depreciation and amortization expense in the above format for all relevant accounts.  Balances presented in the table should exclude asset retirement obligations (AROs) and the related depreciation and accretion expense. These should be disclosed separately consistent with the Notes of historical Audited Financial Statements."]
[]
[]
["Notes:"]
[1,"This is the net book value of assets that existed as at the date of the utility's change in depreciation policies (i.e. as at Jan. 1, 2012 or Jan. 1, 2013).  These assets are to be depreciated at the average remaining service life. This amount will not change in years subsequent to the date of the utility's change in depreciation policies.  This column is expected to be used until the assets that existed as at the date of the utility's change in depreciation policies are fully depreciated."]
[2,"This is the opening gross book value of assets that have been acquired after the date of the utilities change in depreciation policies (i.e. additions starting in 2012/2013 for those who changed policies Jan. 1, 2012/2013). These assets are to be depreciated at the revised service life. The amount is expected to be equal to the gross book value of the prior year plus the prior year's additions."]
[3,"A recalculation should be performed to determine the average remaining life of opening balance of assets (i.e. excluding current year's additions) under the change in policies under CGAAP.  For example, Asset A had a useful life of 20 years under CGAAP without the change in policies.  On January 1 of the year of policy changes, Asset A was 3 years depreciated. As a result, Asset A would have a remaining service life of 17 years (20 years less 3 years) as at January 1 of the year of policy changes.  Due to making the change in policies under CGAAP, management re-assessed the asset useful lives and concluded that the revised useful life of Asset A is now 30 years. Therefore, the average remaining useful life of the opening balance of Asset A is determined to be 27 years (30 years less 3 years) under the revised CGAAP as at January 1 of the year of policy changes."]
[4,"The useful life used should be consistent with the OEB's regulatory accounting policies as set out in the  Accounting Procedures Handbook for Electricity Distributors, effective Jan. 1, 2012 and also with the Report of the Board, Transition to International Financial Reporting Standards, EB-2008-0408, and the Kinectrics Report."]
[5,"Board policy of the \"half-year\" rule - the applicant must ensure that additions in the year attract a half-year depreciation expense in the first year.  Deviations from this standard practice must be supported in the application."]
[6,"The applicant must provide an explanation of material variances in evidence."]
[7,"This should include assets in column a (excel column C) that become fully depreciated since the date of the policy change.  The amount input in b (excel column D) should equal the net book value of the asset as at the date of depreciation policy change"]
[8,"This should include assets in column d (excel column f) that have become fully depreciated.  The amount input in e (excel column G) should equal the gross book value of the asset"]
[]
[]
[]
[]
[]
["Appendix 2-C"]
["Depreciation and Amortization Expense"]
[]
["This appendix is to be completed in conjunction with the accounting instructions in Appendix 2-B"]
[]
["Scenario that applies",null,"Applicable Years and Accounting Standard",null,null,null,null,null,null,null,null,null,null,null,null,null,null,"Year Reflected in Schedule Below","Accounting Standard Reflected in Schedule Below"]
["Rebasing for the first time with depreciation policy changes made in 2012.",null,"This appendix must be duplicated and completed for the years 2012 to 2018. The appendix for 2012 is to be completed under CGAAP (prior to changes in depreciation policies). The appendix for 2012 to 2014 must be completed under Revised CGAAP (after changes in depreciation policies). The appendix for 2014 to 2018 is to be completed under MIFRS (2014 if changes to MIFRS are material)."]
["Rebasing for the first time with depreciation policy changes made in 2013.",null,"This appendix must be duplicated and completed for the years 2013 to 2018. The appendix for 2013 is to be completed under CGAAP (prior to changes in depreciation policies). The appendix for 2013 to 2014 must be completed under Revised CGAAP (after changes in depreciation policies). The appendix for 2014 to 2018 is to be completed under MIFRS (2014 if changes to MIFRS are material)."]
["Already rebased with depreciation policy changes in a prior rate application",null,"This appendix must be completed for 2014 to 2018. The appendix for 2014 is to be completed under Revised CGAAP (after changes in depreciation policies). The appendix for 2014 to 2018 is to be completed under MIFRS (2014 if changes to MIFRS are material).",null,null,null,null,null,null,null,null,null,null,null,null,null,null,2017,"MIFRS"]
[]
[]
[null,null,"Book Values",null,null,null,null,null,null,"Service Lives",null,null,null,"Depreciation Expense"]
["Account","Description","Opening Net  Book Value of Existing Assets as at Date of Policy Change (Jan. 1) 1","Less Fully Depreciated 7","Net Amount of Existing Assets Before Policy Change to be Depreciated ","Opening Gross Book Value of Assets Acquired After Policy Change 2","Less Fully Depreciated 8","Net Amount of Assets Acquired After Policy Change to be Depreciated ","Current Year Additions","Average Remaining Life of Assets Existing Before Policy Change 3","Depreciation Rate Assets Acquired After Policy Change","Life of Assets Acquired After Policy Change 4","Depreciation Rate on New Additions","Depreciation Expense on Assets Existing Before Policy Change","Depreciation Expense on Assets Acquired After Policy Change","Depreciation Expense on Current Year Additions 5","Total Current Year Depreciation Expense ","Depreciation Expense per Appendix 2-BA Fixed Assets, Column J \n ","Variance 6"]
[null,null,"a","b","c = a-b","d","e","f = d- e","g","h","i = 1/h","j","k = 1/j","l = c/h","m = f/j","n = g*0.5/j","o = l+m+n","p","q = p-o"]
[1611,"Computer Software (Formally known as Account 1925)",24240,14825.68,{"$f":"C243-D243","v":9414.32},{"$f":"SUM(F168,I168)","v":92752.639999999999},79784.639999999999,{"$f":"F243-G243","v":12968},45000,3.27,{"$f":"IF(J243=0,0,1/J243)","v":0.3058103975535168},5,{"$f":"IF(L243=0,0,1/L243)","v":0.2},{"$f":"IF(J243=0,0,+E243/J243)","v":2878.9969418960245},{"$f":"IF(L243=0,0,+H243/L243)","v":2593.6},{"$f":"IF(L243=0,0,+(I243*0.5)/L243)","v":4500},{"$f":"IF(ISERROR(+N243+O243+P243), 0, +N243+O243+P243)","v":9972.5969418960249},{"$f":"-'App.2-BA_Fixed Asset Cont'!J314","v":8403},{"$f":"IF(ISERROR(+R243-122), 0, +R243-Q243)","v":-1569.5969418960249}]
[1612,"Land Rights (Formally known as Account 1906)",null,null,{"$f":"C244-D244","v":0},null,null,{"$f":"F244-G244","v":0},null,null,{"$f":"IF(J244=0,0,1/J244)","v":0},null,{"$f":"IF(L244=0,0,1/L244)","v":0},{"$f":"IF(J244=0,0,+E244/J244)","v":0},{"$f":"IF(L244=0,0,+H244/L244)","v":0},{"$f":"IF(L244=0,0,+(I244*0.5)/L244)","v":0},{"$f":"IF(ISERROR(+N244+O244+P244), 0, +N244+O244+P244)","v":0},null,{"$f":"IF(ISERROR(+R244-122), 0, +R244-Q244)","v":0}]
[1805,"Land",null,null,0,null,null,0,null,null,0,null,0,0,{"$f":"IF(L245=0,0,+H245/L245)","v":0},0,0,null,0]
[1808,"Buildings",50840,null,50840,{"$f":"SUM(F171,I171)","v":0},null,0,null,14,7.1428571428571425E-2,25,0.04,3631.4285714285716,0,0,3631.4285714285716,{"$f":"-'App.2-BA_Fixed Asset Cont'!J317","v":3675},43.571428571428442]
[1810,"Leasehold Improvements",null,null,0,null,null,0,null,null,0,null,0,0,0,0,0,null,0]
[1815,"Transformer Station Equipment >50 kV",null,null,0,null,null,0,null,null,0,null,0,0,0,0,0,null,0]
[1820,"Distribution Station Equipment <50 kV",null,null,0,null,null,0,null,null,0,null,0,0,0,0,0,null,0]
[1825,"Storage Battery Equipment",null,null,0,null,null,0,null,null,0,null,0,0,0,0,0,null,0]
[1830,"Poles, Towers & Fixtures",2287202,null,2287202,{"$f":"SUM(F176,I176)","v":858257.14},null,858257.14,177309,34,2.9411764705882353E-2,45,2.2222222222222223E-2,67270.647058823524,19072.380888888889,1970.1,88313.127947712419,{"$f":"-'App.2-BA_Fixed Asset Cont'!J322","v":87458},-855.12794771241897]
[1835,"Overhead Conductors & Devices",605093,null,605093,{"$f":"SUM(F177,I177)","v":74465.62},null,74465.62,116126,34,2.9411764705882353E-2,45,2.2222222222222223E-2,17796.852941176472,1654.7915555555555,1290.2888888888888,20741.933385620916,{"$f":"-'App.2-BA_Fixed Asset Cont'!J323","v":20705},-36.933385620915942]
[1840,"Underground Conduit",105284,null,105284,{"$f":"SUM(F178,I178)","v":19790.559999999998},null,19790.559999999998,2800,39,2.564102564102564E-2,50,0.02,2699.5897435897436,395.81119999999993,28,3123.4009435897437,{"$f":"-'App.2-BA_Fixed Asset Cont'!J324","v":3187},63.599056410256253]
[1845,"Underground Conductors & Devices",582212,null,582212,{"$f":"SUM(F179,I179)","v":135296.30000000002},null,135296.30000000002,49012,29,3.4482758620689655E-2,40,2.5000000000000001E-2,20076.275862068964,3382.4075000000003,612.65,24071.333362068966,{"$f":"-'App.2-BA_Fixed Asset Cont'!J325","v":24115},43.66663793103362]
[1850,"Line Transformers",1020305,null,1020305,{"$f":"SUM(F180,I180)","v":254503.76},null,254503.76,143477,29,3.4482758620689655E-2,40,2.5000000000000001E-2,35182.931034482761,6362.5940000000001,1793.4625000000001,43338.98753448276,{"$f":"-'App.2-BA_Fixed Asset Cont'!J326","v":42604},-734.98753448275966]
[1855,"Services (Overhead & Underground)",null,null,0,null,null,0,null,null,0,null,0,0,0,0,0,null,0]
[1860,"Meters",327572,181593,145979,{"$f":"SUM(F182,I182)","v":19752.160000000003},null,19752.160000000003,918,14,7.1428571428571425E-2,25,0.04,10427.071428571429,790.08640000000014,18.36,11235.51782857143,{"$f":"-'App.2-BA_Fixed Asset Cont'!J328","v":12688},1452.4821714285699]
[1860,"Meters (Smart Meters)",null,null,0,{"$f":"SUM(F183,I183)","v":666904.07999999996},14890,652014.07999999996,16712,12,8.3333333333333329E-2,15,6.6666666666666666E-2,0,43467.605333333333,557.06666666666672,44024.671999999999,{"$f":"-'App.2-BA_Fixed Asset Cont'!J329","v":43465},-559.67199999999866]
[1905,"Land",null,null,0,null,null,0,null,null,0,null,0,0,0,0,0,null,0]
[1908,"Buildings & Fixtures",null,null,0,null,null,0,null,null,0,null,0,0,0,0,0,null,0]
[1910,"Leasehold Improvements",null,null,0,null,null,0,null,null,0,null,0,0,0,0,0,null,0]
[1915,"Office Furniture & Equipment (10 years)",9103,null,9103,{"$f":"SUM(F187,I187)","v":8895.3000000000011},1847.72,7047.5800000000008,2000,7.79,0.12836970474967907,10,0.1,1168.5494223363287,704.75800000000004,100,1973.3074223363287,{"$f":"-'App.2-BA_Fixed Asset Cont'!J333","v":1921},-52.307422336328727]
[1915,"Office Furniture & Equipment (5 years)",null,null,0,null,null,0,null,null,0,null,0,0,0,0,0,null,0]
[1920,"Computer Equipment - Hardware",null,null,0,null,null,0,null,null,0,null,0,0,0,0,0,null,0]
[1920,"Computer Equip.-Hardware(Post Mar. 22/04)",12678,1752.84,10925.16,{"$f":"SUM(F190,I190)","v":34962.259999999995},29346.85,5615.4099999999962,2000,2.83,0.35335689045936397,5,0.2,3860.4805653710246,1123.0819999999992,200,5183.562565371024,{"$f":"-'App.2-BA_Fixed Asset Cont'!J335","v":4958},-225.56256537102399]
[1920,"Computer Equip.-Hardware(Post Mar. 19/07)",null,null,0,null,null,0,null,null,0,null,0,0,0,0,0,null,0]
[1930,"Transportation Equipment (8 years)",34927.42,null,34927.42,{"$f":"SUM(F192,I192)","v":35425.160000000003},68429.88,-33004.720000000001,null,4.0999999999999996,0.24390243902439027,8,0.125,8518.8829268292684,-4125.59,0,4393.2929268292683,{"$f":"-'App.2-BA_Fixed Asset Cont'!J338","v":4428},34.707073170731746]
[1930,"Transportation Equipment ( 5 years)",18189.09,null,18189.09,54538.75,31183,23355.75,35000,3,0.33333333333333331,5,0.2,6063.03,4671.1499999999996,3500,14234.18,{"$f":"-'App.2-BA_Fixed Asset Cont'!J339","v":14408},173.81999999999971]
[1940,"Tools, Shop & Garage Equipment",15953,null,15953,27367.129999999997,23822.09,3545.0399999999972,5000,6.17,0.16207455429497569,10,0.1,2585.5753646677472,354.50399999999973,250,3190.0793646677471,{"$f":"-'App.2-BA_Fixed Asset Cont'!J340","v":2703.87},-486.2093646677472]
[1945,"Measurement & Testing Equipment",3220,null,3220,21534.05,9820.92,11713.13,null,2.69,0.37174721189591081,10,0.1,1197.0260223048328,1171.3129999999999,0,2368.3390223048327,{"$f":"-'App.2-BA_Fixed Asset Cont'!J341","v":2153},-215.33902230483272]
[1950,"Power Operated Equipment(8 years)",20231.25,null,20231.25,85090,null,85090,null,5.87,0.17035775127768313,8,0.125,3446.550255536627,10636.25,0,14082.800255536627,{"$f":"-'App.2-BA_Fixed Asset Cont'!J342","v":13561.25},-521.55025553662745]
[1950,"Power Operated Equipment(5 years)",2458.91,null,2458.91,15732.95,4215.29,11517.66,null,3.65,0.27397260273972601,5,0.2,673.6739726027397,2303.5320000000002,{"$f":"IF(L272=0,0,+(I272*0.5)/L272)","v":0},{"$f":"IF(ISERROR(+N272+O272+P272), 0, +N272+O272+P272)","v":2977.2059726027401},{"$f":"-'App.2-BA_Fixed Asset Cont'!J343","v":3062.59},85.38402739726007]
[1955,"Communications Equipment",6980,null,6980,17397.3,11313.61,6083.6899999999987,null,4.55,0.21978021978021978,10,0.1,1534.065934065934,608.36899999999991,0,2142.4349340659337,{"$f":"-'App.2-BA_Fixed Asset Cont'!J344","v":2082},-60.434934065933703]
[1955,"Communication Equipment (Smart Meters)",null,null,0,null,null,0,null,null,0,null,0,0,0,0,0,null,0]
[1960,"Miscellaneous Equipment ",null,null,0,null,null,0,null,null,0,null,0,0,0,0,0,null,0]
[1970,"Load Management Controls Customer Premises",null,null,0,null,null,0,null,null,0,null,0,0,0,0,0,null,0]
[1975,"Load Management Controls Utility Premises",null,null,0,null,null,0,null,null,0,null,0,0,0,0,0,null,0]
[1980,"System Supervisor Equipment",null,null,0,null,null,0,null,null,0,null,0,0,0,0,0,null,0]
[1985,"Miscellaneous Fixed Assets",6711,276.06,6434.94,{"$f":"SUM(F204,I204)","v":4520.51},6098.54,-1578.0299999999997,300,5.37,0.18621973929236499,10,0.1,1198.3128491620112,-157.80299999999997,15,1055.5098491620113,{"$f":"-'App.2-BA_Fixed Asset Cont'!J349","v":1033},-22.509849162011278]
[1990,"Other Tangible Property",null,null,0,null,null,0,null,null,0,null,0,0,0,0,0,null,0]
[1995,"Contributions & Grants",-681468,null,{"$f":"C281-D281","v":-681468},{"$f":"SUM(F206,I206)","v":-190438.08},null,{"$f":"F281-G281","v":-190438.08},null,29,{"$f":"IF(J281=0,0,1/J281)","v":3.4482758620689655E-2},40,{"$f":"IF(L281=0,0,1/L281)","v":2.5000000000000001E-2},{"$f":"IF(J281=0,0,+E281/J281)","v":-23498.896551724138},{"$f":"IF(L281=0,0,+H281/L281)","v":-4760.9519999999993},{"$f":"IF(L281=0,0,+(I281*0.5)/L281)","v":0},{"$f":"IF(ISERROR(+N281+O281+P281), 0, +N281+O281+P281)","v":-28259.848551724135},{"$f":"-'App.2-BA_Fixed Asset Cont'!J351","v":-31626},{"$f":"IF(ISERROR(+R281-122), 0, +R281-Q281)","v":-3366.1514482758648}]
[2440,"Deferred Revenue",null,null,0,{"$f":"SUM(F207,I207)","v":-70208.84},null,-70208.84,-170000,null,0,40,2.5000000000000001E-2,0,-1755.221,-2125,-3880.221,{"$f":"-'App.2-BA_Fixed Asset Cont'!J352","v":-4955},-1074.779]
[null,"Total",{"$f":"SUM(C243:C282)","v":4451731.67},198447.58,4253284.0900000008,2166538.7499999991,280752.53999999998,1885786.2100000002,425654,null,null,null,null,{"$f":"SUM(N243:N282)","v":166711.04434318983},88492.66887777776,12709.928055555556,267913.64127652324,260029.71000000002,-7883.931276523208]
[]
[]
["General:","Applicants are to complete this appendix to show the reasonability of the depreciation expense that is included in rate base via. Accumulated depreciation and the revenue requirement."]
[null,"Applicants must provide a breakdown of depreciation and amortization expense in the above format for all relevant accounts.  Balances presented in the table should exclude asset retirement obligations (AROs) and the related depreciation and accretion expense. These should be disclosed separately consistent with the Notes of historical Audited Financial Statements."]
[]
[]
["Notes:"]
[1,"This is the net book value of assets that existed as at the date of the utility's change in depreciation policies (i.e. as at Jan. 1, 2012 or Jan. 1, 2013).  These assets are to be depreciated at the average remaining service life. This amount will not change in years subsequent to the date of the utility's change in depreciation policies.  This column is expected to be used until the assets that existed as at the date of the utility's change in depreciation policies are fully depreciated."]
[2,"This is the opening gross book value of assets that have been acquired after the date of the utilities change in depreciation policies (i.e. additions starting in 2012/2013 for those who changed policies Jan. 1, 2012/2013). These assets are to be depreciated at the revised service life. The amount is expected to be equal to the gross book value of the prior year plus the prior year's additions."]
[3,"A recalculation should be performed to determine the average remaining life of opening balance of assets (i.e. excluding current year's additions) under the change in policies under CGAAP.  For example, Asset A had a useful life of 20 years under CGAAP without the change in policies.  On January 1 of the year of policy changes, Asset A was 3 years depreciated. As a result, Asset A would have a remaining service life of 17 years (20 years less 3 years) as at January 1 of the year of policy changes.  Due to making the change in policies under CGAAP, management re-assessed the asset useful lives and concluded that the revised useful life of Asset A is now 30 years. Therefore, the average remaining useful life of the opening balance of Asset A is determined to be 27 years (30 years less 3 years) under the revised CGAAP as at January 1 of the year of policy changes."]
[4,"The useful life used should be consistent with the OEB's regulatory accounting policies as set out in the  Accounting Procedures Handbook for Electricity Distributors, effective Jan. 1, 2012 and also with the Report of the Board, Transition to International Financial Reporting Standards, EB-2008-0408, and the Kinectrics Report."]
[5,"Board policy of the \"half-year\" rule - the applicant must ensure that additions in the year attract a half-year depreciation expense in the first year.  Deviations from this standard practice must be supported in the application."]
[6,"The applicant must provide an explanation of material variances in evidence."]
[7,"This should include assets in column a (excel column C) that become fully depreciated since the date of the policy change.  The amount input in b (excel column D) should equal the net book value of the asset as at the date of depreciation policy change"]
[8,"This should include assets in column d (excel column f) that have become fully depreciated.  The amount input in e (excel column G) should equal the gross book value of the asset"]
[]
[]
[]
[]
["Appendix 2-C"]
["Depreciation and Amortization Expense"]
[]
["This appendix is to be completed in conjunction with the accounting instructions in Appendix 2-B"]
[]
["Scenario that applies",null,"Applicable Years and Accounting Standard",null,null,null,null,null,null,null,null,null,null,null,null,null,null,"Year Reflected in Schedule Below","Accounting Standard Reflected in Schedule Below"]
["Rebasing for the first time with depreciation policy changes made in 2012.",null,"This appendix must be duplicated and completed for the years 2012 to 2018. The appendix for 2012 is to be completed under CGAAP (prior to changes in depreciation policies). The appendix for 2012 to 2014 must be completed under Revised CGAAP (after changes in depreciation policies). The appendix for 2014 to 2018 is to be completed under MIFRS (2014 if changes to MIFRS are material)."]
["Rebasing for the first time with depreciation policy changes made in 2013.",null,"This appendix must be duplicated and completed for the years 2013 to 2018. The appendix for 2013 is to be completed under CGAAP (prior to changes in depreciation policies). The appendix for 2013 to 2014 must be completed under Revised CGAAP (after changes in depreciation policies). The appendix for 2014 to 2018 is to be completed under MIFRS (2014 if changes to MIFRS are material)."]
["Already rebased with depreciation policy changes in a prior rate application",null,"This appendix must be completed for 2014 to 2018. The appendix for 2014 is to be completed under Revised CGAAP (after changes in depreciation policies). The appendix for 2014 to 2018 is to be completed under MIFRS (2014 if changes to MIFRS are material).",null,null,null,null,null,null,null,null,null,null,null,null,null,null,2018,"MIFRS"]
[]
[]
[null,null,"Book Values",null,null,null,null,null,null,"Service Lives",null,null,null,"Depreciation Expense"]
["Account","Description","Opening Net  Book Value of Existing Assets as at Date of Policy Change (Jan. 1) 1","Less Fully Depreciated 7","Net Amount of Existing Assets Before Policy Change to be Depreciated ","Opening Gross Book Value of Assets Acquired After Policy Change 2","Less Fully Depreciated 8","Net Amount of Assets Acquired After Policy Change to be Depreciated ","Current Year Additions","Average Remaining Life of Assets Existing Before Policy Change 3","Depreciation Rate Assets Acquired After Policy Change","Life of Assets Acquired After Policy Change 4","Depreciation Rate on New Additions","Depreciation Expense on Assets Existing Before Policy Change","Depreciation Expense on Assets Acquired After Policy Change","Depreciation Expense on Current Year Additions 5","Total Current Year Depreciation Expense ","Depreciation Expense per Appendix 2-BA Fixed Assets, Column J \n ","Variance 6"]
[null,null,"a","b","c = a-b","d","e","f = d- e","g","h","i = 1/h","j","k = 1/j","l = c/h","m = f/j","n = g*0.5/j","o = l+m+n","p","q = p-o"]
[1611,"Computer Software (Formally known as Account 1925)",24240,14825.68,{"$f":"C317-D317","v":9414.32},{"$f":"SUM(F243,I243)","v":137752.64000000001},79784.639999999999,{"$f":"F317-G317","v":57968.000000000015},0,3.27,{"$f":"IF(J317=0,0,1/J317)","v":0.3058103975535168},5,{"$f":"IF(L317=0,0,1/L317)","v":0.2},{"$f":"IF(J317=0,0,+E317/J317)","v":2878.9969418960245},{"$f":"IF(L317=0,0,+H317/L317)","v":11593.600000000002},{"$f":"IF(L317=0,0,+(I317*0.5)/L317)","v":0},{"$f":"IF(ISERROR(+N317+O317+P317), 0, +N317+O317+P317)","v":14472.596941896027},{"$f":"-'App.2-BA_Fixed Asset Cont'!J373","v":12903},{"$f":"IF(ISERROR(+R317-122), 0, +R317-Q317)","v":-1569.5969418960267}]
[1612,"Land Rights (Formally known as Account 1906)",null,null,{"$f":"C318-D318","v":0},null,null,{"$f":"F318-G318","v":0},null,null,{"$f":"IF(J318=0,0,1/J318)","v":0},null,{"$f":"IF(L318=0,0,1/L318)","v":0},{"$f":"IF(J318=0,0,+E318/J318)","v":0},{"$f":"IF(L318=0,0,+H318/L318)","v":0},{"$f":"IF(L318=0,0,+(I318*0.5)/L318)","v":0},{"$f":"IF(ISERROR(+N318+O318+P318), 0, +N318+O318+P318)","v":0},null,{"$f":"IF(ISERROR(+R318-122), 0, +R318-Q318)","v":0}]
[1805,"Land",null,null,0,null,null,0,null,null,0,null,0,0,{"$f":"IF(L319=0,0,+H319/L319)","v":0},0,0,null,0]
[1808,"Buildings",50840,null,50840,{"$f":"SUM(F246,I246)","v":0},null,0,null,14,7.1428571428571425E-2,25,0.04,3631.4285714285716,0,0,3631.4285714285716,{"$f":"-'App.2-BA_Fixed Asset Cont'!J376","v":3675},43.571428571428442]
[1810,"Leasehold Improvements",null,null,0,null,null,0,null,null,0,null,0,0,0,0,0,null,0]
[1815,"Transformer Station Equipment >50 kV",null,null,0,null,null,0,null,null,0,null,0,0,0,0,0,null,0]
[1820,"Distribution Station Equipment <50 kV",null,null,0,null,null,0,null,null,0,null,0,0,0,0,0,null,0]
[1825,"Storage Battery Equipment",null,null,0,null,null,0,null,null,0,null,0,0,0,0,0,null,0]
[1830,"Poles, Towers & Fixtures",2287202,null,2287202,{"$f":"SUM(F251,I251)","v":1035566.14},null,1035566.14,173504,34,2.9411764705882353E-2,45,2.2222222222222223E-2,67270.647058823524,23012.58088888889,1927.8222222222223,92211.050169934635,{"$f":"-'App.2-BA_Fixed Asset Cont'!J381","v":91299},-912.05016993463505]
[1835,"Overhead Conductors & Devices",605093,null,605093,{"$f":"SUM(F252,I252)","v":190591.62},null,190591.62,3200,34,2.9411764705882353E-2,45,2.2222222222222223E-2,17796.852941176472,4235.3693333333331,35.555555555555557,22067.777830065359,{"$f":"-'App.2-BA_Fixed Asset Cont'!J382","v":22046},-21.777830065359012]
[1840,"Underground Conduit",105284,null,105284,{"$f":"SUM(F253,I253)","v":22590.559999999998},null,22590.559999999998,1200,39,2.564102564102564E-2,50,0.02,2699.5897435897436,451.81119999999993,12,3163.4009435897437,{"$f":"-'App.2-BA_Fixed Asset Cont'!J383","v":3168},4.599056410256253]
[1845,"Underground Conductors & Devices",582212,null,582212,{"$f":"SUM(F254,I254)","v":184308.30000000002},null,184308.30000000002,35000,29,3.4482758620689655E-2,40,2.5000000000000001E-2,20076.275862068964,4607.7075000000004,437.5,25121.483362068964,{"$f":"-'App.2-BA_Fixed Asset Cont'!J384","v":25181},59.516637931035802]
[1850,"Line Transformers",1020305,null,1020305,{"$f":"SUM(F255,I255)","v":397980.76},null,397980.76,41425,29,3.4482758620689655E-2,40,2.5000000000000001E-2,35182.931034482761,9949.5190000000002,517.8125,45650.262534482761,{"$f":"-'App.2-BA_Fixed Asset Cont'!J385","v":44961},-689.26253448276111]
[1855,"Services (Overhead & Underground)",null,null,0,null,null,0,null,null,0,null,0,0,0,0,0,null,0]
[1860,"Meters",327572,181593,145979,{"$f":"SUM(F257,I257)","v":20670.160000000003},null,20670.160000000003,0,14,7.1428571428571425E-2,25,0.04,10427.071428571429,826.80640000000017,0,11253.877828571429,{"$f":"-'App.2-BA_Fixed Asset Cont'!J387","v":12707},1453.1221714285712]
[1860,"Meters (Smart Meters)",null,null,0,{"$f":"SUM(F258,I258)","v":683616.08},16669.89,666946.18999999994,0,12,8.3333333333333329E-2,15,6.6666666666666666E-2,0,44463.079333333328,0,44463.079333333328,{"$f":"-'App.2-BA_Fixed Asset Cont'!J388","v":43797},-666.07933333332767]
[1905,"Land",null,null,0,null,null,0,null,null,0,null,0,0,0,0,0,null,0]
[1908,"Buildings & Fixtures",null,null,0,null,null,0,null,null,0,null,0,0,0,0,0,null,0]
[1910,"Leasehold Improvements",null,null,0,null,null,0,null,null,0,null,0,0,0,0,0,null,0]
[1915,"Office Furniture & Equipment (10 years)",9103,null,9103,{"$f":"SUM(F262,I262)","v":10895.300000000001},1847.72,9047.5800000000017,2000,7.79,0.12836970474967907,10,0.1,1168.5494223363287,904.75800000000015,100,2173.3074223363287,{"$f":"-'App.2-BA_Fixed Asset Cont'!J392","v":2031},-142.30742233632873]
[1915,"Office Furniture & Equipment (5 years)",null,null,0,null,null,0,null,null,0,null,0,0,0,0,0,null,0]
[1920,"Computer Equipment - Hardware",null,null,0,null,null,0,null,null,0,null,0,0,0,0,0,null,0]
[1920,"Computer Equip.-Hardware(Post Mar. 22/04)",12678,1752.84,10925.16,{"$f":"SUM(F265,I265)","v":36962.259999999995},29346.85,7615.4099999999962,2000,2.83,0.35335689045936397,5,0.2,3860.4805653710246,1523.0819999999992,200,5583.562565371024,{"$f":"-'App.2-BA_Fixed Asset Cont'!J394","v":4700},-883.56256537102399]
[1920,"Computer Equip.-Hardware(Post Mar. 19/07)",null,null,0,null,null,0,null,null,0,null,0,0,0,0,0,null,0]
[1930,"Transportation Equipment (8 years)",34927.42,null,34927.42,{"$f":"SUM(F267,I267)","v":35425.160000000003},103855.03999999999,-68429.87999999999,355000,4.0999999999999996,0.24390243902439027,8,0.125,8518.8829268292684,-8553.7349999999988,22187.5,22152.647926829268,{"$f":"-'App.2-BA_Fixed Asset Cont'!J397","v":22187.5},34.852073170732183]
[1930,"Transportation Equipment ( 5 years)",18189.09,null,18189.09,{"$f":"SUM(F268,I268)","v":89538.75},31183,58355.75,0,3,0.33333333333333331,5,0.2,6063.03,11671.15,0,17734.18,{"$f":"-'App.2-BA_Fixed Asset Cont'!J398","v":17908},173.81999999999971]
[1940,"Tools, Shop & Garage Equipment",15953,null,15953,32367.129999999997,23822.09,8545.0399999999972,5000,6.17,0.16207455429497569,10,0.1,2585.5753646677472,854.50399999999968,250,3690.0793646677466,{"$f":"-'App.2-BA_Fixed Asset Cont'!J399","v":2894.92},-795.15936466774656]
[1945,"Measurement & Testing Equipment",3220,null,3220,21534.05,9820.92,11713.13,null,2.69,0.37174721189591081,10,0.1,1197.0260223048328,1171.3129999999999,0,2368.3390223048327,{"$f":"-'App.2-BA_Fixed Asset Cont'!J400","v":2153},-215.33902230483272]
[1950,"Power Operated Equipment(8 years)",20231.25,null,20231.25,85090,null,85090,null,5.87,0.17035775127768313,8,0.125,3446.550255536627,10636.25,0,14082.800255536627,{"$f":"-'App.2-BA_Fixed Asset Cont'!J401","v":13317.5},-765.30025553662745]
[1950,"Power Operated Equipment(5 years)",2458.91,null,2458.91,15732.95,4935.24,10797.710000000001,null,3.65,0.27397260273972601,5,0.2,{"$f":"IF(J346=0,0,+E346/J346)","v":673.6739726027397},{"$f":"IF(L346=0,0,+H346/L346)","v":2159.5420000000004},{"$f":"IF(L346=0,0,+(I346*0.5)/L346)","v":0},{"$f":"IF(ISERROR(+N346+O346+P346), 0, +N346+O346+P346)","v":2833.2159726027403},{"$f":"-'App.2-BA_Fixed Asset Cont'!J402","v":3002.6},169.38402739725962]
[1955,"Communications Equipment",6980,null,6980,17397.3,12581.29,4816.0099999999984,null,4.55,0.21978021978021978,10,0.1,1534.065934065934,481.60099999999983,0,2015.6669340659339,{"$f":"-'App.2-BA_Fixed Asset Cont'!J403","v":1955},-60.666934065933901]
[1955,"Communication Equipment (Smart Meters)",null,null,0,null,null,0,null,null,0,null,0,0,0,0,0,null,0]
[1960,"Miscellaneous Equipment ",null,null,0,null,null,0,null,null,0,null,0,0,0,0,0,null,0]
[1970,"Load Management Controls Customer Premises",null,null,0,null,null,0,null,null,0,null,0,0,0,0,0,null,0]
[1975,"Load Management Controls Utility Premises",null,null,0,null,null,0,null,null,0,null,0,0,0,0,0,null,0]
[1980,"System Supervisor Equipment",null,null,0,null,null,0,null,null,0,null,0,0,0,0,0,null,0]
[1985,"Miscellaneous Fixed Assets",6711,276.06,6434.94,{"$f":"SUM(F279,I279)","v":4820.51},7506.84,-2686.33,null,5.37,0.18621973929236499,10,0.1,1198.3128491620112,-268.63299999999998,0,929.67984916201112,{"$f":"-'App.2-BA_Fixed Asset Cont'!J408","v":893},-36.679849162011124]
[1990,"Other Tangible Property",null,null,0,null,null,0,null,null,0,null,0,0,0,0,0,null,0]
[1995,"Contributions & Grants",-681468,null,{"$f":"C355-D355","v":-681468},{"$f":"SUM(F281,I281)","v":-190438.08},null,{"$f":"F355-G355","v":-190438.08},null,29,{"$f":"IF(J355=0,0,1/J355)","v":3.4482758620689655E-2},40,{"$f":"IF(L355=0,0,1/L355)","v":2.5000000000000001E-2},{"$f":"IF(J355=0,0,+E355/J355)","v":-23498.896551724138},{"$f":"IF(L355=0,0,+H355/L355)","v":-4760.9519999999993},{"$f":"IF(L355=0,0,+(I355*0.5)/L355)","v":0},{"$f":"IF(ISERROR(+N355+O355+P355), 0, +N355+O355+P355)","v":-28259.848551724135},{"$f":"-'App.2-BA_Fixed Asset Cont'!J410","v":-31626},{"$f":"IF(ISERROR(+R355-122), 0, +R355-Q355)","v":-3366.1514482758648}]
[2440,"Deferred Revenue",null,null,0,{"$f":"SUM(F282,I282)","v":-240208.84},null,-240208.84,-30000,null,0,40,2.5000000000000001E-2,0,-6005.2209999999995,-375,-6380.2209999999995,{"$f":"-'App.2-BA_Fixed Asset Cont'!J411","v":-7468},-1087.7790000000005]
[null,"Total",{"$f":"SUM(C317:C356)","v":4451731.67},198447.58,4253284.0900000008,2592192.7499999991,321353.52,2270839.2300000004,588329,null,null,null,null,{"$f":"SUM(N317:N356)","v":166711.04434318983},108954.13265555553,25293.19027777778,300958.36727652315,291685.51999999996,-9272.8472765231963]
[]
[]
["General:","Applicants are to complete this appendix to show the reasonability of the depreciation expense that is included in rate base via. Accumulated depreciation and the revenue requirement."]
[null,"Applicants must provide a breakdown of depreciation and amortization expense in the above format for all relevant accounts.  Balances presented in the table should exclude asset retirement obligations (AROs) and the related depreciation and accretion expense. These should be disclosed separately consistent with the Notes of historical Audited Financial Statements."]
[]
[]
["Notes:"]
[1,"This is the net book value of assets that existed as at the date of the utility's change in depreciation policies (i.e. as at Jan. 1, 2012 or Jan. 1, 2013).  These assets are to be depreciated at the average remaining service life. This amount will not change in years subsequent to the date of the utility's change in depreciation policies.  This column is expected to be used until the assets that existed as at the date of the utility's change in depreciation policies are fully depreciated."]
[2,"This is the opening gross book value of assets that have been acquired after the date of the utilities change in depreciation policies (i.e. additions starting in 2012/2013 for those who changed policies Jan. 1, 2012/2013). These assets are to be depreciated at the revised service life. The amount is expected to be equal to the gross book value of the prior year plus the prior year's additions."]
[3,"A recalculation should be performed to determine the average remaining life of opening balance of assets (i.e. excluding current year's additions) under the change in policies under CGAAP.  For example, Asset A had a useful life of 20 years under CGAAP without the change in policies.  On January 1 of the year of policy changes, Asset A was 3 years depreciated. As a result, Asset A would have a remaining service life of 17 years (20 years less 3 years) as at January 1 of the year of policy changes.  Due to making the change in policies under CGAAP, management re-assessed the asset useful lives and concluded that the revised useful life of Asset A is now 30 years. Therefore, the average remaining useful life of the opening balance of Asset A is determined to be 27 years (30 years less 3 years) under the revised CGAAP as at January 1 of the year of policy changes."]
[4,"The useful life used should be consistent with the OEB's regulatory accounting policies as set out in the  Accounting Procedures Handbook for Electricity Distributors, effective Jan. 1, 2012 and also with the Report of the Board, Transition to International Financial Reporting Standards, EB-2008-0408, and the Kinectrics Report."]
[5,"Board policy of the \"half-year\" rule - the applicant must ensure that additions in the year attract a half-year depreciation expense in the first year.  Deviations from this standard practice must be supported in the application."]
[6,"The applicant must provide an explanation of material variances in evidence."]
[7,"This should include assets in column a (excel column C) that become fully depreciated since the date of the policy change.  The amount input in b (excel column D) should equal the net book value of the asset as at the date of depreciation policy change"]
[8,"This should include assets in column d (excel column f) that have become fully depreciated.  The amount input in e (excel column G) should equal the gross book value of the asset"]

{"sheet":"App.2-D_Overhead","index":12,"n_rows":42,"n_cols":8,"rows_kept":42,"cut":false,"hidden":false,"merged":[[6,6,6,7],[8,0,8,7],[9,0,9,7],[13,0,15,0],[23,0,25,0],[23,7,25,7],[11,0,11,5],[21,0,21,5],[56,0,57,0],[42,0,43,0],[42,1,43,1],[45,0,46,0],[48,0,49,0],[51,0,54,0]]}
[null,null,null,null,null,"File Number:",{"$f":"EBNUMBER","v":"EB-2017-0073"}]
[null,null,null,null,null,"Exhibit:",2]
[null,null,null,null,null,"Tab:"]
[null,null,null,null,null,"Schedule:"]
[null,null,null,null,null,"Page:"]
[]
[null,null,null,null,null,"Date:","2017-08-28"]
[]
["Appendix 2-D"]
["Overhead Expense"]
[]
["Applicants are to provide a breakdown of OM&A before capitalization in the below table.  OM&A before capitalization may be broken down by cost center, program, drivers or another format best suited to focus on capitalized vs. uncapitalized OM&A."]
[]
[" OM&A Before Capitalization"]
[null,{"$f":"F15-4","v":2014},{"$f":"F15-3","v":2015},{"$f":"F15-2","v":2016},{"$f":"F15-1","v":2017},{"$f":"TestYear","v":2018}]
[null,"Historical Year","Historical Year","Historical Year","Bridge Year","Test Year"]
["Total OM&A Before Capitalization",1499301,1493964,1622607,1694090,1639469]
[]
[]
["Total OM&A Before Capitalization (B)",{"$f":"SUM(B17:B19)","v":1499301},{"$f":"SUM(C17:C19)","v":1493964},{"$f":"SUM(D17:D19)","v":1622607},{"$f":"SUM(E17:E19)","v":1694090},{"$f":"SUM(F17:F19)","v":1639469}]
[]
["Applicants are to provide a breakdown of capitalized OM&A in the below table.  Capitalized OM&A may be broken down using the categories listed in the table below if possible.  Otherwise, applicants are to provide its own break down of capitalized OM&A."]
[]
["Capitalized OM&A",null,null,null,null,null,"Directly","Explanation for Change in Overhead Capitalized"]
[null,{"$f":"F25-4","v":2014},{"$f":"F25-3","v":2015},{"$f":"F25-2","v":2016},{"$f":"F25-1","v":2017},{"$f":"TestYear","v":2018},"Attributable?"]
[null,"Historical Year","Historical Year","Historical Year","Bridge Year","Test Year","(Yes/No)"]
["employee benefits",32617.119999999999,39766,54827,35307,28652,"Yes","No Changes made to Overhead Capitalized"]
["Trucking/Fleet Costs",11907.54,17026,17874,17223,17431,"Yes","No Changes made to Overhead Capitalized"]
["Material",5268.03,5395,6895,4898,4986,"Yes","No Changes made to Overhead Capitalized"]
["Downtime (Sick time/Vacation etc.)",9607.68,11531,11566,8553,6941,"Yes","No Changes made to Overhead Capitalized"]
[]
[]
[]
[]
[]
[]
[]
["Insert description of additional item(s) and new rows if needed"]
[]
["Total Capitalized OM&A (A)",{"$f":"SUM(B27:B39)","v":59400.37},{"$f":"SUM(C27:C39)","v":73718},{"$f":"SUM(D27:D39)","v":91162},{"$f":"SUM(E27:E39)","v":65981},{"$f":"SUM(F27:F39)","v":58010}]
[]
["% of Capitalized OM&A (=A/B)",{"$f":"IF(ISERROR(B40/B20),\"0%\",B40/B20)","v":3.9618708985053701E-2},{"$f":"IF(ISERROR(C40/C20),\"0%\",C40/C20)","v":4.9343893159406786E-2},{"$f":"IF(ISERROR(D40/D20),\"0%\",D40/D20)","v":5.6182427414648156E-2},{"$f":"IF(ISERROR(E40/E20),\"0%\",E40/E20)","v":3.8947753661257668E-2},{"$f":"IF(ISERROR(F40/F20),\"0%\",F40/F20)","v":3.5383407676509895E-2}]

{"sheet":"App.2-EA_Account 1575 (2015)","index":13,"n_rows":47,"n_cols":9,"rows_kept":47,"cut":false,"hidden":false,"merged":[[6,8,6,9],[20,1,20,5],[8,0,8,8],[9,0,9,8],[10,0,10,8],[12,0,12,8],[14,0,14,8],[47,0,47,9],[52,0,53,8],[25,1,26,5],[31,1,31,5],[37,6,38,7],[37,8,38,8]]}
[null,null,null,null,null,null,null,"File Number:",{"$f":"EBNUMBER","v":"EB-2017-0073"}]
[null,null,null,null,null,null,null,"Exhibit:",9]
[null,null,null,null,null,null,null,"Tab:"]
[null,null,null,null,null,null,null,"Schedule:"]
[null,null,null,null,null,null,null,"Page:"]
[]
[null,null,null,null,null,null,null,"Date:","2017-08-28"]
[]
["Appendix 2-EA"]
["Account 1575 - IFRS-CGAAP Transitional PP&E Amounts"]
["2015 Adopters of IFRS for Financial Reporting Purposes"]
[]
["For applicants that adopted IFRS on January 1, 2015 for financial reporting purposes"]
[]
[]
[]
[null,2014,{"$f":"TestYear-3","v":2015},{"$f":"TestYear-2","v":2016},{"$f":"CONCATENATE(TestYear-1,\" Bridge Year\")","v":"2017 Bridge Year"},{"$f":"CONCATENATE(TestYear,\" Rebasing Year\")","v":"2018 Rebasing Year"}]
["Reporting Basis","CGAAP","CGAAP","CGAAP","MIFRS","MIFRS"]
[null,"Actual","Actual","Actual","Forecast","Forecast"]
[null,null,null,"$","$"]
["PP&E Values under CGAAP"]
["            Opening net PP&E - Note 1",4936887,{"$f":"+B25","v":4992542.37},{"$f":"+C25","v":4988393.57},{"$f":"+D25","v":5026747.12}]
["            Net Additions - Note 4",276063,255121,272451,425354]
["            Net Depreciation (amounts should be negative) - Note 4",{"$f":"-218015-2392.63","v":-220407.63},{"$f":"-257912-1357.8","v":-259269.8},{"$f":"-232624-1473.45","v":-234097.45},-258997]
["            Closing net PP&E (1)",{"$f":"SUM(B22:B24)","v":4992542.37},{"$f":"SUM(C22:C24)","v":4988393.57},{"$f":"SUM(D22:D24)","v":5026747.12},{"$f":"SUM(E22:E24)","v":5193104.12}]
[]
["PP&E Values under MIFRS (Starts from 2014, the transition year)"]
["            Opening net PP&E  - Note 1",4936887,{"$f":"+B31","v":4957111},{"$f":"+C31","v":4944984},{"$f":"+D31","v":4979216}]
["            Net Additions - Note 4",183646,225089,250957,405090]
["            Net Depreciation (amounts should be negative) - Note 4",-163422,-237216,-216725,-244171]
["            Closing net PP&E (2)",{"$f":"SUM(B28:B30)","v":4957111},{"$f":"SUM(C28:C30)","v":4944984},{"$f":"SUM(D28:D30)","v":4979216},{"$f":"SUM(E28:E30)","v":5140135}]
[]
["Difference in Closing net PP&E, former CGAAP vs. revised CGAAP ",{"$f":"B25-B31","v":35431.370000000112},{"$f":"C25-C31","v":43409.570000000298},{"$f":"D25-D31","v":47531.120000000112},{"$f":"E25-E31","v":52969.120000000112}]
[]
[]
["Effect on Deferral and Variance Account Rate Riders"]
["Closing balance in Account 1575",null,null,null,null,{"$f":"IF(ISERROR(E33), 0, E33)","v":52969.120000000112},null,"WACC",3.7199999999999997E-2]
["Return on Rate Base Associated with Account 1575 balance at WACC  - Note 2",null,null,null,null,{"$f":"E33*I37*I38","v":9852.2563200000186},"# of years of rate rider disposition period",null,5]
["     Amount included in Deferral and Variance Account Rate Rider Calculation",null,null,null,null,{"$f":"F37+F38","v":62821.376320000127}]
[]
["Notes:"]
["1  For an applicant that adopted IFRS on January 1, 2015, the PP&E values as of January 1, 2014 under both CGAAP and MIFRS should be the same. "]
["2 Return on rate base associated with deferred balance is calculated as:"]
["     the deferral account closing balance as of 2017 x WACC X # of years of rate rider disposition period"]
["     * Please note that the calculation should be adjusted once WACC is updated and finalized in the rate application."]
["3  The  PP&E deferral account is cleared by including the total balance in the deferral and variance account rate rider calculation."]
["4  Net additions are additions net of disposals; Net depreciation is additions to depreciation net of disposals."]

{"sheet":"App.2-EB_Account 1576 (2012)","index":14,"n_rows":48,"n_cols":12,"rows_kept":48,"cut":false,"hidden":false,"merged":[[6,11,6,12],[41,0,41,12],[45,0,45,10],[8,0,8,11],[9,0,9,11],[10,0,10,11],[12,0,13,11],[14,0,14,11],[20,1,20,8],[25,1,26,8],[31,1,31,8],[37,9,38,10],[37,11,38,11]]}
[null,null,null,null,null,null,null,null,null,null,"File Number:",{"$f":"EBNUMBER","v":"EB-2017-0073"}]
[null,null,null,null,null,null,null,null,null,null,"Exhibit:"]
[null,null,null,null,null,null,null,null,null,null,"Tab:"]
[null,null,null,null,null,null,null,null,null,null,"Schedule:"]
[null,null,null,null,null,null,null,null,null,null,"Page:"]
[]
[null,null,null,null,null,null,null,null,null,null,"Date:","2017-08-28"]
[]
["Appendix 2-EB"]
["Account 1576 - Accounting Changes under CGAAP"]
["2012 Changes in Accounting Policies under CGAAP"]
[]
["For applicants with a balance in Account 1576 and made capitalization and depreciation expense accounting policy changes under CGAAP effective January 1, 2012.  This is the first time the applicant is rebasing with changes in these accounting policies."]
[]
[]
[]
[null,"Prior Years Rebasing",2012,2013,2014,2015,2016,2017,"2018 Rebasing Year"]
["Reporting Basis","CGAAP","CGAAP","CGAAP","CGAAP","MIFRS - Note 5","MIFRS","MIFRS","MIFRS"]
[null,"Forecast","Actual","Actual","Actual","Actual","Actual","Forecast","Forecast"]
[null,null,"$","$","$","$","$","$"]
["PP&E Values under former CGAAP"]
["            Opening net PP&E - Note 1",null,null,{"$f":"+C25","v":0},{"$f":"+D25","v":0},{"$f":"+E25","v":0},{"$f":"+F25","v":0},{"$f":"+G25","v":0}]
["            Net Additions - Note 4"]
["            Net Depreciation (amounts should be negative) - Note 4"]
["            Closing net PP&E (1)",null,{"$f":"C22+C23+C24","v":0},0,0,0,0,0]
[]
["PP&E Values under revised CGAAP (Starts from 2012)"]
["            Opening net PP&E  - Note 1",null,null,{"$f":"+C31","v":0},{"$f":"+D31","v":0},{"$f":"+E31","v":0},{"$f":"+F31","v":0},{"$f":"+G31","v":0}]
["            Net Additions - Note 4"]
["            Net Depreciation (amounts should be negative) - Note 4"]
["            Closing net PP&E (2)",null,{"$f":"SUM(C28:C30)","v":0},0,0,0,0,0]
[]
["Difference in Closing net PP&E, former CGAAP vs. revised CGAAP ",null,{"$f":"C25-C31","v":0},0,0,0,0,0]
[]
[]
["Effect on Deferral and Variance Account Rate Riders"]
["Closing balance in Account 1576",null,null,null,null,null,null,null,{"$f":"IF(ISERROR(H33), 0, H33)","v":0},null,"WACC"]
["Return on Rate Base Associated with Account 1576 balance at WACC  - Note 2",null,null,null,null,null,null,null,{"$f":"H33*L37*L38","v":0},"# of years of rate rider disposition period"]
["     Amount included in Deferral and Variance Account Rate Rider Calculation",null,null,null,null,null,null,null,{"$f":"I37+I38","v":0}]
[]
["Notes:"]
["1  For an applicant that made the capitalization and depreciation expense accounting policy changes on January 1, 2012, the PP&E values as of January 1, 2012 under both former CGAAP and revised CGAAP should be the same. "]
["2 Return on rate base associated with Account 1576 balance is calculated as:"]
["     the variance account ending balance as of 2017 x WACC X # of years of rate rider disposition period"]
["     * Please note that the calculation should be adjusted once WACC is updated and finalized in the rate application."]
["3  Account 1576 is cleared by including the total balance in the deferral and variance account rate rider calculation."]
["4  Net additions are additions net of disposals; Net depreciation is additions to depreciation net of disposals."]
["5 Differences due to the adoption of MIFRS are to be shown separately in Account 1575 in Appendix 2-EA as Accounts 1575 and 1576 cannot be used interchangably."]

{"sheet":"App.2-EC_Account 1576 (2013)","index":15,"n_rows":48,"n_cols":11,"rows_kept":48,"cut":false,"hidden":false,"merged":[[6,10,6,11],[45,0,45,9],[8,0,8,10],[9,0,9,10],[10,0,10,10],[12,0,12,10],[14,0,14,10],[37,10,38,10],[20,1,20,7],[25,1,26,7],[31,1,31,7],[37,8,38,9],[41,0,41,11]]}
[null,null,null,null,null,null,null,null,null,"File Number:",{"$f":"EBNUMBER","v":"EB-2017-0073"}]
[null,null,null,null,null,null,null,null,null,"Exhibit:"]
[null,null,null,null,null,null,null,null,null,"Tab:"]
[null,null,null,null,null,null,null,null,null,"Schedule:"]
[null,null,null,null,null,null,null,null,null,"Page:"]
[]
[null,null,null,null,null,null,null,null,null,"Date:","2017-08-28"]
[]
["Appendix 2-EC"]
["Account 1576 - Accounting Changes under CGAAP"]
["2013 Changes in Accounting Policies under CGAAP"]
[]
["For applicants with a balance in Account 1576 and made capitalization and depreciation expense accounting policy changes under CGAAP effective January 1, 2013.  This is the first time the applicant is rebasing with changes in these accounting policies."]
[]
[]
[]
[null,"Prior Years Rebasing",2013,2014,2015,2016,2017,"2018 Rebasing Year"]
["Reporting Basis","CGAAP","CGAAP","CGAAP","MIFRS - Note 5","MIFRS","MIFRS","MIFRS"]
[null,"Actual","Actual","Actual","Actual","Actual","Forecast","Forecast"]
[null,null,"$","$",null,"$"]
["PP&E Values under former CGAAP"]
["            Opening net PP&E - Note 1",null,null,{"$f":"+C25","v":0},{"$f":"+D25","v":0},{"$f":"+E25","v":0},{"$f":"+F25","v":0}]
["            Net Additions - Note 4"]
["            Net Depreciation (amounts should be negative) - Note 4"]
["            Closing net PP&E (1)",null,{"$f":"C22+C23+C24","v":0},{"$f":"D22+D23+D24","v":0},{"$f":"E22+E23+E24","v":0},{"$f":"F22+F23+F24","v":0},{"$f":"G22+G23+G24","v":0}]
[]
["PP&E Values under revised CGAAP (Starts from 2012)"]
["            Opening net PP&E  - Note 1",null,null,{"$f":"+C31","v":0},{"$f":"+D31","v":0},{"$f":"+E31","v":0},{"$f":"+F31","v":0}]
["            Net Additions - Note 4"]
["            Net Depreciation (amounts should be negative) - Note 4"]
["            Closing net PP&E (2)",null,{"$f":"SUM(C28:C30)","v":0},{"$f":"SUM(D28:D30)","v":0},{"$f":"SUM(E28:E30)","v":0},{"$f":"SUM(F28:F30)","v":0},{"$f":"SUM(G28:G30)","v":0}]
[]
["Difference in Closing net PP&E, former CGAAP vs. revised CGAAP ",null,{"$f":"C25-C31","v":0},{"$f":"D25-D31","v":0},{"$f":"E25-E31","v":0},{"$f":"F25-F31","v":0},{"$f":"G25-G31","v":0}]
[]
[]
["Effect on Deferral and Variance Account Rate Riders"]
["Closing balance in Account 1576",null,null,null,null,null,null,{"$f":"IF(ISERROR(G33), 0, G33)","v":0},null,"WACC"]
["Return on Rate Base Associated with Account 1576 balance at WACC  - Note 2",null,null,null,null,null,null,{"$f":"G33*K37*K38","v":0},"# of years of rate rider disposition period"]
["     Amount included in Deferral and Variance Account Rate Rider Calculation",null,null,null,null,null,null,{"$f":"H37+H38","v":0}]
[]
["Notes:"]
["1  For an applicant that made the capitalization and depreciation expense accounting policy changes on January 1, 2013, the PP&E values as of January 1, 2013 under both former CGAAP and revised CGAAP should be the same. "]
["2 Return on rate base associated with Account 1576 balance is calculated as:"]
["     the variance account ending balance as of 2017 x WACC X # of years of rate rider disposition period"]
["     * Please note that the calculation should be adjusted once WACC is updated and finalized in the rate application."]
["3  Account 1576 is cleared by including the total balance in the deferral and variance account rate rider calculation."]
["4  Net additions are additions net of disposals; Net depreciation is additions to depreciation net of disposals."]
["5 Differences due to the adoption of MIFRS are to be shown separately in Account 1575 in Appendix 2-EA as Accounts 1575 and 1576 cannot be used interchangably."]

{"sheet":"App.2-FA Proposed REG Invest.","index":16,"n_rows":101,"n_cols":11,"rows_kept":101,"cut":false,"hidden":false,"merged":[[8,0,8,10],[17,0,17,8],[16,0,16,9],[12,0,12,6],[13,0,13,5],[14,0,14,5],[11,0,11,6],[9,0,9,10]]}
[null,null,null,null,null,null,null,null,null,"File Number:",{"$f":"EBNUMBER","v":"EB-2017-0073"}]
[null,null,null,null,null,null,null,null,null,"Exhibit:"]
[null,null,null,null,null,null,null,null,null,"Tab:"]
[null,null,null,null,null,null,null,null,null,"Schedule:"]
[null,null,null,null,null,null,null,null,null,"Page:"]
[]
[null,null,null,null,null,null,null,null,null,"Date:"]
[]
["Appendix 2-FA"]
["Renewable Generation Connection Investment Summary (past investments or over the future rate setting period)"]
[]
["Enter the details of the Renewable Generation Connection projects as described in the appropriate section of the Filing Requirements."]
["All costs entered on this page will be transferred to the appropriate cells in the appendices that follow."]
["For Part A, Renewable Enabling Improvements (REI), these amounts will be transferred to Appendix 2 - FB"]
["For Part B, Expansions, these amounts will be transferred to Appendix 2 - FC"]
[]
["If there are more than five projects proposed to be in-service in a certain year, please amend the tables below and ensure that the formulae for the Total Amounts in any given rate year are updated."]
["Based on the current methodology and allocation, amounts allocated represent 6% for REI Connection Investments and 17% for Expansion Investments. (EB-2009-0349, 6-10-2010, p. 15, note 9)"]
[]
["There are two scenarios described below.  Separate sets of spreadsheets (2-FA, 2-FB, 2-FC) should be submited for each scenario as required."]
["Scenario 1:  Past Investments with No Recovery.  The distributor has made investments in the past (during the IRM Years), but has not received approval for these projects and therefore did not receive"]
["revenue from the IESO under Regulation 330/09 and did not receive ratepayer revenue for the direct benefit portion of the investment."]
["The WCA percentage, debt percentages, interest rates, kWh, tax rates, amortization period, CCA Class and percentage should correspond to the distributor's last Cost of Service approval. "]
["The Direct Benefit portion of the calculated Revenue Requirement for each year should be summed and can be applied for recovery from the distributor's ratepayers through a rate rider."]
["The Provincial Recovery portion of the calculated Revenue Requirement for each year should be summed and can be applied for recovery from the IESO through a separate order."]
[]
["Scenario 2:  Investments in the Test Year and Beyond.  Distributor plans to make investments in 2017 and/or beyond.  These investments should be added to 2-FA in the appropriate year."]
["The WCA percentage, debt percentages, interest rates, kWh, tax rates, amortization period, CCA Class and percentage should correspond to the distributor's current application. "]
[]
["Part A",null,null,null,null,null,"Test Year"]
["REI Investments (Direct Benefit at 6%)",null,{"$f":"D31-1","v":2014},{"$f":"E31-1","v":2015},{"$f":"F31-1","v":2016},{"$f":"G31-1","v":2017},{"$f":"TestYear","v":2018},{"$f":"G31+1","v":2019},{"$f":"H31+1","v":2020},{"$f":"I31+1","v":2021},{"$f":"J31+1","v":2022}]
["Project 1"]
["Name: REI Connection Project"]
["Capital Costs",null,0,0,0,0,0,0,0,0,0]
["OM&A (Start-Up)",null,0,0,0,0,0,0,0,0,0]
["OM&A (Ongoing)",null,0,0,0,0,0,0,0,0,0]
[]
["Project 2"]
["Name: REI Connection Project"]
["Capital Costs",null,0,0,0,0,0,0,0,0,0]
["OM&A (Start-Up)",null,0,0,0,0,0,0,0,0,0]
["OM&A (Ongoing)",null,0,0,0,0,0,0,0,0,0]
[]
["Project 3"]
["Name: REI Connection Project"]
["Capital Costs",null,0,0,0,0,0,0,0,0,0]
["OM&A (Start-Up)",null,0,0,0,0,0,0,0,0,0]
["OM&A (Ongoing)",null,0,0,0,0,0,0,0,0,0]
[]
["Project 4"]
["Name: REI Connection Project"]
["Capital Costs",null,0,0,0,0,0,0,0,0,0]
["OM&A (Start-Up)",null,0,0,0,0,0,0,0,0,0]
["OM&A (Ongoing)",null,0,0,0,0,0,0,0,0,0]
[]
["Project 5"]
["Name: REI Connection Project"]
["Capital Costs",null,0,0,0,0,0,0,0,0,0]
["OM&A (Start-Up)",null,0,0,0,0,0,0,0,0,0]
["OM&A (Ongoing)",null,0,0,0,0,0,0,0,0,0]
[]
["Total Capital Costs",null,{"$f":"SUM(C58,C52,C46,C40,C34)","v":0},0,0,0,{"$f":"SUM(G58,G52,G46,G40,G34)","v":0},{"$f":"SUM(H58,H52,H46,H40,H34)","v":0},0,0,0]
["Total OM&A (Start-Up)",null,0,0,0,0,{"$f":"SUM(G59,G53,G47,G41,G35)","v":0},0,0,0,0]
["Total OM&A (Ongoing)",null,0,0,0,0,{"$f":"SUM(G60,G54,G48,G42,G36)","v":0},0,0,0,0]
[]
[]
["Part B",null,null,null,null,null,"Test Year"]
["Expansion Investments (Direct Benefit at 17%)",null,{"$f":"D68-1","v":2014},{"$f":"E68-1","v":2015},{"$f":"F68-1","v":2016},{"$f":"G68-1","v":2017},{"$f":"TestYear","v":2018},{"$f":"G68+1","v":2019},{"$f":"H68+1","v":2020},{"$f":"I68+1","v":2021},{"$f":"J68+1","v":2022}]
["Project 1"]
["Name: Expansion Connection Project"]
["Capital Costs",null,0,0,0,0,0,0,0,0,0]
["OM&A (Start-Up)",null,0,0,0,0,0,0,0,0,0]
["OM&A (Ongoing)",null,0,0,0,0,0,0,0,0,0]
[]
["Project 2"]
["Name: Expansion Connection Project"]
["Capital Costs",null,0,0,0,0,0,0,0,0,0]
["OM&A (Start-Up)",null,0,0,0,0,0,0,0,0,0]
["OM&A (Ongoing)",null,0,0,0,0,0,0,0,0,0]
[]
["Project 3"]
["Name: Expansion Connection Project"]
["Capital Costs",null,0,0,0,0,0,0,0,0,0]
["OM&A (Start-Up)",null,0,0,0,0,0,0,0,0,0]
["OM&A (Ongoing)",null,0,0,0,0,0,0,0,0,0]
[]
["Project 4"]
["Name: Expansion Connection Project"]
["Capital Costs",null,0,0,0,0,0,0,0,0,0]
["OM&A (Start-Up)",null,0,0,0,0,0,0,0,0,0]
["OM&A (Ongoing)",null,0,0,0,0,0,0,0,0,0]
[]
["Project 5"]
["Name: Expansion Connection Project"]
["Capital Costs",null,0,0,0,0,0,0,0,0,0]
["OM&A (Start-Up)",null,0,0,0,0,0,0,0,0,0]
["OM&A (Ongoing)",null,0,0,0,0,0,0,0,0,0]
[]
["Total Capital Costs",null,{"$f":"SUM(C95,C89,C83,C77,C71)","v":0},0,0,0,{"$f":"SUM(G95,G89,G83,G77,G71)","v":0},{"$f":"SUM(H95,H89,H83,H77,H71)","v":0},0,0,0]
["Total OM&A (Start-Up)",null,0,0,0,0,{"$f":"SUM(G96,G90,G84,G78,G72)","v":0},0,0,0,0]
["Total OM&A (Ongoing)",null,0,0,0,0,{"$f":"SUM(G97,G91,G85,G79,G73)","v":0},0,0,0,0]

{"sheet":"App.2-FB Calc of REG Improvemnt","index":17,"n_rows":95,"n_cols":29,"rows_kept":95,"cut":false,"hidden":false,"merged":[[51,24,51,25],[51,27,51,28],[48,0,48,22],[49,0,49,1],[51,15,51,16],[51,18,51,19],[51,21,51,22],[51,12,51,13],[51,9,51,10],[51,6,51,7],[51,3,51,4],[46,0,46,22],[16,14,16,16],[16,17,16,19],[16,20,16,22],[16,23,16,25],[16,11,16,13],[16,8,16,10],[16,5,16,7],[16,2,16,4],[16,26,16,28],[8,0,8,17],[9,0,9,17],[11,0,11,17],[12,0,12,17],[14,0,14,17]]}
[null,null,null,null,null,null,null,null,null,null,null,null,null,"File Number:",{"$f":"EBNUMBER","v":"EB-2017-0073"}]
[null,null,null,null,null,null,null,null,null,null,null,null,null,"Exhibit:"]
[null,null,null,null,null,null,null,null,null,null,null,null,null,"Tab:"]
[null,null,null,null,null,null,null,null,null,null,null,null,null,"Schedule:"]
[null,null,null,null,null,null,null,null,null,null,null,null,null,"Page:"]
[]
[null,null,null,null,null,null,null,null,null,null,null,null,null,"Date:"]
[]
["Appendix 2-FB"]
["Calculation of Renewable Generation Connection Direct Benefits/Provincial Amount: Renewable Enabling Improvement Investments"]
[]
["This table will calculate the distributor/provincial shares of the investments entered in Part A of Appendix 2-FA."]
["Enter values in green shaded cells: WCA percentage, debt percentages, interest rates, kWh, tax rates, amortization period, CCA Class and percentage."]
["For historical investments, enter these variables for your last cost of service test year.  For 2017 and beyond, enter variables as in the application."]
["Rate Riders are not calculated for the Test Year as these assets and costs are already in the distributor's rate base/revenue requirement."]
[]
[null,null,{"$f":"F17-1","v":2014},null,null,{"$f":"I17-1","v":2015},null,null,{"$f":"L17-1","v":2016},null,null,{"$f":"BridgeYear","v":2017},null,null,{"$f":"CONCATENATE(TestYear,\" Test Year\")","v":"2018 Test Year"},null,null,{"$f":"TestYear+1","v":2019},null,null,{"$f":"R17+1","v":2020},2016,null,{"$f":"U17+1","v":2021},null,null,{"$f":"X17+1","v":2022}]
[null,null,null,"Direct Benefit","Provincial",null,"Direct Benefit","Provincial",null,"Direct Benefit","Provincial",null,"Direct Benefit","Provincial",null,"Direct Benefit","Provincial",null,"Direct Benefit","Provincial",null,"Direct Benefit","Provincial",null,"Direct Benefit","Provincial",null,"Direct Benefit","Provincial"]
[null,null,"Total",0.06,0.94,"Total",0.06,0.94,"Total",0.06,0.94,"Total",0.06,0.94,"Total",0.06,0.94,"Total",0.06,0.94,"Total",0.06,0.94,"Total",0.06,0.94,"Total",0.06,0.94]
["Net Fixed Assets (average)",null,{"$f":"D82","v":0},{"$f":"C20*D19","v":0},{"$f":"C20*E19","v":0},{"$f":"E82","v":0},{"$f":"F20*G19","v":0},{"$f":"F20*H19","v":0},{"$f":"F82","v":0},{"$f":"I20*J19","v":0},{"$f":"I20*K19","v":0},{"$f":"G82","v":0},{"$f":"L20*M19","v":0},{"$f":"L20*N19","v":0},{"$f":"H82","v":0},{"$f":"O20*P19","v":0},{"$f":"O20*Q19","v":0},{"$f":"I82","v":0},{"$f":"R20*S19","v":0},{"$f":"R20*T19","v":0},{"$f":"J82","v":0},{"$f":"U20*V19","v":0},{"$f":"U20*W19","v":0},{"$f":"K82","v":0},{"$f":"X20*Y19","v":0},{"$f":"X20*Z19","v":0},{"$f":"L82","v":0},{"$f":"AA20*AB19","v":0},{"$f":"AA20*AC19","v":0}]
["Incremental OM&A (on-going, N/A for Provincial Recovery)",null,{"$f":"'App.2-FA Proposed REG Invest.'!C64","v":0},{"$f":"C21","v":0},null,{"$f":"'App.2-FA Proposed REG Invest.'!D64","v":0},{"$f":"F21","v":0},null,{"$f":"'App.2-FA Proposed REG Invest.'!E64","v":0},{"$f":"I21","v":0},null,{"$f":"'App.2-FA Proposed REG Invest.'!F64","v":0},{"$f":"L21","v":0},null,{"$f":"'App.2-FA Proposed REG Invest.'!G64","v":0},{"$f":"O21","v":0},null,{"$f":"'App.2-FA Proposed REG Invest.'!H64","v":0},{"$f":"R21","v":0},null,{"$f":"'App.2-FA Proposed REG Invest.'!I64","v":0},{"$f":"U21","v":0},null,{"$f":"'App.2-FA Proposed REG Invest.'!J64","v":0},{"$f":"X21","v":0},null,{"$f":"'App.2-FA Proposed REG Invest.'!K64","v":0},{"$f":"AA21","v":0}]
["Incremental OM&A (start-up, applicable for Provincial Recovery)",null,{"$f":"'App.2-FA Proposed REG Invest.'!C63","v":0},{"$f":"C22*D19","v":0},{"$f":"C22*E19","v":0},{"$f":"'App.2-FA Proposed REG Invest.'!D63","v":0},{"$f":"F22*G19","v":0},{"$f":"F22*H19","v":0},{"$f":"'App.2-FA Proposed REG Invest.'!E63","v":0},{"$f":"I22*J19","v":0},{"$f":"I22*K19","v":0},{"$f":"'App.2-FA Proposed REG Invest.'!F63","v":0},{"$f":"L22*M19","v":0},{"$f":"L22*N19","v":0},{"$f":"'App.2-FA Proposed REG Invest.'!G63","v":0},{"$f":"O22*P19","v":0},{"$f":"O22*Q19","v":0},{"$f":"'App.2-FA Proposed REG Invest.'!H63","v":0},{"$f":"R22*S19","v":0},{"$f":"R22*T19","v":0},{"$f":"'App.2-FA Proposed REG Invest.'!I63","v":0},{"$f":"U22*V19","v":0},{"$f":"U22*W19","v":0},{"$f":"'App.2-FA Proposed REG Invest.'!J63","v":0},{"$f":"X22*Y19","v":0},{"$f":"X22*Z19","v":0},{"$f":"'App.2-FA Proposed REG Invest.'!K63","v":0},{"$f":"AA22*AB19","v":0},{"$f":"AA22*AC19","v":0}]
["WCA",null,null,{"$f":"(D21+D22)*$B$23","v":0},{"$f":"E22*$B$23","v":0},null,{"$f":"(G21+G22)*$B$23","v":0},{"$f":"H22*$B$23","v":0},null,{"$f":"(J21+J22)*$B$23","v":0},{"$f":"K22*$B$23","v":0},null,{"$f":"(M21+M22)*$B$23","v":0},{"$f":"N22*$B$23","v":0},null,{"$f":"(P21+P22)*$B$23","v":0},{"$f":"Q22*$B$23","v":0},null,{"$f":"(S21+S22)*$B$23","v":0},{"$f":"T22*$B$23","v":0},null,{"$f":"(V21+V22)*$B$23","v":0},{"$f":"W22*$B$23","v":0},null,{"$f":"(Y21+Y22)*$B$23","v":0},{"$f":"Z22*$B$23","v":0},null,{"$f":"(AB21+AB22)*$B$23","v":0},{"$f":"AC22*$B$23","v":0}]
["Rate Base",null,null,{"$f":"SUM(D20+D23)","v":0},{"$f":"SUM(E20+E23)","v":0},null,{"$f":"SUM(G20+G23)","v":0},{"$f":"SUM(H20+H23)","v":0},null,{"$f":"SUM(J20+J23)","v":0},{"$f":"SUM(K20+K23)","v":0},null,{"$f":"SUM(M20+M23)","v":0},{"$f":"SUM(N20+N23)","v":0},null,{"$f":"SUM(P20+P23)","v":0},{"$f":"SUM(Q20+Q23)","v":0},null,{"$f":"SUM(S20+S23)","v":0},{"$f":"SUM(T20+T23)","v":0},null,{"$f":"SUM(V20+V23)","v":0},{"$f":"SUM(W20+W23)","v":0},null,{"$f":"SUM(Y20+Y23)","v":0},{"$f":"SUM(Z20+Z23)","v":0},null,{"$f":"SUM(AB20+AB23)","v":0},{"$f":"SUM(AC20+AC23)","v":0}]
[]
[]
["Deemed ST Debt",null,null,{"$f":"D24*$B$27","v":0},{"$f":"E24*$B$27","v":0},null,{"$f":"G24*$B$27","v":0},{"$f":"H24*$B$27","v":0},null,{"$f":"J24*$B$27","v":0},{"$f":"K24*$B$27","v":0},null,{"$f":"M24*$B$27","v":0},{"$f":"N24*$B$27","v":0},null,{"$f":"P24*$B$27","v":0},{"$f":"Q24*$B$27","v":0},null,{"$f":"S24*$B$27","v":0},{"$f":"T24*$B$27","v":0},null,{"$f":"V24*$B$27","v":0},{"$f":"W24*$B$27","v":0},null,{"$f":"Y24*$B$27","v":0},{"$f":"Z24*$B$27","v":0},null,{"$f":"AB24*$B$27","v":0},{"$f":"AC24*$B$27","v":0}]
["Deemed LT Debt",null,null,{"$f":"D24*$B$28","v":0},{"$f":"E24*$B$28","v":0},null,{"$f":"G24*$B$28","v":0},{"$f":"H24*$B$28","v":0},null,{"$f":"J24*$B$28","v":0},{"$f":"K24*$B$28","v":0},null,{"$f":"M24*$B$28","v":0},{"$f":"N24*$B$28","v":0},null,{"$f":"P24*$B$28","v":0},{"$f":"Q24*$B$28","v":0},null,{"$f":"S24*$B$28","v":0},{"$f":"T24*$B$28","v":0},null,{"$f":"V24*$B$28","v":0},{"$f":"W24*$B$28","v":0},null,{"$f":"Y24*$B$28","v":0},{"$f":"Z24*$B$28","v":0},null,{"$f":"AB24*$B$28","v":0},{"$f":"AC24*$B$28","v":0}]
["Deemed Equity",null,null,{"$f":"D24*$B$29","v":0},{"$f":"E24*$B$29","v":0},null,{"$f":"G24*$B$29","v":0},{"$f":"H24*$B$29","v":0},null,{"$f":"J24*$B$29","v":0},{"$f":"K24*$B$29","v":0},null,{"$f":"M24*$B$29","v":0},{"$f":"N24*$B$29","v":0},null,{"$f":"P24*$B$29","v":0},{"$f":"Q24*$B$29","v":0},null,{"$f":"S24*$B$29","v":0},{"$f":"T24*$B$29","v":0},null,{"$f":"V24*$B$29","v":0},{"$f":"W24*$B$29","v":0},null,{"$f":"Y24*$B$29","v":0},{"$f":"Z24*$B$29","v":0},null,{"$f":"AB24*$B$29","v":0},{"$f":"AC24*$B$29","v":0}]
[]
["ST Interest",null,null,{"$f":"D27*$B31","v":0},0,null,{"$f":"G27*$B31","v":0},0,null,{"$f":"J27*$B31","v":0},0,null,{"$f":"M27*$B31","v":0},0,null,{"$f":"P27*$B31","v":0},0,null,{"$f":"S27*$B31","v":0},0,null,{"$f":"V27*$B31","v":0},0,null,{"$f":"Y27*$B31","v":0},0,null,{"$f":"AB27*$B31","v":0},0]
["LT Interest",null,null,0,0,null,0,0,null,0,0,null,0,0,null,0,0,null,0,0,null,0,0,null,0,0,null,0,0]
["ROE",null,null,0,0,null,0,0,null,0,0,null,0,0,null,0,0,null,0,0,null,0,0,null,0,0,null,0,0]
["Cost of Capital Total",null,null,{"$f":"SUM(D31:D33)","v":0},{"$f":"SUM(E31:E33)","v":0},null,{"$f":"SUM(G31:G33)","v":0},{"$f":"SUM(H31:H33)","v":0},null,{"$f":"SUM(J31:J33)","v":0},{"$f":"SUM(K31:K33)","v":0},null,{"$f":"SUM(M31:M33)","v":0},{"$f":"SUM(N31:N33)","v":0},null,{"$f":"SUM(P31:P33)","v":0},{"$f":"SUM(Q31:Q33)","v":0},null,{"$f":"SUM(S31:S33)","v":0},{"$f":"SUM(T31:T33)","v":0},null,{"$f":"SUM(V31:V33)","v":0},{"$f":"SUM(W31:W33)","v":0},null,{"$f":"SUM(Y31:Y33)","v":0},{"$f":"SUM(Z31:Z33)","v":0},null,{"$f":"SUM(AB31:AB33)","v":0},{"$f":"SUM(AC31:AC33)","v":0}]
[]
["OM&A",null,null,{"$f":"D21+D22","v":0},{"$f":"E22","v":0},null,{"$f":"G21+G22","v":0},{"$f":"H22","v":0},null,{"$f":"J21+J22","v":0},{"$f":"K22","v":0},null,{"$f":"M21+M22","v":0},{"$f":"N22","v":0},null,{"$f":"P21+P22","v":0},{"$f":"Q22","v":0},null,{"$f":"S21+S22","v":0},{"$f":"T22","v":0},null,{"$f":"V21+V22","v":0},{"$f":"W22","v":0},null,{"$f":"Y21+Y22","v":0},{"$f":"Z22","v":0},null,{"$f":"AB21+AB22","v":0},{"$f":"AC22","v":0}]
["Amortization",null,{"$f":"D77","v":0},{"$f":"C37*D$19","v":0},{"$f":"C37*E$19","v":0},{"$f":"E77","v":0},{"$f":"F37*G$19","v":0},{"$f":"F37*H$19","v":0},{"$f":"F77","v":0},{"$f":"I37*J$19","v":0},{"$f":"I37*K$19","v":0},{"$f":"G77","v":0},{"$f":"L37*M$19","v":0},{"$f":"L37*N$19","v":0},{"$f":"H77","v":0},{"$f":"O37*P$19","v":0},{"$f":"O37*Q$19","v":0},{"$f":"I76+I77","v":0},{"$f":"R37*S$19","v":0},{"$f":"R37*T$19","v":0},{"$f":"J76+J77","v":0},{"$f":"U37*V$19","v":0},{"$f":"U37*W$19","v":0},{"$f":"K76+K77","v":0},{"$f":"X37*Y$19","v":0},{"$f":"X37*Z$19","v":0},{"$f":"L76+L77","v":0},{"$f":"AA37*AB$19","v":0},{"$f":"AA37*AC$19","v":0}]
["Grossed-up PILs",null,null,{"$f":"D65","v":0},{"$f":"E65","v":0},null,{"$f":"G65","v":0},{"$f":"H65","v":0},null,{"$f":"J65","v":0},{"$f":"K65","v":0},null,{"$f":"M65","v":0},{"$f":"N65","v":0},null,{"$f":"P65","v":0},{"$f":"Q65","v":0},null,{"$f":"S65","v":0},{"$f":"T65","v":0},null,{"$f":"V65","v":0},{"$f":"W65","v":0},null,{"$f":"Y65","v":0},{"$f":"Z65","v":0},null,{"$f":"AB65","v":0},{"$f":"AC65","v":0}]
[]
["Revenue Requirement",null,null,{"$f":"SUM(D34:D38)","v":0},{"$f":"SUM(E34:E38)","v":0},null,{"$f":"SUM(G34:G38)","v":0},{"$f":"SUM(H34:H38)","v":0},null,{"$f":"SUM(J34:J38)","v":0},{"$f":"SUM(K34:K38)","v":0},null,{"$f":"SUM(M34:M38)","v":0},{"$f":"SUM(N34:N38)","v":0},null,{"$f":"SUM(P34:P38)","v":0},{"$f":"SUM(Q34:Q38)","v":0},null,{"$f":"SUM(S34:S38)","v":0},{"$f":"SUM(T34:T38)","v":0},null,{"$f":"SUM(V34:V38)","v":0},{"$f":"SUM(W34:W38)","v":0},null,{"$f":"SUM(Y34:Y38)","v":0},{"$f":"SUM(Z34:Z38)","v":0},null,{"$f":"SUM(AB34:AB38)","v":0},{"$f":"SUM(AC34:AC38)","v":0}]
[]
[]
["Provincial Rate Protection",null,null,null,{"$f":"E40","v":0},null,null,{"$f":"H40","v":0},null,null,{"$f":"K40","v":0},null,null,{"$f":"N40","v":0},null,null,{"$f":"Q40","v":0},null,null,{"$f":"T40","v":0},null,null,{"$f":"W40","v":0},null,null,{"$f":"Z40","v":0},null,null,{"$f":"AC40","v":0}]
[]
["Monthly Amount Paid by IESO",null,null,null,{"$f":"E43/12","v":0},null,null,{"$f":"H43/12","v":0},null,null,{"$f":"K43/12","v":0},null,null,{"$f":"N43/12","v":0},null,null,{"$f":"Q43/12","v":0},null,null,{"$f":"T43/12","v":0},null,null,{"$f":"W43/12","v":0},null,null,{"$f":"Z43/12","v":0},null,null,{"$f":"AC43/12","v":0}]
[]
["Note 1: The difference between the actual costs of approved eligible investments and revenue received from the IESO should be recorded in a variance account.  The Board may provide "]
["regulatory accounting guidance regarding a variance account either in an individual proceeding or on a generic basis."]
["Note 2: For the 2016 Test Year, Costs and Revenues of the Direct Benefit are to be included in the test year applicant Rate Base and Revenues.  "]
[]
["PILs Calculation"]
[null,null,null,{"$f":"C17","v":2014},null,null,{"$f":"F17","v":2015},null,null,{"$f":"I17","v":2016},null,null,{"$f":"L17","v":2017},null,null,{"$f":"O17","v":"2018 Test Year"},null,null,{"$f":"R17","v":2019},null,null,{"$f":"U17","v":2020},null,null,{"$f":"X17","v":2021},null,null,{"$f":"AA17","v":2022}]
["Income Tax",null,null,"Direct Benefit","Provincial",null,"Direct Benefit","Provincial",null,"Direct Benefit","Provincial",null,"Direct Benefit","Provincial",null,"Direct Benefit","Provincial",null,"Direct Benefit","Provincial",null,"Direct Benefit","Provincial",null,"Direct Benefit","Provincial",null,"Direct Benefit","Provincial"]
[null,null,null,null,null,null,null,null,null,null,null,null,null,null,null,null,null,null,null,null,null,null,null,"Total",null,null,"Total"]
["Net Income - ROE on Rate Base",null,null,{"$f":"D33","v":0},{"$f":"E33","v":0},null,{"$f":"G33","v":0},{"$f":"H33","v":0},null,{"$f":"J33","v":0},{"$f":"K33","v":0},null,{"$f":"M33","v":0},{"$f":"N33","v":0},null,{"$f":"P33","v":0},{"$f":"Q33","v":0},null,{"$f":"S33","v":0},{"$f":"T33","v":0},null,{"$f":"V33","v":0},{"$f":"W33","v":0},null,{"$f":"Y33","v":0},{"$f":"Z33","v":0},null,{"$f":"AB33","v":0},{"$f":"AC33","v":0}]
["Amortization (6% DB and 94% P)",null,null,{"$f":"D37","v":0},{"$f":"E37","v":0},null,{"$f":"G37","v":0},{"$f":"H37","v":0},null,{"$f":"J37","v":0},{"$f":"K37","v":0},null,{"$f":"M37","v":0},{"$f":"N37","v":0},null,{"$f":"P37","v":0},{"$f":"Q37","v":0},null,{"$f":"S37","v":0},{"$f":"T37","v":0},null,{"$f":"V37","v":0},{"$f":"W37","v":0},null,{"$f":"Y37","v":0},{"$f":"Z37","v":0},null,{"$f":"AB37","v":0},{"$f":"AC37","v":0}]
["CCA (6% DB and 94% P)",null,null,{"$f":"-D94*D$19","v":0},{"$f":"-D94*E$19","v":0},null,{"$f":"-E94*G19","v":0},{"$f":"-E94*H$19","v":0},null,{"$f":"-F94*J$19","v":0},{"$f":"-F94*K$19","v":0},null,{"$f":"-G94*M$19","v":0},{"$f":"-G94*N$19","v":0},null,{"$f":"-H94*P$19","v":0},{"$f":"-H94*Q$19","v":0},null,{"$f":"-I94*S$19","v":0},{"$f":"-I94*T$19","v":0},null,{"$f":"-J94*V$19","v":0},{"$f":"-J94*W$19","v":0},null,{"$f":"-K94*Y$19","v":0},{"$f":"-K94*Z$19","v":0},null,{"$f":"-L94*AB$19","v":0},{"$f":"-L94*AC$19","v":0}]
["Taxable income",null,null,{"$f":"SUM(D55:D57)","v":0},{"$f":"SUM(E55:E57)","v":0},null,{"$f":"SUM(G55:G57)","v":0},{"$f":"SUM(H55:H57)","v":0},null,{"$f":"SUM(J55:J57)","v":0},{"$f":"SUM(K55:K57)","v":0},null,{"$f":"SUM(M55:M57)","v":0},{"$f":"SUM(N55:N57)","v":0},null,{"$f":"SUM(P55:P57)","v":0},{"$f":"SUM(Q55:Q57)","v":0},null,{"$f":"SUM(S55:S57)","v":0},{"$f":"SUM(T55:T57)","v":0},null,{"$f":"SUM(V55:V57)","v":0},{"$f":"SUM(W55:W57)","v":0},null,{"$f":"SUM(Y55:Y57)","v":0},{"$f":"SUM(Z55:Z57)","v":0},null,{"$f":"SUM(AB55:AB57)","v":0},{"$f":"SUM(AC55:AC57)","v":0}]
[]
["Tax Rate  (to be entered)"]
[]
["Income Taxes Payable",null,null,{"$f":"D58*D60","v":0},{"$f":"E58*E60","v":0},null,{"$f":"G58*G60","v":0},{"$f":"H58*H60","v":0},null,{"$f":"J58*J60","v":0},{"$f":"K58*K60","v":0},null,{"$f":"M58*M60","v":0},{"$f":"N58*N60","v":0},null,{"$f":"P58*P60","v":0},{"$f":"Q58*Q60","v":0},null,{"$f":"S58*S60","v":0},{"$f":"T58*T60","v":0},null,{"$f":"V58*V60","v":0},{"$f":"W58*W60","v":0},null,{"$f":"Y58*Y60","v":0},{"$f":"Z58*Z60","v":0},null,{"$f":"AB58*AB60","v":0},{"$f":"AC58*AC60","v":0}]
["Gross Up"]
["Income Taxes Payable",null,null,{"$f":"D62/(1-D60)","v":0},{"$f":"E62/(1-E60)","v":0},null,{"$f":"G62/(1-G60)","v":0},{"$f":"H62/(1-H60)","v":0},null,{"$f":"J62/(1-J60)","v":0},{"$f":"K62/(1-K60)","v":0},null,{"$f":"M62/(1-M60)","v":0},{"$f":"N62/(1-N60)","v":0},null,{"$f":"P62/(1-P60)","v":0},{"$f":"Q62/(1-Q60)","v":0},null,{"$f":"S62/(1-S60)","v":0},{"$f":"T62/(1-T60)","v":0},null,{"$f":"V62/(1-V60)","v":0},{"$f":"W62/(1-W60)","v":0},null,{"$f":"Y62/(1-Y60)","v":0},{"$f":"Z62/(1-Z60)","v":0},null,{"$f":"AB62/(1-AB60)","v":0},{"$f":"AC62/(1-AC60)","v":0}]
["Grossed Up PILs",null,null,{"$f":"SUM(D64:D64)","v":0},{"$f":"SUM(E64:E64)","v":0},null,{"$f":"SUM(G64:G64)","v":0},{"$f":"SUM(H64:H64)","v":0},null,{"$f":"SUM(J64:J64)","v":0},{"$f":"SUM(K64:K64)","v":0},null,{"$f":"SUM(M64:M64)","v":0},{"$f":"SUM(N64:N64)","v":0},null,{"$f":"SUM(P64:P64)","v":0},{"$f":"SUM(Q64:Q64)","v":0},null,{"$f":"SUM(S64:S64)","v":0},{"$f":"SUM(T64:T64)","v":0},null,{"$f":"SUM(V64:V64)","v":0},{"$f":"SUM(W64:W64)","v":0},null,{"$f":"SUM(Y64:Y64)","v":0},{"$f":"SUM(Z64:Z64)","v":0},null,{"$f":"SUM(AB64:AB64)","v":0},{"$f":"SUM(AC64:AC64)","v":0}]
[]
[]
[null,null,null,{"$f":"E68-1","v":2014},{"$f":"F68-1","v":2015},{"$f":"G68-1","v":2016},{"$f":"H68-1","v":2017},{"$f":"TestYear","v":2018},{"$f":"H68+1","v":2019},{"$f":"I68+1","v":2020},{"$f":"J68+1","v":2021},{"$f":"K68+1","v":2022}]
["Net Fixed Assets"]
[null,"Enter applicable amortization in years:",25]
["Opening Gross Fixed Assets",null,null,null,{"$f":"D73","v":0},0,0,0,0,0,0,0]
["Gross Capital Additions",null,null,{"$f":"'App.2-FA Proposed REG Invest.'!C62","v":0},{"$f":"'App.2-FA Proposed REG Invest.'!D62","v":0},{"$f":"'App.2-FA Proposed REG Invest.'!E62","v":0},{"$f":"'App.2-FA Proposed REG Invest.'!F62","v":0},{"$f":"'App.2-FA Proposed REG Invest.'!G62","v":0},{"$f":"'App.2-FA Proposed REG Invest.'!H62","v":0},{"$f":"'App.2-FA Proposed REG Invest.'!I62","v":0},{"$f":"'App.2-FA Proposed REG Invest.'!J62","v":0},{"$f":"'App.2-FA Proposed REG Invest.'!K62","v":0}]
["Closing Gross Fixed Assets",null,null,{"$f":"SUM(D71:D72)","v":0},0,0,0,0,0,0,0,0]
[]
["Opening Accumulated Amortization",null,null,null,{"$f":"+D78","v":0},{"$f":"E78","v":0},0,0,0,0,0,0]
["Current Year Amortization (before additions)",null,null,{"$f":"IF(ISERROR(D71/$C$70), 0, D71/$C$70)","v":0},0,0,0,0,0,0,0,0]
["Additions (half year)",null,null,{"$f":"D72/$C$70/2","v":0},{"$f":"E72/$C$70/2","v":0},{"$f":"F72/$C$70/2","v":0},{"$f":"G72/$C$70/2","v":0},{"$f":"H72/$C$70/2","v":0},{"$f":"I72/C70/2","v":0},{"$f":"J72/C70/2","v":0},{"$f":"K72/C70/2","v":0},{"$f":"L72/C70/2","v":0}]
["Closing Accumulated Amortization",null,null,{"$f":"SUM(D75+D76+D77)","v":0},{"$f":"SUM(E75+E76+E77)","v":0},{"$f":"SUM(F75+F76+F77)","v":0},{"$f":"SUM(G75+G76+G77)","v":0},{"$f":"SUM(H75+H76+H77)","v":0},{"$f":"SUM(I75:I77)","v":0},{"$f":"SUM(J75:J77)","v":0},{"$f":"SUM(K75:K77)","v":0},{"$f":"SUM(L75:L77)","v":0}]
[]
["Opening Net Fixed Assets",null,null,{"$f":"D71-D75","v":0},{"$f":"E71-E75","v":0},{"$f":"F71-F75","v":0},{"$f":"G71-G75","v":0},{"$f":"H71-H75","v":0},{"$f":"H81","v":0},{"$f":"I81","v":0},{"$f":"J81","v":0},{"$f":"K81","v":0}]
["Closing Net Fixed Assets",null,null,{"$f":"D73-D78","v":0},0,0,0,0,0,0,0,0]
["Average Net Fixed Assets",null,null,{"$f":"SUM(D80:D81)/2","v":0},0,0,0,0,0,0,0,0]
[]
["UCC for PILs Calculation"]
[null,null,null,{"$f":"D68","v":2014},{"$f":"E68","v":2015},2016,2017,2018,2019,2020,2021,2022]
[]
["Opening UCC",null,null,null,{"$f":"D95","v":0},0,0,0,0,0,0,0]
["Capital Additions (from Appendix 2-FA)",null,null,{"$f":"D72","v":0},0,0,0,0,0,0,0,0]
["UCC Before Half Year Rule",null,null,{"$f":"SUM(D87:D88)","v":0},0,0,0,0,0,0,0,0]
["Half Year Rule (1/2 Additions - Disposals)",null,null,{"$f":"D88/2","v":0},0,0,0,0,0,0,0,0]
["Reduced UCC",null,null,{"$f":"D89-D90","v":0},0,0,0,0,0,0,0,0]
["CCA Rate Class (to be entered)",null,47,{"$f":"C92","v":47},{"$f":"D92","v":47},47,47,47,47,47,47,47]
["CCA Rate  (to be entered)",null,0.08,{"$f":"C93","v":0.08},0.08,0.08,0.08,0.08,0.08,0.08,0.08,0.08]
["CCA",null,null,{"$f":"D91*D93","v":0},0,0,0,0,0,0,0,0]
["Closing UCC",null,null,{"$f":"D89-D94","v":0},0,0,0,0,0,0,0,0]

{"sheet":"App.2-FC Calc of REG Expansion","index":18,"n_rows":95,"n_cols":30,"rows_kept":95,"cut":false,"hidden":false,"merged":[[17,18,17,20],[17,21,17,23],[17,24,17,26],[17,27,17,29],[52,22,52,23],[52,25,52,26],[52,28,52,29],[47,0,47,20],[49,0,49,21],[50,0,50,1],[52,4,52,5],[52,7,52,8],[52,10,52,11],[52,13,52,14],[52,16,52,17],[52,19,52,20],[17,3,17,5],[17,6,17,8],[17,9,17,11],[17,12,17,14],[17,15,17,17],[8,0,8,14],[9,0,9,14],[11,0,11,14],[12,0,12,14],[14,0,14,14]]}
[null,null,null,null,null,null,null,null,null,null,null,null,null,"File Number:",{"$f":"EBNUMBER","v":"EB-2017-0073"}]
[null,null,null,null,null,null,null,null,null,null,null,null,null,"Exhibit:"]
[null,null,null,null,null,null,null,null,null,null,null,null,null,"Tab:"]
[null,null,null,null,null,null,null,null,null,null,null,null,null,"Schedule:"]
[null,null,null,null,null,null,null,null,null,null,null,null,null,"Page:"]
[]
[null,null,null,null,null,null,null,null,null,null,null,null,null,"Date:"]
[]
["Appendix 2-FC"]
["Calculation of Renewable Generation Connection Direct Benefits/Provincial Amount: Renewable Expansion Investments"]
[]
["This table will calculate the distributor/provincial shares of the investments entered in Part B of Appendix 2-FA."]
["Enter values in green shaded cells: WCA percentage, debt percentages, interest rates, kWh, tax rates, amortization period, CCA Class and percentage."]
["For historical investments, enter these variables for your last cost of service test year.  For 2016 and beyond, enter variables as in the application."]
["Rate Riders are not calculated for the Test Year as these assets and costs are already in the distributor's rate base."]
[]
[]
[null,null,null,{"$f":"G18-1","v":2014},null,null,{"$f":"J18-1","v":2015},null,null,{"$f":"M18-1","v":2016},null,null,{"$f":"BridgeYear","v":2017},null,null,{"$f":"CONCATENATE(TestYear,\" Test Year\")","v":"2018 Test Year"},null,null,{"$f":"TestYear+1","v":2019},2016,null,{"$f":"S18+1","v":2020},null,null,{"$f":"V18+1","v":2021},null,null,{"$f":"Y18+1","v":2022}]
[null,null,null,null,"Direct Benefit","Provincial",null,"Direct Benefit","Provincial",null,"Direct Benefit","Provincial",null,"Direct Benefit","Provincial",null,"Direct Benefit","Provincial",null,"Direct Benefit","Provincial",null,"Direct Benefit","Provincial",null,"Direct Benefit","Provincial",null,"Direct Benefit","Provincial"]
[null,null,null,"Total",0.17,0.83,"Total",0.17,0.83,"Total",0.17,0.83,"Total",0.17,0.83,"Total",0.17,0.83,"Total",0.17,0.83,"Total",0.17,0.83,"Total",0.17,0.83,"Total",0.17,0.83]
["Net Fixed Assets (average)",null,null,{"$f":"D82","v":0},{"$f":"D21*E20","v":0},{"$f":"D21*F20","v":0},{"$f":"E82","v":0},{"$f":"G21*H20","v":0},{"$f":"G21*I20","v":0},{"$f":"F82","v":0},{"$f":"J21*K20","v":0},{"$f":"J21*L20","v":0},{"$f":"G82","v":0},{"$f":"M21*N20","v":0},{"$f":"M21*O20","v":0},{"$f":"H82","v":0},{"$f":"P21*Q20","v":0},{"$f":"P21*R20","v":0},{"$f":"I82","v":0},{"$f":"S21*T20","v":0},{"$f":"S21*U20","v":0},{"$f":"J82","v":0},{"$f":"V21*W20","v":0},{"$f":"V21*X20","v":0},{"$f":"K82","v":0},{"$f":"Y21*Z20","v":0},{"$f":"Y21*AA20","v":0},{"$f":"L82","v":0},{"$f":"AB21*AC20","v":0},{"$f":"AB21*AD20","v":0}]
["Incremental OM&A (on-going, N/A for Provincial Recovery)",null,null,{"$f":"'App.2-FA Proposed REG Invest.'!C101","v":0},{"$f":"D22","v":0},null,{"$f":"'App.2-FA Proposed REG Invest.'!D$101","v":0},{"$f":"G22","v":0},null,{"$f":"'App.2-FA Proposed REG Invest.'!E$101","v":0},{"$f":"J22","v":0},null,{"$f":"'App.2-FA Proposed REG Invest.'!F$101","v":0},{"$f":"M22","v":0},null,{"$f":"'App.2-FA Proposed REG Invest.'!G$101","v":0},{"$f":"P22","v":0},null,{"$f":"'App.2-FA Proposed REG Invest.'!H$101","v":0},{"$f":"S22","v":0},null,{"$f":"'App.2-FA Proposed REG Invest.'!I$101","v":0},{"$f":"V22","v":0},null,{"$f":"'App.2-FA Proposed REG Invest.'!J$101","v":0},{"$f":"Y22","v":0},null,{"$f":"'App.2-FA Proposed REG Invest.'!K$101","v":0},{"$f":"AB22","v":0}]
["Incremental OM&A (start-up, applicable for Provincial Recovery)",null,null,{"$f":"'App.2-FA Proposed REG Invest.'!C100","v":0},{"$f":"D23*E20","v":0},{"$f":"D23*F20","v":0},{"$f":"'App.2-FA Proposed REG Invest.'!D$100","v":0},{"$f":"G23*H20","v":0},{"$f":"G23*I20","v":0},{"$f":"'App.2-FA Proposed REG Invest.'!E$100","v":0},{"$f":"J23*K20","v":0},{"$f":"J23*L20","v":0},{"$f":"'App.2-FA Proposed REG Invest.'!F$100","v":0},{"$f":"M23*N20","v":0},{"$f":"M23*O20","v":0},{"$f":"'App.2-FA Proposed REG Invest.'!G$100","v":0},{"$f":"P23*Q20","v":0},{"$f":"P23*R20","v":0},{"$f":"'App.2-FA Proposed REG Invest.'!H$100","v":0},{"$f":"S23*T20","v":0},{"$f":"S23*U20","v":0},{"$f":"'App.2-FA Proposed REG Invest.'!I$100","v":0},{"$f":"V23*W20","v":0},{"$f":"V23*X20","v":0},{"$f":"'App.2-FA Proposed REG Invest.'!J$100","v":0},{"$f":"Y23*Z20","v":0},{"$f":"Y23*AA20","v":0},{"$f":"'App.2-FA Proposed REG Invest.'!K$100","v":0},{"$f":"AB23*AC20","v":0},{"$f":"AB23*AD20","v":0}]
["WCA",null,null,null,{"$f":"(E22+E23)*$B$24","v":0},{"$f":"F23*$B$24","v":0},null,{"$f":"(H22+H23)*$B$24","v":0},{"$f":"I23*$B$24","v":0},null,{"$f":"(K22+K23)*$B$24","v":0},{"$f":"L23*$B$24","v":0},null,{"$f":"(N22+N23)*$B$24","v":0},{"$f":"O23*$B$24","v":0},null,{"$f":"(Q22+Q23)*$B$24","v":0},{"$f":"R23*$B$24","v":0},null,{"$f":"(T22+T23)*$B$24","v":0},{"$f":"U23*$B$24","v":0},null,{"$f":"(W22+W23)*$B$24","v":0},{"$f":"X23*$B$24","v":0},null,{"$f":"(Z22+Z23)*$B$24","v":0},{"$f":"AA23*$B$24","v":0},null,{"$f":"(AC22+AC23)*$B$24","v":0},{"$f":"AD23*$B$24","v":0}]
["Rate Base",null,null,null,{"$f":"SUM(E21+E24)","v":0},{"$f":"SUM(F21+F24)","v":0},null,{"$f":"SUM(H21+H24)","v":0},{"$f":"SUM(I21+I24)","v":0},null,{"$f":"SUM(K21+K24)","v":0},{"$f":"SUM(L21+L24)","v":0},null,{"$f":"SUM(N21+N24)","v":0},{"$f":"SUM(O21+O24)","v":0},null,{"$f":"SUM(Q21+Q24)","v":0},{"$f":"SUM(R21+R24)","v":0},null,{"$f":"SUM(T21+T24)","v":0},{"$f":"SUM(U21+U24)","v":0},null,{"$f":"SUM(W21+W24)","v":0},{"$f":"SUM(X21+X24)","v":0},null,{"$f":"SUM(Z21+Z24)","v":0},{"$f":"SUM(AA21+AA24)","v":0},null,{"$f":"SUM(AC21+AC24)","v":0},{"$f":"SUM(AD21+AD24)","v":0}]
[]
[]
["Deemed ST Debt",null,null,null,{"$f":"E25*$B$28","v":0},{"$f":"F25*$B$28","v":0},null,{"$f":"H25*$B$28","v":0},{"$f":"I25*$B$28","v":0},null,{"$f":"K25*$B$28","v":0},{"$f":"L25*$B$28","v":0},null,{"$f":"N25*$B$28","v":0},{"$f":"O25*$B$28","v":0},null,{"$f":"Q25*$B$28","v":0},{"$f":"R25*$B$28","v":0},null,{"$f":"T25*$B$28","v":0},{"$f":"U25*$B$28","v":0},null,{"$f":"W25*$B$28","v":0},{"$f":"X25*$B$28","v":0},null,{"$f":"Z25*$B$28","v":0},{"$f":"AA25*$B$28","v":0},null,{"$f":"AC25*$B$28","v":0},{"$f":"AD25*$B$28","v":0}]
["Deemed LT Debt",null,null,null,{"$f":"E25*$B$29","v":0},{"$f":"F25*$B$29","v":0},null,{"$f":"H25*$B$29","v":0},{"$f":"I25*$B$29","v":0},null,{"$f":"K25*$B$29","v":0},{"$f":"L25*$B$29","v":0},null,{"$f":"N25*$B$29","v":0},{"$f":"O25*$B$29","v":0},null,{"$f":"Q25*$B$29","v":0},{"$f":"R25*$B$29","v":0},null,{"$f":"T25*$B$29","v":0},{"$f":"U25*$B$29","v":0},null,{"$f":"W25*$B$29","v":0},{"$f":"X25*$B$29","v":0},null,{"$f":"Z25*$B$29","v":0},{"$f":"AA25*$B$29","v":0},null,{"$f":"AC25*$B$29","v":0},{"$f":"AD25*$B$29","v":0}]
["Deemed Equity",null,null,null,{"$f":"E25*$B$30","v":0},{"$f":"F25*$B$30","v":0},null,{"$f":"H25*$B$30","v":0},{"$f":"I25*$B$30","v":0},null,{"$f":"K25*$B$30","v":0},{"$f":"L25*$B$30","v":0},null,{"$f":"N25*$B$30","v":0},{"$f":"O25*$B$30","v":0},null,{"$f":"Q25*$B$30","v":0},{"$f":"R25*$B$30","v":0},null,{"$f":"T25*$B$30","v":0},{"$f":"U25*$B$30","v":0},null,{"$f":"W25*$B$30","v":0},{"$f":"X25*$B$30","v":0},null,{"$f":"Z25*$B$30","v":0},{"$f":"AA25*$B$30","v":0},null,{"$f":"AC25*$B$30","v":0},{"$f":"AD25*$B$30","v":0}]
[]
["ST Interest",null,null,null,{"$f":"E28*$B$32","v":0},{"$f":"F28*$B$32","v":0},null,{"$f":"H28*$B$32","v":0},{"$f":"I28*$B$32","v":0},null,{"$f":"K28*$B$32","v":0},{"$f":"L28*$B$32","v":0},null,{"$f":"N28*$B$32","v":0},{"$f":"O28*$B$32","v":0},null,{"$f":"Q28*$B$32","v":0},{"$f":"R28*$B$32","v":0},null,{"$f":"T28*$B$32","v":0},{"$f":"U28*$B$32","v":0},null,{"$f":"W28*$B$32","v":0},{"$f":"X28*$B$32","v":0},null,{"$f":"Z28*$B$32","v":0},{"$f":"AA28*$B$32","v":0},null,{"$f":"AC28*$B$32","v":0},{"$f":"AD28*$B$32","v":0}]
["LT Interest",null,null,null,{"$f":"E29*$B$33","v":0},{"$f":"F29*$B$33","v":0},null,{"$f":"H29*$B$33","v":0},{"$f":"I29*$B$33","v":0},null,{"$f":"K29*$B$33","v":0},{"$f":"L29*$B$33","v":0},null,{"$f":"N29*$B$33","v":0},{"$f":"O29*$B$33","v":0},null,{"$f":"Q29*$B$33","v":0},{"$f":"R29*$B$33","v":0},null,{"$f":"T29*$B$33","v":0},{"$f":"U29*$B$33","v":0},null,{"$f":"W29*$B$33","v":0},{"$f":"X29*$B$33","v":0},null,{"$f":"Z29*$B$33","v":0},{"$f":"AA29*$B$33","v":0},null,{"$f":"AC29*$B$33","v":0},{"$f":"AD29*$B$33","v":0}]
["ROE",null,null,null,{"$f":"E30*$B$34","v":0},{"$f":"F30*$B$34","v":0},null,{"$f":"H30*$B$34","v":0},{"$f":"I30*$B$34","v":0},null,{"$f":"K30*$B$34","v":0},{"$f":"L30*$B$34","v":0},null,{"$f":"N30*$B$34","v":0},{"$f":"O30*$B$34","v":0},null,{"$f":"Q30*$B$34","v":0},{"$f":"R30*$B$34","v":0},null,{"$f":"T30*$B$34","v":0},{"$f":"U30*$B$34","v":0},null,{"$f":"W30*$B$34","v":0},{"$f":"X30*$B$34","v":0},null,{"$f":"Z30*$B$34","v":0},{"$f":"AA30*$B$34","v":0},null,{"$f":"AC30*$B$34","v":0},{"$f":"AD30*$B$34","v":0}]
["Cost of Capital Total",null,null,null,{"$f":"SUM(E32:E34)","v":0},{"$f":"SUM(F32:F34)","v":0},null,{"$f":"SUM(H32:H34)","v":0},{"$f":"SUM(I32:I34)","v":0},null,{"$f":"SUM(K32:K34)","v":0},{"$f":"SUM(L32:L34)","v":0},null,{"$f":"SUM(N32:N34)","v":0},{"$f":"SUM(O32:O34)","v":0},null,{"$f":"SUM(Q32:Q34)","v":0},{"$f":"SUM(R32:R34)","v":0},null,{"$f":"SUM(T32:T34)","v":0},{"$f":"SUM(U32:U34)","v":0},null,{"$f":"SUM(W32:W34)","v":0},{"$f":"SUM(X32:X34)","v":0},null,{"$f":"SUM(Z32:Z34)","v":0},{"$f":"SUM(AA32:AA34)","v":0},null,{"$f":"SUM(AC32:AC34)","v":0},{"$f":"SUM(AD32:AD34)","v":0}]
[]
["OM&A",null,null,null,{"$f":"E22+E23","v":0},{"$f":"F23","v":0},null,{"$f":"H22+H23","v":0},{"$f":"I23","v":0},null,{"$f":"K22+K23","v":0},{"$f":"L23","v":0},null,{"$f":"N22+N23","v":0},{"$f":"O23","v":0},null,{"$f":"Q22+Q23","v":0},{"$f":"R23","v":0},null,{"$f":"T22+T23","v":0},{"$f":"U23","v":0},null,{"$f":"W22+W23","v":0},{"$f":"X23","v":0},null,{"$f":"Z22+Z23","v":0},{"$f":"AA23","v":0},null,{"$f":"AC22+AC23","v":0},{"$f":"AD23","v":0}]
["Amortization",null,null,{"$f":"D78","v":0},{"$f":"D38*E$20","v":0},{"$f":"D38*F$20","v":0},{"$f":"E78","v":0},{"$f":"G38*H$20","v":0},{"$f":"G38*I$20","v":0},{"$f":"F78","v":0},{"$f":"J38*K$20","v":0},{"$f":"J38*L$20","v":0},{"$f":"G78","v":0},{"$f":"M38*N$20","v":0},{"$f":"M38*O$20","v":0},{"$f":"H76+H77","v":0},{"$f":"P38*Q$20","v":0},{"$f":"P38*R$20","v":0},{"$f":"I76+I77","v":0},{"$f":"S38*T$20","v":0},{"$f":"S38*U$20","v":0},{"$f":"J76+J77","v":0},{"$f":"V38*W$20","v":0},{"$f":"V38*X$20","v":0},{"$f":"K76+K77","v":0},{"$f":"Y38*Z$20","v":0},{"$f":"Y38*AA$20","v":0},{"$f":"L76+L77","v":0},{"$f":"AB38*AC$20","v":0},{"$f":"AB38*AD$20","v":0}]
["Grossed-up PILs",null,null,null,{"$f":"E66","v":0},{"$f":"F66","v":0},null,{"$f":"H66","v":0},{"$f":"I66","v":0},null,{"$f":"K66","v":0},{"$f":"L66","v":0},null,{"$f":"N66","v":0},{"$f":"O66","v":0},null,{"$f":"Q66","v":0},{"$f":"R66","v":0},null,{"$f":"T66","v":0},{"$f":"U66","v":0},null,{"$f":"W66","v":0},{"$f":"X66","v":0},null,{"$f":"Z66","v":0},{"$f":"AA66","v":0},null,{"$f":"AC66","v":0},{"$f":"AD66","v":0}]
[]
["Revenue Requirement",null,null,null,{"$f":"SUM(E35:E39)","v":0},{"$f":"SUM(F35:F39)","v":0},null,{"$f":"SUM(H35:H39)","v":0},{"$f":"SUM(I35:I39)","v":0},null,{"$f":"SUM(K35:K39)","v":0},{"$f":"SUM(L35:L39)","v":0},null,{"$f":"SUM(N35:N39)","v":0},{"$f":"SUM(O35:O39)","v":0},null,{"$f":"SUM(Q35:Q39)","v":0},{"$f":"SUM(R35:R39)","v":0},null,{"$f":"SUM(T35:T39)","v":0},{"$f":"SUM(U35:U39)","v":0},null,{"$f":"SUM(W35:W39)","v":0},{"$f":"SUM(X35:X39)","v":0},null,{"$f":"SUM(Z35:Z39)","v":0},{"$f":"SUM(AA35:AA39)","v":0},null,{"$f":"SUM(AC35:AC39)","v":0},{"$f":"SUM(AD35:AD39)","v":0}]
[]
[]
["Provincial Rate Protection",null,null,null,null,{"$f":"F41","v":0},null,null,{"$f":"I41","v":0},null,null,{"$f":"L41","v":0},null,null,{"$f":"O41","v":0},null,null,{"$f":"R41","v":0},null,null,{"$f":"U41","v":0},null,null,{"$f":"X41","v":0},null,null,{"$f":"AA41","v":0},null,null,{"$f":"AD41","v":0}]
[]
["Monthly Amount Paid by IESO",null,null,null,null,{"$f":"F44/12","v":0},null,null,{"$f":"I44/12","v":0},null,null,{"$f":"L44/12","v":0},null,null,{"$f":"O44/12","v":0},null,null,{"$f":"R44/12","v":0},null,null,{"$f":"U44/12","v":0},null,null,{"$f":"X44/12","v":0},null,null,{"$f":"AA44/12","v":0},null,null,{"$f":"AD44/12","v":0}]
[]
["Note 1: The difference between the actual costs of approved eligible investments and revenue received from the IESO should be recorded in a variance account.  The Board may provide "]
["regulatory accounting guidance regarding a variance account either in an individual proceeding or on a generic basis."]
["Note 2: For the 2016 Test Year, Costs and Revenues of the Direct Benefit are to be included in the test year applicant Rate Base and Revenues."]
[]
["PILs Calculation"]
[null,null,null,null,{"$f":"D18","v":2014},null,null,{"$f":"G18","v":2015},null,null,{"$f":"J18","v":2016},null,null,{"$f":"M18","v":2017},null,null,{"$f":"P18","v":"2018 Test Year"},null,null,{"$f":"S18","v":2019},null,null,{"$f":"V18","v":2020},null,null,{"$f":"Y18","v":2021},null,null,{"$f":"AB18","v":2022}]
["Income Tax",null,null,null,"Direct Benefit","Provincial",null,"Direct Benefit","Provincial",null,"Direct Benefit","Provincial",null,"Direct Benefit","Provincial",null,"Direct Benefit","Provincial",null,"Direct Benefit","Provincial",null,"Direct Benefit","Provincial",null,"Direct Benefit","Provincial",null,"Direct Benefit","Provincial"]
[null,null,null,null,null,null,null,null,null,null,null,null,null,null,null,null,null,null,null,null,null,"Total",null,null,"Total",null,null,"Total"]
["Net Income - ROE on Rate Base",null,null,null,{"$f":"E34","v":0},{"$f":"F34","v":0},null,{"$f":"H34","v":0},{"$f":"I34","v":0},null,{"$f":"K34","v":0},{"$f":"L34","v":0},null,{"$f":"N34","v":0},{"$f":"O34","v":0},null,{"$f":"Q34","v":0},{"$f":"R34","v":0},null,{"$f":"T34","v":0},{"$f":"U34","v":0},null,{"$f":"W34","v":0},{"$f":"X34","v":0},null,{"$f":"Z34","v":0},{"$f":"AA34","v":0},null,{"$f":"AC34","v":0},{"$f":"AD34","v":0}]
["Amortization (17% DB and 83% P)",null,null,null,{"$f":"E38","v":0},{"$f":"F38","v":0},null,{"$f":"H38","v":0},{"$f":"I38","v":0},null,{"$f":"K38","v":0},{"$f":"L38","v":0},null,{"$f":"N38","v":0},{"$f":"O38","v":0},null,{"$f":"Q38","v":0},{"$f":"R38","v":0},null,{"$f":"T38","v":0},{"$f":"U38","v":0},null,{"$f":"W38","v":0},{"$f":"X38","v":0},null,{"$f":"Z38","v":0},{"$f":"AA38","v":0},null,{"$f":"AC38","v":0},{"$f":"AD38","v":0}]
["CCA (17% DB and 83% P)",null,null,null,{"$f":"-D94*E$20","v":0},{"$f":"-D94*F$20","v":0},null,{"$f":"-E94*H$20","v":0},{"$f":"-E94*I$20","v":0},null,{"$f":"-F94*K$20","v":0},{"$f":"-F94*L$20","v":0},null,{"$f":"-G94*N$20","v":0},{"$f":"-G94*O$20","v":0},null,{"$f":"-H94*Q$20","v":0},{"$f":"-H94*R$20","v":0},null,{"$f":"-I94*T$20","v":0},{"$f":"-I94*U$20","v":0},null,{"$f":"-J94*W$20","v":0},{"$f":"-J94*X$20","v":0},null,{"$f":"-K94*Z$20","v":0},{"$f":"-K94*AA$20","v":0},null,{"$f":"-L94*AC$20","v":0},{"$f":"-L94*AD$20","v":0}]
["Taxable income",null,null,null,{"$f":"SUM(E56:E58)","v":0},{"$f":"SUM(F56:F58)","v":0},null,{"$f":"SUM(H56:H58)","v":0},{"$f":"SUM(I56:I58)","v":0},null,{"$f":"SUM(K56:K58)","v":0},{"$f":"SUM(L56:L58)","v":0},null,{"$f":"SUM(N56:N58)","v":0},{"$f":"SUM(O56:O58)","v":0},null,{"$f":"SUM(Q56:Q58)","v":0},{"$f":"SUM(R56:R58)","v":0},null,{"$f":"SUM(T56:T58)","v":0},{"$f":"SUM(U56:U58)","v":0},null,{"$f":"SUM(W56:W58)","v":0},{"$f":"SUM(X56:X58)","v":0},null,{"$f":"SUM(Z56:Z58)","v":0},{"$f":"SUM(AA56:AA58)","v":0},null,{"$f":"SUM(AC56:AC58)","v":0},{"$f":"SUM(AD56:AD58)","v":0}]
[]
["Tax Rate  (to be entered)"]
[]
["Income Taxes Payable",null,null,null,{"$f":"E59*E61","v":0},{"$f":"F59*F61","v":0},null,{"$f":"H59*H61","v":0},{"$f":"I59*I61","v":0},null,{"$f":"K59*K61","v":0},{"$f":"L59*L61","v":0},null,{"$f":"N59*N61","v":0},{"$f":"O59*O61","v":0},null,{"$f":"Q59*Q61","v":0},{"$f":"R59*R61","v":0},null,{"$f":"T59*T61","v":0},{"$f":"U59*U61","v":0},null,{"$f":"W59*W61","v":0},{"$f":"X59*X61","v":0},null,{"$f":"Z59*Z61","v":0},{"$f":"AA59*AA61","v":0},null,{"$f":"AC59*AC61","v":0},{"$f":"AD59*AD61","v":0}]
["Gross Up"]
["Income Taxes Payable",null,null,null,{"$f":"E63/(1-E61)","v":0},{"$f":"F63/(1-F61)","v":0},null,{"$f":"H63/(1-H61)","v":0},{"$f":"I63/(1-I61)","v":0},null,{"$f":"K63/(1-K61)","v":0},{"$f":"L63/(1-L61)","v":0},null,{"$f":"N63/(1-N61)","v":0},{"$f":"O63/(1-O61)","v":0},null,{"$f":"Q63/(1-Q61)","v":0},{"$f":"R63/(1-R61)","v":0},null,{"$f":"T63/(1-T61)","v":0},{"$f":"U63/(1-U61)","v":0},null,{"$f":"W63/(1-W61)","v":0},{"$f":"X63/(1-X61)","v":0},null,{"$f":"Z63/(1-Z61)","v":0},{"$f":"AA63/(1-AA61)","v":0},null,{"$f":"AC63/(1-AC61)","v":0},{"$f":"AD63/(1-AD61)","v":0}]
["Grossed Up PILs",null,null,null,{"$f":"SUM(E65:E65)","v":0},{"$f":"SUM(F65:F65)","v":0},null,{"$f":"SUM(H65:H65)","v":0},{"$f":"SUM(I65:I65)","v":0},null,{"$f":"SUM(K65:K65)","v":0},{"$f":"SUM(L65:L65)","v":0},null,{"$f":"SUM(N65:N65)","v":0},{"$f":"SUM(O65:O65)","v":0},null,{"$f":"SUM(Q65:Q65)","v":0},{"$f":"SUM(R65:R65)","v":0},null,{"$f":"SUM(T65:T65)","v":0},{"$f":"SUM(U65:U65)","v":0},null,{"$f":"SUM(W65:W65)","v":0},{"$f":"SUM(X65:X65)","v":0},null,{"$f":"SUM(Z65:Z65)","v":0},{"$f":"SUM(AA65:AA65)","v":0},null,{"$f":"SUM(AC65:AC65)","v":0},{"$f":"SUM(AD65:AD65)","v":0}]
[]
[]
["Net Fixed Assets",null,null,2011,2012,2013,2014,2015,2016,2017,2018,2019]
[null,"Enter applicable amortization in years:",25]
["Opening Gross Fixed Assets",null,null,null,{"$f":"D73","v":0},0,0,0,0,0,0,0]
["Gross Capital Additions",null,null,{"$f":"'App.2-FA Proposed REG Invest.'!C99","v":0},{"$f":"'App.2-FA Proposed REG Invest.'!D99","v":0},{"$f":"'App.2-FA Proposed REG Invest.'!E99","v":0},{"$f":"'App.2-FA Proposed REG Invest.'!F99","v":0},{"$f":"'App.2-FA Proposed REG Invest.'!G99","v":0},{"$f":"'App.2-FA Proposed REG Invest.'!H99","v":0},{"$f":"'App.2-FA Proposed REG Invest.'!I99","v":0},{"$f":"'App.2-FA Proposed REG Invest.'!J99","v":0},{"$f":"'App.2-FA Proposed REG Invest.'!K99","v":0}]
["Closing Gross Fixed Assets",null,null,{"$f":"SUM(D71:D72)","v":0},0,0,0,0,0,0,0,0]
[]
["Opening Accumulated Amortization",null,null,null,{"$f":"+D78","v":0},{"$f":"E78","v":0},0,0,0,0,0,0]
["Current Year Amortization (before additions)",null,null,null,{"$f":"IF(ISERROR(E71/$C$70), 0, E71/$C$70)","v":0},{"$f":"IF(ISERROR(F71/$C$70), 0, F71/$C$70)","v":0},{"$f":"IF(ISERROR(G71/$C$70), 0, G71/$C$70)","v":0},{"$f":"H71/$C$70","v":0},{"$f":"I71/$C$70","v":0},{"$f":"J71/$C$70","v":0},{"$f":"K71/$C$70","v":0},{"$f":"L71/$C$70","v":0}]
["Additions (half year)",null,null,{"$f":"D72/C70/2","v":0},{"$f":"E72/C70/2","v":0},{"$f":"F72/C70/2","v":0},{"$f":"G72/C70/2","v":0},{"$f":"H72/C70/2","v":0},{"$f":"I72/C70/2","v":0},{"$f":"J72/C70/2","v":0},{"$f":"K72/C70/2","v":0},{"$f":"L72/C70/2","v":0}]
["Closing Accumulated Amortization",null,null,{"$f":"SUM(D75+D77)","v":0},{"$f":"SUM(E75:E77)","v":0},0,0,0,0,0,0,0]
[]
["Opening Net Fixed Assets",null,null,{"$f":"D71-D75","v":0},{"$f":"E71-E75","v":0},{"$f":"F71-F75","v":0},{"$f":"G71-G75","v":0},{"$f":"G81","v":0},{"$f":"H81","v":0},{"$f":"I81","v":0},{"$f":"J81","v":0},{"$f":"K81","v":0}]
["Closing Net Fixed Assets",null,null,{"$f":"D73-D78","v":0},0,0,0,0,0,0,0,0]
["Average Net Fixed Assets",null,null,{"$f":"SUM(D80:D81)/2","v":0},0,0,0,0,0,0,0,0]
[]
["UCC for PILs Calculation"]
[null,null,null,2014,2014,2014,2014,2015,2016,2017,2018,2019]
[]
["Opening UCC",null,null,null,{"$f":"D95","v":0},0,0,0,0,0,0,0]
["Capital Additions (from Appendix 2-FA)",null,null,{"$f":"D72","v":0},0,0,0,0,0,0,0,0]
["UCC Before Half Year Rule",null,null,{"$f":"SUM(D87:D88)","v":0},0,0,0,0,0,0,0,0]
["Half Year Rule (1/2 Additions - Disposals)",null,null,{"$f":"D88/2","v":0},0,0,0,0,0,0,0,0]
["Reduced UCC",null,null,{"$f":"D89-D90","v":0},0,0,0,0,0,0,0,0]
["CCA Rate Class (to be entered)",null,47,{"$f":"$C$92","v":47},{"$f":"$C$92","v":47},47,47,47,47,47,47,47]
["CCA Rate  (to be entered)",null,0.08,{"$f":"$C$93","v":0.08},{"$f":"$C$93","v":0.08},0.08,0.08,0.08,0.08,0.08,0.08,0.08]
["CCA",null,null,{"$f":"D91*D$93","v":0},0,0,0,0,0,0,0,0]
["Closing UCC",null,null,{"$f":"D89-D94","v":0},0,0,0,0,0,0,0,0]

{"sheet":"App.2-G SQI","index":19,"n_rows":40,"n_cols":16,"rows_kept":40,"cut":false,"hidden":false,"merged":[[21,6,21,9],[14,0,15,0],[14,1,14,5],[14,6,14,10],[0,14,0,15],[1,14,1,15],[2,14,2,15],[3,14,3,15],[4,14,4,15],[28,0,28,3],[6,14,6,15],[14,11,14,15],[20,11,20,14],[21,11,21,14],[19,0,19,15],[8,0,8,15],[9,0,9,15],[10,0,10,15],[12,0,12,15],[20,1,20,4],[20,6,20,9],[23,0,23,10],[24,0,24,10],[26,0,26,10],[21,1,21,4],[34,4,34,5],[35,4,35,5],[36,4,36,5],[28,4,28,5],[29,4,29,5],[30,4,30,5],[31,4,31,5],[37,4,37,5],[38,4,38,5],[39,4,39,5],[29,0,29,3],[30,0,30,3],[31,0,31,3],[32,0,32,3],[33,0,33,3],[34,0,34,3],[35,0,35,3],[36,0,36,3],[37,0,37,3],[38,0,38,3],[39,0,39,3],[32,4,32,5],[33,4,33,5]]}
[null,null,null,null,null,null,null,null,null,null,null,null,"File Number:",null,{"$f":"EBNUMBER","v":"EB-2017-0073"}]
[null,null,null,null,null,null,null,null,null,null,null,null,"Exhibit:",null,2]
[null,null,null,null,null,null,null,null,null,null,null,null,"Tab:"]
[null,null,null,null,null,null,null,null,null,null,null,null,"Schedule:"]
[null,null,null,null,null,null,null,null,null,null,null,null,"Page:"]
[]
[null,null,null,null,null,null,null,null,null,null,null,null,"Date:",null,"2017-08-28"]
[]
["Appendix 2-G"]
["Service Reliability and Quality Indicators"]
["2012 - 2016"]
[]
["Service Reliability"]
[]
["Index","Including outages caused by loss of supply",null,null,null,null,"Excluding outages caused by loss of supply",null,null,null,null,"Excluding Major Event Days"]
[null,{"$f":"TestYear-6","v":2012},{"$f":"TestYear-5","v":2013},{"$f":"TestYear-4","v":2014},{"$f":"TestYear-3","v":2015},{"$f":"TestYear-2","v":2016},{"$f":"B16","v":2012},2013,2014,2015,2016,2012,2013,2014,2015,2016]
["SAIDI ",0.53,4.7300000000000004,6.18,11.22,25.28,0.47,0.23,1.28,0.68,1.74,0.47,0.23,1.28,0.68,0.67]
["SAIFI",1.18,1.28,3.69,2.36,5.18,0.17,0.28000000000000003,0.74,0.36,1.18,0.17,0.28000000000000003,0.74,0.36,0.56999999999999995]
[]
["5 Year Historical Average"]
["SAIDI ",null,null,null,null,{"$f":"IF(ISERROR(AVERAGE(B17:F17)), \"\", AVERAGE(B17:F17))","v":9.588000000000001},null,null,null,null,{"$f":"IF(ISERROR(AVERAGE(G17:K17)), \"\", AVERAGE(G17:K17))","v":0.88000000000000012},null,null,null,null,{"$f":"IF(ISERROR(AVERAGE(L17:P17)), \"\", AVERAGE(L17:P17))","v":0.66600000000000004}]
["SAIFI",null,null,null,null,{"$f":"IF(ISERROR(AVERAGE(B18:F18)), \"\", AVERAGE(B18:F18))","v":2.738},null,null,null,null,{"$f":"IF(ISERROR(AVERAGE(G18:K18)), \"\", AVERAGE(G18:K18))","v":0.54599999999999993},null,null,null,null,{"$f":"IF(ISERROR(AVERAGE(L18:P18)), \"\", AVERAGE(L18:P18))","v":0.42399999999999993}]
[]
["SAIDI = System Average Interruption Duration Index"]
["SAIFI = System Average Interruption Frequency Index "]
[]
["Service Quality"]
[]
["Indicator",null,null,null,"OEB Minimum Standard",null,{"$f":"B16","v":2012},{"$f":"C16","v":2013},{"$f":"D16","v":2014},{"$f":"E16","v":2015},{"$f":"F16","v":2016}]
["Low Voltage Connections",null,null,null,0.9,null,0.96399999999999997,0.95,1,1,1]
["High Voltage Connections",null,null,null,0.9,null,"n/a","n/a","n/a","n/a","n/a"]
["Telephone Accessibility",null,null,null,0.65,null,0.98099999999999998,0.99,1,0.96,0.94]
["Appointments Met",null,null,null,0.9,null,0.92900000000000005,0.98499999999999999,0.98199999999999998,0.96199999999999997,0.91700000000000004]
["Written Response to Enquires",null,null,null,0.8,null,1,0.97,1,0.98,1]
["Emergency Urban Response",null,null,null,0.8,null,1,1,1,1,1]
["Emergency Rural Response",null,null,null,0.8,null,1,1,1,1,"n/a"]
["Telephone Call Abandon Rate",null,null,null,0.1,null,6.0000000000000001E-3,0,0,0.02,2.8000000000000001E-2]
["Appointment Scheduling",null,null,null,0.9,null,1,1,0.98,1,0.93300000000000005]
["Rescheduling a Missed Appointment",null,null,null,1,null,1,1,1,1,1]
["Reconnection Performance Standard",null,null,null,0.85,null,1,1,1,1,1]

{"sheet":"App.2-H_Other_Oper_Rev","index":20,"n_rows":137,"n_cols":9,"rows_kept":137,"cut":false,"hidden":false,"merged":[[6,8,6,9],[124,0,124,1],[125,0,125,1],[126,0,126,1],[127,0,127,1],[114,0,114,1],[115,0,115,1],[121,0,121,1],[122,0,122,1],[123,0,123,1],[109,0,109,1],[112,0,112,1],[113,0,113,1],[101,0,101,1],[102,0,102,1],[103,0,103,1],[91,0,91,1],[92,0,92,1],[97,0,97,1],[81,0,81,1],[86,0,86,1],[87,0,87,1],[88,0,88,1],[89,0,89,1],[77,0,77,1],[78,0,78,1],[79,0,79,1],[80,0,80,1],[90,0,90,1],[67,0,67,1],[68,0,68,1],[69,0,69,1],[75,0,75,1],[76,0,76,1],[42,0,42,8],[29,0,29,1],[30,0,30,1],[8,0,8,8],[9,0,9,8],[27,0,27,8],[28,0,28,1],[37,2,37,8],[38,2,39,8],[31,0,31,1],[32,0,32,1],[35,0,35,1],[36,0,36,1],[37,0,37,1],[38,0,38,1],[142,1,142,8],[140,1,140,8],[141,1,141,8],[52,0,52,1],[45,0,46,8],[51,0,51,1],[57,0,57,1],[53,0,53,1],[54,0,54,1],[55,0,55,1],[56,0,56,1],[136,1,136,8],[63,0,63,1],[64,0,64,1],[65,0,65,1],[66,0,66,1]]}
[null,null,null,null,null,null,null,"File Number:",{"$f":"EBNUMBER","v":"EB-2017-0073"}]
[null,null,null,null,null,null,null,"Exhibit:",3]
[null,null,null,null,null,null,null,"Tab:"]
[null,null,null,null,null,null,null,"Schedule:"]
[null,null,null,null,null,null,null,"Page:"]
[]
[null,null,null,null,null,null,null,"Date:","2017-08-28"]
[]
["Appendix 2-H"]
["Other Operating Revenue"]
[]
["USoA #","USoA Description",{"$f":"F13-2 & \" Actual\" & CHAR(178)","v":"2013 Actual²"},{"$f":"D13&\" Actual\"&CHAR(178)","v":"2014 Actual²"},{"$f":"E13 & \" Actual\" & CHAR(178)","v":"2014 Actual²"},{"$f":"F13 & \" Actual\" & CHAR(178)","v":"2015 Actual²"},{"$f":"G13 & \" Actual\" & CHAR(178)","v":"2016 Actual²"},{"$f":"\"Bridge Year\"","v":"Bridge Year"},"Test Year"]
[null,null,{"$f":"D13-1","v":2013},{"$f":"F13-1","v":2014},{"$f":"F13-1","v":2014},{"$f":"I13-3","v":2015},{"$f":"I13-2","v":2016},{"$f":"BridgeYear","v":2017},{"$f":"TestYear","v":2018}]
[null,"Reporting Basis","CGAAP","CGAAP","MIFRS","MIFRS","MIFRS","MIFRS","MIFRS"]
[4235,"Specific Service Charges",17685,18275,18275,17770,17965,18000,18000]
[4225,"Late Payment Charges",38446.79,52423.55,52423.55,46090.73,48896.78,{"$f":"AVERAGE(C16:G16)","v":47656.280000000006},49498]
[4086,"SS Revenue",8139.5,8048.77,8048.77,7900.52,8135.27,8463,8484]
[4210,"Rent from Electric Property",42858.83,42949.01,42949.01,47261,45333.14,{"$f":"G18*1.09","v":49413.122600000002},50247]
[4215,"Other Utility Operating Income",0,1000,1000]
[4245,"Gov't Assist Directly Credit to Income",0,0,1292.55,2496.52,2477,4955,7468]
[4360,"Loss on Disposition of Utility & Other Property",-1167,-6074,-6074]
[4362,"Loss on Retirement of Utility & Other Property",null,null,null,-2042,-1337,{"$f":"AVERAGE(C22:G22)","v":-1689.5},-2000]
[4375,"Revenue from Non-Utility Operations",85375,145790,145790,219152,87633]
[4380,"Expense from Non-Utility Operations",-85375,-145790,-145790,-174458,-87366]
[4385,"Non-Utility Rental Income",10951.17,10951.99,10951.99,10724,11365,{"$f":"AVERAGE(C25:G25)","v":10988.83},11500]
[4405,"Interest and Dividend Income",4762,3055,3055,2138,2578,{"$f":"AVERAGE(C26,E26,F26,G26)","v":3133.25},3500]
[]
[]
["Specific Service Charges",null,{"$f":"C15","v":17685},18275,18275,17770,17965,18000,18000]
["Late Payment Charges",null,38446.79,52423.55,52423.55,46090.73,48896.78,47656.280000000006,49498]
["Other Operating Revenues",null,{"$f":"SUM(C17:C20)","v":50998.33},51997.78,53290.33,57658.04,55945.41,62831.122600000002,66199]
["Other Income or Deductions",null,{"$f":"SUM(C21:C27)-C25","v":3595},-3019,-3019,44790,1508,1443.75,1500]
["Total",null,{"$f":"SUM(C29:C32)","v":110725.12},119677.33,120969.88,166308.77000000002,124315.19,129931.1526,135197]
[]
["Description",null,"Account(s)"]
["Specific Service Charges:",null,4235]
["Late Payment Charges:",null,4225,null,null,null,8]
["Other Distribution Revenues:",null,"4080, 4082, 4084, 4090, 4205, 4210, 4215, 4220, 4240, 4245"]
["Other Income and Expenses:",null,"4305, 4310, 4315, 4320, 4325, 4330, 4335, 4340, 4345, 4350, 4355, 4360, 4365, 4370, 4375, 4380, 4385, 4390, 4395, 4398, 4405, 4415"]
[]
[]
["Note: Add all applicable accounts listed above to the table and include all relevant information."]
[]
["Account Breakdown Details"]
[]
["For each \"Other Operating Revenue\" and \"Other Income or Deductions\" Account, a detailed breakdown of the account components is required.  See the example below for Account 4405, Interest and Dividend Income."]
[]
[]
["Account 4405 - Interest and Dividend Income"]
[null,null,{"$f":"$C$12","v":"2013 Actual²"},{"$f":"$D$12","v":"2014 Actual²"},{"$f":"$E$12","v":"2014 Actual²"},{"$f":"$F$12","v":"2015 Actual²"},{"$f":"$G$12","v":"2016 Actual²"},{"$f":"$H$12","v":"Bridge Year"},{"$f":"$I$12","v":"Test Year"}]
[null,null,{"$f":"$C$13","v":2013},{"$f":"$D$13","v":2014},{"$f":"$E$13","v":2014},{"$f":"$F$13","v":2015},{"$f":"$G$13","v":2016},{"$f":"$H$13","v":2017},{"$f":"$I$13","v":2018}]
["Reporting Basis",null,{"$f":"IF($C$14=0, \"\", $C$14)","v":"CGAAP"},{"$f":"IF($D$14=0, \"\", $D$14)","v":"CGAAP"},{"$f":"IF($E$14=0, \"\", $E$14)","v":"MIFRS"},{"$f":"IF($F$14=0, \"\", $F$14)","v":"MIFRS"},{"$f":"IF($G$14=0, \"\", $G$14)","v":"MIFRS"},{"$f":"IF($H$14=0, \"\", $H$14)","v":"MIFRS"},{"$f":"IF($I$14=0, \"\", $I$14)","v":"MIFRS"}]
["Short-term Investment Interest"]
["Bank Deposit Interest",null,4521.42,3051.31,3051.31,1934.81,2423.92,3113,3500]
["Miscellaneous Interest Revenue",null,240.2,3.2,3.2,203,153.96]
["etc.1"]
[]
["Total",null,{"$f":"SUM(C53:C57)","v":4761.62},3054.5099999999998,3054.5099999999998,2137.81,2577.88,3113,3500]
[]
[]
["Account 4210- Rent from Electric Property"]
[null,null,{"$f":"$C$12","v":"2013 Actual²"},{"$f":"$D$12","v":"2014 Actual²"},{"$f":"$E$12","v":"2014 Actual²"},{"$f":"$F$12","v":"2015 Actual²"},{"$f":"$G$12","v":"2016 Actual²"},{"$f":"$H$12","v":"Bridge Year"},{"$f":"$I$12","v":"Test Year"}]
[null,null,{"$f":"$C$13","v":2013},{"$f":"$D$13","v":2014},{"$f":"$E$13","v":2014},{"$f":"$F$13","v":2015},{"$f":"$G$13","v":2016},{"$f":"$H$13","v":2017},{"$f":"$I$13","v":2018}]
["Reporting Basis",null,{"$f":"IF($C$14=0, \"\", $C$14)","v":"CGAAP"},{"$f":"IF($D$14=0, \"\", $D$14)","v":"CGAAP"},{"$f":"IF($E$14=0, \"\", $E$14)","v":"MIFRS"},{"$f":"IF($F$14=0, \"\", $F$14)","v":"MIFRS"},{"$f":"IF($G$14=0, \"\", $G$14)","v":"MIFRS"},{"$f":"IF($H$14=0, \"\", $H$14)","v":"MIFRS"},{"$f":"IF($I$14=0, \"\", $I$14)","v":"MIFRS"}]
["Pole rental fees on Third Party Attachments",null,42859.25,42948.65,42948.65,43980.59,45333.14,49413.122600000002,50247]
["Sentinel Light rental revenue",null,10951.17,10951.99,10951.99]
["Other rental revenue",null,null,null,null,3280.5]
["etc.1"]
[]
["Total",null,{"$f":"SUM(C65:C69)","v":53810.42},53900.639999999999,53900.639999999999,47261.09,45333.14,49413.122600000002,50247]
[]
[]
["Account 4215- Other Utility Operating Income"]
[null,null,{"$f":"$C$12","v":"2013 Actual²"},{"$f":"$D$12","v":"2014 Actual²"},{"$f":"$E$12","v":"2014 Actual²"},{"$f":"$F$12","v":"2015 Actual²"},{"$f":"$G$12","v":"2016 Actual²"},{"$f":"$H$12","v":"Bridge Year"},{"$f":"$I$12","v":"Test Year"}]
[null,null,{"$f":"$C$13","v":2013},{"$f":"$D$13","v":2014},{"$f":"$E$13","v":2014},{"$f":"$F$13","v":2015},{"$f":"$G$13","v":2016},{"$f":"$H$13","v":2017},{"$f":"$I$13","v":2018}]
["Reporting Basis",null,{"$f":"IF($C$14=0, \"\", $C$14)","v":"CGAAP"},{"$f":"IF($D$14=0, \"\", $D$14)","v":"CGAAP"},{"$f":"IF($E$14=0, \"\", $E$14)","v":"MIFRS"},{"$f":"IF($F$14=0, \"\", $F$14)","v":"MIFRS"},{"$f":"IF($G$14=0, \"\", $G$14)","v":"MIFRS"},{"$f":"IF($H$14=0, \"\", $H$14)","v":"MIFRS"},{"$f":"IF($I$14=0, \"\", $I$14)","v":"MIFRS"}]
["Small Business Hiring Credit",null,null,999.83,999.83]
[]
[]
[]
[]
["Total",null,{"$f":"SUM(C77:C81)","v":0},999.83,999.83,0,0,0,0]
[]
["Account 4245- Gov't Assist Directly Credit to Income"]
[null,null,{"$f":"$C$12","v":"2013 Actual²"},{"$f":"$D$12","v":"2014 Actual²"},{"$f":"$E$12","v":"2014 Actual²"},{"$f":"$F$12","v":"2015 Actual²"},{"$f":"$G$12","v":"2016 Actual²"},{"$f":"$H$12","v":"Bridge Year"},{"$f":"$I$12","v":"Test Year"}]
[null,null,{"$f":"$C$13","v":2013},{"$f":"$D$13","v":2014},{"$f":"$E$13","v":2014},{"$f":"$F$13","v":2015},{"$f":"$G$13","v":2016},{"$f":"$H$13","v":2017},{"$f":"$I$13","v":2018}]
["Reporting Basis",null,{"$f":"IF($C$14=0, \"\", $C$14)","v":"CGAAP"},{"$f":"IF($D$14=0, \"\", $D$14)","v":"CGAAP"},{"$f":"IF($E$14=0, \"\", $E$14)","v":"MIFRS"},{"$f":"IF($F$14=0, \"\", $F$14)","v":"MIFRS"},{"$f":"IF($G$14=0, \"\", $G$14)","v":"MIFRS"},{"$f":"IF($H$14=0, \"\", $H$14)","v":"MIFRS"},{"$f":"IF($I$14=0, \"\", $I$14)","v":"MIFRS"}]
["Revenues arising from customer contributions",null,null,null,1292.55,2496.52,2477,4955,7468]
[]
[]
[]
[]
["Total",null,{"$f":"SUM(C88:C92)","v":0},0,1292.55,2496.52,2477,4955,7468]
[]
["Account 4375 -Revenue from Non-Utility Operations"]
[null,null,{"$f":"$C$12","v":"2013 Actual²"},{"$f":"$D$12","v":"2014 Actual²"},{"$f":"$E$12","v":"2014 Actual²"},{"$f":"$F$12","v":"2015 Actual²"},{"$f":"$G$12","v":"2016 Actual²"},{"$f":"$H$12","v":"Bridge Year"},{"$f":"$I$12","v":"Test Year"}]
[null,null,{"$f":"$C$13","v":2013},{"$f":"$D$13","v":2014},{"$f":"$E$13","v":2014},{"$f":"$F$13","v":2015},{"$f":"$G$13","v":2016},{"$f":"$H$13","v":2017},{"$f":"$I$13","v":2018}]
["Reporting Basis",null,{"$f":"IF($C$14=0, \"\", $C$14)","v":"CGAAP"},{"$f":"IF($D$14=0, \"\", $D$14)","v":"CGAAP"},{"$f":"IF($E$14=0, \"\", $E$14)","v":"MIFRS"},{"$f":"IF($F$14=0, \"\", $F$14)","v":"MIFRS"},{"$f":"IF($G$14=0, \"\", $G$14)","v":"MIFRS"},{"$f":"IF($H$14=0, \"\", $H$14)","v":"MIFRS"},{"$f":"IF($I$14=0, \"\", $I$14)","v":"MIFRS"}]
["Municipality Street light conversion project",null,null,null,null,111143.79]
["Revenue from IESO for Conservation Programs",null,85375,145790,145790,105069.97,87365.74]
["Miscellaneous Revenue",null,null,null,null,2938.7,266.98]
[]
[]
["Total",null,{"$f":"SUM(C99:C103)","v":85375},145790,145790,219152.46000000002,87632.72,0,0]
[]
[]
["Account 4380 -Expense from Non-Utility Operations"]
[null,null,{"$f":"$C$12","v":"2013 Actual²"},{"$f":"$D$12","v":"2014 Actual²"},{"$f":"$E$12","v":"2014 Actual²"},{"$f":"$F$12","v":"2015 Actual²"},{"$f":"$G$12","v":"2016 Actual²"},{"$f":"$H$12","v":"Bridge Year"},{"$f":"$I$12","v":"Test Year"}]
[null,null,{"$f":"$C$13","v":2013},{"$f":"$D$13","v":2014},{"$f":"$E$13","v":2014},{"$f":"$F$13","v":2015},{"$f":"$G$13","v":2016},{"$f":"$H$13","v":2017},{"$f":"$I$13","v":2018}]
["Reporting Basis",null,{"$f":"IF($C$14=0, \"\", $C$14)","v":"CGAAP"},{"$f":"IF($D$14=0, \"\", $D$14)","v":"CGAAP"},{"$f":"IF($E$14=0, \"\", $E$14)","v":"MIFRS"},{"$f":"IF($F$14=0, \"\", $F$14)","v":"MIFRS"},{"$f":"IF($G$14=0, \"\", $G$14)","v":"MIFRS"},{"$f":"IF($H$14=0, \"\", $H$14)","v":"MIFRS"},{"$f":"IF($I$14=0, \"\", $I$14)","v":"MIFRS"}]
["Municipality Street light conversion project",null,null,null,null,-73278.27]
["Expenses for IESO Conservation Programs ",null,-85375,-145790,-145790,-101179.42,-87366]
[]
[]
[]
["Total",null,{"$f":"SUM(C111:C115)","v":-85375},-145790,-145790,-174457.69,-87366,0,0]
[]
[]
["Account 4385 -Non-Utility Rental Income"]
[null,null,{"$f":"$C$12","v":"2013 Actual²"},{"$f":"$D$12","v":"2014 Actual²"},{"$f":"$E$12","v":"2014 Actual²"},{"$f":"$F$12","v":"2015 Actual²"},{"$f":"$G$12","v":"2016 Actual²"},{"$f":"$H$12","v":"Bridge Year"},{"$f":"$I$12","v":"Test Year"}]
[null,null,{"$f":"$C$13","v":2013},{"$f":"$D$13","v":2014},{"$f":"$E$13","v":2014},{"$f":"$F$13","v":2015},{"$f":"$G$13","v":2016},{"$f":"$H$13","v":2017},{"$f":"$I$13","v":2018}]
["Reporting Basis",null,{"$f":"IF($C$14=0, \"\", $C$14)","v":"CGAAP"},{"$f":"IF($D$14=0, \"\", $D$14)","v":"CGAAP"},{"$f":"IF($E$14=0, \"\", $E$14)","v":"MIFRS"},{"$f":"IF($F$14=0, \"\", $F$14)","v":"MIFRS"},{"$f":"IF($G$14=0, \"\", $G$14)","v":"MIFRS"},{"$f":"IF($H$14=0, \"\", $H$14)","v":"MIFRS"},{"$f":"IF($I$14=0, \"\", $I$14)","v":"MIFRS"}]
["Sentinel Light rental revenue",null,null,null,null,10724.44,11364.86,10988.83,11500]
[]
[]
[]
[]
["Total",null,{"$f":"SUM(C123:C127)","v":0},0,0,10724.44,11364.86,10988.83,11500]
[]
[]
[]
[]
[]
[]
["Notes:"]
[1,"List and specify any other interest revenue."]
[2,"In the transition year to IFRS, the applicant is to present information in both MIFRS and CGAAP.  For the typical applicant that adopted IFRS on January 1, 2015, 2014 must be presented in both a CGAAP and MIFRS basis."]

{"sheet":"App_2-I LF_CDM","index":21,"n_rows":98,"n_cols":14,"rows_kept":98,"cut":false,"hidden":false,"merged":[[24,0,24,7],[32,0,32,7],[84,0,84,7],[65,0,65,7],[74,0,74,7],[76,0,76,7],[78,0,78,7],[80,0,80,7],[82,0,82,7],[40,6,40,7],[42,0,42,7],[44,0,44,7],[46,0,46,7],[48,0,48,7],[69,0,69,5],[19,0,19,7],[21,0,21,7],[22,0,22,7],[17,0,17,5],[8,0,8,7],[9,0,9,7],[11,0,11,7],[13,0,13,7],[15,0,15,7],[97,0,97,7],[50,0,50,5],[52,0,52,4],[55,0,55,1],[63,0,63,1],[67,0,67,7]]}
[{"$f":"+G71+1","v":2021},null,null,null,null,null,"File Number:",{"$f":"EBNUMBER","v":"EB-2017-0073"}]
[null,null,null,null,null,null,"Exhibit:",3]
[null,null,null,null,null,null,"Tab:"]
[null,null,null,null,null,null,"Schedule:"]
[null,null,null,null,null,null,"Page:"]
[]
[null,null,null,null,null,null,"Date:","2017-08-22"]
[]
["Appendix 2-I"]
["Load Forecast CDM Adjustment Work Form (2018)"]
[]
["Appendix 2-I was initially developed to help determine what would be the amount of CDM savings needed in each year to cumulatively achieve the four year 2011-2014 CDM target.  This then determined the amount of kWh (and with translation, kW of demand) savings that were converted into dollar balances for the LRAMVA, and also to determine the related adjustment to the load forecast to account for OPA-reported savings.  Beginning in the 2015 year, it has been adjusted because the persistence of 2011-2014 CDM programs will be an adjustment to the load forecast in addition to the estimated savings for the first year (2015) for the new 2015-2020 CDM plan."]
[]
["2018 is the fourth year of the six-year (2015-2020) Conservation First program. Final results for the 2011-14 program were issued in the fall of 2015, and the program is completed, although in some instances disposition of the amounts has been deferred. For the purposes of the 2015-2020 LRAMVA, and the impact of CDM on the load forecast, CDM programs in 2014 and earlier are implicit in the historical data on which the base load forecast is developed. Only actual and forecasted impacts of 2015 to 2018 CDM programs need to be reflected in the manual load forecast adjustment and for the LRAMVA threshold amount in 2018 and carrying forward, although the full year impact of 2015 CDM programs and half-year impact of 2016 CDM programs on 2016 historical data is also assumed to be reflected in the base load forecast. "]
[]
["The new six year (2015-2020) CDM program works in a slightly different manner to the previous 2011-2014 CDM program. Distributors will offer programs each year that, over the six years (from January 1, 2015 to December 31, 2020) will strive to achieve savings equal to the new six year CDM target with the full target in place (i.e., persisting) on December 31, 2020. In other words, distributors will be able to offer and execute programs on a basis so that, as long as savings equal to the full target are in place at the end the period, the distributor's 2015-2020 CDM target will have been met."]
[]
["2015-2020 CDM Program - 2018 fourth year of the current CDM plan"]
[]
["For the first year of the new 2015-2020 CDM plan, it is assumed that each year's program will achieve an equal amount of new CDM savings.  This results in each year's program being about 1/6 (16.67%) of the cumulative 2015-2020 CDM target for kWh savings.  A distributor may propose an alternative approach but would be expected to document in its application why it believes that its proposal is more reasonable.  In its proposal, the distributor should ensure that the sum of the results for each year's CDM program from 2015 to 2020 add up to its 2015-2020 CDM target as established by the IESO."]
[]
["6 Year (2015-2020) kWh Target:"]
[3700000]
[null,2015,2016,2017,2018,2019,2020,"Total"]
["%"]
["2015 CDM Programs",null,null,null,null,null,{"$f":"G34/G40","v":6.5675675675675671E-2},{"$f":"H34/H40","v":6.5675675675675671E-2}]
["2016 CDM Programs",null,null,null,null,null,{"$f":"G35/G40","v":0.18108108108108109},{"$f":"H35/H40","v":0.18108108108108109}]
["2017 CDM Programs",null,null,null,null,null,{"$f":"G36/$H$40","v":0.19108108108108107},{"$f":"H36/H40","v":0.19108108108108107}]
["2018 CDM Programs",null,null,null,null,null,{"$f":"G37/$H$40","v":0.18756756756756757},{"$f":"H37/H40","v":0.18756756756756757}]
["2019 CDM Programs",null,null,null,null,null,{"$f":"G38/$H$40","v":0.18756756756756757},{"$f":"H38/H40","v":0.18756756756756757}]
["2020 CDM Programs",null,null,null,null,null,{"$f":"G39/$H$40","v":0.18702702702702703},{"$f":"H39/H40","v":0.18702702702702703}]
["Total in Year",{"$f":"SUM(B26:B31)","v":0},{"$f":"SUM(C26:C31)","v":0},{"$f":"SUM(D26:D31)","v":0},{"$f":"SUM(E26:E29)","v":0},{"$f":"SUM(F26:F30)","v":0},{"$f":"SUM(G26:G31)","v":0.99999999999999989},{"$f":"SUM(H26:H31)","v":0.99999999999999989}]
["kWh"]
[{"$f":"A26","v":"2015 CDM Programs"},243000,{"$f":"B34","v":243000},{"$f":"C34","v":243000},{"$f":"D34","v":243000},{"$f":"E34","v":243000},{"$f":"F34","v":243000},{"$f":"G34","v":243000}]
["2016 CDM Programs",null,670000,{"$f":"C35","v":670000},{"$f":"D35","v":670000},{"$f":"E35","v":670000},{"$f":"F35","v":670000},670000,null,null,2011,2012,2013,2014]
["2017 CDM Programs",null,null,707000,{"$f":"D36","v":707000},{"$f":"E36","v":707000},{"$f":"F36","v":707000},707000,null,"2011 CDM Programs",{"$f":"50%","v":0.5},1,1,1]
["2018 CDM Programs",null,null,null,694000,{"$f":"E37","v":694000},{"$f":"F37","v":694000},694000,null,"2012 CDM Programs",null,0.5,1,1]
["2019 CDM Programs",null,null,null,null,694000,694000,694000,null,"2013 CDM Programs",null,null,0.5,1]
["2020 CDM Programs",null,null,null,null,null,{"$f":"A23-SUM(H34:H38)","v":692000},692000,null,"2014 CDM Programs",null,null,null,0.5]
["Total in Year",{"$f":"SUM(B34:B39)","v":243000},{"$f":"SUM(C34:C39)","v":913000},{"$f":"SUM(D34:D39)","v":1620000},{"$f":"SUM(E34:E37)","v":2314000},{"$f":"SUM(F34:F38)","v":3008000},{"$f":"SUM(G34:G39)","v":3700000},{"$f":"A23","v":3700000}]
[null,null,null,null,null,null,{"$f":"IF(G40-H40<>0,\"Inputs do no match 2015-20 CDM target\",\"\")","v":""}]
[]
["Note: The default formulae in the above table assume that the 2015-2020 kWh CDM target is achieved through persistence of CDM savings to the end of 2020. The distributor should enter measured CDM savings for 2015, and persistence of 2015 programs for 2016-2020 in row 34. When available, (preliminary/final) CDM savings for 2016 can be entered into row 35. The distributor can also input estimates or forecasts of the 2017 CDM programs if it believes that these are more realistic and can be supported; such information would typically be derived from the CDM plans that the distributor has filed with the IESO. Similarly, CDM savings and persistence into future years can be estimated for 2018, 2019 and 2020 CDM programs. However, the distributor will have to support its proposals for estimated or forecasted savings, particularly beyond the 2017 bridge year. The sum of persistent savings to the end of 2020, should equal the target entered into cell A23."]
[]
["Determination of 2018 Load Forecast Adjustment"]
[]
["The Board determined that the \"net\" number should be used in its Decision and Order with respect to Centre Wellington Hydro Ltd.'s 2013 Cost of Service rates (EB-2012-0113).  This approach has also been used in Settlement Agreements accepted by the Board in other 2013 and 2014 applications.  The distributor should select whether the adjustment is done on a \"net\" or \"gross\" basis, but must support a proposal for the adjustment being done on a \"gross\" basis.  Sheet 2-I defaults to the adjustment being done on a \"net\" basis consistent with Board policy and practice."]
[]
["From each of the 2006-2010 CDM Final Report,  and the 2011 to 2016 CDM Final Reports, issued by the OPA/IESO for the distributor, the distributor should input the \"gross\" and \"net\" results of the cumulative CDM savings for 2018 into cells C57 to C63 and D57 to D63.  The model will calculate the cumulative savings for all programs from 2006 to 2016 and determine the \"net\" to \"gross\" factor \"g\"."]
[]
["Net-to-Gross Conversion"]
[]
["Is CDM adjustment being done on a \"net\" or \"gross\" basis?",null,null,null,null,"net"]
[]
[null,null,"\"Gross\"","\"Net\"","Difference","\"Net-to-Gross\" Conversion Factor"]
["Persistence of Historical CDM programs to 2015",null,"kWh","kWh","kWh","('g')"]
["2006-2010 CDM programs",null,null,null,{"$f":"IF(ISBLANK(D57),\"\",C57-D57)","v":""}]
["2011 CDM program",null,null,null,{"$f":"IF(ISBLANK(D58),\"\",C58-D58)","v":""}]
["2012 CDM program",null,null,null,""]
["2013 CDM program",null,null,null,""]
["2014 CDM program",null,null,null,""]
["2015 CDM program"]
["2016 CDM program",null,null,null,""]
["2006 to 2016 OPA CDM programs:  Persistence to 2018.",null,{"$f":"SUM(C57:C63)","v":0},{"$f":"SUM(D57:D63)","v":0},{"$f":"C64-D64","v":0},{"$f":"IF(D64=0,0,IF(F53=\"net\",0,E64/D64))","v":0}]
[]
["The default values below represent the factor used for how each year's CDM program is factored into the manual CDM adjustment.  Distributors can choose alternative weights of \"0\", \"0.5\" or \"1\" from the drop-down menu for each cell, but must support its alternatives."]
[]
["These factors do not mean that CDM programs are excluded, but the assumption that impacts of previous year CDM programs are already implicitly reflected in the actual data for historical years that are used to derive the load forecast prior to any manual CDM adjustment for the 2018 test year."]
[]
["Weight Factor for Inclusion in CDM Adjustment to 2018 Load Forecast"]
[null,2015,2016,2017,2018,2019,2020]
["Weight Factor for each year's CDM program impact on 2018 load forecast",0,0,1,0.5,0,0,"Distributor can select \"0\", \"0.5\", or \"1\" from drop-down list"]
["Default Value selection rationale.  ","Full year impact of 2015 CDM is assumed to be reflected in the base forecast, as the full year persistence of 2015 CDM programs is in the 2016 historical actual data. No further impact is necessary for the manual adjustment to the load forecast.","Default is 0.5, but one option is for full year impact of persistence of 2016 CDM programs on 2018 load forecast, but 50% impact in base forecast (first year impact of 2016 CDM programs on 2016 actuals, which is part of the data underlying the base load forecast).","Full year impact of persistence of 2017 programs on 2018 load forecast.  2017 CDM program impacts are not in the base forecast.","Only 50% of 2017 CDM programs are assumed to impact the 2018 load forecast based on the \"half-year\" rule.","2019 and 2020 are future years beyond the 2018 test year. No impacts of CDM programs beyond the 2018 test year are factored into the test year load forecast."]
[]
["2015-2020 LRAMVA and 2018 CDM adjustment to Load Forecast"]
[]
["One manual adjustment for CDM impacts to the 2018 load forecast is made.  There is a different but related threshold amount that is used for the 2018 LRAMVA amount for Account 1568."]
[]
["The amount used for the CDM threshold of the LRAMVA is the kWh that will be used to determine the base amount for the LRAMVA balance for 2018, for assessing performance against the six-year target."]
[]
["If used to determine the manual CDM adjustment for the system purchased kWh, the proposed loss factor should correspond with the proposed total loss factor calculated in Appendix 2-R ."]
[]
["The Manual Adjustment for the 2018 Load Forecast is the amount manually subtracted from the system-wide load forecast (either based on a purchased or billed basis) derived from the base forecast from historical data. If the distributor has developed their load forecast on a system purchased basis, then the manual adjustment should be on a system purchased basis, including the adjustment for losses.  If the load forecast has been developed on a billed basis, either on a system basis or on a class-specific basis, the manual adjustment should be on a billed basis, excluding losses."]
[]
["The distributor should determine the allocation of the savings to all customer classes in a reasonable manner (e.g. taking into account what programs and what IESO-measured impacts were directed at specific customer classes), for both the LRAMVA and for the load forecast adjustment."]
[]
[null,2015,2016,2017,2018,2019,2020,"Total for 2018"]
[]
["Amount used for CDM threshold for LRAMVA (2018)",0,0,{"$f":"E36","v":707000},{"$f":"E37","v":694000},null,null,{"$f":"SUM(B89:G89)","v":1401000}]
[]
["Manual Adjustment for 2018 Load Forecast (billed basis)",{"$f":"B89*(1+F64)*B72","v":0},{"$f":"C89*(1+F64)*C72","v":0},{"$f":"D89*(1+F64)*D72","v":707000},{"$f":"E89*(1+G64)*E72","v":347000},null,null,{"$f":"SUM(B91:G91)","v":1054000}]
["Manual Adjustment for 2018 LDC-only CDM programs (billed basis)"]
["Total Manual Forecast to Load Forecast",{"$f":"B91+B92","v":0},{"$f":"C91+C92","v":0},{"$f":"D91+D92","v":707000},{"$f":"E91+E92","v":347000},null,null,{"$f":"SUM(B93:G93)","v":1054000}]
[]
["Proposed Loss Factor (TLF)",8.9499999999999996E-2," Format: X.XX%"]
["Manual Adjustment for 2018 Load Forecast (system purchased basis)",{"$f":"B93*(1+$B95)","v":0},{"$f":"C93*(1+$B95)","v":0},{"$f":"D93*(1+$B95)","v":770276.49999999988},{"$f":"E93*(1+$B95)","v":378056.49999999994},null,null,{"$f":"SUM(B96:G96)","v":1148332.9999999998}]
[]
["Manual adjustment uses \"gross\" versus \"net\" (i.e. numbers multiplied by (1 + g).  The Weight factor is also used to calculate the impact of each year's program on the CDM adjustment to the 2018 load forecast."]

{"sheet":"App.2-IA_Load_Forecast_Instrct","index":22,"n_rows":45,"n_cols":18,"rows_kept":45,"cut":false,"hidden":false,"merged":[[24,1,24,17],[26,1,26,17],[43,2,43,17],[44,2,44,17],[28,8,28,10],[28,12,28,14],[29,13,29,14],[29,9,29,10],[41,2,41,17],[42,2,42,17],[28,16,28,17],[9,1,9,17],[8,1,8,17],[18,1,18,17],[20,1,20,17],[22,1,22,17]]}
[null,null,null,null,null,null,null,null,null,null,null,null,null,null,null,null,"File Number:",{"$f":"EBNUMBER","v":"EB-2017-0073"}]
[null,null,null,null,null,null,null,null,null,null,null,null,null,null,null,null,"Exhibit:",3]
[null,null,null,null,null,null,null,null,null,null,null,null,null,null,null,null,"Tab:"]
[null,null,null,null,null,null,null,null,null,null,null,null,null,null,null,null,"Schedule:"]
[null,null,null,null,null,null,null,null,null,null,null,null,null,null,null,null,"Page:"]
[]
[null,null,null,null,null,null,null,null,null,null,null,null,null,null,null,null,"Date:"]
[]
[null,"Appendix 2-IA"]
[null,"Instructions on Customer, Connections, Load Forecast and Revenues Data and Analysis"]
[]
[null,"This sheet requires no inputs, but serves as a summary of the hiostorical and forecasted data to be provided with respect to:"]
[]
[null,"1)","Customers and connections"]
[null,"2)","Consumption (kWh)"]
[null,"3)","Demand (kW or kCA) for applicable demand-billed customer classes"]
[null,"4)","Revenues"]
[]
[null,"The spreadsheet summarizes the data provided and the analyses (variance or year-over-year) that are required. Data are required to be provided on a customer class level. Consumption (kWh) must also be provided on a total distribution system level."]
[]
[null,"Appendix 2-IB (formerly 2-IA) is the appendix spreadsheet that the distributor populates, and the spreadsheet is laid out for inputting the necessary data. The spreadsheet also calculates necessary statistics such as average consumption per customer/connection per year, and variances and % annual changes, as necessary."]
[]
[null,"The distributor is required to provide suitable documentation in Exhibit 3 of its Application, in accordance with section 2.3.2 of Chaoter 2 of the Filing Requirements. This would include explanations for material variations or of trends in the data."]
[]
[null,"The distributor is also required to input its test year customer/connection and load forecast in Sheet 10 - Load Forecast of the Revenue Requirement Work Form. This sheet should also be updated to reflect changes in the load forecast made through the stages of processing of the rates application."]
[]
[null,"The applicant must demonstrate the historical accuracy of its load forecast approach for at least the past 5 years. Such analysis will cover both customer/connections and consumption (kWh) and demand (kW or kVA) by providing the following, as shown in the following table:"]
[]
[null,null,null,"Calendar Year",null,"Customers / Connections",null,null,"Consumption (kWh) (3)",null,null,null,"Demand (kW or kVA)",null,null,null,"Revenues"]
[null,null,null,{"$f":"\"(for \"&TestYear&\" Cost of Service)\"","v":"(for 2018 Cost of Service)"},null,null,null,null,"Weather-actual","Weather-normalized",null,null,"Weather-actual","Weather-normalized",null,null,"Weather-actual","Weather-normalized"]
[null,null,"Historical",{"$f":"D32-1","v":2012},null,"Actual",null,null,"Actual","Actual (1)",null,null,"Actual","Actual (1)",null,null,"Actual"]
[null,null,"Historical",2013,null,"Actual",null,null,"Actual","Actual (1)",null,null,"Actual","Actual (1)",null,null,"Actual"]
[null,null,"Historical",2014,null,"Actual","Board-approved (2)",null,"Actual","Actual (1)","Board-approved (2)",null,"Actual","Actual (1)","Board-approved (2)",null,"Actual"]
[null,null,"Historical",2015,null,"Actual",null,null,"Actual","Actual (1)",null,null,"Actual","Actual (1)",null,null,"Actual"]
[null,null,"Historical",2016,null,"Actual",null,null,"Actual","Actual (1)",null,null,"Actual","Actual (1)",null,null,"Actual"]
[null,null,"Bridge Year (Forecast)",2017,null,"Forecast",null,null,null,"Forecast",null,null,null,"Forecast",null,null,null,"Forecast"]
[null,null,"Test Year (Forecast)",{"$f":"TestYear","v":2018},null,"Forecast",null,null,null,"Forecast",null,null,null,"Forecast",null,null,null,"Forecast"]
[]
[]
[null,"Notes:"]
[]
[null,"(1)","“Weather-normalized actuals” are estimated by replacing the actual weather-related values (typically Heating Degree Days (HDD) and Cooling Degree Days (CDD)) by the “typical” or “weather-normalized” values. These “weather-normalized HDD and CDD values would be the same as used to estimate the Bridge Year and Test Year forecasts."]
[null,"(2)","For 2017 Cost of Service rebasers, the typical situation is that 2013 would have been the most recent cost of service rebasing application. If the most recent rebasing application was for a rate year other than 2013, that year should be used. An applicant must provide historical information back to the greater of: a) at least five (5) historical actual years; or b) to its last cost of service application."]
[null,"(3)","Consumption must be provided on a total distribution system basis as well as at a customer class level."]
[null,"(4)","Revenues exclude commodity charges."]

{"sheet":"App.2-IB_Load_Forecast_Analysis","index":23,"n_rows":489,"n_cols":21,"rows_kept":489,"cut":false,"hidden":false,"merged":[[6,20,6,21],[469,5,469,7],[478,11,478,12],[478,17,478,18],[448,5,448,7],[457,11,457,12],[457,17,457,18],[468,5,468,8],[468,10,468,14],[468,16,468,20],[426,5,426,7],[435,11,435,12],[435,17,435,18],[445,3,445,5],[447,5,447,8],[447,10,447,14],[447,16,447,20],[405,5,405,7],[414,11,414,12],[414,17,414,18],[425,5,425,8],[425,10,425,14],[425,16,425,20],[383,5,383,7],[392,11,392,12],[392,17,392,18],[402,3,402,5],[404,5,404,8],[404,10,404,14],[404,16,404,20],[362,5,362,7],[371,11,371,12],[371,17,371,18],[382,5,382,8],[382,10,382,14],[382,16,382,20],[340,5,340,7],[349,11,349,12],[349,17,349,18],[359,3,359,5],[361,5,361,8],[361,10,361,14],[361,16,361,20],[319,5,319,7],[328,11,328,12],[328,17,328,18],[339,5,339,8],[339,10,339,14],[339,16,339,20],[297,5,297,7],[306,11,306,12],[306,17,306,18],[316,3,316,5],[318,5,318,8],[318,10,318,14],[318,16,318,20],[276,5,276,7],[285,11,285,12],[285,17,285,18],[296,5,296,8],[296,10,296,14],[296,16,296,20],[254,5,254,7],[263,11,263,12],[263,17,263,18],[273,3,273,5],[275,5,275,8],[275,10,275,14],[275,16,275,20],[242,11,242,12],[242,17,242,18],[253,5,253,8],[253,10,253,14],[253,16,253,20],[230,3,230,5],[232,5,232,8],[232,10,232,14],[232,16,232,20],[233,5,233,7],[24,1,24,21],[8,1,8,21],[9,1,9,21],[18,1,18,21],[20,1,20,21],[22,1,22,21],[26,1,26,21],[60,10,60,14],[60,16,60,20],[36,10,36,14],[37,5,37,7],[28,1,28,21],[58,3,58,5],[61,5,61,7],[60,5,60,8],[103,16,103,20],[104,5,104,7],[70,11,70,12],[81,10,81,14],[91,11,91,12],[81,5,81,8],[82,5,82,7],[70,17,70,18],[81,16,81,20],[91,17,91,18],[125,5,125,7],[46,11,46,12],[101,3,101,5],[103,5,103,8],[103,10,103,14],[113,11,113,12],[113,17,113,18],[124,5,124,8],[124,10,124,14],[124,16,124,20],[134,11,134,12],[134,17,134,18],[144,3,144,5],[146,5,146,8],[146,10,146,14],[146,16,146,20],[147,5,147,7],[156,11,156,12],[156,17,156,18],[167,5,167,8],[167,10,167,14],[167,16,167,20],[168,5,168,7],[177,11,177,12],[177,17,177,18],[187,3,187,5],[189,5,189,8],[189,10,189,14],[189,16,189,20],[211,5,211,7],[220,11,220,12],[220,17,220,18],[190,5,190,7],[199,11,199,12],[199,17,199,18],[210,5,210,8],[210,10,210,14],[210,16,210,20]]}
[null,null,null,null,null,null,null,null,null,null,null,null,null,null,null,null,null,null,null,"File Number:",{"$f":"EBNUMBER","v":"EB-2017-0073"}]
[null,null,null,null,null,null,null,null,null,null,null,null,null,null,null,null,null,null,null,"Exhibit:",3]
[null,null,null,null,null,null,null,null,null,null,null,null,null,null,null,null,null,null,null,"Tab:"]
[null,null,null,null,null,null,null,null,null,null,null,null,null,null,null,null,null,null,null,"Schedule:"]
[null,null,null,null,null,null,null,null,null,null,null,null,null,null,null,null,null,null,null,"Page:"]
[]
[null,null,null,null,null,null,null,null,null,null,null,null,null,null,null,null,null,null,null,"Date:","2017-08-28"]
[]
[null,"Appendix 2-IB"]
[null,"Customer, Connections, Load Forecast and Revenues Data and Analysis"]
[]
[null,"This sheet requires no inputs, but serves as a summary of the hiostorical and forecasted data to be provided with respect to:"]
[]
[null,"1)","Customers and connections"]
[null,"2)","Consumption (kWh)"]
[null,"3)","Demand (kW or kCA) for applicable demand-billed customer classes"]
[null,"4)","Revenues"]
[]
[null,"The spreadsheet summarizes the data provided and the analyses (variance or year-over-year) that are required. Data are required to be provided on a customer class level. Consumption (kWh) must also be provided on a total distribution system level."]
[]
[null,"Appendix 2-IB (formerly 2-IA) is the appendix spreadsheet that the distributor populates, and the spreadsheet is laid out for inputting the necessary data. The spreadsheet also calculates necessary statistics such as average consumption per customer/connection per year, and variances and % annual changes, as necessary."]
[]
[null,"The distributor is required to provide suitable documentation in Exhibit 3 of its Application, in accordance with section 2.3.2 of Chaoter 2 of the Filing Requirements. This would include explanations for material variations or of trends in the data."]
[]
[null,"The distributor is also required to input its test year customer/connection and load forecast in Sheet 10 - Load Forecast of the Revenue Requirement Work Form. This sheet should also be updated to reflect changes in the load forecast made through the stages of processing of the rates application."]
[]
[null,"The applicant must demonstrate the historical accuracy of its load forecast approach for at least the past 5 years. Such analysis will cover both customer/connections and consumption (kWh) and demand (kW or kVA) by providing the following, as shown in the following table:"]
[]
[null,"This sheet is to be filled in accordance with the instructions documented in section 2.3.2 of Chapter 2 of the Filing Requirements for Distribution Rate Applications, in terms of one set of tables per customer class."]
[]
[null,"Color coding for Cells:",null,null,null,"Data input",null,null,null,null,"Drop-down List"]
[]
[null,null,null,null,null,"No data entry required",null,null,null,null,"Blank or calculated value"]
[]
[null,"Distribution System (Total)"]
[]
[null,null,null,"Calendar Year",null,null,null,null,null,null,"Consumption (kWh) (3)"]
[null,null,null,{"$f":"CONCATENATE(\"(for \",TestYear,\" Cost of Service\")","v":"(for 2018 Cost of Service"},null,null,null,null,null,null,null,"Actual (Weather actual)","Weather-normalized",null,"Weather-normalized"]
[null,null,"Historical",{"$f":"D40-1","v":2012},null,null,null,null,null,null,"Actual",71922866,null,{"$f":"IF(D39=RebaseYear,\"Board-approved\",\"\")","v":""}]
[null,null,"Historical",2013,null,null,null,null,null,null,"Actual",83168941,null,"Board-approved",72077403.848123491]
[null,null,"Historical",2014,null,null,null,null,null,null,"Actual",85548133,null,""]
[null,null,"Historical",2015,null,null,null,null,null,null,"Actual",79338527,null,""]
[null,null,"Historical",2016,null,null,null,null,null,null,"Actual",70815698,null,""]
[null,null,"Bridge Year",2017,null,null,null,null,null,null,"Forecast",null,72764601,""]
[null,null,"Test Year",{"$f":"TestYear","v":2018},null,null,null,null,null,null,"Forecast",null,72064101,""]
[null,null,null,null,null,null,null,null,null,null,null,null,null,null,{"$f":"SUM(O39:O44)","v":72077403.848123491}]
[null,null,"Variance Analysis",null,null,null,null,null,null,null,"Year","Year-over-year",null,null,"Versus Board-approved"]
[null,null,null,{"$f":"D39","v":2012},null,null,null,null,null,null,{"$f":"D48","v":2012}]
[null,null,null,2013,null,null,null,null,null,null,{"$f":"D49","v":2013},{"$f":"IF(L39=0,\"\",L40/L39-1)","v":0.15636299866025927},""]
[null,null,null,2014,null,null,null,null,null,null,2014,2.8606736738417737E-2,""]
[null,null,null,2015,null,null,null,null,null,null,2015,-7.2586107752930173E-2,""]
[null,null,null,2016,null,null,null,null,null,null,2016,-0.10742358501311722,""]
[null,null,null,2017,null,null,null,null,null,null,2017,{"$f":"IF(K44=\"Forecast\",\"\",IF(L43=0,\"\",L44/L43-1))","v":""},{"$f":"IF(M43=0,\"\",M44/M43-1)","v":""}]
[null,null,null,2018,null,null,null,null,null,null,2018,{"$f":"IF(K45=\"Forecast\",\"\",IF(L44=0,\"\",L45/L44-1))","v":""},{"$f":"IF(M44=0,\"\",M45/M44-1)","v":-9.6269338438342844E-3},null,{"$f":"IF(O46=0,\"\",M45/O46-1)","v":-1.8456336401240225E-4}]
[null,null,null,"Geometric Mean",null,null,null,null,null,null,"Geometric Mean",{"$f":"IF(L39=0,\"\",(L43/L39)^(1/($D43-$D39-1))-1)","v":-5.1578324382467455E-3},{"$f":"IF(M39=0,\"\",(M45/M39)^(1/($D45-$D39-1))-1)","v":""},null,{"$f":"IF(O46=0,\"\",(M45/O46)^(1/(TestYear-RebaseYear-1))-1)","v":-4.6144034812733992E-5}]
[]
[null,"Customer Class Analysis (one for each Customer Class, excluding MicroFIT and Standby)"]
[]
[null,1,"Customer Class:","Residential",null,null,null,"Is the customer class billed on consumption (kWh) or demand (kW or kVA)?",null,null,null,null,null,"kWh"]
[]
[null,null,null,"Calendar Year",null,"Customers",null,null,null,null,"Consumption (kWh) (3)",null,null,null,null,null,{"$f":"CONCATENATE(\"Consumption (kWh) per \",LEFT(F61,LEN(F61)-1))","v":"Consumption (kWh) per Customer"}]
[null,null,null,{"$f":"CONCATENATE(\"(for \",TestYear,\" Cost of Service\")","v":"(for 2018 Cost of Service"},null,null,null,null,null,null,null,"Actual (Weather actual)","Weather-normalized",null,"Weather-normalized",null,null,{"$f":"L62","v":"Actual (Weather actual)"},{"$f":"M62","v":"Weather-normalized"},null,{"$f":"O62","v":"Weather-normalized"}]
[null,null,"Historical",{"$f":"D64-1","v":2012},null,{"$f":"K39","v":"Actual"},2344,{"$f":"IF(D63=RebaseYear,\"Board-approved\",\"\")","v":""},null,null,{"$f":"F63","v":"Actual"},32285778,null,{"$f":"H63","v":""},null,null,{"$f":"K63","v":"Actual"},{"$f":"IF(G63=0,\"\",L63/G63)","v":13773.796075085324},{"$f":"IF(G63=0,\"\",M63/G63)","v":0},{"$f":"N63","v":""},{"$f":"IF(T63=\"\",\"\",IF(I63=0,\"\",O63/I63))","v":""}]
[null,null,"Historical",2013,null,{"$f":"K40","v":"Actual"},2346,"Board-approved",2323,null,{"$f":"F64","v":"Actual"},36371059,null,{"$f":"H64","v":"Board-approved"},35413349,null,{"$f":"K64","v":"Actual"},{"$f":"IF(G64=0,\"\",L64/G64)","v":15503.435208866154},{"$f":"IF(G64=0,\"\",M64/G64)","v":0},{"$f":"N64","v":"Board-approved"},{"$f":"IF(T64=\"\",\"\",IF(I64=0,\"\",O64/I64))","v":15244.661644425312}]
[null,null,"Historical",2014,null,"Actual",2356,"",null,null,"Actual",37207390,null,"",null,null,"Actual",15792.610356536503,0,"",""]
[null,null,"Historical",2015,null,"Actual",2357,"",null,null,"Actual",33751334,null,"",null,null,"Actual",14319.615613067459,0,"",""]
[null,null,"Historical",2016,null,"Actual",2374,"",null,null,"Actual",32668225,null,"",null,null,"Actual",13760.836141533277,0,"",""]
[null,null,"Bridge Year",2017,null,"Forecast",2380,"",null,null,"Forecast",null,33524773,"",null,null,"Forecast",0,14086.039075630251,"",""]
[null,null,"Test Year",{"$f":"TestYear","v":2018},null,"Forecast",2386,"",null,null,"Forecast",null,32918746,"",null,null,"Forecast",0,13796.624476110645,"",""]
[null,null,null,null,null,null,null,null,{"$f":"SUM(I63:I68)","v":2323},null,null,null,null,null,{"$f":"SUM(O63:O68)","v":35413349},null,null,null,null,null,{"$f":"SUM(U63:U68)","v":15244.661644425312}]
[null,null,"Variance Analysis","Year",null,null,"Year-over-year",null,"Test Year Versus Board-approved",null,"Year","Year-over-year",null,null,{"$f":"I71","v":"Test Year Versus Board-approved"},null,"Year","Year-over-year",null,null,{"$f":"O71","v":"Test Year Versus Board-approved"}]
[null,null,null,{"$f":"D63","v":2012},null,null,null,null,null,null,{"$f":"D72","v":2012},null,null,null,null,null,{"$f":"K72","v":2012}]
[null,null,null,2013,null,null,{"$f":"IF(G63=0,\"\",G64/G63-1)","v":8.5324232081918083E-4},null,null,null,{"$f":"D73","v":2013},{"$f":"IF(L63=0,\"\",L64/L63-1)","v":0.12653500250172067},"",null,null,null,{"$f":"K73","v":2013},{"$f":"IF(R63=\"\",\"\",IF(R63=0,\"\",R64/R63-1))","v":0.12557461460529984},{"$f":"IF(S63=\"\",\"\",IF(S63=0,\"\",S64/S63-1))","v":""}]
[null,null,null,2014,null,null,4.2625745950555238E-3,null,null,null,2014,2.2994408823784784E-2,"",null,null,null,2014,{"$f":"IF(R64=\"\",\"\",IF(R64=0,\"\",R65/R64-1))","v":1.8652327292274729E-2},""]
[null,null,null,2015,null,null,4.2444821731746352E-4,null,null,null,2015,-9.2886278774189757E-2,"",null,null,null,2015,-9.3271138223161243E-2,""]
[null,null,null,2016,null,null,7.2125583368689572E-3,null,null,null,2016,-3.2090850097954648E-2,"",null,null,null,2016,-3.9021960269957523E-2,""]
[null,null,null,2017,null,null,2.5273799494522908E-3,null,null,null,2017,{"$f":"IF(K68=\"Forecast\",\"\",IF(L67=0,\"\",L68/L67-1))","v":""},{"$f":"IF(M67=0,\"\",M68/M67-1)","v":""},null,null,null,2017,{"$f":"IF(Q68=\"Forecast\",\"\",IF(R67=0,\"\",R68/R67-1))","v":""},{"$f":"IF(S67=\"\",\"\",IF(S67=0,\"\",S68/S67-1))","v":""}]
[null,null,null,2018,null,null,2.5210084033613356E-3,null,{"$f":"IF(I70=0,\"\",G69/I70-1)","v":2.7120103314679289E-2},null,2018,{"$f":"IF(K69=\"Forecast\",\"\",IF(L68=0,\"\",L69/L68-1))","v":""},{"$f":"IF(M68=0,\"\",M69/M68-1)","v":-1.8076990409450322E-2},null,{"$f":"IF(O70=0,\"\",M69/O70-1)","v":-7.0442448128811508E-2},null,2018,{"$f":"IF(Q69=\"Forecast\",\"\",IF(R68=0,\"\",R69/R68-1))","v":""},{"$f":"IF(S68=\"\",\"\",IF(S68=0,\"\",S69/S68-1))","v":-2.0546201665755159E-2},null,{"$f":"IF(U70=0,\"\",S69/U70-1)","v":-9.4986507545360199E-2}]
[null,null,null,"Geometric Mean",null,null,{"$f":"IF(G63=0,\"\",(G69/G63)^(1/($D69-$D63-1))-1)","v":3.558205829904626E-3},null,{"$f":"IF(I70=0,\"\",(G69/I70)^(1/(TestYear-RebaseYear-1))-1)","v":6.712143612079613E-3},null,"Geometric Mean",{"$f":"IF(L63=0,\"\",(L67/L63)^(1/($D67-$D63-1))-1)","v":3.9330707286766575E-3},{"$f":"IF(M63=0,\"\",(M69/M63)^(1/($D69-$D63-1))-1)","v":""},null,{"$f":"IF(O70=0,\"\",(M69/O70)^(1/(TestYear-RebaseYear-1))-1)","v":-1.8095905833894754E-2},null,"Geometric Mean",{"$f":"IF(R63=\"\",\"\",IF(R63=0,\"\",(R67/R63)^(1/($D67-$D63-1))-1))","v":-3.1373583887273071E-4},{"$f":"IF(S63=\"\",\"\",IF(S63=0,\"\",(S69/S63)^(1/($D69-$D63-1))-1))","v":""},null,{"$f":"IF(U70=0,\"\",(S69/U70)^(1/(TestYear-RebaseYear-1))-1)","v":-2.464264447726161E-2}]
[]
[]
[null,null,null,"Calendar Year",null,"Revenues",null,null,null,null,{"$f":"IF(ISBLANK(N59),\"\",CONCATENATE(\"Demand (\",N59,\")\"))","v":"Demand (kWh)"},null,null,null,null,null,{"$f":"CONCATENATE(\"Demand (\",N59,\") per \",LEFT(F61,LEN(F61)-1))","v":"Demand (kWh) per Customer"}]
[null,null,null,{"$f":"CONCATENATE(\"(for \",TestYear,\" Cost of Service\")","v":"(for 2018 Cost of Service"},null,null,null,null,null,null,null,"Actual (Weather actual)","Weather-normalized",null,{"$f":"M83","v":"Weather-normalized"},null,null,{"$f":"L83","v":"Actual (Weather actual)"},{"$f":"M83","v":"Weather-normalized"},null,{"$f":"O83","v":"Weather-normalized"}]
[null,null,"Historical",{"$f":"D85-1","v":2012},null,{"$f":"F63","v":"Actual"},1245709,{"$f":"IF(D84=RebaseYear,\"Board-approved\",\"\")","v":""},null,null,{"$f":"K63","v":"Actual"},null,null,{"$f":"N63","v":""},null,null,{"$f":"K84","v":"Actual"},{"$f":"IF(G84=0,\"\",L84/G84)","v":0},{"$f":"IF(G84=0,\"\",M84/G84)","v":0},{"$f":"N84","v":""},{"$f":"IF(T84=\"\",\"\",IF(I84=0,\"\",O84/I84))","v":""}]
[null,null,"Historical",2013,null,"Actual",1163086,"Board-approved",1131550,null,"Actual",null,null,"Board-approved",null,null,{"$f":"K85","v":"Actual"},{"$f":"IF(G85=0,\"\",L85/G85)","v":0},{"$f":"IF(G85=0,\"\",M85/G85)","v":0},{"$f":"N85","v":"Board-approved"},{"$f":"IF(T85=\"\",\"\",IF(I85=0,\"\",O85/I85))","v":0}]
[null,null,"Historical",2014,null,"Actual",1209006,"",null,null,"Actual",null,null,"",null,null,"Actual",0,0,"",""]
[null,null,"Historical",2015,null,"Actual",1138938,"",null,null,"Actual",null,null,"",null,null,"Actual",0,0,"",""]
[null,null,"Historical",2016,null,"Actual",1156021,"",null,null,"Actual",null,null,"",null,null,"Actual",0,0,"",""]
[null,null,"Bridge Year (Forecast)",2017,null,"Forecast",1207928,"",null,null,"Forecast",null,null,"",null,null,"Forecast",0,0,"",""]
[null,null,"Test Year (Forecast)",{"$f":"TestYear","v":2018},null,"Forecast",1346837,"",null,null,"Forecast",null,null,"",null,null,"Forecast",0,0,"",""]
[null,null,null,null,null,null,null,null,{"$f":"SUM(I84:I89)","v":1131550},null,null,null,null,null,{"$f":"SUM(O84:O89)","v":0},null,null,null,null,null,{"$f":"SUM(U84:U89)","v":0}]
[null,null,"Variance Analysis","Year",null,null,"Year-over-year",null,{"$f":"I71","v":"Test Year Versus Board-approved"},null,"Year","Year-over-year",null,null,{"$f":"I92","v":"Test Year Versus Board-approved"},null,"Year","Year-over-year",null,null,{"$f":"O92","v":"Test Year Versus Board-approved"}]
[null,null,null,{"$f":"D84","v":2012},null,null,null,null,null,null,{"$f":"D93","v":2012},null,null,null,null,null,{"$f":"K93","v":2012}]
[null,null,null,2013,null,null,{"$f":"IF(G84=0,\"\",G85/G84-1)","v":-6.632608418177921E-2},null,null,null,{"$f":"D94","v":2013},{"$f":"IF(L84=0,\"\",L85/L84-1)","v":""},"",null,null,null,{"$f":"K94","v":2013},{"$f":"IF(R84=\"\",\"\",IF(R84=0,\"\",R85/R84-1))","v":""},{"$f":"IF(S84=\"\",\"\",IF(S84=0,\"\",S85/S84-1))","v":""}]
[null,null,null,2014,null,null,3.9481173361213262E-2,null,null,null,2014,"","",null,null,null,2014,{"$f":"IF(R85=\"\",\"\",IF(R85=0,\"\",R86/R85-1))","v":""},""]
[null,null,null,2015,null,null,-5.7955047369491974E-2,null,null,null,2015,"","",null,null,null,2015,"",""]
[null,null,null,2016,null,null,1.4999060528316788E-2,null,null,null,2016,"","",null,null,null,2016,"",""]
[null,null,null,2017,null,null,4.4901433451468353E-2,null,null,null,2017,{"$f":"IF(K89=\"Forecast\",\"\",IF(L88=0,\"\",L89/L88-1))","v":""},{"$f":"IF(M88=0,\"\",M89/M88-1)","v":""},null,null,null,2017,{"$f":"IF(Q89=\"Forecast\",\"\",IF(R88=0,\"\",R89/R88-1))","v":""},{"$f":"IF(S88=\"\",\"\",IF(S88=0,\"\",S89/S88-1))","v":""}]
[null,null,null,2018,null,null,0.11499774821015829,null,{"$f":"IF(I91=0,\"\",G90/I91-1)","v":0.19025849498475544},null,2018,{"$f":"IF(K90=\"Forecast\",\"\",IF(L89=0,\"\",L90/L89-1))","v":""},{"$f":"IF(M89=0,\"\",M90/M89-1)","v":""},null,{"$f":"IF(O91=0,\"\",M90/O91-1)","v":""},null,2018,{"$f":"IF(Q90=\"Forecast\",\"\",IF(R89=0,\"\",R90/R89-1))","v":""},{"$f":"IF(S89=\"\",\"\",IF(S89=0,\"\",S90/S89-1))","v":""},null,{"$f":"IF(U91=0,\"\",S90/U91-1)","v":""}]
[null,null,null,"Geometric Mean",null,null,{"$f":"IF(G84=0,\"\",(G90/G84)^(1/($D90-$D84-1))-1)","v":1.5733292124392451E-2},null,{"$f":"IF(I91=0,\"\",(G90/I91)^(1/(TestYear-RebaseYear-1))-1)","v":4.4504516989796628E-2},null,"Geometric Mean",{"$f":"IF(L84=0,\"\",(L88/L84)^(1/($D88-$D84-1))-1)","v":""},{"$f":"IF(M84=0,\"\",(M90/M84)^(1/($D90-$D84-1))-1)","v":""},null,{"$f":"IF(O91=0,\"\",(M90/O91)^(1/(TestYear-RebaseYear-1))-1)","v":""},null,"Geometric Mean",{"$f":"IF(R84=\"\",\"\",IF(R84=0,\"\",(R88/R84)^(1/($D88-$D84-1))-1))","v":""},{"$f":"IF(S84=\"\",\"\",IF(S84=0,\"\",(S90/S84)^(1/($D90-$D84-1))-1))","v":""},null,{"$f":"IF(U91=0,\"\",(S90/U91)^(1/(TestYear-RebaseYear-1))-1)","v":""}]
[]
[null,2,"Customer Class:","GS < 50 kW",null,null,null,"Is the customer class billed on consumption (kWh) or demand (kW or kVA)?",null,null,null,null,null,"kWh"]
[]
[null,null,null,"Calendar Year",null,"Customers",null,null,null,null,"Consumption (kWh) (3)",null,null,null,null,null,{"$f":"CONCATENATE(\"Consumption (kWh) per \",LEFT(F104,LEN(F104)-1))","v":"Consumption (kWh) per Customer"}]
[null,null,null,{"$f":"CONCATENATE(\"(for \",TestYear,\" Cost of Service\")","v":"(for 2018 Cost of Service"},null,null,null,null,null,null,null,"Actual (Weather actual)","Weather-normalized",null,"Weather-normalized",null,null,{"$f":"L105","v":"Actual (Weather actual)"},{"$f":"M105","v":"Weather-normalized"},null,{"$f":"O105","v":"Weather-normalized"}]
[null,null,"Historical",{"$f":"D107-1","v":2012},null,{"$f":"F63","v":"Actual"},395,{"$f":"IF(D106=RebaseYear,\"Board-approved\",\"\")","v":""},null,null,{"$f":"F106","v":"Actual"},11883435,null,{"$f":"H106","v":""},null,null,{"$f":"K106","v":"Actual"},{"$f":"IF(G106=0,\"\",L106/G106)","v":30084.645569620254},{"$f":"IF(G106=0,\"\",M106/G106)","v":0},{"$f":"N106","v":""},{"$f":"IF(T106=\"\",\"\",IF(I106=0,\"\",O106/I106))","v":""}]
[null,null,"Historical",2013,null,{"$f":"F64","v":"Actual"},400,"Board-approved",386,null,{"$f":"F107","v":"Actual"},12926388,null,{"$f":"H107","v":"Board-approved"},13104863,null,{"$f":"K107","v":"Actual"},{"$f":"IF(G107=0,\"\",L107/G107)","v":32315.97},{"$f":"IF(G107=0,\"\",M107/G107)","v":0},{"$f":"N107","v":"Board-approved"},{"$f":"IF(T107=\"\",\"\",IF(I107=0,\"\",O107/I107))","v":33950.422279792743}]
[null,null,"Historical",2014,null,"Actual",404,"",null,null,"Actual",13500466,null,"",null,null,"Actual",33416.995049504949,0,"",""]
[null,null,"Historical",2015,null,"Actual",404,"",null,null,"Actual",12579056,null,"",null,null,"Actual",31136.27722772277,0,"",""]
[null,null,"Historical",2016,null,"Actual",402,"",null,null,"Actual",11845271,null,"",null,null,"Actual",29465.848258706468,0,"",""]
[null,null,"Bridge Year",2017,null,"Forecast",402,"",null,null,"Forecast",null,12143659,"",null,null,"Forecast",0,30208.106965174131,"",""]
[null,null,"Test Year",{"$f":"TestYear","v":2018},null,"Forecast",402,"",null,null,"Forecast",null,11931508,"",null,null,"Forecast",0,29680.368159203979,"",""]
[null,null,null,null,null,null,null,null,{"$f":"SUM(I106:I111)","v":386},null,null,null,null,null,{"$f":"SUM(O106:O111)","v":13104863},null,null,null,null,null,{"$f":"SUM(U106:U111)","v":33950.422279792743}]
[null,null,"Variance Analysis","Year",null,null,"Year-over-year",null,"Test Year Versus Board-approved",null,"Year","Year-over-year",null,null,{"$f":"I114","v":"Test Year Versus Board-approved"},null,"Year","Year-over-year",null,null,{"$f":"O114","v":"Test Year Versus Board-approved"}]
[null,null,null,{"$f":"D106","v":2012},null,null,null,null,null,null,{"$f":"D115","v":2012},null,null,null,null,null,{"$f":"K115","v":2012}]
[null,null,null,2013,null,null,{"$f":"IF(G106=0,\"\",G107/G106-1)","v":1.2658227848101333E-2},null,null,null,{"$f":"D116","v":2013},{"$f":"IF(L106=0,\"\",L107/L106-1)","v":8.7765279988488265E-2},"",null,null,null,{"$f":"K116","v":2013},{"$f":"IF(R106=\"\",\"\",IF(R106=0,\"\",R107/R106-1))","v":7.4168213988632159E-2},""]
[null,null,null,2014,null,null,1.0000000000000009E-2,null,null,null,2014,4.4411323565407335E-2,"",null,null,null,2014,3.4070617391492419E-2,""]
[null,null,null,2015,null,null,0,null,null,null,2015,-6.8250236695533317E-2,"",null,null,null,2015,-6.8250236695533317E-2,""]
[null,null,null,2016,null,null,-4.9504950495049549E-3,null,null,null,2016,-5.8333868614624196E-2,"",null,null,null,2016,{"$f":"IF(R109=\"\",\"\",IF(R109=0,\"\",R110/R109-1))","v":-5.3648962488328733E-2},""]
[null,null,null,2017,null,null,0,null,null,null,2017,{"$f":"IF(K111=\"Forecast\",\"\",IF(L110=0,\"\",L111/L110-1))","v":""},{"$f":"IF(M110=0,\"\",M111/M110-1)","v":""},null,null,null,2017,{"$f":"IF(Q111=\"Forecast\",\"\",IF(R110=0,\"\",R111/R110-1))","v":""},""]
[null,null,null,2018,null,null,0,null,{"$f":"IF(I113=0,\"\",G112/I113-1)","v":4.1450777202072464E-2},null,2018,{"$f":"IF(K112=\"Forecast\",\"\",IF(L111=0,\"\",L112/L111-1))","v":""},{"$f":"IF(M111=0,\"\",M112/M111-1)","v":-1.7470105179995588E-2},null,{"$f":"IF(O113=0,\"\",M112/O113-1)","v":-8.9535846349557358E-2},null,2018,{"$f":"IF(Q112=\"Forecast\",\"\",IF(R111=0,\"\",R112/R111-1))","v":""},-1.7470105179995699E-2,null,{"$f":"IF(U113=0,\"\",S112/U113-1)","v":-0.12577322559932624}]
[null,null,null,"Geometric Mean",null,null,{"$f":"IF(G106=0,\"\",(G112/G106)^(1/($D112-$D106-1))-1)","v":3.5194434918996986E-3},null,{"$f":"IF(I113=0,\"\",(G112/I113)^(1/(TestYear-RebaseYear-1))-1)","v":1.0205403308297445E-2},null,"Geometric Mean",{"$f":"IF(L106=0,\"\",(L110/L106)^(1/($D110-$D106-1))-1)","v":-1.0716578156675372E-3},{"$f":"IF(M106=0,\"\",(M112/M106)^(1/($D112-$D106-1))-1)","v":""},null,{"$f":"IF(O113=0,\"\",(M112/O113)^(1/(TestYear-RebaseYear-1))-1)","v":-2.3177368700146639E-2},null,"Geometric Mean",{"$f":"IF(R106=\"\",\"\",IF(R106=0,\"\",(R110/R106)^(1/($D110-$D106-1))-1))","v":-6.9037326764799234E-3},{"$f":"IF(S106=\"\",\"\",IF(S106=0,\"\",(S112/S106)^(1/($D112-$D106-1))-1))","v":""},null,{"$f":"IF(U113=0,\"\",(S112/U113)^(1/(TestYear-RebaseYear-1))-1)","v":-3.3045529056882517E-2}]
[]
[]
[null,null,null,"Calendar Year",null,"Revenues",null,null,null,null,{"$f":"IF(ISBLANK(N102),\"\",CONCATENATE(\"Demand (\",N102,\")\"))","v":"Demand (kWh)"},null,null,null,null,null,{"$f":"CONCATENATE(\"Demand (\",N102,\") per \",LEFT(F104,LEN(F104)-1))","v":"Demand (kWh) per Customer"}]
[null,null,null,{"$f":"CONCATENATE(\"(for \",TestYear,\" Cost of Service\")","v":"(for 2018 Cost of Service"},null,null,null,null,null,null,null,"Actual (Weather actual)","Weather-normalized",null,{"$f":"M126","v":"Weather-normalized"},null,null,{"$f":"L126","v":"Actual (Weather actual)"},{"$f":"M126","v":"Weather-normalized"},null,{"$f":"O126","v":"Weather-normalized"}]
[null,null,"Historical",{"$f":"D128-1","v":2012},null,{"$f":"F106","v":"Actual"},337495.86,{"$f":"IF(D127=RebaseYear,\"Board-approved\",\"\")","v":""},null,null,{"$f":"K106","v":"Actual"},null,null,{"$f":"N106","v":""},null,null,{"$f":"K127","v":"Actual"},{"$f":"IF(G127=0,\"\",L127/G127)","v":0},{"$f":"IF(G127=0,\"\",M127/G127)","v":0},{"$f":"N127","v":""},{"$f":"IF(T127=\"\",\"\",IF(I127=0,\"\",O127/I127))","v":""}]
[null,null,"Historical",2013,null,"Actual",325333,"Board-approved",292065,null,"Actual",null,null,"Board-approved",null,null,{"$f":"K128","v":"Actual"},{"$f":"IF(G128=0,\"\",L128/G128)","v":0},{"$f":"IF(G128=0,\"\",M128/G128)","v":0},{"$f":"N128","v":"Board-approved"},{"$f":"IF(T128=\"\",\"\",IF(I128=0,\"\",O128/I128))","v":0}]
[null,null,"Historical",2014,null,"Actual",311466,"",null,null,"Actual",null,null,"",null,null,"Actual",0,0,"",""]
[null,null,"Historical",2015,null,"Actual",296931,"",null,null,"Actual",null,null,"",null,null,"Actual",0,0,"",""]
[null,null,"Historical",2016,null,"Actual",297450,"",null,null,"Actual",null,null,"",null,null,"Actual",0,0,"",""]
[null,null,"Bridge Year (Forecast)",2017,null,"Forecast",308149,"",null,null,"Forecast",null,null,"",null,null,"Forecast",0,0,"",""]
[null,null,"Test Year (Forecast)",{"$f":"TestYear","v":2018},null,"Forecast",343565,"",null,null,"Forecast",null,null,"",null,null,"Forecast",0,0,"",""]
[null,null,null,null,null,null,null,null,{"$f":"SUM(I127:I132)","v":292065},null,null,null,null,null,{"$f":"SUM(O127:O132)","v":0},null,null,null,null,null,{"$f":"SUM(U127:U132)","v":0}]
[null,null,"Variance Analysis","Year",null,null,"Year-over-year",null,{"$f":"I114","v":"Test Year Versus Board-approved"},null,"Year","Year-over-year",null,null,{"$f":"I135","v":"Test Year Versus Board-approved"},null,"Year","Year-over-year",null,null,{"$f":"O135","v":"Test Year Versus Board-approved"}]
[null,null,null,{"$f":"D127","v":2012},null,null,null,null,null,null,{"$f":"D136","v":2012},null,null,null,null,null,{"$f":"K136","v":2012}]
[null,null,null,2013,null,null,{"$f":"IF(G127=0,\"\",G128/G127-1)","v":-3.6038545776531872E-2},null,null,null,{"$f":"D137","v":2013},{"$f":"IF(L127=0,\"\",L128/L127-1)","v":""},"",null,null,null,{"$f":"K137","v":2013},{"$f":"IF(R127=\"\",\"\",IF(R127=0,\"\",R128/R127-1))","v":""},""]
[null,null,null,2014,null,null,-4.2624019081986764E-2,null,null,null,2014,"","",null,null,null,2014,"",""]
[null,null,null,2015,null,null,-4.6666409816801813E-2,null,null,null,2015,"","",null,null,null,2015,"",""]
[null,null,null,2016,null,null,1.7478808207966878E-3,null,null,null,2016,{"$f":"IF(L130=0,\"\",L131/L130-1)","v":""},"",null,null,null,2016,{"$f":"IF(R130=\"\",\"\",IF(R130=0,\"\",R131/R130-1))","v":""},""]
[null,null,null,2017,null,null,3.5969070432005479E-2,null,null,null,2017,{"$f":"IF(K132=\"Forecast\",\"\",IF(L131=0,\"\",L132/L131-1))","v":""},"",null,null,null,2017,{"$f":"IF(Q132=\"Forecast\",\"\",IF(R131=0,\"\",R132/R131-1))","v":""},""]
[null,null,null,2018,null,null,0.11493141305018018,null,{"$f":"IF(I134=0,\"\",G133/I134-1)","v":0.17633061133651751},null,2018,{"$f":"IF(K133=\"Forecast\",\"\",IF(L132=0,\"\",L133/L132-1))","v":""},"",null,{"$f":"IF(O134=0,\"\",M133/O134-1)","v":""},null,2018,{"$f":"IF(Q133=\"Forecast\",\"\",IF(R132=0,\"\",R133/R132-1))","v":""},"",null,{"$f":"IF(U134=0,\"\",S133/U134-1)","v":""}]
[null,null,null,"Geometric Mean",null,null,{"$f":"IF(G127=0,\"\",(G133/G127)^(1/($D133-$D127-1))-1)","v":3.5709765424101203E-3},null,{"$f":"IF(I134=0,\"\",(G133/I134)^(1/(TestYear-RebaseYear-1))-1)","v":4.1435432953847107E-2},null,"Geometric Mean",{"$f":"IF(L127=0,\"\",(L131/L127)^(1/($D131-$D127-1))-1)","v":""},{"$f":"IF(M127=0,\"\",(M133/M127)^(1/($D133-$D127-1))-1)","v":""},null,{"$f":"IF(O134=0,\"\",(M133/O134)^(1/(TestYear-RebaseYear-1))-1)","v":""},null,"Geometric Mean",{"$f":"IF(R127=\"\",\"\",IF(R127=0,\"\",(R131/R127)^(1/($D131-$D127-1))-1))","v":""},{"$f":"IF(S127=\"\",\"\",IF(S127=0,\"\",(S133/S127)^(1/($D133-$D127-1))-1))","v":""},null,{"$f":"IF(U134=0,\"\",(S133/U134)^(1/(TestYear-RebaseYear-1))-1)","v":""}]
[]
[null,3,"Customer Class:","GS > 50 Kw to 4,999 kW",null,null,null,"Is the customer class billed on consumption (kWh) or demand (kW or kVA)?",null,null,null,null,null,"kW"]
[]
[null,null,null,"Calendar Year",null,"Customers",null,null,null,null,"Consumption (kWh) (3)",null,null,null,null,null,{"$f":"CONCATENATE(\"Consumption (kWh) per \",LEFT(F147,LEN(F147)-1))","v":"Consumption (kWh) per Customer"}]
[null,null,null,{"$f":"CONCATENATE(\"(for \",TestYear,\" Cost of Service\")","v":"(for 2018 Cost of Service"},null,null,null,null,null,null,null,"Actual (Weather actual)","Weather-normalized",null,"Weather-normalized",null,null,{"$f":"L148","v":"Actual (Weather actual)"},{"$f":"M148","v":"Weather-normalized"},null,{"$f":"O148","v":"Weather-normalized"}]
[null,null,"Historical",{"$f":"D150-1","v":2012},null,{"$f":"F106","v":"Actual"},52,{"$f":"IF(D149=RebaseYear,\"Board-approved\",\"\")","v":""},null,null,{"$f":"F149","v":"Actual"},27280733,null,{"$f":"H149","v":""},null,null,{"$f":"K149","v":"Actual"},{"$f":"IF(G149=0,\"\",L149/G149)","v":524629.48076923075},{"$f":"IF(G149=0,\"\",M149/G149)","v":0},{"$f":"N149","v":""},{"$f":"IF(T149=\"\",\"\",IF(I149=0,\"\",O149/I149))","v":""}]
[null,null,"Historical",2013,null,{"$f":"F107","v":"Actual"},53,"Board-approved",51,null,{"$f":"F150","v":"Actual"},33352062,null,{"$f":"H150","v":"Board-approved"},230461812,null,{"$f":"K150","v":"Actual"},{"$f":"IF(G150=0,\"\",L150/G150)","v":629284.1886792453},{"$f":"IF(G150=0,\"\",M150/G150)","v":0},{"$f":"N150","v":"Board-approved"},{"$f":"IF(T150=\"\",\"\",IF(I150=0,\"\",O150/I150))","v":4518859.0588235296}]
[null,null,"Historical",2014,null,"Actual",52,"",null,null,"Actual",34318921,null,"",null,null,"Actual",659979.25,0,"",""]
[null,null,"Historical",2015,null,"Actual",51,"",null,null,"Actual",32657665,null,"",null,null,"Actual",640346.37254901964,0,"",""]
[null,null,"Historical",2016,null,"Actual",51,"",null,null,"Actual",26151605,null,"",null,null,"Actual",512776.56862745096,0,"",""]
[null,null,"Bridge Year",2017,null,"Forecast",52,"",null,null,"Forecast",null,26945572,"",null,null,"Forecast",0,518184.07692307694,"",""]
[null,null,"Test Year",{"$f":"TestYear","v":2018},null,"Forecast",53,"",null,null,"Forecast",null,27063250,"",null,null,"Forecast",0,510627.35849056602,"",""]
[null,null,null,null,null,null,null,null,{"$f":"SUM(I149:I154)","v":51},null,null,null,null,null,{"$f":"SUM(O149:O154)","v":230461812},null,null,null,null,null,{"$f":"SUM(U149:U154)","v":4518859.0588235296}]
[null,null,"Variance Analysis","Year",null,null,"Year-over-year",null,"Test Year Versus Board-approved",null,"Year","Year-over-year",null,null,{"$f":"I157","v":"Test Year Versus Board-approved"},null,"Year","Year-over-year",null,null,{"$f":"O157","v":"Test Year Versus Board-approved"}]
[null,null,null,{"$f":"D149","v":2012},null,null,null,null,null,null,{"$f":"D158","v":2012},null,null,null,null,null,{"$f":"K158","v":2012}]
[null,null,null,2013,null,null,{"$f":"IF(G149=0,\"\",G150/G149-1)","v":1.9230769230769162E-2},null,null,null,{"$f":"D159","v":2013},{"$f":"IF(L149=0,\"\",L150/L149-1)","v":0.22255006857770288},"",null,null,null,{"$f":"K159","v":2013},{"$f":"IF(R149=\"\",\"\",IF(R149=0,\"\",R150/R149-1))","v":0.19948308615170851},""]
[null,null,null,2014,null,null,-1.8867924528301883E-2,null,null,null,2014,2.8989481969660558E-2,"",null,null,null,2014,4.8777741238307915E-2,""]
[null,null,null,2015,null,null,-1.9230769230769273E-2,null,null,null,2015,-4.8406416973307498E-2,"",null,null,null,2015,-2.9747719266901784E-2,""]
[null,null,null,2016,null,null,0,null,null,null,2016,-0.19921999934777945,"",null,null,null,2016,-0.19921999934777956,""]
[null,null,null,2017,null,null,1.9607843137254832E-2,null,null,null,2017,{"$f":"IF(K154=\"Forecast\",\"\",IF(L153=0,\"\",L154/L153-1))","v":""},{"$f":"IF(M153=0,\"\",M154/M153-1)","v":""},null,null,null,2017,{"$f":"IF(Q154=\"Forecast\",\"\",IF(R153=0,\"\",R154/R153-1))","v":""},{"$f":"IF(S153=\"\",\"\",IF(S153=0,\"\",S154/S153-1))","v":""}]
[null,null,null,2018,null,null,1.9230769230769162E-2,null,{"$f":"IF(I156=0,\"\",G155/I156-1)","v":3.9215686274509887E-2},null,2018,{"$f":"IF(K155=\"Forecast\",\"\",IF(L154=0,\"\",L155/L154-1))","v":""},{"$f":"IF(M154=0,\"\",M155/M154-1)","v":4.3672481697549781E-3},null,{"$f":"IF(O156=0,\"\",M155/O156-1)","v":-0.88256948183675654},null,2018,{"$f":"IF(Q155=\"Forecast\",\"\",IF(R154=0,\"\",R155/R154-1))","v":""},{"$f":"IF(S154=\"\",\"\",IF(S154=0,\"\",S155/S154-1))","v":-1.458307726741026E-2},null,{"$f":"IF(U156=0,\"\",S155/U156-1)","v":-0.88700082214480347}]
[null,null,null,"Geometric Mean",null,null,{"$f":"IF(G149=0,\"\",(G155/G149)^(1/($D155-$D149-1))-1)","v":3.8169048926584015E-3},null,{"$f":"IF(I156=0,\"\",(G155/I156)^(1/(TestYear-RebaseYear-1))-1)","v":9.6629579961260426E-3},null,"Geometric Mean",{"$f":"IF(L149=0,\"\",(L153/L149)^(1/($D153-$D149-1))-1)","v":-1.3991245489558213E-2},{"$f":"IF(M149=0,\"\",(M155/M149)^(1/($D155-$D149-1))-1)","v":""},null,{"$f":"IF(O156=0,\"\",(M155/O156)^(1/(TestYear-RebaseYear-1))-1)","v":-0.41461007408954664},null,"Geometric Mean",{"$f":"IF(R149=\"\",\"\",IF(R149=0,\"\",(R153/R149)^(1/($D153-$D149-1))-1))","v":-7.5884118312573579E-3},{"$f":"IF(S149=\"\",\"\",IF(S149=0,\"\",(S155/S149)^(1/($D155-$D149-1))-1))","v":""},null,{"$f":"IF(U156=0,\"\",(S155/U156)^(1/(TestYear-RebaseYear-1))-1)","v":-0.42021253600085084}]
[]
[]
[null,null,null,"Calendar Year",null,"Revenues",null,null,null,null,{"$f":"IF(ISBLANK(N145),\"\",CONCATENATE(\"Demand (\",N145,\")\"))","v":"Demand (kW)"},null,null,null,null,null,{"$f":"CONCATENATE(\"Demand (\",N145,\") per \",LEFT(F147,LEN(F147)-1))","v":"Demand (kW) per Customer"}]
[null,null,null,{"$f":"CONCATENATE(\"(for \",TestYear,\" Cost of Service\")","v":"(for 2018 Cost of Service"},null,null,null,null,null,null,null,"Actual (Weather actual)","Weather-normalized",null,{"$f":"M169","v":"Weather-normalized"},null,null,{"$f":"L169","v":"Actual (Weather actual)"},{"$f":"M169","v":"Weather-normalized"},null,{"$f":"O169","v":"Weather-normalized"}]
[null,null,"Historical",{"$f":"D171-1","v":2012},null,{"$f":"F149","v":"Actual"},324328,{"$f":"IF(D170=RebaseYear,\"Board-approved\",\"\")","v":""},null,null,{"$f":"K149","v":"Actual"},66215,null,{"$f":"N149","v":""},null,null,{"$f":"K170","v":"Actual"},{"$f":"IF(G170=0,\"\",L170/G170)","v":0.20416060284650106},{"$f":"IF(G170=0,\"\",M170/G170)","v":0},{"$f":"N170","v":""},{"$f":"IF(T170=\"\",\"\",IF(I170=0,\"\",O170/I170))","v":""}]
[null,null,"Historical",2013,null,"Actual",339849,"Board-approved",299949,null,"Actual",92251,null,"Board-approved",58143,null,{"$f":"K171","v":"Actual"},{"$f":"IF(G171=0,\"\",L171/G171)","v":0.27144702500228041},{"$f":"IF(G171=0,\"\",M171/G171)","v":0},{"$f":"N171","v":"Board-approved"},{"$f":"IF(T171=\"\",\"\",IF(I171=0,\"\",O171/I171))","v":0.19384295330206136}]
[null,null,"Historical",2014,null,"Actual",345504,"",null,null,"Actual",99288,null,"",null,null,"Actual",0.28737149208113366,0,"",""]
[null,null,"Historical",2015,null,"Actual",338561,"",null,null,"Actual",94899,null,"",null,null,"Actual",0.28030103880836837,0,"",""]
[null,null,"Historical",2016,null,"Actual",311730,"",null,null,"Actual",66975,null,"",null,null,"Actual",0.21484938889423538,0,"",""]
[null,null,"Bridge Year (Forecast)",2017,null,"Forecast",336581,"",null,null,"Forecast",null,71869,"",null,null,"Forecast",0,0.2135266102364661,"",""]
[null,null,"Test Year (Forecast)",{"$f":"TestYear","v":2018},null,"Forecast",335105,"",null,null,"Forecast",null,72183,"",null,null,"Forecast",0,0.21540412706465137,"",""]
[null,null,null,null,null,null,null,null,{"$f":"SUM(I170:I175)","v":299949},null,null,null,null,null,{"$f":"SUM(O170:O175)","v":58143},null,null,null,null,null,{"$f":"SUM(U170:U175)","v":0.19384295330206136}]
[null,null,"Variance Analysis","Year",null,null,"Year-over-year",null,{"$f":"I157","v":"Test Year Versus Board-approved"},null,"Year","Year-over-year",null,null,{"$f":"I178","v":"Test Year Versus Board-approved"},null,"Year","Year-over-year",null,null,{"$f":"O178","v":"Test Year Versus Board-approved"}]
[null,null,null,{"$f":"D170","v":2012},null,null,null,null,null,null,{"$f":"D179","v":2012},null,null,null,null,null,{"$f":"K179","v":2012}]
[null,null,null,2013,null,null,{"$f":"IF(G170=0,\"\",G171/G170-1)","v":4.7855874300091195E-2},null,null,null,{"$f":"D180","v":2013},{"$f":"IF(L170=0,\"\",L171/L170-1)","v":0.39320395680736997},"",null,null,null,{"$f":"K180","v":2013},{"$f":"IF(R170=\"\",\"\",IF(R170=0,\"\",R171/R170-1))","v":0.32957593785304851},""]
[null,null,null,2014,null,null,1.6639742944660751E-2,null,null,null,2014,7.6281015923946649E-2,"",null,null,null,2014,5.8665100782443469E-2,""]
[null,null,null,2015,null,null,-2.0095281096600859E-2,null,null,null,2015,-4.420473773265654E-2,"",null,null,null,2015,-2.4603878490386477E-2,""]
[null,null,null,2016,null,null,-7.9250120362357124E-2,null,null,null,2016,-0.29424967597129581,"",null,null,null,2016,-0.23350484248072978,""]
[null,null,null,2017,null,null,7.9719629166265626E-2,null,null,null,2017,{"$f":"IF(K175=\"Forecast\",\"\",IF(L174=0,\"\",L175/L174-1))","v":""},{"$f":"IF(M174=0,\"\",M175/M174-1)","v":""},null,null,null,2017,{"$f":"IF(Q175=\"Forecast\",\"\",IF(R174=0,\"\",R175/R174-1))","v":""},{"$f":"IF(S174=\"\",\"\",IF(S174=0,\"\",S175/S174-1))","v":""}]
[null,null,null,2018,null,null,-4.3852742727604754E-3,null,{"$f":"IF(I177=0,\"\",G176/I177-1)","v":0.11720659178727044},null,2018,{"$f":"IF(K176=\"Forecast\",\"\",IF(L175=0,\"\",L176/L175-1))","v":""},{"$f":"IF(M175=0,\"\",M176/M175-1)","v":4.3690603737356337E-3},null,{"$f":"IF(O177=0,\"\",M176/O177-1)","v":0.24147360817295294},null,2018,{"$f":"IF(Q176=\"Forecast\",\"\",IF(R175=0,\"\",R176/R175-1))","v":""},{"$f":"IF(S175=\"\",\"\",IF(S175=0,\"\",S176/S175-1))","v":8.7928938978896198E-3},null,{"$f":"IF(U177=0,\"\",S176/U177-1)","v":0.11123011383855519}]
[null,null,null,"Geometric Mean",null,null,{"$f":"IF(G170=0,\"\",(G176/G170)^(1/($D176-$D170-1))-1)","v":6.5591307267325316E-3},null,{"$f":"IF(I177=0,\"\",(G176/I177)^(1/(TestYear-RebaseYear-1))-1)","v":2.8095296730940467E-2},null,"Geometric Mean",{"$f":"IF(L170=0,\"\",(L174/L170)^(1/($D174-$D170-1))-1)","v":3.8113755729669574E-3},{"$f":"IF(M170=0,\"\",(M176/M170)^(1/($D176-$D170-1))-1)","v":""},null,{"$f":"IF(O177=0,\"\",(M176/O177)^(1/(TestYear-RebaseYear-1))-1)","v":5.55635204496987E-2},null,"Geometric Mean",{"$f":"IF(R170=\"\",\"\",IF(R170=0,\"\",(R174/R170)^(1/($D174-$D170-1))-1))","v":1.7155599923426967E-2},{"$f":"IF(S170=\"\",\"\",IF(S170=0,\"\",(S176/S170)^(1/($D176-$D170-1))-1))","v":""},null,{"$f":"IF(U177=0,\"\",(S176/U177)^(1/(TestYear-RebaseYear-1))-1)","v":2.6717585233683616E-2}]
[]
[null,4,"Customer Class:","Streetlighting",null,null,null,"Is the customer class billed on consumption (kWh) or demand (kW or kVA)?",null,null,null,null,null,"kW"]
[]
[null,null,null,"Calendar Year",null,"Customers",null,null,null,null,"Consumption (kWh) (3)",null,null,null,null,null,{"$f":"CONCATENATE(\"Consumption (kWh) per \",LEFT(F190,LEN(F190)-1))","v":"Consumption (kWh) per Customer"}]
[null,null,null,{"$f":"CONCATENATE(\"(for \",TestYear,\" Cost of Service\")","v":"(for 2018 Cost of Service"},null,null,null,null,null,null,null,"Actual (Weather actual)","Weather-normalized",null,"Weather-normalized",null,null,{"$f":"L191","v":"Actual (Weather actual)"},{"$f":"M191","v":"Weather-normalized"},null,{"$f":"O191","v":"Weather-normalized"}]
[null,null,"Historical",{"$f":"D193-1","v":2012},null,{"$f":"F149","v":"Actual"},532,{"$f":"IF(D192=RebaseYear,\"Board-approved\",\"\")","v":""},null,null,{"$f":"F192","v":"Actual"},468216,null,{"$f":"H192","v":""},null,null,{"$f":"K192","v":"Actual"},{"$f":"IF(G192=0,\"\",L192/G192)","v":880.10526315789468},{"$f":"IF(G192=0,\"\",M192/G192)","v":0},{"$f":"N192","v":""},{"$f":"IF(T192=\"\",\"\",IF(I192=0,\"\",O192/I192))","v":""}]
[null,null,"Historical",2013,null,{"$f":"F150","v":"Actual"},532,"Board-approved",531,null,{"$f":"F193","v":"Actual"},517279,null,{"$f":"H193","v":"Board-approved"},501465,null,{"$f":"K193","v":"Actual"},{"$f":"IF(G193=0,\"\",L193/G193)","v":972.32894736842104},{"$f":"IF(G193=0,\"\",M193/G193)","v":0},{"$f":"N193","v":"Board-approved"},{"$f":"IF(T193=\"\",\"\",IF(I193=0,\"\",O193/I193))","v":944.37853107344631}]
[null,null,"Historical",2014,null,"Actual",534,"",null,null,"Actual",519121,null,"",null,null,"Actual",972.13670411985015,0,"",""]
[null,null,"Historical",2015,null,"Actual",532,"",null,null,"Actual",348985,null,"",null,null,"Actual",655.98684210526312,0,"",""]
[null,null,"Historical",2016,null,"Actual",531,"",null,null,"Actual",150597,null,"",null,null,"Actual",283.61016949152543,0,"",""]
[null,null,"Bridge Year",2017,null,"Forecast",531,"",null,null,"Forecast",null,150597,"",null,null,"Forecast",0,283.61016949152543,"",""]
[null,null,"Test Year",{"$f":"TestYear","v":2018},null,"Forecast",531,"",null,null,"Forecast",null,150597,"",null,null,"Forecast",0,283.61016949152543,"",""]
[null,null,null,null,null,null,null,null,{"$f":"SUM(I192:I197)","v":531},null,null,null,null,null,{"$f":"SUM(O192:O197)","v":501465},null,null,null,null,null,{"$f":"SUM(U192:U197)","v":944.37853107344631}]
[null,null,"Variance Analysis","Year",null,null,"Year-over-year",null,"Test Year Versus Board-approved",null,"Year","Year-over-year",null,null,{"$f":"I200","v":"Test Year Versus Board-approved"},null,"Year","Year-over-year",null,null,{"$f":"O200","v":"Test Year Versus Board-approved"}]
[null,null,null,{"$f":"D192","v":2012},null,null,null,null,null,null,{"$f":"D201","v":2012},null,null,null,null,null,{"$f":"K201","v":2012}]
[null,null,null,2013,null,null,{"$f":"IF(G192=0,\"\",G193/G192-1)","v":0},null,null,null,{"$f":"D202","v":2013},{"$f":"IF(L192=0,\"\",L193/L192-1)","v":0.10478710680540604},"",null,null,null,{"$f":"K202","v":2013},{"$f":"IF(R192=\"\",\"\",IF(R192=0,\"\",R193/R192-1))","v":0.10478710680540604},""]
[null,null,null,2014,null,null,3.759398496240518E-3,null,null,null,2014,3.5609410008912157E-3,"",null,null,null,2014,-1.9771420884995283E-4,""]
[null,null,null,2015,null,null,-3.7453183520599342E-3,null,null,null,2015,-0.32773861970523255,"",null,null,null,2015,-0.32521132128307173,""]
[null,null,null,2016,null,null,-1.879699248120259E-3,null,null,null,2016,-0.56847142427324959,"",null,null,null,2016,-0.56765875275587341,""]
[null,null,null,2017,null,null,0,null,null,null,2017,{"$f":"IF(K197=\"Forecast\",\"\",IF(L196=0,\"\",L197/L196-1))","v":""},{"$f":"IF(M196=0,\"\",M197/M196-1)","v":""},null,null,null,2017,{"$f":"IF(Q197=\"Forecast\",\"\",IF(R196=0,\"\",R197/R196-1))","v":""},{"$f":"IF(S196=\"\",\"\",IF(S196=0,\"\",S197/S196-1))","v":""}]
[null,null,null,2018,null,null,0,null,{"$f":"IF(I199=0,\"\",G198/I199-1)","v":0},null,2018,{"$f":"IF(K198=\"Forecast\",\"\",IF(L197=0,\"\",L198/L197-1))","v":""},{"$f":"IF(M197=0,\"\",M198/M197-1)","v":0},null,{"$f":"IF(O199=0,\"\",M198/O199-1)","v":-0.69968592025365672},null,2018,{"$f":"IF(Q198=\"Forecast\",\"\",IF(R197=0,\"\",R198/R197-1))","v":""},{"$f":"IF(S197=\"\",\"\",IF(S197=0,\"\",S198/S197-1))","v":0},null,{"$f":"IF(U199=0,\"\",S198/U199-1)","v":-0.69968592025365672}]
[null,null,null,"Geometric Mean",null,null,{"$f":"IF(G192=0,\"\",(G198/G192)^(1/($D198-$D192-1))-1)","v":-3.7622283037641591E-4},null,{"$f":"IF(I199=0,\"\",(G198/I199)^(1/(TestYear-RebaseYear-1))-1)","v":0},null,"Geometric Mean",{"$f":"IF(L192=0,\"\",(L196/L192)^(1/($D196-$D192-1))-1)","v":-0.31484311952577448},{"$f":"IF(M192=0,\"\",(M198/M192)^(1/($D198-$D192-1))-1)","v":""},null,{"$f":"IF(O199=0,\"\",(M198/O199)^(1/(TestYear-RebaseYear-1))-1)","v":-0.25972356732658219},null,"Geometric Mean",{"$f":"IF(R192=\"\",\"\",IF(R192=0,\"\",(R196/R192)^(1/($D196-$D192-1))-1))","v":-0.31441328448174066},{"$f":"IF(S192=\"\",\"\",IF(S192=0,\"\",(S198/S192)^(1/($D198-$D192-1))-1))","v":""},null,{"$f":"IF(U199=0,\"\",(S198/U199)^(1/(TestYear-RebaseYear-1))-1)","v":-0.25972356732658219}]
[]
[]
[null,null,null,"Calendar Year",null,"Revenues",null,null,null,null,{"$f":"IF(ISBLANK(N188),\"\",CONCATENATE(\"Demand (\",N188,\")\"))","v":"Demand (kW)"},null,null,null,null,null,{"$f":"CONCATENATE(\"Demand (\",N188,\") per \",LEFT(F190,LEN(F190)-1))","v":"Demand (kW) per Customer"}]
[null,null,null,{"$f":"CONCATENATE(\"(for \",TestYear,\" Cost of Service\")","v":"(for 2018 Cost of Service"},null,null,null,null,null,null,null,"Actual (Weather actual)","Weather-normalized",null,{"$f":"M212","v":"Weather-normalized"},null,null,{"$f":"L212","v":"Actual (Weather actual)"},{"$f":"M212","v":"Weather-normalized"},null,{"$f":"O212","v":"Weather-normalized"}]
[null,null,"Historical",{"$f":"D214-1","v":2012},null,{"$f":"F192","v":"Actual"},99516,{"$f":"IF(D213=RebaseYear,\"Board-approved\",\"\")","v":""},null,null,{"$f":"K192","v":"Actual"},1447,null,{"$f":"N192","v":""},null,null,{"$f":"K213","v":"Actual"},{"$f":"IF(G213=0,\"\",L213/G213)","v":1.4540375417018369E-2},{"$f":"IF(G213=0,\"\",M213/G213)","v":0},{"$f":"N213","v":""},{"$f":"IF(T213=\"\",\"\",IF(I213=0,\"\",O213/I213))","v":""}]
[null,null,"Historical",2013,null,"Actual",96659,"Board-approved",95645,null,"Actual",1450,null,"Board-approved",1512,null,{"$f":"K214","v":"Actual"},{"$f":"IF(G214=0,\"\",L214/G214)","v":1.500118974953186E-2},{"$f":"IF(G214=0,\"\",M214/G214)","v":0},{"$f":"N214","v":"Board-approved"},{"$f":"IF(T214=\"\",\"\",IF(I214=0,\"\",O214/I214))","v":1.580845836164985E-2}]
[null,null,"Historical",2014,null,"Actual",99988,"",null,null,"Actual",1454,null,"",null,null,"Actual",1.4541745009401127E-2,0,"",""]
[null,null,"Historical",2015,null,"Actual",96201,"",null,null,"Actual",1104,null,"",null,null,"Actual",1.1475972183241338E-2,0,"",""]
[null,null,"Historical",2016,null,"Actual",90824,"",null,null,"Actual",420,null,"",null,null,"Actual",4.6243283713555891E-3,0,"",""]
[null,null,"Bridge Year (Forecast)",2017,null,"Forecast",79907,"",null,null,"Forecast",null,420,"",null,null,"Forecast",0,5.2561102281402129E-3,"",""]
[null,null,"Test Year (Forecast)",{"$f":"TestYear","v":2018},null,"Forecast",29451,"",null,null,"Forecast",null,420,"",null,null,"Forecast",0,1.4260975858205155E-2,"",""]
[null,null,null,null,null,null,null,null,{"$f":"SUM(I213:I218)","v":95645},null,null,null,null,null,{"$f":"SUM(O213:O218)","v":1512},null,null,null,null,null,{"$f":"SUM(U213:U218)","v":1.580845836164985E-2}]
[null,null,"Variance Analysis","Year",null,null,"Year-over-year",null,{"$f":"I200","v":"Test Year Versus Board-approved"},null,"Year","Year-over-year",null,null,{"$f":"I221","v":"Test Year Versus Board-approved"},null,"Year","Year-over-year",null,null,{"$f":"O221","v":"Test Year Versus Board-approved"}]
[null,null,null,{"$f":"D213","v":2012},null,null,null,null,null,null,{"$f":"D222","v":2012},null,null,null,null,null,{"$f":"K222","v":2012}]
[null,null,null,2013,null,null,{"$f":"IF(G213=0,\"\",G214/G213-1)","v":-2.8708951324410092E-2},null,null,null,{"$f":"D223","v":2013},{"$f":"IF(L213=0,\"\",L214/L213-1)","v":2.0732550103663705E-3},"",null,null,null,{"$f":"K223","v":2013},{"$f":"IF(R213=\"\",\"\",IF(R213=0,\"\",R214/R213-1))","v":3.1692051910443997E-2},""]
[null,null,null,2014,null,null,3.4440662535304423E-2,null,null,null,2014,2.7586206896552667E-3,"",null,null,null,2014,-3.0627220093997543E-2,""]
[null,null,null,2015,null,null,-3.787454494539344E-2,null,null,null,2015,-0.24071526822558464,"",null,null,null,2015,-0.21082564879096632,""]
[null,null,null,2016,null,null,-5.5893389881602085E-2,null,null,null,2016,-0.61956521739130432,"",null,null,null,2016,-0.59704256009712042,""]
[null,null,null,2017,null,null,-0.12019950673830704,null,null,null,2017,{"$f":"IF(K218=\"Forecast\",\"\",IF(L217=0,\"\",L218/L217-1))","v":""},{"$f":"IF(M217=0,\"\",M218/M217-1)","v":""},null,null,null,2017,{"$f":"IF(Q218=\"Forecast\",\"\",IF(R217=0,\"\",R218/R217-1))","v":""},{"$f":"IF(S217=\"\",\"\",IF(S217=0,\"\",S218/S217-1))","v":""}]
[null,null,null,2018,null,null,-0.63143404207391085,null,{"$f":"IF(I220=0,\"\",G219/I220-1)","v":-0.6920800878247686},null,2018,{"$f":"IF(K219=\"Forecast\",\"\",IF(L218=0,\"\",L219/L218-1))","v":""},{"$f":"IF(M218=0,\"\",M219/M218-1)","v":0},null,{"$f":"IF(O220=0,\"\",M219/O220-1)","v":-0.72222222222222221},null,2018,{"$f":"IF(Q219=\"Forecast\",\"\",IF(R218=0,\"\",R219/R218-1))","v":""},{"$f":"IF(S218=\"\",\"\",IF(S218=0,\"\",S219/S218-1))","v":1.7132185664323796},null,{"$f":"IF(U220=0,\"\",S219/U220-1)","v":-9.7889526482782929E-2}]
[null,null,null,"Geometric Mean",null,null,{"$f":"IF(G213=0,\"\",(G219/G213)^(1/($D219-$D213-1))-1)","v":-0.21613472301291814},null,{"$f":"IF(I220=0,\"\",(G219/I220)^(1/(TestYear-RebaseYear-1))-1)","v":-0.25508032768107247},null,"Geometric Mean",{"$f":"IF(L213=0,\"\",(L217/L213)^(1/($D217-$D213-1))-1)","v":-0.33789492039346813},{"$f":"IF(M213=0,\"\",(M219/M213)^(1/($D219-$D213-1))-1)","v":""},null,{"$f":"IF(O220=0,\"\",(M219/O220)^(1/(TestYear-RebaseYear-1))-1)","v":-0.27402047088452286},null,"Geometric Mean",{"$f":"IF(R213=\"\",\"\",IF(R213=0,\"\",(R217/R213)^(1/($D217-$D213-1))-1))","v":-0.31741351999475809},{"$f":"IF(S213=\"\",\"\",IF(S213=0,\"\",(S219/S213)^(1/($D219-$D213-1))-1))","v":""},null,{"$f":"IF(U220=0,\"\",(S219/U220)^(1/(TestYear-RebaseYear-1))-1)","v":-2.5425752476760155E-2}]
[]
[null,5,"Customer Class:","Unmetered Scattered Load",null,null,null,"Is the customer class billed on consumption (kWh) or demand (kW or kVA)?",null,null,null,null,null,"kWh"]
[]
[null,null,null,"Calendar Year",null,"Customers",null,null,null,null,"Consumption (kWh) (3)",null,null,null,null,null,{"$f":"CONCATENATE(\"Consumption (kWh) per \",LEFT(F233,LEN(F233)-1))","v":"Consumption (kWh) per Customer"}]
[null,null,null,{"$f":"CONCATENATE(\"(for \",TestYear,\" Cost of Service\")","v":"(for 2018 Cost of Service"},null,null,null,null,null,null,null,"Actual (Weather actual)","Weather-normalized",null,"Weather-normalized",null,null,{"$f":"L234","v":"Actual (Weather actual)"},{"$f":"M234","v":"Weather-normalized"},null,{"$f":"O234","v":"Weather-normalized"}]
[null,null,"Historical",{"$f":"D236-1","v":2012},null,{"$f":"F192","v":"Actual"},2,{"$f":"IF(D235=RebaseYear,\"Board-approved\",\"\")","v":""},null,null,{"$f":"F235","v":"Actual"},4705,null,{"$f":"H235","v":""},null,null,{"$f":"K235","v":"Actual"},{"$f":"IF(G235=0,\"\",L235/G235)","v":2352.5},{"$f":"IF(G235=0,\"\",M235/G235)","v":0},{"$f":"N235","v":""},{"$f":"IF(T235=\"\",\"\",IF(I235=0,\"\",O235/I235))","v":""}]
[null,null,"Historical",2013,null,{"$f":"F193","v":"Actual"},1,"Board-approved",2,null,{"$f":"F236","v":"Actual"},2154,null,{"$f":"H236","v":"Board-approved"},11545,null,{"$f":"K236","v":"Actual"},{"$f":"IF(G236=0,\"\",L236/G236)","v":2154},{"$f":"IF(G236=0,\"\",M236/G236)","v":0},{"$f":"N236","v":"Board-approved"},{"$f":"IF(T236=\"\",\"\",IF(I236=0,\"\",O236/I236))","v":5772.5}]
[null,null,"Historical",2014,null,"Actual",1,"",null,null,"Actual",2235,null,"",null,null,"Actual",2235,0,"",""]
[null,null,"Historical",2015,null,"Actual",1,"",null,null,"Actual",1488,null,"",null,null,"Actual",1488,0,"",""]
[null,null,"Historical",2016,null,"Actual",0,"",null,null,"Actual",0,null,"",null,null,"Actual","","","",""]
[null,null,"Bridge Year",2017,null,"Forecast",0,"",null,null,"Forecast",null,0,"",null,null,"Forecast","","","",""]
[null,null,"Test Year",{"$f":"TestYear","v":2018},null,"Forecast",0,"",null,null,"Forecast",null,0,"",null,null,"Forecast","","","",""]
[null,null,null,null,null,null,null,null,{"$f":"SUM(I235:I240)","v":2},null,null,null,null,null,{"$f":"SUM(O235:O240)","v":11545},null,null,null,null,null,{"$f":"SUM(U235:U240)","v":5772.5}]
[null,null,"Variance Analysis","Year",null,null,"Year-over-year",null,"Test Year Versus Board-approved",null,"Year","Year-over-year",null,null,{"$f":"I243","v":"Test Year Versus Board-approved"},null,"Year","Year-over-year",null,null,{"$f":"O243","v":"Test Year Versus Board-approved"}]
[null,null,null,{"$f":"D235","v":2012},null,null,null,null,null,null,{"$f":"D244","v":2012},null,null,null,null,null,{"$f":"K244","v":2012}]
[null,null,null,2013,null,null,{"$f":"IF(G235=0,\"\",G236/G235-1)","v":-0.5},null,null,null,{"$f":"D245","v":2013},{"$f":"IF(L235=0,\"\",L236/L235-1)","v":-0.54218916046758769},"",null,null,null,{"$f":"K245","v":2013},{"$f":"IF(R235=\"\",\"\",IF(R235=0,\"\",R236/R235-1))","v":-8.4378320935175388E-2},""]
[null,null,null,2014,null,null,0,null,null,null,2014,3.7604456824512633E-2,"",null,null,null,2014,3.7604456824512633E-2,""]
[null,null,null,2015,null,null,0,null,null,null,2015,-0.33422818791946307,"",null,null,null,2015,-0.33422818791946307,""]
[null,null,null,2016,null,null,-1,null,null,null,2016,-1,"",null,null,null,2016,{"$error":"#VALUE!"},""]
[null,null,null,2017,null,null,"",null,null,null,2017,{"$f":"IF(K240=\"Forecast\",\"\",IF(L239=0,\"\",L240/L239-1))","v":""},{"$f":"IF(M239=0,\"\",M240/M239-1)","v":""},null,null,null,2017,{"$f":"IF(Q240=\"Forecast\",\"\",IF(R239=0,\"\",R240/R239-1))","v":""},{"$f":"IF(S239=\"\",\"\",IF(S239=0,\"\",S240/S239-1))","v":""}]
[null,null,null,2018,null,null,"",null,{"$f":"IF(I242=0,\"\",G241/I242-1)","v":-1},null,2018,{"$f":"IF(K241=\"Forecast\",\"\",IF(L240=0,\"\",L241/L240-1))","v":""},{"$f":"IF(M240=0,\"\",M241/M240-1)","v":""},null,{"$f":"IF(O242=0,\"\",M241/O242-1)","v":-1},null,2018,{"$f":"IF(Q241=\"Forecast\",\"\",IF(R240=0,\"\",R241/R240-1))","v":""},{"$f":"IF(S240=\"\",\"\",IF(S240=0,\"\",S241/S240-1))","v":""},null,{"$f":"IF(U242=0,\"\",S241/U242-1)","v":{"$error":"#VALUE!"}}]
[null,null,null,"Geometric Mean",null,null,{"$f":"IF(G235=0,\"\",(G241/G235)^(1/($D241-$D235-1))-1)","v":-1},null,{"$f":"IF(I242=0,\"\",(G241/I242)^(1/(TestYear-RebaseYear-1))-1)","v":-1},null,"Geometric Mean",{"$f":"IF(L235=0,\"\",(L239/L235)^(1/($D239-$D235-1))-1)","v":-1},{"$f":"IF(M235=0,\"\",(M241/M235)^(1/($D241-$D235-1))-1)","v":""},null,{"$f":"IF(O242=0,\"\",(M241/O242)^(1/(TestYear-RebaseYear-1))-1)","v":-1},null,"Geometric Mean",{"$f":"IF(R235=\"\",\"\",IF(R235=0,\"\",(R239/R235)^(1/($D239-$D235-1))-1))","v":{"$error":"#VALUE!"}},{"$f":"IF(S235=\"\",\"\",IF(S235=0,\"\",(S241/S235)^(1/($D241-$D235-1))-1))","v":""},null,{"$f":"IF(U242=0,\"\",(S241/U242)^(1/(TestYear-RebaseYear-1))-1)","v":{"$error":"#VALUE!"}}]
[]
[]
[null,null,null,"Calendar Year",null,"Revenues",null,null,null,null,{"$f":"IF(ISBLANK(N231),\"\",CONCATENATE(\"Demand (\",N231,\")\"))","v":"Demand (kWh)"},null,null,null,null,null,{"$f":"CONCATENATE(\"Demand (\",N231,\") per \",LEFT(F233,LEN(F233)-1))","v":"Demand (kWh) per Customer"}]
[null,null,null,{"$f":"CONCATENATE(\"(for \",TestYear,\" Cost of Service\")","v":"(for 2018 Cost of Service"},null,null,null,null,null,null,null,"Actual (Weather actual)","Weather-normalized",null,{"$f":"M255","v":"Weather-normalized"},null,null,{"$f":"L255","v":"Actual (Weather actual)"},{"$f":"M255","v":"Weather-normalized"},null,{"$f":"O255","v":"Weather-normalized"}]
[null,null,"Historical",{"$f":"D257-1","v":2012},null,{"$f":"F235","v":"Actual"},597,{"$f":"IF(D256=RebaseYear,\"Board-approved\",\"\")","v":""},null,null,{"$f":"K235","v":"Actual"},null,null,{"$f":"N235","v":""},null,null,{"$f":"K256","v":"Actual"},{"$f":"IF(G256=0,\"\",L256/G256)","v":0},{"$f":"IF(G256=0,\"\",M256/G256)","v":0},{"$f":"N256","v":""},{"$f":"IF(T256=\"\",\"\",IF(I256=0,\"\",O256/I256))","v":""}]
[null,null,"Historical",2013,null,"Actual",276,"Board-approved",617,null,"Actual",null,null,"Board-approved",null,null,{"$f":"K257","v":"Actual"},{"$f":"IF(G257=0,\"\",L257/G257)","v":0},{"$f":"IF(G257=0,\"\",M257/G257)","v":0},{"$f":"N257","v":"Board-approved"},{"$f":"IF(T257=\"\",\"\",IF(I257=0,\"\",O257/I257))","v":0}]
[null,null,"Historical",2014,null,"Actual",281,"",null,null,"Actual",null,null,"",null,null,"Actual",0,0,"",""]
[null,null,"Historical",2015,null,"Actual",189,"",null,null,"Actual",null,null,"",null,null,"Actual",0,0,"",""]
[null,null,"Historical",2016,null,"Actual",0,"",null,null,"Actual",null,null,"",null,null,"Actual","","","",""]
[null,null,"Bridge Year (Forecast)",2017,null,"Forecast",0,"",null,null,"Forecast",null,null,"",null,null,"Forecast","","","",""]
[null,null,"Test Year (Forecast)",{"$f":"TestYear","v":2018},null,"Forecast",0,"",null,null,"Forecast",null,null,"",null,null,"Forecast","","","",""]
[null,null,null,null,null,null,null,null,{"$f":"SUM(I256:I261)","v":617},null,null,null,null,null,{"$f":"SUM(O256:O261)","v":0},null,null,null,null,null,{"$f":"SUM(U256:U261)","v":0}]
[null,null,"Variance Analysis","Year",null,null,"Year-over-year",null,{"$f":"I243","v":"Test Year Versus Board-approved"},null,"Year","Year-over-year",null,null,{"$f":"I264","v":"Test Year Versus Board-approved"},null,"Year","Year-over-year",null,null,{"$f":"O264","v":"Test Year Versus Board-approved"}]
[null,null,null,{"$f":"D256","v":2012},null,null,null,null,null,null,{"$f":"D265","v":2012},null,null,null,null,null,{"$f":"K265","v":2012}]
[null,null,null,2013,null,null,{"$f":"IF(G256=0,\"\",G257/G256-1)","v":-0.53768844221105527},null,null,null,{"$f":"D266","v":2013},{"$f":"IF(L256=0,\"\",L257/L256-1)","v":""},"",null,null,null,{"$f":"K266","v":2013},{"$f":"IF(R256=\"\",\"\",IF(R256=0,\"\",R257/R256-1))","v":""},""]
[null,null,null,2014,null,null,1.8115942028985588E-2,null,null,null,2014,"","",null,null,null,2014,"",""]
[null,null,null,2015,null,null,-0.32740213523131667,null,null,null,2015,"","",null,null,null,2015,"",""]
[null,null,null,2016,null,null,-1,null,null,null,2016,"","",null,null,null,2016,"",""]
[null,null,null,2017,null,null,"",null,null,null,2017,{"$f":"IF(K261=\"Forecast\",\"\",IF(L260=0,\"\",L261/L260-1))","v":""},{"$f":"IF(M260=0,\"\",M261/M260-1)","v":""},null,null,null,2017,{"$f":"IF(Q261=\"Forecast\",\"\",IF(R260=0,\"\",R261/R260-1))","v":""},{"$f":"IF(S260=\"\",\"\",IF(S260=0,\"\",S261/S260-1))","v":""}]
[null,null,null,2018,null,null,"",null,{"$f":"IF(I263=0,\"\",G262/I263-1)","v":-1},null,2018,{"$f":"IF(K262=\"Forecast\",\"\",IF(L261=0,\"\",L262/L261-1))","v":""},{"$f":"IF(M261=0,\"\",M262/M261-1)","v":""},null,{"$f":"IF(O263=0,\"\",M262/O263-1)","v":""},null,2018,{"$f":"IF(Q262=\"Forecast\",\"\",IF(R261=0,\"\",R262/R261-1))","v":""},{"$f":"IF(S261=\"\",\"\",IF(S261=0,\"\",S262/S261-1))","v":""},null,{"$f":"IF(U263=0,\"\",S262/U263-1)","v":""}]
[null,null,null,"Geometric Mean",null,null,{"$f":"IF(G256=0,\"\",(G262/G256)^(1/($D262-$D256-1))-1)","v":-1},null,{"$f":"IF(I263=0,\"\",(G262/I263)^(1/(TestYear-RebaseYear-1))-1)","v":-1},null,"Geometric Mean",{"$f":"IF(L256=0,\"\",(L260/L256)^(1/($D260-$D256-1))-1)","v":""},{"$f":"IF(M256=0,\"\",(M262/M256)^(1/($D262-$D256-1))-1)","v":""},null,{"$f":"IF(O263=0,\"\",(M262/O263)^(1/(TestYear-RebaseYear-1))-1)","v":""},null,"Geometric Mean",{"$f":"IF(R256=\"\",\"\",IF(R256=0,\"\",(R260/R256)^(1/($D260-$D256-1))-1))","v":""},{"$f":"IF(S256=\"\",\"\",IF(S256=0,\"\",(S262/S256)^(1/($D262-$D256-1))-1))","v":""},null,{"$f":"IF(U263=0,\"\",(S262/U263)^(1/(TestYear-RebaseYear-1))-1)","v":""}]
[]
[null,{"$f":"B231+1","v":6},"Customer Class:",null,null,null,null,"Is the customer class billed on consumption (kWh) or demand (kW or kVA)?"]
[]
[null,null,null,"Calendar Year",null,"Customers",null,null,null,null,"Consumption (kWh) (3)",null,null,null,null,null,{"$f":"CONCATENATE(\"Consumption (kWh) per \",LEFT(F276,LEN(F276)-1))","v":"Consumption (kWh) per Customer"}]
[null,null,null,{"$f":"CONCATENATE(\"(for \",TestYear,\" Cost of Service\")","v":"(for 2018 Cost of Service"},null,null,null,null,null,null,null,"Actual (Weather actual)","Weather-normalized",null,"Weather-normalized",null,null,{"$f":"L277","v":"Actual (Weather actual)"},{"$f":"M277","v":"Weather-normalized"},null,{"$f":"O277","v":"Weather-normalized"}]
[null,null,"Historical",{"$f":"D279-1","v":2012},null,{"$f":"F235","v":"Actual"},null,{"$f":"IF(D278=RebaseYear,\"Board-approved\",\"\")","v":""},null,null,{"$f":"F278","v":"Actual"},null,null,{"$f":"H278","v":""},null,null,{"$f":"K278","v":"Actual"},{"$f":"IF(G278=0,\"\",L278/G278)","v":""},{"$f":"IF(G278=0,\"\",M278/G278)","v":""},{"$f":"N278","v":""},{"$f":"IF(T278=\"\",\"\",IF(I278=0,\"\",O278/I278))","v":""}]
[null,null,"Historical",2013,null,{"$f":"F236","v":"Actual"},null,"Board-approved",null,null,{"$f":"F279","v":"Actual"},null,null,{"$f":"H279","v":"Board-approved"},null,null,{"$f":"K279","v":"Actual"},{"$f":"IF(G279=0,\"\",L279/G279)","v":""},{"$f":"IF(G279=0,\"\",M279/G279)","v":""},{"$f":"N279","v":"Board-approved"},{"$f":"IF(T279=\"\",\"\",IF(I279=0,\"\",O279/I279))","v":""}]
[null,null,"Historical",2014,null,"Actual",null,"",null,null,"Actual",null,null,"",null,null,"Actual","","","",""]
[null,null,"Historical",2015,null,"Actual",null,"",null,null,"Actual",null,null,"",null,null,"Actual","","","",""]
[null,null,"Historical",2016,null,"Actual",null,"",null,null,"Actual",null,null,"",null,null,"Actual","","","",""]
[null,null,"Bridge Year",2017,null,"Forecast",null,"",null,null,"Forecast",null,null,"",null,null,"Forecast","","","",""]
[null,null,"Test Year",{"$f":"TestYear","v":2018},null,"Forecast",null,"",null,null,"Forecast",null,null,"",null,null,"Forecast","","","",""]
[null,null,null,null,null,null,null,null,{"$f":"SUM(I278:I283)","v":0},null,null,null,null,null,{"$f":"SUM(O278:O283)","v":0},null,null,null,null,null,{"$f":"SUM(U278:U283)","v":0}]
[null,null,"Variance Analysis","Year",null,null,"Year-over-year",null,"Test Year Versus Board-approved",null,"Year","Year-over-year",null,null,{"$f":"I286","v":"Test Year Versus Board-approved"},null,"Year","Year-over-year",null,null,{"$f":"O286","v":"Test Year Versus Board-approved"}]
[null,null,null,{"$f":"D278","v":2012},null,null,null,null,null,null,{"$f":"D287","v":2012},null,null,null,null,null,{"$f":"K287","v":2012}]
[null,null,null,2013,null,null,{"$f":"IF(G278=0,\"\",G279/G278-1)","v":""},null,null,null,{"$f":"D288","v":2013},{"$f":"IF(L278=0,\"\",L279/L278-1)","v":""},"",null,null,null,{"$f":"K288","v":2013},{"$f":"IF(R278=\"\",\"\",IF(R278=0,\"\",R279/R278-1))","v":""},""]
[null,null,null,2014,null,null,"",null,null,null,2014,"","",null,null,null,2014,"",""]
[null,null,null,2015,null,null,"",null,null,null,2015,"","",null,null,null,2015,"",""]
[null,null,null,2016,null,null,"",null,null,null,2016,"","",null,null,null,2016,"",""]
[null,null,null,2017,null,null,"",null,null,null,2017,{"$f":"IF(K283=\"Forecast\",\"\",IF(L282=0,\"\",L283/L282-1))","v":""},{"$f":"IF(M282=0,\"\",M283/M282-1)","v":""},null,null,null,2017,{"$f":"IF(Q283=\"Forecast\",\"\",IF(R282=0,\"\",R283/R282-1))","v":""},{"$f":"IF(S282=\"\",\"\",IF(S282=0,\"\",S283/S282-1))","v":""}]
[null,null,null,2018,null,null,"",null,{"$f":"IF(I285=0,\"\",G284/I285-1)","v":""},null,2018,{"$f":"IF(K284=\"Forecast\",\"\",IF(L283=0,\"\",L284/L283-1))","v":""},{"$f":"IF(M283=0,\"\",M284/M283-1)","v":""},null,{"$f":"IF(O285=0,\"\",M284/O285-1)","v":""},null,2018,{"$f":"IF(Q284=\"Forecast\",\"\",IF(R283=0,\"\",R284/R283-1))","v":""},{"$f":"IF(S283=\"\",\"\",IF(S283=0,\"\",S284/S283-1))","v":""},null,{"$f":"IF(U285=0,\"\",S284/U285-1)","v":""}]
[null,null,null,"Geometric Mean",null,null,{"$f":"IF(G278=0,\"\",(G284/G278)^(1/($D284-$D278-1))-1)","v":""},null,{"$f":"IF(I285=0,\"\",(G284/I285)^(1/(TestYear-RebaseYear-1))-1)","v":""},null,"Geometric Mean",{"$f":"IF(L278=0,\"\",(L282/L278)^(1/($D282-$D278-1))-1)","v":""},{"$f":"IF(M278=0,\"\",(M284/M278)^(1/($D284-$D278-1))-1)","v":""},null,{"$f":"IF(O285=0,\"\",(M284/O285)^(1/(TestYear-RebaseYear-1))-1)","v":""},null,"Geometric Mean",{"$f":"IF(R278=\"\",\"\",IF(R278=0,\"\",(R282/R278)^(1/($D282-$D278-1))-1))","v":""},{"$f":"IF(S278=\"\",\"\",IF(S278=0,\"\",(S284/S278)^(1/($D284-$D278-1))-1))","v":""},null,{"$f":"IF(U285=0,\"\",(S284/U285)^(1/(TestYear-RebaseYear-1))-1)","v":""}]
[]
[]
[null,null,null,"Calendar Year",null,"Revenues",null,null,null,null,{"$f":"IF(ISBLANK(N274),\"\",CONCATENATE(\"Demand (\",N274,\")\"))","v":""},null,null,null,null,null,{"$f":"CONCATENATE(\"Demand (\",N274,\") per \",LEFT(F276,LEN(F276)-1))","v":"Demand () per Customer"}]
[null,null,null,{"$f":"CONCATENATE(\"(for \",TestYear,\" Cost of Service\")","v":"(for 2018 Cost of Service"},null,null,null,null,null,null,null,"Actual (Weather actual)","Weather-normalized",null,{"$f":"M298","v":"Weather-normalized"},null,null,{"$f":"L298","v":"Actual (Weather actual)"},{"$f":"M298","v":"Weather-normalized"},null,{"$f":"O298","v":"Weather-normalized"}]
[null,null,"Historical",{"$f":"D300-1","v":2012},null,{"$f":"F278","v":"Actual"},null,{"$f":"IF(D299=RebaseYear,\"Board-approved\",\"\")","v":""},null,null,{"$f":"K278","v":"Actual"},null,null,{"$f":"N278","v":""},null,null,{"$f":"K299","v":"Actual"},{"$f":"IF(G299=0,\"\",L299/G299)","v":""},{"$f":"IF(G299=0,\"\",M299/G299)","v":""},{"$f":"N299","v":""},{"$f":"IF(T299=\"\",\"\",IF(I299=0,\"\",O299/I299))","v":""}]
[null,null,"Historical",2013,null,"Actual",null,"Board-approved",null,null,"Actual",null,null,"Board-approved",null,null,{"$f":"K300","v":"Actual"},{"$f":"IF(G300=0,\"\",L300/G300)","v":""},{"$f":"IF(G300=0,\"\",M300/G300)","v":""},{"$f":"N300","v":"Board-approved"},{"$f":"IF(T300=\"\",\"\",IF(I300=0,\"\",O300/I300))","v":""}]
[null,null,"Historical",2014,null,"Actual",null,"",null,null,"Actual",null,null,"",null,null,"Actual","","","",""]
[null,null,"Historical",2015,null,"Actual",null,"",null,null,"Actual",null,null,"",null,null,"Actual","","","",""]
[null,null,"Historical",2016,null,"Actual",null,"",null,null,"Actual",null,null,"",null,null,"Actual","","","",""]
[null,null,"Bridge Year (Forecast)",2017,null,"Forecast",null,"",null,null,"Forecast",null,null,"",null,null,"Forecast","","","",""]
[null,null,"Test Year (Forecast)",{"$f":"TestYear","v":2018},null,"Forecast",null,"",null,null,"Forecast",null,null,"",null,null,"Forecast","","","",""]
[null,null,null,null,null,null,null,null,{"$f":"SUM(I299:I304)","v":0},null,null,null,null,null,{"$f":"SUM(O299:O304)","v":0},null,null,null,null,null,{"$f":"SUM(U299:U304)","v":0}]
[null,null,"Variance Analysis","Year",null,null,"Year-over-year",null,{"$f":"I286","v":"Test Year Versus Board-approved"},null,"Year","Year-over-year",null,null,{"$f":"I307","v":"Test Year Versus Board-approved"},null,"Year","Year-over-year",null,null,{"$f":"O307","v":"Test Year Versus Board-approved"}]
[null,null,null,{"$f":"D299","v":2012},null,null,null,null,null,null,{"$f":"D308","v":2012},null,null,null,null,null,{"$f":"K308","v":2012}]
[null,null,null,2013,null,null,{"$f":"IF(G299=0,\"\",G300/G299-1)","v":""},null,null,null,{"$f":"D309","v":2013},{"$f":"IF(L299=0,\"\",L300/L299-1)","v":""},"",null,null,null,{"$f":"K309","v":2013},{"$f":"IF(R299=\"\",\"\",IF(R299=0,\"\",R300/R299-1))","v":""},""]
[null,null,null,2014,null,null,"",null,null,null,2014,"","",null,null,null,2014,"",""]
[null,null,null,2015,null,null,"",null,null,null,2015,"","",null,null,null,2015,"",""]
[null,null,null,2016,null,null,"",null,null,null,2016,"","",null,null,null,2016,"",""]
[null,null,null,2017,null,null,"",null,null,null,2017,{"$f":"IF(K304=\"Forecast\",\"\",IF(L303=0,\"\",L304/L303-1))","v":""},{"$f":"IF(M303=0,\"\",M304/M303-1)","v":""},null,null,null,2017,{"$f":"IF(Q304=\"Forecast\",\"\",IF(R303=0,\"\",R304/R303-1))","v":""},{"$f":"IF(S303=\"\",\"\",IF(S303=0,\"\",S304/S303-1))","v":""}]
[null,null,null,2018,null,null,"",null,{"$f":"IF(I306=0,\"\",G305/I306-1)","v":""},null,2018,{"$f":"IF(K305=\"Forecast\",\"\",IF(L304=0,\"\",L305/L304-1))","v":""},{"$f":"IF(M304=0,\"\",M305/M304-1)","v":""},null,{"$f":"IF(O306=0,\"\",M305/O306-1)","v":""},null,2018,{"$f":"IF(Q305=\"Forecast\",\"\",IF(R304=0,\"\",R305/R304-1))","v":""},{"$f":"IF(S304=\"\",\"\",IF(S304=0,\"\",S305/S304-1))","v":""},null,{"$f":"IF(U306=0,\"\",S305/U306-1)","v":""}]
[null,null,null,"Geometric Mean",null,null,{"$f":"IF(G299=0,\"\",(G305/G299)^(1/($D305-$D299-1))-1)","v":""},null,{"$f":"IF(I306=0,\"\",(G305/I306)^(1/(TestYear-RebaseYear-1))-1)","v":""},null,"Geometric Mean",{"$f":"IF(L299=0,\"\",(L303/L299)^(1/($D303-$D299-1))-1)","v":""},{"$f":"IF(M299=0,\"\",(M305/M299)^(1/($D305-$D299-1))-1)","v":""},null,{"$f":"IF(O306=0,\"\",(M305/O306)^(1/(TestYear-RebaseYear-1))-1)","v":""},null,"Geometric Mean",{"$f":"IF(R299=\"\",\"\",IF(R299=0,\"\",(R303/R299)^(1/($D303-$D299-1))-1))","v":""},{"$f":"IF(S299=\"\",\"\",IF(S299=0,\"\",(S305/S299)^(1/($D305-$D299-1))-1))","v":""},null,{"$f":"IF(U306=0,\"\",(S305/U306)^(1/(TestYear-RebaseYear-1))-1)","v":""}]
[]
[null,{"$f":"B274+1","v":7},"Customer Class:",null,null,null,null,"Is the customer class billed on consumption (kWh) or demand (kW or kVA)?"]
[]
[null,null,null,"Calendar Year",null,"Customers",null,null,null,null,"Consumption (kWh) (3)",null,null,null,null,null,{"$f":"CONCATENATE(\"Consumption (kWh) per \",LEFT(F319,LEN(F319)-1))","v":"Consumption (kWh) per Customer"}]
[null,null,null,{"$f":"CONCATENATE(\"(for \",TestYear,\" Cost of Service\")","v":"(for 2018 Cost of Service"},null,null,null,null,null,null,null,"Actual (Weather actual)","Weather-normalized",null,"Weather-normalized",null,null,{"$f":"L320","v":"Actual (Weather actual)"},{"$f":"M320","v":"Weather-normalized"},null,{"$f":"O320","v":"Weather-normalized"}]
[null,null,"Historical",{"$f":"D322-1","v":2012},null,{"$f":"F278","v":"Actual"},null,{"$f":"IF(D321=RebaseYear,\"Board-approved\",\"\")","v":""},null,null,{"$f":"F321","v":"Actual"},null,null,{"$f":"H321","v":""},null,null,{"$f":"K321","v":"Actual"},{"$f":"IF(G321=0,\"\",L321/G321)","v":""},{"$f":"IF(G321=0,\"\",M321/G321)","v":""},{"$f":"N321","v":""},{"$f":"IF(T321=\"\",\"\",IF(I321=0,\"\",O321/I321))","v":""}]
[null,null,"Historical",2013,null,{"$f":"F279","v":"Actual"},null,"Board-approved",null,null,{"$f":"F322","v":"Actual"},null,null,{"$f":"H322","v":"Board-approved"},null,null,{"$f":"K322","v":"Actual"},{"$f":"IF(G322=0,\"\",L322/G322)","v":""},{"$f":"IF(G322=0,\"\",M322/G322)","v":""},{"$f":"N322","v":"Board-approved"},{"$f":"IF(T322=\"\",\"\",IF(I322=0,\"\",O322/I322))","v":""}]
[null,null,"Historical",2014,null,"Actual",null,"",null,null,"Actual",null,null,"",null,null,"Actual","","","",""]
[null,null,"Historical",2015,null,"Actual",null,"",null,null,"Actual",null,null,"",null,null,"Actual","","","",""]
[null,null,"Historical",2016,null,"Actual",null,"",null,null,"Actual",null,null,"",null,null,"Actual","","","",""]
[null,null,"Bridge Year",2017,null,"Forecast",null,"",null,null,"Forecast",null,null,"",null,null,"Forecast","","","",""]
[null,null,"Test Year",{"$f":"TestYear","v":2018},null,"Forecast",null,"",null,null,"Forecast",null,null,"",null,null,"Forecast","","","",""]
[null,null,null,null,null,null,null,null,{"$f":"SUM(I321:I326)","v":0},null,null,null,null,null,{"$f":"SUM(O321:O326)","v":0},null,null,null,null,null,{"$f":"SUM(U321:U326)","v":0}]
[null,null,"Variance Analysis","Year",null,null,"Year-over-year",null,"Test Year Versus Board-approved",null,"Year","Year-over-year",null,null,{"$f":"I329","v":"Test Year Versus Board-approved"},null,"Year","Year-over-year",null,null,{"$f":"O329","v":"Test Year Versus Board-approved"}]
[null,null,null,{"$f":"D321","v":2012},null,null,null,null,null,null,{"$f":"D330","v":2012},null,null,null,null,null,{"$f":"K330","v":2012}]
[null,null,null,2013,null,null,{"$f":"IF(G321=0,\"\",G322/G321-1)","v":""},null,null,null,{"$f":"D331","v":2013},{"$f":"IF(L321=0,\"\",L322/L321-1)","v":""},"",null,null,null,{"$f":"K331","v":2013},{"$f":"IF(R321=\"\",\"\",IF(R321=0,\"\",R322/R321-1))","v":""},""]
[null,null,null,2014,null,null,"",null,null,null,2014,"","",null,null,null,2014,"",""]
[null,null,null,2015,null,null,"",null,null,null,2015,"","",null,null,null,2015,"",""]
[null,null,null,2016,null,null,"",null,null,null,2016,"","",null,null,null,2016,"",""]
[null,null,null,2017,null,null,"",null,null,null,2017,{"$f":"IF(K326=\"Forecast\",\"\",IF(L325=0,\"\",L326/L325-1))","v":""},{"$f":"IF(M325=0,\"\",M326/M325-1)","v":""},null,null,null,2017,{"$f":"IF(Q326=\"Forecast\",\"\",IF(R325=0,\"\",R326/R325-1))","v":""},{"$f":"IF(S325=\"\",\"\",IF(S325=0,\"\",S326/S325-1))","v":""}]
[null,null,null,2018,null,null,"",null,{"$f":"IF(I328=0,\"\",G327/I328-1)","v":""},null,2018,{"$f":"IF(K327=\"Forecast\",\"\",IF(L326=0,\"\",L327/L326-1))","v":""},{"$f":"IF(M326=0,\"\",M327/M326-1)","v":""},null,{"$f":"IF(O328=0,\"\",M327/O328-1)","v":""},null,2018,{"$f":"IF(Q327=\"Forecast\",\"\",IF(R326=0,\"\",R327/R326-1))","v":""},{"$f":"IF(S326=\"\",\"\",IF(S326=0,\"\",S327/S326-1))","v":""},null,{"$f":"IF(U328=0,\"\",S327/U328-1)","v":""}]
[null,null,null,"Geometric Mean",null,null,{"$f":"IF(G321=0,\"\",(G327/G321)^(1/($D327-$D321-1))-1)","v":""},null,{"$f":"IF(I328=0,\"\",(G327/I328)^(1/(TestYear-RebaseYear-1))-1)","v":""},null,"Geometric Mean",{"$f":"IF(L321=0,\"\",(L325/L321)^(1/($D325-$D321-1))-1)","v":""},{"$f":"IF(M321=0,\"\",(M327/M321)^(1/($D327-$D321-1))-1)","v":""},null,{"$f":"IF(O328=0,\"\",(M327/O328)^(1/(TestYear-RebaseYear-1))-1)","v":""},null,"Geometric Mean",{"$f":"IF(R321=\"\",\"\",IF(R321=0,\"\",(R325/R321)^(1/($D325-$D321-1))-1))","v":""},{"$f":"IF(S321=\"\",\"\",IF(S321=0,\"\",(S327/S321)^(1/($D327-$D321-1))-1))","v":""},null,{"$f":"IF(U328=0,\"\",(S327/U328)^(1/(TestYear-RebaseYear-1))-1)","v":""}]
[]
[]
[null,null,null,"Calendar Year",null,"Revenues",null,null,null,null,{"$f":"IF(ISBLANK(N317),\"\",CONCATENATE(\"Demand (\",N317,\")\"))","v":""},null,null,null,null,null,{"$f":"CONCATENATE(\"Demand (\",N317,\") per \",LEFT(F319,LEN(F319)-1))","v":"Demand () per Customer"}]
[null,null,null,{"$f":"CONCATENATE(\"(for \",TestYear,\" Cost of Service\")","v":"(for 2018 Cost of Service"},null,null,null,null,null,null,null,"Actual (Weather actual)","Weather-normalized",null,{"$f":"M341","v":"Weather-normalized"},null,null,{"$f":"L341","v":"Actual (Weather actual)"},{"$f":"M341","v":"Weather-normalized"},null,{"$f":"O341","v":"Weather-normalized"}]
[null,null,"Historical",{"$f":"D343-1","v":2012},null,{"$f":"F321","v":"Actual"},null,{"$f":"IF(D342=RebaseYear,\"Board-approved\",\"\")","v":""},null,null,{"$f":"K321","v":"Actual"},null,null,{"$f":"N321","v":""},null,null,{"$f":"K342","v":"Actual"},{"$f":"IF(G342=0,\"\",L342/G342)","v":""},{"$f":"IF(G342=0,\"\",M342/G342)","v":""},{"$f":"N342","v":""},{"$f":"IF(T342=\"\",\"\",IF(I342=0,\"\",O342/I342))","v":""}]
[null,null,"Historical",2013,null,"Actual",null,"Board-approved",null,null,"Actual",null,null,"Board-approved",null,null,{"$f":"K343","v":"Actual"},{"$f":"IF(G343=0,\"\",L343/G343)","v":""},{"$f":"IF(G343=0,\"\",M343/G343)","v":""},{"$f":"N343","v":"Board-approved"},{"$f":"IF(T343=\"\",\"\",IF(I343=0,\"\",O343/I343))","v":""}]
[null,null,"Historical",2014,null,"Actual",null,"",null,null,"Actual",null,null,"",null,null,"Actual","","","",""]
[null,null,"Historical",2015,null,"Actual",null,"",null,null,"Actual",null,null,"",null,null,"Actual","","","",""]
[null,null,"Historical",2016,null,"Actual",null,"",null,null,"Actual",null,null,"",null,null,"Actual","","","",""]
[null,null,"Bridge Year (Forecast)",2017,null,"Forecast",null,"",null,null,"Forecast",null,null,"",null,null,"Forecast","","","",""]
[null,null,"Test Year (Forecast)",{"$f":"TestYear","v":2018},null,"Forecast",null,"",null,null,"Forecast",null,null,"",null,null,"Forecast","","","",""]
[null,null,null,null,null,null,null,null,{"$f":"SUM(I342:I347)","v":0},null,null,null,null,null,{"$f":"SUM(O342:O347)","v":0},null,null,null,null,null,{"$f":"SUM(U342:U347)","v":0}]
[null,null,"Variance Analysis","Year",null,null,"Year-over-year",null,{"$f":"I329","v":"Test Year Versus Board-approved"},null,"Year","Year-over-year",null,null,{"$f":"I350","v":"Test Year Versus Board-approved"},null,"Year","Year-over-year",null,null,{"$f":"O350","v":"Test Year Versus Board-approved"}]
[null,null,null,{"$f":"D342","v":2012},null,null,null,null,null,null,{"$f":"D351","v":2012},null,null,null,null,null,{"$f":"K351","v":2012}]
[null,null,null,2013,null,null,{"$f":"IF(G342=0,\"\",G343/G342-1)","v":""},null,null,null,{"$f":"D352","v":2013},{"$f":"IF(L342=0,\"\",L343/L342-1)","v":""},"",null,null,null,{"$f":"K352","v":2013},{"$f":"IF(R342=\"\",\"\",IF(R342=0,\"\",R343/R342-1))","v":""},""]
[null,null,null,2014,null,null,"",null,null,null,2014,"","",null,null,null,2014,"",""]
[null,null,null,2015,null,null,"",null,null,null,2015,"","",null,null,null,2015,"",""]
[null,null,null,2016,null,null,"",null,null,null,2016,"","",null,null,null,2016,"",""]
[null,null,null,2017,null,null,"",null,null,null,2017,{"$f":"IF(K347=\"Forecast\",\"\",IF(L346=0,\"\",L347/L346-1))","v":""},{"$f":"IF(M346=0,\"\",M347/M346-1)","v":""},null,null,null,2017,{"$f":"IF(Q347=\"Forecast\",\"\",IF(R346=0,\"\",R347/R346-1))","v":""},{"$f":"IF(S346=\"\",\"\",IF(S346=0,\"\",S347/S346-1))","v":""}]
[null,null,null,2018,null,null,"",null,{"$f":"IF(I349=0,\"\",G348/I349-1)","v":""},null,2018,{"$f":"IF(K348=\"Forecast\",\"\",IF(L347=0,\"\",L348/L347-1))","v":""},{"$f":"IF(M347=0,\"\",M348/M347-1)","v":""},null,{"$f":"IF(O349=0,\"\",M348/O349-1)","v":""},null,2018,{"$f":"IF(Q348=\"Forecast\",\"\",IF(R347=0,\"\",R348/R347-1))","v":""},{"$f":"IF(S347=\"\",\"\",IF(S347=0,\"\",S348/S347-1))","v":""},null,{"$f":"IF(U349=0,\"\",S348/U349-1)","v":""}]
[null,null,null,"Geometric Mean",null,null,{"$f":"IF(G342=0,\"\",(G348/G342)^(1/($D348-$D342-1))-1)","v":""},null,{"$f":"IF(I349=0,\"\",(G348/I349)^(1/(TestYear-RebaseYear-1))-1)","v":""},null,"Geometric Mean",{"$f":"IF(L342=0,\"\",(L346/L342)^(1/($D346-$D342-1))-1)","v":""},{"$f":"IF(M342=0,\"\",(M348/M342)^(1/($D348-$D342-1))-1)","v":""},null,{"$f":"IF(O349=0,\"\",(M348/O349)^(1/(TestYear-RebaseYear-1))-1)","v":""},null,"Geometric Mean",{"$f":"IF(R342=\"\",\"\",IF(R342=0,\"\",(R346/R342)^(1/($D346-$D342-1))-1))","v":""},{"$f":"IF(S342=\"\",\"\",IF(S342=0,\"\",(S348/S342)^(1/($D348-$D342-1))-1))","v":""},null,{"$f":"IF(U349=0,\"\",(S348/U349)^(1/(TestYear-RebaseYear-1))-1)","v":""}]
[]
[null,{"$f":"B317+1","v":8},"Customer Class:",null,null,null,null,"Is the customer class billed on consumption (kWh) or demand (kW or kVA)?"]
[]
[null,null,null,"Calendar Year",null,"Customers",null,null,null,null,"Consumption (kWh) (3)",null,null,null,null,null,{"$f":"CONCATENATE(\"Consumption (kWh) per \",LEFT(F362,LEN(F362)-1))","v":"Consumption (kWh) per Customer"}]
[null,null,null,{"$f":"CONCATENATE(\"(for \",TestYear,\" Cost of Service\")","v":"(for 2018 Cost of Service"},null,null,null,null,null,null,null,"Actual (Weather actual)","Weather-normalized",null,"Weather-normalized",null,null,{"$f":"L363","v":"Actual (Weather actual)"},{"$f":"M363","v":"Weather-normalized"},null,{"$f":"O363","v":"Weather-normalized"}]
[null,null,"Historical",{"$f":"D365-1","v":2012},null,{"$f":"F321","v":"Actual"},null,{"$f":"IF(D364=RebaseYear,\"Board-approved\",\"\")","v":""},null,null,{"$f":"F364","v":"Actual"},null,null,{"$f":"H364","v":""},null,null,{"$f":"K364","v":"Actual"},{"$f":"IF(G364=0,\"\",L364/G364)","v":""},{"$f":"IF(G364=0,\"\",M364/G364)","v":""},{"$f":"N364","v":""},{"$f":"IF(T364=\"\",\"\",IF(I364=0,\"\",O364/I364))","v":""}]
[null,null,"Historical",2013,null,{"$f":"F322","v":"Actual"},null,"Board-approved",null,null,{"$f":"F365","v":"Actual"},null,null,{"$f":"H365","v":"Board-approved"},null,null,{"$f":"K365","v":"Actual"},{"$f":"IF(G365=0,\"\",L365/G365)","v":""},{"$f":"IF(G365=0,\"\",M365/G365)","v":""},{"$f":"N365","v":"Board-approved"},{"$f":"IF(T365=\"\",\"\",IF(I365=0,\"\",O365/I365))","v":""}]
[null,null,"Historical",2014,null,"Actual",null,"",null,null,"Actual",null,null,"",null,null,"Actual","","","",""]
[null,null,"Historical",2015,null,"Actual",null,"",null,null,"Actual",null,null,"",null,null,"Actual","","","",""]
[null,null,"Historical",2016,null,"Actual",null,"",null,null,"Actual",null,null,"",null,null,"Actual","","","",""]
[null,null,"Bridge Year",2017,null,"Forecast",null,"",null,null,"Forecast",null,null,"",null,null,"Forecast","","","",""]
[null,null,"Test Year",{"$f":"TestYear","v":2018},null,"Forecast",null,"",null,null,"Forecast",null,null,"",null,null,"Forecast","","","",""]
[null,null,null,null,null,null,null,null,{"$f":"SUM(I364:I369)","v":0},null,null,null,null,null,{"$f":"SUM(O364:O369)","v":0},null,null,null,null,null,{"$f":"SUM(U364:U369)","v":0}]
[null,null,"Variance Analysis","Year",null,null,"Year-over-year",null,"Test Year Versus Board-approved",null,"Year","Year-over-year",null,null,{"$f":"I372","v":"Test Year Versus Board-approved"},null,"Year","Year-over-year",null,null,{"$f":"O372","v":"Test Year Versus Board-approved"}]
[null,null,null,{"$f":"D364","v":2012},null,null,null,null,null,null,{"$f":"D373","v":2012},null,null,null,null,null,{"$f":"K373","v":2012}]
[null,null,null,2013,null,null,{"$f":"IF(G364=0,\"\",G365/G364-1)","v":""},null,null,null,{"$f":"D374","v":2013},{"$f":"IF(L364=0,\"\",L365/L364-1)","v":""},"",null,null,null,{"$f":"K374","v":2013},{"$f":"IF(R364=\"\",\"\",IF(R364=0,\"\",R365/R364-1))","v":""},""]
[null,null,null,2014,null,null,"",null,null,null,2014,"","",null,null,null,2014,"",""]
[null,null,null,2015,null,null,"",null,null,null,2015,"","",null,null,null,2015,"",""]
[null,null,null,2016,null,null,"",null,null,null,2016,"","",null,null,null,2016,"",""]
[null,null,null,2017,null,null,"",null,null,null,2017,{"$f":"IF(K369=\"Forecast\",\"\",IF(L368=0,\"\",L369/L368-1))","v":""},{"$f":"IF(M368=0,\"\",M369/M368-1)","v":""},null,null,null,2017,{"$f":"IF(Q369=\"Forecast\",\"\",IF(R368=0,\"\",R369/R368-1))","v":""},{"$f":"IF(S368=\"\",\"\",IF(S368=0,\"\",S369/S368-1))","v":""}]
[null,null,null,2018,null,null,"",null,{"$f":"IF(I371=0,\"\",G370/I371-1)","v":""},null,2018,{"$f":"IF(K370=\"Forecast\",\"\",IF(L369=0,\"\",L370/L369-1))","v":""},{"$f":"IF(M369=0,\"\",M370/M369-1)","v":""},null,{"$f":"IF(O371=0,\"\",M370/O371-1)","v":""},null,2018,{"$f":"IF(Q370=\"Forecast\",\"\",IF(R369=0,\"\",R370/R369-1))","v":""},{"$f":"IF(S369=\"\",\"\",IF(S369=0,\"\",S370/S369-1))","v":""},null,{"$f":"IF(U371=0,\"\",S370/U371-1)","v":""}]
[null,null,null,"Geometric Mean",null,null,{"$f":"IF(G364=0,\"\",(G370/G364)^(1/($D370-$D364-1))-1)","v":""},null,{"$f":"IF(I371=0,\"\",(G370/I371)^(1/(TestYear-RebaseYear-1))-1)","v":""},null,"Geometric Mean",{"$f":"IF(L364=0,\"\",(L368/L364)^(1/($D368-$D364-1))-1)","v":""},{"$f":"IF(M364=0,\"\",(M370/M364)^(1/($D370-$D364-1))-1)","v":""},null,{"$f":"IF(O371=0,\"\",(M370/O371)^(1/(TestYear-RebaseYear-1))-1)","v":""},null,"Geometric Mean",{"$f":"IF(R364=\"\",\"\",IF(R364=0,\"\",(R368/R364)^(1/($D368-$D364-1))-1))","v":""},{"$f":"IF(S364=\"\",\"\",IF(S364=0,\"\",(S370/S364)^(1/($D370-$D364-1))-1))","v":""},null,{"$f":"IF(U371=0,\"\",(S370/U371)^(1/(TestYear-RebaseYear-1))-1)","v":""}]
[]
[]
[null,null,null,"Calendar Year",null,"Revenues",null,null,null,null,{"$f":"IF(ISBLANK(N360),\"\",CONCATENATE(\"Demand (\",N360,\")\"))","v":""},null,null,null,null,null,{"$f":"CONCATENATE(\"Demand (\",N360,\") per \",LEFT(F362,LEN(F362)-1))","v":"Demand () per Customer"}]
[null,null,null,{"$f":"CONCATENATE(\"(for \",TestYear,\" Cost of Service\")","v":"(for 2018 Cost of Service"},null,null,null,null,null,null,null,"Actual (Weather actual)","Weather-normalized",null,{"$f":"M384","v":"Weather-normalized"},null,null,{"$f":"L384","v":"Actual (Weather actual)"},{"$f":"M384","v":"Weather-normalized"},null,{"$f":"O384","v":"Weather-normalized"}]
[null,null,"Historical",{"$f":"D386-1","v":2012},null,{"$f":"F364","v":"Actual"},null,{"$f":"IF(D385=RebaseYear,\"Board-approved\",\"\")","v":""},null,null,{"$f":"K364","v":"Actual"},null,null,{"$f":"N364","v":""},null,null,{"$f":"K385","v":"Actual"},{"$f":"IF(G385=0,\"\",L385/G385)","v":""},{"$f":"IF(G385=0,\"\",M385/G385)","v":""},{"$f":"N385","v":""},{"$f":"IF(T385=\"\",\"\",IF(I385=0,\"\",O385/I385))","v":""}]
[null,null,"Historical",2013,null,"Actual",null,"Board-approved",null,null,"Actual",null,null,"Board-approved",null,null,{"$f":"K386","v":"Actual"},{"$f":"IF(G386=0,\"\",L386/G386)","v":""},{"$f":"IF(G386=0,\"\",M386/G386)","v":""},{"$f":"N386","v":"Board-approved"},{"$f":"IF(T386=\"\",\"\",IF(I386=0,\"\",O386/I386))","v":""}]
[null,null,"Historical",2014,null,"Actual",null,"",null,null,"Actual",null,null,"",null,null,"Actual","","","",""]
[null,null,"Historical",2015,null,"Actual",null,"",null,null,"Actual",null,null,"",null,null,"Actual","","","",""]
[null,null,"Historical",2016,null,"Actual",null,"",null,null,"Actual",null,null,"",null,null,"Actual","","","",""]
[null,null,"Bridge Year (Forecast)",2017,null,"Forecast",null,"",null,null,"Forecast",null,null,"",null,null,"Forecast","","","",""]
[null,null,"Test Year (Forecast)",{"$f":"TestYear","v":2018},null,"Forecast",null,"",null,null,"Forecast",null,null,"",null,null,"Forecast","","","",""]
[null,null,null,null,null,null,null,null,{"$f":"SUM(I385:I390)","v":0},null,null,null,null,null,{"$f":"SUM(O385:O390)","v":0},null,null,null,null,null,{"$f":"SUM(U385:U390)","v":0}]
[null,null,"Variance Analysis","Year",null,null,"Year-over-year",null,{"$f":"I372","v":"Test Year Versus Board-approved"},null,"Year","Year-over-year",null,null,{"$f":"I393","v":"Test Year Versus Board-approved"},null,"Year","Year-over-year",null,null,{"$f":"O393","v":"Test Year Versus Board-approved"}]
[null,null,null,{"$f":"D385","v":2012},null,null,null,null,null,null,{"$f":"D394","v":2012},null,null,null,null,null,{"$f":"K394","v":2012}]
[null,null,null,2013,null,null,{"$f":"IF(G385=0,\"\",G386/G385-1)","v":""},null,null,null,{"$f":"D395","v":2013},{"$f":"IF(L385=0,\"\",L386/L385-1)","v":""},"",null,null,null,{"$f":"K395","v":2013},{"$f":"IF(R385=\"\",\"\",IF(R385=0,\"\",R386/R385-1))","v":""},""]
[null,null,null,2014,null,null,"",null,null,null,2014,"","",null,null,null,2014,"",""]
[null,null,null,2015,null,null,"",null,null,null,2015,"","",null,null,null,2015,"",""]
[null,null,null,2016,null,null,"",null,null,null,2016,"","",null,null,null,2016,"",""]
[null,null,null,2017,null,null,"",null,null,null,2017,{"$f":"IF(K390=\"Forecast\",\"\",IF(L389=0,\"\",L390/L389-1))","v":""},{"$f":"IF(M389=0,\"\",M390/M389-1)","v":""},null,null,null,2017,{"$f":"IF(Q390=\"Forecast\",\"\",IF(R389=0,\"\",R390/R389-1))","v":""},{"$f":"IF(S389=\"\",\"\",IF(S389=0,\"\",S390/S389-1))","v":""}]
[null,null,null,2018,null,null,"",null,{"$f":"IF(I392=0,\"\",G391/I392-1)","v":""},null,2018,{"$f":"IF(K391=\"Forecast\",\"\",IF(L390=0,\"\",L391/L390-1))","v":""},{"$f":"IF(M390=0,\"\",M391/M390-1)","v":""},null,{"$f":"IF(O392=0,\"\",M391/O392-1)","v":""},null,2018,{"$f":"IF(Q391=\"Forecast\",\"\",IF(R390=0,\"\",R391/R390-1))","v":""},{"$f":"IF(S390=\"\",\"\",IF(S390=0,\"\",S391/S390-1))","v":""},null,{"$f":"IF(U392=0,\"\",S391/U392-1)","v":""}]
[null,null,null,"Geometric Mean",null,null,{"$f":"IF(G385=0,\"\",(G391/G385)^(1/($D391-$D385-1))-1)","v":""},null,{"$f":"IF(I392=0,\"\",(G391/I392)^(1/(TestYear-RebaseYear-1))-1)","v":""},null,"Geometric Mean",{"$f":"IF(L385=0,\"\",(L389/L385)^(1/($D389-$D385-1))-1)","v":""},{"$f":"IF(M385=0,\"\",(M391/M385)^(1/($D391-$D385-1))-1)","v":""},null,{"$f":"IF(O392=0,\"\",(M391/O392)^(1/(TestYear-RebaseYear-1))-1)","v":""},null,"Geometric Mean",{"$f":"IF(R385=\"\",\"\",IF(R385=0,\"\",(R389/R385)^(1/($D389-$D385-1))-1))","v":""},{"$f":"IF(S385=\"\",\"\",IF(S385=0,\"\",(S391/S385)^(1/($D391-$D385-1))-1))","v":""},null,{"$f":"IF(U392=0,\"\",(S391/U392)^(1/(TestYear-RebaseYear-1))-1)","v":""}]
[]
[null,{"$f":"B360+1","v":9},"Customer Class:",null,null,null,null,"Is the customer class billed on consumption (kWh) or demand (kW or kVA)?"]
[]
[null,null,null,"Calendar Year",null,"Customers",null,null,null,null,"Consumption (kWh) (3)",null,null,null,null,null,{"$f":"CONCATENATE(\"Consumption (kWh) per \",LEFT(F405,LEN(F405)-1))","v":"Consumption (kWh) per Customer"}]
[null,null,null,{"$f":"CONCATENATE(\"(for \",TestYear,\" Cost of Service\")","v":"(for 2018 Cost of Service"},null,null,null,null,null,null,null,"Actual (Weather actual)","Weather-normalized",null,"Weather-normalized",null,null,{"$f":"L406","v":"Actual (Weather actual)"},{"$f":"M406","v":"Weather-normalized"},null,{"$f":"O406","v":"Weather-normalized"}]
[null,null,"Historical",{"$f":"D408-1","v":2012},null,{"$f":"F364","v":"Actual"},null,{"$f":"IF(D407=RebaseYear,\"Board-approved\",\"\")","v":""},null,null,{"$f":"F407","v":"Actual"},null,null,{"$f":"H407","v":""},null,null,{"$f":"K407","v":"Actual"},{"$f":"IF(G407=0,\"\",L407/G407)","v":""},{"$f":"IF(G407=0,\"\",M407/G407)","v":""},{"$f":"N407","v":""},{"$f":"IF(T407=\"\",\"\",IF(I407=0,\"\",O407/I407))","v":""}]
[null,null,"Historical",2013,null,{"$f":"F365","v":"Actual"},null,"Board-approved",null,null,{"$f":"F408","v":"Actual"},null,null,{"$f":"H408","v":"Board-approved"},null,null,{"$f":"K408","v":"Actual"},{"$f":"IF(G408=0,\"\",L408/G408)","v":""},{"$f":"IF(G408=0,\"\",M408/G408)","v":""},{"$f":"N408","v":"Board-approved"},{"$f":"IF(T408=\"\",\"\",IF(I408=0,\"\",O408/I408))","v":""}]
[null,null,"Historical",2014,null,"Actual",null,"",null,null,"Actual",null,null,"",null,null,"Actual","","","",""]
[null,null,"Historical",2015,null,"Actual",null,"",null,null,"Actual",null,null,"",null,null,"Actual","","","",""]
[null,null,"Historical",2016,null,"Actual",null,"",null,null,"Actual",null,null,"",null,null,"Actual","","","",""]
[null,null,"Bridge Year",2017,null,"Forecast",null,"",null,null,"Forecast",null,null,"",null,null,"Forecast","","","",""]
[null,null,"Test Year",{"$f":"TestYear","v":2018},null,"Forecast",null,"",null,null,"Forecast",null,null,"",null,null,"Forecast","","","",""]
[null,null,null,null,null,null,null,null,{"$f":"SUM(I407:I412)","v":0},null,null,null,null,null,{"$f":"SUM(O407:O412)","v":0},null,null,null,null,null,{"$f":"SUM(U407:U412)","v":0}]
[null,null,"Variance Analysis","Year",null,null,"Year-over-year",null,"Test Year Versus Board-approved",null,"Year","Year-over-year",null,null,{"$f":"I415","v":"Test Year Versus Board-approved"},null,"Year","Year-over-year",null,null,{"$f":"O415","v":"Test Year Versus Board-approved"}]
[null,null,null,{"$f":"D407","v":2012},null,null,null,null,null,null,{"$f":"D416","v":2012},null,null,null,null,null,{"$f":"K416","v":2012}]
[null,null,null,2013,null,null,{"$f":"IF(G407=0,\"\",G408/G407-1)","v":""},null,null,null,{"$f":"D417","v":2013},{"$f":"IF(L407=0,\"\",L408/L407-1)","v":""},"",null,null,null,{"$f":"K417","v":2013},{"$f":"IF(R407=\"\",\"\",IF(R407=0,\"\",R408/R407-1))","v":""},""]
[null,null,null,2014,null,null,"",null,null,null,2014,"","",null,null,null,2014,"",""]
[null,null,null,2015,null,null,"",null,null,null,2015,"","",null,null,null,2015,"",""]
[null,null,null,2016,null,null,"",null,null,null,2016,"","",null,null,null,2016,"",""]
[null,null,null,2017,null,null,"",null,null,null,2017,{"$f":"IF(K412=\"Forecast\",\"\",IF(L411=0,\"\",L412/L411-1))","v":""},{"$f":"IF(M411=0,\"\",M412/M411-1)","v":""},null,null,null,2017,{"$f":"IF(Q412=\"Forecast\",\"\",IF(R411=0,\"\",R412/R411-1))","v":""},{"$f":"IF(S411=\"\",\"\",IF(S411=0,\"\",S412/S411-1))","v":""}]
[null,null,null,2018,null,null,"",null,{"$f":"IF(I414=0,\"\",G413/I414-1)","v":""},null,2018,{"$f":"IF(K413=\"Forecast\",\"\",IF(L412=0,\"\",L413/L412-1))","v":""},{"$f":"IF(M412=0,\"\",M413/M412-1)","v":""},null,{"$f":"IF(O414=0,\"\",M413/O414-1)","v":""},null,2018,{"$f":"IF(Q413=\"Forecast\",\"\",IF(R412=0,\"\",R413/R412-1))","v":""},{"$f":"IF(S412=\"\",\"\",IF(S412=0,\"\",S413/S412-1))","v":""},null,{"$f":"IF(U414=0,\"\",S413/U414-1)","v":""}]
[null,null,null,"Geometric Mean",null,null,{"$f":"IF(G407=0,\"\",(G413/G407)^(1/($D413-$D407-1))-1)","v":""},null,{"$f":"IF(I414=0,\"\",(G413/I414)^(1/(TestYear-RebaseYear-1))-1)","v":""},null,"Geometric Mean",{"$f":"IF(L407=0,\"\",(L411/L407)^(1/($D411-$D407-1))-1)","v":""},{"$f":"IF(M407=0,\"\",(M413/M407)^(1/($D413-$D407-1))-1)","v":""},null,{"$f":"IF(O414=0,\"\",(M413/O414)^(1/(TestYear-RebaseYear-1))-1)","v":""},null,"Geometric Mean",{"$f":"IF(R407=\"\",\"\",IF(R407=0,\"\",(R411/R407)^(1/($D411-$D407-1))-1))","v":""},{"$f":"IF(S407=\"\",\"\",IF(S407=0,\"\",(S413/S407)^(1/($D413-$D407-1))-1))","v":""},null,{"$f":"IF(U414=0,\"\",(S413/U414)^(1/(TestYear-RebaseYear-1))-1)","v":""}]
[]
[]
[null,null,null,"Calendar Year",null,"Revenues",null,null,null,null,{"$f":"IF(ISBLANK(N403),\"\",CONCATENATE(\"Demand (\",N403,\")\"))","v":""},null,null,null,null,null,{"$f":"CONCATENATE(\"Demand (\",N403,\") per \",LEFT(F405,LEN(F405)-1))","v":"Demand () per Customer"}]
[null,null,null,{"$f":"CONCATENATE(\"(for \",TestYear,\" Cost of Service\")","v":"(for 2018 Cost of Service"},null,null,null,null,null,null,null,"Actual (Weather actual)","Weather-normalized",null,{"$f":"M427","v":"Weather-normalized"},null,null,{"$f":"L427","v":"Actual (Weather actual)"},{"$f":"M427","v":"Weather-normalized"},null,{"$f":"O427","v":"Weather-normalized"}]
[null,null,"Historical",{"$f":"D429-1","v":2012},null,{"$f":"F407","v":"Actual"},null,{"$f":"IF(D428=RebaseYear,\"Board-approved\",\"\")","v":""},null,null,{"$f":"K407","v":"Actual"},null,null,{"$f":"N407","v":""},null,null,{"$f":"K428","v":"Actual"},{"$f":"IF(G428=0,\"\",L428/G428)","v":""},{"$f":"IF(G428=0,\"\",M428/G428)","v":""},{"$f":"N428","v":""},{"$f":"IF(T428=\"\",\"\",IF(I428=0,\"\",O428/I428))","v":""}]
[null,null,"Historical",2013,null,"Actual",null,"Board-approved",null,null,"Actual",null,null,"Board-approved",null,null,{"$f":"K429","v":"Actual"},{"$f":"IF(G429=0,\"\",L429/G429)","v":""},{"$f":"IF(G429=0,\"\",M429/G429)","v":""},{"$f":"N429","v":"Board-approved"},{"$f":"IF(T429=\"\",\"\",IF(I429=0,\"\",O429/I429))","v":""}]
[null,null,"Historical",2014,null,"Actual",null,"",null,null,"Actual",null,null,"",null,null,"Actual","","","",""]
[null,null,"Historical",2015,null,"Actual",null,"",null,null,"Actual",null,null,"",null,null,"Actual","","","",""]
[null,null,"Historical",2016,null,"Actual",null,"",null,null,"Actual",null,null,"",null,null,"Actual","","","",""]
[null,null,"Bridge Year (Forecast)",2017,null,"Forecast",null,"",null,null,"Forecast",null,null,"",null,null,"Forecast","","","",""]
[null,null,"Test Year (Forecast)",{"$f":"TestYear","v":2018},null,"Forecast",null,"",null,null,"Forecast",null,null,"",null,null,"Forecast","","","",""]
[null,null,null,null,null,null,null,null,{"$f":"SUM(I428:I433)","v":0},null,null,null,null,null,{"$f":"SUM(O428:O433)","v":0},null,null,null,null,null,{"$f":"SUM(U428:U433)","v":0}]
[null,null,"Variance Analysis","Year",null,null,"Year-over-year",null,{"$f":"I415","v":"Test Year Versus Board-approved"},null,"Year","Year-over-year",null,null,{"$f":"I436","v":"Test Year Versus Board-approved"},null,"Year","Year-over-year",null,null,{"$f":"O436","v":"Test Year Versus Board-approved"}]
[null,null,null,{"$f":"D428","v":2012},null,null,null,null,null,null,{"$f":"D437","v":2012},null,null,null,null,null,{"$f":"K437","v":2012}]
[null,null,null,2013,null,null,{"$f":"IF(G428=0,\"\",G429/G428-1)","v":""},null,null,null,{"$f":"D438","v":2013},{"$f":"IF(L428=0,\"\",L429/L428-1)","v":""},"",null,null,null,{"$f":"K438","v":2013},{"$f":"IF(R428=\"\",\"\",IF(R428=0,\"\",R429/R428-1))","v":""},""]
[null,null,null,2014,null,null,"",null,null,null,2014,"","",null,null,null,2014,"",""]
[null,null,null,2015,null,null,"",null,null,null,2015,"","",null,null,null,2015,"",""]
[null,null,null,2016,null,null,"",null,null,null,2016,"","",null,null,null,2016,"",""]
[null,null,null,2017,null,null,"",null,null,null,2017,{"$f":"IF(K433=\"Forecast\",\"\",IF(L432=0,\"\",L433/L432-1))","v":""},{"$f":"IF(M432=0,\"\",M433/M432-1)","v":""},null,null,null,2017,{"$f":"IF(Q433=\"Forecast\",\"\",IF(R432=0,\"\",R433/R432-1))","v":""},{"$f":"IF(S432=\"\",\"\",IF(S432=0,\"\",S433/S432-1))","v":""}]
[null,null,null,2018,null,null,"",null,{"$f":"IF(I435=0,\"\",G434/I435-1)","v":""},null,2018,{"$f":"IF(K434=\"Forecast\",\"\",IF(L433=0,\"\",L434/L433-1))","v":""},{"$f":"IF(M433=0,\"\",M434/M433-1)","v":""},null,{"$f":"IF(O435=0,\"\",M434/O435-1)","v":""},null,2018,{"$f":"IF(Q434=\"Forecast\",\"\",IF(R433=0,\"\",R434/R433-1))","v":""},{"$f":"IF(S433=\"\",\"\",IF(S433=0,\"\",S434/S433-1))","v":""},null,{"$f":"IF(U435=0,\"\",S434/U435-1)","v":""}]
[null,null,null,"Geometric Mean",null,null,{"$f":"IF(G428=0,\"\",(G434/G428)^(1/($D434-$D428-1))-1)","v":""},null,{"$f":"IF(I435=0,\"\",(G434/I435)^(1/(TestYear-RebaseYear-1))-1)","v":""},null,"Geometric Mean",{"$f":"IF(L428=0,\"\",(L432/L428)^(1/($D432-$D428-1))-1)","v":""},{"$f":"IF(M428=0,\"\",(M434/M428)^(1/($D434-$D428-1))-1)","v":""},null,{"$f":"IF(O435=0,\"\",(M434/O435)^(1/(TestYear-RebaseYear-1))-1)","v":""},null,"Geometric Mean",{"$f":"IF(R428=\"\",\"\",IF(R428=0,\"\",(R432/R428)^(1/($D432-$D428-1))-1))","v":""},{"$f":"IF(S428=\"\",\"\",IF(S428=0,\"\",(S434/S428)^(1/($D434-$D428-1))-1))","v":""},null,{"$f":"IF(U435=0,\"\",(S434/U435)^(1/(TestYear-RebaseYear-1))-1)","v":""}]
[]
[null,{"$f":"B403+1","v":10},"Customer Class:",null,null,null,null,"Is the customer class billed on consumption (kWh) or demand (kW or kVA)?"]
[]
[null,null,null,"Calendar Year",null,"Customers",null,null,null,null,"Consumption (kWh) (3)",null,null,null,null,null,{"$f":"CONCATENATE(\"Consumption (kWh) per \",LEFT(F448,LEN(F448)-1))","v":"Consumption (kWh) per Customer"}]
[null,null,null,{"$f":"CONCATENATE(\"(for \",TestYear,\" Cost of Service\")","v":"(for 2018 Cost of Service"},null,null,null,null,null,null,null,"Actual (Weather actual)","Weather-normalized",null,"Weather-normalized",null,null,{"$f":"L449","v":"Actual (Weather actual)"},{"$f":"M449","v":"Weather-normalized"},null,{"$f":"O449","v":"Weather-normalized"}]
[null,null,"Historical",{"$f":"D451-1","v":2012},null,{"$f":"F407","v":"Actual"},null,{"$f":"IF(D450=RebaseYear,\"Board-approved\",\"\")","v":""},null,null,{"$f":"F450","v":"Actual"},null,null,{"$f":"H450","v":""},null,null,{"$f":"K450","v":"Actual"},{"$f":"IF(G450=0,\"\",L450/G450)","v":""},{"$f":"IF(G450=0,\"\",M450/G450)","v":""},{"$f":"N450","v":""},{"$f":"IF(T450=\"\",\"\",IF(I450=0,\"\",O450/I450))","v":""}]
[null,null,"Historical",2013,null,{"$f":"F408","v":"Actual"},null,"Board-approved",null,null,{"$f":"F451","v":"Actual"},null,null,{"$f":"H451","v":"Board-approved"},null,null,{"$f":"K451","v":"Actual"},{"$f":"IF(G451=0,\"\",L451/G451)","v":""},{"$f":"IF(G451=0,\"\",M451/G451)","v":""},{"$f":"N451","v":"Board-approved"},{"$f":"IF(T451=\"\",\"\",IF(I451=0,\"\",O451/I451))","v":""}]
[null,null,"Historical",2014,null,"Actual",null,"",null,null,"Actual",null,null,"",null,null,"Actual","","","",""]
[null,null,"Historical",2015,null,"Actual",null,"",null,null,"Actual",null,null,"",null,null,"Actual","","","",""]
[null,null,"Historical",2016,null,"Actual",null,"",null,null,"Actual",null,null,"",null,null,"Actual","","","",""]
[null,null,"Bridge Year",2017,null,"Forecast",null,"",null,null,"Forecast",null,null,"",null,null,"Forecast","","","",""]
[null,null,"Test Year",{"$f":"TestYear","v":2018},null,"Forecast",null,"",null,null,"Forecast",null,null,"",null,null,"Forecast","","","",""]
[null,null,null,null,null,null,null,null,{"$f":"SUM(I450:I455)","v":0},null,null,null,null,null,{"$f":"SUM(O450:O455)","v":0},null,null,null,null,null,{"$f":"SUM(U450:U455)","v":0}]
[null,null,"Variance Analysis","Year",null,null,"Year-over-year",null,"Test Year Versus Board-approved",null,"Year","Year-over-year",null,null,{"$f":"I458","v":"Test Year Versus Board-approved"},null,"Year","Year-over-year",null,null,{"$f":"O458","v":"Test Year Versus Board-approved"}]
[null,null,null,{"$f":"D450","v":2012},null,null,null,null,null,null,{"$f":"D459","v":2012},null,null,null,null,null,{"$f":"K459","v":2012}]
[null,null,null,2013,null,null,{"$f":"IF(G450=0,\"\",G451/G450-1)","v":""},null,null,null,{"$f":"D460","v":2013},{"$f":"IF(L450=0,\"\",L451/L450-1)","v":""},"",null,null,null,{"$f":"K460","v":2013},{"$f":"IF(R450=\"\",\"\",IF(R450=0,\"\",R451/R450-1))","v":""},""]
[null,null,null,2014,null,null,"",null,null,null,2014,"","",null,null,null,2014,"",""]
[null,null,null,2015,null,null,"",null,null,null,2015,"","",null,null,null,2015,"",""]
[null,null,null,2016,null,null,"",null,null,null,2016,"","",null,null,null,2016,"",""]
[null,null,null,2017,null,null,"",null,null,null,2017,{"$f":"IF(K455=\"Forecast\",\"\",IF(L454=0,\"\",L455/L454-1))","v":""},{"$f":"IF(M454=0,\"\",M455/M454-1)","v":""},null,null,null,2017,{"$f":"IF(Q455=\"Forecast\",\"\",IF(R454=0,\"\",R455/R454-1))","v":""},{"$f":"IF(S454=\"\",\"\",IF(S454=0,\"\",S455/S454-1))","v":""}]
[null,null,null,2018,null,null,"",null,{"$f":"IF(I457=0,\"\",G456/I457-1)","v":""},null,2018,{"$f":"IF(K456=\"Forecast\",\"\",IF(L455=0,\"\",L456/L455-1))","v":""},{"$f":"IF(M455=0,\"\",M456/M455-1)","v":""},null,{"$f":"IF(O457=0,\"\",M456/O457-1)","v":""},null,2018,{"$f":"IF(Q456=\"Forecast\",\"\",IF(R455=0,\"\",R456/R455-1))","v":""},{"$f":"IF(S455=\"\",\"\",IF(S455=0,\"\",S456/S455-1))","v":""},null,{"$f":"IF(U457=0,\"\",S456/U457-1)","v":""}]
[null,null,null,"Geometric Mean",null,null,{"$f":"IF(G450=0,\"\",(G456/G450)^(1/($D456-$D450-1))-1)","v":""},null,{"$f":"IF(I457=0,\"\",(G456/I457)^(1/(TestYear-RebaseYear-1))-1)","v":""},null,"Geometric Mean",{"$f":"IF(L450=0,\"\",(L454/L450)^(1/($D454-$D450-1))-1)","v":""},{"$f":"IF(M450=0,\"\",(M456/M450)^(1/($D456-$D450-1))-1)","v":""},null,{"$f":"IF(O457=0,\"\",(M456/O457)^(1/(TestYear-RebaseYear-1))-1)","v":""},null,"Geometric Mean",{"$f":"IF(R450=\"\",\"\",IF(R450=0,\"\",(R454/R450)^(1/($D454-$D450-1))-1))","v":""},{"$f":"IF(S450=\"\",\"\",IF(S450=0,\"\",(S456/S450)^(1/($D456-$D450-1))-1))","v":""},null,{"$f":"IF(U457=0,\"\",(S456/U457)^(1/(TestYear-RebaseYear-1))-1)","v":""}]
[]
[]
[null,null,null,"Calendar Year",null,"Revenues",null,null,null,null,{"$f":"IF(ISBLANK(N446),\"\",CONCATENATE(\"Demand (\",N446,\")\"))","v":""},null,null,null,null,null,{"$f":"CONCATENATE(\"Demand (\",N446,\") per \",LEFT(F448,LEN(F448)-1))","v":"Demand () per Customer"}]
[null,null,null,{"$f":"CONCATENATE(\"(for \",TestYear,\" Cost of Service\")","v":"(for 2018 Cost of Service"},null,null,null,null,null,null,null,"Actual (Weather actual)","Weather-normalized",null,{"$f":"M470","v":"Weather-normalized"},null,null,{"$f":"L470","v":"Actual (Weather actual)"},{"$f":"M470","v":"Weather-normalized"},null,{"$f":"O470","v":"Weather-normalized"}]
[null,null,"Historical",{"$f":"D472-1","v":2012},null,{"$f":"F450","v":"Actual"},null,{"$f":"IF(D471=RebaseYear,\"Board-approved\",\"\")","v":""},null,null,{"$f":"K450","v":"Actual"},null,null,{"$f":"N450","v":""},null,null,{"$f":"K471","v":"Actual"},{"$f":"IF(G471=0,\"\",L471/G471)","v":""},{"$f":"IF(G471=0,\"\",M471/G471)","v":""},{"$f":"N471","v":""},{"$f":"IF(T471=\"\",\"\",IF(I471=0,\"\",O471/I471))","v":""}]
[null,null,"Historical",2013,null,"Actual",null,"Board-approved",null,null,"Actual",null,null,"Board-approved",null,null,{"$f":"K472","v":"Actual"},{"$f":"IF(G472=0,\"\",L472/G472)","v":""},{"$f":"IF(G472=0,\"\",M472/G472)","v":""},{"$f":"N472","v":"Board-approved"},{"$f":"IF(T472=\"\",\"\",IF(I472=0,\"\",O472/I472))","v":""}]
[null,null,"Historical",2014,null,"Actual",null,"",null,null,"Actual",null,null,"",null,null,"Actual","","","",""]
[null,null,"Historical",2015,null,"Actual",null,"",null,null,"Actual",null,null,"",null,null,"Actual","","","",""]
[null,null,"Historical",2016,null,"Actual",null,"",null,null,"Actual",null,null,"",null,null,"Actual","","","",""]
[null,null,"Bridge Year (Forecast)",2017,null,"Forecast",null,"",null,null,"Forecast",null,null,"",null,null,"Forecast","","","",""]
[null,null,"Test Year (Forecast)",{"$f":"TestYear","v":2018},null,"Forecast",null,"",null,null,"Forecast",null,null,"",null,null,"Forecast","","","",""]
[null,null,null,null,null,null,null,null,{"$f":"SUM(I471:I476)","v":0},null,null,null,null,null,{"$f":"SUM(O471:O476)","v":0},null,null,null,null,null,{"$f":"SUM(U471:U476)","v":0}]
[null,null,"Variance Analysis","Year",null,null,"Year-over-year",null,{"$f":"I458","v":"Test Year Versus Board-approved"},null,"Year","Year-over-year",null,null,{"$f":"I479","v":"Test Year Versus Board-approved"},null,"Year","Year-over-year",null,null,{"$f":"O479","v":"Test Year Versus Board-approved"}]
[null,null,null,{"$f":"D471","v":2012},null,null,null,null,null,null,{"$f":"D480","v":2012},null,null,null,null,null,{"$f":"K480","v":2012}]
[null,null,null,2013,null,null,{"$f":"IF(G471=0,\"\",G472/G471-1)","v":""},null,null,null,{"$f":"D481","v":2013},{"$f":"IF(L471=0,\"\",L472/L471-1)","v":""},"",null,null,null,{"$f":"K481","v":2013},{"$f":"IF(R471=\"\",\"\",IF(R471=0,\"\",R472/R471-1))","v":""},""]
[null,null,null,2014,null,null,"",null,null,null,2014,"","",null,null,null,2014,"",""]
[null,null,null,2015,null,null,"",null,null,null,2015,"","",null,null,null,2015,"",""]
[null,null,null,2016,null,null,"",null,null,null,2016,"","",null,null,null,2016,"",""]
[null,null,null,2017,null,null,"",null,null,null,2017,{"$f":"IF(K476=\"Forecast\",\"\",IF(L475=0,\"\",L476/L475-1))","v":""},{"$f":"IF(M475=0,\"\",M476/M475-1)","v":""},null,null,null,2017,{"$f":"IF(Q476=\"Forecast\",\"\",IF(R475=0,\"\",R476/R475-1))","v":""},{"$f":"IF(S475=\"\",\"\",IF(S475=0,\"\",S476/S475-1))","v":""}]
[null,null,null,2018,null,null,"",null,{"$f":"IF(I478=0,\"\",G477/I478-1)","v":""},null,2018,{"$f":"IF(K477=\"Forecast\",\"\",IF(L476=0,\"\",L477/L476-1))","v":""},{"$f":"IF(M476=0,\"\",M477/M476-1)","v":""},null,{"$f":"IF(O478=0,\"\",M477/O478-1)","v":""},null,2018,{"$f":"IF(Q477=\"Forecast\",\"\",IF(R476=0,\"\",R477/R476-1))","v":""},{"$f":"IF(S476=\"\",\"\",IF(S476=0,\"\",S477/S476-1))","v":""},null,{"$f":"IF(U478=0,\"\",S477/U478-1)","v":""}]
[null,null,null,"Geometric Mean",null,null,{"$f":"IF(G471=0,\"\",(G477/G471)^(1/($D477-$D471-1))-1)","v":""},null,{"$f":"IF(I478=0,\"\",(G477/I478)^(1/(TestYear-RebaseYear-1))-1)","v":""},null,"Geometric Mean",{"$f":"IF(L471=0,\"\",(L475/L471)^(1/($D475-$D471-1))-1)","v":""},{"$f":"IF(M471=0,\"\",(M477/M471)^(1/($D477-$D471-1))-1)","v":""},null,{"$f":"IF(O478=0,\"\",(M477/O478)^(1/(TestYear-RebaseYear-1))-1)","v":""},null,"Geometric Mean",{"$f":"IF(R471=\"\",\"\",IF(R471=0,\"\",(R475/R471)^(1/($D475-$D471-1))-1))","v":""},{"$f":"IF(S471=\"\",\"\",IF(S471=0,\"\",(S477/S471)^(1/($D477-$D471-1))-1))","v":""},null,{"$f":"IF(U478=0,\"\",(S477/U478)^(1/(TestYear-RebaseYear-1))-1)","v":""}]
[]
[null,"Note: If there are more than ten (10) customer classes, please contact OEB Staff to add tables for additional customer classes."]

{"sheet":"App.2-JA_OM&A_Summary_Analys","index":24,"n_rows":60,"n_cols":14,"rows_kept":60,"cut":false,"hidden":false,"merged":[[6,12,6,13],[62,1,63,6],[57,0,58,12],[8,0,8,7],[9,0,9,7],[12,8,12,9],[59,0,59,12]]}
[null,null,null,null,null,null,null,null,null,null,null,"File Number:",{"$f":"EBNUMBER","v":"EB-2017-0073"}]
[null,null,null,null,null,null,null,null,null,null,null,"Exhibit:",4]
[null,null,null,null,null,null,null,null,null,null,null,"Tab:"]
[null,null,null,null,null,null,null,null,null,null,null,"Schedule:"]
[null,null,null,null,null,null,null,null,null,null,null,"Page:"]
[]
[null,null,null,null,null,null,null,null,null,null,null,"Date:","2017-08-28"]
[]
["Appendix 2-JA"]
["Summary of Recoverable OM&A Expenses"]
[]
[]
[null,{"$f":"\"Last Rebasing Year (\" & RebaseYear & \" Board-Approved)\"","v":"Last Rebasing Year (2013 Board-Approved)"},{"$f":"\"Last Rebasing Year (\" & RebaseYear & \" Actuals)\"","v":"Last Rebasing Year (2013 Actuals)"},{"$f":"BridgeYear -3 & \" Actuals\"","v":"2014 Actuals"},{"$f":"BridgeYear -2 & \" Actuals\"","v":"2015 Actuals"},{"$f":"BridgeYear -1 & \" Actuals\"","v":"2016 Actuals"},{"$f":"BridgeYear & \" Bridge Year\"","v":"2017 Bridge Year"},{"$f":"TestYear & \" Test Year\"","v":"2018 Test Year"}]
["Reporting Basis","CGAAP","CGAAP","MIFRS","MIFRS","MIFRS","MIFRS","MIFRS"]
["Operations",543617,535159,581576,526730,574153,540346,514586]
["Maintenance",201605,215047,190949,159501,194875,236866,226447]
["SubTotal",{"$f":"SUM(B15:B16)","v":745222},{"$f":"SUM(C15:C16)","v":750206},772525,686231,769028,777212,741033]
["%Change (year over year)",null,null,{"$f":"IF(ISERROR((D17-B17)/B17), \"\", (D17-B17)/B17)","v":3.6637404692829785E-2},{"$f":"IF(ISERROR((E17-C17)/C17), \"\", (E17-C17)/C17)","v":-8.5276577366749928E-2},{"$f":"IF(ISERROR((F17-E17)/E17), \"\", (F17-E17)/E17)","v":0.12065470665125884},{"$f":"IF(ISERROR((G17-F17)/F17), \"\", (G17-F17)/F17)","v":1.0642005232579308E-2},{"$f":"IF(ISERROR((H17-G17)/G17), \"\", (H17-G17)/G17)","v":-4.6549718738259319E-2}]
["%Change (Test Year vs \nLast Rebasing Year - Actual)",null,null,null,null,null,null,{"$f":"IF(ISERROR((H17-C17)/C17), \"\", (H17-C17)/C17)","v":-1.2227308232672093E-2}]
["Billing and Collecting",316965,296239,310022,329917,351771,350791,355718]
["Community Relations"]
["Administrative and General",359059,374136,357354,404099,410646,499606,483335]
["SubTotal",{"$f":"SUM(B20:B22)","v":676024},{"$f":"SUM(C20:C22)","v":670375},667376,734016,762417,850397,839053]
["%Change (year over year)",null,null,{"$f":"IF(ISERROR((D23-B23)/B23), \"\", (D23-B23)/B23)","v":-1.2792445238630582E-2},{"$f":"IF(ISERROR((E23-C23)/C23), \"\", (E23-C23)/C23)","v":9.4933432780160351E-2},{"$f":"IF(ISERROR((F23-E23)/E23), \"\", (F23-E23)/E23)","v":3.8692617054669108E-2},{"$f":"IF(ISERROR((G23-F23)/F23), \"\", (G23-F23)/F23)","v":0.11539616771399379},{"$f":"IF(ISERROR((H23-G23)/G23), \"\", (H23-G23)/G23)","v":-1.3339651950794746E-2}]
["%Change (Test Year vs \nLast Rebasing Year - Actual)",null,null,null,null,null,null,{"$f":"IF(ISERROR((H23-C23)/C23), \"\", (H23-C23)/C23)","v":0.25161737833302256}]
["Total",{"$f":"SUM(B23,B17)","v":1421246},{"$f":"SUM(C23,C17)","v":1420581},1439901,1420247,1531445,1627609,1580086]
["%Change (year over year)",null,null,{"$f":"IF(ISERROR((D26-B26)/B26), \"\", (D26-B26)/B26)","v":1.3125806510625183E-2},{"$f":"IF(ISERROR((E26-C26)/C26), \"\", (E26-C26)/C26)","v":-2.35115069116087E-4},{"$f":"IF(ISERROR((F26-E26)/E26), \"\", (F26-E26)/E26)","v":7.8294831814466073E-2},{"$f":"IF(ISERROR((G26-F26)/F26), \"\", (G26-F26)/F26)","v":6.2792983097662666E-2},{"$f":"IF(ISERROR((H26-G26)/G26), \"\", (H26-G26)/G26)","v":-2.9198044493487074E-2}]
[]
[]
[null,{"$f":"B13","v":"Last Rebasing Year (2013 Board-Approved)"},{"$f":"C13","v":"Last Rebasing Year (2013 Actuals)"},"2014 Actuals","2015 Actuals","2016 Actuals","2017 Bridge Year","2018 Test Year"]
["Operations",{"$f":"B15","v":543617},{"$f":"C15","v":535159},{"$f":"D15","v":581576},526730,574153,540346,514586]
["Maintenance",{"$f":"B16","v":201605},{"$f":"C16","v":215047},{"$f":"D16","v":190949},159501,194875,236866,226447]
["Billing and Collecting",{"$f":"B20","v":316965},{"$f":"C20","v":296239},{"$f":"D20","v":310022},329917,351771,350791,355718]
["Community Relations",{"$f":"B21","v":0},{"$f":"C21","v":0},{"$f":"D21","v":0},0,0,0,0]
["Administrative and General",{"$f":"B22","v":359059},{"$f":"C22","v":374136},{"$f":"D22","v":357354},404099,410646,499606,483335]
["Total",{"$f":"SUM(B31:B35)","v":1421246},{"$f":"SUM(C31:C35)","v":1420581},{"$f":"SUM(D31:D35)","v":1439901},1420247,1531445,1627609,1580086]
["%Change (year over year)",null,null,{"$f":"IF(ISERROR((D36-B36)/B36), \"\", (D36-B36)/B36)","v":1.3125806510625183E-2},{"$f":"IF(ISERROR((E36-C36)/C36), \"\", (E36-C36)/C36)","v":-2.35115069116087E-4},{"$f":"IF(ISERROR((F36-E36)/E36), \"\", (F36-E36)/E36)","v":7.8294831814466073E-2},{"$f":"IF(ISERROR((G36-F36)/F36), \"\", (G36-F36)/F36)","v":6.2792983097662666E-2},{"$f":"IF(ISERROR((H36-G36)/G36), \"\", (H36-G36)/G36)","v":-2.9198044493487074E-2}]
[]
[]
[null,{"$f":"B13","v":"Last Rebasing Year (2013 Board-Approved)"},{"$f":"C13","v":"Last Rebasing Year (2013 Actuals)"},{"$f":"\"Variance \" & 'LDC Info'!E28 & \"  Board-approved – \" & 'LDC Info'!E28 & \" Actuals\"","v":"Variance 2013  Board-approved – 2013 Actuals"},{"$f":"D13","v":"2014 Actuals"},{"$f":"\"Variance \" & 'LDC Info'!E26 -3 & \" Actuals vs. \" &  'LDC Info'!E28 & \" Actuals\"","v":"Variance 2014 Actuals vs. 2013 Actuals"},{"$f":"E13","v":"2015 Actuals"},{"$f":"\"Variance \" & 'LDC Info'!E26 -2 & \" Actuals vs. \" &  'LDC Info'!E28 & \" Actuals\"","v":"Variance 2015 Actuals vs. 2013 Actuals"},{"$f":"F13","v":"2016 Actuals"},{"$f":"\"Variance \" & 'LDC Info'!E26 -1 & \" Actuals vs. \" &  'LDC Info'!E26-2 & \" Actuals\"","v":"Variance 2016 Actuals vs. 2015 Actuals"},{"$f":"G13","v":"2017 Bridge Year"},{"$f":"\"Variance \" & 'LDC Info'!E26 & \" Bridge vs. \" & 'LDC Info'!E26 -1 & \" Actuals\"","v":"Variance 2017 Bridge vs. 2016 Actuals"},{"$f":"H13","v":"2018 Test Year"},{"$f":"\"Variance \" & TestYear & \" Test vs. \" & BridgeYear & \" Bridge\"","v":"Variance 2018 Test vs. 2017 Bridge"}]
["Operations",{"$f":"B15","v":543617},{"$f":"C15","v":535159},{"$f":"B41-C41","v":8458},{"$f":"D15","v":581576},{"$f":"E41-C41","v":46417},{"$f":"E15","v":526730},{"$f":"G41-E41","v":-54846},{"$f":"F15","v":574153},{"$f":"I41-G41","v":47423},{"$f":"G15","v":540346},{"$f":"K41-I41","v":-33807},{"$f":"H15","v":514586},{"$f":"M41-K41","v":-25760}]
["Maintenance ",{"$f":"B16","v":201605},{"$f":"C16","v":215047},{"$f":"B42-C42","v":-13442},{"$f":"D16","v":190949},{"$f":"E42-C42","v":-24098},{"$f":"E16","v":159501},{"$f":"G42-E42","v":-31448},{"$f":"F16","v":194875},{"$f":"I42-G42","v":35374},{"$f":"G16","v":236866},41991,{"$f":"H16","v":226447},-10419]
["Billing and Collecting ",{"$f":"B20","v":316965},296239,{"$f":"B43-C43","v":20726},{"$f":"D20","v":310022},{"$f":"E43-C43","v":13783},{"$f":"E20","v":329917},{"$f":"G43-E43","v":19895},{"$f":"F20","v":351771},21854,{"$f":"G20","v":350791},-980,{"$f":"H20","v":355718},4927]
["Community Relations ",0,0,{"$f":"B44-C44","v":0},{"$f":"C21","v":0},{"$f":"E44-C44","v":0},{"$f":"E21","v":0},{"$f":"G44-E44","v":0},{"$f":"F21","v":0},0,{"$f":"G21","v":0},0,{"$f":"H21","v":0},0]
["Administrative and General ",359059,374136,{"$f":"B45-C45","v":-15077},{"$f":"D22","v":357354},{"$f":"E45-C45","v":-16782},{"$f":"E22","v":404099},{"$f":"G45-E45","v":46745},{"$f":"F22","v":410646},6547,{"$f":"G22","v":499606},88960,{"$f":"H22","v":483335},-16271]
["Total OM&A Expenses ",{"$f":"SUM(B41:B45)","v":1421246},{"$f":"SUM(C41:C45)","v":1420581},665,{"$f":"SUM(E41:E45)","v":1439901},{"$f":"SUM(F41:F45)","v":19320},1420247,-19654,1531445,111198,1627609,96164,1580086,-47523]
["Adjustments for Total non-recoverable items (from Appendices 2-JA and 2-JB)"]
["Total Recoverable OM&A Expenses ",{"$f":"B46-B47","v":1421246},{"$f":"C46-C47","v":1420581},665,1439901,19320,1420247,-19654,1531445,111198,1627609,96164,1580086,-47523]
["Variance from previous year ",null,null,null,{"$f":"E48-C48","v":19320},null,{"$f":"G48-E48","v":-19654},null,{"$f":"I48-G48","v":111198},null,{"$f":"K48-I48","v":96164},null,{"$f":"M48-K48","v":-47523}]
["Percent change (year over year) ",null,null,null,{"$f":"IF(ISERROR(E49/C48), \"\", E49/C48)","v":1.3600069267433536E-2},null,{"$f":"IF(ISERROR(G49/E48), \"\", G49/E48)","v":-1.3649549517640448E-2},null,{"$f":"IF(ISERROR(I49/G48), \"\", I49/G48)","v":7.8294831814466073E-2},null,{"$f":"IF(ISERROR(K49/I48), \"\", K49/I48)","v":6.2792983097662666E-2},null,{"$f":"IF(ISERROR(M49/K48), \"\", M49/K48)","v":-2.9198044493487074E-2}]
["Percent Change:                                                    Test year vs. Most Current Actual ",null,null,null,null,null,null,null,{"$f":"IF(ISERROR((M48-I48)/I48), \"\", (M48-I48)/I48)","v":3.1761506289811253E-2}]
["Simple average of % variance for all years",null,null,null,null,null,null,null,{"$f":"IF(ISERROR((M46-C46)/C46), \"\", (M46-C46)/C46)","v":0.11228152424958521},null,null,null,null,{"$f":"IF(ISERROR(AVERAGE(E50,G50,I50,K50,M50)), \"\", AVERAGE(G50,I50,K50,M50))","v":2.4560055225250298E-2}]
["Compound Annual Growth Rate for all years",null,null,null,null,null,null,null,{"$f":"IF(ISERROR((M49-C49)/C49), \"\", (M49-C49)/C49)","v":""},null,null,null,null,{"$f":"IF((M48-C48)=0, \"\", (M48/C48)^(1/6)-1)","v":1.7893764400803036E-2}]
[{"$f":"\"Compound Growth Rate                                                            (\" & F13 & \" vs. \" & 'LDC Info'!E28 & \" Actuals)\"","v":"Compound Growth Rate                                                            (2016 Actuals vs. 2013 Actuals)"},null,null,null,null,null,null,null,{"$f":"IF(ISERROR((I48/C48)^(1/(4)) - 1), \"\", (I48/C48)^(1/(4)) - 1)","v":1.8964023392539886E-2}]
[]
["Note:"]
[]
["1     If it has been more than three years since the applicant last filed a cost of service application, additional years of historical actuals should be incorporated into the table, as necessary, to go back to the last cost of service application.  If the applicant last filed a cost of service application less than three years ago, a minimum of three years of actual information is required."]
[]
["2     Recoverable OM&A that is included on these tables should be identical to the recoverable OM&A that is shown for the corresponding periods on Appendix 2-JB."]

{"sheet":"App.2-JB_OM&A_Cost _Drivers","index":25,"n_rows":52,"n_cols":8,"rows_kept":52,"cut":false,"hidden":false,"merged":[[6,7,6,8],[9,0,9,6],[10,0,10,6],[54,1,54,6],[49,1,49,7],[50,1,50,7],[51,1,53,7]]}
[null,null,null,null,null,"File Number:",{"$f":"EBNUMBER","v":"EB-2017-0073"}]
[null,null,null,null,null,"Exhibit:",4]
[null,null,null,null,null,"Tab:"]
[null,null,null,null,null,null,"Schedule:"]
[null,null,null,null,null,null,"Page:"]
[]
[null,null,null,null,null,null,"Date:","2017-08-28"]
[]
[]
["Appendix 2-JB"]
[{"$f":"\"Recoverable OM&A Cost Driver Table\" & CHAR(185)&CHAR(183)&CHAR(179)","v":"Recoverable OM&A Cost Driver Table¹·³"}]
[]
["OM&A",{"$f":"\"Last Rebasing Year (\"&RebaseYear&\" Actuals)\"","v":"Last Rebasing Year (2013 Actuals)"},{"$f":"BridgeYear -3 & \" Actuals\"","v":"2014 Actuals"},{"$f":"BridgeYear -3 & \" Actuals\"","v":"2014 Actuals"},{"$f":"BridgeYear -2 & \" Actuals\"","v":"2015 Actuals"},{"$f":"BridgeYear -1 & \" Actuals\"","v":"2016 Actuals"},{"$f":"BridgeYear & \" Bridge Year\"","v":"2017 Bridge Year"},{"$f":"TestYear & \" Test Year\"","v":"2018 Test Year"}]
["Reporting Basis","CGAAP",null,"MIFRS","MIFRS","MIFRS","MIFRS","MIFRS"]
[{"$f":"\"Opening Balance\" & CHAR(178)","v":"Opening Balance²"},{"$f":"'[14]App.2-JA_OM&A_Summary_Analys'!B26","v":1421246},{"$f":"B46","v":1420581},{"$f":"B46","v":1420581},{"$f":"D46","v":1439901},{"$f":"E46","v":1420246.71},{"$f":"F46","v":1531444.71},{"$f":"G46","v":1627608.71}]
[]
["Salaries, Wages(including overhead)",null,null,49732,-15165,37423,23305,-53401]
["Training",null,null,173,-25228,27153,-12002,-8025]
["Memberships Licences & Fees",null,null,-9085,-3486,-2158,2720,628]
[]
["Billing ",null,null,-886,-1878,13844,1763,2165]
["Collecting",null,null,3433,3553,-4508,-12768,657]
[]
["Administration",null,null,-3562,6116,-6676,6048,20268]
[]
["OESP Program Development Costs",null,null,null,10930.71]
[]
["Bad Debts",null,null,5117,-15763,1547,5442,-914]
[]
["Consulting Fees",null,null,-2951,18399,7944,67550,-49532]
[]
["Professional Fees",null,null,1236,5751,4054,-4861,14040]
[]
["Bank and Merchant Fees",null,null,11389,6920,13640,354,1485]
[]
["Tree Trimming",null,null,-17567,-9547,15908,-11854,1149]
[]
["U/G Maintenance",null,null,null,null,2212,12788,0]
[]
["Operations/Maintenance",null,null,-14634,-29696,26512,17307,25687]
["Fleet",null,null,-2389,6222,17646,-1100,1384]
["Meter Reverifications",null,null,null,null,null,11313,160]
[]
["All Other Items",-665,null,-686,23217,-43343,-9841,-3274]
[]
[{"$f":"\"Closing Balance\"&CHAR(178)","v":"Closing Balance²"},{"$f":"SUM(B15:B45)","v":1420581},1420581,1439901,1420246.71,1531444.71,1627608.71,1580085.71]
[]
["Notes:"]
[]
[1,"For each year, a detailed explanation for each cost driver and associated amount is requied in Exhibit 4."]
[2,"Opening Balance for \"Last Rebasing Year\" (cell B15) should be equal to the Board-Approved amount. For purposes of assessing incremental cost drivers, the closing balance for each year becomes the opening balance for the next year."]
[3,"If it has been more than four years since the applicant last filed a cost of service application, additional years of historical actuals should be incorporated into the table, as necessary, to go back to the last cost of service application.  If the applicant last filed a cost of service application less than four years ago, a minimum of three years of actual information is required."]

{"sheet":"App.2-JC_OMA Programs","index":26,"n_rows":63,"n_cols":10,"rows_kept":63,"cut":false,"hidden":false,"merged":[[6,8,6,9],[62,0,63,8],[8,0,8,7],[9,0,9,7],[11,0,11,7],[60,0,60,7],[58,0,58,8],[59,0,59,8]]}
[null,null,null,null,null,null,null,"File Number:",{"$f":"EBNUMBER","v":"EB-2017-0073"}]
[null,null,null,null,null,null,null,"Exhibit:",4]
[null,null,null,null,null,null,null,"Tab:"]
[null,null,null,null,null,null,null,"Schedule:"]
[null,null,null,null,null,null,null,"Page:"]
[]
[null,null,null,null,null,null,null,"Date:","2017-08-28"]
[]
["Appendix 2-JC"]
["OM&A Programs Table"]
[]
[]
["Programs",{"$f":"\"Last Rebasing Year (\" & RebaseYear & \" Board-Approved)\"","v":"Last Rebasing Year (2013 Board-Approved)"},{"$f":"\"Last Rebasing Year (\" & RebaseYear & \" Actuals)\"","v":"Last Rebasing Year (2013 Actuals)"},{"$f":"BridgeYear-3&\" Actuals\"","v":"2014 Actuals"},{"$f":"BridgeYear -2 & \" Actuals\"","v":"2015 Actuals"},{"$f":"BridgeYear -1 & \" Actuals\"","v":"2016 Actuals"},{"$f":"BridgeYear & \" Bridge Year\"","v":"2017 Bridge Year"},{"$f":"TestYear & \" Test Year\"","v":"2018 Test Year"},{"$f":"\"Variance \n(Test Year vs. \" & F13 &\")\"","v":"Variance \n(Test Year vs. 2016 Actuals)"},{"$f":"\"Variance \n(Test Year vs. \" & B13","v":"Variance \n(Test Year vs. Last Rebasing Year (2013 Board-Approved)"}]
["Reporting Basis","CGAAP","CGAAP","MIFRS","MIFRS","MIFRS","MIFRS","MIFRS"]
["Operations"]
["Apprenticeship Training",21224,20864,21647,7659,23627,11000,0,{"$f":"H16-F16","v":-23627},{"$f":"H16-B16","v":-21224}]
["Mapping",0,33853.550000000003,37607.449999999997,34069.300000000003,33196.32,35561.03,36280.769999999997,{"$f":"H17-F17","v":3084.4499999999971},36280.769999999997]
["Distribution Lines Operations",522393,480441.45,562321.55000000005,485001.7,517329.68,498155,478305,-39024.679999999993,-44088]
[null,null,null,null,null,null,null,null,0,0]
[null,null,null,null,null,null,null,null,0,0]
["Sub-Total",{"$f":"SUM(B16:B20)","v":543617},{"$f":"SUM(C16:C20)","v":535159},621576,526730,574153,544716.03,{"$f":"SUM(H16:H20)","v":514585.77},-59567.229999999981,-29031.229999999981]
["Maintenance"]
["Tree Trimming",51200,86889,69322,59775,75683,63829,65041,-10642,{"$f":"H23-B23","v":13841}]
["U/G Cable Maintenance",0,null,null,null,2212,15000,15000,12788,15000]
["Meter Reverification Program",0,null,null,null,null,11313,11473,11473,11473]
["Transformer and Lines Maintenance",150405,128158,121627,99726,116980,142414,134933,17953,-15472]
[null,null,null,null,null,null,null,null,0,0]
["Sub-Total",{"$f":"SUM(B23:B27)","v":201605},215047,190949,159501,194875,232556,{"$f":"SUM(H23:H27)","v":226447},31572,24842]
["Billing & Collecting"]
["Monthly Billing System Charges",53100,53100,53100,55755,67463.58,70379,71716,4252.4199999999983,{"$f":"H30-B30","v":18616}]
["Billing System Program Changes",2500,2537.46,8911.0400000000009,6130.25,2583.56,10000,10000,7416.4400000000005,7500]
["Smart Meter Administration",59167,55979.6,48741.66,47360.53,54961.42,56895,57977,3015.5800000000017,-1190]
["Third Party Collection",22285,15892,18758,22903,17722,5500,5500,-12222,-16785]
["Bad Debt ",20000,34740,39857,24094,25641,31083,30169,4528,10169]
["Bank and Merchant fee Charges",55183,50197,61586,68506,82146,82500,84068,1922,28885]
["All Other Billing & Collecting",104730,83793,79068,105168,101253,94434,96288,-4965,-8442]
[null,null,null,null,null,null,null,null,0,0]
["Sub-Total",{"$f":"SUM(B30:B37)","v":316965},296239.06,310021.7,329916.78000000003,351770.56,350791,{"$f":"SUM(H30:H37)","v":355718},3947.4400000000023,38753]
["Administration"]
["Insurance",18850,21584,22694,21487,24229,23552,24000,-229,{"$f":"H40-B40","v":5150}]
["Regulatory ",33046,23097,15590,29099,17731,15223,18474,743,-14572]
["Professional Fees",36773,25320,26556,32307,36361,31500,35070,-1291,-1703]
["Travel and Meetings",40563,33666,27527,30082,25526,36200,36889,11363,-3674]
["All Other Administration and General",229827,269209,264987,280318,287824,293822,304902,17078,75075]
[null,null,null,null,null,null,null,null,0,0]
["Sub-Total",{"$f":"SUM(B40:B45)","v":359059},372876,357354,393293,391671,400297,{"$f":"SUM(H40:H45)","v":419335},27664,60276]
["    Special Projects"]
["Asset Management Plan/Distribution System Plan",null,null,null,null,15099.75,24248.5,null,{"$f":"H48-F48","v":-15099.75},{"$f":"H48-B48","v":0}]
["Asset Condition Assessment",null,null,null,10806,3875.4,null,null,-3875.4,0]
["Cost of Service Application",null,1260,null,null,null,75000,24000,24000,24000]
["Anticipated on going consulting fees",null,null,null,null,null,null,40000,{"$f":"H51-F51","v":40000},40000]
[null,null,null,null,null,null,null,null,0,{"$f":"H52-B52","v":0}]
["Sub-Total",{"$f":"SUM(B48:B52)","v":0},1260,0,10806,18975.150000000001,99248.5,64000,45024.85,64000]
["Miscellaneous",null,null,null,null,null,null,null,0,0]
["Total",{"$f":"SUMPRODUCT(--($A15:$A54=\"Sub-Total\"), B$15:B$54)+B54","v":1421246},1420581.06,1479900.7,1420246.78,1531444.71,1627608.53,1580085.77,{"$f":"H55-F55","v":48641.060000000056},158839.77000000002]
[]
["Notes:"]
[]
["1   Please provide a breakdown of the major components of each OM&A Program undertaken in each year.  Please ensure that all Programs below the materiality threshold are included in the miscellaneous line.  Add more Programs as required."]
["2   The applicant should group projects appropriately and avoid presentations that result in classification of significant components of the OM&A budget in the miscellaneous category"]
[]
[]
["  "]

{"sheet":"App.2-K_Employee Costs","index":27,"n_rows":32,"n_cols":8,"rows_kept":32,"cut":false,"hidden":false,"merged":[[6,7,6,8],[31,0,31,7],[24,0,24,7],[8,0,8,7],[9,0,9,7],[12,0,12,7],[16,0,16,7],[20,0,20,7]]}
[null,null,null,null,null,null,"File Number:",{"$f":"EBNUMBER","v":"EB-2017-0073"}]
[null,null,null,null,null,null,"Exhibit:",4]
[null,null,null,null,null,null,"Tab:"]
[null,null,null,null,null,null,"Schedule:"]
[null,null,null,null,null,null,"Page:"]
[]
[null,null,null,null,null,null,"Date:","2017-08-28"]
[]
["Appendix 2-K"]
["Employee Costs"]
[]
[null,{"$f":"\"Last Rebasing Year - \"&RebaseYear&\"- Board Approved\"","v":"Last Rebasing Year - 2013- Board Approved"},{"$f":"\"Last Rebasing Year - \"&RebaseYear&\"-  Actual\"","v":"Last Rebasing Year - 2013-  Actual"},{"$f":"BridgeYear-3 & \" Actuals\"","v":"2014 Actuals"},{"$f":"BridgeYear -2 & \" Actuals\"","v":"2015 Actuals"},{"$f":"BridgeYear -1 & \" Actuals\"","v":"2016 Actuals"},{"$f":"BridgeYear & \" Bridge Year\"","v":"2017 Bridge Year"},{"$f":"TestYear & \" Test Year\"","v":"2018 Test Year"}]
["Number of Employees (FTEs including Part-Time)1"]
["Management (including executive)",2,2,2,2,2,2,1]
["Non-Management (union and non-union)",7,7,7,7.35,7.35,7.35,7.35]
["Total",{"$f":"SUM(B14:B15)","v":9},9,9,9.35,9.35,9.35,8.35]
["Total Salary and Wages including ovetime and incentive pay"]
["Management (including executive)"]
["Non-Management (union and non-union)",641205,663688.68000000005,690076.69,731695.49,764396.06,727717.69499999995,672391.08810000005]
["Total",{"$f":"SUM(B18:B19)","v":641205},663688.68000000005,690076.69,731695.49,764396.06,727717.69499999995,672391.08810000005]
["Total Benefits (Current + Accrued) 2"]
["Management (including executive)"]
["Non-Management (union and non-union)",144240,118919,119138,133851,154266,156758,153324]
["Total",{"$f":"SUM(B22:B23)","v":144240},{"$f":"SUM(C22:C23)","v":118919},119138,133851,154266,156758,153324]
["Total Compensation (Salary, Wages, & Benefits)"]
["Management (including executive)",{"$f":"B18+B22","v":0},0,{"$f":"D18+D22","v":0},0,0,0,0]
["Non-Management (union and non-union)",785445,782607.68,{"$f":"D19+D23","v":809214.69},865546.49,918662.06,884475.69499999995,825715.08810000005]
["Total",785445,782607.68,{"$f":"D20+D24","v":809214.69},865546.49,918662.06,884475.69499999995,825715.08810000005]
[]
["Note:"]
["1 If an applicant wishes to use headcount, it must also file the same schedule on an FTE basis."]
["2 Current employee benefits, plus Pension and Other Post-Employment Benefits costs, as recorded for recovery in distribution rates. Should be consistent with OPEBs costs as documented in Appendix 2-KA."]

{"sheet":"App.2-L_OM&A_per_Cust_FTE","index":28,"n_rows":38,"n_cols":10,"rows_kept":38,"cut":false,"hidden":false,"merged":[[6,9,6,10],[37,2,37,9],[34,2,34,9],[35,2,35,9],[36,2,36,9],[32,2,33,9],[22,1,22,2],[25,1,25,2],[26,1,26,2],[16,1,16,2],[17,1,17,2],[18,1,18,2],[19,1,19,2],[20,1,20,2],[21,1,21,2],[13,1,13,2],[14,1,14,2],[15,1,15,2],[8,1,8,9],[9,1,9,9]]}
[null,null,null,null,null,null,null,null,"File Number:",{"$f":"EBNUMBER","v":"EB-2017-0073"}]
[null,null,null,null,null,null,null,null,"Exhibit:",4]
[null,null,null,null,null,null,null,null,"Tab:"]
[null,null,null,null,null,null,null,null,"Schedule:"]
[null,null,null,null,null,null,null,null,"Page:"]
[]
[null,null,null,null,null,null,null,null,"Date:","2017-08-28"]
[]
[null,"Appendix 2-L"]
[null,"Recoverable OM&A Cost per Customer and per FTE 1"]
[]
[]
[null,null,null,{"$f":"\"Last Rebasing Year - \"&RebaseYear&\"- Board Approved\"","v":"Last Rebasing Year - 2013- Board Approved"},{"$f":"\"Last Rebasing Year - \"&RebaseYear&\"-  Actual\"","v":"Last Rebasing Year - 2013-  Actual"},{"$f":"BridgeYear -3 & \" Actuals\"","v":"2014 Actuals"},{"$f":"BridgeYear -2 & \" Actuals\"","v":"2015 Actuals"},{"$f":"BridgeYear -1 & \" Actuals\"","v":"2016 Actuals"},{"$f":"BridgeYear & \" Bridge Year\"","v":"2017 Bridge Year"},{"$f":"TestYear & \" Test Year\"","v":"2018 Test Year"}]
[null,"Reporting Basis",null,"CGAAP","CGAAP","MIFRS","MIFRS","MIFRS","MIFRS","MIFRS"]
[null,"OM&A Costs"]
[null,"     O&M",null,707676,750206,772525,686231,769028,777212,741033]
[null,"     Admin Expenses",null,713570,670375,667376,734016,762417,850397,839053]
[null,"Total Recoverable OM&A from Appendix 2-JB 5",null,{"$f":"SUM(D16:D17)","v":1421246},{"$f":"SUM(E16:E17)","v":1420581},1439901,1420247,1531445,1627609,1580086]
[null,"Number of Customers 2,4",null,3293,3332,3347,3345,3358,3365,3372]
[null,"Number of FTEs 3,4",null,9,9,9,9.35,9.35,9.06,8.35]
[null,"Customers/FTEs",null,{"$f":"IF(D20=0,\"\",D19/D20)","v":365.88888888888891},{"$f":"IF(E20=0,\"\",E19/E20)","v":370.22222222222223},{"$f":"IF(F20=0,\"\",F19/F20)","v":371.88888888888891},357.75401069518716,359.14438502673801,371.41280353200881,403.83233532934133]
[null,"OM&A cost per customer"]
[null,"     O&M per customer",null,{"$f":"IF(D19=0,\"\",D16/D19)","v":214.90312784694808},{"$f":"IF(E19=0,\"\",E16/E19)","v":225.15186074429772},{"$f":"IF(F19=0,\"\",F16/F19)","v":230.81117418583807},205.15127055306428,229.01369863013699,230.96939078751856,219.76067615658363]
[null,"     Admin per customer",null,{"$f":"IF(D19=0,\"\",D17/D19)","v":216.6929851199514},{"$f":"IF(E19=0,\"\",E17/E19)","v":201.19297719087635},{"$f":"IF(F19=0,\"\",F17/F19)","v":199.39527935464596},219.43677130044844,227.04496724240619,252.71827637444278,248.82947805456703]
[null,"     Total OM&A per customer",null,{"$f":"IF(D19=0,\"\",D18/D19)","v":431.59611296689951},{"$f":"IF(E19=0,\"\",E18/E19)","v":426.34483793517404},{"$f":"IF(F19=0,\"\",F18/F19)","v":430.20645354048401},424.58804185351272,456.0586658725432,483.68766716196137,468.59015421115066]
[null,"OM&A cost per FTE"]
[null,"     O&M per FTE",null,{"$f":"IF(D20=0,\"\",D16/D20)","v":78630.666666666672},{"$f":"IF(E20=0,\"\",E16/E20)","v":83356.222222222219},{"$f":"IF(F20=0,\"\",F16/F20)","v":85836.111111111109},73393.689839572195,82248.983957219258,85784.988962472402,88746.467065868273]
[null,"     Admin per FTE",null,{"$f":"IF(D20=0,\"\",D17/D20)","v":79285.555555555562},{"$f":"IF(E20=0,\"\",E17/E20)","v":74486.111111111109},{"$f":"IF(F20=0,\"\",F17/F20)","v":74152.888888888891},78504.385026737975,81541.925133689845,93862.803532008824,100485.38922155689]
[null,"     Total OM&A per FTE",null,{"$f":"IF(D20=0,\"\",D18/D20)","v":157916.22222222222},{"$f":"IF(E20=0,\"\",E18/E20)","v":157842.33333333334},{"$f":"IF(F20=0,\"\",F18/F20)","v":159989},151898.07486631017,163790.90909090909,179647.79249448123,189231.85628742515]
[]
[null,"Notes:"]
[]
[null,1,"If it has been more than four years since the applicant last filed a cost of service application, additional years of historical actuals should be incorporated into the table, as necessary, to go back to the last cost of service application. If the applicant last filed a cost of service application less than four years ago, a minimum of three years of actual information is required."]
[]
[null,2,"The method of calculating the number of customers must be identified. Should correspond with data provided in Appendix 2-IB."]
[null,3,"The method of calculating the number of FTEs must be identified. See also Appendix 2-K."]
[null,4,"The number of customers and the number of FTEs should correspond to mid-year or average of January 1 and December 31 figures."]
[null,5,"For the test year, the applicant should take into account the system O&M (line 22 of Appendix 2-AB) in developing its forecasted OM&A."]

{"sheet":"App.2-L_OM&A_per_Cust_FTEE_exp","index":29,"n_rows":38,"n_cols":12,"rows_kept":38,"cut":false,"hidden":true,"merged":[[8,0,8,11],[9,0,9,11],[34,1,34,6],[35,1,35,6],[21,0,21,1],[22,0,22,1],[25,0,25,1],[14,0,14,1],[13,0,13,1],[11,7,11,11],[15,0,15,1],[16,0,16,1],[17,0,17,1],[37,1,38,11],[36,1,36,11],[32,1,33,11],[19,0,19,1],[18,0,18,1],[20,0,20,1],[26,0,26,1]]}
[null,null,null,null,null,null,null,null,null,null,"File Number:",{"$f":"EBNUMBER","v":"EB-2017-0073"}]
[null,null,null,null,null,null,null,null,null,null,"Exhibit:"]
[null,null,null,null,null,null,null,null,null,null,"Tab:"]
[null,null,null,null,null,null,null,null,null,null,"Schedule:"]
[null,null,null,null,null,null,null,null,null,null,"Page:"]
[]
[null,null,null,null,null,null,null,null,null,null,"Date:"]
[]
["Appendix 2-L"]
["Recoverable OM&A Cost per Customer and per FTE 1"]
[]
[null,null,null,null,null,null,null,"5-year Distribution System Plan Period"]
[null,null,{"$f":"\"Last Rebasing Year - \"&RebaseYear&\"- Board Approved\"","v":"Last Rebasing Year - 2013- Board Approved"},{"$f":"\"Last Rebasing Year - \"&RebaseYear&\"-  Actual\"","v":"Last Rebasing Year - 2013-  Actual"},{"$f":"BridgeYear -2 & \" Actuals\"","v":"2015 Actuals"},{"$f":"BridgeYear -1 & \" Actuals\"","v":"2016 Actuals"},{"$f":"BridgeYear & \" Bridge Year\"","v":"2017 Bridge Year"},{"$f":"TestYear & \" Test Year\"","v":"2018 Test Year"},{"$f":"TestYear+1 & \" Year\"","v":"2019 Year"},{"$f":"TestYear+2 & \" Year\"","v":"2020 Year"},{"$f":"TestYear+3 & \" Year\"","v":"2021 Year"},{"$f":"TestYear+4 & \" Year\"","v":"2022 Year"}]
["Reporting Basis"]
["OM&A Costs"]
["     O&M"]
["     Admin Expenses"]
["Total Recoverable OM&A from Appendix 2-JB 5",null,{"$f":"SUM(C16:C17)","v":0},{"$f":"SUM(D16:D17)","v":0},0,0,0,0,0,0,0,0]
["Number of Customers 2,4"]
["Number of FTEs 3,4"]
["Customers/FTEs",null,{"$f":"IF(C20=0,\"\",C19/C20)","v":""},{"$f":"IF(D20=0,\"\",D19/D20)","v":""},"","","","","","","",""]
["OM&A cost per customer"]
["     O&M per customer",null,{"$f":"IF(C19=0,\"\",C16/C19)","v":""},{"$f":"IF(D19=0,\"\",D16/D19)","v":""},"","","","","","","",""]
["     Admin per customer",null,{"$f":"IF(C19=0,\"\",C17/C19)","v":""},{"$f":"IF(D19=0,\"\",D17/D19)","v":""},"","","","","","","",""]
["     Total OM&A per customer",null,{"$f":"IF(C19=0,\"\",C18/C19)","v":""},{"$f":"IF(D19=0,\"\",D18/D19)","v":""},"","","","","","","",""]
["OM&A cost per FTE"]
["     O&M per FTE",null,{"$f":"IF(C20=0,\"\",C16/C20)","v":""},{"$f":"IF(D20=0,\"\",D16/D20)","v":""},"","","","","","","",""]
["     Admin per FTE",null,{"$f":"IF(C20=0,\"\",C17/C20)","v":""},{"$f":"IF(D20=0,\"\",D17/D20)","v":""},"","","","","","","",""]
["     Total OM&A per FTE",null,{"$f":"IF(C20=0,\"\",C18/C20)","v":""},{"$f":"IF(D20=0,\"\",D18/D20)","v":""},"","","","","","","",""]
[]
["Notes:"]
[]
[1,"If it has been more than three years since the applicant last filed a cost of service application, additional years of historical actuals should be incorporated into the table, as necessary, to go back to the last cost of service application.  If the applicant last filed a cost of service application less than three years ago, a minimum of three years of actual information is required."]
[]
[2,"The method of calculating the number of customers must be identified. Should be linked back to Appendix 2-IA"]
[3,"The method of calculating the number of FTEs must be identified.  See also Appendix 2-K"]
[4,"The number of customers and the number of FTEs should correspond to mid-year or average of January 1 and December 31 figures."]
[5,"For the test year and in the subsequent four years of the DSP period, the applicant should take into account the system O&M (line X of Appendix 2-AB) in developing its forecasted OM&A. Admin expenses beyond the test year also need to be forecasted (separately)."]

{"sheet":"App.2-M_Regulatory_Costs","index":30,"n_rows":46,"n_cols":11,"rows_kept":46,"cut":false,"hidden":false,"merged":[[12,0,12,1],[13,0,13,1],[8,0,8,10],[9,0,9,10],[6,10,6,11]]}
[null,null,null,null,null,null,null,null,null,"File Number:",{"$f":"EBNUMBER","v":"EB-2017-0073"}]
[null,null,null,null,null,null,null,null,null,"Exhibit:",4]
[null,null,null,null,null,null,null,null,null,"Tab:"]
[null,null,null,null,null,null,null,null,null,"Schedule:"]
[null,null,null,null,null,null,null,null,null,"Page:"]
[]
[null,null,null,null,null,null,null,null,null,"Date:","2017-08-28"]
[]
["Appendix 2-M"]
["Regulatory Cost Schedule"]
[]
[]
["Regulatory Cost Category",null,"USoA Account","USoA Account Balance","Ongoing or One-time Cost? 2",{"$f":"\"Last Rebasing Year (\" & RebaseYear & \" Board Approved)\"","v":"Last Rebasing Year (2013 Board Approved)"},{"$f":"\"Most Current Actuals               Year \" & TestYear - 2","v":"Most Current Actuals               Year 2016"},{"$f":"TestYear -1 & \" Bridge Year\"","v":"2017 Bridge Year"},"Annual % Change",{"$f":"TestYear & \" Test Year\"","v":"2018 Test Year"},"Annual % Change"]
["(A)",null,"(B)","(C )","(D)","(E)","(F)","(G)","(H) = [(G)-(F)]/(F)","(I)","(J) = [(I)-(G)]/(G)"]
[1,"OEB Annual Assessment",5655,null,"On-Going",12734,14122,null,{"$f":"IF(G15=0,\"\",(H15-G15)/G15)","v":-1},null,{"$f":"IF(H15=0,\"\",(J15-H15)/H15)","v":""}]
[2,"OEB Section 30 Costs (Applicant-originated)",null,null,"One-Time",null,null,null,{"$f":"IF(G16=0,\"\",(H16-G16)/G16)","v":""},null,{"$f":"IF(H16=0,\"\",(J16-H16)/H16)","v":""}]
[3,"OEB Section 30 Costs (OEB-initiated)",5655,null,"On-Going",1000,835.13,null,-1,null,""]
[4,"Expert Witness costs for regulatory matters",null,null,null,null,null,null,"",null,""]
[5,"Legal costs for regulatory matters",5630,null,"On-Going",null,710,null,-1,null,""]
[6,"Consultants' costs for regulatory matters",5665,null,"One-Time",30000,26850.15,95000,2.5381552803243186,19000,-0.8]
[7,"Operating expenses associated with staff resources allocated to regulatory matters",5610,null,"On-Going",67353,null,null,"",null,""]
[8,"Operating expenses associated with other resources allocated to regulatory matters 1",5665,null,"On-Going",null,null,null,"",40000,""]
[9,"Other regulatory agency fees or assessments",5680,null,"On-Going",2501,2614.33,null,-1,null,""]
[10,"Legal Costs for Cost of Service Proceeding",null,null,"One-Time",null,null,null,"",3000,""]
[11,"Intervenor costs",5655,null,"One-Time",5000,0,10000,"",4097.3500000000004,-0.59026499999999993]
[12,"Sub-total - Ongoing Costs 3",null,{"$f":"SUMIF($E15:$E25,$E11,D15:D25)","v":0},null,{"$f":"SUMIF($E15:$E25,$E11,F15:F25)","v":0},{"$f":"SUMIF($E15:$E25,$E11,G15:G25)","v":0},{"$f":"SUMIF($E15:$E25,$E11,H15:H25)","v":0},"",{"$f":"SUMIF($E15:$E25,$E11,J15:J25)","v":0},""]
[13,"Sub-total - One-time Costs 4",null,{"$f":"SUMIF($E15:$E25,$E12,D15:D25)","v":0},null,{"$f":"SUMIF($E15:$E25,$E12,F15:F25)","v":0},{"$f":"SUMIF($E15:$E25,$E12,G15:G25)","v":0},{"$f":"SUMIF($E15:$E25,$E12,H15:H25)","v":0},"",{"$f":"SUMIF($E15:$E25,$E12,J15:J25)","v":0},""]
[14,"Total",null,{"$f":"D26+D27","v":0},null,{"$f":"F26+F27","v":0},{"$f":"G26+G27","v":0},{"$f":"H26+H27","v":0},"",{"$f":"J26+J27","v":0},""]
[]
[]
["Please fill out the following table for all one-time costs related to this cost of service application to be amortized over the test year plus the IRM period."]
[]
[null,null,"Historical Year(s)",{"$f":"H13","v":"2017 Bridge Year"},{"$f":"J13","v":"2018 Test Year"}]
[4,"Expert Witness costs"]
[5,"Legal costs",5486.73,null,15000]
[6,"Consultants' costs",null,95000]
[7,"Incremental operating expenses associated with staff resources allocated to this application."]
[8,"Incremental operating expenses associated with other resources allocated to this application. 1"]
[11,"Intervenor costs",null,null,10000]
[]
["Notes:"]
[]
["1","Please identify the resources involved."]
["2","Where a category's costs include both one-time and ongoing costs, the applicant should prove a separate breakdown between one-time and ongoing costs."]
["3","Sum of all ongoing costs identified in rows 1 to 11 inclusive."]
["4","Sum of all one-time costs identified in rows 1 to 11 inclusive."]

{"sheet":"App.2-N_Corp_Cost_Allocation","index":31,"n_rows":53,"n_cols":8,"rows_kept":53,"cut":false,"hidden":false,"merged":[[46,1,46,6],[49,1,49,6],[52,1,52,6],[13,1,13,6],[8,1,8,6],[9,1,9,6],[42,2,43,6],[16,1,17,1],[16,2,17,2],[15,3,17,3],[15,4,17,4],[15,1,15,2],[15,5,16,5],[15,6,16,6],[15,7,16,7],[29,1,29,2],[29,3,31,3],[29,4,31,4],[29,6,30,6],[29,5,30,5],[30,1,31,1],[30,2,31,2],[27,1,27,6]]}
[null,null,null,null,null,null,"File Number:",{"$f":"EBNUMBER","v":"EB-2017-0073"}]
[null,null,null,null,null,null,"Exhibit:"]
[null,null,null,null,null,null,"Tab:"]
[null,null,null,null,null,null,"Schedule:"]
[null,null,null,null,null,null,"Page:"]
[]
[null,null,null,null,null,null,"Date:"]
[]
[null,"Appendix 2-N"]
[null,"Shared Services and Corporate Cost Allocation 1"]
[]
[null,null,"Year:"]
[]
[null,"Shared Services"]
[]
[null,"Name of Company",null,"Service Offered","Pricing Methodology","Price for the Service","Cost for the Service"]
[null,"From","To"]
[null,null,null,null,null,"$","$"]
[]
[]
[]
[]
[]
[]
[]
[]
[]
[null,"Corporate Cost Allocation"]
[]
[null,"Name of Company",null,"Service Offered","Pricing Methodology","% of Corporate Costs Allocated","Amount Allocated"]
[null,"From","To"]
[null,null,null,null,null,"%","$"]
[null,"eg: parent company","eg: regulated entity"]
[]
[]
[]
[]
[]
[]
[]
[]
[null,"Note: "]
[null,1,"This appendix must be completed in relation to each service provided or received for the Historical (actuals), Bridge and Test years. The required information includes:"]
[]
[]
[null,"·         Type of Service:"]
[null,"Services such as billing, accounting, payroll, etc.  The applicant must identify any costs related to the Board of Directors of the parent company that are allocated to the applicant."]
[]
[null,"·         Pricing Methodology:"]
[null,"Pricing Methodology includes approaches such as cost-base, market-base, tendering, etc.  The applicant must provide evidence demonstrating the pricing methodology used.  The applicant must also provide a description of why that pricing methodology was chosen, whether or not it is in conformity with ARC, and why it is appropriate."]
[]
[null,"·         % Allocation:"]
[null,"The applicant must provide the percentage of the costs allocated to the entity for the service being offered.  The Applicant must also provide a description of the allocator and why it is an appropriate allocator."]

{"sheet":"App.2-OA Capital Structure","index":32,"n_rows":62,"n_cols":15,"rows_kept":62,"cut":false,"hidden":false,"merged":[[6,14,6,15],[67,2,67,14],[62,2,62,14],[63,2,63,14],[64,2,64,14],[65,2,65,14],[66,2,66,14],[41,7,41,9],[43,0,44,0],[44,4,44,8],[60,0,60,14],[61,2,61,14],[9,2,9,14],[10,2,10,14],[16,0,17,0],[17,4,17,8],[14,7,14,9],[40,2,40,14],[12,0,12,14],[34,2,34,14],[35,2,35,14],[36,2,36,14],[37,2,37,14],[38,2,38,14],[39,2,39,14],[33,0,33,14]]}
[null,null,null,null,null,null,null,null,null,null,"File Number:",null,null,null,{"$f":"EBNUMBER","v":"EB-2017-0073"}]
[null,null,null,null,null,null,null,null,null,null,"Exhibit:",null,null,null,5]
[null,null,null,null,null,null,null,null,null,null,"Tab:"]
[null,null,null,null,null,null,null,null,null,null,"Schedule:"]
[null,null,null,null,null,null,null,null,null,null,"Page:"]
[]
[null,null,null,null,null,null,null,null,null,null,"Date:",null,null,null,"2017-08-28"]
[]
[]
[null,null,"Appendix 2-OA"]
[null,null,"Capital Structure and Cost of Capital"]
[]
["This table must be completed for the last Board-approved year and the test year."]
[]
[null,null,null,null,null,null,"Year:",2013]
[]
["Line No."]
[null,null,"Particulars",null,"Capitalization Ratio",null,null,null,null,null,"Cost Rate",null,null,null,"Return"]
[]
[null,null,null,null,"(%)",null,null,null,"($)",null,"(%)",null,null,null,"($)"]
[null,null,"Debt"]
[1,null,"  Long-term Debt",null,0.56000000000000005,null,null,null,{"$f":"$I$31*E22","v":3423960.4000000004},null,3.44E-2,null,null,null,{"$f":"K22*I22","v":117784.23776000002}]
[2,null,"  Short-term Debt",null,0.04,null,"(1)",null,{"$f":"$I$31*E23","v":244568.6},null,2.07E-2,null,null,null,{"$f":"K23*I23","v":5062.5700200000001}]
[3,null,"Total Debt",null,{"$f":"SUM(E22:E23)","v":0.60000000000000009},null,null,null,{"$f":"SUM(I22:I23)","v":3668529.0000000005},null,{"$f":"IF(E24=0,0,SUMPRODUCT(E22:E23,K22:K23)/E24)","v":3.3486666666666665E-2},null,null,null,{"$f":"SUM(O22:O23)","v":122846.80778000002}]
[]
[null,null,"Equity"]
[4,null,"  Common Equity",null,0.4,null,null,null,{"$f":"$I$31*E27","v":2445686},null,8.9800000000000005E-2,null,null,null,{"$f":"K27*I27","v":219622.60280000002}]
[5,null,"  Preferred Shares",null,null,null,null,null,{"$f":"$I$31*E28","v":0},null,null,null,null,null,{"$f":"K28*I28","v":0}]
[6,null,"Total Equity",null,{"$f":"SUM(E27:E28)","v":0.4},null,null,null,{"$f":"SUM(I27:I28)","v":2445686},null,{"$f":"IF(E29=0,0,SUMPRODUCT(E27:E28,K27:K28)/E29)","v":8.9799999999999991E-2},null,null,null,{"$f":"SUM(O27:O28)","v":219622.60280000002}]
[]
[7,null,"Total",null,1,null,null,null,6114215,null,{"$f":"(K24*E24)+(K29*E29)","v":5.6012000000000006E-2},null,null,null,{"$f":"O24+O29","v":342469.41058000003}]
[]
[]
["Notes"]
["(1)",null,"4.0% unless an applicant has proposed or been approved for a different amount."]
[]
[]
[]
[]
[]
[]
[null,null,null,null,null,null,"Year:",2018]
[]
["Line No."]
[null,null,"Particulars",null,"Capitalization Ratio",null,null,null,null,null,"Cost Rate",null,null,null,"Return"]
[]
[null,null,null,null,"(%)",null,null,null,"($)",null,"(%)",null,null,null,"($)"]
[null,null,"Debt"]
[1,null,"  Long-term Debt",null,0.56000000000000005,null,null,null,{"$f":"$I$58*E49","v":3455816.0000000005},null,3.8600000000000002E-2,null,null,null,{"$f":"K49*I49","v":133394.49760000003}]
[2,null,"  Short-term Debt",null,0.04,null,"(1)",null,{"$f":"$I$58*E50","v":246844},null,1.7600000000000001E-2,null,null,null,{"$f":"K50*I50","v":4344.4544000000005}]
[3,null,"Total Debt",null,{"$f":"SUM(E49:E50)","v":0.60000000000000009},null,null,null,{"$f":"SUM(I49:I50)","v":3702660.0000000005},null,{"$f":"IF(E51=0,0,SUMPRODUCT(E49:E50,K49:K50)/E51)","v":3.7199999999999997E-2},null,null,null,{"$f":"SUM(O49:O50)","v":137738.95200000002}]
[]
[null,null,"Equity"]
[4,null,"  Common Equity",null,0.4,null,null,null,{"$f":"$I$58*E54","v":2468440},null,8.7800000000000003E-2,null,null,null,{"$f":"K54*I54","v":216729.03200000001}]
[5,null,"  Preferred Shares",null,null,null,null,null,{"$f":"$I$58*E55","v":0},null,null,null,null,null,{"$f":"K55*I55","v":0}]
[6,null,"Total Equity",null,{"$f":"SUM(E54:E55)","v":0.4},null,null,null,{"$f":"SUM(I54:I55)","v":2468440},null,{"$f":"IF(E56=0,0,SUMPRODUCT(E54:E55,K54:K55)/E56)","v":8.7800000000000003E-2},null,null,null,{"$f":"SUM(O54:O55)","v":216729.03200000001}]
[]
[7,null,"Total",null,1,null,null,null,6171100,null,{"$f":"(K51*E51)+(K56*E56)","v":5.7440000000000005E-2},null,null,null,{"$f":"O51+O56","v":354467.98400000005}]
[]
[]
["Notes"]
["(1)",null,"4.0% unless an applicant has proposed or been approved for a different amount."]

{"sheet":"App.2-OB_Debt Instruments","index":33,"n_rows":126,"n_cols":11,"rows_kept":126,"cut":false,"hidden":false,"merged":[[6,10,6,11],[35,1,35,10],[9,0,9,10],[10,0,10,10],[10,11,10,14],[12,0,12,10],[34,1,34,10],[33,1,33,10]]}
[null,null,null,null,null,null,null,null,null,"File Number:",{"$f":"EBNUMBER","v":"EB-2017-0073"}]
[null,null,null,null,null,null,null,null,null,"Exhibit:",5]
[null,null,null,null,null,null,null,null,null,"Tab:"]
[null,null,null,null,null,null,null,null,null,"Schedule:"]
[null,null,null,null,null,null,null,null,null,"Page:"]
[]
[null,null,null,null,null,null,null,null,null,"Date:","2017-08-28"]
[]
[]
["Appendix 2-OB"]
["Debt Instruments"]
[]
["This table must be completed for all required historical years, the bridge year and the test year."]
[null,null,null,"Year",2013]
[]
["Row","Description","Lender","Affiliated or Third-Party Debt?","Fixed or Variable-Rate?","Start Date","Term              (years)","Principal                         ($)","Rate (%) 2","Interest ($) 1","Additional Comments, if any"]
[1,"CIBC Bank Loan (1)","CIBC","Third-Party","Variable Rate","2007-06-01",8.75,1758989.32,0.03,{"$f":"H17*I17/12*10","v":43974.733000000007},"Non-revolving Demand Installment Loan - Fixed Principle plus interest payments"]
[2,"CIBC Bank Loan (1)","CIBC","Third-Party","Fixed Rate","2013-11-01",4,1588490,2.8299999999999999E-2,{"$f":"H18*I18/12*2","v":7492.377833333333},"Converted Loan to Principle and interest blended Monthly payment. Interest rate fixed until Nov 1 2017"]
[3,"CIBC Smart Meter Loan","CIBC","Third-Party","Fixed Rate","2009-07-03",15,622318.55000000005,4.7E-2,{"$f":"H19*I19","v":29248.971850000002},"Principle and interest blended monthly payment. Interest rate fixed until July 3, 2019"]
[4,null,null,null,null,null,null,null,null,0]
[5,null,null,null,null,null,null,null,null,0]
[6,null,null,null,null,null,null,null,null,0]
[7,null,null,null,null,null,null,null,null,0]
[8,null,null,null,null,null,null,null,null,0]
[9,null,null,null,null,null,null,null,null,0]
[10,null,null,null,null,null,null,null,null,0]
[11,null,null,null,null,null,null,null,null,0]
[12,null,null,null,null,null,null,null,null,0]
[]
["Total",null,null,null,null,null,null,{"$f":"SUM(H17:H28)","v":3969797.87},{"$f":"IF(H30=0,\"\",J30/H30)","v":2.0332542191457557E-2},{"$f":"SUM(J17:J28)","v":80716.082683333341}]
[]
["Notes"]
[]
[1,"If financing is in place only part of the year, separately calculate the pro-rated interest in the year and input in the cell."]
[2,"Input actual or deemed long-term debt rate in accordance with the guidelines in The Report of the Board on the Cost of Capital for Ontario's Regulated Utilities, issued December 11, 2009, or with any subsequent update issued by the Board."]
[3,"Add more lines above row 12 if necessary."]
[]
[null,null,null,"Year",2014]
[]
["Row","Description","Lender","Affiliated or Third-Party Debt?","Fixed or Variable-Rate?","Start Date","Term              (years)","Principal                         ($)","Rate (%) 2","Interest ($) 1","Additional Comments, if any"]
[1]
[2,"CIBC Bank Loan (1)","CIBC","Third-Party","Fixed Rate","2013-11-01",4,1574028.56,2.8299999999999999E-2,{"$f":"H42*I42","v":44545.008247999998},"Principle and interest blended monthly payment. Interest rate fixed until Nov 1, 2017"]
[3,"CIBC Smart Meter Loan","CIBC","Third-Party","Fixed Rate","2009-07-03",15,580910.14,4.7E-2,{"$f":"H43*I43","v":27302.776580000002},"Principle and interest blended monthly payment. Interest rate fixed until July 3, 2019"]
[4,null,null,null,null,null,null,null,null,0]
[5,null,null,null,null,null,null,null,null,0]
[6,null,null,null,null,null,null,null,null,0]
[7,null,null,null,null,null,null,null,null,0]
[8,null,null,null,null,null,null,null,null,0]
[9,null,null,null,null,null,null,null,null,0]
[10,null,null,null,null,null,null,null,null,0]
[11,null,null,null,null,null,null,null,null,0]
[12,null,null,null,null,null,null,null,null,0]
[]
["Total",null,null,null,null,null,null,{"$f":"SUM(H41:H52)","v":2154938.7000000002},{"$f":"IF(H54=0,\"\",J54/H54)","v":3.3340987763596244E-2},{"$f":"SUM(J41:J52)","v":71847.784828000003}]
[]
[null,null,null,"Year",2015]
[]
["Row","Description","Lender","Affiliated or Third-Party Debt?","Fixed or Variable-Rate?","Start Date","Term              (years)","Principal                         ($)","Rate (%) 2","Interest ($) 1","Additional Comments, if any"]
[1]
[2,"CIBC Bank Loan (1)","CIBC","Third-Party","Fixed Rate","2013-11-01",4,1405926.46,2.8299999999999999E-2,{"$f":"H60*I60","v":39787.718817999994},"Principle and interest blended monthly payment. Interest rate fixed until Nov 1, 2017"]
[3,"CIBC Smart Meter Loan","CIBC","Third-Party","Fixed Rate","2009-07-03",15,537513.06999999995,4.7E-2,{"$f":"H61*I61","v":25263.114289999998},"Principle and interest blended monthly payment. Interest rate fixed until July 3, 2019"]
[4,null,null,null,null,null,null,null,null,0]
[5,null,null,null,null,null,null,null,null,0]
[6,null,null,null,null,null,null,null,null,0]
[7,null,null,null,null,null,null,null,null,0]
[8,null,null,null,null,null,null,null,null,0]
[9,null,null,null,null,null,null,null,null,0]
[10,null,null,null,null,null,null,null,null,0]
[11,null,null,null,null,null,null,null,null,0]
[12,null,null,null,null,null,null,null,null,0]
[]
["Total",null,null,null,null,null,null,{"$f":"SUM(H59:H70)","v":1943439.5299999998},{"$f":"IF(H72=0,\"\",J72/H72)","v":3.3472012946036966E-2},{"$f":"SUM(J59:J70)","v":65050.833107999992}]
[]
[null,null,null,"Year",2016]
[]
["Row","Description","Lender","Affiliated or Third-Party Debt?","Fixed or Variable-Rate?","Start Date","Term              (years)","Principal                         ($)","Rate (%) 2","Interest ($) 1","Additional Comments, if any"]
[1]
[2,"CIBC Bank Loan (1)","CIBC","Third-Party","Fixed Rate","2013-11-01",4,1233044.8700000001,2.8299999999999999E-2,{"$f":"H78*I78","v":34895.169821000003},"Principle and interest blended monthly payment. Interest rate fixed until Nov 1, 2017"]
[3,"CIBC Smart Meter Loan","CIBC","Third-Party","Fixed Rate","2009-07-03",15,492031.84,4.7E-2,{"$f":"H79*I79","v":23125.496480000002},"Principle and interest blended monthly payment. Interest rate fixed until July 3, 2019"]
[4,null,null,null,null,null,null,null,null,0]
[5,null,null,null,null,null,null,null,null,0]
[6,null,null,null,null,null,null,null,null,0]
[7,null,null,null,null,null,null,null,null,0]
[8,null,null,null,null,null,null,null,null,0]
[9,null,null,null,null,null,null,null,null,0]
[10,null,null,null,null,null,null,null,null,0]
[11,null,null,null,null,null,null,null,null,0]
[12,null,null,null,null,null,null,null,null,0]
[]
["Total",null,null,null,null,null,null,{"$f":"SUM(H77:H88)","v":1725076.7100000002},{"$f":"IF(H90=0,\"\",J90/H90)","v":3.3633673195321269E-2},{"$f":"SUM(J77:J88)","v":58020.666301000005}]
[]
[null,null,null,"Year",2017]
[]
["Row","Description","Lender","Affiliated or Third-Party Debt?","Fixed or Variable-Rate?","Start Date","Term              (years)","Principal                         ($)","Rate (%) 2","Interest ($) 1","Additional Comments, if any"]
[1]
[2,"CIBC Bank Loan (1)","CIBC","Third-Party","Fixed Rate","2013-11-01",4,1040801.6,2.8299999999999999E-2,{"$f":"H96*I96","v":29454.685279999998},"Principle and interest blended monthly payment. Interest rate fixed until Nov 1, 2017"]
[3,"CIBC Smart Meter Loan","CIBC","Third-Party","Fixed Rate","2009-07-03",15,440292.32,4.7E-2,{"$f":"H97*I97","v":20693.73904},"Principle and interest blended monthly payment. Interest rate fixed until July 3, 2019"]
[4,"Long Term Load Transfer Elimination - Purchase of Hydro One Assets","CIBC","Third-Party","Variable Rate","2017-07-01",10,147842,2.7E-2,{"$f":"H98*I98/12*7","v":2328.5115000000001},"Non-revolving deman loan, set principle plus interest of Prime"]
[5,null,null,null,null,null,null,null,null,0]
[6,null,null,null,null,null,null,null,null,0]
[7,null,null,null,null,null,null,null,null,0]
[8,null,null,null,null,null,null,null,null,0]
[9,null,null,null,null,null,null,null,null,0]
[10,null,null,null,null,null,null,null,null,0]
[11,null,null,null,null,null,null,null,null,0]
[12,null,null,null,null,null,null,null,null,0]
[]
["Total",null,null,null,null,null,null,{"$f":"SUM(H95:H106)","v":1628935.92},{"$f":"IF(H108=0,\"\",J108/H108)","v":3.22154697282383E-2},{"$f":"SUM(J95:J106)","v":52476.935819999999}]
[]
[null,null,null,"Year",2018]
[]
["Row","Description","Lender","Affiliated or Third-Party Debt?","Fixed or Variable-Rate?","Start Date","Term              (years)","Principal                         ($)","Rate (%) 2","Interest ($) 1","Additional Comments, if any"]
[1]
[2,"CIBC Bank Loan (1)","CIBC","Third-Party","Fixed Rate","2013-11-01",4,857412,2.8299999999999999E-2,{"$f":"H114*I114","v":24264.759599999998},"Principle and interest blended monthly payment. Interest rate fixed until Nov 1, 2017"]
[3,"CIBC Smart Meter Loan","CIBC","Third-Party","Fixed Rate","2009-07-03",15,390142,4.7E-2,{"$f":"H115*I115","v":18336.673999999999},"Principle and interest blended monthly payment. Interest rate fixed until July 3, 2019"]
[4,"Long Term Load Transfer Elimination - Purchase of Hydro One Assets","CIBC","Third-Party","Variable Rate","2017-07-01",10,136754,2.7E-2,{"$f":"H116*I116","v":3692.3580000000002},"Non-revolving deman loan, set principle plus interest of Prime"]
[5,"Line Truck Financing","Key Equipment Financing","Third-Party","Fixed Rate","2018-01-01",6,345788,5.8999999999999997E-2,{"$f":"H117*I117","v":20401.491999999998},"Financing required for the purchase of line truck"]
[6,null,null,null,null,null,null,null,null,0]
[7,null,null,null,null,null,null,null,null,0]
[8,null,null,null,null,null,null,null,null,0]
[9,null,null,null,null,null,null,null,null,0]
[10,null,null,null,null,null,null,null,null,0]
[11,null,null,null,null,null,null,null,null,0]
[12,null,null,null,null,null,null,null,null,0]
[]
["Total",null,null,null,null,null,null,{"$f":"SUM(H113:H124)","v":1730096},{"$f":"IF(H126=0,\"\",J126/H126)","v":3.8550047858615932E-2},{"$f":"SUM(J113:J124)","v":66695.283599999995}]

{"sheet":"App.2-Q_Cost of Serv. Emb. Dx","index":34,"n_rows":60,"n_cols":7,"rows_kept":60,"cut":false,"hidden":false,"merged":[[6,6,6,7],[8,0,8,6],[9,0,9,6],[15,0,15,1],[15,2,15,3],[53,3,54,3],[9,7,9,11],[12,0,12,6],[11,0,11,6],[58,3,59,3],[58,4,59,4],[53,4,54,4]]}
[null,null,null,null,null,"File Number:",{"$f":"EBNUMBER","v":"EB-2017-0073"}]
[null,null,null,null,null,"Exhibit:"]
[null,null,null,null,null,"Tab:"]
[null,null,null,null,null,"Schedule:"]
[null,null,null,null,null,"Page:"]
[]
[null,null,null,null,null,"Date:","2017-08-28"]
[]
["Appendix 2-Q"]
["Cost of Serving Embedded Distributor(s) "]
[]
["To be completed by Host Distributors ONLY"]
["(Not required if Host Distributor has an Embedded Distributor rate class, i.e. a separate row on Sheet 11 of the RRWF.)"]
[]
[]
["Proposed Rate Class for Billing Embedded Distributor(s)"]
[]
["Host's Distribution Facilities used by Embedded Distributor(s)"]
[]
["(1)","(2)","(3)","(4)","(5)","(6) = '(3) + (4)"]
["Asset Class","Total OM&A costs asociated with asset class ","Original cost of asset class ","Accumulated amortization of asset class","Annual amortization of asset class","Net Book Value of asset class"]
["Totals for Host Distributor:","($)","($)","($)","($)"]
["Distribution Stations",null,null,null,null,{"$f":"C23+D23","v":0}]
["Low Voltage Line",null,null,null,null,0]
["LV Line category # 2 (if applcable)",null,null,null,null,0]
["TS (owned by host)",null,null,null,null,0]
["add rows if necessary... ",null,null,null,null,0]
[null,null,null,null,null,0]
[null,null,null,null,null,0]
[]
["(1)","(7)","(8)","(9)","(10)","(11)"]
[{"$f":"A21","v":"Asset Class"},"Total line length or station capacity in asset class","Line length or capacity required to provide LV service to Embedded Distributor(s)","Annual total demand on station/line providing LV services (sum of 12 monthly peaks)","Annual billed Embedded Distributor demand on station/line providing LV services","Embedded Distributor(s)' Responsibility Share "]
["Embedded Distributor's share:","kW or kVa; km","kW or kVA; km","kW or kVA","kW or kVA","percent"]
["Distribution Stations",null,null,null,null,{"$f":"IF(D34=0,0,(C34/B34)*(E34/D34))","v":0}]
["Low Voltage Line",null,null,null,null,{"$f":"IF(D35=0,0,(C35/B35)*(E35/D35))","v":0}]
["LV Line # 2 (if applicable) ",null,null,null,null,{"$f":"IF(D36=0,0,(C36/B36)*(E36/D36))","v":0}]
["TS (owned by host)",null,null,null,null,{"$f":"IF(D37=0,0,(C37/B37)*(E37/D37))","v":0}]
["add rows if necessary ",null,null,null,null,{"$f":"IF(D38=0,0,(C38/B38)*(E38/D38))","v":0}]
[]
["(1)","(12)","(12a)","(13)","(14)","(15)","(16)"]
[{"$f":"A32","v":"Asset Class"},"Return on Assets used to Provide LV services","Taxes/PILs","Annual amortization on assets used to provide LV services","OM&A costs with burden associated with assets used to provide LV services","Total annual cost associated with assets used to provide LV services","Monthly cost associated with the delivery of LV services"]
[null,"($)","($)","($)","($)","($)","$/kW or $/kVA"]
["Distribution Stations",{"$f":"E$54*(F23+B23*E$59)*F34","v":0},{"$f":"(B43-(B$54*C$54*F34*(F23+B23*E57)+B$55*C$55*F34*(F23+B23*E$57)))*E$57/(1-E$57)","v":0},{"$f":"E23*F34","v":0},{"$f":"B23*F34","v":0},{"$f":"SUM(B43:E43)","v":0},{"$f":"IF(E34=0,0,(D43/E34))","v":0}]
["Low Voltage Line",{"$f":"E$54*(F24+B24*E$59)*F35","v":0},{"$f":"(B44-(B$54*C$54*F35*(F24+B24*E58)+B$55*C$55*F35*(F24+B24*E58)))*E$57/(1-E$57)","v":0},{"$f":"E24*F35","v":0},{"$f":"B24*F35","v":0},{"$f":"SUM(B44:E44)","v":0},{"$f":"IF(E35=0,0,(D44/E35))","v":0}]
["LV Line # 2 (if applicable) ",{"$f":"E$54*(F25+B25*E$59)*F36","v":0},{"$f":"(B45-(B$54*C$54*F36*(F25+B25*E59)+B$55*C$55*F36*(F25+B25*E$59)))*E$57/(1-E$57)","v":0},{"$f":"E25*F36","v":0},{"$f":"B25*F36","v":0},{"$f":"SUM(B45:E45)","v":0},{"$f":"IF(E36=0,0,(D45/E36))","v":0}]
["TS (owned by host)",{"$f":"E$54*(F26+B26*E$59)*F37","v":0},{"$f":"(B46-(B$54*C$54*F37*(F26+B26*E60)+B$55*C$55*F37*(F26+B26*E60)))*E$57/(1-E$57)","v":0},{"$f":"E26*F37","v":0},{"$f":"B26*F37","v":0},{"$f":"SUM(B46:E46)","v":0},{"$f":"IF(E37=0,0,(D46/E37))","v":0}]
["add rows if necessary ",{"$f":"E$54*(F27+B27*E$59)*F38","v":0},{"$f":"(B47-(B$54*C$54*F38*(F27+B27*I61)+B$55*C$55*F38*(F27+B27*I61)))*E$57/(1-E$57)","v":0},{"$f":"E27*F38","v":0},{"$f":"B27*F38","v":0},{"$f":"SUM(B47:E47)","v":0},{"$f":"IF(E38=0,0,(D47/E38))","v":0}]
[]
["Total",null,null,null,null,{"$f":"SUM(F43:F47)","v":0},{"$f":"SUM(G43:G47)","v":0}]
[]
["(17)","(18)","(19)","(20)","(21)"]
[null,"Capital Structure","Cost Rate"]
[null,"(%)","(%)",null,"(%)"]
["Long-Term Debt",null,null,"Weighted Average Cost of Capital",{"$f":"IF(B60=0%,0,SUMPRODUCT(B54:B58,C54:C58)/B60)","v":0}]
["Short-term Debt"]
[]
["Common Equity",null,null,"Tax/PILs Rate"]
["Preferred Shares"]
[null,null,null,"Working Capital Allowance Factor"]
["Total",{"$f":"SUM(B54:B58)","v":0}]

{"sheet":"App.2-R_Loss Factors","index":35,"n_rows":70,"n_cols":9,"rows_kept":70,"cut":false,"hidden":false,"merged":[[6,8,6,9],[8,1,8,8],[9,1,9,8],[10,1,10,8],[12,1,13,2],[12,3,12,7],[12,8,13,8],[14,2,14,8],[23,2,23,8],[25,2,25,8],[52,2,53,8],[34,2,37,8],[41,2,43,8],[45,2,48,8],[55,2,56,8],[58,2,58,8],[30,2,32,8],[68,2,68,8],[60,2,60,8],[62,2,62,8],[64,2,66,7],[50,2,50,8]]}
[null,null,null,null,null,null,null,"File Number:",{"$f":"EBNUMBER","v":"EB-2017-0073"}]
[null,null,null,null,null,null,null,"Exhibit:",8]
[null,null,null,null,null,null,null,"Tab:"]
[null,null,null,null,null,null,null,"Schedule:"]
[null,null,null,null,null,null,null,"Page:"]
[]
[null,null,null,null,null,null,null,"Date:","2017-08-28"]
[]
[null,"Appendix 2-R"]
[null,"Loss Factors"]
[]
[]
[null,null,null,"Historical Years",null,null,null,null,"5-Year Average"]
[null,null,null,{"$f":"IF(ISBLANK('LDC Info'!E26-5), \"Year 5\", 'LDC Info'!E26-5)","v":2012},{"$f":"IF(ISBLANK('LDC Info'!E26-4), \"Year 5\", 'LDC Info'!E26-4)","v":2013},{"$f":"IF(ISBLANK('LDC Info'!E26-3), \"Year 5\", 'LDC Info'!E26-3)","v":2014},{"$f":"IF(ISBLANK('LDC Info'!E26-2), \"Year 5\", 'LDC Info'!E26-2)","v":2015},{"$f":"IF(ISBLANK('LDC Info'!E26-1), \"Year 5\", 'LDC Info'!E26-1)","v":2016}]
[null,null,"Losses Within Distributor's System"]
[null,"A(1)","\"Wholesale\" kWh delivered to distributor (higher value)",75859029,87948723,89786000,83643508,75653709,{"$f":"IF(SUM(D16:H16)=0,0,AVERAGE(D16:H16))","v":82578193.799999997}]
[null,"A(2)","\"Wholesale\" kWh delivered to distributor (lower value)",75601634,87692323,89519317,83393450,75446075,{"$f":"IF(SUM(D17:H17)=0,0,AVERAGE(D17:H17))","v":82330559.799999997}]
[null,"B","Portion of \"Wholesale\" kWh delivered to distributor for its Large Use Customer(s)",null,null,null,null,null,{"$f":"IF(SUM(D18:H18)=0,0,AVERAGE(D18:H18))","v":0}]
[null,"C","Net \"Wholesale\" kWh delivered to distributor  = A(2) - B",{"$f":"D17-D18","v":75601634},87692323,89519317,83393450,75446075,82330559.799999997]
[null,"D","\"Retail\" kWh delivered by distributor",71922866,83168941,85548133,79338527,70815698,{"$f":"IF(SUM(D20:H20)=0,0,AVERAGE(D20:H20))","v":78158833}]
[null,"E","Portion of \"Retail\" kWh delivered by distributor to its Large Use Customer(s)",null,null,null,null,null,{"$f":"IF(SUM(D21:H21)=0,0,AVERAGE(D21:H21))","v":0}]
[null,"F","Net \"Retail\" kWh delivered by distributor = D - E",{"$f":"D20-D21","v":71922866},83168941,85548133,79338527,70815698,78158833]
[null,"G","Loss Factor in Distributor's system = C / F",{"$f":"IF(D22=0,\"\",D19/D22)","v":1.0511487959893033},1.0543878753968985,1.0464204636704346,1.0511091288599295,1.0653863074257914,1.0533749883394496]
[null,null,"Losses Upstream of Distributor's System"]
[null,"H","Supply Facilities Loss Factor",1.034,1.034,1.034,1.034,1.034,{"$f":"IF(SUM(D25:H25)=0,0,AVERAGE(D25:H25))","v":1.034}]
[null,null,"Total Losses"]
[null,"I","Total Loss Factor = G x H",{"$f":"IF(D23=\"\",\"\",D23*D25)","v":1.0868878550529397},1.090237063160393,1.0819987594352294,1.0868468392411672,1.1016094418782685,1.0891897379429909]
[]
[null,"Notes:"]
[]
[null,"A(1)","If directly connected to the IESO-controlled grid, kWh pertains to the virtual meter on the primary or high voltage side of the transformer at the interface with the transmission grid.  This corresponds to the \"With Losses\" kWh value provided by the IESO's MV-WEB.  It is the higher of the two values provided by MV-WEB."]
[]
[]
[]
[null,null,"If fully embedded within a host distributor, kWh pertains to the virtual meter on the primary or high voltage side of the transformer, at the interface between the host distributor and the transmission grid.  For example, if the host distributor is Hydro One Networks Inc., kWh from the Hydro One Networks' invoice corresponding to \"Total kWh w Losses\" should be reported.  This corresponds to the higher of the two kWh values provided in Hydro One Networks' invoice."]
[]
[]
[]
[]
[null,null,"If partially embedded, kWh pertains to the sum of the above."]
[]
[null,"A(2)","If directly connected to the IESO-controlled grid, kWh pertains to a metering installation on the secondary or low voltage side of the transformer at the interface with the transmission grid.  This corresponds to the \"Without Losses\" kWh value provided by the IESO's MV-WEB.  It is the lower of the two kWh values provided by MV-WEB."]
[]
[]
[]
[null,null,"If fully embedded with the host distributor, kWh pertains to a metering installation on the secondary or low voltage side of the transformer at the interface between the embedded distributor and the host distributor.  For example, if the host distributor is Hydro One Networks Inc., kWh from the Hydro One Networks' invoice corresponding to \"Total kWh\" should be reported.  This corresponds to the lower of the two kWh values provided in Hydro One Networks' invoice."]
[]
[]
[]
[]
[null,null,"If partially embedded, kWh pertains to the sum of the above."]
[]
[null,null,"Additionally, kWh pertaining to distributed generation directly connected to the distributor's own distribution network should be included in A(2)."]
[]
[]
[null,"B","If a Large Use Customer is metered on the secondary or low voltage side of the transformer, the default loss is 1%                         (i.e., B = 1.01 X E)."]
[]
[]
[null,"D","kWh corresponding to D should equal metered or estimated kWh at the customer’s delivery point."]
[]
[null,"G and I","These loss factors pertain to secondary-metered customers with demand less than 5,000 kW."]
[]
[null,"H","If directly connected to the IESO-controlled grid, SFLF = 1.0045."]
[]
[null,null,"If fully embedded within a host distributor, SFLF = loss factor re losses in transformer at grid interface X loss factor re losses in host distributor's system.  If the host distributor is Hydro One Networks Inc., SFLF = 1.0060 X 1.0278 = 1.0340. If partially embedded, SFLF should be calculated as the weighted average of above."]
[]
[]
[]
[null,null,"Distributors that wish to propose a different SFLF should provide appropriate justification for any such proposal including supporting"]
[null,null,"calculations and any other relevant material."]

{"sheet":"App.2-S_Stranded Meters","index":36,"n_rows":93,"n_cols":8,"rows_kept":93,"cut":false,"hidden":false,"merged":[[92,0,95,7],[85,1,87,7],[89,1,90,7],[70,1,71,7],[77,1,79,7],[81,1,83,7],[73,1,75,7],[63,2,65,7],[67,0,68,7],[38,1,39,7],[41,1,43,7],[45,1,48,7],[50,1,53,7],[58,2,61,7],[8,0,8,7],[9,0,9,7],[30,0,33,7],[35,0,36,7],[55,2,56,7]]}
[null,null,null,null,null,null,"File Number:",{"$f":"EBNUMBER","v":"EB-2017-0073"}]
[null,null,null,null,null,null,"Exhibit:"]
[null,null,null,null,null,null,"Tab:"]
[null,null,null,null,null,null,"Schedule:"]
[null,null,null,null,null,null,"Page:"]
[]
[null,null,null,null,null,null,"Date:"]
[]
["Appendix 2-S"]
["Stranded Meter Treatment"]
[]
["Year","Notes","Gross Asset Value","Accumulated Amortization","Contributed Capital (Net of Amortization)","Net Asset","Proceeds on Disposition","Residual Net Book Value"]
[null,null,"(A)","(B)","(C)","(D ) = (A) - (B) - (C)","(E)","(F) = (D) - (E)"]
[2006,null,null,null,null,{"$f":"C14-D14-E14","v":0},null,{"$f":"F14-G14","v":0}]
[2007,null,null,null,null,0,null,0]
[2008,null,null,null,null,0,null,0]
[2009,null,null,null,null,0,null,0]
[2010,null,null,null,null,0,null,0]
[2011,null,null,null,null,0,null,0]
[2012,null,null,null,null,0,null,0]
[2013,null,null,null,null,{"$f":"C21-D21-E21","v":0},null,{"$f":"F21-G21","v":0}]
[2014,null,null,null,null,{"$f":"C22-D22-E22","v":0},null,{"$f":"F22-G22","v":0}]
[2015,null,null,null,null,{"$f":"C23-D23-E23","v":0},null,{"$f":"F23-G23","v":0}]
[2016,null,null,null,null,{"$f":"C24-D24-E24","v":0},null,{"$f":"F24-G24","v":0}]
[2017,"(1)",null,null,null,0,null,0]
[]
["Notes:"]
[]
["(1)","For 2017, please indicate whether the amounts provided are on a forecast or actual basis."]
[]
["Some distributors have transferred the cost of stranded meters from Account 1860 - Meters to \"Sub-account Stranded Meter Costs of Account 1555\", while in some cases distributors have left these costs in Account 1860.  Depending on which treatment the applicant has chosen. please provide the information under either of the two scenarios (A and B below), as applicable."]
[]
[]
[]
[]
["Scenario A:  If the stranded meter costs were transferred to \"Sub-account Stranded Meter Costs\" of Account 1555, the above table should be completed and the following information should be provided in Exhibit 9."]
[]
[]
[1,"A description of the accounting treatment followed by the applicant on stranded meter costs for financial accounting and reporting purposes."]
[]
[]
[2,"The amount of the pooled residual net book value of the removed from service stranded meters, less any contributed capital (net of accumulated amortization), and less any net proceeds from sales, which were transferred to this sub-account as of December 31, 2010."]
[]
[]
[]
[3,"A statement as to whether or not, since transferring the removed stranded meter costs to the sub-account, the recording of depreciation expenses was continued in order to reduce the net book value through accumulated depreciation.  If so, the total depreciation expense amount for the period from the time the costs for the stranded meters were transferred to the sub-account to December 31, 2010 should be provided."]
[]
[]
[]
[]
[null,"If no depreciation expenses were recorded to reduce the net book value of stranded meter costs through accumulated depreciation, the total depreciation expense amount that would have been applicable from the time that the stranded meter costs were transferred to the sub-account of Account 1555 to December 31, 2010 should be provided.  In addition, the following information should be provided:"]
[]
[]
[]
[]
[null,"a)","Whether or not carrying charges were recorded for the stranded meter cost balances in the sub-account, and if so, the total carrying charges recorded to December 31, 2010."]
[]
[]
[null,"b)","The estimated amount of the pooled residual net book value of the removed from service meters, less any net proceeds from sales and contributed capital, at the time when the smart meters will have been fully deployed (e.g., as of December 31, 2010).  If the smart meters have been fully deployed, the actual amount should be provided."]
[]
[]
[]
[]
[null,"c)","A description as to how the applicant intends to recover in rates the remaining costs for stranded meters, including the proposed accounting treatment, the proposed disposition period, and the associated bill impacts."]
[]
[]
[]
["Scenario B:  If the stranded meter costs remained recorded in Account 1860, the above table should be completed and the following information should be provided in Exhibit 9:"]
[]
[]
[1,"A description of the accounting treatment followed by the applicant on stranded meter costs for financial accounting and reporting purposes."]
[]
[]
[2,"The amount of the pooled residual net book value of the removed from service stranded meters, less any contributed capital (net of accumulated amortization), and less any net proceeds from sales, as of December 31, 2010."]
[]
[]
[]
[3,"A statement as to whether or not the recording of depreciation expenses continued in order to reduce the net book value through accumulated depreciation.  If so, provision of the total (cumulative) depreciation expense for the period from the time that the meters became stranded to December 31, 2010."]
[]
[]
[]
[4,"If no depreciation expenses were recorded to reduce the net book value of stranded meters through accumulated depreciation, the total (cumulative) depreciation expense amount that would have been applicable for the period from the time that the meters became stranded to December 31, 2010."]
[]
[]
[]
[5,"The estimated amount of the pooled residual net book value of the removed from service meters, less any net proceeds from sales and contributed capital, at the time when smart meters will have been fully deployed.  If the smart meters have been fully deployed, please provide the actual amount."]
[]
[]
[]
[6,"A description as to how the applicant intends to recover in rates the costs for stranded meters, including the proposed accounting treatment, the proposed disposition period and the associated bill impacts."]
[]
[]
["Distributors should also provide the Net Book Value per class of meter as of December 31, 2010 as well as the number of meters that were removed / stranded.  In preparing this information, distributors should review the Board's letter of January 16, 2007 Stranded Meter Costs Related to the Installation of Smart Meters which stated that records were to be kept of the type and number of each meter to support the stranded meter costs."]

{"sheet":"App.2-Y_MIFRS Summary Impacts","index":37,"n_rows":37,"n_cols":9,"rows_kept":37,"cut":false,"hidden":false,"merged":[[6,8,6,9],[36,0,36,8],[29,0,29,2],[29,6,29,8],[30,0,30,2],[30,6,30,8],[31,0,31,2],[31,6,31,8],[32,0,32,2],[32,6,32,8],[33,0,33,2],[33,6,33,8],[34,0,34,2],[34,6,34,8],[26,0,26,2],[26,6,26,8],[27,0,27,2],[27,6,27,8],[28,0,28,2],[28,6,28,8],[23,0,23,2],[23,6,23,8],[24,0,24,2],[24,6,24,8],[25,0,25,2],[25,6,25,8],[20,0,20,2],[20,6,20,8],[21,0,21,2],[21,6,21,8],[22,0,22,2],[22,3,22,5],[22,6,22,8],[17,0,17,2],[17,6,17,8],[18,0,18,2],[18,6,18,8],[19,0,19,2],[19,6,19,8],[8,0,8,8],[9,0,9,8],[10,0,10,8],[14,0,16,2],[14,6,14,8],[15,6,15,8]]}
[null,null,null,null,null,null,null,"File Number:",{"$f":"EBNUMBER","v":"EB-2017-0073"}]
[null,null,null,null,null,null,null,"Exhibit:",9]
[null,null,null,null,null,null,null,"Tab:"]
[null,null,null,null,null,null,null,"Schedule:"]
[null,null,null,null,null,null,null,"Page:"]
[]
[null,null,null,null,null,null,null,"Date:","2017-08-28"]
[]
["Appendix 2-Y"]
["Summary of Impacts to Revenue Requirement"]
["from Transition to MIFRS"]
[]
[]
[]
["Revenue Requirement Component",null,null,{"$f":"TestYear","v":2018},{"$f":"TestYear","v":2018},"Difference","Reasons why the revenue requirement "]
[null,null,null,"MIFRS","CGAAP 1",null,"component is different under MIFRS"]
[]
["Closing NBV 2017",null,null,5140135,5193104,{"$f":"+D18-E18","v":-52969},"The need to dispose of pooled assets under IFRS"]
["Closing NBV 2018",null,null,5426730,5429980,{"$f":"+D19-E19","v":-3250}]
["Average NBV",null,null,{"$f":"(D18+D19)/2","v":5283432.5},{"$f":"(E18+E19)/2","v":5311542},{"$f":"+D20-E20","v":-28109.5}]
["Working Capital",null,null,null,null,{"$f":"+D21-E21","v":0}]
["Rate Base",null,null,{"$f":"SUM(D20:D21)","v":5283432.5},{"$f":"SUM(E20:E21)","v":5311542},{"$f":"+D22-E22","v":-28109.5}]
[null,null,null,null,null,{"$f":"+D23-E23","v":0}]
["Return on Rate Base",null,null,null,null,0]
[null,null,null,null,null,0]
["OM&A",null,null,null,null,0]
["Depreciation",null,null,null,null,0]
["PILs or Income Taxes",null,null,null,null,0]
[null,null,null,null,null,0]
["Less: Revenue Offsets",null,null,null,null,0]
[null,null,null,null,null,0]
[null,null,null,null,null,0]
[null,null,null,null,null,0]
["Insert description of additional item(s) and new rows if needed.",null,null,null,null,0]
["Total Base Revenue Requirement",null,null,{"$f":"SUM(D24:D34)","v":0},{"$f":"SUM(E24:E34)","v":0},{"$f":"SUM(F24:F34)","v":0}]
[]
["1.  Applicants must provide a summary of the dollar impacts of MIFRS to each component of the revenue requirement (e.g. rate base, operating costs, etc.), including the overall impact on the proposed revenue requirement.  Accordingly, the applicants must identify financial differences and resulting revenue requirement impacts arising from the adoption of  MIFRS as compared to CGAAP.  If the applicant is reflecting the changes in capitalization and depreciation policies for the first time in a rebasing application, then the comparison in the above table should be between MIFRS and CGAAP before the change in accounting policies. If the applicant changed capitalization and depreciation policies and reflected these changes in a previous rebasing application, the comparison in the above table should be between MIFRS and CGAAP after the change in accounting policies.  "]

{"sheet":"Sheet19","index":38,"n_rows":72,"n_cols":9,"rows_kept":72,"cut":false,"hidden":true,"merged":[]}
[null,"CGAAP","CGAAP","CGAAP","MIFRS","USGAAP","ASPE","ASPE","ASPE"]
[null,"N/A",2012,2013,null,null,"N/A",2012,2013]
["LDC Info","x","x","x","x","x","x","x","x"]
["Table of Contents","x","x","x","x","x","x","x","x"]
["COS Flowchart","x","x","x","x","x","x","x","x"]
["List of Key References","x","x","x","x","x","x","x","x"]
["App.2-AA_Capital Projects","x","x","x","x","x","x","x","x"]
["App.2-AB_Capital Expenditures","x","x","x","x","x","x","x","x"]
["App.2-BA1_Fix Asset Cont.CGAAP","x","x","x","n","x","x","x","x"]
["App.2-BA2_Fix Asset Cont.MIFRS","n","n","n","x","n","n","n","n"]
["Appendix 2-BB Service Life Comp","x","x","x","x","x","x","x","x"]
["Instruction for App. 2-C MIFRS","n","n","n","x","n","n","n","n"]
["App.2-CA_CGAAP_DepExp_2011","n","n","n","x","n","n","n","n"]
["App.2-CB_MIFRS_DepExp_2011","n","n","n","x","n","n","n","n"]
["App.2-CC_MIFRS_DepExp_2012","n","n","n","x","n","n","n","n"]
["App.2-CD_MIFRS_DepExp_2013","n","n","n","x","n","n","n","n"]
["App.2-CE_MIFRS_DepExp_2014","n","n","n","x","n","n","n","n"]
["App.2-CF_CGAAP_DepExp_2012","n","n","n","x","n","n","n","n"]
["App.2-CG_MIFRS_DepExp_2012","n","n","n","x","n","n","n","n"]
["App.2-CH_MIFRS_DepExp_2013","n","n","n","x","n","n","n","n"]
["App.2-CI_MIFRS_DepExp_2014","n","n","n","x","n","n","n","n"]
["App.2-CJ_CGAAP_DepExp_2012","n","n","n","x","n","n","n","n"]
["App.2-CK_CGAAP_DepExp_2013","n","n","n","x","n","n","n","n"]
["App.2-CL_MIFRS_DepExp_2013","n","n","n","x","n","n","n","n"]
["App.2-CM_MIFRS_DepExp_2014","n","n","n","x","n","n","n","n"]
["Instruction for App. 2-C CGAAP","x","x","x","n","n","x","x","x"]
["App.2-CN_OldCGAAP_DepExp_2012","x","x","n","n","n","x","x","n"]
["App.2-CO_NewCGAAP_DepExp_2012","x","x","n","n","n","x","x","n"]
["App.2-CP_NewCGAAP_DepExp_2013","x","x","n","n","n","x","x","n"]
["App.2-CQ NewCGAAP_DepExp_2014","x","x","n","n","n","x","x","n"]
["App.2-CR_OldCGAAP_DepExp_2012","x","n","x","n","n","x","n","x"]
["App.2-CS_OldCGAAP_DepExp_2013","x","n","x","n","n","x","n","x"]
["App.2-CT_NewCGAAP_DepExp_2013","x","n","x","n","n","x","n","x"]
["App.2-CU_NewCGAAP_DepExp_2014","x","n","x","n","n","x","n","x"]
["App.2-CV_USGAAP_DepExp","n","n","n","n","x","n","n","n"]
["App.2-DA_Overhead","n","n","n","x","n","n","n","n"]
["App.2-DB_Overhead","x","x","x","n","n","x","x","x"]
["App.2-EA_PP&E Deferral Account","n","n","n","x","x","n","n","n"]
["App.2-EB_PP&E Deferral Account","n","n","n","x","x","n","n","n"]
["App.2-EC_PP&E Deferral Account","n","n","n","x","x","n","n","n"]
["App.2-ED_Account 1576 (2012)","x","x","n","x","x","x","x","n"]
["App.2-EE_Account 1576 (2013)","x","n","x","x","x","x","n","x"]
["App.2-FA Proposed REG Invest.","o","o","o","o","o","o","o","o"]
["App.2-FB Calc of REG Improvemnt","o","o","o","o","o","o","o","o"]
["App.2-FC Calc of REG Expansion","o","o","o","o","o","o","o","o"]
["App.2-G SQI","x","x","x","x","x","x","x","x"]
["App.2-H_Other_Oper_Rev","x","x","x","x","x","x","x","x"]
["App.2-I LF_CDM_WF","x","x","x","x","x","x","x","x"]
["App.2-JA_OM&A_Summary_Analys","x","x","x","x","x","x","x","x"]
["App.2-JB_OM&A_Cost _Drivers","x","x","x","x","x","x","x","x"]
["App.2-JC_OMA Programs","x","x","x","x","x","x","x","x"]
["App.2-K_Employee Costs","x","x","x","x","x","x","x","x"]
["App.2-L_OM&A_per_Cust_FTEE","x","x","x","x","x","x","x","x"]
["App.2-M_Regulatory_Costs","x","x","x","x","x","x","x","x"]
["App.2-N_Corp_Cost_Allocation","x","x","x","x","x","x","x","x"]
["App.2-OA Capital Structure","x","x","x","x","x","x","x","x"]
["App.2-OB_Debt Instruments","x","x","x","x","x","x","x","x"]
["App.2-P_Cost_Allocation","x","x","x","x","x","x","x","x"]
["App.2-Q_Cost of Serv. Emb. Dx","e","e","e","e","e","e","e","e"]
["App.2-R_Loss Factors","x","x","x","x","x","x","x","x"]
["App.2-S_Stranded Meters","x","x","x","x","x","x","x","x"]
["App.2-TA_1592_Tax_Variance","x","x","x","x","x","x","x","x"]
["App.2-TB_1592_HST-OVAT","x","x","x","x","x","x","x","x"]
["App.2-U_IFRS Transition Costs","x","x","x","x","x","x","x","x"]
["App.2-V_Rev_Reconciliation","x","x","x","x","x","x","x","x"]
["App.2-W_Bill Impacts","x","x","x","x","x","x","x","x"]
["App.2-YA_MIFRS Summary Impacts","n","n","n","x","n","n","n","n"]
["App. 2-YB_CGAAP Summary Impacts","x","x","x","n","n","x","x","x"]
["App. 2-Z_Tariff","x","x","x","x","x","x","x","x"]
["lists","n","n","n","n","n","n","n","n"]
["lists2","n","n","n","n","n","n","n","n"]
["Sheet19","n","n","n","n","n","n","n","n"]

{"sheet":"App.2-YA_IFRS Transition Costs","index":39,"n_rows":34,"n_cols":15,"rows_kept":34,"cut":false,"hidden":false,"merged":[[7,14,7,15],[32,1,32,4],[32,5,32,6],[31,1,31,14],[33,1,33,14],[39,0,42,0],[39,1,42,3],[44,0,45,0],[44,1,45,3],[33,0,34,0],[36,0,37,0],[36,1,37,3],[28,0,28,2],[17,0,17,2],[18,0,18,2],[19,0,19,2],[20,0,20,2],[21,0,21,2],[22,0,22,2],[23,0,23,2],[24,0,24,2],[25,0,25,2],[26,0,26,2],[27,0,27,2],[8,0,8,16],[9,0,9,16],[11,0,11,14],[13,11,14,11],[13,14,15,14],[16,0,16,2],[13,0,15,2],[13,13,15,13],[13,10,14,10],[13,12,15,12]]}
[]
[null,null,null,null,null,null,null,null,null,null,null,null,null,"File Number:",{"$f":"EBNUMBER","v":"EB-2017-0073"}]
[null,null,null,null,null,null,null,null,null,null,null,null,null,"Exhibit:",9]
[null,null,null,null,null,null,null,null,null,null,null,null,null,"Tab:"]
[null,null,null,null,null,null,null,null,null,null,null,null,null,"Schedule:"]
[null,null,null,null,null,null,null,null,null,null,null,null,null,"Page:"]
[]
[null,null,null,null,null,null,null,null,null,null,null,null,null,"Date:","2017-08-28"]
["Appendix 2-YA"]
["One-Time Incremental IFRS Transition Costs"]
[]
["The following table should be completed based on the information requested below. An explanation should be provided for any blank entries.  The entries should include one-time incremental IFRS transition costs that are currently included in Account 1508, Other Regulatory Assets, sub-account Deferred IFRS Transition Costs Account, or Account 1508, Other Regulatory Assets, sub-account IFRS Transition Costs Variance Account."]
[]
["Nature of One-Time Incremental IFRS Transition Costs 1",null,null,null,"Audited Actual Costs Incurred","Audited Actual Costs Incurred","Audited Actual Costs Incurred","Audited Actual Costs Incurred","Audited Actual Costs Incurred","Audited Carrying Charges ","Forecasted Costs ","Forecasted Costs ","Carrying Charges January 1, 2017 to December 31, 2017 or April 30, 2018 (As appropriate)","Total Costs and Carrying Charges","Reasons why the costs recorded meet the criteria of one-time IFRS administrative incremental costs"]
[]
[null,null,null,null,2012,2013,2014,2015,"2016 3","To December 31, 2016","2017 3","2018 3"]
["Professional accounting fees",null,null,null,24000,null,null,null,20000,1691.59,null,null,{"$f":"SUM(E17,I17)*0.011/12*16","v":645.33333333333337},{"$f":"SUM(E17:M17)","v":46336.923333333332},"Professional services used to convert to IFRS. Evaluation done in 2011 and 2012 to separate out pooled assets. Actual transition occurred in 2015 with expenses incurred during the audit in 2016"]
["Professional legal fees",null,null,null,null,null,null,null,null,null,null,null,null,0]
["Salaries, wages and benefits of staff added to support the transition to IFRS",null,null,null,null,null,null,null,null,null,null,null,null,0]
["Associated staff training and development costs",null,null,null,null,null,null,null,null,null,null,null,null,0]
["Costs related to system upgrades, or replacements or changes where IFRS was the major reason for conversion",null,null,null,null,null,null,null,null,null,null,null,null,0]
[null,null,null,null,null,null,null,null,null,null,null,null,null,0]
[null,null,null,null,null,null,null,null,null,null,null,null,null,0]
[null,null,null,null,null,null,null,null,null,null,null,null,null,0]
[null,null,null,null,null,null,null,null,null,null,null,null,null,0]
["Amounts, if any, included in previous Board approved rates (amounts should be negative) 2",null,null,null,null,null,null,null,null,null,null,null,null,0]
[null,null,null,null,null,null,null,null,null,null,null,null,null,0]
["Insert description of additional item(s) and new rows if needed.",null,null,null,null,null,null,null,null,null,null,null,null,0]
["Total",null,null,null,{"$f":"SUM(E17:E28)","v":24000},0,null,{"$f":"SUM(H17:H28)","v":0},null,1691.59,null,0,null,{"$f":"SUM(N17:N28)","v":46336.923333333332}]
[]
["Note:"]
[1,"The Deferred IFRS Transition Costs Account and the IFRS Transition Costs Variance Account are exclusively for necessary, incremental transition costs and shall not include ongoing IFRS compliance costs or impacts arising from adopting accounting policy changes that reflect changes in the timing of the recognition of income. The incremental costs in these accounts shall not include costs related to system upgrades, or replacements or changes where IFRS was not the major reason for conversion. In addition, incremental IFRS costs shall not include capital assets or expenditures."]
[2,"If there were any amounts approved in previous Board approved rates, please state the EB #:"]
[3,"Any forecasted One-time costs past 2015 should be fully explained in the application, since distributors were required to adopt IFRS or an alternative accounting standard by January 1, 2015."]

{"sheet":"Sheet1","index":40,"n_rows":0,"n_cols":0,"rows_kept":0,"cut":false,"hidden":false,"merged":[]}