{"text_format":"1","workbook":"xlsx","n_sheets":8,"sheets":["1. Information Sheet","2. 2016 Continuity Schedule","3. Appendix A","4. Billing Determinants","5. Allocation of Balances","5a. GA Allocation Class A","6. Rate Rider Calculations","Summary Sheet"],"not_rendered":{"charts":0,"images":2,"macros":1,"external_links":7,"defined_names":162,"comments":3,"pivot_tables":0},"unopened":[],"bounds":{"document_bytes":16777216,"sheet_cells":100000,"rows_first":2000,"rows_last":500,"rows_between":2000,"halvings":0,"cell_chars":16384,"cell_head_chars":4096},"cells_cut":0,"cells_raw":0,"read":"whole","date_system":"1900"}

{"sheet":"1. Information Sheet","index":0,"n_rows":74,"n_cols":22,"rows_kept":74,"cut":false,"hidden":false,"merged":[[30,2,30,11],[32,2,32,13],[34,2,34,12],[26,1,26,12],[13,5,13,11],[15,5,15,9],[17,5,17,9],[19,5,19,9],[21,5,21,9],[23,5,23,9]]}
[null,null,null,null,null,null,null,null,null,null,null,null,null,null,null,null,null,null,null,null,null,"Algoma Power Inc."]
[null,null,null,null,null,null,null,null,null,null,null,null,null,null,null,null,null,null,null,null,null,"Atikokan Hydro Inc."]
[null,null,null,null,null,null,null,null,null,null,null,null,null,null,null,null,null,null,null,null,null,"Attawapiskat Power Corporation"]
[null,null,null,null,null,null,null,null,null,null,null,null,null,null,null,null,null,null,null,null,null,"Bluewater Power Distribution Corporation"]
[null,null,null,null,null,null,null,null,null,null,null,null,null,null,null,null,null,null,null,null,null,"Brantford Power Inc."]
[null,null,null,null,null,null,null,null,null,null,null,null,null,null,null,null,null,null,null,null,null,"Burlington Hydro Inc."]
{"$rows_left_out":69}
{"sheet":"2. 2016 Continuity Schedule","index":1,"n_rows":104,"n_cols":80,"rows_kept":104,"cut":false,"hidden":false,"merged":[[103,2,103,8],[102,2,102,8],[100,2,100,8],[89,2,89,5],[101,2,101,8],[90,2,90,7],[93,2,93,8],[95,2,95,8],[98,2,98,8],[99,2,99,8],[96,2,96,8],[97,2,97,8],[18,44,18,53],[19,44,21,44],[19,45,21,45],[19,46,21,46],[19,47,21,47],[19,48,21,48],[19,49,21,49],[19,50,21,50],[19,51,21,51],[19,52,21,52],[19,53,21,53],[18,24,18,33],[19,2,21,2],[19,3,21,3],[19,12,21,12],[19,8,21,8],[19,11,21,11],[19,9,21,9],[19,6,21,6],[19,7,21,7],[19,20,21,20],[19,30,21,30],[19,23,21,23],[19,21,21,21],[19,14,21,14],[18,4,18,13],[19,4,21,4],[19,65,21,65],[18,64,18,67],[19,66,21,66],[19,67,21,67],[19,64,21,64],[19,73,21,73],[18,68,18,71],[19,71,21,71],[19,69,21,69],[19,68,21,68],[19,72,21,72],[19,70,21,70],[19,5,21,5],[18,34,18,43],[19,34,21,34],[19,35,21,35],[19,36,21,36],[19,37,21,37],[19,38,21,38],[19,39,21,39],[19,17,21,17],[19,18,21,18],[19,19,21,19],[18,14,18,23],[19,31,21,31],[19,32,21,32],[19,43,21,43],[19,40,21,40],[19,41,21,41],[19,42,21,42],[19,10,21,10],[19,29,21,29],[19,13,21,13],[19,15,21,15],[19,16,21,16],[19,24,21,24],[19,25,21,25],[19,26,21,26],[19,27,21,27],[19,28,21,28],[19,22,21,22],[19,33,21,33],[18,54,18,63],[19,54,21,54],[19,55,21,55],[19,56,21,56],[19,57,21,57],[19,58,21,58],[19,59,21,59],[19,60,21,60],[19,61,21,61],[19,62,21,62],[19,63,21,63]]}
[]
[]
[]
[]
[]
[]
{"$rows_left_out":99}
{"sheet":"3. Appendix A","index":2,"n_rows":69,"n_cols":6,"rows_kept":69,"cut":false,"hidden":false,"merged":[[19,4,21,4],[19,5,21,5],[19,2,21,2],[19,3,21,3],[15,1,15,4]]}
[]
[]
[]
[]
[]
[]
{"$rows_left_out":64}
{"sheet":"4. Billing Determinants","index":3,"n_rows":51,"n_cols":29,"rows_kept":51,"cut":false,"hidden":false,"merged":[[17,11,17,12],[17,14,17,16],[18,19,19,19],[18,20,19,20],[18,21,19,21],[18,22,19,22],[18,28,19,28],[18,23,19,23],[18,24,19,24],[18,25,19,25],[18,26,19,26],[18,27,19,27],[15,1,16,8],[18,3,19,3],[18,8,19,8],[18,14,19,14],[18,18,19,18],[18,16,19,16],[18,17,19,17],[18,15,19,15],[18,9,19,9],[18,10,19,10],[18,11,19,11],[18,12,19,12],[18,13,19,13],[17,4,17,5],[17,6,17,7],[17,9,17,10],[44,0,45,7],[46,0,46,7],[18,5,19,5],[18,4,19,4],[18,2,19,2],[18,1,19,1],[18,6,19,6],[18,7,19,7]]}
[]
[null,false]
[]
[]
[]
[]
{"$rows_left_out":46}
{"sheet":"5. Allocation of Balances","index":4,"n_rows":60,"n_cols":27,"rows_kept":60,"cut":false,"hidden":false,"merged":[[51,1,51,2],[49,1,49,2],[39,1,39,2],[40,1,40,2],[47,1,47,2],[45,1,45,2],[46,1,46,2]]}
[null,null,null,null,null,null,null,null,null,null,null,null,null,null,null,null,null,null,null,null,null,null,null,null,null,null,21]
[null,null,null,null,null,null,null,null,null,null,null,null,null,null,null,null,null,null,null,null,null,null,null,null,null,null,22]
[]
[1,null,null,"Amounts from Sheet 2","Allocator",{"$f":"IF(LEN(TRIM('4. Billing Determinants'!$B21))=0, \"\", UPPER('4. Billing Determinants'!$B21))","v":"RESIDENTIAL"},{"$f":"IF(LEN(TRIM('4. Billing Determinants'!$B22))=0, \"\", '4. Billing Determinants'!$B22)","v":"GENERAL SERVICE LESS THAN 50 KW"},{"$f":"IF(LEN(TRIM('4. Billing Determinants'!$B23))=0, \"\", '4. Billing Determinants'!$B23)","v":"GENERAL SERVICE 50 TO 2,999 KW"},{"$f":"IF(LEN(TRIM('4. Billing Determinants'!$B24))=0, \"\", '4. Billing Determinants'!$B24)","v":"GENERAL SERVICE 3,000 TO 4,999 KW"},{"$f":"IF(LEN(TRIM('4. Billing Determinants'!$B25))=0, \"\", '4. Billing Determinants'!$B25)","v":"UNMETERED SCATTERED LOAD"},{"$f":"IF(LEN(TRIM('4. Billing Determinants'!$B26))=0, \"\", '4. Billing Determinants'!$B26)","v":"SENTINEL LIGHTING"},{"$f":"IF(LEN(TRIM('4. Billing Determinants'!$B27))=0, \"\", '4. Billing Determinants'!$B27)","v":"STREET LIGHTING"},{"$f":"IF(LEN(TRIM('4. Billing Determinants'!$B28))=0, \"\", '4. Billing Determinants'!$B28)","v":""},{"$f":"IF(LEN(TRIM('4. Billing Determinants'!$B29))=0, \"\", '4. Billing Determinants'!$B29)","v":""},{"$f":"IF(LEN(TRIM('4. Billing Determinants'!$B30))=0, \"\", '4. Billing Determinants'!$B30)","v":""},{"$f":"IF(LEN(TRIM('4. Billing Determinants'!$B31))=0, \"\", '4. Billing Determinants'!$B31)","v":""},{"$f":"IF(LEN(TRIM('4. Billing Determinants'!$B32))=0, \"\", '4. Billing Determinants'!$B32)","v":""},{"$f":"IF(LEN(TRIM('4. Billing Determinants'!$B33))=0, \"\", '4. Billing Determinants'!$B33)","v":""},{"$f":"IF(LEN(TRIM('4. Billing Determinants'!$B34))=0, \"\", '4. Billing Determinants'!$B34)","v":""},{"$f":"IF(LEN(TRIM('4. Billing Determinants'!$B35))=0, \"\", '4. Billing Determinants'!$B35)","v":""},{"$f":"IF(LEN(TRIM('4. Billing Determinants'!$B36))=0, \"\", '4. Billing Determinants'!$B36)","v":""},{"$f":"IF(LEN(TRIM('4. Billing Determinants'!$B37))=0, \"\", '4. Billing Determinants'!$B37)","v":""},{"$f":"IF(LEN(TRIM('4. Billing Determinants'!$B38))=0, \"\", '4. Billing Determinants'!$B38)","v":""},{"$f":"IF(LEN(TRIM('4. Billing Determinants'!$B39))=0, \"\", '4. Billing Determinants'!$B39)","v":""},{"$f":"IF(LEN(TRIM('4. Billing Determinants'!$B40))=0, \"\", '4. Billing Determinants'!$B40)","v":""}]
[2,"LV Variance Account",1550,{"$f":"'2. 2016 Continuity Schedule'!BT24","v":341359.13135999988},"kWh",{"$f":"IFERROR(IF(F$4=\"\",0,IF($E5=\"kWh\",VLOOKUP(F$4,'4. Billing Determinants'!$B$19:$R$41,4,0)/'4. Billing Determinants'!$E$41*$D5,IF($E5=\"kW\",VLOOKUP(F$4,'4. Billing Determinants'!$B$19:$R$41,5,0)/'4. Billing Determinants'!$F$41*$D5,IF($E5=\"Non-RPP kWh\",VLOOKUP(F$4,'4. Billing Determinants'!$B$19:$R$41,6,0)/'4. Billing Determinants'!$G$41*$D5,IF($E5=\"Distribution Rev.\",VLOOKUP(F$4,'4. Billing Determinants'!$B$19:$R$41,8,0)/'4. Billing Determinants'!$I$41*$D5, VLOOKUP(F$4,'4. Billing Determinants'!$B$19:$R$41,3,0)/'4. Billing Determinants'!$D$41*$D5))))),0)","v":105971.41792103408},{"$f":"IFERROR(IF(G$4=\"\",0,IF($E5=\"kWh\",VLOOKUP(G$4,'4. Billing Determinants'!$B$19:$R$41,4,0)/'4. Billing Determinants'!$E$41*$D5,IF($E5=\"kW\",VLOOKUP(G$4,'4. Billing Determinants'!$B$19:$R$41,5,0)/'4. Billing Determinants'!$F$41*$D5,IF($E5=\"Non-RPP kWh\",VLOOKUP(G$4,'4. Billing Determinants'!$B$19:$R$41,6,0)/'4. Billing Determinants'!$G$41*$D5,IF($E5=\"Distribution Rev.\",VLOOKUP(G$4,'4. Billing Determinants'!$B$19:$R$41,8,0)/'4. Billing Determinants'!$I$41*$D5, VLOOKUP(G$4,'4. Billing Determinants'!$B$19:$R$41,3,0)/'4. Billing Determinants'!$D$41*$D5))))),0)","v":49435.542250177976},{"$f":"IFERROR(IF(H$4=\"\",0,IF($E5=\"kWh\",VLOOKUP(H$4,'4. Billing Determinants'!$B$19:$R$41,4,0)/'4. Billing Determinants'!$E$41*$D5,IF($E5=\"kW\",VLOOKUP(H$4,'4. Billing Determinants'!$B$19:$R$41,5,0)/'4. Billing Determinants'!$F$41*$D5,IF($E5=\"Non-RPP kWh\",VLOOKUP(H$4,'4. Billing Determinants'!$B$19:$R$41,6,0)/'4. Billing Determinants'!$G$41*$D5,IF($E5=\"Distribution Rev.\",VLOOKUP(H$4,'4. Billing Determinants'!$B$19:$R$41,8,0)/'4. Billing Determinants'!$I$41*$D5, VLOOKUP(H$4,'4. Billing Determinants'!$B$19:$R$41,3,0)/'4. Billing Determinants'!$D$41*$D5))))),0)","v":144958.81828890904},{"$f":"IFERROR(IF(I$4=\"\",0,IF($E5=\"kWh\",VLOOKUP(I$4,'4. Billing Determinants'!$B$19:$R$41,4,0)/'4. Billing Determinants'!$E$41*$D5,IF($E5=\"kW\",VLOOKUP(I$4,'4. Billing Determinants'!$B$19:$R$41,5,0)/'4. Billing Determinants'!$F$41*$D5,IF($E5=\"Non-RPP kWh\",VLOOKUP(I$4,'4. Billing Determinants'!$B$19:$R$41,6,0)/'4. Billing Determinants'!$G$41*$D5,IF($E5=\"Distribution Rev.\",VLOOKUP(I$4,'4. Billing Determinants'!$B$19:$R$41,8,0)/'4. Billing Determinants'!$I$41*$D5, VLOOKUP(I$4,'4. Billing Determinants'!$B$19:$R$41,3,0)/'4. Billing Determinants'!$D$41*$D5))))),0)","v":38232.320082625258},{"$f":"IFERROR(IF(J$4=\"\",0,IF($E5=\"kWh\",VLOOKUP(J$4,'4. Billing Determinants'!$B$19:$R$41,4,0)/'4. Billing Determinants'!$E$41*$D5,IF($E5=\"kW\",VLOOKUP(J$4,'4. Billing Determinants'!$B$19:$R$41,5,0)/'4. Billing Determinants'!$F$41*$D5,IF($E5=\"Non-RPP kWh\",VLOOKUP(J$4,'4. Billing Determinants'!$B$19:$R$41,6,0)/'4. Billing Determinants'!$G$41*$D5,IF($E5=\"Distribution Rev.\",VLOOKUP(J$4,'4. Billing Determinants'!$B$19:$R$41,8,0)/'4. Billing Determinants'!$I$41*$D5, VLOOKUP(J$4,'4. Billing Determinants'!$B$19:$R$41,3,0)/'4. Billing Determinants'!$D$41*$D5))))),0)","v":1321.9589934304513},{"$f":"IFERROR(IF(K$4=\"\",0,IF($E5=\"kWh\",VLOOKUP(K$4,'4. Billing Determinants'!$B$19:$R$41,4,0)/'4. Billing Determinants'!$E$41*$D5,IF($E5=\"kW\",VLOOKUP(K$4,'4. Billing Determinants'!$B$19:$R$41,5,0)/'4. Billing Determinants'!$F$41*$D5,IF($E5=\"Non-RPP kWh\",VLOOKUP(K$4,'4. Billing Determinants'!$B$19:$R$41,6,0)/'4. Billing Determinants'!$G$41*$D5,IF($E5=\"Distribution Rev.\",VLOOKUP(K$4,'4. Billing Determinants'!$B$19:$R$41,8,0)/'4. Billing Determinants'!$I$41*$D5, VLOOKUP(K$4,'4. Billing Determinants'!$B$19:$R$41,3,0)/'4. Billing Determinants'!$D$41*$D5))))),0)","v":92.18151686063446},{"$f":"IFERROR(IF(L$4=\"\",0,IF($E5=\"kWh\",VLOOKUP(L$4,'4. Billing Determinants'!$B$19:$R$41,4,0)/'4. Billing Determinants'!$E$41*$D5,IF($E5=\"kW\",VLOOKUP(L$4,'4. Billing Determinants'!$B$19:$R$41,5,0)/'4. Billing Determinants'!$F$41*$D5,IF($E5=\"Non-RPP kWh\",VLOOKUP(L$4,'4. Billing Determinants'!$B$19:$R$41,6,0)/'4. Billing Determinants'!$G$41*$D5,IF($E5=\"Distribution Rev.\",VLOOKUP(L$4,'4. Billing Determinants'!$B$19:$R$41,8,0)/'4. Billing Determinants'!$I$41*$D5, VLOOKUP(L$4,'4. Billing Determinants'!$B$19:$R$41,3,0)/'4. Billing Determinants'!$D$41*$D5))))),0)","v":1346.8923069624589},{"$f":"IFERROR(IF(M$4=\"\",0,IF($E5=\"kWh\",VLOOKUP(M$4,'4. Billing Determinants'!$B$19:$R$41,4,0)/'4. Billing Determinants'!$E$41*$D5,IF($E5=\"kW\",VLOOKUP(M$4,'4. Billing Determinants'!$B$19:$R$41,5,0)/'4. Billing Determinants'!$F$41*$D5,IF($E5=\"Non-RPP kWh\",VLOOKUP(M$4,'4. Billing Determinants'!$B$19:$R$41,6,0)/'4. Billing Determinants'!$G$41*$D5,IF($E5=\"Distribution Rev.\",VLOOKUP(M$4,'4. Billing Determinants'!$B$19:$R$41,8,0)/'4. Billing Determinants'!$I$41*$D5, VLOOKUP(M$4,'4. Billing Determinants'!$B$19:$R$41,3,0)/'4. Billing Determinants'!$D$41*$D5))))),0)","v":0},{"$f":"IFERROR(IF(N$4=\"\",0,IF($E5=\"kWh\",VLOOKUP(N$4,'4. Billing Determinants'!$B$19:$R$41,4,0)/'4. Billing Determinants'!$E$41*$D5,IF($E5=\"kW\",VLOOKUP(N$4,'4. Billing Determinants'!$B$19:$R$41,5,0)/'4. Billing Determinants'!$F$41*$D5,IF($E5=\"Non-RPP kWh\",VLOOKUP(N$4,'4. Billing Determinants'!$B$19:$R$41,6,0)/'4. Billing Determinants'!$G$41*$D5,IF($E5=\"Distribution Rev.\",VLOOKUP(N$4,'4. Billing Determinants'!$B$19:$R$41,8,0)/'4. Billing Determinants'!$I$41*$D5, VLOOKUP(N$4,'4. Billing Determinants'!$B$19:$R$41,3,0)/'4. Billing Determinants'!$D$41*$D5))))),0)","v":0},{"$f":"IFERROR(IF(O$4=\"\",0,IF($E5=\"kWh\",VLOOKUP(O$4,'4. Billing Determinants'!$B$19:$R$41,4,0)/'4. Billing Determinants'!$E$41*$D5,IF($E5=\"kW\",VLOOKUP(O$4,'4. Billing Determinants'!$B$19:$R$41,5,0)/'4. Billing Determinants'!$F$41*$D5,IF($E5=\"Non-RPP kWh\",VLOOKUP(O$4,'4. Billing Determinants'!$B$19:$R$41,6,0)/'4. Billing Determinants'!$G$41*$D5,IF($E5=\"Distribution Rev.\",VLOOKUP(O$4,'4. Billing Determinants'!$B$19:$R$41,8,0)/'4. Billing Determinants'!$I$41*$D5, VLOOKUP(O$4,'4. Billing Determinants'!$B$19:$R$41,3,0)/'4. Billing Determinants'!$D$41*$D5))))),0)","v":0},{"$f":"IFERROR(IF(P$4=\"\",0,IF($E5=\"kWh\",VLOOKUP(P$4,'4. Billing Determinants'!$B$19:$R$41,4,0)/'4. Billing Determinants'!$E$41*$D5,IF($E5=\"kW\",VLOOKUP(P$4,'4. Billing Determinants'!$B$19:$R$41,5,0)/'4. Billing Determinants'!$F$41*$D5,IF($E5=\"Non-RPP kWh\",VLOOKUP(P$4,'4. Billing Determinants'!$B$19:$R$41,6,0)/'4. Billing Determinants'!$G$41*$D5,IF($E5=\"Distribution Rev.\",VLOOKUP(P$4,'4. Billing Determinants'!$B$19:$R$41,8,0)/'4. Billing Determinants'!$I$41*$D5, VLOOKUP(P$4,'4. Billing Determinants'!$B$19:$R$41,3,0)/'4. Billing Determinants'!$D$41*$D5))))),0)","v":0},{"$f":"IFERROR(IF(Q$4=\"\",0,IF($E5=\"kWh\",VLOOKUP(Q$4,'4. Billing Determinants'!$B$19:$R$41,4,0)/'4. Billing Determinants'!$E$41*$D5,IF($E5=\"kW\",VLOOKUP(Q$4,'4. Billing Determinants'!$B$19:$R$41,5,0)/'4. Billing Determinants'!$F$41*$D5,IF($E5=\"Non-RPP kWh\",VLOOKUP(Q$4,'4. Billing Determinants'!$B$19:$R$41,6,0)/'4. Billing Determinants'!$G$41*$D5,IF($E5=\"Distribution Rev.\",VLOOKUP(Q$4,'4. Billing Determinants'!$B$19:$R$41,8,0)/'4. Billing Determinants'!$I$41*$D5, VLOOKUP(Q$4,'4. Billing Determinants'!$B$19:$R$41,3,0)/'4. Billing Determinants'!$D$41*$D5))))),0)","v":0},{"$f":"IFERROR(IF(R$4=\"\",0,IF($E5=\"kWh\",VLOOKUP(R$4,'4. Billing Determinants'!$B$19:$R$41,4,0)/'4. Billing Determinants'!$E$41*$D5,IF($E5=\"kW\",VLOOKUP(R$4,'4. Billing Determinants'!$B$19:$R$41,5,0)/'4. Billing Determinants'!$F$41*$D5,IF($E5=\"Non-RPP kWh\",VLOOKUP(R$4,'4. Billing Determinants'!$B$19:$R$41,6,0)/'4. Billing Determinants'!$G$41*$D5,IF($E5=\"Distribution Rev.\",VLOOKUP(R$4,'4. Billing Determinants'!$B$19:$R$41,8,0)/'4. Billing Determinants'!$I$41*$D5, VLOOKUP(R$4,'4. Billing Determinants'!$B$19:$R$41,3,0)/'4. Billing Determinants'!$D$41*$D5))))),0)","v":0},{"$f":"IFERROR(IF(S$4=\"\",0,IF($E5=\"kWh\",VLOOKUP(S$4,'4. Billing Determinants'!$B$19:$R$41,4,0)/'4. Billing Determinants'!$E$41*$D5,IF($E5=\"kW\",VLOOKUP(S$4,'4. Billing Determinants'!$B$19:$R$41,5,0)/'4. Billing Determinants'!$F$41*$D5,IF($E5=\"Non-RPP kWh\",VLOOKUP(S$4,'4. Billing Determinants'!$B$19:$R$41,6,0)/'4. Billing Determinants'!$G$41*$D5,IF($E5=\"Distribution Rev.\",VLOOKUP(S$4,'4. Billing Determinants'!$B$19:$R$41,8,0)/'4. Billing Determinants'!$I$41*$D5, VLOOKUP(S$4,'4. Billing Determinants'!$B$19:$R$41,3,0)/'4. Billing Determinants'!$D$41*$D5))))),0)","v":0},{"$f":"IFERROR(IF(T$4=\"\",0,IF($E5=\"kWh\",VLOOKUP(T$4,'4. Billing Determinants'!$B$19:$R$41,4,0)/'4. Billing Determinants'!$E$41*$D5,IF($E5=\"kW\",VLOOKUP(T$4,'4. Billing Determinants'!$B$19:$R$41,5,0)/'4. Billing Determinants'!$F$41*$D5,IF($E5=\"Non-RPP kWh\",VLOOKUP(T$4,'4. Billing Determinants'!$B$19:$R$41,6,0)/'4. Billing Determinants'!$G$41*$D5,IF($E5=\"Distribution Rev.\",VLOOKUP(T$4,'4. Billing Determinants'!$B$19:$R$41,8,0)/'4. Billing Determinants'!$I$41*$D5, VLOOKUP(T$4,'4. Billing Determinants'!$B$19:$R$41,3,0)/'4. Billing Determinants'!$D$41*$D5))))),0)","v":0},{"$f":"IFERROR(IF(U$4=\"\",0,IF($E5=\"kWh\",VLOOKUP(U$4,'4. Billing Determinants'!$B$19:$R$41,4,0)/'4. Billing Determinants'!$E$41*$D5,IF($E5=\"kW\",VLOOKUP(U$4,'4. Billing Determinants'!$B$19:$R$41,5,0)/'4. Billing Determinants'!$F$41*$D5,IF($E5=\"Non-RPP kWh\",VLOOKUP(U$4,'4. Billing Determinants'!$B$19:$R$41,6,0)/'4. Billing Determinants'!$G$41*$D5,IF($E5=\"Distribution Rev.\",VLOOKUP(U$4,'4. Billing Determinants'!$B$19:$R$41,8,0)/'4. Billing Determinants'!$I$41*$D5, VLOOKUP(U$4,'4. Billing Determinants'!$B$19:$R$41,3,0)/'4. Billing Determinants'!$D$41*$D5))))),0)","v":0},{"$f":"IFERROR(IF(V$4=\"\",0,IF($E5=\"kWh\",VLOOKUP(V$4,'4. Billing Determinants'!$B$19:$R$41,4,0)/'4. Billing Determinants'!$E$41*$D5,IF($E5=\"kW\",VLOOKUP(V$4,'4. Billing Determinants'!$B$19:$R$41,5,0)/'4. Billing Determinants'!$F$41*$D5,IF($E5=\"Non-RPP kWh\",VLOOKUP(V$4,'4. Billing Determinants'!$B$19:$R$41,6,0)/'4. Billing Determinants'!$G$41*$D5,IF($E5=\"Distribution Rev.\",VLOOKUP(V$4,'4. Billing Determinants'!$B$19:$R$41,8,0)/'4. Billing Determinants'!$I$41*$D5, VLOOKUP(V$4,'4. Billing Determinants'!$B$19:$R$41,3,0)/'4. Billing Determinants'!$D$41*$D5))))),0)","v":0},{"$f":"IFERROR(IF(W$4=\"\",0,IF($E5=\"kWh\",VLOOKUP(W$4,'4. Billing Determinants'!$B$19:$R$41,4,0)/'4. Billing Determinants'!$E$41*$D5,IF($E5=\"kW\",VLOOKUP(W$4,'4. Billing Determinants'!$B$19:$R$41,5,0)/'4. Billing Determinants'!$F$41*$D5,IF($E5=\"Non-RPP kWh\",VLOOKUP(W$4,'4. Billing Determinants'!$B$19:$R$41,6,0)/'4. Billing Determinants'!$G$41*$D5,IF($E5=\"Distribution Rev.\",VLOOKUP(W$4,'4. Billing Determinants'!$B$19:$R$41,8,0)/'4. Billing Determinants'!$I$41*$D5, VLOOKUP(W$4,'4. Billing Determinants'!$B$19:$R$41,3,0)/'4. Billing Determinants'!$D$41*$D5))))),0)","v":0},{"$f":"IFERROR(IF(X$4=\"\",0,IF($E5=\"kWh\",VLOOKUP(X$4,'4. Billing Determinants'!$B$19:$R$41,4,0)/'4. Billing Determinants'!$E$41*$D5,IF($E5=\"kW\",VLOOKUP(X$4,'4. Billing Determinants'!$B$19:$R$41,5,0)/'4. Billing Determinants'!$F$41*$D5,IF($E5=\"Non-RPP kWh\",VLOOKUP(X$4,'4. Billing Determinants'!$B$19:$R$41,6,0)/'4. Billing Determinants'!$G$41*$D5,IF($E5=\"Distribution Rev.\",VLOOKUP(X$4,'4. Billing Determinants'!$B$19:$R$41,8,0)/'4. Billing Determinants'!$I$41*$D5, VLOOKUP(X$4,'4. Billing Determinants'!$B$19:$R$41,3,0)/'4. Billing Determinants'!$D$41*$D5))))),0)","v":0},{"$f":"IFERROR(IF(Y$4=\"\",0,IF($E5=\"kWh\",VLOOKUP(Y$4,'4. Billing Determinants'!$B$19:$R$41,4,0)/'4. Billing Determinants'!$E$41*$D5,IF($E5=\"kW\",VLOOKUP(Y$4,'4. Billing Determinants'!$B$19:$R$41,5,0)/'4. Billing Determinants'!$F$41*$D5,IF($E5=\"Non-RPP kWh\",VLOOKUP(Y$4,'4. Billing Determinants'!$B$19:$R$41,6,0)/'4. Billing Determinants'!$G$41*$D5,IF($E5=\"Distribution Rev.\",VLOOKUP(Y$4,'4. Billing Determinants'!$B$19:$R$41,8,0)/'4. Billing Determinants'!$I$41*$D5, VLOOKUP(Y$4,'4. Billing Determinants'!$B$19:$R$41,3,0)/'4. Billing Determinants'!$D$41*$D5))))),0)","v":0}]
[3,"Smart Metering Entity Charge Variance Account",1551,{"$f":"'2. 2016 Continuity Schedule'!BT25","v":-3047.4689200000003},"# of Customers",{"$f":"(6107.01429378963/(6107.01429378963+758.143614058788))*D6","v":-2710.9261730226435},{"$f":"(758.143614058788/(6107.01429378963+758.143614058788))*D6","v":-336.54274697735701},0,0,0,0,0,0,0,0,0,0,0,0,0,0,0,0,0,0]
{"$rows_left_out":55}
{"sheet":"5a. GA Allocation Class A","index":5,"n_rows":33,"n_cols":10,"rows_kept":33,"cut":false,"hidden":false,"merged":[[31,2,31,6],[13,0,13,4],[15,2,15,8],[17,0,17,4],[24,0,24,2],[30,0,30,3]]}
[]
[]
[]
[]
[]
[]
{"$rows_left_out":28}
{"sheet":"6. Rate Rider Calculations","index":6,"n_rows":201,"n_cols":16,"rows_kept":201,"cut":false,"hidden":false,"merged":[[122,1,123,1],[122,2,123,2],[122,3,123,3],[122,4,123,4],[122,5,123,5],[95,1,96,1],[95,2,96,2],[95,3,96,3],[95,4,96,4],[95,5,96,5],[178,1,179,1],[178,2,179,2],[178,3,179,3],[178,4,179,4],[178,5,179,5],[150,1,151,1],[150,2,151,2],[150,3,151,3],[150,4,151,4],[150,5,151,5],[69,1,70,1],[69,2,70,2],[17,3,18,3],[17,4,18,4],[17,5,18,5],[69,4,70,4],[69,5,70,5],[69,3,70,3],[17,1,18,1],[17,2,18,2],[43,1,44,1],[43,2,44,2],[43,3,44,3],[43,4,44,4],[43,5,44,5]]}
[]
[]
[]
[]
[]
[]
{"$rows_left_out":196}
{"sheet":"Summary Sheet","index":7,"n_rows":44,"n_cols":10,"rows_kept":44,"cut":false,"hidden":true,"merged":[[0,8,2,8],[0,9,2,9],[0,2,2,2],[0,3,2,3],[0,5,2,5],[0,6,2,6],[0,7,2,7],[0,4,2,4]]}
[null,null,"Closing Principal Balances as of Dec 31-13 Adjusted for Dispositions during 2014","Closing Interest Balances as of Dec 31-13 Adjusted for Dispositions during 2014","December 31, 2013 Audited Balances","Projected Interest from Jan 1, 2014 to December 31, 2014 on                        Dec 31 -13 balance adjusted for disposition during 2014 6","Projected Interest from January 1, 2015 to April 30, 2015 on Dec 31 -13 balance adjusted for disposition during 2014  6","Total Claim","2.1.7\nAs of Dec 31-13","Variance                           RRR vs. 2013 Balance                        (Principal + Interest)"]
[]
[null,null,null,null,null,null,null,"Claim before Forecasted Transactions"]
["Other Regulatory Assets - Sub-Account - Deferred IFRS Transition Costs",1508,{"$f":"VLOOKUP(A4, '2. 2016 Continuity Schedule'!$C$20:$BV$86, MATCH('2. 2016 Continuity Schedule'!BO$20, '2. 2016 Continuity Schedule'!C$20:BV$20,0),FALSE)","v":84518.200000000012},{"$f":"VLOOKUP(A4, '2. 2016 Continuity Schedule'!$C$20:$BV$86, MATCH('2. 2016 Continuity Schedule'!BP$20, '2. 2016 Continuity Schedule'!C$20:BV$20,0),FALSE)","v":6326.8},{"$f":"SUM(C4:D4)","v":90845.000000000015},{"$f":"VLOOKUP(A4, '2. 2016 Continuity Schedule'!$C$20:$BV$86, MATCH('2. 2016 Continuity Schedule'!BQ$20, '2. 2016 Continuity Schedule'!C$20:BV$20,0),FALSE)","v":929.70020000000011},{"$f":"VLOOKUP(A4, '2. 2016 Continuity Schedule'!$C$20:$BV$86, MATCH('2. 2016 Continuity Schedule'!BR$20, '2. 2016 Continuity Schedule'!C$20:BV$20,0),FALSE)","v":0},{"$f":"SUM(E4:G4)","v":91774.700200000021},{"$f":"VLOOKUP(A4, '2. 2016 Continuity Schedule'!$C$20:$BV$86, MATCH('2. 2016 Continuity Schedule'!BU$20, '2. 2016 Continuity Schedule'!C$20:BV$20,0),FALSE)","v":90845},{"$f":"VLOOKUP(A4, '2. 2016 Continuity Schedule'!$C$20:$BV$86, MATCH('2. 2016 Continuity Schedule'!BV$20, '2. 2016 Continuity Schedule'!C$20:BV$20,0),FALSE)","v":0}]
["Other Regulatory Assets - Sub-Account - Incremental Capital Charges",1508,{"$f":"VLOOKUP(A5, '2. 2016 Continuity Schedule'!$C$20:$BV$86, MATCH('2. 2016 Continuity Schedule'!BO$20, '2. 2016 Continuity Schedule'!C$20:BV$20,0),FALSE)","v":{"$error":"#N/A"}},{"$f":"VLOOKUP(A5, '2. 2016 Continuity Schedule'!$C$20:$BV$86, MATCH('2. 2016 Continuity Schedule'!BP$20, '2. 2016 Continuity Schedule'!C$20:BV$20,0),FALSE)","v":{"$error":"#N/A"}},{"$f":"SUM(C5:D5)","v":{"$error":"#N/A"}},{"$f":"VLOOKUP(A5, '2. 2016 Continuity Schedule'!$C$20:$BV$86, MATCH('2. 2016 Continuity Schedule'!BQ$20, '2. 2016 Continuity Schedule'!C$20:BV$20,0),FALSE)","v":{"$error":"#N/A"}},{"$f":"VLOOKUP(A5, '2. 2016 Continuity Schedule'!$C$20:$BV$86, MATCH('2. 2016 Continuity Schedule'!BR$20, '2. 2016 Continuity Schedule'!C$20:BV$20,0),FALSE)","v":{"$error":"#N/A"}},{"$f":"SUM(E5:G5)","v":{"$error":"#N/A"}},{"$f":"VLOOKUP(A5, '2. 2016 Continuity Schedule'!$C$20:$BV$86, MATCH('2. 2016 Continuity Schedule'!BU$20, '2. 2016 Continuity Schedule'!C$20:BV$20,0),FALSE)","v":{"$error":"#N/A"}},{"$f":"VLOOKUP(A5, '2. 2016 Continuity Schedule'!$C$20:$BV$86, MATCH('2. 2016 Continuity Schedule'!BV$20, '2. 2016 Continuity Schedule'!C$20:BV$20,0),FALSE)","v":{"$error":"#N/A"}}]
["Other Regulatory Assets - Sub-Account - Financial Assistance Payment and Recovery Variance - Ontario Clean Energy Benefit Act8",1508,{"$f":"VLOOKUP(A6, '2. 2016 Continuity Schedule'!$C$20:$BV$86, MATCH('2. 2016 Continuity Schedule'!BO$20, '2. 2016 Continuity Schedule'!C$20:BV$20,0),FALSE)","v":{"$error":"#N/A"}},{"$f":"VLOOKUP(A6, '2. 2016 Continuity Schedule'!$C$20:$BV$86, MATCH('2. 2016 Continuity Schedule'!BP$20, '2. 2016 Continuity Schedule'!C$20:BV$20,0),FALSE)","v":{"$error":"#N/A"}},{"$error":"#N/A"},{"$f":"VLOOKUP(A6, '2. 2016 Continuity Schedule'!$C$20:$BV$86, MATCH('2. 2016 Continuity Schedule'!BQ$20, '2. 2016 Continuity Schedule'!C$20:BV$20,0),FALSE)","v":{"$error":"#N/A"}},{"$f":"VLOOKUP(A6, '2. 2016 Continuity Schedule'!$C$20:$BV$86, MATCH('2. 2016 Continuity Schedule'!BR$20, '2. 2016 Continuity Schedule'!C$20:BV$20,0),FALSE)","v":{"$error":"#N/A"}},{"$error":"#N/A"},{"$f":"VLOOKUP(A6, '2. 2016 Continuity Schedule'!$C$20:$BV$86, MATCH('2. 2016 Continuity Schedule'!BU$20, '2. 2016 Continuity Schedule'!C$20:BV$20,0),FALSE)","v":{"$error":"#N/A"}},{"$f":"VLOOKUP(A6, '2. 2016 Continuity Schedule'!$C$20:$BV$86, MATCH('2. 2016 Continuity Schedule'!BV$20, '2. 2016 Continuity Schedule'!C$20:BV$20,0),FALSE)","v":{"$error":"#N/A"}}]
{"$rows_left_out":38}