{"text_format":"1","workbook":"xlsx","n_sheets":10,"sheets":["1. Info","2. Table of Contents","3. Rate Classes","4. RRR Data","5. UTRs and Sub-Transmission","6. Historical Wholesale","7. Current Wholesale","8. Forecast Wholesale","9. RTSR Rates to Forecast","hidden1"],"not_rendered":{"charts":0,"images":3,"macros":1,"external_links":2,"defined_names":20,"comments":0,"pivot_tables":0},"unopened":[],"bounds":{"document_bytes":16777216,"sheet_cells":100000,"rows_first":2000,"rows_last":500,"rows_between":2000,"halvings":0,"cell_chars":16384,"cell_head_chars":4096},"cells_cut":0,"cells_raw":0,"read":"whole","date_system":"1900"}

{"sheet":"1. Info","index":0,"n_rows":76,"n_cols":28,"rows_kept":76,"cut":false,"hidden":false,"merged":[[24,3,24,4],[20,3,20,4],[1,2,1,9],[2,2,2,9],[3,2,3,9],[4,2,4,9],[14,3,14,4],[16,3,16,4]]}
[null,null,null,null,null,null,null,null,null,null,null,null,null,null,null,null,null,null,null,null,null,null,null,null,null,null,null,"Alectra Utilities Corporation - Enersource Hydro"]
[null,null,null,null,null,null,null,null,null,null,null,null,null,null,null,null,null,null,null,null,null,null,null,null,null,null,null,"Alectra Utilities Corporation - Horizon Utilities"]
[null,null,null,null,null,null,null,null,null,null,null,null,null,null,null,null,null,null,null,null,null,null,null,null,null,null,null,"Alectra Utilities Corporation - Hydro One Brampton "]
[null,null,null,null,null,null,null,null,null,null,null,null,null,null,null,null,null,null,null,null,null,null,null,null,null,null,null,"Alectra Utilities Corporation - PowerStream Inc."]
[null,null,null,null,null,null,null,null,null,null,null,null,null,null,null,null,null,null,null,null,null,null,null,null,null,null,null,"Algoma Power Inc."]
[null,null,null,null,null,null,null,null,null,null,null,null,null,null,null,null,null,null,null,null,null,null,null,null,null,null,null,"Atikokan Hydro Inc."]
[null,null,null,null,null,null,null,null,null,null,null,null,null,null,null,null,null,null,null,null,null,null,null,null,null,null,null,"Attawapiskat Power Corp. "]
[null,null,null,null,null,null,null,null,null,null,null,null,null,null,null,null,null,null,null,null,null,null,null,null,null,null,null,"Bluewater Power Distribution Corporation"]
[null,null,null,null,null,null,null,null,null,null,null,null,null,null,null,null,null,null,null,null,null,null,null,null,null,null,null,"Brantford Power Inc."]
[null,null,null,null,null,null,null,null,null,null,null,null,null,null,null,null,null,null,null,null,null,null,null,null,null,null,null,"Burlington Hydro Inc."]
[null,null,null,null,null,null,null,null,null,null,null,null,null,null,null,null,null,null,null,null,null,null,null,null,null,null,null,"Canadian Niagara Power Inc."]
[null,null,null,null,null,null,null,null,null,null,null,null,null,null,null,null,null,null,null,null,null,null,null,null,null,null,null,"Centre Wellington Hydro Ltd."]
["Drop-down lists are shaded blue; Input cells are shaded green.",null,null,null,null,null,null,null,null,null,null,null,null,null,null,null,null,null,null,null,null,null,null,null,null,null,null,"Chapleau Public Utilities Corporation"]
[null,null,null,null,null,null,null,null,null,null,null,null,null,null,null,null,null,null,null,null,null,null,null,null,null,null,null,"Clinton Power Corporation"]
[null,null,"Utility Name   ","Energy + Inc.",null,null,null,null,null,null,null,null,null,null,null,null,null,null,null,null,null,null,null,null,null,null,null,"COLLUS PowerStream Corporation"]
[null,null,null,null,null,null,null,null,null,null,null,null,null,null,null,null,null,null,null,null,null,null,null,null,null,null,null,"Cooperative Hydro Embrun Inc."]
[null,null,"Service Territory","Cambridge and North Dumfries",null,null,null,null,null,null,null,null,null,null,null,null,null,null,null,null,null,null,null,null,null,null,null,"E.L.K. Energy Inc."]
[null,null,null,null,null,null,null,null,null,null,null,null,null,null,null,null,null,null,null,null,null,null,null,null,null,null,null,"Energy + Inc."]
[null,null,"Assigned EB Number","EB-2018-0028",null,null,null,null,null,null,null,null,null,null,null,null,null,null,null,null,null,null,null,null,null,null,null,"Entegrus Powerlines Inc."]
[null,null,null,null,null,null,null,null,null,null,null,null,null,null,null,null,null,null,null,null,null,null,null,null,null,null,null,"ENWIN Utilities Ltd."]
[null,null,"Name and Title","Sarah Hughes, Chief Financial Officer, Finance",null,null,null,null,null,null,null,null,null,null,null,null,null,null,null,null,null,null,null,null,null,null,null,"Erie Thames Powerlines Corporation"]
[null,null,null,null,null,null,null,null,null,null,null,null,null,null,null,null,null,null,null,null,null,null,null,null,null,null,null,"Espanola Regional Hydro Distribution Corporation"]
[null,null,"Phone Number","519-621-8405 ext 2638",null,null,null,null,null,null,null,null,null,null,null,null,null,null,null,null,null,null,null,null,null,null,null,"Essex Powerlines Corporation"]
[null,null,null,null,null,null,null,null,null,null,null,null,null,null,null,null,null,null,null,null,null,null,null,null,null,null,null,"Festival Hydro Inc."]
[null,null,"Email Address","shughes@energyplus.ca",null,null,null,null,null,null,null,null,null,null,null,null,null,null,null,null,null,null,null,null,null,null,null,"Fort Albany Power Corporation"]
[null,null,null,null,null,null,null,null,null,null,null,null,null,null,null,null,null,null,null,null,null,null,null,null,null,null,null,"Fort Frances Power Corporation"]
[null,null,"Date","2018-04-27",null,null,null,null,null,null,null,null,null,null,null,null,null,null,null,null,null,null,null,null,null,null,null,"Greater Sudbury Hydro Inc."]
[null,null,null,null,null,null,null,null,null,null,null,null,null,null,null,null,null,null,null,null,null,null,null,null,null,null,null,"Grimsby Power Inc."]
[null,null,"Last COS Re-based Year",2014,null,null,null,null,null,null,null,null,null,null,null,null,null,null,null,null,null,null,null,null,null,null,null,"Guelph Hydro Electric Systems Inc."]
[null,null,null,null,null,null,null,null,null,null,null,null,null,null,null,null,null,null,null,null,null,null,null,null,null,null,null,"Halton Hills Hydro Inc."]
[null,null,null,null,null,null,null,null,null,null,null,null,null,null,null,null,null,null,null,null,null,null,null,null,null,null,null,"Hearst Power Distribution Company Limited"]
[null,null,null,null,null,null,null,null,null,null,null,null,null,null,null,null,null,null,null,null,null,null,null,null,null,null,null,"Hydro 2000 Inc."]
[null,null,null,null,null,null,null,null,null,null,null,null,null,null,null,null,null,null,null,null,null,null,null,null,null,null,null,"Hydro Hawkesbury Inc."]
[null,null,null,null,null,null,null,null,null,null,null,null,null,null,null,null,null,null,null,null,null,null,null,null,null,null,null,"Hydro One Networks Inc."]
[null,null,null,null,null,null,null,null,null,null,null,null,null,null,null,null,null,null,null,null,null,null,null,null,null,null,null,"Hydro One Networks Inc. - Haldimand County Hydro"]
[null,null,null,null,null,null,null,null,null,null,null,null,null,null,null,null,null,null,null,null,null,null,null,null,null,null,null,"Hydro One Networks Inc. - Norfolk Hydro"]
[null,null,null,null,null,null,null,null,null,null,null,null,null,null,null,null,null,null,null,null,null,null,null,null,null,null,null,"Hydro One Networks Inc. - Woodstock Hydro"]
[null,null,null,null,null,null,null,null,null,null,null,null,null,null,null,null,null,null,null,null,null,null,null,null,null,null,null,"Hydro One Remote Communities Inc."]
[null,null,null,null,null,null,null,null,null,null,null,null,null,null,null,null,null,null,null,null,null,null,null,null,null,null,null,"Hydro Ottawa Limited"]
[null,null,null,null,null,null,null,null,null,null,null,null,null,null,null,null,null,null,null,null,null,null,null,null,null,null,null,"Innpower Corporation"]
[null,null,null,null,null,null,null,null,null,null,null,null,null,null,null,null,null,null,null,null,null,null,null,null,null,null,null,"Kashechewan Power Corporation"]
[null,null,null,null,null,null,null,null,null,null,null,null,null,null,null,null,null,null,null,null,null,null,null,null,null,null,null,"Kenora Hydro Electric Corporation Ltd."]
[null,null,null,null,null,null,null,null,null,null,null,null,null,null,null,null,null,null,null,null,null,null,null,null,null,null,null,"Kingston Hydro Corporation"]
[null,null,null,null,null,null,null,null,null,null,null,null,null,null,null,null,null,null,null,null,null,null,null,null,null,null,null,"Kitchener-Wilmot Hydro Inc."]
[null,null,null,null,null,null,null,null,null,null,null,null,null,null,null,null,null,null,null,null,null,null,null,null,null,null,null,"Lakefront Utilities Inc."]
[null,null,null,null,null,null,null,null,null,null,null,null,null,null,null,null,null,null,null,null,null,null,null,null,null,null,null,"Lakeland Power Distribution Ltd."]
[null,null,null,null,null,null,null,null,null,null,null,null,null,null,null,null,null,null,null,null,null,null,null,null,null,null,null,"London Hydro Inc."]
[null,null,null,null,null,null,null,null,null,null,null,null,null,null,null,null,null,null,null,null,null,null,null,null,null,null,null,"Midland Power Utility Corporation"]
[null,null,null,null,null,null,null,null,null,null,null,null,null,null,null,null,null,null,null,null,null,null,null,null,null,null,null,"Milton Hydro Distribution inc."]
[null,null,null,null,null,null,null,null,null,null,null,null,null,null,null,null,null,null,null,null,null,null,null,null,null,null,null,"Newmarket - Tay Power Distribution Ltd."]
[null,null,null,null,null,null,null,null,null,null,null,null,null,null,null,null,null,null,null,null,null,null,null,null,null,null,null,"Niagara Peninsula Energy Inc."]
[null,null,null,null,null,null,null,null,null,null,null,null,null,null,null,null,null,null,null,null,null,null,null,null,null,null,null,"Niagara-on-the-Lake Hydro Inc."]
[null,null,null,null,null,null,null,null,null,null,null,null,null,null,null,null,null,null,null,null,null,null,null,null,null,null,null,"North Bay Hydro Distribution Limited"]
[null,null,null,null,null,null,null,null,null,null,null,null,null,null,null,null,null,null,null,null,null,null,null,null,null,null,null,"Northern Ontario Wires Inc."]
[null,null,null,null,null,null,null,null,null,null,null,null,null,null,null,null,null,null,null,null,null,null,null,null,null,null,null,"Oakville Hydro Electricity Distribution Inc."]
[null,null,null,null,null,null,null,null,null,null,null,null,null,null,null,null,null,null,null,null,null,null,null,null,null,null,null,"Orangeville Hydro Limited"]
[null,null,null,null,null,null,null,null,null,null,null,null,null,null,null,null,null,null,null,null,null,null,null,null,null,null,null,"Orillia Power Distribution Corporation"]
[null,null,null,null,null,null,null,null,null,null,null,null,null,null,null,null,null,null,null,null,null,null,null,null,null,null,null,"Oshawa PUC Networks Inc."]
[null,null,null,null,null,null,null,null,null,null,null,null,null,null,null,null,null,null,null,null,null,null,null,null,null,null,null,"Ottawa River Power Corporation"]
[null,null,null,null,null,null,null,null,null,null,null,null,null,null,null,null,null,null,null,null,null,null,null,null,null,null,null,"Peterborough Distribution Incorporated"]
[null,null,null,null,null,null,null,null,null,null,null,null,null,null,null,null,null,null,null,null,null,null,null,null,null,null,null,"PUC Distribution Inc."]
[null,null,null,null,null,null,null,null,null,null,null,null,null,null,null,null,null,null,null,null,null,null,null,null,null,null,null,"Renfrew Hydro Inc."]
[null,null,null,null,null,null,null,null,null,null,null,null,null,null,null,null,null,null,null,null,null,null,null,null,null,null,null,"Rideau St. Lawrence Distribution Inc."]
[null,null,null,null,null,null,null,null,null,null,null,null,null,null,null,null,null,null,null,null,null,null,null,null,null,null,null,"Sioux Lookout Hydro Inc."]
[null,null,null,null,null,null,null,null,null,null,null,null,null,null,null,null,null,null,null,null,null,null,null,null,null,null,null,"St. Thomas Energy Inc."]
[null,null,null,null,null,null,null,null,null,null,null,null,null,null,null,null,null,null,null,null,null,null,null,null,null,null,null,"Thunder Bay Hydro Electricity Distribution Inc."]
[null,null,null,null,null,null,null,null,null,null,null,null,null,null,null,null,null,null,null,null,null,null,null,null,null,null,null,"Tillsonburg Hydro Inc."]
[null,null,null,null,null,null,null,null,null,null,null,null,null,null,null,null,null,null,null,null,null,null,null,null,null,null,null,"Toronto Hydro-Electric System Limited"]
[null,null,null,null,null,null,null,null,null,null,null,null,null,null,null,null,null,null,null,null,null,null,null,null,null,null,null,"Veridian Connections Inc."]
[null,null,null,null,null,null,null,null,null,null,null,null,null,null,null,null,null,null,null,null,null,null,null,null,null,null,null,"Wasaga Distribution Inc."]
[null,null,null,null,null,null,null,null,null,null,null,null,null,null,null,null,null,null,null,null,null,null,null,null,null,null,null,"Waterloo North Hydro Inc."]
[null,null,null,null,null,null,null,null,null,null,null,null,null,null,null,null,null,null,null,null,null,null,null,null,null,null,null,"Welland Hydro Electric System Corp."]
[null,null,null,null,null,null,null,null,null,null,null,null,null,null,null,null,null,null,null,null,null,null,null,null,null,null,null,"Wellington North Power Inc."]
[null,null,null,null,null,null,null,null,null,null,null,null,null,null,null,null,null,null,null,null,null,null,null,null,null,null,null,"West Coast Huron Energy Inc."]
[null,null,null,null,null,null,null,null,null,null,null,null,null,null,null,null,null,null,null,null,null,null,null,null,null,null,null,"Westario Power Inc."]
[null,null,null,null,null,null,null,null,null,null,null,null,null,null,null,null,null,null,null,null,null,null,null,null,null,null,null,"Whitby Hydro Electric Corporation"]

{"sheet":"2. Table of Contents","index":1,"n_rows":28,"n_cols":9,"rows_kept":28,"cut":false,"hidden":false,"merged":[]}
[]
[]
[]
[]
[]
[]
[]
[]
[]
[]
[]
[]
[]
[]
[]
[]
[]
[]
[]
[null,null,null,"1. Info",null,null,null,null,"6. Historical Wholesale"]
[]
[null,null,null,"2. Table of Contents",null,null,null,null,"7. Current Wholesale"]
[]
[null,null,null,"3. Rate Classes",null,null,null,null,"8. Forecast Wholesale"]
[]
[null,null,null,"4. RRR Data",null,null,null,null,"9. RTSR Rates to Forecast"]
[]
[null,null,null,"5. UTRs and Sub-Transmission"]

{"sheet":"3. Rate Classes","index":2,"n_rows":100,"n_cols":23,"rows_kept":100,"cut":false,"hidden":false,"merged":[[12,2,12,8]]}
[]
[]
[]
[]
[]
[]
[]
[]
[]
[]
[]
[]
[null,null,"1.  Select the appropriate rate classes that appear on your most recent Board-Approved Tariff of Rates and Charges.\n2.  Enter the RTS Network and Connection Rate as it appears on the Tariff of Rates and Charges"]
[]
[null,null,"Rate Class",null,"Unit",null,"RTSR-Network",null,"RTSR-Connection"]
[]
[null,null,"Residential",null,"kWh",null,5.9399238706380553E-3,null,3.8676907620184288E-3,null,null,{"$f":"IF(OR(ISBLANK(C17), ISERROR(FIND(\"Choose\", C17))=FALSE), 0, 1)","v":1},{"$f":"\"C\" & ROW(C17)","v":"C17"},{"$f":"IF(OR(C17=\"General Service Intermediate Rate Class 1,000 To 4,999 kW (formerly General Service > 50 kW Customers)\", C17=\"General Service Intermediate Rate Class 1,000 To 4,999 kW (formerly Large Use Customers)\"), \"x\", \"\")","v":""},null,null,null,null,null,null,null,null,"Choose Rate Class"]
[null,null,"General Service Less Than 50 kW",null,"kWh",null,5.2512370540438889E-3,null,3.6098446961708663E-3,null,null,1,"C18",{"$f":"IF(OR(C18=\"General Service Intermediate Rate Class 1,000 To 4,999 kW (formerly General Service > 50 kW Customers)\", C18=\"General Service Intermediate Rate Class 1,000 To 4,999 kW (formerly Large Use Customers)\"), \"x\", \"\")","v":""},null,null,null,null,null,null,null,null,"Residential"]
[null,null,"General Service 50 to 999 kW",null,"kW",null,3.4015964117252584,null,2.1955591127940868,null,null,1,"C19","",null,null,null,null,null,null,null,null,"Residential Regular"]
[null,null,"General Service 1,000 to 4,999 kW",null,"kW",null,2.5835225519369915,null,1.7230132431889384,null,null,1,"C20","",null,null,null,null,null,null,null,null,"Residential Urban"]
[null,null,"Large Use",null,"kW",null,2.4481955755687381,null,1.7538688131530065,null,null,1,"C21","",null,null,null,null,null,null,null,null,"Residential Urban Year-Round"]
[null,null,"Street Lighting",null,"kW",null,1.7094930997669184,null,1.1033232933218973,null,null,1,"C22","",null,null,null,null,null,null,null,null,"Residential Suburban"]
[null,null,"Unmetered Scattered Load",null,"kWh",null,5.3E-3,null,3.5999999999999999E-3,null,null,1,"C23","",null,null,null,null,null,null,null,null,"Residential Suburban Seasonal"]
[null,null,"Embedded Distributor",null,"kW",null,2.4481955654859595,null,1.75386883418276,null,null,1,"C24","",null,null,null,null,null,null,null,null,"Residential Suburban Year Round"]
[null,null,"Embedded Distributor",null,"kW",null,2.4481955654859595,null,1.75386883418276,null,null,1,"C25","",null,null,null,null,null,null,null,null,"Residential - Time of Use"]
[null,null,"Choose Rate Class",null,null,null,null,null,null,null,null,0,"C26","",null,null,null,null,null,null,null,null,"Residential - Hensall"]
[null,null,"Choose Rate Class",null,null,null,null,null,null,null,null,0,"C27","",null,null,null,null,null,null,null,null,"Residential – High Density [R1]"]
[null,null,"Choose Rate Class",null,null,null,null,null,null,null,null,0,"C28","",null,null,null,null,null,null,null,null,"Residential – Normal Density [R2]"]
[null,null,"Choose Rate Class",null,null,null,null,null,null,null,null,0,"C29","",null,null,null,null,null,null,null,null,"Seasonal Residential – High Density [R3]"]
[null,null,"Choose Rate Class",null,null,null,null,null,null,null,null,0,"C30","",null,null,null,null,null,null,null,null,"Seasonal Residential – Normal Density [R4]"]
[null,null,"Choose Rate Class",null,null,null,null,null,null,null,null,0,"C31","",null,null,null,null,null,null,null,null,"Residential – Urban [UR]"]
[null,null,"Choose Rate Class",null,null,null,null,null,null,null,null,0,"C32","",null,null,null,null,null,null,null,null,"General Service Less Than 50 kW"]
[null,null,"Choose Rate Class",null,null,null,null,null,null,null,null,0,"C33","",null,null,null,null,null,null,null,null,"General Service Less Than 50 kW – Single Phase energy-billed [G1]"]
[null,null,"Choose Rate Class",null,null,null,null,null,null,null,null,0,"C34","",null,null,null,null,null,null,null,null,"General Service Less Than 50 kW – Three Phase energy-billed [G3]"]
[null,null,"Choose Rate Class",null,null,null,null,null,null,null,null,0,"C35","",null,null,null,null,null,null,null,null,"General Service Less Than 50 kW – Transmission Class energy-billed [T]"]
[null,null,"Choose Rate Class",null,null,null,null,null,null,null,null,0,"C36","",null,null,null,null,null,null,null,null,"General Service Less Than 50 kW – Urban energy-billed [UG]"]
[null,null,"Choose Rate Class",null,null,null,null,null,null,null,null,0,"C37","",null,null,null,null,null,null,null,null,"Westport Sewage Treatment Plant"]
[null,null,"Choose Rate Class",null,null,null,null,null,null,null,null,0,"C38","",null,null,null,null,null,null,null,null,"Small Commercial and USL - per meter"]
[null,null,null,null,null,null,null,null,null,null,null,null,null,{"$f":"COUNTIF(N17:N38, \"x\")","v":0},null,null,null,null,null,null,null,null,"Small Commercial and USL - per connection"]
[null,null,null,null,null,null,null,null,null,null,null,null,null,null,null,null,null,null,null,null,null,null,"Farms – Single Phase energy-billed [F1]"]
[null,null,null,null,null,null,null,null,null,null,null,null,null,null,null,null,null,null,null,null,null,null,"General Service 50 to 499 kW"]
[null,null,null,null,null,null,null,null,null,null,null,null,null,null,null,null,null,null,null,null,null,null,"General Service 50 to 699 kW"]
[null,null,null,null,null,null,null,null,null,null,null,null,null,null,null,null,null,null,null,null,null,null,"General Service 50 to 999 kW"]
[null,null,null,null,null,null,null,null,null,null,null,null,null,null,null,null,null,null,null,null,null,null,"General Service 50 to 999 kW - Interval Metered"]
[null,null,null,null,null,null,null,null,null,null,null,null,null,null,null,null,null,null,null,null,null,null,"General Service 50 to 1,000 kW"]
[null,null,null,null,null,null,null,null,null,null,null,null,null,null,null,null,null,null,null,null,null,null,"General Service 50 to 1,000 kW - Interval Meters"]
[null,null,null,null,null,null,null,null,null,null,null,null,null,null,null,null,null,null,null,null,null,null,"General Service 50 to 1,000 kW - Non Interval Meters"]
[null,null,null,null,null,null,null,null,null,null,null,null,null,null,null,null,null,null,null,null,null,null,"General Service 50 to 1,499 kW"]
[null,null,null,null,null,null,null,null,null,null,null,null,null,null,null,null,null,null,null,null,null,null,"General Service 50 to 1,499 kW - Interval Metered"]
[null,null,null,null,null,null,null,null,null,null,null,null,null,null,null,null,null,null,null,null,null,null,"General Service  50 to 2,499 kW"]
[null,null,null,null,null,null,null,null,null,null,null,null,null,null,null,null,null,null,null,null,null,null,"General Service 50 to 2,999 kW"]
[null,null,null,null,null,null,null,null,null,null,null,null,null,null,null,null,null,null,null,null,null,null,"General Service 50 to 2,999 kW - Time of Use"]
[null,null,null,null,null,null,null,null,null,null,null,null,null,null,null,null,null,null,null,null,null,null,"General Service 50 to 4,999 kW"]
[null,null,null,null,null,null,null,null,null,null,null,null,null,null,null,null,null,null,null,null,null,null,"General Service 50 to 4,999 kW – Interval Metered"]
[null,null,null,null,null,null,null,null,null,null,null,null,null,null,null,null,null,null,null,null,null,null,"General Service 50 to 4,999 kW - Time of Use"]
[null,null,null,null,null,null,null,null,null,null,null,null,null,null,null,null,null,null,null,null,null,null,"General Service 50 to 4,999 kW (CoGeneration)"]
[null,null,null,null,null,null,null,null,null,null,null,null,null,null,null,null,null,null,null,null,null,null,"General Service 50 to 4,999 kW (formerly Time of Use)"]
[null,null,null,null,null,null,null,null,null,null,null,null,null,null,null,null,null,null,null,null,null,null,"General Service 500 to 4,999 kW"]
[null,null,null,null,null,null,null,null,null,null,null,null,null,null,null,null,null,null,null,null,null,null,"General Service 700 to 4,999 kW"]
[null,null,null,null,null,null,null,null,null,null,null,null,null,null,null,null,null,null,null,null,null,null,"General Service 1,000 to 2,999 kW"]
[null,null,null,null,null,null,null,null,null,null,null,null,null,null,null,null,null,null,null,null,null,null,"General Service 1,000 to 4,999 kW"]
[null,null,null,null,null,null,null,null,null,null,null,null,null,null,null,null,null,null,null,null,null,null,"General Service 1,000 to 4,999 kW - Interval Meters"]
[null,null,null,null,null,null,null,null,null,null,null,null,null,null,null,null,null,null,null,null,null,null,"General Service 1,000 To 4,999 kW (co-generation)"]
[null,null,null,null,null,null,null,null,null,null,null,null,null,null,null,null,null,null,null,null,null,null,"General Service Greater Than 1,000 kW"]
[null,null,null,null,null,null,null,null,null,null,null,null,null,null,null,null,null,null,null,null,null,null,"General Service Intermediate Rate Class 1,000 To 4,999 kW (formerly Large Use Customers)"]
[null,null,null,null,null,null,null,null,null,null,null,null,null,null,null,null,null,null,null,null,null,null,"General Service Intermediate Rate Class 1,000 To 4,999 kW (formerly General Service > 50 kW Customers)"]
[null,null,null,null,null,null,null,null,null,null,null,null,null,null,null,null,null,null,null,null,null,null,"General Service 1,500 to 4,999 kW"]
[null,null,null,null,null,null,null,null,null,null,null,null,null,null,null,null,null,null,null,null,null,null,"General Service Equal To Or Greater Than 1,500 kW"]
[null,null,null,null,null,null,null,null,null,null,null,null,null,null,null,null,null,null,null,null,null,null,"General Service Equal To Or Greater Than 1,500 kW - Interval Metered"]
[null,null,null,null,null,null,null,null,null,null,null,null,null,null,null,null,null,null,null,null,null,null,"General Service Intermediate 1,000 To 4,999 kW"]
[null,null,null,null,null,null,null,null,null,null,null,null,null,null,null,null,null,null,null,null,null,null,"General Service 2,500 to 4,999 kW"]
[null,null,null,null,null,null,null,null,null,null,null,null,null,null,null,null,null,null,null,null,null,null,"General Service 3,000 to 4,999 kW"]
[null,null,null,null,null,null,null,null,null,null,null,null,null,null,null,null,null,null,null,null,null,null,"General Service 3,000 to 4,999 kW - Interval Metered"]
[null,null,null,null,null,null,null,null,null,null,null,null,null,null,null,null,null,null,null,null,null,null,"General Service 3,000 to 4,999 kW - Intermediate Use"]
[null,null,null,null,null,null,null,null,null,null,null,null,null,null,null,null,null,null,null,null,null,null,"General Service 3,000 to 4,999 kW - Time of Use"]
[null,null,null,null,null,null,null,null,null,null,null,null,null,null,null,null,null,null,null,null,null,null,"Intermediate With Self Generation"]
[null,null,null,null,null,null,null,null,null,null,null,null,null,null,null,null,null,null,null,null,null,null,"General Service - Commercial"]
[null,null,null,null,null,null,null,null,null,null,null,null,null,null,null,null,null,null,null,null,null,null,"General Service - Institutional"]
[null,null,null,null,null,null,null,null,null,null,null,null,null,null,null,null,null,null,null,null,null,null,"Farms – Three Phase energy-billed [F3]"]
[null,null,null,null,null,null,null,null,null,null,null,null,null,null,null,null,null,null,null,null,null,null,"Large Use"]
[null,null,null,null,null,null,null,null,null,null,null,null,null,null,null,null,null,null,null,null,null,null,"Large Use - Regular"]
[null,null,null,null,null,null,null,null,null,null,null,null,null,null,null,null,null,null,null,null,null,null,"Large Use > 5000 kW"]
[null,null,null,null,null,null,null,null,null,null,null,null,null,null,null,null,null,null,null,null,null,null,"Large Use - 3TS"]
[null,null,null,null,null,null,null,null,null,null,null,null,null,null,null,null,null,null,null,null,null,null,"Large Use - Ford Annex"]
[null,null,null,null,null,null,null,null,null,null,null,null,null,null,null,null,null,null,null,null,null,null,"Unmetered Scattered Load"]
[null,null,null,null,null,null,null,null,null,null,null,null,null,null,null,null,null,null,null,null,null,null,"Sentinel Lighting"]
[null,null,null,null,null,null,null,null,null,null,null,null,null,null,null,null,null,null,null,null,null,null,"Street Lighting"]
[null,null,null,null,null,null,null,null,null,null,null,null,null,null,null,null,null,null,null,null,null,null,"Embedded Distributor"]
[null,null,null,null,null,null,null,null,null,null,null,null,null,null,null,null,null,null,null,null,null,null,"Low Voltage Wheeling Charge Rate"]
[null,null,null,null,null,null,null,null,null,null,null,null,null,null,null,null,null,null,null,null,null,null,"Stand-By"]
[null,null,null,null,null,null,null,null,null,null,null,null,null,null,null,null,null,null,null,null,null,null,"Standby Power"]
[null,null,null,null,null,null,null,null,null,null,null,null,null,null,null,null,null,null,null,null,null,null,"Standby Power – INTERIM APPROVAL"]
[null,null,null,null,null,null,null,null,null,null,null,null,null,null,null,null,null,null,null,null,null,null,"Standby Power - APPROVED ON AN INTERIM BASIS"]
[null,null,null,null,null,null,null,null,null,null,null,null,null,null,null,null,null,null,null,null,null,null,"Standby - General Service 50 - 1,000 kW"]
[null,null,null,null,null,null,null,null,null,null,null,null,null,null,null,null,null,null,null,null,null,null,"Standby Power General Service 50 to 1,499 kW"]
[null,null,null,null,null,null,null,null,null,null,null,null,null,null,null,null,null,null,null,null,null,null,"Standby - General Service 1,000 - 5,000 kW"]
[null,null,null,null,null,null,null,null,null,null,null,null,null,null,null,null,null,null,null,null,null,null,"Standby Power General Service 1,500 to 4,999 kW"]
[null,null,null,null,null,null,null,null,null,null,null,null,null,null,null,null,null,null,null,null,null,null,"Standby - Large Use"]
[null,null,null,null,null,null,null,null,null,null,null,null,null,null,null,null,null,null,null,null,null,null,"Standby Power General Service Large Use"]
[null,null,null,null,null,null,null,null,null,null,null,null,null,null,null,null,null,null,null,null,null,null,"Standby Distribution Service"]

{"sheet":"4. RRR Data","index":3,"n_rows":34,"n_cols":9,"rows_kept":34,"cut":false,"hidden":false,"merged":[[12,1,12,8]]}
[]
[]
[]
[]
[]
[]
[]
[]
[]
[]
[]
[]
[]
[]
[null,"Rate Class","Rate Description","Unit","Rate","Non-Loss Adjusted Metered kWh","Non-Loss Adjusted Metered kW","Applicable \nLoss Factor\neg: (1.0325)","Loss Adjusted Billed kWh"]
[]
[null,"Residential","RTSR - Network","kWh",5.9399238706380553E-3,393553282.79506308,0,1.0287360269808161,{"$f":"F17*H17","v":404862440.54785079}]
[null,"Residential","RTSR - Connection","kWh",3.8676907620184288E-3,393553282.79506308,0,1.0287360269808161,{"$f":"F18*H18","v":404862440.54785079}]
[null,"General Service Less Than 50 kW","RTSR - Network","kWh",5.2512370540438889E-3,151746522.08460078,0,1.0287360269808161,{"$f":"F19*H19","v":156107114.23746887}]
[null,"General Service Less Than 50 kW","RTSR - Connection","kWh",3.6098446961708663E-3,151746522.08460078,0,1.0287360269808161,{"$f":"F20*H20","v":156107114.23746887}]
[null,"General Service 50 to 999 kW","RTSR - Network","kW",3.4015964117252584,439447002.45507395,1369688.6323982805]
[null,"General Service 50 to 999 kW","RTSR - Connection","kW",2.1955591127940868,439447002.45507395,1369688.6323982805]
[null,"General Service 1,000 to 4,999 kW","RTSR - Network","kW",2.5835225519369915,214007704.86139953,484625.02329374]
[null,"General Service 1,000 to 4,999 kW","RTSR - Connection","kW",1.7230132431889384,214007704.86139953,484625.02329374]
[null,"Large Use","RTSR - Network","kW",2.4481955755687381,145904991.57595247,332574.65216008137]
[null,"Large Use","RTSR - Connection","kW",1.7538688131530065,145904991.57595247,332574.65216008137]
[null,"Street Lighting","RTSR - Network","kW",1.7094930997669184,6074391.0594339594,17383.916721786645,1.0335000000000001]
[null,"Street Lighting","RTSR - Connection","kW",1.1033232933218973,6074391.0594339594,17383.916721786645,1.0335000000000001]
[null,"Unmetered Scattered Load","RTSR - Network","kWh",5.3E-3,2059804.7588936943,0,1.0287360269808161,{"$f":"F29*H29","v":2118995.364020477}]
[null,"Unmetered Scattered Load","RTSR - Connection","kWh",3.5999999999999999E-3,2059804.7588936943,0,1.0287360269808161,{"$f":"F30*H30","v":2118995.364020477}]
[null,"Embedded Distributor","RTSR - Network","kW",2.4481955654859595,58104381.490000002,114656.88436169598]
[null,"Embedded Distributor","RTSR - Connection","kW",1.75386883418276,58104381.490000002,114656.88436169598]
[null,"Embedded Distributor","RTSR - Network","kW",2.4481955654859595,12605162.219999999,24387.435638304029]
[null,"Embedded Distributor","RTSR - Connection","kW",1.75386883418276,12605162.219999999,24387.435638304029]

{"sheet":"5. UTRs and Sub-Transmission","index":4,"n_rows":75,"n_cols":10,"rows_kept":75,"cut":false,"hidden":false,"merged":[[48,4,48,5],[44,4,44,5],[59,4,59,5],[28,4,28,5],[17,4,17,5],[33,4,33,5],[19,4,19,5],[21,4,21,5],[23,4,23,5],[25,4,25,5],[69,4,69,5],[71,4,71,5],[74,4,74,5],[73,4,73,5],[50,4,50,5],[52,4,52,5],[54,4,54,5],[56,4,56,5],[65,4,65,5],[67,4,67,5]]}
[]
[]
[]
[]
[]
[]
[]
[]
[]
[]
[]
[]
[]
[]
[]
[]
[]
[null,"Uniform Transmission Rates","Unit",null,2016,null,null,2017,null,2018]
[]
[null,"Rate Description",null,null,"Rate",null,null,"Rate",null,"Rate"]
[]
[null,"Network Service Rate","kW",null,3.66,null,null,3.66,null,3.61]
[]
[null,"Line Connection Service Rate","kW",null,0.87,null,null,0.87,null,0.95]
[]
[null,"Transformation Connection Service Rate","kW",null,2.02,null,null,2.02,null,2.34]
[]
[]
[null,"Hydro One Sub-Transmission Rates","Unit",null,2016,null,null,2017,null,2018]
[null,null,null,null,"Jan 2016","Feb - Dec 2016"]
[]
[]
[]
[null,"Rate Description",null,null,"Rate",null,null,"Rate",null,"Rate"]
[]
[null,"Network Service Rate","kW",null,3.4121000000000001,3.3395999999999999,null,3.1941999999999999,null,3.1941999999999999]
[]
[null,"Line Connection Service Rate","kW",null,0.78790000000000004,0.77910000000000001,null,0.77100000000000002,null,0.77100000000000002]
[]
[null,"Transformation Connection Service Rate","kW",null,1.8018000000000001,1.7713000000000001,null,1.7493000000000001,null,1.7493000000000001]
[]
[null,"Both Line and Transformation Connection Service Rate","kW",null,{"$f":"E40+E38","v":2.5897000000000001},{"$f":"SUM(F40,F38)","v":2.5504000000000002},null,{"$f":"SUM(H40,H38)","v":2.5203000000000002},null,{"$f":"SUM(J40,J38)","v":2.5203000000000002}]
[]
[]
[null,"If needed, add extra host here. (I)","Unit",null,2016,null,null,2017,null,2018]
[]
[]
[]
[null,"Rate Description",null,null,"Rate",null,null,"Rate",null,"Rate"]
[]
[null,"Network Service Rate","kW"]
[]
[null,"Line Connection Service Rate","kW"]
[]
[null,"Transformation Connection Service Rate","kW"]
[]
[null,"Both Line and Transformation Connection Service Rate","kW",null,{"$f":"SUM(E53,E55)","v":0},null,null,{"$f":"SUM(H53,H55)","v":0},null,{"$f":"J55+J53","v":0}]
[]
[]
[null,"If needed, add extra host here. (II)","Unit",null,"Effective \nJanuary 1, 2016",null,null,"Effective \nJanuary 1, 2017",null,"Effective \nJanuary 1, 2018"]
[]
[]
[]
[null,"Rate Description",null,null,"Rate",null,null,"Rate",null,"Rate"]
[]
[null,"Network Service Rate","kW"]
[]
[null,"Line Connection Service Rate","kW"]
[]
[null,"Transformation Connection Service Rate","kW"]
[]
[null,"Both Line and Transformation Connection Service Rate","kW",null,{"$f":"SUM(E68,E70)","v":0},null,null,{"$f":"SUM(H68,H70)","v":0},null,{"$f":"J70+J68","v":0}]
[]
[null,null,null,null,"Historical 2016",null,null,"Current 2017",null,"Forecast 2018"]
[null,"Low Voltage Switchgear Credit (if applicable, enter as a negative value)","$"]

{"sheet":"6. Historical Wholesale","index":5,"n_rows":117,"n_cols":16,"rows_kept":117,"cut":false,"hidden":false,"merged":[[95,7,95,9],[95,11,95,13],[96,7,96,9],[96,11,96,13],[20,3,20,5],[20,7,20,9],[20,11,20,13],[96,3,96,5],[38,3,38,5],[38,7,38,9],[38,11,38,13],[95,3,95,5],[57,3,57,5],[57,7,57,9],[57,11,57,13],[76,3,76,5],[76,7,76,9],[76,11,76,13]]}
[]
[]
[]
[]
[]
[]
[]
[]
[]
[]
[]
[]
[]
[]
[]
[]
[]
[]
[]
[]
[null,"IESO",null,"Network",null,null,null,"Line Connection",null,null,null,"Transformation Connection",null,null,null,"Total Line"]
[null,"Month",null,"Units Billed","Rate","Amount",null,"Units Billed","Rate","Amount",null,"Units Billed","Rate","Amount",null,"Amount"]
[]
[null,"January",null,213396,{"$f":"IF(D24<>0,F24/D24,0)","v":3.66},781029.36,null,237341.00000000003,{"$f":"IF(H24<>0,J24/H24,0)","v":0.87},206486.67,null,161316,{"$f":"IF(L24<>0,N24/L24,0)","v":2.02},325858.32,null,{"$f":"J24+N24","v":532344.99}]
[null,"February",null,206916.99999999997,{"$f":"IF(D25<>0,F25/D25,0)","v":3.6600000000000006},757316.22,null,222637,0.87,193694.19,null,146089,2.02,295099.78000000003,null,488793.97000000003]
[null,"March",null,200773,3.66,734829.18,null,216787,0.87,188604.69,null,149426,2.02,301840.52,null,490445.21]
[null,"April",null,188501,3.66,689913.66,null,296787.32183908048,0.86999999999999988,258204.97,null,234275.31683168319,2.02,473236.14,null,731441.11]
[null,"May",null,211915,3.66,775608.9,null,222469,0.87,193548.03,null,154165,2.02,311413.3,null,504961.32999999996]
[null,"June",null,251957,3.66,922162.62,null,264468,0.87,230087.16,null,186572,2.02,376875.44,null,606962.6]
[null,"July",null,251759.99999999997,3.66,921441.6,null,279198,0.87,242902.26,null,181098,2.02,365817.96,null,608720.22]
[null,"August",null,237358.99999999997,3.66,868733.94,null,251309,0.87,218638.83,null,167684,2.02,338721.68,null,557360.51]
[null,"September",null,261407,3.66,956749.62,null,301252,0.87,262089.24,null,198455,2.02,400879.1,null,662968.34]
[null,"October",null,194544.99999999997,3.66,712034.7,null,214242,0.87,186390.54,null,148766,2.02,300507.32,null,486897.86]
[null,"November",null,113302.01136363637,3.52,398823.08,null,245121.61363636362,0.88,215707.02,null,233608.32394366196,2.13,497585.73,null,713292.75]
[null,"December",null,299830.98863636365,3.52,1055405.08,null,199130.38636363635,0.88,175234.74,null,71887.676056338038,2.13,153120.75,null,328355.49]
[]
[null,"Total",null,{"$f":"SUM(D24:D35)","v":2631663},{"$f":"IF(D37<>0,F37/D37,0)","v":3.6380220263764778},{"$f":"SUM(F24:F35)","v":9574047.9600000009},null,{"$f":"SUM(H24:H35)","v":2950742.3218390802},{"$f":"IF(H37<>0,J37/H37,0)","v":0.87150556013214708},{"$f":"SUM(J24:J35)","v":2571588.34},null,{"$f":"SUM(L24:L35)","v":2033342.3168316833},{"$f":"IF(L37<>0,N37/L37,0)","v":2.0365267597697776},{"$f":"SUM(N24:N35)","v":4140956.0400000005},null,{"$f":"SUM(P24:P35)","v":6712544.3799999999}]
[]
[null,"Hydro One",null,"Network",null,null,null,"Line Connection",null,null,null,"Transformation Connection",null,null,null,"Total Line"]
[]
[null,"Month",null,"Units Billed","Rate","Amount",null,"Units Billed","Rate","Amount",null,"Units Billed","Rate","Amount",null,"Amount"]
[]
[null,"January",null,11114.82,{"$f":"IF(D43<>0,F43/D43,0)","v":3.3395999999999999},37119.052872,null,11114.82,{"$f":"IF(H43<>0,J43/H43,0)","v":0.77910000000000001},8659.5562620000001,null,null,{"$f":"IF(L43<>0,N43/L43,0)","v":0},null,null,{"$f":"J43+N43","v":8659.5562620000001}]
[null,"February",null,5308.09,{"$f":"IF(D44<>0,F44/D44,0)","v":3.1941999999999999},16955.101078,null,5593.37,{"$f":"IF(H44<>0,J44/H44,0)","v":0.77100000000000002},4312.4882699999998,null,null,{"$f":"IF(L44<>0,N44/L44,0)","v":0},null,null,4312.4882699999998]
[null,"March",null,5012.1100000000006,3.1941999999999999,16009.681762000002,null,5256.72,0.77100000000000002,4052.9311200000002,null,null,0,null,null,4052.9311200000002]
[null,"April",null,4833,3.1941999999999999,15437.568600000001,null,5126.12,0.77100000000000002,3952.2385199999999,null,null,0,null,null,3952.2385199999999]
[null,"May",null,4287.6400000000003,3.1941999999999999,13695.579688000002,null,4287.6400000000003,0.77100000000000002,3305.7704400000002,null,null,0,null,null,3305.7704400000002]
[null,"June",null,4529,3.1941999999999999,14466.531799999999,null,4529,0.77100000000000002,3491.8589999999999,null,null,0,null,null,3491.8589999999999]
[null,"July",null,6124.06,3.1941999999999999,19561.472452000002,null,6124.06,0.77100000000000002,4721.6502600000003,null,null,0,null,null,4721.6502600000003]
[null,"August",null,5869.94,3.1941999999999995,18749.762347999997,null,5869.94,0.77099999999999991,4525.7237399999995,null,null,0,null,null,4525.7237399999995]
[null,"September",null,6129.23,3.1941999999999999,19577.986465999998,null,6129.23,0.77099999999999991,4725.6363299999994,null,null,0,null,null,4725.6363299999994]
[null,"October",null,12301.41,3.1942000000000004,39293.163822000002,null,12301.41,0.77100000000000002,9484.3871099999997,null,null,0,null,null,9484.3871099999997]
[null,"November",null,5848.5,3.1941999999999999,18681.278699999999,null,5848.5,0.77100000000000002,4509.1935000000003,null,null,0,null,null,4509.1935000000003]
[null,"December",null,6321.24,3.1941999999999995,20191.304807999997,null,6321.24,0.77100000000000002,4873.6760400000003,null,null,0,null,null,4873.6760400000003]
[]
[null,"Total",null,{"$f":"SUM(D43:D54)","v":77679.040000000008},{"$f":"IF(D56<>0,F56/D56,0)","v":3.2150047734369522},{"$f":"SUM(F43:F54)","v":249738.48439599999},null,{"$f":"SUM(H43:H54)","v":78502.05},{"$f":"IF(H56<>0,J56/H56,0)","v":0.77214684956634883},{"$f":"SUM(J43:J54)","v":60615.110591999997},null,{"$f":"SUM(L43:L54)","v":0},{"$f":"IF(L56<>0,N56/L56,0)","v":0},{"$f":"SUM(N43:N54)","v":0},null,{"$f":"SUM(P43:P54)","v":60615.110591999997}]
[]
[null,"Add Extra Host Here (I)",null,"Network",null,null,null,"Line Connection",null,null,null,"Transformation Connection",null,null,null,"Total Line"]
[null,"(if needed)"]
[null,"Month",null,"Units Billed","Rate","Amount",null,"Units Billed","Rate","Amount",null,"Units Billed","Rate","Amount",null,"Amount"]
[]
[null,"January",null,null,{"$f":"IF(D62<>0,F62/D62,0)","v":0},null,null,null,{"$f":"IF(H62<>0,J62/H62,0)","v":0},null,null,null,{"$f":"IF(L62<>0,N62/L62,0)","v":0},null,null,{"$f":"J62+N62","v":0}]
[null,"February",null,null,0,null,null,null,0,null,null,null,0,null,null,0]
[null,"March",null,null,0,null,null,null,0,null,null,null,0,null,null,0]
[null,"April",null,null,0,null,null,null,0,null,null,null,0,null,null,0]
[null,"May",null,null,0,null,null,null,0,null,null,null,0,null,null,0]
[null,"June",null,null,0,null,null,null,0,null,null,null,0,null,null,0]
[null,"July",null,null,0,null,null,null,0,null,null,null,0,null,null,0]
[null,"August",null,null,0,null,null,null,0,null,null,null,0,null,null,0]
[null,"September",null,null,0,null,null,null,0,null,null,null,0,null,null,0]
[null,"October",null,null,0,null,null,null,0,null,null,null,0,null,null,0]
[null,"November",null,null,0,null,null,null,0,null,null,null,0,null,null,0]
[null,"December",null,null,0,null,null,null,0,null,null,null,0,null,null,0]
[]
[null,"Total",null,{"$f":"SUM(D62:D73)","v":0},{"$f":"IF(D75<>0,F75/D75,0)","v":0},{"$f":"SUM(F62:F73)","v":0},null,{"$f":"SUM(H62:H73)","v":0},{"$f":"IF(H75<>0,J75/H75,0)","v":0},{"$f":"SUM(J62:J73)","v":0},null,{"$f":"SUM(L62:L73)","v":0},{"$f":"IF(L75<>0,N75/L75,0)","v":0},{"$f":"SUM(N62:N73)","v":0},null,{"$f":"SUM(P62:P73)","v":0}]
[]
[null,"Add Extra Host Here (II)",null,"Network",null,null,null,"Line Connection",null,null,null,"Transformation Connection",null,null,null,"Total Line"]
[null,"(if needed)"]
[null,"Month",null,"Units Billed","Rate","Amount",null,"Units Billed","Rate","Amount",null,"Units Billed","Rate","Amount",null,"Amount"]
[]
[null,"January",null,null,{"$f":"IF(D81<>0,F81/D81,0)","v":0},null,null,null,{"$f":"IF(H81<>0,J81/H81,0)","v":0},null,null,null,{"$f":"IF(L81<>0,N81/L81,0)","v":0},null,null,{"$f":"J81+N81","v":0}]
[null,"February",null,null,0,null,null,null,0,null,null,null,0,null,null,0]
[null,"March",null,null,0,null,null,null,0,null,null,null,0,null,null,0]
[null,"April",null,null,0,null,null,null,0,null,null,null,0,null,null,0]
[null,"May",null,null,0,null,null,null,0,null,null,null,0,null,null,0]
[null,"June",null,null,0,null,null,null,0,null,null,null,0,null,null,0]
[null,"July",null,null,0,null,null,null,0,null,null,null,0,null,null,0]
[null,"August",null,null,0,null,null,null,0,null,null,null,0,null,null,0]
[null,"September",null,null,0,null,null,null,0,null,null,null,0,null,null,0]
[null,"October",null,null,0,null,null,null,0,null,null,null,0,null,null,0]
[null,"November",null,null,0,null,null,null,0,null,null,null,0,null,null,0]
[null,"December",null,null,0,null,null,null,0,null,null,null,0,null,null,0]
[]
[null,"Total",null,{"$f":"SUM(D81:D92)","v":0},{"$f":"IF(D94<>0,F94/D94,0)","v":0},{"$f":"SUM(F81:F92)","v":0},null,{"$f":"SUM(H81:H92)","v":0},{"$f":"IF(H94<>0,J94/H94,0)","v":0},{"$f":"SUM(J81:J92)","v":0},null,{"$f":"SUM(L81:L92)","v":0},{"$f":"IF(L94<>0,N94/L94,0)","v":0},{"$f":"SUM(N81:N92)","v":0},null,{"$f":"SUM(P81:P92)","v":0}]
[]
[null,"Total",null,"Network",null,null,null,"Line Connection",null,null,null,"Transformation Connection",null,null,null,"Total Line"]
[]
[null,"Month",null,"Units Billed","Rate","Amount",null,"Units Billed","Rate","Amount",null,"Units Billed","Rate","Amount",null,"Amount"]
[]
[null,"January",null,{"$f":"D24+D43+D62+D81","v":224510.82},{"$f":"IF(D100<>0,F100/D100,0)","v":3.6441380102393284},{"$f":"F24+F43+F62+F81","v":818148.41287200002},null,{"$f":"H24+H43+H62+H81","v":248455.82000000004},{"$f":"IF(H100<>0,J100/H100,0)","v":0.86593353402629081},{"$f":"J24+J43+J62+J81","v":215146.22626200001},null,{"$f":"L24+L43+L62+L81","v":161316},{"$f":"IF(L100<>0,N100/L100,0)","v":2.02},{"$f":"N24+N43+N62+N81","v":325858.32},null,{"$f":"J100+N100","v":541004.54626199999}]
[null,"February",null,{"$f":"D25+D44+D63+D82","v":212225.08999999997},3.6483495946591429,{"$f":"F25+F44+F63+F82","v":774271.32107800001},null,{"$f":"H25+H44+H63+H82","v":228230.37},0.86757375133730019,{"$f":"J25+J44+J63+J82","v":198006.67827},null,{"$f":"L25+L44+L63+L82","v":146089},2.02,{"$f":"N25+N44+N63+N82","v":295099.78000000003},null,493106.45827000006]
[null,"March",null,205785.11,3.6486549574067824,750838.86176200002,null,222043.72,0.86765624859824897,192657.62112,null,149426,2.02,301840.52,null,494498.14112000004]
[null,"April",null,193334,3.6483558432557133,705351.22860000003,null,301913.44183908048,0.86831910140565882,262157.20851999999,null,234275.31683168319,2.02,473236.14,null,735393.34852]
[null,"May",null,216202.64,3.6507624499312312,789304.47968800005,null,226756.64,0.86812805322922393,196853.80043999999,null,154165,2.02,311413.3,null,508267.10043999995]
[null,"June",null,256486,3.651774957697496,936629.15179999999,null,268997,0.86833317471942062,233579.019,null,186572,2.02,376875.44,null,610454.45900000003]
[null,"July",null,257884.05999999997,3.6489384898469495,941003.07245199999,null,285322.06,0.86787509616326197,247623.91026,null,181098,2.02,365817.96,null,613441.87026]
[null,"August",null,243228.93999999997,3.64875866477073,887483.7023479999,null,257178.94,0.86774039017347215,223164.55373999997,null,167684,2.02,338721.68,null,561886.23373999994]
[null,"September",null,267536.23,3.6493285655778287,976327.60646599997,null,307381.23,0.86802592445218607,266814.87633,null,198455,2.02,400879.1,null,667693.97632999998]
[null,"October",null,206846.40999999997,3.6322983020203257,751327.86382199998,null,226543.41,0.86462425505999052,195874.92711000002,null,148766,2.02,300507.32,null,496382.24711]
[null,"November",null,119150.51136363637,3.5040081147936935,417504.35870000004,null,250970.11363636362,0.87745991070106588,220216.21349999998,null,233608.32394366196,2.13,497585.73,null,717801.94349999994]
[null,"December",null,306152.22863636364,3.5132730850885099,1075596.3848080002,null,205451.62636363634,0.8766463387406801,180108.41603999998,null,71887.676056338038,2.13,153120.75,null,333229.16603999998]
[]
[null,"Total",null,{"$f":"SUM(D100:D111)","v":2709342.04},{"$f":"IF(D113<>0,F113/D113,0)","v":3.6258937776627125},{"$f":"SUM(F100:F111)","v":9823786.4443960004},null,{"$f":"SUM(H100:H111)","v":3029244.3718390809},{"$f":"IF(H113<>0,J113/H113,0)","v":0.86893070597469368},{"$f":"SUM(J100:J111)","v":2632203.450592},null,{"$f":"SUM(L100:L111)","v":2033342.3168316833},{"$f":"IF(L113<>0,N113/L113,0)","v":2.0365267597697776},{"$f":"SUM(N100:N111)","v":4140956.0400000005},null,{"$f":"SUM(P100:P111)","v":6773159.4905920001}]
[]
[null,null,null,null,null,null,null,null,null,null,null,null,null,"Low Voltage Switchgear Credit (if applicable)",null,{"$f":"'5. UTRs and Sub-Transmission'!E75","v":0}]
[]
[null,null,null,null,null,null,null,null,null,null,null,null,null,"Total including deduction for Low Voltage Switchgear Credit",null,{"$f":"P113+P115","v":6773159.4905920001}]

{"sheet":"7. Current Wholesale","index":6,"n_rows":117,"n_cols":16,"rows_kept":117,"cut":false,"hidden":false,"merged":[[12,1,12,11],[19,3,19,5],[19,7,19,9],[19,11,19,13],[38,3,38,5],[38,7,38,9],[38,11,38,13],[96,7,96,9],[96,11,96,13],[20,3,20,5],[20,7,20,9],[20,11,20,13],[96,3,96,5],[95,3,95,5],[95,7,95,9],[95,11,95,13],[57,3,57,5],[57,7,57,9],[57,11,57,13],[76,3,76,5],[76,7,76,9],[76,11,76,13]]}
[]
[]
[]
[]
[]
[]
[]
[]
[]
[]
[]
[]
[null,"The purpose of this sheet is to calculate the expected billing when current 2017 Uniform Transmission Rates are applied against historical 2016 transmission units."]
[]
[]
[]
[]
[]
[]
[null,"IESO",null,"Network",null,null,null,"Line Connection",null,null,null,"Transformation Connection",null,null,null,"Total Line"]
[]
[null,"Month",null,"Units Billed","Rate","Amount",null,"Units Billed","Rate","Amount",null,"Units Billed","Rate","Amount",null,"Amount"]
[]
[null,"January",null,{"$f":"'6. Historical Wholesale'!D24","v":213396},{"$f":"'5. UTRs and Sub-Transmission'!H22","v":3.66},{"$f":"D24*E24","v":781029.36},null,{"$f":"'6. Historical Wholesale'!H24","v":237341.00000000003},{"$f":"'5. UTRs and Sub-Transmission'!H24","v":0.87},{"$f":"H24*I24","v":206486.67},null,{"$f":"'6. Historical Wholesale'!L24","v":161316},{"$f":"'5. UTRs and Sub-Transmission'!H26","v":2.02},{"$f":"L24*M24","v":325858.32},null,{"$f":"J24+N24","v":532344.99}]
[null,"February",null,{"$f":"'6. Historical Wholesale'!D25","v":206916.99999999997},{"$f":"E24","v":3.66},{"$f":"D25*E25","v":757316.22},null,{"$f":"'6. Historical Wholesale'!H25","v":222637},{"$f":"I24","v":0.87},{"$f":"H25*I25","v":193694.19},null,{"$f":"'6. Historical Wholesale'!L25","v":146089},{"$f":"M24","v":2.02},{"$f":"L25*M25","v":295099.78000000003},null,488793.97000000003]
[null,"March",null,{"$f":"'6. Historical Wholesale'!D26","v":200773},{"$f":"E25","v":3.66},734829.18,null,{"$f":"'6. Historical Wholesale'!H26","v":216787},{"$f":"I25","v":0.87},188604.69,null,{"$f":"'6. Historical Wholesale'!L26","v":149426},{"$f":"M25","v":2.02},301840.52,null,490445.21]
[null,"April",null,{"$f":"'6. Historical Wholesale'!D27","v":188501},3.66,689913.66,null,{"$f":"'6. Historical Wholesale'!H27","v":296787.32183908048},0.87,258204.97000000003,null,{"$f":"'6. Historical Wholesale'!L27","v":234275.31683168319},2.02,473236.14,null,731441.1100000001]
[null,"May",null,{"$f":"'6. Historical Wholesale'!D28","v":211915},3.66,775608.9,null,{"$f":"'6. Historical Wholesale'!H28","v":222469},0.87,193548.03,null,{"$f":"'6. Historical Wholesale'!L28","v":154165},2.02,311413.3,null,504961.32999999996]
[null,"June",null,{"$f":"'6. Historical Wholesale'!D29","v":251957},3.66,922162.62,null,{"$f":"'6. Historical Wholesale'!H29","v":264468},0.87,230087.16,null,{"$f":"'6. Historical Wholesale'!L29","v":186572},2.02,376875.44,null,606962.6]
[null,"July",null,{"$f":"'6. Historical Wholesale'!D30","v":251759.99999999997},3.66,921441.6,null,{"$f":"'6. Historical Wholesale'!H30","v":279198},0.87,242902.26,null,{"$f":"'6. Historical Wholesale'!L30","v":181098},2.02,365817.96,null,608720.22]
[null,"August",null,{"$f":"'6. Historical Wholesale'!D31","v":237358.99999999997},3.66,868733.94,null,{"$f":"'6. Historical Wholesale'!H31","v":251309},0.87,218638.83,null,{"$f":"'6. Historical Wholesale'!L31","v":167684},2.02,338721.68,null,557360.51]
[null,"September",null,{"$f":"'6. Historical Wholesale'!D32","v":261407},3.66,956749.62,null,{"$f":"'6. Historical Wholesale'!H32","v":301252},0.87,262089.24,null,{"$f":"'6. Historical Wholesale'!L32","v":198455},2.02,400879.1,null,662968.34]
[null,"October",null,{"$f":"'6. Historical Wholesale'!D33","v":194544.99999999997},3.66,712034.7,null,{"$f":"'6. Historical Wholesale'!H33","v":214242},0.87,186390.54,null,{"$f":"'6. Historical Wholesale'!L33","v":148766},2.02,300507.32,null,486897.86]
[null,"November",null,{"$f":"'6. Historical Wholesale'!D34","v":113302.01136363637},3.66,414685.36159090913,null,{"$f":"'6. Historical Wholesale'!H34","v":245121.61363636362},0.87,213255.80386363633,null,{"$f":"'6. Historical Wholesale'!L34","v":233608.32394366196},2.02,471888.81436619716,null,685144.61822983343]
[null,"December",null,{"$f":"'6. Historical Wholesale'!D35","v":299830.98863636365},3.66,1097381.418409091,null,{"$f":"'6. Historical Wholesale'!H35","v":199130.38636363635},0.87,173243.43613636363,null,{"$f":"'6. Historical Wholesale'!L35","v":71887.676056338038},2.02,145213.10563380283,null,318456.54177016648]
[]
[null,"Total",null,{"$f":"SUM(D24:D35)","v":2631663},{"$f":"IF(D37<>0,F37/D37,0)","v":3.66},{"$f":"SUM(F24:F35)","v":9631886.5800000001},null,{"$f":"SUM(H24:H35)","v":2950742.3218390802},{"$f":"IF(H37<>0,J37/H37,0)","v":0.87},{"$f":"SUM(J24:J35)","v":2567145.8199999998},null,{"$f":"SUM(L24:L35)","v":2033342.3168316833},{"$f":"IF(L37<>0,N37/L37,0)","v":2.02},{"$f":"SUM(N24:N35)","v":4107351.4800000004},null,{"$f":"SUM(P24:P35)","v":6674497.3000000007}]
[]
[null,"Hydro One",null,"Network",null,null,null,"Line Connection",null,null,null,"Transformation Connection",null,null,null,"Total Line"]
[]
[null,"Month",null,"Units Billed","Rate","Amount",null,"Units Billed","Rate","Amount",null,"Units Billed","Rate","Amount",null,"Amount"]
[]
[null,"January",null,{"$f":"'6. Historical Wholesale'!D43","v":11114.82},{"$f":"'5. UTRs and Sub-Transmission'!H36","v":3.1941999999999999},{"$f":"D43*E43","v":35502.958043999999},null,{"$f":"'6. Historical Wholesale'!H43","v":11114.82},{"$f":"'5. UTRs and Sub-Transmission'!H38","v":0.77100000000000002},{"$f":"H43*I43","v":8569.5262199999997},null,{"$f":"'6. Historical Wholesale'!L43","v":0},{"$f":"'5. UTRs and Sub-Transmission'!H40","v":1.7493000000000001},{"$f":"L43*M43","v":0},null,{"$f":"J43+N43","v":8569.5262199999997}]
[null,"February",null,{"$f":"'6. Historical Wholesale'!D44","v":5308.09},{"$f":"E43","v":3.1941999999999999},{"$f":"D44*E44","v":16955.101078},null,{"$f":"'6. Historical Wholesale'!H44","v":5593.37},{"$f":"I43","v":0.77100000000000002},{"$f":"H44*I44","v":4312.4882699999998},null,{"$f":"'6. Historical Wholesale'!L44","v":0},{"$f":"M43","v":1.7493000000000001},{"$f":"L44*M44","v":0},null,4312.4882699999998]
[null,"March",null,{"$f":"'6. Historical Wholesale'!D45","v":5012.1100000000006},3.1941999999999999,16009.681762000002,null,{"$f":"'6. Historical Wholesale'!H45","v":5256.72},0.77100000000000002,4052.9311200000002,null,{"$f":"'6. Historical Wholesale'!L45","v":0},{"$f":"M44","v":1.7493000000000001},0,null,4052.9311200000002]
[null,"April",null,{"$f":"'6. Historical Wholesale'!D46","v":4833},3.1941999999999999,15437.568600000001,null,{"$f":"'6. Historical Wholesale'!H46","v":5126.12},0.77100000000000002,3952.2385199999999,null,{"$f":"'6. Historical Wholesale'!L46","v":0},{"$f":"M45","v":1.7493000000000001},0,null,3952.2385199999999]
[null,"May",null,{"$f":"'6. Historical Wholesale'!D47","v":4287.6400000000003},3.1941999999999999,13695.579688000002,null,{"$f":"'6. Historical Wholesale'!H47","v":4287.6400000000003},0.77100000000000002,3305.7704400000002,null,{"$f":"'6. Historical Wholesale'!L47","v":0},1.7493000000000001,0,null,3305.7704400000002]
[null,"June",null,{"$f":"'6. Historical Wholesale'!D48","v":4529},3.1941999999999999,14466.531799999999,null,{"$f":"'6. Historical Wholesale'!H48","v":4529},0.77100000000000002,3491.8589999999999,null,{"$f":"'6. Historical Wholesale'!L48","v":0},1.7493000000000001,0,null,3491.8589999999999]
[null,"July",null,{"$f":"'6. Historical Wholesale'!D49","v":6124.06},3.1941999999999999,19561.472452000002,null,{"$f":"'6. Historical Wholesale'!H49","v":6124.06},0.77100000000000002,4721.6502600000003,null,{"$f":"'6. Historical Wholesale'!L49","v":0},1.7493000000000001,0,null,4721.6502600000003]
[null,"August",null,{"$f":"'6. Historical Wholesale'!D50","v":5869.94},3.1941999999999999,18749.762347999997,null,{"$f":"'6. Historical Wholesale'!H50","v":5869.94},0.77100000000000002,4525.7237399999995,null,{"$f":"'6. Historical Wholesale'!L50","v":0},1.7493000000000001,0,null,4525.7237399999995]
[null,"September",null,{"$f":"'6. Historical Wholesale'!D51","v":6129.23},3.1941999999999999,19577.986465999998,null,{"$f":"'6. Historical Wholesale'!H51","v":6129.23},0.77100000000000002,4725.6363299999994,null,{"$f":"'6. Historical Wholesale'!L51","v":0},1.7493000000000001,0,null,4725.6363299999994]
[null,"October",null,{"$f":"'6. Historical Wholesale'!D52","v":12301.41},3.1941999999999999,39293.163822000002,null,{"$f":"'6. Historical Wholesale'!H52","v":12301.41},0.77100000000000002,9484.3871099999997,null,{"$f":"'6. Historical Wholesale'!L52","v":0},1.7493000000000001,0,null,9484.3871099999997]
[null,"November",null,{"$f":"'6. Historical Wholesale'!D53","v":5848.5},3.1941999999999999,18681.278699999999,null,{"$f":"'6. Historical Wholesale'!H53","v":5848.5},0.77100000000000002,4509.1935000000003,null,{"$f":"'6. Historical Wholesale'!L53","v":0},1.7493000000000001,0,null,4509.1935000000003]
[null,"December",null,{"$f":"'6. Historical Wholesale'!D54","v":6321.24},3.1941999999999999,20191.304807999997,null,{"$f":"'6. Historical Wholesale'!H54","v":6321.24},0.77100000000000002,4873.6760400000003,null,{"$f":"'6. Historical Wholesale'!L54","v":0},1.7493000000000001,0,null,4873.6760400000003]
[]
[null,"Total",null,{"$f":"SUM(D43:D54)","v":77679.040000000008},{"$f":"IF(D56<>0,F56/D56,0)","v":3.1941999999999995},{"$f":"SUM(F43:F54)","v":248122.38956799998},null,{"$f":"SUM(H43:H54)","v":78502.05},{"$f":"IF(H56<>0,J56/H56,0)","v":0.77099999999999991},{"$f":"SUM(J43:J54)","v":60525.080549999999},null,{"$f":"SUM(L43:L54)","v":0},{"$f":"IF(L56<>0,N56/L56,0)","v":0},{"$f":"SUM(N43:N54)","v":0},null,{"$f":"SUM(P43:P54)","v":60525.080549999999}]
[]
[null,{"$f":"'6. Historical Wholesale'!B58","v":"Add Extra Host Here (I)"},null,"Network",null,null,null,"Line Connection",null,null,null,"Transformation Connection",null,null,null,"Total Line"]
[]
[null,"Month",null,"Units Billed","Rate","Amount",null,"Units Billed","Rate","Amount",null,"Units Billed","Rate","Amount",null,"Amount"]
[]
[null,"January",null,{"$f":"'6. Historical Wholesale'!D62","v":0},{"$f":"'5. UTRs and Sub-Transmission'!H51","v":0},{"$f":"D62*E62","v":0},null,{"$f":"'6. Historical Wholesale'!H62","v":0},{"$f":"'5. UTRs and Sub-Transmission'!H53","v":0},{"$f":"H62*I62","v":0},null,{"$f":"'6. Historical Wholesale'!L62","v":0},{"$f":"'5. UTRs and Sub-Transmission'!H55","v":0},{"$f":"L62*M62","v":0},null,{"$f":"J62+N62","v":0}]
[null,"February",null,{"$f":"'6. Historical Wholesale'!D63","v":0},{"$f":"E62","v":0},{"$f":"D63*E63","v":0},null,{"$f":"'6. Historical Wholesale'!H63","v":0},{"$f":"I62","v":0},{"$f":"H63*I63","v":0},null,{"$f":"'6. Historical Wholesale'!L63","v":0},{"$f":"M62","v":0},{"$f":"L63*M63","v":0},null,0]
[null,"March",null,{"$f":"'6. Historical Wholesale'!D64","v":0},{"$f":"E63","v":0},0,null,{"$f":"'6. Historical Wholesale'!H64","v":0},{"$f":"I63","v":0},0,null,{"$f":"'6. Historical Wholesale'!L64","v":0},{"$f":"M63","v":0},0,null,0]
[null,"April",null,{"$f":"'6. Historical Wholesale'!D65","v":0},0,0,null,{"$f":"'6. Historical Wholesale'!H65","v":0},0,0,null,{"$f":"'6. Historical Wholesale'!L65","v":0},{"$f":"M64","v":0},0,null,0]
[null,"May",null,{"$f":"'6. Historical Wholesale'!D66","v":0},0,0,null,{"$f":"'6. Historical Wholesale'!H66","v":0},0,0,null,{"$f":"'6. Historical Wholesale'!L66","v":0},0,0,null,0]
[null,"June",null,{"$f":"'6. Historical Wholesale'!D67","v":0},0,0,null,{"$f":"'6. Historical Wholesale'!H67","v":0},0,0,null,{"$f":"'6. Historical Wholesale'!L67","v":0},0,0,null,0]
[null,"July",null,{"$f":"'6. Historical Wholesale'!D68","v":0},0,0,null,{"$f":"'6. Historical Wholesale'!H68","v":0},0,0,null,{"$f":"'6. Historical Wholesale'!L68","v":0},0,0,null,0]
[null,"August",null,{"$f":"'6. Historical Wholesale'!D69","v":0},0,0,null,{"$f":"'6. Historical Wholesale'!H69","v":0},0,0,null,{"$f":"'6. Historical Wholesale'!L69","v":0},0,0,null,0]
[null,"September",null,{"$f":"'6. Historical Wholesale'!D70","v":0},0,0,null,{"$f":"'6. Historical Wholesale'!H70","v":0},0,0,null,{"$f":"'6. Historical Wholesale'!L70","v":0},0,0,null,0]
[null,"October",null,{"$f":"'6. Historical Wholesale'!D71","v":0},0,0,null,{"$f":"'6. Historical Wholesale'!H71","v":0},0,0,null,{"$f":"'6. Historical Wholesale'!L71","v":0},0,0,null,0]
[null,"November",null,{"$f":"'6. Historical Wholesale'!D72","v":0},0,0,null,{"$f":"'6. Historical Wholesale'!H72","v":0},0,0,null,{"$f":"'6. Historical Wholesale'!L72","v":0},0,0,null,0]
[null,"December",null,{"$f":"'6. Historical Wholesale'!D73","v":0},0,0,null,{"$f":"'6. Historical Wholesale'!H73","v":0},0,0,null,{"$f":"'6. Historical Wholesale'!L73","v":0},0,0,null,0]
[]
[null,"Total",null,{"$f":"SUM(D62:D73)","v":0},{"$f":"IF(D75<>0,F75/D75,0)","v":0},{"$f":"SUM(F62:F73)","v":0},null,{"$f":"SUM(H62:H73)","v":0},{"$f":"IF(H75<>0,J75/H75,0)","v":0},{"$f":"SUM(J62:J73)","v":0},null,{"$f":"SUM(L62:L73)","v":0},{"$f":"IF(L75<>0,N75/L75,0)","v":0},{"$f":"SUM(N62:N73)","v":0},null,{"$f":"SUM(P62:P73)","v":0}]
[]
[null,{"$f":"'6. Historical Wholesale'!B77","v":"Add Extra Host Here (II)"},null,"Network",null,null,null,"Line Connection",null,null,null,"Transformation Connection",null,null,null,"Total Line"]
[]
[null,"Month",null,"Units Billed","Rate","Amount",null,"Units Billed","Rate","Amount",null,"Units Billed","Rate","Amount",null,"Amount"]
[]
[null,"January",null,{"$f":"'6. Historical Wholesale'!D81","v":0},{"$f":"'5. UTRs and Sub-Transmission'!H66","v":0},{"$f":"D81*E81","v":0},null,{"$f":"'6. Historical Wholesale'!H81","v":0},{"$f":"'5. UTRs and Sub-Transmission'!H68","v":0},{"$f":"H81*I81","v":0},null,{"$f":"'6. Historical Wholesale'!L81","v":0},{"$f":"'5. UTRs and Sub-Transmission'!H70","v":0},{"$f":"L81*M81","v":0},null,{"$f":"J81+N81","v":0}]
[null,"February",null,{"$f":"'6. Historical Wholesale'!D82","v":0},{"$f":"E81","v":0},{"$f":"D82*E82","v":0},null,{"$f":"'6. Historical Wholesale'!H82","v":0},{"$f":"I81","v":0},{"$f":"H82*I82","v":0},null,{"$f":"'6. Historical Wholesale'!L82","v":0},{"$f":"M81","v":0},{"$f":"L82*M82","v":0},null,0]
[null,"March",null,{"$f":"'6. Historical Wholesale'!D83","v":0},{"$f":"E82","v":0},0,null,{"$f":"'6. Historical Wholesale'!H83","v":0},{"$f":"I82","v":0},0,null,{"$f":"'6. Historical Wholesale'!L83","v":0},{"$f":"M82","v":0},0,null,0]
[null,"April",null,{"$f":"'6. Historical Wholesale'!D84","v":0},0,0,null,{"$f":"'6. Historical Wholesale'!H84","v":0},0,0,null,{"$f":"'6. Historical Wholesale'!L84","v":0},{"$f":"M83","v":0},0,null,0]
[null,"May",null,{"$f":"'6. Historical Wholesale'!D85","v":0},0,0,null,{"$f":"'6. Historical Wholesale'!H85","v":0},0,0,null,{"$f":"'6. Historical Wholesale'!L85","v":0},0,0,null,0]
[null,"June",null,{"$f":"'6. Historical Wholesale'!D86","v":0},0,0,null,{"$f":"'6. Historical Wholesale'!H86","v":0},0,0,null,{"$f":"'6. Historical Wholesale'!L86","v":0},0,0,null,0]
[null,"July",null,{"$f":"'6. Historical Wholesale'!D87","v":0},0,0,null,{"$f":"'6. Historical Wholesale'!H87","v":0},0,0,null,{"$f":"'6. Historical Wholesale'!L87","v":0},0,0,null,0]
[null,"August",null,{"$f":"'6. Historical Wholesale'!D88","v":0},0,0,null,{"$f":"'6. Historical Wholesale'!H88","v":0},0,0,null,{"$f":"'6. Historical Wholesale'!L88","v":0},0,0,null,0]
[null,"September",null,{"$f":"'6. Historical Wholesale'!D89","v":0},0,0,null,{"$f":"'6. Historical Wholesale'!H89","v":0},0,0,null,{"$f":"'6. Historical Wholesale'!L89","v":0},0,0,null,0]
[null,"October",null,{"$f":"'6. Historical Wholesale'!D90","v":0},0,0,null,{"$f":"'6. Historical Wholesale'!H90","v":0},0,0,null,{"$f":"'6. Historical Wholesale'!L90","v":0},0,0,null,0]
[null,"November",null,{"$f":"'6. Historical Wholesale'!D91","v":0},0,0,null,{"$f":"'6. Historical Wholesale'!H91","v":0},0,0,null,{"$f":"'6. Historical Wholesale'!L91","v":0},0,0,null,0]
[null,"December",null,{"$f":"'6. Historical Wholesale'!D92","v":0},0,0,null,{"$f":"'6. Historical Wholesale'!H92","v":0},0,0,null,{"$f":"'6. Historical Wholesale'!L92","v":0},0,0,null,0]
[]
[null,"Total",null,{"$f":"SUM(D81:D92)","v":0},{"$f":"IF(D94<>0,F94/D94,0)","v":0},{"$f":"SUM(F81:F92)","v":0},null,{"$f":"SUM(H81:H92)","v":0},{"$f":"IF(H94<>0,J94/H94,0)","v":0},{"$f":"SUM(J81:J92)","v":0},null,{"$f":"SUM(L81:L92)","v":0},{"$f":"IF(L94<>0,N94/L94,0)","v":0},{"$f":"SUM(N81:N92)","v":0},null,{"$f":"SUM(P81:P92)","v":0}]
[]
[null,"Total",null,"Network",null,null,null,"Line Connection",null,null,null,"Transformation Connection",null,null,null,"Total Line"]
[]
[null,"Month",null,"Units Billed","Rate","Amount",null,"Units Billed","Rate","Amount",null,"Units Billed","Rate","Amount",null,"Amount"]
[]
[null,"January",null,{"$f":"D24+D43+D62+D81","v":224510.82},{"$f":"IF(D100<>0,F100/D100,0)","v":3.6369397165089858},{"$f":"F24+F43+F62+F81","v":816532.31804399996},null,{"$f":"H24+H43+H62+H81","v":248455.82000000004},{"$f":"IF(H100<>0,J100/H100,0)","v":0.86557117567219788},{"$f":"J24+J43+J62+J81","v":215056.19622000001},null,{"$f":"L24+L43+L62+L81","v":161316},{"$f":"IF(L100<>0,N100/L100,0)","v":2.02},{"$f":"N24+N43+N62+N81","v":325858.32},null,{"$f":"J100+N100","v":540914.51621999999}]
[null,"February",null,{"$f":"D25+D44+D63+D82","v":212225.08999999997},3.6483495946591429,{"$f":"F25+F44+F63+F82","v":774271.32107800001},null,{"$f":"H25+H44+H63+H82","v":228230.37},0.86757375133730019,{"$f":"J25+J44+J63+J82","v":198006.67827},null,{"$f":"L25+L44+L63+L82","v":146089},2.02,{"$f":"N25+N44+N63+N82","v":295099.78000000003},null,493106.45827000006]
[null,"March",null,205785.11,3.6486549574067824,750838.86176200002,null,222043.72,0.86765624859824897,192657.62112,null,149426,2.02,301840.52,null,494498.14112000004]
[null,"April",null,193334,3.6483558432557133,705351.22860000003,null,301913.44183908048,0.86831910140565893,262157.20852000004,null,234275.31683168319,2.02,473236.14,null,735393.34852]
[null,"May",null,216202.64,3.6507624499312312,789304.47968800005,null,226756.64,0.86812805322922393,196853.80043999999,null,154165,2.02,311413.3,null,508267.10043999995]
[null,"June",null,256486,3.651774957697496,936629.15179999999,null,268997,0.86833317471942062,233579.019,null,186572,2.02,376875.44,null,610454.45900000003]
[null,"July",null,257884.05999999997,3.6489384898469495,941003.07245199999,null,285322.06,0.86787509616326197,247623.91026,null,181098,2.02,365817.96,null,613441.87026]
[null,"August",null,243228.93999999997,3.64875866477073,887483.7023479999,null,257178.94,0.86774039017347215,223164.55373999997,null,167684,2.02,338721.68,null,561886.23373999994]
[null,"September",null,267536.23,3.6493285655778287,976327.60646599997,null,307381.23,0.86802592445218607,266814.87633,null,198455,2.02,400879.1,null,667693.97632999998]
[null,"October",null,206846.40999999997,3.6322983020203257,751327.86382199998,null,226543.41,0.86462425505999052,195874.92711000002,null,148766,2.02,300507.32,null,496382.24711]
[null,"November",null,119150.51136363637,3.6371362181427336,433366.64029090916,null,250970.11363636362,0.86769294641656436,217764.99736363633,null,233608.32394366196,2.02,471888.81436619716,null,689653.81172983348]
[null,"December",null,306152.22863636364,3.6503824525298585,1117572.7232170911,null,205451.62636363634,0.86695401408557182,178117.11217636362,null,71887.676056338038,2.02,145213.10563380283,null,323330.21781016642]
[]
[null,"Total",null,{"$f":"SUM(D100:D111)","v":2709342.04},{"$f":"IF(D113<>0,F113/D113,0)","v":3.6466451351295612},{"$f":"SUM(F100:F111)","v":9880008.9695680011},null,{"$f":"SUM(H100:H111)","v":3029244.3718390809},{"$f":"IF(H113<>0,J113/H113,0)","v":0.86743444173000728},{"$f":"SUM(J100:J111)","v":2627670.9005499999},null,{"$f":"SUM(L100:L111)","v":2033342.3168316833},{"$f":"IF(L113<>0,N113/L113,0)","v":2.02},{"$f":"SUM(N100:N111)","v":4107351.4800000004},null,{"$f":"SUM(P100:P111)","v":6735022.3805499999}]
[]
[null,null,null,null,null,null,null,null,null,null,null,null,null,"Low Voltage Switchgear Credit (if applicable)",null,{"$f":"'5. UTRs and Sub-Transmission'!H75","v":0}]
[]
[null,null,null,null,null,null,null,null,null,null,null,null,null,"Total including deduction for Low Voltage Switchgear Credit",null,{"$f":"P113+P115","v":6735022.3805499999}]

{"sheet":"8. Forecast Wholesale","index":7,"n_rows":117,"n_cols":16,"rows_kept":117,"cut":false,"hidden":false,"merged":[[12,1,12,12],[19,3,19,5],[19,7,19,9],[19,11,19,13],[38,3,38,5],[38,7,38,9],[38,11,38,13],[96,7,96,9],[96,11,96,13],[20,3,20,5],[20,7,20,9],[20,11,20,13],[96,3,96,5],[95,3,95,5],[95,7,95,9],[95,11,95,13],[57,3,57,5],[57,7,57,9],[57,11,57,13],[76,3,76,5],[76,7,76,9],[76,11,76,13]]}
[]
[]
[]
[]
[]
[]
[]
[]
[]
[]
[]
[]
[null,"The purpose of this sheet is to calculate the expected billing when forecasted 2018 Uniform Transmission Rates are applied against historical 2016 transmission units."]
[]
[]
[]
[]
[]
[]
[null,"IESO",null,"Network",null,null,null,"Line Connection",null,null,null,"Transformation Connection",null,null,null,"Total Line"]
[]
[null,"Month",null,"Units Billed","Rate","Amount",null,"Units Billed","Rate","Amount",null,"Units Billed","Rate","Amount",null,"Amount"]
[]
[null,"January",null,{"$f":"'6. Historical Wholesale'!D24","v":213396},{"$f":"'5. UTRs and Sub-Transmission'!J22","v":3.61},{"$f":"D24*E24","v":770359.55999999994},null,{"$f":"'6. Historical Wholesale'!H24","v":237341.00000000003},{"$f":"'5. UTRs and Sub-Transmission'!J24","v":0.95},{"$f":"H24*I24","v":225473.95},null,{"$f":"'6. Historical Wholesale'!L24","v":161316},{"$f":"'5. UTRs and Sub-Transmission'!J26","v":2.34},{"$f":"L24*M24","v":377479.44},null,{"$f":"J24+N24","v":602953.39}]
[null,"February",null,{"$f":"'6. Historical Wholesale'!D25","v":206916.99999999997},{"$f":"E24","v":3.61},746970.36999999988,null,{"$f":"'6. Historical Wholesale'!H25","v":222637},{"$f":"I24","v":0.95},211505.15,null,{"$f":"'6. Historical Wholesale'!L25","v":146089},{"$f":"M24","v":2.34},341848.25999999995,null,553353.40999999992]
[null,"March",null,{"$f":"'6. Historical Wholesale'!D26","v":200773},3.61,724790.53,null,{"$f":"'6. Historical Wholesale'!H26","v":216787},0.95,205947.65,null,{"$f":"'6. Historical Wholesale'!L26","v":149426},2.34,349656.83999999997,null,555604.49]
[null,"April",null,{"$f":"'6. Historical Wholesale'!D27","v":188501},3.61,680488.61,null,{"$f":"'6. Historical Wholesale'!H27","v":296787.32183908048},0.95,281947.95574712643,null,{"$f":"'6. Historical Wholesale'!L27","v":234275.31683168319},2.34,548204.2413861386,null,830152.19713326497]
[null,"May",null,{"$f":"'6. Historical Wholesale'!D28","v":211915},3.61,765013.15,null,{"$f":"'6. Historical Wholesale'!H28","v":222469},0.95,211345.55,null,{"$f":"'6. Historical Wholesale'!L28","v":154165},2.34,360746.1,null,572091.64999999991]
[null,"June",null,{"$f":"'6. Historical Wholesale'!D29","v":251957},3.61,909564.77,null,{"$f":"'6. Historical Wholesale'!H29","v":264468},0.95,251244.59999999998,null,{"$f":"'6. Historical Wholesale'!L29","v":186572},2.34,436578.48,null,687823.08]
[null,"July",null,{"$f":"'6. Historical Wholesale'!D30","v":251759.99999999997},3.61,908853.59999999986,null,{"$f":"'6. Historical Wholesale'!H30","v":279198},0.95,265238.09999999998,null,{"$f":"'6. Historical Wholesale'!L30","v":181098},2.34,423769.31999999995,null,689007.41999999993]
[null,"August",null,{"$f":"'6. Historical Wholesale'!D31","v":237358.99999999997},3.61,856865.98999999987,null,{"$f":"'6. Historical Wholesale'!H31","v":251309},0.95,238743.55,null,{"$f":"'6. Historical Wholesale'!L31","v":167684},2.34,392380.56,null,631124.11]
[null,"September",null,{"$f":"'6. Historical Wholesale'!D32","v":261407},3.61,943679.27,null,{"$f":"'6. Historical Wholesale'!H32","v":301252},0.95,286189.39999999997,null,{"$f":"'6. Historical Wholesale'!L32","v":198455},2.34,464384.69999999995,null,750574.09999999986]
[null,"October",null,{"$f":"'6. Historical Wholesale'!D33","v":194544.99999999997},3.61,702307.44999999984,null,{"$f":"'6. Historical Wholesale'!H33","v":214242},0.95,203529.9,null,{"$f":"'6. Historical Wholesale'!L33","v":148766},2.34,348112.44,null,551642.34]
[null,"November",null,{"$f":"'6. Historical Wholesale'!D34","v":113302.01136363637},3.61,409020.2610227273,null,{"$f":"'6. Historical Wholesale'!H34","v":245121.61363636362},0.95,232865.53295454543,null,{"$f":"'6. Historical Wholesale'!L34","v":233608.32394366196},2.34,546643.4780281689,null,779509.01098271436]
[null,"December",null,{"$f":"'6. Historical Wholesale'!D35","v":299830.98863636365},3.61,1082389.8689772727,null,{"$f":"'6. Historical Wholesale'!H35","v":199130.38636363635},0.95,189173.86704545454,null,{"$f":"'6. Historical Wholesale'!L35","v":71887.676056338038},2.34,168217.161971831,null,357391.02901728556]
[]
[null,"Total",null,{"$f":"SUM(D24:D35)","v":2631663},{"$f":"IF(D37<>0,F37/D37,0)","v":3.61},{"$f":"SUM(F24:F35)","v":9500303.4299999997},null,{"$f":"SUM(H24:H35)","v":2950742.3218390802},{"$f":"IF(H37<>0,J37/H37,0)","v":0.95000000000000018},{"$f":"SUM(J24:J35)","v":2803205.2057471266},null,{"$f":"SUM(L24:L35)","v":2033342.3168316833},{"$f":"IF(L37<>0,N37/L37,0)","v":2.34},{"$f":"SUM(N24:N35)","v":4758021.0213861382},null,{"$f":"SUM(P24:P35)","v":7561226.2271332648}]
[]
[null,"Hydro One",null,"Network",null,null,null,"Line Connection",null,null,null,"Transformation Connection",null,null,null,"Total Line"]
[]
[null,"Month",null,"Units Billed","Rate","Amount",null,"Units Billed","Rate","Amount",null,"Units Billed","Rate","Amount",null,"Amount"]
[]
[null,"January",null,{"$f":"'6. Historical Wholesale'!D43","v":11114.82},{"$f":"'5. UTRs and Sub-Transmission'!J36","v":3.1941999999999999},{"$f":"D43*E43","v":35502.958043999999},null,{"$f":"'6. Historical Wholesale'!H43","v":11114.82},{"$f":"'5. UTRs and Sub-Transmission'!J38","v":0.77100000000000002},{"$f":"H43*I43","v":8569.5262199999997},null,{"$f":"'6. Historical Wholesale'!L43","v":0},{"$f":"'5. UTRs and Sub-Transmission'!J40","v":1.7493000000000001},{"$f":"L43*M43","v":0},null,{"$f":"J43+N43","v":8569.5262199999997}]
[null,"February",null,{"$f":"'6. Historical Wholesale'!D44","v":5308.09},{"$f":"E43","v":3.1941999999999999},16955.101078,null,{"$f":"'6. Historical Wholesale'!H44","v":5593.37},{"$f":"I43","v":0.77100000000000002},4312.4882699999998,null,{"$f":"'6. Historical Wholesale'!L44","v":0},{"$f":"M43","v":1.7493000000000001},0,null,4312.4882699999998]
[null,"March",null,{"$f":"'6. Historical Wholesale'!D45","v":5012.1100000000006},3.1941999999999999,16009.681762000002,null,{"$f":"'6. Historical Wholesale'!H45","v":5256.72},0.77100000000000002,4052.9311200000002,null,{"$f":"'6. Historical Wholesale'!L45","v":0},1.7493000000000001,0,null,4052.9311200000002]
[null,"April",null,{"$f":"'6. Historical Wholesale'!D46","v":4833},3.1941999999999999,15437.568600000001,null,{"$f":"'6. Historical Wholesale'!H46","v":5126.12},0.77100000000000002,3952.2385199999999,null,{"$f":"'6. Historical Wholesale'!L46","v":0},1.7493000000000001,0,null,3952.2385199999999]
[null,"May",null,{"$f":"'6. Historical Wholesale'!D47","v":4287.6400000000003},3.1941999999999999,13695.579688000002,null,{"$f":"'6. Historical Wholesale'!H47","v":4287.6400000000003},0.77100000000000002,3305.7704400000002,null,{"$f":"'6. Historical Wholesale'!L47","v":0},1.7493000000000001,0,null,3305.7704400000002]
[null,"June",null,{"$f":"'6. Historical Wholesale'!D48","v":4529},3.1941999999999999,14466.531799999999,null,{"$f":"'6. Historical Wholesale'!H48","v":4529},0.77100000000000002,3491.8589999999999,null,{"$f":"'6. Historical Wholesale'!L48","v":0},1.7493000000000001,0,null,3491.8589999999999]
[null,"July",null,{"$f":"'6. Historical Wholesale'!D49","v":6124.06},3.1941999999999999,19561.472452000002,null,{"$f":"'6. Historical Wholesale'!H49","v":6124.06},0.77100000000000002,4721.6502600000003,null,{"$f":"'6. Historical Wholesale'!L49","v":0},1.7493000000000001,0,null,4721.6502600000003]
[null,"August",null,{"$f":"'6. Historical Wholesale'!D50","v":5869.94},3.1941999999999999,18749.762347999997,null,{"$f":"'6. Historical Wholesale'!H50","v":5869.94},0.77100000000000002,4525.7237399999995,null,{"$f":"'6. Historical Wholesale'!L50","v":0},1.7493000000000001,0,null,4525.7237399999995]
[null,"September",null,{"$f":"'6. Historical Wholesale'!D51","v":6129.23},3.1941999999999999,19577.986465999998,null,{"$f":"'6. Historical Wholesale'!H51","v":6129.23},0.77100000000000002,4725.6363299999994,null,{"$f":"'6. Historical Wholesale'!L51","v":0},1.7493000000000001,0,null,4725.6363299999994]
[null,"October",null,{"$f":"'6. Historical Wholesale'!D52","v":12301.41},3.1941999999999999,39293.163822000002,null,{"$f":"'6. Historical Wholesale'!H52","v":12301.41},0.77100000000000002,9484.3871099999997,null,{"$f":"'6. Historical Wholesale'!L52","v":0},1.7493000000000001,0,null,9484.3871099999997]
[null,"November",null,{"$f":"'6. Historical Wholesale'!D53","v":5848.5},3.1941999999999999,18681.278699999999,null,{"$f":"'6. Historical Wholesale'!H53","v":5848.5},0.77100000000000002,4509.1935000000003,null,{"$f":"'6. Historical Wholesale'!L53","v":0},1.7493000000000001,0,null,4509.1935000000003]
[null,"December",null,{"$f":"'6. Historical Wholesale'!D54","v":6321.24},3.1941999999999999,20191.304807999997,null,{"$f":"'6. Historical Wholesale'!H54","v":6321.24},0.77100000000000002,4873.6760400000003,null,{"$f":"'6. Historical Wholesale'!L54","v":0},1.7493000000000001,0,null,4873.6760400000003]
[]
[null,"Total",null,{"$f":"SUM(D43:D54)","v":77679.040000000008},{"$f":"IF(D56<>0,F56/D56,0)","v":3.1941999999999995},{"$f":"SUM(F43:F54)","v":248122.38956799998},null,{"$f":"SUM(H43:H54)","v":78502.05},{"$f":"IF(H56<>0,J56/H56,0)","v":0.77099999999999991},{"$f":"SUM(J43:J54)","v":60525.080549999999},null,{"$f":"SUM(L43:L54)","v":0},{"$f":"IF(L56<>0,N56/L56,0)","v":0},{"$f":"SUM(N43:N54)","v":0},null,{"$f":"SUM(P43:P54)","v":60525.080549999999}]
[]
[null,{"$f":"'6. Historical Wholesale'!B58","v":"Add Extra Host Here (I)"},null,"Network",null,null,null,"Line Connection",null,null,null,"Transformation Connection",null,null,null,"Total Line"]
[]
[null,"Month",null,"Units Billed","Rate","Amount",null,"Units Billed","Rate","Amount",null,"Units Billed","Rate","Amount",null,"Amount"]
[]
[null,"January",null,{"$f":"'6. Historical Wholesale'!D62","v":0},{"$f":"'5. UTRs and Sub-Transmission'!J51","v":0},{"$f":"D62*E62","v":0},null,{"$f":"'6. Historical Wholesale'!H62","v":0},{"$f":"'5. UTRs and Sub-Transmission'!J53","v":0},{"$f":"H62*I62","v":0},null,{"$f":"'6. Historical Wholesale'!L62","v":0},{"$f":"'5. UTRs and Sub-Transmission'!J55","v":0},{"$f":"L62*M62","v":0},null,{"$f":"J62+N62","v":0}]
[null,"February",null,{"$f":"'6. Historical Wholesale'!D63","v":0},{"$f":"E62","v":0},0,null,{"$f":"'6. Historical Wholesale'!H63","v":0},{"$f":"I62","v":0},0,null,{"$f":"'6. Historical Wholesale'!L63","v":0},{"$f":"M62","v":0},0,null,0]
[null,"March",null,{"$f":"'6. Historical Wholesale'!D64","v":0},0,0,null,{"$f":"'6. Historical Wholesale'!H64","v":0},0,0,null,{"$f":"'6. Historical Wholesale'!L64","v":0},0,0,null,0]
[null,"April",null,{"$f":"'6. Historical Wholesale'!D65","v":0},0,0,null,{"$f":"'6. Historical Wholesale'!H65","v":0},0,0,null,{"$f":"'6. Historical Wholesale'!L65","v":0},0,0,null,0]
[null,"May",null,{"$f":"'6. Historical Wholesale'!D66","v":0},0,0,null,{"$f":"'6. Historical Wholesale'!H66","v":0},0,0,null,{"$f":"'6. Historical Wholesale'!L66","v":0},0,0,null,0]
[null,"June",null,{"$f":"'6. Historical Wholesale'!D67","v":0},0,0,null,{"$f":"'6. Historical Wholesale'!H67","v":0},0,0,null,{"$f":"'6. Historical Wholesale'!L67","v":0},0,0,null,0]
[null,"July",null,{"$f":"'6. Historical Wholesale'!D68","v":0},0,0,null,{"$f":"'6. Historical Wholesale'!H68","v":0},0,0,null,{"$f":"'6. Historical Wholesale'!L68","v":0},0,0,null,0]
[null,"August",null,{"$f":"'6. Historical Wholesale'!D69","v":0},0,0,null,{"$f":"'6. Historical Wholesale'!H69","v":0},0,0,null,{"$f":"'6. Historical Wholesale'!L69","v":0},0,0,null,0]
[null,"September",null,{"$f":"'6. Historical Wholesale'!D70","v":0},0,0,null,{"$f":"'6. Historical Wholesale'!H70","v":0},0,0,null,{"$f":"'6. Historical Wholesale'!L70","v":0},0,0,null,0]
[null,"October",null,{"$f":"'6. Historical Wholesale'!D71","v":0},0,0,null,{"$f":"'6. Historical Wholesale'!H71","v":0},0,0,null,{"$f":"'6. Historical Wholesale'!L71","v":0},0,0,null,0]
[null,"November",null,{"$f":"'6. Historical Wholesale'!D72","v":0},0,0,null,{"$f":"'6. Historical Wholesale'!H72","v":0},0,0,null,{"$f":"'6. Historical Wholesale'!L72","v":0},0,0,null,0]
[null,"December",null,{"$f":"'6. Historical Wholesale'!D73","v":0},0,0,null,{"$f":"'6. Historical Wholesale'!H73","v":0},0,0,null,{"$f":"'6. Historical Wholesale'!L73","v":0},0,0,null,0]
[]
[null,"Total",null,{"$f":"SUM(D62:D73)","v":0},{"$f":"IF(D75<>0,F75/D75,0)","v":0},{"$f":"SUM(F62:F73)","v":0},null,{"$f":"SUM(H62:H73)","v":0},{"$f":"IF(H75<>0,J75/H75,0)","v":0},{"$f":"SUM(J62:J73)","v":0},null,{"$f":"SUM(L62:L73)","v":0},{"$f":"IF(L75<>0,N75/L75,0)","v":0},{"$f":"SUM(N62:N73)","v":0},null,{"$f":"SUM(P62:P73)","v":0}]
[]
[null,{"$f":"'6. Historical Wholesale'!B77","v":"Add Extra Host Here (II)"},null,"Network",null,null,null,"Line Connection",null,null,null,"Transformation Connection",null,null,null,"Total Line"]
[]
[null,"Month",null,"Units Billed","Rate","Amount",null,"Units Billed","Rate","Amount",null,"Units Billed","Rate","Amount",null,"Amount"]
[]
[null,"January",null,{"$f":"'6. Historical Wholesale'!D81","v":0},{"$f":"'5. UTRs and Sub-Transmission'!J66","v":0},{"$f":"D81*E81","v":0},null,{"$f":"'6. Historical Wholesale'!H81","v":0},{"$f":"'5. UTRs and Sub-Transmission'!J68","v":0},{"$f":"H81*I81","v":0},null,{"$f":"'6. Historical Wholesale'!L81","v":0},{"$f":"'5. UTRs and Sub-Transmission'!J70","v":0},{"$f":"L81*M81","v":0},null,{"$f":"J81+N81","v":0}]
[null,"February",null,{"$f":"'6. Historical Wholesale'!D82","v":0},{"$f":"E81","v":0},0,null,{"$f":"'6. Historical Wholesale'!H82","v":0},{"$f":"I81","v":0},0,null,{"$f":"'6. Historical Wholesale'!L82","v":0},{"$f":"M81","v":0},0,null,0]
[null,"March",null,{"$f":"'6. Historical Wholesale'!D83","v":0},0,0,null,{"$f":"'6. Historical Wholesale'!H83","v":0},0,0,null,{"$f":"'6. Historical Wholesale'!L83","v":0},0,0,null,0]
[null,"April",null,{"$f":"'6. Historical Wholesale'!D84","v":0},0,0,null,{"$f":"'6. Historical Wholesale'!H84","v":0},0,0,null,{"$f":"'6. Historical Wholesale'!L84","v":0},0,0,null,0]
[null,"May",null,{"$f":"'6. Historical Wholesale'!D85","v":0},0,0,null,{"$f":"'6. Historical Wholesale'!H85","v":0},0,0,null,{"$f":"'6. Historical Wholesale'!L85","v":0},0,0,null,0]
[null,"June",null,{"$f":"'6. Historical Wholesale'!D86","v":0},0,0,null,{"$f":"'6. Historical Wholesale'!H86","v":0},0,0,null,{"$f":"'6. Historical Wholesale'!L86","v":0},0,0,null,0]
[null,"July",null,{"$f":"'6. Historical Wholesale'!D87","v":0},0,0,null,{"$f":"'6. Historical Wholesale'!H87","v":0},0,0,null,{"$f":"'6. Historical Wholesale'!L87","v":0},0,0,null,0]
[null,"August",null,{"$f":"'6. Historical Wholesale'!D88","v":0},0,0,null,{"$f":"'6. Historical Wholesale'!H88","v":0},0,0,null,{"$f":"'6. Historical Wholesale'!L88","v":0},0,0,null,0]
[null,"September",null,{"$f":"'6. Historical Wholesale'!D89","v":0},0,0,null,{"$f":"'6. Historical Wholesale'!H89","v":0},0,0,null,{"$f":"'6. Historical Wholesale'!L89","v":0},0,0,null,0]
[null,"October",null,{"$f":"'6. Historical Wholesale'!D90","v":0},0,0,null,{"$f":"'6. Historical Wholesale'!H90","v":0},0,0,null,{"$f":"'6. Historical Wholesale'!L90","v":0},0,0,null,0]
[null,"November",null,{"$f":"'6. Historical Wholesale'!D91","v":0},0,0,null,{"$f":"'6. Historical Wholesale'!H91","v":0},0,0,null,{"$f":"'6. Historical Wholesale'!L91","v":0},0,0,null,0]
[null,"December",null,{"$f":"'6. Historical Wholesale'!D92","v":0},0,0,null,{"$f":"'6. Historical Wholesale'!H92","v":0},0,0,null,{"$f":"'6. Historical Wholesale'!L92","v":0},0,0,null,0]
[]
[null,"Total",null,{"$f":"SUM(D81:D92)","v":0},{"$f":"IF(D94<>0,F94/D94,0)","v":0},{"$f":"SUM(F81:F92)","v":0},null,{"$f":"SUM(H81:H92)","v":0},{"$f":"IF(H94<>0,J94/H94,0)","v":0},{"$f":"SUM(J81:J92)","v":0},null,{"$f":"SUM(L81:L92)","v":0},{"$f":"IF(L94<>0,N94/L94,0)","v":0},{"$f":"SUM(N81:N92)","v":0},null,{"$f":"SUM(P81:P92)","v":0}]
[]
[null,"Total",null,"Network",null,null,null,"Line Connection",null,null,null,"Transformation Connection",null,null,null,"Total Line"]
[]
[null,"Month",null,"Units Billed","Rate","Amount",null,"Units Billed","Rate","Amount",null,"Units Billed","Rate","Amount",null,"Amount"]
[]
[null,"January",null,{"$f":"D24+D43+D62+D81","v":224510.82},{"$f":"IF(D100<>0,F100/D100,0)","v":3.5894150582319369},{"$f":"F24+F43+F62+F81","v":805862.51804399991},null,{"$f":"H24+H43+H62+H81","v":248455.82000000004},{"$f":"IF(H100<>0,J100/H100,0)","v":0.94199232773053965},{"$f":"J24+J43+J62+J81","v":234043.47622000001},null,{"$f":"L24+L43+L62+L81","v":161316},{"$f":"IF(L100<>0,N100/L100,0)","v":2.34},{"$f":"N24+N43+N62+N81","v":377479.44},null,{"$f":"J100+N100","v":611522.91622000001}]
[null,"February",null,{"$f":"D25+D44+D63+D82","v":212225.08999999997},3.5996001748803597,763925.47107799991,null,{"$f":"H25+H44+H63+H82","v":228230.37},0.94561314635734062,{"$f":"J25+J44+J63+J82","v":215817.63827},null,{"$f":"L25+L44+L63+L82","v":146089},2.34,{"$f":"N25+N44+N63+N82","v":341848.25999999995},null,557665.89827000001]
[null,"March",null,205785.11,3.5998727593167459,740800.21176199999,null,{"$f":"H26+H45+H64+H83","v":222043.72},0.94576230807158157,{"$f":"J26+J45+J64+J83","v":210000.58111999999},null,{"$f":"L26+L45+L64+L83","v":149426},2.34,{"$f":"N26+N45+N64+N83","v":349656.83999999997},null,559657.42111999996]
[null,"April",null,193334,3.5996057527387837,695926.17859999998,null,{"$f":"H27+H46+H65+H84","v":301913.44183908048},0.94696079951124179,{"$f":"J27+J46+J65+J84","v":285900.19426712644},null,{"$f":"L27+L46+L65+L84","v":234275.31683168319},2.34,{"$f":"N27+N46+N65+N84","v":548204.2413861386},null,834104.4356532651]
[null,"May",null,216202.64,3.6017540289424774,778708.72968800005,null,{"$f":"H28+H47+H66+H85","v":226756.64},0.94661536897001108,{"$f":"J28+J47+J66+J85","v":214651.32043999998},null,{"$f":"L28+L47+L66+L85","v":154165},2.34,{"$f":"N28+N47+N66+N85","v":360746.1},null,575397.42044000002]
[null,"June",null,256486,3.6026578518905517,924031.30180000002,null,{"$f":"H29+H48+H67+H86","v":268997},0.94698624519976049,{"$f":"J29+J48+J67+J86","v":254736.45899999997},null,{"$f":"L29+L48+L67+L86","v":186572},2.34,{"$f":"N29+N48+N67+N86","v":436578.48},null,691314.93900000001]
[null,"July",null,257884.05999999997,3.6001258567590413,928415.07245199988,null,{"$f":"H30+H49+H68+H87","v":285322.06},0.94615800215377666,{"$f":"J30+J49+J68+J87","v":269959.75026},null,{"$f":"L30+L49+L68+L87","v":181098},2.34,{"$f":"N30+N49+N68+N87","v":423769.31999999995},null,693729.07025999995]
[null,"August",null,243228.93999999997,3.5999653345033691,875615.75234799983,null,{"$f":"H31+H50+H69+H88","v":257178.94},0.94591444283890425,{"$f":"J31+J50+J69+J88","v":243269.27373999998},null,{"$f":"L31+L50+L69+L88","v":167684},2.34,{"$f":"N31+N50+N69+N88","v":392380.56},null,635649.83373999991]
[null,"September",null,267536.23,3.6004740609000883,963257.25646599999,null,{"$f":"H32+H51+H70+H89","v":307381.23},0.94643071188829586,{"$f":"J32+J51+J70+J89","v":290915.03632999997},null,{"$f":"L32+L51+L70+L89","v":198455},2.34,{"$f":"N32+N51+N70+N89","v":464384.69999999995},null,755299.73632999999]
[null,"October",null,206846.40999999997,3.5852718634178857,741600.61382199987,null,{"$f":"H33+H52+H71+H90","v":226543.41},0.94028021874483125,{"$f":"J33+J52+J71+J90","v":213014.28711},null,{"$f":"L33+L52+L71+L90","v":148766},2.34,{"$f":"N33+N52+N71+N90","v":348112.44},null,561126.72710999998]
[null,"November",null,119150.51136363637,3.5895904669466479,427701.53972272732,null,{"$f":"H34+H53+H72+H91","v":250970.11363636362},0.9458286606925761,{"$f":"J34+J53+J72+J91","v":237374.72645454542},null,{"$f":"L34+L53+L72+L91","v":233608.32394366196},2.3399999999999994,{"$f":"N34+N53+N72+N91","v":546643.4780281689},null,784018.2044827143]
[null,"December",null,306152.22863636364,3.6014148213008048,1102581.1737852728,null,{"$f":"H35+H54+H73+H92","v":205451.62636363634},0.94449261132643791,{"$f":"J35+J54+J73+J92","v":194047.54308545453},null,{"$f":"L35+L54+L73+L92","v":71887.676056338038},2.34,{"$f":"N35+N54+N73+N92","v":168217.161971831},null,362264.70505728549]
[]
[null,"Total",null,{"$f":"SUM(D100:D111)","v":2709342.04},{"$f":"IF(D113<>0,F113/D113,0)","v":3.5980786757983494},{"$f":"SUM(F100:F111)","v":9748425.8195679989},null,{"$f":"SUM(H100:H111)","v":3029244.3718390809},{"$f":"IF(H113<>0,J113/H113,0)","v":0.94536126333001336},{"$f":"SUM(J100:J111)","v":2863730.2862971262},null,{"$f":"SUM(L100:L111)","v":2033342.3168316833},{"$f":"IF(L113<>0,N113/L113,0)","v":2.34},{"$f":"SUM(N100:N111)","v":4758021.0213861382},null,{"$f":"SUM(P100:P111)","v":7621751.3076832648}]
[]
[null,null,null,null,null,null,null,null,null,null,null,null,null,"Low Voltage Switchgear Credit (if applicable)",null,{"$f":"'5. UTRs and Sub-Transmission'!J75","v":0}]
[]
[null,null,null,null,null,null,null,null,null,null,null,null,null,"Total including deduction for Low Voltage Switchgear Credit",null,{"$f":"P113+P115","v":7621751.3076832648}]

{"sheet":"9. RTSR Rates to Forecast","index":8,"n_rows":64,"n_cols":10,"rows_kept":64,"cut":false,"hidden":false,"merged":[]}
[]
[]
[]
[]
[]
[]
[]
[]
[]
[]
[]
[]
["The purpose of this sheet is to re-align the current RTS Network Rates to recover current wholesale network costs."]
[]
["Rate Class","Rate Description","Unit","Current RTSR-Network","Loss Adjusted Billed kWh","Billed kW","Billed Amount","Billed Amount %","Current Wholesale Billing","Adjusted RTSR Network"]
[]
["Residential","RTSR - Network","kWh",5.9399238706380553E-3,404862440.54785079,0,{"$f":"ROUND(D17*E17, 2)","v":2404852.0699999998},{"$f":"G17/10331339","v":0.2327725447785616},{"$f":"H17*total_current_wholesale_network","v":2299794.8302813577},{"$f":"IF(ISERROR(I17/E17), 0, I17/E17)","v":5.6804351304342452E-3}]
["General Service Less Than 50 kW","RTSR - Network","kWh",5.2512370540438889E-3,156107114.23746887,0,{"$f":"ROUND(D18*E18, 2)","v":819755.46},7.9346487420459244E-2,783944.00741785194,{"$f":"IF(ISERROR(I18/E18), 0, I18/E18)","v":5.0218339583506921E-3}]
["General Service 50 to 999 kW","RTSR - Network","kW",3.4015964117252584,null,1369688.6323982805,{"$f":"ROUND(D19*F19, 2)","v":4659127.9400000004},0.45097038631681724,4455591.4618197009,{"$f":"IF(ISERROR(I19/F19), 0, I19/F19)","v":3.2529958681325288}]
["General Service 1,000 to 4,999 kW","RTSR - Network","kW",2.5835225519369915,null,484625.02329374,{"$f":"ROUND(D20*F20, 2)","v":1252039.6799999999},0.12118851970688407,1197343.661712683,{"$f":"IF(ISERROR(I20/F20), 0, I20/F20)","v":2.4706600034289838}]
["Large Use","RTSR - Network","kW",2.4481955755687381,null,332574.65216008137,{"$f":"ROUND(D21*F21, 2)","v":814207.79},7.8809512493975858E-2,778638.69032776298,{"$f":"IF(ISERROR(I21/F21), 0, I21/F21)","v":2.3412448461435158}]
["Street Lighting","RTSR - Network","kW",1.7094930997669184,null,17383.916721786645,{"$f":"ROUND(D22*F22, 2)","v":29717.69},2.8764606407746373E-3,28419.456931462737,{"$f":"IF(ISERROR(I22/F22), 0, I22/F22)","v":1.6348132234115942}]
["Unmetered Scattered Load","RTSR - Network","kWh",5.3E-3,2118995.364020477,0,{"$f":"ROUND(D23*E23, 2)","v":11230.68},1.0870498006115181E-3,10740.061780408907,{"$f":"IF(ISERROR(I23/E23), 0, I23/E23)","v":5.0684687483370629E-3}]
["Embedded Distributor","RTSR - Network","kW",2.4481955654859595,null,114656.88436169598,{"$f":"ROUND(D24*F24, 2)","v":280702.48},2.7169999939020487E-2,268439.84310068446,{"$f":"IF(ISERROR(I24/F24), 0, I24/F24)","v":2.3412448767913978}]
["Embedded Distributor","RTSR - Network","kW",2.4481955654859595,null,24387.435638304029,{"$f":"ROUND(D25*F25, 2)","v":59705.21},5.7790389028953551E-3,57096.956196088526,{"$f":"IF(ISERROR(I25/F25), 0, I25/F25)","v":2.3412447722223577}]
[]
["The purpose of this table is to re-align the current RTS Connection Rates to recover current wholesale connection costs."]
["Rate Class","Rate Description","Unit","Current RTSR-Connection","Loss Adjusted Billed kWh","Billed kW","Billed Amount","Billed Amount %","Current Wholesale Billing","Adjusted RTSR-Connection"]
[]
["Residential","RTSR - Connection","kWh",3.8676907620184288E-3,404862440.54785079,0,{"$f":"ROUND(D30*E30, 2)","v":1565882.72},{"$f":"G30/6825619.12","v":0.22941255473979624},{"$f":"H30*Total_Current_Wholesale_Lineplus","v":1545098.6905516796},{"$f":"IF(ISERROR(I30/E30), 0, I30/E30)","v":3.8163547314018229E-3}]
["General Service Less Than 50 kW","RTSR - Connection","kWh",3.6098446961708663E-3,156107114.23746887,0,{"$f":"ROUND(D31*E31, 2)","v":563522.43999999994},8.2559901174210248E-2,556042.78214430227,{"$f":"IF(ISERROR(I31/E31), 0, I31/E31)","v":3.5619310808503867E-3}]
["General Service 50 to 999 kW","RTSR - Connection","kW",2.1955591127940868,null,1369688.6323982805,{"$f":"ROUND(D32*F32, 2)","v":3007232.36},0.44058015941563405,2967317.234090582,{"$f":"IF(ISERROR(I32/F32), 0, I32/F32)","v":2.1664173622401357}]
["General Service 1,000 to 4,999 kW","RTSR - Connection","kW",1.7230132431889384,null,484625.02329374,{"$f":"ROUND(D33*F33, 2)","v":835015.33},0.12233547101292108,823932.1352071492,{"$f":"IF(ISERROR(I33/F33), 0, I33/F33)","v":1.7001436071280807}]
["Large Use","RTSR - Connection","kW",1.7538688131530065,null,332574.65216008137,{"$f":"ROUND(D34*F34, 2)","v":583292.31000000006},8.5456322678608532E-2,575550.245799931,{"$f":"IF(ISERROR(I34/F34), 0, I34/F34)","v":1.7305896347232617}]
["Street Lighting","RTSR - Connection","kW",1.1033232933218973,null,17383.916721786645,{"$f":"ROUND(D35*F35, 2)","v":19180.080000000002},2.8100132255841435E-3,18925.501963950701,{"$f":"IF(ISERROR(I35/F35), 0, I35/F35)","v":1.0886788211676164}]
["Unmetered Scattered Load","RTSR - Connection","kWh",3.5999999999999999E-3,2118995.364020477,0,{"$f":"ROUND(D36*E36, 2)","v":7628.38},1.1176099729397148E-3,7527.1281804748587,{"$f":"IF(ISERROR(I36/E36), 0, I36/E36)","v":3.552215501875029E-3}]
["Embedded Distributor","RTSR - Connection","kW",1.75386883418276,null,114656.88436169598,{"$f":"ROUND(D37*F37, 2)","v":201093.14},2.9461523777494343E-2,198424.02200653037,{"$f":"IF(ISERROR(I37/F37), 0, I37/F37)","v":1.7305896903720412}]
["Embedded Distributor","RTSR - Connection","kW",1.75386883418276,null,24387.435638304029,{"$f":"ROUND(D38*F38, 2)","v":42772.36},6.2664440028115716E-3,42204.640605399261,{"$f":"IF(ISERROR(I38/F38), 0, I38/F38)","v":1.7305895228734387}]
[]
["The purpose of this table is to update the re-aligned RTS Network Rates to recover future wholesale network costs."]
["Rate Class","Rate Description","Unit","Adjusted RTSR-Network","Loss Adjusted Billed kWh","Billed kW","Billed Amount","Billed Amount %","Current Wholesale Billing","Proposed RTSR-Network"]
[]
["Residential","RTSR - Network","kWh",5.6804351304342452E-3,404862440.54785079,0,{"$f":"IF(ISERROR(D43*E43), 0, ROUND(D43*E43, 2))","v":2299794.83},{"$f":"G43/9880008.97","v":0.23277254473990625},{"$f":"H43*forecast_wholesale_network","v":2269165.8852290493},{"$f":"IF(ISERROR(I43/E43), 0, I43/E43)","v":5.6047824099426579E-3}]
["General Service Less Than 50 kW","RTSR - Network","kWh",5.0218339583506921E-3,156107114.23746887,0,{"$f":"IF(ISERROR(D44*E44), 0, ROUND(D44*E44, 2))","v":783944.01},7.9346487678340641E-2,773503.34917556995,{"$f":"IF(ISERROR(I44/E44), 0, I44/E44)","v":4.9549525846651864E-3}]
["General Service 50 to 999 kW","RTSR - Network","kW",3.2529958681325288,null,1369688.6323982805,{"$f":"ROUND(D45*F45, 2)","v":4455591.46},0.45097038611291862,4396251.3558437256,{"$f":"IF(ISERROR(I45/F45), 0, I45/F45)","v":3.2096720757228097}]
["General Service 1,000 to 4,999 kW","RTSR - Network","kW",2.4706600034289838,null,484625.02329374,{"$f":"ROUND(D46*F46, 2)","v":1197343.6599999999},0.12118851952823681,1181397.2928042843,{"$f":"IF(ISERROR(I46/F46), 0, I46/F46)","v":2.4377554521946712}]
["Large Use","RTSR - Network","kW",2.3412448461435158,null,332574.65216008137,{"$f":"ROUND(D47*F47, 2)","v":778638.69},7.8809512457355582E-2,768268.68606685102,{"$f":"IF(ISERROR(I47/F47), 0, I47/F47)","v":2.3100638640886344}]
["Street Lighting","RTSR - Network","kW",1.6348132234115942,null,17383.916721786645,{"$f":"ROUND(D48*F48, 2)","v":28419.46},2.8764609512292776E-3,28040.966205942615,{"$f":"IF(ISERROR(I48/F48), 0, I48/F48)","v":1.6130407580013237}]
["Unmetered Scattered Load","RTSR - Network","kWh",5.0684687483370629E-3,2118995.364020477,0,{"$f":"IF(ISERROR(D49*E49), 0, ROUND(D49*E49, 2))","v":10740.06},1.0870496203608203E-3,10597.022586277011,{"$f":"IF(ISERROR(I49/E49), 0, I49/E49)","v":5.0009654415528043E-3}]
["Embedded Distributor","RTSR - Network","kW",2.3412448767913978,null,114656.88436169598,{"$f":"ROUND(D50*F50, 2)","v":268439.84000000003},2.7169999623998319E-2,264864.72585223801,{"$f":"IF(ISERROR(I50/F50), 0, I50/F50)","v":2.310063868617755}]
["Embedded Distributor","RTSR - Network","kW",2.3412447722223577,null,24387.435638304029,{"$f":"ROUND(D51*F51, 2)","v":57096.959999999999},5.779039287653602E-3,56336.53580406023,{"$f":"IF(ISERROR(I51/F51), 0, I51/F51)","v":2.3100639460253656}]
[]
["The purpose of this table is to update the re-aligned RTS Connection Rates to recover future wholesale connection costs."]
["Rate Class","Rate Description","Unit","Adjusted RTSR-Connection","Loss Adjusted Billed kWh","Billed kW","Billed Amount","Billed Amount %","Current Wholesale Billing","Proposed RTSR-Connection"]
[]
["Residential","RTSR - Connection","kWh",3.8163547314018229E-3,404862440.54785079,0,{"$f":"ROUND(D56*E56, 2)","v":1545098.69},{"$f":"G56/6735022.38","v":0.22941255467661861},{"$f":"H56*forecast_wholesale_lineplus","v":1748525.4386054764},{"$f":"IF(ISERROR(I56/E56), 0, I56/E56)","v":4.3188136598678083E-3}]
["General Service Less Than 50 kW","RTSR - Connection","kWh",3.5619310808503867E-3,156107114.23746887,0,{"$f":"ROUND(D57*E57, 2)","v":556042.78},8.255990086257145E-2,629251.03236150462,{"$f":"IF(ISERROR(I57/E57), 0, I57/E57)","v":4.0308927330774498E-3}]
["General Service 50 to 999 kW","RTSR - Connection","kW",2.1664173622401357,null,1369688.6323982805,{"$f":"ROUND(D58*F58, 2)","v":2967317.23},0.44058015884425317,3357992.4018104873,{"$f":"IF(ISERROR(I58/F58), 0, I58/F58)","v":2.4516465438796486}]
["General Service 1,000 to 4,999 kW","RTSR - Connection","kW",1.7001436071280807,null,484625.02329374,{"$f":"ROUND(D59*F59, 2)","v":823932.14},0.12233547173454233,932410.54166879714,{"$f":"IF(ISERROR(I59/F59), 0, I59/F59)","v":1.9239834858953335}]
["Large Use","RTSR - Connection","kW",1.7305896347232617,null,332574.65216008137,{"$f":"ROUND(D60*F60, 2)","v":575550.25},8.5456323309203316E-2,651326.8439317242,{"$f":"IF(ISERROR(I60/F60), 0, I60/F60)","v":1.958438021963907}]
["Street Lighting","RTSR - Connection","kW",1.0886788211676164,null,17383.916721786645,{"$f":"ROUND(D61*F61, 2)","v":18925.5},2.810012934210918E-3,21417.219755928953,{"$f":"IF(ISERROR(I61/F61), 0, I61/F61)","v":1.232013481121174}]
["Unmetered Scattered Load","RTSR - Connection","kWh",3.552215501875029E-3,2118995.364020477,0,{"$f":"ROUND(D62*E62, 2)","v":7527.13},1.117610243189719E-3,8518.147332511453,{"$f":"IF(ISERROR(I62/E62), 0, I62/E62)","v":4.0198989941863496E-3}]
["Embedded Distributor","RTSR - Connection","kW",1.7305896903720412,null,114656.88436169598,{"$f":"ROUND(D63*F63, 2)","v":198424.02},2.9461523481975421E-2,224548.40512508739,{"$f":"IF(ISERROR(I63/F63), 0, I63/F63)","v":1.9584380508433163}]
["Embedded Distributor","RTSR - Connection","kW",1.7305895228734387,null,24387.435638304029,{"$f":"ROUND(D64*F64, 2)","v":42204.639999999999},6.2664439134350733E-3,47761.277091747608,{"$f":"IF(ISERROR(I64/F64), 0, I64/F64)","v":1.9584378530037634}]

{"sheet":"hidden1","index":9,"n_rows":22,"n_cols":2,"rows_kept":22,"cut":false,"hidden":true,"merged":[]}
[{"$f":"IF('3. Rate Classes'!L17=1, '3. Rate Classes'!C17, \"\")","v":"Residential"},1]
[{"$f":"IF('3. Rate Classes'!L18=1, '3. Rate Classes'!C18, \"\")","v":"General Service Less Than 50 kW"},2]
[{"$f":"IF('3. Rate Classes'!L19=1, '3. Rate Classes'!C19, \"\")","v":"General Service 50 to 999 kW"},3]
[{"$f":"IF('3. Rate Classes'!L20=1, '3. Rate Classes'!C20, \"\")","v":"General Service 1,000 to 4,999 kW"},4]
[{"$f":"IF('3. Rate Classes'!L21=1, '3. Rate Classes'!C21, \"\")","v":"Large Use"},5]
[{"$f":"IF('3. Rate Classes'!L22=1, '3. Rate Classes'!C22, \"\")","v":"Street Lighting"},6]
[{"$f":"IF('3. Rate Classes'!L23=1, '3. Rate Classes'!C23, \"\")","v":"Unmetered Scattered Load"},7]
[{"$f":"IF('3. Rate Classes'!L24=1, '3. Rate Classes'!C24, \"\")","v":"Embedded Distributor"},8]
[{"$f":"IF('3. Rate Classes'!L25=1, '3. Rate Classes'!C25, \"\")","v":"Embedded Distributor"},9]
[{"$f":"IF('3. Rate Classes'!L26=1, '3. Rate Classes'!C26, \"\")","v":""},10]
[{"$f":"IF('3. Rate Classes'!L27=1, '3. Rate Classes'!C27, \"\")","v":""},11]
[{"$f":"IF('3. Rate Classes'!L28=1, '3. Rate Classes'!C28, \"\")","v":""},12]
[{"$f":"IF('3. Rate Classes'!L29=1, '3. Rate Classes'!C29, \"\")","v":""},13]
[{"$f":"IF('3. Rate Classes'!L30=1, '3. Rate Classes'!C30, \"\")","v":""},14]
[{"$f":"IF('3. Rate Classes'!L31=1, '3. Rate Classes'!C31, \"\")","v":""},15]
[{"$f":"IF('3. Rate Classes'!L32=1, '3. Rate Classes'!C32, \"\")","v":""},16]
[{"$f":"IF('3. Rate Classes'!L33=1, '3. Rate Classes'!C33, \"\")","v":""},17]
[{"$f":"IF('3. Rate Classes'!L34=1, '3. Rate Classes'!C34, \"\")","v":""},18]
[{"$f":"IF('3. Rate Classes'!L35=1, '3. Rate Classes'!C35, \"\")","v":""},19]
[{"$f":"IF('3. Rate Classes'!L36=1, '3. Rate Classes'!C36, \"\")","v":""},20]
[{"$f":"IF('3. Rate Classes'!L37=1, '3. Rate Classes'!C37, \"\")","v":""},21]
[{"$f":"IF('3. Rate Classes'!L38=1, '3. Rate Classes'!C38, \"\")","v":""},22]