{"text_format":"1","workbook":"xlsx","n_sheets":14,"sheets":["1. Information Sheet","Sheet1","2.2-TSC Current Tariff Schedule","2016 List","3. Regulatory Charges","4.2-TS Tariff Schedule","5. 2-W Bill Impacts","20. HIDDEN","Database","lists","Sheet2","New Class Template","Sheet5","Sheet10"],"not_rendered":{"charts":0,"images":2,"macros":1,"external_links":11,"defined_names":443,"comments":0,"pivot_tables":0},"unopened":[],"bounds":{"document_bytes":16777216,"sheet_cells":100000,"rows_first":2000,"rows_last":500,"rows_between":2000,"halvings":0,"cell_chars":16384,"cell_head_chars":4096},"cells_cut":0,"cells_raw":0,"read":"whole","date_system":"1900"}

{"sheet":"1. Information Sheet","index":0,"n_rows":44,"n_cols":21,"rows_kept":44,"cut":false,"hidden":false,"merged":[[43,0,43,6],[13,5,13,11],[15,5,15,9],[40,2,40,12],[23,5,23,9],[27,5,27,7],[29,5,29,7],[29,0,29,4],[31,0,31,4],[31,5,31,7],[17,5,17,7],[19,5,19,10],[21,5,21,7],[36,2,36,11],[38,2,38,13],[25,5,25,7]]}
[null,null,null,null,null,null,null,null,null,null,null,null,null,null,null,null,null,null,null,null,"a"]
[]
[]
[]
[]
[]
[]
[]
[]
[]
[]
[null,null,null,null,null,null,null,null,null,null,null,null,"Version",2]
[]
[null,null,null,null,"Utility Name   ","Energy+ Inc."]
[]
[null,null,null,null,"Service Territory","For Former Cambridge and North Dumfries Hydro Service Area"]
[]
[null,null,null,null,"Assigned EB Number","EB-2018-0028"]
[]
[null,null,null,null,"Name of Contact and Title","Sarah Hughes, Chief Financial Officer, Finance"]
[]
[null,null,null,null,"Phone Number   ","519-621-8405 ext 2638"]
[]
[null,null,null,null,"Email Address   ","shughes@energyplus.ca"]
[]
[null,null,null,null,"We are applying for rates effective   ","2019-01-01"]
[]
[null,null,null,null,"Rate-Setting Method","Cost of Service"]
[]
["Please indicate in which Rate Year the Group 1 accounts were last cleared1",null,null,null,null,2016]
[]
["Please indicate the last Cost of Service \nRe-Basing Year",null,null,null,null,2014]
[]
[]
[null,"Notes"]
[]
[null,null,"Pale green cells represent input cells."]
[]
[null,null,"Pale blue cells represent drop-down lists.  The applicant should select the appropriate item from the drop-down list."]
[]
[null,null,"White cells contain fixed values, automatically generated values or formulae. "]
[]
[]
["Note:  \n1.  Rate year of application"]

{"sheet":"Sheet1","index":1,"n_rows":16,"n_cols":3,"rows_kept":16,"cut":false,"hidden":true,"merged":[]}
["1. Information Sheet"]
["Sheet1","X"]
["2.2-TSC Current Tariff Schedule","X","X"]
["2016 List","X"]
["3. Regulatory Charges","X","X"]
["4.2-TS Tariff Schedule","X"]
["4.2-TS Tariff Schedule","X","X"]
["5. 2-W Bill Impacts","X","X"]
["20. HIDDEN","X"]
["20. Bill Impacts hidden","X"]
["2.1.7 Filing","X"]
["2 1 5 TotalConsumptionData_Dist","X"]
["212_Total_Connection_RollUp","X"]
["2016 Database","X"]
["lists","X"]
["Sheet2","X"]

{"sheet":"2.2-TSC Current Tariff Schedule","index":2,"n_rows":361,"n_cols":52,"rows_kept":361,"cut":false,"hidden":false,"merged":[[359,1,359,2],[360,1,360,2],[256,1,256,2],[257,1,257,2],[258,1,258,2],[350,1,350,2],[351,1,351,2],[352,1,352,2],[356,1,356,4],[357,1,357,2],[358,1,358,2],[344,1,344,2],[345,1,345,2],[346,1,346,2],[347,1,347,2],[348,1,348,2],[349,1,349,2],[337,1,337,4],[339,1,339,4],[340,1,340,2],[341,1,341,2],[342,1,342,2],[343,1,343,2],[326,1,326,2],[327,1,327,2],[328,1,328,2],[331,1,331,4],[333,1,333,4],[335,1,335,4],[318,1,318,2],[319,1,319,2],[320,1,320,2],[321,1,321,2],[322,1,322,2],[323,1,323,2],[310,1,310,2],[311,1,311,2],[314,1,314,2],[315,1,315,2],[316,1,316,2],[317,1,317,2],[304,1,304,2],[305,1,305,2],[306,1,306,2],[307,1,307,2],[308,1,308,2],[309,1,309,2],[298,1,298,2],[299,1,299,2],[300,1,300,2],[301,1,301,2],[302,1,302,2],[303,1,303,2],[287,1,287,2],[289,1,289,4],[291,1,291,4],[293,1,293,4],[296,1,296,2],[297,1,297,2],[275,1,275,4],[277,1,277,4],[279,1,279,4],[281,1,281,4],[283,1,283,2],[286,1,286,2],[266,1,266,2],[267,1,267,2],[268,1,268,4],[269,1,269,4],[271,1,271,4],[273,1,273,4],[255,1,255,2],[259,1,259,2],[260,1,260,2],[262,1,262,2],[264,1,264,2],[265,1,265,2],[244,1,244,4],[246,1,246,4],[248,1,248,4],[250,1,250,4],[252,1,252,4],[254,1,254,2],[236,1,236,2],[237,1,237,2],[238,1,238,2],[239,1,239,4],[240,1,240,4],[242,1,242,4],[228,1,228,2],[229,1,229,2],[230,1,230,2],[231,1,231,2],[233,1,233,2],[235,1,235,2],[220,1,220,4],[222,1,222,4],[224,1,224,2],[225,1,225,2],[226,1,226,2],[227,1,227,2],[209,1,209,4],[211,1,211,4],[213,1,213,4],[215,1,215,4],[217,1,217,4],[219,1,219,4],[202,1,202,2],[204,1,204,2],[205,1,205,2],[206,1,206,2],[207,1,207,2],[208,1,208,4],[195,1,195,2],[196,1,196,2],[197,1,197,2],[198,1,198,2],[199,1,199,2],[200,1,200,2],[186,1,186,4],[188,1,188,4],[189,1,189,4],[191,1,191,4],[193,1,193,2],[194,1,194,2],[176,1,176,2],[177,1,177,4],[178,1,178,4],[180,1,180,4],[182,1,182,4],[184,1,184,4],[168,1,168,2],[169,1,169,2],[171,1,171,2],[173,1,173,2],[174,1,174,2],[175,1,175,2],[160,1,160,4],[162,1,162,4],[164,1,164,2],[165,1,165,2],[166,1,166,2],[167,1,167,2],[150,1,150,4],[152,1,152,4],[154,1,154,4],[156,1,156,4],[158,1,158,4],[159,1,159,4],[143,1,143,2],[144,1,144,2],[145,1,145,2],[146,1,146,2],[147,1,147,4],[148,1,148,4],[135,1,135,2],[136,1,136,2],[137,1,137,2],[138,1,138,2],[139,1,139,2],[141,1,141,2],[127,1,127,4],[129,1,129,4],[131,1,131,2],[132,1,132,2],[133,1,133,2],[134,1,134,2],[117,1,117,4],[119,1,119,4],[121,1,121,4],[123,1,123,4],[125,1,125,4],[126,1,126,4],[110,1,110,2],[111,1,111,2],[112,1,112,2],[113,1,113,2],[114,1,114,4],[115,1,115,4],[102,1,102,2],[103,1,103,2],[104,1,104,2],[105,1,105,2],[106,1,106,2],[108,1,108,2],[94,1,94,4],[96,1,96,4],[98,1,98,2],[99,1,99,2],[100,1,100,2],[101,1,101,2],[83,1,83,4],[85,1,85,4],[87,1,87,4],[89,1,89,4],[91,1,91,4],[93,1,93,4],[76,1,76,2],[78,1,78,2],[79,1,79,2],[80,1,80,2],[81,1,81,2],[82,1,82,4],[69,1,69,2],[70,1,70,2],[71,1,71,2],[72,1,72,2],[73,1,73,2],[74,1,74,2],[61,1,61,4],[62,1,62,4],[64,1,64,4],[66,1,66,2],[67,1,67,2],[68,1,68,2],[50,1,50,4],[51,1,51,4],[53,1,53,4],[55,1,55,4],[57,1,57,4],[59,1,59,4],[42,1,42,2],[44,1,44,2],[46,1,46,2],[47,1,47,2],[48,1,48,2],[49,1,49,2],[36,1,36,2],[37,1,37,2],[38,1,38,2],[39,1,39,2],[40,1,40,2],[41,1,41,2],[27,1,27,4],[29,1,29,4],[30,1,30,4],[32,1,32,4],[34,1,34,2],[35,1,35,2],[17,1,17,4],[18,1,18,4],[19,1,19,4],[21,1,21,4],[23,1,23,4],[25,1,25,4],[11,1,11,4],[12,1,12,4],[13,1,13,4],[14,1,14,4],[15,1,15,4],[16,1,16,4]]}
[null,null,null,null,null,null,null,null,null,null,null,null,null,null,null,null,null,null,null,null,null,null,null,null,null,null,null,null,null,null,null,null,null,null,null,null,null,null,null,null,null,null,null,null,null,null,null,null,null,null,null,true]
[]
[null,"Macro has been activated"]
[]
[]
[]
[]
[]
[]
[]
[]
[null,"Energy+ Inc.",null,null,null,"X","Energy+ Inc.-For Former Cambridge and North Dumfries Hydro Service Area_Start","Energy+ Inc."]
[null,"For Former Cambridge and North Dumfries Hydro Service Area"]
[null,"TARIFF OF RATES AND CHARGES"]
[null,"Effective and Implementation Date May 1, 2018",null,null,null,null,null,null,null,null,null,null,null,null,null,"2018-05-01"]
[null,"This schedule supersedes and replaces all previously"]
[null,"approved schedules of Rates, Charges and Loss Factors"]
[null,"EB-2017-0030",null,null,null,null,null,"EB-2017-0030",null,null,null,null,null,null,null,null,null,null,null,null,null,null,null,null,null,null,"EB-2017-0030",null,null,null,null,null,null,null,null,null,null,null,null,null,null,null,null,null,"X"]
[null,"RESIDENTIAL SERVICE CLASSIFICATION",null,null,null,null,null,"1_RESIDENTIAL SERVICE CLASSIFICATION",null,null,null,null,null,null,null,null,null,null,null,null,null,null,null,null,null,null,"RESIDENTIAL SERVICE CLASSIFICATION"]
[null,"Residential refers to the supply of electrical energy to detached, semi-detached and row-housing units (freehold or condominium).  This classification typically refers to an account taking electricity at 750 volts or less where electricity is used exclusively in a separate metered living accommodation.  Customers shall be residing in single-dwelling units that consist of a detached house or one unit of a semi-detached, duplex, triplex, or quadruplex house, with a residential zoning.  Separate metered dwellings within a town house complex, condominium, or apartment building also qualify as residential customers.  Class B consumers are defined in accordance with O. Reg. 429/04. Further servicing details are available in the distributor's Conditions of Service.",null,null,null,null,null,"1_RESIDENTIAL SERVICE CLASSIFICATION",null,null,null,null,null,null,null,null,null,null,null,null,null,null,null,null,null,null,"Residential refers to the supply of electrical energy to detached, semi-detached and row-housing units (freehold or condominium).  This classification typically refers to an account taking electricity at 750 volts or less where electricity is used exclusively in a separate metered living accommodation.  Customers shall be residing in single-dwelling units that consist of a detached house or one unit of a semi-detached, duplex, triplex, or quadruplex house, with a residential zoning.  Separate metered dwellings within a town house complex, condominium, or apartment building also qualify as residential customers.  Class B consumers are defined in accordance with O. Reg. 429/04. Further servicing details are available in the distributor's Conditions of Service."]
[]
[null,"APPLICATION",null,null,null,null,null,"1_APPLICATION",null,null,null,null,null,null,null,null,null,null,null,null,null,null,null,null,null,null,"APPLICATION"]
[]
[null,"The application of these rates and charges shall be in accordance with the Licence of the Distributor and any Code or Order of the Ontario Energy Board, and amendments thereto as approved by the Ontario Energy Board, which may be applicable to the administration of this schedule.",null,null,null,null,null,"1_RESIDENTIAL SERVICE CLASSIFICATION",null,null,null,null,null,null,null,null,null,null,null,null,null,null,null,null,null,null,"The application of these rates and charges shall be in accordance with the Licence of the Distributor and any Code or Order of the Ontario Energy Board, and amendments thereto as approved by the Ontario Energy Board, which may be applicable to the administration of this schedule."]
[]
[null,"No rates and charges for the distribution of electricity and charges to meet the costs of any work or service done or furnished for the purpose of the distribution of electricity shall be made except as permitted by this schedule, unless required by the Distributor’s Licence or a Code or Order of the Ontario Energy Board, and amendments thereto as approved by the Ontario Energy Board, or as specified herein.",null,null,null,null,null,"1_RESIDENTIAL SERVICE CLASSIFICATION",null,null,null,null,null,null,null,null,null,null,null,null,null,null,null,null,null,null,"No rates and charges for the distribution of electricity and charges to meet the costs of any work or service done or furnished for the purpose of the distribution of electricity shall be made except as permitted by this schedule, unless required by the Distributor’s Licence or a Code or Order of the Ontario Energy Board, and amendments thereto as approved by the Ontario Energy Board, or as specified herein."]
[]
[null,"Unless specifically noted, this schedule does not contain any charges for the electricity commodity, be it under the Regulated Price Plan, a contract with a retailer or the wholesale market price, as applicable.  In addition, the charges in the MONTHLY RATES AND CHARGES - Regulatory Component of this schedule do not apply to a customer that is an embedded wholesale market participant.",null,null,null,null,null,"1_RESIDENTIAL SERVICE CLASSIFICATION",null,null,null,null,null,null,null,null,null,null,null,null,null,null,null,null,null,null,"Unless specifically noted, this schedule does not contain any charges for the electricity commodity, be it under the Regulated Price Plan, a contract with a retailer or the wholesale market price, as applicable.  In addition, the charges in the MONTHLY RATES AND CHARGES - Regulatory Component of this schedule do not apply to a customer that is an embedded wholesale market participant."]
[]
[null,"The rate rider for the disposition of WMS - Sub-account CBR Class B is not applicable to wholesale market participants (WMP), customers that transitioned between Class A and Class B during the variance account accumulation period, or to customers that were in Class A for the entire period. Customers who transitioned are to be charged or refunded their share of the variance disposed through customer specific billing adjustments. This rate rider is to be consistently applied for the entire period to the sunset date of the rate rider. In addition, this rate rider is applicable to all new Class B customers.",null,null,null,null,null,"1_RESIDENTIAL SERVICE CLASSIFICATION",null,null,null,null,null,null,null,null,null,null,null,null,null,null,null,null,null,null,"The rate rider for the disposition of WMS - Sub-account CBR Class B is not applicable to wholesale market participants (WMP), customers that transitioned between Class A and Class B during the variance account accumulation period, or to customers that were in Class A for the entire period. Customers who transitioned are to be charged or refunded their share of the variance disposed through customer specific billing adjustments. This rate rider is to be consistently applied for the entire period to the sunset date of the rate rider. In addition, this rate rider is applicable to all new Class B customers."]
[null,"It should be noted that this schedule does not list any charges, assessments, or credits that are required by law to be invoiced by a distributor and that are not subject to Ontario Energy Board approval, such as the Debt Retirement Charge, the Global Adjustment and the HST.",null,null,null,null,null,"1_RESIDENTIAL SERVICE CLASSIFICATION",null,null,null,null,null,null,null,null,null,null,null,null,null,null,null,null,null,null,"It should be noted that this schedule does not list any charges, assessments, or credits that are required by law to be invoiced by a distributor and that are not subject to Ontario Energy Board approval, such as the Debt Retirement Charge, the Global Adjustment and the HST."]
[]
[null,"MONTHLY RATES AND CHARGES - Delivery Component",null,null,null,null,null,"1_MRC_Del",null,null,null,null,null,null,null,null,null,null,null,null,null,null,null,null,null,null,"MONTHLY RATES AND CHARGES - Delivery Component"]
[]
[null,"Service Charge",null,"$",21.350439999999999,null,null,"1_RESIDENTIAL SERVICE CLASSIFICATION","A",null,null,null,"1_RESIDENTIAL SERVICE CLASSIFICATION_MSC",null,null,null,null,null,null,null,null,null,null,null,null,"Service Charge"]
[null,"Rate Rider for Smart Metering Entity Charge - effective until December 31, 2022",null,"$",0.56999999999999995,null,null,"1_RESIDENTIAL SERVICE CLASSIFICATION","B",null,null,null,"1_RESIDENTIAL SERVICE CLASSIFICATION_SME",null,null,null,"2022-12-31",null,null,null,null,null,null,null,null,"Rate Rider for Smart Metering Entity Charge - effective until December 31, 2022"]
[null,"Distribution Volumetric Rate",null,"$/kWh",4.6413999999999995E-3,null,null,"1_RESIDENTIAL SERVICE CLASSIFICATION","A",null,null,null,"1_RESIDENTIAL SERVICE CLASSIFICATION_DVC",null,null,null,null,null,null,null,null,null,null,null,null,"Distribution Volumetric Rate"]
[null,"Low Voltage Service Rate",null,"$/kWh",1E-4,null,null,"1_RESIDENTIAL SERVICE CLASSIFICATION","B",null,null,null,"1_RESIDENTIAL SERVICE CLASSIFICATION_LV",null,null,null,null,null,null,null,null,null,null,null,null,"Low Voltage Service Rate"]
[null,"Rate Rider for Disposition of Global Adjustment Account (2018) - effective until April 30, 2019\n      Applicable only for Non-RPP Customers",null,"$/kWh",3.3E-3,null,null,"1_RESIDENTIAL SERVICE CLASSIFICATION","B",null,null,null,"1_RESIDENTIAL SERVICE CLASSIFICATION_GA_kwh",null,null,null,"2019-04-30",null,null,null,null,null,null,null,null,"Rate Rider for Disposition of Global Adjustment Account (2019) - effective until April 30, 2019\n      Applicable only for Non-RPP Customers"]
[null,"Rate Rider for Disposition of Deferral/Variance Accounts (2018) - effective until April 30, 2019",null,"$/kWh",-6.268366589161683E-3,null,null,"1_RESIDENTIAL SERVICE CLASSIFICATION","B",null,null,null,"1_RESIDENTIAL SERVICE CLASSIFICATION_DEFVAR_ALL",null,null,null,"2019-04-30",null,null,null,null,null,null,null,null,"Rate Rider for Disposition of Deferral/Variance Accounts (2019) - effective until April 30, 2019"]
[null,"Rate Rider for Disposition of Capacity Based Recovery Account (2018) - effective until April 30, 2019 Applicable only for Class B Customers",null,"$/kWh",4.0000000000000002E-4,null,null,"1_RESIDENTIAL SERVICE CLASSIFICATION","B",null,null,null,"1_RESIDENTIAL SERVICE CLASSIFICATION_VR_RR_15",null,null,null,"2019-04-30",null,null,null,null,null,null,null,null,"Rate Rider for Disposition of Capacity Based Recovery Account (2019) - effective until April 30, 2019 Applicable only for Class B Customers"]
[null,"Retail Transmission Rate - Network Service Rate",null,"$/kWh",5.8999999999999999E-3,null,null,"1_RESIDENTIAL SERVICE CLASSIFICATION","C",null,null,null,"1_RESIDENTIAL SERVICE CLASSIFICATION_Retail Transmission Rate - Network Service Rate",null,null,null,null,null,null,null,null,null,null,null,null,"Retail Transmission Rate - Network Service Rate"]
[null,"Retail Transmission Rate - Line and Transformation Connection Service Rate",null,"$/kWh",4.4000000000000003E-3,null,null,"1_RESIDENTIAL SERVICE CLASSIFICATION","C",null,null,null,"1_RESIDENTIAL SERVICE CLASSIFICATION_Retail Transmission Rate - Line and Transformation Connection Service Rate",null,null,null,null,null,null,null,null,null,null,null,null,"Retail Transmission Rate - Line and Transformation Connection Service Rate"]
[]
[null,"MONTHLY RATES AND CHARGES - Regulatory Component",null,null,null,null,null,"1_MRC_Reg",null,null,null,null,null,null,null,null,null,null,null,null,null,null,null,null,null,"MONTHLY RATES AND CHARGES - Regulatory Component"]
[]
[null,"Wholesale Market Service Rate (WMS) - not including CBR",null,"$/kWh",3.2000000000000002E-3,null,null,"1_RESIDENTIAL SERVICE CLASSIFICATION",null,null,null,null,"1_RESIDENTIAL SERVICE CLASSIFICATION_WMSR",null,null,null,null,null,null,null,null,null,null,null,null,"Wholesale Market Service Rate (WMS) - not including CBR"]
[null,"Capacity Based Recovery (CBR) - Applicable for Class B Customers ",null,"$/kWh",4.0000000000000002E-4,null,null,"1_RESIDENTIAL SERVICE CLASSIFICATION",null,null,null,null,null,null,null,null,null,null,null,null,null,null,null,null,null,"Capacity Based Recovery (CBR) - Applicable for Class B Customers "]
[null,"Rural or Remote Electricity Rate Protection Charge (RRRP)",null,"$/kWh",2.9999999999999997E-4,null,null,"1_RESIDENTIAL SERVICE CLASSIFICATION","T",null,null,null,"1_RESIDENTIAL SERVICE CLASSIFICATION_RRRP",null,null,null,null,null,null,null,null,null,null,null,null,"Rural or Remote Electricity Rate Protection Charge (RRRP)"]
[null,"Standard Supply Service - Administrative Charge (if applicable)",null,"$",0.25,null,null,"1_RESIDENTIAL SERVICE CLASSIFICATION","T",null,null,null,"1_RESIDENTIAL SERVICE CLASSIFICATION_SSS",null,null,null,null,null,null,null,null,null,null,null,null,"Standard Supply Service - Administrative Charge (if applicable)",null,null,null,null,null,null,null,null,null,null,null,null,null,null,null,null,null,null,"X"]
[null,"GENERAL SERVICE LESS THAN 50 KW SERVICE CLASSIFICATION",null,null,null,null,null,"2_GENERAL SERVICE LESS THAN 50 kW SERVICE CLASSIFICATION",null,null,null,null,null,null,null,null,null,null,null,null,null,null,null,null,null,null,"GENERAL SERVICE LESS THAN 50 KW SERVICE CLASSIFICATION"]
[null,"General Service refers to the supply of electrical energy to business customers, to bulk-metered residential buildings and to combined residential and business or residential and agricultural buildings.  Apartment buildings that are bulk metered will be billed at the appropriate General Service rate.  This classification refers to a non-residential account taking electricity at 750 volts or less whose average monthly peak demand is less than, or is forecast to be less than, 50 kW. Class B consumers are defined in accordance with O. Reg. 429/04. Further servicing details are available in the distributor's Conditions of Service.",null,null,null,null,null,"2_GENERAL SERVICE LESS THAN 50 kW SERVICE CLASSIFICATION",null,null,null,null,null,null,null,null,null,null,null,null,null,null,null,null,null,null,"General Service refers to the supply of electrical energy to business customers, to bulk-metered residential buildings and to combined residential and business or residential and agricultural buildings.  Apartment buildings that are bulk metered will be billed at the appropriate General Service rate.  This classification refers to a non-residential account taking electricity at 750 volts or less whose average monthly peak demand is less than, or is forecast to be less than, 50 kW. Class B consumers are defined in accordance with O. Reg. 429/04. Further servicing details are available in the distributor's Conditions of Service."]
[]
[null,"APPLICATION",null,null,null,null,null,"2_APPLICATION",null,null,null,null,null,null,null,null,null,null,null,null,null,null,null,null,null,null,"APPLICATION"]
[]
[null,"The application of these rates and charges shall be in accordance with the Licence of the Distributor and any Code or Order of the Ontario Energy Board, and amendments thereto as approved by the Ontario Energy Board, which may be applicable to the administration of this schedule.",null,null,null,null,null,"2_GENERAL SERVICE LESS THAN 50 kW SERVICE CLASSIFICATION",null,null,null,null,null,null,null,null,null,null,null,null,null,null,null,null,null,null,"The application of these rates and charges shall be in accordance with the Licence of the Distributor and any Code or Order of the Ontario Energy Board, and amendments thereto as approved by the Ontario Energy Board, which may be applicable to the administration of this schedule."]
[]
[null,"No rates and charges for the distribution of electricity and charges to meet the costs of any work or service done or furnished for the purpose of the distribution of electricity shall be made except as permitted by this schedule, unless required by the Distributor’s Licence or a Code or Order of the Ontario Energy Board, and amendments thereto as approved by the Ontario Energy Board, or as specified herein.",null,null,null,null,null,"2_GENERAL SERVICE LESS THAN 50 kW SERVICE CLASSIFICATION",null,null,null,null,null,null,null,null,null,null,null,null,null,null,null,null,null,null,"No rates and charges for the distribution of electricity and charges to meet the costs of any work or service done or furnished for the purpose of the distribution of electricity shall be made except as permitted by this schedule, unless required by the Distributor’s Licence or a Code or Order of the Ontario Energy Board, and amendments thereto as approved by the Ontario Energy Board, or as specified herein."]
[]
[null,"Unless specifically noted, this schedule does not contain any charges for the electricity commodity, be it under the Regulated Price Plan, a contract with a retailer or the wholesale market price, as applicable.  In addition, the charges in the MONTHLY RATES AND CHARGES - Regulatory Component of this schedule do not apply to a customer that is an embedded wholesale market participant.",null,null,null,null,null,"2_GENERAL SERVICE LESS THAN 50 kW SERVICE CLASSIFICATION",null,null,null,null,null,null,null,null,null,null,null,null,null,null,null,null,null,null,"Unless specifically noted, this schedule does not contain any charges for the electricity commodity, be it under the Regulated Price Plan, a contract with a retailer or the wholesale market price, as applicable.  In addition, the charges in the MONTHLY RATES AND CHARGES - Regulatory Component of this schedule do not apply to a customer that is an embedded wholesale market participant."]
[]
[null,"The rate rider for the disposition of WMS - Sub-account CBR Class B is not applicable to wholesale market participants (WMP), customers that transitioned between Class A and Class B during the variance account accumulation period, or to customers that were in Class A for the entire period. Customers who transitioned are to be charged or refunded their share of the variance disposed through customer specific billing adjustments. This rate rider is to be consistently applied for the entire period to the sunset date of the rate rider. In addition, this rate rider is applicable to all new Class B customers.",null,null,null,null,null,"2_GENERAL SERVICE LESS THAN 50 kW SERVICE CLASSIFICATION",null,null,null,null,null,null,null,null,null,null,null,null,null,null,null,null,null,null,"The rate rider for the disposition of WMS - Sub-account CBR Class B is not applicable to wholesale market participants (WMP), customers that transitioned between Class A and Class B during the variance account accumulation period, or to customers that were in Class A for the entire period. Customers who transitioned are to be charged or refunded their share of the variance disposed through customer specific billing adjustments. This rate rider is to be consistently applied for the entire period to the sunset date of the rate rider. In addition, this rate rider is applicable to all new Class B customers."]
[null,"It should be noted that this schedule does not list any charges, assessments, or credits that are required by law to be invoiced by a distributor and that are not subject to Ontario Energy Board approval, such as the Debt Retirement Charge, the Global Adjustment and the HST.",null,null,null,null,null,"2_GENERAL SERVICE LESS THAN 50 kW SERVICE CLASSIFICATION",null,null,null,null,null,null,null,null,null,null,null,null,null,null,null,null,null,null,"It should be noted that this schedule does not list any charges, assessments, or credits that are required by law to be invoiced by a distributor and that are not subject to Ontario Energy Board approval, such as the Debt Retirement Charge, the Global Adjustment and the HST."]
[]
[null,"MONTHLY RATES AND CHARGES - Delivery Component",null,null,null,null,null,"2_MRC_Del",null,null,null,null,null,null,null,null,null,null,null,null,null,null,null,null,null,null,"MONTHLY RATES AND CHARGES - Delivery Component"]
[]
[null,"Service Charge",null,"$",13.742579999999998,null,null,"2_GENERAL SERVICE LESS THAN 50 kW SERVICE CLASSIFICATION","A",null,null,null,"2_GENERAL SERVICE LESS THAN 50 kW SERVICE CLASSIFICATION_MSC",null,null,null,null,null,null,null,null,null,null,null,null,"Service Charge"]
[null,"Rate Rider for Smart Metering Entity Charge - effective until December 31, 2022",null,"$",0.56999999999999995,null,null,"2_GENERAL SERVICE LESS THAN 50 kW SERVICE CLASSIFICATION","B",null,null,null,"2_GENERAL SERVICE LESS THAN 50 kW SERVICE CLASSIFICATION_SME",null,null,null,"2022-12-31",null,null,null,null,null,null,null,null,"Rate Rider for Smart Metering Entity Charge - effective until December 31, 2022"]
[null,"Distribution Volumetric Rate",null,"$/kWh",1.4731399999999999E-2,null,null,"2_GENERAL SERVICE LESS THAN 50 kW SERVICE CLASSIFICATION","A",null,null,null,"2_GENERAL SERVICE LESS THAN 50 kW SERVICE CLASSIFICATION_DVC",null,null,null,null,null,null,null,null,null,null,null,null,"Distribution Volumetric Rate"]
[null,"Low Voltage Service Rate",null,"$/kWh",1E-4,null,null,"2_GENERAL SERVICE LESS THAN 50 kW SERVICE CLASSIFICATION","B",null,null,null,"2_GENERAL SERVICE LESS THAN 50 kW SERVICE CLASSIFICATION_LV",null,null,null,null,null,null,null,null,null,null,null,null,"Low Voltage Service Rate"]
[null,"Rate Rider for Disposition of Global Adjustment Account (2018) - effective until April 30, 2019\n      Applicable only for Non-RPP Customers",null,"$/kWh",3.3E-3,null,null,"2_GENERAL SERVICE LESS THAN 50 kW SERVICE CLASSIFICATION","B",null,null,null,"2_GENERAL SERVICE LESS THAN 50 kW SERVICE CLASSIFICATION_GA_kwh",null,null,null,"2019-04-30",null,null,null,null,null,null,null,null,"Rate Rider for Disposition of Global Adjustment Account (2019) - effective until April 30, 2019\n      Applicable only for Non-RPP Customers"]
[null,"Rate Rider for Disposition of Deferral/Variance Accounts (2018) - effective until April 30, 2019",null,"$/kWh",-6.2193914195985949E-3,null,null,"2_GENERAL SERVICE LESS THAN 50 kW SERVICE CLASSIFICATION","B",null,null,null,"2_GENERAL SERVICE LESS THAN 50 kW SERVICE CLASSIFICATION_DEFVAR_ALL",null,null,null,"2019-04-30",null,null,null,null,null,null,null,null,"Rate Rider for Disposition of Deferral/Variance Accounts (2019) - effective until April 30, 2019"]
[null,"Rate Rider for Disposition of Capacity Based Recovery Account (2018) - effective until April 30, 2019 Applicable only for Class B Customers",null,"$/kWh",4.0000000000000002E-4,null,null,"2_GENERAL SERVICE LESS THAN 50 kW SERVICE CLASSIFICATION","B",null,null,null,"2_GENERAL SERVICE LESS THAN 50 kW SERVICE CLASSIFICATION_VR_RR_18",null,null,null,"2019-04-30",null,null,null,null,null,null,null,null,"Rate Rider for Disposition of Capacity Based Recovery Account (2019) - effective until April 30, 2019 Applicable only for Class B Customers"]
[null,"Retail Transmission Rate - Network Service Rate",null,"$/kWh",5.1999999999999998E-3,null,null,"2_GENERAL SERVICE LESS THAN 50 kW SERVICE CLASSIFICATION","C",null,null,null,"2_GENERAL SERVICE LESS THAN 50 kW SERVICE CLASSIFICATION_Retail Transmission Rate - Network Service Rate",null,null,null,null,null,null,null,null,null,null,null,null,"Retail Transmission Rate - Network Service Rate"]
[null,"Retail Transmission Rate - Line and Transformation Connection Service Rate",null,"$/kWh",4.1000000000000003E-3,null,null,"2_GENERAL SERVICE LESS THAN 50 kW SERVICE CLASSIFICATION","C",null,null,null,"2_GENERAL SERVICE LESS THAN 50 kW SERVICE CLASSIFICATION_Retail Transmission Rate - Line and Transformation Connection Service Rate",null,null,null,null,null,null,null,null,null,null,null,null,"Retail Transmission Rate - Line and Transformation Connection Service Rate"]
[]
[null,"MONTHLY RATES AND CHARGES - Regulatory Component",null,null,null,null,null,"2_MRC_Reg",null,null,null,null,null,null,null,null,null,null,null,null,null,null,null,null,null,"MONTHLY RATES AND CHARGES - Regulatory Component"]
[]
[null,"Wholesale Market Service Rate (WMS) - not including CBR",null,"$/kWh",3.2000000000000002E-3,null,null,"2_GENERAL SERVICE LESS THAN 50 kW SERVICE CLASSIFICATION",null,null,null,null,"2_GENERAL SERVICE LESS THAN 50 kW SERVICE CLASSIFICATION_WMSR",null,null,null,null,null,null,null,null,null,null,null,null,"Wholesale Market Service Rate (WMS) - not including CBR"]
[null,"Capacity Based Recovery (CBR) - Applicable for Class B Customers ",null,"$/kWh",4.0000000000000002E-4,null,null,"2_GENERAL SERVICE LESS THAN 50 kW SERVICE CLASSIFICATION",null,null,null,null,null,null,null,null,null,null,null,null,null,null,null,null,null,"Capacity Based Recovery (CBR) - Applicable for Class B Customers "]
[null,"Rural or Remote Electricity Rate Protection Charge (RRRP)",null,"$/kWh",2.9999999999999997E-4,null,null,"2_GENERAL SERVICE LESS THAN 50 kW SERVICE CLASSIFICATION","T",null,null,null,"2_GENERAL SERVICE LESS THAN 50 kW SERVICE CLASSIFICATION_RRRP",null,null,null,null,null,null,null,null,null,null,null,null,"Rural or Remote Electricity Rate Protection Charge (RRRP)"]
[null,"Standard Supply Service - Administrative Charge (if applicable)",null,"$",0.25,null,null,"2_GENERAL SERVICE LESS THAN 50 kW SERVICE CLASSIFICATION","T",null,null,null,"2_GENERAL SERVICE LESS THAN 50 kW SERVICE CLASSIFICATION_SSS",null,null,null,null,null,null,null,null,null,null,null,null,"Standard Supply Service - Administrative Charge (if applicable)",null,null,null,null,null,null,null,null,null,null,null,null,null,null,null,null,null,null,"X"]
[null,"GENERAL SERVICE 50 TO 999 KW SERVICE CLASSIFICATION",null,null,null,null,null,"3_GENERAL SERVICE 50 to 999 kW SERVICE CLASSIFICATION",null,null,null,null,null,null,null,null,null,null,null,null,null,null,null,null,null,null,"GENERAL SERVICE 50 TO 999 KW SERVICE CLASSIFICATION"]
[null,"General Service refers to the supply of electrical energy to business customers, to bulk-metered residential buildings and to combined residential and business or residential and agricultural buildings.  Apartment buildings that are bulk metered will be billed at the appropriate General Service rate.  This classification refers to a non-residential account whose average monthly peak demand is equal to or greater than, or is forecast to be equal to or greater than, 50 kW but less than 1,000 kW.  Class B consumers are defined in accordance with O.Reg. 429/04. Further servicing details are available in the distributor's Conditions of Service.",null,null,null,null,null,"3_GENERAL SERVICE 50 to 999 kW SERVICE CLASSIFICATION",null,null,null,null,null,null,null,null,null,null,null,null,null,null,null,null,null,null,"General Service refers to the supply of electrical energy to business customers, to bulk-metered residential buildings and to combined residential and business or residential and agricultural buildings.  Apartment buildings that are bulk metered will be billed at the appropriate General Service rate.  This classification refers to a non-residential account whose average monthly peak demand is equal to or greater than, or is forecast to be equal to or greater than, 50 kW but less than 1,000 kW.  Class B consumers are defined in accordance with O.Reg. 429/04. Further servicing details are available in the distributor's Conditions of Service."]
[]
[null,"APPLICATION",null,null,null,null,null,"3_APPLICATION",null,null,null,null,null,null,null,null,null,null,null,null,null,null,null,null,null,null,"APPLICATION"]
[]
[null,"The application of these rates and charges shall be in accordance with the Licence of the Distributor and any Code or Order of the Ontario Energy Board, and amendments thereto as approved by the Ontario Energy Board, which may be applicable to the administration of this schedule.",null,null,null,null,null,"3_GENERAL SERVICE 50 to 999 kW SERVICE CLASSIFICATION",null,null,null,null,null,null,null,null,null,null,null,null,null,null,null,null,null,null,"The application of these rates and charges shall be in accordance with the Licence of the Distributor and any Code or Order of the Ontario Energy Board, and amendments thereto as approved by the Ontario Energy Board, which may be applicable to the administration of this schedule."]
[]
[null,"No rates and charges for the distribution of electricity and charges to meet the costs of any work or service done or furnished for the purpose of the distribution of electricity shall be made except as permitted by this schedule, unless required by the Distributor’s Licence or a Code or Order of the Ontario Energy Board, and amendments thereto as approved by the Ontario Energy Board, or as specified herein.",null,null,null,null,null,"3_GENERAL SERVICE 50 to 999 kW SERVICE CLASSIFICATION",null,null,null,null,null,null,null,null,null,null,null,null,null,null,null,null,null,null,"No rates and charges for the distribution of electricity and charges to meet the costs of any work or service done or furnished for the purpose of the distribution of electricity shall be made except as permitted by this schedule, unless required by the Distributor’s Licence or a Code or Order of the Ontario Energy Board, and amendments thereto as approved by the Ontario Energy Board, or as specified herein."]
[]
[null,"Unless specifically noted, this schedule does not contain any charges for the electricity commodity, be it under the Regulated Price Plan, a contract with a retailer or the wholesale market price, as applicable.  In addition, the charges in the MONTHLY RATES AND CHARGES - Regulatory Component of this schedule do not apply to a customer that is an embedded wholesale market participant.",null,null,null,null,null,"3_GENERAL SERVICE 50 to 999 kW SERVICE CLASSIFICATION",null,null,null,null,null,null,null,null,null,null,null,null,null,null,null,null,null,null,"Unless specifically noted, this schedule does not contain any charges for the electricity commodity, be it under the Regulated Price Plan, a contract with a retailer or the wholesale market price, as applicable.  In addition, the charges in the MONTHLY RATES AND CHARGES - Regulatory Component of this schedule do not apply to a customer that is an embedded wholesale market participant."]
[]
[null,"The rate rider for the disposition of WMS - Sub-account CBR Class B is not applicable to wholesale market participants (WMP), customers that transitioned between Class A and Class B during the variance account accumulation period, or to customers that were in Class A for the entire period. Customers who transitioned are to be charged or refunded their share of the variance disposed through customer specific billing adjustments. This rate rider is to be consistently applied for the entire period to the sunset date of the rate rider. In addition, this rate rider is applicable to all new Class B customers.",null,null,null,null,null,"3_GENERAL SERVICE 50 to 999 kW SERVICE CLASSIFICATION",null,null,null,null,null,null,null,null,null,null,null,null,null,null,null,null,null,null,"The rate rider for the disposition of WMS - Sub-account CBR Class B is not applicable to wholesale market participants (WMP), customers that transitioned between Class A and Class B during the variance account accumulation period, or to customers that were in Class A for the entire period. Customers who transitioned are to be charged or refunded their share of the variance disposed through customer specific billing adjustments. This rate rider is to be consistently applied for the entire period to the sunset date of the rate rider. In addition, this rate rider is applicable to all new Class B customers."]
[null,"It should be noted that this schedule does not list any charges, assessments, or credits that are required by law to be invoiced by a distributor and that are not subject to Ontario Energy Board approval, such as the Debt Retirement Charge, the Global Adjustment and the HST.",null,null,null,null,null,"3_GENERAL SERVICE 50 to 999 kW SERVICE CLASSIFICATION",null,null,null,null,null,null,null,null,null,null,null,null,null,null,null,null,null,null,"It should be noted that this schedule does not list any charges, assessments, or credits that are required by law to be invoiced by a distributor and that are not subject to Ontario Energy Board approval, such as the Debt Retirement Charge, the Global Adjustment and the HST."]
[]
[null,"MONTHLY RATES AND CHARGES - Delivery Component",null,null,null,null,null,"3_MRC_Del",null,null,null,null,null,null,null,null,null,null,null,null,null,null,null,null,null,null,"MONTHLY RATES AND CHARGES - Delivery Component"]
[]
[null,"Service Charge",null,"$",115.59103999999999,null,null,"3_GENERAL SERVICE 50 to 999 kW SERVICE CLASSIFICATION","A",null,null,null,"3_GENERAL SERVICE 50 to 999 kW SERVICE CLASSIFICATION_MSC",null,null,null,null,null,null,null,null,null,null,null,null,"Service Charge"]
[null,"Distribution Volumetric Rate",null,"$/kW",4.207630899999999,null,null,"3_GENERAL SERVICE 50 to 999 kW SERVICE CLASSIFICATION","A",null,null,null,"3_GENERAL SERVICE 50 to 999 kW SERVICE CLASSIFICATION_DVC",null,null,null,null,null,null,null,null,null,null,null,null,"Distribution Volumetric Rate"]
[null,"Low Voltage Service Rate",null,"$/kW",5.3699999999999998E-2,null,null,"3_GENERAL SERVICE 50 to 999 kW SERVICE CLASSIFICATION","B",null,null,null,"3_GENERAL SERVICE 50 to 999 kW SERVICE CLASSIFICATION_LV",null,null,null,null,null,null,null,null,null,null,null,null,"Low Voltage Service Rate"]
[null,"Rate Rider for Disposition of Global Adjustment Account (2018) - effective until April 30, 2019\n      Applicable only for Non-RPP Customers",null,"$/kWh",3.3E-3,null,null,"3_GENERAL SERVICE 50 to 999 kW SERVICE CLASSIFICATION","B",null,null,null,"3_GENERAL SERVICE 50 to 999 kW SERVICE CLASSIFICATION_GA_kwh",null,null,null,"2019-04-30",null,null,null,null,null,null,null,null,"Rate Rider for Disposition of Global Adjustment Account (2019) - effective until April 30, 2019\n      Applicable only for Non-RPP Customers"]
[null,"Rate Rider for Disposition of Deferral/Variance Accounts (2018) - effective until April 30, 2019\n      Applicable only for Non-Wholesale Market Participants",null,"$/kW",-1.7176948178630711,null,null,"3_GENERAL SERVICE 50 to 999 kW SERVICE CLASSIFICATION","B",null,null,null,"3_GENERAL SERVICE 50 to 999 kW SERVICE CLASSIFICATION_DEFVAR_ALL",null,null,null,"2019-04-30",null,null,null,null,null,null,null,null,"Rate Rider for Disposition of Deferral/Variance Accounts (2019) - effective until April 30, 2019\n      Applicable only for Non-Wholesale Market Participants"]
[null,"Rate Rider for Disposition of Deferral/Variance Accounts (2018) - effective until April 30, 2019",null,"$/kW",-0.29754431886348609,null,null,"3_GENERAL SERVICE 50 to 999 kW SERVICE CLASSIFICATION","B",null,null,null,"3_GENERAL SERVICE 50 to 999 kW SERVICE CLASSIFICATION_DEFVAR_ALL",null,null,null,"2019-04-30",null,null,null,null,null,null,null,null,"Rate Rider for Disposition of Deferral/Variance Accounts (2019) - effective until April 30, 2019"]
[null,"Rate Rider for Disposition of Capacity Based Recovery Account (2018) - effective until April 30, 2019 Applicable only for Class B Customers",null,"$/kW",0.13750000000000001,null,null,"3_GENERAL SERVICE 50 to 999 kW SERVICE CLASSIFICATION","B",null,null,null,"3_GENERAL SERVICE 50 to 999 kW SERVICE CLASSIFICATION_VR_RR_22",null,null,null,"2019-04-30",null,null,null,null,null,null,null,null,"Rate Rider for Disposition of Capacity Based Recovery Account (2019) - effective until April 30, 2019 Applicable only for Class B Customers"]
[null,"Retail Transmission Rate - Network Service Rate",null,"$/kW",3.3563000000000001,null,null,"3_GENERAL SERVICE 50 to 999 kW SERVICE CLASSIFICATION","C",null,null,null,"3_GENERAL SERVICE 50 to 999 kW SERVICE CLASSIFICATION_Retail Transmission Rate - Network Service Rate",null,null,null,null,null,null,null,null,null,null,null,null,"Retail Transmission Rate - Network Service Rate"]
[null,"Retail Transmission Rate - Line and Transformation Connection Service Rate",null,"$/kW",2.4847000000000001,null,null,"3_GENERAL SERVICE 50 to 999 kW SERVICE CLASSIFICATION","C",null,null,null,"3_GENERAL SERVICE 50 to 999 kW SERVICE CLASSIFICATION_Retail Transmission Rate - Line and Transformation Connection Service Rate",null,null,null,null,null,null,null,null,null,null,null,null,"Retail Transmission Rate - Line and Transformation Connection Service Rate"]
[]
[null,"MONTHLY RATES AND CHARGES - Regulatory Component",null,null,null,null,null,"3_MRC_Reg",null,null,null,null,null,null,null,null,null,null,null,null,null,null,null,null,null,"MONTHLY RATES AND CHARGES - Regulatory Component"]
[]
[null,"Wholesale Market Service Rate (WMS) - not including CBR",null,"$/kWh",3.2000000000000002E-3,null,null,"3_GENERAL SERVICE 50 to 999 kW SERVICE CLASSIFICATION",null,null,null,null,"3_GENERAL SERVICE 50 to 999 kW SERVICE CLASSIFICATION_WMSR",null,null,null,null,null,null,null,null,null,null,null,null,"Wholesale Market Service Rate (WMS) - not including CBR"]
[null,"Capacity Based Recovery (CBR) - Applicable for Class B Customers ",null,"$/kWh",4.0000000000000002E-4,null,null,"3_GENERAL SERVICE 50 to 999 kW SERVICE CLASSIFICATION",null,null,null,null,null,null,null,null,null,null,null,null,null,null,null,null,null,"Capacity Based Recovery (CBR) - Applicable for Class B Customers "]
[null,"Rural or Remote Electricity Rate Protection Charge (RRRP)",null,"$/kWh",2.9999999999999997E-4,null,null,"3_GENERAL SERVICE 50 to 999 kW SERVICE CLASSIFICATION","T",null,null,null,"3_GENERAL SERVICE 50 to 999 kW SERVICE CLASSIFICATION_RRRP",null,null,null,null,null,null,null,null,null,null,null,null,"Rural or Remote Electricity Rate Protection Charge (RRRP)"]
[null,"Standard Supply Service - Administrative Charge (if applicable)",null,"$",0.25,null,null,"3_GENERAL SERVICE 50 to 999 kW SERVICE CLASSIFICATION","T",null,null,null,"3_GENERAL SERVICE 50 to 999 kW SERVICE CLASSIFICATION_SSS",null,null,null,null,null,null,null,null,null,null,null,null,"Standard Supply Service - Administrative Charge (if applicable)",null,null,null,null,null,null,null,null,null,null,null,null,null,null,null,null,null,null,"X"]
[null,"GENERAL SERVICE 1,000 TO 4,999 KW SERVICE CLASSIFICATION",null,null,null,null,null,"4_GENERAL SERVICE 1,000 to 4,999 kW SERVICE CLASSIFICATION",null,null,null,null,null,null,null,null,null,null,null,null,null,null,null,null,null,null,"GENERAL SERVICE 1,000 TO 4,999 KW SERVICE CLASSIFICATION"]
[null,"General Service refers to the supply of electrical energy to business customers, to bulk-metered residential buildings and to combined residential and business or residential and agricultural buildings.  Apartment buildings that are bulk metered will be billed at the appropriate General Service rate.  This classification refers to a non-residential account whose average monthly peak demand is equal to or greater than, or is forecast to be equal to or greater than, 1,000 kW but less than 5,000 kW.  Class A and Class B consumers are defined in accordance with O. Reg. 429/04. Further servicing details are available in the distributor's Conditions of Service.",null,null,null,null,null,"4_GENERAL SERVICE 1,000 to 4,999 kW SERVICE CLASSIFICATION",null,null,null,null,null,null,null,null,null,null,null,null,null,null,null,null,null,null,"General Service refers to the supply of electrical energy to business customers, to bulk-metered residential buildings and to combined residential and business or residential and agricultural buildings.  Apartment buildings that are bulk metered will be billed at the appropriate General Service rate.  This classification refers to a non-residential account whose average monthly peak demand is equal to or greater than, or is forecast to be equal to or greater than, 1,000 kW but less than 5,000 kW.  Class A and Class B consumers are defined in accordance with O. Reg. 429/04. Further servicing details are available in the distributor's Conditions of Service."]
[]
[null,"APPLICATION",null,null,null,null,null,"4_APPLICATION",null,null,null,null,null,null,null,null,null,null,null,null,null,null,null,null,null,null,"APPLICATION"]
[]
[null,"The application of these rates and charges shall be in accordance with the Licence of the Distributor and any Code or Order of the Ontario Energy Board, and amendments thereto as approved by the Ontario Energy Board, which may be applicable to the administration of this schedule.",null,null,null,null,null,"4_GENERAL SERVICE 1,000 to 4,999 kW SERVICE CLASSIFICATION",null,null,null,null,null,null,null,null,null,null,null,null,null,null,null,null,null,null,"The application of these rates and charges shall be in accordance with the Licence of the Distributor and any Code or Order of the Ontario Energy Board, and amendments thereto as approved by the Ontario Energy Board, which may be applicable to the administration of this schedule."]
[]
[null,"No rates and charges for the distribution of electricity and charges to meet the costs of any work or service done or furnished for the purpose of the distribution of electricity shall be made except as permitted by this schedule, unless required by the Distributor’s Licence or a Code or Order of the Ontario Energy Board, and amendments thereto as approved by the Ontario Energy Board, or as specified herein.",null,null,null,null,null,"4_GENERAL SERVICE 1,000 to 4,999 kW SERVICE CLASSIFICATION",null,null,null,null,null,null,null,null,null,null,null,null,null,null,null,null,null,null,"No rates and charges for the distribution of electricity and charges to meet the costs of any work or service done or furnished for the purpose of the distribution of electricity shall be made except as permitted by this schedule, unless required by the Distributor’s Licence or a Code or Order of the Ontario Energy Board, and amendments thereto as approved by the Ontario Energy Board, or as specified herein."]
[]
[null,"Unless specifically noted, this schedule does not contain any charges for the electricity commodity, be it under the Regulated Price Plan, a contract with a retailer or the wholesale market price, as applicable.  In addition, the charges in the MONTHLY RATES AND CHARGES - Regulatory Component of this schedule do not apply to a customer that is an embedded wholesale market participant.",null,null,null,null,null,"4_GENERAL SERVICE 1,000 to 4,999 kW SERVICE CLASSIFICATION",null,null,null,null,null,null,null,null,null,null,null,null,null,null,null,null,null,null,"Unless specifically noted, this schedule does not contain any charges for the electricity commodity, be it under the Regulated Price Plan, a contract with a retailer or the wholesale market price, as applicable.  In addition, the charges in the MONTHLY RATES AND CHARGES - Regulatory Component of this schedule do not apply to a customer that is an embedded wholesale market participant."]
[]
[null,"The rate rider for the disposition of Global Adjustment is only applicable to non-RPP Class B customers. It is not applicable to Wholesale Market Participant (WMP), customers that transitioned between Class A and Class B during the variance account accumulation period, or to customers that were in Class A for the entire period. Customers who transitioned are to be charged or refunded their share of the variance disposed through customer specific billing adjustments. This rate rider is to be consistently applied for the entire period to the sunset date of the rate rider. In addition, this rate rider is applicable to all new non-RPP Class B customers.",null,null,null,null,null,"4_GENERAL SERVICE 1,000 to 4,999 kW SERVICE CLASSIFICATION",null,null,null,null,null,null,null,null,null,null,null,null,null,null,null,null,null,null,"The rate rider for the disposition of Global Adjustment is only applicable to non-RPP Class B customers. It is not applicable to Wholesale Market Participant (WMP), customers that transitioned between Class A and Class B during the variance account accumulation period, or to customers that were in Class A for the entire period. Customers who transitioned are to be charged or refunded their share of the variance disposed through customer specific billing adjustments. This rate rider is to be consistently applied for the entire period to the sunset date of the rate rider. In addition, this rate rider is applicable to all new non-RPP Class B customers."]
[null,"The rate rider for the disposition of WMS - Sub-account CBR Class B is not applicable to wholesale market participants (WMP), customers that transitioned between Class A and Class B during the variance account accumulation period, or to customers that were in Class A for the entire period. Customers who transitioned are to be charged or refunded their share of the variance disposed through customer specific billing adjustments. This rate rider is to be consistently applied for the entire period to the sunset date of the rate rider. In addition, this rate rider is applicable to all new Class B customers.",null,null,null,null,null,"4_GENERAL SERVICE 1,000 to 4,999 kW SERVICE CLASSIFICATION",null,null,null,null,null,null,null,null,null,null,null,null,null,null,null,null,null,null,"The rate rider for the disposition of WMS - Sub-account CBR Class B is not applicable to wholesale market participants (WMP), customers that transitioned between Class A and Class B during the variance account accumulation period, or to customers that were in Class A for the entire period. Customers who transitioned are to be charged or refunded their share of the variance disposed through customer specific billing adjustments. This rate rider is to be consistently applied for the entire period to the sunset date of the rate rider. In addition, this rate rider is applicable to all new Class B customers."]
[null,"It should be noted that this schedule does not list any charges, assessments, or credits that are required by law to be invoiced by a distributor and that are not subject to Ontario Energy Board approval, such as the Debt Retirement Charge, the Global Adjustment and the HST.",null,null,null,null,null,"4_GENERAL SERVICE 1,000 to 4,999 kW SERVICE CLASSIFICATION",null,null,null,null,null,null,null,null,null,null,null,null,null,null,null,null,null,null,"It should be noted that this schedule does not list any charges, assessments, or credits that are required by law to be invoiced by a distributor and that are not subject to Ontario Energy Board approval, such as the Debt Retirement Charge, the Global Adjustment and the HST."]
[]
[null,"MONTHLY RATES AND CHARGES - Delivery Component",null,null,null,null,null,"4_MRC_Del",null,null,null,null,null,null,null,null,null,null,null,null,null,null,null,null,null,null,"MONTHLY RATES AND CHARGES - Delivery Component"]
[]
[null,"Service Charge",null,"$",1047.7657799999999,null,null,"4_GENERAL SERVICE 1,000 to 4,999 kW SERVICE CLASSIFICATION","A",null,null,null,"4_GENERAL SERVICE 1,000 to 4,999 kW SERVICE CLASSIFICATION_MSC",null,null,null,null,null,null,null,null,null,null,null,null,"Service Charge"]
[null,"Distribution Volumetric Rate",null,"$/kW",3.6470304999999996,null,null,"4_GENERAL SERVICE 1,000 to 4,999 kW SERVICE CLASSIFICATION","A",null,null,null,"4_GENERAL SERVICE 1,000 to 4,999 kW SERVICE CLASSIFICATION_DVC",null,null,null,null,null,null,null,null,null,null,null,null,"Distribution Volumetric Rate"]
[null,"Low Voltage Service Rate",null,"$/kW",4.2099999999999999E-2,null,null,"4_GENERAL SERVICE 1,000 to 4,999 kW SERVICE CLASSIFICATION","B",null,null,null,"4_GENERAL SERVICE 1,000 to 4,999 kW SERVICE CLASSIFICATION_LV",null,null,null,null,null,null,null,null,null,null,null,null,"Low Voltage Service Rate"]
[null,"Rate Rider for Disposition of Global Adjustment Account (2018) - effective until April 30, 2019\n      Applicable only for Non-RPP Customers",null,"$/kWh",3.3E-3,null,null,"4_GENERAL SERVICE 1,000 to 4,999 kW SERVICE CLASSIFICATION","B",null,null,null,"4_GENERAL SERVICE 1,000 to 4,999 kW SERVICE CLASSIFICATION_GA_kwh",null,null,null,"2019-04-30",null,null,null,null,null,null,null,null,"Rate Rider for Disposition of Global Adjustment Account (2019) - effective until April 30, 2019\n      Applicable only for Non-RPP Customers"]
[null,"Rate Rider for Disposition of Deferral/Variance Accounts (2018) - effective until April 30, 2019\n      Applicable only for Non-Wholesale Market Participants",null,"$/kW",-2.2353997609561107,null,null,"4_GENERAL SERVICE 1,000 to 4,999 kW SERVICE CLASSIFICATION","B",null,null,null,"4_GENERAL SERVICE 1,000 to 4,999 kW SERVICE CLASSIFICATION_DEFVAR_ALL",null,null,null,"2019-04-30",null,null,null,null,null,null,null,null,"Rate Rider for Disposition of Deferral/Variance Accounts (2019) - effective until April 30, 2019\n      Applicable only for Non-Wholesale Market Participants"]
[null,"Rate Rider for Disposition of Deferral/Variance Accounts (2018) - effective until April 30, 2019",null,"$/kW",-0.39842107158418288,null,null,"4_GENERAL SERVICE 1,000 to 4,999 kW SERVICE CLASSIFICATION","B",null,null,null,"4_GENERAL SERVICE 1,000 to 4,999 kW SERVICE CLASSIFICATION_DEFVAR_ALL",null,null,null,"2019-04-30",null,null,null,null,null,null,null,null,"Rate Rider for Disposition of Deferral/Variance Accounts (2019) - effective until April 30, 2019"]
[null,"Rate Rider for Disposition of Capacity Based Recovery Account (2018) - effective until April 30, 2019 Applicable only for Class B Customers",null,"$/kW",0.1709,null,null,"4_GENERAL SERVICE 1,000 to 4,999 kW SERVICE CLASSIFICATION","B",null,null,null,"4_GENERAL SERVICE 1,000 to 4,999 kW SERVICE CLASSIFICATION_VR_RR_26",null,null,null,"2019-04-30",null,null,null,null,null,null,null,null,"Rate Rider for Disposition of Capacity Based Recovery Account (2019) - effective until April 30, 2019 Applicable only for Class B Customers"]
[null,"Retail Transmission Rate - Network Service Rate",null,"$/kW",2.5491000000000001,null,null,"4_GENERAL SERVICE 1,000 to 4,999 kW SERVICE CLASSIFICATION","C",null,null,null,"4_GENERAL SERVICE 1,000 to 4,999 kW SERVICE CLASSIFICATION_Retail Transmission Rate - Network Service Rate",null,null,null,null,null,null,null,null,null,null,null,null,"Retail Transmission Rate - Network Service Rate"]
[null,"Retail Transmission Rate - Line and Transformation Connection Service Rate",null,"$/kW",1.9499,null,null,"4_GENERAL SERVICE 1,000 to 4,999 kW SERVICE CLASSIFICATION","C",null,null,null,"4_GENERAL SERVICE 1,000 to 4,999 kW SERVICE CLASSIFICATION_Retail Transmission Rate - Line and Transformation Connection Service Rate",null,null,null,null,null,null,null,null,null,null,null,null,"Retail Transmission Rate - Line and Transformation Connection Service Rate"]
[]
[null,"MONTHLY RATES AND CHARGES - Regulatory Component",null,null,null,null,null,"4_MRC_Reg",null,null,null,null,null,null,null,null,null,null,null,null,null,null,null,null,null,"MONTHLY RATES AND CHARGES - Regulatory Component"]
[]
[null,"Wholesale Market Service Rate (WMS) - not including CBR",null,"$/kWh",3.2000000000000002E-3,null,null,"4_GENERAL SERVICE 1,000 to 4,999 kW SERVICE CLASSIFICATION",null,null,null,null,"4_GENERAL SERVICE 1,000 to 4,999 kW SERVICE CLASSIFICATION_WMSR",null,null,null,null,null,null,null,null,null,null,null,null,"Wholesale Market Service Rate (WMS) - not including CBR"]
[null,"Capacity Based Recovery (CBR) - Applicable for Class B Customers ",null,"$/kWh",4.0000000000000002E-4,null,null,"4_GENERAL SERVICE 1,000 to 4,999 kW SERVICE CLASSIFICATION",null,null,null,null,null,null,null,null,null,null,null,null,null,null,null,null,null,"Capacity Based Recovery (CBR) - Applicable for Class B Customers "]
[null,"Rural or Remote Electricity Rate Protection Charge (RRRP)",null,"$/kWh",2.9999999999999997E-4,null,null,"4_GENERAL SERVICE 1,000 to 4,999 kW SERVICE CLASSIFICATION","T",null,null,null,"4_GENERAL SERVICE 1,000 to 4,999 kW SERVICE CLASSIFICATION_RRRP",null,null,null,null,null,null,null,null,null,null,null,null,"Rural or Remote Electricity Rate Protection Charge (RRRP)"]
[null,"Standard Supply Service - Administrative Charge (if applicable)",null,"$",0.25,null,null,"4_GENERAL SERVICE 1,000 to 4,999 kW SERVICE CLASSIFICATION","T",null,null,null,"4_GENERAL SERVICE 1,000 to 4,999 kW SERVICE CLASSIFICATION_SSS",null,null,null,null,null,null,null,null,null,null,null,null,"Standard Supply Service - Administrative Charge (if applicable)",null,null,null,null,null,null,null,null,null,null,null,null,null,null,null,null,null,null,"X"]
[null,"LARGE USE SERVICE CLASSIFICATION",null,null,null,null,null,"5_LARGE USE SERVICE CLASSIFICATION",null,null,null,null,null,null,null,null,null,null,null,null,null,null,null,null,null,null,"LARGE USE SERVICE CLASSIFICATION"]
[null,"General Service refers to the supply of electrical energy to business customers, to bulk-metered residential buildings and to combined residential and business or residential and agricultural buildings.  Apartment buildings that are bulk metered will be billed at the appropriate General Service rate.  This classification refers to an account whose average monthly peak demand is equal to or greater than, or is forecast to be equal to or greater than, 5,000 kW.  Class A and Class B consumers are defined in accordance with O. Reg. 429/04.Further servicing details are available in the distributor's Conditions of Service.",null,null,null,null,null,"5_LARGE USE SERVICE CLASSIFICATION",null,null,null,null,null,null,null,null,null,null,null,null,null,null,null,null,null,null,"General Service refers to the supply of electrical energy to business customers, to bulk-metered residential buildings and to combined residential and business or residential and agricultural buildings.  Apartment buildings that are bulk metered will be billed at the appropriate General Service rate.  This classification refers to an account whose average monthly peak demand is equal to or greater than, or is forecast to be equal to or greater than, 5,000 kW.  Class A and Class B consumers are defined in accordance with O. Reg. 429/04.Further servicing details are available in the distributor's Conditions of Service."]
[]
[null,"APPLICATION",null,null,null,null,null,"5_APPLICATION",null,null,null,null,null,null,null,null,null,null,null,null,null,null,null,null,null,null,"APPLICATION"]
[]
[null,"The application of these rates and charges shall be in accordance with the Licence of the Distributor and any Code or Order of the Ontario Energy Board, and amendments thereto as approved by the Ontario Energy Board, which may be applicable to the administration of this schedule.",null,null,null,null,null,"5_LARGE USE SERVICE CLASSIFICATION",null,null,null,null,null,null,null,null,null,null,null,null,null,null,null,null,null,null,"The application of these rates and charges shall be in accordance with the Licence of the Distributor and any Code or Order of the Ontario Energy Board, and amendments thereto as approved by the Ontario Energy Board, which may be applicable to the administration of this schedule."]
[]
[null,"No rates and charges for the distribution of electricity and charges to meet the costs of any work or service done or furnished for the purpose of the distribution of electricity shall be made except as permitted by this schedule, unless required by the Distributor’s Licence or a Code or Order of the Ontario Energy Board, and amendments thereto as approved by the Ontario Energy Board, or as specified herein.",null,null,null,null,null,"5_LARGE USE SERVICE CLASSIFICATION",null,null,null,null,null,null,null,null,null,null,null,null,null,null,null,null,null,null,"No rates and charges for the distribution of electricity and charges to meet the costs of any work or service done or furnished for the purpose of the distribution of electricity shall be made except as permitted by this schedule, unless required by the Distributor’s Licence or a Code or Order of the Ontario Energy Board, and amendments thereto as approved by the Ontario Energy Board, or as specified herein."]
[]
[null,"Unless specifically noted, this schedule does not contain any charges for the electricity commodity, be it under the Regulated Price Plan, a contract with a retailer or the wholesale market price, as applicable.  In addition, the charges in the MONTHLY RATES AND CHARGES - Regulatory Component of this schedule do not apply to a customer that is an embedded wholesale market participant.",null,null,null,null,null,"5_LARGE USE SERVICE CLASSIFICATION",null,null,null,null,null,null,null,null,null,null,null,null,null,null,null,null,null,null,"Unless specifically noted, this schedule does not contain any charges for the electricity commodity, be it under the Regulated Price Plan, a contract with a retailer or the wholesale market price, as applicable.  In addition, the charges in the MONTHLY RATES AND CHARGES - Regulatory Component of this schedule do not apply to a customer that is an embedded wholesale market participant."]
[]
[null,"The rate rider for the disposition of Global Adjustment is only applicable to non-RPP Class B customers. It is not applicable to Wholesale Market Participant (WMP), customers that transitioned between Class A and Class B during the variance account accumulation period, or to customers that were in Class A for the entire period. Customers who transitioned are to be charged or refunded their share of the variance disposed through customer specific billing adjustments. This rate rider is to be consistently applied for the entire period to the sunset date of the rate rider. In addition, this rate rider is applicable to all new non-RPP Class B customers.",null,null,null,null,null,"5_LARGE USE SERVICE CLASSIFICATION",null,null,null,null,null,null,null,null,null,null,null,null,null,null,null,null,null,null,"The rate rider for the disposition of Global Adjustment is only applicable to non-RPP Class B customers. It is not applicable to Wholesale Market Participant (WMP), customers that transitioned between Class A and Class B during the variance account accumulation period, or to customers that were in Class A for the entire period. Customers who transitioned are to be charged or refunded their share of the variance disposed through customer specific billing adjustments. This rate rider is to be consistently applied for the entire period to the sunset date of the rate rider. In addition, this rate rider is applicable to all new non-RPP Class B customers."]
[null,"The rate rider for the disposition of WMS - Sub-account CBR Class B is not applicable to wholesale market participants (WMP), customers that transitioned between Class A and Class B during the variance account accumulation period, or to customers that were in Class A for the entire period. Customers who transitioned are to be charged or refunded their share of the variance disposed through customer specific billing adjustments. This rate rider is to be consistently applied for the entire period to the sunset date of the rate rider. In addition, this rate rider is applicable to all new Class B customers.",null,null,null,null,null,"5_LARGE USE SERVICE CLASSIFICATION",null,null,null,null,null,null,null,null,null,null,null,null,null,null,null,null,null,null,"The rate rider for the disposition of WMS - Sub-account CBR Class B is not applicable to wholesale market participants (WMP), customers that transitioned between Class A and Class B during the variance account accumulation period, or to customers that were in Class A for the entire period. Customers who transitioned are to be charged or refunded their share of the variance disposed through customer specific billing adjustments. This rate rider is to be consistently applied for the entire period to the sunset date of the rate rider. In addition, this rate rider is applicable to all new Class B customers."]
[null,"It should be noted that this schedule does not list any charges, assessments, or credits that are required by law to be invoiced by a distributor and that are not subject to Ontario Energy Board approval, such as the Debt Retirement Charge, the Global Adjustment and the HST.",null,null,null,null,null,"5_LARGE USE SERVICE CLASSIFICATION",null,null,null,null,null,null,null,null,null,null,null,null,null,null,null,null,null,null,"It should be noted that this schedule does not list any charges, assessments, or credits that are required by law to be invoiced by a distributor and that are not subject to Ontario Energy Board approval, such as the Debt Retirement Charge, the Global Adjustment and the HST."]
[]
[null,"MONTHLY RATES AND CHARGES - Delivery Component",null,null,null,null,null,"5_MRC_Del",null,null,null,null,null,null,null,null,null,null,null,null,null,null,null,null,null,null,"MONTHLY RATES AND CHARGES - Delivery Component"]
[]
[null,"Service Charge",null,"$",8976.0639999999985,null,null,"5_LARGE USE SERVICE CLASSIFICATION","A",null,null,null,"5_LARGE USE SERVICE CLASSIFICATION_MSC",null,null,null,null,null,null,null,null,null,null,null,null,"Service Charge"]
[null,"Distribution Volumetric Rate",null,"$/kW",2.4926336,null,null,"5_LARGE USE SERVICE CLASSIFICATION","A",null,null,null,"5_LARGE USE SERVICE CLASSIFICATION_DVC",null,null,null,null,null,null,null,null,null,null,null,null,"Distribution Volumetric Rate"]
[null,"Low Voltage Service Rate",null,"$/kW",4.2099999999999999E-2,null,null,"5_LARGE USE SERVICE CLASSIFICATION","B",null,null,null,"5_LARGE USE SERVICE CLASSIFICATION_LV",null,null,null,null,null,null,null,null,null,null,null,null,"Low Voltage Service Rate"]
[null,"Rate Rider for Disposition of Deferral/Variance Accounts (2018) - effective until April 30, 2019",null,"$/kW",-2.5357339211051015,null,null,"5_LARGE USE SERVICE CLASSIFICATION","B",null,null,null,"5_LARGE USE SERVICE CLASSIFICATION_DEFVAR_ALL",null,null,null,"2019-04-30",null,null,null,null,null,null,null,null,"Rate Rider for Disposition of Deferral/Variance Accounts (2019) - effective until April 30, 2019"]
[null,"Retail Transmission Rate - Network Service Rate",null,"$/kW",2.4156,null,null,"5_LARGE USE SERVICE CLASSIFICATION","C",null,null,null,"5_LARGE USE SERVICE CLASSIFICATION_Retail Transmission Rate - Network Service Rate",null,null,null,null,null,null,null,null,null,null,null,null,"Retail Transmission Rate - Network Service Rate"]
[null,"Retail Transmission Rate - Line and Transformation Connection Service Rate",null,"$/kW",1.9849000000000001,null,null,"5_LARGE USE SERVICE CLASSIFICATION","C",null,null,null,"5_LARGE USE SERVICE CLASSIFICATION_Retail Transmission Rate - Line and Transformation Connection Service Rate",null,null,null,null,null,null,null,null,null,null,null,null,"Retail Transmission Rate - Line and Transformation Connection Service Rate"]
[]
[null,"MONTHLY RATES AND CHARGES - Regulatory Component",null,null,null,null,null,"5_MRC_Reg",null,null,null,null,null,null,null,null,null,null,null,null,null,null,null,null,null,"MONTHLY RATES AND CHARGES - Regulatory Component"]
[]
[null,"Wholesale Market Service Rate (WMS) - not including CBR",null,"$/kWh",3.2000000000000002E-3,null,null,"5_LARGE USE SERVICE CLASSIFICATION",null,null,null,null,"5_LARGE USE SERVICE CLASSIFICATION_WMSR",null,null,null,null,null,null,null,null,null,null,null,null,"Wholesale Market Service Rate (WMS) - not including CBR"]
[null,"Capacity Based Recovery (CBR) - Applicable for Class B Customers ",null,"$/kWh",4.0000000000000002E-4,null,null,"5_LARGE USE SERVICE CLASSIFICATION",null,null,null,null,null,null,null,null,null,null,null,null,null,null,null,null,null,"Capacity Based Recovery (CBR) - Applicable for Class B Customers "]
[null,"Rural or Remote Electricity Rate Protection Charge (RRRP)",null,"$/kWh",2.9999999999999997E-4,null,null,"5_LARGE USE SERVICE CLASSIFICATION","T",null,null,null,"5_LARGE USE SERVICE CLASSIFICATION_RRRP",null,null,null,null,null,null,null,null,null,null,null,null,"Rural or Remote Electricity Rate Protection Charge (RRRP)"]
[null,"Standard Supply Service - Administrative Charge (if applicable)",null,"$",0.25,null,null,"5_LARGE USE SERVICE CLASSIFICATION","T",null,null,null,"5_LARGE USE SERVICE CLASSIFICATION_SSS",null,null,null,null,null,null,null,null,null,null,null,null,"Standard Supply Service - Administrative Charge (if applicable)",null,null,null,null,null,null,null,null,null,null,null,null,null,null,null,null,null,null,"X"]
[null,"UNMETERED SCATTERED LOAD SERVICE CLASSIFICATION",null,null,null,null,null,"6_UNMETERED SCATTERED LOAD SERVICE CLASSIFICATION",null,null,null,null,null,null,null,null,null,null,null,null,null,null,null,null,null,null,"UNMETERED SCATTERED LOAD SERVICE CLASSIFICATION"]
[null,"This classification refers to an account taking electricity at 750 volts or less whose average monthly peak demand is less than, or is forecast to be less than, 50kW and the consumption is unmetered.  Such connections include cable TV power packs, bus shelters, telephone booths, traffic lights, railway crossings, etc.  The customer will provide detailed manufacturer information/documentation with regard to electrical demand/consumption of the proposed unmetered load.  Class B consumers are defined in accordance with O. Reg. 429/04. Further servicing details are available in the distributor's Conditions of Service.",null,null,null,null,null,"6_UNMETERED SCATTERED LOAD SERVICE CLASSIFICATION",null,null,null,null,null,null,null,null,null,null,null,null,null,null,null,null,null,null,"This classification refers to an account taking electricity at 750 volts or less whose average monthly peak demand is less than, or is forecast to be less than, 50kW and the consumption is unmetered.  Such connections include cable TV power packs, bus shelters, telephone booths, traffic lights, railway crossings, etc.  The customer will provide detailed manufacturer information/documentation with regard to electrical demand/consumption of the proposed unmetered load.  Class B consumers are defined in accordance with O. Reg. 429/04. Further servicing details are available in the distributor's Conditions of Service."]
[]
[null,"APPLICATION",null,null,null,null,null,"6_APPLICATION",null,null,null,null,null,null,null,null,null,null,null,null,null,null,null,null,null,null,"APPLICATION"]
[]
[null,"The application of these rates and charges shall be in accordance with the Licence of the Distributor and any Code or Order of the Ontario Energy Board, and amendments thereto as approved by the Ontario Energy Board, which may be applicable to the administration of this schedule.",null,null,null,null,null,"6_UNMETERED SCATTERED LOAD SERVICE CLASSIFICATION",null,null,null,null,null,null,null,null,null,null,null,null,null,null,null,null,null,null,"The application of these rates and charges shall be in accordance with the Licence of the Distributor and any Code or Order of the Ontario Energy Board, and amendments thereto as approved by the Ontario Energy Board, which may be applicable to the administration of this schedule."]
[]
[null,"No rates and charges for the distribution of electricity and charges to meet the costs of any work or service done or furnished for the purpose of the distribution of electricity shall be made except as permitted by this schedule, unless required by the Distributor’s Licence or a Code or Order of the Ontario Energy Board, and amendments thereto as approved by the Ontario Energy Board, or as specified herein.",null,null,null,null,null,"6_UNMETERED SCATTERED LOAD SERVICE CLASSIFICATION",null,null,null,null,null,null,null,null,null,null,null,null,null,null,null,null,null,null,"No rates and charges for the distribution of electricity and charges to meet the costs of any work or service done or furnished for the purpose of the distribution of electricity shall be made except as permitted by this schedule, unless required by the Distributor’s Licence or a Code or Order of the Ontario Energy Board, and amendments thereto as approved by the Ontario Energy Board, or as specified herein."]
[]
[null,"Unless specifically noted, this schedule does not contain any charges for the electricity commodity, be it under the Regulated Price Plan, a contract with a retailer or the wholesale market price, as applicable.  In addition, the charges in the MONTHLY RATES AND CHARGES - Regulatory Component of this schedule do not apply to a customer that is an embedded wholesale market participant.",null,null,null,null,null,"6_UNMETERED SCATTERED LOAD SERVICE CLASSIFICATION",null,null,null,null,null,null,null,null,null,null,null,null,null,null,null,null,null,null,"Unless specifically noted, this schedule does not contain any charges for the electricity commodity, be it under the Regulated Price Plan, a contract with a retailer or the wholesale market price, as applicable.  In addition, the charges in the MONTHLY RATES AND CHARGES - Regulatory Component of this schedule do not apply to a customer that is an embedded wholesale market participant."]
[]
[null,"The rate rider for the disposition of WMS - Sub-account CBR Class B is not applicable to wholesale market participants (WMP), customers that transitioned between Class A and Class B during the variance account accumulation period, or to customers that were in Class A for the entire period. Customers who transitioned are to be charged or refunded their share of the variance disposed through customer specific billing adjustments. This rate rider is to be consistently applied for the entire period to the sunset date of the rate rider. In addition, this rate rider is applicable to all new Class B customers.",null,null,null,null,null,"6_UNMETERED SCATTERED LOAD SERVICE CLASSIFICATION",null,null,null,null,null,null,null,null,null,null,null,null,null,null,null,null,null,null,"The rate rider for the disposition of WMS - Sub-account CBR Class B is not applicable to wholesale market participants (WMP), customers that transitioned between Class A and Class B during the variance account accumulation period, or to customers that were in Class A for the entire period. Customers who transitioned are to be charged or refunded their share of the variance disposed through customer specific billing adjustments. This rate rider is to be consistently applied for the entire period to the sunset date of the rate rider. In addition, this rate rider is applicable to all new Class B customers."]
[null,"It should be noted that this schedule does not list any charges, assessments, or credits that are required by law to be invoiced by a distributor and that are not subject to Ontario Energy Board approval, such as the Debt Retirement Charge, the Global Adjustment and the HST.",null,null,null,null,null,"6_UNMETERED SCATTERED LOAD SERVICE CLASSIFICATION",null,null,null,null,null,null,null,null,null,null,null,null,null,null,null,null,null,null,"It should be noted that this schedule does not list any charges, assessments, or credits that are required by law to be invoiced by a distributor and that are not subject to Ontario Energy Board approval, such as the Debt Retirement Charge, the Global Adjustment and the HST."]
[]
[null,"MONTHLY RATES AND CHARGES - Delivery Component",null,null,null,null,null,"6_MRC_Del",null,null,null,null,null,null,null,null,null,null,null,null,null,null,null,null,null,null,"MONTHLY RATES AND CHARGES - Delivery Component"]
[]
[null,"Service Charge (per connection)",null,"$",5.8925599999999996,null,null,"6_UNMETERED SCATTERED LOAD SERVICE CLASSIFICATION","A",null,null,null,"6_UNMETERED SCATTERED LOAD SERVICE CLASSIFICATION_MSC",null,null,null,null,null,null,null,null,null,null,null,null,"Service Charge (per connection)"]
[null,"Distribution Volumetric Rate",null,"$/kWh",1.2612499999999999E-2,null,null,"6_UNMETERED SCATTERED LOAD SERVICE CLASSIFICATION","A",null,null,null,"6_UNMETERED SCATTERED LOAD SERVICE CLASSIFICATION_DVC",null,null,null,null,null,null,null,null,null,null,null,null,"Distribution Volumetric Rate"]
[null,"Low Voltage Service Rate",null,"$/kWh",1E-4,null,null,"6_UNMETERED SCATTERED LOAD SERVICE CLASSIFICATION","B",null,null,null,"6_UNMETERED SCATTERED LOAD SERVICE CLASSIFICATION_LV",null,null,null,null,null,null,null,null,null,null,null,null,"Low Voltage Service Rate"]
[null,"Rate Rider for Disposition of Global Adjustment Account (2018) - effective until April 30, 2019\n      Applicable only for Non-RPP Customers",null,"$/kWh",3.2000000000000002E-3,null,null,"6_UNMETERED SCATTERED LOAD SERVICE CLASSIFICATION","B",null,null,null,"6_UNMETERED SCATTERED LOAD SERVICE CLASSIFICATION_GA_kwh",null,null,null,"2019-04-30",null,null,null,null,null,null,null,null,"Rate Rider for Disposition of Global Adjustment Account (2019) - effective until April 30, 2019\n      Applicable only for Non-RPP Customers"]
[null,"Rate Rider for Disposition of Deferral/Variance Accounts (2018) - effective until April 30, 2019",null,"$/kWh",-6.202260836220665E-3,null,null,"6_UNMETERED SCATTERED LOAD SERVICE CLASSIFICATION","B",null,null,null,"6_UNMETERED SCATTERED LOAD SERVICE CLASSIFICATION_DEFVAR_ALL",null,null,null,"2019-04-30",null,null,null,null,null,null,null,null,"Rate Rider for Disposition of Deferral/Variance Accounts (2019) - effective until April 30, 2019"]
[null,"Rate Rider for Disposition of Capacity Based Recovery Account (2018) - effective until April 30, 2019 Applicable only for Class B Customers",null,"$/kWh",4.0000000000000002E-4,null,null,"6_UNMETERED SCATTERED LOAD SERVICE CLASSIFICATION","B",null,null,null,"6_UNMETERED SCATTERED LOAD SERVICE CLASSIFICATION_VR_RR_30",null,null,null,"2019-04-30",null,null,null,null,null,null,null,null,"Rate Rider for Disposition of Capacity Based Recovery Account (2019) - effective until April 30, 2019 Applicable only for Class B Customers"]
[null,"Retail Transmission Rate - Network Service Rate",null,"$/kWh",5.1999999999999998E-3,null,null,"6_UNMETERED SCATTERED LOAD SERVICE CLASSIFICATION","C",null,null,null,"6_UNMETERED SCATTERED LOAD SERVICE CLASSIFICATION_Retail Transmission Rate - Network Service Rate",null,null,null,null,null,null,null,null,null,null,null,null,"Retail Transmission Rate - Network Service Rate"]
[null,"Retail Transmission Rate - Line and Transformation Connection Service Rate",null,"$/kWh",4.1000000000000003E-3,null,null,"6_UNMETERED SCATTERED LOAD SERVICE CLASSIFICATION","C",null,null,null,"6_UNMETERED SCATTERED LOAD SERVICE CLASSIFICATION_Retail Transmission Rate - Line and Transformation Connection Service Rate",null,null,null,null,null,null,null,null,null,null,null,null,"Retail Transmission Rate - Line and Transformation Connection Service Rate"]
[]
[null,"MONTHLY RATES AND CHARGES - Regulatory Component",null,null,null,null,null,"6_MRC_Reg",null,null,null,null,null,null,null,null,null,null,null,null,null,null,null,null,null,"MONTHLY RATES AND CHARGES - Regulatory Component"]
[]
[null,"Wholesale Market Service Rate (WMS) - not including CBR",null,"$/kWh",3.2000000000000002E-3,null,null,"6_UNMETERED SCATTERED LOAD SERVICE CLASSIFICATION",null,null,null,null,"6_UNMETERED SCATTERED LOAD SERVICE CLASSIFICATION_WMSR",null,null,null,null,null,null,null,null,null,null,null,null,"Wholesale Market Service Rate (WMS) - not including CBR"]
[null,"Capacity Based Recovery (CBR) - Applicable for Class B Customers ",null,"$/kWh",4.0000000000000002E-4,null,null,"6_UNMETERED SCATTERED LOAD SERVICE CLASSIFICATION",null,null,null,null,null,null,null,null,null,null,null,null,null,null,null,null,null,"Capacity Based Recovery (CBR) - Applicable for Class B Customers "]
[null,"Rural or Remote Electricity Rate Protection Charge (RRRP)",null,"$/kWh",2.9999999999999997E-4,null,null,"6_UNMETERED SCATTERED LOAD SERVICE CLASSIFICATION","T",null,null,null,"6_UNMETERED SCATTERED LOAD SERVICE CLASSIFICATION_RRRP",null,null,null,null,null,null,null,null,null,null,null,null,"Rural or Remote Electricity Rate Protection Charge (RRRP)"]
[null,"Standard Supply Service - Administrative Charge (if applicable)",null,"$",0.25,null,null,"6_UNMETERED SCATTERED LOAD SERVICE CLASSIFICATION","T",null,null,null,"6_UNMETERED SCATTERED LOAD SERVICE CLASSIFICATION_SSS",null,null,null,null,null,null,null,null,null,null,null,null,"Standard Supply Service - Administrative Charge (if applicable)",null,null,null,null,null,null,null,null,null,null,null,null,null,null,null,null,null,null,"X"]
[null,"STREET LIGHTING SERVICE CLASSIFICATION",null,null,null,null,null,"7_STREET LIGHTING SERVICE CLASSIFICATION",null,null,null,null,null,null,null,null,null,null,null,null,null,null,null,null,null,null,"STREET LIGHTING SERVICE CLASSIFICATION"]
[null,"This classification refers to an account for roadway lighting with a Municipality, Regional Municipality, Ministry of Transportation and private roadway lighting operation, controlled by photo cells.  The consumption for these customers will be based on the calculated connected load times the required lighting times established in the approved Ontario Energy Board street lighting load shape template. Class B consumers are defined in accordance with O. Reg. 429/04. Further servicing details are available in the distributor's Conditions of Service.",null,null,null,null,null,"7_STREET LIGHTING SERVICE CLASSIFICATION",null,null,null,null,null,null,null,null,null,null,null,null,null,null,null,null,null,null,"This classification refers to an account for roadway lighting with a Municipality, Regional Municipality, Ministry of Transportation and private roadway lighting operation, controlled by photo cells.  The consumption for these customers will be based on the calculated connected load times the required lighting times established in the approved Ontario Energy Board street lighting load shape template. Class B consumers are defined in accordance with O. Reg. 429/04. Further servicing details are available in the distributor's Conditions of Service."]
[]
[null,"APPLICATION",null,null,null,null,null,"7_APPLICATION",null,null,null,null,null,null,null,null,null,null,null,null,null,null,null,null,null,null,"APPLICATION"]
[]
[null,"The application of these rates and charges shall be in accordance with the Licence of the Distributor and any Code or Order of the Ontario Energy Board, and amendments thereto as approved by the Ontario Energy Board, which may be applicable to the administration of this schedule.",null,null,null,null,null,"7_STREET LIGHTING SERVICE CLASSIFICATION",null,null,null,null,null,null,null,null,null,null,null,null,null,null,null,null,null,null,"The application of these rates and charges shall be in accordance with the Licence of the Distributor and any Code or Order of the Ontario Energy Board, and amendments thereto as approved by the Ontario Energy Board, which may be applicable to the administration of this schedule."]
[]
[null,"No rates and charges for the distribution of electricity and charges to meet the costs of any work or service done or furnished for the purpose of the distribution of electricity shall be made except as permitted by this schedule, unless required by the Distributor’s Licence or a Code or Order of the Ontario Energy Board, and amendments thereto as approved by the Ontario Energy Board, or as specified herein.",null,null,null,null,null,"7_STREET LIGHTING SERVICE CLASSIFICATION",null,null,null,null,null,null,null,null,null,null,null,null,null,null,null,null,null,null,"No rates and charges for the distribution of electricity and charges to meet the costs of any work or service done or furnished for the purpose of the distribution of electricity shall be made except as permitted by this schedule, unless required by the Distributor’s Licence or a Code or Order of the Ontario Energy Board, and amendments thereto as approved by the Ontario Energy Board, or as specified herein."]
[]
[null,"Unless specifically noted, this schedule does not contain any charges for the electricity commodity, be it under the Regulated Price Plan, a contract with a retailer or the wholesale market price, as applicable.  In addition, the charges in the MONTHLY RATES AND CHARGES - Regulatory Component of this schedule do not apply to a customer that is an embedded wholesale market participant.",null,null,null,null,null,"7_STREET LIGHTING SERVICE CLASSIFICATION",null,null,null,null,null,null,null,null,null,null,null,null,null,null,null,null,null,null,"Unless specifically noted, this schedule does not contain any charges for the electricity commodity, be it under the Regulated Price Plan, a contract with a retailer or the wholesale market price, as applicable.  In addition, the charges in the MONTHLY RATES AND CHARGES - Regulatory Component of this schedule do not apply to a customer that is an embedded wholesale market participant."]
[]
[null,"The rate rider for the disposition of WMS - Sub-account CBR Class B is not applicable to wholesale market participants (WMP), customers that transitioned between Class A and Class B during the variance account accumulation period, or to customers that were in Class A for the entire period. Customers who transitioned are to be charged or refunded their share of the variance disposed through customer specific billing adjustments. This rate rider is to be consistently applied for the entire period to the sunset date of the rate rider. In addition, this rate rider is applicable to all new Class B customers.",null,null,null,null,null,"7_STREET LIGHTING SERVICE CLASSIFICATION",null,null,null,null,null,null,null,null,null,null,null,null,null,null,null,null,null,null,"The rate rider for the disposition of WMS - Sub-account CBR Class B is not applicable to wholesale market participants (WMP), customers that transitioned between Class A and Class B during the variance account accumulation period, or to customers that were in Class A for the entire period. Customers who transitioned are to be charged or refunded their share of the variance disposed through customer specific billing adjustments. This rate rider is to be consistently applied for the entire period to the sunset date of the rate rider. In addition, this rate rider is applicable to all new Class B customers."]
[null,"It should be noted that this schedule does not list any charges, assessments, or credits that are required by law to be invoiced by a distributor and that are not subject to Ontario Energy Board approval, such as the Debt Retirement Charge, the Global Adjustment and the HST.",null,null,null,null,null,"7_STREET LIGHTING SERVICE CLASSIFICATION",null,null,null,null,null,null,null,null,null,null,null,null,null,null,null,null,null,null,"It should be noted that this schedule does not list any charges, assessments, or credits that are required by law to be invoiced by a distributor and that are not subject to Ontario Energy Board approval, such as the Debt Retirement Charge, the Global Adjustment and the HST."]
[]
[null,"MONTHLY RATES AND CHARGES - Delivery Component",null,null,null,null,null,"7_MRC_Del",null,null,null,null,null,null,null,null,null,null,null,null,null,null,null,null,null,null,"MONTHLY RATES AND CHARGES - Delivery Component"]
[]
[null,"Service Charge (per connection)",null,"$",2.5628599999999997,null,null,"7_STREET LIGHTING SERVICE CLASSIFICATION","A",null,null,null,"7_STREET LIGHTING SERVICE CLASSIFICATION_MSC",null,null,null,null,null,null,null,null,null,null,null,null,"Service Charge (per connection)"]
[null,"Distribution Volumetric Rate",null,"$/kW",16.365576399999998,null,null,"7_STREET LIGHTING SERVICE CLASSIFICATION","A",null,null,null,"7_STREET LIGHTING SERVICE CLASSIFICATION_DVC",null,null,null,null,null,null,null,null,null,null,null,null,"Distribution Volumetric Rate"]
[null,"Low Voltage Service Rate",null,"$/kW",2.7E-2,null,null,"7_STREET LIGHTING SERVICE CLASSIFICATION","B",null,null,null,"7_STREET LIGHTING SERVICE CLASSIFICATION_LV",null,null,null,null,null,null,null,null,null,null,null,null,"Low Voltage Service Rate"]
[null,"Rate Rider for Disposition of Global Adjustment Account (2018) - effective until April 30, 2019\n      Applicable only for Non-RPP Customers",null,"$/kWh",3.3E-3,null,null,"7_STREET LIGHTING SERVICE CLASSIFICATION","B",null,null,null,"7_STREET LIGHTING SERVICE CLASSIFICATION_GA_kwh",null,null,null,"2019-04-30",null,null,null,null,null,null,null,null,"Rate Rider for Disposition of Global Adjustment Account (2019) - effective until April 30, 2019\n      Applicable only for Non-RPP Customers"]
[null,"Rate Rider for Disposition of Deferral/Variance Accounts (2018) - effective until April 30, 2019",null,"$/kW",-2.2406831535474727,null,null,"7_STREET LIGHTING SERVICE CLASSIFICATION","B",null,null,null,"7_STREET LIGHTING SERVICE CLASSIFICATION_DEFVAR_ALL",null,null,null,"2019-04-30",null,null,null,null,null,null,null,null,"Rate Rider for Disposition of Deferral/Variance Accounts (2019) - effective until April 30, 2019"]
[null,"Rate Rider for Disposition of Capacity Based Recovery Account (2018) - effective until April 30, 2019 Applicable only for Class B Customers",null,"$/kW",0.15310000000000001,null,null,"7_STREET LIGHTING SERVICE CLASSIFICATION","B",null,null,null,"7_STREET LIGHTING SERVICE CLASSIFICATION_VR_RR_33",null,null,null,"2019-04-30",null,null,null,null,null,null,null,null,"Rate Rider for Disposition of Capacity Based Recovery Account (2019) - effective until April 30, 2019 Applicable only for Class B Customers"]
[null,"Retail Transmission Rate - Network Service Rate",null,"$/kW",1.6867000000000001,null,null,"7_STREET LIGHTING SERVICE CLASSIFICATION","C",null,null,null,"7_STREET LIGHTING SERVICE CLASSIFICATION_Retail Transmission Rate - Network Service Rate",null,null,null,null,null,null,null,null,null,null,null,null,"Retail Transmission Rate - Network Service Rate"]
[null,"Retail Transmission Rate - Line and Transformation Connection Service Rate",null,"$/kW",1.2485999999999999,null,null,"7_STREET LIGHTING SERVICE CLASSIFICATION","C",null,null,null,"7_STREET LIGHTING SERVICE CLASSIFICATION_Retail Transmission Rate - Line and Transformation Connection Service Rate",null,null,null,null,null,null,null,null,null,null,null,null,"Retail Transmission Rate - Line and Transformation Connection Service Rate"]
[]
[null,"MONTHLY RATES AND CHARGES - Regulatory Component",null,null,null,null,null,"7_MRC_Reg",null,null,null,null,null,null,null,null,null,null,null,null,null,null,null,null,null,"MONTHLY RATES AND CHARGES - Regulatory Component"]
[]
[null,"Wholesale Market Service Rate (WMS) - not including CBR",null,"$/kWh",3.2000000000000002E-3,null,null,"7_STREET LIGHTING SERVICE CLASSIFICATION",null,null,null,null,"7_STREET LIGHTING SERVICE CLASSIFICATION_WMSR",null,null,null,null,null,null,null,null,null,null,null,null,"Wholesale Market Service Rate (WMS) - not including CBR"]
[null,"Capacity Based Recovery (CBR) - Applicable for Class B Customers ",null,"$/kWh",4.0000000000000002E-4,null,null,"7_STREET LIGHTING SERVICE CLASSIFICATION",null,null,null,null,null,null,null,null,null,null,null,null,null,null,null,null,null,"Capacity Based Recovery (CBR) - Applicable for Class B Customers "]
[null,"Rural or Remote Electricity Rate Protection Charge (RRRP)",null,"$/kWh",2.9999999999999997E-4,null,null,"7_STREET LIGHTING SERVICE CLASSIFICATION","T",null,null,null,"7_STREET LIGHTING SERVICE CLASSIFICATION_RRRP",null,null,null,null,null,null,null,null,null,null,null,null,"Rural or Remote Electricity Rate Protection Charge (RRRP)"]
[null,"Standard Supply Service - Administrative Charge (if applicable)",null,"$",0.25,null,null,"7_STREET LIGHTING SERVICE CLASSIFICATION","T",null,null,null,"7_STREET LIGHTING SERVICE CLASSIFICATION_SSS",null,null,null,null,null,null,null,null,null,null,null,null,"Standard Supply Service - Administrative Charge (if applicable)",null,null,null,null,null,null,null,null,null,null,null,null,null,null,null,null,null,null,"X"]
[null,"EMBEDDED DISTRIBUTOR SERVICE CLASSIFICATION",null,null,null,null,null,"8_EMBEDDED DISTRIBUTOR SERVICE CLASSIFICATION",null,null,null,null,null,null,null,null,null,null,null,null,null,null,null,null,null,null,"EMBEDDED DISTRIBUTOR SERVICE CLASSIFICATION"]
[null,"This classification applies to an electricity distributor licenced by the Ontario Energy Board, that is provided electricity by means of this distributor's facilities. Further servicing details are available in the distributor's Conditions of Service.",null,null,null,null,null,"8_EMBEDDED DISTRIBUTOR SERVICE CLASSIFICATION",null,null,null,null,null,null,null,null,null,null,null,null,null,null,null,null,null,null,"This classification applies to an electricity distributor licenced by the Ontario Energy Board, that is provided electricity by means of this distributor's facilities. Further servicing details are available in the distributor's Conditions of Service."]
[]
[null,"APPLICATION",null,null,null,null,null,"8_APPLICATION",null,null,null,null,null,null,null,null,null,null,null,null,null,null,null,null,null,null,"APPLICATION"]
[]
[null,"The application of these rates and charges shall be in accordance with the Licence of the Distributor and any Code or Order of the Ontario Energy Board, and amendments thereto as approved by the Ontario Energy Board, which may be applicable to the administration of this schedule.",null,null,null,null,null,"8_EMBEDDED DISTRIBUTOR SERVICE CLASSIFICATION",null,null,null,null,null,null,null,null,null,null,null,null,null,null,null,null,null,null,"The application of these rates and charges shall be in accordance with the Licence of the Distributor and any Code or Order of the Ontario Energy Board, and amendments thereto as approved by the Ontario Energy Board, which may be applicable to the administration of this schedule."]
[]
[null,"No rates and charges for the distribution of electricity and charges to meet the costs of any work or service done or furnished for the purpose of the distribution of electricity shall be made except as permitted by this schedule, unless required by the Distributor’s Licence or a Code or Order of the Ontario Energy Board, and amendments thereto as approved by the Ontario Energy Board, or as specified herein.",null,null,null,null,null,"8_EMBEDDED DISTRIBUTOR SERVICE CLASSIFICATION",null,null,null,null,null,null,null,null,null,null,null,null,null,null,null,null,null,null,"No rates and charges for the distribution of electricity and charges to meet the costs of any work or service done or furnished for the purpose of the distribution of electricity shall be made except as permitted by this schedule, unless required by the Distributor’s Licence or a Code or Order of the Ontario Energy Board, and amendments thereto as approved by the Ontario Energy Board, or as specified herein."]
[]
[null,"Unless specifically noted, this schedule does not contain any charges for the electricity commodity, be it under the Regulated Price Plan, a contract with a retailer or the wholesale market price, as applicable.  In addition, the charges in the MONTHLY RATES AND CHARGES - Regulatory Component of this schedule do not apply to a customer that is an embedded wholesale market participant.",null,null,null,null,null,"8_EMBEDDED DISTRIBUTOR SERVICE CLASSIFICATION",null,null,null,null,null,null,null,null,null,null,null,null,null,null,null,null,null,null,"Unless specifically noted, this schedule does not contain any charges for the electricity commodity, be it under the Regulated Price Plan, a contract with a retailer or the wholesale market price, as applicable.  In addition, the charges in the MONTHLY RATES AND CHARGES - Regulatory Component of this schedule do not apply to a customer that is an embedded wholesale market participant."]
[]
[null,"It should be noted that this schedule does not list any charges, assessments, or credits that are required by law to be invoiced by a distributor and that are not subject to Ontario Energy Board approval, such as the Debt Retirement Charge, the Global Adjustment and the HST.",null,null,null,null,null,"8_EMBEDDED DISTRIBUTOR SERVICE CLASSIFICATION",null,null,null,null,null,null,null,null,null,null,null,null,null,null,null,null,null,null,"It should be noted that this schedule does not list any charges, assessments, or credits that are required by law to be invoiced by a distributor and that are not subject to Ontario Energy Board approval, such as the Debt Retirement Charge, the Global Adjustment and the HST."]
[]
[null,"MONTHLY RATES AND CHARGES - Delivery Component",null,null,null,null,null,"8_MRC_Del",null,null,null,null,null,null,null,null,null,null,null,null,null,null,null,null,null,null,"MONTHLY RATES AND CHARGES - Delivery Component"]
[]
[null,"Monthly Distribution Wheeling Service Rate - Waterloo North Hydro",null,"$/kW",1.9166963999999997,null,null,"8_EMBEDDED DISTRIBUTOR SERVICE CLASSIFICATION","A",null,null,null,"8_EMBEDDED DISTRIBUTOR SERVICE CLASSIFICATION_DWSR",null,null,null,null,null,null,null,null,null,null,null,null,"Monthly Distribution Wheeling Service Rate - Waterloo North Hydro"]
[null,"Monthly Distribution Wheeling Service Rate - Hydro One Networks",null,"$/kW",2.0575527999999998,null,null,"8_EMBEDDED DISTRIBUTOR SERVICE CLASSIFICATION","A",null,null,null,"8_EMBEDDED DISTRIBUTOR SERVICE CLASSIFICATION_DWSR",null,null,null,null,null,null,null,null,null,null,null,null,"Monthly Distribution Wheeling Service Rate - Hydro One Networks"]
[null,"Rate Rider for Disposition of Global Adjustment Account (2018) - effective until April 30, 2019\n      Applicable only for Non-RPP Customers",null,"$/kWh",3.3E-3]
[null,"Rate Rider for Disposition of Deferral/Variance Accounts (2018) - effective until April 30, 2019",null,"$/kW",-0.53879999999999995]
[null,"Rate Rider for Disposition of Capacity Based Recovery Account (2018) - effective until April 30, 2019 Applicable only for Class B Customers",null,"$/kW",3.6799999999999999E-2]
[null,"Retail Transmission Rate - Network Service Rate",null,"$/kW",2.4156,null,null,"8_EMBEDDED DISTRIBUTOR SERVICE CLASSIFICATION","C",null,null,null,"8_EMBEDDED DISTRIBUTOR SERVICE CLASSIFICATION_Retail Transmission Rate - Network Service Rate",null,null,null,null,null,null,null,null,null,null,null,null,"Retail Transmission Rate - Network Service Rate"]
[null,"Retail Transmission Rate - Line and Transformation Connection Service Rate",null,"$/kW",1.9849000000000001,null,null,"8_EMBEDDED DISTRIBUTOR SERVICE CLASSIFICATION","C",null,null,null,"8_EMBEDDED DISTRIBUTOR SERVICE CLASSIFICATION_Retail Transmission Rate - Line and Transformation Connection Service Rate",null,null,null,null,null,null,null,null,null,null,null,null,"Retail Transmission Rate - Line and Transformation Connection Service Rate"]
[]
[null,"MONTHLY RATES AND CHARGES - Regulatory Component",null,null,null,null,null,"8_MRC_Reg",null,null,null,null,null,null,null,null,null,null,null,null,null,null,null,null,null,"MONTHLY RATES AND CHARGES - Regulatory Component"]
[]
[null,"Wholesale Market Service Rate (WMS) - not including CBR",null,"$/kWh",3.2000000000000002E-3,null,null,"8_EMBEDDED DISTRIBUTOR SERVICE CLASSIFICATION",null,null,null,null,"8_EMBEDDED DISTRIBUTOR SERVICE CLASSIFICATION_WMSR",null,null,null,null,null,null,null,null,null,null,null,null,"Wholesale Market Service Rate (WMS) - not including CBR"]
[null,"Capacity Based Recovery (CBR) - Applicable for Class B Customers ",null,"$/kWh",4.0000000000000002E-4,null,null,"8_EMBEDDED DISTRIBUTOR SERVICE CLASSIFICATION",null,null,null,null,null,null,null,null,null,null,null,null,null,null,null,null,null,"Capacity Based Recovery (CBR) - Applicable for Class B Customers "]
[null,"Rural or Remote Electricity Rate Protection Charge (RRRP)",null,"$/kWh",2.9999999999999997E-4,null,null,"8_EMBEDDED DISTRIBUTOR SERVICE CLASSIFICATION","T",null,null,null,"8_EMBEDDED DISTRIBUTOR SERVICE CLASSIFICATION_RRRP",null,null,null,null,null,null,null,null,null,null,null,null,"Rural or Remote Electricity Rate Protection Charge (RRRP)"]
[null,"Standard Supply Service - Administrative Charge (if applicable)",null,"$",0.25,null,null,"8_EMBEDDED DISTRIBUTOR SERVICE CLASSIFICATION","T",null,null,null,"8_EMBEDDED DISTRIBUTOR SERVICE CLASSIFICATION_SSS",null,null,null,null,null,null,null,null,null,null,null,null,"Standard Supply Service - Administrative Charge (if applicable)",null,null,null,null,null,null,null,null,null,null,null,null,null,null,null,null,null,null,"X"]
[null,"microFIT SERVICE CLASSIFICATION",null,null,null,null,null,"9_microFIT SERVICE CLASSIFICATION",null,null,null,null,null,null,null,null,null,null,null,null,null,null,null,null,null,null,"microFIT SERVICE CLASSIFICATION"]
[null,"This classification applies to an electricity generation facility contracted under the Independent Electricity System Operator’s microFIT program and connected to the distributor's distribution system.  Further servicing details are available in the distributor's Conditions of Service.",null,null,null,null,null,"9_microFIT SERVICE CLASSIFICATION",null,null,null,null,null,null,null,null,null,null,null,null,null,null,null,null,null,null,"This classification applies to an electricity generation facility contracted under the Independent Electricity System Operator’s microFIT program and connected to the distributor's distribution system.  Further servicing details are available in the distributor's Conditions of Service."]
[]
[null,"APPLICATION",null,null,null,null,null,"9_APPLICATION",null,null,null,null,null,null,null,null,null,null,null,null,null,null,null,null,null,null,"APPLICATION"]
[]
[null,"The application of these rates and charges shall be in accordance with the Licence of the Distributor and any Code or Order of the Ontario Energy Board, and amendments thereto as approved by the Ontario Energy Board, which may be applicable to the administration of this schedule.",null,null,null,null,null,"9_microFIT SERVICE CLASSIFICATION",null,null,null,null,null,null,null,null,null,null,null,null,null,null,null,null,null,null,"The application of these rates and charges shall be in accordance with the Licence of the Distributor and any Code or Order of the Ontario Energy Board, and amendments thereto as approved by the Ontario Energy Board, which may be applicable to the administration of this schedule."]
[]
[null,"No rates and charges for the distribution of electricity and charges to meet the costs of any work or service done or furnished for the purpose of the distribution of electricity shall be made except as permitted by this schedule, unless required by the Distributor’s Licence or a Code or Order of the Ontario Energy Board, and amendments thereto as approved by the Ontario Energy Board, or as specified herein.",null,null,null,null,null,"9_microFIT SERVICE CLASSIFICATION",null,null,null,null,null,null,null,null,null,null,null,null,null,null,null,null,null,null,"No rates and charges for the distribution of electricity and charges to meet the costs of any work or service done or furnished for the purpose of the distribution of electricity shall be made except as permitted by this schedule, unless required by the Distributor’s Licence or a Code or Order of the Ontario Energy Board, and amendments thereto as approved by the Ontario Energy Board, or as specified herein."]
[]
[null,"Unless specifically noted, this schedule does not contain any charges for the electricity commodity, be it under the Regulated Price Plan, a contract with a retailer or the wholesale market price, as applicable.",null,null,null,null,null,"9_microFIT SERVICE CLASSIFICATION",null,null,null,null,null,null,null,null,null,null,null,null,null,null,null,null,null,null,"Unless specifically noted, this schedule does not contain any charges for the electricity commodity, be it under the Regulated Price Plan, a contract with a retailer or the wholesale market price, as applicable."]
[]
[null,"It should be noted that this schedule does not list any charges, assessments, or credits that are required by law to be invoiced by a distributor and that are not subject to Ontario Energy Board approval, such as the Debt Retirement Charge, the Global Adjustment and the HST.",null,null,null,null,null,"9_microFIT SERVICE CLASSIFICATION",null,null,null,null,null,null,null,null,null,null,null,null,null,null,null,null,null,null,"It should be noted that this schedule does not list any charges, assessments, or credits that are required by law to be invoiced by a distributor and that are not subject to Ontario Energy Board approval, such as the Debt Retirement Charge, the Global Adjustment and the HST."]
[]
[null,"MONTHLY RATES AND CHARGES - Delivery Component",null,null,null,null,null,"9_MRC_Del",null,null,null,null,null,null,null,null,null,null,null,null,null,null,null,null,null,null,"MONTHLY RATES AND CHARGES - Delivery Component"]
[]
[null,"Service Charge",null,"$",5.4,null,null,"9_microFIT SERVICE CLASSIFICATION","A",null,null,null,"9_microFIT SERVICE CLASSIFICATION_MSC",null,null,null,null,null,null,null,null,null,null,null,null,"Service Charge"]
[null,null,null,null,null,null,null,null,null,null,null,null,null,null,null,null,null,null,null,null,null,null,null,null,null,null,null,null,null,null,null,null,null,null,null,null,null,null,null,null,null,null,null,null,"X"]
[null,"ALLOWANCES",null,null,null,null,null,"Energy+ Inc._ALLOWANCES"]
[null,"Transformer Allowance for Ownership - per kW of billing demand/month",null,"$/kW",-0.6,null,null,null,null,null,null,null,null,null,null,null,null,null,null,null,null,null,null,null,null,"Transformer Allowance for Ownership - per kW of billing demand/month"]
[null,"Primary Metering Allowance for Transformer Losses - applied to measured demand & energy",null,"%",-1,null,null,null,null,null,null,null,null,null,null,null,null,null,null,null,null,null,null,null,null,"Primary Metering Allowance for Transformer Losses - applied to measured demand & energy",null,null,null,null,null,null,null,null,null,null,null,null,null,null,null,null,null,null,"X"]
[null,"SPECIFIC SERVICE CHARGES",null,null,null,null,null,"Energy+ Inc._SSC"]
[null,"The application of these rates and charges shall be in accordance with the Licence of the Distributor and any Code or Order of the Ontario Energy Board, and amendments thereto as approved by the Ontario Energy Board, which may be applicable to the administration of this schedule.",null,null,null,null,null,null,null,null,null,null,null,null,null,null,null,null,null,null,null,null,null,null,null,null,"The application of these rates and charges shall be in accordance with the Licence of the Distributor and any Code or Order of the Ontario Energy Board, and amendments thereto as approved by the Ontario Energy Board, which may be applicable to the administration of this schedule."]
[]
[null,"No charges to meet the costs of any work or service done or furnished for the purpose of the distribution of electricity shall be made except as permitted by this schedule, unless required by the Distributor’s Licence or a Code or Order of the Ontario Energy Board, and amendments thereto as approved by the Ontario Energy Board, or as specified herein.",null,null,null,null,null,null,null,null,null,null,null,null,null,null,null,null,null,null,null,null,null,null,null,null,"No charges to meet the costs of any work or service done or furnished for the purpose of the distribution of electricity shall be made except as permitted by this schedule, unless required by the Distributor’s Licence or a Code or Order of the Ontario Energy Board, and amendments thereto as approved by the Ontario Energy Board, or as specified herein."]
[]
[null,"It should be noted that this schedule does not list any charges, assessments, or credits that are required by law to be invoiced by a distributor and that are not subject to Ontario Energy Board approval, such as the Debt Retirement Charge, the Global Adjustment and the HST.",null,null,null,null,null,null,null,null,null,null,null,null,null,null,null,null,null,null,null,null,null,null,null,null,"It should be noted that this schedule does not list any charges, assessments, or credits that are required by law to be invoiced by a distributor and that are not subject to Ontario Energy Board approval, such as the Debt Retirement Charge, the Global Adjustment and the HST."]
[]
[null,"Customer Administration",null,null,null,null,null,"Energy+ Inc._CA"]
[null,"Arrears certificate",null,"$",15,null,null,null,null,null,null,null,null,null,null,null,null,null,null,null,null,null,null,null,null,"Arrears certificate"]
[null,"Statement of account",null,"$",15,null,null,null,null,null,null,null,null,null,null,null,null,null,null,null,null,null,null,null,null,"Statement of account"]
[null,"Pulling post dated cheques",null,"$",15,null,null,null,null,null,null,null,null,null,null,null,null,null,null,null,null,null,null,null,null,"Pulling post dated cheques"]
[null,"Duplicate invoices for previous billing",null,"$",15,null,null,null,null,null,null,null,null,null,null,null,null,null,null,null,null,null,null,null,null,"Duplicate invoices for previous billing"]
[null,"Request for other billing information",null,"$",15,null,null,null,null,null,null,null,null,null,null,null,null,null,null,null,null,null,null,null,null,"Request for other billing information"]
[null,"Easement Letter",null,"$",15,null,null,null,null,null,null,null,null,null,null,null,null,null,null,null,null,null,null,null,null,"Easement Letter"]
[null,"Income tax letter",null,"$",15,null,null,null,null,null,null,null,null,null,null,null,null,null,null,null,null,null,null,null,null,"Income tax letter"]
[null,"Notification charge",null,"$",15,null,null,null,null,null,null,null,null,null,null,null,null,null,null,null,null,null,null,null,null,"Notification charge"]
[null,"Account history",null,"$",15,null,null,null,null,null,null,null,null,null,null,null,null,null,null,null,null,null,null,null,null,"Account history"]
[null,"Returned Cheque (plus bank charges)",null,"$",15,null,null,null,null,null,null,null,null,null,null,null,null,null,null,null,null,null,null,null,null,"Returned Cheque (plus bank charges)"]
[null,"Charge to certify cheque",null,"$",15,null,null,null,null,null,null,null,null,null,null,null,null,null,null,null,null,null,null,null,null,"Charge to certify cheque"]
[null,"Legal letter charge",null,"$",15,null,null,null,null,null,null,null,null,null,null,null,null,null,null,null,null,null,null,null,null,"Legal letter charge"]
[null,"Account set up charge/change of occupancy charge (plus credit agency costs if applicable)",null,"$",30,null,null,null,null,null,null,null,null,null,null,null,null,null,null,null,null,null,null,null,null,"Account set up charge/change of occupancy charge (plus credit agency costs if applicable)"]
[null,"Special meter reads",null,"$",30,null,null,null,null,null,null,null,null,null,null,null,null,null,null,null,null,null,null,null,null,"Special meter reads"]
[null,"Meter dispute charge plus Measurement Canada fees (if meter found correct)",null,"$",30,null,null,null,null,null,null,null,null,null,null,null,null,null,null,null,null,null,null,null,null,"Meter dispute charge plus Measurement Canada fees (if meter found correct)"]
[null,"Credit reference/credit check (plus credit agency costs)",null,"$",15,null,null,null,null,null,null,null,null,null,null,null,null,null,null,null,null,null,null,null,null,"Credit reference/credit check (plus credit agency costs)"]
[]
[null,"Non-Payment of Account",null,null,null,null,null,"Energy+ Inc._NPoA"]
[null,"Late Payment - per month",null,"%",1.5,null,null,null,null,null,null,null,null,null,null,null,null,null,null,null,null,null,null,null,null,"Late Payment - per month"]
[null,"Late Payment - per annum",null,"%",19.559999999999999,null,null,null,null,null,null,null,null,null,null,null,null,null,null,null,null,null,null,null,null,"Late Payment - per annum"]
[null,"Collection of account charge - no disconnection - during regular business hours",null,"$",30,null,null,null,null,null,null,null,null,null,null,null,null,null,null,null,null,null,null,null,null,"Collection of account charge - no disconnection - during regular business hours"]
[null,"Collection of account charge - no disconnection - after regular hours",null,"$",165,null,null,null,null,null,null,null,null,null,null,null,null,null,null,null,null,null,null,null,null,"Collection of account charge - no disconnection - after regular hours"]
[null,"Disconnect/Reconnect at Meter - during regular hours",null,"$",65,null,null,null,null,null,null,null,null,null,null,null,null,null,null,null,null,null,null,null,null,"Disconnect/Reconnect at Meter - during regular hours"]
[null,"Disconnect/Reconnect at Meter - after regular hours",null,"$",185,null,null,null,null,null,null,null,null,null,null,null,null,null,null,null,null,null,null,null,null,"Disconnect/Reconnect at Meter - after regular hours"]
[null,"Disconnect/Reconnect at Pole - during regular hours",null,"$",185,null,null,null,null,null,null,null,null,null,null,null,null,null,null,null,null,null,null,null,null,"Disconnect/Reconnect at Pole - during regular hours"]
[null,"Disconnect/Reconnect at Pole - after regular hours",null,"$",415,null,null,null,null,null,null,null,null,null,null,null,null,null,null,null,null,null,null,null,null,"Disconnect/Reconnect at Pole - after regular hours"]
[null,"Install/Remove Load Control Device - during regular hours",null,"$",65,null,null,null,null,null,null,null,null,null,null,null,null,null,null,null,null,null,null,null,null,"Install/Remove Load Control Device - during regular hours"]
[null,"Install/Remove Load Control Device - after regular hours",null,"$",185,null,null,null,null,null,null,null,null,null,null,null,null,null,null,null,null,null,null,null,null,"Install/Remove Load Control Device - after regular hours"]
[]
[null,"Other"]
[null,"Specific charge for access to the power poles - $/pole/year                                                                                                                                                                                                                                                                                                                                                             (with the exception of wireless attachments)",null,"$",22.35,null,null,null,null,null,null,null,null,null,null,null,null,null,null,null,null,null,null,null,null,"Specific charge for access to the power poles - $/pole/year                                                                                                                                                                                                                                                                                                                                                             (with the exception of wireless attachments)"]
[null,"Service call - customer owned equipment",null,"$",30,null,null,null,null,null,null,null,null,null,null,null,null,null,null,null,null,null,null,null,null,"Service call - customer owned equipment"]
[null,"Service call - customer-owned equipment - after regular hours",null,"$",165,null,null,null,null,null,null,null,null,null,null,null,null,null,null,null,null,null,null,null,null,"Service call - customer-owned equipment - after regular hours",null,null,null,null,null,null,null,null,null,null,null,null,null,null,null,null,null,null,"X"]
[null,"RETAIL SERVICE CHARGES (if applicable)",null,null,null,null,null,"Energy+ Inc._RSC"]
[]
[null,"The application of these rates and charges shall be in accordance with the Licence of the Distributor and any Code or Order of the Ontario Energy Board, and amendments thereto as approved by the Ontario Energy Board, which may be applicable to the administration of this schedule.",null,null,null,null,null,null,null,null,null,null,null,null,null,null,null,null,null,null,null,null,null,null,null,null,"The application of these rates and charges shall be in accordance with the Licence of the Distributor and any Code or Order of the Ontario Energy Board, and amendments thereto as approved by the Ontario Energy Board, which may be applicable to the administration of this schedule."]
[]
[null,"No rates and charges for the distribution of electricity and charges to meet the costs of any work or service done or furnished for the purpose of the distribution of electricity shall be made except as permitted by this schedule, unless required by the Distributor’s Licence or a Code or Order of the Ontario Energy Board, and amendments thereto as approved by the Ontario Energy Board, or as specified herein.",null,null,null,null,null,null,null,null,null,null,null,null,null,null,null,null,null,null,null,null,null,null,null,null,"No rates and charges for the distribution of electricity and charges to meet the costs of any work or service done or furnished for the purpose of the distribution of electricity shall be made except as permitted by this schedule, unless required by the Distributor’s Licence or a Code or Order of the Ontario Energy Board, and amendments thereto as approved by the Ontario Energy Board, or as specified herein."]
[]
[null,"Unless specifically noted, this schedule does not contain any charges for the electricity commodity, be it under the Regulated Price Plan, a contract with a retailer or the wholesale market price, as applicable.",null,null,null,null,null,null,null,null,null,null,null,null,null,null,null,null,null,null,null,null,null,null,null,null,"Unless specifically noted, this schedule does not contain any charges for the electricity commodity, be it under the Regulated Price Plan, a contract with a retailer or the wholesale market price, as applicable."]
[]
[null,"It should be noted that this schedule does not list any charges, assessments, or credits that are required by law to be invoiced by a distributor and that are not subject to Ontario Energy Board approval, such as the Debt Retirement Charge, the Global Adjustment and the HST.",null,null,null,null,null,null,null,null,null,null,null,null,null,null,null,null,null,null,null,null,null,null,null,null,"It should be noted that this schedule does not list any charges, assessments, or credits that are required by law to be invoiced by a distributor and that are not subject to Ontario Energy Board approval, such as the Debt Retirement Charge, the Global Adjustment and the HST."]
[]
[null,"Retail Service Charges refer to services provided by a distributor to retailers or customers related to the supply of competitive electricity.",null,null,null,null,null,null,null,null,null,null,null,null,null,null,null,null,null,null,null,null,null,null,null,null,"Retail Service Charges refer to services provided by a distributor to retailers or customers related to the supply of competitive electricity."]
[null,"One-time charge, per retailer, to establish the service agreement between the distributor and the retailer",null,"$",100,null,null,null,null,null,null,null,null,null,null,null,null,null,null,null,null,null,null,null,null,"One-time charge, per retailer, to establish the service agreement between the distributor and the retailer"]
[null,"Monthly Fixed Charge, per retailer",null,"$",20,null,null,null,null,null,null,null,null,null,null,null,null,null,null,null,null,null,null,null,null,"Monthly Fixed Charge, per retailer"]
[null,"Monthly Variable Charge, per customer, per retailer",null,"$/cust.",0.5,null,null,null,null,null,null,null,null,null,null,null,null,null,null,null,null,null,null,null,null,"Monthly Variable Charge, per customer, per retailer"]
[null,"Distributor-consolidated billing monthly charge, per customer, per retailer",null,"$/cust.",0.3,null,null,null,null,null,null,null,null,null,null,null,null,null,null,null,null,null,null,null,null,"Distributor-consolidated billing monthly charge, per customer, per retailer"]
[null,"Retailer-consolidated billing monthly credit, per customer, per retailer",null,"$/cust.",-0.3,null,null,null,null,null,null,null,null,null,null,null,null,null,null,null,null,null,null,null,null,"Retailer-consolidated billing monthly credit, per customer, per retailer"]
[null,"Service Transaction Requests (STR)",null,null,null,null,null,null,null,null,null,null,null,null,null,null,null,null,null,null,null,null,null,null,null,"Service Transaction Requests (STR)"]
[null,"Request fee, per request, applied to the requesting party",null,"$",0.25,null,null,null,null,null,null,null,null,null,null,null,null,null,null,null,null,null,null,null,null,"Request fee, per request, applied to the requesting party"]
[null,"Processing fee, per request, applied to the requesting party",null,"$",0.5,null,null,null,null,null,null,null,null,null,null,null,null,null,null,null,null,null,null,null,null,"Processing fee, per request, applied to the requesting party"]
[null,"Request for customer information as outlined in Section 10.6.3 and Chapter 11 of the Retail",null,null,null,null,null,null,null,null,null,null,null,null,null,null,null,null,null,null,null,null,null,null,null,"Request for customer information as outlined in Section 10.6.3 and Chapter 11 of the Retail"]
[null,"Settlement Code directly to retailers and customers, if not delivered electronically through the",null,null,null,null,null,null,null,null,null,null,null,null,null,null,null,null,null,null,null,null,null,null,null,"Settlement Code directly to retailers and customers, if not delivered electronically through the"]
[null,"Electronic Business Transaction (EBT) system, applied to the requesting party",null,null,null,null,null,null,null,null,null,null,null,null,null,null,null,null,null,null,null,null,null,null,null,"Electronic Business Transaction (EBT) system, applied to the requesting party"]
[null,"Up to twice a year",null,"$","no charge",null,null,null,null,null,null,null,null,null,null,null,null,null,null,null,null,null,null,null,null,"Up to twice a year"]
[null,"More than twice a year, per request (plus incremental delivery costs)",null,"$",2,null,null,null,null,null,null,null,null,null,null,null,null,null,null,null,null,null,null,null,null,"More than twice a year, per request (plus incremental delivery costs)"]
[null,null,null,null,null,null,null,null,null,null,null,null,null,null,null,null,null,null,null,null,null,null,null,null,null,null,null,null,null,null,null,null,null,null,null,null,null,null,null,null,null,null,null,null,"X"]
[null,"LOSS FACTORS",null,null,null,null,null,"Energy+ Inc._LFs"]
[]
[null,"If the distributor is not capable of prorating changed loss factors jointly with distribution rates, the revised loss factors will be implemented upon the first subsequent billing for each billing cycle.",null,null,null,null,null,null,null,null,null,null,null,null,null,null,null,null,null,null,null,null,null,null,null,null,"If the distributor is not capable of prorating changed loss factors jointly with distribution rates, the revised loss factors will be implemented upon the first subsequent billing for each billing cycle."]
[null,"Total Loss Factor - Secondary Metered Customer < 5,000 kW",null,null,1.0335000000000001,null,null,null,null,null,null,null,null,null,null,null,null,null,null,null,null,null,null,null,null,"Total Loss Factor - Secondary Metered Customer < 5,000 kW"]
[null,"Total Loss Factor - Secondary Metered Customer > 5,000 kW",null,null,1.0145,null,null,null,null,null,null,null,null,null,null,null,null,null,null,null,null,null,null,null,null,"Total Loss Factor - Secondary Metered Customer > 5,000 kW"]
[null,"Total Loss Factor - Primary Metered Customer < 5,000 kW",null,null,1.0235000000000001,null,null,null,null,null,null,null,null,null,null,null,null,null,null,null,null,null,null,null,null,"Total Loss Factor - Primary Metered Customer < 5,000 kW"]
[null,"Total Loss Factor - Primary Metered Customer > 5,000 kW",null,null,1.0044999999999999,null,"Energy+ Inc.-For Former Cambridge and North Dumfries Hydro Service Area_End",null,null,null,null,null,null,null,null,null,null,null,null,null,null,null,null,null,null,"Total Loss Factor - Primary Metered Customer > 5,000 kW"]

{"sheet":"2016 List","index":3,"n_rows":73,"n_cols":27,"rows_kept":73,"cut":false,"hidden":true,"merged":[]}
["Algoma Power Inc.","HHPNS717",null,null,null,null,null,null,null,null,null,null,null,null,null,null,null,null,null,null,null,null,null,0,0]
["Atikokan Hydro Inc.","KSUYD122","Fort Erie Service Area","X",null,null,null,null,null,null,null,null,null,null,null,null,null,null,null,null,null,null,null,null,null,null,"Retail Transmission Rate - Line and Transformation Connection Service Rate"]
["Bluewater Power Distribution Corporation","WKBSV849","Eastern Ontario Power Service Area","X",null,null,null,null,null,null,null,null,null,null,null,null,null,null,null,null,null,null,null,null,null,null,"Retail Transmission Rate - Line and Transformation Connection Service Rate - < 1,000 kW"]
["Brantford Power Inc.","GQQHM388","Port Colborne Service Area","X",null,null,null,null,null,null,null,null,null,null,null,null,null,null,null,null,null,null,null,null,null,null,"Retail Transmission Rate - Line and Transformation Connection Service Rate - Interval Metered"]
["Burlington Hydro Inc.","SFXZP935",null,"X",null,null,null,null,null,null,null,null,null,null,null,null,null,null,null,null,null,null,null,null,null,null,"Retail Transmission Rate - Line and Transformation Connection Service Rate - Interval Metered (1,000 to 4,999 kW)"]
["Canadian Niagara Power Inc.","KQEEH473","Former Chatham-Kent Hydro Service Area","X",null,null,null,null,null,null,null,null,null,null,null,null,null,null,null,null,null,null,null,null,null,null,"Retail Transmission Rate - Line and Transformation Connection Service Rate - Interval Metered < 1,000 kW"]
["Centre Wellington Hydro Ltd.","OARZC118","Strathroy, Mount Brydges & Parkhill Service Area",null,null,null,null,null,null,null,null,null,null,null,null,null,null,null,null,null,null,null,null,null,null,null,"Retail Transmission Rate - Line and Transformation Connection Service Rate - Interval Metered > 1,000 kW"]
["Chapleau Public Utilities Corporation","WKBSV849","Dutton Service Area","X",null,null,null,null,null,null,null,null,null,null,null,null,null,null,null,null,null,null,null,null,null,null,"Retail Transmission Rate - Line Connection Service Rate"]
["Collus PowerStream Corp.","FUIJX538",null,null,null,null,null,null,null,null,null,null,null,null,null,null,null,null,null,null,null,null,null,null,null,null,"Retail Transmission Rate - Transformation Connection Service Rate"]
["Cooperative Hydro Embrun Inc.","HJHBH994","Newbury Service Area","X"]
["E.L.K. Energy Inc.","NJYBW716"]
["Energy+ Inc.","QXHJU641",null,"X"]
["Enersource Hydro Mississauga Inc.","AVXSO594","For Former Parry Sound Power Service Area","X"]
["Entegrus Powerlines Inc.","TVKSH414","Except for the Former Parry Sound Power Service Area","X"]
["EnWin Utilities Ltd.","DUISI693",null,"X"]
["Erie Thames Powerlines Corporation","JMNNR431","For Former Brant County Power Service Area"]
["Espanola Regional Hydro Distribution Corporation","GQQHM388","For Former Cambridge and North Dumfries Hydro Service Area","X"]
["Essex Powerlines Corporation","QHCKN852"]
["Festival Hydro Inc.","PWKJP953",null,"X"]
["Fort Frances Power Corporation","ADICB565","Former Haldimand County Hydro Inc. Service Area",null,null,null,null,null,null,null,null,null,null,null,null,null,null,null,null,null,null,null,null,null,null,null,"Retail Transmission Rate - Network Service Rate"]
["Greater Sudbury Hydro Inc.","YEOQG654","Former Norfolk Power Distribution Inc. Service Area",null,null,null,null,null,null,null,null,null,null,null,null,null,null,null,null,null,null,null,null,null,null,null,"Retail Transmission Rate - Network Service Rate - < 1,000 kW"]
["Grimsby Power Incorporated","LRECV427","Former Woodstock Hydro Services Inc. Service Area",null,null,null,null,null,null,null,null,null,null,null,null,null,null,null,null,null,null,null,null,null,null,null,"Retail Transmission Rate - Network Service Rate - Interval Metered"]
["Guelph Hydro Electric Systems Inc.","PQZCY963",null,null,null,null,null,null,null,null,null,null,null,null,null,null,null,null,null,null,null,null,null,null,null,null,"Retail Transmission Rate - Network Service Rate - Interval Metered (1,000 to 4,999 kW)"]
["Halton Hills Hydro Inc.","KTCNY552",null,"X",null,null,null,null,null,null,null,null,null,null,null,null,null,null,null,null,null,null,null,null,null,null,"Retail Transmission Rate - Network Service Rate - Interval Metered < 1,000 kW"]
["Hearst Power Distribution Company Ltd.","YEPCI143",null,null,null,null,null,null,null,null,null,null,null,null,null,null,null,null,null,null,null,null,null,null,null,null,"Retail Transmission Rate - Network Service Rate - Interval Metered > 1,000 kW"]
["Horizon Utilities Corporation","GRHTW113"]
["Hydro 2000 Inc.","GTLBW445"]
["Hydro Hawkesbury Inc.","HHPNS717",null,"X"]
["Hydro One Brampton Networks Inc.","NJYBW716"]
["Hydro One Networks Inc.","GMGHU415"]
["Hydro Ottawa Limited","YTPWF351",null,"X"]
["InnPower Corporation","SFXZP935"]
["Kenora Hydro Electric Corporation Ltd.","YCYKQ642",null,"X"]
["Kingston Hydro Corporation","ADZFM459",null,"X"]
["Kitchener-Wilmot Hydro Inc.","RVWKN794"]
["Lakefront Utilities Inc.","XCFPH269"]
["Lakeland Power Distribution Ltd.","KESKM585",null,"X"]
["London Hydro Inc.","MQFNL784",null,"X"]
["Midland Power Utility Corporation","JEGGW178"]
["Milton Hydro Distribution Inc.","FNDHH648"]
["Newmarket - Tay Power Distribution Ltd.","PTREM828"]
["Niagara Peninsula Energy Inc.","TXKTT167"]
["Niagara-on-the-Lake Hydro Inc.","UBBYF452"]
["North Bay Hydro Distribution Limited","NSBED625",null,"X"]
["Northern Ontario Wires Inc.","CPEFQ593"]
["Oakville Hydro Electricity Distribution Inc.","MLWYG784",null,"X"]
["Orangeville Hydro Limited","ZHKLA874",null,"X"]
["Orillia Power Distribution Corporation","YLJHT264",null,"X"]
["Oshawa PUC Networks Inc.","JKBZG525"]
["Ottawa River Power Corporation","YLCEC559"]
["Peterborough Distribution Incorporated","OARZC118",null,"X"]
["PowerStream Inc.","KQEEH473",null,"X"]
["PUC Distribution Inc.","NHKJF259"]
["Renfrew Hydro Inc.","SLRXO177"]
["Rideau St. Lawrence Distribution Inc.","SLRXO178"]
["Sioux Lookout Hydro Inc.","UIFEM157",null,"X"]
["St. Thomas Energy Inc.","RUZIU984",null,"X"]
["Thunder Bay Hydro Electricity Distribution Inc.","HJHBH994",null,"X"]
["Tillsonburg Hydro Inc.","AMZEN437"]
["Toronto Hydro-Electric System Limited","ACEVX242",null,"X"]
["Veridian Connections Inc.","PTLUC812"]
["Wasaga Distribution Inc.","QDKIF127",null,"X"]
["Waterloo North Hydro Inc.","OLIUU862",null,"X"]
["Welland Hydro-Electric System Corp.","NIOJF461"]
["Wellington North Power Inc.","ZYZFO848"]
["West Coast Huron Energy Inc.","ASEGZ471"]
["Westario Power Inc.","IOKHC383",null,"X"]
["Whitby Hydro Electric Corporation","DSPWZ318"]
[null,null,null,"X"]
[]
[]
[null,null,null,"X"]
[null,null,null,"X"]

{"sheet":"3. Regulatory Charges","index":4,"n_rows":29,"n_cols":5,"rows_kept":29,"cut":false,"hidden":false,"merged":[[11,1,11,3],[21,2,21,3],[28,4,29,10]]}
[]
[]
[]
[]
[]
[]
[]
[]
[]
[]
[]
[null,"Update the following rates if an OEB Decision has been issued at the time of completing this application"]
[null,"Regulatory Charges",null,"Proposed"]
[null,"Wholesale Market Service Rate (WMS) - not including CBR","$/kWh",3.2000000000000002E-3]
[null,"Capacity Based Recovery (CBR) - Applicable for Class B Customers ","$/kWh",4.0000000000000002E-4]
[null,"Rural or Remote Electricity Rate Protection Charge (RRRP)","$/kWh",2.9999999999999997E-4]
[null,"Standard Supply Service - Administrative Charge (if applicable)","$",0.25]
[null,"Ontario Electricity Support Program (OESP)","$/kWh",0]
[]
[]
[null,"Time-of-Use RPP Prices"]
[null,"As of ","2017-07-01"]
[null,"Off-Peak","$/kWh",6.5000000000000002E-2]
[null,"Mid-Peak","$/kWh",9.5000000000000001E-2]
[null,"On-Peak","$/kWh",0.13200000000000001]
[]
[]
[null,"Debt Retirement Charge (DRC)"]
[null,"Debt Retirement Charge (DRC)","$/kWh",7.0000000000000001E-3,"If your utility's DRC differs from the value in Cell D29, please update this value."]

{"sheet":"4.2-TS Tariff Schedule","index":5,"n_rows":363,"n_cols":105,"rows_kept":363,"cut":false,"hidden":false,"merged":[[89,1,89,2],[362,1,362,2],[274,1,274,2],[277,1,277,2],[278,1,278,2],[279,1,279,2],[283,1,283,2],[284,1,284,2],[285,1,285,2],[286,1,286,2],[287,1,287,2],[356,1,356,2],[358,1,358,4],[359,1,359,2],[360,1,360,2],[361,1,361,2],[351,1,351,2],[352,1,352,2],[353,1,353,2],[354,1,354,2],[355,1,355,2],[346,1,346,2],[347,1,347,2],[348,1,348,2],[349,1,349,2],[350,1,350,2],[341,1,341,4],[342,1,342,4],[343,1,343,4],[344,1,344,2],[345,1,345,2],[335,1,335,2],[336,1,336,2],[337,1,337,2],[339,1,339,4],[340,1,340,4],[329,1,329,2],[330,1,330,2],[331,1,331,2],[332,1,332,2],[333,1,333,2],[324,1,324,2],[325,1,325,2],[326,1,326,2],[327,1,327,2],[328,1,328,2],[318,1,318,2],[319,1,319,2],[320,1,320,2],[321,1,321,2],[322,1,322,2],[313,1,313,2],[314,1,314,2],[315,1,315,2],[316,1,316,2],[317,1,317,2],[308,1,308,2],[309,1,309,2],[310,1,310,2],[311,1,311,2],[312,1,312,2],[301,1,301,2],[303,1,303,4],[304,1,304,4],[305,1,305,4],[307,1,307,2],[295,1,295,4],[296,1,296,4],[297,1,297,4],[298,1,298,2],[300,1,300,2],[290,1,290,4],[291,1,291,4],[292,1,292,4],[293,1,293,4],[294,1,294,4],[288,1,288,2],[289,1,289,2],[273,1,273,4],[275,1,275,2],[276,1,276,2],[249,1,249,2],[250,1,250,2],[248,1,248,4],[261,1,261,2],[263,1,263,2],[264,1,264,2],[265,1,265,2],[262,1,262,2],[251,1,251,2],[254,1,254,2],[259,1,259,2],[260,1,260,2],[271,1,271,4],[272,1,272,4],[256,1,256,2],[280,1,280,2],[228,1,228,2],[219,1,219,4],[220,1,220,4],[221,1,221,4],[246,1,246,4],[247,1,247,4],[245,1,245,4],[237,1,237,2],[238,1,238,2],[239,1,239,2],[240,1,240,2],[229,1,229,2],[241,1,241,4],[242,1,242,4],[243,1,243,4],[244,1,244,4],[234,1,234,2],[235,1,235,2],[236,1,236,2],[209,1,209,2],[211,1,211,2],[208,1,208,2],[210,1,210,2],[266,1,266,4],[267,1,267,4],[268,1,268,4],[269,1,269,4],[270,1,270,4],[225,1,225,2],[226,1,226,2],[252,1,252,2],[253,1,253,2],[217,1,217,4],[218,1,218,4],[212,1,212,2],[214,1,214,4],[215,1,215,4],[213,1,213,4],[216,1,216,4],[222,1,222,2],[223,1,223,2],[224,1,224,2],[227,1,227,2],[199,1,199,2],[200,1,200,2],[201,1,201,2],[206,1,206,2],[207,1,207,2],[194,1,194,2],[195,1,195,2],[196,1,196,2],[193,1,193,4],[197,1,197,2],[198,1,198,2],[190,1,190,4],[191,1,191,4],[192,1,192,4],[188,1,188,4],[189,1,189,4],[185,1,185,4],[186,1,186,4],[187,1,187,4],[184,1,184,2],[180,1,180,2],[181,1,181,2],[182,1,182,2],[183,1,183,2],[170,1,170,2],[173,1,173,2],[178,1,178,2],[179,1,179,2],[167,1,167,4],[168,1,168,2],[169,1,169,2],[171,1,171,2],[141,1,141,2],[142,1,142,2],[163,1,163,4],[164,1,164,4],[165,1,165,4],[166,1,166,4],[162,1,162,4],[161,1,161,4],[157,1,157,2],[158,1,158,4],[159,1,159,4],[160,1,160,4],[105,1,105,2],[107,1,107,2],[108,1,108,2],[101,1,101,4],[102,1,102,4],[103,1,103,4],[99,1,99,4],[100,1,100,4],[127,1,127,4],[124,1,124,2],[125,1,125,2],[126,1,126,2],[121,1,121,2],[122,1,122,2],[123,1,123,2],[112,1,112,2],[113,1,113,2],[114,1,114,2],[115,1,115,2],[120,1,120,2],[109,1,109,2],[110,1,110,2],[111,1,111,2],[83,1,83,2],[84,1,84,2],[75,1,75,2],[76,1,76,2],[78,1,78,2],[79,1,79,2],[82,1,82,2],[74,1,74,4],[72,1,72,4],[73,1,73,4],[71,1,71,4],[47,1,47,2],[51,1,51,2],[52,1,52,2],[55,1,55,2],[56,1,56,2],[45,1,45,2],[46,1,46,2],[64,1,64,2],[65,1,65,2],[66,1,66,4],[67,1,67,4],[68,1,68,4],[69,1,69,4],[57,1,57,2],[59,1,59,2],[60,1,60,2],[61,1,61,2],[62,1,62,2],[63,1,63,2],[35,1,35,4],[36,1,36,4],[37,1,37,4],[29,1,29,4],[30,1,30,4],[31,1,31,4],[32,1,32,4],[33,1,33,4],[70,1,70,4],[41,1,41,4],[42,1,42,4],[43,1,43,4],[44,1,44,4],[50,1,50,2],[13,1,13,4],[14,1,14,4],[15,1,15,4],[16,1,16,4],[17,1,17,4],[54,1,54,2],[53,1,53,2],[80,1,80,2],[81,1,81,2],[58,1,58,2],[77,1,77,2],[18,1,18,4],[19,1,19,4],[20,1,20,4],[26,1,26,4],[21,1,21,4],[22,1,22,4],[23,1,23,4],[24,1,24,4],[25,1,25,4],[38,1,38,4],[39,1,39,4],[40,1,40,4],[34,1,34,4],[128,1,128,4],[134,1,134,4],[135,1,135,4],[136,1,136,4],[172,1,172,2],[131,1,131,4],[132,1,132,4],[133,1,133,4],[129,1,129,4],[130,1,130,4],[153,1,153,2],[154,1,154,2],[155,1,155,2],[156,1,156,2],[145,1,145,2],[146,1,146,2],[151,1,151,2],[152,1,152,2],[137,1,137,2],[138,1,138,2],[139,1,139,2],[143,1,143,2],[144,1,144,2],[140,1,140,2],[85,1,85,2],[116,1,116,2],[147,1,147,2],[176,1,176,2],[202,1,202,2],[230,1,230,2],[255,1,255,2],[86,1,86,2],[106,1,106,2],[117,1,117,2],[148,1,148,2],[174,1,174,2],[203,1,203,2],[231,1,231,2],[95,1,95,2],[96,1,96,4],[97,1,97,4],[98,1,98,4],[91,1,91,2],[92,1,92,2],[93,1,93,2],[94,1,94,2],[90,1,90,2],[104,1,104,4]]}
[null,null,null,null,null,null,null,null,null,null,null,null,null,null,null,null,null,null,null,null,null,null,null,null,null,null,null,null,null,null,null,null,null,null,null,null,null,null,null,null,null,null,null,null,null,null,null,null,null,null,null,null,null,null,null,null,null,null,null,null,null,null,null,null,null,null,null,null,null,null,null,null,null,null,null,null,null,null,null,null,null,null,null,null,null,null,null,null,null,null,null,null,null,null,{"$f":"'1. Information Sheet'!F18","v":"EB-2018-0028"},null,null,null,null,null,null,null,null,null,true]
[]
[]
[]
[]
[]
[]
[]
[]
[]
[]
[null,null,null,null,9]
[]
[null,"Identify Your Rate Classes in the Blue Cells below.  Rate class names can be selected from the pull-dwon menu.  Please ensure that a rate class is assigned to each shaded cell.\n"]
[null,"List of Rate Classes",null,null,null,null,null,null,null,null,null,null,null,null,null,null,null,null,null,null,null,null,null,null,null,null,null,null,null,null,null,null,null,null,null,null,null,null,null,null,null,null,null,null,null,null,null,null,null,null,null,null,null,null,null,null,null,null,null,null,null,null,null,null,null,null,null,null,null,null,null,null,null,null,null,null,null,null,null,null,null,"Linked to:",null,null,"Add before:"]
[]
[]
[]
[]
[]
[]
[]
[]
[]
[]
[]
[]
[]
[]
[null,"Energy+ Inc.",null,null,null,"X","Energy+ Inc.-For Former Cambridge and North Dumfries Hydro Service Area_Start","ENERGY+ INC.",null,null,null,null,null,null,null,null,null,null,null,null,null,12]
[null,"For Former Cambridge and North Dumfries Hydro Service Area",null,null,null,null,null,null,null,null,null,null,null,null,null,null,null,null,null,null,null,58]
[null,"TARIFF OF RATES AND CHARGES",null,null,null,null,null,null,null,null,null,null,null,null,null,null,null,null,null,null,null,27]
[null,"Effective and Implementation Date May 1, 2018",null,null,null,null,null,null,null,null,null,null,null,null,null,"2018-05-01",null,null,null,null,null,45]
[null,"This schedule supersedes and replaces all previously",null,null,null,null,null,null,null,null,null,null,null,null,null,null,null,null,null,null,null,52]
[null,"approved schedules of Rates, Charges and Loss Factors",null,null,null,null,null,null,null,null,null,null,null,null,null,null,null,null,null,null,null,53]
[null,{"$f":"'1. Information Sheet'!F18","v":"EB-2018-0028"},null,null,null,null,null,"EB-2018-0028",null,null,null,null,null,null,null,null,null,null,null,null,null,12,null,null,null,null,"EB-2017-0030",null,null,null,null,null,null,null,null,null,null,null,null,null,null,null,null,null,"X"]
[null,"RESIDENTIAL SERVICE CLASSIFICATION",null,null,null,null,null,"1_RESIDENTIAL SERVICE CLASSIFICATION",null,null,null,null,null,null,null,null,null,null,null,null,null,34,null,null,null,null,"RESIDENTIAL SERVICE CLASSIFICATION"]
[null,"Residential refers to the supply of electrical energy to detached, semi-detached and row-housing units (freehold or condominium).  This classification typically refers to an account taking electricity at 750 volts or less where electricity is used exclusively in a separate metered living accommodation.  Customers shall be residing in single-dwelling units that consist of a detached house or one unit of a semi-detached, duplex, triplex, or quadruplex house, with a residential zoning.  Separate metered dwellings within a town house complex, condominium, or apartment building also qualify as residential customers.  Class B consumers are defined in accordance with O. Reg. 429/04. Further servicing details are available in the distributor's Conditions of Service.",null,null,null,null,null,"1_RESIDENTIAL SERVICE CLASSIFICATION",null,null,null,null,null,null,null,null,null,null,null,null,null,768,null,null,null,null,"Residential refers to the supply of electrical energy to detached, semi-detached and row-housing units (freehold or condominium).  This classification typically refers to an account taking electricity at 750 volts or less where electricity is used exclusively in a separate metered living accommodation.  Customers shall be residing in single-dwelling units that consist of a detached house or one unit of a semi-detached, duplex, triplex, or quadruplex house, with a residential zoning.  Separate metered dwellings within a town house complex, condominium, or apartment building also qualify as residential customers.  Class B consumers are defined in accordance with O. Reg. 429/04. Further servicing details are available in the distributor's Conditions of Service."]
[null,"APPLICATION",null,null,null,null,null,"1_APPLICATION",null,null,null,null,null,null,null,null,null,null,null,null,null,11,null,null,null,null,"APPLICATION"]
[null,"The application of these rates and charges shall be in accordance with the Licence of the Distributor and any Code or Order of the Ontario Energy Board, and amendments thereto as approved by the Ontario Energy Board, which may be applicable to the administration of this schedule.",null,null,null,null,null,"1_RESIDENTIAL SERVICE CLASSIFICATION",null,null,null,null,null,null,null,null,null,null,null,null,null,280,null,null,null,null,"The application of these rates and charges shall be in accordance with the Licence of the Distributor and any Code or Order of the Ontario Energy Board, and amendments thereto as approved by the Ontario Energy Board, which may be applicable to the administration of this schedule."]
[null,"No rates and charges for the distribution of electricity and charges to meet the costs of any work or service done or furnished for the purpose of the distribution of electricity shall be made except as permitted by this schedule, unless required by the Distributor’s Licence or a Code or Order of the Ontario Energy Board, and amendments thereto as approved by the Ontario Energy Board, or as specified herein.",null,null,null,null,null,"1_RESIDENTIAL SERVICE CLASSIFICATION",null,null,null,null,null,null,null,null,null,null,null,null,null,411,null,null,null,null,"No rates and charges for the distribution of electricity and charges to meet the costs of any work or service done or furnished for the purpose of the distribution of electricity shall be made except as permitted by this schedule, unless required by the Distributor’s Licence or a Code or Order of the Ontario Energy Board, and amendments thereto as approved by the Ontario Energy Board, or as specified herein."]
[null,"Unless specifically noted, this schedule does not contain any charges for the electricity commodity, be it under the Regulated Price Plan, a contract with a retailer or the wholesale market price, as applicable.  In addition, the charges in the MONTHLY RATES AND CHARGES - Regulatory Component of this schedule do not apply to a customer that is an embedded wholesale market participant.",null,null,null,null,null,"1_RESIDENTIAL SERVICE CLASSIFICATION",null,null,null,null,null,null,null,null,null,null,null,null,null,387,null,null,null,null,"Unless specifically noted, this schedule does not contain any charges for the electricity commodity, be it under the Regulated Price Plan, a contract with a retailer or the wholesale market price, as applicable.  In addition, the charges in the MONTHLY RATES AND CHARGES - Regulatory Component of this schedule do not apply to a customer that is an embedded wholesale market participant."]
[null,"The rate rider for the disposition of WMS - Sub-account CBR Class B is not applicable to wholesale market participants (WMP), customers that transitioned between Class A and Class B during the variance account accumulation period, or to customers that were in Class A for the entire period. Customers who transitioned are to be charged or refunded their share of the variance disposed through customer specific billing adjustments. This rate rider is to be consistently applied for the entire period to the sunset date of the rate rider. In addition, this rate rider is applicable to all new Class B customers.",null,null,null,null,null,"1_RESIDENTIAL SERVICE CLASSIFICATION",null,null,null,null,null,null,null,null,null,null,null,null,null,610,null,null,null,null,"The rate rider for the disposition of WMS - Sub-account CBR Class B is not applicable to wholesale market participants (WMP), customers that transitioned between Class A and Class B during the variance account accumulation period, or to customers that were in Class A for the entire period. Customers who transitioned are to be charged or refunded their share of the variance disposed through customer specific billing adjustments. This rate rider is to be consistently applied for the entire period to the sunset date of the rate rider. In addition, this rate rider is applicable to all new Class B customers."]
[null,"It should be noted that this schedule does not list any charges, assessments, or credits that are required by law to be invoiced by a distributor and that are not subject to Ontario Energy Board approval, such as the Debt Retirement Charge, the Global Adjustment and the HST.",null,null,null,null,null,"1_RESIDENTIAL SERVICE CLASSIFICATION",null,null,null,null,null,null,null,null,null,null,null,null,null,275,null,null,null,null,"It should be noted that this schedule does not list any charges, assessments, or credits that are required by law to be invoiced by a distributor and that are not subject to Ontario Energy Board approval, such as the Debt Retirement Charge, the Global Adjustment and the HST."]
[null,"MONTHLY RATES AND CHARGES - Delivery Component",null,null,null,null,null,"1_MRC_DEL",null,null,null,null,null,null,null,null,null,null,null,null,null,46,null,null,null,null,"MONTHLY RATES AND CHARGES - Delivery Component"]
[null,"Service Charge",null,"$",27.33,null,null,"1_RESIDENTIAL SERVICE CLASSIFICATION","A",null,null,null,"1_RESIDENTIAL SERVICE CLASSIFICATION_MSC",null,null,null,null,null,null,null,null,8,null,null,null,"Service Charge"]
[null,"Rate Rider for Smart Metering Entity Charge - effective until December 31, 2022",null,"$",0.56999999999999995,null,null,"1_RESIDENTIAL SERVICE CLASSIFICATION","B",null,null,null,"1_RESIDENTIAL SERVICE CLASSIFICATION_SME",null,null,null,"2022-12-31",null,null,null,null,4,null,null,null,"Rate Rider for Smart Metering Entity Charge - effective until December 31, 2022"]
[null,"Rate Rider for Smart Meter (Stranded Meters) - effective until Dec 31, 2019",null,"$",0.25994789727448581,null,null,null,"B"]
[null,"Rate Rider for Disposition of Account 1575 and 1576 - effective until Dec 31, 2019",null,"$",-0.2126511495947081,null,null,null,"B"]
[null,"Rate Rider - Gain on Sale of Property",null,"$",-0.16323570297172302,null,null,null,"B"]
[null,"Rate Rider for Disposition of Deferral/Variance Group 2 Accounts (2019) - effective until Dec 31, 2019",null,"$",0.69826095732834137,null,null,"1_RESIDENTIAL SERVICE CLASSIFICATION","B",null,null,null,"1_RESIDENTIAL SERVICE CLASSIFICATION_DEFVAR_ALL",null,null,null,"2019-04-30",null,null,null,null,21,null,null,null,"Rate Rider for Disposition of Deferral/Variance Accounts (2019) - effective until April 30, 2019"]
[null,"Low Voltage Service Rate",null,"$/kWh",4.0000000000000002E-4,null,null,"1_RESIDENTIAL SERVICE CLASSIFICATION","B",null,null,null,"1_RESIDENTIAL SERVICE CLASSIFICATION_LV",null,null,null,null,null,null,null,null,6,null,null,null,"Low Voltage Service Rate"]
[null,"Rate Rider for Disposition of Global Adjustment Account (2018) - effective until April 30, 2019\n      Applicable only for Non-RPP Customers",null,"$/kWh",3.3E-3,null,null,"1_RESIDENTIAL SERVICE CLASSIFICATION","B",null,null,null,"1_RESIDENTIAL SERVICE CLASSIFICATION_GA_kwh",null,null,null,"2019-04-30",null,null,null,null,null,null,null,null,"Rate Rider for Disposition of Global Adjustment Account (2019) - effective until April 30, 2019\n      Applicable only for Non-RPP Customers"]
[null,"Rate Rider for Disposition of Deferral/Variance Accounts (2018) - effective until April 30, 2019",null,"$/kWh",-6.268366589161683E-3,null,null,"1_RESIDENTIAL SERVICE CLASSIFICATION","B",null,null,null,"1_RESIDENTIAL SERVICE CLASSIFICATION_DEFVAR_ALL",null,null,null,"2019-04-30",null,null,null,null,null,null,null,null,"Rate Rider for Disposition of Deferral/Variance Accounts (2019) - effective until April 30, 2019"]
[null,"Rate Rider for Disposition of Global Adjustment Account (2019) - effective until Dec 31, 2019\n      Applicable only for Non-RPP Customers",null,"$/kWh",3.8449181889326281E-4,null,null,"1_RESIDENTIAL SERVICE CLASSIFICATION","B",null,null,null,"1_RESIDENTIAL SERVICE CLASSIFICATION_GA_kwh",null,null,null,"2019-04-30",null,null,null,null,6,null,null,null,"Rate Rider for Disposition of Global Adjustment Account (2019) - effective until April 30, 2019\n      Applicable only for Non-RPP Customers"]
[null,"Rate Rider for Disposition of Deferral/Variance Group 1 Accounts (2019) - effective until Dec 31, 2019",null,"$/kWh",-1.7004562090666019E-3,null,null,"1_RESIDENTIAL SERVICE CLASSIFICATION","B",null,null,null,"1_RESIDENTIAL SERVICE CLASSIFICATION_DEFVAR_ALL",null,null,null,"2019-04-30",null,null,null,null,21,null,null,null,"Rate Rider for Disposition of Deferral/Variance Accounts (2019) - effective until April 30, 2019"]
[null,"Rate Rider for Disposition of Capacity Based Recovery Account (2018) - effective until Dec 31, 2019 Applicable only for Class B Customers",null,"$/kWh",4.0000000000000002E-4,null,null,"1_RESIDENTIAL SERVICE CLASSIFICATION","B",null,null,null,"1_RESIDENTIAL SERVICE CLASSIFICATION_VR_RR_3",null,null,null,"2019-04-30",null,null,null,null,6,null,null,null,"Rate Rider for Disposition of Capacity Based Recovery Account (2019) - effective until April 30, 2019 Applicable only for Class B Customers"]
[null,"Rate Rider for Disposition of Capacity Based Recovery Account (2019) - effective until Dec 31, 2019 Applicable only for Class B Customers",null,"$/kWh",4.9568533837617714E-6,null,null,"1_RESIDENTIAL SERVICE CLASSIFICATION","B"]
[null,"Rate Rider for Disposition of Account 1568 (2019) - effective until Dec 31, 2019",null,"$/kWh",6.1978880186534072E-5,null,null,null,"B"]
[null,"Retail Transmission Rate - Network Service Rate",null,"$/kWh",5.5481168316355673E-3,null,null,"1_RESIDENTIAL SERVICE CLASSIFICATION","C",null,null,null,"1_RESIDENTIAL SERVICE CLASSIFICATION_Retail Transmission Rate - Network Service Rate",null,null,null,null,null,null,null,null,6,null,null,null,"Retail Transmission Rate - Network Service Rate"]
[null,"Retail Transmission Rate - Line and Transformation Connection Service Rate",null,"$/kWh",4.137812914852752E-3,null,null,"1_RESIDENTIAL SERVICE CLASSIFICATION","C",null,null,null,"1_RESIDENTIAL SERVICE CLASSIFICATION_Retail Transmission Rate - Line and Transformation Connection Service Rate",null,null,null,null,null,null,null,null,6,null,null,null,"Retail Transmission Rate - Line and Transformation Connection Service Rate"]
[null,"MONTHLY RATES AND CHARGES - Regulatory Component",null,null,null,null,null,"1_MRC_REG",null,null,null,null,null,null,null,null,null,null,null,null,null,48,null,null,null,"MONTHLY RATES AND CHARGES - Regulatory Component"]
[null,"Wholesale Market Service Rate (WMS) - not including CBR",null,"$/kWh",3.2000000000000002E-3,null,null,"1_RESIDENTIAL SERVICE CLASSIFICATION",null,null,null,null,"1_RESIDENTIAL SERVICE CLASSIFICATION_WMSR",null,null,null,null,null,null,null,null,6,null,null,null,"Wholesale Market Service Rate (WMS) - not including CBR"]
[null,"Capacity Based Recovery (CBR) - Applicable for Class B Customers ",null,"$/kWh",4.0000000000000002E-4,null,null,"1_RESIDENTIAL SERVICE CLASSIFICATION",null,null,null,null,null,null,null,null,null,null,null,null,null,6,null,null,null,"Capacity Based Recovery (CBR) - Applicable for Class B Customers "]
[null,"Rural or Remote Electricity Rate Protection Charge (RRRP)",null,"$/kWh",2.9999999999999997E-4,null,null,"3_GENERAL SERVICE 50 TO 999 KW SERVICE CLASSIFICATION","T",null,null,null,null,null,null,null,null,null,null,null,null,6,null,null,null,"Rural or Remote Electricity Rate Protection Charge (RRRP)"]
[null,"Standard Supply Service - Administrative Charge (if applicable)",null,"$",0.25,null,null,"1_RESIDENTIAL SERVICE CLASSIFICATION","T",null,null,null,"1_RESIDENTIAL SERVICE CLASSIFICATION_SSS",null,null,null,null,null,null,null,null,4,null,null,null,"Standard Supply Service - Administrative Charge (if applicable)",null,null,null,null,null,null,null,null,null,null,null,null,null,null,null,null,null,null,"X"]
[null,"GENERAL SERVICE LESS THAN 50 KW SERVICE CLASSIFICATION",null,null,null,null,null,"2_GENERAL SERVICE LESS THAN 50 KW SERVICE CLASSIFICATION",null,null,null,null,null,null,null,null,null,null,null,null,null,54,null,null,null,null,"GENERAL SERVICE LESS THAN 50 KW SERVICE CLASSIFICATION"]
[null,"General Service refers to the supply of electrical energy to business customers, to bulk-metered residential buildings and to combined residential and business or residential and agricultural buildings.  Apartment buildings that are bulk metered will be billed at the appropriate General Service rate.  This classification refers to a non-residential account taking electricity at 750 volts or less whose average monthly peak demand is less than, or is forecast to be less than, 50 kW. Class B consumers are defined in accordance with O. Reg. 429/04. Further servicing details are available in the distributor's Conditions of Service.",null,null,null,null,null,"2_GENERAL SERVICE LESS THAN 50 KW SERVICE CLASSIFICATION",null,null,null,null,null,null,null,null,null,null,null,null,null,634,null,null,null,null,"General Service refers to the supply of electrical energy to business customers, to bulk-metered residential buildings and to combined residential and business or residential and agricultural buildings.  Apartment buildings that are bulk metered will be billed at the appropriate General Service rate.  This classification refers to a non-residential account taking electricity at 750 volts or less whose average monthly peak demand is less than, or is forecast to be less than, 50 kW. Class B consumers are defined in accordance with O. Reg. 429/04. Further servicing details are available in the distributor's Conditions of Service."]
[null,"APPLICATION",null,null,null,null,null,"2_APPLICATION",null,null,null,null,null,null,null,null,null,null,null,null,null,11,null,null,null,null,"APPLICATION"]
[null,"The application of these rates and charges shall be in accordance with the Licence of the Distributor and any Code or Order of the Ontario Energy Board, and amendments thereto as approved by the Ontario Energy Board, which may be applicable to the administration of this schedule.",null,null,null,null,null,"2_GENERAL SERVICE LESS THAN 50 KW SERVICE CLASSIFICATION",null,null,null,null,null,null,null,null,null,null,null,null,null,280,null,null,null,null,"The application of these rates and charges shall be in accordance with the Licence of the Distributor and any Code or Order of the Ontario Energy Board, and amendments thereto as approved by the Ontario Energy Board, which may be applicable to the administration of this schedule."]
[null,"No rates and charges for the distribution of electricity and charges to meet the costs of any work or service done or furnished for the purpose of the distribution of electricity shall be made except as permitted by this schedule, unless required by the Distributor’s Licence or a Code or Order of the Ontario Energy Board, and amendments thereto as approved by the Ontario Energy Board, or as specified herein.",null,null,null,null,null,"2_GENERAL SERVICE LESS THAN 50 KW SERVICE CLASSIFICATION",null,null,null,null,null,null,null,null,null,null,null,null,null,411,null,null,null,null,"No rates and charges for the distribution of electricity and charges to meet the costs of any work or service done or furnished for the purpose of the distribution of electricity shall be made except as permitted by this schedule, unless required by the Distributor’s Licence or a Code or Order of the Ontario Energy Board, and amendments thereto as approved by the Ontario Energy Board, or as specified herein."]
[null,"Unless specifically noted, this schedule does not contain any charges for the electricity commodity, be it under the Regulated Price Plan, a contract with a retailer or the wholesale market price, as applicable.  In addition, the charges in the MONTHLY RATES AND CHARGES - Regulatory Component of this schedule do not apply to a customer that is an embedded wholesale market participant.",null,null,null,null,null,"2_GENERAL SERVICE LESS THAN 50 KW SERVICE CLASSIFICATION",null,null,null,null,null,null,null,null,null,null,null,null,null,387,null,null,null,null,"Unless specifically noted, this schedule does not contain any charges for the electricity commodity, be it under the Regulated Price Plan, a contract with a retailer or the wholesale market price, as applicable.  In addition, the charges in the MONTHLY RATES AND CHARGES - Regulatory Component of this schedule do not apply to a customer that is an embedded wholesale market participant."]
[null,"The rate rider for the disposition of WMS - Sub-account CBR Class B is not applicable to wholesale market participants (WMP), customers that transitioned between Class A and Class B during the variance account accumulation period, or to customers that were in Class A for the entire period. Customers who transitioned are to be charged or refunded their share of the variance disposed through customer specific billing adjustments. This rate rider is to be consistently applied for the entire period to the sunset date of the rate rider. In addition, this rate rider is applicable to all new Class B customers.",null,null,null,null,null,"2_GENERAL SERVICE LESS THAN 50 KW SERVICE CLASSIFICATION",null,null,null,null,null,null,null,null,null,null,null,null,null,610,null,null,null,null,"The rate rider for the disposition of WMS - Sub-account CBR Class B is not applicable to wholesale market participants (WMP), customers that transitioned between Class A and Class B during the variance account accumulation period, or to customers that were in Class A for the entire period. Customers who transitioned are to be charged or refunded their share of the variance disposed through customer specific billing adjustments. This rate rider is to be consistently applied for the entire period to the sunset date of the rate rider. In addition, this rate rider is applicable to all new Class B customers."]
[null,"It should be noted that this schedule does not list any charges, assessments, or credits that are required by law to be invoiced by a distributor and that are not subject to Ontario Energy Board approval, such as the Debt Retirement Charge, the Global Adjustment and the HST.",null,null,null,null,null,"2_GENERAL SERVICE LESS THAN 50 KW SERVICE CLASSIFICATION",null,null,null,null,null,null,null,null,null,null,null,null,null,275,null,null,null,null,"It should be noted that this schedule does not list any charges, assessments, or credits that are required by law to be invoiced by a distributor and that are not subject to Ontario Energy Board approval, such as the Debt Retirement Charge, the Global Adjustment and the HST."]
[null,"MONTHLY RATES AND CHARGES - Delivery Component",null,null,null,null,null,"2_MRC_DEL",null,null,null,null,null,null,null,null,null,null,null,null,null,46,null,null,null,null,"MONTHLY RATES AND CHARGES - Delivery Component"]
[null,"Service Charge",null,"$",15.18,null,null,"2_GENERAL SERVICE LESS THAN 50 KW SERVICE CLASSIFICATION","A",null,null,null,"2_GENERAL SERVICE LESS THAN 50 KW SERVICE CLASSIFICATION_MSC",null,null,null,null,null,null,null,null,8,null,null,null,"Service Charge"]
[null,"Rate Rider for Smart Metering Entity Charge - effective until December 31, 2022",null,"$",0.56999999999999995,null,null,"2_GENERAL SERVICE LESS THAN 50 KW SERVICE CLASSIFICATION","B",null,null,null,"2_GENERAL SERVICE LESS THAN 50 KW SERVICE CLASSIFICATION_SME",null,null,null,"2022-12-31",null,null,null,null,4,null,null,null,"Rate Rider for Smart Metering Entity Charge - effective until December 31, 2022"]
[null,"Rate Rider for Smart Meter (Stranded Meters) - effective until Dec 31, 2019",null,"$",0.25994789727448581,null,null,null,"B"]
[null,"Distribution Volumetric Rate",null,"$/kWh",1.6199999999999999E-2,null,null,"2_GENERAL SERVICE LESS THAN 50 KW SERVICE CLASSIFICATION","A",null,null,null,"2_GENERAL SERVICE LESS THAN 50 KW SERVICE CLASSIFICATION_DVC",null,null,null,null,null,null,null,null,9,null,null,null,"Distribution Volumetric Rate"]
[null,"Low Voltage Service Rate",null,"$/kWh",4.0000000000000002E-4,null,null,"2_GENERAL SERVICE LESS THAN 50 KW SERVICE CLASSIFICATION","B",null,null,null,"2_GENERAL SERVICE LESS THAN 50 KW SERVICE CLASSIFICATION_LV",null,null,null,null,null,null,null,null,6,null,null,null,"Low Voltage Service Rate"]
[null,"Rate Rider for Disposition of Global Adjustment Account (2018) - effective until April 30, 2019\n      Applicable only for Non-RPP Customers",null,"$/kWh",3.3E-3,null,null,"2_GENERAL SERVICE LESS THAN 50 kW SERVICE CLASSIFICATION","B",null,null,null,"2_GENERAL SERVICE LESS THAN 50 kW SERVICE CLASSIFICATION_GA_kwh",null,null,null,"2019-04-30",null,null,null,null,null,null,null,null,"Rate Rider for Disposition of Global Adjustment Account (2019) - effective until April 30, 2019\n      Applicable only for Non-RPP Customers"]
[null,"Rate Rider for Disposition of Deferral/Variance Accounts (2018) - effective until April 30, 2019",null,"$/kWh",-6.2193914195985949E-3,null,null,"2_GENERAL SERVICE LESS THAN 50 kW SERVICE CLASSIFICATION","B",null,null,null,"2_GENERAL SERVICE LESS THAN 50 kW SERVICE CLASSIFICATION_DEFVAR_ALL",null,null,null,"2019-04-30",null,null,null,null,null,null,null,null,"Rate Rider for Disposition of Deferral/Variance Accounts (2019) - effective until April 30, 2019"]
[null,"Rate Rider for Disposition of Global Adjustment Account (2019) - effective until Dec 31, 2019\n      Applicable only for Non-RPP Customers",null,"$/kWh",3.8449181889326276E-4,null,null,"2_GENERAL SERVICE LESS THAN 50 KW SERVICE CLASSIFICATION","B",null,null,null,"2_GENERAL SERVICE LESS THAN 50 KW SERVICE CLASSIFICATION_GA_kwh",null,null,null,"2019-04-30",null,null,null,null,6,null,null,null,"Rate Rider for Disposition of Global Adjustment Account (2019) - effective until April 30, 2019\n      Applicable only for Non-RPP Customers"]
[null,"Rate Rider for Disposition of Deferral/Variance Accounts (2019) - effective until Dec 31, 2019",null,"$/kWh",-1.1688771623365082E-3,null,null,"2_GENERAL SERVICE LESS THAN 50 KW SERVICE CLASSIFICATION","B",null,null,null,"2_GENERAL SERVICE LESS THAN 50 KW SERVICE CLASSIFICATION_DEFVAR_ALL",null,null,null,"2019-04-30",null,null,null,null,21,null,null,null,"Rate Rider for Disposition of Deferral/Variance Accounts (2019) - effective until April 30, 2019"]
[null,"Rate Rider for Disposition of Capacity Based Recovery Account (2018) - effective until April 30, 2019 Applicable only for Class B Customers",null,"$/kWh",4.0000000000000002E-4,null,null,"2_GENERAL SERVICE LESS THAN 50 KW SERVICE CLASSIFICATION","B",null,null,null,"2_GENERAL SERVICE LESS THAN 50 KW SERVICE CLASSIFICATION_VR_RR_6",null,null,null,"2019-04-30",null,null,null,null,6,null,null,null,"Rate Rider for Disposition of Capacity Based Recovery Account (2019) - effective until April 30, 2019 Applicable only for Class B Customers"]
[null,"Rate Rider for Disposition of Capacity Based Recovery Account (2019) - effective until Dec 31, 2019 Applicable only for Class B Customers",null,"$/kWh",4.9568533837617705E-6,null,null,"2_GENERAL SERVICE LESS THAN 50 KW SERVICE CLASSIFICATION","B"]
[null,"Rate Rider for Disposition of Account 1568 (2019) - effective until Dec 31, 2019",null,"$/kWh",2.0735183467511436E-4,null,null,null,"B"]
[null,"Rate Rider for Disposition of Account 1575 and 1576 - effective until Dec 31, 2019",null,"$/kWh",-3.2126915242846417E-4,null,null,null,"B"]
[null,"Rate Rider - Gain on Sale of Property",null,"$/kWh",-2.4661231261194989E-4,null,null,null,"B"]
[null,"Retail Transmission Rate - Network Service Rate",null,"$/kWh",4.9369576887273803E-3,null,null,"1_RESIDENTIAL SERVICE CLASSIFICATION","C",null,null,null,"1_RESIDENTIAL SERVICE CLASSIFICATION_Retail Transmission Rate - Network Service Rate",null,null,null,null,null,null,null,null,6,null,null,null,"Retail Transmission Rate - Network Service Rate"]
[null,"Retail Transmission Rate - Line and Transformation Connection Service Rate",null,"$/kWh",3.7651244729822726E-3,null,null,"2_GENERAL SERVICE LESS THAN 50 KW SERVICE CLASSIFICATION","C",null,null,null,"2_GENERAL SERVICE LESS THAN 50 KW SERVICE CLASSIFICATION_Retail Transmission Rate - Line and Transformation Connection Service Rate",null,null,null,null,null,null,null,null,6,null,null,null,"Retail Transmission Rate - Line and Transformation Connection Service Rate"]
[null,"MONTHLY RATES AND CHARGES - Regulatory Component",null,null,null,null,null,"2_MRC_REG",null,null,null,null,null,null,null,null,null,null,null,null,null,48,null,null,null,"MONTHLY RATES AND CHARGES - Regulatory Component"]
[null,"Wholesale Market Service Rate (WMS) - not including CBR",null,"$/kWh",3.2000000000000002E-3,null,null,"2_GENERAL SERVICE LESS THAN 50 KW SERVICE CLASSIFICATION",null,null,null,null,"2_GENERAL SERVICE LESS THAN 50 KW SERVICE CLASSIFICATION_WMSR",null,null,null,null,null,null,null,null,6,null,null,null,"Wholesale Market Service Rate (WMS) - not including CBR"]
[null,"Capacity Based Recovery (CBR) - Applicable for Class B Customers ",null,"$/kWh",4.0000000000000002E-4,null,null,"2_GENERAL SERVICE LESS THAN 50 KW SERVICE CLASSIFICATION",null,null,null,null,null,null,null,null,null,null,null,null,null,6,null,null,null,"Capacity Based Recovery (CBR) - Applicable for Class B Customers "]
[null,"Rural or Remote Electricity Rate Protection Charge (RRRP)",null,"$/kWh",2.9999999999999997E-4,null,null,"3_GENERAL SERVICE 50 TO 999 KW SERVICE CLASSIFICATION","T",null,null,null,null,null,null,null,null,null,null,null,null,6,null,null,null,"Rural or Remote Electricity Rate Protection Charge (RRRP)"]
[null,"Standard Supply Service - Administrative Charge (if applicable)",null,"$",0.25,null,null,"2_GENERAL SERVICE LESS THAN 50 KW SERVICE CLASSIFICATION","T",null,null,null,"2_GENERAL SERVICE LESS THAN 50 KW SERVICE CLASSIFICATION_SSS",null,null,null,null,null,null,null,null,4,null,null,null,"Standard Supply Service - Administrative Charge (if applicable)",null,null,null,null,null,null,null,null,null,null,null,null,null,null,null,null,null,null,"X"]
[null,"GENERAL SERVICE 50 TO 999 KW SERVICE CLASSIFICATION",null,null,null,null,null,"3_GENERAL SERVICE 50 TO 999 KW SERVICE CLASSIFICATION",null,null,null,null,null,null,null,null,null,null,null,null,null,51,null,null,null,null,"GENERAL SERVICE 50 TO 999 KW SERVICE CLASSIFICATION"]
[null,"General Service refers to the supply of electrical energy to business customers, to bulk-metered residential buildings and to combined residential and business or residential and agricultural buildings.  Apartment buildings that are bulk metered will be billed at the appropriate General Service rate.  This classification refers to a non-residential account whose average monthly peak demand is equal to or greater than, or is forecast to be equal to or greater than, 50 kW but less than 1,000 kW.  Class B consumers are defined in accordance with O.Reg. 429/04. Further servicing details are available in the distributor's Conditions of Service.",null,null,null,null,null,"3_GENERAL SERVICE 50 TO 999 KW SERVICE CLASSIFICATION",null,null,null,null,null,null,null,null,null,null,null,null,null,647,null,null,null,null,"General Service refers to the supply of electrical energy to business customers, to bulk-metered residential buildings and to combined residential and business or residential and agricultural buildings.  Apartment buildings that are bulk metered will be billed at the appropriate General Service rate.  This classification refers to a non-residential account whose average monthly peak demand is equal to or greater than, or is forecast to be equal to or greater than, 50 kW but less than 1,000 kW.  Class B consumers are defined in accordance with O.Reg. 429/04. Further servicing details are available in the distributor's Conditions of Service."]
[null,"APPLICATION",null,null,null,null,null,"3_APPLICATION",null,null,null,null,null,null,null,null,null,null,null,null,null,11,null,null,null,null,"APPLICATION"]
[null,"The application of these rates and charges shall be in accordance with the Licence of the Distributor and any Code or Order of the Ontario Energy Board, and amendments thereto as approved by the Ontario Energy Board, which may be applicable to the administration of this schedule.",null,null,null,null,null,"3_GENERAL SERVICE 50 TO 999 KW SERVICE CLASSIFICATION",null,null,null,null,null,null,null,null,null,null,null,null,null,280,null,null,null,null,"The application of these rates and charges shall be in accordance with the Licence of the Distributor and any Code or Order of the Ontario Energy Board, and amendments thereto as approved by the Ontario Energy Board, which may be applicable to the administration of this schedule."]
[null,"No rates and charges for the distribution of electricity and charges to meet the costs of any work or service done or furnished for the purpose of the distribution of electricity shall be made except as permitted by this schedule, unless required by the Distributor’s Licence or a Code or Order of the Ontario Energy Board, and amendments thereto as approved by the Ontario Energy Board, or as specified herein.",null,null,null,null,null,"3_GENERAL SERVICE 50 TO 999 KW SERVICE CLASSIFICATION",null,null,null,null,null,null,null,null,null,null,null,null,null,411,null,null,null,null,"No rates and charges for the distribution of electricity and charges to meet the costs of any work or service done or furnished for the purpose of the distribution of electricity shall be made except as permitted by this schedule, unless required by the Distributor’s Licence or a Code or Order of the Ontario Energy Board, and amendments thereto as approved by the Ontario Energy Board, or as specified herein."]
[null,"Unless specifically noted, this schedule does not contain any charges for the electricity commodity, be it under the Regulated Price Plan, a contract with a retailer or the wholesale market price, as applicable.  In addition, the charges in the MONTHLY RATES AND CHARGES - Regulatory Component of this schedule do not apply to a customer that is an embedded wholesale market participant.",null,null,null,null,null,"3_GENERAL SERVICE 50 TO 999 KW SERVICE CLASSIFICATION",null,null,null,null,null,null,null,null,null,null,null,null,null,387,null,null,null,null,"Unless specifically noted, this schedule does not contain any charges for the electricity commodity, be it under the Regulated Price Plan, a contract with a retailer or the wholesale market price, as applicable.  In addition, the charges in the MONTHLY RATES AND CHARGES - Regulatory Component of this schedule do not apply to a customer that is an embedded wholesale market participant."]
[null,"The rate rider for the disposition of WMS - Sub-account CBR Class B is not applicable to wholesale market participants (WMP), customers that transitioned between Class A and Class B during the variance account accumulation period, or to customers that were in Class A for the entire period. Customers who transitioned are to be charged or refunded their share of the variance disposed through customer specific billing adjustments. This rate rider is to be consistently applied for the entire period to the sunset date of the rate rider. In addition, this rate rider is applicable to all new Class B customers.",null,null,null,null,null,"3_GENERAL SERVICE 50 TO 999 KW SERVICE CLASSIFICATION",null,null,null,null,null,null,null,null,null,null,null,null,null,610,null,null,null,null,"The rate rider for the disposition of WMS - Sub-account CBR Class B is not applicable to wholesale market participants (WMP), customers that transitioned between Class A and Class B during the variance account accumulation period, or to customers that were in Class A for the entire period. Customers who transitioned are to be charged or refunded their share of the variance disposed through customer specific billing adjustments. This rate rider is to be consistently applied for the entire period to the sunset date of the rate rider. In addition, this rate rider is applicable to all new Class B customers."]
[null,"It should be noted that this schedule does not list any charges, assessments, or credits that are required by law to be invoiced by a distributor and that are not subject to Ontario Energy Board approval, such as the Debt Retirement Charge, the Global Adjustment and the HST.",null,null,null,null,null,"3_GENERAL SERVICE 50 TO 999 KW SERVICE CLASSIFICATION",null,null,null,null,null,null,null,null,null,null,null,null,null,275,null,null,null,null,"It should be noted that this schedule does not list any charges, assessments, or credits that are required by law to be invoiced by a distributor and that are not subject to Ontario Energy Board approval, such as the Debt Retirement Charge, the Global Adjustment and the HST."]
[null,"MONTHLY RATES AND CHARGES - Delivery Component",null,null,null,null,null,"3_MRC_DEL",null,null,null,null,null,null,null,null,null,null,null,null,null,46,null,null,null,null,"MONTHLY RATES AND CHARGES - Delivery Component"]
[null,"Service Charge",null,"$",111.18,null,null,"3_GENERAL SERVICE 50 TO 999 KW SERVICE CLASSIFICATION","A",null,null,null,"3_GENERAL SERVICE 50 TO 999 KW SERVICE CLASSIFICATION_MSC",null,null,null,null,null,null,null,null,9,null,null,null,"Service Charge"]
[null,"Rate Rider for Smart Meter (Stranded Meters) - effective until Dec 31, 2019",null,"$",18.578982363534003,null,null,null,"B"]
[null,"Distribution Volumetric Rate",null,"$/kW",4.1018999999999997,null,null,"3_GENERAL SERVICE 50 TO 999 KW SERVICE CLASSIFICATION","A",null,null,null,"3_GENERAL SERVICE 50 TO 999 KW SERVICE CLASSIFICATION_DVC",null,null,null,null,null,null,null,null,9,null,null,null,"Distribution Volumetric Rate"]
[null,"Low Voltage Service Rate",null,"$/kW",0.23050000000000001,null,null,"3_GENERAL SERVICE 50 TO 999 KW SERVICE CLASSIFICATION","B",null,null,null,"3_GENERAL SERVICE 50 TO 999 KW SERVICE CLASSIFICATION_LV",null,null,null,null,null,null,null,null,6,null,null,null,"Low Voltage Service Rate"]
[null,"Rate Rider for Disposition of Global Adjustment Account (2018) - effective until April 30, 2019\n      Applicable only for Non-RPP Customers",null,"$/kWh",3.3E-3,null,null,"3_GENERAL SERVICE 50 to 999 kW SERVICE CLASSIFICATION","B",null,null,null,"3_GENERAL SERVICE 50 to 999 kW SERVICE CLASSIFICATION_GA_kwh",null,null,null,"2019-04-30",null,null,null,null,null,null,null,null,"Rate Rider for Disposition of Global Adjustment Account (2019) - effective until April 30, 2019\n      Applicable only for Non-RPP Customers"]
[null,"Rate Rider for Disposition of Deferral/Variance Accounts (2018) - effective until April 30, 2019\n      Applicable only for Non-Wholesale Market Participants",null,"$/kW",-1.7176948178630711,null,null,"3_GENERAL SERVICE 50 to 999 kW SERVICE CLASSIFICATION","B",null,null,null,"3_GENERAL SERVICE 50 to 999 kW SERVICE CLASSIFICATION_DEFVAR_ALL",null,null,null,"2019-04-30",null,null,null,null,null,null,null,null,"Rate Rider for Disposition of Deferral/Variance Accounts (2019) - effective until April 30, 2019\n      Applicable only for Non-Wholesale Market Participants"]
[null,"Rate Rider for Disposition of Deferral/Variance Accounts (2018) - effective until April 30, 2019",null,"$/kW",-0.29754431886348609,null,null,"3_GENERAL SERVICE 50 to 999 kW SERVICE CLASSIFICATION","B",null,null,null,"3_GENERAL SERVICE 50 to 999 kW SERVICE CLASSIFICATION_DEFVAR_ALL",null,null,null,"2019-04-30",null,null,null,null,null,null,null,null,"Rate Rider for Disposition of Deferral/Variance Accounts (2019) - effective until April 30, 2019"]
[null,"Rate Rider for Disposition of Global Adjustment Account (2019) - effective until Dec 31, 2019\n      Applicable only for Non-RPP Customers",null,"$/kWh",3.8449181889326276E-4,null,null,"3_GENERAL SERVICE 50 TO 999 KW SERVICE CLASSIFICATION","B",null,null,null,"3_GENERAL SERVICE 50 TO 999 KW SERVICE CLASSIFICATION_GA_kwh",null,null,null,"2019-04-30",null,null,null,null,6,null,null,null,"Rate Rider for Disposition of Global Adjustment Account (2019) - effective until April 30, 2019\n      Applicable only for Non-RPP Customers"]
[null,"Rate Rider for Disposition of Deferral/Variance Accounts (2019) - effective until Dec 31, 2019\n      Applicable only for Non-Wholesale Market Participants",null,"$/kW",-8.6780676279522614E-2,null,null,"3_GENERAL SERVICE 50 TO 999 KW SERVICE CLASSIFICATION","B",null,null,null,"3_GENERAL SERVICE 50 TO 999 KW SERVICE CLASSIFICATION_DEFVAR_ALL",null,null,null,"2019-04-30",null,null,null,null,17,null,null,null,"Rate Rider for Disposition of Deferral/Variance Accounts (2019) - effective until April 30, 2019\n      Applicable only for Non-Wholesale Market Participants"]
[null,"Rate Rider for Disposition of Deferral/Variance Accounts (2019) - effective until Dec 31, 2019",null,"$/kW",-0.35040118122990804,null,null,"3_GENERAL SERVICE 50 TO 999 KW SERVICE CLASSIFICATION","B",null,null,null,"3_GENERAL SERVICE 50 TO 999 KW SERVICE CLASSIFICATION_DEFVAR_ALL",null,null,null,"2019-04-30",null,null,null,null,18,null,null,null,"Rate Rider for Disposition of Deferral/Variance Accounts (2019) - effective until April 30, 2019"]
[null,"Rate Rider for Disposition of Capacity Based Recovery Account (2018) - effective until April 30, 2019 Applicable only for Class B Customers",null,"$/kW",0.13750000000000001,null,null,"3_GENERAL SERVICE 50 TO 999 KW SERVICE CLASSIFICATION","B",null,null,null,"3_GENERAL SERVICE 50 TO 999 KW SERVICE CLASSIFICATION_VR_RR_10",null,null,null,"2019-04-30",null,null,null,null,6,null,null,null,"Rate Rider for Disposition of Capacity Based Recovery Account (2019) - effective until April 30, 2019 Applicable only for Class B Customers"]
[null,"Rate Rider for Disposition of Capacity Based Recovery Account (2019) - effective until Dec 31, 2019 Applicable only for Class B Customers",null,"$/kW",1.5625881795421066E-3,null,null,"2_GENERAL SERVICE LESS THAN 50 KW SERVICE CLASSIFICATION","B"]
[null,"Rate Rider for Disposition of Account 1568 (2019) - effective until Dec 31, 2019",null,"$/kW",0.4554727233494929,null,null,null,"B"]
[null,"Rate Rider for Disposition of Account 1575 and 1576 - effective until Dec 31, 2019",null,"$/kW",-0.10277596422689866,null,null,null,"B"]
[null,"Rate Rider - Gain on Sale of Property",null,"$/kW",-7.8892779815913319E-2,null,null,null,"B"]
[null,"Retail Transmission Rate - Network Service Rate",null,"$/kW",3.039109007035127,null,null,"3_GENERAL SERVICE 50 TO 999 KW SERVICE CLASSIFICATION","C",null,null,null,"3_GENERAL SERVICE 50 TO 999 KW SERVICE CLASSIFICATION_Retail Transmission Rate - Network Service Rate",null,null,null,null,null,null,null,null,6,null,null,null,"Retail Transmission Rate - Network Service Rate"]
[null,"Retail Transmission Rate - Line and Transformation Connection Service Rate",null,"$/kW",2.2794726540731611,null,null,"3_GENERAL SERVICE 50 TO 999 KW SERVICE CLASSIFICATION","C",null,null,null,"3_GENERAL SERVICE 50 TO 999 KW SERVICE CLASSIFICATION_Retail Transmission Rate - Line and Transformation Connection Service Rate",null,null,null,null,null,null,null,null,6,null,null,null,"Retail Transmission Rate - Line and Transformation Connection Service Rate"]
[null,"MONTHLY RATES AND CHARGES - Regulatory Component",null,null,null,null,null,"3_MRC_REG",null,null,null,null,null,null,null,null,null,null,null,null,null,48,null,null,null,"MONTHLY RATES AND CHARGES - Regulatory Component"]
[null,"Wholesale Market Service Rate (WMS) - not including CBR",null,"$/kWh",3.2000000000000002E-3,null,null,"3_GENERAL SERVICE 50 TO 999 KW SERVICE CLASSIFICATION",null,null,null,null,"3_GENERAL SERVICE 50 TO 999 KW SERVICE CLASSIFICATION_WMSR",null,null,null,null,null,null,null,null,6,null,null,null,"Wholesale Market Service Rate (WMS) - not including CBR"]
[null,"Capacity Based Recovery (CBR) - Applicable for Class B Customers ",null,"$/kWh",4.0000000000000002E-4,null,null,"3_GENERAL SERVICE 50 TO 999 KW SERVICE CLASSIFICATION",null,null,null,null,null,null,null,null,null,null,null,null,null,6,null,null,null,"Capacity Based Recovery (CBR) - Applicable for Class B Customers "]
[null,"Rural or Remote Electricity Rate Protection Charge (RRRP)",null,"$/kWh",2.9999999999999997E-4,null,null,"3_GENERAL SERVICE 50 TO 999 KW SERVICE CLASSIFICATION","T",null,null,null,null,null,null,null,null,null,null,null,null,6,null,null,null,"Rural or Remote Electricity Rate Protection Charge (RRRP)"]
[null,"Standard Supply Service - Administrative Charge (if applicable)",null,"$",0.25,null,null,"3_GENERAL SERVICE 50 TO 999 KW SERVICE CLASSIFICATION","T",null,null,null,"3_GENERAL SERVICE 50 TO 999 KW SERVICE CLASSIFICATION_SSS",null,null,null,null,null,null,null,null,4,null,null,null,"Standard Supply Service - Administrative Charge (if applicable)",null,null,null,null,null,null,null,null,null,null,null,null,null,null,null,null,null,null,"X"]
[null,"GENERAL SERVICE 1,000 TO 4,999 KW SERVICE CLASSIFICATION",null,null,null,null,null,"4_GENERAL SERVICE 1,000 TO 4,999 KW SERVICE CLASSIFICATION",null,null,null,null,null,null,null,null,null,null,null,null,null,56,null,null,null,null,"GENERAL SERVICE 1,000 TO 4,999 KW SERVICE CLASSIFICATION"]
[null,"General Service refers to the supply of electrical energy to business customers, to bulk-metered residential buildings and to combined residential and business or residential and agricultural buildings.  Apartment buildings that are bulk metered will be billed at the appropriate General Service rate.  This classification refers to a non-residential account whose average monthly peak demand is equal to or greater than, or is forecast to be equal to or greater than, 1,000 kW but less than 5,000 kW.  Class A and Class B consumers are defined in accordance with O. Reg. 429/04. Further servicing details are available in the distributor's Conditions of Service.",null,null,null,null,null,"4_GENERAL SERVICE 1,000 TO 4,999 KW SERVICE CLASSIFICATION",null,null,null,null,null,null,null,null,null,null,null,null,null,663,null,null,null,null,"General Service refers to the supply of electrical energy to business customers, to bulk-metered residential buildings and to combined residential and business or residential and agricultural buildings.  Apartment buildings that are bulk metered will be billed at the appropriate General Service rate.  This classification refers to a non-residential account whose average monthly peak demand is equal to or greater than, or is forecast to be equal to or greater than, 1,000 kW but less than 5,000 kW.  Class A and Class B consumers are defined in accordance with O. Reg. 429/04. Further servicing details are available in the distributor's Conditions of Service."]
[null,"APPLICATION",null,null,null,null,null,"4_APPLICATION",null,null,null,null,null,null,null,null,null,null,null,null,null,11,null,null,null,null,"APPLICATION"]
[null,"The application of these rates and charges shall be in accordance with the Licence of the Distributor and any Code or Order of the Ontario Energy Board, and amendments thereto as approved by the Ontario Energy Board, which may be applicable to the administration of this schedule.",null,null,null,null,null,"4_GENERAL SERVICE 1,000 TO 4,999 KW SERVICE CLASSIFICATION",null,null,null,null,null,null,null,null,null,null,null,null,null,280,null,null,null,null,"The application of these rates and charges shall be in accordance with the Licence of the Distributor and any Code or Order of the Ontario Energy Board, and amendments thereto as approved by the Ontario Energy Board, which may be applicable to the administration of this schedule."]
[null,"No rates and charges for the distribution of electricity and charges to meet the costs of any work or service done or furnished for the purpose of the distribution of electricity shall be made except as permitted by this schedule, unless required by the Distributor’s Licence or a Code or Order of the Ontario Energy Board, and amendments thereto as approved by the Ontario Energy Board, or as specified herein.",null,null,null,null,null,"4_GENERAL SERVICE 1,000 TO 4,999 KW SERVICE CLASSIFICATION",null,null,null,null,null,null,null,null,null,null,null,null,null,411,null,null,null,null,"No rates and charges for the distribution of electricity and charges to meet the costs of any work or service done or furnished for the purpose of the distribution of electricity shall be made except as permitted by this schedule, unless required by the Distributor’s Licence or a Code or Order of the Ontario Energy Board, and amendments thereto as approved by the Ontario Energy Board, or as specified herein."]
[null,"Unless specifically noted, this schedule does not contain any charges for the electricity commodity, be it under the Regulated Price Plan, a contract with a retailer or the wholesale market price, as applicable.  In addition, the charges in the MONTHLY RATES AND CHARGES - Regulatory Component of this schedule do not apply to a customer that is an embedded wholesale market participant.",null,null,null,null,null,"4_GENERAL SERVICE 1,000 TO 4,999 KW SERVICE CLASSIFICATION",null,null,null,null,null,null,null,null,null,null,null,null,null,387,null,null,null,null,"Unless specifically noted, this schedule does not contain any charges for the electricity commodity, be it under the Regulated Price Plan, a contract with a retailer or the wholesale market price, as applicable.  In addition, the charges in the MONTHLY RATES AND CHARGES - Regulatory Component of this schedule do not apply to a customer that is an embedded wholesale market participant."]
[null,"The rate rider for the disposition of Global Adjustment is only applicable to non-RPP Class B customers. It is not applicable to Wholesale Market Participant (WMP), customers that transitioned between Class A and Class B during the variance account accumulation period, or to customers that were in Class A for the entire period. Customers who transitioned are to be charged or refunded their share of the variance disposed through customer specific billing adjustments. This rate rider is to be consistently applied for the entire period to the sunset date of the rate rider. In addition, this rate rider is applicable to all new non-RPP Class B customers.",null,null,null,null,null,"4_GENERAL SERVICE 1,000 TO 4,999 KW SERVICE CLASSIFICATION",null,null,null,null,null,null,null,null,null,null,null,null,null,657,null,null,null,null,"The rate rider for the disposition of Global Adjustment is only applicable to non-RPP Class B customers. It is not applicable to Wholesale Market Participant (WMP), customers that transitioned between Class A and Class B during the variance account accumulation period, or to customers that were in Class A for the entire period. Customers who transitioned are to be charged or refunded their share of the variance disposed through customer specific billing adjustments. This rate rider is to be consistently applied for the entire period to the sunset date of the rate rider. In addition, this rate rider is applicable to all new non-RPP Class B customers."]
[null,"The rate rider for the disposition of WMS - Sub-account CBR Class B is not applicable to wholesale market participants (WMP), customers that transitioned between Class A and Class B during the variance account accumulation period, or to customers that were in Class A for the entire period. Customers who transitioned are to be charged or refunded their share of the variance disposed through customer specific billing adjustments. This rate rider is to be consistently applied for the entire period to the sunset date of the rate rider. In addition, this rate rider is applicable to all new Class B customers.",null,null,null,null,null,"4_GENERAL SERVICE 1,000 TO 4,999 KW SERVICE CLASSIFICATION",null,null,null,null,null,null,null,null,null,null,null,null,null,610,null,null,null,null,"The rate rider for the disposition of WMS - Sub-account CBR Class B is not applicable to wholesale market participants (WMP), customers that transitioned between Class A and Class B during the variance account accumulation period, or to customers that were in Class A for the entire period. Customers who transitioned are to be charged or refunded their share of the variance disposed through customer specific billing adjustments. This rate rider is to be consistently applied for the entire period to the sunset date of the rate rider. In addition, this rate rider is applicable to all new Class B customers."]
[null,"It should be noted that this schedule does not list any charges, assessments, or credits that are required by law to be invoiced by a distributor and that are not subject to Ontario Energy Board approval, such as the Debt Retirement Charge, the Global Adjustment and the HST.",null,null,null,null,null,"4_GENERAL SERVICE 1,000 TO 4,999 KW SERVICE CLASSIFICATION",null,null,null,null,null,null,null,null,null,null,null,null,null,275,null,null,null,null,"It should be noted that this schedule does not list any charges, assessments, or credits that are required by law to be invoiced by a distributor and that are not subject to Ontario Energy Board approval, such as the Debt Retirement Charge, the Global Adjustment and the HST."]
[null,"MONTHLY RATES AND CHARGES - Delivery Component",null,null,null,null,null,"4_MRC_DEL",null,null,null,null,null,null,null,null,null,null,null,null,null,46,null,null,null,null,"MONTHLY RATES AND CHARGES - Delivery Component"]
[null,"Service Charge",null,"$",904.08,null,null,"4_GENERAL SERVICE 1,000 TO 4,999 KW SERVICE CLASSIFICATION","A",null,null,null,"4_GENERAL SERVICE 1,000 TO 4,999 KW SERVICE CLASSIFICATION_MSC",null,null,null,null,null,null,null,null,10,null,null,null,"Service Charge"]
[null,"Distribution Volumetric Rate",null,"$/kW",3.8454000000000002,null,null,"4_GENERAL SERVICE 1,000 TO 4,999 KW SERVICE CLASSIFICATION","A",null,null,null,"4_GENERAL SERVICE 1,000 TO 4,999 KW SERVICE CLASSIFICATION_DVC",null,null,null,null,null,null,null,null,9,null,null,null,"Distribution Volumetric Rate"]
[null,"Low Voltage Service Rate",null,"$/kW",0.18090000000000001,null,null,"4_GENERAL SERVICE 1,000 TO 4,999 KW SERVICE CLASSIFICATION","B",null,null,null,"4_GENERAL SERVICE 1,000 TO 4,999 KW SERVICE CLASSIFICATION_LV",null,null,null,null,null,null,null,null,6,null,null,null,"Low Voltage Service Rate"]
[null,"Rate Rider for Disposition of Global Adjustment Account (2018) - effective until April 30, 2019\n      Applicable only for Non-RPP Customers",null,"$/kWh",3.3E-3,null,null,"4_GENERAL SERVICE 1,000 to 4,999 kW SERVICE CLASSIFICATION","B",null,null,null,"4_GENERAL SERVICE 1,000 to 4,999 kW SERVICE CLASSIFICATION_GA_kwh",null,null,null,"2019-04-30",null,null,null,null,null,null,null,null,"Rate Rider for Disposition of Global Adjustment Account (2019) - effective until April 30, 2019\n      Applicable only for Non-RPP Customers"]
[null,"Rate Rider for Disposition of Deferral/Variance Accounts (2018) - effective until April 30, 2019\n      Applicable only for Non-Wholesale Market Participants",null,"$/kW",-2.2353997609561107,null,null,"4_GENERAL SERVICE 1,000 to 4,999 kW SERVICE CLASSIFICATION","B",null,null,null,"4_GENERAL SERVICE 1,000 to 4,999 kW SERVICE CLASSIFICATION_DEFVAR_ALL",null,null,null,"2019-04-30",null,null,null,null,null,null,null,null,"Rate Rider for Disposition of Deferral/Variance Accounts (2019) - effective until April 30, 2019\n      Applicable only for Non-Wholesale Market Participants"]
[null,"Rate Rider for Disposition of Deferral/Variance Accounts (2018) - effective until April 30, 2019",null,"$/kW",-0.39842107158418288,null,null,"4_GENERAL SERVICE 1,000 to 4,999 kW SERVICE CLASSIFICATION","B",null,null,null,"4_GENERAL SERVICE 1,000 to 4,999 kW SERVICE CLASSIFICATION_DEFVAR_ALL",null,null,null,"2019-04-30",null,null,null,null,null,null,null,null,"Rate Rider for Disposition of Deferral/Variance Accounts (2019) - effective until April 30, 2019"]
[null,"Rate Rider for Disposition of Global Adjustment Account (2019) - effective until Dec 31, 2019\n      Applicable only for Non-RPP Customers",null,"$/kWh",3.8449181889326281E-4,null,null,"4_GENERAL SERVICE 1,000 TO 4,999 KW SERVICE CLASSIFICATION","B",null,null,null,"4_GENERAL SERVICE 1,000 TO 4,999 KW SERVICE CLASSIFICATION_GA_kwh",null,null,null,"2019-04-30",null,null,null,null,6,null,null,null,"Rate Rider for Disposition of Global Adjustment Account (2019) - effective until April 30, 2019\n      Applicable only for Non-RPP Customers"]
[null,"Rate Rider for Disposition of Deferral/Variance Accounts (2019) - effective until Dec 31, 2019\n      Applicable only for Non-Wholesale Market Participants",null,"$/kW",-0.1166961875706015,null,null,"4_GENERAL SERVICE 1,000 TO 4,999 KW SERVICE CLASSIFICATION","B",null,null,null,"4_GENERAL SERVICE 1,000 TO 4,999 KW SERVICE CLASSIFICATION_DEFVAR_ALL",null,null,null,"2019-04-30",null,null,null,null,17,null,null,null,"Rate Rider for Disposition of Deferral/Variance Accounts (2019) - effective until April 30, 2019\n      Applicable only for Non-Wholesale Market Participants"]
[null,"Rate Rider for Disposition of Deferral/Variance Accounts (2019) - effective until Dec 31, 2019",null,"$/kW",-0.53545485181115837,null,null,"4_GENERAL SERVICE 1,000 TO 4,999 KW SERVICE CLASSIFICATION","B",null,null,null,"4_GENERAL SERVICE 1,000 TO 4,999 KW SERVICE CLASSIFICATION_DEFVAR_ALL",null,null,null,"2019-04-30",null,null,null,null,18,null,null,null,"Rate Rider for Disposition of Deferral/Variance Accounts (2019) - effective until April 30, 2019"]
[null,"Rate Rider for Disposition of Capacity Based Recovery Account (2018) - effective until April 30, 2019 Applicable only for Class B Customers",null,"$/kW",0.1709,null,null,"4_GENERAL SERVICE 1,000 TO 4,999 KW SERVICE CLASSIFICATION","B",null,null,null,"4_GENERAL SERVICE 1,000 TO 4,999 KW SERVICE CLASSIFICATION_VR_RR_14",null,null,null,"2019-04-30",null,null,null,null,6,null,null,null,"Rate Rider for Disposition of Capacity Based Recovery Account (2019) - effective until April 30, 2019 Applicable only for Class B Customers"]
[null,"Rate Rider for Disposition of Capacity Based Recovery Account (2019) - effective until Dec 31, 2019 Applicable only for Class B Customers",null,"$/kW",1.5235690482471663E-3,null,null,"2_GENERAL SERVICE LESS THAN 50 KW SERVICE CLASSIFICATION","B"]
[null,"Rate Rider for Disposition of Account 1568 (2019) - effective until Dec 31, 2019",null,"$/kW",7.282843324020509E-2,null,null,null,"B"]
[null,"Rate Rider for Disposition of Account 1575 and 1576 - effective until Dec 31, 2019",null,"$/kW",-0.14117530117823188,null,null,null,"B"]
[null,"Rate Rider - Gain on Sale of Property",null,"$/kW",-0.10836892517016627,null,null,null,"B"]
[null,"Retail Transmission Rate - Network Service Rate",null,"$/kW",2.3620195199576757,null,null,"4_GENERAL SERVICE 1,000 TO 4,999 KW SERVICE CLASSIFICATION","C",null,null,null,"4_GENERAL SERVICE 1,000 TO 4,999 KW SERVICE CLASSIFICATION_Retail Transmission Rate - Network Service Rate",null,null,null,null,null,null,null,null,6,null,null,null,"Retail Transmission Rate - Network Service Rate"]
[null,"Retail Transmission Rate - Line and Transformation Connection Service Rate",null,"$/kW",1.796393227715454,null,null,"4_GENERAL SERVICE 1,000 TO 4,999 KW SERVICE CLASSIFICATION","C",null,null,null,"4_GENERAL SERVICE 1,000 TO 4,999 KW SERVICE CLASSIFICATION_Retail Transmission Rate - Line and Transformation Connection Service Rate",null,null,null,null,null,null,null,null,6,null,null,null,"Retail Transmission Rate - Line and Transformation Connection Service Rate"]
[null,"MONTHLY RATES AND CHARGES - Regulatory Component",null,null,null,null,null,"4_MRC_REG",null,null,null,null,null,null,null,null,null,null,null,null,null,48,null,null,null,"MONTHLY RATES AND CHARGES - Regulatory Component"]
[null,"Wholesale Market Service Rate (WMS) - not including CBR",null,"$/kWh",3.2000000000000002E-3,null,null,"4_GENERAL SERVICE 1,000 TO 4,999 KW SERVICE CLASSIFICATION",null,null,null,null,"4_GENERAL SERVICE 1,000 TO 4,999 KW SERVICE CLASSIFICATION_WMSR",null,null,null,null,null,null,null,null,6,null,null,null,"Wholesale Market Service Rate (WMS) - not including CBR"]
[null,"Capacity Based Recovery (CBR) - Applicable for Class B Customers ",null,"$/kWh",4.0000000000000002E-4,null,null,"4_GENERAL SERVICE 1,000 TO 4,999 KW SERVICE CLASSIFICATION",null,null,null,null,null,null,null,null,null,null,null,null,null,6,null,null,null,"Capacity Based Recovery (CBR) - Applicable for Class B Customers "]
[null,"Rural or Remote Electricity Rate Protection Charge (RRRP)",null,"$/kWh",2.9999999999999997E-4,null,null,"3_GENERAL SERVICE 50 TO 999 KW SERVICE CLASSIFICATION","T",null,null,null,null,null,null,null,null,null,null,null,null,6,null,null,null,"Rural or Remote Electricity Rate Protection Charge (RRRP)"]
[null,"Standard Supply Service - Administrative Charge (if applicable)",null,"$",0.25,null,null,"4_GENERAL SERVICE 1,000 TO 4,999 KW SERVICE CLASSIFICATION","T",null,null,null,"4_GENERAL SERVICE 1,000 TO 4,999 KW SERVICE CLASSIFICATION_SSS",null,null,null,null,null,null,null,null,4,null,null,null,"Standard Supply Service - Administrative Charge (if applicable)",null,null,null,null,null,null,null,null,null,null,null,null,null,null,null,null,null,null,"X"]
[null,"LARGE USE SERVICE CLASSIFICATION",null,null,null,null,null,"5_LARGE USE SERVICE CLASSIFICATION",null,null,null,null,null,null,null,null,null,null,null,null,null,32,null,null,null,null,"LARGE USE SERVICE CLASSIFICATION"]
[null,"General Service refers to the supply of electrical energy to business customers, to bulk-metered residential buildings and to combined residential and business or residential and agricultural buildings.  Apartment buildings that are bulk metered will be billed at the appropriate General Service rate.  This classification refers to an account whose average monthly peak demand is equal to or greater than, or is forecast to be equal to or greater than, 5,000 kW.  Class A and Class B consumers are defined in accordance with O. Reg. 429/04.Further servicing details are available in the distributor's Conditions of Service.",null,null,null,null,null,"5_LARGE USE SERVICE CLASSIFICATION",null,null,null,null,null,null,null,null,null,null,null,null,null,624,null,null,null,null,"General Service refers to the supply of electrical energy to business customers, to bulk-metered residential buildings and to combined residential and business or residential and agricultural buildings.  Apartment buildings that are bulk metered will be billed at the appropriate General Service rate.  This classification refers to an account whose average monthly peak demand is equal to or greater than, or is forecast to be equal to or greater than, 5,000 kW.  Class A and Class B consumers are defined in accordance with O. Reg. 429/04.Further servicing details are available in the distributor's Conditions of Service."]
[null,"APPLICATION",null,null,null,null,null,"5_APPLICATION",null,null,null,null,null,null,null,null,null,null,null,null,null,11,null,null,null,null,"APPLICATION"]
[null,"The application of these rates and charges shall be in accordance with the Licence of the Distributor and any Code or Order of the Ontario Energy Board, and amendments thereto as approved by the Ontario Energy Board, which may be applicable to the administration of this schedule.",null,null,null,null,null,"5_LARGE USE SERVICE CLASSIFICATION",null,null,null,null,null,null,null,null,null,null,null,null,null,280,null,null,null,null,"The application of these rates and charges shall be in accordance with the Licence of the Distributor and any Code or Order of the Ontario Energy Board, and amendments thereto as approved by the Ontario Energy Board, which may be applicable to the administration of this schedule."]
[null,"No rates and charges for the distribution of electricity and charges to meet the costs of any work or service done or furnished for the purpose of the distribution of electricity shall be made except as permitted by this schedule, unless required by the Distributor’s Licence or a Code or Order of the Ontario Energy Board, and amendments thereto as approved by the Ontario Energy Board, or as specified herein.",null,null,null,null,null,"5_LARGE USE SERVICE CLASSIFICATION",null,null,null,null,null,null,null,null,null,null,null,null,null,411,null,null,null,null,"No rates and charges for the distribution of electricity and charges to meet the costs of any work or service done or furnished for the purpose of the distribution of electricity shall be made except as permitted by this schedule, unless required by the Distributor’s Licence or a Code or Order of the Ontario Energy Board, and amendments thereto as approved by the Ontario Energy Board, or as specified herein."]
[null,"Unless specifically noted, this schedule does not contain any charges for the electricity commodity, be it under the Regulated Price Plan, a contract with a retailer or the wholesale market price, as applicable.  In addition, the charges in the MONTHLY RATES AND CHARGES - Regulatory Component of this schedule do not apply to a customer that is an embedded wholesale market participant.",null,null,null,null,null,"5_LARGE USE SERVICE CLASSIFICATION",null,null,null,null,null,null,null,null,null,null,null,null,null,387,null,null,null,null,"Unless specifically noted, this schedule does not contain any charges for the electricity commodity, be it under the Regulated Price Plan, a contract with a retailer or the wholesale market price, as applicable.  In addition, the charges in the MONTHLY RATES AND CHARGES - Regulatory Component of this schedule do not apply to a customer that is an embedded wholesale market participant."]
[null,"The rate rider for the disposition of Global Adjustment is only applicable to non-RPP Class B customers. It is not applicable to Wholesale Market Participant (WMP), customers that transitioned between Class A and Class B during the variance account accumulation period, or to customers that were in Class A for the entire period. Customers who transitioned are to be charged or refunded their share of the variance disposed through customer specific billing adjustments. This rate rider is to be consistently applied for the entire period to the sunset date of the rate rider. In addition, this rate rider is applicable to all new non-RPP Class B customers.",null,null,null,null,null,"5_LARGE USE SERVICE CLASSIFICATION",null,null,null,null,null,null,null,null,null,null,null,null,null,657,null,null,null,null,"The rate rider for the disposition of Global Adjustment is only applicable to non-RPP Class B customers. It is not applicable to Wholesale Market Participant (WMP), customers that transitioned between Class A and Class B during the variance account accumulation period, or to customers that were in Class A for the entire period. Customers who transitioned are to be charged or refunded their share of the variance disposed through customer specific billing adjustments. This rate rider is to be consistently applied for the entire period to the sunset date of the rate rider. In addition, this rate rider is applicable to all new non-RPP Class B customers."]
[null,"The rate rider for the disposition of WMS - Sub-account CBR Class B is not applicable to wholesale market participants (WMP), customers that transitioned between Class A and Class B during the variance account accumulation period, or to customers that were in Class A for the entire period. Customers who transitioned are to be charged or refunded their share of the variance disposed through customer specific billing adjustments. This rate rider is to be consistently applied for the entire period to the sunset date of the rate rider. In addition, this rate rider is applicable to all new Class B customers.",null,null,null,null,null,"5_LARGE USE SERVICE CLASSIFICATION",null,null,null,null,null,null,null,null,null,null,null,null,null,610,null,null,null,null,"The rate rider for the disposition of WMS - Sub-account CBR Class B is not applicable to wholesale market participants (WMP), customers that transitioned between Class A and Class B during the variance account accumulation period, or to customers that were in Class A for the entire period. Customers who transitioned are to be charged or refunded their share of the variance disposed through customer specific billing adjustments. This rate rider is to be consistently applied for the entire period to the sunset date of the rate rider. In addition, this rate rider is applicable to all new Class B customers."]
[null,"It should be noted that this schedule does not list any charges, assessments, or credits that are required by law to be invoiced by a distributor and that are not subject to Ontario Energy Board approval, such as the Debt Retirement Charge, the Global Adjustment and the HST.",null,null,null,null,null,"5_LARGE USE SERVICE CLASSIFICATION",null,null,null,null,null,null,null,null,null,null,null,null,null,275,null,null,null,null,"It should be noted that this schedule does not list any charges, assessments, or credits that are required by law to be invoiced by a distributor and that are not subject to Ontario Energy Board approval, such as the Debt Retirement Charge, the Global Adjustment and the HST."]
[null,"MONTHLY RATES AND CHARGES - Delivery Component",null,null,null,null,null,"5_MRC_DEL",null,null,null,null,null,null,null,null,null,null,null,null,null,46,null,null,null,null,"MONTHLY RATES AND CHARGES - Delivery Component"]
[null,"Service Charge",null,"$",9388.0499999999993,null,null,"5_LARGE USE SERVICE CLASSIFICATION","A",null,null,null,"5_LARGE USE SERVICE CLASSIFICATION_MSC",null,null,null,null,null,null,null,null,8,null,null,null,"Service Charge"]
[null,"Distribution Volumetric Rate",null,"$/kW",2.2631999999999999,null,null,"5_LARGE USE SERVICE CLASSIFICATION","A",null,null,null,"5_LARGE USE SERVICE CLASSIFICATION_DVC",null,null,null,null,null,null,null,null,9,null,null,null,"Distribution Volumetric Rate"]
[null,"Low Voltage Service Rate",null,"$/kW",0.18410000000000001,null,null,"5_LARGE USE SERVICE CLASSIFICATION","B",null,null,null,"5_LARGE USE SERVICE CLASSIFICATION_LV",null,null,null,null,null,null,null,null,6,null,null,null,"Low Voltage Service Rate"]
[null,"Rate Rider for Disposition of Deferral/Variance Accounts (2018) - effective until April 30, 2019",null,"$/kW",-2.5357339211051002,null,null,"5_LARGE USE SERVICE CLASSIFICATION","B",null,null,null,"5_LARGE USE SERVICE CLASSIFICATION_DEFVAR_ALL",null,null,null,"2019-04-30",null,null,null,null,null,null,null,null,"Rate Rider for Disposition of Deferral/Variance Accounts (2019) - effective until April 30, 2019"]
[null,"Rate Rider for Disposition of Global Adjustment Account (2019) - effective until Dec 31, 2019\n      Applicable only for Non-RPP Customers",null,"$/kWh",3.8449181889326281E-4,null,null,"4_GENERAL SERVICE 1,000 TO 4,999 KW SERVICE CLASSIFICATION","B"]
[null,"Rate Rider for Disposition of Deferral/Variance Accounts (2019) - effective until Dec 31, 2019",null,"$/kW",-0.57745466899425835,null,null,"5_LARGE USE SERVICE CLASSIFICATION","B",null,null,null,"5_LARGE USE SERVICE CLASSIFICATION_DEFVAR_ALL",null,null,null,"2019-04-30",null,null,null,null,16,null,null,null,"Rate Rider for Disposition of Deferral/Variance Accounts (2019) - effective until April 30, 2019"]
[null,"Rate Rider for Disposition of Account 1568 (2019) - effective until Dec 31, 2019",null,"$/kW",0.82632388084328812,null,null,null,"B"]
[null,"Rate Rider for Disposition of Account 1575 and 1576 - effective until Dec 31, 2019",null,"$/kW",-0.12235869011495178,null,null,null,"B"]
[null,"Rate Rider for Disposition of Capacity Based Recovery Account (2019) - effective until Dec 31, 2019 Applicable only for Class B Customers",null,"$/kW",7.6323637167737674E-5,null,null,"2_GENERAL SERVICE LESS THAN 50 KW SERVICE CLASSIFICATION","B"]
[null,"Rate Rider - Gain on Sale of Property",null,"$/kW",-9.3924851441814547E-2,null,null,null,"B"]
[null,"Retail Transmission Rate - Network Service Rate",null,"$/kW",2.3100638640886344,null,null,"5_LARGE USE SERVICE CLASSIFICATION","C",null,null,null,"5_LARGE USE SERVICE CLASSIFICATION_Retail Transmission Rate - Network Service Rate",null,null,null,null,null,null,null,null,6,null,null,null,"Retail Transmission Rate - Network Service Rate"]
[null,"Retail Transmission Rate - Line and Transformation Connection Service Rate",null,"$/kW",1.9584380219639073,null,null,"5_LARGE USE SERVICE CLASSIFICATION","C",null,null,null,"5_LARGE USE SERVICE CLASSIFICATION_Retail Transmission Rate - Line and Transformation Connection Service Rate",null,null,null,null,null,null,null,null,6,null,null,null,"Retail Transmission Rate - Line and Transformation Connection Service Rate"]
[null,"MONTHLY RATES AND CHARGES - Regulatory Component",null,null,null,null,null,"5_MRC_REG",null,null,null,null,null,null,null,null,null,null,null,null,null,48,null,null,null,"MONTHLY RATES AND CHARGES - Regulatory Component"]
[null,"Wholesale Market Service Rate (WMS) - not including CBR",null,"$/kWh",3.2000000000000002E-3,null,null,"5_LARGE USE SERVICE CLASSIFICATION",null,null,null,null,"5_LARGE USE SERVICE CLASSIFICATION_WMSR",null,null,null,null,null,null,null,null,6,null,null,null,"Wholesale Market Service Rate (WMS) - not including CBR"]
[null,"Capacity Based Recovery (CBR) - Applicable for Class B Customers ",null,"$/kWh",4.0000000000000002E-4,null,null,"5_LARGE USE SERVICE CLASSIFICATION",null,null,null,null,null,null,null,null,null,null,null,null,null,6,null,null,null,"Capacity Based Recovery (CBR) - Applicable for Class B Customers "]
[null,"Rural or Remote Electricity Rate Protection Charge (RRRP)",null,"$/kWh",2.9999999999999997E-4,null,null,"3_GENERAL SERVICE 50 TO 999 KW SERVICE CLASSIFICATION","T",null,null,null,null,null,null,null,null,null,null,null,null,6,null,null,null,"Rural or Remote Electricity Rate Protection Charge (RRRP)"]
[null,"Standard Supply Service - Administrative Charge (if applicable)",null,"$",0.25,null,null,"5_LARGE USE SERVICE CLASSIFICATION","T",null,null,null,"5_LARGE USE SERVICE CLASSIFICATION_SSS",null,null,null,null,null,null,null,null,4,null,null,null,"Standard Supply Service - Administrative Charge (if applicable)",null,null,null,null,null,null,null,null,null,null,null,null,null,null,null,null,null,null,"X"]
[null,"UNMETERED SCATTERED LOAD SERVICE CLASSIFICATION",null,null,null,null,null,"6_UNMETERED SCATTERED LOAD SERVICE CLASSIFICATION",null,null,null,null,null,null,null,null,null,null,null,null,null,47,null,null,null,null,"UNMETERED SCATTERED LOAD SERVICE CLASSIFICATION"]
[null,"This classification refers to an account taking electricity at 750 volts or less whose average monthly peak demand is less than, or is forecast to be less than, 50kW and the consumption is unmetered.  Such connections include cable TV power packs, bus shelters, telephone booths, traffic lights, railway crossings, etc.  The customer will provide detailed manufacturer information/documentation with regard to electrical demand/consumption of the proposed unmetered load.  Class B consumers are defined in accordance with O. Reg. 429/04. Further servicing details are available in the distributor's Conditions of Service.",null,null,null,null,null,"6_UNMETERED SCATTERED LOAD SERVICE CLASSIFICATION",null,null,null,null,null,null,null,null,null,null,null,null,null,621,null,null,null,null,"This classification refers to an account taking electricity at 750 volts or less whose average monthly peak demand is less than, or is forecast to be less than, 50kW and the consumption is unmetered.  Such connections include cable TV power packs, bus shelters, telephone booths, traffic lights, railway crossings, etc.  The customer will provide detailed manufacturer information/documentation with regard to electrical demand/consumption of the proposed unmetered load.  Class B consumers are defined in accordance with O. Reg. 429/04. Further servicing details are available in the distributor's Conditions of Service."]
[null,"APPLICATION",null,null,null,null,null,"6_APPLICATION",null,null,null,null,null,null,null,null,null,null,null,null,null,11,null,null,null,null,"APPLICATION"]
[null,"The application of these rates and charges shall be in accordance with the Licence of the Distributor and any Code or Order of the Ontario Energy Board, and amendments thereto as approved by the Ontario Energy Board, which may be applicable to the administration of this schedule.",null,null,null,null,null,"6_UNMETERED SCATTERED LOAD SERVICE CLASSIFICATION",null,null,null,null,null,null,null,null,null,null,null,null,null,280,null,null,null,null,"The application of these rates and charges shall be in accordance with the Licence of the Distributor and any Code or Order of the Ontario Energy Board, and amendments thereto as approved by the Ontario Energy Board, which may be applicable to the administration of this schedule."]
[null,"No rates and charges for the distribution of electricity and charges to meet the costs of any work or service done or furnished for the purpose of the distribution of electricity shall be made except as permitted by this schedule, unless required by the Distributor’s Licence or a Code or Order of the Ontario Energy Board, and amendments thereto as approved by the Ontario Energy Board, or as specified herein.",null,null,null,null,null,"6_UNMETERED SCATTERED LOAD SERVICE CLASSIFICATION",null,null,null,null,null,null,null,null,null,null,null,null,null,411,null,null,null,null,"No rates and charges for the distribution of electricity and charges to meet the costs of any work or service done or furnished for the purpose of the distribution of electricity shall be made except as permitted by this schedule, unless required by the Distributor’s Licence or a Code or Order of the Ontario Energy Board, and amendments thereto as approved by the Ontario Energy Board, or as specified herein."]
[null,"Unless specifically noted, this schedule does not contain any charges for the electricity commodity, be it under the Regulated Price Plan, a contract with a retailer or the wholesale market price, as applicable.  In addition, the charges in the MONTHLY RATES AND CHARGES - Regulatory Component of this schedule do not apply to a customer that is an embedded wholesale market participant.",null,null,null,null,null,"6_UNMETERED SCATTERED LOAD SERVICE CLASSIFICATION",null,null,null,null,null,null,null,null,null,null,null,null,null,387,null,null,null,null,"Unless specifically noted, this schedule does not contain any charges for the electricity commodity, be it under the Regulated Price Plan, a contract with a retailer or the wholesale market price, as applicable.  In addition, the charges in the MONTHLY RATES AND CHARGES - Regulatory Component of this schedule do not apply to a customer that is an embedded wholesale market participant."]
[null,"The rate rider for the disposition of WMS - Sub-account CBR Class B is not applicable to wholesale market participants (WMP), customers that transitioned between Class A and Class B during the variance account accumulation period, or to customers that were in Class A for the entire period. Customers who transitioned are to be charged or refunded their share of the variance disposed through customer specific billing adjustments. This rate rider is to be consistently applied for the entire period to the sunset date of the rate rider. In addition, this rate rider is applicable to all new Class B customers.",null,null,null,null,null,"6_UNMETERED SCATTERED LOAD SERVICE CLASSIFICATION",null,null,null,null,null,null,null,null,null,null,null,null,null,610,null,null,null,null,"The rate rider for the disposition of WMS - Sub-account CBR Class B is not applicable to wholesale market participants (WMP), customers that transitioned between Class A and Class B during the variance account accumulation period, or to customers that were in Class A for the entire period. Customers who transitioned are to be charged or refunded their share of the variance disposed through customer specific billing adjustments. This rate rider is to be consistently applied for the entire period to the sunset date of the rate rider. In addition, this rate rider is applicable to all new Class B customers."]
[null,"It should be noted that this schedule does not list any charges, assessments, or credits that are required by law to be invoiced by a distributor and that are not subject to Ontario Energy Board approval, such as the Debt Retirement Charge, the Global Adjustment and the HST.",null,null,null,null,null,"6_UNMETERED SCATTERED LOAD SERVICE CLASSIFICATION",null,null,null,null,null,null,null,null,null,null,null,null,null,275,null,null,null,null,"It should be noted that this schedule does not list any charges, assessments, or credits that are required by law to be invoiced by a distributor and that are not subject to Ontario Energy Board approval, such as the Debt Retirement Charge, the Global Adjustment and the HST."]
[null,"MONTHLY RATES AND CHARGES - Delivery Component",null,null,null,null,null,"6_MRC_DEL",null,null,null,null,null,null,null,null,null,null,null,null,null,46,null,null,null,null,"MONTHLY RATES AND CHARGES - Delivery Component"]
[null,"Service Charge (per connection)",null,"$",5.7904999999999998,null,null,"6_UNMETERED SCATTERED LOAD SERVICE CLASSIFICATION","A",null,null,null,"6_UNMETERED SCATTERED LOAD SERVICE CLASSIFICATION_MSC",null,null,null,null,null,null,null,null,7,null,null,null,"Service Charge (per connection)"]
[null,"Distribution Volumetric Rate",null,"$/kWh",1.43E-2,null,null,"6_UNMETERED SCATTERED LOAD SERVICE CLASSIFICATION","A",null,null,null,"6_UNMETERED SCATTERED LOAD SERVICE CLASSIFICATION_DVC",null,null,null,null,null,null,null,null,9,null,null,null,"Distribution Volumetric Rate"]
[null,"Low Voltage Service Rate",null,"$/kWh",4.0000000000000002E-4,null,null,"6_UNMETERED SCATTERED LOAD SERVICE CLASSIFICATION","B",null,null,null,"6_UNMETERED SCATTERED LOAD SERVICE CLASSIFICATION_LV",null,null,null,null,null,null,null,null,6,null,null,null,"Low Voltage Service Rate"]
[null,"Rate Rider for Disposition of Global Adjustment Account (2018) - effective until April 30, 2019\n      Applicable only for Non-RPP Customers",null,"$/kWh",3.2000000000000002E-3,null,null,"6_UNMETERED SCATTERED LOAD SERVICE CLASSIFICATION","B",null,null,null,"6_UNMETERED SCATTERED LOAD SERVICE CLASSIFICATION_GA_kwh",null,null,null,"2019-04-30",null,null,null,null,null,null,null,null,"Rate Rider for Disposition of Global Adjustment Account (2019) - effective until April 30, 2019\n      Applicable only for Non-RPP Customers"]
[null,"Rate Rider for Disposition of Deferral/Variance Accounts (2018) - effective until April 30, 2019",null,"$/kWh",-6.202260836220665E-3,null,null,"6_UNMETERED SCATTERED LOAD SERVICE CLASSIFICATION","B",null,null,null,"6_UNMETERED SCATTERED LOAD SERVICE CLASSIFICATION_DEFVAR_ALL",null,null,null,"2019-04-30",null,null,null,null,null,null,null,null,"Rate Rider for Disposition of Deferral/Variance Accounts (2019) - effective until April 30, 2019"]
[null,"Rate Rider for Disposition of Global Adjustment Account (2019) - effective until Dec 31, 2019\n      Applicable only for Non-RPP Customers",null,"$/kWh",3.8449181889326276E-4,null,null,"6_UNMETERED SCATTERED LOAD SERVICE CLASSIFICATION","B",null,null,null,"6_UNMETERED SCATTERED LOAD SERVICE CLASSIFICATION_GA_kwh",null,null,null,"2019-04-30",null,null,null,null,6,null,null,null,"Rate Rider for Disposition of Global Adjustment Account (2019) - effective until April 30, 2019\n      Applicable only for Non-RPP Customers"]
[null,"Rate Rider for Disposition of Deferral/Variance Accounts (2019) - effective until Dec 31, 2019",null,"$/kWh",-6.8749332317947381E-4,null,null,"6_UNMETERED SCATTERED LOAD SERVICE CLASSIFICATION","B",null,null,null,"6_UNMETERED SCATTERED LOAD SERVICE CLASSIFICATION_DEFVAR_ALL",null,null,null,"2019-04-30",null,null,null,null,21,null,null,null,"Rate Rider for Disposition of Deferral/Variance Accounts (2019) - effective until April 30, 2019"]
[null,"Rate Rider for Disposition of Capacity Based Recovery Account (2018) - effective until April 30, 2019 Applicable only for Class B Customers",null,"$/kWh",4.0000000000000002E-4,null,null,"6_UNMETERED SCATTERED LOAD SERVICE CLASSIFICATION","B",null,null,null,"6_UNMETERED SCATTERED LOAD SERVICE CLASSIFICATION_VR_RR_18",null,null,null,"2019-04-30",null,null,null,null,6,null,null,null,"Rate Rider for Disposition of Capacity Based Recovery Account (2019) - effective until April 30, 2019 Applicable only for Class B Customers"]
[null,"Rate Rider for Disposition of Capacity Based Recovery Account (2019) - effective until Dec 31, 2019 Applicable only for Class B Customers",null,"$/kWh",4.9568533837617714E-6,null,null,"2_GENERAL SERVICE LESS THAN 50 KW SERVICE CLASSIFICATION","B"]
[null,"Rate Rider for Disposition of Account 1568 (2019) - effective until Dec 31, 2019",null,"$/kWh",-1.0838623612552882E-3,null,null,null,"B"]
[null,"Rate Rider for Disposition of Account 1575 and 1576 - effective until Dec 31, 2019",null,"$/kWh",-3.2126915242846417E-4,null,null,null,"B"]
[null,"Rate Rider - Gain on Sale of Property",null,"$/kWh",-2.4661231261194995E-4,null,null,null,"B"]
[null,"Retail Transmission Rate - Network Service Rate",null,"$/kWh",4.9679962660321014E-3,null,null,"6_UNMETERED SCATTERED LOAD SERVICE CLASSIFICATION","C",null,null,null,"6_UNMETERED SCATTERED LOAD SERVICE CLASSIFICATION_Retail Transmission Rate - Network Service Rate",null,null,null,null,null,null,null,null,6,null,null,null,"Retail Transmission Rate - Network Service Rate"]
[null,"Retail Transmission Rate - Line and Transformation Connection Service Rate",null,"$/kWh",3.8893129791551149E-3,null,null,"6_UNMETERED SCATTERED LOAD SERVICE CLASSIFICATION","C",null,null,null,"6_UNMETERED SCATTERED LOAD SERVICE CLASSIFICATION_Retail Transmission Rate - Line and Transformation Connection Service Rate",null,null,null,null,null,null,null,null,6,null,null,null,"Retail Transmission Rate - Line and Transformation Connection Service Rate"]
[null,"MONTHLY RATES AND CHARGES - Regulatory Component",null,null,null,null,null,"6_MRC_REG",null,null,null,null,null,null,null,null,null,null,null,null,null,48,null,null,null,"MONTHLY RATES AND CHARGES - Regulatory Component"]
[null,"Wholesale Market Service Rate (WMS) - not including CBR",null,"$/kWh",3.2000000000000002E-3,null,null,"6_UNMETERED SCATTERED LOAD SERVICE CLASSIFICATION",null,null,null,null,"6_UNMETERED SCATTERED LOAD SERVICE CLASSIFICATION_WMSR",null,null,null,null,null,null,null,null,6,null,null,null,"Wholesale Market Service Rate (WMS) - not including CBR"]
[null,"Capacity Based Recovery (CBR) - Applicable for Class B Customers ",null,"$/kWh",4.0000000000000002E-4,null,null,"6_UNMETERED SCATTERED LOAD SERVICE CLASSIFICATION",null,null,null,null,null,null,null,null,null,null,null,null,null,6,null,null,null,"Capacity Based Recovery (CBR) - Applicable for Class B Customers "]
[null,"Rural or Remote Electricity Rate Protection Charge (RRRP)",null,"$/kWh",2.9999999999999997E-4,null,null,"3_GENERAL SERVICE 50 TO 999 KW SERVICE CLASSIFICATION","T",null,null,null,null,null,null,null,null,null,null,null,null,6,null,null,null,"Rural or Remote Electricity Rate Protection Charge (RRRP)"]
[null,"Standard Supply Service - Administrative Charge (if applicable)",null,"$",0.25,null,null,"6_UNMETERED SCATTERED LOAD SERVICE CLASSIFICATION","T",null,null,null,"6_UNMETERED SCATTERED LOAD SERVICE CLASSIFICATION_SSS",null,null,null,null,null,null,null,null,4,null,null,null,"Standard Supply Service - Administrative Charge (if applicable)",null,null,null,null,null,null,null,null,null,null,null,null,null,null,null,null,null,null,"X"]
[null,"STREET LIGHTING SERVICE CLASSIFICATION",null,null,null,null,null,"7_STREET LIGHTING SERVICE CLASSIFICATION",null,null,null,null,null,null,null,null,null,null,null,null,null,38,null,null,null,null,"STREET LIGHTING SERVICE CLASSIFICATION"]
[null,"This classification refers to an account for roadway lighting with a Municipality, Regional Municipality, Ministry of Transportation and private roadway lighting operation, controlled by photo cells.  The consumption for these customers will be based on the calculated connected load times the required lighting times established in the approved Ontario Energy Board street lighting load shape template. Class B consumers are defined in accordance with O. Reg. 429/04. Further servicing details are available in the distributor's Conditions of Service.",null,null,null,null,null,"7_STREET LIGHTING SERVICE CLASSIFICATION",null,null,null,null,null,null,null,null,null,null,null,null,null,552,null,null,null,null,"This classification refers to an account for roadway lighting with a Municipality, Regional Municipality, Ministry of Transportation and private roadway lighting operation, controlled by photo cells.  The consumption for these customers will be based on the calculated connected load times the required lighting times established in the approved Ontario Energy Board street lighting load shape template. Class B consumers are defined in accordance with O. Reg. 429/04. Further servicing details are available in the distributor's Conditions of Service."]
[null,"APPLICATION",null,null,null,null,null,"7_APPLICATION",null,null,null,null,null,null,null,null,null,null,null,null,null,11,null,null,null,null,"APPLICATION"]
[null,"The application of these rates and charges shall be in accordance with the Licence of the Distributor and any Code or Order of the Ontario Energy Board, and amendments thereto as approved by the Ontario Energy Board, which may be applicable to the administration of this schedule.",null,null,null,null,null,"7_STREET LIGHTING SERVICE CLASSIFICATION",null,null,null,null,null,null,null,null,null,null,null,null,null,280,null,null,null,null,"The application of these rates and charges shall be in accordance with the Licence of the Distributor and any Code or Order of the Ontario Energy Board, and amendments thereto as approved by the Ontario Energy Board, which may be applicable to the administration of this schedule."]
[null,"No rates and charges for the distribution of electricity and charges to meet the costs of any work or service done or furnished for the purpose of the distribution of electricity shall be made except as permitted by this schedule, unless required by the Distributor’s Licence or a Code or Order of the Ontario Energy Board, and amendments thereto as approved by the Ontario Energy Board, or as specified herein.",null,null,null,null,null,"7_STREET LIGHTING SERVICE CLASSIFICATION",null,null,null,null,null,null,null,null,null,null,null,null,null,411,null,null,null,null,"No rates and charges for the distribution of electricity and charges to meet the costs of any work or service done or furnished for the purpose of the distribution of electricity shall be made except as permitted by this schedule, unless required by the Distributor’s Licence or a Code or Order of the Ontario Energy Board, and amendments thereto as approved by the Ontario Energy Board, or as specified herein."]
[null,"Unless specifically noted, this schedule does not contain any charges for the electricity commodity, be it under the Regulated Price Plan, a contract with a retailer or the wholesale market price, as applicable.  In addition, the charges in the MONTHLY RATES AND CHARGES - Regulatory Component of this schedule do not apply to a customer that is an embedded wholesale market participant.",null,null,null,null,null,"7_STREET LIGHTING SERVICE CLASSIFICATION",null,null,null,null,null,null,null,null,null,null,null,null,null,387,null,null,null,null,"Unless specifically noted, this schedule does not contain any charges for the electricity commodity, be it under the Regulated Price Plan, a contract with a retailer or the wholesale market price, as applicable.  In addition, the charges in the MONTHLY RATES AND CHARGES - Regulatory Component of this schedule do not apply to a customer that is an embedded wholesale market participant."]
[null,"The rate rider for the disposition of WMS - Sub-account CBR Class B is not applicable to wholesale market participants (WMP), customers that transitioned between Class A and Class B during the variance account accumulation period, or to customers that were in Class A for the entire period. Customers who transitioned are to be charged or refunded their share of the variance disposed through customer specific billing adjustments. This rate rider is to be consistently applied for the entire period to the sunset date of the rate rider. In addition, this rate rider is applicable to all new Class B customers.",null,null,null,null,null,"7_STREET LIGHTING SERVICE CLASSIFICATION",null,null,null,null,null,null,null,null,null,null,null,null,null,610,null,null,null,null,"The rate rider for the disposition of WMS - Sub-account CBR Class B is not applicable to wholesale market participants (WMP), customers that transitioned between Class A and Class B during the variance account accumulation period, or to customers that were in Class A for the entire period. Customers who transitioned are to be charged or refunded their share of the variance disposed through customer specific billing adjustments. This rate rider is to be consistently applied for the entire period to the sunset date of the rate rider. In addition, this rate rider is applicable to all new Class B customers."]
[null,"It should be noted that this schedule does not list any charges, assessments, or credits that are required by law to be invoiced by a distributor and that are not subject to Ontario Energy Board approval, such as the Debt Retirement Charge, the Global Adjustment and the HST.",null,null,null,null,null,"7_STREET LIGHTING SERVICE CLASSIFICATION",null,null,null,null,null,null,null,null,null,null,null,null,null,275,null,null,null,null,"It should be noted that this schedule does not list any charges, assessments, or credits that are required by law to be invoiced by a distributor and that are not subject to Ontario Energy Board approval, such as the Debt Retirement Charge, the Global Adjustment and the HST."]
[null,"MONTHLY RATES AND CHARGES - Delivery Component",null,null,null,null,null,"7_MRC_DEL",null,null,null,null,null,null,null,null,null,null,null,null,null,46,null,null,null,null,"MONTHLY RATES AND CHARGES - Delivery Component"]
[null,"Service Charge (per connection)",null,"$",1.6541999999999999,null,null,"7_STREET LIGHTING SERVICE CLASSIFICATION","A",null,null,null,"7_STREET LIGHTING SERVICE CLASSIFICATION_MSC",null,null,null,null,null,null,null,null,7,null,null,null,"Service Charge (per connection)"]
[null,"Distribution Volumetric Rate",null,"$/kW",13.3222,null,null,"7_STREET LIGHTING SERVICE CLASSIFICATION","A",null,null,null,"7_STREET LIGHTING SERVICE CLASSIFICATION_DVC",null,null,null,null,null,null,null,null,10,null,null,null,"Distribution Volumetric Rate"]
[null,"Low Voltage Service Rate",null,"$/kW",0.1158,null,null,"7_STREET LIGHTING SERVICE CLASSIFICATION","B",null,null,null,"7_STREET LIGHTING SERVICE CLASSIFICATION_LV",null,null,null,null,null,null,null,null,5,null,null,null,"Low Voltage Service Rate"]
[null,"Rate Rider for Disposition of Global Adjustment Account (2018) - effective until April 30, 2019\n      Applicable only for Non-RPP Customers",null,"$/kWh",3.3E-3,null,null,"7_STREET LIGHTING SERVICE CLASSIFICATION","B",null,null,null,"7_STREET LIGHTING SERVICE CLASSIFICATION_GA_kwh",null,null,null,"2019-04-30",null,null,null,null,null,null,null,null,"Rate Rider for Disposition of Global Adjustment Account (2019) - effective until April 30, 2019\n      Applicable only for Non-RPP Customers"]
[null,"Rate Rider for Disposition of Deferral/Variance Accounts (2018) - effective until April 30, 2019",null,"$/kW",-2.2406831535474727,null,null,"7_STREET LIGHTING SERVICE CLASSIFICATION","B",null,null,null,"7_STREET LIGHTING SERVICE CLASSIFICATION_DEFVAR_ALL",null,null,null,"2019-04-30",null,null,null,null,null,null,null,null,"Rate Rider for Disposition of Deferral/Variance Accounts (2019) - effective until April 30, 2019"]
[null,"Rate Rider for Disposition of Global Adjustment Account (2019) - effective until Dec 31, 2019\n      Applicable only for Non-RPP Customers",null,"$/kWh",3.8449181889326281E-4,null,null,"7_STREET LIGHTING SERVICE CLASSIFICATION","B",null,null,null,"7_STREET LIGHTING SERVICE CLASSIFICATION_GA_kwh",null,null,null,"2019-04-30",null,null,null,null,6,null,null,null,"Rate Rider for Disposition of Global Adjustment Account (2019) - effective until April 30, 2019\n      Applicable only for Non-RPP Customers"]
[null,"Rate Rider for Disposition of Deferral/Variance Accounts (2019) - effective until Dec 31, 2019",null,"$/kW",1.9503357877848408,null,null,"7_STREET LIGHTING SERVICE CLASSIFICATION","B",null,null,null,"7_STREET LIGHTING SERVICE CLASSIFICATION_DEFVAR_ALL",null,null,null,"2019-04-30",null,null,null,null,17,null,null,null,"Rate Rider for Disposition of Deferral/Variance Accounts (2019) - effective until April 30, 2019"]
[null,"Rate Rider for Disposition of Capacity Based Recovery Account (2018) - effective until April 30, 2019 Applicable only for Class B Customers",null,"$/kW",0.15310000000000001,null,null,"7_STREET LIGHTING SERVICE CLASSIFICATION","B",null,null,null,"7_STREET LIGHTING SERVICE CLASSIFICATION_VR_RR_21",null,null,null,"2019-04-30",null,null,null,null,6,null,null,null,"Rate Rider for Disposition of Capacity Based Recovery Account (2019) - effective until April 30, 2019 Applicable only for Class B Customers"]
[null,"Rate Rider for Disposition of Capacity Based Recovery Account (2019) - effective until Dec 31, 2019 Applicable only for Class B Customers",null,"$/kW",1.7201209911030804E-3,null,null,"2_GENERAL SERVICE LESS THAN 50 KW SERVICE CLASSIFICATION","B"]
[null,"Rate Rider for Disposition of Account 1568 (2019) - effective until Dec 31, 2019",null,"$/kW",3.7322156582669548,null,null,null,"B"]
[null,"Rate Rider for Disposition of Account 1575 and 1576 - effective until Dec 31, 2019",null,"$/kW",-0.11148641488901773,null,null,null,"B"]
[null,"Rate Rider - Gain on Sale of Property",null,"$/kW",-8.5581089409800692E-2,null,null,null,"B"]
[null,"Retail Transmission Rate - Network Service Rate",null,"$/kW",1.5981031044204883,null,null,"7_STREET LIGHTING SERVICE CLASSIFICATION","C",null,null,null,"7_STREET LIGHTING SERVICE CLASSIFICATION_Retail Transmission Rate - Network Service Rate",null,null,null,null,null,null,null,null,6,null,null,null,"Retail Transmission Rate - Network Service Rate"]
[null,"Retail Transmission Rate - Line and Transformation Connection Service Rate",null,"$/kW",1.200006056470766,null,null,"7_STREET LIGHTING SERVICE CLASSIFICATION","C",null,null,null,"7_STREET LIGHTING SERVICE CLASSIFICATION_Retail Transmission Rate - Line and Transformation Connection Service Rate",null,null,null,null,null,null,null,null,6,null,null,null,"Retail Transmission Rate - Line and Transformation Connection Service Rate"]
[null,"MONTHLY RATES AND CHARGES - Regulatory Component",null,null,null,null,null,"7_MRC_REG",null,null,null,null,null,null,null,null,null,null,null,null,null,48,null,null,null,"MONTHLY RATES AND CHARGES - Regulatory Component"]
[null,"Wholesale Market Service Rate (WMS) - not including CBR",null,"$/kWh",3.2000000000000002E-3,null,null,"7_STREET LIGHTING SERVICE CLASSIFICATION",null,null,null,null,"7_STREET LIGHTING SERVICE CLASSIFICATION_WMSR",null,null,null,null,null,null,null,null,6,null,null,null,"Wholesale Market Service Rate (WMS) - not including CBR"]
[null,"Capacity Based Recovery (CBR) - Applicable for Class B Customers ",null,"$/kWh",4.0000000000000002E-4,null,null,"7_STREET LIGHTING SERVICE CLASSIFICATION",null,null,null,null,null,null,null,null,null,null,null,null,null,6,null,null,null,"Capacity Based Recovery (CBR) - Applicable for Class B Customers "]
[null,"Rural or Remote Electricity Rate Protection Charge (RRRP)",null,"$/kWh",2.9999999999999997E-4,null,null,"3_GENERAL SERVICE 50 TO 999 KW SERVICE CLASSIFICATION","T",null,null,null,null,null,null,null,null,null,null,null,null,6,null,null,null,"Rural or Remote Electricity Rate Protection Charge (RRRP)"]
[null,"Standard Supply Service - Administrative Charge (if applicable)",null,"$",0.25,null,null,"7_STREET LIGHTING SERVICE CLASSIFICATION","T",null,null,null,"7_STREET LIGHTING SERVICE CLASSIFICATION_SSS",null,null,null,null,null,null,null,null,4,null,null,null,"Standard Supply Service - Administrative Charge (if applicable)",null,null,null,null,null,null,null,null,null,null,null,null,null,null,null,null,null,null,"X"]
[null,"EMBEDDED DISTRIBUTOR SERVICE CLASSIFICATION - HYDRO ONE NETWORK",null,null,null,null,null,"8_EMBEDDED DISTRIBUTOR SERVICE CLASSIFICATION",null,null,null,null,null,null,null,null,null,null,null,null,null,43,null,null,null,null,"EMBEDDED DISTRIBUTOR SERVICE CLASSIFICATION"]
[null,"This classification applies to an electricity distributor licenced by the Ontario Energy Board, that is provided electricity by means of this distributor's facilities. Further servicing details are available in the distributor's Conditions of Service.",null,null,null,null,null,"8_EMBEDDED DISTRIBUTOR SERVICE CLASSIFICATION",null,null,null,null,null,null,null,null,null,null,null,null,null,251,null,null,null,null,"This classification applies to an electricity distributor licenced by the Ontario Energy Board, that is provided electricity by means of this distributor's facilities. Further servicing details are available in the distributor's Conditions of Service."]
[null,"APPLICATION",null,null,null,null,null,"8_APPLICATION",null,null,null,null,null,null,null,null,null,null,null,null,null,11,null,null,null,null,"APPLICATION"]
[null,"The application of these rates and charges shall be in accordance with the Licence of the Distributor and any Code or Order of the Ontario Energy Board, and amendments thereto as approved by the Ontario Energy Board, which may be applicable to the administration of this schedule.",null,null,null,null,null,"8_EMBEDDED DISTRIBUTOR SERVICE CLASSIFICATION",null,null,null,null,null,null,null,null,null,null,null,null,null,280,null,null,null,null,"The application of these rates and charges shall be in accordance with the Licence of the Distributor and any Code or Order of the Ontario Energy Board, and amendments thereto as approved by the Ontario Energy Board, which may be applicable to the administration of this schedule."]
[null,"No rates and charges for the distribution of electricity and charges to meet the costs of any work or service done or furnished for the purpose of the distribution of electricity shall be made except as permitted by this schedule, unless required by the Distributor’s Licence or a Code or Order of the Ontario Energy Board, and amendments thereto as approved by the Ontario Energy Board, or as specified herein.",null,null,null,null,null,"8_EMBEDDED DISTRIBUTOR SERVICE CLASSIFICATION",null,null,null,null,null,null,null,null,null,null,null,null,null,411,null,null,null,null,"No rates and charges for the distribution of electricity and charges to meet the costs of any work or service done or furnished for the purpose of the distribution of electricity shall be made except as permitted by this schedule, unless required by the Distributor’s Licence or a Code or Order of the Ontario Energy Board, and amendments thereto as approved by the Ontario Energy Board, or as specified herein."]
[null,"Unless specifically noted, this schedule does not contain any charges for the electricity commodity, be it under the Regulated Price Plan, a contract with a retailer or the wholesale market price, as applicable.  In addition, the charges in the MONTHLY RATES AND CHARGES - Regulatory Component of this schedule do not apply to a customer that is an embedded wholesale market participant.",null,null,null,null,null,"8_EMBEDDED DISTRIBUTOR SERVICE CLASSIFICATION",null,null,null,null,null,null,null,null,null,null,null,null,null,387,null,null,null,null,"Unless specifically noted, this schedule does not contain any charges for the electricity commodity, be it under the Regulated Price Plan, a contract with a retailer or the wholesale market price, as applicable.  In addition, the charges in the MONTHLY RATES AND CHARGES - Regulatory Component of this schedule do not apply to a customer that is an embedded wholesale market participant."]
[null,"It should be noted that this schedule does not list any charges, assessments, or credits that are required by law to be invoiced by a distributor and that are not subject to Ontario Energy Board approval, such as the Debt Retirement Charge, the Global Adjustment and the HST.",null,null,null,null,null,"8_EMBEDDED DISTRIBUTOR SERVICE CLASSIFICATION",null,null,null,null,null,null,null,null,null,null,null,null,null,275,null,null,null,null,"It should be noted that this schedule does not list any charges, assessments, or credits that are required by law to be invoiced by a distributor and that are not subject to Ontario Energy Board approval, such as the Debt Retirement Charge, the Global Adjustment and the HST."]
[null,"MONTHLY RATES AND CHARGES - Delivery Component",null,null,null,null,null,"8_MRC_DEL",null,null,null,null,null,null,null,null,null,null,null,null,null,46,null,null,null,null,"MONTHLY RATES AND CHARGES - Delivery Component"]
[null,"Monthly Distribution Wheeling Service Rate - Hydro One Networks",null,"$/kW",1.9142999999999999,null,null,"8_EMBEDDED DISTRIBUTOR SERVICE CLASSIFICATION","A",null,null,null,null,null,null,null,null,null,null,null,null,9,null,null,null,"Monthly Distribution Wheeling Service Rate - Hydro One Networks"]
[null,"Rate Rider for Disposition of Global Adjustment Account (2018) - effective until April 30, 2019\n      Applicable only for Non-RPP Customers",null,"$/kWh",3.3E-3,null,null,null,"B"]
[null,"Rate Rider for Disposition of Deferral/Variance Accounts (2018) - effective until April 30, 2019",null,"$/kW",-0.53879999999999995,null,null,null,"B"]
[null,"Rate Rider for Disposition of Global Adjustment Account (2019) - effective until Dec 31, 2019\n      Applicable only for Non-RPP Customers",null,"$/kWh",3.8449181889326276E-4,null,null,"8_EMBEDDED DISTRIBUTOR SERVICE CLASSIFICATION","B",null,null,null,"8_EMBEDDED DISTRIBUTOR SERVICE CLASSIFICATION_GA_kwh",null,null,null,null,null,null,null,null,6]
[null,"Rate Rider for Disposition of Deferral/Variance Accounts (2019) - effective until Dec 31, 2019",null,"$/kW",-0.82312345244829288,null,null,"8_EMBEDDED DISTRIBUTOR SERVICE CLASSIFICATION","B",null,null,null,"8_EMBEDDED DISTRIBUTOR SERVICE CLASSIFICATION_DEFVAR_ALL",null,null,null,null,null,null,null,null,7]
[null,"Rate Rider for Disposition of Capacity Based Recovery Account (2018) - effective until April 30, 2019 Applicable only for Class B Customers",null,"$/kW",3.6799999999999999E-2,null,null,"8_EMBEDDED DISTRIBUTOR SERVICE CLASSIFICATION","B",null,null,null,"8_EMBEDDED DISTRIBUTOR SERVICE CLASSIFICATION_VR_RR_24",null,null,null,null,null,null,null,null,6]
[null,"Rate Rider for Disposition of Capacity Based Recovery Account (2019) - effective until Dec 31, 2019 Applicable only for Class B Customers",null,"$/kW",2.5620545730907448E-3,null,null,"2_GENERAL SERVICE LESS THAN 50 KW SERVICE CLASSIFICATION","B"]
[null,"Rate Rider for Disposition of Account 1568 (2019) - effective until Dec 31, 2019",null,"$/kW",0,null,null,null,"B"]
[null,"Rate Rider for Disposition of Account 1575 and 1576 - effective until Dec 31, 2019",null,"$/kW",-0.16605476043910622,null,null,null,"B"]
[null,"Rate Rider - Gain on Sale of Property",null,"$/kW",-0.12746906760439053,null,null,null,"B"]
[null,"Retail Transmission Rate - Network Service Rate",null,"$/kW",2.3100639460253656,null,null,"8_EMBEDDED DISTRIBUTOR SERVICE CLASSIFICATION","C",null,null,null,"8_EMBEDDED DISTRIBUTOR SERVICE CLASSIFICATION_Retail Transmission Rate - Network Service Rate",null,null,null,null,null,null,null,null,6,null,null,null,"Retail Transmission Rate - Network Service Rate"]
[null,"Retail Transmission Rate - Line and Transformation Connection Service Rate",null,"$/kW",1.9584378530037638,null,null,"8_EMBEDDED DISTRIBUTOR SERVICE CLASSIFICATION","C",null,null,null,"8_EMBEDDED DISTRIBUTOR SERVICE CLASSIFICATION_Retail Transmission Rate - Line and Transformation Connection Service Rate",null,null,null,null,null,null,null,null,6,null,null,null,"Retail Transmission Rate - Line and Transformation Connection Service Rate"]
[null,"MONTHLY RATES AND CHARGES - Regulatory Component",null,null,null,null,null,"8_MRC_REG",null,null,null,null,null,null,null,null,null,null,null,null,null,48,null,null,null,"MONTHLY RATES AND CHARGES - Regulatory Component"]
[null,"Wholesale Market Service Rate (WMS) - not including CBR",null,"$/kWh",3.2000000000000002E-3,null,null,"8_EMBEDDED DISTRIBUTOR SERVICE CLASSIFICATION",null,null,null,null,"8_EMBEDDED DISTRIBUTOR SERVICE CLASSIFICATION_WMSR",null,null,null,null,null,null,null,null,6,null,null,null,"Wholesale Market Service Rate (WMS) - not including CBR"]
[null,"Capacity Based Recovery (CBR) - Applicable for Class B Customers ",null,"$/kWh",4.0000000000000002E-4,null,null,"8_EMBEDDED DISTRIBUTOR SERVICE CLASSIFICATION",null,null,null,null,null,null,null,null,null,null,null,null,null,6,null,null,null,"Capacity Based Recovery (CBR) - Applicable for Class B Customers "]
[null,"Rural or Remote Electricity Rate Protection Charge (RRRP)",null,"$/kWh",2.9999999999999997E-4,null,null,"3_GENERAL SERVICE 50 TO 999 KW SERVICE CLASSIFICATION","T",null,null,null,null,null,null,null,null,null,null,null,null,6,null,null,null,"Rural or Remote Electricity Rate Protection Charge (RRRP)"]
[null,"Standard Supply Service - Administrative Charge (if applicable)",null,"$",0.25,null,null,"8_EMBEDDED DISTRIBUTOR SERVICE CLASSIFICATION","T",null,null,null,"8_EMBEDDED DISTRIBUTOR SERVICE CLASSIFICATION_SSS",null,null,null,null,null,null,null,null,4,null,null,null,"Standard Supply Service - Administrative Charge (if applicable)",null,null,null,null,null,null,null,null,null,null,null,null,null,null,null,null,null,null,"X"]
[null,"EMBEDDED DISTRIBUTOR SERVICE CLASSIFICATION - WATERLOO NORTH HYDRO",null,null,null,null,null,"8_EMBEDDED DISTRIBUTOR SERVICE CLASSIFICATION",null,null,null,null,null,null,null,null,null,null,null,null,null,43,null,null,null,null,"EMBEDDED DISTRIBUTOR SERVICE CLASSIFICATION"]
[null,"This classification applies to an electricity distributor licenced by the Ontario Energy Board, that is provided electricity by means of this distributor's facilities. Further servicing details are available in the distributor's Conditions of Service.",null,null,null,null,null,"8_EMBEDDED DISTRIBUTOR SERVICE CLASSIFICATION",null,null,null,null,null,null,null,null,null,null,null,null,null,251,null,null,null,null,"This classification applies to an electricity distributor licenced by the Ontario Energy Board, that is provided electricity by means of this distributor's facilities. Further servicing details are available in the distributor's Conditions of Service."]
[null,"APPLICATION",null,null,null,null,null,"8_APPLICATION",null,null,null,null,null,null,null,null,null,null,null,null,null,11,null,null,null,null,"APPLICATION"]
[null,"The application of these rates and charges shall be in accordance with the Licence of the Distributor and any Code or Order of the Ontario Energy Board, and amendments thereto as approved by the Ontario Energy Board, which may be applicable to the administration of this schedule.",null,null,null,null,null,"8_EMBEDDED DISTRIBUTOR SERVICE CLASSIFICATION",null,null,null,null,null,null,null,null,null,null,null,null,null,280,null,null,null,null,"The application of these rates and charges shall be in accordance with the Licence of the Distributor and any Code or Order of the Ontario Energy Board, and amendments thereto as approved by the Ontario Energy Board, which may be applicable to the administration of this schedule."]
[null,"No rates and charges for the distribution of electricity and charges to meet the costs of any work or service done or furnished for the purpose of the distribution of electricity shall be made except as permitted by this schedule, unless required by the Distributor’s Licence or a Code or Order of the Ontario Energy Board, and amendments thereto as approved by the Ontario Energy Board, or as specified herein.",null,null,null,null,null,"8_EMBEDDED DISTRIBUTOR SERVICE CLASSIFICATION",null,null,null,null,null,null,null,null,null,null,null,null,null,411,null,null,null,null,"No rates and charges for the distribution of electricity and charges to meet the costs of any work or service done or furnished for the purpose of the distribution of electricity shall be made except as permitted by this schedule, unless required by the Distributor’s Licence or a Code or Order of the Ontario Energy Board, and amendments thereto as approved by the Ontario Energy Board, or as specified herein."]
[null,"Unless specifically noted, this schedule does not contain any charges for the electricity commodity, be it under the Regulated Price Plan, a contract with a retailer or the wholesale market price, as applicable.  In addition, the charges in the MONTHLY RATES AND CHARGES - Regulatory Component of this schedule do not apply to a customer that is an embedded wholesale market participant.",null,null,null,null,null,"8_EMBEDDED DISTRIBUTOR SERVICE CLASSIFICATION",null,null,null,null,null,null,null,null,null,null,null,null,null,387,null,null,null,null,"Unless specifically noted, this schedule does not contain any charges for the electricity commodity, be it under the Regulated Price Plan, a contract with a retailer or the wholesale market price, as applicable.  In addition, the charges in the MONTHLY RATES AND CHARGES - Regulatory Component of this schedule do not apply to a customer that is an embedded wholesale market participant."]
[null,"It should be noted that this schedule does not list any charges, assessments, or credits that are required by law to be invoiced by a distributor and that are not subject to Ontario Energy Board approval, such as the Debt Retirement Charge, the Global Adjustment and the HST.",null,null,null,null,null,"8_EMBEDDED DISTRIBUTOR SERVICE CLASSIFICATION",null,null,null,null,null,null,null,null,null,null,null,null,null,275,null,null,null,null,"It should be noted that this schedule does not list any charges, assessments, or credits that are required by law to be invoiced by a distributor and that are not subject to Ontario Energy Board approval, such as the Debt Retirement Charge, the Global Adjustment and the HST."]
[null,"MONTHLY RATES AND CHARGES - Delivery Component",null,null,null,null,null,"8_MRC_DEL",null,null,null,null,null,null,null,null,null,null,null,null,null,46,null,null,null,null,"MONTHLY RATES AND CHARGES - Delivery Component"]
[null,"Monthly Distribution Wheeling Service Rate - Waterloo North Hydro",null,"$/kW",1.4219999999999999,null,null,"8_EMBEDDED DISTRIBUTOR SERVICE CLASSIFICATION","A",null,null,null,null,null,null,null,null,null,null,null,null,9,null,null,null,"Monthly Distribution Wheeling Service Rate - Waterloo North Hydro"]
[null,"Rate Rider for Disposition of Global Adjustment Account (2018) - effective until April 30, 2019\n      Applicable only for Non-RPP Customers",null,"$/kWh",3.3E-3,null,null,null,"B"]
[null,"Rate Rider for Disposition of Deferral/Variance Accounts (2018) - effective until April 30, 2019",null,"$/kW",-0.53879999999999995,null,null,null,"B"]
[null,"Rate Rider for Disposition of Global Adjustment Account (2019) - effective until Dec 31, 2019\n      Applicable only for Non-RPP Customers",null,"$/kWh",3.8449181889326281E-4,null,null,"8_EMBEDDED DISTRIBUTOR SERVICE CLASSIFICATION","B",null,null,null,"8_EMBEDDED DISTRIBUTOR SERVICE CLASSIFICATION_GA_kwh",null,null,null,null,null,null,null,null,6]
[null,"Rate Rider for Disposition of Deferral/Variance Accounts (2019) - effective until Dec 31, 2019",null,"$/kW",-0.81635510426823699,null,null,"8_EMBEDDED DISTRIBUTOR SERVICE CLASSIFICATION","B",null,null,null,"8_EMBEDDED DISTRIBUTOR SERVICE CLASSIFICATION_DEFVAR_ALL",null,null,null,null,null,null,null,null,7]
[null,"Rate Rider for Disposition of Capacity Based Recovery Account (2018) - effective until April 30, 2019 Applicable only for Class B Customers",null,"$/kW",3.6799999999999999E-2,null,null,"8_EMBEDDED DISTRIBUTOR SERVICE CLASSIFICATION","B",null,null,null,"8_EMBEDDED DISTRIBUTOR SERVICE CLASSIFICATION_VR_RR_24",null,null,null,null,null,null,null,null,6]
[null,"Rate Rider for Disposition of Capacity Based Recovery Account (2019) - effective until Dec 31, 2019 Applicable only for Class B Customers",null,"$/kW",2.5119721471893578E-3,null,null,"2_GENERAL SERVICE LESS THAN 50 KW SERVICE CLASSIFICATION","B"]
[null,"Rate Rider for Disposition of Account 1575 and 1576 - effective until Dec 31, 2019",null,"$/kW",-0.16280876196483032,null,null,null,"B"]
[null,"Rate Rider - Gain on Sale of Property",null,"$/kW",-0.12497497554703023,null,null,null,"B"]
[null,"Retail Transmission Rate - Network Service Rate",null,"$/kW",2.310063868617755,null,null,"8_EMBEDDED DISTRIBUTOR SERVICE CLASSIFICATION","C",null,null,null,"8_EMBEDDED DISTRIBUTOR SERVICE CLASSIFICATION_Retail Transmission Rate - Network Service Rate",null,null,null,null,null,null,null,null,6,null,null,null,"Retail Transmission Rate - Network Service Rate"]
[null,"Retail Transmission Rate - Line and Transformation Connection Service Rate",null,"$/kW",1.9584380508433166,null,null,"8_EMBEDDED DISTRIBUTOR SERVICE CLASSIFICATION","C",null,null,null,"8_EMBEDDED DISTRIBUTOR SERVICE CLASSIFICATION_Retail Transmission Rate - Line and Transformation Connection Service Rate",null,null,null,null,null,null,null,null,6,null,null,null,"Retail Transmission Rate - Line and Transformation Connection Service Rate"]
[null,"MONTHLY RATES AND CHARGES - Regulatory Component",null,null,null,null,null,"8_MRC_REG",null,null,null,null,null,null,null,null,null,null,null,null,null,48,null,null,null,"MONTHLY RATES AND CHARGES - Regulatory Component"]
[null,"Wholesale Market Service Rate (WMS) - not including CBR",null,"$/kWh",3.2000000000000002E-3,null,null,"8_EMBEDDED DISTRIBUTOR SERVICE CLASSIFICATION",null,null,null,null,"8_EMBEDDED DISTRIBUTOR SERVICE CLASSIFICATION_WMSR",null,null,null,null,null,null,null,null,6,null,null,null,"Wholesale Market Service Rate (WMS) - not including CBR"]
[null,"Capacity Based Recovery (CBR) - Applicable for Class B Customers ",null,"$/kWh",4.0000000000000002E-4,null,null,"8_EMBEDDED DISTRIBUTOR SERVICE CLASSIFICATION",null,null,null,null,null,null,null,null,null,null,null,null,null,6,null,null,null,"Capacity Based Recovery (CBR) - Applicable for Class B Customers "]
[null,"Rural or Remote Electricity Rate Protection Charge (RRRP)",null,"$/kWh",2.9999999999999997E-4,null,null,"3_GENERAL SERVICE 50 TO 999 KW SERVICE CLASSIFICATION","T",null,null,null,null,null,null,null,null,null,null,null,null,6,null,null,null,"Rural or Remote Electricity Rate Protection Charge (RRRP)"]
[null,"Standard Supply Service - Administrative Charge (if applicable)",null,"$",0.25,null,null,"8_EMBEDDED DISTRIBUTOR SERVICE CLASSIFICATION","T",null,null,null,"8_EMBEDDED DISTRIBUTOR SERVICE CLASSIFICATION_SSS",null,null,null,null,null,null,null,null,4,null,null,null,"Standard Supply Service - Administrative Charge (if applicable)",null,null,null,null,null,null,null,null,null,null,null,null,null,null,null,null,null,null,"X"]
[null,"microFIT SERVICE CLASSIFICATION",null,null,null,null,null,"9_MICROFIT SERVICE CLASSIFICATION",null,null,null,null,null,null,null,null,null,null,null,null,null,31,null,null,null,null,"microFIT SERVICE CLASSIFICATION"]
[null,"This classification applies to an electricity generation facility contracted under the Independent Electricity System Operator’s microFIT program and connected to the distributor's distribution system.  Further servicing details are available in the distributor's Conditions of Service.",null,null,null,null,null,"9_MICROFIT SERVICE CLASSIFICATION",null,null,null,null,null,null,null,null,null,null,null,null,null,286,null,null,null,null,"This classification applies to an electricity generation facility contracted under the Independent Electricity System Operator’s microFIT program and connected to the distributor's distribution system.  Further servicing details are available in the distributor's Conditions of Service."]
[null,"APPLICATION",null,null,null,null,null,"9_APPLICATION",null,null,null,null,null,null,null,null,null,null,null,null,null,11,null,null,null,null,"APPLICATION"]
[null,"The application of these rates and charges shall be in accordance with the Licence of the Distributor and any Code or Order of the Ontario Energy Board, and amendments thereto as approved by the Ontario Energy Board, which may be applicable to the administration of this schedule.",null,null,null,null,null,"9_MICROFIT SERVICE CLASSIFICATION",null,null,null,null,null,null,null,null,null,null,null,null,null,280,null,null,null,null,"The application of these rates and charges shall be in accordance with the Licence of the Distributor and any Code or Order of the Ontario Energy Board, and amendments thereto as approved by the Ontario Energy Board, which may be applicable to the administration of this schedule."]
[null,"No rates and charges for the distribution of electricity and charges to meet the costs of any work or service done or furnished for the purpose of the distribution of electricity shall be made except as permitted by this schedule, unless required by the Distributor’s Licence or a Code or Order of the Ontario Energy Board, and amendments thereto as approved by the Ontario Energy Board, or as specified herein.",null,null,null,null,null,"9_MICROFIT SERVICE CLASSIFICATION",null,null,null,null,null,null,null,null,null,null,null,null,null,411,null,null,null,null,"No rates and charges for the distribution of electricity and charges to meet the costs of any work or service done or furnished for the purpose of the distribution of electricity shall be made except as permitted by this schedule, unless required by the Distributor’s Licence or a Code or Order of the Ontario Energy Board, and amendments thereto as approved by the Ontario Energy Board, or as specified herein."]
[null,"Unless specifically noted, this schedule does not contain any charges for the electricity commodity, be it under the Regulated Price Plan, a contract with a retailer or the wholesale market price, as applicable.",null,null,null,null,null,"9_MICROFIT SERVICE CLASSIFICATION",null,null,null,null,null,null,null,null,null,null,null,null,null,211,null,null,null,null,"Unless specifically noted, this schedule does not contain any charges for the electricity commodity, be it under the Regulated Price Plan, a contract with a retailer or the wholesale market price, as applicable."]
[null,"It should be noted that this schedule does not list any charges, assessments, or credits that are required by law to be invoiced by a distributor and that are not subject to Ontario Energy Board approval, such as the Debt Retirement Charge, the Global Adjustment and the HST.",null,null,null,null,null,"9_MICROFIT SERVICE CLASSIFICATION",null,null,null,null,null,null,null,null,null,null,null,null,null,275,null,null,null,null,"It should be noted that this schedule does not list any charges, assessments, or credits that are required by law to be invoiced by a distributor and that are not subject to Ontario Energy Board approval, such as the Debt Retirement Charge, the Global Adjustment and the HST."]
[null,"MONTHLY RATES AND CHARGES - Delivery Component",null,null,null,null,null,"9_MRC_DEL",null,null,null,null,null,null,null,null,null,null,null,null,null,46,null,null,null,null,"MONTHLY RATES AND CHARGES - Delivery Component"]
[null,"Service Charge",null,"$",5.4,null,null,"9_MICROFIT SERVICE CLASSIFICATION","A",null,null,null,"9_MICROFIT SERVICE CLASSIFICATION_MSC",null,null,null,null,null,null,null,null,3,null,null,null,"Service Charge"]
[null,"ALLOWANCES",null,null,null,null,null,"ENERGY+ INC._ALLOWANCES",null,null,null,null,null,null,null,null,null,null,null,null,null,10]
[null,"Transformer Allowance for Ownership - per kW of billing demand/month",null,"$/kW",-0.6,null,null,null,null,null,null,null,null,null,null,null,null,null,null,null,null,4,null,null,null,"Transformer Allowance for Ownership - per kW of billing demand/month"]
[null,"Primary Metering Allowance for Transformer Losses - applied to measured demand & energy",null,"%",-1,null,null,null,null,null,null,null,null,null,null,null,null,null,null,null,null,2,null,null,null,"Primary Metering Allowance for Transformer Losses - applied to measured demand & energy",null,null,null,null,null,null,null,null,null,null,null,null,null,null,null,null,null,null,"X"]
[null,"SPECIFIC SERVICE CHARGES",null,null,null,null,null,"ENERGY+ INC._SSC",null,null,null,null,null,null,null,null,null,null,null,null,null,24]
[null,"The application of these rates and charges shall be in accordance with the Licence of the Distributor and any Code or Order of the Ontario Energy Board, and amendments thereto as approved by the Ontario Energy Board, which may be applicable to the administration of this schedule.",null,null,null,null,null,null,null,null,null,null,null,null,null,null,null,null,null,null,null,280,null,null,null,null,"The application of these rates and charges shall be in accordance with the Licence of the Distributor and any Code or Order of the Ontario Energy Board, and amendments thereto as approved by the Ontario Energy Board, which may be applicable to the administration of this schedule."]
[null,"No charges to meet the costs of any work or service done or furnished for the purpose of the distribution of electricity shall be made except as permitted by this schedule, unless required by the Distributor’s Licence or a Code or Order of the Ontario Energy Board, and amendments thereto as approved by the Ontario Energy Board, or as specified herein.",null,null,null,null,null,null,null,null,null,null,null,null,null,null,null,null,null,null,null,353,null,null,null,null,"No charges to meet the costs of any work or service done or furnished for the purpose of the distribution of electricity shall be made except as permitted by this schedule, unless required by the Distributor’s Licence or a Code or Order of the Ontario Energy Board, and amendments thereto as approved by the Ontario Energy Board, or as specified herein."]
[null,"It should be noted that this schedule does not list any charges, assessments, or credits that are required by law to be invoiced by a distributor and that are not subject to Ontario Energy Board approval, such as the Debt Retirement Charge, the Global Adjustment and the HST.",null,null,null,null,null,null,null,null,null,null,null,null,null,null,null,null,null,null,null,275,null,null,null,null,"It should be noted that this schedule does not list any charges, assessments, or credits that are required by law to be invoiced by a distributor and that are not subject to Ontario Energy Board approval, such as the Debt Retirement Charge, the Global Adjustment and the HST."]
[null,"Customer Administration",null,null,null,null,null,"ENERGY+ INC._CA",null,null,null,null,null,null,null,null,null,null,null,null,null,23]
[null,"Arrears certificate",null,"$",15,null,null,null,null,null,null,null,null,null,null,null,null,null,null,null,null,2,null,null,null,"Arrears certificate"]
[null,"Statement of account",null,"$",15,null,null,null,null,null,null,null,null,null,null,null,null,null,null,null,null,2,null,null,null,"Statement of account"]
[null,"Pulling post dated cheques",null,"$",15,null,null,null,null,null,null,null,null,null,null,null,null,null,null,null,null,2,null,null,null,"Pulling post dated cheques"]
[null,"Duplicate invoices for previous billing",null,"$",15,null,null,null,null,null,null,null,null,null,null,null,null,null,null,null,null,2,null,null,null,"Duplicate invoices for previous billing"]
[null,"Request for other billing information",null,"$",15,null,null,null,null,null,null,null,null,null,null,null,null,null,null,null,null,2,null,null,null,"Request for other billing information"]
[null,"Easement Letter",null,"$",15,null,null,null,null,null,null,null,null,null,null,null,null,null,null,null,null,2,null,null,null,"Easement Letter"]
[null,"Income tax letter",null,"$",15,null,null,null,null,null,null,null,null,null,null,null,null,null,null,null,null,2,null,null,null,"Income tax letter"]
[null,"Notification charge",null,"$",15,null,null,null,null,null,null,null,null,null,null,null,null,null,null,null,null,2,null,null,null,"Notification charge"]
[null,"Account history",null,"$",15,null,null,null,null,null,null,null,null,null,null,null,null,null,null,null,null,2,null,null,null,"Account history"]
[null,"Returned Cheque (plus bank charges)",null,"$",15,null,null,null,null,null,null,null,null,null,null,null,null,null,null,null,null,2,null,null,null,"Returned Cheque (plus bank charges)"]
[null,"Charge to certify cheque",null,"$",15,null,null,null,null,null,null,null,null,null,null,null,null,null,null,null,null,2,null,null,null,"Charge to certify cheque"]
[null,"Legal letter charge",null,"$",15,null,null,null,null,null,null,null,null,null,null,null,null,null,null,null,null,2,null,null,null,"Legal letter charge"]
[null,"Account set up charge/change of occupancy charge (plus credit agency costs if applicable)",null,"$",30,null,null,null,null,null,null,null,null,null,null,null,null,null,null,null,null,2,null,null,null,"Account set up charge/change of occupancy charge (plus credit agency costs if applicable)"]
[null,"Special meter reads",null,"$",30,null,null,null,null,null,null,null,null,null,null,null,null,null,null,null,null,2,null,null,null,"Special meter reads"]
[null,"Meter dispute charge plus Measurement Canada fees (if meter found correct)",null,"$",30,null,null,null,null,null,null,null,null,null,null,null,null,null,null,null,null,2,null,null,null,"Meter dispute charge plus Measurement Canada fees (if meter found correct)"]
[null,"Credit reference/credit check (plus credit agency costs)",null,"$",15,null,null,null,null,null,null,null,null,null,null,null,null,null,null,null,null,2,null,null,null,"Credit reference/credit check (plus credit agency costs)"]
[null,"Non-Payment of Account",null,null,null,null,null,"ENERGY+ INC._NPOA",null,null,null,null,null,null,null,null,null,null,null,null,null,22]
[null,"Late Payment - per month",null,"%",1.5,null,null,null,null,null,null,null,null,null,null,null,null,null,null,null,null,3,null,null,null,"Late Payment - per month"]
[null,"Late Payment - per annum",null,"%",19.559999999999999,null,null,null,null,null,null,null,null,null,null,null,null,null,null,null,null,5,null,null,null,"Late Payment - per annum"]
[null,"Collection of account charge - no disconnection - during regular business hours",null,"$",30,null,null,null,null,null,null,null,null,null,null,null,null,null,null,null,null,2,null,null,null,"Collection of account charge - no disconnection - during regular business hours"]
[null,"Collection of account charge - no disconnection - after regular hours",null,"$",165,null,null,null,null,null,null,null,null,null,null,null,null,null,null,null,null,3,null,null,null,"Collection of account charge - no disconnection - after regular hours"]
[null,"Disconnect/Reconnect at Meter - during regular hours",null,"$",65,null,null,null,null,null,null,null,null,null,null,null,null,null,null,null,null,2,null,null,null,"Disconnect/Reconnect at Meter - during regular hours"]
[null,"Disconnect/Reconnect at Meter - after regular hours",null,"$",185,null,null,null,null,null,null,null,null,null,null,null,null,null,null,null,null,3,null,null,null,"Disconnect/Reconnect at Meter - after regular hours"]
[null,"Disconnect/Reconnect at Pole - during regular hours",null,"$",185,null,null,null,null,null,null,null,null,null,null,null,null,null,null,null,null,3,null,null,null,"Disconnect/Reconnect at Pole - during regular hours"]
[null,"Disconnect/Reconnect at Pole - after regular hours",null,"$",415,null,null,null,null,null,null,null,null,null,null,null,null,null,null,null,null,3,null,null,null,"Disconnect/Reconnect at Pole - after regular hours"]
[null,"Install/Remove Load Control Device - during regular hours",null,"$",65,null,null,null,null,null,null,null,null,null,null,null,null,null,null,null,null,2,null,null,null,"Install/Remove Load Control Device - during regular hours"]
[null,"Install/Remove Load Control Device - after regular hours",null,"$",185,null,null,null,null,null,null,null,null,null,null,null,null,null,null,null,null,3,null,null,null,"Install/Remove Load Control Device - after regular hours"]
[null,"Other",null,null,null,null,null,null,null,null,null,null,null,null,null,null,null,null,null,null,null,5]
[null,"Specific charge for access to the power poles - $/pole/year                                                                                                                                                                                                                                                                                                                                                             (with the exception of wireless attachments)",null,"$",22.35,null,null,null,null,null,null,null,null,null,null,null,null,null,null,null,null,5,null,null,null,"Specific charge for access to the power poles - $/pole/year                                                                                                                                                                                                                                                                                                                                                             (with the exception of wireless attachments)"]
[null,"Service call - customer owned equipment",null,"$",30,null,null,null,null,null,null,null,null,null,null,null,null,null,null,null,null,2,null,null,null,"Service call - customer owned equipment"]
[null,"Service call - customer-owned equipment - after regular hours",null,"$",165,null,null,null,null,null,null,null,null,null,null,null,null,null,null,null,null,3,null,null,null,"Service call - customer-owned equipment - after regular hours",null,null,null,null,null,null,null,null,null,null,null,null,null,null,null,null,null,null,"X"]
[null,"RETAIL SERVICE CHARGES (if applicable)",null,null,null,null,null,"ENERGY+ INC._RSC",null,null,null,null,null,null,null,null,null,null,null,null,null,38]
[null,"The application of these rates and charges shall be in accordance with the Licence of the Distributor and any Code or Order of the Ontario Energy Board, and amendments thereto as approved by the Ontario Energy Board, which may be applicable to the administration of this schedule.",null,null,null,null,null,null,null,null,null,null,null,null,null,null,null,null,null,null,null,280,null,null,null,null,"The application of these rates and charges shall be in accordance with the Licence of the Distributor and any Code or Order of the Ontario Energy Board, and amendments thereto as approved by the Ontario Energy Board, which may be applicable to the administration of this schedule."]
[null,"No rates and charges for the distribution of electricity and charges to meet the costs of any work or service done or furnished for the purpose of the distribution of electricity shall be made except as permitted by this schedule, unless required by the Distributor’s Licence or a Code or Order of the Ontario Energy Board, and amendments thereto as approved by the Ontario Energy Board, or as specified herein.",null,null,null,null,null,null,null,null,null,null,null,null,null,null,null,null,null,null,null,411,null,null,null,null,"No rates and charges for the distribution of electricity and charges to meet the costs of any work or service done or furnished for the purpose of the distribution of electricity shall be made except as permitted by this schedule, unless required by the Distributor’s Licence or a Code or Order of the Ontario Energy Board, and amendments thereto as approved by the Ontario Energy Board, or as specified herein."]
[null,"Unless specifically noted, this schedule does not contain any charges for the electricity commodity, be it under the Regulated Price Plan, a contract with a retailer or the wholesale market price, as applicable.",null,null,null,null,null,null,null,null,null,null,null,null,null,null,null,null,null,null,null,211,null,null,null,null,"Unless specifically noted, this schedule does not contain any charges for the electricity commodity, be it under the Regulated Price Plan, a contract with a retailer or the wholesale market price, as applicable."]
[null,"It should be noted that this schedule does not list any charges, assessments, or credits that are required by law to be invoiced by a distributor and that are not subject to Ontario Energy Board approval, such as the Debt Retirement Charge, the Global Adjustment and the HST.",null,null,null,null,null,null,null,null,null,null,null,null,null,null,null,null,null,null,null,275,null,null,null,null,"It should be noted that this schedule does not list any charges, assessments, or credits that are required by law to be invoiced by a distributor and that are not subject to Ontario Energy Board approval, such as the Debt Retirement Charge, the Global Adjustment and the HST."]
[null,"Retail Service Charges refer to services provided by a distributor to retailers or customers related to the supply of competitive electricity.",null,null,null,null,null,null,null,null,null,null,null,null,null,null,null,null,null,null,null,142,null,null,null,null,"Retail Service Charges refer to services provided by a distributor to retailers or customers related to the supply of competitive electricity."]
[null,"One-time charge, per retailer, to establish the service agreement between the distributor and the retailer",null,"$",100,null,null,null,null,null,null,null,null,null,null,null,null,null,null,null,null,3,null,null,null,"One-time charge, per retailer, to establish the service agreement between the distributor and the retailer"]
[null,"Monthly Fixed Charge, per retailer",null,"$",20,null,null,null,null,null,null,null,null,null,null,null,null,null,null,null,null,2,null,null,null,"Monthly Fixed Charge, per retailer"]
[null,"Monthly Variable Charge, per customer, per retailer",null,"$/cust.",0.5,null,null,null,null,null,null,null,null,null,null,null,null,null,null,null,null,3,null,null,null,"Monthly Variable Charge, per customer, per retailer"]
[null,"Distributor-consolidated billing monthly charge, per customer, per retailer",null,"$/cust.",0.3,null,null,null,null,null,null,null,null,null,null,null,null,null,null,null,null,3,null,null,null,"Distributor-consolidated billing monthly charge, per customer, per retailer"]
[null,"Retailer-consolidated billing monthly credit, per customer, per retailer",null,"$/cust.",-0.3,null,null,null,null,null,null,null,null,null,null,null,null,null,null,null,null,4,null,null,null,"Retailer-consolidated billing monthly credit, per customer, per retailer"]
[null,"Service Transaction Requests (STR)",null,null,null,null,null,null,null,null,null,null,null,null,null,null,null,null,null,null,null,34,null,null,null,"Service Transaction Requests (STR)"]
[null,"Request fee, per request, applied to the requesting party",null,"$",0.25,null,null,null,null,null,null,null,null,null,null,null,null,null,null,null,null,4,null,null,null,"Request fee, per request, applied to the requesting party"]
[null,"Processing fee, per request, applied to the requesting party",null,"$",0.5,null,null,null,null,null,null,null,null,null,null,null,null,null,null,null,null,3,null,null,null,"Processing fee, per request, applied to the requesting party"]
[null,"Request for customer information as outlined in Section 10.6.3 and Chapter 11 of the Retail",null,null,null,null,null,null,null,null,null,null,null,null,null,null,null,null,null,null,null,91,null,null,null,"Request for customer information as outlined in Section 10.6.3 and Chapter 11 of the Retail"]
[null,"Settlement Code directly to retailers and customers, if not delivered electronically through the",null,null,null,null,null,null,null,null,null,null,null,null,null,null,null,null,null,null,null,96,null,null,null,"Settlement Code directly to retailers and customers, if not delivered electronically through the"]
[null,"Electronic Business Transaction (EBT) system, applied to the requesting party",null,null,null,null,null,null,null,null,null,null,null,null,null,null,null,null,null,null,null,77,null,null,null,"Electronic Business Transaction (EBT) system, applied to the requesting party"]
[null,"Up to twice a year",null,"$","no charge",null,null,null,null,null,null,null,null,null,null,null,null,null,null,null,null,9,null,null,null,"Up to twice a year"]
[null,"More than twice a year, per request (plus incremental delivery costs)",null,"$",2,null,null,null,null,null,null,null,null,null,null,null,null,null,null,null,null,1,null,null,null,"More than twice a year, per request (plus incremental delivery costs)"]
[null,"LOSS FACTORS",null,null,null,null,null,"ENERGY+ INC._LFS",null,null,null,null,null,null,null,null,null,null,null,null,null,12]
[null,"If the distributor is not capable of prorating changed loss factors jointly with distribution rates, the revised loss factors will be implemented upon the first subsequent billing for each billing cycle.",null,null,null,null,null,null,null,null,null,null,null,null,null,null,null,null,null,null,null,203,null,null,null,null,"If the distributor is not capable of prorating changed loss factors jointly with distribution rates, the revised loss factors will be implemented upon the first subsequent billing for each billing cycle."]
[null,"Total Loss Factor - Secondary Metered Customer < 5,000 kW",null,null,1.030684649944027,null,null,null,null,null,null,null,null,null,null,null,null,null,null,null,null,6,null,null,null,"Total Loss Factor - Secondary Metered Customer < 5,000 kW"]
[null,"Total Loss Factor - Secondary Metered Customer > 5,000 kW",null,null,1.014545,null,null,null,null,null,null,null,null,null,null,null,null,null,null,null,null,6,null,null,null,"Total Loss Factor - Secondary Metered Customer > 5,000 kW"]
[null,"Total Loss Factor - Primary Metered Customer < 5,000 kW",null,null,1.0203778034445867,null,null,null,null,null,null,null,null,null,null,null,null,null,null,null,null,6,null,null,null,"Total Loss Factor - Primary Metered Customer < 5,000 kW"]
[null,"Total Loss Factor - Primary Metered Customer > 5,000 kW",null,null,1.0044999999999999,null,"Energy+ Inc.-For Former Cambridge and North Dumfries Hydro Service Area_End",null,null,null,null,null,null,null,null,null,null,null,null,null,null,6,null,null,null,"Total Loss Factor - Primary Metered Customer > 5,000 kW"]

{"sheet":"5. 2-W Bill Impacts","index":6,"n_rows":383,"n_cols":79,"rows_kept":383,"cut":false,"hidden":false,"merged":[[341,11,342,11],[341,12,342,12],[209,3,209,4],[214,3,214,4],[219,3,219,4],[225,4,225,9],[226,4,226,6],[232,5,232,7],[232,8,232,10],[317,3,317,4],[322,3,322,4],[341,4,342,4],[160,3,160,4],[165,3,165,4],[171,4,171,9],[172,4,172,6],[178,5,178,7],[178,8,178,10],[178,11,178,12],[179,4,180,4],[179,11,180,11],[179,12,180,12],[100,3,100,5],[101,3,101,5],[92,3,92,5],[93,3,93,5],[94,3,94,5],[95,3,95,5],[96,3,96,5],[114,3,114,5],[107,3,107,5],[108,3,108,5],[109,3,109,5],[110,3,110,5],[111,3,111,5],[112,3,112,5],[103,3,103,5],[104,3,104,5],[105,3,105,5],[106,3,106,5],[113,3,113,5],[87,3,87,5],[88,3,88,5],[89,3,89,5],[90,3,90,5],[91,3,91,5],[28,3,28,5],[71,6,73,6],[81,3,81,5],[102,3,102,5],[74,3,74,5],[76,3,76,5],[77,3,77,5],[78,3,78,5],[79,3,79,5],[80,3,80,5],[71,3,73,5],[82,3,82,5],[83,3,83,5],[84,3,84,5],[85,3,85,5],[86,3,86,5],[97,3,97,5],[98,3,98,5],[99,3,99,5],[75,3,75,5],[71,13,71,14],[72,7,72,8],[72,9,72,10],[72,11,72,12],[72,13,72,14],[71,7,71,12],[2,2,2,10],[9,3,9,12],[10,3,10,12],[10,13,10,14],[11,3,11,13],[376,3,376,4],[381,3,381,4],[232,11,232,12],[233,4,234,4],[233,11,234,11],[233,12,234,12],[263,3,263,4],[268,3,268,4],[273,3,273,4],[279,4,279,9],[280,4,280,6],[286,5,286,7],[286,8,286,10],[286,11,286,12],[287,4,288,4],[287,11,288,11],[287,12,288,12],[327,3,327,4],[333,4,333,9],[334,4,334,6],[340,5,340,7],[340,8,340,10],[340,11,340,12],[371,3,371,4],[117,4,117,9],[118,4,118,6],[124,5,124,7],[124,8,124,10],[124,11,124,12],[125,4,126,4],[125,11,126,11],[125,12,126,12],[155,3,155,4]]}
[null,null,null,null,null,null,null,null,null,null,null,null,null,null,null,null,null,null,null,null,null,null,null,null,null,null,null,null,null,null,null,null,null,null,null,null,null,null,null,null,null,null,null,null,null,null,null,null,null,null,null,"YES",null,null,null,null,null,null,null,null,null,null,null,null,null,null,null,null,null,null,null,null,null,null,null,null,null,null,1]
[]
[]
[]
[]
[]
[]
[]
[]
[]
[]
[null,null,null,"The bill comparisons below must be provided for typical customers and consumption levels. Bill impacts must be provided for residential customers consuming 750 kWh per month and general service customers consuming 2,000 kWh per month and having a monthly demand of less than 50 kW. Include bill comparisons for Non-RPP (retailer) as well. The OEB has established that, when assessing the combined effects of the shift to fixed rates and other bill impacts associated with changes in the cost of distribution service, a utility shall evaluate the total bill impact for a low volume residential customer consuming at the distributor’s 10th consumption percentile19, to a minimum of 50 kWh per month. Refer to page 62 of Chapter 2 Filing Requirements For Electricity Distribution Rate Applications issued July 20, 2017.\n\nFor certain classes where one or more customers have unique consumption and demand patterns and which may be significantly impacted by the proposed rate changes, the distributor must show a typical comparison, and provide an explanation.\n\nNote:  \n1. For those classes that are not eligible for the RPP price, the weighted average price including Class B GA through end of May 2017 of $0.113/kWh (IESO's Monthly Market Report for May 2017, page 22) has been used to represent the cost of power. For those classes on a retailer contract, applicants should enter the contract price (plus GA) for a more accurate estimate. Changes to the cost of power can be made directly on the bill impact chart for the specific class.\n2. Due to the change to energy consumption used in the calculation of GA rate riders for the 2018 rate year, the separate “GA Rate Riders” line is only applicable to the “Proposed” section of the bill impact tables.\n3. Please enter the applicable billing determinant (e.g. number of connections or devices) to be applied to the monthly service charge for unmetered rate classes in column N. If the monthly service charge is applied on a per customer basis, enter the number “1”. Distributors should provide the number of connections or devices reflective of a typical customer in each class."]
[null,null,null,"Note that cells with the highlighted color shown to the left indicate quantities that are loss adjusted."]
[]
[]
[]
[]
[]
[]
[]
[]
[]
[]
[]
[]
[]
[]
[null,null,null,"Table 1"]
[null,null,null,"RATE CLASSES / CATEGORIES \n(eg: Residential TOU, Residential Retailer)",null,null,"Units","RPP?\nNon-RPP Retailer?\nNon-RPP\nOther?","Current \nLoss Factor \n(eg: 1.0351)","Proposed Loss Factor","Consumption (kWh)","Demand kW\n(if applicable)","RTSR\nDemand or \nDemand-Interval?","Billing Determinant Applied to Fixed Charge for Unmetered Classes (e.g. # of devices/connections)."]
[null,1,1,"RESIDENTIAL SERVICE CLASSIFICATION",null,null,"kWh","RPP",1.0335000000000001,1.030684649944027,750,null,"N/A",null,null,null,null,null,null,{"$f":"SUM(I30:L30)","v":752.06418464994408},78,null,null,null,null,null,null,null,null,null,null,null,null,null,null,null,null,null,null,null,null,null,null,null,1]
[null,2,2,"GENERAL SERVICE LESS THAN 50 kW SERVICE CLASSIFICATION",null,null,"kWh","RPP",1.0335000000000001,1.030684649944027,2000,null,"N/A",null,null,null,null,null,null,2002.0641846499441,{"$f":"U30+68","v":146},null,null,null,null,null,null,null,null,null,null,null,null,null,null,null,null,null,null,null,null,null,null,null,2]
[null,3,3,"GENERAL SERVICE 50 TO 4,999 KW SERVICE CLASSIFICATION",null,null,"kW","Non-RPP (Other)",1.0335000000000001,1.030684649944027,20000,60,"DEMAND",null,null,null,null,null,null,20062.064184649946,{"$f":"U31+68","v":214},null,null,null,null,null,null,null,null,null,null,null,null,null,null,null,null,null,null,null,null,null,null,null,3]
[null,4,4,"UNMETERED SCATTERED LOAD SERVICE CLASSIFICATION",null,null,"kWh","Non-RPP (Other)",1.0335000000000001,1.030684649944027,100,null,"N/A",1,null,null,null,null,null,102.06418464994402,282,null,null,null,null,null,null,null,null,null,null,null,null,null,null,null,null,null,null,null,null,null,null,null,4]
[null,5,5,"SENTINEL LIGHTING SERVICE CLASSIFICATION",null,null,null,null,null,null,null,null,"N/A",null,null,null,null,null,null,0,350,null,null,null,null,null,null,null,null,null,null,null,null,null,null,null,null,null,null,null,null,null,null,null,5]
[null,6,6,"STREET LIGHTING SERVICE CLASSIFICATION",null,null,"kW","Non-RPP (Other)",1.0335000000000001,1.030684649944027,400000,700,"DEMAND",547,null,null,null,null,null,400702.06418464996,418,null,null,null,null,null,null,null,null,null,null,null,null,null,null,null,null,null,null,null,null,null,null,null,6]
[null,7,7,"Add additional scenarios if required",null,null,null,null,null,null,null,null,null,null,null,null,null,null,null,0,486,null,null,null,null,null,null,null,null,null,null,null,null,null,null,null,null,null,null,null,null,null,null,null,7]
[null,8,8,"Add additional scenarios if required",null,null,null,null,null,null,null,null,null,null,null,null,null,null,null,0,null,null,null,null,null,null,null,null,null,null,null,null,null,null,null,null,null,null,null,null,null,null,null,null,8]
[null,9,9,"Add additional scenarios if required",null,null,null,null,null,null,null,null,null,null,null,null,null,null,null,0,null,null,null,null,null,null,null,null,null,null,null,null,null,null,null,null,null,null,null,null,null,null,null,null,9]
[null,10,{"$f":"IF(ISERROR(VLOOKUP(D39, D30:AS69, 42, FALSE)),\"\", VLOOKUP(D39, D30:AS69, 42, FALSE))","v":7},"Add additional scenarios if required",null,null,null,null,null,null,null,null,null,null,null,null,null,null,null,0]
[null,11,{"$f":"IF(ISERROR(VLOOKUP(D40, D30:AS69, 42, FALSE)),\"\", VLOOKUP(D40, D30:AS69, 42, FALSE))","v":7},"Add additional scenarios if required",null,null,null,null,null,null,null,null,null,null,null,null,null,null,null,0]
[null,12,{"$f":"IF(ISERROR(VLOOKUP(D41, D30:AS69, 42, FALSE)),\"\", VLOOKUP(D41, D30:AS69, 42, FALSE))","v":7},"Add additional scenarios if required",null,null,null,null,null,null,null,null,null,null,null,null,null,null,null,0]
[null,13,{"$f":"IF(ISERROR(VLOOKUP(D42, D30:AS69, 42, FALSE)),\"\", VLOOKUP(D42, D30:AS69, 42, FALSE))","v":7},"Add additional scenarios if required",null,null,null,null,null,null,null,null,null,null,null,null,null,null,null,0]
[null,14,{"$f":"IF(ISERROR(VLOOKUP(D43, D30:AS69, 42, FALSE)),\"\", VLOOKUP(D43, D30:AS69, 42, FALSE))","v":7},"Add additional scenarios if required",null,null,null,null,null,null,null,null,null,null,null,null,null,null,null,0]
[null,15,{"$f":"IF(ISERROR(VLOOKUP(D44, D30:AS69, 42, FALSE)),\"\", VLOOKUP(D44, D30:AS69, 42, FALSE))","v":7},"Add additional scenarios if required",null,null,null,null,null,null,null,null,null,null,null,null,null,null,null,0]
[null,16,{"$f":"IF(ISERROR(VLOOKUP(D45, D30:AS69, 42, FALSE)),\"\", VLOOKUP(D45, D30:AS69, 42, FALSE))","v":7},"Add additional scenarios if required",null,null,null,null,null,null,null,null,null,null,null,null,null,null,null,0]
[null,17,{"$f":"IF(ISERROR(VLOOKUP(D46, D30:AS69, 42, FALSE)),\"\", VLOOKUP(D46, D30:AS69, 42, FALSE))","v":7},"Add additional scenarios if required",null,null,null,null,null,null,null,null,null,null,null,null,null,null,null,0]
[null,18,{"$f":"IF(ISERROR(VLOOKUP(D47, D30:AS69, 42, FALSE)),\"\", VLOOKUP(D47, D30:AS69, 42, FALSE))","v":7},"Add additional scenarios if required",null,null,null,null,null,null,null,null,null,null,null,null,null,null,null,0]
[null,19,{"$f":"IF(ISERROR(VLOOKUP(D48, D30:AS69, 42, FALSE)),\"\", VLOOKUP(D48, D30:AS69, 42, FALSE))","v":7},"Add additional scenarios if required",null," ",null,null,null,null,null,null,null,null,null,null,null,null,null,0]
[null,20,{"$f":"IF(ISERROR(VLOOKUP(D49, D30:AS69, 42, FALSE)),\"\", VLOOKUP(D49, D30:AS69, 42, FALSE))","v":7},"Add additional scenarios if required",null,null,null,null,null,null,null,null,null,null,null,null,null,null,null,0]
[null,21,{"$f":"IF(ISERROR(VLOOKUP(D50, D30:AS69, 42, FALSE)),\"\", VLOOKUP(D50, D30:AS69, 42, FALSE))","v":7},"Add additional scenarios if required",null,null,null,null,null,null,null,null,null,null,null,null,null,null,null,0]
[null,22,{"$f":"IF(ISERROR(VLOOKUP(D51, D30:AS69, 42, FALSE)),\"\", VLOOKUP(D51, D30:AS69, 42, FALSE))","v":7},"Add additional scenarios if required",null,null,null,null,null,null,null,null,null,null,null,null,null,null,null,0]
[null,23,{"$f":"IF(ISERROR(VLOOKUP(D52, D30:AS69, 42, FALSE)),\"\", VLOOKUP(D52, D30:AS69, 42, FALSE))","v":7},"Add additional scenarios if required",null,null,null,null,null,null,null,null,null,null,null,null,null,null,null,0]
[null,24,{"$f":"IF(ISERROR(VLOOKUP(D53, D30:AS69, 42, FALSE)),\"\", VLOOKUP(D53, D30:AS69, 42, FALSE))","v":7},"Add additional scenarios if required",null,null,null,null,null,null,null,null,null,null,null,null,null,null,null,0]
[null,25,{"$f":"IF(ISERROR(VLOOKUP(D54, D30:AS69, 42, FALSE)),\"\", VLOOKUP(D54, D30:AS69, 42, FALSE))","v":7},"Add additional scenarios if required",null,null,null,null,null,null,null,null,null,null,null,null,null,null,null,0]
[null,26,{"$f":"IF(ISERROR(VLOOKUP(D55, D30:AS69, 42, FALSE)),\"\", VLOOKUP(D55, D30:AS69, 42, FALSE))","v":7},"Add additional scenarios if required",null,null,null,null,null,null,null,null,null,null,null,null,null,null,null,0]
[null,27,{"$f":"IF(ISERROR(VLOOKUP(D56, D30:AS69, 42, FALSE)),\"\", VLOOKUP(D56, D30:AS69, 42, FALSE))","v":7},"Add additional scenarios if required",null,null,null,null,null,null,null,null,null,null,null,null,null,null,null,0]
[null,28,{"$f":"IF(ISERROR(VLOOKUP(D57, D30:AS69, 42, FALSE)),\"\", VLOOKUP(D57, D30:AS69, 42, FALSE))","v":7},"Add additional scenarios if required",null,null,null,null,null,null,null,null,null,null,null,null,null,null,null,0,{"$f":"U36+68","v":554},null,null,null,null,null,null,null,null,null,null,null,null,null,null,null,null,null,null,null,null,null,null,null,8]
[null,29,{"$f":"IF(ISERROR(VLOOKUP(D58, D30:AS69, 42, FALSE)),\"\", VLOOKUP(D58, D30:AS69, 42, FALSE))","v":7},"Add additional scenarios if required",null,null,null,null,null,null,null,null,null,null,null,null,null,null,null,0,{"$f":"U57+68","v":622},null,null,null,null,null,null,null,null,null,null,null,null,null,null,null,null,null,null,null,null,null,null,null,9]
[null,30,{"$f":"IF(ISERROR(VLOOKUP(D59, D30:AS69, 42, FALSE)),\"\", VLOOKUP(D59, D30:AS69, 42, FALSE))","v":7},"Add additional scenarios if required",null,null,null,null,null,null,null,null,null,null,null,null,null,null,null,0,690,null,null,null,null,null,null,null,null,null,null,null,null,null,null,null,null,null,null,null,null,null,null,null,10]
[null,31,{"$f":"IF(ISERROR(VLOOKUP(D60, D30:AS69, 42, FALSE)),\"\", VLOOKUP(D60, D30:AS69, 42, FALSE))","v":7},"Add additional scenarios if required",null,null,null,null,null,null,null,null,null,null,null,null,null,null,null,0,758]
[null,32,{"$f":"IF(ISERROR(VLOOKUP(D61, D30:AS69, 42, FALSE)),\"\", VLOOKUP(D61, D30:AS69, 42, FALSE))","v":7},"Add additional scenarios if required",null,null,null,null,null,null,null,null,null,null,null,null,null,null,null,0,826]
[null,33,{"$f":"IF(ISERROR(VLOOKUP(D62, D30:AS69, 42, FALSE)),\"\", VLOOKUP(D62, D30:AS69, 42, FALSE))","v":7},"Add additional scenarios if required",null,null,null,null,null,null,null,null,null,null,null,null,null,null,null,0,894]
[null,34,{"$f":"IF(ISERROR(VLOOKUP(D63, D30:AS69, 42, FALSE)),\"\", VLOOKUP(D63, D30:AS69, 42, FALSE))","v":7},"Add additional scenarios if required",null,null,null,null,null,null,null,null,null,null,null,null,null,null,null,0,962]
[null,35,{"$f":"IF(ISERROR(VLOOKUP(D64, D30:AS69, 42, FALSE)),\"\", VLOOKUP(D64, D30:AS69, 42, FALSE))","v":7},"Add additional scenarios if required",null,null,null,null,null,null,null,null,null,null,null,null,null,null,null,0,1030]
[null,36,{"$f":"IF(ISERROR(VLOOKUP(D65, D30:AS69, 42, FALSE)),\"\", VLOOKUP(D65, D30:AS69, 42, FALSE))","v":7},"Add additional scenarios if required",null,null,null,null,null,null,null,null,null,null,null,null,null,null,null,0,1098]
[null,37,{"$f":"IF(ISERROR(VLOOKUP(D66, D30:AS69, 42, FALSE)),\"\", VLOOKUP(D66, D30:AS69, 42, FALSE))","v":7},"Add additional scenarios if required",null,null,null,null,null,null,null,null,null,null,null,null,null,null,null,0,1166]
[null,38,{"$f":"IF(ISERROR(VLOOKUP(D67, D30:AS69, 42, FALSE)),\"\", VLOOKUP(D67, D30:AS69, 42, FALSE))","v":7},"Add additional scenarios if required",null,null,null,null,null,null,null,null,null,null,null,null,null,null,null,0,1234]
[null,39,{"$f":"IF(ISERROR(VLOOKUP(D68, D30:AS69, 42, FALSE)),\"\", VLOOKUP(D68, D30:AS69, 42, FALSE))","v":7},"Add additional scenarios if required",null,null,null,null,null,null,null,null,null,null,null,null,null,null,null,0,1302]
[null,40,{"$f":"IF(ISERROR(VLOOKUP(D69, D30:AS69, 42, FALSE)),\"\", VLOOKUP(D69, D30:AS69, 42, FALSE))","v":7},"Add additional scenarios if required",null,null,null,null,null,null,null,null,null,null,null,null,null,null,null,0,1370]
[]
[null,null,null,"Table 2"]
[null,null,null,"RATE CLASSES / CATEGORIES \n(eg: Residential TOU, Residential Retailer)",null,null,"Units","Sub-Total",null,null,null,null,null,"Total (After Tax)"]
[null,null,null,null,null,null,null,"A",null,"B",null,"C"]
[null,null,null,null,null,null,null,"$","%","$","%","$","%","$","%"]
[null,{"$f":"H30","v":"RPP"},1,{"$f":"IF(ISBLANK(D30), \"\", IF(D30 = \"Add additional scenarios if required\", \"\", IF(M30=\"YES\", D30 & \" - \" & H30 & \" - Interval Customers\", D30 & \" - \" &H30)))","v":"RESIDENTIAL SERVICE CLASSIFICATION - RPP"},null,null,{"$f":"IF(ISBLANK(G30), \"\", G30)","v":"kWh"},{"$f":"IF(LEN($G75)>1, (SUMPRODUCT(--($C$118:$C$1000=$B30), --($A$118:$A$1000=$D30), --($B$118:$B$1000=\"ST_A\"), $L$118:$L$1000)), \"\")","v":2.5299999999999976},{"$f":"IF(LEN($G75)>1, (SUMPRODUCT(--($C$118:$C$1000=$B30), --($A$118:$A$1000=$D30), --($B$118:$B$1000=\"ST_A\"), $M$118:$M$1000)), \"\")","v":0.10201612903225796},{"$f":"IF(LEN($G75)>1, (SUMPRODUCT(--($C$118:$C$1000=$B30), --($A$118:$A$1000=$D30), --($B$118:$B$1000=\"ST_B\"), $L$118:$L$1000)), \"\")","v":525.03151812955093},{"$f":"IF(LEN($G75)>1, (SUMPRODUCT(--($C$118:$C$1000=$B30), --($A$118:$A$1000=$D30), --($B$118:$B$1000=\"ST_B\"), $M$118:$M$1000)), \"\")","v":23.043596223602982},{"$f":"IF(LEN($G75)>1, (SUMPRODUCT(--($C$118:$C$1000=$B30), --($A$118:$A$1000=$D30), --($B$118:$B$1000=\"ST_C\"), $L$118:$L$1000)), \"\")","v":524.46866010914789},{"$f":"IF(LEN($G75)>1, (SUMPRODUCT(--($C$118:$C$1000=$B30), --($A$118:$A$1000=$D30), --($B$118:$B$1000=\"ST_C\"), $M$118:$M$1000)), \"\")","v":17.045881434313742},{"$f":"IF(LEN($G75)>1, (SUMPRODUCT(--($C$118:$C$1000=$B30), --($A$118:$A$1000=$D30), --($B$118:$B$1000=$B75&\"_TOTAL\"), $L$118:$L$1000)), \"\")","v":550.44083405746426},{"$f":"IF(LEN($G75)>1, (SUMPRODUCT(--($C$118:$C$1000=$B30), --($A$118:$A$1000=$D30), --($B$118:$B$1000=$B75&\"_TOTAL\"), $M$118:$M$1000)), \"\")","v":5.4978908795761745}]
[null,null,null,"GENERAL SERVICE LESS THAN 50 kW SERVICE CLASSIFICATION - RPP",null,null,{"$f":"IF(ISBLANK(G31), \"\", G31)","v":"kWh"},{"$f":"IF(LEN($G76)>1, (SUMPRODUCT(--($C$118:$C$1000=$B31), --($A$118:$A$1000=$D31), --($B$118:$B$1000=\"ST_A\"), $L$118:$L$1000)), \"\")","v":4.4399999999999977},{"$f":"IF(LEN($G76)>1, (SUMPRODUCT(--($C$118:$C$1000=$B31), --($A$118:$A$1000=$D31), --($B$118:$B$1000=\"ST_A\"), $M$118:$M$1000)), \"\")","v":0.1029207232267037},{"$f":"IF(LEN($G76)>1, (SUMPRODUCT(--($C$118:$C$1000=$B31), --($A$118:$A$1000=$D31), --($B$118:$B$1000=\"ST_B\"), $L$118:$L$1000)), \"\")","v":2.1773816788024902},{"$f":"IF(LEN($G76)>1, (SUMPRODUCT(--($C$118:$C$1000=$B31), --($A$118:$A$1000=$D31), --($B$118:$B$1000=\"ST_B\"), $M$118:$M$1000)), \"\")","v":5.8824750769490897E-2},{"$f":"IF(LEN($G76)>1, (SUMPRODUCT(--($C$118:$C$1000=$B31), --($A$118:$A$1000=$D31), --($B$118:$B$1000=\"ST_C\"), $L$118:$L$1000)), \"\")","v":-9.2125149816229026},{"$f":"IF(LEN($G76)>1, (SUMPRODUCT(--($C$118:$C$1000=$B31), --($A$118:$A$1000=$D31), --($B$118:$B$1000=\"ST_C\"), $M$118:$M$1000)), \"\")","v":-0.16381351520423271},{"$f":"IF(LEN($G76)>1, (SUMPRODUCT(--($C$118:$C$1000=$B31), --($A$118:$A$1000=$D31), --($B$118:$B$1000=$B76&\"_TOTAL\"), $L$118:$L$1000)), \"\")","v":0},{"$f":"IF(LEN($G76)>1, (SUMPRODUCT(--($C$118:$C$1000=$B31), --($A$118:$A$1000=$D31), --($B$118:$B$1000=$B76&\"_TOTAL\"), $M$118:$M$1000)), \"\")","v":0}]
[null,{"$f":"H31","v":"RPP"},2,"GENERAL SERVICE 50 TO 4,999 KW SERVICE CLASSIFICATION - Non-RPP (Other)",null,null,{"$f":"IF(ISBLANK(G31), \"\", G31)","v":"kWh"},0,0,0,0,0,0,0,0]
[null,"Non-RPP (Other)",3,"UNMETERED SCATTERED LOAD SERVICE CLASSIFICATION - Non-RPP (Other)",null,null,"kW",7.0000000000000284E-2,9.790209790209831E-3,4.7805179635381556E-2,6.6131236409990761E-3,3.9595180855656054E-3,4.8345823200829369E-4,-3.1579425143551276E-2,-1.3792709024061519E-3]
[null,"Non-RPP (Other)",4,"SENTINEL LIGHTING SERVICE CLASSIFICATION - ",null,null,"kWh",0,0,0,0,0,0,0,0]
[null,0,5,"STREET LIGHTING SERVICE CLASSIFICATION - Non-RPP (Other)",null,null,"","","","","","","","",""]
[null,"Non-RPP (Other)",6,"",null,null,"kW",0,0,0,0,0,0,0,0]
[null,0,7,"",null,null,"","","","","","","","",""]
[null,0,8,"",null,null,"","","","","","","","",""]
[null,0,9,"",null,null,"","","","","","","","",""]
[null,0,10,"",null,null,"","","","","","","","",""]
[null,0,11,"",null,null,"","","","","","","","",""]
[null,0,12,"",null,null,"","","","","","","","",""]
[null,0,13,"",null,null,"","","","","","","","",""]
[null,0,14,"",null,null,"","","","","","","","",""]
[null,0,15,"",null,null,"","","","","","","","",""]
[null,0,16,"",null,null,"","","","","","","","",""]
[null,0,17,"",null,null,"","","","","","","","",""]
[null,0,18,"",null,null,"","","","","","","","",""]
[null,0,19,"",null,null,"","","","","","","","",""]
[null,0,20,"",null,null,"","","","","","","","",""]
[null,0,21,"",null,null,"","","","","","","","",""]
[null,0,22,"",null,null,"","","","","","","","",""]
[null,0,23,"",null,null,"","","","","","","","",""]
[null,0,24,"",null,null,"","","","","","","","",""]
[null,0,25,"",null,null,"","","","","","","","",""]
[null,0,26,"",null,null,"","","","","","","","",""]
[null,0,27,"",null,null,"","","","","","","","",""]
[null,0,28,"",null,null,"","","","","","","","",""]
[null,0,29,"",null,null,"","","","","","","","",""]
[null,0,30,"",null,null,"","","","","","","","",""]
[null,0,31,"",null,null,"","","","","","","","",""]
[null,0,32,"",null,null,"","","","","","","","",""]
[null,0,33,"",null,null,"","","","","","","","",""]
[null,0,34,"",null,null,"","","","","","","","",""]
[null,0,35,"",null,null,"","","","","","","","",""]
[null,0,36,"",null,null,"","","","","","","","",""]
[null,0,37,"",null,null,"","","","","","","","",""]
[null,0,38,"",null,null,"","","","","","","","",""]
[null,0,39,"",null,null,"","","","","","","","",""]
[null,0,40,{"$f":"IF(ISBLANK(D69), \"\", IF(D69 = \"Add additional scenarios if required\", \"\", IF(M69=\"YES\", D69 & \" - \" & H69 & \" - Interval Customers\", D69 & \" - \" &H69)))","v":""},null,null,"",{"$f":"IF(LEN($G115)>1, ( SUMPRODUCT(--(#REF!=$B69), --(#REF!=$D69), --(#REF!=\"ST_A\"),#REF!)), \"\")","v":""},{"$f":"IF(LEN($G115)>1, ( SUMPRODUCT(--(#REF!=$B69), --(#REF!=$D69), --(#REF!=\"ST_A\"),#REF!)), \"\")","v":""},{"$f":"IF(LEN($G115)>1, ( SUMPRODUCT(--(#REF!=$B69), --(#REF!=$D69), --(#REF!=\"ST_B\"),#REF!)), \"\")","v":""},{"$f":"IF(LEN($G115)>1, ( SUMPRODUCT(--(#REF!=$B69), --(#REF!=$D69), --(#REF!=\"ST_B\"),#REF!)), \"\")","v":""},{"$f":"IF(LEN($G115)>1, ( SUMPRODUCT(--(#REF!=$B69), --(#REF!=$D69), --(#REF!=\"ST_C\"),#REF!)), \"\")","v":""},{"$f":"IF(LEN($G115)>1, ( SUMPRODUCT(--(#REF!=$B69), --(#REF!=$D69), --(#REF!=\"ST_C\"),#REF!)), \"\")","v":""},{"$f":"IF(LEN($G115)>1, ( SUMPRODUCT(--(#REF!=$B69), --(#REF!=$D69), --(#REF!=$B115&\"_TOTAL\"),#REF!)), \"\")","v":""},{"$f":"IF(LEN($G115)>1, ( SUMPRODUCT(--(#REF!=$B69), --(#REF!=$D69), --(#REF!=$B115&\"_TOTAL\"),#REF!)), \"\")","v":""}]
[]
[]
[null,null,null,"Customer Class:",{"$f":"D30","v":"RESIDENTIAL SERVICE CLASSIFICATION"},null,null,null,null,null,{"$f":"IF(N30=\"DEMAND - INTERVAL\",\"RTSR - INTERVAL METERED\",\"\")","v":""},null,null,null,null,null,null,null,null,"X"]
[null,null,null,"RPP / Non-RPP:",{"$f":"H30","v":"RPP"}]
[null,null,null,"Consumption",{"$f":"K30","v":750},"kWh"]
[null,null,null,"Demand",{"$f":"L30","v":0},"kW"]
[null,null,null,"Current Loss Factor",{"$f":"I30","v":1.0335000000000001}]
[null,null,null,"Proposed/Approved Loss Factor",{"$f":"J30","v":1.030684649944027}]
[]
[null,null,null,null,null,"Current OEB-Approved",null,null,"Proposed",null,null,"Impact"]
[null,null,null,null,null,"Rate","Volume","Charge","Rate","Volume","Charge","$ Change","% Change"]
[null,null,null,null,null,"($)",null,"($)","($)",null,"($)"]
[{"$f":"$E118","v":"RESIDENTIAL SERVICE CLASSIFICATION"},null,null,"Monthly Service Charge",null,21.35,1,{"$f":"G128*F128","v":21.35},27.33,{"$f":"G128","v":1},{"$f":"J128*I128","v":27.33},{"$f":"K128-H128","v":5.9799999999999969},{"$f":"IF(ISERROR(L128/H128), \"\", L128/H128)","v":0.28009367681498815}]
[{"$f":"A128","v":"RESIDENTIAL SERVICE CLASSIFICATION"},null,null,"Distribution Volumetric Rate",null,4.5999999999999999E-3,{"$f":"IF($E121>0, $E121, $E120)","v":750},{"$f":"G129*F129","v":3.4499999999999997},0,{"$f":"IF($E121>0, $E121, $E120)","v":750},{"$f":"J129*I129","v":0},-3.4499999999999997,{"$f":"IF(ISERROR(L129/H129), \"\", L129/H129)","v":-1}]
[{"$f":"A129","v":"RESIDENTIAL SERVICE CLASSIFICATION"},null,null,"Fixed Rate Riders",null,0,1,0,0,{"$f":"G130","v":1},{"$f":"J130*I130","v":0},0,""]
["RESIDENTIAL SERVICE CLASSIFICATION",null,null,"Volumetric Rate Riders",null,0,{"$f":"IF($E121>0, $E121, $E120)","v":750},0,0,{"$f":"IF($E121>0, $E121, $E120)","v":750},0,0,""]
["RESIDENTIAL SERVICE CLASSIFICATION","ST_A",{"$f":"B30","v":1},"Sub-Total A (excluding pass through)",null,null,null,{"$f":"SUM(H128:H131)","v":24.8},null,null,{"$f":"SUM(K128:K131)","v":27.33},2.5299999999999976,{"$f":"IF((H132)=0,\"\",(L132/H132))","v":0.10201612903225796}]
["RESIDENTIAL SERVICE CLASSIFICATION",null,null,"Line Losses on Cost of Power",null,{"$f":"IF((E120*12>=150000), 0, IF(E119=\"RPP\",(F147*0.65+F148*0.17+F149*0.18),IF(E119=\"Non-RPP (Retailer)\",F150,F151)))","v":8.2160000000000011E-2},{"$f":"IF(F133=0, 0, $E120*E122-E120)","v":25.125000000000114},{"$f":"G133*F133","v":2.0642700000000098},{"$f":"IF((E120*12>=150000), 0, IF(E119=\"RPP\",(I147*0.65+I148*0.17+I149*0.18),IF(E119=\"Non-RPP (Retailer)\",I150,I151)))","v":8.2160000000000011E-2},{"$f":"IF(I133=0, 0, E120*E123-E120)","v":23.013487458020222},{"$f":"J133*I133","v":1.8907881295509417},{"$f":"K133-H133","v":-0.17348187044906815},{"$f":"IF(ISERROR(L133/H133), \"\", L133/H133)","v":-8.404030017830387E-2}]
["RESIDENTIAL SERVICE CLASSIFICATION",null,null,"Total Deferral/Variance Account Rate Riders",null,-6.3E-3,{"$f":"IF($E121>0, $E121, $E120)","v":750},-4.7249999999999996,0.69030000000000002,{"$f":"IF($E121>0, $E121, $E120)","v":750},517.72500000000002,522.45000000000005,-110.57142857142858]
["RESIDENTIAL SERVICE CLASSIFICATION",null,null,"GA Rate Riders",null,0,{"$f":"E120","v":750},0,0,{"$f":"E120","v":750},0,0,""]
["RESIDENTIAL SERVICE CLASSIFICATION",null,null,"Low Voltage Service Charge",null,1E-4,{"$f":"IF($E121>0, $E121, $E120)","v":750},7.4999999999999997E-2,4.0000000000000002E-4,{"$f":"IF($E121>0, $E121, $E120)","v":750},0.3,0.22499999999999998,3]
["RESIDENTIAL SERVICE CLASSIFICATION",null,null,"Smart Meter Entity Charge (if applicable)",null,0.56999999999999995,1,{"$f":"G137*F137","v":0.56999999999999995},0.56999999999999995,1,{"$f":"J137*I137","v":0.56999999999999995},0,{"$f":"IF(ISERROR(L137/H137), \"\", L137/H137)","v":0}]
["RESIDENTIAL SERVICE CLASSIFICATION","ST_B",{"$f":"B30","v":1},"Sub-Total B - Distribution (includes Sub-Total A)",null,null,null,{"$f":"SUM(H132:H137)","v":22.78427000000001},null,null,{"$f":"SUM(K132:K137)","v":547.81578812955092},525.03151812955093,{"$f":"IF((H138)=0,\"\",(L138/H138))","v":23.043596223602982}]
["RESIDENTIAL SERVICE CLASSIFICATION",null,null,"RTSR - Network",null,5.8999999999999999E-3,{"$f":"IF($E121>0, $E121, $E120*$E122)","v":775.12500000000011},{"$f":"G139*F139","v":4.5732375000000003},5.4999999999999997E-3,{"$f":"IF($E121>0, $E121, $E120*$E123)","v":773.01348745802022},{"$f":"J139*I139","v":4.2515741810191106},-0.32166331898088973,{"$f":"IF(ISERROR(L139/H139), \"\", L139/H139)","v":-7.0336018844612755E-2}]
["RESIDENTIAL SERVICE CLASSIFICATION",null,null,"RTSR - Connection and/or Line and Transformation Connection",null,4.4000000000000003E-3,{"$f":"IF($E121>0, $E121, $E120*$E122)","v":775.12500000000011},{"$f":"G140*F140","v":3.4105500000000006},4.1000000000000003E-3,{"$f":"IF($E121>0, $E121, $E120*$E123)","v":773.01348745802022},{"$f":"J140*I140","v":3.1693552985778832},-0.24119470142211741,{"$f":"IF(ISERROR(L140/H140), \"\", L140/H140)","v":-7.0720177514511554E-2}]
["RESIDENTIAL SERVICE CLASSIFICATION","ST_C",{"$f":"B30","v":1},"Sub-Total C - Delivery (including Sub-Total B)",null,null,null,{"$f":"SUM(H138:H140)","v":30.768057500000012},null,null,{"$f":"SUM(K138:K140)","v":555.23671760914795},524.46866010914789,{"$f":"IF((H141)=0,\"\",(L141/H141))","v":17.045881434313742}]
["RESIDENTIAL SERVICE CLASSIFICATION",null,null,"Wholesale Market Service Charge (WMSC)",null,3.2000000000000002E-3,{"$f":"E120*E122","v":775.12500000000011},{"$f":"G142*F142","v":2.4804000000000004},3.2000000000000002E-3,{"$f":"E120*E123","v":773.01348745802022},{"$f":"J142*I142","v":2.4736431598656647},-6.7568401343356399E-3,{"$f":"IF(ISERROR(L142/H142), \"\", L142/H142)","v":-2.7240929424026928E-3}]
["RESIDENTIAL SERVICE CLASSIFICATION",null,null,"Rural and Remote Rate Protection (RRRP)",null,2.9999999999999997E-4,{"$f":"E120*E122","v":775.12500000000011},0.23253750000000001,0,{"$f":"E120*E123","v":773.01348745802022},0,-0.23253750000000001,-1]
["RESIDENTIAL SERVICE CLASSIFICATION",null,null,"Standard Supply Service Charge",null,0.25,1,0.25,0.25,1,0.25,0,0]
["RESIDENTIAL SERVICE CLASSIFICATION",null,null,"Debt Retirement Charge (DRC)"]
["RESIDENTIAL SERVICE CLASSIFICATION",null,null,"Ontario Electricity Support Program \n(OESP) ",null,null,{"$f":"E120*E123","v":773.01348745802022},0,null,{"$f":"E120*E123","v":773.01348745802022},0,0,""]
["RESIDENTIAL SERVICE CLASSIFICATION","RPP",null,"TOU - Off Peak",null,{"$f":"OffPeak","v":6.5000000000000002E-2},{"$f":"IF(AND(E120*12>=150000),0.65*E120*E122,0.65*E120)","v":487.5},31.6875,{"$f":"OffPeak","v":6.5000000000000002E-2},{"$f":"IF(AND(E120*12>=150000),0.65*E120*E123,0.65*E120)","v":487.5},31.6875,0,0]
["RESIDENTIAL SERVICE CLASSIFICATION","RPP",null,"TOU - Mid Peak",null,{"$f":"MidPeak","v":9.5000000000000001E-2},{"$f":"IF(AND(E120*12>=150000),0.17*E120*E122,0.17*E120)","v":127.50000000000001},12.112500000000001,{"$f":"MidPeak","v":9.5000000000000001E-2},{"$f":"IF(AND(E120*12>=150000),0.17*E120*E123,0.17*E120)","v":127.50000000000001},12.112500000000001,0,0]
["RESIDENTIAL SERVICE CLASSIFICATION","RPP",null,"TOU - On Peak",null,{"$f":"OnPeak","v":0.13200000000000001},{"$f":"IF(AND(E120*12>=150000),0.18*E120*E122,0.18*E120)","v":135},17.82,{"$f":"OnPeak","v":0.13200000000000001},{"$f":"IF(AND(E120*12>=150000),0.18*E120*E123,0.18*E120)","v":135},17.82,0,0]
["RESIDENTIAL SERVICE CLASSIFICATION","Non-RPP (Retailer)",null,"Non-RPP Retailer Avg. Price",null,{"$f":"0.1101","v":0.1101},{"$f":"IF(AND(E120*12>=150000),E120*E122,E120)","v":750},{"$f":"G150*F150","v":82.575000000000003},{"$f":"F150","v":0.1101},{"$f":"IF(AND(E120*12>=150000),E120*E123,E120)","v":750},{"$f":"J150*I150","v":82.575000000000003},0,0]
["RESIDENTIAL SERVICE CLASSIFICATION","Non-RPP (Other)",null,"Average IESO Wholesale Market Price",null,{"$f":"0.1101","v":0.1101},{"$f":"IF(AND(E120*12>=150000),E120*E122,E120)","v":750},{"$f":"G151*F151","v":82.575000000000003},{"$f":"F151","v":0.1101},{"$f":"IF(AND(E120*12>=150000),E120*E123,E120)","v":750},{"$f":"J151*I151","v":82.575000000000003},0,0]
["RESIDENTIAL SERVICE CLASSIFICATION"]
["RESIDENTIAL SERVICE CLASSIFICATION","RPP",null,"Total Bill on TOU (before Taxes)",null,null,null,{"$f":"SUM(H142:H149,H141)","v":95.350995000000026},null,null,{"$f":"SUM(K142:K149,K141)","v":619.58036076901362},{"$f":"K153-H153","v":524.22936576901361},{"$f":"IF((H153)=0,\"\",(L153/H153))","v":5.4978908795761754}]
["RESIDENTIAL SERVICE CLASSIFICATION","RPP",null,"HST",null,0.13,null,{"$f":"H153*F154","v":12.395629350000004},0.13,null,{"$f":"K153*I154","v":80.545446899971779},{"$f":"K154-H154","v":68.149817549971772},{"$f":"IF((H154)=0,\"\",(L154/H154))","v":5.4978908795761754}]
[0,"RPP",null,"8% Rebate",null,0.08,null,{"$f":"H153*F155*(-1)","v":-7.6280796000000022},0.08,null,{"$f":"K153*I155*(-1)","v":-49.566428861521089},{"$f":"K155-H155","v":-41.93834926152109}]
[{"$f":"A154","v":"RESIDENTIAL SERVICE CLASSIFICATION"},"RPP_TOTAL",{"$f":"B30","v":1},"Total Bill on TOU",null,null,null,{"$f":"H153+H154+H155","v":100.11854475000003},null,null,{"$f":"K153+K154+K155","v":650.55937880746433},{"$f":"K156-H156","v":550.44083405746426},{"$f":"IF((H156)=0,\"\",(L156/H156))","v":5.4978908795761745}]
["RESIDENTIAL SERVICE CLASSIFICATION","RPP"]
["RESIDENTIAL SERVICE CLASSIFICATION","Non-RPP (Retailer)",null,"Total Bill on Non-RPP Avg. Price",null,null,null,{"$f":"SUM(H150,H142:H146,H141)","v":116.30599500000002},null,null,{"$f":"SUM(K150,K142:K146,K141)","v":640.53536076901355},{"$f":"K158-H158","v":524.2293657690135},{"$f":"IF((H158)=0,\"\",(L158/H158))","v":4.5073288420688318}]
["RESIDENTIAL SERVICE CLASSIFICATION","Non-RPP (Retailer)",null,"HST",null,0.13,null,{"$f":"H158*F159","v":15.119779350000004},0.13,null,{"$f":"K158*I159","v":83.269596899971759},{"$f":"K159-H159","v":68.149817549971758},{"$f":"IF((H159)=0,\"\",(L159/H159))","v":4.5073288420688327}]
[0,"Non-RPP (Retailer)",null,"8% Rebate",null,0.08,null,{"$f":"H158*F160*(-1)","v":-9.3044796000000023},0.08,null,{"$f":"K158*I160*(-1)","v":-51.242828861521083}]
[{"$f":"A159","v":"RESIDENTIAL SERVICE CLASSIFICATION"},"Non-RPP (Retailer)_TOTAL",null,"Total Bill on Non-RPP Avg. Price",null,null,null,{"$f":"H158+H159+H160","v":122.12129475000003},null,null,{"$f":"K158+K159+K160","v":672.56212880746421},{"$f":"K161-H161","v":550.44083405746414},{"$f":"IF((H161)=0,\"\",(L161/H161))","v":4.5073288420688318}]
["RESIDENTIAL SERVICE CLASSIFICATION","Non-RPP (Retailer)"]
["RESIDENTIAL SERVICE CLASSIFICATION","Non-RPP (Other)",null,"Total Bill on Average IESO Wholesale Market Price",null,null,null,{"$f":"SUM(H151,H142:H146,H141)","v":116.30599500000002},null,null,{"$f":"SUM(K151,K142:K146,K141)","v":640.53536076901355},{"$f":"K163-H163","v":524.2293657690135},{"$f":"IF((H163)=0,\"\",(L163/H163))","v":4.5073288420688318}]
["RESIDENTIAL SERVICE CLASSIFICATION","Non-RPP (Other)",null,"HST",null,0.13,null,{"$f":"H163*F164","v":15.119779350000004},0.13,null,{"$f":"K163*I164","v":83.269596899971759},{"$f":"K164-H164","v":68.149817549971758},{"$f":"IF((H164)=0,\"\",(L164/H164))","v":4.5073288420688327}]
[0,"Non-RPP (Other)",null,"8% Rebate",null,0.08,null,{"$f":"H163*F165*(-1)","v":-9.3044796000000023},0.08,null,{"$f":"K163*I165*(-1)","v":-51.242828861521083}]
[{"$f":"A164","v":"RESIDENTIAL SERVICE CLASSIFICATION"},"Non-RPP (Other)_TOTAL",null,"Total Bill on Average IESO Wholesale Market Price",null,null,null,{"$f":"H163+H164+H165","v":122.12129475000003},null,null,{"$f":"K163+K164+K165","v":672.56212880746421},{"$f":"K166-H166","v":550.44083405746414},{"$f":"IF((H166)=0,\"\",(L166/H166))","v":4.5073288420688318}]
["RESIDENTIAL SERVICE CLASSIFICATION","Non-RPP (Other)"]
[]
[]
[]
[]
[null,null,null,"Customer Class:",{"$f":"D31","v":"GENERAL SERVICE LESS THAN 50 kW SERVICE CLASSIFICATION"},null,null,null,null,null,{"$f":"IF(N31=\"DEMAND - INTERVAL\",\"RTSR - INTERVAL METERED\",\"\")","v":""},null,null,null,null,null,null,null,null,"X"]
[null,null,null,"RPP / Non-RPP:",{"$f":"H31","v":"RPP"}]
[null,null,null,"Consumption",{"$f":"K31","v":2000},"kWh"]
[null,null,null,"Demand",{"$f":"L31","v":0},"kW"]
[null,null,null,"Current Loss Factor",{"$f":"I31","v":1.0335000000000001}]
[null,null,null,"Proposed/Approved Loss Factor",{"$f":"J31","v":1.030684649944027}]
[]
[null,null,null,null,null,"Current OEB-Approved",null,null,"Proposed",null,null,"Impact"]
[null,null,null,null,null,"Rate","Volume","Charge","Rate","Volume","Charge","$ Change","% Change"]
[null,null,null,null,null,"($)",null,"($)","($)",null,"($)"]
[{"$f":"$E172","v":"GENERAL SERVICE LESS THAN 50 kW SERVICE CLASSIFICATION"},null,null,"Monthly Service Charge",null,13.74,1,{"$f":"G182*F182","v":13.74},15.18,{"$f":"G182","v":1},{"$f":"J182*I182","v":15.18},{"$f":"K182-H182","v":1.4399999999999995},{"$f":"IF(ISERROR(L182/H182), \"\", L182/H182)","v":0.10480349344978163}]
[{"$f":"A182","v":"GENERAL SERVICE LESS THAN 50 kW SERVICE CLASSIFICATION"},null,null,"Distribution Volumetric Rate",null,1.47E-2,{"$f":"IF($E175>0, $E175, $E174)","v":2000},{"$f":"G183*F183","v":29.4},1.6199999999999999E-2,{"$f":"IF($E175>0, $E175, $E174)","v":2000},{"$f":"J183*I183","v":32.4},3,{"$f":"IF(ISERROR(L183/H183), \"\", L183/H183)","v":0.10204081632653061}]
[{"$f":"A183","v":"GENERAL SERVICE LESS THAN 50 kW SERVICE CLASSIFICATION"},null,null,"Fixed Rate Riders",null,0,1,0,0,{"$f":"G184","v":1},{"$f":"J184*I184","v":0},0,""]
["GENERAL SERVICE LESS THAN 50 kW SERVICE CLASSIFICATION",null,null,"Volumetric Rate Riders",null,0,{"$f":"IF($E175>0, $E175, $E174)","v":2000},0,0,{"$f":"IF($E175>0, $E175, $E174)","v":2000},0,0,""]
["GENERAL SERVICE LESS THAN 50 kW SERVICE CLASSIFICATION","ST_A",{"$f":"B31","v":2},"Sub-Total A (excluding pass through)",null,null,null,{"$f":"SUM(H182:H185)","v":43.14},null,null,{"$f":"SUM(K182:K185)","v":47.58},4.4399999999999977,{"$f":"IF((H186)=0,\"\",(L186/H186))","v":0.1029207232267037}]
["GENERAL SERVICE LESS THAN 50 kW SERVICE CLASSIFICATION",null,null,"Line Losses on Cost of Power",null,{"$f":"IF((E174*12>=150000), 0, IF(E173=\"RPP\",(F201*0.65+F202*0.17+F203*0.18),IF(E173=\"Non-RPP (Retailer)\",F204,F205)))","v":8.2160000000000011E-2},{"$f":"IF(F187=0, 0, $E174*E176-E174)","v":67},{"$f":"G187*F187","v":5.5047200000000007},{"$f":"IF((E174*12>=150000), 0, IF(E173=\"RPP\",(I201*0.65+I202*0.17+I203*0.18),IF(E173=\"Non-RPP (Retailer)\",I204,I205)))","v":8.2160000000000011E-2},{"$f":"IF(I187=0, 0, E174*E177-E174)","v":61.369299888053774},{"$f":"J187*I187","v":5.0421016788024984},{"$f":"K187-H187","v":-0.46261832119750235},{"$f":"IF(ISERROR(L187/H187), \"\", L187/H187)","v":-8.4040300178301941E-2}]
["GENERAL SERVICE LESS THAN 50 kW SERVICE CLASSIFICATION",null,null,"Total Deferral/Variance Account Rate Riders",null,-6.1999999999999998E-3,{"$f":"IF($E175>0, $E175, $E174)","v":2000},-12.4,-7.4000000000000003E-3,{"$f":"IF($E175>0, $E175, $E174)","v":2000},-14.8,-2.4000000000000004,0.19354838709677422]
["GENERAL SERVICE LESS THAN 50 kW SERVICE CLASSIFICATION",null,null,"GA Rate Riders",null,0,{"$f":"E174","v":2000},0,0,{"$f":"E174","v":2000},0,0,""]
["GENERAL SERVICE LESS THAN 50 kW SERVICE CLASSIFICATION",null,null,"Low Voltage Service Charge",null,1E-4,{"$f":"IF($E175>0, $E175, $E174)","v":2000},0.2,4.0000000000000002E-4,{"$f":"IF($E175>0, $E175, $E174)","v":2000},0.8,0.60000000000000009,3.0000000000000004]
["GENERAL SERVICE LESS THAN 50 kW SERVICE CLASSIFICATION",null,null,"Smart Meter Entity Charge (if applicable)",null,0.56999999999999995,1,{"$f":"G191*F191","v":0.56999999999999995},0.56999999999999995,1,{"$f":"J191*I191","v":0.56999999999999995},0,{"$f":"IF(ISERROR(L191/H191), \"\", L191/H191)","v":0}]
["GENERAL SERVICE LESS THAN 50 kW SERVICE CLASSIFICATION","ST_B",{"$f":"B31","v":2},"Sub-Total B - Distribution (includes Sub-Total A)",null,null,null,{"$f":"SUM(H186:H191)","v":37.014720000000004},null,null,{"$f":"SUM(K186:K191)","v":39.192101678802494},2.1773816788024902,{"$f":"IF((H192)=0,\"\",(L192/H192))","v":5.8824750769490897E-2}]
["GENERAL SERVICE LESS THAN 50 kW SERVICE CLASSIFICATION",null,null,"RTSR - Network",null,5.1999999999999998E-3,{"$f":"IF($E175>0, $E175, $E174*$E176)","v":2067},{"$f":"G193*F193","v":10.7484},0,{"$f":"IF($E175>0, $E175, $E174*$E177)","v":2061.3692998880538},{"$f":"J193*I193","v":0},-10.7484,{"$f":"IF(ISERROR(L193/H193), \"\", L193/H193)","v":-1}]
["GENERAL SERVICE LESS THAN 50 kW SERVICE CLASSIFICATION",null,null,"RTSR - Connection and/or Line and Transformation Connection",null,4.1000000000000003E-3,{"$f":"IF($E175>0, $E175, $E174*$E176)","v":2067},{"$f":"G194*F194","v":8.4747000000000003},3.8E-3,{"$f":"IF($E175>0, $E175, $E174*$E177)","v":2061.3692998880538},{"$f":"J194*I194","v":7.8332033395746041},-0.64149666042539621,{"$f":"IF(ISERROR(L194/H194), \"\", L194/H194)","v":-7.5695500775885424E-2}]
["GENERAL SERVICE LESS THAN 50 kW SERVICE CLASSIFICATION","ST_C",{"$f":"B31","v":2},"Sub-Total C - Delivery (including Sub-Total B)",null,null,null,{"$f":"SUM(H192:H194)","v":56.237819999999999},null,null,{"$f":"SUM(K192:K194)","v":47.025305018377097},-9.2125149816229026,{"$f":"IF((H195)=0,\"\",(L195/H195))","v":-0.16381351520423271}]
["GENERAL SERVICE LESS THAN 50 kW SERVICE CLASSIFICATION",null,null,"Wholesale Market Service Charge (WMSC)",null,3.2000000000000002E-3,{"$f":"E174*E176","v":2067},{"$f":"G196*F196","v":6.6144000000000007},3.2000000000000002E-3,{"$f":"E174*E177","v":2061.3692998880538},{"$f":"J196*I196","v":6.5963817596417726},-1.8018240358228077E-2,{"$f":"IF(ISERROR(L196/H196), \"\", L196/H196)","v":-2.7240929424026481E-3}]
["GENERAL SERVICE LESS THAN 50 kW SERVICE CLASSIFICATION",null,null,"Rural and Remote Rate Protection (RRRP)",null,2.9999999999999997E-4,{"$f":"E174*E176","v":2067},0.62009999999999998,0,{"$f":"E174*E177","v":2061.3692998880538},0,-0.62009999999999998,-1]
["GENERAL SERVICE LESS THAN 50 kW SERVICE CLASSIFICATION",null,null,"Standard Supply Service Charge",null,0.25,1,0.25,0.25,1,0.25,0,0]
["GENERAL SERVICE LESS THAN 50 kW SERVICE CLASSIFICATION",null,null,"Debt Retirement Charge (DRC)",null,{"$f":"IF('1. Information Sheet'!F196 = DATE(2016, 5, 1), (IF(ISERROR(FIND(\"RESIDENTIAL\", UPPER(E172))),DRC, 0)), DRC)","v":7.0000000000000001E-3},{"$f":"E174","v":2000},14,{"$f":"IF(ISERROR(FIND(\"RESIDENTIAL\", UPPER(E172))), DRC, 0)","v":7.0000000000000001E-3},{"$f":"E174","v":2000},14,0,0]
["GENERAL SERVICE LESS THAN 50 kW SERVICE CLASSIFICATION",null,null,"Ontario Electricity Support Program \n(OESP) ",null,null,{"$f":"E174*E177","v":2061.3692998880538},0,null,{"$f":"E174*E177","v":2061.3692998880538},0,0,""]
["GENERAL SERVICE LESS THAN 50 kW SERVICE CLASSIFICATION","RPP",null,"TOU - Off Peak",null,{"$f":"OffPeak","v":6.5000000000000002E-2},{"$f":"IF(AND(E174*12>=150000),0.65*E174*E176,0.65*E174)","v":1300},84.5,{"$f":"OffPeak","v":6.5000000000000002E-2},{"$f":"IF(AND(E174*12>=150000),0.65*E174*E177,0.65*E174)","v":1300},84.5,0,0]
["GENERAL SERVICE LESS THAN 50 kW SERVICE CLASSIFICATION","RPP",null,"TOU - Mid Peak",null,{"$f":"MidPeak","v":9.5000000000000001E-2},{"$f":"IF(AND(E174*12>=150000),0.17*E174*E176,0.17*E174)","v":340},32.299999999999997,{"$f":"MidPeak","v":9.5000000000000001E-2},{"$f":"IF(AND(E174*12>=150000),0.17*E174*E177,0.17*E174)","v":340},32.299999999999997,0,0]
["GENERAL SERVICE LESS THAN 50 kW SERVICE CLASSIFICATION","RPP",null,"TOU - On Peak",null,{"$f":"OnPeak","v":0.13200000000000001},{"$f":"IF(AND(E174*12>=150000),0.18*E174*E176,0.18*E174)","v":360},47.52,{"$f":"OnPeak","v":0.13200000000000001},{"$f":"IF(AND(E174*12>=150000),0.18*E174*E177,0.18*E174)","v":360},47.52,0,0]
["GENERAL SERVICE LESS THAN 50 kW SERVICE CLASSIFICATION","Non-RPP (Retailer)",null,"Non-RPP Retailer Avg. Price",null,{"$f":"0.1101","v":0.1101},{"$f":"IF(AND(E174*12>=150000),E174*E176,E174)","v":2000},{"$f":"G204*F204","v":220.20000000000002},{"$f":"F204","v":0.1101},{"$f":"IF(AND(E174*12>=150000),E174*E177,E174)","v":2000},{"$f":"J204*I204","v":220.20000000000002},0,0]
["GENERAL SERVICE LESS THAN 50 kW SERVICE CLASSIFICATION","Non-RPP (Other)",null,"Average IESO Wholesale Market Price",null,{"$f":"0.1101","v":0.1101},{"$f":"IF(AND(E174*12>=150000),E174*E176,E174)","v":2000},{"$f":"G205*F205","v":220.20000000000002},{"$f":"F205","v":0.1101},{"$f":"IF(AND(E174*12>=150000),E174*E177,E174)","v":2000},{"$f":"J205*I205","v":220.20000000000002},0,0]
["GENERAL SERVICE LESS THAN 50 kW SERVICE CLASSIFICATION"]
["GENERAL SERVICE LESS THAN 50 kW SERVICE CLASSIFICATION","RPP",null,"Total Bill on TOU (before Taxes)",null,null,null,{"$f":"SUM(H196:H203,H195)","v":242.04231999999999},null,null,{"$f":"SUM(K196:K203,K195)","v":232.19168677801889},{"$f":"K207-H207","v":-9.8506332219810986},{"$f":"IF((H207)=0,\"\",(L207/H207))","v":-4.0697978857503508E-2}]
["GENERAL SERVICE LESS THAN 50 kW SERVICE CLASSIFICATION","RPP",null,"HST",null,0.13,null,{"$f":"H207*F208","v":31.4655016},0.13,null,{"$f":"K207*I208","v":30.184919281142456},{"$f":"K208-H208","v":-1.2805823188575438},{"$f":"IF((H208)=0,\"\",(L208/H208))","v":-4.0697978857503543E-2}]
[0,"RPP",null,"8% Rebate",null,0.08,null,{"$f":"H207*F209*(-1)","v":-19.363385600000001},0.08,null,{"$f":"K207*I209*(-1)","v":-18.575334942241511},{"$f":"K209-H209","v":0.78805065775848959}]
[{"$f":"A208","v":"GENERAL SERVICE LESS THAN 50 kW SERVICE CLASSIFICATION"},"RPP_TOTAL",{"$f":"B31","v":2},"Total Bill on TOU",null,null,null,{"$f":"H207+H208+H209","v":254.14443599999998},null,null,{"$f":"K207+K208+K209","v":243.80127111691985},{"$f":"K210-H210","v":-10.343164883080135},{"$f":"IF((H210)=0,\"\",(L210/H210))","v":-4.0697978857503439E-2}]
["GENERAL SERVICE LESS THAN 50 kW SERVICE CLASSIFICATION","RPP"]
["GENERAL SERVICE LESS THAN 50 kW SERVICE CLASSIFICATION","Non-RPP (Retailer)",null,"Total Bill on Non-RPP Avg. Price",null,null,null,{"$f":"SUM(H204,H196:H200,H195)","v":297.92232000000001},null,null,{"$f":"SUM(K204,K196:K200,K195)","v":288.07168677801889},{"$f":"K212-H212","v":-9.850633221981127},{"$f":"IF((H212)=0,\"\",(L212/H212))","v":-3.3064435125173319E-2}]
["GENERAL SERVICE LESS THAN 50 kW SERVICE CLASSIFICATION","Non-RPP (Retailer)",null,"HST",null,0.13,null,{"$f":"H212*F213","v":38.729901600000005},0.13,null,{"$f":"K212*I213","v":37.449319281142458},{"$f":"K213-H213","v":-1.2805823188575474},{"$f":"IF((H213)=0,\"\",(L213/H213))","v":-3.306443512517334E-2}]
[0,"Non-RPP (Retailer)",null,"8% Rebate",null,0.08,null,{"$f":"H212*F214*(-1)","v":-23.833785600000002},0.08,null,{"$f":"K212*I214*(-1)","v":-23.045734942241513}]
[{"$f":"A213","v":"GENERAL SERVICE LESS THAN 50 kW SERVICE CLASSIFICATION"},"Non-RPP (Retailer)_TOTAL",null,"Total Bill on Non-RPP Avg. Price",null,null,null,{"$f":"H212+H213+H214","v":312.81843600000002},null,null,{"$f":"K212+K213+K214","v":302.47527111691983},{"$f":"K215-H215","v":-10.343164883080192},{"$f":"IF((H215)=0,\"\",(L215/H215))","v":-3.3064435125173347E-2}]
["GENERAL SERVICE LESS THAN 50 kW SERVICE CLASSIFICATION","Non-RPP (Retailer)"]
["GENERAL SERVICE LESS THAN 50 kW SERVICE CLASSIFICATION","Non-RPP (Other)",null,"Total Bill on Average IESO Wholesale Market Price",null,null,null,{"$f":"SUM(H205,H196:H200,H195)","v":297.92232000000001},null,null,{"$f":"SUM(K205,K196:K200,K195)","v":288.07168677801889},{"$f":"K217-H217","v":-9.850633221981127},{"$f":"IF((H217)=0,\"\",(L217/H217))","v":-3.3064435125173319E-2}]
["GENERAL SERVICE LESS THAN 50 kW SERVICE CLASSIFICATION","Non-RPP (Other)",null,"HST",null,0.13,null,{"$f":"H217*F218","v":38.729901600000005},0.13,null,{"$f":"K217*I218","v":37.449319281142458},{"$f":"K218-H218","v":-1.2805823188575474},{"$f":"IF((H218)=0,\"\",(L218/H218))","v":-3.306443512517334E-2}]
[0,"Non-RPP (Other)",null,"8% Rebate",null,0.08,null,{"$f":"H217*F219*(-1)","v":-23.833785600000002},0.08,null,{"$f":"K217*I219*(-1)","v":-23.045734942241513}]
[{"$f":"A218","v":"GENERAL SERVICE LESS THAN 50 kW SERVICE CLASSIFICATION"},"Non-RPP (Other)_TOTAL",null,"Total Bill on Average IESO Wholesale Market Price",null,null,null,{"$f":"H217+H218+H219","v":312.81843600000002},null,null,{"$f":"K217+K218+K219","v":302.47527111691983},{"$f":"K220-H220","v":-10.343164883080192},{"$f":"IF((H220)=0,\"\",(L220/H220))","v":-3.3064435125173347E-2}]
["GENERAL SERVICE LESS THAN 50 kW SERVICE CLASSIFICATION","Non-RPP (Other)"]
[]
[]
[]
[]
[null,null,null,"Customer Class:",{"$f":"D32","v":"GENERAL SERVICE 50 TO 4,999 KW SERVICE CLASSIFICATION"},null,null,null,null,null,{"$f":"IF(N32=\"DEMAND - INTERVAL\",\"RTSR - INTERVAL METERED\",\"\")","v":""},null,null,null,null,null,null,null,null,"X"]
[null,null,null,"RPP / Non-RPP:",{"$f":"H32","v":"Non-RPP (Other)"}]
[null,null,null,"Consumption",{"$f":"K32","v":20000},"kWh"]
[null,null,null,"Demand",{"$f":"L32","v":60},"kW"]
[null,null,null,"Current Loss Factor",{"$f":"I32","v":1.0335000000000001}]
[null,null,null,"Proposed/Approved Loss Factor",{"$f":"J32","v":1.030684649944027}]
[]
[null,null,null,null,null,"Current OEB-Approved",null,null,"Proposed",null,null,"Impact"]
[null,null,null,null,null,"Rate","Volume","Charge","Rate","Volume","Charge","$ Change","% Change"]
[null,null,null,null,null,"($)",null,"($)","($)",null,"($)"]
[{"$f":"$E226","v":"GENERAL SERVICE 50 TO 4,999 KW SERVICE CLASSIFICATION"},null,null,"Monthly Service Charge",null,0,1,{"$f":"G236*F236","v":0},0,{"$f":"G236","v":1},{"$f":"J236*I236","v":0},{"$f":"K236-H236","v":0},{"$f":"IF(ISERROR(L236/H236), \"\", L236/H236)","v":""}]
[{"$f":"A236","v":"GENERAL SERVICE 50 TO 4,999 KW SERVICE CLASSIFICATION"},null,null,"Distribution Volumetric Rate",null,0,{"$f":"IF($E229>0, $E229, $E228)","v":60},{"$f":"G237*F237","v":0},0,{"$f":"IF($E229>0, $E229, $E228)","v":60},{"$f":"J237*I237","v":0},0,{"$f":"IF(ISERROR(L237/H237), \"\", L237/H237)","v":""}]
[{"$f":"A237","v":"GENERAL SERVICE 50 TO 4,999 KW SERVICE CLASSIFICATION"},null,null,"Fixed Rate Riders",null,0,1,0,0,{"$f":"G238","v":1},{"$f":"J238*I238","v":0},0,""]
["GENERAL SERVICE 50 TO 4,999 KW SERVICE CLASSIFICATION",null,null,"Volumetric Rate Riders",null,0,{"$f":"IF($E229>0, $E229, $E228)","v":60},0,0,{"$f":"IF($E229>0, $E229, $E228)","v":60},0,0,""]
["GENERAL SERVICE 50 TO 4,999 KW SERVICE CLASSIFICATION","ST_A",{"$f":"B32","v":3},"Sub-Total A (excluding pass through)",null,null,null,{"$f":"SUM(H236:H239)","v":0},null,null,{"$f":"SUM(K236:K239)","v":0},0,{"$f":"IF((H240)=0,\"\",(L240/H240))","v":""}]
["GENERAL SERVICE 50 TO 4,999 KW SERVICE CLASSIFICATION",null,null,"Line Losses on Cost of Power",null,{"$f":"IF((E228*12>=150000), 0, IF(E227=\"RPP\",(F255*0.65+F256*0.17+F257*0.18),IF(E227=\"Non-RPP (Retailer)\",F258,F259)))","v":0},{"$f":"IF(F241=0, 0, $E228*E230-E228)","v":0},{"$f":"G241*F241","v":0},{"$f":"IF((E228*12>=150000), 0, IF(E227=\"RPP\",(I255*0.65+I256*0.17+I257*0.18),IF(E227=\"Non-RPP (Retailer)\",I258,I259)))","v":0},{"$f":"IF(I241=0, 0, E228*E231-E228)","v":0},{"$f":"J241*I241","v":0},{"$f":"K241-H241","v":0},{"$f":"IF(ISERROR(L241/H241), \"\", L241/H241)","v":""}]
["GENERAL SERVICE 50 TO 4,999 KW SERVICE CLASSIFICATION",null,null,"Total Deferral/Variance Account Rate Riders",null,0,{"$f":"IF($E229>0, $E229, $E228)","v":60},0,0,{"$f":"IF($E229>0, $E229, $E228)","v":60},0,0,""]
["GENERAL SERVICE 50 TO 4,999 KW SERVICE CLASSIFICATION",null,null,"GA Rate Riders",null,0,{"$f":"E228","v":20000},0,0,{"$f":"E228","v":20000},0,0,""]
["GENERAL SERVICE 50 TO 4,999 KW SERVICE CLASSIFICATION",null,null,"Low Voltage Service Charge",null,0,{"$f":"IF($E229>0, $E229, $E228)","v":60},0,null,{"$f":"IF($E229>0, $E229, $E228)","v":60},0,0,""]
["GENERAL SERVICE 50 TO 4,999 KW SERVICE CLASSIFICATION",null,null,"Smart Meter Entity Charge (if applicable)",null,0,1,{"$f":"G245*F245","v":0},0,1,{"$f":"J245*I245","v":0},0,{"$f":"IF(ISERROR(L245/H245), \"\", L245/H245)","v":""}]
["GENERAL SERVICE 50 TO 4,999 KW SERVICE CLASSIFICATION","ST_B",{"$f":"B32","v":3},"Sub-Total B - Distribution (includes Sub-Total A)",null,null,null,{"$f":"SUM(H240:H245)","v":0},null,null,{"$f":"SUM(K240:K245)","v":0},0,{"$f":"IF((H246)=0,\"\",(L246/H246))","v":""}]
["GENERAL SERVICE 50 TO 4,999 KW SERVICE CLASSIFICATION",null,null,"RTSR - Network",null,0,{"$f":"IF($E229>0, $E229, $E228*$E230)","v":60},{"$f":"G247*F247","v":0},0,{"$f":"IF($E229>0, $E229, $E228*$E231)","v":60},{"$f":"J247*I247","v":0},0,{"$f":"IF(ISERROR(L247/H247), \"\", L247/H247)","v":""}]
["GENERAL SERVICE 50 TO 4,999 KW SERVICE CLASSIFICATION",null,null,"RTSR - Connection and/or Line and Transformation Connection",null,0,{"$f":"IF($E229>0, $E229, $E228*$E230)","v":60},{"$f":"G248*F248","v":0},0,{"$f":"IF($E229>0, $E229, $E228*$E231)","v":60},{"$f":"J248*I248","v":0},0,{"$f":"IF(ISERROR(L248/H248), \"\", L248/H248)","v":""}]
["GENERAL SERVICE 50 TO 4,999 KW SERVICE CLASSIFICATION","ST_C",{"$f":"B32","v":3},"Sub-Total C - Delivery (including Sub-Total B)",null,null,null,{"$f":"SUM(H246:H248)","v":0},null,null,{"$f":"SUM(K246:K248)","v":0},0,{"$f":"IF((H249)=0,\"\",(L249/H249))","v":""}]
["GENERAL SERVICE 50 TO 4,999 KW SERVICE CLASSIFICATION",null,null,"Wholesale Market Service Charge (WMSC)",null,0,{"$f":"E228*E230","v":20670},{"$f":"G250*F250","v":0},0,{"$f":"E228*E231","v":20613.692998880539},{"$f":"J250*I250","v":0},0,{"$f":"IF(ISERROR(L250/H250), \"\", L250/H250)","v":""}]
["GENERAL SERVICE 50 TO 4,999 KW SERVICE CLASSIFICATION",null,null,"Rural and Remote Rate Protection (RRRP)",null,0,{"$f":"E228*E230","v":20670},0,0,{"$f":"E228*E231","v":20613.692998880539},0,0,""]
["GENERAL SERVICE 50 TO 4,999 KW SERVICE CLASSIFICATION",null,null,"Standard Supply Service Charge"]
["GENERAL SERVICE 50 TO 4,999 KW SERVICE CLASSIFICATION",null,null,"Debt Retirement Charge (DRC)",null,{"$f":"IF('1. Information Sheet'!F250 = DATE(2016, 5, 1), (IF(ISERROR(FIND(\"RESIDENTIAL\", UPPER(E226))),DRC, 0)), DRC)","v":7.0000000000000001E-3},{"$f":"E228","v":20000},140,{"$f":"IF(ISERROR(FIND(\"RESIDENTIAL\", UPPER(E226))), DRC, 0)","v":7.0000000000000001E-3},{"$f":"E228","v":20000},140,0,0]
["GENERAL SERVICE 50 TO 4,999 KW SERVICE CLASSIFICATION",null,null,"Ontario Electricity Support Program \n(OESP) ",null,null,{"$f":"E228*E231","v":20613.692998880539},0,null,{"$f":"E228*E231","v":20613.692998880539},0,0,""]
["GENERAL SERVICE 50 TO 4,999 KW SERVICE CLASSIFICATION","RPP",null,"TOU - Off Peak",null,{"$f":"OffPeak","v":6.5000000000000002E-2},{"$f":"IF(AND(E228*12>=150000),0.65*E228*E230,0.65*E228)","v":13435.500000000002},873.30750000000012,{"$f":"OffPeak","v":6.5000000000000002E-2},{"$f":"IF(AND(E228*12>=150000),0.65*E228*E231,0.65*E228)","v":13398.900449272351},870.92852920270286,-2.3789707972972565,-2.7240929424025974E-3]
["GENERAL SERVICE 50 TO 4,999 KW SERVICE CLASSIFICATION","RPP",null,"TOU - Mid Peak",null,{"$f":"MidPeak","v":9.5000000000000001E-2},{"$f":"IF(AND(E228*12>=150000),0.17*E228*E230,0.17*E228)","v":3513.9000000000005},333.82050000000004,{"$f":"MidPeak","v":9.5000000000000001E-2},{"$f":"IF(AND(E228*12>=150000),0.17*E228*E231,0.17*E228)","v":3504.3278098096921},332.91114193192078,-0.90935806807925701,-2.7240929424024495E-3]
["GENERAL SERVICE 50 TO 4,999 KW SERVICE CLASSIFICATION","RPP",null,"TOU - On Peak",null,{"$f":"OnPeak","v":0.13200000000000001},{"$f":"IF(AND(E228*12>=150000),0.18*E228*E230,0.18*E228)","v":3720.6000000000004},491.11920000000009,{"$f":"OnPeak","v":0.13200000000000001},{"$f":"IF(AND(E228*12>=150000),0.18*E228*E231,0.18*E228)","v":3710.4647397984972},489.78134565340167,-1.3378543465984194,-2.7240929424026165E-3]
["GENERAL SERVICE 50 TO 4,999 KW SERVICE CLASSIFICATION","Non-RPP (Retailer)",null,"Non-RPP Retailer Avg. Price",null,{"$f":"0.1101","v":0.1101},{"$f":"IF(AND(E228*12>=150000),E228*E230,E228)","v":20670},{"$f":"G258*F258","v":2275.7670000000003},{"$f":"F258","v":0.1101},{"$f":"IF(AND(E228*12>=150000),E228*E231,E228)","v":20613.692998880539},{"$f":"J258*I258","v":2269.5675991767475},-6.1994008232527449,-2.7240929424026026E-3]
["GENERAL SERVICE 50 TO 4,999 KW SERVICE CLASSIFICATION","Non-RPP (Other)",null,"Average IESO Wholesale Market Price",null,{"$f":"0.1101","v":0.1101},{"$f":"IF(AND(E228*12>=150000),E228*E230,E228)","v":20670},{"$f":"G259*F259","v":2275.7670000000003},{"$f":"F259","v":0.1101},{"$f":"IF(AND(E228*12>=150000),E228*E231,E228)","v":20613.692998880539},{"$f":"J259*I259","v":2269.5675991767475},-6.1994008232527449,-2.7240929424026026E-3]
["GENERAL SERVICE 50 TO 4,999 KW SERVICE CLASSIFICATION"]
["GENERAL SERVICE 50 TO 4,999 KW SERVICE CLASSIFICATION","RPP",null,"Total Bill on TOU (before Taxes)",null,null,null,{"$f":"SUM(H250:H257,H249)","v":1838.2472000000002},null,null,{"$f":"SUM(K250:K257,K249)","v":1833.6210167880254},{"$f":"K261-H261","v":-4.626183211974876},{"$f":"IF((H261)=0,\"\",(L261/H261))","v":-2.5166273676221975E-3}]
["GENERAL SERVICE 50 TO 4,999 KW SERVICE CLASSIFICATION","RPP",null,"HST",null,0.13,null,{"$f":"H261*F262","v":238.97213600000003},0.13,null,{"$f":"K261*I262","v":238.37073218244331},{"$f":"K262-H262","v":-0.60140381755672934},{"$f":"IF((H262)=0,\"\",(L262/H262))","v":-2.5166273676221784E-3}]
[0,"RPP",null,"8% Rebate",null,0.08,null,0,0.08,null,0,{"$f":"K263-H263","v":0}]
[{"$f":"A262","v":"GENERAL SERVICE 50 TO 4,999 KW SERVICE CLASSIFICATION"},"RPP_TOTAL",null,"Total Bill on TOU",null,null,null,{"$f":"H261+H262+H263","v":2077.2193360000001},null,null,{"$f":"K261+K262+K263","v":2071.9917489704685},{"$f":"K264-H264","v":-5.2275870295316054},{"$f":"IF((H264)=0,\"\",(L264/H264))","v":-2.5166273676221957E-3}]
["GENERAL SERVICE 50 TO 4,999 KW SERVICE CLASSIFICATION","RPP"]
["GENERAL SERVICE 50 TO 4,999 KW SERVICE CLASSIFICATION","Non-RPP (Retailer)",null,"Total Bill on Non-RPP Avg. Price",null,null,null,{"$f":"SUM(H258,H250:H254,H249)","v":2415.7670000000003},null,null,{"$f":"SUM(K258,K250:K254,K249)","v":2409.5675991767475},{"$f":"K266-H266","v":-6.1994008232527449},{"$f":"IF((H266)=0,\"\",(L266/H266))","v":-2.5662246496672668E-3}]
["GENERAL SERVICE 50 TO 4,999 KW SERVICE CLASSIFICATION","Non-RPP (Retailer)",null,"HST",null,0.13,null,{"$f":"H266*F267","v":314.04971000000006},0.13,null,{"$f":"K266*I267","v":313.2437878929772},{"$f":"K267-H267","v":-0.80592210702286593},{"$f":"IF((H267)=0,\"\",(L267/H267))","v":-2.5662246496672954E-3}]
[0,"Non-RPP (Retailer)",null,"8% Rebate",null,0.08,null,0,0.08,null,0]
[{"$f":"A267","v":"GENERAL SERVICE 50 TO 4,999 KW SERVICE CLASSIFICATION"},"Non-RPP (Retailer)_TOTAL",null,"Total Bill on Non-RPP Avg. Price",null,null,null,{"$f":"H266+H267+H268","v":2729.8167100000005},null,null,{"$f":"K266+K267+K268","v":2722.8113870697248},{"$f":"K269-H269","v":-7.0053229302757245},{"$f":"IF((H269)=0,\"\",(L269/H269))","v":-2.5662246496673115E-3}]
["GENERAL SERVICE 50 TO 4,999 KW SERVICE CLASSIFICATION","Non-RPP (Retailer)"]
["GENERAL SERVICE 50 TO 4,999 KW SERVICE CLASSIFICATION","Non-RPP (Other)",null,"Total Bill on Average IESO Wholesale Market Price",null,null,null,{"$f":"SUM(H259,H250:H254,H249)","v":2415.7670000000003},null,null,{"$f":"SUM(K259,K250:K254,K249)","v":2409.5675991767475},{"$f":"K271-H271","v":-6.1994008232527449},{"$f":"IF((H271)=0,\"\",(L271/H271))","v":-2.5662246496672668E-3}]
["GENERAL SERVICE 50 TO 4,999 KW SERVICE CLASSIFICATION","Non-RPP (Other)",null,"HST",null,0.13,null,{"$f":"H271*F272","v":314.04971000000006},0.13,null,{"$f":"K271*I272","v":313.2437878929772},{"$f":"K272-H272","v":-0.80592210702286593},{"$f":"IF((H272)=0,\"\",(L272/H272))","v":-2.5662246496672954E-3}]
[0,"Non-RPP (Other)",null,"8% Rebate",null,0.08,null,0,0.08,null,0]
[{"$f":"A272","v":"GENERAL SERVICE 50 TO 4,999 KW SERVICE CLASSIFICATION"},"Non-RPP (Other)_TOTAL",{"$f":"B32","v":3},"Total Bill on Average IESO Wholesale Market Price",null,null,null,{"$f":"H271+H272+H273","v":2729.8167100000005},null,null,{"$f":"K271+K272+K273","v":2722.8113870697248},{"$f":"K274-H274","v":-7.0053229302757245},{"$f":"IF((H274)=0,\"\",(L274/H274))","v":-2.5662246496673115E-3}]
["GENERAL SERVICE 50 TO 4,999 KW SERVICE CLASSIFICATION","Non-RPP (Other)"]
[]
[]
[]
[]
[null,null,null,"Customer Class:",{"$f":"D33","v":"UNMETERED SCATTERED LOAD SERVICE CLASSIFICATION"},null,null,null,null,null,{"$f":"IF(N33=\"DEMAND - INTERVAL\",\"RTSR - INTERVAL METERED\",\"\")","v":""},null,null,null,null,null,null,null,null,"X"]
[null,null,null,"RPP / Non-RPP:",{"$f":"H33","v":"Non-RPP (Other)"}]
[null,null,null,"Consumption",{"$f":"K33","v":100},"kWh"]
[null,null,null,"Demand",{"$f":"L33","v":0},"kW"]
[null,null,null,"Current Loss Factor",{"$f":"I33","v":1.0335000000000001}]
[null,null,null,"Proposed/Approved Loss Factor",{"$f":"J33","v":1.030684649944027}]
[]
[null,null,null,null,null,"Current OEB-Approved",null,null,"Proposed",null,null,"Impact"]
[null,null,null,null,null,"Rate","Volume","Charge","Rate","Volume","Charge","$ Change","% Change"]
[null,null,null,null,null,"($)",null,"($)","($)",null,"($)"]
[{"$f":"$E280","v":"UNMETERED SCATTERED LOAD SERVICE CLASSIFICATION"},null,null,"Monthly Service Charge",null,5.89,1,{"$f":"G290*F290","v":5.89},5.79,{"$f":"G290","v":1},{"$f":"J290*I290","v":5.79},{"$f":"K290-H290","v":-9.9999999999999645E-2},{"$f":"IF(ISERROR(L290/H290), \"\", L290/H290)","v":-1.6977928692699432E-2}]
[{"$f":"A290","v":"UNMETERED SCATTERED LOAD SERVICE CLASSIFICATION"},null,null,"Distribution Volumetric Rate",null,1.26E-2,{"$f":"IF($E283>0, $E283, $E282)","v":100},{"$f":"G291*F291","v":1.26},1.43E-2,{"$f":"IF($E283>0, $E283, $E282)","v":100},{"$f":"J291*I291","v":1.43},0.16999999999999993,{"$f":"IF(ISERROR(L291/H291), \"\", L291/H291)","v":0.13492063492063486}]
[{"$f":"A291","v":"UNMETERED SCATTERED LOAD SERVICE CLASSIFICATION"},null,null,"Fixed Rate Riders",null,0,1,0,0,{"$f":"G292","v":1},{"$f":"J292*I292","v":0},0,""]
["UNMETERED SCATTERED LOAD SERVICE CLASSIFICATION",null,null,"Volumetric Rate Riders",null,0,{"$f":"IF($E283>0, $E283, $E282)","v":100},0,0,{"$f":"IF($E283>0, $E283, $E282)","v":100},0,0,""]
["UNMETERED SCATTERED LOAD SERVICE CLASSIFICATION","ST_A",{"$f":"B33","v":4},"Sub-Total A (excluding pass through)",null,null,null,{"$f":"SUM(H290:H293)","v":7.1499999999999995},null,null,{"$f":"SUM(K290:K293)","v":7.22},7.0000000000000284E-2,{"$f":"IF((H294)=0,\"\",(L294/H294))","v":9.790209790209831E-3}]
["UNMETERED SCATTERED LOAD SERVICE CLASSIFICATION",null,null,"Line Losses on Cost of Power",null,{"$f":"IF((E282*12>=150000), 0, IF(E281=\"RPP\",(F309*0.65+F310*0.17+F311*0.18),IF(E281=\"Non-RPP (Retailer)\",F312,F313)))","v":0.1101},{"$f":"IF(F295=0, 0, $E282*E284-E282)","v":3.3500000000000085},{"$f":"G295*F295","v":0.36883500000000097},{"$f":"IF((E282*12>=150000), 0, IF(E281=\"RPP\",(I309*0.65+I310*0.17+I311*0.18),IF(E281=\"Non-RPP (Retailer)\",I312,I313)))","v":0.1101},{"$f":"IF(I295=0, 0, E282*E285-E282)","v":3.0684649944027029},{"$f":"J295*I295","v":0.33783799588373759},{"$f":"K295-H295","v":-3.0997004116263382E-2},{"$f":"IF(ISERROR(L295/H295), \"\", L295/H295)","v":-8.4040300178300054E-2}]
["UNMETERED SCATTERED LOAD SERVICE CLASSIFICATION",null,null,"Total Deferral/Variance Account Rate Riders",null,-6.1999999999999998E-3,{"$f":"IF($E283>0, $E283, $E282)","v":100},-0.62,-6.8999999999999999E-3,{"$f":"IF($E283>0, $E283, $E282)","v":100},-0.69,-6.9999999999999951E-2,0.11290322580645154]
["UNMETERED SCATTERED LOAD SERVICE CLASSIFICATION",null,null,"GA Rate Riders",null,3.2000000000000002E-3,{"$f":"E282","v":100},0.32,3.6880218375164348E-3,{"$f":"E282","v":100},0.36880218375164348,4.8802183751643469E-2,0.15250682422388584]
["UNMETERED SCATTERED LOAD SERVICE CLASSIFICATION",null,null,"Low Voltage Service Charge",null,1E-4,{"$f":"IF($E283>0, $E283, $E282)","v":100},0.01,4.0000000000000002E-4,{"$f":"IF($E283>0, $E283, $E282)","v":100},0.04,0.03,3]
["UNMETERED SCATTERED LOAD SERVICE CLASSIFICATION",null,null,"Smart Meter Entity Charge (if applicable)",null,0,1,{"$f":"G299*F299","v":0},0,1,{"$f":"J299*I299","v":0},0,{"$f":"IF(ISERROR(L299/H299), \"\", L299/H299)","v":""}]
["UNMETERED SCATTERED LOAD SERVICE CLASSIFICATION","ST_B",{"$f":"B33","v":4},"Sub-Total B - Distribution (includes Sub-Total A)",null,null,null,{"$f":"SUM(H294:H299)","v":7.2288350000000001},null,null,{"$f":"SUM(K294:K299)","v":7.2766401796353817},4.7805179635381556E-2,{"$f":"IF((H300)=0,\"\",(L300/H300))","v":6.6131236409990761E-3}]
["UNMETERED SCATTERED LOAD SERVICE CLASSIFICATION",null,null,"RTSR - Network",null,5.1999999999999998E-3,{"$f":"IF($E283>0, $E283, $E282*$E284)","v":103.35000000000001},{"$f":"G301*F301","v":0.53742000000000001},5.0000000000000001E-3,{"$f":"IF($E283>0, $E283, $E282*$E285)","v":103.0684649944027},{"$f":"J301*I301","v":0.51534232497201349},-2.2077675027986521E-2,{"$f":"IF(ISERROR(L301/H301), \"\", L301/H301)","v":-4.1080858598463998E-2}]
["UNMETERED SCATTERED LOAD SERVICE CLASSIFICATION",null,null,"RTSR - Connection and/or Line and Transformation Connection",null,4.1000000000000003E-3,{"$f":"IF($E283>0, $E283, $E282*$E284)","v":103.35000000000001},{"$f":"G302*F302","v":0.42373500000000008},3.8999999999999998E-3,{"$f":"IF($E283>0, $E283, $E282*$E285)","v":103.0684649944027},{"$f":"J302*I302","v":0.40196701347817054},-2.1767986521829541E-2,{"$f":"IF(ISERROR(L302/H302), \"\", L302/H302)","v":-5.1371698164724498E-2}]
["UNMETERED SCATTERED LOAD SERVICE CLASSIFICATION","ST_C",{"$f":"B33","v":4},"Sub-Total C - Delivery (including Sub-Total B)",null,null,null,{"$f":"SUM(H300:H302)","v":8.1899899999999999},null,null,{"$f":"SUM(K300:K302)","v":8.1939495180855655},3.9595180855656054E-3,{"$f":"IF((H303)=0,\"\",(L303/H303))","v":4.8345823200829369E-4}]
["UNMETERED SCATTERED LOAD SERVICE CLASSIFICATION",null,null,"Wholesale Market Service Charge (WMSC)",null,3.2000000000000002E-3,{"$f":"E282*E284","v":103.35000000000001},{"$f":"G304*F304","v":0.33072000000000007},3.2000000000000002E-3,{"$f":"E282*E285","v":103.0684649944027},{"$f":"J304*I304","v":0.32981908798208864},-9.0091201791142606E-4,{"$f":"IF(ISERROR(L304/H304), \"\", L304/H304)","v":-2.7240929424027149E-3}]
["UNMETERED SCATTERED LOAD SERVICE CLASSIFICATION",null,null,"Rural and Remote Rate Protection (RRRP)",null,2.9999999999999997E-4,{"$f":"E282*E284","v":103.35000000000001},3.1005000000000001E-2,0,{"$f":"E282*E285","v":103.0684649944027},0,-3.1005000000000001E-2,-1]
["UNMETERED SCATTERED LOAD SERVICE CLASSIFICATION",null,null,"Standard Supply Service Charge"]
["UNMETERED SCATTERED LOAD SERVICE CLASSIFICATION",null,null,"Debt Retirement Charge (DRC)",null,{"$f":"IF('1. Information Sheet'!F304 = DATE(2016, 5, 1), (IF(ISERROR(FIND(\"RESIDENTIAL\", UPPER(E280))),DRC, 0)), DRC)","v":7.0000000000000001E-3},{"$f":"E282","v":100},0.70000000000000007,{"$f":"IF(ISERROR(FIND(\"RESIDENTIAL\", UPPER(E280))), DRC, 0)","v":7.0000000000000001E-3},{"$f":"E282","v":100},0.70000000000000007,0,0]
["UNMETERED SCATTERED LOAD SERVICE CLASSIFICATION",null,null,"Ontario Electricity Support Program \n(OESP) ",null,null,{"$f":"E282*E285","v":103.0684649944027},0,null,{"$f":"E282*E285","v":103.0684649944027},0,0,""]
["UNMETERED SCATTERED LOAD SERVICE CLASSIFICATION","RPP",null,"TOU - Off Peak",null,{"$f":"OffPeak","v":6.5000000000000002E-2},{"$f":"IF(AND(E282*12>=150000),0.65*E282*E284,0.65*E282)","v":65},4.2250000000000005,{"$f":"OffPeak","v":6.5000000000000002E-2},{"$f":"IF(AND(E282*12>=150000),0.65*E282*E285,0.65*E282)","v":65},4.2250000000000005,0,0]
["UNMETERED SCATTERED LOAD SERVICE CLASSIFICATION","RPP",null,"TOU - Mid Peak",null,{"$f":"MidPeak","v":9.5000000000000001E-2},{"$f":"IF(AND(E282*12>=150000),0.17*E282*E284,0.17*E282)","v":17},1.615,{"$f":"MidPeak","v":9.5000000000000001E-2},{"$f":"IF(AND(E282*12>=150000),0.17*E282*E285,0.17*E282)","v":17},1.615,0,0]
["UNMETERED SCATTERED LOAD SERVICE CLASSIFICATION","RPP",null,"TOU - On Peak",null,{"$f":"OnPeak","v":0.13200000000000001},{"$f":"IF(AND(E282*12>=150000),0.18*E282*E284,0.18*E282)","v":18},2.3760000000000003,{"$f":"OnPeak","v":0.13200000000000001},{"$f":"IF(AND(E282*12>=150000),0.18*E282*E285,0.18*E282)","v":18},2.3760000000000003,0,0]
["UNMETERED SCATTERED LOAD SERVICE CLASSIFICATION","Non-RPP (Retailer)",null,"Non-RPP Retailer Avg. Price",null,{"$f":"0.1101","v":0.1101},{"$f":"IF(AND(E282*12>=150000),E282*E284,E282)","v":100},{"$f":"G312*F312","v":11.01},{"$f":"F312","v":0.1101},{"$f":"IF(AND(E282*12>=150000),E282*E285,E282)","v":100},{"$f":"J312*I312","v":11.01},0,0]
["UNMETERED SCATTERED LOAD SERVICE CLASSIFICATION","Non-RPP (Other)",null,"Average IESO Wholesale Market Price",null,{"$f":"0.1101","v":0.1101},{"$f":"IF(AND(E282*12>=150000),E282*E284,E282)","v":100},{"$f":"G313*F313","v":11.01},{"$f":"F313","v":0.1101},{"$f":"IF(AND(E282*12>=150000),E282*E285,E282)","v":100},{"$f":"J313*I313","v":11.01},0,0]
["UNMETERED SCATTERED LOAD SERVICE CLASSIFICATION"]
["UNMETERED SCATTERED LOAD SERVICE CLASSIFICATION","RPP",null,"Total Bill on TOU (before Taxes)",null,null,null,{"$f":"SUM(H304:H311,H303)","v":17.467714999999998},null,null,{"$f":"SUM(K304:K311,K303)","v":17.439768606067656},{"$f":"K315-H315","v":-2.7946393932342772E-2},{"$f":"IF((H315)=0,\"\",(L315/H315))","v":-1.5998883616055548E-3}]
["UNMETERED SCATTERED LOAD SERVICE CLASSIFICATION","RPP",null,"HST",null,0.13,null,{"$f":"H315*F316","v":2.2708029499999998},0.13,null,{"$f":"K315*I316","v":2.2671699187887953},{"$f":"K316-H316","v":-3.6330312112045071E-3},{"$f":"IF((H316)=0,\"\",(L316/H316))","v":-1.5998883616055314E-3}]
[0,"RPP",null,"8% Rebate",null,0.08,null,0,0.08,null,0,{"$f":"K317-H317","v":0}]
[{"$f":"A316","v":"UNMETERED SCATTERED LOAD SERVICE CLASSIFICATION"},"RPP_TOTAL",null,"Total Bill on TOU",null,null,null,{"$f":"H315+H316+H317","v":19.738517949999999},null,null,{"$f":"K315+K316+K317","v":19.706938524856451},{"$f":"K318-H318","v":-3.1579425143547724E-2},{"$f":"IF((H318)=0,\"\",(L318/H318))","v":-1.5998883616055747E-3}]
["UNMETERED SCATTERED LOAD SERVICE CLASSIFICATION","RPP"]
["UNMETERED SCATTERED LOAD SERVICE CLASSIFICATION","Non-RPP (Retailer)",null,"Total Bill on Non-RPP Avg. Price",null,null,null,{"$f":"SUM(H312,H304:H308,H303)","v":20.261714999999999},null,null,{"$f":"SUM(K312,K304:K308,K303)","v":20.233768606067652},{"$f":"K320-H320","v":-2.7946393932346325E-2},{"$f":"IF((H320)=0,\"\",(L320/H320))","v":-1.3792709024061549E-3}]
["UNMETERED SCATTERED LOAD SERVICE CLASSIFICATION","Non-RPP (Retailer)",null,"HST",null,0.13,null,{"$f":"H320*F321","v":2.6340229499999999},0.13,null,{"$f":"K320*I321","v":2.6303899187887949},{"$f":"K321-H321","v":-3.6330312112049512E-3},{"$f":"IF((H321)=0,\"\",(L321/H321))","v":-1.3792709024061281E-3}]
[0,"Non-RPP (Retailer)",null,"8% Rebate",null,0.08,null,0,0.08,null,0]
[{"$f":"A321","v":"UNMETERED SCATTERED LOAD SERVICE CLASSIFICATION"},"Non-RPP (Retailer)_TOTAL",null,"Total Bill on Non-RPP Avg. Price",null,null,null,{"$f":"H320+H321+H322","v":22.895737949999997},null,null,{"$f":"K320+K321+K322","v":22.864158524856446},{"$f":"K323-H323","v":-3.1579425143551276E-2},{"$f":"IF((H323)=0,\"\",(L323/H323))","v":-1.3792709024061519E-3}]
["UNMETERED SCATTERED LOAD SERVICE CLASSIFICATION","Non-RPP (Retailer)"]
["UNMETERED SCATTERED LOAD SERVICE CLASSIFICATION","Non-RPP (Other)",null,"Total Bill on Average IESO Wholesale Market Price",null,null,null,{"$f":"SUM(H313,H304:H308,H303)","v":20.261714999999999},null,null,{"$f":"SUM(K313,K304:K308,K303)","v":20.233768606067652},{"$f":"K325-H325","v":-2.7946393932346325E-2},{"$f":"IF((H325)=0,\"\",(L325/H325))","v":-1.3792709024061549E-3}]
["UNMETERED SCATTERED LOAD SERVICE CLASSIFICATION","Non-RPP (Other)",null,"HST",null,0.13,null,{"$f":"H325*F326","v":2.6340229499999999},0.13,null,{"$f":"K325*I326","v":2.6303899187887949},{"$f":"K326-H326","v":-3.6330312112049512E-3},{"$f":"IF((H326)=0,\"\",(L326/H326))","v":-1.3792709024061281E-3}]
[0,"Non-RPP (Other)",null,"8% Rebate",null,0.08,null,0,0.08,null,0]
[{"$f":"A326","v":"UNMETERED SCATTERED LOAD SERVICE CLASSIFICATION"},"Non-RPP (Other)_TOTAL",{"$f":"B33","v":4},"Total Bill on Average IESO Wholesale Market Price",null,null,null,{"$f":"H325+H326+H327","v":22.895737949999997},null,null,{"$f":"K325+K326+K327","v":22.864158524856446},{"$f":"K328-H328","v":-3.1579425143551276E-2},{"$f":"IF((H328)=0,\"\",(L328/H328))","v":-1.3792709024061519E-3}]
["UNMETERED SCATTERED LOAD SERVICE CLASSIFICATION","Non-RPP (Other)"]
[]
[]
[]
[]
[null,null,null,"Customer Class:",{"$f":"D35","v":"STREET LIGHTING SERVICE CLASSIFICATION"},null,null,null,null,null,{"$f":"IF(N35=\"DEMAND - INTERVAL\",\"RTSR - INTERVAL METERED\",\"\")","v":""},null,null,null,null,null,null,null,null,"X"]
[null,null,null,"RPP / Non-RPP:",{"$f":"H35","v":"Non-RPP (Other)"}]
[null,null,null,"Consumption",{"$f":"K35","v":400000},"kWh"]
[null,null,null,"Demand",{"$f":"L35","v":700},"kW"]
[null,null,null,"Current Loss Factor",{"$f":"I35","v":1.0335000000000001}]
[null,null,null,"Proposed/Approved Loss Factor",{"$f":"J35","v":1.030684649944027}]
[]
[null,null,null,null,null,"Current OEB-Approved",null,null,"Proposed",null,null,"Impact"]
[null,null,null,null,null,"Rate","Volume","Charge","Rate","Volume","Charge","$ Change","% Change"]
[null,null,null,null,null,"($)",null,"($)","($)",null,"($)"]
[{"$f":"$E334","v":"STREET LIGHTING SERVICE CLASSIFICATION"},null,null,"Monthly Service Charge",null,2.56,547,{"$f":"G344*F344","v":1400.32},1.65,{"$f":"G344","v":547},{"$f":"J344*I344","v":902.55},{"$f":"K344-H344","v":-497.77},{"$f":"IF(ISERROR(L344/H344), \"\", L344/H344)","v":-0.35546875}]
[{"$f":"A344","v":"STREET LIGHTING SERVICE CLASSIFICATION"},null,null,"Distribution Volumetric Rate",null,16.365600000000001,{"$f":"IF($E337>0, $E337, $E336)","v":700},{"$f":"G345*F345","v":11455.92},13.3222,{"$f":"IF($E337>0, $E337, $E336)","v":700},{"$f":"J345*I345","v":9325.5400000000009},-2130.3799999999992,{"$f":"IF(ISERROR(L345/H345), \"\", L345/H345)","v":-0.18596323996675948}]
[{"$f":"A345","v":"STREET LIGHTING SERVICE CLASSIFICATION"},null,null,"Fixed Rate Riders",null,0,547,0,0,{"$f":"G346","v":547},{"$f":"J346*I346","v":0},0,""]
["STREET LIGHTING SERVICE CLASSIFICATION",null,null,"Volumetric Rate Riders",null,0,{"$f":"IF($E337>0, $E337, $E336)","v":700},0,0,{"$f":"IF($E337>0, $E337, $E336)","v":700},0,0,""]
["STREET LIGHTING SERVICE CLASSIFICATION","ST_A",{"$f":"B35","v":6},"Sub-Total A (excluding pass through)",null,null,null,{"$f":"SUM(H344:H347)","v":12856.24},null,null,{"$f":"SUM(K344:K347)","v":10228.09},-2628.1499999999996,{"$f":"IF((H348)=0,\"\",(L348/H348))","v":-0.20442602191620565}]
["STREET LIGHTING SERVICE CLASSIFICATION",null,null,"Line Losses on Cost of Power",null,{"$f":"IF((E336*12>=150000), 0, IF(E335=\"RPP\",(F363*0.65+F364*0.17+F365*0.18),IF(E335=\"Non-RPP (Retailer)\",F366,F367)))","v":0},{"$f":"IF(F349=0, 0, $E336*E338-E336)","v":0},{"$f":"G349*F349","v":0},{"$f":"IF((E336*12>=150000), 0, IF(E335=\"RPP\",(I363*0.65+I364*0.17+I365*0.18),IF(E335=\"Non-RPP (Retailer)\",I366,I367)))","v":0},{"$f":"IF(I349=0, 0, E336*E339-E336)","v":0},{"$f":"J349*I349","v":0},{"$f":"K349-H349","v":0},{"$f":"IF(ISERROR(L349/H349), \"\", L349/H349)","v":""}]
["STREET LIGHTING SERVICE CLASSIFICATION",null,null,"Total Deferral/Variance Account Rate Riders",null,-2.2406999999999999,{"$f":"IF($E337>0, $E337, $E336)","v":700},-1568.49,-0.2903,{"$f":"IF($E337>0, $E337, $E336)","v":700},-203.21,1365.28,-0.8704422725041282]
["STREET LIGHTING SERVICE CLASSIFICATION",null,null,"GA Rate Riders",null,3.3E-3,{"$f":"E336","v":400000},1320,3.7880218375164346E-3,{"$f":"E336","v":400000},1515.2087350065738,195.20873500657376,0.14788540530801042]
["STREET LIGHTING SERVICE CLASSIFICATION",null,null,"Low Voltage Service Charge",null,2.7E-2,{"$f":"IF($E337>0, $E337, $E336)","v":700},18.899999999999999,0.1158,{"$f":"IF($E337>0, $E337, $E336)","v":700},81.06,62.160000000000004,3.2888888888888892]
["STREET LIGHTING SERVICE CLASSIFICATION",null,null,"Smart Meter Entity Charge (if applicable)",null,0,1,{"$f":"G353*F353","v":0},0,1,{"$f":"J353*I353","v":0},0,{"$f":"IF(ISERROR(L353/H353), \"\", L353/H353)","v":""}]
["STREET LIGHTING SERVICE CLASSIFICATION","ST_B",{"$f":"B35","v":6},"Sub-Total B - Distribution (includes Sub-Total A)",null,null,null,{"$f":"SUM(H348:H353)","v":12626.65},null,null,{"$f":"SUM(K348:K353)","v":11621.148735006574},-1005.5012649934251,{"$f":"IF((H354)=0,\"\",(L354/H354))","v":-7.9633257039153318E-2}]
["STREET LIGHTING SERVICE CLASSIFICATION",null,null,"RTSR - Network",null,1.6867000000000001,{"$f":"IF($E337>0, $E337, $E336*$E338)","v":700},{"$f":"G355*F355","v":1180.69},1.5981000000000001,{"$f":"IF($E337>0, $E337, $E336*$E339)","v":700},{"$f":"J355*I355","v":1118.67},-62.019999999999982,{"$f":"IF(ISERROR(L355/H355), \"\", L355/H355)","v":-5.2528606154028559E-2}]
["STREET LIGHTING SERVICE CLASSIFICATION",null,null,"RTSR - Connection and/or Line and Transformation Connection",null,1.2485999999999999,{"$f":"IF($E337>0, $E337, $E336*$E338)","v":700},{"$f":"G356*F356","v":874.02},1.2,{"$f":"IF($E337>0, $E337, $E336*$E339)","v":700},{"$f":"J356*I356","v":840},-34.019999999999982,{"$f":"IF(ISERROR(L356/H356), \"\", L356/H356)","v":-3.8923594425756824E-2}]
["STREET LIGHTING SERVICE CLASSIFICATION","ST_C",{"$f":"B35","v":6},"Sub-Total C - Delivery (including Sub-Total B)",null,null,null,{"$f":"SUM(H354:H356)","v":14681.36},null,null,{"$f":"SUM(K354:K356)","v":13579.818735006575},-1101.541264993426,{"$f":"IF((H357)=0,\"\",(L357/H357))","v":-7.5029919911603959E-2}]
["STREET LIGHTING SERVICE CLASSIFICATION",null,null,"Wholesale Market Service Charge (WMSC)",null,3.2000000000000002E-3,{"$f":"E336*E338","v":413400.00000000006},{"$f":"G358*F358","v":1322.8800000000003},3.2000000000000002E-3,{"$f":"E336*E339","v":412273.85997761082},{"$f":"J358*I358","v":1319.2763519283546},-3.6036480716456936,{"$f":"IF(ISERROR(L358/H358), \"\", L358/H358)","v":-2.7240929424027067E-3}]
["STREET LIGHTING SERVICE CLASSIFICATION",null,null,"Rural and Remote Rate Protection (RRRP)",null,2.9999999999999997E-4,{"$f":"E336*E338","v":413400.00000000006},124.02000000000001,0,{"$f":"E336*E339","v":412273.85997761082},0,-124.02000000000001,-1]
["STREET LIGHTING SERVICE CLASSIFICATION",null,null,"Standard Supply Service Charge"]
["STREET LIGHTING SERVICE CLASSIFICATION",null,null,"Debt Retirement Charge (DRC)",null,{"$f":"IF('1. Information Sheet'!F358 = DATE(2016, 5, 1), (IF(ISERROR(FIND(\"RESIDENTIAL\", UPPER(E334))),DRC, 0)), DRC)","v":7.0000000000000001E-3},{"$f":"E336","v":400000},2800,{"$f":"IF(ISERROR(FIND(\"RESIDENTIAL\", UPPER(E334))), DRC, 0)","v":7.0000000000000001E-3},{"$f":"E336","v":400000},2800,0,0]
["STREET LIGHTING SERVICE CLASSIFICATION",null,null,"Ontario Electricity Support Program \n(OESP) ",null,null,{"$f":"E336*E339","v":412273.85997761082},0,null,{"$f":"E336*E339","v":412273.85997761082},0,0,""]
["STREET LIGHTING SERVICE CLASSIFICATION","RPP",null,"TOU - Off Peak",null,{"$f":"OffPeak","v":6.5000000000000002E-2},{"$f":"IF(AND(E336*12>=150000),0.65*E336*E338,0.65*E336)","v":268710},17466.150000000001,{"$f":"OffPeak","v":6.5000000000000002E-2},{"$f":"IF(AND(E336*12>=150000),0.65*E336*E339,0.65*E336)","v":267978.008985447},17418.570584054054,-47.579415945947403,-2.7240929424027275E-3]
["STREET LIGHTING SERVICE CLASSIFICATION","RPP",null,"TOU - Mid Peak",null,{"$f":"MidPeak","v":9.5000000000000001E-2},{"$f":"IF(AND(E336*12>=150000),0.17*E336*E338,0.17*E336)","v":70278},6676.41,{"$f":"MidPeak","v":9.5000000000000001E-2},{"$f":"IF(AND(E336*12>=150000),0.17*E336*E339,0.17*E336)","v":70086.556196193837},6658.2228386384149,-18.187161361584913,-2.7240929424024157E-3]
["STREET LIGHTING SERVICE CLASSIFICATION","RPP",null,"TOU - On Peak",null,{"$f":"OnPeak","v":0.13200000000000001},{"$f":"IF(AND(E336*12>=150000),0.18*E336*E338,0.18*E336)","v":74412},9822.384,{"$f":"OnPeak","v":0.13200000000000001},{"$f":"IF(AND(E336*12>=150000),0.18*E336*E339,0.18*E336)","v":74209.294795969938},9795.6269130680321,-26.757086931967933,-2.7240929424025709E-3]
["STREET LIGHTING SERVICE CLASSIFICATION","Non-RPP (Retailer)",null,"Non-RPP Retailer Avg. Price",null,{"$f":"0.1101","v":0.1101},{"$f":"IF(AND(E336*12>=150000),E336*E338,E336)","v":413400.00000000006},{"$f":"G366*F366","v":45515.340000000011},{"$f":"F366","v":0.1101},{"$f":"IF(AND(E336*12>=150000),E336*E339,E336)","v":412273.85997761082},{"$f":"J366*I366","v":45391.351983534951},-123.98801646506035,-2.7240929424027223E-3]
["STREET LIGHTING SERVICE CLASSIFICATION","Non-RPP (Other)",null,"Average IESO Wholesale Market Price",null,{"$f":"0.1101","v":0.1101},{"$f":"IF(AND(E336*12>=150000),E336*E338,E336)","v":413400.00000000006},{"$f":"G367*F367","v":45515.340000000011},{"$f":"F367","v":0.1101},{"$f":"IF(AND(E336*12>=150000),E336*E339,E336)","v":412273.85997761082},{"$f":"J367*I367","v":45391.351983534951},-123.98801646506035,-2.7240929424027223E-3]
["STREET LIGHTING SERVICE CLASSIFICATION"]
["STREET LIGHTING SERVICE CLASSIFICATION","RPP",null,"Total Bill on TOU (before Taxes)",null,null,null,{"$f":"SUM(H358:H365,H357)","v":52893.204000000005},null,null,{"$f":"SUM(K358:K365,K357)","v":51571.515422695433},{"$f":"K369-H369","v":-1321.6885773045724},{"$f":"IF((H369)=0,\"\",(L369/H369))","v":-2.4987871358758532E-2}]
["STREET LIGHTING SERVICE CLASSIFICATION","RPP",null,"HST",null,0.13,null,{"$f":"H369*F370","v":6876.1165200000005},0.13,null,{"$f":"K369*I370","v":6704.2970049504065},{"$f":"K370-H370","v":-171.81951504959397},{"$f":"IF((H370)=0,\"\",(L370/H370))","v":-2.4987871358758469E-2}]
[0,"RPP",null,"8% Rebate",null,0.08,null,0,0.08,null,0,{"$f":"K371-H371","v":0}]
[{"$f":"A370","v":"STREET LIGHTING SERVICE CLASSIFICATION"},"RPP_TOTAL",null,"Total Bill on TOU",null,null,null,{"$f":"H369+H370+H371","v":59769.320520000008},null,null,{"$f":"K369+K370+K371","v":58275.81242764584},{"$f":"K372-H372","v":-1493.5080923541682},{"$f":"IF((H372)=0,\"\",(L372/H372))","v":-2.4987871358758556E-2}]
["STREET LIGHTING SERVICE CLASSIFICATION","RPP"]
["STREET LIGHTING SERVICE CLASSIFICATION","Non-RPP (Retailer)",null,"Total Bill on Non-RPP Avg. Price",null,null,null,{"$f":"SUM(H366,H358:H362,H357)","v":64443.600000000006},null,null,{"$f":"SUM(K366,K358:K362,K357)","v":63090.447070469876},{"$f":"K374-H374","v":-1353.1529295301298},{"$f":"IF((H374)=0,\"\",(L374/H374))","v":-2.0997475769977618E-2}]
["STREET LIGHTING SERVICE CLASSIFICATION","Non-RPP (Retailer)",null,"HST",null,0.13,null,{"$f":"H374*F375","v":8377.6680000000015},0.13,null,{"$f":"K374*I375","v":8201.7581191610843},{"$f":"K375-H375","v":-175.90988083891716},{"$f":"IF((H375)=0,\"\",(L375/H375))","v":-2.0997475769977653E-2}]
[0,"Non-RPP (Retailer)",null,"8% Rebate",null,0.08,null,0,0.08,null,0]
[{"$f":"A375","v":"STREET LIGHTING SERVICE CLASSIFICATION"},"Non-RPP (Retailer)_TOTAL",null,"Total Bill on Non-RPP Avg. Price",null,null,null,{"$f":"H374+H375+H376","v":72821.268000000011},null,null,{"$f":"K374+K375+K376","v":71292.205189630957},{"$f":"K377-H377","v":-1529.0628103690542},{"$f":"IF((H377)=0,\"\",(L377/H377))","v":-2.0997475769977722E-2}]
["STREET LIGHTING SERVICE CLASSIFICATION","Non-RPP (Retailer)"]
["STREET LIGHTING SERVICE CLASSIFICATION","Non-RPP (Other)",null,"Total Bill on Average IESO Wholesale Market Price",null,null,null,{"$f":"SUM(H367,H358:H362,H357)","v":64443.600000000006},null,null,{"$f":"SUM(K367,K358:K362,K357)","v":63090.447070469876},{"$f":"K379-H379","v":-1353.1529295301298},{"$f":"IF((H379)=0,\"\",(L379/H379))","v":-2.0997475769977618E-2}]
["STREET LIGHTING SERVICE CLASSIFICATION","Non-RPP (Other)",null,"HST",null,0.13,null,{"$f":"H379*F380","v":8377.6680000000015},0.13,null,{"$f":"K379*I380","v":8201.7581191610843},{"$f":"K380-H380","v":-175.90988083891716},{"$f":"IF((H380)=0,\"\",(L380/H380))","v":-2.0997475769977653E-2}]
[0,"Non-RPP (Other)",null,"8% Rebate",null,0.08,null,0,0.08,null,0]
[{"$f":"A380","v":"STREET LIGHTING SERVICE CLASSIFICATION"},"Non-RPP (Other)_TOTAL",{"$f":"B35","v":6},"Total Bill on Average IESO Wholesale Market Price",null,null,null,{"$f":"H379+H380+H381","v":72821.268000000011},null,null,{"$f":"K379+K380+K381","v":71292.205189630957},{"$f":"K382-H382","v":-1529.0628103690542},{"$f":"IF((H382)=0,\"\",(L382/H382))","v":-2.0997475769977722E-2}]
["STREET LIGHTING SERVICE CLASSIFICATION","Non-RPP (Other)"]

{"sheet":"20. HIDDEN","index":7,"n_rows":51,"n_cols":15,"rows_kept":51,"cut":false,"hidden":true,"merged":[[8,11,8,12],[9,4,10,4],[9,11,10,11],[9,12,10,12],[39,3,39,4],[44,3,44,4],[49,3,49,4],[1,4,1,9],[2,4,2,6],[8,5,8,7],[8,8,8,10]]}
[]
[null,null,null,"Customer Class:",null,null,null,null,null,null,null,null,null,null,{"$f":"FIND(\"RESIDENTIAL\", E2)","v":{"$error":"#VALUE!"}}]
[null,null,null,"RPP / Non-RPP:"]
[null,null,null,"Consumption",null,"kWh"]
[null,null,null,"Demand",null,"kW"]
[null,null,null,"Current Loss Factor"]
[null,null,null,"Proposed/Approved Loss Factor"]
[]
[null,null,null,null,null,"Current OEB-Approved",null,null,"Proposed",null,null,"Impact"]
[null,null,null,null,null,"Rate","Volume","Charge","Rate","Volume","Charge","$ Change","% Change"]
[null,null,null,null,null,"($)",null,"($)","($)",null,"($)"]
[{"$f":"$E2","v":0},null,null,"Monthly Service Charge",null,null,1,{"$f":"G12*F12","v":0},null,{"$f":"G12","v":1},{"$f":"J12*I12","v":0},{"$f":"K12-H12","v":0},{"$f":"IF(ISERROR(L12/H12), \"\", L12/H12)","v":""}]
[{"$f":"A12","v":0},null,null,"Distribution Volumetric Rate",null,null,{"$f":"IF($E5>0, $E5, $E4)","v":0},{"$f":"G13*F13","v":0},null,{"$f":"IF($E5>0, $E5, $E4)","v":0},{"$f":"J13*I13","v":0},0,{"$f":"IF(ISERROR(L13/H13), \"\", L13/H13)","v":""}]
[{"$f":"A13","v":0},null,null,"Fixed Rate Riders",null,null,1,0,null,{"$f":"G14","v":1},{"$f":"J14*I14","v":0},0,""]
[0,null,null,"Volumetric Rate Riders",null,null,{"$f":"IF($E5>0, $E5, $E4)","v":0},0,null,{"$f":"IF($E5>0, $E5, $E4)","v":0},0,0,""]
[0,"ST_A",null,"Sub-Total A (excluding pass through)",null,null,null,{"$f":"SUM(H12:H15)","v":0},null,null,{"$f":"SUM(K12:K15)","v":0},0,{"$f":"IF((H16)=0,\"\",(L16/H16))","v":""}]
[0,null,null,"Line Losses on Cost of Power",null,{"$f":"IF((E4*12>=150000), 0, IF(E3=\"RPP\",(F31*0.65+F32*0.17+F33*0.18),IF(E3=\"Non-RPP (Retailer)\",F34,F35)))","v":0.1101},{"$f":"IF(F17=0, 0, $E4*E6-E4)","v":0},{"$f":"G17*F17","v":0},{"$f":"IF((E4*12>=150000), 0, IF(E3=\"RPP\",(I31*0.65+I32*0.17+I33*0.18),IF(E3=\"Non-RPP (Retailer)\",I34,I35)))","v":0.1101},{"$f":"IF(I17=0, 0, E4*E7-E4)","v":0},{"$f":"J17*I17","v":0},{"$f":"K17-H17","v":0},{"$f":"IF(ISERROR(L17/H17), \"\", L17/H17)","v":""}]
[0,null,null,"Total Deferral/Variance Account Rate Riders",null,null,{"$f":"IF($E5>0, $E5, $E4)","v":0},0,null,{"$f":"IF($E5>0, $E5, $E4)","v":0},0,0,""]
[0,null,null,"GA Rate Riders",null,null,{"$f":"E4","v":0},0,null,{"$f":"E4","v":0},0,0,""]
[0,null,null,"Low Voltage Service Charge",null,null,{"$f":"IF($E5>0, $E5, $E4)","v":0},0,null,{"$f":"IF($E5>0, $E5, $E4)","v":0},0,0,""]
[0,null,null,"Smart Meter Entity Charge (if applicable)",null,{"$f":"IF(OR(ISNUMBER(SEARCH(\"RESIDENTIAL\", E2))=TRUE, ISNUMBER(SEARCH(\"GENERAL SERVICE LESS THAN 50\", E2))=TRUE), 0.79, 0)","v":0},1,{"$f":"G21*F21","v":0},{"$f":"IF(OR(ISNUMBER(SEARCH(\"RESIDENTIAL\", E2))=TRUE, ISNUMBER(SEARCH(\"GENERAL SERVICE LESS THAN 50\", E2))=TRUE), 0.79, 0)","v":0},1,{"$f":"J21*I21","v":0},{"$f":"K21-H21","v":0},{"$f":"IF(ISERROR(L21/H21), \"\", L21/H21)","v":""}]
[0,"ST_B",null,"Sub-Total B - Distribution (includes Sub-Total A)",null,null,null,{"$f":"SUM(H16:H21)","v":0},null,null,{"$f":"SUM(K16:K21)","v":0},0,{"$f":"IF((H22)=0,\"\",(L22/H22))","v":""}]
[0,null,null,"RTSR - Network",null,null,{"$f":"IF($E5>0, $E5, $E4*$E6)","v":0},{"$f":"G23*F23","v":0},null,{"$f":"IF($E5>0, $E5, $E4*$E7)","v":0},{"$f":"J23*I23","v":0},0,{"$f":"IF(ISERROR(L23/H23), \"\", L23/H23)","v":""}]
[0,null,null,"RTSR - Connection and/or Line and Transformation Connection",null,null,{"$f":"IF($E5>0, $E5, $E4*$E6)","v":0},{"$f":"G24*F24","v":0},null,{"$f":"IF($E5>0, $E5, $E4*$E7)","v":0},{"$f":"J24*I24","v":0},0,{"$f":"IF(ISERROR(L24/H24), \"\", L24/H24)","v":""}]
[0,"ST_C",null,"Sub-Total C - Delivery (including Sub-Total B)",null,null,null,{"$f":"SUM(H22:H24)","v":0},null,null,{"$f":"SUM(K22:K24)","v":0},0,{"$f":"IF((H25)=0,\"\",(L25/H25))","v":""}]
[0,null,null,"Wholesale Market Service Charge (WMSC)",null,null,{"$f":"E4*E6","v":0},{"$f":"G26*F26","v":0},{"$f":"'3. Regulatory Charges'!D14","v":3.2000000000000002E-3},{"$f":"E4*E7","v":0},{"$f":"J26*I26","v":0},0,{"$f":"IF(ISERROR(L26/H26), \"\", L26/H26)","v":""}]
[0,null,null,"Rural and Remote Rate Protection (RRRP)",null,null,{"$f":"E4*E6","v":0},0,{"$f":"'3. Regulatory Charges'!D16","v":2.9999999999999997E-4},{"$f":"E4*E7","v":0},0,0,""]
[0,null,null,"Standard Supply Service Charge",null,0.25,1,0.25,{"$f":"'3. Regulatory Charges'!D17","v":0.25},1,0.25,0,0]
[0,null,null,"Debt Retirement Charge (DRC)",null,{"$f":"IF('1. Information Sheet'!F26 = DATE(2016, 5, 1), (IF(ISERROR(FIND(\"RESIDENTIAL\", UPPER(E2))),DRC, 0)), DRC)","v":7.0000000000000001E-3},{"$f":"E4","v":0},0,{"$f":"IF(ISERROR(FIND(\"RESIDENTIAL\", UPPER(E2))), DRC, 0)","v":7.0000000000000001E-3},{"$f":"E4","v":0},0,{"$f":"K29-H29","v":0},""]
[0,null,null,"Ontario Electricity Support Program \n(OESP) ",null,null,{"$f":"E4*E7","v":0},0,null,{"$f":"E4*E7","v":0},0,0,""]
[0,"RPP",null,"TOU - Off Peak",null,{"$f":"OffPeak","v":6.5000000000000002E-2},{"$f":"IF(AND(E4*12>=150000),0.65*E4*E6,0.65*E4)","v":0},0,{"$f":"OffPeak","v":6.5000000000000002E-2},{"$f":"IF(AND(E4*12>=150000),0.65*E4*E7,0.65*E4)","v":0},0,0,""]
[0,"RPP",null,"TOU - Mid Peak",null,{"$f":"MidPeak","v":9.5000000000000001E-2},{"$f":"IF(AND(E4*12>=150000),0.17*E4*E6,0.17*E4)","v":0},0,{"$f":"MidPeak","v":9.5000000000000001E-2},{"$f":"IF(AND(E4*12>=150000),0.17*E4*E7,0.17*E4)","v":0},0,0,""]
[0,"RPP",null,"TOU - On Peak",null,{"$f":"OnPeak","v":0.13200000000000001},{"$f":"IF(AND(E4*12>=150000),0.18*E4*E6,0.18*E4)","v":0},0,{"$f":"OnPeak","v":0.13200000000000001},{"$f":"IF(AND(E4*12>=150000),0.18*E4*E7,0.18*E4)","v":0},0,0,""]
[0,"Non-RPP (Retailer)",null,"Non-RPP Retailer Avg. Price",null,{"$f":"0.1101","v":0.1101},{"$f":"IF(AND(E4*12>=150000),E4*E6,E4)","v":0},{"$f":"G34*F34","v":0},{"$f":"F34","v":0.1101},{"$f":"IF(AND(E4*12>=150000),E4*E7,E4)","v":0},{"$f":"J34*I34","v":0},0,""]
[0,"Non-RPP (Other)",null,"Average IESO Wholesale Market Price",null,{"$f":"0.1101","v":0.1101},{"$f":"IF(AND(E4*12>=150000),E4*E6,E4)","v":0},{"$f":"G35*F35","v":0},{"$f":"F35","v":0.1101},{"$f":"IF(AND(E4*12>=150000),E4*E7,E4)","v":0},{"$f":"J35*I35","v":0},0,""]
[0]
[0,"RPP",null,"Total Bill on TOU (before Taxes)",null,null,null,{"$f":"SUM(H26:H33,H25)","v":0.25},null,null,{"$f":"SUM(K26:K33,K25)","v":0.25},{"$f":"K37-H37","v":0},{"$f":"IF((H37)=0,\"\",(L37/H37))","v":0}]
[0,"RPP",null,"HST",null,0.13,null,{"$f":"H37*F38","v":3.2500000000000001E-2},0.13,null,{"$f":"K37*I38","v":3.2500000000000001E-2},{"$f":"K38-H38","v":0},{"$f":"IF((H38)=0,\"\",(L38/H38))","v":0}]
[0,"RPP",null,"8% Rebate",null,0.08,null,{"$f":"H37*F39*(-1)","v":-0.02},0.08,null,{"$f":"K37*I39*(-1)","v":-0.02},{"$f":"K39-H39","v":0}]
[{"$f":"A38","v":0},"RPP_TOTAL",null,"Total Bill on TOU",null,null,null,{"$f":"H37+H38+H39","v":0.26249999999999996},null,null,{"$f":"K37+K38+K39","v":0.26249999999999996},{"$f":"K40-H40","v":0},{"$f":"IF((H40)=0,\"\",(L40/H40))","v":0}]
[0,"RPP"]
[0,"Non-RPP (Retailer)",null,"Total Bill on Non-RPP Avg. Price",null,null,null,{"$f":"SUM(H34,H26:H30,H25)","v":0.25},null,null,{"$f":"SUM(K34,K26:K30,K25)","v":0.25},{"$f":"K42-H42","v":0},{"$f":"IF((H42)=0,\"\",(L42/H42))","v":0}]
[0,"Non-RPP (Retailer)",null,"HST",null,0.13,null,{"$f":"H42*F43","v":3.2500000000000001E-2},0.13,null,{"$f":"K42*I43","v":3.2500000000000001E-2},{"$f":"K43-H43","v":0},{"$f":"IF((H43)=0,\"\",(L43/H43))","v":0}]
[0,"Non-RPP (Retailer)",null,"8% Rebate",null,0.08,null,{"$f":"H42*F44*(-1)","v":-0.02},0.08,null,{"$f":"K42*I44*(-1)","v":-0.02}]
[{"$f":"A43","v":0},"Non-RPP (Retailer)_TOTAL",null,"Total Bill on Non-RPP Avg. Price",null,null,null,{"$f":"H42+H43+H44","v":0.26249999999999996},null,null,{"$f":"K42+K43+K44","v":0.26249999999999996},{"$f":"K45-H45","v":0},{"$f":"IF((H45)=0,\"\",(L45/H45))","v":0}]
[0,"Non-RPP (Retailer)"]
[0,"Non-RPP (Other)",null,"Total Bill on Average IESO Wholesale Market Price",null,null,null,{"$f":"SUM(H35,H26:H30,H25)","v":0.25},null,null,{"$f":"SUM(K35,K26:K30,K25)","v":0.25},{"$f":"K47-H47","v":0},{"$f":"IF((H47)=0,\"\",(L47/H47))","v":0}]
[0,"Non-RPP (Other)",null,"HST",null,0.13,null,{"$f":"H47*F48","v":3.2500000000000001E-2},0.13,null,{"$f":"K47*I48","v":3.2500000000000001E-2},{"$f":"K48-H48","v":0},{"$f":"IF((H48)=0,\"\",(L48/H48))","v":0}]
[0,"Non-RPP (Other)",null,"8% Rebate",null,0.08,null,{"$f":"H47*F49*(-1)","v":-0.02},0.08,null,{"$f":"K47*I49*(-1)","v":-0.02}]
[{"$f":"A48","v":0},"Non-RPP (Other)_TOTAL",null,"Total Bill on Average IESO Wholesale Market Price",null,null,null,{"$f":"H47+H48+H49","v":0.26249999999999996},null,null,{"$f":"K47+K48+K49","v":0.26249999999999996},{"$f":"K50-H50","v":0},{"$f":"IF((H50)=0,\"\",(L50/H50))","v":0}]
[0,"Non-RPP (Other)"]

{"sheet":"Database","index":8,"n_rows":466,"n_cols":22,"rows_kept":466,"cut":false,"hidden":true,"merged":[[56,4,56,7],[58,4,58,7],[60,4,60,7],[332,4,332,7],[333,4,333,7],[342,4,342,5],[343,4,343,5],[344,4,344,5],[345,4,345,5],[194,4,194,5],[195,4,195,5],[196,4,196,5],[197,4,197,5],[198,4,198,5],[181,4,181,5],[183,4,183,5],[152,4,152,7],[160,4,160,5],[161,4,161,5],[163,4,163,5],[164,4,164,5],[165,4,165,5],[166,4,166,5],[172,4,172,5],[42,4,42,5],[32,4,32,7],[33,4,33,7],[26,4,26,5],[35,4,35,7],[341,4,341,5],[384,4,384,5],[394,4,394,7],[395,4,395,7],[385,4,385,5],[386,4,386,5],[387,4,387,5],[388,4,388,5],[389,4,389,5],[391,4,391,5],[376,4,376,7],[377,4,377,7],[309,4,309,5],[321,4,321,5],[148,4,148,5],[45,4,45,5],[80,4,80,7],[65,4,65,5],[55,4,55,7],[19,4,19,5],[20,4,20,5],[22,4,22,5],[24,4,24,5],[25,4,25,5],[11,4,11,7],[12,4,12,7],[13,4,13,7],[14,4,14,7],[16,4,16,5],[18,4,18,5],[1,4,1,7],[2,4,2,7],[3,4,3,7],[4,4,4,7],[5,4,5,7],[6,4,6,7],[7,4,7,7],[8,4,8,7],[9,4,9,7],[113,4,113,5],[114,4,114,5],[115,4,115,5],[432,4,432,5],[435,4,435,5],[322,4,322,5],[323,4,323,5],[246,4,246,7],[310,4,310,5],[347,4,347,5],[354,4,354,7],[355,4,355,7],[356,4,356,7],[357,4,357,7],[396,4,396,7],[397,4,397,7],[398,4,398,7],[346,4,346,5],[188,4,188,7],[189,4,189,7],[202,4,202,5],[203,4,203,5],[206,4,206,5],[210,4,210,5],[104,4,104,7],[105,4,105,5],[106,4,106,5],[107,4,107,5],[108,4,108,5],[109,4,109,5],[110,4,110,5],[111,4,111,5],[112,4,112,5],[95,4,95,5],[96,4,96,5],[97,4,97,7],[98,4,98,7],[99,4,99,7],[100,4,100,7],[101,4,101,7],[102,4,102,7],[103,4,103,7],[86,4,86,5],[87,4,87,5],[88,4,88,5],[89,4,89,5],[90,4,90,5],[91,4,91,5],[92,4,92,5],[93,4,93,5],[94,4,94,5],[271,4,271,7],[272,4,272,7],[278,4,278,5],[279,4,279,5],[280,4,280,5],[23,4,23,5],[28,4,28,5],[29,4,29,5],[36,4,36,7],[37,4,37,7],[46,4,46,5],[47,4,47,5],[48,4,48,5],[49,4,49,5],[51,4,51,5],[59,4,59,7],[62,4,62,5],[63,4,63,5],[64,4,64,5],[66,4,66,5],[67,4,67,5],[68,4,68,5],[69,4,69,5],[85,4,85,5],[167,4,167,5],[169,4,169,5],[209,4,209,5],[263,4,263,5],[273,4,273,5],[276,4,276,5],[277,4,277,5],[286,4,286,5],[248,4,248,7],[250,4,250,5],[251,4,251,5],[252,4,252,5],[253,4,253,5],[254,4,254,5],[255,4,255,5],[256,4,256,5],[257,4,257,5],[258,4,258,5],[259,4,259,5],[260,4,260,5],[261,4,261,5],[262,4,262,5],[264,4,264,7],[265,4,265,7],[226,4,226,7],[227,4,227,5],[228,4,228,5],[229,4,229,5],[230,4,230,5],[231,4,231,5],[241,4,241,7],[242,4,242,7],[243,4,243,7],[217,4,217,7],[218,4,218,7],[219,4,219,7],[220,4,220,7],[221,4,221,7],[222,4,222,7],[223,4,223,7],[224,4,224,7],[225,4,225,7],[297,4,297,5],[298,4,298,5],[299,4,299,5],[300,4,300,5],[275,4,275,5],[232,4,232,5],[233,4,233,5],[234,4,234,5],[235,4,235,5],[236,4,236,5],[237,4,237,5],[238,4,238,5],[239,4,239,5],[240,4,240,5],[249,4,249,7],[274,4,274,5],[244,4,244,7],[245,4,245,7],[247,4,247,7],[266,4,266,7],[267,4,267,7],[268,4,268,7],[269,4,269,7],[270,4,270,7],[411,4,411,5],[422,4,422,5],[423,4,423,5],[424,4,424,5],[404,4,404,5],[381,4,381,7],[382,4,382,7],[383,4,383,7],[392,4,392,5],[459,4,459,5],[464,4,464,5],[465,4,465,5],[401,4,401,5],[403,4,403,5],[430,4,430,5],[431,4,431,5],[462,4,462,5],[463,4,463,5],[433,4,433,5],[434,4,434,5],[454,4,454,5],[456,4,456,5],[457,4,457,5],[406,4,406,7],[407,4,407,7],[408,4,408,7],[414,4,414,5],[415,4,415,5],[416,4,416,5],[417,4,417,5],[418,4,418,5],[419,4,419,5],[420,4,420,5],[427,4,427,5],[428,4,428,5],[429,4,429,5],[442,4,442,7],[443,4,443,7],[447,4,447,5],[453,4,453,5],[455,4,455,5],[458,4,458,5],[436,4,436,5],[438,4,438,5],[439,4,439,5],[440,4,440,5],[444,4,444,7],[445,4,445,7],[446,4,446,7],[448,4,448,5],[449,4,449,5],[450,4,450,5],[451,4,451,5],[452,4,452,5],[79,4,79,7],[81,4,81,7],[82,4,82,7],[83,4,83,7],[84,4,84,7],[17,4,17,5],[425,4,425,5],[400,4,400,7],[421,4,421,5],[363,4,363,5],[364,4,364,5],[365,4,365,5],[366,4,366,5],[367,4,367,5],[368,4,368,5],[369,4,369,5],[378,4,378,7],[390,4,390,5],[393,4,393,7],[370,4,370,5],[399,4,399,7],[412,4,412,5],[413,4,413,5],[410,4,410,5],[70,4,70,5],[71,4,71,5],[72,4,72,5],[73,4,73,5],[74,4,74,5],[75,4,75,5],[76,4,76,5],[77,4,77,7],[78,4,78,7],[144,4,144,7],[145,4,145,5],[147,4,147,5],[150,4,150,7],[151,4,151,7],[10,4,10,7],[15,4,15,7],[21,4,21,5],[27,4,27,5],[30,4,30,7],[31,4,31,7],[34,4,34,7],[38,4,38,5],[39,4,39,5],[40,4,40,5],[41,4,41,5],[43,4,43,5],[44,4,44,5],[50,4,50,5],[52,4,52,7],[53,4,53,7],[54,4,54,7],[57,4,57,7],[61,4,61,5],[135,4,135,5],[136,4,136,5],[137,4,137,7],[138,4,138,7],[139,4,139,7],[140,4,140,7],[141,4,141,7],[142,4,142,7],[143,4,143,7],[212,4,212,7],[213,4,213,7],[214,4,214,7],[215,4,215,7],[216,4,216,7],[116,4,116,5],[117,4,117,7],[118,4,118,7],[119,4,119,7],[120,4,120,7],[121,4,121,7],[122,4,122,7],[123,4,123,7],[124,4,124,7],[125,4,125,5],[126,4,126,5],[127,4,127,5],[128,4,128,5],[129,4,129,5],[130,4,130,5],[131,4,131,5],[132,4,132,5],[133,4,133,5],[134,4,134,5],[192,4,192,7],[193,4,193,7],[205,4,205,5],[199,4,199,5],[200,4,200,5],[201,4,201,5],[204,4,204,5],[208,4,208,7],[211,4,211,7],[320,4,320,7],[154,4,154,5],[155,4,155,5],[156,4,156,5],[157,4,157,5],[158,4,158,5],[159,4,159,5],[162,4,162,5],[168,4,168,5],[171,4,171,5],[173,4,173,5],[174,4,174,5],[175,4,175,5],[176,4,176,5],[177,4,177,5],[178,4,178,5],[180,4,180,5],[182,4,182,5],[184,4,184,5],[185,4,185,5],[186,4,186,5],[187,4,187,5],[190,4,190,7],[191,4,191,7],[311,4,311,7],[312,4,312,7],[313,4,313,7],[314,4,314,7],[315,4,315,7],[316,4,316,7],[317,4,317,7],[318,4,318,7],[319,4,319,7],[380,4,380,7],[281,4,281,5],[282,4,282,5],[283,4,283,5],[284,4,284,5],[285,4,285,5],[287,4,287,7],[288,4,288,7],[289,4,289,7],[290,4,290,7],[291,4,291,7],[292,4,292,7],[293,4,293,7],[294,4,294,7],[295,4,295,7],[296,4,296,7],[301,4,301,5],[302,4,302,5],[303,4,303,5],[304,4,304,5],[305,4,305,5],[306,4,306,5],[307,4,307,5],[308,4,308,5],[360,4,360,7],[361,4,361,7],[362,4,362,7],[371,4,371,5],[372,4,372,5],[373,4,373,5],[374,4,374,5],[375,4,375,5],[379,4,379,7],[461,4,461,7],[324,4,324,5],[325,4,325,5],[326,4,326,5],[327,4,327,5],[328,4,328,5],[329,4,329,5],[330,4,330,5],[331,4,331,5],[334,4,334,7],[335,4,335,7],[336,4,336,7],[337,4,337,7],[338,4,338,7],[339,4,339,7],[340,4,340,7],[348,4,348,5],[349,4,349,5],[350,4,350,5],[351,4,351,5],[352,4,352,5],[353,4,353,5],[358,4,358,7],[359,4,359,7]]}
["A","B","C","D","E","F","G","H","N","O","P","Q","R","S","T",null,"V","W"]
["Energy+ Inc.","Energy+ Inc.-For Former Brant County Power Service Area","EFF_DATE",null,"Energy+ Inc.",null,null,null,"X","Energy+ Inc.-For Former Brant County Power Service Area_Start","Energy+ Inc.",null,7,null,null,null,null,null,null,null,null,12]
["Energy+ Inc.","Energy+ Inc.-For Former Brant County Power Service Area","IMP_DATE",null,"For Former Brant County Power Service Area",null,null,null,null,null,null,null,null,null,null,null,null,null,null,null,null,42]
["Energy+ Inc.","Energy+ Inc.-For Former Brant County Power Service Area","EBNUMBER",null,"TARIFF OF RATES AND CHARGES",null,null,null,null,null,null,null,null,null,null,null,null,null,null,null,null,27]
["Energy+ Inc.","Energy+ Inc.-For Former Brant County Power Service Area","NUMBER OF RATE CLASSES",null,"Effective and Implementation Date May 1, 2018",null,null,null,null,null,null,null,null,null,null,null,null,null,"2018-05-01",null,null,45]
["Energy+ Inc.","Energy+ Inc.-For Former Brant County Power Service Area",null,null,"This schedule supersedes and replaces all previously",null,null,null,null,null,null,null,null,null,null,null,null,null,null,null,null,52]
["Energy+ Inc.","Energy+ Inc.-For Former Brant County Power Service Area",null,null,"approved schedules of Rates, Charges and Loss Factors",null,null,null,null,null,null,null,null,null,null,null,null,null,null,null,null,53]
["Energy+ Inc.","Energy+ Inc.-For Former Brant County Power Service Area",null,null,"EB-2017-0030",null,null,null,null,null,"EB-2017-0030",null,null,null,null,null,null,null,null,null,null,12]
["Energy+ Inc.","Energy+ Inc.-For Former Brant County Power Service Area",null,null,"RESIDENTIAL SERVICE CLASSIFICATION",null,null,null,null,null,"1_RESIDENTIAL SERVICE CLASSIFICATION",null,null,null,null,null,null,null,null,null,null,34]
["Energy+ Inc.","Energy+ Inc.-For Former Brant County Power Service Area",null,null,"This classification applies to an account taking electricity at 750 volts or less where the electricity is used exclusively in a separate metered living accommodation. Customers shall be residing in single-dwelling units that consist of a detached house or one unit of a semi-detached, duplex, triplex or quadruplex house, with a residential zoning. Separately metered dwellings within a town house complex or apartment building also qualify as residential customers. All customers are single-phase. Class B consumers are defined in accordance with O. Reg. 429/04. Further servicing details are available in the distributor’s Conditions of Service.",null,null,null,null,null,"1_RESIDENTIAL SERVICE CLASSIFICATION",null,null,null,null,null,null,null,null,null,null,648]
["Energy+ Inc.","Energy+ Inc.-For Former Brant County Power Service Area",null,null,"APPLICATION",null,null,null,null,null,"1_APPLICATION",null,null,null,null,null,null,null,null,null,null,11]
["Energy+ Inc.","Energy+ Inc.-For Former Brant County Power Service Area",null,null,"The application of these rates and charges shall be in accordance with the Licence of the Distributor and any Code or Order of the Ontario Energy Board, and amendments thereto as approved by the Ontario Energy Board, which may be applicable to the administration of this schedule.",null,null,null,null,null,"1_RESIDENTIAL SERVICE CLASSIFICATION",null,null,null,null,null,null,null,null,null,null,280]
["Energy+ Inc.","Energy+ Inc.-For Former Brant County Power Service Area",null,null,"No rates and charges for the distribution of electricity and charges to meet the costs of any work or service done or furnished for the purpose of the distribution of electricity shall be made except as permitted by this schedule, unless required by the Distributor’s Licence or a Code or Order of the Ontario Energy Board, and amendments thereto as approved by the Ontario Energy Board, or as specified herein.",null,null,null,null,null,"1_RESIDENTIAL SERVICE CLASSIFICATION",null,null,null,null,null,null,null,null,null,null,411]
["Energy+ Inc.","Energy+ Inc.-For Former Brant County Power Service Area",null,null,"Unless specifically noted, this schedule does not contain any charges for the electricity commodity, be it under the Regulated Price Plan, a contract with a retailer or the wholesale market prices, as applicable.  In addition, the charges in the MONTHLY RATES AND CHARGES - Regulatory Component of this schedule do not apply to a customer that is an embedded wholesale market participant.",null,null,null,null,null,"1_RESIDENTIAL SERVICE CLASSIFICATION",null,null,null,null,null,null,null,null,null,null,388]
["Energy+ Inc.","Energy+ Inc.-For Former Brant County Power Service Area",null,null,"It should be noted that this schedule does not list any charges, assessments, or credits that are required by law to be invoiced by a distributor and that are not subject to Ontario Energy Board approval, such as the Debt Retirement Charge, the Global Adjustment and the HST.",null,null,null,null,null,"1_RESIDENTIAL SERVICE CLASSIFICATION",null,null,null,null,null,null,null,null,null,null,275]
["Energy+ Inc.","Energy+ Inc.-For Former Brant County Power Service Area",null,null,"MONTHLY RATES AND CHARGES - Delivery Component",null,null,null,null,null,"1_MRC_Del",null,null,null,null,null,null,null,null,null,null,46]
["Energy+ Inc.","Energy+ Inc.-For Former Brant County Power Service Area",null,null,"Service Charge",null,"$",24.3,null,null,"1_RESIDENTIAL SERVICE CLASSIFICATION","A",null,null,null,"1_RESIDENTIAL SERVICE CLASSIFICATION_MSC",null,null,null,null,null,14]
["Energy+ Inc.","Energy+ Inc.-For Former Brant County Power Service Area",null,null,"Rate Rider for Recovery of Smart Meter Incremental Revenue Requirement - effective until the date of the next cost of service-based rate order",null,"$",1.75,null,null,"1_RESIDENTIAL SERVICE CLASSIFICATION","A",null,null,null,"1_RESIDENTIAL SERVICE CLASSIFICATION_FX_RR_1",null,null,null,null,null,142]
["Energy+ Inc.","Energy+ Inc.-For Former Brant County Power Service Area",null,null,"Smart Metering Entity Charge - effective until December 31, 2022",null,"$",0.56999999999999995,null,null,"1_RESIDENTIAL SERVICE CLASSIFICATION",null,null,null,null,"1_RESIDENTIAL SERVICE CLASSIFICATION_SME",null,null,null,"2022-12-31",null,64]
["Energy+ Inc.","Energy+ Inc.-For Former Brant County Power Service Area",null,null,"Distribution Volumetric Rate",null,"$/kWh",5.3E-3,null,null,"1_RESIDENTIAL SERVICE CLASSIFICATION","A",null,null,null,"1_RESIDENTIAL SERVICE CLASSIFICATION_DVC",null,null,null,null,null,28]
["Energy+ Inc.","Energy+ Inc.-For Former Brant County Power Service Area",null,null,"Low Voltage Service Rate",null,"$/kWh",2.3999999999999998E-3,null,null,"1_RESIDENTIAL SERVICE CLASSIFICATION","B",null,null,null,"1_RESIDENTIAL SERVICE CLASSIFICATION_LV",null,null,null,null,null,24]
["Energy+ Inc.","Energy+ Inc.-For Former Brant County Power Service Area",null,null,"Rate Rider for Disposition of Global Adjustment Account (2018) - effective until April 30, 2019\n      Applicable only for Non-RPP Customers",null,"$/kWh",1.4200000000000001E-2,null,null,"1_RESIDENTIAL SERVICE CLASSIFICATION","B",null,null,null,"1_RESIDENTIAL SERVICE CLASSIFICATION_GA_kwh",null,null,null,"2019-04-30",null,139]
["Energy+ Inc.","Energy+ Inc.-For Former Brant County Power Service Area",null,null,"Rate Rider for Disposition of Deferral/Variance Accounts (2018) - effective until April 30, 2019",null,"$/kWh",-6.4739169462600422E-3,null,null,"1_RESIDENTIAL SERVICE CLASSIFICATION","B",null,null,null,"1_RESIDENTIAL SERVICE CLASSIFICATION_DEFVAR_ALL",null,null,null,"2019-04-30",null,96]
["Energy+ Inc.","Energy+ Inc.-For Former Brant County Power Service Area",null,null,"Retail Transmission Rate - Network Service Rate",null,"$/kWh",6.1000000000000004E-3,null,null,"1_RESIDENTIAL SERVICE CLASSIFICATION","C",null,null,null,"1_RESIDENTIAL SERVICE CLASSIFICATION_Retail Transmission Rate - Network Service Rate",null,null,null,null,null,47]
["Energy+ Inc.","Energy+ Inc.-For Former Brant County Power Service Area",null,null,"Retail Transmission Rate - Line and Transformation Connection Service Rate",null,"$/kWh",3.3E-3,null,null,"1_RESIDENTIAL SERVICE CLASSIFICATION","C",null,null,null,"1_RESIDENTIAL SERVICE CLASSIFICATION_Retail Transmission Rate - Line and Transformation Connection Service Rate",null,null,null,null,null,74]
["Energy+ Inc.","Energy+ Inc.-For Former Brant County Power Service Area",null,null,"MONTHLY RATES AND CHARGES - Regulatory Component",null,null,null,null,null,"1_MRC_Reg",null,null,null,null,null,null,null,null,null,null,48]
["Energy+ Inc.","Energy+ Inc.-For Former Brant County Power Service Area",null,null,"Wholesale Market Service Rate (WMS) - not including CBR",null,"$/kWh",3.2000000000000002E-3,null,null,"1_RESIDENTIAL SERVICE CLASSIFICATION",null,null,null,null,"1_RESIDENTIAL SERVICE CLASSIFICATION_WMSR",null,null,null,null,null,55]
["Energy+ Inc.","Energy+ Inc.-For Former Brant County Power Service Area",null,null,"Capacity Based Recovery (CBR) - Applicable for Class B Customers ",null,"$/kWh",4.0000000000000002E-4,null,null,"1_RESIDENTIAL SERVICE CLASSIFICATION",null,null,null,null,null,null,null,null,null,null,65]
["Energy+ Inc.","Energy+ Inc.-For Former Brant County Power Service Area",null,null,"Rural or Remote Electricity Rate Protection Charge (RRRP)",null,"$/kWh",2.9999999999999997E-4,null,null,"1_RESIDENTIAL SERVICE CLASSIFICATION","T",null,null,null,"1_RESIDENTIAL SERVICE CLASSIFICATION_RRRP",null,null,null,null,null,57]
["Energy+ Inc.","Energy+ Inc.-For Former Brant County Power Service Area",null,null,"Standard Supply Service - Administrative Charge (if applicable)",null,"$",0.25,null,null,"1_RESIDENTIAL SERVICE CLASSIFICATION","T",null,null,null,"1_RESIDENTIAL SERVICE CLASSIFICATION_SSS",null,null,null,null,null,63]
["Energy+ Inc.","Energy+ Inc.-For Former Brant County Power Service Area",null,null,"GENERAL SERVICE LESS THAN 50 KW SERVICE CLASSIFICATION",null,null,null,null,null,"2_GENERAL SERVICE LESS THAN 50 kW SERVICE CLASSIFICATION",null,null,null,null,null,null,null,null,null,null,54]
["Energy+ Inc.","Energy+ Inc.-For Former Brant County Power Service Area",null,null,"This classification applies to a non residential account taking electricity at 750 volts or less whose average monthly maximum demand is less than, or is forecast to be less than, 50 kW. Class B consumers are defined in accordance with O. Reg. 429/04. Further servicing details are available in the distributor's Conditions of Service.",null,null,null,null,null,"2_GENERAL SERVICE LESS THAN 50 kW SERVICE CLASSIFICATION",null,null,null,null,null,null,null,null,null,null,335]
["Energy+ Inc.","Energy+ Inc.-For Former Brant County Power Service Area",null,null,"APPLICATION",null,null,null,null,null,"2_APPLICATION",null,null,null,null,null,null,null,null,null,null,11]
["Energy+ Inc.","Energy+ Inc.-For Former Brant County Power Service Area",null,null,"The application of these rates and charges shall be in accordance with the Licence of the Distributor and any Code or Order of the Ontario Energy Board, and amendments thereto as approved by the Ontario Energy Board, which may be applicable to the administration of this schedule.",null,null,null,null,null,"2_GENERAL SERVICE LESS THAN 50 kW SERVICE CLASSIFICATION",null,null,null,null,null,null,null,null,null,null,280]
["Energy+ Inc.","Energy+ Inc.-For Former Brant County Power Service Area",null,null,"No rates and charges for the distribution of electricity and charges to meet the costs of any work or service done or furnished for the purpose of the distribution of electricity shall be made except as permitted by this schedule, unless required by the Distributor’s Licence or a Code or Order of the Ontario Energy Board, and amendments thereto as approved by the Ontario Energy Board, or as specified herein.",null,null,null,null,null,"2_GENERAL SERVICE LESS THAN 50 kW SERVICE CLASSIFICATION",null,null,null,null,null,null,null,null,null,null,411]
["Energy+ Inc.","Energy+ Inc.-For Former Brant County Power Service Area",null,null,"Unless specifically noted, this schedule does not contain any charges for the electricity commodity, be it under the Regulated Price Plan, a contract with a retailer or the wholesale market prices, as applicable.  In addition, the charges in the MONTHLY RATES AND CHARGES - Regulatory Component of this schedule do not apply to a customer that is an embedded wholesale market participant.",null,null,null,null,null,"2_GENERAL SERVICE LESS THAN 50 kW SERVICE CLASSIFICATION",null,null,null,null,null,null,null,null,null,null,388]
["Energy+ Inc.","Energy+ Inc.-For Former Brant County Power Service Area",null,null,"It should be noted that this schedule does not list any charges, assessments, or credits that are required by law to be invoiced by a distributor and that are not subject to Ontario Energy Board approval, such as the Debt Retirement Charge, the Global Adjustment and the HST.",null,null,null,null,null,"2_GENERAL SERVICE LESS THAN 50 kW SERVICE CLASSIFICATION",null,null,null,null,null,null,null,null,null,null,275]
["Energy+ Inc.","Energy+ Inc.-For Former Brant County Power Service Area",null,null,"MONTHLY RATES AND CHARGES - Delivery Component",null,null,null,null,null,"2_MRC_Del",null,null,null,null,null,null,null,null,null,null,46]
["Energy+ Inc.","Energy+ Inc.-For Former Brant County Power Service Area",null,null,"Service Charge",null,"$",17.36,null,null,"2_GENERAL SERVICE LESS THAN 50 kW SERVICE CLASSIFICATION","A",null,null,null,"2_GENERAL SERVICE LESS THAN 50 kW SERVICE CLASSIFICATION_MSC",null,null,null,null,null,14]
["Energy+ Inc.","Energy+ Inc.-For Former Brant County Power Service Area",null,null,"Rate Rider for Recovery of Smart Meter Incremental Revenue Requirement - effective until the date of the next cost of service-based rate order",null,"$",4.33,null,null,"2_GENERAL SERVICE LESS THAN 50 kW SERVICE CLASSIFICATION","A",null,null,null,"2_GENERAL SERVICE LESS THAN 50 kW SERVICE CLASSIFICATION_FX_RR_2",null,null,null,null,null,142]
["Energy+ Inc.","Energy+ Inc.-For Former Brant County Power Service Area",null,null,"Smart Metering Entity Charge - effective until December 31, 2022",null,"$",0.56999999999999995,null,null,"2_GENERAL SERVICE LESS THAN 50 kW SERVICE CLASSIFICATION",null,null,null,null,"2_GENERAL SERVICE LESS THAN 50 kW SERVICE CLASSIFICATION_SME",null,null,null,"2022-12-31",null,64]
["Energy+ Inc.","Energy+ Inc.-For Former Brant County Power Service Area",null,null,"Distribution Volumetric Rate",null,"$/kWh",1.7999999999999999E-2,null,null,"2_GENERAL SERVICE LESS THAN 50 kW SERVICE CLASSIFICATION","A",null,null,null,"2_GENERAL SERVICE LESS THAN 50 kW SERVICE CLASSIFICATION_DVC",null,null,null,null,null,28]
["Energy+ Inc.","Energy+ Inc.-For Former Brant County Power Service Area",null,null,"Low Voltage Service Rate",null,"$/kWh",2.3999999999999998E-3,null,null,"2_GENERAL SERVICE LESS THAN 50 kW SERVICE CLASSIFICATION","B",null,null,null,"2_GENERAL SERVICE LESS THAN 50 kW SERVICE CLASSIFICATION_LV",null,null,null,null,null,24]
["Energy+ Inc.","Energy+ Inc.-For Former Brant County Power Service Area",null,null,"Rate Rider for Disposition of Global Adjustment Account (2018) - effective until April 30, 2019\n      Applicable only for Non-RPP Customers",null,"$/kWh",1.4200000000000001E-2,null,null,"2_GENERAL SERVICE LESS THAN 50 kW SERVICE CLASSIFICATION","B",null,null,null,"2_GENERAL SERVICE LESS THAN 50 kW SERVICE CLASSIFICATION_GA_kwh",null,null,null,"2019-04-30",null,139]
["Energy+ Inc.","Energy+ Inc.-For Former Brant County Power Service Area",null,null,"Rate Rider for Disposition of Deferral/Variance Accounts (2018) - effective until April 30, 2019",null,"$/kWh",-6.3844404687474557E-3,null,null,"2_GENERAL SERVICE LESS THAN 50 kW SERVICE CLASSIFICATION","B",null,null,null,"2_GENERAL SERVICE LESS THAN 50 kW SERVICE CLASSIFICATION_DEFVAR_ALL",null,null,null,"2019-04-30",null,96]
["Energy+ Inc.","Energy+ Inc.-For Former Brant County Power Service Area",null,null,"Retail Transmission Rate - Network Service Rate",null,"$/kWh",5.5999999999999999E-3,null,null,"2_GENERAL SERVICE LESS THAN 50 kW SERVICE CLASSIFICATION","C",null,null,null,"2_GENERAL SERVICE LESS THAN 50 kW SERVICE CLASSIFICATION_Retail Transmission Rate - Network Service Rate",null,null,null,null,null,47]
["Energy+ Inc.","Energy+ Inc.-For Former Brant County Power Service Area",null,null,"Retail Transmission Rate - Line and Transformation Connection Service Rate",null,"$/kWh",2.8E-3,null,null,"2_GENERAL SERVICE LESS THAN 50 kW SERVICE CLASSIFICATION","C",null,null,null,"2_GENERAL SERVICE LESS THAN 50 kW SERVICE CLASSIFICATION_Retail Transmission Rate - Line and Transformation Connection Service Rate",null,null,null,null,null,74]
["Energy+ Inc.","Energy+ Inc.-For Former Brant County Power Service Area",null,null,"MONTHLY RATES AND CHARGES - Regulatory Component",null,null,null,null,null,"2_MRC_Reg",null,null,null,null,null,null,null,null,null,null,48]
["Energy+ Inc.","Energy+ Inc.-For Former Brant County Power Service Area",null,null,"Wholesale Market Service Rate (WMS) - not including CBR",null,"$/kWh",3.2000000000000002E-3,null,null,"2_GENERAL SERVICE LESS THAN 50 kW SERVICE CLASSIFICATION",null,null,null,null,"2_GENERAL SERVICE LESS THAN 50 kW SERVICE CLASSIFICATION_WMSR",null,null,null,null,null,55]
["Energy+ Inc.","Energy+ Inc.-For Former Brant County Power Service Area",null,null,"Capacity Based Recovery (CBR) - Applicable for Class B Customers ",null,"$/kWh",4.0000000000000002E-4,null,null,"2_GENERAL SERVICE LESS THAN 50 kW SERVICE CLASSIFICATION",null,null,null,null,null,null,null,null,null,null,65]
["Energy+ Inc.","Energy+ Inc.-For Former Brant County Power Service Area",null,null,"Rural or Remote Electricity Rate Protection Charge (RRRP)",null,"$/kWh",2.9999999999999997E-4,null,null,"2_GENERAL SERVICE LESS THAN 50 kW SERVICE CLASSIFICATION","T",null,null,null,"2_GENERAL SERVICE LESS THAN 50 kW SERVICE CLASSIFICATION_RRRP",null,null,null,null,null,57]
["Energy+ Inc.","Energy+ Inc.-For Former Brant County Power Service Area",null,null,"Standard Supply Service - Administrative Charge (if applicable)",null,"$",0.25,null,null,"2_GENERAL SERVICE LESS THAN 50 kW SERVICE CLASSIFICATION","T",null,null,null,"2_GENERAL SERVICE LESS THAN 50 kW SERVICE CLASSIFICATION_SSS",null,null,null,null,null,63]
["Energy+ Inc.","Energy+ Inc.-For Former Brant County Power Service Area",null,null,"GENERAL SERVICE 50 TO 4,999 KW SERVICE CLASSIFICATION",null,null,null,null,null,"3_GENERAL SERVICE 50 TO 4,999 KW SERVICE CLASSIFICATION",null,null,null,null,null,null,null,null,null,null,53]
["Energy+ Inc.","Energy+ Inc.-For Former Brant County Power Service Area",null,null,"This classification applies to a non residential account whose average monthly maximum demand used for billing purposes is equal to or greater than, or is forecast to be equal to or greater than, 50 kW but less than 5,000 kW. Note that for the application of the Retail Transmission Rate - Network Service Rate and the Retail Transmission Rate - Line and Transformation Connection Service Rate the following sub-classifications apply:                                                                                                                                                                                                                                                                                     - General Service 50 to 1,000 non-interval metered                                                                                                                                                                                                                                                                - General Service 50 to 1,000 interval metered                                                                                                                                                                                                                                                                        - General Service > 1,000 to 5,000 kW interval metered                                                                                                                                                                                                                                                 Class A and Class B consumers are defined in accordance with O. Reg. 429/04. Further servicing details are available in the distributor's Conditions of Service.",null,null,null,null,null,"3_GENERAL SERVICE 50 TO 4,999 KW SERVICE CLASSIFICATION",null,null,null,null,null,null,null,null,null,null,1782]
["Energy+ Inc.","Energy+ Inc.-For Former Brant County Power Service Area",null,null,"APPLICATION",null,null,null,null,null,"3_APPLICATION",null,null,null,null,null,null,null,null,null,null,11]
["Energy+ Inc.","Energy+ Inc.-For Former Brant County Power Service Area",null,null,"The application of these rates and charges shall be in accordance with the Licence of the Distributor and any Code or Order of the Ontario Energy Board, and amendments thereto as approved by the Ontario Energy Board, which may be applicable to the administration of this schedule.",null,null,null,null,null,"3_GENERAL SERVICE 50 TO 4,999 KW SERVICE CLASSIFICATION",null,null,null,null,null,null,null,null,null,null,280]
["Energy+ Inc.","Energy+ Inc.-For Former Brant County Power Service Area",null,null,"No rates and charges for the distribution of electricity and charges to meet the costs of any work or service done or furnished for the purpose of the distribution of electricity shall be made except as permitted by this schedule, unless required by the Distributor’s Licence or a Code or Order of the Ontario Energy Board, and amendments thereto as approved by the Ontario Energy Board, or as specified herein.",null,null,null,null,null,"3_GENERAL SERVICE 50 TO 4,999 KW SERVICE CLASSIFICATION",null,null,null,null,null,null,null,null,null,null,411]
["Energy+ Inc.","Energy+ Inc.-For Former Brant County Power Service Area",null,null,"Unless specifically noted, this schedule does not contain any charges for the electricity commodity, be it under the Regulated Price Plan, a contract with a retailer or the wholesale market prices, as applicable.  In addition, the charges in the MONTHLY RATES AND CHARGES - Regulatory Component of this schedule do not apply to a customer that is an embedded wholesale market participant.",null,null,null,null,null,"3_GENERAL SERVICE 50 TO 4,999 KW SERVICE CLASSIFICATION",null,null,null,null,null,null,null,null,null,null,388]
["Energy+ Inc.","Energy+ Inc.-For Former Brant County Power Service Area",null,null,"The rate rider for the disposition of Global Adjustment is only applicable to non-RPP Class B customers. It is not applicable to WMP, customers that transitioned between Class A and Class B during the variance account accumulation period, or to customers that were in Class A for the entire period. Customers who transitioned are to be charged or refunded their share of the variance disposed through customer specific billing adjustments. This rate rider is to be consistently applied for the entire period to the sunset date of the rate rider. In addition, this rate rider is applicable to all new non-RPP Class B customers.",null,null,null,null,null,"3_GENERAL SERVICE 50 TO 4,999 KW SERVICE CLASSIFICATION",null,null,null,null,null,null,null,null,null,null,626]
["Energy+ Inc.","Energy+ Inc.-For Former Brant County Power Service Area",null,null,"It should be noted that this schedule does not list any charges, assessments, or credits that are required by law to be invoiced by a distributor and that are not subject to Ontario Energy Board approval, such as the Debt Retirement Charge, the Global Adjustment and the HST.",null,null,null,null,null,"3_GENERAL SERVICE 50 TO 4,999 KW SERVICE CLASSIFICATION",null,null,null,null,null,null,null,null,null,null,275]
["Energy+ Inc.","Energy+ Inc.-For Former Brant County Power Service Area",null,null,"MONTHLY RATES AND CHARGES - Delivery Component",null,null,null,null,null,"3_MRC_Del",null,null,null,null,null,null,null,null,null,null,46]
["Energy+ Inc.","Energy+ Inc.-For Former Brant County Power Service Area",null,null,"Service Charge",null,"$",96.98,null,null,"3_GENERAL SERVICE 50 TO 4,999 KW SERVICE CLASSIFICATION","A",null,null,null,"3_GENERAL SERVICE 50 TO 4,999 KW SERVICE CLASSIFICATION_MSC",null,null,null,null,null,14]
["Energy+ Inc.","Energy+ Inc.-For Former Brant County Power Service Area",null,null,"Distribution Volumetric Rate",null,"$/kW",3.9297,null,null,"3_GENERAL SERVICE 50 TO 4,999 KW SERVICE CLASSIFICATION","A",null,null,null,"3_GENERAL SERVICE 50 TO 4,999 KW SERVICE CLASSIFICATION_DVC",null,null,null,null,null,28]
["Energy+ Inc.","Energy+ Inc.-For Former Brant County Power Service Area",null,null,"Low Voltage Service Rate",null,"$/kW",1.1222000000000001,null,null,"3_GENERAL SERVICE 50 TO 4,999 KW SERVICE CLASSIFICATION","B",null,null,null,"3_GENERAL SERVICE 50 TO 4,999 KW SERVICE CLASSIFICATION_LV",null,null,null,null,null,24]
["Energy+ Inc.","Energy+ Inc.-For Former Brant County Power Service Area",null,null,"Rate Rider for Disposition of Global Adjustment Account (2018) - effective until April 30, 2019\n      Applicable only for Non-RPP Customers",null,"$/kWh",1.4200000000000001E-2,null,null,"3_GENERAL SERVICE 50 TO 4,999 KW SERVICE CLASSIFICATION","B",null,null,null,"3_GENERAL SERVICE 50 TO 4,999 KW SERVICE CLASSIFICATION_GA_kwh",null,null,null,"2019-04-30",null,139]
["Energy+ Inc.","Energy+ Inc.-For Former Brant County Power Service Area",null,null,"Rate Rider for Disposition of Deferral/Variance Accounts (2018) - effective until April 30, 2019",null,"$/kW",-2.8760694640552322,null,null,"3_GENERAL SERVICE 50 TO 4,999 KW SERVICE CLASSIFICATION","B",null,null,null,"3_GENERAL SERVICE 50 TO 4,999 KW SERVICE CLASSIFICATION_DEFVAR_ALL",null,null,null,"2019-04-30",null,96]
["Energy+ Inc.","Energy+ Inc.-For Former Brant County Power Service Area",null,null,"Retail Transmission Rate - Network Service Rate",null,"$/kW",2.2263999999999999,null,null,"3_GENERAL SERVICE 50 TO 4,999 KW SERVICE CLASSIFICATION","C",null,null,null,"3_GENERAL SERVICE 50 TO 4,999 KW SERVICE CLASSIFICATION_Retail Transmission Rate - Network Service Rate",null,null,null,null,null,47]
["Energy+ Inc.","Energy+ Inc.-For Former Brant County Power Service Area",null,null,"Retail Transmission Rate - Line and Transformation Connection Service Rate",null,"$/kW",1.1812,null,null,"3_GENERAL SERVICE 50 TO 4,999 KW SERVICE CLASSIFICATION","C",null,null,null,"3_GENERAL SERVICE 50 TO 4,999 KW SERVICE CLASSIFICATION_Retail Transmission Rate - Line and Transformation Connection Service Rate",null,null,null,null,null,74]
["Energy+ Inc.","Energy+ Inc.-For Former Brant County Power Service Area",null,null,"Retail Transmission Rate - Network Service Rate - Interval Metered < 1,000 kW",null,"$/kW",2.3616999999999999,null,null,"3_GENERAL SERVICE 50 TO 4,999 KW SERVICE CLASSIFICATION","C",null,null,null,"3_GENERAL SERVICE 50 TO 4,999 KW SERVICE CLASSIFICATION_Retail Transmission Rate - Network Service Rate - Interval Metered < 1,000 kW",null,null,null,null,null,77]
["Energy+ Inc.","Energy+ Inc.-For Former Brant County Power Service Area",null,null,"Retail Transmission Rate - Line and Transformation Connection Service Rate \n- Interval Metered < 1,000 kW",null,"$/kW",1.3052999999999999,null,null,"3_GENERAL SERVICE 50 TO 4,999 KW SERVICE CLASSIFICATION",null,null,null,null,"3_GENERAL SERVICE 50 TO 4,999 KW SERVICE CLASSIFICATION_Retail Transmission Rate - Line and Transformation Connection Service Rate \n- Interval Metered < 1,000 kW",null,null,null,null,null,105]
["Energy+ Inc.","Energy+ Inc.-For Former Brant County Power Service Area",null,null,"Retail Transmission Rate - Network Service Rate - Interval Metered > 1,000 kW",null,"$/kW",2.3643999999999998,null,null,"3_GENERAL SERVICE 50 TO 4,999 KW SERVICE CLASSIFICATION","C",null,null,null,"3_GENERAL SERVICE 50 TO 4,999 KW SERVICE CLASSIFICATION_Retail Transmission Rate - Network Service Rate - Interval Metered > 1,000 kW",null,null,null,null,null,77]
["Energy+ Inc.","Energy+ Inc.-For Former Brant County Power Service Area",null,null,"Retail Transmission Rate - Line and Transformation Connection Service Rate \n- Interval Metered > 1,000 kW",null,"$/kW",1.2948999999999999,null,null,"3_GENERAL SERVICE 50 TO 4,999 KW SERVICE CLASSIFICATION",null,null,null,null,"3_GENERAL SERVICE 50 TO 4,999 KW SERVICE CLASSIFICATION_Retail Transmission Rate - Line and Transformation Connection Service Rate \n- Interval Metered > 1,000 kW",null,null,null,null,null,105]
["Energy+ Inc.","Energy+ Inc.-For Former Brant County Power Service Area",null,null,"MONTHLY RATES AND CHARGES - Regulatory Component",null,null,null,null,null,"3_MRC_Reg",null,null,null,null,null,null,null,null,null,null,48]
["Energy+ Inc.","Energy+ Inc.-For Former Brant County Power Service Area",null,null,"Wholesale Market Service Rate (WMS) - not including CBR",null,"$/kWh",3.2000000000000002E-3,null,null,"3_GENERAL SERVICE 50 TO 4,999 KW SERVICE CLASSIFICATION",null,null,null,null,"3_GENERAL SERVICE 50 TO 4,999 KW SERVICE CLASSIFICATION_WMSR",null,null,null,null,null,55]
["Energy+ Inc.","Energy+ Inc.-For Former Brant County Power Service Area",null,null,"Capacity Based Recovery (CBR) - Applicable for Class B Customers ",null,"$/kWh",4.0000000000000002E-4,null,null,"3_GENERAL SERVICE 50 TO 4,999 KW SERVICE CLASSIFICATION",null,null,null,null,null,null,null,null,null,null,65]
["Energy+ Inc.","Energy+ Inc.-For Former Brant County Power Service Area",null,null,"Rural or Remote Electricity Rate Protection Charge (RRRP)",null,"$/kWh",2.9999999999999997E-4,null,null,"3_GENERAL SERVICE 50 TO 4,999 KW SERVICE CLASSIFICATION","T",null,null,null,"3_GENERAL SERVICE 50 TO 4,999 KW SERVICE CLASSIFICATION_RRRP",null,null,null,null,null,57]
["Energy+ Inc.","Energy+ Inc.-For Former Brant County Power Service Area",null,null,"Standard Supply Service - Administrative Charge (if applicable)",null,"$",0.25,null,null,"3_GENERAL SERVICE 50 TO 4,999 KW SERVICE CLASSIFICATION","T",null,null,null,"3_GENERAL SERVICE 50 TO 4,999 KW SERVICE CLASSIFICATION_SSS",null,null,null,null,null,63]
["Energy+ Inc.","Energy+ Inc.-For Former Brant County Power Service Area",null,null,"UNMETERED SCATTERED LOAD SERVICE CLASSIFICATION",null,null,null,null,null,"4_UNMETERED SCATTERED LOAD SERVICE CLASSIFICATION",null,null,null,null,null,null,null,null,null,null,47]
["Energy+ Inc.","Energy+ Inc.-For Former Brant County Power Service Area",null,null,"This classification applies to an account taking electricity at 750 volts or less whose average monthly maximum demand is less than, or is forecast to be less than, 50 kW and the consumption is unmetered. Such connections include cable TV power packs, bus shelters, telephone booths, traffic lights, railway crossings, etc. The level of the consumption will be agreed to by the distributor and the customer, based on detailed manufacturer information/documentation with regard to electrical consumption of the unmetered load or periodic monitoring of actual consumption. Class B consumers are defined in accordance with O. Reg. 429/04. Further servicing details are available in the distributor's Conditions of Service.",null,null,null,null,null,"4_UNMETERED SCATTERED LOAD SERVICE CLASSIFICATION",null,null,null,null,null,null,null,null,null,null,719]
["Energy+ Inc.","Energy+ Inc.-For Former Brant County Power Service Area",null,null,"APPLICATION",null,null,null,null,null,"4_APPLICATION",null,null,null,null,null,null,null,null,null,null,11]
["Energy+ Inc.","Energy+ Inc.-For Former Brant County Power Service Area",null,null,"The application of these rates and charges shall be in accordance with the Licence of the Distributor and any Code or Order of the Ontario Energy Board, and amendments thereto as approved by the Ontario Energy Board, which may be applicable to the administration of this schedule.",null,null,null,null,null,"4_UNMETERED SCATTERED LOAD SERVICE CLASSIFICATION",null,null,null,null,null,null,null,null,null,null,280]
["Energy+ Inc.","Energy+ Inc.-For Former Brant County Power Service Area",null,null,"No rates and charges for the distribution of electricity and charges to meet the costs of any work or service done or furnished for the purpose of the distribution of electricity shall be made except as permitted by this schedule, unless required by the Distributor’s Licence or a Code or Order of the Ontario Energy Board, and amendments thereto as approved by the Ontario Energy Board, or as specified herein.",null,null,null,null,null,"4_UNMETERED SCATTERED LOAD SERVICE CLASSIFICATION",null,null,null,null,null,null,null,null,null,null,411]
["Energy+ Inc.","Energy+ Inc.-For Former Brant County Power Service Area",null,null,"Unless specifically noted, this schedule does not contain any charges for the electricity commodity, be it under the Regulated Price Plan, a contract with a retailer or the wholesale market prices, as applicable.  In addition, the charges in the MONTHLY RATES AND CHARGES - Regulatory Component of this schedule do not apply to a customer that is an embedded wholesale market participant.",null,null,null,null,null,"4_UNMETERED SCATTERED LOAD SERVICE CLASSIFICATION",null,null,null,null,null,null,null,null,null,null,388]
["Energy+ Inc.","Energy+ Inc.-For Former Brant County Power Service Area",null,null,"It should be noted that this schedule does not list any charges, assessments, or credits that are required by law to be invoiced by a distributor and that are not subject to Ontario Energy Board approval, such as the Debt Retirement Charge, the Global Adjustment and the HST.",null,null,null,null,null,"4_UNMETERED SCATTERED LOAD SERVICE CLASSIFICATION",null,null,null,null,null,null,null,null,null,null,275]
["Energy+ Inc.","Energy+ Inc.-For Former Brant County Power Service Area",null,null,"MONTHLY RATES AND CHARGES - Delivery Component",null,null,null,null,null,"4_MRC_Del",null,null,null,null,null,null,null,null,null,null,46]
["Energy+ Inc.","Energy+ Inc.-For Former Brant County Power Service Area",null,null,"Service Charge (per connection)",null,"$",2.04,null,null,"4_UNMETERED SCATTERED LOAD SERVICE CLASSIFICATION","A",null,null,null,"4_UNMETERED SCATTERED LOAD SERVICE CLASSIFICATION_MSC",null,null,null,null,null,31]
["Energy+ Inc.","Energy+ Inc.-For Former Brant County Power Service Area",null,null,"Distribution Volumetric Rate",null,"$/kWh",2.3300000000000001E-2,null,null,"4_UNMETERED SCATTERED LOAD SERVICE CLASSIFICATION","A",null,null,null,"4_UNMETERED SCATTERED LOAD SERVICE CLASSIFICATION_DVC",null,null,null,null,null,28]
["Energy+ Inc.","Energy+ Inc.-For Former Brant County Power Service Area",null,null,"Low Voltage Service Rate",null,"$/kWh",2.3999999999999998E-3,null,null,"4_UNMETERED SCATTERED LOAD SERVICE CLASSIFICATION","B",null,null,null,"4_UNMETERED SCATTERED LOAD SERVICE CLASSIFICATION_LV",null,null,null,null,null,24]
["Energy+ Inc.","Energy+ Inc.-For Former Brant County Power Service Area",null,null,"Rate Rider for Disposition of Global Adjustment Account (2018) - effective until April 30, 2019\n      Applicable only for Non-RPP Customers",null,"$/kWh",1.4200000000000001E-2,null,null,"4_UNMETERED SCATTERED LOAD SERVICE CLASSIFICATION","B",null,null,null,"4_UNMETERED SCATTERED LOAD SERVICE CLASSIFICATION_GA_kwh",null,null,null,"2019-04-30",null,139]
["Energy+ Inc.","Energy+ Inc.-For Former Brant County Power Service Area",null,null,"Rate Rider for Disposition of Deferral/Variance Accounts (2018) - effective until April 30, 2019",null,"$/kWh",-6.340831193566771E-3,null,null,"4_UNMETERED SCATTERED LOAD SERVICE CLASSIFICATION","B",null,null,null,"4_UNMETERED SCATTERED LOAD SERVICE CLASSIFICATION_DEFVAR_ALL",null,null,null,"2019-04-30",null,96]
["Energy+ Inc.","Energy+ Inc.-For Former Brant County Power Service Area",null,null,"Retail Transmission Rate - Network Service Rate",null,"$/kWh",5.5999999999999999E-3,null,null,"4_UNMETERED SCATTERED LOAD SERVICE CLASSIFICATION","C",null,null,null,"4_UNMETERED SCATTERED LOAD SERVICE CLASSIFICATION_Retail Transmission Rate - Network Service Rate",null,null,null,null,null,47]
["Energy+ Inc.","Energy+ Inc.-For Former Brant County Power Service Area",null,null,"Retail Transmission Rate - Line and Transformation Connection Service Rate",null,"$/kWh",2.8E-3,null,null,"4_UNMETERED SCATTERED LOAD SERVICE CLASSIFICATION","C",null,null,null,"4_UNMETERED SCATTERED LOAD SERVICE CLASSIFICATION_Retail Transmission Rate - Line and Transformation Connection Service Rate",null,null,null,null,null,74]
["Energy+ Inc.","Energy+ Inc.-For Former Brant County Power Service Area",null,null,"MONTHLY RATES AND CHARGES - Regulatory Component",null,null,null,null,null,"4_MRC_Reg",null,null,null,null,null,null,null,null,null,null,48]
["Energy+ Inc.","Energy+ Inc.-For Former Brant County Power Service Area",null,null,"Wholesale Market Service Rate (WMS) - not including CBR",null,"$/kWh",3.2000000000000002E-3,null,null,"4_UNMETERED SCATTERED LOAD SERVICE CLASSIFICATION",null,null,null,null,"4_UNMETERED SCATTERED LOAD SERVICE CLASSIFICATION_WMSR",null,null,null,null,null,55]
["Energy+ Inc.","Energy+ Inc.-For Former Brant County Power Service Area",null,null,"Capacity Based Recovery (CBR) - Applicable for Class B Customers ",null,"$/kWh",4.0000000000000002E-4,null,null,"4_UNMETERED SCATTERED LOAD SERVICE CLASSIFICATION",null,null,null,null,null,null,null,null,null,null,65]
["Energy+ Inc.","Energy+ Inc.-For Former Brant County Power Service Area",null,null,"Rural or Remote Electricity Rate Protection Charge (RRRP)",null,"$/kWh",2.9999999999999997E-4,null,null,"4_UNMETERED SCATTERED LOAD SERVICE CLASSIFICATION","T",null,null,null,"4_UNMETERED SCATTERED LOAD SERVICE CLASSIFICATION_RRRP",null,null,null,null,null,57]
["Energy+ Inc.","Energy+ Inc.-For Former Brant County Power Service Area",null,null,"Standard Supply Service - Administrative Charge (if applicable)",null,"$",0.25,null,null,"4_UNMETERED SCATTERED LOAD SERVICE CLASSIFICATION","T",null,null,null,"4_UNMETERED SCATTERED LOAD SERVICE CLASSIFICATION_SSS",null,null,null,null,null,63]
["Energy+ Inc.","Energy+ Inc.-For Former Brant County Power Service Area",null,null,"SENTINEL LIGHTING SERVICE CLASSIFICATION",null,null,null,null,null,"5_SENTINEL LIGHTING SERVICE CLASSIFICATION",null,null,null,null,null,null,null,null,null,null,40]
["Energy+ Inc.","Energy+ Inc.-For Former Brant County Power Service Area",null,null,"This classification applies to safety/security lighting with a Residential, General Service or Large Use customer. This is typically exterior lighting, and unmetered. Consumption is estimated based on the equipment rating and estimated hours of use. Class B consumers are defined in accordance with O. Reg. 429/04. Further servicing details are available in the distributor's Conditions of Service.",null,null,null,null,null,"5_SENTINEL LIGHTING SERVICE CLASSIFICATION",null,null,null,null,null,null,null,null,null,null,398]
["Energy+ Inc.","Energy+ Inc.-For Former Brant County Power Service Area",null,null,"APPLICATION",null,null,null,null,null,"5_APPLICATION",null,null,null,null,null,null,null,null,null,null,11]
["Energy+ Inc.","Energy+ Inc.-For Former Brant County Power Service Area",null,null,"The application of these rates and charges shall be in accordance with the Licence of the Distributor and any Code or Order of the Ontario Energy Board, and amendments thereto as approved by the Ontario Energy Board, which may be applicable to the administration of this schedule.",null,null,null,null,null,"5_SENTINEL LIGHTING SERVICE CLASSIFICATION",null,null,null,null,null,null,null,null,null,null,280]
["Energy+ Inc.","Energy+ Inc.-For Former Brant County Power Service Area",null,null,"No rates and charges for the distribution of electricity and charges to meet the costs of any work or service done or furnished for the purpose of the distribution of electricity shall be made except as permitted by this schedule, unless required by the Distributor’s Licence or a Code or Order of the Ontario Energy Board, and amendments thereto as approved by the Ontario Energy Board, or as specified herein.",null,null,null,null,null,"5_SENTINEL LIGHTING SERVICE CLASSIFICATION",null,null,null,null,null,null,null,null,null,null,411]
["Energy+ Inc.","Energy+ Inc.-For Former Brant County Power Service Area",null,null,"Unless specifically noted, this schedule does not contain any charges for the electricity commodity, be it under the Regulated Price Plan, a contract with a retailer or the wholesale market prices, as applicable.  In addition, the charges in the MONTHLY RATES AND CHARGES - Regulatory Component of this schedule do not apply to a customer that is an embedded wholesale market participant.",null,null,null,null,null,"5_SENTINEL LIGHTING SERVICE CLASSIFICATION",null,null,null,null,null,null,null,null,null,null,388]
["Energy+ Inc.","Energy+ Inc.-For Former Brant County Power Service Area",null,null,"It should be noted that this schedule does not list any charges, assessments, or credits that are required by law to be invoiced by a distributor and that are not subject to Ontario Energy Board approval, such as the Debt Retirement Charge, the Global Adjustment and the HST.",null,null,null,null,null,"5_SENTINEL LIGHTING SERVICE CLASSIFICATION",null,null,null,null,null,null,null,null,null,null,275]
["Energy+ Inc.","Energy+ Inc.-For Former Brant County Power Service Area",null,null,"MONTHLY RATES AND CHARGES - Delivery Component",null,null,null,null,null,"5_MRC_Del",null,null,null,null,null,null,null,null,null,null,46]
["Energy+ Inc.","Energy+ Inc.-For Former Brant County Power Service Area",null,null,"Service Charge (per connection)",null,"$",2.04,null,null,"5_SENTINEL LIGHTING SERVICE CLASSIFICATION","A",null,null,null,"5_SENTINEL LIGHTING SERVICE CLASSIFICATION_MSC",null,null,null,null,null,31]
["Energy+ Inc.","Energy+ Inc.-For Former Brant County Power Service Area",null,null,"Distribution Volumetric Rate",null,"$/kW",30.502800000000001,null,null,"5_SENTINEL LIGHTING SERVICE CLASSIFICATION","A",null,null,null,"5_SENTINEL LIGHTING SERVICE CLASSIFICATION_DVC",null,null,null,null,null,28]
["Energy+ Inc.","Energy+ Inc.-For Former Brant County Power Service Area",null,null,"Low Voltage Service Rate",null,"$/kW",0.71919999999999995,null,null,"5_SENTINEL LIGHTING SERVICE CLASSIFICATION","B",null,null,null,"5_SENTINEL LIGHTING SERVICE CLASSIFICATION_LV",null,null,null,null,null,24]
["Energy+ Inc.","Energy+ Inc.-For Former Brant County Power Service Area",null,null,"Rate Rider for Disposition of Global Adjustment Account (2018) - effective until April 30, 2019\n      Applicable only for Non-RPP Customers",null,"$/kWh",1.4200000000000001E-2,null,null,"5_SENTINEL LIGHTING SERVICE CLASSIFICATION","B",null,null,null,"5_SENTINEL LIGHTING SERVICE CLASSIFICATION_GA_kwh",null,null,null,"2019-04-30",null,139]
["Energy+ Inc.","Energy+ Inc.-For Former Brant County Power Service Area",null,null,"Rate Rider for Disposition of Deferral/Variance Accounts (2018) - effective until April 30, 2019",null,"$/kW",-2.0786521942248708,null,null,"5_SENTINEL LIGHTING SERVICE CLASSIFICATION","B",null,null,null,"5_SENTINEL LIGHTING SERVICE CLASSIFICATION_DEFVAR_ALL",null,null,null,"2019-04-30",null,96]
["Energy+ Inc.","Energy+ Inc.-For Former Brant County Power Service Area",null,null,"Retail Transmission Rate - Network Service Rate",null,"$/kW",1.6411,null,null,"5_SENTINEL LIGHTING SERVICE CLASSIFICATION","C",null,null,null,"5_SENTINEL LIGHTING SERVICE CLASSIFICATION_Retail Transmission Rate - Network Service Rate",null,null,null,null,null,47]
["Energy+ Inc.","Energy+ Inc.-For Former Brant County Power Service Area",null,null,"Retail Transmission Rate - Line and Transformation Connection Service Rate",null,"$/kW",0.95440000000000003,null,null,"5_SENTINEL LIGHTING SERVICE CLASSIFICATION","C",null,null,null,"5_SENTINEL LIGHTING SERVICE CLASSIFICATION_Retail Transmission Rate - Line and Transformation Connection Service Rate",null,null,null,null,null,74]
["Energy+ Inc.","Energy+ Inc.-For Former Brant County Power Service Area",null,null,"MONTHLY RATES AND CHARGES - Regulatory Component",null,null,null,null,null,"5_MRC_Reg",null,null,null,null,null,null,null,null,null,null,48]
["Energy+ Inc.","Energy+ Inc.-For Former Brant County Power Service Area",null,null,"Wholesale Market Service Rate (WMS) - not including CBR",null,"$/kWh",3.2000000000000002E-3,null,null,"5_SENTINEL LIGHTING SERVICE CLASSIFICATION",null,null,null,null,"5_SENTINEL LIGHTING SERVICE CLASSIFICATION_WMSR",null,null,null,null,null,55]
["Energy+ Inc.","Energy+ Inc.-For Former Brant County Power Service Area",null,null,"Capacity Based Recovery (CBR) - Applicable for Class B Customers ",null,"$/kWh",4.0000000000000002E-4,null,null,"5_SENTINEL LIGHTING SERVICE CLASSIFICATION",null,null,null,null,null,null,null,null,null,null,65]
["Energy+ Inc.","Energy+ Inc.-For Former Brant County Power Service Area",null,null,"Rural or Remote Electricity Rate Protection Charge (RRRP)",null,"$/kWh",2.9999999999999997E-4,null,null,"5_SENTINEL LIGHTING SERVICE CLASSIFICATION","T",null,null,null,"5_SENTINEL LIGHTING SERVICE CLASSIFICATION_RRRP",null,null,null,null,null,57]
["Energy+ Inc.","Energy+ Inc.-For Former Brant County Power Service Area",null,null,"Standard Supply Service - Administrative Charge (if applicable)",null,"$",0.25,null,null,"5_SENTINEL LIGHTING SERVICE CLASSIFICATION","T",null,null,null,"5_SENTINEL LIGHTING SERVICE CLASSIFICATION_SSS",null,null,null,null,null,63]
["Energy+ Inc.","Energy+ Inc.-For Former Brant County Power Service Area",null,null,"STREET LIGHTING SERVICE CLASSIFICATION",null,null,null,null,null,"6_STREET LIGHTING SERVICE CLASSIFICATION",null,null,null,null,null,null,null,null,null,null,38]
["Energy+ Inc.","Energy+ Inc.-For Former Brant County Power Service Area",null,null,"This classification applies to an account for roadway lighting with a Municipality, Regional Municipality, Ministry of Transportation and private roadway lighting, controlled by photo cells. The consumption for these customers will be based on the calculated connected load times that required lighting times established in the approved Ontario Energy Board street lighting load shape template. Class B consumers are defined in accordance with O. Reg. 429/04. Further servicing details are available in the distributor's Conditions of Service.",null,null,null,null,null,"6_STREET LIGHTING SERVICE CLASSIFICATION",null,null,null,null,null,null,null,null,null,null,543]
["Energy+ Inc.","Energy+ Inc.-For Former Brant County Power Service Area",null,null,"APPLICATION",null,null,null,null,null,"6_APPLICATION",null,null,null,null,null,null,null,null,null,null,11]
["Energy+ Inc.","Energy+ Inc.-For Former Brant County Power Service Area",null,null,"The application of these rates and charges shall be in accordance with the Licence of the Distributor and any Code or Order of the Ontario Energy Board, and amendments thereto as approved by the Ontario Energy Board, which may be applicable to the administration of this schedule.",null,null,null,null,null,"6_STREET LIGHTING SERVICE CLASSIFICATION",null,null,null,null,null,null,null,null,null,null,280]
["Energy+ Inc.","Energy+ Inc.-For Former Brant County Power Service Area",null,null,"No rates and charges for the distribution of electricity and charges to meet the costs of any work or service done or furnished for the purpose of the distribution of electricity shall be made except as permitted by this schedule, unless required by the Distributor’s Licence or a Code or Order of the Ontario Energy Board, and amendments thereto as approved by the Ontario Energy Board, or as specified herein.",null,null,null,null,null,"6_STREET LIGHTING SERVICE CLASSIFICATION",null,null,null,null,null,null,null,null,null,null,411]
["Energy+ Inc.","Energy+ Inc.-For Former Brant County Power Service Area",null,null,"Unless specifically noted, this schedule does not contain any charges for the electricity commodity, be it under the Regulated Price Plan, a contract with a retailer or the wholesale market prices, as applicable.  In addition, the charges in the MONTHLY RATES AND CHARGES - Regulatory Component of this schedule do not apply to a customer that is an embedded wholesale market participant.",null,null,null,null,null,"6_STREET LIGHTING SERVICE CLASSIFICATION",null,null,null,null,null,null,null,null,null,null,388]
["Energy+ Inc.","Energy+ Inc.-For Former Brant County Power Service Area",null,null,"It should be noted that this schedule does not list any charges, assessments, or credits that are required by law to be invoiced by a distributor and that are not subject to Ontario Energy Board approval, such as the Debt Retirement Charge, the Global Adjustment and the HST.",null,null,null,null,null,"6_STREET LIGHTING SERVICE CLASSIFICATION",null,null,null,null,null,null,null,null,null,null,275]
["Energy+ Inc.","Energy+ Inc.-For Former Brant County Power Service Area",null,null,"MONTHLY RATES AND CHARGES - Delivery Component",null,null,null,null,null,"6_MRC_Del",null,null,null,null,null,null,null,null,null,null,46]
["Energy+ Inc.","Energy+ Inc.-For Former Brant County Power Service Area",null,null,"Service Charge (per connection)",null,"$",1.53,null,null,"6_STREET LIGHTING SERVICE CLASSIFICATION","A",null,null,null,"6_STREET LIGHTING SERVICE CLASSIFICATION_MSC",null,null,null,null,null,31]
["Energy+ Inc.","Energy+ Inc.-For Former Brant County Power Service Area",null,null,"Distribution Volumetric Rate",null,"$/kW",44.8917,null,null,"6_STREET LIGHTING SERVICE CLASSIFICATION","A",null,null,null,"6_STREET LIGHTING SERVICE CLASSIFICATION_DVC",null,null,null,null,null,28]
["Energy+ Inc.","Energy+ Inc.-For Former Brant County Power Service Area",null,null,"Low Voltage Service Rate",null,"$/kW",0.84060000000000001,null,null,"6_STREET LIGHTING SERVICE CLASSIFICATION","B",null,null,null,"6_STREET LIGHTING SERVICE CLASSIFICATION_LV",null,null,null,null,null,24]
["Energy+ Inc.","Energy+ Inc.-For Former Brant County Power Service Area",null,null,"Rate Rider for Disposition of Global Adjustment Account (2018) - effective until April 30, 2019\n      Applicable only for Non-RPP Customers",null,"$/kWh",1.4200000000000001E-2,null,null,"6_STREET LIGHTING SERVICE CLASSIFICATION","B",null,null,null,"6_STREET LIGHTING SERVICE CLASSIFICATION_GA_kwh",null,null,null,"2019-04-30",null,139]
["Energy+ Inc.","Energy+ Inc.-For Former Brant County Power Service Area",null,null,"Rate Rider for Disposition of Deferral/Variance Accounts (2018) - effective until April 30, 2019",null,"$/kW",-2.1186153084440291,null,null,"6_STREET LIGHTING SERVICE CLASSIFICATION","B",null,null,null,"6_STREET LIGHTING SERVICE CLASSIFICATION_DEFVAR_ALL",null,null,null,"2019-04-30",null,96]
["Energy+ Inc.","Energy+ Inc.-For Former Brant County Power Service Area",null,null,"Retail Transmission Rate - Network Service Rate",null,"$/kW",1.6793,null,null,"6_STREET LIGHTING SERVICE CLASSIFICATION","C",null,null,null,"6_STREET LIGHTING SERVICE CLASSIFICATION_Retail Transmission Rate - Network Service Rate",null,null,null,null,null,47]
["Energy+ Inc.","Energy+ Inc.-For Former Brant County Power Service Area",null,null,"Retail Transmission Rate - Line and Transformation Connection Service Rate",null,"$/kW",0.91300000000000003,null,null,"6_STREET LIGHTING SERVICE CLASSIFICATION","C",null,null,null,"6_STREET LIGHTING SERVICE CLASSIFICATION_Retail Transmission Rate - Line and Transformation Connection Service Rate",null,null,null,null,null,74]
["Energy+ Inc.","Energy+ Inc.-For Former Brant County Power Service Area",null,null,"MONTHLY RATES AND CHARGES - Regulatory Component",null,null,null,null,null,"6_MRC_Reg",null,null,null,null,null,null,null,null,null,null,48]
["Energy+ Inc.","Energy+ Inc.-For Former Brant County Power Service Area",null,null,"Wholesale Market Service Rate (WMS) - not including CBR",null,"$/kWh",3.2000000000000002E-3,null,null,"6_STREET LIGHTING SERVICE CLASSIFICATION",null,null,null,null,"6_STREET LIGHTING SERVICE CLASSIFICATION_WMSR",null,null,null,null,null,55]
["Energy+ Inc.","Energy+ Inc.-For Former Brant County Power Service Area",null,null,"Capacity Based Recovery (CBR) - Applicable for Class B Customers ",null,"$/kWh",4.0000000000000002E-4,null,null,"6_STREET LIGHTING SERVICE CLASSIFICATION",null,null,null,null,null,null,null,null,null,null,65]
["Energy+ Inc.","Energy+ Inc.-For Former Brant County Power Service Area",null,null,"Rural or Remote Electricity Rate Protection Charge (RRRP)",null,"$/kWh",2.9999999999999997E-4,null,null,"6_STREET LIGHTING SERVICE CLASSIFICATION","T",null,null,null,"6_STREET LIGHTING SERVICE CLASSIFICATION_RRRP",null,null,null,null,null,57]
["Energy+ Inc.","Energy+ Inc.-For Former Brant County Power Service Area",null,null,"Standard Supply Service - Administrative Charge (if applicable)",null,"$",0.25,null,null,"6_STREET LIGHTING SERVICE CLASSIFICATION","T",null,null,null,"6_STREET LIGHTING SERVICE CLASSIFICATION_SSS",null,null,null,null,null,63]
["Energy+ Inc.","Energy+ Inc.-For Former Brant County Power Service Area",null,null,"microFIT SERVICE CLASSIFICATION",null,null,null,null,null,"7_microFIT SERVICE CLASSIFICATION",null,null,null,null,null,null,null,null,null,null,31]
["Energy+ Inc.","Energy+ Inc.-For Former Brant County Power Service Area",null,null,"This classification applies to an electricity generation facility contracted under the Independent Electricity System Operator's microFIT program and connected to the distributor's distribution system. Further servicing details are available in the distributor's Conditions of Service.",null,null,null,null,null,"7_microFIT SERVICE CLASSIFICATION",null,null,null,null,null,null,null,null,null,null,285]
["Energy+ Inc.","Energy+ Inc.-For Former Brant County Power Service Area",null,null,"APPLICATION",null,null,null,null,null,"7_APPLICATION",null,null,null,null,null,null,null,null,null,null,11]
["Energy+ Inc.","Energy+ Inc.-For Former Brant County Power Service Area",null,null,"The application of these rates and charges shall be in accordance with the Licence of the Distributor and any Code or Order of the Ontario Energy Board, and amendments thereto as approved by the Ontario Energy Board, which may be applicable to the administration of this schedule.",null,null,null,null,null,"7_microFIT SERVICE CLASSIFICATION",null,null,null,null,null,null,null,null,null,null,280]
["Energy+ Inc.","Energy+ Inc.-For Former Brant County Power Service Area",null,null,"No rates and charges for the distribution of electricity and charges to meet the costs of any work or service done or furnished for the purpose of the distribution of electricity shall be made except as permitted by this schedule, unless required by the Distributor’s Licence or a Code or Order of the Ontario Energy Board, and amendments thereto as approved by the Ontario Energy Board, or as specified herein.",null,null,null,null,null,"7_microFIT SERVICE CLASSIFICATION",null,null,null,null,null,null,null,null,null,null,411]
["Energy+ Inc.","Energy+ Inc.-For Former Brant County Power Service Area",null,null,"Unless specifically noted, this schedule does not contain any charges for the electricity commodity, be it under the Regulated Price Plan, a contract with a retailer or the wholesale market prices, as applicable.",null,null,null,null,null,"7_microFIT SERVICE CLASSIFICATION",null,null,null,null,null,null,null,null,null,null,212]
["Energy+ Inc.","Energy+ Inc.-For Former Brant County Power Service Area",null,null,"It should be noted that this schedule does not list any charges, assessments, or credits that are required by law to be invoiced by a distributor and that are not subject to Ontario Energy Board approval, such as the Debt Retirement Charge, the Global Adjustment and the HST.",null,null,null,null,null,"7_microFIT SERVICE CLASSIFICATION",null,null,null,null,null,null,null,null,null,null,275]
["Energy+ Inc.","Energy+ Inc.-For Former Brant County Power Service Area",null,null,"MONTHLY RATES AND CHARGES - Delivery Component",null,null,null,null,null,"7_MRC_Del",null,null,null,null,null,null,null,null,null,null,46]
["Energy+ Inc.","Energy+ Inc.-For Former Brant County Power Service Area",null,null,"Service Charge",null,"$",5.4,null,null,"7_microFIT SERVICE CLASSIFICATION","A",null,null,null,"7_microFIT SERVICE CLASSIFICATION_MSC",null,null,null,null,null,14]
["Energy+ Inc.","Energy+ Inc.-For Former Brant County Power Service Area",null,null,"ALLOWANCES",null,null,null,null,null,"Energy+ Inc._ALLOWANCES",null,null,null,null,null,null,null,null,null,null,10]
["Energy+ Inc.","Energy+ Inc.-For Former Brant County Power Service Area",null,null,"Transformer Allowance for Ownership - per kW of billing demand/month",null,"$/kW",-0.6,null,null,null,null,null,null,null,null,null,null,null,null,null,68]
["Energy+ Inc.","Energy+ Inc.-For Former Brant County Power Service Area",null,null,"Primary Metering Allowance for Transformer Losses - applied to measured demand & energy",null,"%",-1,null,null,null,null,null,null,null,null,null,null,null,null,null,87]
["Energy+ Inc.","Energy+ Inc.-For Former Brant County Power Service Area",null,null,"SPECIFIC SERVICE CHARGES",null,null,null,null,null,"Energy+ Inc._SSC",null,null,null,null,null,null,null,null,null,null,24]
["Energy+ Inc.","Energy+ Inc.-For Former Brant County Power Service Area",null,null,"The application of these rates and charges shall be in accordance with the Licence of the Distributor and any Code or Order of the Ontario Energy Board, and amendments thereto as approved by the Ontario Energy Board, which may be applicable to the administration of this schedule.",null,null,null,null,null,null,null,null,null,null,null,null,null,null,null,null,280]
["Energy+ Inc.","Energy+ Inc.-For Former Brant County Power Service Area",null,null,"No charges to meet the costs of any work or service done or furnished for the purpose of the distribution of electricity shall be made except as permitted by this schedule, unless required by the Distributor’s Licence or a Code or Order of the Ontario Energy Board, and amendments thereto as approved by the Ontario Energy Board, or as specified herein.",null,null,null,null,null,null,null,null,null,null,null,null,null,null,null,null,353]
["Energy+ Inc.","Energy+ Inc.-For Former Brant County Power Service Area",null,null,"It should be noted that this schedule does not list any charges, assessments, or credits that are required by law to be invoiced by a distributor and that are not subject to Ontario Energy Board approval, such as the Debt Retirement Charge, the Global Adjustment and the HST.",null,null,null,null,null,null,null,null,null,null,null,null,null,null,null,null,275]
["Energy+ Inc.","Energy+ Inc.-For Former Brant County Power Service Area",null,null,"Customer Administration",null,null,null,null,null,"Energy+ Inc._CA",null,null,null,null,null,null,null,null,null,null,23]
["Energy+ Inc.","Energy+ Inc.-For Former Brant County Power Service Area",null,null,"Arrears certificate",null,"$",15,null,null,null,null,null,null,null,null,null,null,null,null,null,19]
["Energy+ Inc.","Energy+ Inc.-For Former Brant County Power Service Area",null,null,"Statement of account",null,"$",15,null,null,null,null,null,null,null,null,null,null,null,null,null,20]
["Energy+ Inc.","Energy+ Inc.-For Former Brant County Power Service Area",null,null,"Pulling post dated cheques",null,"$",15,null,null,null,null,null,null,null,null,null,null,null,null,null,26]
["Energy+ Inc.","Energy+ Inc.-For Former Brant County Power Service Area",null,null,"Duplicate invoices for previous billing",null,"$",15,null,null,null,null,null,null,null,null,null,null,null,null,null,39]
["Energy+ Inc.","Energy+ Inc.-For Former Brant County Power Service Area",null,null,"Request for other billing information",null,"$",15,null,null,null,null,null,null,null,null,null,null,null,null,null,37]
["Energy+ Inc.","Energy+ Inc.-For Former Brant County Power Service Area",null,null,"Easement Letter",null,"$",15,null,null,null,null,null,null,null,null,null,null,null,null,null,15]
["Energy+ Inc.","Energy+ Inc.-For Former Brant County Power Service Area",null,null,"Income tax letter",null,"$",15,null,null,null,null,null,null,null,null,null,null,null,null,null,17]
["Energy+ Inc.","Energy+ Inc.-For Former Brant County Power Service Area",null,null,"Notification charge",null,"$",15,null,null,null,null,null,null,null,null,null,null,null,null,null,19]
["Energy+ Inc.","Energy+ Inc.-For Former Brant County Power Service Area",null,null,"Account history",null,"$",15,null,null,null,null,null,null,null,null,null,null,null,null,null,15]
["Energy+ Inc.","Energy+ Inc.-For Former Brant County Power Service Area",null,null,"Credit reference/credit check (plus credit agency costs - general service)",null,"$",15,null,null,null,null,null,null,null,null,null,null,null,null,null,74]
["Energy+ Inc.","Energy+ Inc.-For Former Brant County Power Service Area",null,null,"Returned Cheque (plus bank charges)",null,"$",15,null,null,null,null,null,null,null,null,null,null,null,null,null,35]
["Energy+ Inc.","Energy+ Inc.-For Former Brant County Power Service Area",null,null,"Charge to certify cheque",null,"$",15,null,null,null,null,null,null,null,null,null,null,null,null,null,24]
["Energy+ Inc.","Energy+ Inc.-For Former Brant County Power Service Area",null,null,"Legal letter charge",null,"$",15,null,null,null,null,null,null,null,null,null,null,null,null,null,19]
["Energy+ Inc.","Energy+ Inc.-For Former Brant County Power Service Area",null,null,"Special meter reads",null,"$",30,null,null,null,null,null,null,null,null,null,null,null,null,null,19]
["Energy+ Inc.","Energy+ Inc.-For Former Brant County Power Service Area",null,null,"Account set up charge/change of occupancy charge (plus credit agency costs if applicable)",null,"$",30,null,null,null,null,null,null,null,null,null,null,null,null,null,89]
["Energy+ Inc.","Energy+ Inc.-For Former Brant County Power Service Area",null,null,"Meter dispute charge plus Measurement Canada fees (if meter found correct)",null,"$",30,null,null,null,null,null,null,null,null,null,null,null,null,null,74]
["Energy+ Inc.","Energy+ Inc.-For Former Brant County Power Service Area",null,null,"Non-Payment of Account",null,null,null,null,null,"Energy+ Inc._NPoA",null,null,null,null,null,null,null,null,null,null,22]
["Energy+ Inc.","Energy+ Inc.-For Former Brant County Power Service Area",null,null,"Late Payment - per month",null,"%",1.5,null,null,null,null,null,null,null,null,null,null,null,null,null,24]
["Energy+ Inc.","Energy+ Inc.-For Former Brant County Power Service Area",null,null,"Late Payment - per annum",null,"%",19.559999999999999,null,null,null,null,null,null,null,null,null,null,null,null,null,24]
["Energy+ Inc.","Energy+ Inc.-For Former Brant County Power Service Area",null,null,"Collection of account charge - no disconnection",null,"$",30,null,null,null,null,null,null,null,null,null,null,null,null,null,47]
["Energy+ Inc.","Energy+ Inc.-For Former Brant County Power Service Area",null,null,"Collection of account charge - no disconnection - after regular hours",null,"$",165,null,null,null,null,null,null,null,null,null,null,null,null,null,69]
["Energy+ Inc.","Energy+ Inc.-For Former Brant County Power Service Area",null,null,"Disconnect/Reconnect at Meter - during regular hours",null,"$",65,null,null,null,null,null,null,null,null,null,null,null,null,null,52]
["Energy+ Inc.","Energy+ Inc.-For Former Brant County Power Service Area",null,null,"Disconnect/Reconnect at Meter - after regular hours",null,"$",185,null,null,null,null,null,null,null,null,null,null,null,null,null,51]
["Energy+ Inc.","Energy+ Inc.-For Former Brant County Power Service Area",null,null,"Disconnect/Reconnect at Pole - during regular hours",null,"$",185,null,null,null,null,null,null,null,null,null,null,null,null,null,51]
["Energy+ Inc.","Energy+ Inc.-For Former Brant County Power Service Area",null,null,"Disconnect/Reconnect at Pole - after regular hours",null,"$",415,null,null,null,null,null,null,null,null,null,null,null,null,null,50]
["Energy+ Inc.","Energy+ Inc.-For Former Brant County Power Service Area",null,null,"Other",null,null,null,null,null,null,null,null,null,null,null,null,null,null,null,null,5]
["Energy+ Inc.","Energy+ Inc.-For Former Brant County Power Service Area",null,null,"Service call - customer owned equipment",null,"$",30,null,null,null,null,null,null,null,null,null,null,null,null,null,39]
["Energy+ Inc.","Energy+ Inc.-For Former Brant County Power Service Area",null,null,"Service call - after regular hours",null,"$",165,null,null,null,null,null,null,null,null,null,null,null,null,null,34]
["Energy+ Inc.","Energy+ Inc.-For Former Brant County Power Service Area",null,null,"Temporary service - install & remove - overhead - no transformer",null,"$",500,null,null,null,null,null,null,null,null,null,null,null,null,null,64]
["Energy+ Inc.","Energy+ Inc.-For Former Brant County Power Service Area",null,null,"Temporary service - install & remove - underground - no transformer",null,"$",300,null,null,null,null,null,null,null,null,null,null,null,null,null,67]
["Energy+ Inc.","Energy+ Inc.-For Former Brant County Power Service Area",null,null,"Temporary service - install & remove - overhead - with transformer",null,"$",1000,null,null,null,null,null,null,null,null,null,null,null,null,null,66]
["Energy+ Inc.","Energy+ Inc.-For Former Brant County Power Service Area",null,null,"Rural system expansion / line connection fee",null,"$",500,null,null,null,null,null,null,null,null,null,null,null,null,null,44]
["Energy+ Inc.","Energy+ Inc.-For Former Brant County Power Service Area",null,null,"Specific charge for access to the power poles - $/pole/year",null,"$",22.35,null,null,null,null,null,null,null,null,null,null,null,null,null,59]
["Energy+ Inc.","Energy+ Inc.-For Former Brant County Power Service Area",null,null," (with the exception of wireless attachments)",null,null,null,null,null,null,null,null,null,null,null,null,null,null,null,null,45]
["Energy+ Inc.","Energy+ Inc.-For Former Brant County Power Service Area",null,null,"RETAIL SERVICE CHARGES (if applicable)",null,null,null,null,null,"Energy+ Inc._RSC",null,null,null,null,null,null,null,null,null,null,38]
["Energy+ Inc.","Energy+ Inc.-For Former Brant County Power Service Area",null,null,"The application of these rates and charges shall be in accordance with the Licence of the Distributor and any Code or Order of the Ontario Energy Board, and amendments thereto as approved by the Ontario Energy Board, which may be applicable to the administration of this schedule.",null,null,null,null,null,null,null,null,null,null,null,null,null,null,null,null,280]
["Energy+ Inc.","Energy+ Inc.-For Former Brant County Power Service Area",null,null,"No rates and charges for the distribution of electricity and charges to meet the costs of any work or service done or furnished for the purpose of the distribution of electricity shall be made except as permitted by this schedule, unless required by the Distributor’s Licence or a Code or Order of the Ontario Energy Board, and amendments thereto as approved by the Ontario Energy Board, or as specified herein.",null,null,null,null,null,null,null,null,null,null,null,null,null,null,null,null,411]
["Energy+ Inc.","Energy+ Inc.-For Former Brant County Power Service Area",null,null,"Unless specifically noted, this schedule does not contain any charges for the electricity commodity, be it under the Regulated Price Plan, a contract with a retailer or the wholesale market price, as applicable.",null,null,null,null,null,null,null,null,null,null,null,null,null,null,null,null,211]
["Energy+ Inc.","Energy+ Inc.-For Former Brant County Power Service Area",null,null,"It should be noted that this schedule does not list any charges, assessments, or credits that are required by law to be invoiced by a distributor and that are not subject to Ontario Energy Board approval, such as the Debt Retirement Charge, the Global Adjustment, the Ontario Clean Energy Benefit and the HST.",null,null,null,null,null,null,null,null,null,null,null,null,null,null,null,null,309]
["Energy+ Inc.","Energy+ Inc.-For Former Brant County Power Service Area",null,null,"Retail Service Charges refer to services provided by a distributor to retailers or customers related to the supply of competitive electricity.",null,null,null,null,null,null,null,null,null,null,null,null,null,null,null,null,142]
["Energy+ Inc.","Energy+ Inc.-For Former Brant County Power Service Area",null,null,"One-time charge, per retailer, to establish the service agreement between the distributor and the retailer",null,"$",100,null,null,null,null,null,null,null,null,null,null,null,null,null,106]
["Energy+ Inc.","Energy+ Inc.-For Former Brant County Power Service Area",null,null,"Monthly Fixed Charge, per retailer",null,"$",20,null,null,null,null,null,null,null,null,null,null,null,null,null,34]
["Energy+ Inc.","Energy+ Inc.-For Former Brant County Power Service Area",null,null,"Monthly Variable Charge, per customer, per retailer",null,"$/cust.",0.5,null,null,null,null,null,null,null,null,null,null,null,null,null,51]
["Energy+ Inc.","Energy+ Inc.-For Former Brant County Power Service Area",null,null,"Distributor-consolidated billing monthly charge, per customer, per retailer",null,"$/cust.",0.3,null,null,null,null,null,null,null,null,null,null,null,null,null,75]
["Energy+ Inc.","Energy+ Inc.-For Former Brant County Power Service Area",null,null,"Retailer-consolidated billing monthly credit, per customer, per retailer",null,"$/cust.",-0.3,null,null,null,null,null,null,null,null,null,null,null,null,null,72]
["Energy+ Inc.","Energy+ Inc.-For Former Brant County Power Service Area",null,null,"Service Transaction Requests (STR)",null,null,null,null,null,null,null,null,null,null,null,null,null,null,null,null,34]
["Energy+ Inc.","Energy+ Inc.-For Former Brant County Power Service Area",null,null,"Request fee, per request, applied to the requesting party",null,"$",0.25,null,null,null,null,null,null,null,null,null,null,null,null,null,57]
["Energy+ Inc.","Energy+ Inc.-For Former Brant County Power Service Area",null,null,"Processing fee, per request, applied to the requesting party",null,"$",0.5,null,null,null,null,null,null,null,null,null,null,null,null,null,60]
["Energy+ Inc.","Energy+ Inc.-For Former Brant County Power Service Area",null,null,"Request for customer information as outlined in Section 10.6.3 and Chapter 11 of the Retail",null,null,null,null,null,null,null,null,null,null,null,null,null,null,null,null,91]
["Energy+ Inc.","Energy+ Inc.-For Former Brant County Power Service Area",null,null,"Settlement Code directly to retailers and customers, if not delivered electronically through the",null,null,null,null,null,null,null,null,null,null,null,null,null,null,null,null,96]
["Energy+ Inc.","Energy+ Inc.-For Former Brant County Power Service Area",null,null,"Electronic Business Transaction (EBT) system, applied to the requesting party",null,null,null,null,null,null,null,null,null,null,null,null,null,null,null,null,77]
["Energy+ Inc.","Energy+ Inc.-For Former Brant County Power Service Area",null,null,"Up to twice a year",null,"$","no charge",null,null,null,null,null,null,null,null,null,null,null,null,null,18]
["Energy+ Inc.","Energy+ Inc.-For Former Brant County Power Service Area",null,null,"More than twice a year, per request (plus incremental delivery costs)",null,"$",2,null,null,null,null,null,null,null,null,null,null,null,null,null,69]
["Energy+ Inc.","Energy+ Inc.-For Former Brant County Power Service Area",null,null,"LOSS FACTORS",null,null,null,null,null,"Energy+ Inc._LFs",null,null,null,null,null,null,null,null,null,null,12]
["Energy+ Inc.","Energy+ Inc.-For Former Brant County Power Service Area",null,null,"If the distributor is not capable of prorating changed loss factors jointly with distribution rates, the revised loss factors will be implemented upon the first subsequent billing for each billing cycle.",null,null,null,null,null,null,null,null,null,null,null,null,null,null,null,null,203]
["Energy+ Inc.","Energy+ Inc.-For Former Brant County Power Service Area",null,null,"Total Loss Factor - Secondary Metered Customer < 5,000 kW",null,null,1.0495000000000001,null,null,null,null,null,null,null,null,null,null,null,null,null,57]
["Energy+ Inc.","Energy+ Inc.-For Former Brant County Power Service Area",null,null,"Total Loss Factor - Primary Metered Customer < 5,000 kW",null,null,1.0389999999999999,null,"Energy+ Inc.-For Former Brant County Power Service Area_End",null,null,null,null,null,null,null,null,null,null,null,55]
["Energy+ Inc.","Energy+ Inc.-For Former Cambridge and North Dumfries Hydro Service Area","EFF_DATE",null,"Energy+ Inc.",null,null,null,"X","Energy+ Inc.-For Former Cambridge and North Dumfries Hydro Service Area_Start","Energy+ Inc.",null,null,null,null,null,null,null,null,null,null,12]
["Energy+ Inc.","Energy+ Inc.-For Former Cambridge and North Dumfries Hydro Service Area","IMP_DATE",null,"For Former Cambridge and North Dumfries Hydro Service Area",null,null,null,null,null,null,null,null,null,null,null,null,null,null,null,null,58]
["Energy+ Inc.","Energy+ Inc.-For Former Cambridge and North Dumfries Hydro Service Area","EBNUMBER",null,"TARIFF OF RATES AND CHARGES",null,null,null,null,null,null,null,null,null,null,null,null,null,null,null,null,27]
["Energy+ Inc.","Energy+ Inc.-For Former Cambridge and North Dumfries Hydro Service Area","NUMBER OF RATE CLASSES",null,"Effective and Implementation Date May 1, 2018",null,null,null,null,null,null,null,null,null,null,null,null,null,"2018-05-01",null,null,45]
["Energy+ Inc.","Energy+ Inc.-For Former Cambridge and North Dumfries Hydro Service Area",null,null,"This schedule supersedes and replaces all previously",null,null,null,null,null,null,null,null,null,null,null,null,null,null,null,null,52]
["Energy+ Inc.","Energy+ Inc.-For Former Cambridge and North Dumfries Hydro Service Area",null,null,"approved schedules of Rates, Charges and Loss Factors",null,null,null,null,null,null,null,null,null,null,null,null,null,null,null,null,53]
["Energy+ Inc.","Energy+ Inc.-For Former Cambridge and North Dumfries Hydro Service Area",null,null,"EB-2017-0030",null,null,null,null,null,"EB-2017-0030",null,null,null,null,null,null,null,null,null,null,12]
["Energy+ Inc.","Energy+ Inc.-For Former Cambridge and North Dumfries Hydro Service Area",null,null,"RESIDENTIAL SERVICE CLASSIFICATION",null,null,null,null,null,"1_RESIDENTIAL SERVICE CLASSIFICATION",null,null,null,null,null,null,null,null,null,null,34]
["Energy+ Inc.","Energy+ Inc.-For Former Cambridge and North Dumfries Hydro Service Area",null,null,"Residential refers to the supply of electrical energy to detached, semi-detached and row-housing units (freehold or condominium).  This classification typically refers to an account taking electricity at 750 volts or less where electricity is used exclusively in a separate metered living accommodation.  Customers shall be residing in single-dwelling units that consist of a detached house or one unit of a semi-detached, duplex, triplex, or quadruplex house, with a residential zoning.  Separate metered dwellings within a town house complex, condominium, or apartment building also qualify as residential customers.  Class B consumers are defined in accordance with O. Reg. 429/04. Further servicing details are available in the distributor's Conditions of Service.",null,null,null,null,null,"1_RESIDENTIAL SERVICE CLASSIFICATION",null,null,null,null,null,null,null,null,null,null,768]
["Energy+ Inc.","Energy+ Inc.-For Former Cambridge and North Dumfries Hydro Service Area",null,null,"APPLICATION",null,null,null,null,null,"1_APPLICATION",null,null,null,null,null,null,null,null,null,null,11]
["Energy+ Inc.","Energy+ Inc.-For Former Cambridge and North Dumfries Hydro Service Area",null,null,"The application of these rates and charges shall be in accordance with the Licence of the Distributor and any Code or Order of the Ontario Energy Board, and amendments thereto as approved by the Ontario Energy Board, which may be applicable to the administration of this schedule.",null,null,null,null,null,"1_RESIDENTIAL SERVICE CLASSIFICATION",null,null,null,null,null,null,null,null,null,null,280]
["Energy+ Inc.","Energy+ Inc.-For Former Cambridge and North Dumfries Hydro Service Area",null,null,"No rates and charges for the distribution of electricity and charges to meet the costs of any work or service done or furnished for the purpose of the distribution of electricity shall be made except as permitted by this schedule, unless required by the Distributor’s Licence or a Code or Order of the Ontario Energy Board, and amendments thereto as approved by the Ontario Energy Board, or as specified herein.",null,null,null,null,null,"1_RESIDENTIAL SERVICE CLASSIFICATION",null,null,null,null,null,null,null,null,null,null,411]
["Energy+ Inc.","Energy+ Inc.-For Former Cambridge and North Dumfries Hydro Service Area",null,null,"Unless specifically noted, this schedule does not contain any charges for the electricity commodity, be it under the Regulated Price Plan, a contract with a retailer or the wholesale market price, as applicable.  In addition, the charges in the MONTHLY RATES AND CHARGES - Regulatory Component of this schedule do not apply to a customer that is an embedded wholesale market participant.",null,null,null,null,null,"1_RESIDENTIAL SERVICE CLASSIFICATION",null,null,null,null,null,null,null,null,null,null,387]
["Energy+ Inc.","Energy+ Inc.-For Former Cambridge and North Dumfries Hydro Service Area",null,null,"The rate rider for the disposition of WMS - Sub-account CBR Class B is not applicable to wholesale market participants (WMP), customers that transitioned between Class A and Class B during the variance account accumulation period, or to customers that were in Class A for the entire period. Customers who transitioned are to be charged or refunded their share of the variance disposed through customer specific billing adjustments. This rate rider is to be consistently applied for the entire period to the sunset date of the rate rider. In addition, this rate rider is applicable to all new Class B customers.",null,null,null,null,null,"1_RESIDENTIAL SERVICE CLASSIFICATION",null,null,null,null,null,null,null,null,null,null,610]
["Energy+ Inc.","Energy+ Inc.-For Former Cambridge and North Dumfries Hydro Service Area",null,null,"It should be noted that this schedule does not list any charges, assessments, or credits that are required by law to be invoiced by a distributor and that are not subject to Ontario Energy Board approval, such as the Debt Retirement Charge, the Global Adjustment and the HST.",null,null,null,null,null,"1_RESIDENTIAL SERVICE CLASSIFICATION",null,null,null,null,null,null,null,null,null,null,275]
["Energy+ Inc.","Energy+ Inc.-For Former Cambridge and North Dumfries Hydro Service Area",null,null,"MONTHLY RATES AND CHARGES - Delivery Component",null,null,null,null,null,"1_MRC_Del",null,null,null,null,null,null,null,null,null,null,46]
["Energy+ Inc.","Energy+ Inc.-For Former Cambridge and North Dumfries Hydro Service Area",null,null,"Service Charge",null,"$",21.350439999999999,null,null,"1_RESIDENTIAL SERVICE CLASSIFICATION","A",null,null,null,"1_RESIDENTIAL SERVICE CLASSIFICATION_MSC",null,null,null,null,null,14]
["Energy+ Inc.","Energy+ Inc.-For Former Cambridge and North Dumfries Hydro Service Area",null,null,"Rate Rider for Smart Metering Entity Charge - effective until December 31, 2022",null,"$",0.56999999999999995,null,null,"1_RESIDENTIAL SERVICE CLASSIFICATION","B",null,null,null,"1_RESIDENTIAL SERVICE CLASSIFICATION_SME",null,null,null,"2022-12-31",null,79]
["Energy+ Inc.","Energy+ Inc.-For Former Cambridge and North Dumfries Hydro Service Area",null,null,"Distribution Volumetric Rate",null,"$/kWh",4.6413999999999995E-3,null,null,"1_RESIDENTIAL SERVICE CLASSIFICATION","A",null,null,null,"1_RESIDENTIAL SERVICE CLASSIFICATION_DVC",null,null,null,null,null,28]
["Energy+ Inc.","Energy+ Inc.-For Former Cambridge and North Dumfries Hydro Service Area",null,null,"Low Voltage Service Rate",null,"$/kWh",1E-4,null,null,"1_RESIDENTIAL SERVICE CLASSIFICATION","B",null,null,null,"1_RESIDENTIAL SERVICE CLASSIFICATION_LV",null,null,null,null,null,24]
["Energy+ Inc.","Energy+ Inc.-For Former Cambridge and North Dumfries Hydro Service Area",null,null,"Rate Rider for Disposition of Global Adjustment Account (2019) - effective until April 30, 2019\n      Applicable only for Non-RPP Customers",null,"$/kWh",3.3E-3,null,null,"1_RESIDENTIAL SERVICE CLASSIFICATION","B",null,null,null,"1_RESIDENTIAL SERVICE CLASSIFICATION_GA_kwh",null,null,null,"2019-04-30",null,139]
["Energy+ Inc.","Energy+ Inc.-For Former Cambridge and North Dumfries Hydro Service Area",null,null,"Rate Rider for Disposition of Deferral/Variance Accounts (2019) - effective until April 30, 2019",null,"$/kWh",-6.268366589161683E-3,null,null,"1_RESIDENTIAL SERVICE CLASSIFICATION","B",null,null,null,"1_RESIDENTIAL SERVICE CLASSIFICATION_DEFVAR_ALL",null,null,null,"2019-04-30",null,96]
["Energy+ Inc.","Energy+ Inc.-For Former Cambridge and North Dumfries Hydro Service Area",null,null,"Rate Rider for Disposition of Capacity Based Recovery Account (2019) - effective until April 30, 2019 Applicable only for Class B Customers",null,"$/kWh",4.0000000000000002E-4,null,null,"1_RESIDENTIAL SERVICE CLASSIFICATION","B",null,null,null,"1_RESIDENTIAL SERVICE CLASSIFICATION_VR_RR_15",null,null,null,"2019-04-30",null,139]
["Energy+ Inc.","Energy+ Inc.-For Former Cambridge and North Dumfries Hydro Service Area",null,null,"Retail Transmission Rate - Network Service Rate",null,"$/kWh",5.8999999999999999E-3,null,null,"1_RESIDENTIAL SERVICE CLASSIFICATION","C",null,null,null,"1_RESIDENTIAL SERVICE CLASSIFICATION_Retail Transmission Rate - Network Service Rate",null,null,null,null,null,47]
["Energy+ Inc.","Energy+ Inc.-For Former Cambridge and North Dumfries Hydro Service Area",null,null,"Retail Transmission Rate - Line and Transformation Connection Service Rate",null,"$/kWh",4.4000000000000003E-3,null,null,"1_RESIDENTIAL SERVICE CLASSIFICATION","C",null,null,null,"1_RESIDENTIAL SERVICE CLASSIFICATION_Retail Transmission Rate - Line and Transformation Connection Service Rate",null,null,null,null,null,74]
["Energy+ Inc.","Energy+ Inc.-For Former Cambridge and North Dumfries Hydro Service Area",null,null,"MONTHLY RATES AND CHARGES - Regulatory Component",null,null,null,null,null,"1_MRC_Reg",null,null,null,null,null,null,null,null,null,null,48]
["Energy+ Inc.","Energy+ Inc.-For Former Cambridge and North Dumfries Hydro Service Area",null,null,"Wholesale Market Service Rate (WMS) - not including CBR",null,"$/kWh",3.2000000000000002E-3,null,null,"1_RESIDENTIAL SERVICE CLASSIFICATION",null,null,null,null,"1_RESIDENTIAL SERVICE CLASSIFICATION_WMSR",null,null,null,null,null,55]
["Energy+ Inc.","Energy+ Inc.-For Former Cambridge and North Dumfries Hydro Service Area",null,null,"Capacity Based Recovery (CBR) - Applicable for Class B Customers ",null,"$/kWh",4.0000000000000002E-4,null,null,"1_RESIDENTIAL SERVICE CLASSIFICATION",null,null,null,null,null,null,null,null,null,null,65]
["Energy+ Inc.","Energy+ Inc.-For Former Cambridge and North Dumfries Hydro Service Area",null,null,"Rural or Remote Electricity Rate Protection Charge (RRRP)",null,"$/kWh",2.9999999999999997E-4,null,null,"1_RESIDENTIAL SERVICE CLASSIFICATION","T",null,null,null,"1_RESIDENTIAL SERVICE CLASSIFICATION_RRRP",null,null,null,null,null,57]
["Energy+ Inc.","Energy+ Inc.-For Former Cambridge and North Dumfries Hydro Service Area",null,null,"Standard Supply Service - Administrative Charge (if applicable)",null,"$",0.25,null,null,"1_RESIDENTIAL SERVICE CLASSIFICATION","T",null,null,null,"1_RESIDENTIAL SERVICE CLASSIFICATION_SSS",null,null,null,null,null,63]
["Energy+ Inc.","Energy+ Inc.-For Former Cambridge and North Dumfries Hydro Service Area",null,null,"GENERAL SERVICE LESS THAN 50 KW SERVICE CLASSIFICATION",null,null,null,null,null,"2_GENERAL SERVICE LESS THAN 50 kW SERVICE CLASSIFICATION",null,null,null,null,null,null,null,null,null,null,54]
["Energy+ Inc.","Energy+ Inc.-For Former Cambridge and North Dumfries Hydro Service Area",null,null,"General Service refers to the supply of electrical energy to business customers, to bulk-metered residential buildings and to combined residential and business or residential and agricultural buildings.  Apartment buildings that are bulk metered will be billed at the appropriate General Service rate.  This classification refers to a non-residential account taking electricity at 750 volts or less whose average monthly peak demand is less than, or is forecast to be less than, 50 kW. Class B consumers are defined in accordance with O. Reg. 429/04. Further servicing details are available in the distributor's Conditions of Service.",null,null,null,null,null,"2_GENERAL SERVICE LESS THAN 50 kW SERVICE CLASSIFICATION",null,null,null,null,null,null,null,null,null,null,634]
["Energy+ Inc.","Energy+ Inc.-For Former Cambridge and North Dumfries Hydro Service Area",null,null,"APPLICATION",null,null,null,null,null,"2_APPLICATION",null,null,null,null,null,null,null,null,null,null,11]
["Energy+ Inc.","Energy+ Inc.-For Former Cambridge and North Dumfries Hydro Service Area",null,null,"The application of these rates and charges shall be in accordance with the Licence of the Distributor and any Code or Order of the Ontario Energy Board, and amendments thereto as approved by the Ontario Energy Board, which may be applicable to the administration of this schedule.",null,null,null,null,null,"2_GENERAL SERVICE LESS THAN 50 kW SERVICE CLASSIFICATION",null,null,null,null,null,null,null,null,null,null,280]
["Energy+ Inc.","Energy+ Inc.-For Former Cambridge and North Dumfries Hydro Service Area",null,null,"No rates and charges for the distribution of electricity and charges to meet the costs of any work or service done or furnished for the purpose of the distribution of electricity shall be made except as permitted by this schedule, unless required by the Distributor’s Licence or a Code or Order of the Ontario Energy Board, and amendments thereto as approved by the Ontario Energy Board, or as specified herein.",null,null,null,null,null,"2_GENERAL SERVICE LESS THAN 50 kW SERVICE CLASSIFICATION",null,null,null,null,null,null,null,null,null,null,411]
["Energy+ Inc.","Energy+ Inc.-For Former Cambridge and North Dumfries Hydro Service Area",null,null,"Unless specifically noted, this schedule does not contain any charges for the electricity commodity, be it under the Regulated Price Plan, a contract with a retailer or the wholesale market price, as applicable.  In addition, the charges in the MONTHLY RATES AND CHARGES - Regulatory Component of this schedule do not apply to a customer that is an embedded wholesale market participant.",null,null,null,null,null,"2_GENERAL SERVICE LESS THAN 50 kW SERVICE CLASSIFICATION",null,null,null,null,null,null,null,null,null,null,387]
["Energy+ Inc.","Energy+ Inc.-For Former Cambridge and North Dumfries Hydro Service Area",null,null,"The rate rider for the disposition of WMS - Sub-account CBR Class B is not applicable to wholesale market participants (WMP), customers that transitioned between Class A and Class B during the variance account accumulation period, or to customers that were in Class A for the entire period. Customers who transitioned are to be charged or refunded their share of the variance disposed through customer specific billing adjustments. This rate rider is to be consistently applied for the entire period to the sunset date of the rate rider. In addition, this rate rider is applicable to all new Class B customers.",null,null,null,null,null,"2_GENERAL SERVICE LESS THAN 50 kW SERVICE CLASSIFICATION",null,null,null,null,null,null,null,null,null,null,610]
["Energy+ Inc.","Energy+ Inc.-For Former Cambridge and North Dumfries Hydro Service Area",null,null,"It should be noted that this schedule does not list any charges, assessments, or credits that are required by law to be invoiced by a distributor and that are not subject to Ontario Energy Board approval, such as the Debt Retirement Charge, the Global Adjustment and the HST.",null,null,null,null,null,"2_GENERAL SERVICE LESS THAN 50 kW SERVICE CLASSIFICATION",null,null,null,null,null,null,null,null,null,null,275]
["Energy+ Inc.","Energy+ Inc.-For Former Cambridge and North Dumfries Hydro Service Area",null,null,"MONTHLY RATES AND CHARGES - Delivery Component",null,null,null,null,null,"2_MRC_Del",null,null,null,null,null,null,null,null,null,null,46]
["Energy+ Inc.","Energy+ Inc.-For Former Cambridge and North Dumfries Hydro Service Area",null,null,"Service Charge",null,"$",13.742579999999998,null,null,"2_GENERAL SERVICE LESS THAN 50 kW SERVICE CLASSIFICATION","A",null,null,null,"2_GENERAL SERVICE LESS THAN 50 kW SERVICE CLASSIFICATION_MSC",null,null,null,null,null,14]
["Energy+ Inc.","Energy+ Inc.-For Former Cambridge and North Dumfries Hydro Service Area",null,null,"Rate Rider for Smart Metering Entity Charge - effective until December 31, 2022",null,"$",0.56999999999999995,null,null,"2_GENERAL SERVICE LESS THAN 50 kW SERVICE CLASSIFICATION","B",null,null,null,"2_GENERAL SERVICE LESS THAN 50 kW SERVICE CLASSIFICATION_SME",null,null,null,"2022-12-31",null,79]
["Energy+ Inc.","Energy+ Inc.-For Former Cambridge and North Dumfries Hydro Service Area",null,null,"Distribution Volumetric Rate",null,"$/kWh",1.4731399999999999E-2,null,null,"2_GENERAL SERVICE LESS THAN 50 kW SERVICE CLASSIFICATION","A",null,null,null,"2_GENERAL SERVICE LESS THAN 50 kW SERVICE CLASSIFICATION_DVC",null,null,null,null,null,28]
["Energy+ Inc.","Energy+ Inc.-For Former Cambridge and North Dumfries Hydro Service Area",null,null,"Low Voltage Service Rate",null,"$/kWh",1E-4,null,null,"2_GENERAL SERVICE LESS THAN 50 kW SERVICE CLASSIFICATION","B",null,null,null,"2_GENERAL SERVICE LESS THAN 50 kW SERVICE CLASSIFICATION_LV",null,null,null,null,null,24]
["Energy+ Inc.","Energy+ Inc.-For Former Cambridge and North Dumfries Hydro Service Area",null,null,"Rate Rider for Disposition of Global Adjustment Account (2019) - effective until April 30, 2019\n      Applicable only for Non-RPP Customers",null,"$/kWh",3.3E-3,null,null,"2_GENERAL SERVICE LESS THAN 50 kW SERVICE CLASSIFICATION","B",null,null,null,"2_GENERAL SERVICE LESS THAN 50 kW SERVICE CLASSIFICATION_GA_kwh",null,null,null,"2019-04-30",null,139]
["Energy+ Inc.","Energy+ Inc.-For Former Cambridge and North Dumfries Hydro Service Area",null,null,"Rate Rider for Disposition of Deferral/Variance Accounts (2019) - effective until April 30, 2019",null,"$/kWh",-6.2193914195985949E-3,null,null,"2_GENERAL SERVICE LESS THAN 50 kW SERVICE CLASSIFICATION","B",null,null,null,"2_GENERAL SERVICE LESS THAN 50 kW SERVICE CLASSIFICATION_DEFVAR_ALL",null,null,null,"2019-04-30",null,96]
["Energy+ Inc.","Energy+ Inc.-For Former Cambridge and North Dumfries Hydro Service Area",null,null,"Rate Rider for Disposition of Capacity Based Recovery Account (2019) - effective until April 30, 2019 Applicable only for Class B Customers",null,"$/kWh",4.0000000000000002E-4,null,null,"2_GENERAL SERVICE LESS THAN 50 kW SERVICE CLASSIFICATION","B",null,null,null,"2_GENERAL SERVICE LESS THAN 50 kW SERVICE CLASSIFICATION_VR_RR_18",null,null,null,"2019-04-30",null,139]
["Energy+ Inc.","Energy+ Inc.-For Former Cambridge and North Dumfries Hydro Service Area",null,null,"Retail Transmission Rate - Network Service Rate",null,"$/kWh",5.1999999999999998E-3,null,null,"2_GENERAL SERVICE LESS THAN 50 kW SERVICE CLASSIFICATION","C",null,null,null,"2_GENERAL SERVICE LESS THAN 50 kW SERVICE CLASSIFICATION_Retail Transmission Rate - Network Service Rate",null,null,null,null,null,47]
["Energy+ Inc.","Energy+ Inc.-For Former Cambridge and North Dumfries Hydro Service Area",null,null,"Retail Transmission Rate - Line and Transformation Connection Service Rate",null,"$/kWh",4.1000000000000003E-3,null,null,"2_GENERAL SERVICE LESS THAN 50 kW SERVICE CLASSIFICATION","C",null,null,null,"2_GENERAL SERVICE LESS THAN 50 kW SERVICE CLASSIFICATION_Retail Transmission Rate - Line and Transformation Connection Service Rate",null,null,null,null,null,74]
["Energy+ Inc.","Energy+ Inc.-For Former Cambridge and North Dumfries Hydro Service Area",null,null,"MONTHLY RATES AND CHARGES - Regulatory Component",null,null,null,null,null,"2_MRC_Reg",null,null,null,null,null,null,null,null,null,null,48]
["Energy+ Inc.","Energy+ Inc.-For Former Cambridge and North Dumfries Hydro Service Area",null,null,"Wholesale Market Service Rate (WMS) - not including CBR",null,"$/kWh",3.2000000000000002E-3,null,null,"2_GENERAL SERVICE LESS THAN 50 kW SERVICE CLASSIFICATION",null,null,null,null,"2_GENERAL SERVICE LESS THAN 50 kW SERVICE CLASSIFICATION_WMSR",null,null,null,null,null,55]
["Energy+ Inc.","Energy+ Inc.-For Former Cambridge and North Dumfries Hydro Service Area",null,null,"Capacity Based Recovery (CBR) - Applicable for Class B Customers ",null,"$/kWh",4.0000000000000002E-4,null,null,"2_GENERAL SERVICE LESS THAN 50 kW SERVICE CLASSIFICATION",null,null,null,null,null,null,null,null,null,null,65]
["Energy+ Inc.","Energy+ Inc.-For Former Cambridge and North Dumfries Hydro Service Area",null,null,"Rural or Remote Electricity Rate Protection Charge (RRRP)",null,"$/kWh",2.9999999999999997E-4,null,null,"2_GENERAL SERVICE LESS THAN 50 kW SERVICE CLASSIFICATION","T",null,null,null,"2_GENERAL SERVICE LESS THAN 50 kW SERVICE CLASSIFICATION_RRRP",null,null,null,null,null,57]
["Energy+ Inc.","Energy+ Inc.-For Former Cambridge and North Dumfries Hydro Service Area",null,null,"Standard Supply Service - Administrative Charge (if applicable)",null,"$",0.25,null,null,"2_GENERAL SERVICE LESS THAN 50 kW SERVICE CLASSIFICATION","T",null,null,null,"2_GENERAL SERVICE LESS THAN 50 kW SERVICE CLASSIFICATION_SSS",null,null,null,null,null,63]
["Energy+ Inc.","Energy+ Inc.-For Former Cambridge and North Dumfries Hydro Service Area",null,null,"GENERAL SERVICE 50 TO 999 KW SERVICE CLASSIFICATION",null,null,null,null,null,"3_GENERAL SERVICE 50 to 999 kW SERVICE CLASSIFICATION",null,null,null,null,null,null,null,null,null,null,51]
["Energy+ Inc.","Energy+ Inc.-For Former Cambridge and North Dumfries Hydro Service Area",null,null,"General Service refers to the supply of electrical energy to business customers, to bulk-metered residential buildings and to combined residential and business or residential and agricultural buildings.  Apartment buildings that are bulk metered will be billed at the appropriate General Service rate.  This classification refers to a non-residential account whose average monthly peak demand is equal to or greater than, or is forecast to be equal to or greater than, 50 kW but less than 1,000 kW.  Class B consumers are defined in accordance with O.Reg. 429/04. Further servicing details are available in the distributor's Conditions of Service.",null,null,null,null,null,"3_GENERAL SERVICE 50 to 999 kW SERVICE CLASSIFICATION",null,null,null,null,null,null,null,null,null,null,647]
["Energy+ Inc.","Energy+ Inc.-For Former Cambridge and North Dumfries Hydro Service Area",null,null,"APPLICATION",null,null,null,null,null,"3_APPLICATION",null,null,null,null,null,null,null,null,null,null,11]
["Energy+ Inc.","Energy+ Inc.-For Former Cambridge and North Dumfries Hydro Service Area",null,null,"The application of these rates and charges shall be in accordance with the Licence of the Distributor and any Code or Order of the Ontario Energy Board, and amendments thereto as approved by the Ontario Energy Board, which may be applicable to the administration of this schedule.",null,null,null,null,null,"3_GENERAL SERVICE 50 to 999 kW SERVICE CLASSIFICATION",null,null,null,null,null,null,null,null,null,null,280]
["Energy+ Inc.","Energy+ Inc.-For Former Cambridge and North Dumfries Hydro Service Area",null,null,"No rates and charges for the distribution of electricity and charges to meet the costs of any work or service done or furnished for the purpose of the distribution of electricity shall be made except as permitted by this schedule, unless required by the Distributor’s Licence or a Code or Order of the Ontario Energy Board, and amendments thereto as approved by the Ontario Energy Board, or as specified herein.",null,null,null,null,null,"3_GENERAL SERVICE 50 to 999 kW SERVICE CLASSIFICATION",null,null,null,null,null,null,null,null,null,null,411]
["Energy+ Inc.","Energy+ Inc.-For Former Cambridge and North Dumfries Hydro Service Area",null,null,"Unless specifically noted, this schedule does not contain any charges for the electricity commodity, be it under the Regulated Price Plan, a contract with a retailer or the wholesale market price, as applicable.  In addition, the charges in the MONTHLY RATES AND CHARGES - Regulatory Component of this schedule do not apply to a customer that is an embedded wholesale market participant.",null,null,null,null,null,"3_GENERAL SERVICE 50 to 999 kW SERVICE CLASSIFICATION",null,null,null,null,null,null,null,null,null,null,387]
["Energy+ Inc.","Energy+ Inc.-For Former Cambridge and North Dumfries Hydro Service Area",null,null,"The rate rider for the disposition of WMS - Sub-account CBR Class B is not applicable to wholesale market participants (WMP), customers that transitioned between Class A and Class B during the variance account accumulation period, or to customers that were in Class A for the entire period. Customers who transitioned are to be charged or refunded their share of the variance disposed through customer specific billing adjustments. This rate rider is to be consistently applied for the entire period to the sunset date of the rate rider. In addition, this rate rider is applicable to all new Class B customers.",null,null,null,null,null,"3_GENERAL SERVICE 50 to 999 kW SERVICE CLASSIFICATION",null,null,null,null,null,null,null,null,null,null,610]
["Energy+ Inc.","Energy+ Inc.-For Former Cambridge and North Dumfries Hydro Service Area",null,null,"It should be noted that this schedule does not list any charges, assessments, or credits that are required by law to be invoiced by a distributor and that are not subject to Ontario Energy Board approval, such as the Debt Retirement Charge, the Global Adjustment and the HST.",null,null,null,null,null,"3_GENERAL SERVICE 50 to 999 kW SERVICE CLASSIFICATION",null,null,null,null,null,null,null,null,null,null,275]
["Energy+ Inc.","Energy+ Inc.-For Former Cambridge and North Dumfries Hydro Service Area",null,null,"MONTHLY RATES AND CHARGES - Delivery Component",null,null,null,null,null,"3_MRC_Del",null,null,null,null,null,null,null,null,null,null,46]
["Energy+ Inc.","Energy+ Inc.-For Former Cambridge and North Dumfries Hydro Service Area",null,null,"Service Charge",null,"$",115.59103999999999,null,null,"3_GENERAL SERVICE 50 to 999 kW SERVICE CLASSIFICATION","A",null,null,null,"3_GENERAL SERVICE 50 to 999 kW SERVICE CLASSIFICATION_MSC",null,null,null,null,null,14]
["Energy+ Inc.","Energy+ Inc.-For Former Cambridge and North Dumfries Hydro Service Area",null,null,"Distribution Volumetric Rate",null,"$/kW",4.207630899999999,null,null,"3_GENERAL SERVICE 50 to 999 kW SERVICE CLASSIFICATION","A",null,null,null,"3_GENERAL SERVICE 50 to 999 kW SERVICE CLASSIFICATION_DVC",null,null,null,null,null,28]
["Energy+ Inc.","Energy+ Inc.-For Former Cambridge and North Dumfries Hydro Service Area",null,null,"Low Voltage Service Rate",null,"$/kW",5.3699999999999998E-2,null,null,"3_GENERAL SERVICE 50 to 999 kW SERVICE CLASSIFICATION","B",null,null,null,"3_GENERAL SERVICE 50 to 999 kW SERVICE CLASSIFICATION_LV",null,null,null,null,null,24]
["Energy+ Inc.","Energy+ Inc.-For Former Cambridge and North Dumfries Hydro Service Area",null,null,"Rate Rider for Disposition of Global Adjustment Account (2019) - effective until April 30, 2019\n      Applicable only for Non-RPP Customers",null,"$/kWh",3.3E-3,null,null,"3_GENERAL SERVICE 50 to 999 kW SERVICE CLASSIFICATION","B",null,null,null,"3_GENERAL SERVICE 50 to 999 kW SERVICE CLASSIFICATION_GA_kwh",null,null,null,"2019-04-30",null,139]
["Energy+ Inc.","Energy+ Inc.-For Former Cambridge and North Dumfries Hydro Service Area",null,null,"Rate Rider for Disposition of Deferral/Variance Accounts (2019) - effective until April 30, 2019\n      Applicable only for Non-Wholesale Market Participants",null,"$/kW",-1.7176948178630711,null,null,"3_GENERAL SERVICE 50 to 999 kW SERVICE CLASSIFICATION","B",null,null,null,"3_GENERAL SERVICE 50 to 999 kW SERVICE CLASSIFICATION_DEFVAR_ALL",null,null,null,"2019-04-30",null,156]
["Energy+ Inc.","Energy+ Inc.-For Former Cambridge and North Dumfries Hydro Service Area",null,null,"Rate Rider for Disposition of Deferral/Variance Accounts (2019) - effective until April 30, 2019",null,"$/kW",-0.29754431886348609,null,null,"3_GENERAL SERVICE 50 to 999 kW SERVICE CLASSIFICATION","B",null,null,null,"3_GENERAL SERVICE 50 to 999 kW SERVICE CLASSIFICATION_DEFVAR_ALL",null,null,null,"2019-04-30",null,96]
["Energy+ Inc.","Energy+ Inc.-For Former Cambridge and North Dumfries Hydro Service Area",null,null,"Rate Rider for Disposition of Capacity Based Recovery Account (2019) - effective until April 30, 2019 Applicable only for Class B Customers",null,"$/kWh",0.13750000000000001,null,null,"3_GENERAL SERVICE 50 to 999 kW SERVICE CLASSIFICATION","B",null,null,null,"3_GENERAL SERVICE 50 to 999 kW SERVICE CLASSIFICATION_VR_RR_22",null,null,null,"2019-04-30",null,139]
["Energy+ Inc.","Energy+ Inc.-For Former Cambridge and North Dumfries Hydro Service Area",null,null,"Retail Transmission Rate - Network Service Rate",null,"$/kW",3.3563000000000001,null,null,"3_GENERAL SERVICE 50 to 999 kW SERVICE CLASSIFICATION","C",null,null,null,"3_GENERAL SERVICE 50 to 999 kW SERVICE CLASSIFICATION_Retail Transmission Rate - Network Service Rate",null,null,null,null,null,47]
["Energy+ Inc.","Energy+ Inc.-For Former Cambridge and North Dumfries Hydro Service Area",null,null,"Retail Transmission Rate - Line and Transformation Connection Service Rate",null,"$/kW",2.4847000000000001,null,null,"3_GENERAL SERVICE 50 to 999 kW SERVICE CLASSIFICATION","C",null,null,null,"3_GENERAL SERVICE 50 to 999 kW SERVICE CLASSIFICATION_Retail Transmission Rate - Line and Transformation Connection Service Rate",null,null,null,null,null,74]
["Energy+ Inc.","Energy+ Inc.-For Former Cambridge and North Dumfries Hydro Service Area",null,null,"MONTHLY RATES AND CHARGES - Regulatory Component",null,null,null,null,null,"3_MRC_Reg",null,null,null,null,null,null,null,null,null,null,48]
["Energy+ Inc.","Energy+ Inc.-For Former Cambridge and North Dumfries Hydro Service Area",null,null,"Wholesale Market Service Rate (WMS) - not including CBR",null,"$/kWh",3.2000000000000002E-3,null,null,"3_GENERAL SERVICE 50 to 999 kW SERVICE CLASSIFICATION",null,null,null,null,"3_GENERAL SERVICE 50 to 999 kW SERVICE CLASSIFICATION_WMSR",null,null,null,null,null,55]
["Energy+ Inc.","Energy+ Inc.-For Former Cambridge and North Dumfries Hydro Service Area",null,null,"Capacity Based Recovery (CBR) - Applicable for Class B Customers ",null,"$/kWh",4.0000000000000002E-4,null,null,"3_GENERAL SERVICE 50 to 999 kW SERVICE CLASSIFICATION",null,null,null,null,null,null,null,null,null,null,65]
["Energy+ Inc.","Energy+ Inc.-For Former Cambridge and North Dumfries Hydro Service Area",null,null,"Rural or Remote Electricity Rate Protection Charge (RRRP)",null,"$/kWh",2.9999999999999997E-4,null,null,"3_GENERAL SERVICE 50 to 999 kW SERVICE CLASSIFICATION","T",null,null,null,"3_GENERAL SERVICE 50 to 999 kW SERVICE CLASSIFICATION_RRRP",null,null,null,null,null,57]
["Energy+ Inc.","Energy+ Inc.-For Former Cambridge and North Dumfries Hydro Service Area",null,null,"Standard Supply Service - Administrative Charge (if applicable)",null,"$",0.25,null,null,"3_GENERAL SERVICE 50 to 999 kW SERVICE CLASSIFICATION","T",null,null,null,"3_GENERAL SERVICE 50 to 999 kW SERVICE CLASSIFICATION_SSS",null,null,null,null,null,63]
["Energy+ Inc.","Energy+ Inc.-For Former Cambridge and North Dumfries Hydro Service Area",null,null,"GENERAL SERVICE 1,000 TO 4,999 KW SERVICE CLASSIFICATION",null,null,null,null,null,"4_GENERAL SERVICE 1,000 to 4,999 kW SERVICE CLASSIFICATION",null,null,null,null,null,null,null,null,null,null,56]
["Energy+ Inc.","Energy+ Inc.-For Former Cambridge and North Dumfries Hydro Service Area",null,null,"General Service refers to the supply of electrical energy to business customers, to bulk-metered residential buildings and to combined residential and business or residential and agricultural buildings.  Apartment buildings that are bulk metered will be billed at the appropriate General Service rate.  This classification refers to a non-residential account whose average monthly peak demand is equal to or greater than, or is forecast to be equal to or greater than, 1,000 kW but less than 5,000 kW.  Class A and Class B consumers are defined in accordance with O. Reg. 429/04. Further servicing details are available in the distributor's Conditions of Service.",null,null,null,null,null,"4_GENERAL SERVICE 1,000 to 4,999 kW SERVICE CLASSIFICATION",null,null,null,null,null,null,null,null,null,null,663]
["Energy+ Inc.","Energy+ Inc.-For Former Cambridge and North Dumfries Hydro Service Area",null,null,"APPLICATION",null,null,null,null,null,"4_APPLICATION",null,null,null,null,null,null,null,null,null,null,11]
["Energy+ Inc.","Energy+ Inc.-For Former Cambridge and North Dumfries Hydro Service Area",null,null,"The application of these rates and charges shall be in accordance with the Licence of the Distributor and any Code or Order of the Ontario Energy Board, and amendments thereto as approved by the Ontario Energy Board, which may be applicable to the administration of this schedule.",null,null,null,null,null,"4_GENERAL SERVICE 1,000 to 4,999 kW SERVICE CLASSIFICATION",null,null,null,null,null,null,null,null,null,null,280]
["Energy+ Inc.","Energy+ Inc.-For Former Cambridge and North Dumfries Hydro Service Area",null,null,"No rates and charges for the distribution of electricity and charges to meet the costs of any work or service done or furnished for the purpose of the distribution of electricity shall be made except as permitted by this schedule, unless required by the Distributor’s Licence or a Code or Order of the Ontario Energy Board, and amendments thereto as approved by the Ontario Energy Board, or as specified herein.",null,null,null,null,null,"4_GENERAL SERVICE 1,000 to 4,999 kW SERVICE CLASSIFICATION",null,null,null,null,null,null,null,null,null,null,411]
["Energy+ Inc.","Energy+ Inc.-For Former Cambridge and North Dumfries Hydro Service Area",null,null,"Unless specifically noted, this schedule does not contain any charges for the electricity commodity, be it under the Regulated Price Plan, a contract with a retailer or the wholesale market price, as applicable.  In addition, the charges in the MONTHLY RATES AND CHARGES - Regulatory Component of this schedule do not apply to a customer that is an embedded wholesale market participant.",null,null,null,null,null,"4_GENERAL SERVICE 1,000 to 4,999 kW SERVICE CLASSIFICATION",null,null,null,null,null,null,null,null,null,null,387]
["Energy+ Inc.","Energy+ Inc.-For Former Cambridge and North Dumfries Hydro Service Area",null,null,"The rate rider for the disposition of Global Adjustment is only applicable to non-RPP Class B customers. It is not applicable to Wholesale Market Participant (WMP), customers that transitioned between Class A and Class B during the variance account accumulation period, or to customers that were in Class A for the entire period. Customers who transitioned are to be charged or refunded their share of the variance disposed through customer specific billing adjustments. This rate rider is to be consistently applied for the entire period to the sunset date of the rate rider. In addition, this rate rider is applicable to all new non-RPP Class B customers.",null,null,null,null,null,"4_GENERAL SERVICE 1,000 to 4,999 kW SERVICE CLASSIFICATION",null,null,null,null,null,null,null,null,null,null,657]
["Energy+ Inc.","Energy+ Inc.-For Former Cambridge and North Dumfries Hydro Service Area",null,null,"The rate rider for the disposition of WMS - Sub-account CBR Class B is not applicable to wholesale market participants (WMP), customers that transitioned between Class A and Class B during the variance account accumulation period, or to customers that were in Class A for the entire period. Customers who transitioned are to be charged or refunded their share of the variance disposed through customer specific billing adjustments. This rate rider is to be consistently applied for the entire period to the sunset date of the rate rider. In addition, this rate rider is applicable to all new Class B customers.",null,null,null,null,null,"4_GENERAL SERVICE 1,000 to 4,999 kW SERVICE CLASSIFICATION",null,null,null,null,null,null,null,null,null,null,610]
["Energy+ Inc.","Energy+ Inc.-For Former Cambridge and North Dumfries Hydro Service Area",null,null,"It should be noted that this schedule does not list any charges, assessments, or credits that are required by law to be invoiced by a distributor and that are not subject to Ontario Energy Board approval, such as the Debt Retirement Charge, the Global Adjustment and the HST.",null,null,null,null,null,"4_GENERAL SERVICE 1,000 to 4,999 kW SERVICE CLASSIFICATION",null,null,null,null,null,null,null,null,null,null,275]
["Energy+ Inc.","Energy+ Inc.-For Former Cambridge and North Dumfries Hydro Service Area",null,null,"MONTHLY RATES AND CHARGES - Delivery Component",null,null,null,null,null,"4_MRC_Del",null,null,null,null,null,null,null,null,null,null,46]
["Energy+ Inc.","Energy+ Inc.-For Former Cambridge and North Dumfries Hydro Service Area",null,null,"Service Charge",null,"$",1047.7657799999999,null,null,"4_GENERAL SERVICE 1,000 to 4,999 kW SERVICE CLASSIFICATION","A",null,null,null,"4_GENERAL SERVICE 1,000 to 4,999 kW SERVICE CLASSIFICATION_MSC",null,null,null,null,null,14]
["Energy+ Inc.","Energy+ Inc.-For Former Cambridge and North Dumfries Hydro Service Area",null,null,"Distribution Volumetric Rate",null,"$/kW",3.6470304999999996,null,null,"4_GENERAL SERVICE 1,000 to 4,999 kW SERVICE CLASSIFICATION","A",null,null,null,"4_GENERAL SERVICE 1,000 to 4,999 kW SERVICE CLASSIFICATION_DVC",null,null,null,null,null,28]
["Energy+ Inc.","Energy+ Inc.-For Former Cambridge and North Dumfries Hydro Service Area",null,null,"Low Voltage Service Rate",null,"$/kW",4.2099999999999999E-2,null,null,"4_GENERAL SERVICE 1,000 to 4,999 kW SERVICE CLASSIFICATION","B",null,null,null,"4_GENERAL SERVICE 1,000 to 4,999 kW SERVICE CLASSIFICATION_LV",null,null,null,null,null,24]
["Energy+ Inc.","Energy+ Inc.-For Former Cambridge and North Dumfries Hydro Service Area",null,null,"Rate Rider for Disposition of Global Adjustment Account (2019) - effective until April 30, 2019\n      Applicable only for Non-RPP Customers",null,"$/kWh",3.3E-3,null,null,"4_GENERAL SERVICE 1,000 to 4,999 kW SERVICE CLASSIFICATION","B",null,null,null,"4_GENERAL SERVICE 1,000 to 4,999 kW SERVICE CLASSIFICATION_GA_kwh",null,null,null,"2019-04-30",null,139]
["Energy+ Inc.","Energy+ Inc.-For Former Cambridge and North Dumfries Hydro Service Area",null,null,"Rate Rider for Disposition of Deferral/Variance Accounts (2019) - effective until April 30, 2019\n      Applicable only for Non-Wholesale Market Participants",null,"$/kW",-2.2353997609561107,null,null,"4_GENERAL SERVICE 1,000 to 4,999 kW SERVICE CLASSIFICATION","B",null,null,null,"4_GENERAL SERVICE 1,000 to 4,999 kW SERVICE CLASSIFICATION_DEFVAR_ALL",null,null,null,"2019-04-30",null,156]
["Energy+ Inc.","Energy+ Inc.-For Former Cambridge and North Dumfries Hydro Service Area",null,null,"Rate Rider for Disposition of Deferral/Variance Accounts (2019) - effective until April 30, 2019",null,"$/kW",-0.39842107158418288,null,null,"4_GENERAL SERVICE 1,000 to 4,999 kW SERVICE CLASSIFICATION","B",null,null,null,"4_GENERAL SERVICE 1,000 to 4,999 kW SERVICE CLASSIFICATION_DEFVAR_ALL",null,null,null,"2019-04-30",null,96]
["Energy+ Inc.","Energy+ Inc.-For Former Cambridge and North Dumfries Hydro Service Area",null,null,"Rate Rider for Disposition of Capacity Based Recovery Account (2019) - effective until April 30, 2019 Applicable only for Class B Customers",null,"$/kWh",0.1709,null,null,"4_GENERAL SERVICE 1,000 to 4,999 kW SERVICE CLASSIFICATION","B",null,null,null,"4_GENERAL SERVICE 1,000 to 4,999 kW SERVICE CLASSIFICATION_VR_RR_26",null,null,null,"2019-04-30",null,139]
["Energy+ Inc.","Energy+ Inc.-For Former Cambridge and North Dumfries Hydro Service Area",null,null,"Retail Transmission Rate - Network Service Rate",null,"$/kW",2.5491000000000001,null,null,"4_GENERAL SERVICE 1,000 to 4,999 kW SERVICE CLASSIFICATION","C",null,null,null,"4_GENERAL SERVICE 1,000 to 4,999 kW SERVICE CLASSIFICATION_Retail Transmission Rate - Network Service Rate",null,null,null,null,null,47]
["Energy+ Inc.","Energy+ Inc.-For Former Cambridge and North Dumfries Hydro Service Area",null,null,"Retail Transmission Rate - Line and Transformation Connection Service Rate",null,"$/kW",1.9499,null,null,"4_GENERAL SERVICE 1,000 to 4,999 kW SERVICE CLASSIFICATION","C",null,null,null,"4_GENERAL SERVICE 1,000 to 4,999 kW SERVICE CLASSIFICATION_Retail Transmission Rate - Line and Transformation Connection Service Rate",null,null,null,null,null,74]
["Energy+ Inc.","Energy+ Inc.-For Former Cambridge and North Dumfries Hydro Service Area",null,null,"MONTHLY RATES AND CHARGES - Regulatory Component",null,null,null,null,null,"4_MRC_Reg",null,null,null,null,null,null,null,null,null,null,48]
["Energy+ Inc.","Energy+ Inc.-For Former Cambridge and North Dumfries Hydro Service Area",null,null,"Wholesale Market Service Rate (WMS) - not including CBR",null,"$/kWh",3.2000000000000002E-3,null,null,"4_GENERAL SERVICE 1,000 to 4,999 kW SERVICE CLASSIFICATION",null,null,null,null,"4_GENERAL SERVICE 1,000 to 4,999 kW SERVICE CLASSIFICATION_WMSR",null,null,null,null,null,55]
["Energy+ Inc.","Energy+ Inc.-For Former Cambridge and North Dumfries Hydro Service Area",null,null,"Capacity Based Recovery (CBR) - Applicable for Class B Customers ",null,"$/kWh",4.0000000000000002E-4,null,null,"4_GENERAL SERVICE 1,000 to 4,999 kW SERVICE CLASSIFICATION",null,null,null,null,null,null,null,null,null,null,65]
["Energy+ Inc.","Energy+ Inc.-For Former Cambridge and North Dumfries Hydro Service Area",null,null,"Rural or Remote Electricity Rate Protection Charge (RRRP)",null,"$/kWh",2.9999999999999997E-4,null,null,"4_GENERAL SERVICE 1,000 to 4,999 kW SERVICE CLASSIFICATION","T",null,null,null,"4_GENERAL SERVICE 1,000 to 4,999 kW SERVICE CLASSIFICATION_RRRP",null,null,null,null,null,57]
["Energy+ Inc.","Energy+ Inc.-For Former Cambridge and North Dumfries Hydro Service Area",null,null,"Standard Supply Service - Administrative Charge (if applicable)",null,"$",0.25,null,null,"4_GENERAL SERVICE 1,000 to 4,999 kW SERVICE CLASSIFICATION","T",null,null,null,"4_GENERAL SERVICE 1,000 to 4,999 kW SERVICE CLASSIFICATION_SSS",null,null,null,null,null,63]
["Energy+ Inc.","Energy+ Inc.-For Former Cambridge and North Dumfries Hydro Service Area",null,null,"LARGE USE SERVICE CLASSIFICATION",null,null,null,null,null,"5_LARGE USE SERVICE CLASSIFICATION",null,null,null,null,null,null,null,null,null,null,32]
["Energy+ Inc.","Energy+ Inc.-For Former Cambridge and North Dumfries Hydro Service Area",null,null,"General Service refers to the supply of electrical energy to business customers, to bulk-metered residential buildings and to combined residential and business or residential and agricultural buildings.  Apartment buildings that are bulk metered will be billed at the appropriate General Service rate.  This classification refers to an account whose average monthly peak demand is equal to or greater than, or is forecast to be equal to or greater than, 5,000 kW.  Class A and Class B consumers are defined in accordance with O. Reg. 429/04.Further servicing details are available in the distributor's Conditions of Service.",null,null,null,null,null,"5_LARGE USE SERVICE CLASSIFICATION",null,null,null,null,null,null,null,null,null,null,624]
["Energy+ Inc.","Energy+ Inc.-For Former Cambridge and North Dumfries Hydro Service Area",null,null,"APPLICATION",null,null,null,null,null,"5_APPLICATION",null,null,null,null,null,null,null,null,null,null,11]
["Energy+ Inc.","Energy+ Inc.-For Former Cambridge and North Dumfries Hydro Service Area",null,null,"The application of these rates and charges shall be in accordance with the Licence of the Distributor and any Code or Order of the Ontario Energy Board, and amendments thereto as approved by the Ontario Energy Board, which may be applicable to the administration of this schedule.",null,null,null,null,null,"5_LARGE USE SERVICE CLASSIFICATION",null,null,null,null,null,null,null,null,null,null,280]
["Energy+ Inc.","Energy+ Inc.-For Former Cambridge and North Dumfries Hydro Service Area",null,null,"No rates and charges for the distribution of electricity and charges to meet the costs of any work or service done or furnished for the purpose of the distribution of electricity shall be made except as permitted by this schedule, unless required by the Distributor’s Licence or a Code or Order of the Ontario Energy Board, and amendments thereto as approved by the Ontario Energy Board, or as specified herein.",null,null,null,null,null,"5_LARGE USE SERVICE CLASSIFICATION",null,null,null,null,null,null,null,null,null,null,411]
["Energy+ Inc.","Energy+ Inc.-For Former Cambridge and North Dumfries Hydro Service Area",null,null,"Unless specifically noted, this schedule does not contain any charges for the electricity commodity, be it under the Regulated Price Plan, a contract with a retailer or the wholesale market price, as applicable.  In addition, the charges in the MONTHLY RATES AND CHARGES - Regulatory Component of this schedule do not apply to a customer that is an embedded wholesale market participant.",null,null,null,null,null,"5_LARGE USE SERVICE CLASSIFICATION",null,null,null,null,null,null,null,null,null,null,387]
["Energy+ Inc.","Energy+ Inc.-For Former Cambridge and North Dumfries Hydro Service Area",null,null,"The rate rider for the disposition of Global Adjustment is only applicable to non-RPP Class B customers. It is not applicable to Wholesale Market Participant (WMP), customers that transitioned between Class A and Class B during the variance account accumulation period, or to customers that were in Class A for the entire period. Customers who transitioned are to be charged or refunded their share of the variance disposed through customer specific billing adjustments. This rate rider is to be consistently applied for the entire period to the sunset date of the rate rider. In addition, this rate rider is applicable to all new non-RPP Class B customers.",null,null,null,null,null,"5_LARGE USE SERVICE CLASSIFICATION",null,null,null,null,null,null,null,null,null,null,657]
["Energy+ Inc.","Energy+ Inc.-For Former Cambridge and North Dumfries Hydro Service Area",null,null,"The rate rider for the disposition of WMS - Sub-account CBR Class B is not applicable to wholesale market participants (WMP), customers that transitioned between Class A and Class B during the variance account accumulation period, or to customers that were in Class A for the entire period. Customers who transitioned are to be charged or refunded their share of the variance disposed through customer specific billing adjustments. This rate rider is to be consistently applied for the entire period to the sunset date of the rate rider. In addition, this rate rider is applicable to all new Class B customers.",null,null,null,null,null,"5_LARGE USE SERVICE CLASSIFICATION",null,null,null,null,null,null,null,null,null,null,610]
["Energy+ Inc.","Energy+ Inc.-For Former Cambridge and North Dumfries Hydro Service Area",null,null,"It should be noted that this schedule does not list any charges, assessments, or credits that are required by law to be invoiced by a distributor and that are not subject to Ontario Energy Board approval, such as the Debt Retirement Charge, the Global Adjustment and the HST.",null,null,null,null,null,"5_LARGE USE SERVICE CLASSIFICATION",null,null,null,null,null,null,null,null,null,null,275]
["Energy+ Inc.","Energy+ Inc.-For Former Cambridge and North Dumfries Hydro Service Area",null,null,"MONTHLY RATES AND CHARGES - Delivery Component",null,null,null,null,null,"5_MRC_Del",null,null,null,null,null,null,null,null,null,null,46]
["Energy+ Inc.","Energy+ Inc.-For Former Cambridge and North Dumfries Hydro Service Area",null,null,"Service Charge",null,"$",8976.0639999999985,null,null,"5_LARGE USE SERVICE CLASSIFICATION","A",null,null,null,"5_LARGE USE SERVICE CLASSIFICATION_MSC",null,null,null,null,null,14]
["Energy+ Inc.","Energy+ Inc.-For Former Cambridge and North Dumfries Hydro Service Area",null,null,"Distribution Volumetric Rate",null,"$/kW",2.4926336,null,null,"5_LARGE USE SERVICE CLASSIFICATION","A",null,null,null,"5_LARGE USE SERVICE CLASSIFICATION_DVC",null,null,null,null,null,28]
["Energy+ Inc.","Energy+ Inc.-For Former Cambridge and North Dumfries Hydro Service Area",null,null,"Low Voltage Service Rate",null,"$/kW",4.2099999999999999E-2,null,null,"5_LARGE USE SERVICE CLASSIFICATION","B",null,null,null,"5_LARGE USE SERVICE CLASSIFICATION_LV",null,null,null,null,null,24]
["Energy+ Inc.","Energy+ Inc.-For Former Cambridge and North Dumfries Hydro Service Area",null,null,"Rate Rider for Disposition of Deferral/Variance Accounts (2019) - effective until April 30, 2019",null,"$/kW",-2.5357339211051015,null,null,"5_LARGE USE SERVICE CLASSIFICATION","B",null,null,null,"5_LARGE USE SERVICE CLASSIFICATION_DEFVAR_ALL",null,null,null,"2019-04-30",null,96]
["Energy+ Inc.","Energy+ Inc.-For Former Cambridge and North Dumfries Hydro Service Area",null,null,"Retail Transmission Rate - Network Service Rate",null,"$/kW",2.4156,null,null,"5_LARGE USE SERVICE CLASSIFICATION","C",null,null,null,"5_LARGE USE SERVICE CLASSIFICATION_Retail Transmission Rate - Network Service Rate",null,null,null,null,null,47]
["Energy+ Inc.","Energy+ Inc.-For Former Cambridge and North Dumfries Hydro Service Area",null,null,"Retail Transmission Rate - Line and Transformation Connection Service Rate",null,"$/kW",1.9849000000000001,null,null,"5_LARGE USE SERVICE CLASSIFICATION","C",null,null,null,"5_LARGE USE SERVICE CLASSIFICATION_Retail Transmission Rate - Line and Transformation Connection Service Rate",null,null,null,null,null,74]
["Energy+ Inc.","Energy+ Inc.-For Former Cambridge and North Dumfries Hydro Service Area",null,null,"MONTHLY RATES AND CHARGES - Regulatory Component",null,null,null,null,null,"5_MRC_Reg",null,null,null,null,null,null,null,null,null,null,48]
["Energy+ Inc.","Energy+ Inc.-For Former Cambridge and North Dumfries Hydro Service Area",null,null,"Wholesale Market Service Rate (WMS) - not including CBR",null,"$/kWh",3.2000000000000002E-3,null,null,"5_LARGE USE SERVICE CLASSIFICATION",null,null,null,null,"5_LARGE USE SERVICE CLASSIFICATION_WMSR",null,null,null,null,null,55]
["Energy+ Inc.","Energy+ Inc.-For Former Cambridge and North Dumfries Hydro Service Area",null,null,"Capacity Based Recovery (CBR) - Applicable for Class B Customers ",null,"$/kWh",4.0000000000000002E-4,null,null,"5_LARGE USE SERVICE CLASSIFICATION",null,null,null,null,null,null,null,null,null,null,65]
["Energy+ Inc.","Energy+ Inc.-For Former Cambridge and North Dumfries Hydro Service Area",null,null,"Rural or Remote Electricity Rate Protection Charge (RRRP)",null,"$/kWh",2.9999999999999997E-4,null,null,"5_LARGE USE SERVICE CLASSIFICATION","T",null,null,null,"5_LARGE USE SERVICE CLASSIFICATION_RRRP",null,null,null,null,null,57]
["Energy+ Inc.","Energy+ Inc.-For Former Cambridge and North Dumfries Hydro Service Area",null,null,"Standard Supply Service - Administrative Charge (if applicable)",null,"$",0.25,null,null,"5_LARGE USE SERVICE CLASSIFICATION","T",null,null,null,"5_LARGE USE SERVICE CLASSIFICATION_SSS",null,null,null,null,null,63]
["Energy+ Inc.","Energy+ Inc.-For Former Cambridge and North Dumfries Hydro Service Area",null,null,"UNMETERED SCATTERED LOAD SERVICE CLASSIFICATION",null,null,null,null,null,"6_UNMETERED SCATTERED LOAD SERVICE CLASSIFICATION",null,null,null,null,null,null,null,null,null,null,47]
["Energy+ Inc.","Energy+ Inc.-For Former Cambridge and North Dumfries Hydro Service Area",null,null,"This classification refers to an account taking electricity at 750 volts or less whose average monthly peak demand is less than, or is forecast to be less than, 50kW and the consumption is unmetered.  Such connections include cable TV power packs, bus shelters, telephone booths, traffic lights, railway crossings, etc.  The customer will provide detailed manufacturer information/documentation with regard to electrical demand/consumption of the proposed unmetered load.  Class B consumers are defined in accordance with O. Reg. 429/04. Further servicing details are available in the distributor's Conditions of Service.",null,null,null,null,null,"6_UNMETERED SCATTERED LOAD SERVICE CLASSIFICATION",null,null,null,null,null,null,null,null,null,null,621]
["Energy+ Inc.","Energy+ Inc.-For Former Cambridge and North Dumfries Hydro Service Area",null,null,"APPLICATION",null,null,null,null,null,"6_APPLICATION",null,null,null,null,null,null,null,null,null,null,11]
["Energy+ Inc.","Energy+ Inc.-For Former Cambridge and North Dumfries Hydro Service Area",null,null,"The application of these rates and charges shall be in accordance with the Licence of the Distributor and any Code or Order of the Ontario Energy Board, and amendments thereto as approved by the Ontario Energy Board, which may be applicable to the administration of this schedule.",null,null,null,null,null,"6_UNMETERED SCATTERED LOAD SERVICE CLASSIFICATION",null,null,null,null,null,null,null,null,null,null,280]
["Energy+ Inc.","Energy+ Inc.-For Former Cambridge and North Dumfries Hydro Service Area",null,null,"No rates and charges for the distribution of electricity and charges to meet the costs of any work or service done or furnished for the purpose of the distribution of electricity shall be made except as permitted by this schedule, unless required by the Distributor’s Licence or a Code or Order of the Ontario Energy Board, and amendments thereto as approved by the Ontario Energy Board, or as specified herein.",null,null,null,null,null,"6_UNMETERED SCATTERED LOAD SERVICE CLASSIFICATION",null,null,null,null,null,null,null,null,null,null,411]
["Energy+ Inc.","Energy+ Inc.-For Former Cambridge and North Dumfries Hydro Service Area",null,null,"Unless specifically noted, this schedule does not contain any charges for the electricity commodity, be it under the Regulated Price Plan, a contract with a retailer or the wholesale market price, as applicable.  In addition, the charges in the MONTHLY RATES AND CHARGES - Regulatory Component of this schedule do not apply to a customer that is an embedded wholesale market participant.",null,null,null,null,null,"6_UNMETERED SCATTERED LOAD SERVICE CLASSIFICATION",null,null,null,null,null,null,null,null,null,null,387]
["Energy+ Inc.","Energy+ Inc.-For Former Cambridge and North Dumfries Hydro Service Area",null,null,"The rate rider for the disposition of WMS - Sub-account CBR Class B is not applicable to wholesale market participants (WMP), customers that transitioned between Class A and Class B during the variance account accumulation period, or to customers that were in Class A for the entire period. Customers who transitioned are to be charged or refunded their share of the variance disposed through customer specific billing adjustments. This rate rider is to be consistently applied for the entire period to the sunset date of the rate rider. In addition, this rate rider is applicable to all new Class B customers.",null,null,null,null,null,"6_UNMETERED SCATTERED LOAD SERVICE CLASSIFICATION",null,null,null,null,null,null,null,null,null,null,610]
["Energy+ Inc.","Energy+ Inc.-For Former Cambridge and North Dumfries Hydro Service Area",null,null,"It should be noted that this schedule does not list any charges, assessments, or credits that are required by law to be invoiced by a distributor and that are not subject to Ontario Energy Board approval, such as the Debt Retirement Charge, the Global Adjustment and the HST.",null,null,null,null,null,"6_UNMETERED SCATTERED LOAD SERVICE CLASSIFICATION",null,null,null,null,null,null,null,null,null,null,275]
["Energy+ Inc.","Energy+ Inc.-For Former Cambridge and North Dumfries Hydro Service Area",null,null,"MONTHLY RATES AND CHARGES - Delivery Component",null,null,null,null,null,"6_MRC_Del",null,null,null,null,null,null,null,null,null,null,46]
["Energy+ Inc.","Energy+ Inc.-For Former Cambridge and North Dumfries Hydro Service Area",null,null,"Service Charge (per connection)",null,"$",5.8925599999999996,null,null,"6_UNMETERED SCATTERED LOAD SERVICE CLASSIFICATION","A",null,null,null,"6_UNMETERED SCATTERED LOAD SERVICE CLASSIFICATION_MSC",null,null,null,null,null,31]
["Energy+ Inc.","Energy+ Inc.-For Former Cambridge and North Dumfries Hydro Service Area",null,null,"Distribution Volumetric Rate",null,"$/kWh",1.2612499999999999E-2,null,null,"6_UNMETERED SCATTERED LOAD SERVICE CLASSIFICATION","A",null,null,null,"6_UNMETERED SCATTERED LOAD SERVICE CLASSIFICATION_DVC",null,null,null,null,null,28]
["Energy+ Inc.","Energy+ Inc.-For Former Cambridge and North Dumfries Hydro Service Area",null,null,"Low Voltage Service Rate",null,"$/kWh",1E-4,null,null,"6_UNMETERED SCATTERED LOAD SERVICE CLASSIFICATION","B",null,null,null,"6_UNMETERED SCATTERED LOAD SERVICE CLASSIFICATION_LV",null,null,null,null,null,24]
["Energy+ Inc.","Energy+ Inc.-For Former Cambridge and North Dumfries Hydro Service Area",null,null,"Rate Rider for Disposition of Global Adjustment Account (2019) - effective until April 30, 2019\n      Applicable only for Non-RPP Customers",null,"$/kWh",3.2000000000000002E-3,null,null,"6_UNMETERED SCATTERED LOAD SERVICE CLASSIFICATION","B",null,null,null,"6_UNMETERED SCATTERED LOAD SERVICE CLASSIFICATION_GA_kwh",null,null,null,"2019-04-30",null,139]
["Energy+ Inc.","Energy+ Inc.-For Former Cambridge and North Dumfries Hydro Service Area",null,null,"Rate Rider for Disposition of Deferral/Variance Accounts (2019) - effective until April 30, 2019",null,"$/kWh",-6.202260836220665E-3,null,null,"6_UNMETERED SCATTERED LOAD SERVICE CLASSIFICATION","B",null,null,null,"6_UNMETERED SCATTERED LOAD SERVICE CLASSIFICATION_DEFVAR_ALL",null,null,null,"2019-04-30",null,96]
["Energy+ Inc.","Energy+ Inc.-For Former Cambridge and North Dumfries Hydro Service Area",null,null,"Rate Rider for Disposition of Capacity Based Recovery Account (2019) - effective until April 30, 2019 Applicable only for Class B Customers",null,"$/kWh",4.0000000000000002E-4,null,null,"6_UNMETERED SCATTERED LOAD SERVICE CLASSIFICATION","B",null,null,null,"6_UNMETERED SCATTERED LOAD SERVICE CLASSIFICATION_VR_RR_30",null,null,null,"2019-04-30",null,139]
["Energy+ Inc.","Energy+ Inc.-For Former Cambridge and North Dumfries Hydro Service Area",null,null,"Retail Transmission Rate - Network Service Rate",null,"$/kWh",5.1999999999999998E-3,null,null,"6_UNMETERED SCATTERED LOAD SERVICE CLASSIFICATION","C",null,null,null,"6_UNMETERED SCATTERED LOAD SERVICE CLASSIFICATION_Retail Transmission Rate - Network Service Rate",null,null,null,null,null,47]
["Energy+ Inc.","Energy+ Inc.-For Former Cambridge and North Dumfries Hydro Service Area",null,null,"Retail Transmission Rate - Line and Transformation Connection Service Rate",null,"$/kWh",4.1000000000000003E-3,null,null,"6_UNMETERED SCATTERED LOAD SERVICE CLASSIFICATION","C",null,null,null,"6_UNMETERED SCATTERED LOAD SERVICE CLASSIFICATION_Retail Transmission Rate - Line and Transformation Connection Service Rate",null,null,null,null,null,74]
["Energy+ Inc.","Energy+ Inc.-For Former Cambridge and North Dumfries Hydro Service Area",null,null,"MONTHLY RATES AND CHARGES - Regulatory Component",null,null,null,null,null,"6_MRC_Reg",null,null,null,null,null,null,null,null,null,null,48]
["Energy+ Inc.","Energy+ Inc.-For Former Cambridge and North Dumfries Hydro Service Area",null,null,"Wholesale Market Service Rate (WMS) - not including CBR",null,"$/kWh",3.2000000000000002E-3,null,null,"6_UNMETERED SCATTERED LOAD SERVICE CLASSIFICATION",null,null,null,null,"6_UNMETERED SCATTERED LOAD SERVICE CLASSIFICATION_WMSR",null,null,null,null,null,55]
["Energy+ Inc.","Energy+ Inc.-For Former Cambridge and North Dumfries Hydro Service Area",null,null,"Capacity Based Recovery (CBR) - Applicable for Class B Customers ",null,"$/kWh",4.0000000000000002E-4,null,null,"6_UNMETERED SCATTERED LOAD SERVICE CLASSIFICATION",null,null,null,null,null,null,null,null,null,null,65]
["Energy+ Inc.","Energy+ Inc.-For Former Cambridge and North Dumfries Hydro Service Area",null,null,"Rural or Remote Electricity Rate Protection Charge (RRRP)",null,"$/kWh",2.9999999999999997E-4,null,null,"6_UNMETERED SCATTERED LOAD SERVICE CLASSIFICATION","T",null,null,null,"6_UNMETERED SCATTERED LOAD SERVICE CLASSIFICATION_RRRP",null,null,null,null,null,57]
["Energy+ Inc.","Energy+ Inc.-For Former Cambridge and North Dumfries Hydro Service Area",null,null,"Standard Supply Service - Administrative Charge (if applicable)",null,"$",0.25,null,null,"6_UNMETERED SCATTERED LOAD SERVICE CLASSIFICATION","T",null,null,null,"6_UNMETERED SCATTERED LOAD SERVICE CLASSIFICATION_SSS",null,null,null,null,null,63]
["Energy+ Inc.","Energy+ Inc.-For Former Cambridge and North Dumfries Hydro Service Area",null,null,"STREET LIGHTING SERVICE CLASSIFICATION",null,null,null,null,null,"7_STREET LIGHTING SERVICE CLASSIFICATION",null,null,null,null,null,null,null,null,null,null,38]
["Energy+ Inc.","Energy+ Inc.-For Former Cambridge and North Dumfries Hydro Service Area",null,null,"This classification refers to an account for roadway lighting with a Municipality, Regional Municipality, Ministry of Transportation and private roadway lighting operation, controlled by photo cells.  The consumption for these customers will be based on the calculated connected load times the required lighting times established in the approved Ontario Energy Board street lighting load shape template. Class B consumers are defined in accordance with O. Reg. 429/04. Further servicing details are available in the distributor's Conditions of Service.",null,null,null,null,null,"7_STREET LIGHTING SERVICE CLASSIFICATION",null,null,null,null,null,null,null,null,null,null,552]
["Energy+ Inc.","Energy+ Inc.-For Former Cambridge and North Dumfries Hydro Service Area",null,null,"APPLICATION",null,null,null,null,null,"7_APPLICATION",null,null,null,null,null,null,null,null,null,null,11]
["Energy+ Inc.","Energy+ Inc.-For Former Cambridge and North Dumfries Hydro Service Area",null,null,"The application of these rates and charges shall be in accordance with the Licence of the Distributor and any Code or Order of the Ontario Energy Board, and amendments thereto as approved by the Ontario Energy Board, which may be applicable to the administration of this schedule.",null,null,null,null,null,"7_STREET LIGHTING SERVICE CLASSIFICATION",null,null,null,null,null,null,null,null,null,null,280]
["Energy+ Inc.","Energy+ Inc.-For Former Cambridge and North Dumfries Hydro Service Area",null,null,"No rates and charges for the distribution of electricity and charges to meet the costs of any work or service done or furnished for the purpose of the distribution of electricity shall be made except as permitted by this schedule, unless required by the Distributor’s Licence or a Code or Order of the Ontario Energy Board, and amendments thereto as approved by the Ontario Energy Board, or as specified herein.",null,null,null,null,null,"7_STREET LIGHTING SERVICE CLASSIFICATION",null,null,null,null,null,null,null,null,null,null,411]
["Energy+ Inc.","Energy+ Inc.-For Former Cambridge and North Dumfries Hydro Service Area",null,null,"Unless specifically noted, this schedule does not contain any charges for the electricity commodity, be it under the Regulated Price Plan, a contract with a retailer or the wholesale market price, as applicable.  In addition, the charges in the MONTHLY RATES AND CHARGES - Regulatory Component of this schedule do not apply to a customer that is an embedded wholesale market participant.",null,null,null,null,null,"7_STREET LIGHTING SERVICE CLASSIFICATION",null,null,null,null,null,null,null,null,null,null,387]
["Energy+ Inc.","Energy+ Inc.-For Former Cambridge and North Dumfries Hydro Service Area",null,null,"The rate rider for the disposition of WMS - Sub-account CBR Class B is not applicable to wholesale market participants (WMP), customers that transitioned between Class A and Class B during the variance account accumulation period, or to customers that were in Class A for the entire period. Customers who transitioned are to be charged or refunded their share of the variance disposed through customer specific billing adjustments. This rate rider is to be consistently applied for the entire period to the sunset date of the rate rider. In addition, this rate rider is applicable to all new Class B customers.",null,null,null,null,null,"7_STREET LIGHTING SERVICE CLASSIFICATION",null,null,null,null,null,null,null,null,null,null,610]
["Energy+ Inc.","Energy+ Inc.-For Former Cambridge and North Dumfries Hydro Service Area",null,null,"It should be noted that this schedule does not list any charges, assessments, or credits that are required by law to be invoiced by a distributor and that are not subject to Ontario Energy Board approval, such as the Debt Retirement Charge, the Global Adjustment and the HST.",null,null,null,null,null,"7_STREET LIGHTING SERVICE CLASSIFICATION",null,null,null,null,null,null,null,null,null,null,275]
["Energy+ Inc.","Energy+ Inc.-For Former Cambridge and North Dumfries Hydro Service Area",null,null,"MONTHLY RATES AND CHARGES - Delivery Component",null,null,null,null,null,"7_MRC_Del",null,null,null,null,null,null,null,null,null,null,46]
["Energy+ Inc.","Energy+ Inc.-For Former Cambridge and North Dumfries Hydro Service Area",null,null,"Service Charge (per connection)",null,"$",2.5628599999999997,null,null,"7_STREET LIGHTING SERVICE CLASSIFICATION","A",null,null,null,"7_STREET LIGHTING SERVICE CLASSIFICATION_MSC",null,null,null,null,null,31]
["Energy+ Inc.","Energy+ Inc.-For Former Cambridge and North Dumfries Hydro Service Area",null,null,"Distribution Volumetric Rate",null,"$/kW",16.365576399999998,null,null,"7_STREET LIGHTING SERVICE CLASSIFICATION","A",null,null,null,"7_STREET LIGHTING SERVICE CLASSIFICATION_DVC",null,null,null,null,null,28]
["Energy+ Inc.","Energy+ Inc.-For Former Cambridge and North Dumfries Hydro Service Area",null,null,"Low Voltage Service Rate",null,"$/kW",2.7E-2,null,null,"7_STREET LIGHTING SERVICE CLASSIFICATION","B",null,null,null,"7_STREET LIGHTING SERVICE CLASSIFICATION_LV",null,null,null,null,null,24]
["Energy+ Inc.","Energy+ Inc.-For Former Cambridge and North Dumfries Hydro Service Area",null,null,"Rate Rider for Disposition of Global Adjustment Account (2019) - effective until April 30, 2019\n      Applicable only for Non-RPP Customers",null,"$/kWh",3.3E-3,null,null,"7_STREET LIGHTING SERVICE CLASSIFICATION","B",null,null,null,"7_STREET LIGHTING SERVICE CLASSIFICATION_GA_kwh",null,null,null,"2019-04-30",null,139]
["Energy+ Inc.","Energy+ Inc.-For Former Cambridge and North Dumfries Hydro Service Area",null,null,"Rate Rider for Disposition of Deferral/Variance Accounts (2019) - effective until April 30, 2019",null,"$/kW",-2.2406831535474727,null,null,"7_STREET LIGHTING SERVICE CLASSIFICATION","B",null,null,null,"7_STREET LIGHTING SERVICE CLASSIFICATION_DEFVAR_ALL",null,null,null,"2019-04-30",null,96]
["Energy+ Inc.","Energy+ Inc.-For Former Cambridge and North Dumfries Hydro Service Area",null,null,"Rate Rider for Disposition of Capacity Based Recovery Account (2019) - effective until April 30, 2019 Applicable only for Class B Customers",null,"$/kWh",0.15310000000000001,null,null,"7_STREET LIGHTING SERVICE CLASSIFICATION","B",null,null,null,"7_STREET LIGHTING SERVICE CLASSIFICATION_VR_RR_33",null,null,null,"2019-04-30",null,139]
["Energy+ Inc.","Energy+ Inc.-For Former Cambridge and North Dumfries Hydro Service Area",null,null,"Retail Transmission Rate - Network Service Rate",null,"$/kW",1.6867000000000001,null,null,"7_STREET LIGHTING SERVICE CLASSIFICATION","C",null,null,null,"7_STREET LIGHTING SERVICE CLASSIFICATION_Retail Transmission Rate - Network Service Rate",null,null,null,null,null,47]
["Energy+ Inc.","Energy+ Inc.-For Former Cambridge and North Dumfries Hydro Service Area",null,null,"Retail Transmission Rate - Line and Transformation Connection Service Rate",null,"$/kW",1.2485999999999999,null,null,"7_STREET LIGHTING SERVICE CLASSIFICATION","C",null,null,null,"7_STREET LIGHTING SERVICE CLASSIFICATION_Retail Transmission Rate - Line and Transformation Connection Service Rate",null,null,null,null,null,74]
["Energy+ Inc.","Energy+ Inc.-For Former Cambridge and North Dumfries Hydro Service Area",null,null,"MONTHLY RATES AND CHARGES - Regulatory Component",null,null,null,null,null,"7_MRC_Reg",null,null,null,null,null,null,null,null,null,null,48]
["Energy+ Inc.","Energy+ Inc.-For Former Cambridge and North Dumfries Hydro Service Area",null,null,"Wholesale Market Service Rate (WMS) - not including CBR",null,"$/kWh",3.2000000000000002E-3,null,null,"7_STREET LIGHTING SERVICE CLASSIFICATION",null,null,null,null,"7_STREET LIGHTING SERVICE CLASSIFICATION_WMSR",null,null,null,null,null,55]
["Energy+ Inc.","Energy+ Inc.-For Former Cambridge and North Dumfries Hydro Service Area",null,null,"Capacity Based Recovery (CBR) - Applicable for Class B Customers ",null,"$/kWh",4.0000000000000002E-4,null,null,"7_STREET LIGHTING SERVICE CLASSIFICATION",null,null,null,null,null,null,null,null,null,null,65]
["Energy+ Inc.","Energy+ Inc.-For Former Cambridge and North Dumfries Hydro Service Area",null,null,"Rural or Remote Electricity Rate Protection Charge (RRRP)",null,"$/kWh",2.9999999999999997E-4,null,null,"7_STREET LIGHTING SERVICE CLASSIFICATION","T",null,null,null,"7_STREET LIGHTING SERVICE CLASSIFICATION_RRRP",null,null,null,null,null,57]
["Energy+ Inc.","Energy+ Inc.-For Former Cambridge and North Dumfries Hydro Service Area",null,null,"Standard Supply Service - Administrative Charge (if applicable)",null,"$",0.25,null,null,"7_STREET LIGHTING SERVICE CLASSIFICATION","T",null,null,null,"7_STREET LIGHTING SERVICE CLASSIFICATION_SSS",null,null,null,null,null,63]
["Energy+ Inc.","Energy+ Inc.-For Former Cambridge and North Dumfries Hydro Service Area",null,null,"EMBEDDED DISTRIBUTOR SERVICE CLASSIFICATION",null,null,null,null,null,"8_EMBEDDED DISTRIBUTOR SERVICE CLASSIFICATION",null,null,null,null,null,null,null,null,null,null,43]
["Energy+ Inc.","Energy+ Inc.-For Former Cambridge and North Dumfries Hydro Service Area",null,null,"This classification applies to an electricity distributor licenced by the Ontario Energy Board, that is provided electricity by means of this distributor's facilities. Further servicing details are available in the distributor's Conditions of Service.",null,null,null,null,null,"8_EMBEDDED DISTRIBUTOR SERVICE CLASSIFICATION",null,null,null,null,null,null,null,null,null,null,251]
["Energy+ Inc.","Energy+ Inc.-For Former Cambridge and North Dumfries Hydro Service Area",null,null,"APPLICATION",null,null,null,null,null,"8_APPLICATION",null,null,null,null,null,null,null,null,null,null,11]
["Energy+ Inc.","Energy+ Inc.-For Former Cambridge and North Dumfries Hydro Service Area",null,null,"The application of these rates and charges shall be in accordance with the Licence of the Distributor and any Code or Order of the Ontario Energy Board, and amendments thereto as approved by the Ontario Energy Board, which may be applicable to the administration of this schedule.",null,null,null,null,null,"8_EMBEDDED DISTRIBUTOR SERVICE CLASSIFICATION",null,null,null,null,null,null,null,null,null,null,280]
["Energy+ Inc.","Energy+ Inc.-For Former Cambridge and North Dumfries Hydro Service Area",null,null,"No rates and charges for the distribution of electricity and charges to meet the costs of any work or service done or furnished for the purpose of the distribution of electricity shall be made except as permitted by this schedule, unless required by the Distributor’s Licence or a Code or Order of the Ontario Energy Board, and amendments thereto as approved by the Ontario Energy Board, or as specified herein.",null,null,null,null,null,"8_EMBEDDED DISTRIBUTOR SERVICE CLASSIFICATION",null,null,null,null,null,null,null,null,null,null,411]
["Energy+ Inc.","Energy+ Inc.-For Former Cambridge and North Dumfries Hydro Service Area",null,null,"Unless specifically noted, this schedule does not contain any charges for the electricity commodity, be it under the Regulated Price Plan, a contract with a retailer or the wholesale market price, as applicable.  In addition, the charges in the MONTHLY RATES AND CHARGES - Regulatory Component of this schedule do not apply to a customer that is an embedded wholesale market participant.",null,null,null,null,null,"8_EMBEDDED DISTRIBUTOR SERVICE CLASSIFICATION",null,null,null,null,null,null,null,null,null,null,387]
["Energy+ Inc.","Energy+ Inc.-For Former Cambridge and North Dumfries Hydro Service Area",null,null,"It should be noted that this schedule does not list any charges, assessments, or credits that are required by law to be invoiced by a distributor and that are not subject to Ontario Energy Board approval, such as the Debt Retirement Charge, the Global Adjustment and the HST.",null,null,null,null,null,"8_EMBEDDED DISTRIBUTOR SERVICE CLASSIFICATION",null,null,null,null,null,null,null,null,null,null,275]
["Energy+ Inc.","Energy+ Inc.-For Former Cambridge and North Dumfries Hydro Service Area",null,null,"MONTHLY RATES AND CHARGES - Delivery Component",null,null,null,null,null,"8_MRC_Del",null,null,null,null,null,null,null,null,null,null,46]
["Energy+ Inc.","Energy+ Inc.-For Former Cambridge and North Dumfries Hydro Service Area",null,null,"Monthly Distribution Wheeling Service Rate - Waterloo North Hydro",null,"$/kW",1.9166963999999997,null,null,"8_EMBEDDED DISTRIBUTOR SERVICE CLASSIFICATION","A",null,null,null,"8_EMBEDDED DISTRIBUTOR SERVICE CLASSIFICATION_DWSR",null,null,null,null,null,65]
["Energy+ Inc.","Energy+ Inc.-For Former Cambridge and North Dumfries Hydro Service Area",null,null,"Monthly Distribution Wheeling Service Rate - Hydro One Networks",null,"$/kW",2.0575527999999998,null,null,"8_EMBEDDED DISTRIBUTOR SERVICE CLASSIFICATION","A",null,null,null,"8_EMBEDDED DISTRIBUTOR SERVICE CLASSIFICATION_DWSR",null,null,null,null,null,63]
["Energy+ Inc.","Energy+ Inc.-For Former Cambridge and North Dumfries Hydro Service Area",null,null,"Retail Transmission Rate - Network Service Rate",null,"$/kW",2.4156,null,null,"8_EMBEDDED DISTRIBUTOR SERVICE CLASSIFICATION","C",null,null,null,"8_EMBEDDED DISTRIBUTOR SERVICE CLASSIFICATION_Retail Transmission Rate - Network Service Rate",null,null,null,null,null,47]
["Energy+ Inc.","Energy+ Inc.-For Former Cambridge and North Dumfries Hydro Service Area",null,null,"Retail Transmission Rate - Line and Transformation Connection Service Rate",null,"$/kW",1.9849000000000001,null,null,"8_EMBEDDED DISTRIBUTOR SERVICE CLASSIFICATION","C",null,null,null,"8_EMBEDDED DISTRIBUTOR SERVICE CLASSIFICATION_Retail Transmission Rate - Line and Transformation Connection Service Rate",null,null,null,null,null,74]
["Energy+ Inc.","Energy+ Inc.-For Former Cambridge and North Dumfries Hydro Service Area",null,null,"MONTHLY RATES AND CHARGES - Regulatory Component",null,null,null,null,null,"8_MRC_Reg",null,null,null,null,null,null,null,null,null,null,48]
["Energy+ Inc.","Energy+ Inc.-For Former Cambridge and North Dumfries Hydro Service Area",null,null,"Wholesale Market Service Rate (WMS) - not including CBR",null,"$/kWh",3.2000000000000002E-3,null,null,"8_EMBEDDED DISTRIBUTOR SERVICE CLASSIFICATION",null,null,null,null,"8_EMBEDDED DISTRIBUTOR SERVICE CLASSIFICATION_WMSR",null,null,null,null,null,55]
["Energy+ Inc.","Energy+ Inc.-For Former Cambridge and North Dumfries Hydro Service Area",null,null,"Capacity Based Recovery (CBR) - Applicable for Class B Customers ",null,"$/kWh",4.0000000000000002E-4,null,null,"8_EMBEDDED DISTRIBUTOR SERVICE CLASSIFICATION",null,null,null,null,null,null,null,null,null,null,65]
["Energy+ Inc.","Energy+ Inc.-For Former Cambridge and North Dumfries Hydro Service Area",null,null,"Rural or Remote Electricity Rate Protection Charge (RRRP)",null,"$/kWh",2.9999999999999997E-4,null,null,"8_EMBEDDED DISTRIBUTOR SERVICE CLASSIFICATION","T",null,null,null,"8_EMBEDDED DISTRIBUTOR SERVICE CLASSIFICATION_RRRP",null,null,null,null,null,57]
["Energy+ Inc.","Energy+ Inc.-For Former Cambridge and North Dumfries Hydro Service Area",null,null,"Standard Supply Service - Administrative Charge (if applicable)",null,"$",0.25,null,null,"8_EMBEDDED DISTRIBUTOR SERVICE CLASSIFICATION","T",null,null,null,"8_EMBEDDED DISTRIBUTOR SERVICE CLASSIFICATION_SSS",null,null,null,null,null,63]
["Energy+ Inc.","Energy+ Inc.-For Former Cambridge and North Dumfries Hydro Service Area",null,null,"microFIT SERVICE CLASSIFICATION",null,null,null,null,null,"9_microFIT SERVICE CLASSIFICATION",null,null,null,null,null,null,null,null,null,null,31]
["Energy+ Inc.","Energy+ Inc.-For Former Cambridge and North Dumfries Hydro Service Area",null,null,"This classification applies to an electricity generation facility contracted under the Independent Electricity System Operator’s microFIT program and connected to the distributor's distribution system.  Further servicing details are available in the distributor's Conditions of Service.",null,null,null,null,null,"9_microFIT SERVICE CLASSIFICATION",null,null,null,null,null,null,null,null,null,null,286]
["Energy+ Inc.","Energy+ Inc.-For Former Cambridge and North Dumfries Hydro Service Area",null,null,"APPLICATION",null,null,null,null,null,"9_APPLICATION",null,null,null,null,null,null,null,null,null,null,11]
["Energy+ Inc.","Energy+ Inc.-For Former Cambridge and North Dumfries Hydro Service Area",null,null,"The application of these rates and charges shall be in accordance with the Licence of the Distributor and any Code or Order of the Ontario Energy Board, and amendments thereto as approved by the Ontario Energy Board, which may be applicable to the administration of this schedule.",null,null,null,null,null,"9_microFIT SERVICE CLASSIFICATION",null,null,null,null,null,null,null,null,null,null,280]
["Energy+ Inc.","Energy+ Inc.-For Former Cambridge and North Dumfries Hydro Service Area",null,null,"No rates and charges for the distribution of electricity and charges to meet the costs of any work or service done or furnished for the purpose of the distribution of electricity shall be made except as permitted by this schedule, unless required by the Distributor’s Licence or a Code or Order of the Ontario Energy Board, and amendments thereto as approved by the Ontario Energy Board, or as specified herein.",null,null,null,null,null,"9_microFIT SERVICE CLASSIFICATION",null,null,null,null,null,null,null,null,null,null,411]
["Energy+ Inc.","Energy+ Inc.-For Former Cambridge and North Dumfries Hydro Service Area",null,null,"Unless specifically noted, this schedule does not contain any charges for the electricity commodity, be it under the Regulated Price Plan, a contract with a retailer or the wholesale market price, as applicable.",null,null,null,null,null,"9_microFIT SERVICE CLASSIFICATION",null,null,null,null,null,null,null,null,null,null,211]
["Energy+ Inc.","Energy+ Inc.-For Former Cambridge and North Dumfries Hydro Service Area",null,null,"It should be noted that this schedule does not list any charges, assessments, or credits that are required by law to be invoiced by a distributor and that are not subject to Ontario Energy Board approval, such as the Debt Retirement Charge, the Global Adjustment and the HST.",null,null,null,null,null,"9_microFIT SERVICE CLASSIFICATION",null,null,null,null,null,null,null,null,null,null,275]
["Energy+ Inc.","Energy+ Inc.-For Former Cambridge and North Dumfries Hydro Service Area",null,null,"MONTHLY RATES AND CHARGES - Delivery Component",null,null,null,null,null,"9_MRC_Del",null,null,null,null,null,null,null,null,null,null,46]
["Energy+ Inc.","Energy+ Inc.-For Former Cambridge and North Dumfries Hydro Service Area",null,null,"Service Charge",null,"$",5.4,null,null,"9_microFIT SERVICE CLASSIFICATION","A",null,null,null,"9_microFIT SERVICE CLASSIFICATION_MSC",null,null,null,null,null,14]
["Energy+ Inc.","Energy+ Inc.-For Former Cambridge and North Dumfries Hydro Service Area",null,null,"ALLOWANCES",null,null,null,null,null,"Energy+ Inc._ALLOWANCES",null,null,null,null,null,null,null,null,null,null,10]
["Energy+ Inc.","Energy+ Inc.-For Former Cambridge and North Dumfries Hydro Service Area",null,null,"Transformer Allowance for Ownership - per kW of billing demand/month",null,"$/kW",-0.6,null,null,null,null,null,null,null,null,null,null,null,null,null,68]
["Energy+ Inc.","Energy+ Inc.-For Former Cambridge and North Dumfries Hydro Service Area",null,null,"Primary Metering Allowance for Transformer Losses - applied to measured demand & energy",null,"%",-1,null,null,null,null,null,null,null,null,null,null,null,null,null,87]
["Energy+ Inc.","Energy+ Inc.-For Former Cambridge and North Dumfries Hydro Service Area",null,null,"SPECIFIC SERVICE CHARGES",null,null,null,null,null,"Energy+ Inc._SSC",null,null,null,null,null,null,null,null,null,null,24]
["Energy+ Inc.","Energy+ Inc.-For Former Cambridge and North Dumfries Hydro Service Area",null,null,"The application of these rates and charges shall be in accordance with the Licence of the Distributor and any Code or Order of the Ontario Energy Board, and amendments thereto as approved by the Ontario Energy Board, which may be applicable to the administration of this schedule.",null,null,null,null,null,null,null,null,null,null,null,null,null,null,null,null,280]
["Energy+ Inc.","Energy+ Inc.-For Former Cambridge and North Dumfries Hydro Service Area",null,null,"No charges to meet the costs of any work or service done or furnished for the purpose of the distribution of electricity shall be made except as permitted by this schedule, unless required by the Distributor’s Licence or a Code or Order of the Ontario Energy Board, and amendments thereto as approved by the Ontario Energy Board, or as specified herein.",null,null,null,null,null,null,null,null,null,null,null,null,null,null,null,null,353]
["Energy+ Inc.","Energy+ Inc.-For Former Cambridge and North Dumfries Hydro Service Area",null,null,"It should be noted that this schedule does not list any charges, assessments, or credits that are required by law to be invoiced by a distributor and that are not subject to Ontario Energy Board approval, such as the Debt Retirement Charge, the Global Adjustment and the HST.",null,null,null,null,null,null,null,null,null,null,null,null,null,null,null,null,275]
["Energy+ Inc.","Energy+ Inc.-For Former Cambridge and North Dumfries Hydro Service Area",null,null,"Customer Administration",null,null,null,null,null,"Energy+ Inc._CA",null,null,null,null,null,null,null,null,null,null,23]
["Energy+ Inc.","Energy+ Inc.-For Former Cambridge and North Dumfries Hydro Service Area",null,null,"Arrears certificate",null,"$",15,null,null,null,null,null,null,null,null,null,null,null,null,null,19]
["Energy+ Inc.","Energy+ Inc.-For Former Cambridge and North Dumfries Hydro Service Area",null,null,"Statement of account",null,"$",15,null,null,null,null,null,null,null,null,null,null,null,null,null,20]
["Energy+ Inc.","Energy+ Inc.-For Former Cambridge and North Dumfries Hydro Service Area",null,null,"Pulling post dated cheques",null,"$",15,null,null,null,null,null,null,null,null,null,null,null,null,null,26]
["Energy+ Inc.","Energy+ Inc.-For Former Cambridge and North Dumfries Hydro Service Area",null,null,"Duplicate invoices for previous billing",null,"$",15,null,null,null,null,null,null,null,null,null,null,null,null,null,39]
["Energy+ Inc.","Energy+ Inc.-For Former Cambridge and North Dumfries Hydro Service Area",null,null,"Request for other billing information",null,"$",15,null,null,null,null,null,null,null,null,null,null,null,null,null,37]
["Energy+ Inc.","Energy+ Inc.-For Former Cambridge and North Dumfries Hydro Service Area",null,null,"Easement Letter",null,"$",15,null,null,null,null,null,null,null,null,null,null,null,null,null,15]
["Energy+ Inc.","Energy+ Inc.-For Former Cambridge and North Dumfries Hydro Service Area",null,null,"Income tax letter",null,"$",15,null,null,null,null,null,null,null,null,null,null,null,null,null,17]
["Energy+ Inc.","Energy+ Inc.-For Former Cambridge and North Dumfries Hydro Service Area",null,null,"Notification charge",null,"$",15,null,null,null,null,null,null,null,null,null,null,null,null,null,19]
["Energy+ Inc.","Energy+ Inc.-For Former Cambridge and North Dumfries Hydro Service Area",null,null,"Account history",null,"$",15,null,null,null,null,null,null,null,null,null,null,null,null,null,15]
["Energy+ Inc.","Energy+ Inc.-For Former Cambridge and North Dumfries Hydro Service Area",null,null,"Returned Cheque (plus bank charges)",null,"$",15,null,null,null,null,null,null,null,null,null,null,null,null,null,35]
["Energy+ Inc.","Energy+ Inc.-For Former Cambridge and North Dumfries Hydro Service Area",null,null,"Charge to certify cheque",null,"$",15,null,null,null,null,null,null,null,null,null,null,null,null,null,24]
["Energy+ Inc.","Energy+ Inc.-For Former Cambridge and North Dumfries Hydro Service Area",null,null,"Legal letter charge",null,"$",15,null,null,null,null,null,null,null,null,null,null,null,null,null,19]
["Energy+ Inc.","Energy+ Inc.-For Former Cambridge and North Dumfries Hydro Service Area",null,null,"Account set up charge/change of occupancy charge (plus credit agency costs if applicable)",null,"$",30,null,null,null,null,null,null,null,null,null,null,null,null,null,89]
["Energy+ Inc.","Energy+ Inc.-For Former Cambridge and North Dumfries Hydro Service Area",null,null,"Special meter reads",null,"$",30,null,null,null,null,null,null,null,null,null,null,null,null,null,19]
["Energy+ Inc.","Energy+ Inc.-For Former Cambridge and North Dumfries Hydro Service Area",null,null,"Meter dispute charge plus Measurement Canada fees (if meter found correct)",null,"$",30,null,null,null,null,null,null,null,null,null,null,null,null,null,74]
["Energy+ Inc.","Energy+ Inc.-For Former Cambridge and North Dumfries Hydro Service Area",null,null,"Credit reference/credit check (plus credit agency costs)",null,"$",15,null,null,null,null,null,null,null,null,null,null,null,null,null,56]
["Energy+ Inc.","Energy+ Inc.-For Former Cambridge and North Dumfries Hydro Service Area",null,null,"Non-Payment of Account",null,null,null,null,null,"Energy+ Inc._NPoA",null,null,null,null,null,null,null,null,null,null,22]
["Energy+ Inc.","Energy+ Inc.-For Former Cambridge and North Dumfries Hydro Service Area",null,null,"Late Payment - per month",null,"%",1.5,null,null,null,null,null,null,null,null,null,null,null,null,null,24]
["Energy+ Inc.","Energy+ Inc.-For Former Cambridge and North Dumfries Hydro Service Area",null,null,"Late Payment - per annum",null,"%",19.559999999999999,null,null,null,null,null,null,null,null,null,null,null,null,null,24]
["Energy+ Inc.","Energy+ Inc.-For Former Cambridge and North Dumfries Hydro Service Area",null,null,"Collection of account charge - no disconnection - during regular business hours",null,"$",30,null,null,null,null,null,null,null,null,null,null,null,null,null,79]
["Energy+ Inc.","Energy+ Inc.-For Former Cambridge and North Dumfries Hydro Service Area",null,null,"Collection of account charge - no disconnection - after regular hours",null,"$",165,null,null,null,null,null,null,null,null,null,null,null,null,null,69]
["Energy+ Inc.","Energy+ Inc.-For Former Cambridge and North Dumfries Hydro Service Area",null,null,"Disconnect/Reconnect at Meter - during regular hours",null,"$",65,null,null,null,null,null,null,null,null,null,null,null,null,null,52]
["Energy+ Inc.","Energy+ Inc.-For Former Cambridge and North Dumfries Hydro Service Area",null,null,"Disconnect/Reconnect at Meter - after regular hours",null,"$",185,null,null,null,null,null,null,null,null,null,null,null,null,null,51]
["Energy+ Inc.","Energy+ Inc.-For Former Cambridge and North Dumfries Hydro Service Area",null,null,"Disconnect/Reconnect at Pole - during regular hours",null,"$",185,null,null,null,null,null,null,null,null,null,null,null,null,null,51]
["Energy+ Inc.","Energy+ Inc.-For Former Cambridge and North Dumfries Hydro Service Area",null,null,"Disconnect/Reconnect at Pole - after regular hours",null,"$",415,null,null,null,null,null,null,null,null,null,null,null,null,null,50]
["Energy+ Inc.","Energy+ Inc.-For Former Cambridge and North Dumfries Hydro Service Area",null,null,"Install/Remove Load Control Device - during regular hours",null,"$",65,null,null,null,null,null,null,null,null,null,null,null,null,null,57]
["Energy+ Inc.","Energy+ Inc.-For Former Cambridge and North Dumfries Hydro Service Area",null,null,"Install/Remove Load Control Device - after regular hours",null,"$",185,null,null,null,null,null,null,null,null,null,null,null,null,null,56]
["Energy+ Inc.","Energy+ Inc.-For Former Cambridge and North Dumfries Hydro Service Area",null,null,"Other",null,null,null,null,null,null,null,null,null,null,null,null,null,null,null,null,5]
["Energy+ Inc.","Energy+ Inc.-For Former Cambridge and North Dumfries Hydro Service Area",null,null,"Specific charge for access to the power poles - $/pole/year                                                                                                                                                                                                                                                                                                                                                             (with the exception of wireless attachments)",null,"$",22.35,null,null,null,null,null,null,null,null,null,null,null,null,null,452]
["Energy+ Inc.","Energy+ Inc.-For Former Cambridge and North Dumfries Hydro Service Area",null,null,"Service call - customer owned equipment",null,"$",30,null,null,null,null,null,null,null,null,null,null,null,null,null,39]
["Energy+ Inc.","Energy+ Inc.-For Former Cambridge and North Dumfries Hydro Service Area",null,null,"Service call - customer-owned equipment - after regular hours",null,"$",165,null,null,null,null,null,null,null,null,null,null,null,null,null,61]
["Energy+ Inc.","Energy+ Inc.-For Former Cambridge and North Dumfries Hydro Service Area",null,null,"RETAIL SERVICE CHARGES (if applicable)",null,null,null,null,null,"Energy+ Inc._RSC",null,null,null,null,null,null,null,null,null,null,38]
["Energy+ Inc.","Energy+ Inc.-For Former Cambridge and North Dumfries Hydro Service Area",null,null,"The application of these rates and charges shall be in accordance with the Licence of the Distributor and any Code or Order of the Ontario Energy Board, and amendments thereto as approved by the Ontario Energy Board, which may be applicable to the administration of this schedule.",null,null,null,null,null,null,null,null,null,null,null,null,null,null,null,null,280]
["Energy+ Inc.","Energy+ Inc.-For Former Cambridge and North Dumfries Hydro Service Area",null,null,"No rates and charges for the distribution of electricity and charges to meet the costs of any work or service done or furnished for the purpose of the distribution of electricity shall be made except as permitted by this schedule, unless required by the Distributor’s Licence or a Code or Order of the Ontario Energy Board, and amendments thereto as approved by the Ontario Energy Board, or as specified herein.",null,null,null,null,null,null,null,null,null,null,null,null,null,null,null,null,411]
["Energy+ Inc.","Energy+ Inc.-For Former Cambridge and North Dumfries Hydro Service Area",null,null,"Unless specifically noted, this schedule does not contain any charges for the electricity commodity, be it under the Regulated Price Plan, a contract with a retailer or the wholesale market price, as applicable.",null,null,null,null,null,null,null,null,null,null,null,null,null,null,null,null,211]
["Energy+ Inc.","Energy+ Inc.-For Former Cambridge and North Dumfries Hydro Service Area",null,null,"It should be noted that this schedule does not list any charges, assessments, or credits that are required by law to be invoiced by a distributor and that are not subject to Ontario Energy Board approval, such as the Debt Retirement Charge, the Global Adjustment and the HST.",null,null,null,null,null,null,null,null,null,null,null,null,null,null,null,null,275]
["Energy+ Inc.","Energy+ Inc.-For Former Cambridge and North Dumfries Hydro Service Area",null,null,"Retail Service Charges refer to services provided by a distributor to retailers or customers related to the supply of competitive electricity.",null,null,null,null,null,null,null,null,null,null,null,null,null,null,null,null,142]
["Energy+ Inc.","Energy+ Inc.-For Former Cambridge and North Dumfries Hydro Service Area",null,null,"One-time charge, per retailer, to establish the service agreement between the distributor and the retailer",null,"$",100,null,null,null,null,null,null,null,null,null,null,null,null,null,106]
["Energy+ Inc.","Energy+ Inc.-For Former Cambridge and North Dumfries Hydro Service Area",null,null,"Monthly Fixed Charge, per retailer",null,"$",20,null,null,null,null,null,null,null,null,null,null,null,null,null,34]
["Energy+ Inc.","Energy+ Inc.-For Former Cambridge and North Dumfries Hydro Service Area",null,null,"Monthly Variable Charge, per customer, per retailer",null,"$/cust.",0.5,null,null,null,null,null,null,null,null,null,null,null,null,null,51]
["Energy+ Inc.","Energy+ Inc.-For Former Cambridge and North Dumfries Hydro Service Area",null,null,"Distributor-consolidated billing monthly charge, per customer, per retailer",null,"$/cust.",0.3,null,null,null,null,null,null,null,null,null,null,null,null,null,75]
["Energy+ Inc.","Energy+ Inc.-For Former Cambridge and North Dumfries Hydro Service Area",null,null,"Retailer-consolidated billing monthly credit, per customer, per retailer",null,"$/cust.",-0.3,null,null,null,null,null,null,null,null,null,null,null,null,null,72]
["Energy+ Inc.","Energy+ Inc.-For Former Cambridge and North Dumfries Hydro Service Area",null,null,"Service Transaction Requests (STR)",null,null,null,null,null,null,null,null,null,null,null,null,null,null,null,null,34]
["Energy+ Inc.","Energy+ Inc.-For Former Cambridge and North Dumfries Hydro Service Area",null,null,"Request fee, per request, applied to the requesting party",null,"$",0.25,null,null,null,null,null,null,null,null,null,null,null,null,null,57]
["Energy+ Inc.","Energy+ Inc.-For Former Cambridge and North Dumfries Hydro Service Area",null,null,"Processing fee, per request, applied to the requesting party",null,"$",0.5,null,null,null,null,null,null,null,null,null,null,null,null,null,60]
["Energy+ Inc.","Energy+ Inc.-For Former Cambridge and North Dumfries Hydro Service Area",null,null,"Request for customer information as outlined in Section 10.6.3 and Chapter 11 of the Retail",null,null,null,null,null,null,null,null,null,null,null,null,null,null,null,null,91]
["Energy+ Inc.","Energy+ Inc.-For Former Cambridge and North Dumfries Hydro Service Area",null,null,"Settlement Code directly to retailers and customers, if not delivered electronically through the",null,null,null,null,null,null,null,null,null,null,null,null,null,null,null,null,96]
["Energy+ Inc.","Energy+ Inc.-For Former Cambridge and North Dumfries Hydro Service Area",null,null,"Electronic Business Transaction (EBT) system, applied to the requesting party",null,null,null,null,null,null,null,null,null,null,null,null,null,null,null,null,77]
["Energy+ Inc.","Energy+ Inc.-For Former Cambridge and North Dumfries Hydro Service Area",null,null,"Up to twice a year",null,"$","no charge",null,null,null,null,null,null,null,null,null,null,null,null,null,18]
["Energy+ Inc.","Energy+ Inc.-For Former Cambridge and North Dumfries Hydro Service Area",null,null,"More than twice a year, per request (plus incremental delivery costs)",null,"$",2,null,null,null,null,null,null,null,null,null,null,null,null,null,69]
["Energy+ Inc.","Energy+ Inc.-For Former Cambridge and North Dumfries Hydro Service Area",null,null,"LOSS FACTORS",null,null,null,null,null,"Energy+ Inc._LFs",null,null,null,null,null,null,null,null,null,null,12]
["Energy+ Inc.","Energy+ Inc.-For Former Cambridge and North Dumfries Hydro Service Area",null,null,"If the distributor is not capable of prorating changed loss factors jointly with distribution rates, the revised loss factors will be implemented upon the first subsequent billing for each billing cycle.",null,null,null,null,null,null,null,null,null,null,null,null,null,null,null,null,203]
["Energy+ Inc.","Energy+ Inc.-For Former Cambridge and North Dumfries Hydro Service Area",null,null,"Total Loss Factor - Secondary Metered Customer < 5,000 kW",null,null,1.0335000000000001,null,null,null,null,null,null,null,null,null,null,null,null,null,57]
["Energy+ Inc.","Energy+ Inc.-For Former Cambridge and North Dumfries Hydro Service Area",null,null,"Total Loss Factor - Secondary Metered Customer > 5,000 kW",null,null,1.0145,null,null,null,null,null,null,null,null,null,null,null,null,null,57]
["Energy+ Inc.","Energy+ Inc.-For Former Cambridge and North Dumfries Hydro Service Area",null,null,"Total Loss Factor - Primary Metered Customer < 5,000 kW",null,null,1.0235000000000001,null,null,null,null,null,null,null,null,null,null,null,null,null,55]
["Energy+ Inc.","Energy+ Inc.-For Former Cambridge and North Dumfries Hydro Service Area",null,null,"Total Loss Factor - Primary Metered Customer > 5,000 kW",null,null,1.0044999999999999,null,"Energy+ Inc.-For Former Cambridge and North Dumfries Hydro Service Area_End",null,null,null,null,null,null,null,null,null,null,null,55]

{"sheet":"lists","index":9,"n_rows":214,"n_cols":55,"rows_kept":214,"cut":false,"hidden":true,"merged":[[12,51,12,52],[1,51,1,52],[0,51,0,52],[11,51,11,52],[10,51,10,52],[9,51,9,52],[8,51,8,52],[7,51,7,52],[5,51,5,52],[4,51,4,52],[3,51,3,52],[2,51,2,52],[6,51,6,52],[13,51,13,52],[14,51,14,52],[15,51,15,52],[16,51,16,52],[17,51,17,52]]}
["ALLOWANCES","Embedded Distributor",{"$f":"COUNTA(B1:B17)","v":4},null,null,null,null,null,"A Standby Service Charge will be applied for a month where standby power is not provided. The applicable rate is the approved Distribution Volumetric Rate of the applicable service class and is applied to gross metered demand or contracted amount, whichever is greater. A monthly administration charge of $200, for simple metering arrangements, or $500, for complex metering arrangements, will also be applied.",null,null,"Loss Factors",null,"Units","Units1","Units2",null,null,null,null,null,null,null,null,null,"Account History","Account set up charge/change of occupancy charge (plus credit agency costs if applicable)","Total Loss Factor – Embedded Distributor – Hydro One Networks Inc.",null,null,null,null,null,null,null,null,null,"Algoma Power Inc.","Algoma Power Inc.",null,"DISTRIBUTED GENERATION [DGEN]","kW",null,null,null,"Sub-Total:  Delivery (Distribution and Retail Transmission)"]
["COMPETITIVE SECTOR MULTI-UNIT RESIDENTIAL SERVICE","General Service 3,000 to 4,999 kW",null,null,null,null,null,null,"Distribution Volumetric Rate",null,null,"Total Loss Factor – Primary Metered Customer",null,"$","$/kWh","$",null,null,null,null,null,null,null,null,null,"Account set up charge/change of occupancy charge","Administrative Billing Charge","Total Loss Factor – Primary Metered Customer",null,null,null,null,null,null,null,null,null,"Atikokan Hydro Inc.","Atikokan Hydro Inc.",null,"EMBEDDED DISTRIBUTOR","kW",null,null,null,"Wholesale Market Service Rate ",null,null,{"$f":"AU2*AV2","v":0},{"$f":"AU2","v":0},0,{"$f":"AX2*AY2","v":0},null,{"$f":"AZ2-AW2","v":0},{"$f":"BB2/AW2","v":{"$error":"#DIV/0!"}}]
["COMPETITIVE SECTOR MULTI-UNIT RESIDENTIAL SERVICE CLASSIFICATION","General Service 1,000 to 4,999 kW",null,null,null,null,null,null,"Distribution Volumetric Rate - $/kW of contracted amount",null,null,"Total Loss Factor – Primary Metered Customer < 5,000 kW",null,"$/kWh","$/kW","%",null,null,null,null,null,null,"MSC",null,null,"Account set up charge/change of occupancy charge (plus credit agency costs if applicable – Residential)","Bell Canada Pole Rentals","Total Loss Factor – Primary Metered Customer < 5,000 kW",null,null,null,null,null,null,null,null,null,"Bluewater Power Distribution Corporation","Bluewater Power Distribution Corporation",null,"EMBEDDED DISTRIBUTOR","kW",null,null,null,"Rural or Remote Electricity Rate Protection Charge (RRRP)",null,null,{"$f":"AU3*AV3","v":0},0,0,{"$f":"AX3*AY3","v":0},null,{"$f":"AZ3-AW3","v":0},{"$f":"BB3/AW3","v":{"$error":"#DIV/0!"}}]
["DISTRIBUTED GENERATION [DGEN]","General Service Equal To Or Greater Than 1,500 kW - Interval Metered",null,null,null,null,null,null,"Distribution Wheeling Service Rate",null,null,"Total Loss Factor – Primary Metered Customer > 5,000 kW",null,"$/kW","$/kVA",null,null,null,null,null,null,null,"SM_Rate_Adder",null,null,"Account set up charge/change of occupancy charge (plus credit agency costs if applicable)","Clearance Pole Attachment charge $/pole/year","Total Loss Factor – Primary Metered Customer > 5,000 kW",null,null,null,null,null,null,null,null,null,"Brant County Power Inc.","Brant County Power Inc.",null,"FARMS - SINGLE PHASE ENERGY-BILLED [F1]","kWh",null,null,null,"Standard Supply Service – Administration Charge (if applicable)",null,null,{"$f":"AU4*AV4","v":0},0,0,{"$f":"AX4*AY4","v":0},null,{"$f":"AZ4-AW4","v":0},{"$f":"BB4/AW4","v":{"$error":"#DIV/0!"}}]
["DISTRIBUTED GENERATION [DGEN] SERVICE CLASSIFICATION",null,null,null,null,null,null,null,"Electricity Rate",null,null,"Total Loss Factor – Secondary Metered Customer",null,"$/kVA",null,null,null,null,null,null,null,null,"MSC_Rate_Rider_",null,null,"Arrears certificate","Collection of account charge – no disconnection","Total Loss Factor – Secondary Metered Customer",null,null,null,null,null,null,null,null,null,"Brantford Power Inc.","Brantford Power Inc.",null,"FARMS - THREE PHASE ENERGY-BILLED [F3]","kWh",null,null,null,"Sub-Total:  Regulatory",null,null,{"$f":"SUM(AW2:AW4)","v":0},null,null,{"$f":"SUM(AZ2:BA4)","v":0},null,{"$f":"AZ5-AW5","v":0},{"$f":"BB5/AW5","v":{"$error":"#DIV/0!"}}]
["EMBEDDED DISTRIBUTOR",null,null,null,null,null,null,null,"Electricity Rate - All Additional kWh",null,null,"Total Loss Factor – Secondary Metered Customer < 5,000 kW",null,null,null,null,null,null,null,null,null,null,"VC",null,null,"Arrears certificate (credit reference)","Collection of account charge – no disconnection – after regular hours","Total Loss Factor – Secondary Metered Customer < 5,000 kW",null,null,null,null,null,null,null,null,null,"Burlington Hydro Inc.","Burlington Hydro Inc.",null,"GENERAL SERVICE - COMMERCIAL","kW",null,null,null,"Debt Retirement Charge (DRC)",null,null,{"$f":"AU6*AV6","v":0},{"$f":"AU6","v":0},{"$f":"AV6","v":0},{"$f":"AX6*AY6","v":0},null,{"$f":"AZ6-AW6","v":0},{"$f":"BB6/AW6","v":{"$error":"#DIV/0!"}}]
["EMBEDDED DISTRIBUTOR SERVICE CLASSIFICATION",null,null,null,null,null,null,null,"Electricity Rate - First 250 kWh",null,null,null,null,null,null,null,null,null,null,null,null,null,null,null,null,null,null,null,null,null,null,null,null,null,null,null,null,"Cambridge and North Dumfries Hydro Inc.","Cambridge and North Dumfries Hydro Inc.",null,"GENERAL SERVICE - INSTITUTIONAL","kW"]
["ENERGY FROM WASTE SERVICE CLASSIFICATION",null,null,null,null,null,null,null,"Electricity Rate -All Additional kWh",null,null,"Total Loss Factor – Secondary Metered Customer > 5,000 kW",null,null,null,null,null,null,null,null,null,null,"VC_Rate_Rider_",null,null,"Charge to certify cheque","Collection of account charge – no disconnection - during regular business hours","Total Loss Factor – Secondary Metered Customer > 5,000 kW",null,null,null,null,null,null,null,null,null,"Canadian Niagara Power Inc.","Canadian Niagara Power Inc.",null,"GENERAL SERVICE 1,000 TO 2,999 KW","kW",null,null,null,"Total Bill on RPP (before taxes)",null,null,null,null,null,null,null,{"$f":"AZ8-AW8","v":0}]
["FARMS - SINGLE PHASE ENERGY-BILLED [F1]",null,null,null,null,null,null,null,"Electricity Rate First 1,000 kWh",null,null,"Distribution Loss Factor - Secondary Metered Customer < 5,000 kW",null,null,null,null,null,null,null,null,null,null,"VC_GA_Rate_Rider_kW_",null,null,"Collection of Account Charge – No Disconnection","Collection of account charge – no disconnection – during regular hours",null,null,null,null,null,null,null,null,null,null,"Centre Wellington Hydro Ltd.","Centre Wellington Hydro Ltd.",null,"GENERAL SERVICE 1,000 TO 4,999 KW","kW",null,null,null,"HST",null,null,{"$f":"AV9*AW8","v":0},null,{"$f":"AV9","v":0},{"$f":"AY9*AZ8","v":0},null,{"$f":"AZ9-AW9","v":0},{"$f":"BB9/AW9","v":{"$error":"#DIV/0!"}}]
["FARMS - THREE PHASE ENERGY-BILLED [F3]",null,null,null,null,null,null,null,"Electricity Rate First 25,000 kWh",null,null,"Distribution Loss Factor - Secondary Metered Customer > 5,000 kW",null,null,null,null,null,null,null,null,null,null,"VC_LV_Rate",null,null,"Credit Card Convenience Charge","Collection/Disconnection/Load Limiter/Reconnection – if in Community",null,null,null,null,null,null,null,null,null,null,"Chapleau Public Utilities Corporation","Chapleau Public Utilities Corporation",null,"GENERAL SERVICE 1,000 TO 4,999 KW - INTERVAL METERS","kW",null,null,null,"Total Bill (including HST)",null,null,{"$f":"AW9+AW8","v":0},null,null,{"$f":"AZ9+AZ8","v":0},null,{"$f":"AZ10-AW10","v":0},{"$f":"BB10/AW10","v":{"$error":"#DIV/0!"}}]
["GENERAL SERVICE - COMMERCIAL",null,null,null,null,null,null,null,"Electricity Rate First 6,000 kWh",null,null,"Distribution Loss Factor - Primary Metered Customer < 5,000 kW",null,null,null,null,null,null,null,null,null,null,"RTSR_Network",null,null,"Credit check (plus credit agency costs)","Credit Card Convenience Charge",null,null,null,null,null,null,null,null,null,null,"Collus PowerStream Corporation","Collus PowerStream Corporation",null,"GENERAL SERVICE 1,000 TO 4,999 KW (CO-GENERATION)","kW",null,null,null,"Ontario Clean Energy Benefit (OCEB)",null,null,{"$f":"-0.1*AW10","v":0},null,{"$f":"AV11","v":0},{"$f":"-0.1*AZ10","v":0},null,{"$f":"AZ11-AW11","v":0},{"$f":"BB11/AW11","v":{"$error":"#DIV/0!"}}]
["GENERAL SERVICE - INSTITUTIONAL",null,null,null,null,null,null,null,"Electricity Rate Next 1,500 kWh",null,null,"Distribution Loss Factor - Primary Metered Customer > 5,000 kW",null,null,null,null,null,null,null,null,null,null,"RTSR_Connection",null,null,"Credit reference Letter","Disconnect/Reconnect at meter – after regular hours",null,null,null,null,null,null,null,null,null,null,"Cooperative Hydro Embrun Inc.","Cooperative Hydro Embrun Inc.",null,"GENERAL SERVICE 1,500 TO 4,999 KW","kW",null,null,null,"Total Bill on RPP (including OCEB)",null,null,{"$f":"AW10+AW11","v":0},null,null,{"$f":"AZ10+AZ11","v":0},null,{"$f":"AZ12-AW12","v":0},{"$f":"BB12/AW12","v":{"$error":"#DIV/0!"}}]
["GENERAL SERVICE 1,000 TO 2,999 KW",null,null,null,null,null,null,null,"General Service 1,500 to 4,999 kW customer",null,null,null,null,null,null,null,null,null,null,null,null,null,null,null,null,null,null,null,null,null,null,null,null,null,null,null,null,"E.L.K. Energy Inc.","E.L.K. Energy Inc.",null,"GENERAL SERVICE 2,500 TO 4,999 KW","kW"]
["GENERAL SERVICE 1,000 TO 4,999 KW",null,null,null,null,null,null,null,"General Service 50 to 1,499 kW customer",null,null,"Total Loss Factor - Embedded Distributor",null,null,null,null,null,null,null,null,null,null,"RTSR_Network_Interval",null,null,"Credit reference/credit check (plus credit agency costs – General Service)","Disconnect/Reconnect at meter – during regular hours",null,null,null,null,null,null,null,null,null,null,"Enersource Hydro Mississauga Inc.","Enersource Hydro Mississauga Inc.",null,"GENERAL SERVICE 3,000 TO 4,999 KW","kW",null,null,null,"Total Bill on TOU (before taxes)",null,null,null,null,null,null,null,{"$f":"AZ14-AW14","v":0}]
["GENERAL SERVICE 1,000 TO 4,999 KW - INTERVAL METERS",null,null,null,null,null,null,null,"General Service Large Use customer",null,null,"Total Loss Factor – Embedded Distributor – Hydro One Networks Inc.",null,null,null,null,null,null,null,null,null,null,"RTSR_Connection_Interval",null,null,"Credit Reference/credit check (plus credit agency costs)","Disconnect/Reconnect at pole – after regular hours",null,null,null,null,null,null,null,null,null,null,"Entegrus Powerlines Inc.","Entegrus Powerlines Inc.",null,"GENERAL SERVICE 3,000 TO 4,999 KW - INTERMEDIATE USE","kW",null,null,null,"HST",null,null,{"$f":"AV15*AW14","v":0},null,{"$f":"AV15","v":0},{"$f":"AY15*AZ14","v":0},null,{"$f":"AZ15-AW15","v":0},{"$f":"BB15/AW15","v":{"$error":"#DIV/0!"}}]
["GENERAL SERVICE 1,000 TO 4,999 KW (CO-GENERATION)",null,null,null,null,null,null,null,"Green Energy Act Initiatives Funding Adder - effective until the date of the next \n      cost of service-based rate order",null,null,null,null,null,null,null,null,null,null,null,null,null,"RTSR_Network_Interval_GR1000kW",null,null,"Dispute Test – Commercial self contained -- MC","Disconnect/Reconnect at pole – during regular hours",null,null,null,null,null,null,null,null,null,null,"Entegrus Powerlines Inc. - Dutton Service Area","Entegrus Powerlines Inc. - Dutton Service Area",null,"GENERAL SERVICE 3,000 TO 4,999 KW - INTERVAL METERED","kW",null,null,null,"Total Bill (including HST)",null,null,{"$f":"AW15+AW14","v":0},null,null,{"$f":"AZ15+AZ14","v":0},null,{"$f":"AZ16-AW16","v":0},{"$f":"BB16/AW16","v":{"$error":"#DIV/0!"}}]
["GENERAL SERVICE 1,000 TO 4,999 KW (CO-GENERATION) SERVICE CLASSIFICATION",null,null,null,null,null,null,null,"Green Energy Act Plan Funding Adder",null,null,null,null,null,null,null,null,null,null,null,null,null,"RTSR_Connection_Interval_GR1000kW",null,null,"Dispute Test – Commercial TT -- MC","Disconnect/Reconnect Charge – At Meter – After Hours",null,null,null,null,null,null,null,null,null,null,"Entegrus Powerlines Inc. - former Chatham-Kent Hydro Service Area","Entegrus Powerlines Inc. - former Chatham-Kent Hydro Service Area",null,"GENERAL SERVICE 3,000 TO 4,999 KW - TIME OF USE","kW",null,null,null,"Ontario Clean Energy Benefit (OCEB)",null,null,{"$f":"-0.1*AW16","v":0},null,{"$f":"AV17","v":0},{"$f":"-0.1*AZ16","v":0},null,{"$f":"AZ17-AW17","v":0},{"$f":"BB17/AW17","v":{"$error":"#DIV/0!"}}]
["GENERAL SERVICE 1,000 to 4,999 kW SERVICE CLASSIFICATION",null,null,null,null,null,null,null,"Green Energy Act Plan Funding Adder - effective April 1, 2013 until March 31, 2014",null,null,null,null,null,null,null,null,null,null,null,null,null,"RTSR_Line_Connection",null,null,"Dispute Test – Residential","Disconnect/Reconnect Charge – At Meter – During Regular Hours",null,null,null,null,null,null,null,null,null,null,"Entegrus Powerlines Inc. - Newbury Service Area","Entegrus Powerlines Inc. - Newbury Service Area",null,"GENERAL SERVICE 50 TO 1,000 KW","kW",null,null,null,"Total Bill on TOU (including OCEB)",null,null,{"$f":"AW16+AW17","v":0},null,null,{"$f":"AZ16+AZ17","v":0},null,{"$f":"AZ18-AW18","v":0},{"$f":"BB18/AW18","v":{"$error":"#DIV/0!"}}]
["GENERAL SERVICE 1,500 TO 4,999 KW",null,null,null,null,null,null,null,"Green Energy Act Plan Funding Adder - effective April 1, 2014 until March 31, 2015",null,null,null,null,null,null,null,null,null,null,null,null,null,"RTSR_Transformer_Connection",null,null,"Duplicate Invoices for previous billing","Disconnect/Reconnect Charge – At Pole – After Hours",null,null,null,null,null,null,null,null,null,null,"Entegrus Powerlines Inc. - Strathroy, Mount Brydges and Parkhill Service Areas","Entegrus Powerlines Inc. - Strathroy, Mount Brydges and Parkhill Service Areas",null,"GENERAL SERVICE 50 TO 1,000 KW - INTERVAL METERS","kW"]
["GENERAL SERVICE 2,500 TO 4,999 KW",null,null,null,null,null,null,null,"ICM Rate Rider (2014) - in effect until the effective date of the next cost of service rates",null,null,null,null,null,null,null,null,null,null,null,null,null,"WMSR",null,null,"Easement Letter","Disconnect/Reconnect Charge – At Pole – During Regular Hours",null,null,null,null,null,null,null,null,null,null,"ENWIN Utilities Ltd.","ENWIN Utilities Ltd.",null,"GENERAL SERVICE 50 TO 1,000 KW - NON INTERVAL METERS","kW"]
["GENERAL SERVICE 3,000 TO 4,999 KW",null,null,null,null,null,null,null,"Low Voltage Service Charge",null,null,null,null,null,null,null,null,null,null,null,null,null,"RRRP",null,null,"Income Tax Letter","Disconnect/Reconnect Charges for non payment of account - At Meter After Hours",null,null,null,null,null,null,null,null,null,null,"Erie Thames Powerlines Corporation","Erie Thames Powerlines Corporation",null,"GENERAL SERVICE 50 TO 1,499 KW","kW"]
["GENERAL SERVICE 3,000 TO 4,999 KW - INTERMEDIATE USE",null,null,null,null,null,null,null,"Low Voltage Service Rate",null,null,null,null,null,null,null,null,null,null,null,null,null,"SPC",null,null,"Interval Meter Interrogation","Disconnect/Reconnect charges for non payment of account – at meter after regular hours",null,null,null,null,null,null,null,null,null,null,"Espanola Regional Hydro Distribution Corporation","Espanola Regional Hydro Distribution Corporation",null,"GENERAL SERVICE 50 TO 1,499 KW - INTERVAL METERED","kW"]
["GENERAL SERVICE 3,000 TO 4,999 KW - INTERMEDIATE USE SERVICE CLASSIFICATION",null,null,null,null,null,null,null,"Low Voltage Volumetric Rate",null,null,null,null,null,null,null,null,null,null,null,null,null,"DRC",null,null,"Interval meter request change","Disconnect/Reconnect Charges for non payment of account - At Meter During Regular Hours",null,null,null,null,null,null,null,null,null,null,"Essex Powerlines Corporation","Essex Powerlines Corporation",null,"GENERAL SERVICE 50 TO 2,499 KW","kW"]
["GENERAL SERVICE 3,000 TO 4,999 KW - INTERVAL METERED",null,null,null,null,null,null,null,"LRAM Rate Rider - Effective Until April 30, 2015",null,null,null,null,null,null,null,null,null,null,null,null,null,"SSS",null,null,"Legal letter","Disconnect/Reconnect charges for non payment of account – at meter during regular hours",null,null,null,null,null,null,null,null,null,null,"Festival Hydro Inc.","Festival Hydro Inc.",null,"GENERAL SERVICE 50 TO 2,999 KW","kW"]
["GENERAL SERVICE 3,000 TO 4,999 KW - TIME OF USE",null,null,null,null,null,null,null,"Minimum Distribution Charge - per KW of maximum billing demand in the previous 11 months",null,null,null,null,null,null,null,null,null,null,null,null,null,"SFLF",null,null,"Legal letter charge","Disconnect/Reconnect charges for non payment of account – at pole after regular hours",null,null,null,null,null,null,null,null,null,null,"Fort Frances Power Corporation","Fort Frances Power Corporation",null,"GENERAL SERVICE 50 TO 2,999 KW - INTERVAL METERED","kW"]
["GENERAL SERVICE 3,000 TO 4,999 KW SERVICE CLASSIFICATION","January",null,null,null,null,null,null,"Monthly Distribution Wheeling Service Rate - Dedicated LV Line",null,null,null,null,null,null,null,null,null,null,null,null,null,"DLF_Secondary_LT_5000kW",null,null,"Meter dispute charge plus Measurement Canada fees (if meter found correct)","Disconnect/Reconnect charges for non payment of account – at pole during regular hours",null,null,null,null,null,null,null,null,null,null,"Greater Sudbury Hydro Inc.","Greater Sudbury Hydro Inc.",null,"GENERAL SERVICE 50 TO 2,999 KW - TIME OF USE","kW"]
["GENERAL SERVICE 50 TO 1,000 KW","February",null,null,null,null,null,null,"Monthly Distribution Wheeling Service Rate - Hydro One Networks",null,null,null,null,null,null,null,null,null,null,null,null,null,"DLF_Secondary_GT_5000kW",null,null,"Notification charge","Disconnect/Reconnection for >300 volts - after regular hours",null,null,null,null,null,null,null,null,null,null,"Grimsby Power Inc.","Grimsby Power Inc.",null,"GENERAL SERVICE 50 TO 4,999 KW","kW"]
["GENERAL SERVICE 50 TO 1,000 KW - INTERVAL METERS","March",null,null,null,null,null,null,"Monthly Distribution Wheeling Service Rate - Shared LV Line",null,null,null,null,null,null,null,null,null,null,null,null,null,"DLF_Primary_LT_5000kW",null,null,"Pulling Post Dated Cheques","Disconnect/Reconnection for >300 volts - during regular hours",null,null,null,null,null,null,null,null,null,null,"Guelph Hydro Electric Systems Inc.","Guelph Hydro Electric Systems Inc.",null,"GENERAL SERVICE 50 TO 4,999 KW - INTERVAL METERED","kW"]
["GENERAL SERVICE 50 TO 1,000 KW - NON INTERVAL METERS","April",null,null,null,null,null,null,"Monthly Distribution Wheeling Service Rate - Waterloo North Hydro",null,null,null,null,null,null,null,null,null,null,null,null,null,"DLF_Primary_GT_5000kW",null,null,"Request for other billing information","Disposal of Concrete Poles",null,null,null,null,null,null,null,null,null,null,"Haldimand County Hydro Inc.","Haldimand County Hydro Inc.",null,"GENERAL SERVICE 50 TO 4,999 KW - TIME OF USE","kW"]
["GENERAL SERVICE 50 TO 1,499 KW","May",null,null,null,null,null,null,"Rate Rider for Application of Tax Change - effective until April 30, 2015",null,null,null,null,null,null,null,null,null,null,null,null,null,"TLF_Secondary_LT_5000kW",null,null,"Returned cheque (plus bank charges)","Dispute Test – Commercial TT -- MC",null,null,null,null,null,null,null,null,null,null,"Halton Hills Hydro Inc.","Halton Hills Hydro Inc.",null,"GENERAL SERVICE 50 TO 4,999 KW (COGENERATION)","kW"]
["GENERAL SERVICE 50 TO 1,499 KW - INTERVAL METERED","June",null,null,null,null,null,null,"Rate Rider for Application of Tax Change - effective until December 31, 2014",null,null,null,null,null,null,null,null,null,null,null,null,null,"TLF_Secondary_GT_5000kW",null,null,"Returned cheque charge (plus bank charges)","Install/Remove load control device – after regular hours",null,null,null,null,null,null,null,null,null,null,"Hearst Power Distribution Company Limited","Hearst Power Distribution Company Limited",null,"GENERAL SERVICE 50 TO 4,999 KW (FORMERLY TIME OF USE)","kW"]
["GENERAL SERVICE 50 to 1,499 kW SERVICE CLASSIFICATION","July",null,null,null,null,null,null,"Rate Rider for Application of Tax Change (2014) - effective until April 30, 2015",null,null,null,null,null,null,null,null,null,null,null,null,null,"TLF_Primary_LT_5000kW",null,null,"Special Billing Service (aggregation)","Install/Remove load control device – during regular hours",null,null,null,null,null,null,null,null,null,null,"Horizon Utilities Corporation","Horizon Utilities Corporation",null,"GENERAL SERVICE 50 TO 499 KW","kW"]
["GENERAL SERVICE 50 TO 2,499 KW","August",null,null,null,null,null,null,"Rate Rider for Application of Tax Change (per connection) - effective until April 30, 2015",null,null,null,null,null,null,null,null,null,null,null,null,null,"TLF_Primary_GT_5000kW",null,null,"Special Billing Service (sub-metering charge per meter)","Interval Meter Interrogation",null,null,null,null,null,null,null,null,null,null,"Hydro 2000 Inc.","Hydro 2000 Inc.",null,"GENERAL SERVICE 50 TO 699 KW","kW"]
["GENERAL SERVICE 50 TO 2,999 KW","September",null,null,null,null,null,null,"Rate Rider for CGAAP Accounting Changes (2013) - effective until April 30, 2017",null,null,null,null,null,null,null,null,null,null,null,null,null,"TLF_EmbeddedDistributor",null,null,"Special meter reads","Interval Meter Load Management Tool Charge $/month",null,null,null,null,null,null,null,null,null,null,"Hydro Hawkesbury Inc.","Hydro Hawkesbury Inc.",null,"GENERAL SERVICE 50 TO 999 KW","kW"]
["GENERAL SERVICE 50 TO 2,999 KW - INTERVAL METERED","October",null,null,null,null,null,null,"Rate Rider for Deferral/Variance Account (2012) - effective unitl April 30, 2016",null,null,null,null,null,null,null,null,null,null,null,null,null,null,null,null,"Statement of Account","Interval meter request change",null,null,null,null,null,null,null,null,null,null,"Hydro One Brampton Networks Inc.","Hydro One Brampton Networks Inc.",null,"GENERAL SERVICE 50 TO 999 KW - INTERVAL METERED","kW"]
["GENERAL SERVICE 50 TO 2,999 KW - TIME OF USE","November",null,null,null,null,null,null,"Rate Rider for Deferral/Variance Account Disposition – effective until April 30, 2015",null,null,null,null,null,null,null,null,null,null,null,null,null,null,null,null,"Unprocessed Payment Charge (plus bank charges)","Late Payment – per annum",null,null,null,null,null,null,null,null,null,null,"Hydro One Networks Inc.","Hydro One Networks Inc.",null,"GENERAL SERVICE 500 TO 4,999 KW","kW"]
["GENERAL SERVICE 50 TO 2,999 KW SERVICE CLASSIFICATION","December",null,null,null,null,null,null,"Rate Rider for Deferral/Variance Account Disposition (2012) - effective until April 30, 2016",null,null,null,null,null,null,null,null,null,null,null,null,null,null,null,null,null,"Late Payment – per month",null,null,null,null,null,null,null,null,null,null,"Hydro Ottawa Limited","Hydro Ottawa Limited",null,"GENERAL SERVICE 700 TO 4,999 KW","kW"]
["GENERAL SERVICE 50 TO 4,999 KW",null,null,null,null,null,null,null,"Rate Rider for Deferral/Variance Account Disposition (2013) - effective until April 30, 2014",null,null,null,null,null,null,null,null,null,null,null,null,null,null,null,null,null,"Layout fees",null,null,null,null,null,null,null,null,null,null,"Innisfil Hydro Distribution Systems Limited","Innisfil Hydro Distribution Systems Limited",null,"GENERAL SERVICE DEMAND BILLED (50 KW AND ABOVE) [GSD]","kW"]
["GENERAL SERVICE 50 TO 4,999 KW - INTERVAL METERED",null,null,null,null,null,null,null,"Rate Rider for Deferral/Variance Account Disposition (2014) - effective until April 28, 2016",null,null,null,null,null,null,null,null,null,null,null,null,null,null,null,null,null,"Meter dispute charge plus Measurement Canada fees (if meter found correct)",null,null,null,null,null,null,null,null,null,null,"Kenora Hydro Electric Corporation Ltd.","Kenora Hydro Electric Corporation Ltd.",null,"GENERAL SERVICE ENERGY BILLED (LESS THAN 50 KW) [GSE-METERED]","kWh"]
["GENERAL SERVICE 50 TO 4,999 KW - TIME OF USE",null,null,null,null,null,null,null,"Rate Rider for Deferral/Variance Account Disposition (2014) - effective until April 30, 2015",null,null,null,null,null,null,null,null,null,null,null,null,null,null,null,null,null,"Meter Interrogation Charge",null,null,null,null,null,null,null,null,null,null,"Kingston Hydro Corporation","Kingston Hydro Corporation",null,"GENERAL SERVICE ENERGY BILLED (LESS THAN TO 50 KW) [GSE-UNMETERED]","kWh"]
["GENERAL SERVICE 50 TO 4,999 KW (COGENERATION)",null,null,null,null,null,null,null,"Rate Rider for Deferral/Variance Account Disposition (2014) - effective until December 31, 2014",null,null,null,null,null,null,null,null,null,null,null,null,null,null,null,null,null,"Missed Service Appointment",null,null,null,null,null,null,null,null,null,null,"Kitchener-Wilmot Hydro Inc.","Kitchener-Wilmot Hydro Inc.",null,"GENERAL SERVICE EQUAL TO OR GREATER THAN 1,500 KW","kW"]
["GENERAL SERVICE 50 TO 4,999 KW (FORMERLY TIME OF USE)",null,null,null,null,null,null,null,"Rate Rider for Deferral/Variance Account Disposition (2014) - effective until December 31, 2015",null,null,null,null,null,null,null,null,null,null,null,null,null,null,null,null,null,"Norfolk Pole Rentals – Billed",null,null,null,null,null,null,null,null,null,null,"Lakefront Utilities Inc.","Lakefront Utilities Inc.",null,"GENERAL SERVICE EQUAL TO OR GREATER THAN 1,500 KW - INTERVAL METERED","kW"]
["GENERAL SERVICE 50 TO 4,999 KW SERVICE CLASSIFICATION",null,null,null,null,null,null,null,"Rate Rider for Deferral/Variance Account Dispositon (2012) - effective until April 30, 2016",null,null,null,null,null,null,null,null,null,null,null,null,null,null,null,null,null,"Optional Interval/TOU Meter charge $/month",null,null,null,null,null,null,null,null,null,null,"Lakeland Power Distribution Ltd.","Lakeland Power Distribution Ltd.",null,"GENERAL SERVICE GREATER THAN 1,000 KW","kW"]
["GENERAL SERVICE 50 to 4,999 kWSERVICE CLASSIFICATION",null,null,null,null,null,null,null,"Rate Rider for Disposition of Accounting Changes Under CGAAP Account 1576 \n      - effective until April 30, 2016",null,null,null,null,null,null,null,null,null,null,null,null,null,null,null,null,null,"Overtime Locate",null,null,null,null,null,null,null,null,null,null,"London Hydro Inc.","London Hydro Inc.",null,"GENERAL SERVICE GREATER THAN 50 kW - WMP","kW"]
["GENERAL SERVICE 50 TO 499 KW",null,null,null,null,null,null,null,"Rate Rider for Disposition of Deferral/Variance Accounts (2010) - effective until December 31, 2014",null,null,null,null,null,null,null,null,null,null,null,null,null,null,null,null,null,"Owner Requested Disconnection/Reconnection – after regular hours",null,null,null,null,null,null,null,null,null,null,"Midland Power Utility Corporation","Midland Power Utility Corporation",null,"GENERAL SERVICE INTERMEDIATE 1,000 TO 4,999 KW","kW"]
["GENERAL SERVICE 50 to 499 kW SERVICE CLASSIFICATION",null,null,null,null,null,null,null,"Rate Rider for Disposition of Deferral/Variance Accounts (2011) - effective until April 30, 2015",null,null,null,null,null,null,null,null,null,null,null,null,null,null,null,null,null,"Owner Requested Disconnection/Reconnection – during regular hours",null,null,null,null,null,null,null,null,null,null,"Milton Hydro Distribution Inc.","Milton Hydro Distribution Inc.",null,"GENERAL SERVICE INTERMEDIATE RATE CLASS 1,000 TO 4,999 KW (FORMERLY GENERAL SERVICE > 50 KW CUSTOMERS)","kW"]
["GENERAL SERVICE 50 TO 699 KW",null,null,null,null,null,null,null,"Rate Rider for Disposition of Deferral/Variance Accounts (2011) - effective until April 30, 2016",null,null,null,null,null,null,null,null,null,null,null,null,null,null,null,null,null,"Returned cheque (plus bank charges)",null,null,null,null,null,null,null,null,null,null,"Newmarket - Tay Power Distribution Ltd.","Newmarket - Tay Power Distribution Ltd.",null,"GENERAL SERVICE INTERMEDIATE RATE CLASS 1,000 TO 4,999 KW (FORMERLY LARGE USE CUSTOMERS)","kW"]
["GENERAL SERVICE 50 TO 699 KW SERVICE CLASSIFICATION",null,null,null,null,null,null,null,"Rate Rider for Disposition of Deferral/Variance Accounts (2012) - effective until April 30, 2014",null,null,null,null,null,null,null,null,null,null,null,null,null,null,null,null,null,"Rural system expansion / line connection fee",null,null,null,null,null,null,null,null,null,null,"Niagara Peninsula Energy Inc.","Niagara Peninsula Energy Inc.",null,"GENERAL SERVICE LESS THAN 50 KW","kWh"]
["GENERAL SERVICE 50 TO 999 KW",null,null,null,null,null,null,null,"Rate Rider for Disposition of Deferral/Variance Accounts (2012) - effective until April 30, 2015",null,null,null,null,null,null,null,null,null,null,null,null,null,null,null,null,null,"Same Day Open Trench",null,null,null,null,null,null,null,null,null,null,"Niagara-on-the-Lake Hydro Inc.","Niagara-on-the-Lake Hydro Inc.",null,"GENERAL SERVICE LESS THAN 50 KW - SINGLE PHASE ENERGY-BILLED [G1]","kWh"]
["GENERAL SERVICE 50 TO 999 KW - INTERVAL METERED",null,null,null,null,null,null,null,"Rate Rider for Disposition of Deferral/Variance Accounts (2012) - effective until April 30, 2016",null,null,null,null,null,null,null,null,null,null,null,null,null,null,null,null,null,"Scheduled Day Open Trench",null,null,null,null,null,null,null,null,null,null,"Norfolk Power Distribution Inc.","Norfolk Power Distribution Inc.",null,"GENERAL SERVICE LESS THAN 50 KW - THREE PHASE ENERGY-BILLED [G3]","kWh"]
["GENERAL SERVICE 50 to 999 kW SERVICE CLASSIFICATION",null,null,null,null,null,null,null,"Rate Rider for Disposition of Deferral/Variance Accounts (2012) - effective until August 31, 2014",null,null,null,null,null,null,null,null,null,null,null,null,null,null,null,null,null,"Service call – after regular hours",null,null,null,null,null,null,null,null,null,null,"North Bay Hydro Distribution Limited","North Bay Hydro Distribution Limited",null,"GENERAL SERVICE LESS THAN 50 KW - TRANSMISSION CLASS ENERGY-BILLED [T]","kWh"]
["GENERAL SERVICE 500 TO 1,499 KW SERVICE CLASSIFICATION",null,null,null,null,null,null,null,"Rate Rider for Disposition of Deferral/Variance Accounts (2012) - effective until December 31, 2015",null,null,null,null,null,null,null,null,null,null,null,null,null,null,null,null,null,"Service call – customer owned equipment",null,null,null,null,null,null,null,null,null,null,"Northern Ontario Wires Inc.","Northern Ontario Wires Inc.",null,"GENERAL SERVICE LESS THAN 50 KW - URBAN ENERGY-BILLED [UG]","kWh"]
["GENERAL SERVICE 500 TO 4,999 KW",null,null,null,null,null,null,null,"Rate Rider for Disposition of Deferral/Variance Accounts (2012) - effective until December 31, 2016 \n      Applicable only in the former service area of Clinton Power",null,null,null,null,null,null,null,null,null,null,null,null,null,null,null,null,null,"Service Call – Customer-owned Equipment – After Regular Hours",null,null,null,null,null,null,null,null,null,null,"Oakville Hydro Electricity Distribution Inc.","Oakville Hydro Electricity Distribution Inc.",null,"GENERAL SERVICE SINGLE PHASE - G1","kW"]
["GENERAL SERVICE 500 to 4,999 kW SERVICE CLASSIFICATION",null,null,null,null,null,null,null,"Rate Rider for Disposition of Deferral/Variance Accounts (2012) – effective until December 31, 2016 \n      Applicable only in the former service area of Clinton Power",null,null,null,null,null,null,null,null,null,null,null,null,null,null,null,null,null,"Service Call – Customer-owned Equipment – During Regular Hours",null,null,null,null,null,null,null,null,null,null,"Orangeville Hydro Limited","Orangeville Hydro Limited",null,"GENERAL SERVICE THREE PHASE - G3","kW"]
["GENERAL SERVICE 700 TO 4,999 KW",null,null,null,null,null,null,null,"Rate Rider for Disposition of Deferral/Variance Accounts (2012) - effective until January 31, 2014",null,null,null,null,null,null,null,null,null,null,null,null,null,null,null,null,null,"Service Charge for onsite interrogation of interval meter due to customer phone line failure - required weekly until line repaired $ 6",null,null,null,null,null,null,null,null,null,null,"Orillia Power Distribution Corporation","Orillia Power Distribution Corporation",null,"INTERMEDIATE USERS","kW"]
["GENERAL SERVICE 700 TO 4,999 KW SERVICE CLASSIFICATION",null,null,null,null,null,null,null,"Rate Rider for Disposition of Deferral/Variance Accounts (2012) - effective until June 30, 2014",null,null,null,null,null,null,null,null,null,null,null,null,null,null,null,null,null,"Service Layout - Commercial",null,null,null,null,null,null,null,null,null,null,"Oshawa PUC Networks Inc.","Oshawa PUC Networks Inc.",null,"INTERMEDIATE WITH SELF GENERATION","kW"]
["GENERAL SERVICE DEMAND BILLED (50 KW AND ABOVE) [GSD]",null,null,null,null,null,null,null,"Rate Rider for Disposition of Deferral/Variance Accounts (2013) - Applicable only to \n      Wholesale Market Participants - effective until April 30, 2015",null,null,null,null,null,null,null,null,null,null,null,null,null,null,null,null,null,"Service Layout - ResidentiaI",null,null,null,null,null,null,null,null,null,null,"Ottawa River Power Corporation","Ottawa River Power Corporation",null,"LARGE USE","kW"]
["GENERAL SERVICE ENERGY BILLED (LESS THAN 50 KW) [GSE-METERED]",null,null,null,null,null,null,null,"Rate Rider for Disposition of Deferral/Variance Accounts (2013) - effective until April 30, 2014",null,null,null,null,null,null,null,null,null,null,null,null,null,null,null,null,null,"Special Billing Service (sub-metering charge per meter)",null,null,null,null,null,null,null,null,null,null,"Parry Sound Power Corporation","Parry Sound Power Corporation",null,"LARGE USE - 3TS","kW"]
["GENERAL SERVICE ENERGY BILLED (LESS THAN TO 50 KW) [GSE-UNMETERED]",null,null,null,null,null,null,null,"Rate Rider for Disposition of Deferral/Variance Accounts (2013) - effective until April 30, 2015",null,null,null,null,null,null,null,null,null,null,null,null,null,null,null,null,null,"Special meter reads",null,null,null,null,null,null,null,null,null,null,"Peterborough Distribution Incorporated","Peterborough Distribution Incorporated",null,"LARGE USE - FORD ANNEX","kW"]
["GENERAL SERVICE EQUAL TO OR GREATER THAN 1,500 KW",null,null,null,null,null,null,null,"Rate Rider for Disposition of Deferral/Variance Accounts (2013) - effective until April 30, 2015 \n      - not applicable to Wholesale Market Participants",null,null,null,null,null,null,null,null,null,null,null,null,null,null,null,null,null,"Specific Charge for Access to the Power Poles - $/pole/year",null,null,null,null,null,null,null,null,null,null,"PowerStream Inc.","PowerStream Inc.",null,"LARGE USE - REGULAR","kW"]
["GENERAL SERVICE EQUAL TO OR GREATER THAN 1,500 KW - INTERVAL METERED",null,null,null,null,null,null,null,"Rate Rider for Disposition of Deferral/Variance Accounts (2013) - effective until April 30, 2017",null,null,null,null,null,null,null,null,null,null,null,null,null,null,null,null,null,"Specific Charge for Bell Canada Access to the Power Poles – per pole/year",null,null,null,null,null,null,null,null,null,null,"PUC Distribution Inc.","PUC Distribution Inc.",null,"LARGE USE > 5000 KW","kW"]
["GENERAL SERVICE EQUAL TO OR GREATER THAN 1,500 KW SERVICE CLASSIFICATION",null,null,null,null,null,null,null,"Rate Rider for Disposition of Deferral/Variance Accounts (2013) - effective until August 31, 2014",null,null,null,null,null,null,null,null,null,null,null,null,null,null,null,null,null,"Switching for company maintenance – Charge based on Time and Materials",null,null,null,null,null,null,null,null,null,null,"Renfrew Hydro Inc.","Renfrew Hydro Inc.",null,"microFIT","$"]
["GENERAL SERVICE GREATER THAN 1,000 KW",null,null,null,null,null,null,null,"Rate Rider for Disposition of Deferral/Variance Accounts (2013) - effective until December 31, 2014",null,null,null,null,null,null,null,null,null,null,null,null,null,null,null,null,null,"Temporary Service – Install & remove – overhead – no transformer",null,null,null,null,null,null,null,null,null,null,"Rideau St. Lawrence Distribution Inc.","Rideau St. Lawrence Distribution Inc.",null,"RESIDENTIAL","kWh"]
["GENERAL SERVICE GREATER THAN 50 kW - WMP",null,null,null,null,null,null,null,"Rate Rider for Disposition of Deferral/Variance Accounts (2013) - effective until May 31, 2014",null,null,null,null,null,null,null,null,null,null,null,null,null,null,null,null,null,"Temporary Service – Install & remove – overhead – with transformer",null,null,null,null,null,null,null,null,null,null,"Sioux Lookout Hydro Inc.","Sioux Lookout Hydro Inc.",null,"RESIDENTIAL - HENSALL","kWh"]
["GENERAL SERVICE INTERMEDIATE 1,000 TO 4,999 KW",null,null,null,null,null,null,null,"Rate Rider for Disposition of Deferral/Variance Accounts (2014) - effective until December 31, 2015",null,null,null,null,null,null,null,null,null,null,null,null,null,null,null,null,null,"Temporary Service – Install & remove – underground – no transformer",null,null,null,null,null,null,null,null,null,null,"St. Thomas Energy Inc.","St. Thomas Energy Inc.",null,"RESIDENTIAL - HIGH DENSITY [R1]","kWh"]
["GENERAL SERVICE INTERMEDIATE RATE CLASS 1,000 TO 4,999 KW (FORMERLY GENERAL SERVICE > 50 KW CUSTOMERS)",null,null,null,null,null,null,null,"Rate Rider for Disposition of Deferred PILs Variance Account 1562 - effective until March 31, 2016",null,null,null,null,null,null,null,null,null,null,null,null,null,null,null,null,null,"Temporary service install & remove – overhead – no transformer",null,null,null,null,null,null,null,null,null,null,"Thunder Bay Hydro Electricity Distribution Inc.","Thunder Bay Hydro Electricity Distribution Inc.",null,"RESIDENTIAL - LOW DENSITY [R2]","kWh"]
["GENERAL SERVICE INTERMEDIATE RATE CLASS 1,000 TO 4,999 KW (FORMERLY LARGE USE CUSTOMERS)",null,null,null,null,null,null,null,"Rate Rider for Disposition of Deferred PILs Variance Account 1562 (2012) - effective until April 30, 2015",null,null,null,null,null,null,null,null,null,null,null,null,null,null,null,null,null,"Temporary Service Install & Remove – Overhead – With Transformer",null,null,null,null,null,null,null,null,null,null,"Tillsonburg Hydro Inc.","Tillsonburg Hydro Inc.",null,"RESIDENTIAL - MEDIUM DENSITY [R1]","kWh"]
["GENERAL SERVICE LESS THAN 50 KW",null,null,null,null,null,null,null,"Rate Rider for Disposition of Deferred PILs Variance Account 1562 (2012) - effective until April 30, 2016",null,null,null,null,null,null,null,null,null,null,null,null,null,null,null,null,null,"Temporary Service Install & Remove – Underground – No Transformer",null,null,null,null,null,null,null,null,null,null,"Toronto Hydro-Electric System Limited","Toronto Hydro-Electric System Limited",null,"RESIDENTIAL - NORMAL DENSITY [R2]","kWh"]
["GENERAL SERVICE LESS THAN 50 KW - SINGLE PHASE ENERGY-BILLED [G1]",null,null,null,null,null,null,null,"Rate Rider for Disposition of Deferred PILs Variance Account 1562 (2nd Installment - 2012) \n      - effective until April 30, 2016",null,null,null,null,null,null,null,null,null,null,null,null,null,null,null,null,null,"Temporary service installation and removal – overhead – no transformer",null,null,null,null,null,null,null,null,null,null,"Veridian Connections Inc.","Veridian Connections Inc.",null,"RESIDENTIAL - TIME OF USE","kWh"]
["GENERAL SERVICE LESS THAN 50 KW - THREE PHASE ENERGY-BILLED [G3]",null,null,null,null,null,null,null,"Rate Rider for Disposition of Deferred PILs Variance Account 1562 (per connection) (2012) \n      - effective until April 30, 2015",null,null,null,null,null,null,null,null,null,null,null,null,null,null,null,null,null,"Temporary service installation and removal – overhead – with transformer",null,null,null,null,null,null,null,null,null,null,"Wasaga Distribution Inc.","Wasaga Distribution Inc.",null,"RESIDENTIAL - URBAN [UR]","kWh"]
["GENERAL SERVICE LESS THAN 50 KW - TRANSMISSION CLASS ENERGY-BILLED [T]",null,null,null,null,null,null,null,"Rate Rider for Disposition of Deferred PILs Variance Account 1562 (per connection) (2012) \n      - effective until April 30, 2016",null,null,null,null,null,null,null,null,null,null,null,null,null,null,null,null,null,"Temporary service installation and removal – underground – no transformer",null,null,null,null,null,null,null,null,null,null,"Waterloo North Hydro Inc.","Waterloo North Hydro Inc.",null,"RESIDENTIAL REGULAR","kWh"]
["GENERAL SERVICE LESS THAN 50 KW - URBAN ENERGY-BILLED [UG]",null,null,null,null,null,null,null,"Rate Rider for Disposition of Global Adjustment Sub-Account (2011)  - effective until April 30, 2015 \n      Applicable only for Non-RPP Customers",null,null,null,null,null,null,null,null,null,null,null,null,null,null,null,null,null,null,null,null,null,null,null,null,null,null,null,null,"Welland Hydro-Electric System Corp.","Welland Hydro-Electric System Corp.",null,"RESIDENTIAL SUBURBAN","kWh"]
["GENERAL SERVICE LESS THAN 50 kW SERVICE CLASSIFICATION",null,null,null,null,null,null,null,"Rate Rider for Disposition of Global Adjustment Sub-Account (2011) - effective until April 30, 2016 \n      Applicable only for Non-RPP Customers",null,null,null,null,null,null,null,null,null,null,null,null,null,null,null,null,null,null,null,null,null,null,null,null,null,null,null,null,"Wellington North Power Inc.","Wellington North Power Inc.",null,"RESIDENTIAL SUBURBAN SEASONAL","kWh"]
["GENERAL SERVICE SINGLE PHASE - G1",null,null,null,null,null,null,null,"Rate Rider for Disposition of Global Adjustment Sub-Account (2012) - effective until April 30, 2014 \n      Applicable only for Non-RPP Customers",null,null,null,null,null,null,null,null,null,null,null,null,null,null,null,null,null,null,null,null,null,null,null,null,null,null,null,null,"West Coast Huron Energy Inc.","West Coast Huron Energy Inc.",null,"RESIDENTIAL SUBURBAN YEAR ROUND","kWh"]
["GENERAL SERVICE THREE PHASE - G3",null,null,null,null,null,null,null,"Rate Rider for Disposition of Global Adjustment Sub-Account (2012) - effective until April 30, 2015 \n      Applicable only for Non-RPP Customers",null,null,null,null,null,null,null,null,null,null,null,null,null,null,null,null,null,null,null,null,null,null,null,null,null,null,null,null,"Westario Power Inc.","Westario Power Inc.",null,"RESIDENTIAL URBAN","kWh"]
["GENERAL SERVICELESS THAN 50 kWSERVICE CLASSIFICATION",null,null,null,null,null,null,null,"Rate Rider for Disposition of Global Adjustment Sub-Account (2012) - effective until April 30, 2015 \n      Applicatble only for Non-RPP Customers",null,null,null,null,null,null,null,null,null,null,null,null,null,null,null,null,null,null,null,null,null,null,null,null,null,null,null,null,"Whitby Hydro Electric Corporation","Whitby Hydro Electric Corporation",null,"RESIDENTIAL URBAN YEAR-ROUND","kWh"]
["INTERMEDIATE USER SERVICE CLASSIFICATION",null,null,null,null,null,null,null,"Rate Rider for Disposition of Global Adjustment Sub-Account (2012) - effective until April 30, 2016 \n      Applicable only for Non-RPP Customers",null,null,null,null,null,null,null,null,null,null,null,null,null,null,null,null,null,null,null,null,null,null,null,null,null,null,null,null,"Woodstock Hydro Services Inc.","Woodstock Hydro Services Inc.",null,"SEASONAL RESIDENTIAL","kWh"]
["INTERMEDIATE USERS",null,null,null,null,null,null,null,"Rate Rider for Disposition of Global Adjustment Sub-Account (2012) - effective until January 31, 2014. \n      Applicable only for Non-RPP Customers",null,null,null,null,null,null,null,null,null,null,null,null,null,null,null,null,null,null,null,null,null,null,null,null,null,null,null,null,null,null,null,"SEASONAL RESIDENTIAL - HIGH DENSITY [R3]","kWh"]
["INTERMEDIATE WITH SELF GENERATION",null,null,null,null,null,null,null,"Rate Rider for Disposition of Global Adjustment Sub-Account (2012) - effective until June 30, 2014 \n      Applicable only for Non-RPP Customers",null,null,null,null,null,null,null,null,null,null,null,null,null,null,null,null,null,null,null,null,null,null,null,null,null,null,null,null,null,null,null,"SEASONAL RESIDENTIAL - NORMAL DENSITY [R4]","kWh"]
["LARGE USE",null,null,null,null,null,null,null,"Rate Rider for Disposition of Global Adjustment Sub-Account (2012) Applicable only for Non-RPP Customers \n      - effective until August 31, 2014",null,null,null,null,null,null,null,null,null,null,null,null,null,null,null,null,null,null,null,null,null,null,null,null,null,null,null,null,null,null,null,"SENTINEL LIGHTING","kW"]
["LARGE USE - 3TS",null,null,null,null,null,null,null,"Rate Rider for Disposition of Global Adjustment Sub-Account (2012) Applicable only to Non-RPP Customers \n      - effective until August 31, 2014",null,null,null,null,null,null,null,null,null,null,null,null,null,null,null,null,null,null,null,null,null,null,null,null,null,null,null,null,null,null,null,"SMALL COMMERCIAL AND USL - PER CONNECTION","kWh"]
["LARGE USE - 3TS SERVICE CLASSIFICATION",null,null,null,null,null,null,null,"Rate Rider for Disposition of Global Adjustment Sub-Account (2013) - effective until April 30, 2014 \n      Applicable only for Non-RPP Customers",null,null,null,null,null,null,null,null,null,null,null,null,null,null,null,null,null,null,null,null,null,null,null,null,null,null,null,null,null,null,null,"SMALL COMMERCIAL AND USL - PER METER","kWh"]
["LARGE USE - FORD ANNEX",null,null,null,null,null,null,null,"Rate Rider for Disposition of Global Adjustment Sub-Account (2013) - effective until April 30, 2015 \n      Applicable only for Non-RPP Customers",null,null,null,null,null,null,null,null,null,null,null,null,null,null,null,null,null,null,null,null,null,null,null,null,null,null,null,null,null,null,null,"STANDARD A GENERAL SERVICE AIR ACCESS","kWh"]
["LARGE USE - FORD ANNEX SERVICE CLASSIFICATION",null,null,null,null,null,null,null,"Rate Rider for Disposition of Global Adjustment Sub-Account (2013) - effective until April 30, 2015 \n      Applicable only for Non-RPP Customers and excluding Wholesale Market Participants",null,null,null,null,null,null,null,null,null,null,null,null,null,null,null,null,null,null,null,null,null,null,null,null,null,null,null,null,null,null,null,"STANDARD A GENERAL SERVICE ROAD/RAIL","kWh"]
["LARGE USE - REGULAR",null,null,null,null,null,null,null,"Rate Rider for Disposition of Global Adjustment Sub-Account (2013) - effective until April 30, 2017 \n      Applicable only for Non-RPP Customers",null,null,null,null,null,null,null,null,null,null,null,null,null,null,null,null,null,null,null,null,null,null,null,null,null,null,null,null,null,null,null,"STANDARD A GRID CONNECTED","kWh"]
["LARGE USE - REGULAR SERVICE CLASSIFICATION",null,null,null,null,null,null,null,"Rate Rider For Disposition of Global Adjustment Sub-Account (2013) - effective until August 31, 2014 \n      Applicable only for Non-RPP Customers",null,null,null,null,null,null,null,null,null,null,null,null,null,null,null,null,null,null,null,null,null,null,null,null,null,null,null,null,null,null,null,"STANDARD A RESIDENTIAL AIR ACCESS","kWh"]
["LARGE USE > 5000 KW",null,null,null,null,null,null,null,"Rate Rider for Disposition of Global Adjustment Sub-Account (2013) - effective until December 31, 2014 \n      Applicable only for Non-RPP Customers",null,null,null,null,null,null,null,null,null,null,null,null,null,null,null,null,null,null,null,null,null,null,null,null,null,null,null,null,null,null,null,"STANDARD A RESIDENTIAL ROAD/RAIL","kWh"]
["LARGE USE SERVICE CLASSIFICATION",null,null,null,null,null,null,null,"Rate Rider for Disposition of Global Adjustment Sub-Account (2013) - effective until May 31, 2014 \n      Applicable only for Non-RPP Customers",null,null,null,null,null,null,null,null,null,null,null,null,null,null,null,null,null,null,null,null,null,null,null,null,null,null,null,null,null,null,null,"STANDBY - GENERAL SERVICE 1,000 - 5,000 KW","kW"]
["LARGE USE WITH DEDICATED ASSETS SERVICE CLASSIFICATION",null,null,null,null,null,null,null,"Rate Rider for Disposition of Global Adjustment Sub-Account (2014) - effective until December 31, 2014. \n      Applicable only for Non-RPP - Class B Customers",null,null,null,null,null,null,null,null,null,null,null,null,null,null,null,null,null,null,null,null,null,null,null,null,null,null,null,null,null,null,null,"STANDBY - GENERAL SERVICE 50 - 1,000 KW","kW"]
["LARGE USESERVICE CLASSIFICATION",null,null,null,null,null,null,null,"Rate Rider for Disposition of Global Adjustment Sub-Account (2014) - effective until December 31, 2014. \n      Applicable only for Non-RPP Customers",null,null,null,null,null,null,null,null,null,null,null,null,null,null,null,null,null,null,null,null,null,null,null,null,null,null,null,null,null,null,null,"STANDBY - LARGE USE","kW"]
["LOSS FACTORS",null,null,null,null,null,null,null,"Rate Rider for Disposition of Global Adjustment Sub-Account (2014) - effective until December 31, 2014. \n      Applicable only for Non-RPP Customers - Class A Customers",null,null,null,null,null,null,null,null,null,null,null,null,null,null,null,null,null,null,null,null,null,null,null,null,null,null,null,null,null,null,null,"STANDBY DISTRIBUTION SERVICE","kW"]
["microFIT",null,null,null,null,null,null,null,"Rate Rider for Disposition of Global Adjustment Sub-Account (2014) - effective until December 31, 2014. \n      Applicable only for Non-RPP Customers - Interval Metered",null,null,null,null,null,null,null,null,null,null,null,null,null,null,null,null,null,null,null,null,null,null,null,null,null,null,null,null,null,null,null,"STANDBY POWER","kW"]
["MICROFIT GENERATOR SERVICE CLASSIFICATION",null,null,null,null,null,null,null,"Rate Rider for Disposition of Global Adjustment Sub-Account (2014) - effective until December 31, 2014. \n      Applicable only for Non-RPP Customers - Non Interval Metered",null,null,null,null,null,null,null,null,null,null,null,null,null,null,null,null,null,null,null,null,null,null,null,null,null,null,null,null,null,null,null,"STANDBY POWER - APPROVED ON AN INTERIM BASIS","kW"]
["microFIT SERVICE CLASSIFICATION",null,null,null,null,null,null,null,"Rate Rider for Disposition of Global Adjustment Sub-Account (2014) \n      - effective until December 31, 2015. Applicable only for Non-RPP Customers.  ",null,null,null,null,null,null,null,null,null,null,null,null,null,null,null,null,null,null,null,null,null,null,null,null,null,null,null,null,null,null,null,"STANDBY POWER GENERAL SERVICE 1,500 TO 4,999 KW","kW"]
["microFITGENERATOR SERVICE CLASSIFICATION",null,null,null,null,null,null,null,"Rate Rider for Disposition of Post Retirement Actuarial Gain - effective until March 31, 2025",null,null,null,null,null,null,null,null,null,null,null,null,null,null,null,null,null,null,null,null,null,null,null,null,null,null,null,null,null,null,null,"STANDBY POWER GENERAL SERVICE 50 TO 1,499 KW","kW"]
["MONTHLY RATES AND CHARGES–DELIVERY COMPONENT-APPROVED ON AN INTERIM ",null,null,null,null,null,null,null,"Rate Rider for Disposition of Residual Hisotrical Smart Meter Costs - effective until April 30, 2015",null,null,null,null,null,null,null,null,null,null,null,null,null,null,null,null,null,null,null,null,null,null,null,null,null,null,null,null,null,null,null,"STANDBY POWER GENERAL SERVICE LARGE USE","kW"]
["NON STANDARD A GENERAL SERVICE SINGLE PHASE SERVICE CLASSIFICATION – G1",null,null,null,null,null,null,null,"Rate Rider for Disposition of Residual Hisotrical Smart Meter Costs - effective until April 30, 2017",null,null,null,null,null,null,null,null,null,null,null,null,null,null,null,null,null,null,null,null,null,null,null,null,null,null,null,null,null,null,null,"STREET LIGHTING","kW"]
["NON STANDARD A GENERAL SERVICE THREE PHASE SERVICE CLASSIFICATION – G3",null,null,null,null,null,null,null,"Rate Rider for Disposition of Residual Historical Smart Meter Costs - effective until April 30, 2014",null,null,null,null,null,null,null,null,null,null,null,null,null,null,null,null,null,null,null,null,null,null,null,null,null,null,null,null,null,null,null,"SUB TRANSMISSION [ST]","kW"]
["NON STANDARD A SEASONAL RESIDENTIAL SERVICE CLASSIFICATION – R4",null,null,null,null,null,null,null,"Rate Rider for Disposition of Residual Historical Smart Meter Costs - effective until April 30, 2016",null,null,null,null,null,null,null,null,null,null,null,null,null,null,null,null,null,null,null,null,null,null,null,null,null,null,null,null,null,null,null,"UNMETERED SCATTERED LOAD","kWh"]
["NON STANDARD A YEAR ROUND RESIDENTIAL SERVICE CLASSIFICATION – R2",null,null,null,null,null,null,null,"Rate Rider for Disposition of Residual Historical Smart Meter Costs - effective until August 31, 2014",null,null,null,null,null,null,null,null,null,null,null,null,null,null,null,null,null,null,null,null,null,null,null,null,null,null,null,null,null,null,null,"URBAN GENERAL SERVICE DEMAND BILLED (50 KW AND ABOVE) [UGD]","kW"]
["ONTARIO ELECTRICITY SUPPORT PROGRAM RECIPIENTS",null,null,null,null,null,null,null,"Rate Rider for Disposition of Residual Historical Smart Meter Costs - effective until August 31, 2015",null,null,null,null,null,null,null,null,null,null,null,null,null,null,null,null,null,null,null,null,null,null,null,null,null,null,null,null,null,null,null,"URBAN GENERAL SERVICE ENERGY BILLED (LESS THAN 50 KW) [UGE]","kWh"]
["RESIDENTIAL",null,null,null,null,null,null,null,"Rate Rider for Disposition of Residual Historical Smart Meter Costs - effective until December 31, 2014",null,null,null,null,null,null,null,null,null,null,null,null,null,null,null,null,null,null,null,null,null,null,null,null,null,null,null,null,null,null,null,"WESTPORT SEWAGE TREATMENT PLANT","kW"]
["RESIDENTIAL - HENSALL",null,null,null,null,null,null,null,"Rate Rider for Disposition of Residual Historical Smart Meter Costs – effective until December 31, 2014",null,null,null,null,null,null,null,null,null,null,null,null,null,null,null,null,null,null,null,null,null,null,null,null,null,null,null,null,null,null,null,"YEAR-ROUND RESIDENTIAL - R2","kWh"]
["RESIDENTIAL - HIGH DENSITY [R1]",null,null,null,null,null,null,null,"Rate Rider for Disposition of Residual Historical Smart Meter Costs - effective until December 31, 2015"]
["RESIDENTIAL - LOW DENSITY [R2]",null,null,null,null,null,null,null,"Rate Rider for Disposition of Residual Historical Smart Meter Costs - effective until December 31, 2016"]
["RESIDENTIAL - MEDIUM DENSITY [R1]",null,null,null,null,null,null,null,"Rate Rider for Disposition of Residual Historical Smart Meter Costs - effective until October 31, 2014"]
["RESIDENTIAL - NORMAL DENSITY [R2]",null,null,null,null,null,null,null,"Rate Rider for Disposition of Residual Historical Smart Meter Costs - effective until September 30, 2014"]
["RESIDENTIAL - TIME OF USE",null,null,null,null,null,null,null,"Rate Rider for Disposition of Residual Historical Smart Meter Costs - Non-Interval Metered \n      - effective until April 30, 2014"]
["RESIDENTIAL - URBAN [UR]",null,null,null,null,null,null,null,"Rate Rider for Disposition of Residual Historical Smart Meter Costs 2 - in effect until the effective date\n      of the next cost of service-based rate order"]
["RESIDENTIAL REGULAR",null,null,null,null,null,null,null,"Rate Rider for Disposition of Residual Historical Smart Meter Costs 3 - in effect until the effective date of\n      the next cost of service-based rate order"]
["RESIDENTIAL SERVICE CLASSIFICATION",null,null,null,null,null,null,null,"Rate Rider for Disposition of Residual Incremental Historical Smart Meter Costs \n      - effective until August 31, 2015"]
["RESIDENTIAL SUBURBAN",null,null,null,null,null,null,null,"Rate Rider for Disposition of Stranded Meter costs - effective until April 30, 2015"]
["RESIDENTIAL SUBURBAN SEASONAL",null,null,null,null,null,null,null,"Rate Rider for Disposition of Stranded Meter Costs - effective until April 30, 2016"]
["RESIDENTIAL SUBURBAN YEAR ROUND",null,null,null,null,null,null,null,"Rate Rider for Disposition of Stranded Meter Costs - effective until April 30, 2017"]
["RESIDENTIAL URBAN",null,null,null,null,null,null,null,"Rate Rider for Global Adjustment Sub Account Disposition - effective until April 30, 2016 \n      Applicable only for Non RPP Customers"]
["RESIDENTIAL URBAN YEAR-ROUND",null,null,null,null,null,null,null,"Rate Rider for Global Adjustment Sub-Account Disposition (2014) - effective until April 28, 2016 \n      Applicable only for Non-RPP Customers"]
["RETAIL SERVICE CHARGES (if applicable)",null,null,null,null,null,null,null,"Rate Rider for Global Adjustment Sub-Account Disposition (2014) - effective until April 30, 2015 \n      Applicable only for Non-RPP Customers"]
["SEASONAL RESIDENTIAL",null,null,null,null,null,null,null,"Rate Rider for Global Adjustment Sub-Account Disposition (2014) - effective until December 30, 2015 \n      Applicable only for Non-RPP Customers"]
["SEASONAL RESIDENTIAL - HIGH DENSITY [R3]",null,null,null,null,null,null,null,"Rate Rider for Global Adjustment Sub-Account Disposition (2014) - effective until December 31, 2014 \n      Applicable only for Non-RPP Customers"]
["SEASONAL RESIDENTIAL - NORMAL DENSITY [R4]",null,null,null,null,null,null,null,"Rate Rider for Global Adjustment Sub-Account Disposition (2014) - effective until December 31, 2015 \n      Applicable only for Non-RPP Customers"]
["SEASONAL RESIDENTIAL SERVICE CLASSIFICATION",null,null,null,null,null,null,null,"Rate Rider for Global Adjustment Sub-Account Disposition Applicable only for Non-RPP Customers \n      - effective until April 30, 2015"]
["SENTINEL LIGHTING",null,null,null,null,null,null,null,"Rate Rider for Incremental Capital - Distribution Volumetric - effective until April 30, 2016"]
["SENTINEL LIGHTING SERVICE CLASSIFICATION",null,null,null,null,null,null,null,"Rate Rider for Incremental Capital - Service Charge - effective until April 30, 2016"]
["SMALL COMMERCIAL AND USL - PER CONNECTION",null,null,null,null,null,null,null,"Rate Rider for Incremental Capital (2012) - effective until April 30, 2015"]
["SMALL COMMERCIAL AND USL - PER METER",null,null,null,null,null,null,null,"Rate Rider for Lost Revenue Adjustment Mechanism Variance Account (LRAMVA) Recovery (2012 CDM Activities) \n      - effective until April 30, 2015"]
["SPECIFIC SERVICE CHARGES",null,null,null,null,null,null,null,"Rate Rider for Recover of Residual Historical Smart meter Costs - effective until June 30, 2014"]
["SPECIFIC SERVICE CHARGES ",null,null,null,null,null,null,null,"Rate Rider for Recovery of CGAAP/CWIP Differential - in effect until December 31, 2016"]
["STANDARD A GENERAL SERVICE AIR ACCESS",null,null,null,null,null,null,null,"Rate Rider for Recovery of Foregone Revenue - effective until April 30, 2015"]
["STANDARD A GENERAL SERVICE AIR ACCESS SERVICE CLASSIFICATION",null,null,null,null,null,null,null,"Rate Rider for Recovery of Forgone Revenue - effective until April 30, 2015"]
["STANDARD A GENERAL SERVICE ROAD/RAIL",null,null,null,null,null,null,null,"Rate Rider for Recovery of Forgone Revenue - effective until December 31, 2014"]
["STANDARD A GENERAL SERVICE ROAD/RAIL ACCESS SERVICE CLASSIFICATION",null,null,null,null,null,null,null,"Rate Rider for Recovery of Green Energy Act related costs - effective until December 31, 2014"]
["STANDARD A GRID CONNECTED",null,null,null,null,null,null,null,"Rate Rider for Recovery of Incremental Capital (2013) - in effect until the effective date of \n      the next cost of service-based rate order"]
["STANDARD A GRID CONNECTED SERVICE CLASSIFICATION",null,null,null,null,null,null,null,"Rate Rider for Recovery of Incremental Capital (2013) - in effect until the effective date of \n      the next cost of service-based rate order"]
["STANDARD A RESIDENTIAL AIR ACCESS",null,null,null,null,null,null,null,"Rate Rider for Recovery of Incremental Capital (2013) (per connection) - in effect until the effective date of \n      the next cost of service-based rate order"]
["STANDARD A RESIDENTIAL AIR ACCESS SERVICE CLASSIFICATION",null,null,null,null,null,null,null,"Rate Rider for Recovery of Incremental Capital (2013) (per connection)- in effect until the effective date of \n      the next cost of service-based rate order"]
["STANDARD A RESIDENTIAL ROAD/RAIL",null,null,null,null,null,null,null,"Rate Rider for Recovery of Incremental Capital Costs"]
["STANDARD A RESIDENTIAL ROAD/RAIL ACCESS SERVICE CLASSIFICATION",null,null,null,null,null,null,null,"Rate Rider for Recovery of Incremental Capital Costs - effective until April 30, 2015"]
["STANDBY - GENERAL SERVICE 1,000 - 5,000 KW",null,null,null,null,null,null,null,"Rate Rider for Recovery of Incremental Capital Module Costs (2014) - in effect until the effective date\n      of the next cost of service-based rate order"]
["STANDBY - GENERAL SERVICE 50 - 1,000 KW",null,null,null,null,null,null,null,"Rate Rider for Recovery of Incremental Capital Module Costs (2014) - in effect until the effective date\n      of the next cost of service-based rate order"]
["STANDBY - LARGE USE",null,null,null,null,null,null,null,"Rate Rider for Recovery of Lost Revenue Adjustment Mechanism ( LRAM)/Shared Savings Mechanism (SSM) (2012) \n      - effective until August 31, 2014"]
["STANDBY DISTRIBUTION SERVICE",null,null,null,null,null,null,null,"Rate Rider for Recovery of Lost Revenue Adjustment Mechanism (2013) \n      - effective until December 31, 2014"]
["STANDBY DISTRIBUTION SERVICE CLASSIFICATION",null,null,null,null,null,null,null,"Rate Rider for Recovery of Lost Revenue Adjustment Mechanism (LRAM) - effective until April 30, 2016"]
["STANDBY POWER",null,null,null,null,null,null,null,"Rate Rider for Recovery of Lost Revenue Adjustment Mechanism (LRAM) (pre-2011 CDM Activities) \n      - effective until April 30, 2015"]
["STANDBY POWER - APPROVED ON AN INTERIM BASIS",null,null,null,null,null,null,null,"Rate Rider for Recovery of Lost Revenue Adjustment Mechanism (LRAM) (pre-2011 CDM Activities) (2013) \n      - effective until April 30, 2015"]
["STANDBY POWER GENERAL SERVICE 1,500 TO 4,999 KW",null,null,null,null,null,null,null,"Rate Rider for Recovery of Lost Revenue Adjustment Mechanism (LRAM)/Shared Savings"]
["STANDBY POWER GENERAL SERVICE 50 TO 1,499 KW",null,null,null,null,null,null,null,"Rate Rider for Recovery of Lost Revenue Adjustment Mechanism (LRAM)/Shared Savings Mechanism \n      (SSM) - effective until December 31, 2018 and applicable in the service area excluding the former \n      service areas of Clinton Power and West Perth Power"]
["STANDBY POWER GENERAL SERVICE LARGE USE",null,null,null,null,null,null,null,"Rate Rider for Recovery of Lost Revenue Adjustment Mechanism (LRAM)/Shared Savings Mechanism (SSM) - effective until \n      December 31, 2014 and applicable in the service area excluding the former service areas of Clinton Power and West Perth Power"]
["STANDBY POWER SERVICE",null,null,null,null,null,null,null,"Rate Rider for Recovery of Lost Revenue Adjustment Mechanism (LRAM)/Shared Savings Mechanism (SSM) - effective until \n      December 31, 2014 and applicable only in the former service area of Clinton Power"]
["STANDBY POWER SERVICE CLASSIFICATION",null,null,null,null,null,null,null,"Rate Rider for Recovery of Lost Revenue Adjustment Mechanism (LRAM)/Shared Savings Mechanism (SSM) - effective until \n      December 31, 2014 and applicable only in the former service area of West Perth Power"]
["STANDBY POWER SERVICE CLASSIFICATION ",null,null,null,null,null,null,null,"Rate Rider for Recovery of Lost Revenue Adjustment Mechanism (LRAM)/Shared Savings Mechanism (SSM) - effective until December 31, 2014 and applicable in the service area excluding the former service area of Clinton Power"]
["STANDBY POWERSERVICE CLASSIFICATION",null,null,null,null,null,null,null,"Rate Rider for Recovery of Lost Revenue Adjustment Mechanism (LRAM)/Shared Savings Mechanism (SSM) \n      - effective until March 31, 2016"]
["STREET LIGHTING",null,null,null,null,null,null,null,"Rate Rider for Recovery of Lost Revenue Adjustment Mechanism (LRAM)/Shared Savings Mechanism (SSM) (2012) \n      - effective until August 31, 2014"]
["STREET LIGHTING SERVICE CLASSIFICATION",null,null,null,null,null,null,null,"Rate Rider for Recovery of Lost Revenue Adjustment Mechanism (LRAM)/Shared Savings Mechanism (SSM) Recovery \n      - effective until April 30, 2015"]
["SUB TRANSMISSION [ST]",null,null,null,null,null,null,null,"Rate Rider for Recovery of Lost Revenue Adjustment Mechanism Variance Account (LRAMVA) (2014) \n      - effective until April 30, 2015"]
["UNMETERED SCATTERED LOAD",null,null,null,null,null,null,null,"Rate Rider for Recovery of Residual Historical Smart Meter Costs - effective July 1, 2012 - April 30, 2016"]
["UNMETERED SCATTERED LOAD SERVICE CLASSIFICATION",null,null,null,null,null,null,null,"Rate Rider for Recovery of Smart Meter Incremental Revenue Requirement - effective until the date of \n      the next cost of service-based rate order"]
["URBAN GENERAL SERVICE DEMAND BILLED (50 KW AND ABOVE) [UGD]",null,null,null,null,null,null,null,"Rate Rider for Recovery of Smart Meter Incremental Revenue Requirement - effective until the effective \n      date of the next cost of service-based rate order, or October 31, 2017, whichever occurs earlier"]
["URBAN GENERAL SERVICE ENERGY BILLED (LESS THAN 50 KW) [UGE]",null,null,null,null,null,null,null,"Rate Rider for Recovery of Smart Meter Incremental Revenue Requirement - in effect until the effective date of \n      the next cost of service-based rate order"]
["WESTPORT SEWAGE TREATMENT PLANT",null,null,null,null,null,null,null,"Rate Rider for Recovery of Smart Meter Incremental Revenue Requirement - Non-Interval Metered - in effect until \n      the effective date of the next cost of service-based rate order"]
["YEAR-ROUND RESIDENTIAL - R2",null,null,null,null,null,null,null,"Rate Rider for Recovery of Smart Meter Incremental Revenue Requirements - in effect until the effective date \n      of the next cost of service application"]
[null,null,null,null,null,null,null,null,"Rate Rider for Recovery of Smart Meter Stranded Assets - effective until April 30, 2016"]
[null,null,null,null,null,null,null,null,"Rate Rider for Recovery of Storm Damage Costs - effective until August 31, 2017"]
[null,null,null,null,null,null,null,null,"Rate Rider for Recovery of Stranded Assets - effective until April 30, 2016"]
[null,null,null,null,null,null,null,null,"Rate Rider for Recovery of Stranded Meter Assets - effective July 1, 2012 - April 30, 2016"]
[null,null,null,null,null,null,null,null,"Rate Rider for Recovery of Stranded Meter Assets – effective until April 30, 2015"]
[null,null,null,null,null,null,null,null,"Rate Rider for Recovery of Stranded Meter Assets - effective until April 30, 2016"]
[null,null,null,null,null,null,null,null,"Rate Rider for Recovery of Stranded Meter Assets - effective until April 30, 2017"]
[null,null,null,null,null,null,null,null,"Rate Rider for Recovery of Stranded Meter Assets - effective until August 31, 2015"]
[null,null,null,null,null,null,null,null,"Rate Rider for Recovery of Stranded Meter Assets - effective until August 31, 2017"]
[null,null,null,null,null,null,null,null,"Rate Rider for Recovery of Stranded Meter Assets - effective until December 31, 2014"]
[null,null,null,null,null,null,null,null,"Rate Rider for Recovery of Stranded Meter Assets - effective until December 31, 2015"]
[null,null,null,null,null,null,null,null,"Rate Rider for Recovery of Stranded Meter Assets - effective until June 30, 2016"]
[null,null,null,null,null,null,null,null,"Rate Rider for Recovery of Stranded Meter Assets - effective until March 31, 2016"]
[null,null,null,null,null,null,null,null,"Rate Rider for Recovery of Stranded Meter Assets - effective until May 31, 2014"]
[null,null,null,null,null,null,null,null,"Rate Rider for Reversal of Deferral/Variance Account Disposition (2011) - effective until April 30, 2015"]
[null,null,null,null,null,null,null,null,"Rate Rider for Smart Meter Disposition - effective until April 30, 2016"]
[null,null,null,null,null,null,null,null,"Rate Rider for Smart Meter Incremental Revenue Requirement - in effect until the effective date of \n      the next cost of service-based rate order"]
[null,null,null,null,null,null,null,null,"Rate Rider for Smart Metering Entity Charge - effective until October 31, 2018"]
[null,null,null,null,null,null,null,null,"Rate Rider for Stranded Meter Cost Recovery - effective until April 30, 2017"]
[null,null,null,null,null,null,null,null,"Rate Rider for Tax Change"]
[null,null,null,null,null,null,null,null,"Rate Rider for Tax Change - effective until April 30, 2015"]
[null,null,null,null,null,null,null,null,"Rate Rider for Tax Change (2014) - effective until April 30, 2015"]
[null,null,null,null,null,null,null,null,"Retail Transmission Rate - Line and Transformation Connection Service Rate"]
[null,null,null,null,null,null,null,null,"Retail Transmission Rate - Line and Transformation Connection Service Rate - (less than 1,000 kW)"]
[null,null,null,null,null,null,null,null,"Retail Transmission Rate - Line and Transformation Connection Service Rate - Interval Metered"]
[null,null,null,null,null,null,null,null,"Retail Transmission Rate - Line and Transformation Connection Service Rate \n      - Interval Metered (1,000 to 4,999 kW)"]
[null,null,null,null,null,null,null,null,"Retail Transmission Rate - Line and Transformation Connection Service Rate \n      - Interval Metered (less than 1,000 kW)"]
[null,null,null,null,null,null,null,null,"Retail Transmission Rate - Line and Transformation Connection Service Rate \n      - Interval Metered < 1,000 kW"]
[null,null,null,null,null,null,null,null,"Retail Transmission Rate - Line and Transformation Connection Service Rate \n      FOR ALL SERVICE AREAS EXCEPT HENSALL"]
[null,null,null,null,null,null,null,null,"Retail Transmission Rate - Line and Transformation Connection Service Rate\n      - Interval Metered > 1,000 kW"]
[null,null,null,null,null,null,null,null,"Retail Transmission Rate - Line Connection Service Rate"]
[null,null,null,null,null,null,null,null,"Retail Transmission Rate - Network Service Rate"]
[null,null,null,null,null,null,null,null,"Retail Transmission Rate - Network Service Rate - (less than 1,000 kW)"]
[null,null,null,null,null,null,null,null,"Retail Transmission Rate - Network Service Rate - Interval Metered"]
[null,null,null,null,null,null,null,null,"Retail Transmission Rate - Network Service Rate - Interval Metered (1,000 to 4,999 kW)"]
[null,null,null,null,null,null,null,null,"Retail Transmission Rate - Network Service Rate - Interval Metered (less than 1,000 kW)"]
[null,null,null,null,null,null,null,null,"Retail Transmission Rate - Network Service Rate - Interval Metered > 1,000 kW"]
[null,null,null,null,null,null,null,null,"Retail Transmission Rate - Transformation Connection Service Rate"]
[null,null,null,null,null,null,null,null,"Rider for Global Adjustment Sub-Account Disposition (2012) - effective until April 30, 2016 \n      Applicable only for Non-RPP Customers"]
[null,null,null,null,null,null,null,null,"Rural or Remote Electricity Rate Protection Charge (RRRP)"]
[null,null,null,null,null,null,null,null,"Sentinel lights (dusk-to-dawn) connected to unmetered wires will have a flat rate monthly energy charge \nadded to the regular customer bill. Further servicing details are available in the distributor’s Conditions \nof Service."]
[null,null,null,null,null,null,null,null,"Service Charge"]
[null,null,null,null,null,null,null,null,"Service Charge (per connection)"]
[null,null,null,null,null,null,null,null,"Service Charge (per customer)"]
[null,null,null,null,null,null,null,null,"Service Charge (per light)"]
[null,null,null,null,null,null,null,null,"Smart Grid Funding Adder (2014) - in effect until December 31, 2014"]
[null,null,null,null,null,null,null,null,"Smart Meter Disposition Rider"]
[null,null,null,null,null,null,null,null,"Smart Meter Entity Charge"]
[null,null,null,null,null,null,null,null,"Smart Meter Incremental Revenue Requirement Rate Rider"]
[null,null,null,null,null,null,null,null,"Standard Supply Service - Administrative Charge (if applicable)"]
[null,null,null,null,null,null,null,null,"Standby Charge - for a month where standby power is not provided, the charge is based on the applicable \nGeneral Service 50 to 4,999 kW or Large Use Distribution Volumetric Charge applied to the contracted \namount (e.g. Nameplate rating of generating facility)."]
[null,null,null,null,null,null,null,null,"Standby Charge - for a month where standby power is not provided. The charge is applied to the amount of \nreserved load transfer capacity contracted or the amount of monthly peak load displaced by a generating \nfacility"]
[null,null,null,null,null,null,null,null,"Standby Charge - for a month where standby power is not provided. The charge is applied to the contracted \namount (e.g. nameplate rating of the generation facility)."]
[null,null,null,null,null,null,null,null,"Wholesale Market Service Rate"]

{"sheet":"Sheet2","index":10,"n_rows":73,"n_cols":14,"rows_kept":73,"cut":false,"hidden":true,"merged":[]}
["Algoma Power Inc.",null,null,null,null,null,null,"Atikokan Hydro Inc.",null,null,null,null,null,{"$f":"VLOOKUP(H1,A:A,1,0)","v":"Atikokan Hydro Inc."}]
["Atikokan Hydro Inc.",null,null,null,null,null,null,"Bluewater Power Distribution Corporation",null,null,null,null,null,{"$f":"VLOOKUP(H2,A:A,1,0)","v":"Bluewater Power Distribution Corporation"}]
["Bluewater Power Distribution Corporation",null,null,null,null,null,null,"Brant County Power Inc.",null,null,null,null,null,"Brant County Power Inc."]
["Brant County Power Inc.",null,null,null,null,null,null,"Brantford Power Inc.",null,null,null,null,null,"Brantford Power Inc."]
["Brantford Power Inc.",null,null,null,null,null,null,"Burlington Hydro Inc.",null,null,null,null,null,"Burlington Hydro Inc."]
["Burlington Hydro Inc.",null,null,null,null,null,null,"Cambridge and North Dumfries Hydro Inc.",null,null,null,null,null,"Cambridge and North Dumfries Hydro Inc."]
["Cambridge and North Dumfries Hydro Inc.",null,null,null,null,null,null,"Canadian Niagara Power Inc.",null,null,null,null,null,"Canadian Niagara Power Inc."]
["Canadian Niagara Power Inc.",null,null,null,null,null,null,"Centre Wellington Hydro Ltd.",null,null,null,null,null,"Centre Wellington Hydro Ltd."]
["Centre Wellington Hydro Ltd.",null,null,null,null,null,null,"Chapleau Public Utilities Corporation",null,null,null,null,null,"Chapleau Public Utilities Corporation"]
["Chapleau Public Utilities Corporation",null,null,null,null,null,null,"Collus PowerStream Corp.",null,null,null,null,null,"Collus PowerStream Corp."]
["Collus PowerStream Corp.",null,null,null,null,null,null,"Cooperative Hydro Embrun Inc.",null,null,null,null,null,"Cooperative Hydro Embrun Inc."]
["Cooperative Hydro Embrun Inc.",null,null,null,null,null,null,"E.L.K. Energy Inc.",null,null,null,null,null,"E.L.K. Energy Inc."]
["E.L.K. Energy Inc.",null,null,null,null,null,null,"Enersource Hydro Mississauga Inc.",null,null,null,null,null,"Enersource Hydro Mississauga Inc."]
["Enersource Hydro Mississauga Inc.",null,null,null,null,null,null,"Entegrus Powerlines Inc.",null,null,null,null,null,"Entegrus Powerlines Inc."]
["Entegrus Powerlines Inc.",null,null,null,null,null,null,"EnWin Utilities Ltd.",null,null,null,null,null,"EnWin Utilities Ltd."]
["EnWin Utilities Ltd.",null,null,null,null,null,null,"Erie Thames Powerlines Corporation",null,null,null,null,null,"Erie Thames Powerlines Corporation"]
["Erie Thames Powerlines Corporation",null,null,null,null,null,null,"Espanola Regional Hydro Distribution Corporation",null,null,null,null,null,"Espanola Regional Hydro Distribution Corporation"]
["Espanola Regional Hydro Distribution Corporation",null,null,null,null,null,null,"Essex Powerlines Corporation",null,null,null,null,null,"Essex Powerlines Corporation"]
["Essex Powerlines Corporation",null,null,null,null,null,null,"Festival Hydro Inc.",null,null,null,null,null,"Festival Hydro Inc."]
["Festival Hydro Inc.",null,null,null,null,null,null,"Fort Frances Power Corporation",null,null,null,null,null,"Fort Frances Power Corporation"]
["Fort Frances Power Corporation",null,null,null,null,null,null,"Greater Sudbury Hydro Inc.",null,null,null,null,null,"Greater Sudbury Hydro Inc."]
["Greater Sudbury Hydro Inc.",null,null,null,null,null,null,"Grimsby Power Incorporated",null,null,null,null,null,"Grimsby Power Incorporated"]
["Grimsby Power Incorporated",null,null,null,null,null,null,"Guelph Hydro Electric Systems Inc.",null,null,null,null,null,"Guelph Hydro Electric Systems Inc."]
["Guelph Hydro Electric Systems Inc.",null,null,null,null,null,null,"Halton Hills Hydro Inc.",null,null,null,null,null,"Halton Hills Hydro Inc."]
["Haldimand County Hydro Inc.",null,null,null,null,null,null,"Hydro 2000 Inc.",null,null,null,null,null,"Hydro 2000 Inc."]
["Halton Hills Hydro Inc.",null,null,null,null,null,null,"Hydro Hawkesbury Inc.",null,null,null,null,null,"Hydro Hawkesbury Inc."]
["Hearst Power Distribution Company Limited",null,null,null,null,null,null,"Hydro One Brampton Networks Inc.",null,null,null,null,null,"Hydro One Brampton Networks Inc."]
["Horizon Utilities Corporation",null,null,null,null,null,null,"Hydro One Remote Communities Inc.",null,null,null,null,null,"Hydro One Remote Communities Inc."]
["Hydro 2000 Inc.",null,null,null,null,null,null,"Hydro Ottawa Limited",null,null,null,null,null,"Hydro Ottawa Limited"]
["Hydro Hawkesbury Inc.",null,null,null,null,null,null,"Innpower Corporation",null,null,null,null,null,"Innpower Corporation"]
["Hydro One Brampton Networks Inc.",null,null,null,null,null,null,"Kenora Hydro Electric Corporation Ltd.",null,null,null,null,null,"Kenora Hydro Electric Corporation Ltd."]
["Hydro One Networks Inc.",null,null,null,null,null,null,"Kingston Hydro Corporation",null,null,null,null,null,"Kingston Hydro Corporation"]
["Hydro One Remote Communities Inc.",null,null,null,null,null,null,"Kitchener-Wilmot Hydro Inc.",null,null,null,null,null,"Kitchener-Wilmot Hydro Inc."]
["Hydro Ottawa Limited",null,null,null,null,null,null,"Lakefront Utilities Inc.",null,null,null,null,null,"Lakefront Utilities Inc."]
["Innpower Corporation",null,null,null,null,null,null,"Lakeland Power Distribution Ltd.",null,null,null,null,null,"Lakeland Power Distribution Ltd."]
["Kenora Hydro Electric Corporation Ltd.",null,null,null,null,null,null,"London Hydro Inc.",null,null,null,null,null,"London Hydro Inc."]
["Kingston Hydro Corporation",null,null,null,null,null,null,"Midland Power Utility Corporation",null,null,null,null,null,"Midland Power Utility Corporation"]
["Kitchener-Wilmot Hydro Inc.",null,null,null,null,null,null,"Milton Hydro Distribution Inc.",null,null,null,null,null,"Milton Hydro Distribution Inc."]
["Lakefront Utilities Inc.",null,null,null,null,null,null,"Niagara-on-the-Lake Hydro Inc.",null,null,null,null,null,"Niagara-on-the-Lake Hydro Inc."]
["Lakeland Power Distribution Ltd.",null,null,null,null,null,null,"Niagara Peninsula Energy Inc.",null,null,null,null,null,"Niagara Peninsula Energy Inc."]
["London Hydro Inc.",null,null,null,null,null,null,"Northern Ontario Wires Inc.",null,null,null,null,null,"Northern Ontario Wires Inc."]
["Midland Power Utility Corporation",null,null,null,null,null,null,"Oakville Hydro Electricity Distribution Inc.",null,null,null,null,null,"Oakville Hydro Electricity Distribution Inc."]
["Milton Hydro Distribution Inc.",null,null,null,null,null,null,"Orangeville Hydro Limited",null,null,null,null,null,"Orangeville Hydro Limited"]
["Newmarket-Tay Power Distribution Ltd.",null,null,null,null,null,null,"Orillia Power Distribution Corporation",null,null,null,null,null,"Orillia Power Distribution Corporation"]
["Niagara Peninsula Energy Inc.",null,null,null,null,null,null,"Peterborough Distribution Incorporated",null,null,null,null,null,"Peterborough Distribution Incorporated"]
["Niagara-on-the-Lake Hydro Inc.",null,null,null,null,null,null,"PowerStream Inc.",null,null,null,null,null,"PowerStream Inc."]
["Norfolk Power Distribution Inc.",null,null,null,null,null,null,"PUC Distribution Inc.",null,null,null,null,null,"PUC Distribution Inc."]
["North Bay Hydro Distribution Limited",null,null,null,null,null,null,"Renfrew Hydro Inc.",null,null,null,null,null,"Renfrew Hydro Inc."]
["Northern Ontario Wires Inc.",null,null,null,null,null,null,"Rideau St. Lawrence Distribution Inc.",null,null,null,null,null,"Rideau St. Lawrence Distribution Inc."]
["Oakville Hydro Electricity Distribution Inc.",null,null,null,null,null,null,"Sioux Lookout Hydro Inc.",null,null,null,null,null,"Sioux Lookout Hydro Inc."]
["Orangeville Hydro Limited",null,null,null,null,null,null,"Thunder Bay Hydro Electricity Distribution Inc.",null,null,null,null,null,"Thunder Bay Hydro Electricity Distribution Inc."]
["Orillia Power Distribution Corporation",null,null,null,null,null,null,"Tillsonburg Hydro Inc.",null,null,null,null,null,"Tillsonburg Hydro Inc."]
["Oshawa PUC Networks Inc.",null,null,null,null,null,null,"Veridian Connections Inc.",null,null,null,null,null,"Veridian Connections Inc."]
["Ottawa River Power Corporation",null,null,null,null,null,null,"Wasaga Distribution Inc.",null,null,null,null,null,"Wasaga Distribution Inc."]
["Peterborough Distribution Incorporated",null,null,null,null,null,null,"Waterloo North Hydro Inc.",null,null,null,null,null,"Waterloo North Hydro Inc."]
["PowerStream Inc.",null,null,null,null,null,null,"Welland Hydro-Electric System Corp.",null,null,null,null,null,"Welland Hydro-Electric System Corp."]
["PUC Distribution Inc.",null,null,null,null,null,null,"Wellington North Power Inc.",null,null,null,null,null,"Wellington North Power Inc."]
["Renfrew Hydro Inc.",null,null,null,null,null,null,"West Coast Huron Energy Inc.",null,null,null,null,null,"West Coast Huron Energy Inc."]
["Rideau St. Lawrence Distribution Inc.",null,null,null,null,null,null,"Westario Power Inc.",null,null,null,null,null,"Westario Power Inc."]
["Sioux Lookout Hydro Inc.",null,null,null,null,null,null,"Whitby Hydro Electric Corporation",null,null,null,null,null,"Whitby Hydro Electric Corporation"]
["St. Thomas Energy Inc."]
["Thunder Bay Hydro Electricity Distribution Inc."]
["Tillsonburg Hydro Inc."]
["Toronto Hydro-Electric System Limited"]
["Veridian Connections Inc."]
["Wasaga Distribution Inc."]
["Waterloo North Hydro Inc."]
["Welland Hydro-Electric System Corp."]
["Wellington North Power Inc."]
["West Coast Huron Energy Inc."]
["Westario Power Inc."]
["Whitby Hydro Electric Corporation"]
["Woodstock Hydro Services Inc."]

{"sheet":"New Class Template","index":11,"n_rows":49,"n_cols":5,"rows_kept":49,"cut":false,"hidden":true,"merged":[[17,1,17,2],[0,1,0,4],[2,1,2,4],[5,1,5,4],[6,1,6,4],[7,1,7,4],[8,1,8,4],[3,1,3,4],[12,1,12,2],[13,1,13,2],[14,1,14,2],[15,1,15,2],[16,1,16,2],[40,1,40,2],[29,1,29,2],[18,1,18,2],[19,1,19,2],[20,1,20,2],[21,1,21,2],[22,1,22,2],[23,1,23,2],[24,1,24,2],[25,1,25,2],[26,1,26,2],[27,1,27,2],[28,1,28,2],[35,1,35,2],[36,1,36,2],[37,1,37,2],[38,1,38,2],[39,1,39,2],[30,1,30,2],[31,1,31,2],[32,1,32,2],[33,1,33,2],[34,1,34,2],[45,1,45,2],[46,1,46,2],[47,1,47,2],[48,1,48,2],[41,1,41,2]]}
[null,"Select Rate Class"]
[]
[]
[null,"APPLICATION"]
[]
[]
[]
[]
[]
[]
[null,"MONTHLY RATES AND CHARGES - Delivery Component"]
[]
[]
[]
[]
[]
[]
[]
[]
[]
[]
[]
[]
[]
[]
[]
[]
[]
[]
[]
[]
[]
[]
[]
[]
[]
[]
[]
[]
[]
[]
[]
[]
[null,"MONTHLY RATES AND CHARGES - Regulatory Component"]
[]
[null,"Wholesale Market Service Rate",null,"$/kWh",3.5999999999999999E-3]
[null,"Rural or Remote Electricity Rate Protection Charge (RRRP)",null,"$/kWh",1.2999999999999999E-3]
[null,"Ontario Electricity Support Program Charge (OESP)",null,"$/kWh",1.1000000000000001E-3]
[null,"Standard Supply Service - Administrative Charge (if applicable)",null,"$",0.25]

{"sheet":"Sheet5","index":12,"n_rows":161,"n_cols":40,"rows_kept":161,"cut":false,"hidden":true,"merged":[]}
[null,null,null,null,null,null,"LDC_NAME","LDC_NAME",null,null,null,null,null,null,null,null,null,null,null,null,null,null,null,"LDC_NAME","LDC_NAME_OR_SERVICEAREA",null,"LDC_NAME","LDC_NAME_OR_SERVICEAREA",null,null,null,null,null,null,null,null,null,null,"Distributed Generation - DGen",{"$f":"COUNTIF(#REF!, AM1)","v":{"$error":"#REF!"}}]
["COMPETITIVE SECTOR MULTI-UNIT RESIDENTIAL SERVICE CLASSIFICATION",null,null,null,"COMPETITIVE SECTOR MULTI-UNIT RESIDENTIAL SERVICE CLASSIFICATION",null,"Milton Hydro Distribution Inc.","Algoma Power Inc.",null,{"$f":"VLOOKUP(H2,M:M,1,0)","v":{"$error":"#N/A"}},"1_EMBEDDED DISTRIBUTOR SERVICE CLASSIFICATION",null,{"$f":"LEFT(N2, FIND(\",\", N2)-1)","v":"Atikokan Hydro Inc."},"Atikokan Hydro Inc., Atikokan: Corporation; ED-2003-0001; ",null,null,null,null,null,null,null,43,null,"Milton Hydro Distribution Inc.",null,null,"Milton Hydro Distribution Inc.",null,null,null,null,null,null,null,null,null,"DISTRIBUTED GENERATION [DGEN]  SERVICE CLASSIFICATION",1,"Embedded Distributor - Clinton Power and West Perth Power Service Areas",{"$f":"COUNTIF(#REF!, AM2)","v":{"$error":"#REF!"}}]
["DISTRIBUTED GENERATION [DGEN]",null,null,null,"DISTRIBUTED GENERATION [DGEN]",null,"Milton Hydro Distribution Inc.","Atikokan Hydro Inc.",null,"Atikokan Hydro Inc.","2_ENERGY FROM WASTE SERVICE CLASSIFICATION",null,{"$f":"LEFT(N3, FIND(\",\", N3)-1)","v":"Bluewater Power Distribution Corporation"},"Bluewater Power Distribution Corporation, Sarnia: Corporation; ED-2002-0517; ",null,null,null,null,null,null,null,40,null,"Milton Hydro Distribution Inc.",null,null,"Cambridge and North Dumfries Hydro Inc.","Canadian Niagara Power Inc. - Fort Erie Service Area",null,null,null,null,null,null,null,null,"EMBEDDED DISTRIBUTOR SERVICE CLASSIFICATION",2,"Embedded Distributor - Dedicated LV Line",{"$f":"COUNTIF(#REF!, AM3)","v":{"$error":"#REF!"}}]
["DISTRIBUTED GENERATION [DGEN] SERVICE CLASSIFICATION",null,null,null,"DISTRIBUTED GENERATION [DGEN] SERVICE CLASSIFICATION",null,"Milton Hydro Distribution Inc.","Bluewater Power Distribution Corporation",null,"Bluewater Power Distribution Corporation","3_GENERAL SERVICE 1,000 TO 4,999 KW SERVICE CLASSIFICATION",null,"Brant County Power Inc.","Brant County Power Inc., Paris: Corporation; ED-2002-0522; ",null,null,null,null,null,null,null,56,null,"Milton Hydro Distribution Inc.",null,null,"London Hydro Inc.","Canadian Niagara Power Inc. - Eastern Ontario Power Service Area",null,null,null,null,null,null,null,null,"ENERGY FROM WASTE SERVICE CLASSIFICATION",null,"Embedded Distributor - Shared LV Line",{"$f":"COUNTIF(#REF!, AM4)","v":{"$error":"#REF!"}}]
["EMBEDDED DISTRIBUTOR",null,null,null,"EMBEDDED DISTRIBUTOR",null,"Milton Hydro Distribution Inc.","Brant County Power Inc.",null,"Brant County Power Inc.","4_GENERAL SERVICE 1,500 TO 4,999 KW SERVICE CLASSIFICATION",null,"Burlington Hydro Inc.","Burlington Hydro Inc., Burlington: Corporation; ED-2003-0004; ",null,null,null,null,null,null,null,56,null,"Milton Hydro Distribution Inc.",null,null,"Canadian Niagara Power Inc.","Canadian Niagara Power Inc. - Port Colborne Service Area",null,null,null,null,null,null,null,null,"GENERAL SERVICE 1,000 TO 4,999 KW SERVICE CLASSIFICATION",null,"Embedded Distributor - Waterloo North",{"$f":"COUNTIF(#REF!, AM5)","v":{"$error":"#REF!"}}]
["EMBEDDED DISTRIBUTOR SERVICE CLASSIFICATION",null,null,null,"EMBEDDED DISTRIBUTOR SERVICE CLASSIFICATION",null,"Milton Hydro Distribution Inc.","Brantford Power Inc.",null,{"$error":"#N/A"},"5_GENERAL SERVICE 3,000 TO 4,999 KW SERVICE CLASSIFICATION",null,"Cambridge and North Dumfries Hydro Inc.","Cambridge and North Dumfries Hydro Inc., Cambridge: Corporation; ED-2002-0574; ",null,null,null,null,null,null,null,56,null,"Milton Hydro Distribution Inc.",null,null,"PUC Distribution Inc.","Entegrus Powerlines Inc. - For Former Chatham-Kent Hydro Service Areas",null,null,null,null,null,null,null,null,"GENERAL SERVICE 1,500 TO 4,999 KW SERVICE CLASSIFICATION",null,"General Less Than 50 kW - Parry Sound",{"$f":"COUNTIF(#REF!, AM6)","v":{"$error":"#REF!"}}]
["ENERGY FROM WASTE SERVICE CLASSIFICATION",null,null,null,"ENERGY FROM WASTE SERVICE CLASSIFICATION",null,"Milton Hydro Distribution Inc.","Burlington Hydro Inc.",null,"Burlington Hydro Inc.","6_GENERAL SERVICE 50 TO 1,000 KW SERVICE CLASSIFICATION",null,"Canadian Niagara Power Inc.","Canadian Niagara Power Inc., Fort Erie: Corporation; ED-2002-0572; ",null,null,null,null,null,null,null,53,null,"Milton Hydro Distribution Inc.",null,null,"Westario Power Inc.","Entegrus Powerlines Inc. - For Strathroy, Mount Brydges & Parkhill Service Areas",null,null,null,null,null,null,null,null,"GENERAL SERVICE 3,000 TO 4,999 KW SERVICE CLASSIFICATION",null,"General Service >= 1,000 kW",{"$f":"COUNTIF(#REF!, AM7)","v":{"$error":"#REF!"}}]
["FARMS - SINGLE PHASE ENERGY-BILLED [F1]",null,null,null,"FARMS - SINGLE PHASE ENERGY-BILLED [F1]",null,"Milton Hydro Distribution Inc.","Cambridge and North Dumfries Hydro Inc.",null,"Cambridge and North Dumfries Hydro Inc.","7_GENERAL SERVICE 50 TO 1,499 KW SERVICE CLASSIFICATION",null,"Centre Wellington Hydro Ltd.","Centre Wellington Hydro Ltd., Fergus: Corporation; ED-2002-0498; ",null,null,null,null,null,null,null,53,null,"Milton Hydro Distribution Inc.",null,null,"Guelph Hydro Electric Systems Inc.","Entegrus Powerlines Inc. - For Dutton Service Area",null,null,null,null,null,null,null,null,"GENERAL SERVICE 50 TO 1,000 KW SERVICE CLASSIFICATION",null,"General Service >= 1,500 kW",{"$f":"COUNTIF(#REF!, AM8)","v":{"$error":"#REF!"}}]
["FARMS - THREE PHASE ENERGY-BILLED [F3]",null,null,null,"FARMS - THREE PHASE ENERGY-BILLED [F3]",null,"Milton Hydro Distribution Inc.","Canadian Niagara Power Inc.",null,"Canadian Niagara Power Inc.","8_GENERAL SERVICE 50 TO 2,999 KW SERVICE CLASSIFICATION",null,"Chapleau Public Utilities Corporation","Chapleau Public Utilities Corporation, Chapleau: Corporation; ED-2002-0528; ",null,null,null,null,null,null,null,53,null,"Milton Hydro Distribution Inc.",null,null,"Grimsby Power Inc.","Entegrus Powerlines Inc. - For Newbury Service Area",null,null,null,null,null,null,null,null,"GENERAL SERVICE 50 TO 1,499 KW SERVICE CLASSIFICATION",null,"General Service 1,000 kW and Greater",{"$f":"COUNTIF(#REF!, AM9)","v":{"$error":"#REF!"}}]
["GENERAL SERVICE - COMMERCIAL",null,null,null,"GENERAL SERVICE - COMMERCIAL",null,"Milton Hydro Distribution Inc.","Centre Wellington Hydro Ltd.",null,"Centre Wellington Hydro Ltd.","9_GENERAL SERVICE 50 TO 4,999 KW SERVICE CLASSIFICATION",null,"Entegrus Powerlines Inc.","Entegrus Powerlines Inc., Chatham: Corporation; ED-2002-0563; ",null,null,null,null,null,null,null,53,null,"Milton Hydro Distribution Inc.",null,null,"Cooperative Hydro Embrun Inc.","Lakeland Power Distribution Ltd. - For Former Lakeland Power Service Area",null,null,null,null,null,null,null,null,"GENERAL SERVICE 50 TO 2,999 KW SERVICE CLASSIFICATION",null,"General Service 1,000 to 4,999 kW (co-generation)",{"$f":"COUNTIF(#REF!, AM10)","v":{"$error":"#REF!"}}]
["GENERAL SERVICE - INSTITUTIONAL",null,null,null,"GENERAL SERVICE - INSTITUTIONAL",null,"Milton Hydro Distribution Inc.","Chapleau Public Utilities Corporation",null,"Chapleau Public Utilities Corporation","10_GENERAL SERVICE 50 TO 499 KW SERVICE CLASSIFICATION",null,"Collus PowerStream Corp.","Collus PowerStream Corp., Collingwood: Corporation; ED-2002-0518; ",null,null,null,null,null,null,null,51,null,"Milton Hydro Distribution Inc.",null,null,"Hydro Hawkesbury Inc.","Lakeland Power Distribution Ltd. - For Former Parry Sound Service Area",null,null,null,null,null,null,null,null,"GENERAL SERVICE 50 TO 4,999 KW SERVICE CLASSIFICATION",null,"General Service 1,000 to 4,999 kW-Clinton & West Perth Power Service Areas",{"$f":"COUNTIF(#REF!, AM11)","v":{"$error":"#REF!"}}]
["GENERAL SERVICE 1,000 TO 2,999 KW",null,null,null,"GENERAL SERVICE 1,000 TO 2,999 KW",null,"Milton Hydro Distribution Inc.","COLLUS PowerStream Corp.",null,"Collus PowerStream Corp.","11_GENERAL SERVICE 50 TO 699 KW SERVICE CLASSIFICATION",null,"Cooperative Hydro Embrun Inc.","Cooperative Hydro Embrun Inc., Embrun: Corporation; ED-2002-0493; ",null,null,null,null,null,null,null,51,null,"Milton Hydro Distribution Inc.",null,null,"Hydro 2000 Inc.",null,null,null,null,null,null,null,null,null,"GENERAL SERVICE 50 TO 499 KW SERVICE CLASSIFICATION",null,"General Service 1000 to 4,999 kW",{"$f":"COUNTIF(#REF!, AM12)","v":{"$error":"#REF!"}}]
["GENERAL SERVICE 1,000 TO 4,999 KW",null,null,null,"GENERAL SERVICE 1,000 TO 4,999 KW",null,"Milton Hydro Distribution Inc.","Cooperative Hydro Embrun Inc.",null,"Cooperative Hydro Embrun Inc.","12_GENERAL SERVICE 50 TO 999 KW SERVICE CLASSIFICATION",null,"E.L.K. Energy Inc.","E.L.K. Energy Inc., Essex: Corporation; ED-2003-0015; ",null,null,null,null,null,null,null,51,null,"Milton Hydro Distribution Inc.",null,null,"Renfrew Hydro Inc.",null,null,null,null,null,null,null,null,null,"GENERAL SERVICE 50 TO 699 KW SERVICE CLASSIFICATION",null,"General Service 3,000 to 4,999 kW - excluding Gravenhurst",{"$f":"COUNTIF(#REF!, AM13)","v":{"$error":"#REF!"}}]
["GENERAL SERVICE 1,000 TO 4,999 KW - INTERVAL METERS",null,null,null,"GENERAL SERVICE 1,000 TO 4,999 KW - INTERVAL METERS",null,"Milton Hydro Distribution Inc.","E.L.K. Energy Inc.",null,"E.L.K. Energy Inc.","13_GENERAL SERVICE 500 TO 1,499 KW SERVICE CLASSIFICATION",null,"Enersource Hydro Mississauga Inc.","Enersource Hydro Mississauga Inc., Mississauga: Corporation; ED-2003-0017; ",null,null,null,null,null,null,null,54,null,"Milton Hydro Distribution Inc.",null,null,"Wasaga Distribution Inc.",null,null,null,null,null,null,null,null,null,"GENERAL SERVICE 50 TO 999 KW SERVICE CLASSIFICATION",null,"General Service 3,000 to 4,999 kW - former TOU",{"$f":"COUNTIF(#REF!, AM14)","v":{"$error":"#REF!"}}]
["GENERAL SERVICE 1,000 TO 4,999 KW (CO-GENERATION)",null,null,null,"GENERAL SERVICE 1,000 TO 4,999 KW (CO-GENERATION)",null,"Milton Hydro Distribution Inc.","Enersource Hydro Mississauga Inc.",null,"Enersource Hydro Mississauga Inc.","14_GENERAL SERVICE 500 TO 4,999 KW SERVICE CLASSIFICATION",null,"EnWin Utilities Ltd.","EnWin Utilities Ltd., Windsor: Corporation; ED-2002-0527; ",null,null,null,null,null,null,null,54,null,"Milton Hydro Distribution Inc.",null,null,"Kenora Hydro Electric Corporation Ltd.",null,null,null,null,null,null,null,null,null,"GENERAL SERVICE 500 TO 1,499 KW SERVICE CLASSIFICATION",null,"General Service 3,000 to 4,999 kW - Gravenhurst",{"$f":"COUNTIF(#REF!, AM15)","v":{"$error":"#REF!"}}]
["GENERAL SERVICE 1,000 TO 4,999 KW (CO-GENERATION) SERVICE CLASSIFICATION",null,null,null,"GENERAL SERVICE 1,000 TO 4,999 KW (CO-GENERATION) SERVICE CLASSIFICATION",null,"Milton Hydro Distribution Inc.","Entegrus Powerlines Inc.",null,"Entegrus Powerlines Inc.","15_GENERAL SERVICE 700 TO 4,999 KW SERVICE CLASSIFICATION",null,"Erie Thames Powerlines Corporation","Erie Thames Powerlines Corporation, Ingersoll: Corporation; ED-2002-0516; ",null,null,null,null,null,null,null,54,null,"Milton Hydro Distribution Inc.",null,null,"Welland Hydro-Electric System Corp.",null,null,null,null,null,null,null,null,null,"GENERAL SERVICE 500 TO 4,999 KW SERVICE CLASSIFICATION",null,"General Service 50 kW to 4,999 kW",{"$f":"COUNTIF(#REF!, AM16)","v":{"$error":"#REF!"}}]
["GENERAL SERVICE 1,000 to 4,999 kW SERVICE CLASSIFICATION",null,null,null,"GENERAL SERVICE 1,000 to 4,999 kW SERVICE CLASSIFICATION",null,"Milton Hydro Distribution Inc.","ENWIN Utilities Ltd.",null,"EnWin Utilities Ltd.","16_GENERAL SERVICE GREATER THAN 1,000 KW SERVICE CLASSIFICATION",null,"Espanola Regional Hydro Distribution Corporation","Espanola Regional Hydro Distribution Corporation, Espanola: Corporation; ED-2002-0502; ",null,null,null,null,null,null,null,60,null,"Milton Hydro Distribution Inc.",null,null,"Waterloo North Hydro Inc.",null,null,null,null,null,null,null,null,null,"GENERAL SERVICE 700 TO 4,999 KW SERVICE CLASSIFICATION",null,"General Service 50 to 2,999 kW - excluding Gravenhurst",{"$f":"COUNTIF(#REF!, AM17)","v":{"$error":"#REF!"}}]
["GENERAL SERVICE 1,500 TO 4,999 KW",null,null,null,"GENERAL SERVICE 1,500 TO 4,999 KW",null,"Milton Hydro Distribution Inc.","Erie Thames Powerlines Corporation",null,"Erie Thames Powerlines Corporation","17_GENERAL SERVICE INTERMEDIATE 1,000 TO 4,999 KW SERVICE CLASSIFICATION",null,"Essex Powerlines Corporation","Essex Powerlines Corporation, Oldcastle: Corporation; ED-2002-0499; ",null,null,null,null,null,null,null,69,null,"Milton Hydro Distribution Inc.",null,null,"Peterborough Distribution Incorporated",null,null,null,null,null,null,null,null,null,"GENERAL SERVICE GREATER THAN 1,000 KW SERVICE CLASSIFICATION",null,"General Service 50 to 2,999 kW - Gravenhurst",{"$f":"COUNTIF(#REF!, AM18)","v":{"$error":"#REF!"}}]
["GENERAL SERVICE 2,500 TO 4,999 KW",null,null,null,"GENERAL SERVICE 2,500 TO 4,999 KW",null,"Milton Hydro Distribution Inc.","Espanola Regional Hydro Distribution Corporation",null,"Espanola Regional Hydro Distribution Corporation","18_GENERAL SERVICE LESS THAN 50 KW SERVICE CLASSIFICATION",null,"Fort Frances Power Corporation","Fort Frances Power Corporation, Fort Frances: Corporation; ED-2003-0028; ",null,null,null,null,null,null,null,54,null,"Milton Hydro Distribution Inc.",null,null,"Bluewater Power Distribution Corporation",null,null,null,null,null,null,null,null,null,"GENERAL SERVICE INTERMEDIATE 1,000 TO 4,999 KW SERVICE CLASSIFICATION",null,"General Service 50 to 4,999 kW - Barrie Hydro Service Area",{"$f":"COUNTIF(#REF!, AM19)","v":{"$error":"#REF!"}}]
["GENERAL SERVICE 3,000 TO 4,999 KW",null,null,null,"GENERAL SERVICE 3,000 TO 4,999 KW",null,"Milton Hydro Distribution Inc.","Fort Frances Power Corporation",null,"Fort Frances Power Corporation","19_INTERMEDIATE WITH SELF GENERATION SERVICE CLASSIFICATION",null,"Greater Sudbury Hydro Inc.","Greater Sudbury Hydro Inc., Sudbury: Corporation; ED-2002-0559; ",null,null,null,null,null,null,null,56,null,"Milton Hydro Distribution Inc.",null,null,"Erie Thames Powerlines Corporation",null,null,null,null,null,null,null,null,null,"GENERAL SERVICE LESS THAN 50 KW SERVICE CLASSIFICATION",null,"General Service 50 to 4,999 kW - Eastern Ontario Power",{"$f":"COUNTIF(#REF!, AM20)","v":{"$error":"#REF!"}}]
["GENERAL SERVICE 3,000 TO 4,999 KW - INTERMEDIATE USE",null,null,null,"GENERAL SERVICE 3,000 TO 4,999 KW - INTERMEDIATE USE",null,"Milton Hydro Distribution Inc.","Greater Sudbury Hydro Inc.",null,"Greater Sudbury Hydro Inc.","20_LARGE USE - 3TS SERVICE CLASSIFICATION",null,"Grimsby Power Incorporated","Grimsby Power Incorporated, Grimsby: Corporation; ED-2002-0554; ",null,null,null,null,null,null,null,38,null,"Milton Hydro Distribution Inc.",null,null,"Rideau St. Lawrence Distribution Inc.",null,null,null,null,null,null,null,null,null,"INTERMEDIATE WITH SELF GENERATION SERVICE CLASSIFICATION",null,"General Service 50 to 4,999 kW - excl. former Barrie Hydro Ser. Area",{"$f":"COUNTIF(#REF!, AM21)","v":{"$error":"#REF!"}}]
["GENERAL SERVICE 3,000 TO 4,999 KW - INTERMEDIATE USE SERVICE CLASSIFICATION",null,null,null,"GENERAL SERVICE 3,000 TO 4,999 KW - INTERMEDIATE USE SERVICE CLASSIFICATION",null,"Milton Hydro Distribution Inc.","Grimsby Power Incorporated",null,"Grimsby Power Incorporated","21_LARGE USE - FORD ANNEX SERVICE CLASSIFICATION",null,"Guelph Hydro Electric Systems Inc.","Guelph Hydro Electric Systems Inc., Guelph: Corporation; ED-2002-0565; ",null,null,null,null,null,null,null,45,null,"Milton Hydro Distribution Inc.",null,null,"Chapleau Public Utilities Corporation",null,null,null,null,null,null,null,null,null,"LARGE USE - 3TS SERVICE CLASSIFICATION",null,"General Service 50 to 4,999 kW - Fort Erie",{"$f":"COUNTIF(#REF!, AM22)","v":{"$error":"#REF!"}}]
["GENERAL SERVICE 3,000 TO 4,999 KW - INTERVAL METERED",null,null,null,"GENERAL SERVICE 3,000 TO 4,999 KW - INTERVAL METERED",null,"Milton Hydro Distribution Inc.","Guelph Hydro Electric Systems Inc.",null,"Guelph Hydro Electric Systems Inc.","22_LARGE USE - REGULAR SERVICE CLASSIFICATION",null,"Halton Hills Hydro Inc.","Halton Hills Hydro Inc., Acton: Corporation; ED-2002-0552; ",null,null,null,null,null,null,null,42,null,"Milton Hydro Distribution Inc.",null,null,"Orillia Power Distribution Corporation",null,null,null,null,null,null,null,null,null,"LARGE USE - FORD ANNEX SERVICE CLASSIFICATION",null,"General Service 50 to 4,999 kW - Interval Meter - Newmarket",{"$f":"COUNTIF(#REF!, AM23)","v":{"$error":"#REF!"}}]
["GENERAL SERVICE 3,000 TO 4,999 KW - TIME OF USE",null,null,null,"GENERAL SERVICE 3,000 TO 4,999 KW - TIME OF USE",null,"Milton Hydro Distribution Inc.","Halton Hills Hydro Inc.",null,"Halton Hills Hydro Inc.","23_LARGE USE SERVICE CLASSIFICATION",null,"Hydro 2000 Inc.","Hydro 2000 Inc., Alfred: Corporation; ED-2002-0542; ",null,null,null,null,null,null,null,32,null,"Milton Hydro Distribution Inc.",null,null,"West Coast Huron Energy Inc.",null,null,null,null,null,null,null,null,null,"LARGE USE - REGULAR SERVICE CLASSIFICATION",null,"General Service 50 to 4,999 kW - Interval Meter - Tay",{"$f":"COUNTIF(#REF!, AM24)","v":{"$error":"#REF!"}}]
["GENERAL SERVICE 3,000 TO 4,999 KW SERVICE CLASSIFICATION",null,null,null,"GENERAL SERVICE 3,000 TO 4,999 KW SERVICE CLASSIFICATION",null,"Milton Hydro Distribution Inc.","Horizon Utilities Corporation",null,{"$error":"#N/A"},"24_Large Use With Dedicated Assets Service Classification",null,"Hydro Hawkesbury Inc.","Hydro Hawkesbury Inc., Hawkesbury: Corporation; ED-2003-0027; ",null,null,null,null,null,null,null,54,null,"Milton Hydro Distribution Inc.",null,null,"Wellington North Power Inc.",null,null,null,null,null,null,null,null,null,"LARGE USE SERVICE CLASSIFICATION",null,"General Service 50 to 4,999 kW - Newbury Service Area",{"$f":"COUNTIF(#REF!, AM25)","v":{"$error":"#REF!"}}]
["GENERAL SERVICE 50 TO 1,000 KW",null,null,null,"GENERAL SERVICE 50 TO 1,000 KW",null,"Milton Hydro Distribution Inc.","Hydro 2000 Inc.",null,"Hydro 2000 Inc.","25_microFIT GENERATOR SERVICE CLASSIFICATION",null,"Hydro One Remote Communities Inc.","Hydro One Remote Communities Inc., Toronto: Corporation; ED-2003-0037; ",null,null,null,null,null,null,null,41,null,"Milton Hydro Distribution Inc.",null,null,"Centre Wellington Hydro Ltd.",null,null,null,null,null,null,null,null,null,"Large Use With Dedicated Assets Service Classification",null,"General Service 50 to 4,999 kW - non Class A Customers",{"$f":"COUNTIF(#REF!, AM26)","v":{"$error":"#REF!"}}]
["GENERAL SERVICE 50 TO 1,000 KW - INTERVAL METERS",null,null,null,"GENERAL SERVICE 50 TO 1,000 KW - INTERVAL METERS",null,"Milton Hydro Distribution Inc.","Hydro Hawkesbury Inc.",null,"Hydro Hawkesbury Inc.","26_microFIT SERVICE CLASSIFICATION",null,"Hydro Ottawa Limited","Hydro Ottawa Limited, Ottawa: Corporation; ED-2002-0556; ",null,null,null,null,null,null,null,31,null,"Milton Hydro Distribution Inc.",null,null,"Espanola Regional Hydro Distribution Corporation",null,null,null,null,null,null,null,null,null,"microFIT GENERATOR SERVICE CLASSIFICATION",null,"General Service 50 to 4,999 kW - Parry Sound",{"$f":"COUNTIF(#REF!, AM27)","v":{"$error":"#REF!"}}]
["GENERAL SERVICE 50 TO 1,000 KW - NON INTERVAL METERS",null,null,null,"GENERAL SERVICE 50 TO 1,000 KW - NON INTERVAL METERS",null,"Milton Hydro Distribution Inc.","Hydro One Brampton Networks Inc.",null,{"$error":"#N/A"},"27_microFIT Service Classification ",null,"Innpower Corporation","Innpower Corporation, Innisfil: Corporation; ED-2002-0520; ",null,null,null,null,null,null,null,32,null,"Milton Hydro Distribution Inc.",null,null,"Kingston Hydro Corporation",null,null,null,null,null,null,null,null,null,"microFIT SERVICE CLASSIFICATION",null,"General Service 50 to 4,999 kW - Port Colborne",{"$f":"COUNTIF(#REF!, AM28)","v":{"$error":"#REF!"}}]
["GENERAL SERVICE 50 TO 1,499 KW",null,null,null,"GENERAL SERVICE 50 TO 1,499 KW",null,"Milton Hydro Distribution Inc.","Hydro One Remote Communities Inc.",null,"Hydro One Remote Communities Inc.","28_NON STANDARD A GENERAL SERVICE SINGLE PHASE SERVICE CLASSIFICATION - G1",null,"Kenora Hydro Electric Corporation Ltd.","Kenora Hydro Electric Corporation Ltd., Kenora: Corporation; ED-2003-0030; ",null,null,null,null,null,null,null,71,null,"Milton Hydro Distribution Inc.",null,null,"ENWIN Utilities Ltd.",null,null,null,null,null,null,null,null,null,"microFIT Service Classification ",null,"General Service 50 to 4,999 kW - Strathroy, Mount Brydges and Parkhill Serv",{"$f":"COUNTIF(#REF!, AM29)","v":{"$error":"#REF!"}}]
["GENERAL SERVICE 50 TO 1,499 KW - INTERVAL METERED",null,null,null,"GENERAL SERVICE 50 TO 1,499 KW - INTERVAL METERED",null,"Milton Hydro Distribution Inc.","Hydro Ottawa Limited",null,"Hydro Ottawa Limited","29_NON STANDARD A GENERAL SERVICE THREE PHASE SERVICE CLASSIFICATION - G3",null,"Kingston Hydro Corporation","Kingston Hydro Corporation, Kingston: Corporation; ED-2003-0057; ",null,null,null,null,null,null,null,70,null,"Milton Hydro Distribution Inc.",null,null,"Burlington Hydro Inc.",null,null,null,null,null,null,null,null,null,"NON STANDARD A GENERAL SERVICE SINGLE PHASE SERVICE CLASSIFICATION - G1",null,"General Service 50 to 4,999 kW - Thermal Meter - Newmarket",{"$f":"COUNTIF(#REF!, AM30)","v":{"$error":"#REF!"}}]
["GENERAL SERVICE 50 to 1,499 kW SERVICE CLASSIFICATION",null,null,null,"GENERAL SERVICE 50 to 1,499 kW SERVICE CLASSIFICATION",null,"Milton Hydro Distribution Inc.","Innpower Corporation",null,"Innpower Corporation","30_NON STANDARD A SEASONAL RESIDENTIAL SERVICE CLASSIFICATION - R4",null,"Kitchener-Wilmot Hydro Inc.","Kitchener-Wilmot Hydro Inc., Kitchener: Corporation; ED-2002-0573; ",null,null,null,null,null,null,null,63,null,"Milton Hydro Distribution Inc.",null,null,"Fort Frances Power Corporation",null,null,null,null,null,null,null,null,null,"NON STANDARD A GENERAL SERVICE THREE PHASE SERVICE CLASSIFICATION - G3",null,"General Service 50 to 4,999 kW - Thermal Meter - Tay",{"$f":"COUNTIF(#REF!, AM31)","v":{"$error":"#REF!"}}]
["GENERAL SERVICE 50 TO 2,499 KW",null,null,null,"GENERAL SERVICE 50 TO 2,499 KW",null,"Milton Hydro Distribution Inc.","Kenora Hydro Electric Corporation Ltd.",null,"Kenora Hydro Electric Corporation Ltd.","31_NON STANDARD A YEAR ROUND RESIDENTIAL SERVICE CLASSIFICATION - R2",null,"Lakefront Utilities Inc.","Lakefront Utilities Inc., Cobourg: Corporation; ED-2002-0545; ",null,null,null,null,null,null,null,65,null,"Milton Hydro Distribution Inc.",null,null,"Greater Sudbury Hydro Inc.",null,null,null,null,null,null,null,null,null,"NON STANDARD A SEASONAL RESIDENTIAL SERVICE CLASSIFICATION - R4",null,"General Service 50 to 499 kW - Interval Metered",{"$f":"COUNTIF(#REF!, AM32)","v":{"$error":"#REF!"}}]
["GENERAL SERVICE 50 TO 2,999 KW",null,null,null,"GENERAL SERVICE 50 TO 2,999 KW",null,"Milton Hydro Distribution Inc.","Kingston Hydro Corporation",null,"Kingston Hydro Corporation","32_RESIDENTIAL - TIME OF USE SERVICE CLASSIFICATION",null,"Lakeland Power Distribution Ltd.","Lakeland Power Distribution Ltd., Huntsville: Corporation; ED-2002-0540; ",null,null,null,null,null,null,null,48,null,"Milton Hydro Distribution Inc.",null,null,"Orangeville Hydro Limited",null,null,null,null,null,null,null,null,null,"NON STANDARD A YEAR ROUND RESIDENTIAL SERVICE CLASSIFICATION - R2",null,"General Service 50 to 499 kW - non Interval Metered",{"$f":"COUNTIF(#REF!, AM33)","v":{"$error":"#REF!"}}]
["GENERAL SERVICE 50 TO 2,999 KW - INTERVAL METERED",null,null,null,"GENERAL SERVICE 50 TO 2,999 KW - INTERVAL METERED",null,"Milton Hydro Distribution Inc.","Kitchener-Wilmot Hydro Inc.",null,"Kitchener-Wilmot Hydro Inc.","33_RESIDENTIAL SERVICE CLASSIFICATION",null,"London Hydro Inc.","London Hydro Inc., London: Corporation; ED-2002-0557; ",null,null,null,null,null,null,null,34,null,"Milton Hydro Distribution Inc.",null,null,"Halton Hills Hydro Inc.",null,null,null,null,null,null,null,null,null,"RESIDENTIAL - TIME OF USE SERVICE CLASSIFICATION",null,"General Service 50 to 499 kW kW",{"$f":"COUNTIF(#REF!, AM34)","v":{"$error":"#REF!"}}]
["GENERAL SERVICE 50 TO 2,999 KW - TIME OF USE",null,null,null,"GENERAL SERVICE 50 TO 2,999 KW - TIME OF USE",null,"Milton Hydro Distribution Inc.","Lakefront Utilities Inc.",null,"Lakefront Utilities Inc.","34_RESIDENTIAL - R1 SERVICE CLASSIFICATION",null,"Midland Power Utility Corporation","Midland Power Utility Corporation, Midland: Corporation; ED-2002-0541; ",null,null,null,null,null,null,null,39,null,"Milton Hydro Distribution Inc.",null,null,"COLLUS PowerStream Corp.",null,null,null,null,null,null,null,null,null,"RESIDENTIAL SERVICE CLASSIFICATION",null,"General Service 50 to 699 kW",{"$f":"COUNTIF(#REF!, AM35)","v":{"$error":"#REF!"}}]
["GENERAL SERVICE 50 TO 2,999 KW SERVICE CLASSIFICATION",null,null,null,"GENERAL SERVICE 50 TO 2,999 KW SERVICE CLASSIFICATION",null,"Milton Hydro Distribution Inc.","Lakeland Power Distribution Ltd.",null,"Lakeland Power Distribution Ltd.","35_RESIDENTIAL - R2 SERVICE CLASSIFICATION",null,"Milton Hydro Distribution Inc.","Milton Hydro Distribution Inc., Milton: Corporation; ED-2003-0014; ",null,null,null,null,null,null,null,39,null,"Milton Hydro Distribution Inc.",null,null,"Midland Power Utility Corporation",null,null,null,null,null,null,null,null,null,"SEASONAL CUSTOMERS SERVICE CLASSIFICATION",null,"General Service 50 to 999 kW - Chatham-Kent Hydro Service Area",{"$f":"COUNTIF(#REF!, AM36)","v":{"$error":"#REF!"}}]
["GENERAL SERVICE 50 TO 4,999 KW",null,null,null,"GENERAL SERVICE 50 TO 4,999 KW",null,"Milton Hydro Distribution Inc.","London Hydro Inc.",null,"London Hydro Inc.","36_SEASONAL CUSTOMERS SERVICE CLASSIFICATION",null,"Niagara-on-the-Lake Hydro Inc.","Niagara-on-the-Lake Hydro Inc., Virgil: Corporation; ED-2002-0547; ",null,null,null,null,null,null,null,41,null,"Milton Hydro Distribution Inc.",null,null,"Sioux Lookout Hydro Inc.",null,null,null,null,null,null,null,null,null,"SEASONAL RESIDENTIAL SERVICE CLASSIFICATION",null,"General Service 50 to 999 kW - Clinton Power Service Area",{"$f":"COUNTIF(#REF!, AM37)","v":{"$error":"#REF!"}}]
["GENERAL SERVICE 50 TO 4,999 KW - INTERVAL METERED",null,null,null,"GENERAL SERVICE 50 TO 4,999 KW - INTERVAL METERED",null,"Milton Hydro Distribution Inc.","Midland Power Utility Corporation",null,"Midland Power Utility Corporation","37_SEASONAL RESIDENTIAL SERVICE CLASSIFICATION",null,"Northern Ontario Wires Inc.","Northern Ontario Wires Inc., Cochrane: Corporation; ED-2003-0018; ",null,null,null,null,null,null,null,43,null,"Milton Hydro Distribution Inc.",null,null,"Niagara-on-the-Lake Hydro Inc.",null,null,null,null,null,null,null,null,null,"SENTINEL LIGHTING SERVICE CLASSIFICATION",null,"General Service 50 to 999 kW - non WMP",{"$f":"COUNTIF(#REF!, AM38)","v":{"$error":"#REF!"}}]
["GENERAL SERVICE 50 TO 4,999 KW - TIME OF USE",null,null,null,"GENERAL SERVICE 50 TO 4,999 KW - TIME OF USE",null,"Milton Hydro Distribution Inc.","Milton Hydro Distribution Inc.",null,"Milton Hydro Distribution Inc.","38_SENTINEL LIGHTING SERVICE CLASSIFICATION",null,"Oakville Hydro Electricity Distribution Inc.","Oakville Hydro Electricity Distribution Inc., Oakville: Corporation; ED-2003-0135; ",null,null,null,null,null,null,null,40,null,"Milton Hydro Distribution Inc.",null,null,"Entegrus Powerlines Inc.",null,null,null,null,null,null,null,null,null,"Sentinel Lighting Service Classification ",null,"General Service 50 to 999 kW - West Perth Power Service Area",{"$f":"COUNTIF(#REF!, AM39)","v":{"$error":"#REF!"}}]
["GENERAL SERVICE 50 TO 4,999 KW (COGENERATION)",null,null,null,"GENERAL SERVICE 50 TO 4,999 KW (COGENERATION)",null,"Milton Hydro Distribution Inc.","Niagara-on-the-Lake Hydro Inc.",null,"Niagara-on-the-Lake Hydro Inc.","39_Sentinel Lighting Service Classification ",null,"Orangeville Hydro Limited","Orangeville Hydro Limited, Orangeville: Corporation; ED-2002-0500; ",null,null,null,null,null,null,null,41,null,"Milton Hydro Distribution Inc.",null,null,"Northern Ontario Wires Inc.",null,null,null,null,null,null,null,null,null,"SERVICE CLASSIFICATION",null,"General Service 50 to 999 kW - WMP",{"$f":"COUNTIF(#REF!, AM40)","v":{"$error":"#REF!"}}]
["GENERAL SERVICE 50 TO 4,999 KW (FORMERLY TIME OF USE)",null,null,null,"GENERAL SERVICE 50 TO 4,999 KW (FORMERLY TIME OF USE)",null,"Milton Hydro Distribution Inc.","Northern Ontario Wires Inc.",null,"Northern Ontario Wires Inc.","40_SERVICE CLASSIFICATION",null,"Orillia Power Distribution Corporation","Orillia Power Distribution Corporation, Orillia: Corporation; ED-2002-0530; ",null,null,null,null,null,null,null,22,null,"Milton Hydro Distribution Inc.",null,null,"Thunder Bay Hydro Electricity Distribution Inc.",null,null,null,null,null,null,null,null,null,"STANDARD A GENERAL SERVICE AIR ACCESS SERVICE CLASSIFICATION",null,"General Service 500 to 1,499 kW",{"$f":"COUNTIF(#REF!, AM41)","v":{"$error":"#REF!"}}]
["GENERAL SERVICE 50 TO 4,999 KW SERVICE CLASSIFICATION",null,null,null,"GENERAL SERVICE 50 TO 4,999 KW SERVICE CLASSIFICATION",null,"Milton Hydro Distribution Inc.","Oakville Hydro Electricity Distribution Inc.",null,"Oakville Hydro Electricity Distribution Inc.","41_STANDARD A GENERAL SERVICE AIR ACCESS SERVICE CLASSIFICATION",null,"Peterborough Distribution Incorporated","Peterborough Distribution Incorporated, Peterborough: Corporation; ED-2002-0504; ",null,null,null,null,null,null,null,60,null,"Milton Hydro Distribution Inc.",null,null,"E.L.K. Energy Inc.",null,null,null,null,null,null,null,null,null,"STANDARD A GENERAL SERVICE ROAD/RAIL ACCESS SERVICE CLASSIFICATION",null,"General Service 500 to 4,999 kW",{"$f":"COUNTIF(#REF!, AM42)","v":{"$error":"#REF!"}}]
["GENERAL SERVICE 50 to 4,999 kWSERVICE CLASSIFICATION",null,null,null,"GENERAL SERVICE 50 to 4,999 kWSERVICE CLASSIFICATION",null,"Milton Hydro Distribution Inc.","Orangeville Hydro Limited",null,"Orangeville Hydro Limited","42_STANDARD A GENERAL SERVICE ROAD/RAIL ACCESS SERVICE CLASSIFICATION",null,"PowerStream Inc.","PowerStream Inc., Vaughan: Corporation; ED-2004-0420; ",null,null,null,null,null,null,null,66,null,"Milton Hydro Distribution Inc.",null,null,"Tillsonburg Hydro Inc.",null,null,null,null,null,null,null,null,null,"STANDARD A GRID CONNECTED SERVICE CLASSIFICATION",null,"General Service 500 to 4,999 kW - Interval Metered",{"$f":"COUNTIF(#REF!, AM43)","v":{"$error":"#REF!"}}]
["GENERAL SERVICE 50 TO 499 KW",null,null,null,"GENERAL SERVICE 50 TO 499 KW",null,"Milton Hydro Distribution Inc.","Orillia Power Distribution Corporation",null,"Orillia Power Distribution Corporation","43_STANDARD A GRID CONNECTED SERVICE CLASSIFICATION",null,"PUC Distribution Inc.","PUC Distribution Inc., Sault Ste. Marie: Corporation; ED-2002-0546; ",null,null,null,null,null,null,null,48,null,"Milton Hydro Distribution Inc.",null,null,"Lakefront Utilities Inc.",null,null,null,null,null,null,null,null,null,"STANDARD A RESIDENTIAL AIR ACCESS SERVICE CLASSIFICATION",null,"General Service 500 to 4,999 kW - non Interval Metered",{"$f":"COUNTIF(#REF!, AM44)","v":{"$error":"#REF!"}}]
["GENERAL SERVICE 50 to 499 kW SERVICE CLASSIFICATION",null,null,null,"GENERAL SERVICE 50 to 499 kW SERVICE CLASSIFICATION",null,"Milton Hydro Distribution Inc.","Peterborough Distribution Incorporated",null,"Peterborough Distribution Incorporated","44_STANDARD A RESIDENTIAL AIR ACCESS SERVICE CLASSIFICATION",null,"Renfrew Hydro Inc.","Renfrew Hydro Inc., Renfrew: Corporation; ED-2002-0577; ",null,null,null,null,null,null,null,56,null,"Milton Hydro Distribution Inc.",null,null,"Brant County Power Inc.",null,null,null,null,null,null,null,null,null,"STANDARD A RESIDENTIAL ROAD/RAIL ACCESS SERVICE CLASSIFICATION",null,"General Service 700 to 4,999 kW",{"$f":"COUNTIF(#REF!, AM45)","v":{"$error":"#REF!"}}]
["GENERAL SERVICE 50 TO 699 KW",null,null,null,"GENERAL SERVICE 50 TO 699 KW",null,"Milton Hydro Distribution Inc.","PowerStream Inc.",null,"PowerStream Inc.","45_STANDARD A RESIDENTIAL ROAD/RAIL ACCESS SERVICE CLASSIFICATION",null,"Rideau St. Lawrence Distribution Inc.","Rideau St. Lawrence Distribution Inc., Prescott: Corporation; ED-2003-0003; ",null,null,null,null,null,null,null,62,null,"Milton Hydro Distribution Inc.",null,null,"Atikokan Hydro Inc.",null,null,null,null,null,null,null,null,null,"STANDBY DISTRIBUTION SERVICE CLASSIFICATION",null,"General Service Demand Billed (50 kW and above) - GSd",{"$f":"COUNTIF(#REF!, AM46)","v":{"$error":"#REF!"}}]
["GENERAL SERVICE 50 TO 699 KW SERVICE CLASSIFICATION",null,null,null,"GENERAL SERVICE 50 TO 699 KW SERVICE CLASSIFICATION",null,"Milton Hydro Distribution Inc.","PUC Distribution Inc.",null,"PUC Distribution Inc.","46_STANDBY DISTRIBUTION SERVICE CLASSIFICATION",null,"Sioux Lookout Hydro Inc.","Sioux Lookout Hydro Inc., Sioux Lookout: Corporation; ED-2002-0514; ",null,null,null,null,null,null,null,43,null,"Milton Hydro Distribution Inc.",null,null,"Veridian Connections Inc.",null,null,null,null,null,null,null,null,null,"STANDBY POWER SERVICE CLASSIFICATION",null,"General Service Energy Billed (less than 50 kW) - GSe metered",{"$f":"COUNTIF(#REF!, AM47)","v":{"$error":"#REF!"}}]
["GENERAL SERVICE 50 TO 999 KW",null,null,null,"GENERAL SERVICE 50 TO 999 KW",null,"Milton Hydro Distribution Inc.","Renfrew Hydro Inc.",null,"Renfrew Hydro Inc.","47_STANDBY POWER SERVICE CLASSIFICATION",null,"Thunder Bay Hydro Electricity Distribution Inc.","Thunder Bay Hydro Electricity Distribution Inc., Thunder Bay: Corporation; ED-2002-0529; ",null,null,null,null,null,null,null,36,null,"Milton Hydro Distribution Inc.",null,null,"Algoma Power Inc.",null,null,null,null,null,null,null,null,null,"Standby Power Service Classification ",null,"General Service Energy Billed (less than 50 kW) - GSe unmetered",{"$f":"COUNTIF(#REF!, AM48)","v":{"$error":"#REF!"}}]
["GENERAL SERVICE 50 TO 999 KW - INTERVAL METERED",null,null,null,"GENERAL SERVICE 50 TO 999 KW - INTERVAL METERED",null,"Milton Hydro Distribution Inc.","Rideau St. Lawrence Distribution Inc.",null,"Rideau St. Lawrence Distribution Inc.","48_Standby Power Service Classification ",null,"Tillsonburg Hydro Inc.","Tillsonburg Hydro Inc., Tillsonburg: Corporation; ED-2003-0026; ",null,null,null,null,null,null,null,37,null,"Milton Hydro Distribution Inc.",null,null,"Brantford Power Inc.",null,null,null,null,null,null,null,null,null,"STREET LIGHTING SERVICE CLASSIFICATION",null,"General Service Intermediate 1,000 to 4,999 kW - Chatham-Kent Hydro Service",{"$f":"COUNTIF(#REF!, AM49)","v":{"$error":"#REF!"}}]
["GENERAL SERVICE 50 to 999 kW SERVICE CLASSIFICATION",null,null,null,"GENERAL SERVICE 50 to 999 kW SERVICE CLASSIFICATION",null,"Milton Hydro Distribution Inc.","Sioux Lookout Hydro Inc.",null,"Sioux Lookout Hydro Inc.","49_STREET LIGHTING SERVICE CLASSIFICATION",null,"Veridian Connections Inc.","Veridian Connections Inc., Ajax: Corporation; ED-2002-0503; ",null,null,null,null,null,null,null,38,null,"Milton Hydro Distribution Inc.",null,null,"Enersource Hydro Mississauga Inc.",null,null,null,null,null,null,null,null,null,"Street Lighting Service Classification ",null,"General Service Less Than 50 kW - Barrie Hydro Service Area",{"$f":"COUNTIF(#REF!, AM50)","v":{"$error":"#REF!"}}]
["GENERAL SERVICE 500 TO 1,499 KW SERVICE CLASSIFICATION",null,null,null,"GENERAL SERVICE 500 TO 1,499 KW SERVICE CLASSIFICATION",null,"Milton Hydro Distribution Inc.","St. Thomas Energy Inc.",null,{"$error":"#N/A"},"50_Street Lighting Service Classification ",null,"Wasaga Distribution Inc.","Wasaga Distribution Inc., Wasaga Beach: Corporation; ED-2002-0544; ",null,null,null,null,null,null,null,39,null,"Milton Hydro Distribution Inc.",null,null,"Horizon Utilities Corporation",null,null,null,null,null,null,null,null,null,"UNMETERED SCATTERED LOAD SERVICE CLASSIFICATION",null,"General Service Less Than 50 kW - Chatham-Kent Hydro Service Area",{"$f":"COUNTIF(#REF!, AM51)","v":{"$error":"#REF!"}}]
["GENERAL SERVICE 500 TO 4,999 KW",null,null,null,"GENERAL SERVICE 500 TO 4,999 KW",null,"Milton Hydro Distribution Inc.","Thunder Bay Hydro Electricity Distribution Inc.",null,"Thunder Bay Hydro Electricity Distribution Inc.","51_UNMETERED SCATTERED LOAD SERVICE CLASSIFICATION",null,"Waterloo North Hydro Inc.","Waterloo North Hydro Inc., Waterloo: Corporation; ED-2002-0575; ",null,null,null,null,null,null,null,47,null,"Milton Hydro Distribution Inc.",null,null,"Hydro One Brampton Networks Inc.",null,null,null,null,null,null,null,null,null,"Unmetered Scattered Load Service Classification ",null,"General Service Less Than 50 kW - Clinton Power Service Area",{"$f":"COUNTIF(#REF!, AM52)","v":{"$error":"#REF!"}}]
["GENERAL SERVICE 500 to 4,999 kW SERVICE CLASSIFICATION",null,null,null,"GENERAL SERVICE 500 to 4,999 kW SERVICE CLASSIFICATION",null,"Milton Hydro Distribution Inc.","Tillsonburg Hydro Inc.",null,"Tillsonburg Hydro Inc.","51_UNMETERED SCATTERED LOAD SERVICE CLASSIFICATION",null,"Welland Hydro-Electric System Corp.","Welland Hydro-Electric System Corp., Welland: Corporation; ED-2003-0002; ",null,null,null,null,null,null,null,48,null,"Milton Hydro Distribution Inc.",null,null,"Hydro One Remote Communities Inc.",null,null,null,null,null,null,null,null,null,null,null,"General Service less than 50 kW - Dutton Service Area",{"$f":"COUNTIF(#REF!, AM53)","v":{"$error":"#REF!"}}]
["GENERAL SERVICE 700 TO 4,999 KW",null,null,null,"GENERAL SERVICE 700 TO 4,999 KW",null,"Milton Hydro Distribution Inc.","Veridian Connections Inc.",null,"Veridian Connections Inc.","51_UNMETERED SCATTERED LOAD SERVICE CLASSIFICATION",null,"Wellington North Power Inc.","Wellington North Power Inc., Mount Forest: Corporation; ED-2002-0511; ",null,null,null,null,null,null,null,65,null,"Milton Hydro Distribution Inc.",null,null,"Hydro Ottawa Limited",null,null,null,null,null,null,null,null,null,null,null,"General Service Less Than 50 kW - Eastern Ontario Power",{"$f":"COUNTIF(#REF!, AM54)","v":{"$error":"#REF!"}}]
["GENERAL SERVICE 700 TO 4,999 KW SERVICE CLASSIFICATION",null,null,null,"GENERAL SERVICE 700 TO 4,999 KW SERVICE CLASSIFICATION",null,"Milton Hydro Distribution Inc.","Wasaga Distribution Inc.",null,"Wasaga Distribution Inc.","51_UNMETERED SCATTERED LOAD SERVICE CLASSIFICATION",null,"West Coast Huron Energy Inc.","West Coast Huron Energy Inc., Goderich: Corporation; ED-2002-0510; ",null,null,null,null,null,null,null,63,null,"Milton Hydro Distribution Inc.",null,null,"Innpower Corporation",null,null,null,null,null,null,null,null,null,null,null,"General Service Less Than 50 kW - excl. former Barrie Hydro Ser. Area",{"$f":"COUNTIF(#REF!, AM55)","v":{"$error":"#REF!"}}]
["GENERAL SERVICE DEMAND BILLED (50 KW AND ABOVE) [GSD]",null,null,null,"GENERAL SERVICE DEMAND BILLED (50 KW AND ABOVE) [GSD]",null,"Milton Hydro Distribution Inc.","Waterloo North Hydro Inc.",null,"Waterloo North Hydro Inc.","51_UNMETERED SCATTERED LOAD SERVICE CLASSIFICATION",null,"Westario Power Inc.","Westario Power Inc., Walkerton: Corporation; ED-2002-0515; ",null,null,null,null,null,null,null,71,null,"Milton Hydro Distribution Inc.",null,null,"Kitchener-Wilmot Hydro Inc.",null,null,null,null,null,null,null,null,null,null,null,"General Service Less Than 50 kW - excluding Gravenhurst",{"$f":"COUNTIF(#REF!, AM56)","v":{"$error":"#REF!"}}]
["GENERAL SERVICE ENERGY BILLED (LESS THAN 50 KW) [GSE-METERED]",null,null,null,"GENERAL SERVICE ENERGY BILLED (LESS THAN 50 KW) [GSE-METERED]",null,"Milton Hydro Distribution Inc.","Welland Hydro-Electric System Corp.",null,"Welland Hydro-Electric System Corp.","51_UNMETERED SCATTERED LOAD SERVICE CLASSIFICATION",null,"Whitby Hydro Electric Corporation","Whitby Hydro Electric Corporation, Whitby: Corporation; ED-2002-0571; ",null,null,null,null,null,null,null,70,null,"Milton Hydro Distribution Inc.",null,null,"Lakeland Power Distribution Ltd.",null,null,null,null,null,null,null,null,null,null,null,"General Service Less Than 50 kW - Fort Erie",{"$f":"COUNTIF(#REF!, AM57)","v":{"$error":"#REF!"}}]
["GENERAL SERVICE ENERGY BILLED (LESS THAN TO 50 KW) [GSE-UNMETERED]",null,null,null,"GENERAL SERVICE ENERGY BILLED (LESS THAN TO 50 KW) [GSE-UNMETERED]"]
["GENERAL SERVICE EQUAL TO OR GREATER THAN 1,500 KW",null,null,null,"GENERAL SERVICE EQUAL TO OR GREATER THAN 1,500 KW"]
["GENERAL SERVICE EQUAL TO OR GREATER THAN 1,500 KW - INTERVAL METERED",null,null,null,"GENERAL SERVICE EQUAL TO OR GREATER THAN 1,500 KW - INTERVAL METERED"]
["GENERAL SERVICE EQUAL TO OR GREATER THAN 1,500 KW SERVICE CLASSIFICATION",null,null,null,"GENERAL SERVICE EQUAL TO OR GREATER THAN 1,500 KW SERVICE CLASSIFICATION"]
["GENERAL SERVICE GREATER THAN 1,000 KW",null,null,null,"GENERAL SERVICE GREATER THAN 1,000 KW"]
["GENERAL SERVICE GREATER THAN 50 kW - WMP",null,null,null,"GENERAL SERVICE GREATER THAN 50 kW - WMP"]
["GENERAL SERVICE INTERMEDIATE 1,000 TO 4,999 KW",null,null,null,"GENERAL SERVICE INTERMEDIATE 1,000 TO 4,999 KW"]
["GENERAL SERVICE INTERMEDIATE RATE CLASS 1,000 TO 4,999 KW (FORMERLY GENERAL SERVICE > 50 KW CUSTOMERS)",null,null,null,"GENERAL SERVICE INTERMEDIATE RATE CLASS 1,000 TO 4,999 KW (FORMERLY GENERAL SERVICE > 50 KW CUSTOMERS)"]
["GENERAL SERVICE INTERMEDIATE RATE CLASS 1,000 TO 4,999 KW (FORMERLY LARGE USE CUSTOMERS)",null,null,null,"GENERAL SERVICE INTERMEDIATE RATE CLASS 1,000 TO 4,999 KW (FORMERLY LARGE USE CUSTOMERS)"]
["GENERAL SERVICE LESS THAN 50 KW",null,null,null,"GENERAL SERVICE LESS THAN 50 KW"]
["GENERAL SERVICE LESS THAN 50 KW - SINGLE PHASE ENERGY-BILLED [G1]",null,null,null,"GENERAL SERVICE LESS THAN 50 KW - SINGLE PHASE ENERGY-BILLED [G1]"]
["GENERAL SERVICE LESS THAN 50 KW - THREE PHASE ENERGY-BILLED [G3]",null,null,null,"GENERAL SERVICE LESS THAN 50 KW - THREE PHASE ENERGY-BILLED [G3]"]
["GENERAL SERVICE LESS THAN 50 KW - TRANSMISSION CLASS ENERGY-BILLED [T]",null,null,null,"GENERAL SERVICE LESS THAN 50 KW - TRANSMISSION CLASS ENERGY-BILLED [T]"]
["GENERAL SERVICE LESS THAN 50 KW - URBAN ENERGY-BILLED [UG]",null,null,null,"GENERAL SERVICE LESS THAN 50 KW - URBAN ENERGY-BILLED [UG]"]
["GENERAL SERVICE LESS THAN 50 kW SERVICE CLASSIFICATION",null,null,null,"GENERAL SERVICE LESS THAN 50 kW SERVICE CLASSIFICATION"]
["GENERAL SERVICE SINGLE PHASE - G1",null,null,null,"GENERAL SERVICE SINGLE PHASE - G1"]
["GENERAL SERVICE THREE PHASE - G3",null,null,null,"GENERAL SERVICE THREE PHASE - G3"]
["GENERAL SERVICELESS THAN 50 kWSERVICE CLASSIFICATION",null,null,null,"GENERAL SERVICELESS THAN 50 kWSERVICE CLASSIFICATION"]
["INTERMEDIATE USER SERVICE CLASSIFICATION",null,null,null,"INTERMEDIATE USER SERVICE CLASSIFICATION"]
["INTERMEDIATE USERS",null,null,null,"INTERMEDIATE USERS"]
["INTERMEDIATE WITH SELF GENERATION",null,null,null,"INTERMEDIATE WITH SELF GENERATION"]
["LARGE USE",null,null,null,"LARGE USE"]
["LARGE USE - 3TS",null,null,null,"LARGE USE - 3TS"]
["LARGE USE - 3TS SERVICE CLASSIFICATION",null,null,null,"LARGE USE - 3TS SERVICE CLASSIFICATION"]
["LARGE USE - FORD ANNEX",null,null,null,"LARGE USE - FORD ANNEX"]
["LARGE USE - FORD ANNEX SERVICE CLASSIFICATION",null,null,null,"LARGE USE - FORD ANNEX SERVICE CLASSIFICATION"]
["LARGE USE - REGULAR",null,null,null,"LARGE USE - REGULAR"]
["LARGE USE - REGULAR SERVICE CLASSIFICATION",null,null,null,"LARGE USE - REGULAR SERVICE CLASSIFICATION"]
["LARGE USE > 5000 KW",null,null,null,"LARGE USE > 5000 KW"]
["LARGE USE SERVICE CLASSIFICATION",null,null,null,"LARGE USE SERVICE CLASSIFICATION"]
["LARGE USE WITH DEDICATED ASSETS SERVICE CLASSIFICATION",null,null,null,"LARGE USE WITH DEDICATED ASSETS SERVICE CLASSIFICATION"]
["LARGE USESERVICE CLASSIFICATION",null,null,null,"LARGE USESERVICE CLASSIFICATION"]
["microFIT",null,null,null,"microFIT"]
["MICROFIT GENERATOR SERVICE CLASSIFICATION",null,null,null,"MICROFIT GENERATOR SERVICE CLASSIFICATION"]
["microFIT SERVICE CLASSIFICATION",null,null,null,"microFIT SERVICE CLASSIFICATION"]
["microFITGENERATOR SERVICE CLASSIFICATION",null,null,null,"microFITGENERATOR SERVICE CLASSIFICATION"]
["MONTHLY RATES AND CHARGES–DELIVERY COMPONENT-APPROVED ON AN INTERIM ",null,null,null,"MONTHLY RATES AND CHARGES–DELIVERY COMPONENT-APPROVED ON AN INTERIM "]
["NON STANDARD A GENERAL SERVICE SINGLE PHASE SERVICE CLASSIFICATION – G1",null,null,null,"NON STANDARD A GENERAL SERVICE SINGLE PHASE SERVICE CLASSIFICATION – G1"]
["NON STANDARD A GENERAL SERVICE THREE PHASE SERVICE CLASSIFICATION – G3",null,null,null,"NON STANDARD A GENERAL SERVICE THREE PHASE SERVICE CLASSIFICATION – G3"]
["NON STANDARD A SEASONAL RESIDENTIAL SERVICE CLASSIFICATION – R4",null,null,null,"NON STANDARD A SEASONAL RESIDENTIAL SERVICE CLASSIFICATION – R4"]
["NON STANDARD A YEAR ROUND RESIDENTIAL SERVICE CLASSIFICATION – R2",null,null,null,"NON STANDARD A YEAR ROUND RESIDENTIAL SERVICE CLASSIFICATION – R2"]
["ONTARIO ELECTRICITY SUPPORT PROGRAM RECIPIENTS",null,null,null,"ONTARIO ELECTRICITY SUPPORT PROGRAM RECIPIENTS"]
["RESIDENTIAL",null,null,null,"RESIDENTIAL"]
["RESIDENTIAL - HENSALL",null,null,null,"RESIDENTIAL - HENSALL"]
["RESIDENTIAL - HIGH DENSITY [R1]",null,null,null,"RESIDENTIAL - HIGH DENSITY [R1]"]
["RESIDENTIAL - LOW DENSITY [R2]",null,null,null,"RESIDENTIAL - LOW DENSITY [R2]"]
["RESIDENTIAL - MEDIUM DENSITY [R1]",null,null,null,"RESIDENTIAL - MEDIUM DENSITY [R1]"]
["RESIDENTIAL - NORMAL DENSITY [R2]",null,null,null,"RESIDENTIAL - NORMAL DENSITY [R2]"]
["RESIDENTIAL - TIME OF USE",null,null,null,"RESIDENTIAL - TIME OF USE"]
["RESIDENTIAL - URBAN [UR]",null,null,null,"RESIDENTIAL - URBAN [UR]"]
["RESIDENTIAL REGULAR",null,null,null,"RESIDENTIAL REGULAR"]
["RESIDENTIAL – R1 SERVICE CLASSIFICATION",null,null,null,"RESIDENTIAL – R1 SERVICE CLASSIFICATION"]
["RESIDENTIAL – R2 SERVICE CLASSIFICATION",null,null,null,"RESIDENTIAL – R2 SERVICE CLASSIFICATION"]
["RESIDENTIAL SERVICE CLASSIFICATION",null,null,null,"RESIDENTIAL SERVICE CLASSIFICATION"]
["RESIDENTIAL SUBURBAN",null,null,null,"RESIDENTIAL SUBURBAN"]
["RESIDENTIAL SUBURBAN SEASONAL",null,null,null,"RESIDENTIAL SUBURBAN SEASONAL"]
["RESIDENTIAL SUBURBAN YEAR ROUND",null,null,null,"RESIDENTIAL SUBURBAN YEAR ROUND"]
["RESIDENTIAL URBAN",null,null,null,"RESIDENTIAL URBAN"]
["RESIDENTIAL URBAN YEAR-ROUND",null,null,null,"RESIDENTIAL URBAN YEAR-ROUND"]
["SEASONAL RESIDENTIAL",null,null,null,"SEASONAL RESIDENTIAL"]
["SEASONAL RESIDENTIAL - HIGH DENSITY [R3]",null,null,null,"SEASONAL RESIDENTIAL - HIGH DENSITY [R3]"]
["SEASONAL RESIDENTIAL - NORMAL DENSITY [R4]",null,null,null,"SEASONAL RESIDENTIAL - NORMAL DENSITY [R4]"]
["SEASONAL CUSTOMERS SERVICE CLASSIFICATION",null,null,null,"SEASONAL CUSTOMERS SERVICE CLASSIFICATION"]
["SEASONAL RESIDENTIAL SERVICE CLASSIFICATION",null,null,null,"SEASONAL RESIDENTIAL SERVICE CLASSIFICATION"]
["SENTINEL LIGHTING",null,null,null,"SENTINEL LIGHTING"]
["SENTINEL LIGHTING SERVICE CLASSIFICATION",null,null,null,"SENTINEL LIGHTING SERVICE CLASSIFICATION"]
["SMALL COMMERCIAL AND USL - PER CONNECTION",null,null,null,"SMALL COMMERCIAL AND USL - PER CONNECTION"]
["SMALL COMMERCIAL AND USL - PER METER",null,null,null,"SMALL COMMERCIAL AND USL - PER METER"]
["STANDARD A GENERAL SERVICE AIR ACCESS",null,null,null,"STANDARD A GENERAL SERVICE AIR ACCESS"]
["STANDARD A GENERAL SERVICE AIR ACCESS SERVICE CLASSIFICATION",null,null,null,"STANDARD A GENERAL SERVICE AIR ACCESS SERVICE CLASSIFICATION"]
["STANDARD A GENERAL SERVICE ROAD/RAIL",null,null,null,"STANDARD A GENERAL SERVICE ROAD/RAIL"]
["STANDARD A GENERAL SERVICE ROAD/RAIL ACCESS SERVICE CLASSIFICATION",null,null,null,"STANDARD A GENERAL SERVICE ROAD/RAIL ACCESS SERVICE CLASSIFICATION"]
["STANDARD A GRID CONNECTED",null,null,null,"STANDARD A GRID CONNECTED"]
["STANDARD A GRID CONNECTED SERVICE CLASSIFICATION",null,null,null,"STANDARD A GRID CONNECTED SERVICE CLASSIFICATION"]
["STANDARD A RESIDENTIAL AIR ACCESS",null,null,null,"STANDARD A RESIDENTIAL AIR ACCESS"]
["STANDARD A RESIDENTIAL AIR ACCESS SERVICE CLASSIFICATION",null,null,null,"STANDARD A RESIDENTIAL AIR ACCESS SERVICE CLASSIFICATION"]
["STANDARD A RESIDENTIAL ROAD/RAIL",null,null,null,"STANDARD A RESIDENTIAL ROAD/RAIL"]
["STANDARD A RESIDENTIAL ROAD/RAIL ACCESS SERVICE CLASSIFICATION",null,null,null,"STANDARD A RESIDENTIAL ROAD/RAIL ACCESS SERVICE CLASSIFICATION"]
["STANDBY - GENERAL SERVICE 1,000 - 5,000 KW",null,null,null,"STANDBY - GENERAL SERVICE 1,000 - 5,000 KW"]
["STANDBY - GENERAL SERVICE 50 - 1,000 KW",null,null,null,"STANDBY - GENERAL SERVICE 50 - 1,000 KW"]
["STANDBY - LARGE USE",null,null,null,"STANDBY - LARGE USE"]
["STANDBY DISTRIBUTION SERVICE",null,null,null,"STANDBY DISTRIBUTION SERVICE"]
["STANDBY DISTRIBUTION SERVICE CLASSIFICATION",null,null,null,"STANDBY DISTRIBUTION SERVICE CLASSIFICATION"]
["STANDBY POWER",null,null,null,"STANDBY POWER"]
["STANDBY POWER - APPROVED ON AN INTERIM BASIS",null,null,null,"STANDBY POWER - APPROVED ON AN INTERIM BASIS"]
["STANDBY POWER GENERAL SERVICE 1,500 TO 4,999 KW",null,null,null,"STANDBY POWER GENERAL SERVICE 1,500 TO 4,999 KW"]
["STANDBY POWER GENERAL SERVICE 50 TO 1,499 KW",null,null,null,"STANDBY POWER GENERAL SERVICE 50 TO 1,499 KW"]
["STANDBY POWER GENERAL SERVICE LARGE USE",null,null,null,"STANDBY POWER GENERAL SERVICE LARGE USE"]
["STANDBY POWER SERVICE",null,null,null,"STANDBY POWER SERVICE"]
["STANDBY POWER SERVICE CLASSIFICATION",null,null,null,"STANDBY POWER SERVICE CLASSIFICATION"]
["STANDBY POWER SERVICE CLASSIFICATION ",null,null,null,"STANDBY POWER SERVICE CLASSIFICATION "]
["STANDBY POWERSERVICE CLASSIFICATION",null,null,null,"STANDBY POWERSERVICE CLASSIFICATION"]
["STREET LIGHTING",null,null,null,"STREET LIGHTING"]
["STREET LIGHTING SERVICE CLASSIFICATION",null,null,null,"STREET LIGHTING SERVICE CLASSIFICATION"]
["SUB TRANSMISSION [ST]",null,null,null,"SUB TRANSMISSION [ST]"]
["UNMETERED SCATTERED LOAD",null,null,null,"UNMETERED SCATTERED LOAD"]
["UNMETERED SCATTERED LOAD SERVICE CLASSIFICATION",null,null,null,"UNMETERED SCATTERED LOAD SERVICE CLASSIFICATION"]
["URBAN GENERAL SERVICE DEMAND BILLED (50 KW AND ABOVE) [UGD]",null,null,null,"URBAN GENERAL SERVICE DEMAND BILLED (50 KW AND ABOVE) [UGD]"]
["URBAN GENERAL SERVICE ENERGY BILLED (LESS THAN 50 KW) [UGE]",null,null,null,"URBAN GENERAL SERVICE ENERGY BILLED (LESS THAN 50 KW) [UGE]"]
["WESTPORT SEWAGE TREATMENT PLANT",null,null,null,"WESTPORT SEWAGE TREATMENT PLANT"]
["YEAR-ROUND RESIDENTIAL - R2",null,null,null,"YEAR-ROUND RESIDENTIAL - R2"]
["EMBEDDED DISTRIBUTOR FOR HYDRO ONE NETWORKS INC. SERVICE CLASSIFICATION",null,null,null,"EMBEDDED DISTRIBUTOR FOR HYDRO ONE NETWORKS INC. SERVICE CLASSIFICATION"]
["GENERAL SERVICE 1,000 KW AND GREATER SERVICE CLASSIFICATION",null,null,null,"GENERAL SERVICE 1,000 KW AND GREATER SERVICE CLASSIFICATION"]
["NEW CLASS TEST",null,null,null,"NEW CLASS TEST"]

{"sheet":"Sheet10","index":13,"n_rows":310,"n_cols":2,"rows_kept":310,"cut":false,"hidden":true,"merged":[]}
["Connection Charge (per connection)","A"]
["Distribution Volumetric Rate","A"]
["Distribution Volumetric Rate - $/kW of contracted amount","A"]
["Electricity Rate - All Additional kWh","A"]
["Electricity Rate - First 1,000 kWh","A"]
["Electricity Rate - First 25,000 kWh","A"]
["Electricity Rate - First 250 kWh","A"]
["Electricity Rate - First 6,000 kWh","A"]
["Electricity Rate - Next 1,500 kWh","A"]
["Electricity Rate - Next 15,000 kWh","A"]
["Electricity Rate - Next 7,000 kWh","A"]
["For General Service 1,000 – 4,999 kW Service Classification","A"]
["For General Service 50 – 999 kW Service Classification","A"]
["For Large Use Service Classification","A"]
["General Service > 50 kW Standby Charge – for a customer whose facility is in the General Service > 50 kW rate class and for a month where actual demand is less than contracted demand.  The charge is applied to the amount by which the amount of load transfer capacity contracted by a facility exceeds the actual demand.","A"]
["GS> 50 kW Standby Charge – for a month where standby power is not provided. The charge is appliedto the amount of reserved load transfer capacity contracted or the amount of monthly peak load displaced by a generating facility","A"]
["Large Use Standby Charge – for a customer whose facility is in the Large Use rate class and for a month where actual demand is less than contracted demand.  The charge is applied to the amount by which the amount of load transfer capacity contracted by a facility exceeds the actual demand.","A"]
["Large Use Standby Charge – for a month where standby power is not provided. The charge is applied to the amount of reserved load transfer capacity contracted or the amount of monthly peak load displaced by a generating facility","A"]
["Large Use With Dedicated Assets Standby Charge – for a month where standby power is not provided. The charge is applied to the amount of reserved load transfer capacity contracted or the amount of monthly peak load displaced by agenerating facility.","A"]
["Low Voltage Service Rate","B"]
["Low Voltage Service Rate (see Note 1)","B"]
["Monthly Distribution Wheeling Service Rate - Dedicated LV Line","B"]
["Monthly Distribution Wheeling Service Rate - Hydro One Networks","B"]
["Monthly Distribution Wheeling Service Rate - Waterloo North Hydro","B"]
["Monthly Service Charge","A"]
["OESP Credit","Total"]
["Ontario Electricity Support Program (OESP)","Total"]
["Ontario Electricity Support Program Charge (OESP)","Total"]
["Primary Metering Allowance for Transformer Losses – applied to measured demand & energy","Total"]
["Primary Metering Allowance for transformer losses - applied to measured demand and energy","Total"]
["Primary Metering Allowance for transformer losses – applied to measured demand and energy","Total"]
["Rate Rider 3 for Disposition of Deferral and Variance Accounts (2015) - approved on an interim basis and effective until April 30, 2017","B"]
["Rate Rider 3 for Disposition of Deferral and Variance Accounts (2015) - approved on an interim basis and\n      effective until April 30, 2017","B"]
["Rate Rider 4 for Disposition of Global Adjustment Account (2015) - approved on an interim basis and effective until April 30, 2018, applicable only for Non-RPP Customers","B"]
["Rate Rider 4 for Disposition of Global Adjustment Account (2015) - approved on an interim basis and\n      effective until April 30, 2018, applicable only for Non-RPP Customers","B"]
["Rate Rider for  Recovery of Incremental Capital - effective until December 31, 2016","A"]
["Rate Rider for  Recovery of Stranded Meter Assets - effective until April 30, 2017","A"]
["Rate Rider for Application of CGAAP Accounting Changes (2013) - effective until April 30, 2017","A"]
["Rate Rider for Application of CGAAP Accounting Changes (2016) – effective until December 31, 2016","A"]
["Rate Rider for Application of IFRS – 2014 Derecognition – effective until December 31, 2019","A"]
["Rate Rider for Application of Tax Change (2015) – effective until April 30, 2016","A"]
["Rate Rider for Application of Tax Change (2016) - effective until April 30, 2017","A"]
["Rate Rider for Application of Tax Change (2016) – effective until April 30, 2017","A"]
["Rate Rider for Application of Tax Change (2016) – effective until December 31, 2016","A"]
["Rate Rider for Application of Tax Change (2016) (per connection) – effective until April 30, 2017","A"]
["Rate Rider for Disposition LRAM Variance Account - effective until April 30, 2017","A"]
["Rate Rider for Disposition of Account 1576  - effective until April 30, 2018","A"]
["Rate Rider for Disposition of Account 1576 – Accounting Changes – effective until December 31, 2016","A"]
["Rate Rider for Disposition of Account 1576 - effective until April 30, 2018","A"]
["Rate Rider for Disposition of Account 1576 - effective until April 30, 2019","A"]
["Rate Rider for Disposition of Account 1576 - effective until August 31, 2019","A"]
["Rate Rider for Disposition of Account 1576 - effective until December 31, 2016 - Approved on an Interim Basis","A"]
["Rate Rider for Disposition of Account 1576 - effective until December 31, 2016 \n        - Approved on an Interim Basis","A"]
["Rate Rider for Disposition of Account 1576 - effective until December 31, 2017","A"]
["Rate Rider for Disposition of Account 1576 – effective until December 31, 2017","A"]
["Rate Rider for Disposition of Account 1576 (2014) - effective until April 30, 2019","A"]
["Rate Rider for Disposition of Capital Gains - effective until December 31, 2016","A"]
["Rate Rider for Disposition of Deferral / Variance Accounts (2016) - effective until April 30, 2017","B"]
["Rate Rider for Disposition of Deferral/Variance Accounts (2012) - effective until December 31, 2016\n     Applicable in the former service area of Clinton Power","B"]
["Rate Rider for Disposition of Deferral/Variance Accounts (2013) - effective until April 30, 2017","B"]
["Rate Rider for Disposition of Deferral/Variance Accounts (2013) - effective until April 30, 2017 -  Applicable only for customers of the former Newbury rate zone","B"]
["Rate Rider for Disposition of Deferral/Variance Accounts (2013) - effective until April 30, 2017 -  Applicable only for the customers of the former Dutton rate zone","B"]
["Rate Rider for Disposition of Deferral/Variance Accounts (2013) - effective until April 30, 2017 -  Applicable only for the customers of the former Newbury rate zone","B"]
["Rate Rider for Disposition of Deferral/Variance Accounts (2013) - effective until April 30, 2017 - Applicable only for customers of the former Dutton rate zone","B"]
["Rate Rider for Disposition of Deferral/Variance Accounts (2013) - effective until April 30, 2017 - Applicable only for customers of the former Newbury rate zone","B"]
["Rate Rider for Disposition of Deferral/Variance Accounts (2014) - effective until August 31, 2016","B"]
["Rate Rider for Disposition of Deferral/Variance Accounts (2015) - effective until April 30, 2017","B"]
["Rate Rider for Disposition of Deferral/Variance Accounts (2015) - effective until April 30, 2017 -  Applicable only for customers of the former Newbury rate zone","B"]
["Rate Rider for Disposition of Deferral/Variance Accounts (2015) - effective until April 30, 2017 -  Applicable only for the customers of the former Newbury rate zone","B"]
["Rate Rider for Disposition of Deferral/Variance Accounts (2015) - effective until April 30, 2017 - Applicable only for customers of the former Newbury rate zone","B"]
["Rate Rider for Disposition of Deferral/Variance Accounts (2015) - effective until April 30, 2017\n      Applicable only for Non-RPP Customers","B"]
["Rate Rider for Disposition of Deferral/Variance Accounts (2015) - effective until April 30, 2017\n     Applicable only for Non-Wholesale Market Participants","B"]
["Rate Rider for Disposition of Deferral/Variance Accounts (2015) - effective until April 30, 2017\n     Applicable only for Wholesale Market Participants","B"]
["Rate Rider for Disposition of Deferral/Variance Accounts (2015) – effective until December 31, 2019","B"]
["Rate Rider for Disposition of Deferral/Variance Accounts (2016) – effect until December 31, 2016","B"]
["Rate Rider for Disposition of Deferral/Variance Accounts (2016) - effective until Apr 30, 2017","B"]
["Rate Rider for Disposition of Deferral/Variance Accounts (2016) - effective until April 30, 2017","B"]
["Rate Rider for Disposition of Deferral/Variance Accounts (2016) - effective until April 30, 2017 -  Applicable only for Wholesale Market Participants","B"]
["Rate Rider for Disposition of Deferral/Variance Accounts (2016) - effective until April 30, 2017 - Applicable for all customers who are not Wholesale Market Participants","B"]
["Rate Rider for Disposition of Deferral/Variance Accounts (2016) - effective until April 30, 2017\n","B"]
["Rate Rider for Disposition of Deferral/Variance Accounts (2016) - effective until April 30, 2017\n      Applicable only for Non-Wholesale Market Participants","B"]
["Rate Rider for Disposition of Deferral/Variance Accounts (2016) - effective until April 30, 2017\n     Applicable only for Non-Wholesale Market Participants","B"]
["Rate Rider for Disposition of Deferral/Variance Accounts (2016) - effective until April 30, 2017\n     Applicable only for Wholesale Market Participants","B"]
["Rate Rider for Disposition of Deferral/Variance Accounts (2016) – effective until April 30, 2018","B"]
["Rate Rider for Disposition of Deferral/Variance Accounts (2016) – effective until April 30, 2018 - Applicable only for Wholesale Market Participants","B"]
["Rate Rider for Disposition of Deferral/Variance Accounts (2016) – effective until December 31, 2015\n     Applicable only for Non-Wholesale Market Participants","B"]
["Rate Rider for Disposition of Deferral/Variance Accounts (2016) - effective until December 31, 2016","B"]
["Rate Rider for Disposition of Deferral/Variance Accounts (2016) – effective until December 31, 2016","B"]
["Rate Rider for Disposition of Deferral/Variance Accounts (2016) – effective until December 31, 2016 - Applicable only for Non-Wholesale Market Participants","B"]
["Rate Rider for Disposition of Deferral/Variance Accounts (2016) – effective until December 31, 2016 - Not applicable for Wholesale Market Participants","B"]
["Rate Rider for Disposition of Deferral/Variance Accounts (2016) - effective until December 31, 2016\n      Applicable only for Non-Wholesale Market Participants","B"]
["Rate Rider for Disposition of Deferral/Variance Accounts (2016) – effective until December 31, 2016\n     Applicable only for Non-Wholesale Market Participants","B"]
["Rate Rider for Disposition of Deferral/Variance Accounts (2016) – effective until December 31, 2017","B"]
["Rate Rider for Disposition of Deferral/Variance Accounts (2016)- effective until April 30, 2017","B"]
["Rate Rider for Disposition of Deferred PILs Variance Account 1562 – effective until March 31, 2016","A"]
["Rate Rider for Disposition of Global Adjustment (2016) – effective until December 31, 2016 - Applicable only for Non-RPP Class B Consumers","B"]
["Rate Rider for Disposition of Global Adjustment (2016) – effective until December 31, 2016 -Applicable for Customers who were Non-RPP Class B Consumers from January 1, 2014 to December 31, 2014","B"]
["Rate Rider for Disposition of Global Adjustment (2016) – effective until December 31, 2016 Applicable only for Non-RPP Class B Consumers","B"]
["Rate Rider for Disposition of Global Adjustment Account (2013) - effective until April 30, 2017 -  Applicable only for Class B, Non-RPP Customers of the former Newbury rate zone  who are not Wholesale Market Participants","B"]
["Rate Rider for Disposition of Global Adjustment Account (2013) - effective until April 30, 2017 -  Applicable only for Non-RPP customers of the former Newbury rate zone","B"]
["Rate Rider for Disposition of Global Adjustment Account (2013) - effective until April 30, 2017 - Applicable only for Non-RPP customers of the former Dutton rate zone","B"]
["Rate Rider for Disposition of Global Adjustment Account (2013) - effective until April 30, 2017 - Applicable only for Non-RPP customers of the former Newbury rate zone","B"]
["Rate Rider for Disposition of Global Adjustment Account (2013) - effective until April 30, 2017\n      Applicable only for Non-RPP Customers","B"]
["Rate Rider for Disposition of Global Adjustment Account (2014) - effective until August 31, 2016\n      Applicable only for Non-RPP Customers","B"]
["Rate Rider for Disposition of Global Adjustment Account (2015) - Approved on an Interim Basis\n      - effective until April 30, 2018 Applicable only for Non-RPP Customers","B"]
["Rate Rider for Disposition of Global Adjustment Account (2015) - effective until April 30, 2017 -  Applicable only for Class B, Non-RPP Customers of the former Newbury rate zone who are not Wholesale Market Participants","B"]
["Rate Rider for Disposition of Global Adjustment Account (2015) - effective until April 30, 2017 -  Applicable only for Non-RPP customers of the former Newbury rate zone","B"]
["Rate Rider for Disposition of Global Adjustment Account (2015) - effective until April 30, 2017 - Applicable only for Non-RPP customers of the former Newbury rate zone","B"]
["Rate Rider for Disposition of Global Adjustment Account (2015) - effective until April 30, 2017\n     Applicable only for Non-RPP Customers","B"]
["Rate Rider for Disposition of Global Adjustment Account (2015) - effective until April 30, 2017\n     Applicable only for Non-RPP Customers, excluding Wholesale Market Participants","B"]
["Rate Rider for Disposition of Global Adjustment Account (2016 )- effective until April 30, 2017 -  Applicable only for Non-RPP customers","B"]
["Rate Rider for Disposition of Global Adjustment Account (2016 )- effective until April 30, 2017 - Applicable only for Non-RPP Customers","B"]
["Rate Rider for Disposition of Global Adjustment Account (2016) - effective until Apr 30, 2017\n      Applicable only for Non-RPP Customers","B"]
["Rate Rider for Disposition of Global Adjustment Account (2016) - effective until April 30, 2017","B"]
["Rate Rider for Disposition of Global Adjustment Account (2016) - effective until April 30, 2017 -  Applicable only for Class B, Non-RPP Customers who are not Wholesale Market Participants","B"]
["Rate Rider for Disposition of Global Adjustment Account (2016) - effective until April 30, 2017 - Applicable only for Non-RPP Customers","B"]
["Rate Rider for Disposition of Global Adjustment Account (2016) - effective until April 30, 2017\n      Applicable only for Class B, Non-RPP Customers who are not Wholesale Market Participants","B"]
["Rate Rider for Disposition of Global Adjustment Account (2016) - effective until April 30, 2017\n      Applicable only for Non-RPP Customers","B"]
["Rate Rider for Disposition of Global Adjustment Account (2016) - effective until April 30, 2017\n      Applicable only to Class B, Non-RPP customers who are not Wholesale Market Participants","B"]
["Rate Rider for Disposition of Global Adjustment Account (2016) - effective until April 30, 2017\n     Applicable only for Non-RPP Customers","B"]
["Rate Rider for Disposition of Global Adjustment Account (2016) - effective until April 30, 2017\n     Applicable only for Non-RPP Customers, excluding Wholesale Market Participants","B"]
["Rate Rider for Disposition of Global Adjustment Account (2016) – effective until April 30, 2018 - Applicable only for Class B Non-RPP Customers who are not Wholesale Market Participants","B"]
["Rate Rider for Disposition of Global Adjustment Account (2016) – effective until April 30, 2018 - Applicable only for Non-RPP Customers","B"]
["Rate Rider for Disposition of Global Adjustment Account (2016) – effective until April 30, 2018 - Applicable only for Non-RPP Customers, excluding Wholesale Market Participants","B"]
["Rate Rider for Disposition of Global Adjustment Account (2016) - effective until April 30, 2018\n      Applicable only for Non-RPP Customers","B"]
["Rate Rider for Disposition of Global Adjustment Account (2016) – effective until December 31, 2016","B"]
["Rate Rider for Disposition of Global Adjustment Account (2016) – effective until December 31, 2016 - Applicable only for Class B Customers","B"]
["Rate Rider for Disposition of Global Adjustment Account (2016) – effective until December 31, 2016 - Applicable only for Non-RPP and Non-Wholesale Market Participant Customers","B"]
["Rate Rider for Disposition of Global Adjustment Account (2016) – effective until December 31, 2016 Applicable only for Non-RPP Customers","B"]
["Rate Rider for Disposition of Global Adjustment Account (2016) - effective until December 31, 2016\n      Applicable only for Non-RPP Customers","B"]
["Rate Rider for Disposition of Global Adjustment Account (2016) – effective until December 31, 2016\n      Applicable only for Non-RPP Customers","B"]
["Rate Rider for Disposition of Global Adjustment Account (2016) – effective until December 31, 2016\n     Applicable only for Class A non-RPP Customers who are not wholesale market participants\n     and which were Class B consumers as at December 31, 2014","B"]
["Rate Rider for Disposition of Global Adjustment Account (2016) – effective until December 31, 2016\n     Applicable only for Non Interval Metered Non-RPP Customers who are not Wholesale Market Participants","B"]
["Rate Rider for Disposition of Global Adjustment Account (2016) – effective until December 31, 2016\n     Applicable only for Non-RPP Customers","B"]
["Rate Rider for Disposition of Global Adjustment Account (2016) – effective until December 31, 2016 Applicable only for Non Interval Metered Non-RPP Customers who are not Wholesale Market Participants","B"]
["Rate Rider for Disposition of Global Adjustment Account (2016) – effective until December 31, 2016 Applicable to Interval Metered Non-RPP Customers who are not Wholesale Market Participants","B"]
["Rate Rider for Disposition of Global Adjustment Account (2016) – effective until December 31, 2016 Applicable only for Class A non-RPP Customers who are not Wholesale Market Participants","B"]
["Rate Rider for Disposition of Global Adjustment Account (2016) – effective until December 31, 2016\n     Applicable only for Non-RPP Customers – Interval Metered","B"]
["Rate Rider for Disposition of Global Adjustment Account (2016) – effective until December 31, 2016\n     Applicable only for Non-RPP Customers – Non Interval Metered","B"]
["Rate Rider for Disposition of Global Adjustment Account (2016) – effective until December 31, 2016\n     Applicable to Interval Metered Non-RPP Customers who are not Wholesale Market Participants,\n     including Class A customers who were Class B customers as at December 31, 2014","B"]
["Rate Rider for Disposition of Global Adjustment Account (2016) - effective until April 30, 2017 - Applicable only for non-RPP Customers","B"]
["Rate Rider for Disposition of Global Adjustment Account (2015) – effective until April 30, 2016 - Applicable only for Non-RPP Customers","B"]
["Rate Rider for Disposition of Global Adjustment Account (2016) – effective from May 1, 2016 until - December 31, 2016 - Applicable only for Non-RPP Customers","B"]
["Rate Rider for Disposition of Global Adjustment Account (2016) – effective from May 1, 2016 until = December 31, 2016 - Applicable only for Non-RPP Customers","B"]
["Rate Rider for Disposition of Global Adjustment Account (2015) – effective until April 30, 2016 - Applicable only for Non-RPP Customers, excluding Wholesale Market Participants","B"]
["Rate Rider for Disposition of Global Adjustment Account (2016) – effective from May 1, 2016 until December 31, 2016  = Applicable only for Non-RPP Customers, excluding Wholesale Market Participants","B"]
["Rate Rider for Disposition of Deferral/Variance Accounts (2016) – effective until December 31, 2016 - Excluding Wholesale Market Participants","B"]
["Rate Rider for Disposition of Global Adjustment Account (2016) – effective from May 1, 2016 until December 31, 2016 - Applicable only for Non-RPP Customers","B"]
["Rate Rider for Disposition of Global Adjustment Account (2015) – effective until December 31, 2019 - Applicable only for Non-RPP Customers","B"]
["Rate Rider for Disposition of Global Adjustment Account (2016) - effective until April 30, 2017\n      Applicable only to Class B, Non-RPP Customers who are not Wholesale Market Participants","B"]
["Rate Rider for Disposition of Global Adjustment Account (2016) – effective until December 31, 2016 - Applicable to Interval Metered Non-RPP Customers who are not Wholesale Market Participants, including Class A customers who were Class B customers as at December 31, 2014","B"]
["Rate Rider for Disposition of Global Adjustment Account (2016) – effective until December 31, 2016 - Applicable only for non-RPP Customers – Class B Customers who are not wholesale market participants","B"]
["RATE RIDER FOR DISPOSITION OF GLOBAL ADJUSTMENT ACCOUNT (2016) – EFFECTIVE FROM MAY 1, 2016 UNTIL = DECEMBER 31, 2016 - APPLICABLE ONLY FOR NON-RPP CUSTOMERS","B"]
["RATE RIDER FOR DISPOSITION OF GLOBAL ADJUSTMENT ACCOUNT (2015) – EFFECTIVE UNTIL APRIL 30, 2016 - APPLICABLE ONLY FOR NON-RPP CUSTOMERS, EXCLUDING WHOLESALE MARKET PARTICIPANTS","B"]
["RATE RIDER FOR DISPOSITION OF GLOBAL ADJUSTMENT ACCOUNT (2016) – EFFECTIVE FROM MAY 1, 2016 UNTIL DECEMBER 31, 2016  = APPLICABLE ONLY FOR NON-RPP CUSTOMERS, EXCLUDING WHOLESALE MARKET PARTICIPANTS","B"]
["RATE RIDER FOR DISPOSITION OF DEFERRAL/VARIANCE ACCOUNTS (2016) – EFFECTIVE UNTIL DECEMBER 31, 2016 - EXCLUDING WHOLESALE MARKET PARTICIPANTS","B"]
["RATE RIDER FOR DISPOSITION OF GLOBAL ADJUSTMENT ACCOUNT (2016) – EFFECTIVE FROM MAY 1, 2016 UNTIL - DECEMBER 31, 2016 - APPLICABLE ONLY FOR NON-RPP CUSTOMERS","B"]
["RATE RIDER FOR DISPOSITION OF GLOBAL ADJUSTMENT ACCOUNT (2015) – EFFECTIVE UNTIL APRIL 30, 2016 - APPLICABLE ONLY FOR NON-RPP CUSTOMERS","B"]
["Rate Rider for Disposition of Global Adjustment Account (2016)- effective until April 30, 2017 - Applicable only for Non-RPP customers","B"]
["Rate Rider for Disposition of Global Adjustment Account (2016)- effective until April 30, 2017 - Applicable only for Non-RPP Customers who are not Wholesale Market Participants","B"]
["Rate Rider for Disposition of Global Adjustment Accounts (2016) – effective until December 31, 2016 - Applicable only for Non-RPP Customers","B"]
["Rate Rider for Disposition of Global Adjustment Accounts (2016) – effective until December 31, 2016\n     Applicable only for Non-RPP Customers","B"]
["Rate Rider for Disposition of Global Adjustment Sub-Account (2013) - effective until April 30, 2017 -  Applicable only for Non-RPP customers of the former Dutton rate zone","B"]
["Rate Rider for Disposition of Global Adjustment Sub-Account (2015) - effective until April 30, 2017 - Applicable only for Non-RPP customers of the former Newbury rate zone","B"]
["Rate Rider for Disposition of Global Adjustment-Account (2016) – effective until December 31, 2017 - Applicable only for Non-RPP Customers","B"]
["Rate Rider for Disposition of Group 2 Deferral/Variance Accounts (2015) – effective until December 31, 2019","A"]
["Rate Rider for Disposition of Group Two Accounts (2016) - effective until April 30, 2017","A"]
["Rate Rider for Disposition of Group Two Deferral/Variance Accounts (2016) - effective until April 30, 2017","A"]
["Rate Rider for Disposition of Lost Revenue Adjustment Mechanism Variance Account (LRAMVA) (2016)\n      - effective until April 30, 2017","A"]
["Rate Rider for Disposition of Lost Revenue Adjustment Mechanism Variance Account (LRAMVA) (2016)\n      - effective until December 31, 2016","A"]
["Rate Rider for Disposition of LRAM Variance Account - effective until April 30, 2017","A"]
["Rate Rider for Disposition of LRAM Variance Account – effective until December 31, 2016","A"]
["Rate Rider for Disposition of LRAM Variance Account (2016) – effective until December 31, 2016","A"]
["Rate Rider for Disposition of PILS and Tax Variance – effective until December 31, 2016","A"]
["Rate Rider for Disposition of PILS and Tax Variance - HST – effective until December 31, 2016","A"]
["Rate Rider for Disposition of Post Retirement Actuarial Gain – effective until March 31, 2025","A"]
["Rate Rider for Disposition of Residual Historical Smart Meter Costs - effective until April 30, 2017","A"]
["Rate Rider for Disposition of Residual Historical Smart Meter Costs - effective until December 31, 2016","A"]
["Rate Rider for Disposition of Residual Historical Smart Meter Costs - effective until December 31, 2017","A"]
["Rate Rider for Disposition of Residual Historical Smart Meter Costs – effective until December 31, 2019","A"]
["Rate Rider for Recovery of 2008 – 2010 Smart Meter Costs – effective until April 30, 2017","A"]
["Rate Rider for Recovery of 2015 Foregone Revenue – effective until December 31, 2019","A"]
["Rate Rider for Recovery of 2016 Foregone Revenue – effective until December 31, 2019","A"]
["Rate Rider for Recovery of Foregone Revenue – effective until April 30, 2017","A"]
["Rate Rider for Recovery of Foregone Revenue – effective until December 31, 2016","A"]
["Rate Rider for Recovery of Ice Storm Costs – effective until October 31, 2016","A"]
["Rate Rider for Recovery of Incremental Capital - effective until December 31, 2016","A"]
["Rate Rider for Recovery of Incremental Capital - in effect until the effective date of the new cost  of service-based rate order","A"]
["Rate Rider for Recovery of Incremental Capital Module Costs – in effect until the effective date of the next cost of service-based rate order","A"]
["Rate Rider for Recovery of Incremental Capital – True-Up (2016) – effective until December 31, 2016","A"]
["Rate Rider for Recovery of Lost Revenue Adjustment Mechanism (LRAM)/Shared Savings Mechanism (SSM)  - effective until March 31, 2016","A"]
["Rate Rider for Recovery of Lost Revenue Adjustment Mechanism (LRAM)/Shared Savings Mechanism (SSM) - effective until March 31, 2016","A"]
["Rate Rider for Recovery of Lost Revenue Adjustment Mechanism (LRAM)/Shared Savings Mechanism (SSM) – effective until March 31, 2016","A"]
["Rate Rider for Recovery of Low Voltage Variance – effective until December 31, 2016","B"]
["Rate Rider for Recovery of LRAM Variance Account - effective until April 30, 2017","A"]
["Rate Rider for Recovery of LRAM Variance Account – effective until December 31, 2016","A"]
["Rate Rider for Recovery of LRAM Variance Account (2016) - effective until April 30, 2017","A"]
["Rate Rider for Recovery of LRAM Variance Account (2016) – effective until April 30, 2017","A"]
["Rate Rider for Recovery of LRAM Variance Account (2016) – effective until December 31, 2016","A"]
["Rate Rider for Recovery of Permanent Bypass Expenditure - approved on an interim basis and in effect\n      until the effective date of the next IRM based Rate Order","A"]
["Rate Rider for Recovery of Smart Meter Capital (2016) – effective until December 31, 2016","A"]
["Rate Rider for Recovery of Smart Meter Incremental Revenue Requirement - effective until the date of  the next cost of service-based rate order","A"]
["Rate Rider for Recovery of Smart Meter Incremental Revenue Requirement - in effect until the effective \ndate of the next cost of service-based rate order, or October 31, 2017, whichever occurs earlier","A"]
["Rate Rider for Recovery of Smart Meter Incremental Revenue Requirement - in effect until the effective date of the next cost of service-based rate order","A"]
["Rate Rider for Recovery of Smart Meter Incremental Revenue Requirement - in effect until the effective date of the next cost of service-based rate order, or October 31, 2017, whichever occurs earlier","A"]
["Rate Rider for Recovery of Smart Metering Entity Variance – effective until December 31, 2016","A"]
["Rate Rider for Recovery of Storm Damage Costs - effective until August 31, 2017","A"]
["Rate Rider for Recovery of Stranded Meter Assets - effective until April 30, 2017","A"]
["Rate Rider for Recovery of Stranded Meter Assets - effective until August 31, 2017","A"]
["Rate Rider for Recovery of Stranded Meter Assets – effective until December 31, 2016","A"]
["Rate Rider for Recovery of Stranded Meter Assets - effective until December 31, 2017","A"]
["Rate Rider for Recovery of Stranded Meter Assets – effective until December 31, 2017","A"]
["Rate Rider for Recovery of Stranded Meter Assets - effective until December 31, 2019","A"]
["Rate Rider for Recovery of Stranded Meter Assets – effective until December 31, 2019","A"]
["Rate Rider for Recovery of Stranded Meter Assets - effective until June 30, 2016","A"]
["Rate Rider for Recovery of Stranded Meter Assets – effective until March 31, 2016","A"]
["Rate Rider for Smart Meter Incremental Revenue Requirement - in effect until the effective date of  the next cost of service-based rate order","A"]
["Rate Rider for Smart Metering Entity Charge - effective until October 31, 2018","B"]
["Rate Rider for Smart Metering Entity Charge – effective until October 31, 2018","B"]
["Rate Rider for Supplemental Disposition of Account 1576 - effective until April 30, 2019","A"]
["Rate Rider for the Recovery of Stranded Meter Assets - effective until April 30, 2017","A"]
["Rate Rider for the Recovery of Stranded Meter Assets – effective until April 30, 2017","A"]
["Retail Transmission Rate - Line and Transformation Connection Service Rate","C"]
["Retail Transmission Rate – Line and Transformation Connection Service Rate","C"]
["Retail Transmission Rate - Line and Transformation Connection Service Rate - Interval Metered","C"]
["Retail Transmission Rate – Line and Transformation Connection Service Rate – Interval Metered","C"]
["Retail Transmission Rate - Line and Transformation Connection Service Rate - Interval Metered < 1,000 kW","C"]
["Retail Transmission Rate - Line and Transformation Connection Service Rate - Interval Metered > 1,000 kW","C"]
["Retail Transmission Rate - Line and Transformation Connection Service Rate (see Note 1)","C"]
["Retail Transmission Rate - Line Connection Service Rate","C"]
["Retail Transmission Rate - Network Service Rate","C"]
["Retail Transmission Rate – Network Service Rate","C"]
["Retail Transmission Rate - Network Service Rate - Interval Metered","C"]
["Retail Transmission Rate – Network Service Rate – Interval Metered","C"]
["Retail Transmission Rate - Network Service Rate - Interval Metered < 1,000 kW","C"]
["Retail Transmission Rate - Network Service Rate - Interval Metered > 1,000 kW","C"]
["Retail Transmission Rate - Transformation Connection Service Rate","C"]
["Rural or Remote Electricity Rate Protection Charge (RRRP)","Total"]
["Rural or Remote Ellectricity Rate Protection Charge (RRRP)","Total"]
["Service Charge","A"]
["Service Charge (Based on 30 Day Month)","A"]
["Service Charge (per connection)","A"]
["Service Charge (per customer)","A"]
["Service Charge (per device)","A"]
["Service Charge (per light)","A"]
["Service Charge (per luminaire)","A"]
["Standard Supply Service – Administration Charge (if applicable)","Total"]
["Standard Supply Service - Administrative Charge (if applicable)","Total"]
["Standard Supply Service – Administrative Charge (if applicable)","Total"]
["Standby Charge - for a month where standby power is not provided. The charge is applied to the contracted amount (e.g. nameplate rating of the generation facility).","A"]
["Wholesale Market Service Rate","Total"]
["Rate Rider for Disposition of Post Employment Benefit – Tax Savings – effective until December 31, 2018","A"]
["Rate Rider for Application of Operations Center Consolidation Plan Sharing – effective until December 31, 2018","A"]
["Rate Rider for Recovery of the Gain on the Sale of Named Properties – effective until December 31, 2019","A"]
["Rate Rider for Recovery of Hydro One Capital Contributions Variance – effective until December 31, 2019","A"]
["Rate Rider for Disposition of Residual Regulatory Asset Recovery Account – effective until December 31, 2016","A"]
[" Rate Rider for Disposition of Residual Regulatory Asset Recovery Account – effective until December 31, 2016","A"]
[" Rate Rider for Disposition of Post Employment Benefit – Tax Savings – effective until December 31, 2018","A"]
["Rate Rider for Recovery of 2015 Foregone Revenue (per connection) – effective until December 31, 2019","A"]
["Rate Rider for Recovery of 2016 Foregone Revenue (per connection) – effective until December 31, 2019","A"]
["Rate Rider for Smart Metering Entity Change – effective until October 31, 2018","B"]
["Rate Rider for Disposition of Accounts 1575 & 1576 - effective until December 31, 2019","A"]
["Rate Rider for Disposition of Accounts 1575 & 1576 – effective until December 31, 2019","A"]
["Rate Rider for Recovery of Smart Meter Deferred Revenue – effective until December 31, 2016","A"]
["Rate Rider for Disposition of Account 1574 – effective until June 30, 2019","A"]
["Rate Rider for Smart Meter Entity Charge - effective until October 31, 2018","B"]
["Rate Rider for Disposition of Deferral/Variance Accounts (2015) – effective until December 31, 2016","B"]
["Rate Rider for Disposition of Global Adjustment Account (2015) – effective until December 31, 2016\n Applicable only for Non-RPP Customers\n","B"]
["Rate Rider for Disposition of Global Adjustment Account (2016) – effective until December 31, 2017\n Applicable only for Non-RPP Customers\n","B"]
["Rate Rider for Disposition of Deferred PIL’s Variance Account 1562 – effective until December 31, 2016","A"]
["Rate Rider for Application of CGAAP Accounting Changes – effective until April 30, 2019","A"]
["Rate Rider for Recovery of Residual Historical Smart Meter Costs – effective until April 30, 2016","A"]
["Rate Rider for Recovery of Stranded Meter Assets – effective until April 30, 2016","A"]
["Rate Rider for Application of Tax Change – in effect until the effective date of the next Cost of Service based Rate Order","A"]
["Rate Rider for Recovery of Residual Historical Smart Meter Costs– effective until April 30, 2016","A"]
["Rate Rider for Recovery of Stranded Meter Assets– effective until April 30, 2016","A"]
["Rate Rider for Application of Tax Change – in effect until the effective date of the next Cost of  Service based Rate Order","A"]
["Rate Rider for Recovery of Stranded Meter Assets– effective until April 30, 2016 ","A"]
["Rate Rider for Disposition of Group 2 Accounts(2016) – effective until December 31, 2016","A"]
["Rate Rider for Disposition of Global Adjustment Account (2016) – effective until December 31, 2016 - Applicable only for Non-RPP Customers","B"]
["Rate Rider for Recovery of Lost Revenue Adjustment Mechanism (LRAM) Costs – effective until December 31, 2016","A"]
["Rate Rider for Disposition of Group 2 Accounts (2016)– effective until December 31, 2016","A"]
["Rate Rider for Disposition of Global Adjustment Account (2015) - effective until June 30, 2016\n      Applicable only for Non-RPP Customers","B"]
["Rate Rider for Disposition of Deferral/Variance Accounts (2015) - effective until June 30, 2016","B"]
["Rate Rider for Disposition of Accounts 1575 and 1576 - effective until June 30, 2017","A"]
["Rate Rider for Recovery of LRAM Variance Account - effective until June 30, 2016","A"]
["Rate Rider for Recovery of Stranded Meter Assets - effective until April 30, 2019","A"]
["Rate Rider for Recovery of Smart Meter Incremental Revenue Requirement – in effect until the  -  effective date of the next cost of service based rate order","A"]
["Rate Rider for Recovery of Incremental Capital – in effect until the effective date of the next","A"]
["Rate Rider for Recovery of Smart Meter Incremental Revenue Requirement – in effect until the effective date of the next cost of service based rate order","A"]
["Rate Rider for Recovery of Incremental Capital – in effect until the effective date of the next cost of service based rate order","A"]
["Rate Rider for Smart Metering Entity Charge - effective until April 30, 2018","A"]
["Rate Rider for Application of Tax Change (2015) - effective until December 31, 2016","A"]
["Rate Rider for Application of Tax Change - effective until December 31, 2016","A"]
["Rate Rider for Adjustment to 2015 Interim Rates - effective until April 30, 2017","A"]
["Rate Rider for Disposition of Account 1576 - effective until April 30, 2017","A"]
["Rate Rider for Adjustment to 2015 Interim Rates (per customer) - effective until April 30, 2017","A"]
["Rate Rider for Adjustment to 2015 Interim Rates (per connection) - effective until April 30, 2017","A"]
["Rate Rider for Recovery of Smart Meter Incremental Revenue Requirement – in effect until the  -  effective date of the next cost of service based rate order","A"]
["Rate Rider for Recovery of Incremental Capital – in effect until the effective date of the next","A"]
["Rate Rider for Recovery of Foregone Revenue - effective until April 30, 2017","A"]
["Rate Rider for Disposition of Residual Historical Smart Meter Costs - effective until June 30, 2020","A"]
["Rate Rider for Recovery of Stranded Meter Assets - effective until June 30, 2018","A"]
["Rate Rider for Disposition of Group 2 Deferral/Variance Accounts - effective until June 30, 2018","A"]
["Rate Rider for Disposition of Deferral/Variance Accounts (2016) - effective until June 30, 2018","B"]
["Rate Rider for Disposition of Deferral/Variance Accounts (2016) - effective until June 30, 2018\n      Applicable only for Non-Wholesale Market Participants","B"]
["Rate Rider for Disposition of Global Adjustment Account (2016) - effective until June 30, 2018\n      Applicable only for Non-RPP Customers","B"]
["Rate Rider for Disposition of Account 1576 - effective until June 30, 2018","A"]
["Rate Rider for Recovery of Lost Revenue Adjustment Mechanism (LRAM) costs - effective until June 30, 2018","A"]
["Rate Rider for Foregone Revenue - effective until April 30, 2017","A"]