{"text_format":"1","workbook":"xlsx","n_sheets":30,"sheets":["INDEX","Model Specs","1. Information Sheet","2. Current Tariff Schedule","3. Continuity Schedule","4. Billing Det. for Def-Var","5. Allocating Def-Var Balances","6. GA Calculation","6A. GA Allocation_Class A","6B. GA Allocation_new Class B","7. CBR Allocation","7A. CBR Allocation_Class A","7B. CBR Allocation_new Class B","8. Calculation of Def-Var RR","9. STS-Tax Change","10. Shared Tax - RR","11. RTSR - Current Rates","12. RTSR-UTRs & Sub-Tx","13. RTSR-Historic Wholesale","14. RTSR-Current Wholesale","15. RTSR-Forecast Wholesale","16. RTSR-Rates to Forecast","17. Rev2Cost-GDPIPI","18. Regulatory Charges","19. Additional Rates","20. Final Tariff Schedule","21. Bill Impacts","RATES","BoD Reporting","10th Percentile"],"not_rendered":{"charts":0,"images":0,"macros":1,"external_links":4,"defined_names":104,"comments":3,"pivot_tables":0},"unopened":[],"bounds":{"document_bytes":16777216,"sheet_cells":100000,"rows_first":2000,"rows_last":500,"rows_between":2000,"halvings":0,"cell_chars":16384,"cell_head_chars":4096},"cells_cut":0,"cells_raw":0,"read":"whole","date_system":"1900"}

{"sheet":"INDEX","index":0,"n_rows":30,"n_cols":1,"rows_kept":30,"cut":false,"hidden":false,"merged":[]}
["INDEX"]
["Model Specs"]
["1. Information Sheet"]
["2. Current Tariff Schedule"]
["3. Continuity Schedule"]
["4. Billing Det. for Def-Var"]
["5. Allocating Def-Var Balances"]
["6. GA Calculation"]
["6A. GA Allocation_Class A"]
["6B. GA Allocation_new Class B"]
["7. CBR Allocation"]
["7A. CBR Allocation_Class A"]
["7B. CBR Allocation_new Class B"]
["8. Calculation of Def-Var RR"]
["9. STS-Tax Change"]
["10. Shared Tax - RR"]
["11. RTSR - Current Rates"]
["12. RTSR-UTRs & Sub-Tx"]
["13. RTSR-Historic Wholesale"]
["14. RTSR-Current Wholesale"]
["15. RTSR-Forecast Wholesale"]
["16. RTSR-Rates to Forecast"]
["17. Rev2Cost-GDPIPI"]
["18. Regulatory Charges"]
["19. Additional Rates"]
["20. Final Tariff Schedule"]
["21. Bill Impacts"]
["RATES"]
["BoD Reporting"]
["10th Percentile"]

{"sheet":"Model Specs","index":1,"n_rows":34,"n_cols":12,"rows_kept":34,"cut":false,"hidden":false,"merged":[]}
["Back to Index",null,null,null,null,null,null,null,null,null,"Lists:"]
[null,"Model Specifications"]
[null,null,null,null,null,null,null,null,null,null,"Yes"]
[null,"Utility","Alectra - Enersource",null,null,null,null,null,null,null,"No"]
[]
[null,"Applying for Rates Effective",{"$f":"+'1. Information Sheet'!G26","v":"2019-01-01"},null,null,null,null,null,null,null,"kWh"]
[null,null,null,null,null,null,null,null,null,null,"kW"]
[null,null,null,null,null,null,null,null,null,null,"kVA"]
[null,"Line Loss Factor",1.036]
[null,null,null,null,null,null,null,null,null,null,"Alectra Utilities - PowerStream Rate Zone"]
[null,null,null,null,null,null,null,null,null,null,"Alectra Utilities - Enersource Rate Zone"]
[null,null,null,null,null,null,null,null,null,null,"Alectra Utilities - Horizon Utilites Rate Zone"]
[null,null,null,null,null,null,null,null,null,null,"Alectra Utilities - Brampton Rate Zone"]
[null,null,"Rate Classes (select from the List)"]
[null,{"$f":"IFERROR(VLOOKUP(C15,$K$16:$L$29,2,FALSE),\"\")","v":"RES"},"RESIDENTIAL SERVICE CLASSIFICATION"]
[null,{"$f":"IFERROR(VLOOKUP(C16,$K$16:$L$29,2,FALSE),\"\")","v":"GSL"},"GENERAL SERVICE LESS THAN 50 kW SERVICE CLASSIFICATION",null,null,null,null,null,null,null,"RESIDENTIAL SERVICE CLASSIFICATION","RES"]
[null,"GS50_499","GENERAL SERVICE 50 to 499 kW SERVICE CLASSIFICATION",null,null,null,null,null,null,null,"GENERAL SERVICE LESS THAN 50 kW SERVICE CLASSIFICATION","GSL"]
[null,"GS500","GENERAL SERVICE 500 to 4,999 kW SERVICE CLASSIFICATION",null,null,null,null,null,null,null,"GENERAL SERVICE 50 to 499 kW SERVICE CLASSIFICATION","GS50_499"]
[null,"LU","LARGE USE SERVICE CLASSIFICATION",null,null,null,null,null,null,null,"GENERAL SERVICE 50 to 699 KW SERVICE CLASSIFICATION","GS50_699"]
[null,"SB","STANDBY POWER SERVICE CLASSIFICATION ",null,null,null,null,null,null,null,"GENERAL SERVICE 500 to 4,999 kW SERVICE CLASSIFICATION","GS500"]
[null,"USL","UNMETERED SCATTERED LOAD SERVICE CLASSIFICATION",null,null,null,null,null,null,null,"GENERAL SERVICE 700 to 4,999 KW SERVICE CLASSIFICATION","GS700"]
[null,"SL","STREET LIGHTING SERVICE CLASSIFICATION",null,null,null,null,null,null,null,"LARGE USE SERVICE CLASSIFICATION","LU"]
[null,"",null,null,null,null,null,null,null,null,"UNMETERED SCATTERED LOAD SERVICE CLASSIFICATION","USL"]
[null,"",null,null,null,null,null,null,null,null,"STREET LIGHTING SERVICE CLASSIFICATION","SL"]
[null,"",null,null,null,null,null,null,null,null,"STANDBY POWER SERVICE CLASSIFICATION ","SB"]
[null,"",null,null,null,null,null,null,null,null,"SENTINEL LIGHTING SERVICE CLASSIFICATION","SEN"]
[null,"",null,null,null,null,null,null,null,null,"EMBEDDED DISTRIBUTOR SERVICE CLASSIFICATION","EMB"]
[null,"",null,null,null,null,null,null,null,null,"DISTRIBUTED GENERATION [DGEN] SERVICE CLASSIFICATION","DG"]
[null,"",null,null,null,null,null,null,null,null,"ENERGY FROM WASTE SERVICE CLASSIFICATION","WST"]
[null,""]
[null,""]
[]
[]
[null,"Have one or more Class A customers","Yes"]

{"sheet":"1. Information Sheet","index":2,"n_rows":44,"n_cols":22,"rows_kept":44,"cut":false,"hidden":false,"merged":[[43,1,43,7],[25,6,25,8],[27,6,27,8],[29,1,29,5],[29,6,29,8],[31,1,31,5],[31,6,31,8],[36,3,36,12],[38,3,38,14],[40,3,40,13],[1,1,8,14],[23,6,23,10],[13,6,13,12],[15,6,15,10],[19,6,19,11],[21,6,21,8],[17,6,17,8]]}
["Back to Index",null,null,null,null,null,null,null,null,null,null,null,null,null,null,null,null,null,null,null,null,"a"]
[null,"INCENTIVE REGULATION MODEL FOR 2019 FILERS"]
[]
[]
[]
[]
[]
[]
[]
[]
[]
[null,null,null,null,null,null,null,null,null,null,null,null,null,"Version",1]
[]
[null,null,null,null,null,"Utility Name   ","Alectra Utilities - Horizon Utilites Rate Zone"]
[]
[null,null,null,null,null,"Service Territory"]
[]
[null,null,null,null,null,"Assigned EB Number","EB-2018-0016"]
[]
[null,null,null,null,null,"Name of Contact and Title","Indy J. Butany-DeSouza, Vice-President, Regulatory Affairs"]
[]
[null,null,null,null,null,"Phone Number   ","905-821-5727"]
[]
[null,null,null,null,null,"Email Address   ","indy.butany@alectrautilities.com"]
[]
[null,null,null,null,null,"We are applying for rates effective   ","2019-01-01"]
[]
[null,null,null,null,null,"Rate-Setting Method","Price Cap IR"]
[]
[null,"Please indicate in which Rate Year the Group 1 accounts were last cleared1",null,null,null,null,2018]
[]
[null,"Please indicate the last Cost of Service \nRe-Basing Year",null,null,null,null,2013]
[]
[]
[null,null,"Notes"]
[]
[null,null,null,"Pale gray cells represent input cells."]
[]
[null,null,null,"Pale blue cells represent drop-down lists.  "]
[]
[null,null,null,"White cells contain fixed values, automatically generated values or formulae. "]
[]
[]
[null,"Note:  \n1.  Rate year of application"]

{"sheet":"2. Current Tariff Schedule","index":3,"n_rows":401,"n_cols":4,"rows_kept":401,"cut":false,"hidden":false,"merged":[[383,1,383,3],[396,1,396,3],[386,1,386,3],[387,1,387,3],[388,1,388,3],[377,1,377,3],[364,0,364,1],[365,0,365,1],[366,0,366,1],[369,1,369,3],[371,1,371,3],[110,1,110,3],[66,1,66,3],[70,1,70,3],[373,1,373,3],[375,1,375,3],[298,1,298,3],[302,1,302,3],[315,1,315,3],[317,1,317,3],[263,1,263,3],[265,1,265,3],[68,1,68,3],[136,1,136,3],[142,1,142,3],[144,1,144,3],[146,0,146,3],[60,1,60,3],[288,1,288,3],[313,1,313,3],[31,1,31,3],[217,1,217,3],[219,1,219,3],[221,1,221,3],[182,1,182,3],[184,1,184,3],[186,1,186,3],[188,1,188,3],[190,1,190,3],[102,1,102,3],[104,1,104,3],[106,1,106,3],[134,1,134,3],[337,1,337,3],[290,1,290,3],[292,1,292,3],[294,1,294,3],[296,1,296,3],[300,1,300,3],[333,1,333,3],[335,1,335,3],[62,1,62,3],[64,1,64,3],[1,1,8,3],[253,1,253,3],[255,1,255,3],[56,1,56,3],[58,1,58,3],[33,1,33,3],[10,1,10,3],[11,1,11,3],[12,1,12,3],[13,1,13,3],[14,1,14,3],[27,1,27,3],[29,1,29,3],[16,1,16,3],[257,1,257,3],[259,1,259,3],[261,1,261,3],[138,1,138,3],[140,1,140,3],[194,1,194,3],[148,0,148,3],[150,1,150,3],[154,1,154,3],[178,1,178,3],[180,1,180,3],[339,1,339,3],[94,1,94,3],[98,1,98,3],[251,1,251,3],[305,1,305,3],[307,1,307,3],[309,1,309,3],[311,1,311,3],[223,1,223,3],[225,1,225,3],[227,1,227,3],[229,1,229,3],[215,1,215,3],[100,1,100,3],[96,1,96,3],[319,1,319,3],[25,1,25,3],[17,1,17,3],[19,1,19,3],[21,1,21,3],[23,1,23,3],[18,1,18,3]]}
["Back to Index"]
[null,{"$f":"+'1. Information Sheet'!B2:O9","v":"INCENTIVE REGULATION MODEL FOR 2019 FILERS"}]
[]
[]
[]
[]
[]
[]
[]
[]
[null,"Alectra Utilities Corporation"]
[null,"Enersource Rate Zone"]
[null,"TARIFF OF RATES AND CHARGES"]
[null,"Effective Date January 1, 2018"]
[null,"Implementation Date May 1, 2018"]
[]
[null,"This schedule supersedes and replaces all previously "]
[null,"approved schedules of Rates, Charges and Loss Factors"]
[null,"EB-2017-0024"]
[null,"RESIDENTIAL SERVICE CLASSIFICATION"]
[]
[null,"This classification refers to all residential services including, without limitation, single family or single unit dwellings, multifamily dwellings, row-type dwellings and subdivision developments.  Energy is supplied in single phase, 3-wire, or three phase, 4 wire, having a nominal voltage of 120/240 volts.  There shall be only one delivery point to a dwelling.  Class B consumers are defined in accordance with O. Reg. 429/04.  Further servicing details are available in the distributor’s Conditions of Service."]
[]
[null,"APPLICATION"]
[]
[null,"The application of these rates and charges shall be in accordance with the Licence of the Distributor and any Code or Order of the Ontario Energy Board, and amendments thereto as approved by the Ontario Energy Board, which may be applicable to the administration of this schedule."]
[]
[null,"No rates and charges for the distribution of electricity and charges to meet the costs of any work or service done or furnished for the purpose of the distribution of electricity shall be made except as permitted by this schedule, unless required by the Distributor’s Licence or a Code or Order of the Ontario Energy Ontario Energy Board, and amendments thereto as approved by the Ontario Energy Board, or as specified herein."]
[]
[null,"Unless specifically noted, this schedule does not contain any charges for the electricity commodity, be it under the Regulated Price Plan, a contract with a retailer or the wholesale market price, as applicable. In addition, the charges in the MONTHLY RATES AND CHARGES - Regulatory Component of this schedule do not apply to a customer that is an embedded wholesale market participant."]
[]
[null,"It should be noted that this schedule does not list any charges, assessments, or credits that are required by law to be invoiced by a distributor and that are not subject to Ontario Energy Board approval, such as the Debt Retirement Charge, the Global Adjustment and the HST."]
[]
[null,"MONTHLY RATES AND CHARGES - Delivery Component"]
[]
["R_F","Service Charge","$",21.61]
[null,"Smart Metering Entity Charge - effective until December 31, 2022","$",0.56999999999999995]
["R_GA16","Rate Rider for Recovery of Incremental Capital Module (2017) - in effect until the effective date of the next cost of service based rate order","$",0.6]
[null,"Rate Rider for Recovery of ICM (2018) - in effect from May 1, 2018 until the effective date of the next cost of service based rate order","$",0.16]
[null,"Rate Rider for Recovery of 2018 Foregone Revenue - effective until December 31, 2018","$",0.17]
["R_V","Distribution Volumetric Rate","$/kWh",3.5000000000000001E-3]
["R_V","Low Voltage Service Rate ","$/kWh",2.0000000000000001E-4]
[null,"Rate Rider for Disposition of Global Adjustment Account (2018) - effective until  April 30, 2019\n        Applicable only for Non-RPP Customers","$/kWh",-5.0000000000000001E-4]
[null,"Rate Rider for Disposition of Deferral/Variance Accounts (2018) - effective until April 30, 2019","$/kWh",-6.9999999999999999E-4]
[null,"Rate Rider for Disposition of Capacity Based Recovery Account (2018) - effective until April 30, 2019\n        Applicable Only for Class  B Customers","$/kWh",-5.0000000000000002E-5]
[null,"Rate Rider for Disposition of Lost Revenue Adjustment Mechanism Variance Account (LRAMVA) (2018) - effective until April 30, 2019","$/kWh",-2.0000000000000001E-4]
["R_TN","Retail Transmission Rate - Network Service Rate","$/kWh",7.5706432419583008E-3]
["R_TC","Retail Transmission Rate - Line and Transformation Connection Service Rate","$/kWh",7.0836618157868745E-3]
[]
[null,"MONTHLY RATES AND CHARGES - Regulatory Component"]
[]
[null,"Wholesale Market Service Rate (WMS) - Not including CBR","$/kWh",3.2000000000000002E-3]
[null,"Capacity Based Recovery (CBR) - Applicable for Class B Customers","$/kWh",4.0000000000000002E-4]
[null,"Rural or Remote Electricity Rate Protection Charge (RRRP)","$/kWh",2.9999999999999997E-4]
[null,"Standard Supply Service - Administrative Charge (if applicable)","$",0.25]
[]
[null,"GENERAL SERVICE LESS THAN 50 KW SERVICE CLASSIFICATION"]
[]
[null,"This classification refers to a non-residential account whose monthly average peak demand is less than, or is forecast to be less than, 50 kW.  Class B consumers are defined in accordance with O. Reg. 429/04.  Further servicing details are available in the distributor’s Conditions of Service."]
[]
[null,"APPLICATION"]
[]
[null,"The application of these rates and charges shall be in accordance with the Licence of the Distributor and any Code or Order of the Ontario Energy Board, and amendments thereto as approved by the Ontario Energy Board, which may be applicable to the administration of this schedule."]
[]
[null,"No rates and charges for the distribution of electricity and charges to meet the costs of any work or service done or furnished for the purpose of the distribution of electricity shall be made except as permitted by this schedule, unless required by the Distributor’s Licence or a Code or Order of the Ontario Energy Board, and amendments thereto as approved by the Ontario Energy Board, or as specified herein."]
[]
[null,"Unless specifically noted, this schedule does not contain any charges for the electricity commodity, be it under the Regulated Price Plan, a contract with a retailer or the wholesale market price, as applicable. In addition, the charges in the MONTHLY RATES AND CHARGES - Regulatory Component of this schedule do not apply to a customer that is an embedded wholesale market participant."]
[]
[null,"It should be noted that this schedule does not list any charges, assessments, or credits that are required by law to be invoiced by a distributor and that are not subject to Ontario Energy Board approval, such as the Debt Retirement Charge, the Global Adjustment and the HST."]
[]
[null,"MONTHLY RATES AND CHARGES - Delivery Component"]
[]
["GSL_F","Service Charge","$",43.99]
[null,"Smart Metering Entity Charge - effective until December 31, 2022","$",0.56999999999999995]
["GSL_GA16","Rate Rider for Recovery of Incremental Capital Module (2017) - in effect until the effective date of the next cost of service based rate order","$",1.1000000000000001]
[null,"Rate Rider for Recovery of ICM (2018) - in effect from May 1, 2018 until the effective date of the next cost of service based rate order","$",0.28999999999999998]
[null,"Rate Rider for Recovery of 2018 Foregone Revenue - effective until December 31, 2018","$",0.35]
["GSL_V","Distribution Volumetric Rate","$/kWh",1.2800000000000001E-2]
["GSL_V","Low Voltage Service Rate ","$/kWh",2.0000000000000001E-4]
[null,"Rate Rider for Disposition of Global Adjustment Account (2018) - effective until  April 30, 2019\n        Applicable only for Non-RPP Customers","$/kWh",-5.0000000000000001E-4]
[null,"Rate Rider for Disposition of Deferral/Variance Accounts (2018) - effective until April 30, 2019","$/kWh",-6.9999999999999999E-4]
[null,"Rate Rider for Disposition of Capacity Based Recovery Account (2018) - effective until April 30, 2019\n        Applicable Only for Class  B Customers","$/kWh",-5.0000000000000002E-5]
[null,"Rate Rider for Disposition of Lost Revenue Adjustment Mechanism Variance Account (LRAMVA) (2018) - effective until April 30, 2019","$/kWh",5.9999999999999995E-4]
["GSL_1576","Rate Rider for Recovery of Incremental Capital Module (2017) - in effect until the effective date of the next cost of service based rate order","$/kWh",2.9999999999999997E-4]
[null,"Rate Rider for Recovery of ICM (2018) - in effect from May 1, 2018 until the effective date of the next cost of service based rate order","$/kWh",1E-4]
["GSL_TN","Retail Transmission Rate - Network Service Rate","$/kWh",7.1000000000000004E-3]
["GSL_TC","Retail Transmission Rate - Line and Transformation Connection Service Rate","$/kWh",6.4000000000000003E-3]
[]
[null,"MONTHLY RATES AND CHARGES - Regulatory Component"]
[]
[null,"Wholesale Market Service Rate (WMS) - Not including CBR","$/kWh",3.2000000000000002E-3]
[null,"Capacity Based Recovery (CBR) - Applicable for Class B Customers","$/kWh",4.0000000000000002E-4]
[null,"Rural or Remote Electricity Rate Protection Charge (RRRP)","$/kWh",2.9999999999999997E-4]
[null,"Standard Supply Service - Administrative Charge (if applicable)","$",0.25]
[null,"GENERAL SERVICE 50 TO 499 KW SERVICE CLASSIFICATION"]
[]
[null,"This classification refers to a non-residential account whose monthly average peak demand is equal to or greater than, or is forecast to be equal to or greater than, 50 kW but less than 500 kW.  Class B consumers are defined in accordance with O. Reg. 429/04.  Further servicing details are available in the distributor’s Conditions of Service."]
[]
[null,"APPLICATION"]
[]
[null,"The application of these rates and charges shall be in accordance with the Licence of the Distributor and any Code or Order of the Ontario Energy Board, and amendments thereto as approved by the Ontario Energy Board, which may be applicable to the administration of this schedule."]
[]
[null,"No rates and charges for the distribution of electricity and charges to meet the costs of any work or service done or furnished for the purpose of the distribution of electricity shall be made except as permitted by this schedule, unless required by the Distributor’s Licence or a Code or Order of the Ontario Energy Board, and amendments thereto as approved by the Ontario Energy Board, or as specified herein."]
[]
[null,"Unless specifically noted, this schedule does not contain any charges for the electricity commodity, be it under the Regulated Price Plan, a contract with a retailer or the wholesale market price, as applicable. In addition, the charges in the MONTHLY RATES AND CHARGES - Regulatory Component of this schedule do not apply to a customer that is an embedded wholesale market participant."]
[]
[null,"It should be noted that this schedule does not list any charges, assessments, or credits that are required by law to be invoiced by a distributor and that are not subject to Ontario Energy Board approval, such as the Debt Retirement Charge, the Global Adjustment and the HST."]
[]
[null,"Billing demands are established at the greater of 100% of the kW, or 90% of the kVA amounts."]
[]
[null,"MONTHLY RATES AND CHARGES - Delivery Component"]
[]
["GS50_499_F","Service Charge","$",77.48]
["GS50_699_F","Rate Rider for Recovery of Incremental Capital Module (2017) - in effect until the effective date of the next cost of service based rate order","$",1.93]
[null,"Rate Rider for Recovery of ICM (2018) - in effect from May 1, 2018 until the effective date of the next cost of service based rate order","$",0.51]
[null,"Rate Rider for Recovery of 2018 Foregone Revenue - effective until December 31, 2018","$",2.84]
["GS50_499_V","Distribution Volumetric Rate","$/kW",4.6628999999999996]
[null,"Low Voltage Service Rate ","$/kW",8.0199999999999994E-2]
["GS50_699_1576","Rate Rider for Disposition of Global Adjustment Account (2018) - effective until  April 30, 2019\n        Applicable only for Non-RPP Customers","$/kWh",-5.0000000000000001E-4]
[null,"Rate Rider for Disposition of Deferral/Variance Accounts (2018) - effective until April 30, 2019","$/kW",0.10050000000000001]
[null,"Rate Rider for Disposition of Deferral/Variance Accounts (2018) - effective until April 30, 2019\n         Applicable only for Non-Wholesale Market Participants","$/kW",-0.3538]
[null,"Rate Rider for Disposition of Capacity Based Recovery Account (2018) - effective until April 30, 2019\n        Applicable Only for Non-WMP Class  B Customers","$/kW",-1.6060000000000001E-2]
[null,"Rate Rider for Disposition of Lost Revenue Adjustment Mechanism Variance Account (LRAMVA) (2018) - effective until April 30, 2019","$/kW",0.45850000000000002]
["GS50_699_DVA16","Rate Rider for Recovery of Incremental Capital Module (2017) - in effect until the effective date of the next cost of service based rate order","$/kW",0.1163]
[null,"Rate Rider for Recovery of ICM (2018) - in effect from May 1, 2018 until the effective date of the next cost of service based rate order","$/kW",3.0800000000000001E-2]
["GS50_499_TN","Retail Transmission Rate - Network Service Rate","$/kW",2.7324999999999999]
["GS50_499_TC","Retail Transmission Rate - Line and Transformation Connection Service Rate","$/kW",2.5347]
[]
[null,"MONTHLY RATES AND CHARGES - Regulatory Component"]
[]
[null,"Wholesale Market Service Rate (WMS) - Not including CBR","$/kWh",3.2000000000000002E-3]
[null,"Capacity Based Recovery (CBR) - Applicable for Class B Customers","$/kWh",4.0000000000000002E-4]
[null,"Rural or Remote Electricity Rate Protection Charge (RRRP)","$/kWh",2.9999999999999997E-4]
[null,"Standard Supply Service - Administrative Charge (if applicable)","$",0.25]
[null,"GENERAL SERVICE 500 TO 4,999 KW SERVICE CLASSIFICATION"]
[]
[null,"This classification refers to a non-residential account whose monthly average peak demand is equal to or greater than, or is forecast to be equal to or greater than, 500 kW but less than 5,000 kW.  Class A and Class B consumers are defined in accordance with O. Reg. 429/04.  Further servicing details are available in the distributor’s Conditions of Service."]
[]
[null,"APPLICATION"]
[]
[null,"The application of these rates and charges shall be in accordance with the Licence of the Distributor and any Code or Order of the Ontario Energy Board, and amendments thereto as approved by the Ontario Energy Board, which may be applicable to the administration of this schedule."]
[]
[null,"No rates and charges for the distribution of electricity and charges to meet the costs of any work or service done or furnished for the purpose of the distribution of electricity shall be made except as permitted by this schedule, unless required by the Distributor’s Licence or a Code or Order of the Ontario Energy Board, and amendments thereto as approved by the Ontario Energy Board, or as specified herein."]
[]
[null,"Unless specifically noted, this schedule does not contain any charges for the electricity commodity, be it under the Regulated Price Plan, a contract with a retailer or the wholesale market price, as applicable. In addition, the charges in the MONTHLY RATES AND CHARGES - Regulatory Component of this schedule do not apply to a customer that is an embedded wholesale market participant."]
[]
["The rate rider for the disposition of WMS – Sub-account CBR Class B is not applicable to wholesale market participants (WMP), customers that transitioned between Class A and Class B during the variance account accumulation period, or to customers that were in Class A for the entire period. Customers who transitioned are to be charged or refunded their share of the variance disposed through customer specific billing adjustments. This rate rider is to be consistently applied for the entire period to the sunset date of the rate rider. In addition, this rate rider is applicable to all new Class B customers.\n\n\n"]
[]
["The rate rider for the disposition of Global Adjustment is only applicable to non-RPP Class B customers.  It is not applicable to WMP customers that transitioned between Class A and Class B during the variance account accumulation period, or to customers that were in Class A for the entire period.  Customers who transitioned are to be charged or refunded their share of the variance disposed through customer specific billing adjustments.  This rate order is applicable to all new non-RPP Class B customers. "]
[]
[null,"It should be noted that this schedule does not list any charges, assessments, or credits that are required by law to be invoiced by a distributor and that are not subject to Ontario Energy Board approval, such as the Debt Retirement Charge, the Global Adjustment and the HST."]
[]
[null,"Billing demands are established at the greater of 100% of the kW, or 90% of the kVA amounts."]
[]
[null,"MONTHLY RATES AND CHARGES - Delivery Component"]
[]
["GS500_F","Service Charge","$",1764.42]
["GS700_LRVA16","Rate Rider for Recovery of Incremental Capital Module (2017) - in effect until the effective date of the next cost of service based rate order","$",44]
[null,"Rate Rider for Recovery of ICM (2018) - in effect from May 1, 2018 until the effective date of the next cost of service based rate order","$",11.65]
[null,"Rate Rider for Recovery of 2018 Foregone Revenue - effective until December 31, 2018","$",16.18]
["GS500_V","Distribution Volumetric Rate","$/kW",2.3994]
[null,"Low Voltage Service Rate ","$/kW",7.8399999999999997E-2]
["GS700_CBR16_A","Rate Rider for Disposition of Global Adjustment Account (2018) - effective until  April 30, 2019\n        Applicable only for Non-RPP Customers","$/kWh",-5.0000000000000001E-4]
[null,"Rate Rider for Disposition of Deferral/Variance Accounts (2018) - effective until April 30, 2019","$/kW",0.12720000000000001]
[null,"Rate Rider for Disposition of Deferral/Variance Accounts (2018) - effective until April 30, 2019\n         Applicable only for Non-Wholesale Market Participants","$/kW",-0.44650000000000001]
[null,"Rate Rider for Disposition of Capacity Based Recovery Account (2018) - effective until April 30, 2019\n        Applicable Only for Non-WMP Class  B Customers","$/kW",-1.9990000000000001E-2]
[null,"Rate Rider for Disposition of Lost Revenue Adjustment Mechanism Variance Account (LRAMVA) (2018) - effective until April 30, 2019","$/kW",0.14099999999999999]
["GS700_CBR16","Rate Rider for Recovery of Incremental Capital Module (2017) - in effect until the effective date of the next cost of service based rate order","$/kW",5.9799999999999999E-2]
[null,"Rate Rider for Recovery of ICM (2018) - in effect from May 1, 2018 until the effective date of the next cost of service based rate order","$/kW",1.5800000000000002E-2]
["GS500_TN","Retail Transmission Rate - Network Service Rate ","$/kW",2.6436000000000002]
["GS500_TC","Retail Transmission Rate - Line and Transformation Connection Service Rate ","$/kW",2.4803000000000002]
[]
[null,"MONTHLY RATES AND CHARGES - Regulatory Component"]
[]
[null,"Wholesale Market Service Rate (WMS) - Not including CBR","$/kWh",3.2000000000000002E-3]
[null,"Capacity Based Recovery (CBR) - Applicable for Class B Customers","$/kWh",4.0000000000000002E-4]
[null,"Rural or Remote Electricity Rate Protection Charge (RRRP)","$/kWh",2.9999999999999997E-4]
[null,"Standard Supply Service - Administrative Charge (if applicable)","$",0.25]
[null,"LARGE USE SERVICE CLASSIFICATION"]
[]
[null,"This classification refers to an account whose monthly average peak demand is equal to or greater than, or is forecast to be equal to or greater than, 5,000 kW.  Class A and Class B consumers are defined in accordance with O. Reg. 429/04.  Further servicing details are available in the distributor’s Conditions of Service."]
[]
[null,"APPLICATION"]
[]
[null,"The application of these rates and charges shall be in accordance with the Licence of the Distributor and any Code or Order of the Ontario Energy Board, and amendments thereto as approved by the Ontario Energy Board, which may be applicable to the administration of this schedule."]
[]
[null,"No rates and charges for the distribution of electricity and charges to meet the costs of any work or service done or furnished for the purpose of the distribution of electricity shall be made except as permitted by this schedule, unless required by the Distributor’s Licence or a Code or Order of the Ontario Energy Board, and amendments thereto as approved by the Ontario Energy Board, or as specified herein."]
[]
[null,"Unless specifically noted, this schedule does not contain any charges for the electricity commodity, be it under the Regulated Price Plan, a contract with a retailer or the wholesale market price, as applicable. In addition, the charges in the MONTHLY RATES AND CHARGES - Regulatory Component of this schedule do not apply to a customer that is an embedded wholesale market participant."]
[]
[null,"It should be noted that this schedule does not list any charges, assessments, or credits that are required by law to be invoiced by a distributor and that are not subject to Ontario Energy Board approval, such as the Debt Retirement Charge, the Global Adjustment and the HST."]
[]
[null,"Billing demands are established at the greater of 100% of the kW, or 90% of the kVA amounts."]
[]
[null,"MONTHLY RATES AND CHARGES - Delivery Component"]
[]
["LU_F","Service Charge","$",13911.73]
["LU_DVA16","Rate Rider for Recovery of Incremental Capital Module (2017) - in effect until the effective date of the next cost of service based rate order","$",346.9]
[null,"Rate Rider for Recovery of ICM (2018) - in effect from May 1, 2018 until the effective date of the next cost of service based rate order","$",91.89]
[null,"Rate Rider for Recovery of 2018 Foregone Revenue - effective until December 31, 2018","$",264.39]
["LU_V","Distribution Volumetric Rate","$/kW",2.9782000000000002]
[null,"Low Voltage Service Rate ","$/kW",8.3799999999999999E-2]
[null,"Rate Rider for Disposition of Deferral/Variance Accounts (2018) - effective until April 30, 2019","$/kW",-0.40539999999999998]
[null,"Rate Rider for Disposition of Lost Revenue Adjustment Mechanism Variance Account (LRAMVA) (2018) - effective until April 30, 2019","$/kW",8.7999999999999995E-2]
[null,"Rate Rider for Recovery of Incremental Capital Module (2017) - in effect until the effective date of the next cost of service based rate order","$/kW",7.4300000000000005E-2]
[null,"Rate Rider for Recovery of ICM (2018) - in effect from May 1, 2018 until the effective date of the next cost of service based rate order","$/kW",1.9699999999999999E-2]
["LU_TN","Retail Transmission Rate - Network Service Rate – Interval Metered","$/kW",2.8210999999999999]
["LU_TC","Retail Transmission Rate - Line and Transformation Connection Service Rate – Interval Metered ","$/kW",2.6490999999999998]
[]
[null,"MONTHLY RATES AND CHARGES - Regulatory Component"]
[]
[null,"Wholesale Market Service Rate (WMS) - Not including CBR","$/kWh",3.2000000000000002E-3]
[null,"Capacity Based Recovery (CBR) - Applicable for Class B Customers","$/kWh",4.0000000000000002E-4]
[null,"Rural or Remote Electricity Rate Protection Charge (RRRP)","$/kWh",2.9999999999999997E-4]
[null,"Standard Supply Service - Administrative Charge (if applicable)","$",0.25]
[null,"UNMETERED SCATTERED LOAD SERVICE CLASSIFICATION"]
[]
[null,"This classification applies to an account taking electricity at 750 volts or less whose average monthly maximum demand is less than, or is forecast to be less than, 50 kW and the consumption is unmetered. The amount of electricity consumed by unmetered connections will be based on detailed information/documentation provided by the device's manufacturer abd will be agreed to by Alectra Utilities and the customer and may be subject to periodic monitoring of actual consumption.  Eligible onmetered loads include cable TV power packs, bus  shelters, telephone booths, traffic lights, railway crossings, etc.   Class B consumers are defined in accordance with O. Reg. 429/04.  Further servicing details are available in the distributor’s Conditions of Service."]
[]
[null,"APPLICATION"]
[]
[null,"The application of these rates and charges shall be in accordance with the Licence of the Distributor and any Code or Order of the Ontario Energy Board, and amendments thereto as approved by the Ontario Energy Board, which may be applicable to the administration of this schedule."]
[]
[null,"No rates and charges for the distribution of electricity and charges to meet the costs of any work or service done or furnished for the purpose of the distribution of electricity shall be made except as permitted by this schedule, unless required by the Distributor’s Licence or a Code or Order of the Ontario Energy Board, and amendments thereto as approved by the Ontario Energy Board, or as specified herein."]
[]
[null,"Unless specifically noted, this schedule does not contain any charges for the electricity commodity, be it under the Regulated Price Plan, a contract with a retailer or the wholesale market price, as applicable. In addition, the charges in the MONTHLY RATES AND CHARGES - Regulatory Component of this schedule do not apply to a customer that is an embedded wholesale market participant."]
[]
[null,"It should be noted that this schedule does not list any charges, assessments, or credits that are required by law to be invoiced by a distributor and that are not subject to Ontario Energy Board approval, such as the Debt Retirement Charge, the Global Adjustment and the HST."]
[]
[null,"MONTHLY RATES AND CHARGES - Delivery Component"]
[]
["USL_F","Service Charge (per connection)","$",9.08]
[null,"Rate Rider for Recovery of Incremental Capital Module (2017) - in effect until the effective date of the next cost of service based rate order","$",0.23]
[null,"Rate Rider for Recovery of ICM (2018) - in effect from May 1, 2018 until the effective date of the next cost of service based rate order","$",0.06]
[null,"Rate Rider for Recovery of 2018 Foregone Revenue - effective until December 31, 2018","$",0.05]
["USL_V","Distribution Volumetric Rate","$/kWh",1.6500000000000001E-2]
[null,"Low Voltage Service Rate ","$/kWh",2.0000000000000001E-4]
[null,"Rate Rider for Disposition of Global Adjustment Account (2018) - effective until  April 30, 2019\n        Applicable only for Non-RPP Customers","$/kWh",-5.0000000000000001E-4]
["USL_CBR16","Rate Rider for Disposition of Deferral/Variance Accounts (2018) - effective until April 30, 2019","$/kWh",-6.9999999999999999E-4]
[null,"Rate Rider for Disposition of Capacity Based Recovery Account (2018) - effective until April 30, 2019\n        Applicable Only for Class  B Customers","$/kWh",-5.0000000000000002E-5]
["USL_DVA16","Rate Rider for Recovery of Incremental Capital Module (2017) - in effect until the effective date of the next cost of service based rate order","$/kWh",4.0000000000000002E-4]
[null,"Rate Rider for Recovery of ICM (2018) - in effect from May 1, 2018 until the effective date of the next cost of service based rate order","$/kWh",1E-4]
["USL_TN","Retail Transmission Rate - Network Service Rate","$/kWh",7.1000000000000004E-3]
["USL_TC","Retail Transmission Rate - Line and Transformation Connection Service Rate","$/kWh",6.4000000000000003E-3]
[]
[null,"MONTHLY RATES AND CHARGES - Regulatory Component"]
[]
[null,"Wholesale Market Service Rate (WMS) - Not including CBR","$/kWh",3.2000000000000002E-3]
[null,"Capacity Based Recovery (CBR) - Applicable for Class B Customers","$/kWh",4.0000000000000002E-4]
[null,"Rural or Remote Electricity Rate Protection Charge (RRRP)","$/kWh",2.9999999999999997E-4]
[null,"Standard Supply Service - Administrative Charge (if applicable)","$",0.25]
[null,"STREET LIGHTING SERVICE CLASSIFICATION"]
[]
[null,"This classification refers to an account for roadway lighting.  Street Lighting is unmetered where energy consumption is estimated based on the connected wattage and calculated hours of use using methods established by the Ontario Energy Board.  Class B consumers are defined in accordance with O. Reg. 429/04.  Further servicing details are available in the distributor’s Conditions of Service."]
[]
[null,"APPLICATION"]
[]
[null,"The application of these rates and charges shall be in accordance with the Licence of the Distributor and any Code or Order of the Ontario Energy Board, and amendments thereto as approved by the Ontario Energy Board, which may be applicable to the administration of this schedule."]
[]
[null,"No rates and charges for the distribution of electricity and charges to meet the costs of any work or service done or furnished for the purpose of the distribution of electricity shall be made except as permitted by this schedule, unless required by the Distributor’s Licence or a Code or Order of the Ontario Energy Board, and amendments thereto as approved by the Ontario Energy Board, or as specified herein."]
[]
[null,"Unless specifically noted, this schedule does not contain any charges for the electricity commodity, be it under the Regulated Price Plan, a contract with a retailer or the wholesale market price, as applicable. In addition, the charges in the MONTHLY RATES AND CHARGES - Regulatory Component of this schedule do not apply to a customer that is an embedded wholesale market participant."]
[]
[null,"It should be noted that this schedule does not list any charges, assessments, or credits that are required by law to be invoiced by a distributor and that are not subject to Ontario Energy Board approval, such as the Debt Retirement Charge, the Global Adjustment and the HST."]
[]
[null,"MONTHLY RATES AND CHARGES - Delivery Component"]
[]
["SL_F","Service Charge (per luminaire)","$",1.52]
["SL_GA16","Rate Rider for Recovery of Incremental Capital Module (2017) - in effect until the effective date of the next cost of service based rate order","$",0.04]
[null,"Rate Rider for Recovery of ICM (2018) - in effect from May 1, 2018 until the effective date of the next cost of service based rate order","$",0.01]
[null,"Rate Rider for Recovery of 2018 Foregone Revenue - effective until December 31, 2018","$",0.01]
["SL_V","Distribution Volumetric Rate","$/kW",11.650399999999999]
[null,"Low Voltage Service Rate ","$/kW",5.8000000000000003E-2]
[null,"Rate Rider for Disposition of Global Adjustment Account (2018) - effective until  April 30, 2019\n        Applicable only for Non-RPP Customers","$/kWh",-5.0000000000000001E-4]
[null,"Rate Rider for Disposition of Deferral/Variance Accounts (2018) - effective until April 30, 2019","$/kW",-0.2616]
[null,"Rate Rider for Disposition of Capacity Based Recovery Account (2018) - effective until April 30, 2019\n        Applicable Only for Non-WMP Class  B Customers","$/kW",-1.6549999999999999E-2]
[null,"Rate Rider for Disposition of Lost Revenue Adjustment Mechanism Variance Account (LRAMVA) (2018) - effective until April 30, 2019","$/kW",-33.353200000000001]
["SL_1576","Rate Rider for Recovery of Incremental Capital Module (2017) - in effect until the effective date of the next cost of service based rate order","$/kW",0.29049999999999998]
[null,"Rate Rider for Recovery of ICM (2018) - in effect from May 1, 2018 until the effective date of the next cost of service based rate order","$/kW",7.6999999999999999E-2]
["SL_TN","Retail Transmission Rate - Network Service Rate","$/kW",1.8924000000000001]
["SL_TC","Retail Transmission Rate - Line and Transformation Connection Service Rate","$/kW",1.8329]
[]
[null,"MONTHLY RATES AND CHARGES - Regulatory Component"]
[]
[null,"Wholesale Market Service Rate (WMS) - Not including CBR","$/kWh",3.2000000000000002E-3]
[null,"Capacity Based Recovery (CBR) - Applicable for Class B Customers","$/kWh",4.0000000000000002E-4]
[null,"Rural or Remote Electricity Rate Protection Charge (RRRP)","$/kWh",2.9999999999999997E-4]
[null,"Standard Supply Service - Administrative Charge (if applicable)","$",0.25]
[null,"STANDBY POWER SERVICE CLASSIFICATION"]
[]
[null,"This classification refers to an account that requires Alectra Utilities to provide distribution service on a standby basis as a back-up supply to an on-site generator.  Further servicing details are available in the distributor’s Conditions of Service."]
[]
[null,"APPLICATION"]
[]
[null,"The application of these rates and charges shall be in accordance with the Licence of the Distributor and any Code or Order of the Ontario Energy Board, and amendments thereto as approved by the Ontario Energy Board, which may be applicable to the administration of this schedule."]
[]
[null,"No rates and charges for the distribution of electricity and charges to meet the costs of any work or service done or furnished for the purpose of the distribution of electricity shall be made except as permitted by this schedule, unless required by the Distributor’s Licence or a Code or Order of the Ontario Energy Board, and amendments thereto as approved by the Ontario Energy Board, or as specified herein."]
[]
[null,"Unless specifically noted, this schedule does not contain any charges for the electricity commodity, be it under the Regulated Price Plan, a contract with a retailer or the wholesale market price, as applicable."]
[]
[null,"It should be noted that this schedule does not list any charges, assessments or credits that are required by law to be invoiced by a distributor and that are not subject to Ontario Energy Board approval, such as the Debt Retirement Charge, the Global Adjustment and the HST."]
[]
[null,"MONTHLY RATES AND CHARGES – Delivery Component "]
[]
[null,"A Standby Service Charge will be applied for a month where standby power is not provided.  The applicable rate is the approved Distribution Volumetric Rate of the applicable service class and is applied to gross metered demand or contracted amount, whichever is greater.  A monthly administration charge of $200, for simple metering arrangements, or $500, for complex metering arrangements, will also be applied.  "]
[null,"microFIT SERVICE CLASSIFICATION"]
[]
[null,"This classification applies to an electricity generation facility contracted under the Independent Electricity System Operator’s microFIT program and connected to the distributor’s distribution system.  Further servicing details are available in the distributor’s Conditions of Service."]
[]
[null,"APPLICATION"]
[]
[null,"The application of these rates and charges shall be in accordance with the Licence of the Distributor and any Code or Order of the Ontario Energy Board, and amendments thereto as approved by the Ontario Energy Board, which may be applicable to the administration of this schedule."]
[]
[null,"No rates and charges for the distribution of electricity and charges to meet the costs of any work or service done or furnished for the purpose of the distribution of electricity shall be made except as permitted by this schedule, unless required by the Distributor’s Licence or a Code or Order of the Ontario Energy Board, and amendments thereto as approved by the Ontario Energy Board, or as specified herein."]
[]
[null,"Unless specifically noted, this schedule does not contain any charges for the electricity commodity, be it under the Regulated Price Plan, a contract with a retailer or the wholesale market price, as applicable. In addition, the charges in the MONTHLY RATES AND CHARGES - Regulatory Component of this schedule do not apply to a customer that is an embedded wholesale market participant."]
[]
[null,"It should be noted that this schedule does not list any charges, assessments, or credits that are required by law to be invoiced by a distributor and that are not subject to Ontario Energy Board approval, such as the Debt Retirement Charge, the Global Adjustment and the HST."]
[]
[null,"MONTHLY RATES AND CHARGES - Delivery Component"]
[]
[null,"Service Charge","$",5.4]
[]
[]
[]
[]
[null,"ALLOWANCES"]
[]
[null,"Transformer Allowance for Ownership - per kW of billing demand/month","$/kW",-0.4]
[null,"Primary Metering Allowance for transformer losses - applied to measured demand and energy","%",-1]
[]
[null,"SPECIFIC SERVICE CHARGES"]
[]
[null,"APPLICATION"]
[]
[null,"The application of these rates and charges shall be in accordance with the Licence of the Distributor and any Code or Order of the Ontario Energy Board, and amendments thereto as approved by the Ontario Energy Board, which may be applicable to the administration of this schedule."]
[]
[null,"No charges to meet the costs of any work or service done or furnished for the purpose of the distribution of electricity shall be made except as permitted by this schedule, unless required by the Distributor’s Licence or a Code or Order of the Ontario Energy Board, and amendments thereto as approved by the Ontario Energy Board, or as specified herein."]
[]
[null,"It should be noted that this schedule does not list any charges, assessments or credits that are required by law to be invoiced by a distributor and that are not subject to Ontario Energy Board approval, such as the Debt Retirement Charge, the Global Adjustment and the HST."]
[]
[null,"Customer Administration"]
[null,"Arrears Certificate","$",15]
[null,"Request for other billing information","$",15]
[null,"Credit reference/credit check (plus credit agency costs)","$",15]
[null,"Credit reference/credit check (plus credit agency costs – General Service)","$",25]
[null,"Income tax letter","$",15]
[null,"Returned cheque (plus bank charges)","$",12.5]
[null,"Account set up charge/change of occupancy charge (plus credit agency costs if applicable)","$",30]
[null,"Account set up charge/change of occupancy charge (plus credit agency costs if applicable – Residential)","$",20]
[null,"Meter dispute charge plus Measurement Canada fees (if meter found correct)","$ ",10]
[null,"Special meter reads","$",30]
[null,"Interval meter request change","$",40]
[]
[null,"Non-Payment of Account"]
[null,"Late Payment - per month","%",1.5]
[null,"Late Payment - per annum","%",19.559999999999999]
[null,"Collection of account charge – no disconnection","$",9]
[null,"Disconnect/Reconnect at meter - during regular hours","$",20]
[null,"Disconnect/Reconnect at pole - during regular hours","$",185]
[null,"Disconnect/Reconnect at pole - after regular hours","$",415]
[]
[null,"Other"]
[null,"Temporary service install and remove – overhead – no transformer","$",400]
["      Specific Charge for Access to the Power Poles - $/pole/year (with the exception of wireless attachments) - in effect until August 31, 2018",null,"$",22.35]
["      Specific Charge for Access to the Power Poles - $/pole/year (with the exception of wireless attachments) - in effect from September 1, 2018 until December 31, 2018",null,"$",28.09]
["      Specific Charge for Access to the Power Poles - $/pole/year (with the exception of wireless attachments) - in effect from January 1, 2019",null,"$",43.63]
[null,"RETAIL SERVICE CHARGES (if applicable)"]
[]
[null,"The application of these rates and charges shall be in accordance with the Licence of the Distributor and any Code or Order of the Ontario Energy Board, and amendments thereto as approved by the Ontario Energy Board, which may be applicable to the administration of this schedule."]
[]
[null,"No rates and charges for the distribution of electricity and charges to meet the costs of any work or service done or furnished for the purpose of the distribution of electricity shall be made except as permitted by this schedule, unless required by the Distributor’s Licence or a Code or Order of the Ontario Energy Board, and amendments thereto as approved by the Ontario Energy Board, or as specified herein."]
[]
[null,"Unless specifically noted, this schedule does not contain any charges for the electricity commodity, be it under the Regulated Price Plan, a contract with a retailer or the wholesale market price, as applicable."]
[]
[null,"It should be noted that this schedule does not list any charges, assessments, or credits that are required by law to be invoiced by a distributor and that are not subject to Ontario Energy Board approval, such as the Debt Retirement Charge, the Global Adjustment and the HST."]
[]
[null,"Retail Service Charges refer to services provided by a distributor to retailers or customers related to the supply of competitive electricity."]
[null,"One-time charge, per retailer, to establish the service agreement between the distributor and the retailer","$",100]
[null,"Monthly Fixed Charge, per retailer","$",20]
[null,"Monthly Variable Charge, per customer, per retailer","$/cust.",0.5]
[null,"Distributor-consolidated billing monthly charge, per customer, per retailer","$/cust.",0.3]
[null,"Retailer-consolidated billing monthly credit, per customer, per retailer","$/cust.",-0.3]
[null,"Service Transaction Requests (STR)"]
[null,"Request fee, per request, applied to the requesting party","$",0.25]
[null,"Processing fee, per request, applied to the requesting party","$",0.5]
[null,"Request for customer information as outlined in Section 10.6.3 and Chapter 11 of the Retail "]
[null,"Settlement Code directly to retailers and customers, if not delivered electronically through the "]
[null,"Electronic Business Transaction (EBT) system, applied to the requesting party"]
[null,"Up to twice a year","$","no charge"]
[null,"More than twice a year, per request (plus incremental delivery costs)","$",2]
[]
[]
[]
[null,"LOSS FACTORS"]
[]
[null,"If the distributor is not capable of prorating changed loss factors jointly with distribution rates, the revised loss factors will be implemented upon the first subsequent billing for each billing cycle."]
[null,"Total Loss Factor - Secondary Metered Customer < 5,000 kW",null,1.036]
[null,"Total Loss Factor - Secondary Metered Customer > 5,000 kW",null,1.0145]
[null,"Total Loss Factor - Primary Metered Customer < 5,000 kW",null,1.0256000000000001]
[null,"Total Loss Factor - Primary Metered Customer > 5,000 kW",null,1.0044999999999999]

{"sheet":"3. Continuity Schedule","index":4,"n_rows":53,"n_cols":99,"rows_kept":53,"cut":false,"hidden":false,"merged":[[15,4,15,13],[15,14,15,23],[15,24,15,33],[16,24,18,24],[16,25,18,25],[16,26,18,26],[16,15,18,15],[16,16,18,16],[16,17,18,17],[16,23,18,23],[16,9,18,9],[16,10,18,10],[16,11,18,11],[16,12,18,12],[16,13,18,13],[1,2,8,16],[15,34,15,43],[16,14,18,14],[15,54,15,63],[16,32,18,32],[16,33,18,33],[16,34,18,34],[16,35,18,35],[16,36,18,36],[16,37,18,37],[16,39,18,39],[16,40,18,40],[16,41,18,41],[16,50,18,50],[16,42,18,42],[16,43,18,43],[16,53,18,53],[16,54,18,54],[16,45,18,45],[16,46,18,46],[16,47,18,47],[16,48,18,48],[16,49,18,49],[11,2,14,3],[15,88,15,91],[16,2,18,2],[16,3,18,3],[16,4,18,4],[16,5,18,5],[16,6,18,6],[16,7,18,7],[16,8,18,8],[15,44,15,53],[15,64,15,73],[16,64,18,64],[16,65,18,65],[16,18,18,18],[16,19,18,19],[16,20,18,20],[16,21,18,21],[16,22,18,22],[16,44,18,44],[16,38,18,38],[16,27,18,27],[16,28,18,28],[16,29,18,29],[16,30,18,30],[16,31,18,31],[16,89,18,89],[16,90,18,90],[16,91,18,91],[16,92,18,92],[16,93,18,93],[16,51,18,51],[16,52,18,52],[16,56,18,56],[16,55,18,55],[16,73,18,73],[16,88,18,88],[16,57,18,57],[16,58,18,58],[16,59,18,59],[16,60,18,60],[16,61,18,61],[16,62,18,62],[16,67,18,67],[16,68,18,68],[16,69,18,69],[15,84,15,87],[16,84,18,84],[16,85,18,85],[16,86,18,86],[16,87,18,87],[16,63,18,63],[16,70,18,70],[16,71,18,71],[16,72,18,72],[16,66,18,66],[15,74,15,83],[16,74,18,74],[16,75,18,75],[16,76,18,76],[16,77,18,77],[16,78,18,78],[16,79,18,79],[16,80,18,80],[16,81,18,81],[16,82,18,82],[16,83,18,83]]}
["Back to Index","Back to Index",null,null,null,null,null,null,null,null,null,null,null,null,null,null,null,null,null,null,null,null,null,null,null,null,null,null,null,null,null,null,null,null,null,null,null,null,null,null,null,null,null,null,null,null,null,null,null,null,null,null,null,null,null,null,null,null,null,null,null,null,null,null,null,null,null,null,null,null,null,null,null,null,null,null,null,null,null,null,null,null,null,null,null,null,null,null,null,null,null,null,null,null,null,null,null,null,false]
[null,null,{"$f":"+'1. Information Sheet'!B2","v":"INCENTIVE REGULATION MODEL FOR 2019 FILERS"},null,null,null,null,null,null,null,null,null,null,null,null,null,null,null,null,null,null,null,null,null,null,null,null,null,null,null,null,null,null,null,null,null,null,null,null,null,null,null,null,null,null,null,null,null,null,null,null,null,null,null,null,null,null,null,null,null,null,null,null,null,null,null,null,null,null,null,null,null,null,null,null,null,null,null,null,null,null,null,null,null,null,null,null,null,null,null,null,null,null,null,null,null,null,null,false]
[null,null,null,null,null,null,null,null,null,null,null,null,null,null,null,null,null,null,null,null,null,null,null,null,null,null,null,null,null,null,null,null,null,null,null,null,null,null,null,null,null,null,null,null,null,null,null,null,null,null,null,null,null,null,null,null,null,null,null,null,null,null,null,null,null,null,null,null,null,null,null,null,null,null,null,null,null,null,null,null,null,null,null,null,null,null,null,null,null,null,null,null,null,null,null,null,null,null,false]
[null,null,null,null,null,null,null,null,null,null,null,null,null,null,null,null,null,null,null,null,null,null,null,null,null,null,null,null,null,null,null,null,null,null,null,null,null,null,null,null,null,null,null,null,null,null,null,null,null,null,null,null,null,null,null,null,null,null,null,null,null,null,null,null,null,null,null,null,null,null,null,null,null,null,null,null,null,null,null,null,null,null,null,null,null,null,null,null,null,null,null,null,null,null,null,null,null,null,false]
[null,null,null,null,null,null,null,null,null,null,null,null,null,null,null,null,null,null,null,null,null,null,null,null,null,null,null,null,null,null,null,null,null,null,null,null,null,null,null,null,null,null,null,null,null,null,null,null,null,null,null,null,null,null,null,null,null,null,null,null,null,null,null,null,null,null,null,null,null,null,null,null,null,null,null,null,null,null,null,null,null,null,null,null,null,null,null,null,null,null,null,null,null,null,null,null,null,null,false]
[null,null,null,null,null,null,null,null,null,null,null,null,null,null,null,null,null,null,null,null,null,null,null,null,null,null,null,null,null,null,null,null,null,null,null,null,null,null,null,null,null,null,null,null,null,null,null,null,null,null,null,null,null,null,null,null,null,null,null,null,null,null,null,null,null,null,null,null,null,null,null,null,null,null,null,null,null,null,null,null,null,null,null,null,null,null,null,null,null,null,null,null,null,null,null,null,null,null,false]
[null,null,null,null,null,null,null,null,null,null,null,null,null,null,null,null,null,null,null,null,null,null,null,null,null,null,null,null,null,null,null,null,null,null,null,null,null,null,null,null,null,null,null,null,null,null,null,null,null,null,null,null,null,null,null,null,null,null,null,null,null,null,null,null,null,null,null,null,null,null,null,null,null,null,null,null,null,null,null,null,null,null,null,null,null,null,null,null,null,null,null,null,null,null,null,null,null,null,false]
[null,null,null,null,null,null,null,null,null,null,null,null,null,null,null,null,null,null,null,null,null,null,null,null,null,null,null,null,null,null,null,null,null,null,null,null,null,null,null,null,null,null,null,null,null,null,null,null,null,null,null,null,null,null,null,null,null,null,null,null,null,null,null,null,null,null,null,null,null,null,null,null,null,null,null,null,null,null,null,null,null,null,null,null,null,null,null,null,null,null,null,null,null,null,null,null,null,null,false]
[null,null,null,null,null,null,null,null,null,null,null,null,null,null,null,null,null,null,null,null,null,null,null,null,null,null,null,null,null,null,null,null,null,null,null,null,null,null,null,null,null,null,null,null,null,null,null,null,null,null,null,null,null,null,null,null,null,null,null,null,null,null,null,null,null,null,null,null,null,null,null,null,null,null,null,null,null,null,null,null,null,null,null,null,null,null,null,null,null,null,null,null,null,null,null,null,null,null,false]
[null,null,null,null,null,null,null,null,null,null,null,null,null,null,null,null,null,null,null,null,null,null,null,null,null,null,null,null,null,null,null,null,null,null,null,null,null,null,null,null,null,null,null,null,null,null,null,null,null,null,null,null,null,null,null,null,null,null,null,null,null,null,null,null,null,null,null,null,null,null,null,null,null,null,null,null,null,null,null,null,null,null,null,null,null,null,null,null,null,null,null,null,null,null,null,null,null,null,true]
[null,null,null,null,null,null,null,null,null,null,null,null,null,null,null,null,null,null,null,null,null,null,null,null,null,null,null,null,null,null,null,null,null,null,null,null,null,null,null,null,null,null,null,null,null,null,null,null,null,null,null,null,null,null,null,null,null,null,null,null,null,null,null,null,null,null,null,null,null,null,null,null,null,null,null,null,null,null,null,null,null,null,null,null,null,null,null,null,null,null,null,null,null,null,null,null,null,null,true]
[null,null,"Please complete the following continuity schedule for the following Deferral/Variance Accounts.  Enter information into green cells only. Column CE shoudl match the latest 2.1.7 RRR filing.\n\nWhen inputting balances in the continuity schedule, Account 1580 RSVA - Wholesale Market Service Charge is to exclude any amounts relating to CBR. The CBR amounts are to be entered separately in the Class A and Class B 1580 sub-accounts. Only Class B amounts are to be disposed. Class A amounts are not to be disposed.\n\nIf you have received approval to dispose of balances from prior years, the starting point for entries in the schedule below will be the balance sheet date as per your general ledger for which you received approval.  For example, if in the 2016 EDR process (CoS or IRM) you received approval for the December 31, 2014 balances, the starting point for your entries below should be the 2013 year. This will allow for the correct starting point for the 2014 opening balance columns for both principal and interest.\n\nPlease refer to the footnotes for further instructions."]
[]
[]
[]
[null,null,null,null,2010,null,null,null,null,null,null,null,null,null,2011,null,null,null,null,null,null,null,null,null,2012,null,null,null,null,null,null,null,null,null,2013,null,null,null,null,null,null,null,null,null,2014,null,null,null,null,null,null,null,null,null,2015,null,null,null,null,null,null,null,null,null,2016,null,null,null,null,null,null,null,null,null,2017,null,null,null,null,null,null,null,null,null,2018,null,null,null,"Projected Interest on Dec-31-17 Balances",null,null,null,"2.1.7 RRR"]
[null,null,"Account Descriptions","Account Number","Opening Principal Amounts as of Jan 1, 2010","Transactions2 Debit / (Credit) during 2010","OEB-Approved Disposition during 2010","Principal Adjustments1 during 2010","Closing Principal Balance as of Dec 31, 2010","Opening Interest Amounts as of Jan 1, 2010","Interest Jan 1 to Dec 31, 2010","OEB-Approved Disposition during 2010","Interest Adjustments1 during 2010","Closing Interest Amounts as of Dec 31, 2010","Opening Principal Amounts as of Jan 1, 2011","Transactions2 Debit / (Credit) during 2011 ","OEB-Approved Disposition during 2011","Principal Adjustments1 during 2011 ","Closing Principal Balance as of Dec 31, 2011","Opening Interest Amounts as of Jan 1, 2011","Interest Jan 1 to Dec 31, 2011","OEB-Approved Disposition during 2011","Interest Adjustments1 during 2011","Closing Interest Amounts as of Dec 31, 2011","Opening Principal Amounts as of Jan 1, 2012","Transactions2 Debit / (Credit) during 2012","OEB-Approved Disposition during 2012","Principal Adjustments1 during 2012","Closing Principal Balance as of Dec 31, 2012","Opening Interest Amounts as of Jan 1, 2012","Interest Jan 1 to Dec 31, 2012","OEB-Approved Disposition during 2012","Interest Adjustments1 during 2012","Closing Interest Amounts as of Dec 31, 2012","Opening Principal Amounts as of Jan 1, 2013","Transactions2 Debit / (Credit) during 2013","OEB-Approved Disposition during 2013","Principal Adjustments1 during 2013","Closing Principal Balance as of Dec 31, 2013","Opening Interest Amounts as of Jan 1, 2013","Interest Jan 1 to Dec 31, 2013","OEB-Approved Disposition during 2013","Interest Adjustments1 during 2013","Closing Interest Amounts as of Dec 31, 2013","Opening Principal Amounts as of Jan 1, 2014","Transactions2 Debit / (Credit) during 2014","OEB-Approved Disposition during 2014","Principal Adjustments1 during 2014","Closing Principal Balance as of Dec 31, 2014","Opening Interest Amounts as of Jan 1, 2014","Interest Jan 1 to Dec 31. 2014","OEB-Approved Disposition during 2014","Interest Adjustments1 during 2014","Closing Interest Amounts as of Dec 31, 2014","Opening Principal Amounts as of Jan 1, 2015","Transactions2 Debit / (Credit) during 2015","OEB-Approved Disposition during 2015","Principal Adjustments1 during 2015 ","Closing Principal Balance as of Dec 31, 15","Opening Interest Amounts as of Jan 1, 15","Interest Jan 1 to Dec 31, 15","OEB-Approved Disposition during 2015","Interest Adjustments1 during 2015","Closing Interest Amounts as of Dec 31, 15","Opening Principal Amounts as of Jan 1, 2016","Transactions2 Debit / (Credit) during 2016","OEB-Approved Disposition during 2016","Principal Adjustments1 during 2016","Closing Principal Balance as of Dec 31, 16","Opening Interest Amounts as of Jan 1, 16","Interest Jan 1 to Dec 31, 16","OEB-Approved Disposition during 2016","Interest Adjustments1 during 2016","Closing Interest Amounts as of Dec 31, 16","Opening Principal Amounts as of Jan 1, 2017","Transactions2 Debit / (Credit) during 2017","OEB-Approved Disposition during 2017","Principal Adjustments1 during 2017","Closing Principal Balance as of Dec 31, 2017","Opening Interest Amounts as of Jan 1, 2017","Interest Jan 1 to Dec 31, 2017","OEB-Approved Disposition during 2017","Interest Adjustments1 during 2017","Closing Interest Amounts as of Dec 31, 2017","Principal Disposition during 2018 - instructed by OEB","Interest Disposition during 2018 - instructed by OEB","Closing Principal Balances as of Dec 31, 2017 Adjusted for Dispositions during 2018","Closing Interest Balances as of Dec 31, 2017 Adjusted for Disposition in 2018","Projected Interest from January 1, 2018 to December 31, 2018 on December 31, 2017 balance adjusted for disposition during 2019 3","Projected Interest from January 1, 2018 to April 30, 2018 on Dec 31 -16 balance adjusted for disposition during 2017  3","Total Interest","Total Claim","As of Dec 31-17","Variance                           RRR vs. 2017 Balance                        (Principal + Interest)"]
[]
[null,null,null,null,null,null,null,null,null,null,null,null,null,null,null,null,null,null,null,null,null,null,null,null,null,null,null,null,null,null,null,null,null,null,null,null,null,null,null,null,null,null,null,null,null,null,null,null,null,null,null,null,null,null,null,null,null,null,null,null,null,null,null,null,null,null,null,null,null,null,null,null,null,null,null,null,null,null,null,null,null,null,null,null,null,null,null,null,null,null,null,"Claim before Forecasted Transactions"]
[null,null,"Group 1 Accounts"]
[null,null,"LV Variance Account",1550,null,null,null,null,{"$f":"E21+F21-G21+H21","v":0},null,null,null,null,{"$f":"J21+K21-L21+M21","v":0},{"$f":"I21","v":0},null,null,null,{"$f":"O21+P21-Q21+SUM(R21:R21)","v":0},{"$f":"N21","v":0},null,null,null,{"$f":"T21+U21-V21+W21","v":0},null,null,null,null,null,null,null,null,null,null,null,null,null,null,null,null,null,null,null,null,2495672.1800000006,938909.09,1690690.02,null,{"$f":"AS21+AT21-AU21+SUM(AV21:AV21)","v":1743891.2500000005},51131.899999999994,20669.599999999999,41280.14,null,{"$f":"AX21+AY21-AZ21+BA21","v":30521.360000000001},{"$f":"AW21","v":1743891.2500000005},1545686.91,null,null,{"$f":"BC21+BD21-BE21+SUM(BF21:BF21)","v":3289578.16},{"$f":"BB21","v":30521.360000000001},26398.21,null,null,{"$f":"BH21+BI21-BJ21+BK21","v":56919.57},{"$f":"BG21","v":3289578.16},2290281.5499999998,1743890.16,null,{"$f":"BM21+BN21-BO21+SUM(BP21:BP21)","v":3835969.55},{"$f":"BL21","v":56919.57},33128.83,49705.77,null,{"$f":"BR21+BS21-BT21+BU21","v":40342.629999999997},{"$f":"BQ21","v":3835969.55},2379788.37,1545688,null,{"$f":"BW21+BX21-BY21+SUM(BZ21:BZ21)","v":4670069.92},{"$f":"BV21","v":40342.629999999997},42417.74,24215.26,null,{"$f":"CB21+CC21-CD21+CE21","v":58545.11},2290281.5499999998,55806.497853749999,{"$f":"CA21-CG21","v":2379788.37},{"$f":"CF21-CH21","v":2738.6121462500014},{"$f":"(CI21)*((1.5%*25%)+(1.89%*75%))","v":42657.706532249998},null,{"$f":"CJ21+CK21+CL21","v":45396.3186785},{"$f":"SUM(CI21:CL21)","v":2425184.6886785002},4728615.03,{"$f":"CO21-SUM(CA21,CF21)","v":0}]
[null,null,"Smart Metering Entity Charge Variance Account",1551,null,null,null,null,{"$f":"E22+F22-G22+H22","v":0},null,null,null,null,{"$f":"J22+K22-L22+M22","v":0},{"$f":"I22","v":0},null,null,null,0,0,null,null,null,{"$f":"T22+U22-V22+W22","v":0},null,null,null,null,null,null,null,null,null,null,null,null,null,null,null,null,null,null,null,null,-36015.11,-33601.449999999997,null,null,-69616.56,-147.97999999999999,-667.97999999999979,0,null,{"$f":"AX22+AY22-AZ22+BA22","v":-815.95999999999981},-69616.56,-26931.200000000001,null,null,-96547.76,-815.95999999999981,-903.34,null,null,{"$f":"BH22+BI22-BJ22+BK22","v":-1719.2999999999997},{"$f":"BG22","v":-96547.76},-33443.760000000002,-69616.56,null,{"$f":"BM22+BN22-BO22+SUM(BP22:BP22)","v":-60374.959999999992},-1719.2999999999997,-621.30999999999995,-1581.74,null,{"$f":"BR22+BS22-BT22+BU22","v":-758.86999999999966},{"$f":"BQ22","v":-60374.959999999992},-26812.58,-26931.200000000001,null,{"$f":"BW22+BX22-BY22+SUM(BZ22:BZ22)","v":-60256.34},-758.86999999999966,-511.38000000000005,-433.8,null,{"$f":"CB22+CC22-CD22+CE22","v":-836.44999999999982},-33443.759999999995,-904.48314199999959,{"$f":"CA22-CG22","v":-26812.58},{"$f":"CF22-CH22","v":68.033141999999771},{"$f":"(CI22)*((1.5%*25%)+(1.89%*75%))","v":-480.61549650000001},null,{"$f":"CJ22+CK22+CL22","v":-412.58235450000024},{"$f":"SUM(CI22:CL22)","v":-27225.1623545},-61092.79,{"$f":"CO22-SUM(CA22,CF22)","v":0}]
[null,null,"RSVA - Wholesale Market Service Charge",1580,null,null,null,null,{"$f":"E23+F23-G23+H23","v":0},null,null,null,null,{"$f":"J23+K23-L23+M23","v":0},{"$f":"I23","v":0},null,null,null,0,0,null,null,null,{"$f":"T23+U23-V23+W23","v":0},null,null,null,null,null,null,null,null,null,null,null,null,null,null,null,null,null,null,null,null,-14447498.530000001,-1098113.8500000001,-9704806,null,-5840806.3800000008,-303050.23999999999,-35370.699999999997,-236108.65,null,{"$f":"AX23+AY23-AZ23+BA23","v":-102312.29000000001},-5840806.3800000008,-15911140.41,null,null,-21751946.789999999,-102312.29000000001,-126678.56,null,null,{"$f":"BH23+BI23-BJ23+BK23","v":-228990.85},-21751946.789999999,-6868014.8500000006,-5840806.0599999996,null,{"$f":"BM23+BN23-BO23+SUM(BP23:BP23)","v":-22779155.580000002},-228990.85,-231088.58,-166561.26999999999,null,{"$f":"BR23+BS23-BT23+BU23","v":-293518.16000000003},-22779155.580000002,-7283688.9299999997,-15911140.41,null,{"$f":"BW23+BX23-BY23+SUM(BZ23:BZ23)","v":-14151704.100000001},-293518.16000000003,-131490.29999999999,-237452.12,null,{"$f":"CB23+CC23-CD23+CE23","v":-187556.34000000003},-6868015.1700000018,-175054.40282025008,-7283688.9299999997,-12501.937179749948,-130560.12407024999,null,-143062.06124999994,{"$f":"SUM(CI23:CL23)","v":-7426750.99125},-14339260.229999999,0.21000000275671482]
[null,null,"Variance WMS – Sub-account CBR Class A",1580,null,null,null,null,0,null,null,null,null,0,0,null,null,null,0,0,null,null,null,0,null,null,null,null,null,null,null,null,null,null,null,null,null,null,null,null,null,null,null,null,0,null,null,null,0,0,null,null,null,0,0,163061.35,null,null,{"$f":"BC24+BD24-BE24+SUM(BF24:BF24)","v":163061.35},0,520.61,null,null,520.61,163061.35,-163061.35,null,null,{"$f":"BM24+BN24-BO24+SUM(BP24:BP24)","v":0},520.61,-520.61,null,null,0,0,null,null,null,{"$f":"BW24+BX24-BY24+SUM(BZ24:BZ24)","v":0},0,null,null,null,0,0,0,0,0,0,null,0,0,0,0]
[null,null,"Variance WMS – Sub-account CBR Class B",1580,null,null,null,null,0,null,null,null,null,0,0,null,null,null,0,0,null,null,null,0,null,null,null,null,null,null,null,null,null,null,null,null,null,null,null,null,null,null,null,null,0,null,null,null,0,0,null,null,null,0,0,1719663.73,null,null,1719663.73,0,5728.32,null,null,5728.32,1719663.73,-275214.3,null,null,{"$f":"BM25+BN25-BO25+SUM(BP25:BP25)","v":1444449.43},5728.32,16472.099999999999,null,null,22200.42,1444449.43,35171.080000000075,1719663.73,null,{"$f":"BW25+BX25-BY25+SUM(BZ25:BZ25)","v":-240043.21999999997},22200.42,-2176.9000000000015,24644.62,null,-4621.1000000000022,-275214.30000000005,-7212.2877475000014,35171.080000000075,2591.1877474999992,630.44160900000134,null,3221.6293565000005,38392.709356500076,-244664.32000000001,0]
[null,null,"RSVA - Retail Transmission Network Charge",1584,null,null,null,null,0,null,null,null,null,0,0,null,null,null,0,0,null,null,null,0,null,null,null,null,null,null,null,null,null,null,null,null,null,null,null,null,null,null,null,null,5108991.5599999996,2422342.59,1692260,null,5839074.1499999994,48925.099999999984,71423.27,27552.22,null,92796.15,5839074.1499999994,-1557809.05,null,null,4281265.0999999996,92796.15,61504.020000000004,null,null,154300.16999999998,4281265.0999999996,-568200.56000000006,5839073.9800000004,null,-2126009.4400000009,154300.16999999998,-7166.82,157025.1,null,-9891.7500000000291,-2126009.4400000009,1964322.9400000002,-1557808.05,null,1396121.5499999993,-9891.7500000000291,-4203.1600000000017,-19861.830000000002,null,5766.919999999971,-568201.39000000013,125.98946824999621,1964322.9399999995,5640.9305317499748,35210.488699499991,null,40851.419231249965,2005174.3592312494,1401888.43,-3.9999999338760972E-2]
[null,null,"RSVA - Retail Transmission Connection Charge",1586,null,null,null,null,0,null,null,null,null,0,0,null,null,null,0,0,null,null,null,0,null,null,null,null,null,null,null,null,null,null,null,null,null,null,null,null,null,null,null,null,1710896.75,2297463.04,1028939,null,2979420.79,14045.729999999992,28329.71,10695.4,null,31680.039999999986,2979420.79,593534.94000000006,null,null,3572955.73,31680.039999999986,38091.94,null,null,69771.979999999981,3572955.73,333841.02,2979420.24,null,927376.50999999978,69771.979999999981,15523.13,64454.46,null,20840.649999999987,927376.50999999978,48373.089999999967,593534.93999999994,null,382214.6599999998,20840.649999999987,9516.9599999999991,11846.41,null,18511.199999999986,333841.56999999983,14778.040860249979,48373.089999999967,3733.1591397500069,867.08763824999937,null,4600.2467780000061,52973.336777999975,400726.1,0.24000000016530976]
[null,null,"RSVA - Power",1588,null,null,null,null,0,null,null,null,null,0,0,null,null,null,0,0,null,null,null,0,null,null,null,null,null,null,null,null,null,null,null,null,null,null,null,null,null,null,null,null,-1143566.33,-490296.98,716650,null,-2350513.31,-36783.460000000006,2506.5100000000002,-7074.25,null,-27202.700000000004,-2350513.31,1362015.65,null,null,-988497.66000000015,-27202.700000000004,-33475.46,null,null,-60678.16,-988497.66000000015,-2851171.44,-2350512.34,2500544.2639378831,1011387.5039378828,-60678.16,-6630.11,-53059.35,null,-14248.920000000006,1011387.5039378828,1318484.74,1362015.65,-998800.96393788327,{"$f":"BW28+BX28-BY28+BZ28","v":-30944.370000000577},-14248.920000000006,-23231.5,7363.36,null,-44843.780000000006,-350628.14606211707,-27686.914780526178,319683.77606211649,-17156.865219473828,5730.3316859134384,null,-11426.533533560389,308257.24252855609,-1577531.48,{"$f":"CO28-SUM(CA28,CF28)","v":-1501743.3299999994}]
[null,null,"RSVA - Global Adjustment",1589,null,null,null,null,0,null,null,null,null,0,0,null,null,null,0,0,null,null,null,0,null,null,null,null,null,null,null,null,null,null,null,null,null,null,null,null,null,null,null,null,389458.42999999854,7999425.6600000001,-2771959,null,11160843.089999998,-20702.900000000009,59398.74,-101964.8,null,140660.63999999998,11160843.089999998,4890995.04,null,null,16051838.129999999,140660.63999999998,139600.71,null,null,280261.34999999998,16051838.129999999,-1033668.01,11160843.08,{"$f":"-2514038+157273+1530001","v":-826764},3030563.0399999991,280261.34999999998,96150.64,263430.19,null,112981.79999999999,3030563.0399999991,2524883.15,4890994.04,2871035.0510674599,{"$f":"BW29+BX29-BY29+SUM(BZ29:BZ29)","v":3535487.2010674593},112981.79999999999,17845.330000000009,70633.100000000006,null,60194.03,-1860431,10116.728484999992,5395918.2010674588,50077.301515000006,96721.833754134204,null,146799.13526913422,5542717.3363365931,1551409.45,-2044271.7810674591]
[null,null,"Disposition and Recovery/Refund of Regulatory Balances (2009)4",1595,null,null,null,null,0,null,null,null,null,0,0,null,null,null,0,0,null,null,null,0,null,null,null,null,null,null,null,null,null,null,null,null,null,null,null,null,null,null,null,null,-2807103.74,null,-2805249,1855,0.25999999977648258,-192718.47000000009,null,-192712,6,-0.47000000008847564,0.25999999977648258,null,null,null,0.25999999977648258,-0.47000000008847564,null,null,null,-0.47000000008847564,0.25999999977648258,null,null,null,0.25999999977648258,-0.47000000008847564,null,null,null,-0.47000000008847564,0.25999999977648258,null,null,null,0.25999999977648258,-0.47000000008847564,null,null,null,-0.47000000008847564,0,-0.46549550009234808,0.25999999977648258,-4.5044999961275645E-3,4.6604999959934503E-3,null,1.5599999986588581E-4,{"$f":"IF(CD30=0,IF(SUM(CG30:CH30)=0,SUM(CI30:CL30),0),SUM(CI30:CL30))","v":0},0,0.21000000031199306]
[null,null,"Disposition and Recovery/Refund of Regulatory Balances (2010)4",1595,null,null,null,null,0,null,null,null,null,0,0,null,null,null,0,0,null,null,null,0,null,null,null,null,null,null,null,null,null,null,null,null,null,null,null,null,null,null,null,null,-3681076.9700000025,1560914.15,null,null,-2120162.8200000026,-653022.51,3820.1399999999994,null,null,-649202.37,-2120162.8200000026,961.36,null,null,-2119201.4600000028,-649202.37,-25253.91,null,null,-674456.28,-2119201.4600000028,-961.36,-2120162.8199999998,null,-2.7939677238464355E-9,-674456.28,1932.12,-672524.15999999992,null,-1.1641532182693481E-10,-2.7939677238464355E-9,null,null,null,-2.7939677238464355E-9,-1.1641532182693481E-10,null,null,null,-1.1641532182693481E-10,0,-1.648208126425743E-10,-2.7939677238464355E-9,4.840549081563949E-11,-5.008187144994736E-11,null,-1.6763806343078706E-12,0,0,2.9103830456733704E-9]
[null,null,"Disposition and Recovery/Refund of Regulatory Balances (2011)4",1595,null,null,null,null,0,null,null,null,null,0,0,null,null,null,{"$f":"O32+P32-Q32+SUM(R32:R32)","v":0},0,null,null,null,0,null,null,null,null,null,null,null,null,null,null,null,null,null,null,null,null,null,null,null,null,2675,378.82,null,null,3053.82,-5660,23.5,null,null,-5636.5,3053.82,45.52,null,null,3099.34,-5636.5,25.49,null,null,-5611.01,3099.34,-45.519999999999996,3053.63,null,0.19000000000005457,-5611.01,8.6,-5602.41,null,0,0.19000000000005457,null,null,null,0.19000000000005457,0,null,null,null,0,-2.7939677238464355E-9,3.2917500000009454E-3,0.19000000279402229,-3.2917500000009454E-3,3.4057500500828497E-3,null,1.1400005008190429E-4,0,0,-0.19000000000005457]
[null,null,"Disposition and Recovery/Refund of Regulatory Balances (2012)4",1595,null,null,null,null,0,null,null,null,null,0,0,null,null,null,0,0,null,null,null,0,null,null,null,null,null,null,null,null,null,null,null,null,null,null,null,null,null,null,null,null,0,9885176.9800000004,10153475,null,-268298.01999999955,0,383549.67000000004,458332.08,null,-74782.409999999974,-268298.01999999955,-5335.64,null,null,-273633.65999999957,-74782.409999999974,-2969.19,null,null,-77751.599999999977,-273633.65999999957,5335.64,-268298.02,null,4.6566128730773926E-10,-77751.599999999977,17.910000000000025,-77733.69,null,2.9103830456733704E-11,4.6566128730773926E-10,null,null,null,4.6566128730773926E-10,2.9103830456733704E-11,null,null,null,2.9103830456733704E-11,0.19000000000005457,3.717141225934029E-11,-0.18999999953439328,-8.0675818026065859E-12,-3.4057499916539994E-3,null,-3.4057499997215811E-3,0,0,-4.9476511776447296E-10]
[null,null,"Disposition and Recovery/Refund of Regulatory Balances (2013)4",1595,null,null,null,null,0,null,null,null,null,0,0,null,null,null,0,0,null,null,null,0,null,null,null,null,null,null,null,null,null,null,null,null,null,null,null,null,null,null,null,null,0,null,null,null,0,0,null,null,null,0,0,null,null,null,0,0,null,null,null,0,0,null,null,null,0,0,null,null,null,0,0,null,null,null,0,0,null,null,null,0,4.6566128730773926E-10,0,-4.6566128730773926E-10,0,-8.3469785749912262E-12,null,-8.3469785749912262E-12,0,0,0]
[null,null,"Disposition and Recovery/Refund of Regulatory Balances (2016)4",1595,null,null,null,null,{"$f":"E35+F35-G35+H35","v":0},null,null,null,null,{"$f":"J35+K35-L35+M35","v":0},{"$f":"I35","v":0},null,null,null,{"$f":"O35+P35-Q35+SUM(R35:R35)","v":0},{"$f":"N35","v":0},null,null,null,{"$f":"T35+U35-V35+W35","v":0},null,null,null,null,null,null,null,null,null,null,null,null,null,null,null,null,null,null,null,null,0,null,null,null,{"$f":"AS35+AT35-AU35+SUM(AV35:AV35)","v":0},0,null,null,null,{"$f":"AX35+AY35-AZ35+BA35","v":0},{"$f":"AW35","v":0},null,null,null,{"$f":"BC35+BD35-BE35+SUM(BF35:BF35)","v":0},{"$f":"BB35","v":0},null,null,null,{"$f":"BH35+BI35-BJ35+BK35","v":0},{"$f":"BG35","v":0},-11165511,-11106926.08,null,{"$f":"BM35+BN35-BO35+SUM(BP35:BP35)","v":-58584.919999999925},{"$f":"BL35","v":0},494808.82,441505.89,null,{"$f":"BR35+BS35-BT35+BU35","v":53302.929999999993},{"$f":"BQ35","v":-58584.919999999925},-13770.65,null,null,{"$f":"BW35+BX35-BY35+SUM(BZ35:BZ35)","v":-72355.56999999992},{"$f":"BV35","v":53302.929999999993},{"$f":"-768.09+85.29","v":-682.80000000000007},null,null,{"$f":"CB35+CC35-CD35+CE35","v":52620.12999999999},-58584.919999999925,52287.946260999997,{"$f":"CA35-CG35","v":-13770.649999999994},{"$f":"CF35-CH35","v":332.18373899999278},{"$f":"(CI35)*((1.5%*25%)+(1.89%*75%))","v":-246.83890124999991},null,{"$f":"CJ35+CK35+CL35","v":85.344837749992877},0,-19735.440000000002,{"$f":"CO35-SUM(CA35,CF35)","v":-7.2759576141834259E-11}]
[null,null,"Disposition and Recovery/Refund of Regulatory Balances (2017)4\nNot to be disposed of unless rate rider has expired and balance has been audited",1595,null,null,null,null,{"$f":"E36+F36-G36+H36","v":0},null,null,null,null,{"$f":"J36+K36-L36+M36","v":0},{"$f":"I36","v":0},null,null,null,{"$f":"O36+P36-Q36+SUM(R36:R36)","v":0},{"$f":"N36","v":0},null,null,null,{"$f":"T36+U36-V36+W36","v":0},null,null,null,null,null,null,null,null,null,null,null,null,null,null,null,null,null,null,null,null,0,null,null,null,{"$f":"AS36+AT36-AU36+SUM(AV36:AV36)","v":0},0,null,null,null,{"$f":"AX36+AY36-AZ36+BA36","v":0},{"$f":"AW36","v":0},null,null,null,{"$f":"BC36+BD36-BE36+SUM(BF36:BF36)","v":0},{"$f":"BB36","v":0},null,null,null,{"$f":"BH36+BI36-BJ36+BK36","v":0},{"$f":"BG36","v":0},null,null,null,{"$f":"BM36+BN36-BO36+SUM(BP36:BP36)","v":0},{"$f":"BL36","v":0},null,null,null,{"$f":"BR36+BS36-BT36+BU36","v":0},{"$f":"BQ36","v":0},7385427.3099999996,7383983.2999999998,null,{"$f":"BW36+BX36-BY36+SUM(BZ36:BZ36)","v":1444.0099999997765},{"$f":"BV36","v":0},{"$f":"-39330.18+118856.39","v":79526.209999999992},119045,null,{"$f":"CB36+CC36-CD36+CE36","v":-39518.790000000008},null,0,{"$f":"CA36-CG36","v":1444.0099999997765},{"$f":"CF36-CH36","v":-39518.790000000008},{"$f":"(CI36)*((1.5%*25%)+(1.89%*75%))","v":25.883879249995992},null,{"$f":"CJ36+CK36+CL36","v":-39492.906120750013},0,-38074.78,{"$f":"CO36-SUM(CA36,CF36)","v":2.3283064365386963E-10}]
[]
[null,null,{"$f":"C29","v":"RSVA - Global Adjustment"},1589,{"$f":"E29","v":0},0,0,0,0,0,0,0,0,0,0,0,0,0,0,0,0,0,0,0,null,null,null,null,null,null,null,null,null,null,null,null,null,null,null,null,null,null,null,null,{"$f":"AS29","v":389458.42999999854},7999425.6600000001,-2771959,0,11160843.089999998,-20702.900000000009,59398.74,-101964.8,0,140660.63999999998,11160843.089999998,4890995.04,0,0,16051838.129999999,140660.63999999998,139600.71,0,0,280261.34999999998,16051838.129999999,-1033668.01,11160843.08,-826764,3030563.0399999991,280261.34999999998,96150.64,263430.19,0,112981.79999999999,3030563.0399999991,2524883.15,{"$f":"BY29","v":4890994.04},2871035.0510674599,3535487.2010674593,112981.79999999999,17845.330000000009,70633.100000000006,0,60194.03,-1860431,10116.728484999992,5395918.2010674588,50077.301515000006,96721.833754134204,0,146799.13526913422,5542717.3363365931,1551409.45,-2044271.7810674591]
[null,null,"Total Group 1 Balance excluding Account 1589 - Global Adjustment",null,{"$f":"SUM(E21:E35)-E29","v":0},0,0,0,0,0,0,0,0,0,0,0,0,0,0,0,0,0,0,0,null,null,null,null,null,null,null,null,null,null,null,null,null,null,null,null,null,null,null,null,{"$f":"SUM(AS21:AS36)-AS29","v":-12797025.190000003},15483172.390000001,2771959.0199999996,1855,-83956.820000002161,-1077279.9300000002,474283.72,101964.94000000002,6,-704955.15000000014,-83956.820000002161,-12116246.84,0,0,-12200203.660000002,-704955.15000000014,-57011.87000000001,0,0,-761967.02000000014,-12200203.660000002,-19296165.929999996,-11190883.869999999,2500544.2639378831,-17804941.456062123,-761967.02000000014,315864.08,-264371.39999999985,0,-181731.54000000027,-17804941.456062123,5807295.370000001,{"$f":"SUM(BY21:BY36)-BY29","v":-4890994.04},-998800.96393788327,-8105453.0100000072,-181731.54000000027,-30835.130000000012,-70633.100000000006,0,-141933.5700000003,-5529964.3760621212,-87860.076250776474,-2575488.6339378841,-54073.493749223759,-46165.633763336577,0,-100239.12751256037,-2623993.8170316946,-9749129.4800000004,-1501742.8999999927]
[null,null,"Total Group 1 Balance",null,{"$f":"SUM(E38,E39)","v":0},{"$f":"SUM(F38,F39)","v":0},0,0,0,0,0,0,0,0,0,{"$f":"SUM(P38,P39)","v":0},{"$f":"SUM(Q38,Q39)","v":0},0,0,0,0,0,0,0,null,null,null,null,null,null,null,null,null,null,null,null,null,null,null,null,null,null,null,null,{"$f":"SUM(AS38,AS39)","v":-12407566.760000005},23482598.050000001,1.9999999552965164E-2,1855,11076886.269999996,-1097982.83,533682.46,0.14000000001396984,6,-564294.51000000013,11076886.269999996,-7225251.7999999998,0,0,3851634.4699999969,-564294.51000000013,82588.839999999982,0,0,-481705.67000000016,3851634.4699999969,-20329833.939999998,-30040.789999999106,1673780.2639378831,-14774378.416062124,-481705.67000000016,412014.72000000003,-941.20999999984633,0,-68749.740000000282,{"$f":"SUM(BW38,BW39)","v":-14774378.416062124},8332178.5200000014,0,1872234.0871295766,-4569965.8089325484,-68749.740000000282,-12989.800000000003,0,0,-81739.540000000299,-7390395.3760621212,-77743.347765776474,2820429.5671295747,-3996.1922342237522,50556.199990797628,0,46560.007756573847,{"$f":"SUM(CN38,CN39)","v":2918723.5193048986},{"$f":"SUM(CO38,CO39)","v":-8197720.0300000003},-3546014.6810674518]
[]
[29,null,"LRAM Variance Account (only input amounts if applying for disposition of this account)",1568,null,null,null,null,null,null,null,null,null,null,null,null,null,null,{"$f":"O42+P42-Q42+SUM(R42:R42)","v":0},null,null,null,null,{"$f":"T42+U42-V42+W42","v":0},null,null,null,null,null,null,null,null,null,null,null,null,null,null,null,null,null,null,null,null,61418.660000000091,12856.94000000009,null,null,{"$f":"AS42+AT42-AU42+SUM(AV42:AV42)","v":74275.60000000018},5868.05,688.52999999999975,null,null,{"$f":"AX42+AY42-AZ42+BA42","v":6556.58},{"$f":"AW42","v":74275.60000000018},{"$f":"2209737.02","v":2209737.02},null,null,{"$f":"BC42+BD42-BE42+SUM(BF42:BF42)","v":2284012.62},{"$f":"BB42","v":6556.58},{"$f":"63436.96","v":63436.959999999999},null,null,{"$f":"BH42+BI42-BJ42+BK42","v":69993.539999999994},{"$f":"BG42","v":2284012.62},{"$f":"1131354.02","v":1131354.02},null,null,{"$f":"BM42+BN42-BO42+SUM(BP42:BP42)","v":3415366.64},{"$f":"BL42","v":69993.539999999994},{"$f":"29554.8","v":29554.799999999999},null,null,{"$f":"BR42+BS42-BT42+BU42","v":99548.34},{"$f":"BQ42","v":3415366.64},2243433.8600000008,null,null,{"$f":"BW42+BX42-BY42+SUM(BZ42:BZ42)","v":5658800.5000000009},{"$f":"BV42","v":99548.34},45357.110000000008,null,null,{"$f":"CB42+CC42-CD42+CE42","v":144905.45000000001},3415366.64,158719.56703800001,{"$f":"CA42-CG42","v":2243433.8600000008},{"$f":"CF42-CH42","v":-13814.117037999997},{"$f":"(CI42)*((1.5%*25%)+(1.89%*75%))","v":40213.551940500016},null,{"$f":"CJ42+CK42+CL42","v":26399.434902500019},{"$f":"SUM(CI42:CL42)","v":2269833.2949025007},5803705.9500000002,0]
[]
[null,null,"Total including Account 1568",null,{"$f":"SUM(E40,E42)","v":0},{"$f":"SUM(F40,F42)","v":0},0,0,0,0,0,0,0,0,0,0,0,0,0,0,0,0,0,0,null,null,null,null,null,null,null,null,null,null,null,null,null,null,null,null,null,null,null,null,{"$f":"SUM(AS40,AS42)","v":-12346148.100000005},23495454.990000002,1.9999999552965164E-2,1855,11151161.869999995,-1092114.78,534370.99,0.14000000001396984,6,-557737.93000000017,11151161.869999995,-5015514.7799999993,0,0,6135647.0899999971,-557737.93000000017,146025.79999999999,0,0,-411712.13000000018,6135647.0899999971,-19198479.919999998,-30040.789999999106,1673780.2639378831,-11359011.776062123,-411712.13000000018,441569.52,-941.20999999984633,0,30798.599999999715,{"$f":"SUM(BW40,BW42)","v":-11359011.776062123},10575612.380000003,0,1872234.0871295766,1088834.6910674525,30798.599999999715,32367.310000000005,0,0,63165.909999999712,-3975028.7360621211,80976.219272223534,5063863.427129576,-17810.309272223749,90769.751931297651,{"$f":"SUM(CL40,CL42)","v":0},{"$f":"SUM(CM40,CM42)","v":72959.442659073859},{"$f":"SUM(CN40,CN42)","v":5188556.8142073993},{"$f":"SUM(CO40,CO42)","v":-2394014.08},{"$f":"SUM(CP40,CP42)","v":-3546014.6810674518}]
[]
[]
[null,null,"For all OEB-Approved dispositions, please ensure that the disposition amount has the same sign (e.g: debit balances are to have a positive figure and credit balance are to have a negative figure) as per the related OEB decision."]
[null,null,null,null,null,null,null,null,null,null,null,null,null,null,null,null,null,null,null,null,null,null,null,null,null,null,null,null,null,null,null,null,null,null,null,null,null,null,null,null,null,null,null,null,null,null,null,null,null,null,null,null,null,null,null,null,null,null,null,null,null,null,null,null,null,null,null,null,null,null,null,null,null,null,null,null,null,null,{"$f":"+CA40+CF40","v":-4651705.3489325484}]
[null,null,null,null,null,null,null,null,null,null,null,null,null,null,null,null,null,null,null,null,null,null,null,null,null,null,null,null,null,null,null,null,null,null,null,null,null,null,null,null,null,null,null,null,null,null,null,null,null,null,null,null,null,null,null,null,null,null,null,null,null,null,null,null,null,null,null,null,null,null,null,null,null,null,null,null,null,null,{"$f":"+CP28+CP29","v":-3546015.1110674585}]
[null,1,"Please provide explanations for the nature of the adjustments.  If the adjustment relates to previously OEB-Approved disposed balances, please provide amounts for adjustments and include supporting documentations.",null,null,null,null,null,null,null,null,null,null,null,null,null,null,null,null,null,null,null,null,null,null,null,null,null,null,null,null,null,null,null,null,null,null,null,null,null,null,null,null,null,null,null,null,null,null,null,null,null,null,null,null,null,null,null,null,null,null,null,null,null,null,null,null,null,null,null,null,null,null,null,null,null,null,null,{"$f":"+CA48+CA49","v":-8197720.4600000065}]
[null,2,"For RSVA accounts only, report the net variance to the account during the year.  For all other accounts, record the transactions during the year."]
[null,3,"If the LDC’s rate year begins on January 1, 2017, the projected interest is recorded from January 1, 2016 to December 31, 2016 on the December 31, 2015 balances adjusted for the disposed balances approved by the OEB in the 2016 rate decision.  If the LDC’s rate year begins on May 1, 2017, the projected interest is recorded from January 1, 2016 to April 30, 2017 on the December 31, 2015 balances adjusted for the disposed interest balances approved by the OEB in the 2016 rate decision."]
[null,4,"Include Account 1595 as part of Group 1 accounts (lines 30-36) for review and disposition if the recovery (or refund) period has been completed. If the recovery (or refund) period has not been completed, do not include the respective balance in Account 1595 for disposition at this time."]

{"sheet":"4. Billing Det. for Def-Var","index":5,"n_rows":61,"n_cols":21,"rows_kept":61,"cut":false,"hidden":false,"merged":[[14,4,15,4],[14,5,15,5],[14,6,15,6],[13,11,13,18],[1,1,8,15],[14,7,15,7],[14,8,15,8],[12,1,12,7],[13,3,13,8],[14,3,15,3],[46,9,47,9],[46,10,47,10],[44,1,44,7],[45,3,45,8],[46,3,47,3],[46,4,47,4],[46,5,47,5],[46,6,47,6],[46,7,47,7],[46,8,47,8],[31,17,31,19],[32,17,32,20],[14,9,15,9],[14,19,15,19],[14,18,15,18],[14,20,15,20],[14,10,15,10],[14,11,15,11],[14,12,15,12],[14,13,15,13],[14,14,15,14],[14,15,15,15],[14,16,15,16],[14,17,15,17]]}
["Back to Index",null,null,null,null,null,null,null,null,null,"Yes",null,null,null,null,null,null,null,null,{"$f":"IF(D18=\"YES\", \"YES\", \"NO\")","v":"NO"}]
[null,{"$f":"+'1. Information Sheet'!B2","v":"INCENTIVE REGULATION MODEL FOR 2019 FILERS"}]
[]
[]
[]
[]
[]
[]
[]
[]
[]
[]
[null,"Information from the most recent RRR (2017 for 2019 IRM)"]
[null,null,null,null,null,null,null,null,null,null,null,"Approved Recoveries (class allocation %)"]
[null,null,null,"Total Metered kWh","Total Metered kW","Metered kWh for Non-RPP Customers","Metered kW for Non-RPP Customers","Metered kWh for Wholesale Market Participants (WMP)","Metered kW for Wholesale Market Participants (WMP)","Total Metered kWh less WMP consumption\n(if applicable)","Total Metered kW less WMP consumption \n(if applicable)","1595 Recovery Proportion (2009) 1","1595 Recovery Proportion (2010) 1","1595 Recovery Proportion (2011) 1","1595 Recovery Proportion (2012) 1","1595 Recovery Proportion (2013) 1","1595 Recovery Proportion (2014) 1","1595 Recovery Proportion (2015) 1","1595 Recovery Proportion (2017) 1","1568 LRAM Variance Account Class Allocation                           ($ amounts)","Number of Customers for Residential and GS<50 classes3"]
[null,"Rate Class","Unit"]
[null,{"$f":"'Model Specs'!C15","v":"RESIDENTIAL SERVICE CLASSIFICATION"},"kWh",1440461108.0256596,null,51296782.133204632,null,null,null,{"$f":"D17-H17","v":1440461108.0256596},{"$f":"E17-I17","v":0},null,null,null,null,null,4.2831737001724511E-2,0.32918845870239549,0.20484924659696371,218927.77579604124,183145]
[null,{"$f":"'Model Specs'!C16","v":"GENERAL SERVICE LESS THAN 50 kW SERVICE CLASSIFICATION"},"kWh",618679646.43210387,null,97698580.231660247,null,null,null,{"$f":"D18-H18","v":618679646.43210387},{"$f":"E18-I18","v":0},null,null,null,null,null,3.667843854000144E-2,0.13106269284318098,9.0362231025399808E-2,124808.17364371811,18413]
[null,{"$f":"'Model Specs'!C17","v":"GENERAL SERVICE 50 to 499 kW SERVICE CLASSIFICATION"},"kW",1993768779.4230022,5780039.1019777982,1685784807.8789868,4933988.7919777986,2122220.82007722,6656.9,1991646558.6029251,{"$f":"E19-I19","v":5773382.2019777978},null,null,null,null,null,0.41382971137386221,0.17497138828089531,0.29305621790938335,1127412.1685423229]
[null,{"$f":"'Model Specs'!C18","v":"GENERAL SERVICE 500 to 4,999 kW SERVICE CLASSIFICATION"},"kW",2006067809.7416933,4610762.3348864596,1846972865.0954366,4271783.4748864593,15026690.447415058,28831.62,1991041119.2942781,4581930.7148864595,null,null,null,null,null,0.48383786561406839,0.15485395423253379,0.2773941628225613,346857.96314251533]
[null,{"$f":"'Model Specs'!C19","v":"LARGE USE SERVICE CLASSIFICATION"},"kW",981267691.25849652,1753815.618647513,981267691.25849652,1753815.618647513,null,null,981267691.25849652,1753815.618647513,null,null,null,null,null,1.3570457298951785E-2,0.20618059253596072,0.12936296658084911,112182.34017515008]
[null,{"$f":"'Model Specs'!C20","v":"STANDBY POWER SERVICE CLASSIFICATION "},"kW",null,null,null,null,null,null,0,0,null,null,null,null,null,null,null,0]
[null,{"$f":"'Model Specs'!C21","v":"UNMETERED SCATTERED LOAD SERVICE CLASSIFICATION"},"kWh",11421124.458372911,null,586174.66216216213,null,null,null,11421124.458372911,0,null,null,null,null,null,4.1083640846538411E-4,2.3902169950551478E-3,1.4926994947915366E-3]
[null,{"$f":"'Model Specs'!C22","v":"STREET LIGHTING SERVICE CLASSIFICATION"},"kW",14875866.197228426,41239.546182825972,14875866.197228426,41239.546182825972,null,null,14875866.197228426,41239.546182825972,null,null,null,null,null,8.8409537629261983E-3,1.3526964099785945E-3,3.4824755700509865E-3,-156329.03734753683]
[null,null,null,null,null,null,null,null,null,0,0]
[null,null,null,null,null,null,null,null,null,0,0]
[null,null,null,null,null,null,null,null,null,0,0]
[null,null,null,null,null,null,null,null,null,0,0]
[null,null,"Total",{"$f":"SUM(D17:D28)","v":7066542025.5365572},{"$f":"SUM(E17:E28)","v":12185856.601694595},4678482767.4571753,11000827.431694597,17148911.267492279,35488.519999999997,7049393114.2690649,12150368.081694596,0,0,0,0,0,0.99999999999999989,1,1,1773859.3839522109,201558]
[]
[]
[null,"Threshold Test",null,null,null,null,null,null,null,null,null,null,null,null,null,null,null,"1568 Account Balance from Continuity Schedule",null,null,{"$f":"'3. Continuity Schedule'!CN42","v":2269833.2949025007}]
[null,"Total Claim (including Account 1568)",null,{"$f":"'3. Continuity Schedule'!CN44","v":5188556.8142073993},null,null,null,null,null,null,null,null,null,null,null,null,null,{"$f":"IF(U32=T29,\"Total Balance of Account 1568 in Column R matches the amount entered on the Continuity Schedule\",\"Total Balance of Account 1568 in Column T DOES NOT MATCH the amount entered on the Continuity Schedule\")","v":"Total Balance of Account 1568 in Column T DOES NOT MATCH the amount entered on the Continuity Schedule"}]
[null,"Total Claim for Threshold Test (All Group 1 Accounts)",null,{"$f":"'3. Continuity Schedule'!CN40","v":2918723.5193048986}]
[null,"Threshold Test (Total claim per kWh) 2",null,{"$f":"IFERROR(D34/D29,\"\")","v":4.130341981633205E-4}]
[null,"Exceeds Threshold?",null,{"$f":"IF(D35=\"\",\"\",IF(OR(D35>0.001,D35<-0.001),\"Yes\",\"No\"))","v":"No"}]
[null,"ELECT TO DISPOSE of the Group 1 Account Balances?",null,"Yes"]
[]
[]
[null,"As per Section 3.2.5 of the 2017 Filing Requirements for Electricity Distribution Rate Applications, an applicant may elect to dispose of the Group 1 account balances below the threshold. "]
[null,"1 Residual Account balance to be allocated to rate classes in proportion to the recovery share as established when rate riders were implemented."]
[null,"2 The Threshold Test does not include the amount in 1568."]
[null,"3 The proportion of customers for the Residential and GS<50 Classes will be used to allocate Account 1551."]
[]
[null,"Information from the 2015 RRR"]
[]
[null,null,null,"Total Metered kWh","Total Metered kW","Metered kWh for Non-RPP Customers","Metered kW for Non-RPP Customers","Metered kWh for Wholesale Market Participants (WMP)","Metered kW for Wholesale Market Participants (WMP)","Total Metered kWh less WMP consumption\n(if applicable)","Total Metered kW less WMP consumption \n(if applicable)"]
[null,"Rate Class","Unit"]
[null,{"$f":"B17","v":"RESIDENTIAL SERVICE CLASSIFICATION"},"kWh",null,null,null,null,null,null,{"$f":"D49-H49","v":0},{"$f":"E49-I49","v":0}]
[null,{"$f":"B18","v":"GENERAL SERVICE LESS THAN 50 kW SERVICE CLASSIFICATION"},"kWh",null,null,null,null,null,null,{"$f":"D50-H50","v":0},{"$f":"E50-I50","v":0}]
[null,"GENERAL SERVICE 50 to 499 kW SERVICE CLASSIFICATION","kW",null,null,null,null,null,null,0,{"$f":"E51-I51","v":0}]
[null,"GENERAL SERVICE 500 to 4,999 kW SERVICE CLASSIFICATION","kW",null,null,null,null,null,null,0,{"$f":"E52-I52","v":0}]
[null,"LARGE USE SERVICE CLASSIFICATION","kWh",null,null,null,null,null,null,0,0]
[null,"STANDBY POWER SERVICE CLASSIFICATION ","kW",null,null,null,null,null,null,0,0]
[null,"UNMETERED SCATTERED LOAD SERVICE CLASSIFICATION","kW",null,null,null,null,null,null,0,0]
[null,"STREET LIGHTING SERVICE CLASSIFICATION","kW",null,null,null,null,null,null,0,0]
[null,0,"kWh",null,null,null,null,null,null,0,0]
[null,0,"kWh",null,null,null,null,null,null,0,0]
[null,0,"kW",null,null,null,null,null,null,0,0]
[null,null,null,null,null,null,null,null,null,0,0]
[null,null,"Total",{"$f":"SUM(D49:D60)","v":0},{"$f":"SUM(E49:E60)","v":0},0,0,0,0,0,0]

{"sheet":"5. Allocating Def-Var Balances","index":6,"n_rows":32,"n_cols":24,"rows_kept":32,"cut":false,"hidden":false,"merged":[[13,19,14,19],[1,1,8,15],[13,23,14,23],[13,15,14,15],[13,16,14,16],[13,17,14,17],[13,18,14,18],[13,20,14,20],[13,14,14,14],[10,1,11,11],[13,2,14,2],[13,3,14,3],[13,4,14,4],[13,5,14,5],[13,21,14,21],[13,22,14,22]]}
["Back to Index"]
[null,{"$f":"+'1. Information Sheet'!B2","v":"INCENTIVE REGULATION MODEL FOR 2019 FILERS"}]
[]
[]
[]
[]
[]
[]
[]
[]
[null,"No input required.  This workshseet allocates the deferral/variance account balances (Group 1 and 1568) to the appropriate classes as per EDDVAR dated July 31, 2009"]
[]
[null,"Allocation of Group 1 Accounts (including Account 1568)"]
[null,null,"% of  Total kWh","% of  Total non-RPP kWh","% of Customer Numbers **","% of  Total kWh adjusted for WMP",null,null,"allocated based on Total less WMP",null,null,null,null,"allocated based on Total less WMP","1595_(2009)","1595_(2010)","1595_(2011)","1595_(2012)","1595_(2013)","1595_(2017)","1595_(2015)","1595_(2016)","1595_(2017)",1568]
[null,"Rate Class",null,null,null,null,1550,1551,1580,"1580 (Class A)","1580 (Class B)",1584,1586,1588]
[null,{"$f":"'4. Billing Det. for Def-Var'!B17","v":"RESIDENTIAL SERVICE CLASSIFICATION"},{"$f":"IFERROR('4. Billing Det. for Def-Var'!D17/'4. Billing Det. for Def-Var'!D$29,\"\")","v":0.20384243139292538},{"$f":"IFERROR('4. Billing Det. for Def-Var'!F17/'4. Billing Det. for Def-Var'!F$29,\"\")","v":1.0964405488466765E-2},{"$f":"IFERROR('4. Billing Det. for Def-Var'!U17/'4. Billing Det. for Def-Var'!U$29,\"\")","v":0.90864664265372741},{"$f":"IFERROR('4. Billing Det. for Def-Var'!J17/'4. Billing Det. for Def-Var'!J$29,\"\")","v":0.20433831461462162},{"$f":"IFERROR(G$28*C16,\"\")","v":494355.5435171203},{"$f":"IFERROR(H$28*E16,\"\")","v":-24738.052369119072},{"$f":"IFERROR(I$28*F16,\"\")","v":-1517569.7806144955},null,null,{"$f":"IFERROR(L$28*$C16,\"\")","v":408739.61675244907},{"$f":"IFERROR(M$28*$C16,\"\")","v":10798.21376782379},{"$f":"IFERROR(N$28*$F16,\"\")","v":62988.765406035818},{"$f":"'4. Billing Det. for Def-Var'!L17*O$28","v":0},{"$f":"'4. Billing Det. for Def-Var'!M17*P$28","v":0},{"$f":"'4. Billing Det. for Def-Var'!N17*Q$28","v":0},{"$f":"'4. Billing Det. for Def-Var'!O17*R$28","v":0},{"$f":"'4. Billing Det. for Def-Var'!P17*S$28","v":0},{"$f":"+$T$28*'4. Billing Det. for Def-Var'!S17","v":0},{"$f":"'4. Billing Det. for Def-Var'!R17*U$28","v":0},{"$f":"'4. Billing Det. for Def-Var'!S17*V$28","v":0},{"$f":"'4. Billing Det. for Def-Var'!T17*W$28","v":0},{"$f":"'4. Billing Det. for Def-Var'!T17","v":218927.77579604124}]
[null,{"$f":"'4. Billing Det. for Def-Var'!B18","v":"GENERAL SERVICE LESS THAN 50 kW SERVICE CLASSIFICATION"},{"$f":"IFERROR('4. Billing Det. for Def-Var'!D18/'4. Billing Det. for Def-Var'!D$29,\"\")","v":8.7550550778069988E-2},{"$f":"IFERROR('4. Billing Det. for Def-Var'!F18/'4. Billing Det. for Def-Var'!F$29,\"\")","v":2.0882535019950681E-2},{"$f":"IFERROR('4. Billing Det. for Def-Var'!U18/'4. Billing Det. for Def-Var'!U$29,\"\")","v":9.1353357346272535E-2},{"$f":"IFERROR('4. Billing Det. for Def-Var'!J18/'4. Billing Det. for Def-Var'!J$29,\"\")","v":8.7763533172777713E-2},{"$f":"IFERROR(G$28*C17,\"\")","v":212326.25523234491},{"$f":"IFERROR(H$28*E17,\"\")","v":-2487.1099853809251},{"$f":"IFERROR(I$28*F17,\"\")","v":-651797.90698652912},null,null,{"$f":"IFERROR(L$28*$C17,\"\")","v":175554.11955675946},4637.8448114660896,{"$f":"IFERROR(N$28*$F17,\"\")","v":27053.744730403916},{"$f":"'4. Billing Det. for Def-Var'!L18*O$28","v":0},{"$f":"'4. Billing Det. for Def-Var'!M18*P$28","v":0},{"$f":"'4. Billing Det. for Def-Var'!N18*Q$28","v":0},{"$f":"'4. Billing Det. for Def-Var'!O18*R$28","v":0},{"$f":"'4. Billing Det. for Def-Var'!P18*S$28","v":0},{"$f":"+$T$28*'4. Billing Det. for Def-Var'!S18","v":0},{"$f":"'4. Billing Det. for Def-Var'!R18*U$28","v":0},{"$f":"'4. Billing Det. for Def-Var'!S18*V$28","v":0},{"$f":"'4. Billing Det. for Def-Var'!T18*W$28","v":0},{"$f":"'4. Billing Det. for Def-Var'!T18","v":124808.17364371811}]
[null,{"$f":"'4. Billing Det. for Def-Var'!B19","v":"GENERAL SERVICE 50 to 499 kW SERVICE CLASSIFICATION"},{"$f":"IFERROR('4. Billing Det. for Def-Var'!D19/'4. Billing Det. for Def-Var'!D$29,\"\")","v":0.28214206782016793},{"$f":"IFERROR('4. Billing Det. for Def-Var'!F19/'4. Billing Det. for Def-Var'!F$29,\"\")","v":0.36032724532086624},{"$f":"IFERROR('4. Billing Det. for Def-Var'!U19/'4. Billing Det. for Def-Var'!U$29,\"\")","v":0},{"$f":"IFERROR('4. Billing Det. for Def-Var'!J19/'4. Billing Det. for Def-Var'!J$29,\"\")","v":0.28252737878549056},{"$f":"IFERROR(G$28*C18,\"\")","v":684246.62290956231},{"$f":"IFERROR(H$28*E18,\"\")","v":0},{"$f":"IFERROR(I$28*F18,\"\")","v":-2098260.490450406},null,null,565744.04005348496,14946.006777879065,{"$f":"IFERROR(N$28*$F18,\"\")","v":87091.110723236197},{"$f":"'4. Billing Det. for Def-Var'!L19*O$28","v":0},{"$f":"'4. Billing Det. for Def-Var'!M19*P$28","v":0},{"$f":"'4. Billing Det. for Def-Var'!N19*Q$28","v":0},{"$f":"'4. Billing Det. for Def-Var'!O19*R$28","v":0},{"$f":"'4. Billing Det. for Def-Var'!P19*S$28","v":0},{"$f":"+$T$28*'4. Billing Det. for Def-Var'!S19","v":0},{"$f":"'4. Billing Det. for Def-Var'!R19*U$28","v":0},{"$f":"'4. Billing Det. for Def-Var'!S19*V$28","v":0},{"$f":"'4. Billing Det. for Def-Var'!T19*W$28","v":0},{"$f":"'4. Billing Det. for Def-Var'!T19","v":1127412.1685423229}]
[null,{"$f":"'4. Billing Det. for Def-Var'!B20","v":"GENERAL SERVICE 500 to 4,999 kW SERVICE CLASSIFICATION"},{"$f":"IFERROR('4. Billing Det. for Def-Var'!D20/'4. Billing Det. for Def-Var'!D$29,\"\")","v":0.28388252733689417},{"$f":"IFERROR('4. Billing Det. for Def-Var'!F20/'4. Billing Det. for Def-Var'!F$29,\"\")","v":0.39478030739852304},{"$f":"IFERROR('4. Billing Det. for Def-Var'!U20/'4. Billing Det. for Def-Var'!U$29,\"\")","v":0},{"$f":"IFERROR('4. Billing Det. for Def-Var'!J20/'4. Billing Det. for Def-Var'!J$29,\"\")","v":0.28244149347609826},688467.55868079152,0,-2097622.641643743,null,null,569233.96484970441,15038.204726007079,87064.635954589219,{"$f":"'4. Billing Det. for Def-Var'!L20*O$28","v":0},{"$f":"'4. Billing Det. for Def-Var'!M20*P$28","v":0},{"$f":"'4. Billing Det. for Def-Var'!N20*Q$28","v":0},{"$f":"'4. Billing Det. for Def-Var'!O20*R$28","v":0},{"$f":"'4. Billing Det. for Def-Var'!P20*S$28","v":0},{"$f":"+$T$28*'4. Billing Det. for Def-Var'!S20","v":0},{"$f":"'4. Billing Det. for Def-Var'!R20*U$28","v":0},{"$f":"'4. Billing Det. for Def-Var'!S20*V$28","v":0},{"$f":"'4. Billing Det. for Def-Var'!T20*W$28","v":0},{"$f":"'4. Billing Det. for Def-Var'!T20","v":346857.96314251533}]
[null,{"$f":"'4. Billing Det. for Def-Var'!B21","v":"LARGE USE SERVICE CLASSIFICATION"},{"$f":"IFERROR('4. Billing Det. for Def-Var'!D21/'4. Billing Det. for Def-Var'!D$29,\"\")","v":0.13886108477278739},{"$f":"IFERROR('4. Billing Det. for Def-Var'!F21/'4. Billing Det. for Def-Var'!F$29,\"\")","v":0.20974058044715851},{"$f":"IFERROR('4. Billing Det. for Def-Var'!U21/'4. Billing Det. for Def-Var'!U$29,\"\")","v":0},{"$f":"IFERROR('4. Billing Det. for Def-Var'!J21/'4. Billing Det. for Def-Var'!J$29,\"\")","v":0.13919888923094081},336763.77664425119,0,-1033795.4885767887,null,null,278440.68668143015,7355.9350090272701,42909.065757367738,{"$f":"'4. Billing Det. for Def-Var'!L21*O$28","v":0},{"$f":"'4. Billing Det. for Def-Var'!M21*P$28","v":0},{"$f":"'4. Billing Det. for Def-Var'!N21*Q$28","v":0},{"$f":"'4. Billing Det. for Def-Var'!O21*R$28","v":0},{"$f":"'4. Billing Det. for Def-Var'!P21*S$28","v":0},{"$f":"+$T$28*'4. Billing Det. for Def-Var'!S21","v":0},{"$f":"'4. Billing Det. for Def-Var'!R21*U$28","v":0},{"$f":"'4. Billing Det. for Def-Var'!S21*V$28","v":0},{"$f":"'4. Billing Det. for Def-Var'!T21*W$28","v":0},{"$f":"'4. Billing Det. for Def-Var'!T21","v":112182.34017515008}]
[null,{"$f":"'4. Billing Det. for Def-Var'!B22","v":"STANDBY POWER SERVICE CLASSIFICATION "},{"$f":"IFERROR('4. Billing Det. for Def-Var'!D22/'4. Billing Det. for Def-Var'!D$29,\"\")","v":0},{"$f":"IFERROR('4. Billing Det. for Def-Var'!F22/'4. Billing Det. for Def-Var'!F$29,\"\")","v":0},{"$f":"IFERROR('4. Billing Det. for Def-Var'!U22/'4. Billing Det. for Def-Var'!U$29,\"\")","v":0},{"$f":"IFERROR('4. Billing Det. for Def-Var'!J22/'4. Billing Det. for Def-Var'!J$29,\"\")","v":0},0,0,0,null,null,0,0,0,{"$f":"'4. Billing Det. for Def-Var'!L22*O$28","v":0},{"$f":"'4. Billing Det. for Def-Var'!M22*P$28","v":0},{"$f":"'4. Billing Det. for Def-Var'!N22*Q$28","v":0},{"$f":"'4. Billing Det. for Def-Var'!O22*R$28","v":0},{"$f":"'4. Billing Det. for Def-Var'!P22*S$28","v":0},{"$f":"+$T$28*'4. Billing Det. for Def-Var'!S22","v":0},{"$f":"'4. Billing Det. for Def-Var'!R22*U$28","v":0},{"$f":"'4. Billing Det. for Def-Var'!S22*V$28","v":0},{"$f":"'4. Billing Det. for Def-Var'!T22*W$28","v":0},{"$f":"'4. Billing Det. for Def-Var'!T22","v":0}]
[null,{"$f":"'4. Billing Det. for Def-Var'!B23","v":"UNMETERED SCATTERED LOAD SERVICE CLASSIFICATION"},{"$f":"IFERROR('4. Billing Det. for Def-Var'!D23/'4. Billing Det. for Def-Var'!D$29,\"\")","v":1.6162253641314351E-3},{"$f":"IFERROR('4. Billing Det. for Def-Var'!F23/'4. Billing Det. for Def-Var'!F$29,\"\")","v":1.2529161510212354E-4},{"$f":"IFERROR('4. Billing Det. for Def-Var'!U23/'4. Billing Det. for Def-Var'!U$29,\"\")","v":0},{"$f":"IFERROR('4. Billing Det. for Def-Var'!J23/'4. Billing Det. for Def-Var'!J$29,\"\")","v":1.6201571217889358E-3},3919.6450065453901,0,-12032.503510226727,null,null,3240.8136588955431,85.616850523280149,499.42516682565935,{"$f":"'4. Billing Det. for Def-Var'!L23*O$28","v":0},{"$f":"'4. Billing Det. for Def-Var'!M23*P$28","v":0},{"$f":"'4. Billing Det. for Def-Var'!N23*Q$28","v":0},{"$f":"'4. Billing Det. for Def-Var'!O23*R$28","v":0},{"$f":"'4. Billing Det. for Def-Var'!P23*S$28","v":0},{"$f":"+$T$28*'4. Billing Det. for Def-Var'!S23","v":0},{"$f":"'4. Billing Det. for Def-Var'!R23*U$28","v":0},{"$f":"'4. Billing Det. for Def-Var'!S23*V$28","v":0},{"$f":"'4. Billing Det. for Def-Var'!T23*W$28","v":0},{"$f":"'4. Billing Det. for Def-Var'!T23","v":0}]
[null,{"$f":"'4. Billing Det. for Def-Var'!B24","v":"STREET LIGHTING SERVICE CLASSIFICATION"},{"$f":"IFERROR('4. Billing Det. for Def-Var'!D24/'4. Billing Det. for Def-Var'!D$29,\"\")","v":2.1051125350236509E-3},{"$f":"IFERROR('4. Billing Det. for Def-Var'!F24/'4. Billing Det. for Def-Var'!F$29,\"\")","v":3.1796347099326133E-3},{"$f":"IFERROR('4. Billing Det. for Def-Var'!U24/'4. Billing Det. for Def-Var'!U$29,\"\")","v":0},{"$f":"IFERROR('4. Billing Det. for Def-Var'!J24/'4. Billing Det. for Def-Var'!J$29,\"\")","v":2.110233598282009E-3},5105.2866878845416,0,-15672.179467809965,null,null,4221.1176785257203,111.51483527339713,650.49479009752486,{"$f":"'4. Billing Det. for Def-Var'!L24*O$28","v":0},{"$f":"'4. Billing Det. for Def-Var'!M24*P$28","v":0},{"$f":"'4. Billing Det. for Def-Var'!N24*Q$28","v":0},{"$f":"'4. Billing Det. for Def-Var'!O24*R$28","v":0},{"$f":"'4. Billing Det. for Def-Var'!P24*S$28","v":0},{"$f":"+$T$28*'4. Billing Det. for Def-Var'!S24","v":0},{"$f":"'4. Billing Det. for Def-Var'!R24*U$28","v":0},{"$f":"'4. Billing Det. for Def-Var'!S24*V$28","v":0},{"$f":"'4. Billing Det. for Def-Var'!T24*W$28","v":0},{"$f":"'4. Billing Det. for Def-Var'!T24","v":-156329.03734753683}]
[]
[]
[]
[]
[null,null,{"$f":"SUM(C16:C27)","v":0.99999999999999989},{"$f":"SUM(D16:D27)","v":1},{"$f":"SUM(E16:E27)","v":1},{"$f":"SUM(F16:F27)","v":0.99999999999999989},{"$f":"'3. Continuity Schedule'!CN21","v":2425184.6886785002},{"$f":"'3. Continuity Schedule'!CN22","v":-27225.1623545},{"$f":"'3. Continuity Schedule'!CN23","v":-7426750.99125},null,null,{"$f":"'3. Continuity Schedule'!CN26","v":2005174.3592312494},{"$f":"'3. Continuity Schedule'!CN27","v":52973.336777999975},{"$f":"'3. Continuity Schedule'!CN28","v":308257.24252855609},null,null,null,null,null,{"$f":"SUM('3. Continuity Schedule'!CN30:CN36)","v":0},null,0,0,{"$f":"SUM(X16:X26)","v":1773859.3839522109}]
[null,null,null,null,null,null,{"$f":"SUM(G16:G27)-G28","v":0},{"$f":"SUM(H16:H27)-H28","v":0},0,0,0,0,0,0,0,0,0,0,0,{"$f":"SUM(T16:T27)-T28","v":0},0,0,null,0]
[]
[]
[null,"** Used to allocate Account 1551 as this account records the variances arising from the Smart Metering Entity Charges to Residential and GS<50 customers."]

{"sheet":"6. GA Calculation","index":7,"n_rows":51,"n_cols":16,"rows_kept":51,"cut":false,"hidden":false,"merged":[[12,1,12,11],[1,1,8,6]]}
["Back to Index"]
[null,{"$f":"+'1. Information Sheet'!B2","v":"INCENTIVE REGULATION MODEL FOR 2019 FILERS"}]
[]
[]
[]
[]
[]
[]
[]
[]
[]
[]
[null,"The purpose of this tab is to calculate the GA rate riders for all current Class B customers of the distributor.\nIdentify the total billed consumption for former Class B customers prior to becoming Class A customers in  Column G.\nEffective January 2017, the billing determinant and all rate riders for the disposition of GA balances will be calculated on an energy basis (kWhs) regardless of the billing determinant used for distribution rates for the particular class (see Chapter 3, Filing Requirements, section 3.2.5.2)"]
[null,null,"Total Metered Non-RPP consumption minus WMP",null,"Total  Metered Class A Consumption in 2017 (partial and/or full year Class A customers)*",null,"Total Metered Consumption for New Class A customer(s) in the period prior to becoming Class A (i.e. Jan. 1 - June 30, 2017) ","Total Metered Consumption for New Class B customer(s) in the period after becoming Class B (i.e. Jul 1 - Dec 31, 2017) ","Metered Consumption for Current Class B Customers (Non-RPP consumption LESS WMP, Class A and new Class A's former Class B consumption if applicable)",null,"% of total kWh","Total GA $ allocated to Current Class B Customers","GA Rate Rider",null,"Revenue Reconciliation","Variance"]
[null,null,"kWh","kW","kWh","kW","kWh","kWh","kWh","kW"]
[]
[null,{"$f":"'4. Billing Det. for Def-Var'!B17","v":"RESIDENTIAL SERVICE CLASSIFICATION"},{"$f":"'4. Billing Det. for Def-Var'!F17-'4. Billing Det. for Def-Var'!H17","v":51296782.133204632},null,null,null,null,null,{"$f":"C17-E17-G17-H17","v":51296782.133204632},null,{"$f":"IFERROR(I17/I$29,\"\")","v":1.8146109581417668E-2},{"$f":"IFERROR(L$29*K17,\"\")","v":88870.930018132858},{"$f":"IFERROR(L17/I17,\"\")","v":1.7324854761329427E-3},"kwh",{"$f":"IFERROR(ROUND(M17,4)*I17,\"\")","v":87204.529626447867},{"$f":"IFERROR(L17-O17,\"\")","v":1666.4003916849906}]
[null,{"$f":"'4. Billing Det. for Def-Var'!B18","v":"GENERAL SERVICE LESS THAN 50 kW SERVICE CLASSIFICATION"},{"$f":"'4. Billing Det. for Def-Var'!F18-'4. Billing Det. for Def-Var'!H18","v":97698580.231660247},null,null,null,null,null,97698580.231660247,null,{"$f":"IFERROR(I18/I$29,\"\")","v":3.4560630688860693E-2},{"$f":"IFERROR(L$29*K18,\"\")","v":169261.3712901604},{"$f":"IFERROR(L18/I18,\"\")","v":1.7324854761329427E-3},"kwh",{"$f":"IFERROR(ROUND(M18,4)*I18,\"\")","v":166087.58639382242},{"$f":"IFERROR(L18-O18,\"\")","v":3173.7848963379802}]
[null,{"$f":"'4. Billing Det. for Def-Var'!B19","v":"GENERAL SERVICE 50 to 499 kW SERVICE CLASSIFICATION"},{"$f":"'4. Billing Det. for Def-Var'!F19-'4. Billing Det. for Def-Var'!H19","v":1683662587.0589097},null,null,null,null,null,1683662587.0589097,null,0.59559146855583645,2916920.9787879772,{"$f":"IFERROR(L19/I19,\"\")","v":1.7324854761329427E-3},"kwh",2862226.3980001463,54694.580787830986]
[null,{"$f":"'4. Billing Det. for Def-Var'!B20","v":"GENERAL SERVICE 500 to 4,999 kW SERVICE CLASSIFICATION"},{"$f":"'4. Billing Det. for Def-Var'!F20-'4. Billing Det. for Def-Var'!H20","v":1831946174.6480215},null,539356029.31835985,null,313835212.31930602,null,978754933.01035559,null,0.34623213248814122,1695678.7061339123,1.7324854761329427E-3,"kwh",1663883.3861176043,31795.320016307989]
[null,{"$f":"'4. Billing Det. for Def-Var'!B21","v":"LARGE USE SERVICE CLASSIFICATION"},{"$f":"'4. Billing Det. for Def-Var'!F21-'4. Billing Det. for Def-Var'!H21","v":981267691.25849652},null,922691360.86964774,null,null,58576330.269884698,0.11896408349275589,null,4.208324977786687E-11,2.0610354683266632E-4,{"$f":"IFERROR(L21/I21,\"\")","v":1.7324854761329425E-3},"kwh",2.0223894193768501E-4,3.8646048949813152E-6]
[null,{"$f":"'4. Billing Det. for Def-Var'!B22","v":"STANDBY POWER SERVICE CLASSIFICATION "},{"$f":"'4. Billing Det. for Def-Var'!F22-'4. Billing Det. for Def-Var'!H22","v":0},null,null,null,null,null,0,null,0,0,"","kwh","",""]
[null,{"$f":"'4. Billing Det. for Def-Var'!B23","v":"UNMETERED SCATTERED LOAD SERVICE CLASSIFICATION"},{"$f":"'4. Billing Det. for Def-Var'!F23-'4. Billing Det. for Def-Var'!H23","v":586174.66216216213},null,null,null,null,null,586174.66216216213,null,2.0735783437300317E-4,1015.5390886730802,1.7324854761329425E-3,"kwh",996.49692567567558,19.042162997404603]
[null,{"$f":"'4. Billing Det. for Def-Var'!B24","v":"STREET LIGHTING SERVICE CLASSIFICATION"},{"$f":"'4. Billing Det. for Def-Var'!F24-'4. Billing Det. for Def-Var'!H24","v":14875866.197228426},null,null,null,null,null,14875866.197228426,null,5.2623008092876292E-3,25772.222131595234,1.7324854761329425E-3,"kwh",25288.972535288322,483.24959630691228]
[]
[]
[]
[]
[null,null,{"$f":"SUM(C17:C28)","v":4661333856.189683},{"$f":"SUM(D17:D28)","v":0},1462047390.1880076,0,313835212.31930602,58576330.269884698,2826874923.4124851,0,0.99999999999999978,{"$f":"'6B. GA Allocation_new Class B'!D28","v":4897519.7476565549},null,null,{"$f":"SUM(O17:O24)","v":4805687.3698012223},{"$f":"SUM(P17:P24)","v":91832.377855330866}]
[null,null,null,null,null,null,null,null,null,null,null,"from Sheet 6B"]
[]
[null,"*For new Class A customers (who became Class A in 2017), add their consumption only related to July to December period."]
[]
[]
[]
[null,"2015 DATA","Total Metered Non-RPP consumption minus WMP",null,"Total  Metered Class A Consumption in 2015 (partial and/or full year Class A customers)*",null,"Total Metered Consumption for New Class A customer(s) in the period prior to becoming Class A (i.e. Jan. 1 - June 30, 2015) "]
[null,null,"kWh","kW","kWh","kW","kWh"]
[]
[null,{"$f":"B17","v":"RESIDENTIAL SERVICE CLASSIFICATION"},{"$f":"'4. Billing Det. for Def-Var'!F49-'4. Billing Det. for Def-Var'!H49","v":0}]
[null,{"$f":"B18","v":"GENERAL SERVICE LESS THAN 50 kW SERVICE CLASSIFICATION"},{"$f":"'4. Billing Det. for Def-Var'!F50-'4. Billing Det. for Def-Var'!H50","v":0}]
[null,"GENERAL SERVICE 50 to 499 kW SERVICE CLASSIFICATION",{"$f":"'4. Billing Det. for Def-Var'!F51-'4. Billing Det. for Def-Var'!H51","v":0}]
[null,"GENERAL SERVICE 500 to 4,999 kW SERVICE CLASSIFICATION",{"$f":"'4. Billing Det. for Def-Var'!F52-'4. Billing Det. for Def-Var'!H52","v":0}]
[null,"LARGE USE SERVICE CLASSIFICATION",{"$f":"'4. Billing Det. for Def-Var'!F53-'4. Billing Det. for Def-Var'!H53","v":0}]
[null,"STANDBY POWER SERVICE CLASSIFICATION ",{"$f":"'4. Billing Det. for Def-Var'!F54-'4. Billing Det. for Def-Var'!H54","v":0}]
[null,"UNMETERED SCATTERED LOAD SERVICE CLASSIFICATION",{"$f":"'4. Billing Det. for Def-Var'!F55-'4. Billing Det. for Def-Var'!H55","v":0}]
[null,"STREET LIGHTING SERVICE CLASSIFICATION",{"$f":"'4. Billing Det. for Def-Var'!F56-'4. Billing Det. for Def-Var'!H56","v":0}]
[null,0,{"$f":"'4. Billing Det. for Def-Var'!F57-'4. Billing Det. for Def-Var'!H57","v":0}]
[null,0,{"$f":"'4. Billing Det. for Def-Var'!F58-'4. Billing Det. for Def-Var'!H58","v":0}]
[null,0,{"$f":"'4. Billing Det. for Def-Var'!F59-'4. Billing Det. for Def-Var'!H59","v":0}]
[]
[null,null,{"$f":"SUM(C39:C50)","v":0},{"$f":"SUM(D39:D50)","v":0},0,0,0]

{"sheet":"6A. GA Allocation_Class A","index":8,"n_rows":106,"n_cols":12,"rows_kept":106,"cut":false,"hidden":false,"merged":[[29,1,29,3],[1,1,8,6],[28,1,28,4],[11,1,11,5],[13,3,13,9],[15,1,15,5],[22,1,22,3]]}
["Back to Index"]
[null,{"$f":"+'1. Information Sheet'!B2","v":"INCENTIVE REGULATION MODEL FOR 2019 FILERS"}]
[]
[]
[]
[]
[]
[]
[]
[]
[]
[null,"This tab allocates the GA balance to former Class B customers who contributed to the current GA balance but are now Class A customers. The tables below calculate specific amounts for each customer who made the change. Consistent with both decisions for 2016 rates and EDDVAR, distributors are generally expected to settle the amount through 12 equal adjustments to bills. A one-time settlement is acceptable if the affected customer has expressed a clear preference for this approach. (see Filing Requirements section 3.2.5.2)"]
[]
[null,"Year of Group 1 Account Balance Last Disposed",2016,"(e.g. If in the 2017 EDR process, you received approval to dispose the GA variance account balance as of December 31, 2014, please enter 2014 in cell C16.)"]
[]
[null,"Allocation of total Non-RPP consumption (kWh) between Class B and New Class A (Former Class B) customers"]
[null,null,null,"Total",2017,2015,2014,2013,2012]
[null,"Total Class B Consumption for Years Since Last Disposition (Non-RPP consumption LESS WMP and Class A)","A",{"$f":"SUM(E18:I18)","v":3199286466.0016756},{"$f":"'6. GA Calculation'!C29-'6. GA Calculation'!E29","v":3199286466.0016756}]
[null,"New Class A Customer(s)' Former Class B Consumption","B",{"$f":"SUM(E19:I19)","v":313835212.31930602},{"$f":"'6. GA Calculation'!G29","v":313835212.31930602},{"$f":"F106","v":0},{"$f":"G106","v":0},{"$f":"H106","v":0},{"$f":"I106","v":0}]
[null,"Portion of Consumption of Former Class B Customers","C=B/A",{"$f":"IFERROR(+D19/D18,0)","v":9.8095377095606937E-2}]
[]
[]
[null,"Allocation of Total GA Balance $"]
[]
[null,"Total GA Balance","D",{"$f":"'3. Continuity Schedule'!CN29","v":5542717.3363365931}]
[null,"New Class A Customer(s)' Former Class B Portion of GA Balance","E=C*D",{"$f":"+D20*D25","v":543714.94724229618}]
[null,"GA Balance to be disposed to Current Class B Customers","F=D-E",{"$f":"+D25-D26","v":4999002.3890942968}]
[]
[null,"Allocation of GA Balances to Former Class B Customers"]
[null,"# of Former Class B customer(s)"]
[null,"Customer",null,"Total Metered kWh Consumption for each new Class A customer for the period prior to becoming Class A","Metered kWh Consumption for each new Class A customer for the period prior to becoming Class A in 2017","Metered kWh Consumption for each new Class A customer for the period prior to becoming Class A in 2015","Metered kWh Consumption for each new Class A customer for the period prior to becoming Class A in 2014","Metered kWh Consumption for each new Class A customer for the period prior to becoming Class A in 2013","Metered kWh Consumption for each new Class A customer for the period prior to becoming Class A in 2012","% of kWh","Customer specific GA allocation for the period prior to becoming Class A","Monthly Equal Payments"]
[null,"Customer 1",null,{"$f":"SUM(E32:I32)","v":5382021.043392498},5382021.043392498,null,null,null,null,{"$f":"IFERROR(+D32/$D$106,0)","v":1.7149194329145759E-2},{"$f":"+J32*$D$26","v":9324.2732899193707},{"$f":"+K32/12","v":777.02277415994752}]
[null,"Customer 2",null,2398548.8762531271,2398548.8762531271,null,null,null,null,7.6427015901987649E-3,{"$f":"+J33*$D$26","v":4155.4510919035347},{"$f":"+K33/12","v":346.28759099196122}]
[null,"Customer 3",null,4653971.6917620851,4653971.6917620851,null,null,null,null,1.482934836205373E-2,8062.9383623116755,671.91153019263959]
[null,"Customer 4",null,5067324.9470668826,5067324.9470668826,null,null,null,null,1.614645122074837E-2,8779.0668736395091,731.58890613662572]
[null,"Customer 5",null,4261870.5882352944,4261870.5882352944,null,null,null,null,1.3579963053665026E-2,7383.6288952758114,615.30240793965095]
[null,"Customer 6",null,2774874.7533611064,2774874.7533611064,null,null,null,null,8.841820944355535E-3,4807.4302082860995,400.61918402384163]
[null,"Customer 7",null,6770068.2284092959,6770068.2284092959,null,null,null,null,2.1572047885822357E-2,11729.04487814819,977.42040651234913]
[null,"Customer 8",null,2966463.313768887,2966463.313768887,null,null,null,null,9.4522959735656182E-3,{"$f":"+J39*$D$26","v":5139.354606585799},{"$f":"+K39/12","v":428.27955054881659}]
[null,"Customer 9",null,5992308.4840141311,5992308.4840141311,null,null,null,null,1.9093805439261431E-2,10381.587417062698,865.13228475522476]
[null,"Customer 10",null,2375029.0841884613,2375029.0841884613,null,null,null,null,7.567758463546884E-3,4114.7033937498345,342.89194947915286]
[null,"Customer 11",null,3216399.4282555599,3216399.4282555599,null,null,null,null,1.0248688808644876E-2,5572.3652948950603,464.36377457458838]
[null,"Customer 12",null,15509176.032977587,15509176.032977587,null,null,null,null,4.9418215114746443E-2,{"$f":"+J43*$D$26","v":26869.422223922807},{"$f":"+K43/12","v":2239.1185186602338}]
[null,"Customer 13",null,1799641.0797424333,1799641.0797424333,null,null,null,null,5.7343504141639167E-3,3117.8520329059734,259.82100274216447]
[null,"Customer 14",null,3718251.0008962671,3718251.0008962671,null,null,null,null,1.1847781430954277E-2,6441.8158556695616,536.81798797246347]
[null,"Customer 15",null,5149166.6426086612,5149166.6426086612,null,null,null,null,1.6407230420561393E-2,8920.8564225077353,743.40470187564461]
[null,"Customer 16",null,5174786.7863219781,5174786.7863219781,null,null,null,null,1.6488866077452723E-2,8965.2429493874952,747.1035791156246]
[null,"Customer 17",null,4718362.933339118,4718362.933339118,null,null,null,null,1.5034523686712707E-2,8174.4952531340514,681.20793776117091]
[null,"Customer 18",null,5775894.7733261921,5775894.7733261921,null,null,null,null,1.8404227908784217E-2,10006.653806459806,833.88781720498389]
[null,"Customer 19",null,1369819.1694907846,1369819.1694907846,null,null,null,null,4.3647720705638562E-3,2373.1918160712748,197.76598467260624]
[null,"Customer 20",null,3237959.9956475752,3237959.9956475752,null,null,null,null,1.0317389090020819E-2,5609.7186647589115,467.47655539657598]
[null,"Customer 21",null,4894961.5865631886,4894961.5865631886,null,null,null,null,1.5597235091589714E-2,8480.4498549493928,706.70415457911611]
[null,"Customer 22",null,3950390.1316022878,3950390.1316022878,null,null,null,null,1.258746621326556E-2,6843.9935280598693,570.33279400498907]
[null,"Customer 23",null,2029895.6310424784,2029895.6310424784,null,null,null,null,6.468030199801791E-3,3516.7646988468091,293.06372490390078]
[null,"Customer 24",null,2018129.4805076148,2018129.4805076148,null,null,null,null,6.4305387072190771E-3,3496.3800139351642,291.36500116126371]
[null,"Customer 25",null,617671.19562323345,617671.19562323345,null,null,null,null,1.9681386006959439E-3,1070.1063754429217,89.175531286910143]
[null,"Customer 26",null,4331706.9890903011,4331706.9890903011,null,null,null,null,1.3802488755414365E-2,7504.6194454625074,625.38495378854225]
[null,"Customer 27",null,6246686.5905124387,6246686.5905124387,null,null,null,null,1.9904352173703375E-2,10822.293792017213,901.85781600143446]
[null,"Customer 28",null,5498219.5555653526,5498219.5555653526,null,null,null,null,1.751944759459078E-2,9525.5855246070987,793.79879371725826]
[null,"Customer 29",null,2380105.9841976757,2380105.9841976757,null,null,null,null,7.5839354246077378E-3,4123.4990492795769,343.62492077329807]
[null,"Customer 30",null,1719400.2658449335,1719400.2658449335,null,null,null,null,5.4786722405628608E-3,2978.8359882354684,248.23633235295571]
[null,"Customer 31",null,1109140.3905423628,1109140.3905423628,null,null,null,null,3.5341489641827948E-3,1921.5696176070639,160.13080146725534]
[null,"Customer 32",null,3862217.2181120031,3862217.2181120031,null,null,null,null,1.2306513311777326E-2,6691.2352360496243,557.60293633746869]
[null,"Customer 33",null,4255554.0541669484,4255554.0541669484,null,null,null,null,{"$f":"IFERROR(+D64/$D$106,0)","v":1.3559836140494047E-2},7372.685591742902,614.39046597857521]
[null,"Customer 34",null,1447524.7932839391,1447524.7932839391,null,null,null,null,4.612372150933723E-3,2507.8156807067653,208.9846400588971]
[null,"Customer 35",null,2028168.3056808708,2028168.3056808708,null,null,null,null,6.4625262751502443E-3,3513.7721327452678,292.81434439543898]
[null,"Customer 36",null,4195985.4763397854,4195985.4763397854,null,null,null,null,1.3370027682141209E-2,7269.4838958234468,605.79032465195394]
[null,"Customer 37",null,3329162.8071765928,3329162.8071765928,null,null,null,null,1.0607996414976518E-2,5767.726211115425,480.64385092628544]
[null,"Customer 38",null,1408076.1377473001,1408076.1377473001,null,null,null,null,4.4866735231567263E-3,2439.4714579365668,203.28928816138057]
[null,"Customer 39",null,4504174.559277893,4504174.559277893,null,null,null,null,1.4352036936808739E-2,7803.4170059164499,650.28475049303745]
[null,"Customer 40",null,4129830.8518580808,4129830.8518580808,null,null,null,null,1.3159233539594844E-2,7154.8719697298648,596.23933081082203]
[null,"Customer 41",null,2752830.8292194605,2752830.8292194605,null,null,null,null,8.7715805019949189E-3,4769.2394298737208,397.43661915614342]
[null,"Customer 42",null,7868059.3671977418,7868059.3671977418,null,null,null,null,2.5070671034812135E-2,13631.298579021843,1135.9415482518202]
[null,"Customer 43",null,3156083.8680045586,3156083.8680045586,null,null,null,null,1.0056500176256377E-2,5467.8694627753785,455.65578856461485]
[null,"Customer 44",null,4661981.9155833153,4661981.9155833153,null,null,null,null,1.4854872023857111E-2,8076.8159587425307,673.06799656187752]
[null,"Customer 45",null,4771711.453643797,4771711.453643797,null,null,null,null,1.5204512643370638E-2,8266.9207897350916,688.9100658112576]
[null,"Customer 46",null,2600263.2878092579,2600263.2878092579,null,null,null,null,8.2854414856535167E-3,4504.9183802512343,375.40986502093619]
[null,"Customer 47",null,2780357.4048501281,2780357.4048501281,null,null,null,null,8.8592907860871369E-3,4816.9288223615285,401.41073519679406]
[null,"Customer 48",null,3256262.215097954,3256262.215097954,null,null,null,null,1.0375707018449315E-2,5641.4269941376915,470.11891617814098]
[null,"Customer 49",null,5283338.9410218969,5283338.9410218969,null,null,null,null,1.6834755099585378E-2,9153.3079808080402,762.77566506733672]
[null,"Customer 50",null,2912704.7655978212,2912704.7655978212,null,null,null,null,9.2810005100203413E-3,5046.2187026614338,420.51822522178617]
[null,"Customer 51",null,3173277.5288257599,3173277.5288257599,null,null,null,null,1.0111285809436724E-2,5497.657230429666,458.1381025358055]
[null,"Customer 52",null,3422266.963210999,3422266.963210999,null,null,null,null,1.0904662156676908E-2,5929.0278092126491,494.08565076772078]
[null,"Customer 53",null,4300190.5403022766,4300190.5403022766,null,null,null,null,1.3702065196964338E-2,7450.0176556779679,620.83480463983062]
[null,"Customer 54",null,2691099.1954751033,2691099.1954751033,null,null,null,null,8.5748797134245491E-3,4662.2902709936643,388.52418924947204]
[null,"Customer 55",null,3096243.8420066824,3096243.8420066824,null,null,null,null,9.865826779362364E-3,5364.1974868426405,447.01645723688671]
[null,"Customer 56",null,9209604.1985195279,9209604.1985195279,null,null,null,null,2.9345350161502529E-2,15955.505514868055,1329.6254595723378]
[null,"Customer 57",null,6208431.0271120304,6208431.0271120304,null,null,null,null,1.9782455197523769E-2,10756.016584044724,896.3347153370604]
[null,"Customer 58",null,2754773.1945625818,2754773.1945625818,null,null,null,null,8.77776962694609E-3,4772.6045496200231,397.71704580166858]
[null,"Customer 59",null,5485076.8145659715,5485076.8145659715,null,null,null,null,1.7477569753980564E-2,9502.8159167090944,791.90132639242449]
[null,"Customer 60",null,2998332.3659387017,2998332.3659387017,null,null,null,null,9.5538430623524229E-3,5194.5672766081252,432.88060638401043]
[null,"Customer 61",null,5503266.9401998548,5503266.9401998548,null,null,null,null,1.7535530508286795E-2,9534.3300451788309,794.52750376490258]
[null,"Customer 62",null,4702419.374994278,4702419.374994278,null,null,null,null,1.4983721362056357E-2,8146.8732698637386,678.90610582197826]
[null,"Customer 63",null,10467199.538959119,10467199.538959119,null,null,null,null,3.3352533839668234E-2,18134.271177032111,1511.1892647526759]
[null,"Customer 64",null,1447248.1275649334,1447248.1275649334,null,null,null,null,4.6114905872718217E-3,2507.3363613668439,208.94469678057033]
[null,"Customer 65",null,{"$f":"SUM(E96:I96)","v":8867690.8496217467},8867690.8496217467,null,null,null,null,{"$f":"IFERROR(+D96/$D$106,0)","v":2.8255882391550996E-2},15363.145603806675,1280.2621336505563]
[null,"Customer 66",null,4066477.4702005396,4066477.4702005396,null,null,null,null,1.2957365236833829E-2,7045.113156144268,587.09276301202237]
[null,"Customer 67",null,6114189.7375563327,6114189.7375563327,null,null,null,null,1.9482166109950592E-2,10592.744918637438,882.72874321978645]
[null,"Customer 68",null,7752468.2989183497,7752468.2989183497,null,null,null,null,2.4702353319839519E-2,13431.038732057104,1119.2532276714253]
[null,"Customer 69",null,2660559.3004617756,2660559.3004617756,null,null,null,null,8.4775678318557736E-3,4609.3803464404491,384.11502887003741]
[null,"Customer 70",null,5166515.4165866021,5166515.4165866021,null,null,null,null,1.6462510304070099E-2,8950.9129214532313,745.90941012110261]
[null,"Customer 71",null,2411813.9464778895,2411813.9464778895,null,null,null,null,7.6849692188906858E-3,4178.4326334078196,348.20271945065161]
[null,"Customer 72",null,4947601.5547291506,4947601.5547291506,null,null,null,null,1.576496632791894E-2,8571.6478352610229,714.30398627175191]
[null,"Customer 73",null,4661448.9263397502,4661448.9263397502,null,null,null,null,1.485317371460868E-2,8075.8925626191194,672.99104688492662]
[null,"Customer 74",null,5414482.2603568994,5414482.2603568994,null,null,null,null,1.7252628283304396E-2,9380.5118768477969,781.7093230706497]
[null,"Total",null,{"$f":"SUM(D32:D105)","v":313835212.31930602},{"$f":"SUM(E32:E105)","v":313835212.31930602},{"$f":"SUM(F32:F42)","v":0},{"$f":"SUM(G32:G38)","v":0},0,0,{"$f":"SUM(J32:J105)","v":1},{"$f":"SUM(K32:K105)","v":543714.94724229607}]

{"sheet":"6B. GA Allocation_new Class B","index":9,"n_rows":44,"n_cols":15,"rows_kept":44,"cut":false,"hidden":false,"merged":[[30,1,30,3],[1,1,8,6],[11,1,11,5],[13,3,13,9],[15,1,15,5],[22,1,22,3],[29,1,29,4]]}
["Back to Index"]
[null,{"$f":"+'1. Information Sheet'!B2","v":"INCENTIVE REGULATION MODEL FOR 2019 FILERS"}]
[]
[]
[]
[]
[]
[]
[]
[]
[]
[null,"This tab allocates the GA balance to former Class A customers who contributed to the current Class B GA balance once switched to Class B customers. The tables below calculate specific amounts for each customer who made the transition. Consistent with both decisions for 2016 rates and EDDVAR, distributors are generally expected to settle the amount through 12 equal adjustments to bills. A one-time settlement is acceptable if the affected customer has expressed a clear preference for this approach. (see Filing Requirements section 3.2.5.2)"]
[]
[null,"Year of Group 1 Account Balance Last Disposed",2016,"(e.g. If in the 2017 EDR process, you received approval to dispose the GA variance account balance as of December 31, 2014, please enter 2014 in cell C16.)"]
[]
[null,"Allocation of total Non-RPP consumption (kWh) between Class B and New Class B (Former Class A) customers"]
[null,null,null,"Total",2017,2015,2014,2013,2012]
[null,"Total Class B Consumption for Years Since Last Disposition (Non-RPP consumption LESS WMP and Class A)","A",{"$f":"SUM(E18:I18)","v":3199286466.0016756},{"$f":"'6. GA Calculation'!C29-'6. GA Calculation'!E29","v":3199286466.0016756}]
[null,"New Class B Customer(s)'  Consumption","B",{"$f":"SUM(E19:I19)","v":58576330.269884698},{"$f":"'6. GA Calculation'!H29","v":58576330.269884698},{"$f":"F44","v":0},{"$f":"G44","v":0},{"$f":"H44","v":0},{"$f":"I44","v":0}]
[null,"Portion of Consumption of New Class B Customers","C=B/A",{"$f":"IFERROR(+D19/D18,0)","v":1.8309185780131392E-2}]
[]
[]
[null,"Allocation of Total GA Balance $"]
[]
[null,"Total GA Calss B Balance adjusted for Class A","D",{"$f":"'6A. GA Allocation_Class A'!D25","v":5542717.3363365931}]
[null,"New Class B Customer(s)' Former Class A Portion of GA Balance attributable to Class B","E=C*D",{"$f":"+D20*D25","v":101482.64143774169}]
[null,"New Class A Customer(s)' Former Class B Portion of GA Balance","F=Sheet 6A",{"$f":"'6A. GA Allocation_Class A'!D26","v":543714.94724229618}]
[null,"GA Balance to be disposed to Current Class B Customers","G=D-E-F",{"$f":"+D25-D26-D27","v":4897519.7476565549},"Input into Sheet 6. GA Calculation",null,null,null,null,null,null,null,null,null,"s"]
[]
[null,"Allocation of GA Balances to Former Class A Customers"]
[null,"# of Former Class B customer(s)",null,null,null,9]
[null,"Customer",null,"Total Metered kWh Consumption for each new Class B customer for the period after becoming Class B","Metered kWh Consumption for each new Class B customer for the period after becoming Class B in 2017","Metered kWh Consumption for each new Class B customer for the period prior to becoming Class B in 2015","Metered kWh Consumption for each new Class B customer for the period prior to becoming Class B in 2014","Metered kWh Consumption for each new Class B customer for the period prior to becoming Class B in 2013","Metered kWh Consumption for each new Class B customer for the period prior to becoming Class B in 2012","% of kWh","Customer specific GA allocation for the period after becoming Class B","Monthly Equal Payments"]
[null,"Customer 1",null,{"$f":"SUM(E33:I33)","v":28015213.332781807},28015213.332781807,null,null,null,null,{"$f":"IFERROR(+D33/$D$44,0)","v":0.47799283648821028},{"$f":"+J33*$D$26","v":48507.975635142138},{"$f":"+K33/12","v":4042.3313029285114}]
[null,"Customer 2",null,30594897.937102892,30594897.937102892,null,null,null,null,{"$f":"IFERROR(+D34/$D$44,0)","v":0.52200716351178977},{"$f":"+J34*$D$26","v":52974.665802599564},{"$f":"+K34/12","v":4414.5554835499634}]
[null,null,null,null,null,null,null,null,null,{"$f":"IFERROR(+D35/$D$44,0)","v":0},{"$f":"+J35*$D$26","v":0},0]
[null,null,null,null,null,null,null,null,null,0,0,0]
[null,null,null,null,null,null,null,null,null,0,0,0]
[null,null,null,null,null,null,null,null,null,0,0,0]
[null,null,null,null,null,null,null,null,null,0,0,0]
[null,null,null,null,null,null,null,null,null,0,0,0]
[null,null,null,null,null,null,null,null,null,0,0,0]
[null,null,null,null,null,null,null,null,null,0,0,0]
[null,null,null,null,null,null,null,null,null,0,0,0]
[null,"Total",null,{"$f":"SUM(D33:D43)","v":58610111.269884698},{"$f":"SUM(E33:E43)","v":58610111.269884698},{"$f":"SUM(F33:F43)","v":0},{"$f":"SUM(G33:G39)","v":0},0,0,{"$f":"SUM(J33:J43)","v":1},{"$f":"SUM(K33:K43)","v":101482.64143774169}]

{"sheet":"7. CBR Allocation","index":10,"n_rows":37,"n_cols":18,"rows_kept":37,"cut":false,"hidden":false,"merged":[[1,1,8,6],[12,1,12,13],[18,2,18,3],[18,4,18,5],[18,6,18,7],[18,10,18,11],[18,8,18,9]]}
["Back to Index"]
[null,{"$f":"+'1. Information Sheet'!B2","v":"INCENTIVE REGULATION MODEL FOR 2019 FILERS"}]
[]
[]
[]
[]
[]
[]
[]
[]
[]
[]
[null,"The purpose of this tab is to calculate the CBR rate riders for all current Class B customers of the distributor.\nIdentify and input the total billed consumption for former Class B customers prior to becoming Class A customers in  Column H.\n"]
[]
[null,"Account 1580"]
[null,"Variance WMS – Sub-account CBR Class A",{"$f":"'3. Continuity Schedule'!CN24","v":0}]
[null,"Variance WMS – Sub-account CBR Class B",{"$f":"'3. Continuity Schedule'!CN25","v":38392.709356500076}]
[]
[null,null,"Total Metered LESS WMP",null,"Total  Metered Class A \nConsumption/Demand in  2017  (partial \nand/or full year Class A customers)*",null,"Total Metered Consumption/Demand\nfor New Class A customer(s)\n in the period prior to becoming\n Class A (i.e. Jan 1 - Jun 30, 2017) ",null,"Total Metered Consumption for New Class B customer(s) in the period after becoming Class B (i.e. Jul 1 - Dec 31, 2017) ",null,"Metered Consumption for Current Class B Customers (metered consumption/demand LESS WMP, Class A and new Class A's former Class B, if applicable)",null,"% of total kWh","Total CBR $ allocated to Current Class B Customers","CBR Rate Rider",null,"Revenue Reconciliation","Variance"]
[null,null,"kWh","kW","kWh","kW","kWh","kW","kWh","kW","kWh","kW"]
[]
[null,{"$f":"'4. Billing Det. for Def-Var'!B17","v":"RESIDENTIAL SERVICE CLASSIFICATION"},{"$f":"'4. Billing Det. for Def-Var'!D17-'4. Billing Det. for Def-Var'!H17","v":1440461108.0256596},{"$f":"'4. Billing Det. for Def-Var'!E17-'4. Billing Det. for Def-Var'!I17","v":0},{"$f":"'6. GA Calculation'!E17","v":0},null,{"$f":"'6. GA Calculation'!G17","v":0},null,{"$f":"'6. GA Calculation'!H17","v":0},null,{"$f":"C22-E22-G22-I22","v":1440461108.0256596},{"$f":"ROUND(D22-F22-H22-J22,0)","v":0},{"$f":"IFERROR(K22/K$34,\"\")","v":0.27621846372250447},{"$f":"IFERROR(N$34*M22,\"\")","v":9897.8744382165223},{"$f":"IFERROR(IF(L22=0,N22/K22,N22/L22),\"\")","v":6.8713236220468698E-6},"kwh",{"$f":"IFERROR(IF(L22=0,ROUND(O22,5)*K22,ROUND(O22,5)*L22),\"\")","v":14404.611080256596},{"$f":"IFERROR(N22-Q22,\"\")","v":-4506.736642040074}]
[null,{"$f":"'4. Billing Det. for Def-Var'!B18","v":"GENERAL SERVICE LESS THAN 50 kW SERVICE CLASSIFICATION"},{"$f":"'4. Billing Det. for Def-Var'!D18-'4. Billing Det. for Def-Var'!H18","v":618679646.43210387},{"$f":"'4. Billing Det. for Def-Var'!E18-'4. Billing Det. for Def-Var'!I18","v":0},{"$f":"'6. GA Calculation'!E18","v":0},null,{"$f":"'6. GA Calculation'!G18","v":0},null,{"$f":"'6. GA Calculation'!H18","v":0},null,{"$f":"C23-E23-G23-I23","v":618679646.43210387},0,{"$f":"IFERROR(K23/K$34,\"\")","v":0.11863613708258051},{"$f":"IFERROR(N$34*M23,\"\")","v":4251.1480690085209},{"$f":"IFERROR(IF(L23=0,N23/K23,N23/L23),\"\")","v":6.8713236220468698E-6},"kwh",{"$f":"IFERROR(IF(L23=0,ROUND(O23,5)*K23,ROUND(O23,5)*L23),\"\")","v":6186.7964643210389},{"$f":"IFERROR(N23-Q23,\"\")","v":-1935.648395312518}]
[null,{"$f":"'4. Billing Det. for Def-Var'!B19","v":"GENERAL SERVICE 50 to 499 kW SERVICE CLASSIFICATION"},{"$f":"'4. Billing Det. for Def-Var'!D19-'4. Billing Det. for Def-Var'!H19","v":1991646558.6029251},{"$f":"'4. Billing Det. for Def-Var'!E19-'4. Billing Det. for Def-Var'!I19","v":5773382.2019777978},{"$f":"'6. GA Calculation'!E19","v":0},null,{"$f":"'6. GA Calculation'!G19","v":0},null,{"$f":"'6. GA Calculation'!H19","v":0},null,1991646558.6029251,5773382,0.38191211802277497,13685.248044896634,2.3704040447863374E-3,"kW",13682.915340000001,2.332704896633004]
[null,{"$f":"'4. Billing Det. for Def-Var'!B20","v":"GENERAL SERVICE 500 to 4,999 kW SERVICE CLASSIFICATION"},{"$f":"'4. Billing Det. for Def-Var'!D20-'4. Billing Det. for Def-Var'!H20","v":1991041119.2942781},{"$f":"'4. Billing Det. for Def-Var'!E20-'4. Billing Det. for Def-Var'!I20","v":4581930.7148864595},{"$f":"'6. GA Calculation'!E20","v":539356029.31835985},1131282.5001011579,{"$f":"'6. GA Calculation'!G20","v":313835212.31930602},643137.53269327839,{"$f":"'6. GA Calculation'!H20","v":0},null,1137849877.6566124,2807511,0.21819064978708919,7818.5347426850212,2.7848634404940963E-3,"kW",7804.88058,13.65416268502122]
[null,{"$f":"'4. Billing Det. for Def-Var'!B21","v":"LARGE USE SERVICE CLASSIFICATION"},{"$f":"'4. Billing Det. for Def-Var'!D21-'4. Billing Det. for Def-Var'!H21","v":981267691.25849652},{"$f":"'4. Billing Det. for Def-Var'!E21-'4. Billing Det. for Def-Var'!I21","v":1753815.618647513},{"$f":"'6. GA Calculation'!E21","v":922691360.86964774},1625696.1355745338,{"$f":"'6. GA Calculation'!G21","v":0},null,{"$f":"'6. GA Calculation'!H21","v":58576330.269884698},128119.48307297887,0.11896408349275589,0,2.2812192705128861E-11,8.1744071707892971E-7,6.8713236220468707E-6,"kwh",1.189640834927559E-6,-3.722001178486293E-7]
[null,{"$f":"'4. Billing Det. for Def-Var'!B22","v":"STANDBY POWER SERVICE CLASSIFICATION "},{"$f":"'4. Billing Det. for Def-Var'!D22-'4. Billing Det. for Def-Var'!H22","v":0},{"$f":"'4. Billing Det. for Def-Var'!E22-'4. Billing Det. for Def-Var'!I22","v":0},{"$f":"'6. GA Calculation'!E22","v":0},null,{"$f":"'6. GA Calculation'!G22","v":0},null,{"$f":"'6. GA Calculation'!H22","v":0},null,0,0,0,0,"","kW","",""]
[null,{"$f":"'4. Billing Det. for Def-Var'!B23","v":"UNMETERED SCATTERED LOAD SERVICE CLASSIFICATION"},{"$f":"'4. Billing Det. for Def-Var'!D23-'4. Billing Det. for Def-Var'!H23","v":11421124.458372911},{"$f":"'4. Billing Det. for Def-Var'!E23-'4. Billing Det. for Def-Var'!I23","v":0},{"$f":"'6. GA Calculation'!E23","v":0},null,{"$f":"'6. GA Calculation'!G23","v":0},null,{"$f":"'6. GA Calculation'!H23","v":0},null,11421124.458372911,0,{"$f":"IFERROR(K28/K$34,\"\")","v":2.1900802696431356E-3},78.478242281155048,6.8713236220468698E-6,"kW",114.21124458372913,-35.733002302574079]
[null,{"$f":"'4. Billing Det. for Def-Var'!B24","v":"STREET LIGHTING SERVICE CLASSIFICATION"},{"$f":"'4. Billing Det. for Def-Var'!D24-'4. Billing Det. for Def-Var'!H24","v":14875866.197228426},{"$f":"'4. Billing Det. for Def-Var'!E24-'4. Billing Det. for Def-Var'!I24","v":41239.546182825972},{"$f":"'6. GA Calculation'!E24","v":0},null,{"$f":"'6. GA Calculation'!G24","v":0},null,{"$f":"'6. GA Calculation'!H24","v":0},null,14875866.197228426,41240,2.8525510925955355E-3,102.21689079942423,2.4785861008589775E-3,"kW",102.2752,-5.8309200575763498E-2]
[null,{"$f":"'4. Billing Det. for Def-Var'!B25","v":0}]
[]
[]
[]
[null,null,{"$f":"SUM(C22:C33)","v":7049393114.2690649},{"$f":"SUM(D22:D33)","v":12150368.081694596},1462047390.1880076,2756978.635675692,313835212.31930602,643137.53269327839,58576330.269884698,128119.48307297887,5214934181.4918661,8622133,1,{"$f":"'7B. CBR Allocation_new Class B'!D28","v":35833.50042870472},null,null,{"$f":"SUM(Q22:Q33)","v":42295.689910351},{"$f":"SUM(R22:R33)","v":-6462.1894816462873}]
[null,null,null,null,null,null,null,null,null,null,null,null,null,"from Sheet 7B"]
[null,null,null,null,null,null,null,null,null,null,null,null,null,null,null,null,"NOTE: if rate rider is at 5 decimal places, then the balance dispostion is in full"]
[null,"*For new Class A customers (who became Class A in 2017), add their consumption only related to July to December period."]

{"sheet":"7A. CBR Allocation_Class A","index":11,"n_rows":107,"n_cols":15,"rows_kept":107,"cut":false,"hidden":false,"merged":[[30,1,30,3],[1,1,8,6],[11,1,11,5],[15,1,15,5],[22,1,22,3],[28,1,28,4]]}
["Back to Index"]
[null,{"$f":"+'1. Information Sheet'!B2","v":"INCENTIVE REGULATION MODEL FOR 2019 FILERS"}]
[]
[]
[]
[]
[]
[]
[]
[]
[]
[null,"This tab allocates the CBR balance to former Class B customers who contributed to the current CBR balance but are now Class A customers. The tables below calculate specific amounts for each customer who made the change. Consistent with both decisions for 2016 rates and EDDVAR, distributors are generally expected to settle the amount through 12 equal adjustments to bills. A one-time settlement is acceptable if the affected customer has expressed a clear preference for this approach. (see Filing Requirements section 3.2.5.2)"]
[]
[null,"Year of Group 1 Account Balance Last Disposed",2016]
[]
[null,"Allocation of total Non-RPP consumption (kWh) between Class B and New Class A (Former Class B) customers"]
[null,null,null,"Total",2017]
[null,"Total MeteredConsumption for Years Since Last Disposition (consumption LESS WMP and Class A)","A",{"$f":"SUM(E18:I18)","v":5587345724.0810575},{"$f":"'7. CBR Allocation'!C34-'7. CBR Allocation'!E34","v":5587345724.0810575}]
[null,"New Class A Customer(s)' Former Class B Consumption","B",{"$f":"SUM(E19:I19)","v":313835212.31930602},{"$f":"'7. CBR Allocation'!G34","v":313835212.31930602}]
[null,"Portion of Consumption of Former Class B Customers","C=B/A",{"$f":"IFERROR(+D19/D18,0)","v":5.6168926681357638E-2}]
[]
[]
[null,"Allocation of Total CBR Class B Balance $"]
[]
[null,"Total CBR-Class B Balance","D",{"$f":"'7. CBR Allocation'!C17","v":38392.709356500076}]
[null,"New Class A Customer(s)' Former Class B Portion of CBR-Class B Balance","E=C*D",{"$f":"+D20*D25","v":2156.477276943926}]
[null,"CBR-Class B Balance to be disposed to Current Class B Customers (if no Class A to Class  B Transition Customers)","F=D-E",{"$f":"+D25-D26","v":36236.232079556154},null,null,null,null,null,null,null,null,null,null,"s"]
[]
[null,"Allocation of CBR Class B Balances to Former Class B Customers"]
[]
[null,"# of Former Class B customer(s)",null,null,2]
[null,"Customer",null,"Total Metered kWh Consumption for each new Class A customer for the period prior to becoming Class A","Metered kWh Consumption for each new Class A customer for the period prior to becoming Class A in 2017",null,null,null,null,"% of kWh","Customer specific CBR-Class B allocation for the period prior to becoming Class A","Monthly Equal Payments"]
[null,"Customer 1",null,{"$f":"SUM(E33:I33)","v":5382021.043392498},{"$f":"'6A. GA Allocation_Class A'!E32","v":5382021.043392498},null,null,null,null,{"$f":"IFERROR(+D33/$D$107,0)","v":1.7149194329145759E-2},{"$f":"+J33*$D$26","v":36.981847888698461},{"$f":"+K33/12","v":3.0818206573915385}]
[null,"Customer 2",null,2398548.8762531271,{"$f":"'6A. GA Allocation_Class A'!E33","v":2398548.8762531271},null,null,null,null,7.6427015901987649E-3,{"$f":"+J34*$D$26","v":16.481312313726846},{"$f":"+K34/12","v":1.3734426928105705}]
[null,"Customer 3",null,4653971.6917620851,{"$f":"'6A. GA Allocation_Class A'!E34","v":4653971.6917620851},null,null,null,null,1.482934836205373E-2,31.979152774654498,2.664929397887875]
[null,"Customer 4",null,5067324.9470668826,{"$f":"'6A. GA Allocation_Class A'!E35","v":5067324.9470668826},null,null,null,null,1.614645122074837E-2,34.819455160827374,2.9016212634022813]
[null,"Customer 5",null,4261870.5882352944,{"$f":"'6A. GA Allocation_Class A'!E36","v":4261870.5882352944},null,null,null,null,1.3579963053665026E-2,29.284881746966676,2.4404068122472231]
[null,"Customer 6",null,2774874.7533611064,{"$f":"'6A. GA Allocation_Class A'!E37","v":2774874.7533611064},null,null,null,null,8.841820944355535E-3,19.067185953309597,1.5889321627757997]
[null,"Customer 7",null,6770068.2284092959,{"$f":"'6A. GA Allocation_Class A'!E38","v":6770068.2284092959},null,null,null,null,2.1572047885822357E-2,46.519631082922174,3.8766359235768477]
[null,"Customer 8",null,2966463.313768887,{"$f":"'6A. GA Allocation_Class A'!E39","v":2966463.313768887},null,null,null,null,9.4522959735656182E-3,20.38366148194282,1.6986384568285684]
[null,"Customer 9",null,5992308.4840141311,{"$f":"'6A. GA Allocation_Class A'!E40","v":5992308.4840141311},null,null,null,null,1.9093805439261431E-2,41.175357560155611,3.4312797966796342]
[null,"Customer 10",null,2375029.0841884613,{"$f":"'6A. GA Allocation_Class A'!E41","v":2375029.0841884613},null,null,null,null,7.567758463546884E-3,16.319699164038934,1.3599749303365778]
[null,"Customer 11",null,3216399.4282555599,{"$f":"'6A. GA Allocation_Class A'!E42","v":3216399.4282555599},null,null,null,null,1.0248688808644876E-2,22.10106453431219,1.8417553778593492]
[null,"Customer 12",null,15509176.032977587,{"$f":"'6A. GA Allocation_Class A'!E43","v":15509176.032977587},null,null,null,null,{"$f":"IFERROR(+D44/$D$107,0)","v":4.9418215114746443E-2},{"$f":"+J44*$D$26","v":106.56925796207757},{"$f":"+K44/12","v":8.8807714968397971}]
[null,"Customer 13",null,1799641.0797424333,{"$f":"'6A. GA Allocation_Class A'!E44","v":1799641.0797424333},null,null,null,null,5.7343504141639167E-3,12.365996366178477,1.0304996971815397]
[null,"Customer 14",null,3718251.0008962671,{"$f":"'6A. GA Allocation_Class A'!E45","v":3718251.0008962671},null,null,null,null,1.1847781430954277E-2,25.549471438051089,2.1291226198375908]
[null,"Customer 15",null,5149166.6426086612,{"$f":"'6A. GA Allocation_Class A'!E46","v":5149166.6426086612},null,null,null,null,1.6407230420561393E-2,35.381819579523778,2.9484849649603149]
[null,"Customer 16",null,5174786.7863219781,{"$f":"'6A. GA Allocation_Class A'!E47","v":5174786.7863219781},null,null,null,null,1.6488866077452723E-2,35.557865018598321,2.9631554182165267]
[null,"Customer 17",null,4718362.933339118,{"$f":"'6A. GA Allocation_Class A'!E48","v":4718362.933339118},null,null,null,null,1.5034523686712707E-2,32.421608700071175,2.7018007250059313]
[null,"Customer 18",null,5775894.7733261921,{"$f":"'6A. GA Allocation_Class A'!E49","v":5775894.7733261921},null,null,null,null,1.8404227908784217E-2,39.688299284990393,3.3073582737491996]
[null,"Customer 19",null,1369819.1694907846,{"$f":"'6A. GA Allocation_Class A'!E50","v":1369819.1694907846},null,null,null,null,4.3647720705638562E-3,9.4125317892104459,0.78437764910087049]
[null,"Customer 20",null,3237959.9956475752,{"$f":"'6A. GA Allocation_Class A'!E51","v":3237959.9956475752},null,null,null,null,1.0317389090020819E-2,22.249215130019067,1.8541012608349223]
[null,"Customer 21",null,4894961.5865631886,{"$f":"'6A. GA Allocation_Class A'!E52","v":4894961.5865631886},null,null,null,null,1.5597235091589714E-2,33.635083058165634,2.8029235881804695]
[null,"Customer 22",null,3950390.1316022878,{"$f":"'6A. GA Allocation_Class A'!E53","v":3950390.1316022878},null,null,null,null,1.258746621326556E-2,27.144584863206585,2.2620487386005488]
[null,"Customer 23",null,2029895.6310424784,{"$f":"'6A. GA Allocation_Class A'!E54","v":2029895.6310424784},null,null,null,null,6.468030199801791E-3,13.948160152459645,1.162346679371637]
[null,"Customer 24",null,2018129.4805076148,{"$f":"'6A. GA Allocation_Class A'!E55","v":2018129.4805076148},null,null,null,null,6.4305387072190771E-3,13.867310600626309,1.1556092167188592]
[null,"Customer 25",null,617671.19562323345,{"$f":"'6A. GA Allocation_Class A'!E56","v":617671.19562323345},null,null,null,null,1.9681386006959439E-3,4.2442461702770178,0.35368718085641815]
[null,"Customer 26",null,4331706.9890903011,{"$f":"'6A. GA Allocation_Class A'!E57","v":4331706.9890903011},null,null,null,null,1.3802488755414365E-2,29.764753366325127,2.4803961138604271]
[null,"Customer 27",null,6246686.5905124387,{"$f":"'6A. GA Allocation_Class A'!E58","v":6246686.5905124387},null,null,null,null,1.9904352173703375E-2,42.923283174880766,3.576940264573397]
[null,"Customer 28",null,5498219.5555653526,{"$f":"'6A. GA Allocation_Class A'!E59","v":5498219.5555653526},null,null,null,null,1.751944759459078E-2,37.780290642344937,3.1483575535287449]
[null,"Customer 29",null,2380105.9841976757,{"$f":"'6A. GA Allocation_Class A'!E60","v":2380105.9841976757},null,null,null,null,7.5839354246077378E-3,16.354584412976671,1.3628820344147226]
[null,"Customer 30",null,1719400.2658449335,{"$f":"'6A. GA Allocation_Class A'!E61","v":1719400.2658449335},null,null,null,null,5.4786722405628608E-3,11.814632194597277,0.98455268288310638]
[null,"Customer 31",null,1109140.3905423628,{"$f":"'6A. GA Allocation_Class A'!E62","v":1109140.3905423628},null,null,null,null,3.5341489641827948E-3,7.6213119345951101,0.63510932788292584]
[null,"Customer 32",null,3862217.2181120031,{"$f":"'6A. GA Allocation_Class A'!E63","v":3862217.2181120031},null,null,null,null,1.2306513311777326E-2,26.538716315255744,2.2115596929379788]
[null,"Customer 33",null,4255554.0541669484,{"$f":"'6A. GA Allocation_Class A'!E64","v":4255554.0541669484},null,null,null,null,1.3559836140494047E-2,29.241478516058439,2.4367898763382034]
[null,"Customer 34",null,1447524.7932839391,{"$f":"'6A. GA Allocation_Class A'!E65","v":1447524.7932839391},null,null,null,null,4.612372150933723E-3,9.946475736297554,0.8288729780247962]
[null,"Customer 35",null,2028168.3056808708,{"$f":"'6A. GA Allocation_Class A'!E66","v":2028168.3056808708},null,null,null,null,6.4625262751502443E-3,13.936291064014572,1.1613575886678811]
[null,"Customer 36",null,4195985.4763397854,{"$f":"'6A. GA Allocation_Class A'!E67","v":4195985.4763397854},null,null,null,null,1.3370027682141209E-2,28.832160888648787,2.4026800740540657]
[null,"Customer 37",null,3329162.8071765928,{"$f":"'6A. GA Allocation_Class A'!E68","v":3329162.8071765928},null,null,null,null,1.0607996414976518E-2,22.87590322279949,1.9063252685666241]
[null,"Customer 38",null,1408076.1377473001,{"$f":"'6A. GA Allocation_Class A'!E69","v":1408076.1377473001},null,null,null,null,4.4866735231567263E-3,9.6754095017534283,0.80628412514611902]
[null,"Customer 39",null,4504174.559277893,{"$f":"'6A. GA Allocation_Class A'!E70","v":4504174.559277893},null,null,null,null,1.4352036936808739E-2,30.949841532087952,2.5791534610073295]
[null,"Customer 40",null,4129830.8518580808,{"$f":"'6A. GA Allocation_Class A'!E71","v":4129830.8518580808},null,null,null,null,1.3159233539594844E-2,28.377588110134671,2.3647990091778892]
[null,"Customer 41",null,2752830.8292194605,{"$f":"'6A. GA Allocation_Class A'!E72","v":2752830.8292194605},null,null,null,null,8.7715805019949189E-3,18.915714035436437,1.5763095029530365]
[null,"Customer 42",null,7868059.3671977418,{"$f":"'6A. GA Allocation_Class A'!E73","v":7868059.3671977418},null,null,null,null,2.5070671034812135E-2,54.06433240430863,4.5053610336923855]
[null,"Customer 43",null,3156083.8680045586,{"$f":"'6A. GA Allocation_Class A'!E74","v":3156083.8680045586},null,null,null,null,1.0056500176256377E-2,21.686614115679465,1.8072178429732888]
[null,"Customer 44",null,4661981.9155833153,{"$f":"'6A. GA Allocation_Class A'!E75","v":4661981.9155833153},null,null,null,null,1.4854872023857111E-2,32.034193971357887,2.6695161642798237]
[null,"Customer 45",null,4771711.453643797,{"$f":"'6A. GA Allocation_Class A'!E76","v":4771711.453643797},null,null,null,null,1.5204512643370638E-2,32.788186022435404,2.7323488352029504]
[null,"Customer 46",null,2600263.2878092579,{"$f":"'6A. GA Allocation_Class A'!E77","v":2600263.2878092579},null,null,null,null,8.2854414856535167E-3,17.867366293260332,1.4889471911050276]
[null,"Customer 47",null,2780357.4048501281,{"$f":"'6A. GA Allocation_Class A'!E78","v":2780357.4048501281},null,null,null,null,8.8592907860871369E-3,19.104859270035604,1.5920716058363003]
[null,"Customer 48",null,3256262.215097954,{"$f":"'6A. GA Allocation_Class A'!E79","v":3256262.215097954},null,null,null,null,1.0375707018449315E-2,22.374976417513558,1.8645813681261298]
[null,"Customer 49",null,5283338.9410218969,{"$f":"'6A. GA Allocation_Class A'!E80","v":5283338.9410218969},null,null,null,null,1.6834755099585378E-2,36.30376683517175,3.025313902930979]
[null,"Customer 50",null,2912704.7655978212,{"$f":"'6A. GA Allocation_Class A'!E81","v":2912704.7655978212},null,null,null,null,9.2810005100203413E-3,20.014266707163852,1.667855558930321]
[null,"Customer 51",null,3173277.5288257599,{"$f":"'6A. GA Allocation_Class A'!E82","v":3173277.5288257599},null,null,null,null,1.0111285809436724E-2,21.804758088735866,1.8170631740613221]
[null,"Customer 52",null,3422266.963210999,{"$f":"'6A. GA Allocation_Class A'!E83","v":3422266.963210999},null,null,null,null,1.0904662156676908E-2,23.515656153624096,1.9596380128020081]
[null,"Customer 53",null,4300190.5403022766,{"$f":"'6A. GA Allocation_Class A'!E84","v":4300190.5403022766},null,null,null,null,1.3702065196964338E-2,29.548192244457795,2.4623493537048162]
[null,"Customer 54",null,2691099.1954751033,{"$f":"'6A. GA Allocation_Class A'!E85","v":2691099.1954751033},null,null,null,null,8.5748797134245491E-3,18.491533254527486,1.5409611045439571]
[null,"Customer 55",null,3096243.8420066824,{"$f":"'6A. GA Allocation_Class A'!E86","v":3096243.8420066824},null,null,null,null,9.865826779362364E-3,21.275431267959814,1.7729526056633178]
[null,"Customer 56",null,9209604.1985195279,{"$f":"'6A. GA Allocation_Class A'!E87","v":9209604.1985195279},null,null,null,null,2.9345350161502529E-2,63.282580807242972,5.2735484006035813]
[null,"Customer 57",null,6208431.0271120304,{"$f":"'6A. GA Allocation_Class A'!E88","v":6208431.0271120304},null,null,null,null,1.9782455197523769E-2,42.660415115621269,3.5550345929684393]
[null,"Customer 58",null,2754773.1945625818,{"$f":"'6A. GA Allocation_Class A'!E89","v":2754773.1945625818},null,null,null,null,8.77776962694609E-3,18.929060742757805,1.5774217285631504]
[null,"Customer 59",null,5485076.8145659715,{"$f":"'6A. GA Allocation_Class A'!E90","v":5485076.8145659715},null,null,null,null,1.7477569753980564E-2,37.689982030661525,3.1408318358884606]
[null,"Customer 60",null,2998332.3659387017,{"$f":"'6A. GA Allocation_Class A'!E91","v":2998332.3659387017},null,null,null,null,9.5538430623524229E-3,20.602645471451371,1.7168871226209477]
[null,"Customer 61",null,5503266.9401998548,{"$f":"'6A. GA Allocation_Class A'!E92","v":5503266.9401998548},null,null,null,null,1.7535530508286795E-2,37.814973080277447,3.1512477566897874]
[null,"Customer 62",null,4702419.374994278,{"$f":"'6A. GA Allocation_Class A'!E93","v":4702419.374994278},null,null,null,null,1.4983721362056357E-2,32.31205464133383,2.6926712201111527]
[null,"Customer 63",null,10467199.538959119,{"$f":"'6A. GA Allocation_Class A'!E94","v":10467199.538959119},null,null,null,null,3.3352533839668234E-2,71.923981353747891,5.9936651128123239]
[null,"Customer 64",null,1447248.1275649334,{"$f":"'6A. GA Allocation_Class A'!E95","v":1447248.1275649334},null,null,null,null,4.6114905872718217E-3,9.9445746642924835,0.82871455535770699]
[null,"Customer 65",null,{"$f":"SUM(E97:I97)","v":8867690.8496217467},{"$f":"'6A. GA Allocation_Class A'!E96","v":8867690.8496217467},null,null,null,null,2.8255882391550996E-2,60.933168317379717,5.0777640264483095]
[null,"Customer 66",null,4066477.4702005396,{"$f":"'6A. GA Allocation_Class A'!E97","v":4066477.4702005396},null,null,null,null,1.2957365236833829E-2,27.942263702295303,2.3285219751912751]
[null,"Customer 67",null,6114189.7375563327,{"$f":"'6A. GA Allocation_Class A'!E98","v":6114189.7375563327},null,null,null,null,1.9482166109950592E-2,42.012848521755494,3.501070710146291]
[null,"Customer 68",null,7752468.2989183497,{"$f":"'6A. GA Allocation_Class A'!E99","v":7752468.2989183497},null,null,null,null,2.4702353319839519E-2,53.270063621274275,4.4391719684395232]
[null,"Customer 69",null,2660559.3004617756,{"$f":"'6A. GA Allocation_Class A'!E100","v":2660559.3004617756},null,null,null,null,8.4775678318557736E-3,18.281682393147761,1.5234735327623135]
[null,"Customer 70",null,5166515.4165866021,{"$f":"'6A. GA Allocation_Class A'!E101","v":5166515.4165866021},null,null,null,null,1.6462510304070099E-2,35.50102939218241,2.9584191160152007]
[null,"Customer 71",null,2411813.9464778895,{"$f":"'6A. GA Allocation_Class A'!E102","v":2411813.9464778895},null,null,null,null,7.6849692188906858E-3,16.572461494551277,1.3810384578792732]
[null,"Customer 72",null,4947601.5547291506,{"$f":"'6A. GA Allocation_Class A'!E103","v":4947601.5547291506},null,null,null,null,1.576496632791894E-2,33.996791657943319,2.8330659714952766]
[null,"Customer 73",null,4661448.9263397502,{"$f":"'6A. GA Allocation_Class A'!E104","v":4661448.9263397502},null,null,null,null,1.485317371460868E-2,32.030531606054424,2.6692109671712019]
[null,"Customer 74",null,5414482.2603568994,{"$f":"'6A. GA Allocation_Class A'!E105","v":5414482.2603568994},null,null,null,null,1.7252628283304396E-2,37.204900860506022,3.1004084050421685]
[null,"Total",null,{"$f":"SUM(D33:D106)","v":313835212.31930602},{"$f":"SUM(E33:E106)","v":313835212.31930602},{"$f":"SUM(F33:F43)","v":0},{"$f":"SUM(G33:G39)","v":0},0,0,{"$f":"SUM(J33:J106)","v":1},{"$f":"SUM(K33:K106)","v":2156.477276943926}]

{"sheet":"7B. CBR Allocation_new Class B","index":12,"n_rows":43,"n_cols":12,"rows_kept":43,"cut":false,"hidden":false,"merged":[[31,1,31,3],[1,1,8,6],[11,1,11,5],[15,1,15,5],[22,1,22,3],[29,1,29,4]]}
["Back to Index"]
[null,{"$f":"+'1. Information Sheet'!B2","v":"INCENTIVE REGULATION MODEL FOR 2019 FILERS"}]
[]
[]
[]
[]
[]
[]
[]
[]
[]
[null,"This tab allocates the CBR-Class B balance to former Class A customers who contributed to the current CBR-Class B balance once switched to Class B customers. The tables below calculate specific amounts for each customer who made the transition. Consistent with both decisions for 2016 rates and EDDVAR, distributors are generally expected to settle the amount through 12 equal adjustments to bills. A one-time settlement is acceptable if the affected customer has expressed a clear preference for this approach. (see Filing Requirements section 3.2.5.2)"]
[]
[null,"Year of Group 1 Account Balance Last Disposed",2016]
[]
[null,"Allocation of total Non-RPP consumption (kWh) between Class B and New Class B (Former Class A) customers"]
[null,null,null,"Total",2017,2015,2014,2013,2012]
[null,"Total Class B Consumption for Years Since Last Disposition (Non-RPP consumption LESS WMP and Class A)","A",{"$f":"SUM(E18:I18)","v":5587345724.0810575},{"$f":"'7. CBR Allocation'!C34-'7. CBR Allocation'!E34","v":5587345724.0810575}]
[null,"New Class B Customer(s)'  Consumption","B",{"$f":"SUM(E19:I19)","v":58610111.269884698},{"$f":"E43","v":58610111.269884698},{"$f":"F43","v":0},{"$f":"G43","v":0},{"$f":"H43","v":0},{"$f":"I43","v":0}]
[null,"Portion of Consumption of New Class B Customers","C=B/A",{"$f":"IFERROR(+D19/D18,0)","v":1.0489795005395736E-2}]
[]
[]
[null,"Allocation of Total CBR-Class B Balance $"]
[]
[null,"Total CBR-Calss B Balance adjusted for Class A","D",{"$f":"'7. CBR Allocation'!C17","v":38392.709356500076}]
[null,"New Class B Customer(s)' Former Class A Portion of CBR-Class B Balance attributable to Class B","E=C*D",{"$f":"D20*D25","v":402.7316508514246}]
[null,"New Class A Customer(s)' Former Class B Portion of CBR-Class B Balance","F=Sheet 6A",{"$f":"'7A. CBR Allocation_Class A'!D26","v":2156.477276943926}]
[null,"CBR-Class B Balance to be disposed to Current Class B Customers","G=D-E-F",{"$f":"+D25-D26-D27","v":35833.50042870472},"Input into Sheet 7. CBR Calculation"]
[]
[null,"Allocation of CBR-Class B Balances to Former Class A Customers"]
[]
[null,"# of Former Class B customer(s)",null,null,2]
[null,"Customer",null,"Total Metered kWh Consumption for each new Class B customer for the period after becoming Class B","Metered kWh Consumption for each new Class B customer for the period after becoming Class B in 2017",null,null,null,null,"% of kWh","Customer specific CBR-Class B allocation for the period after becoming Class B","Monthly Equal Payments"]
[null,"Customer 1",null,{"$f":"SUM(E34:I34)","v":28015213.332781807},{"$f":"'6B. GA Allocation_new Class B'!E33","v":28015213.332781807},null,null,null,null,{"$f":"IFERROR(+D34/$D$43,0)","v":0.47799283648821028},{"$f":"+J34*$D$26","v":192.502844134052},{"$f":"+K34/12","v":16.041903677837666}]
[null,"Customer 2",null,30594897.937102892,{"$f":"'6B. GA Allocation_new Class B'!E34","v":30594897.937102892},null,null,null,null,0.52200716351178977,{"$f":"+J35*$D$26","v":210.22880671737263},{"$f":"+K35/12","v":17.519067226447721}]
[null,null,null,null,{"$f":"'6B. GA Allocation_new Class B'!E37","v":0},null,null,null,null,0,0,0]
[null,null,null,null,{"$f":"'6B. GA Allocation_new Class B'!E38","v":0},null,null,null,null,0,0,0]
[null,null,null,null,{"$f":"'6B. GA Allocation_new Class B'!E39","v":0},null,null,null,null,0,0,0]
[null,null,null,null,{"$f":"'6B. GA Allocation_new Class B'!E40","v":0},null,null,null,null,0,0,0]
[null,null,null,null,{"$f":"'6B. GA Allocation_new Class B'!E41","v":0},null,null,null,null,0,0,0]
[null,null,null,null,{"$f":"'6B. GA Allocation_new Class B'!E42","v":0},null,null,null,null,0,0,0]
[null,null,null,null,{"$f":"'6B. GA Allocation_new Class B'!E43","v":0},null,null,null,null,0,0,0]
[null,"Total",null,{"$f":"SUM(D34:D42)","v":58610111.269884698},{"$f":"SUM(E34:E42)","v":58610111.269884698},{"$f":"SUM(F34:F42)","v":0},{"$f":"SUM(G34:G38)","v":0},0,0,{"$f":"SUM(J34:J42)","v":1},{"$f":"SUM(K34:K42)","v":402.73165085142466}]

{"sheet":"8. Calculation of Def-Var RR","index":13,"n_rows":31,"n_cols":19,"rows_kept":31,"cut":false,"hidden":false,"merged":[[14,16,15,16],[1,1,8,7],[14,10,15,10],[14,11,15,11],[15,12,15,13],[10,1,10,10],[11,1,11,2],[12,1,12,2],[14,3,15,3],[14,4,15,4],[14,5,15,5],[14,6,15,6],[14,7,15,7],[14,8,15,8],[14,9,15,9]]}
["Back to Index"]
[null,{"$f":"+'1. Information Sheet'!B2","v":"INCENTIVE REGULATION MODEL FOR 2019 FILERS"}]
[]
[]
[]
[]
[]
[]
[]
[]
[null,"Input required at cell D13 only.  This workshseet calculates rate riders related to the Deferral/Variance Account Disposition (if applicable) and rate riders for Account 1568.  Rate Riders will not be generated for the microFIT class."]
[null,"Default Rate Rider Recovery Period (in months)",null,12]
[null,"Proposed Rate Rider Recovery Period (in months)",null,12,{"$f":"IF(D13>0, \"Rate Rider Recovery to be used below\", \"If no rate rider recovery period is proposed then the default recovery period of 12 months will be used\")","v":"Rate Rider Recovery to be used below"}]
[]
[null,null,null,"Total Metered kWh","Metered kW \nor kVA","Total Metered kWh less WMP consumption ","Total Metered kW less WMP consumption ","Allocation of Group 1 Account Balances to All Classes 2","Allocation of Group 1 Account Balances to Non-WMP Classes Only \n(if Applicable) 2","Deferral/Variance Account Rate Rider 2","Deferral/Variance Account Rate Rider for Non-WMP \n(if applicable) 2","Account 1568 Rate Rider",null,null,null,null,"Account \n1568 Fixed RR"]
[null,"Rate Class","Unit",null,null,null,null,null,null,null,null,null,"Revenue Reconciliation:",null,"Revenue\n Reconcilation 1",null,"Fixed RR"]
[null,{"$f":"'4. Billing Det. for Def-Var'!B17","v":"RESIDENTIAL SERVICE CLASSIFICATION"},{"$f":"'4. Billing Det. for Def-Var'!C17","v":"kWh"},{"$f":"'4. Billing Det. for Def-Var'!D17","v":1440461108.0256596},{"$f":"'4. Billing Det. for Def-Var'!E17","v":0},{"$f":"'4. Billing Det. for Def-Var'!J17","v":1440461108.0256596},{"$f":"'4. Billing Det. for Def-Var'!K17","v":0},{"$f":"SUM('5. Allocating Def-Var Balances'!G16:V16)-I17","v":-565425.69354018557},null,{"$f":"IF(ISERROR(H17/D17),0,IF(OR(ISBLANK(D$13), OR(D$13=0, D$13=\"\")), H17/D17/(D$12/12), H17/D17/(D$13/12)))","v":-3.925310377280338E-4},{"$f":"IF(ISERROR(I17/F17),0,IF(OR(ISBLANK(D$13), OR(D$13=0, D$13=\"\")), I17/F17/(D$12/12), I17/F17/(D$13/12)))","v":0},{"$f":"IF(ISERROR('4. Billing Det. for Def-Var'!T17/D17), 0, IF(OR(ISBLANK(D$13), OR(D$13=0, D$13=\"\")), ('4. Billing Det. for Def-Var'!T17/D17)/(D$12/12), ('4. Billing Det. for Def-Var'!T17/D17)/(D$13/12)))","v":1.5198451008240717E-4},{"$f":"J17*D17","v":-565425.69354018557},{"$f":"K17*F17","v":0},null,null,{"$f":"(('4. Billing Det. for Def-Var'!T17/'4. Billing Det. for Def-Var'!U17)/12)*0","v":0},-344680.55963603873,{"$f":"+R17/D17","v":-2.3928487740184013E-4}]
[null,{"$f":"'4. Billing Det. for Def-Var'!B18","v":"GENERAL SERVICE LESS THAN 50 kW SERVICE CLASSIFICATION"},{"$f":"'4. Billing Det. for Def-Var'!C18","v":"kWh"},{"$f":"'4. Billing Det. for Def-Var'!D18","v":618679646.43210387},{"$f":"'4. Billing Det. for Def-Var'!E18","v":0},{"$f":"'4. Billing Det. for Def-Var'!J18","v":618679646.43210387},{"$f":"'4. Billing Det. for Def-Var'!K18","v":0},{"$f":"SUM('5. Allocating Def-Var Balances'!G17:V17)-I18","v":-234713.0526409357},null,{"$f":"IF(ISERROR(H18/D18),0,IF(OR(ISBLANK(D$13), OR(D$13=0, D$13=\"\")), H18/D18/(D$12/12), H18/D18/(D$13/12)))","v":-3.7937736273451812E-4},{"$f":"IF(ISERROR(I18/F18),0,IF(OR(ISBLANK(D$13), OR(D$13=0, D$13=\"\")), I18/F18/(D$12/12), I18/F18/(D$13/12)))","v":0},{"$f":"IF(ISERROR('4. Billing Det. for Def-Var'!T18/D18), 0, IF(OR(ISBLANK(D$13), OR(D$13=0, D$13=\"\")), ('4. Billing Det. for Def-Var'!T18/D18)/(D$12/12), ('4. Billing Det. for Def-Var'!T18/D18)/(D$13/12)))","v":2.0173311723358108E-4},{"$f":"J18*D18","v":-234713.0526409357},{"$f":"K18*F18","v":0},null,null,null,368325.67791683605,{"$f":"R18/D18","v":5.9534151485498633E-4}]
[null,{"$f":"'4. Billing Det. for Def-Var'!B19","v":"GENERAL SERVICE 50 to 499 kW SERVICE CLASSIFICATION"},{"$f":"'4. Billing Det. for Def-Var'!C19","v":"kW"},{"$f":"'4. Billing Det. for Def-Var'!D19","v":1993768779.4230022},{"$f":"'4. Billing Det. for Def-Var'!E19","v":5780039.1019777982},{"$f":"'4. Billing Det. for Def-Var'!J19","v":1991646558.6029251},{"$f":"'4. Billing Det. for Def-Var'!K19","v":5773382.2019777978},{"$f":"SUM('5. Allocating Def-Var Balances'!G18:V18)-I19","v":1264936.6697409265},{"$f":"'5. Allocating Def-Var Balances'!I18+'5. Allocating Def-Var Balances'!N18","v":-2011169.3797271699},{"$f":"IF(ISERROR(H19/E19),0,IF(OR(ISBLANK(D$13), OR(D$13=0, D$13=\"\")), H19/E19/(D$12/12), H19/E19/(D$13/12)))","v":0.21884569419402264},{"$f":"IF(ISERROR(I19/G19),0,IF(OR(ISBLANK(D$13), OR(D$13=0, D$13=\"\")), I19/G19/(D$12/12), I19/G19/(D$13/12)))","v":-0.3483520247521808},{"$f":"IF(ISERROR('4. Billing Det. for Def-Var'!T19/E19), 0, IF(OR(ISBLANK(D$13), OR(D$13=0, D$13=\"\")), ('4. Billing Det. for Def-Var'!T19/E19)/(D$12/12), ('4. Billing Det. for Def-Var'!T19/E19)/(D$13/12)))","v":0.19505268885751104},{"$f":"J19*E19","v":1264936.6697409265},{"$f":"K19*G19","v":-2011169.3797271699},null,null,null,2658869.6161364578,{"$f":"R19/E19","v":0.4600089323317299}]
[null,{"$f":"'4. Billing Det. for Def-Var'!B20","v":"GENERAL SERVICE 500 to 4,999 kW SERVICE CLASSIFICATION"},{"$f":"'4. Billing Det. for Def-Var'!C20","v":"kW"},{"$f":"'4. Billing Det. for Def-Var'!D20","v":2006067809.7416933},{"$f":"'4. Billing Det. for Def-Var'!E20","v":4610762.3348864596},{"$f":"'4. Billing Det. for Def-Var'!J20","v":1991041119.2942781},{"$f":"'4. Billing Det. for Def-Var'!K20","v":4581930.7148864595},{"$f":"SUM('5. Allocating Def-Var Balances'!G19:V19)-I20","v":1272739.7282565031},{"$f":"'5. Allocating Def-Var Balances'!I19+'5. Allocating Def-Var Balances'!N19","v":-2010558.0056891539},{"$f":"IF(ISERROR(H20/E20),0,IF(OR(ISBLANK(D$13), OR(D$13=0, D$13=\"\")), H20/E20/(D$12/12), H20/E20/(D$13/12)))","v":0.27603672360784226},{"$f":"IF(ISERROR(I20/G20),0,IF(OR(ISBLANK(D$13), OR(D$13=0, D$13=\"\")), I20/G20/(D$12/12), I20/G20/(D$13/12)))","v":-0.43880148583586248},{"$f":"IF(ISERROR('4. Billing Det. for Def-Var'!T20/E20), 0, IF(OR(ISBLANK(D$13), OR(D$13=0, D$13=\"\")), ('4. Billing Det. for Def-Var'!T20/E20)/(D$12/12), ('4. Billing Det. for Def-Var'!T20/E20)/(D$13/12)))","v":7.5227898978457483E-2},{"$f":"J20*E20","v":1272739.7282565031},{"$f":"K20*G20","v":-2010558.0056891539},null,null,null,621339.32282633521,{"$f":"R20/E20","v":0.13475847976918892}]
[null,{"$f":"'4. Billing Det. for Def-Var'!B21","v":"LARGE USE SERVICE CLASSIFICATION"},{"$f":"'4. Billing Det. for Def-Var'!C21","v":"kW"},{"$f":"'4. Billing Det. for Def-Var'!D21","v":981267691.25849652},{"$f":"'4. Billing Det. for Def-Var'!E21","v":1753815.618647513},{"$f":"'4. Billing Det. for Def-Var'!J21","v":981267691.25849652},{"$f":"'4. Billing Det. for Def-Var'!K21","v":1753815.618647513},{"$f":"SUM('5. Allocating Def-Var Balances'!G20:V20)-I21","v":-368326.02448471234},null,{"$f":"IF(ISERROR(H21/E21),0,IF(OR(ISBLANK(D$13), OR(D$13=0, D$13=\"\")), H21/E21/(D$12/12), H21/E21/(D$13/12)))","v":-0.21001410899097461},{"$f":"IF(ISERROR(I21/G21),0,IF(OR(ISBLANK(D$13), OR(D$13=0, D$13=\"\")), I21/G21/(D$12/12), I21/G21/(D$13/12)))","v":0},{"$f":"IF(ISERROR('4. Billing Det. for Def-Var'!T21/E21), 0, IF(OR(ISBLANK(D$13), OR(D$13=0, D$13=\"\")), ('4. Billing Det. for Def-Var'!T21/E21)/(D$12/12), ('4. Billing Det. for Def-Var'!T21/E21)/(D$13/12)))","v":6.3964728664955978E-2},{"$f":"J21*E21","v":-368326.02448471234},{"$f":"K21*G21","v":0},null,null,null,156324.61129993584,{"$f":"R21/E21","v":8.9134005671866703E-2}]
[null,{"$f":"'4. Billing Det. for Def-Var'!B22","v":"STANDBY POWER SERVICE CLASSIFICATION "},{"$f":"'4. Billing Det. for Def-Var'!C22","v":"kW"},{"$f":"'4. Billing Det. for Def-Var'!D22","v":0},{"$f":"'4. Billing Det. for Def-Var'!E22","v":0},{"$f":"'4. Billing Det. for Def-Var'!J22","v":0},{"$f":"'4. Billing Det. for Def-Var'!K22","v":0},{"$f":"SUM('5. Allocating Def-Var Balances'!G21:V21)-I22","v":0},null,{"$f":"IF(ISERROR(H22/E22),0,IF(OR(ISBLANK(D$13), OR(D$13=0, D$13=\"\")), H22/E22/(D$12/12), H22/E22/(D$13/12)))","v":0},0,{"$f":"IF(ISERROR('4. Billing Det. for Def-Var'!T22/D22), 0, IF(OR(ISBLANK(D$13), OR(D$13=0, D$13=\"\")), ('4. Billing Det. for Def-Var'!T22/D22)/(D$12/12), ('4. Billing Det. for Def-Var'!T22/D22)/(D$13/12)))","v":0},{"$f":"J22*E22","v":0},{"$f":"K22*G22","v":0}]
[null,{"$f":"'4. Billing Det. for Def-Var'!B23","v":"UNMETERED SCATTERED LOAD SERVICE CLASSIFICATION"},{"$f":"'4. Billing Det. for Def-Var'!C23","v":"kWh"},{"$f":"'4. Billing Det. for Def-Var'!D23","v":11421124.458372911},{"$f":"'4. Billing Det. for Def-Var'!E23","v":0},{"$f":"'4. Billing Det. for Def-Var'!J23","v":11421124.458372911},{"$f":"'4. Billing Det. for Def-Var'!K23","v":0},{"$f":"SUM('5. Allocating Def-Var Balances'!G22:V22)-I23","v":-4287.0028274368542},null,{"$f":"IF(ISERROR(H23/D23),0,IF(OR(ISBLANK(D$13), OR(D$13=0, D$13=\"\")), H23/D23/(D$12/12), H23/D23/(D$13/12)))","v":-3.7535733395270207E-4},{"$f":"IF(ISERROR(I23/F23),0,IF(OR(ISBLANK(D$13), OR(D$13=0, D$13=\"\")), I23/F23/(D$12/12), I23/F23/(D$13/12)))","v":0},{"$f":"IF(ISERROR('4. Billing Det. for Def-Var'!T23/D23), 0, IF(OR(ISBLANK(D$13), OR(D$13=0, D$13=\"\")), ('4. Billing Det. for Def-Var'!T23/D23)/(D$12/12), ('4. Billing Det. for Def-Var'!T23/D23)/(D$13/12)))","v":0},{"$f":"J23*D23","v":-4287.0028274368542},{"$f":"K23*F23","v":0}]
[null,{"$f":"'4. Billing Det. for Def-Var'!B24","v":"STREET LIGHTING SERVICE CLASSIFICATION"},{"$f":"'4. Billing Det. for Def-Var'!C24","v":"kW"},{"$f":"'4. Billing Det. for Def-Var'!D24","v":14875866.197228426},{"$f":"'4. Billing Det. for Def-Var'!E24","v":41239.546182825972},{"$f":"'4. Billing Det. for Def-Var'!J24","v":14875866.197228426},{"$f":"'4. Billing Det. for Def-Var'!K24","v":41239.546182825972},{"$f":"SUM('5. Allocating Def-Var Balances'!G23:V23)-I24","v":-5583.7654760287814},null,{"$f":"IF(ISERROR(H24/E24),0,IF(OR(ISBLANK(D$13), OR(D$13=0, D$13=\"\")), H24/E24/(D$12/12), H24/E24/(D$13/12)))","v":-0.13539832497851578},{"$f":"IF(ISERROR(I24/G24),0,IF(OR(ISBLANK(D$13), OR(D$13=0, D$13=\"\")), I24/G24/(D$12/12), I24/G24/(D$13/12)))","v":0},{"$f":"IF(ISERROR('4. Billing Det. for Def-Var'!T24/E24), 0, IF(OR(ISBLANK(D$13), OR(D$13=0, D$13=\"\")), ('4. Billing Det. for Def-Var'!T24/E24)/(D$12/12), ('4. Billing Det. for Def-Var'!T24/E24)/(D$13/12)))","v":-3.7907555203078198},{"$f":"J24*E24","v":-5583.7654760287814},{"$f":"K24*G24","v":0},null,null,null,-1313772.6249926772,{"$f":"R24/E24","v":-31.857106748177362}]
[]
[]
[null,null,null,null,null,null,null,null,null,null,null,null,{"$f":"SUM(M17:M26)","v":1359340.8590281303},{"$f":"SUM(N17:N26)","v":-4021727.3854163238},{"$f":"SUM(M27:N27)","v":-2662386.5263881935}]
[null,null,null,null,null,null,null,null,null,null,null,null,null,null,{"$f":"O27-'3. Continuity Schedule'!CN39+'7B. CBR Allocation_new Class B'!D25","v":1.1714291758835316E-9}]
[]
[null,"1 When calculating the revenue reconciliation for distributors with Class A customers, the balances of sub-account 1580-CBR Class A and B will not be taken into consideration since the rate riders, if any, are calculated outside of the model."]
[null,"2 Only for rate classes with WMP customers are the Deferral/Variance Account Rate Riders for Non-WMP (column H and J) calculated separately. For all rate classes without WMP customers, balances in account 1580 and 1588 are included in column H and disposed through a combined Deferral/Variance Account and Rate Rider."]

{"sheet":"9. STS-Tax Change","index":14,"n_rows":46,"n_cols":22,"rows_kept":46,"cut":false,"hidden":false,"merged":[[14,1,14,11],[18,1,18,8],[1,1,8,14]]}
["Back to Index",null,null,null,null,null,null,null,null,null,null,null,null,null,null,null,null,null,null,null,"Tax Rates","Effective"]
[null,{"$f":"+'1. Information Sheet'!B2","v":"INCENTIVE REGULATION MODEL FOR 2019 FILERS"},null,null,null,null,null,null,null,null,null,null,null,null,null,null,null,null,null,null,"Federal & Provincial","2016-01-01"]
[null,null,null,null,null,null,null,null,null,null,null,null,null,null,null,null,null,null,null,null,"As of June 20, 2012"]
[]
[null,null,null,null,null,null,null,null,null,null,null,null,null,null,null,null,null,null,null,null,"Federal income tax",0.38]
[null,null,null,null,null,null,null,null,null,null,null,null,null,null,null,null,null,null,null,null,"General corporate rate",-0.1]
[null,null,null,null,null,null,null,null,null,null,null,null,null,null,null,null,null,null,null,null,"Federal tax abatement",{"$f":"SUM(V5:V6)","v":0.28000000000000003}]
[null,null,null,null,null,null,null,null,null,null,null,null,null,null,null,null,null,null,null,null,"  Adjusted federal rate",-0.13]
[null,null,null,null,null,null,null,null,null,null,null,null,null,null,null,null,null,null,null,null,"Rate reduction",{"$f":"V7+V8","v":0.15000000000000002}]
[null,null,null,null,null,null,null,null,null,null,null,null,null,null,null,null,null,null,null,null,"Ontario income tax ",0.115]
[]
[null,null,null,null,null,null,null,null,null,null,null,null,null,null,null,null,null,null,null,null,"Combined federal and Ontario ",{"$f":"V9+V10","v":0.26500000000000001}]
[null,"Summary - Sharing of Tax Change Forecast Amounts"]
[null,null,null,null,null,null,null,null,null,null,null,null,null,null,null,null,null,null,null,null,"Federal & Ontario Small Business"]
[null,{"$f":"\"For the \" & '1. Information Sheet'!G32 & \" year, enter any Tax Credits from the Cost of Service Tax Calculation (Positive #)\"","v":"For the 2013 year, enter any Tax Credits from the Cost of Service Tax Calculation (Positive #)"},null,null,null,null,null,null,null,null,null,null,null,null,null,null,null,null,null,null,"Federal small business threshold",500000]
[null,null,null,null,null,null,null,null,null,null,null,null,null,null,null,null,null,null,null,null,"Ontario Small Business Threshold",500000]
[]
[null,"1. Tax Related Amounts Forecast from Capital Tax Rate Changes ",null,null,null,null,null,null,null,null,null,null,{"$f":"'1. Information Sheet'!G32","v":2013},null,2018,null,null,null,null,null,"Federal small business rate",0.105]
[null,"Taxable Capital (if you are not claiming capital tax, please enter your OEB-Approved Rate Base)",null,null,null,null,null,null,null,null,null,null,null,null,{"$f":"M19","v":0}]
[null,null,null,null,null,null,null,null,null,null,null,null,null,null,null,null,null,null,null,null,"Ontario small business rate",4.4999999999999998E-2]
[null,"Deduction from taxable capital up to $15,000,000",null,null,null,null,null,null,null,null,null,null,null,null,{"$f":"M21","v":0}]
[]
[null,"Net Taxable Capital ",null,null,null,null,null,null,null,null,null,null,{"$f":"M19-M21","v":0},null,{"$f":"O19-O21","v":0}]
[]
[null,"Rate",null,null,null,null,null,null,null,null,null,null,null,null,0,null,null,null,null,null,"Ontario Tax Rate (Maximum 11.5%)"]
[null,null,null,null,null,null,null,null,null,null,null,null,null,null,null,null,null,null,null,null,"Federal tax rate (Maximum 15%)"]
[null,"Ontario Capital Tax (Deductible, not grossed-up)",null,null,null,null,null,null,null,null,null,null,{"$f":"IF(M23>0, M23*M25, 0)*181/365","v":0},null,0,null,null,null,null,null,"Combined tax rate (Maximum 26.5%)"]
[]
[null,"2. Tax Related Amounts Forecast from lncome Tax Rate Changes "]
[null,"Regulatory Taxable Income",null,null,null,null,null,null,null,null,null,null,null,null,{"$f":"M30","v":0}]
[]
[null,"Corporate Tax Rate",null,null,null,null,null,null,null,null,null,null,0.26500000000000001,null,{"$f":"IF(ratebase>15000000, 26.5%, IF(ratebase<10000000, 15%, 15%+11.5%*((ratebase-10000000)/5000000)))","v":0.15}]
[]
[null,"Tax Impact ",null,null,null,null,null,null,null,null,null,null,{"$f":"M30*M32-M15","v":0},null,{"$f":"O30*O32-M15","v":0}]
[]
[null,"Grossed-up Tax Amount",null,null,null,null,null,null,null,null,null,null,{"$f":"M34/(1-M32)","v":0},null,{"$f":"O34/(1-O32)","v":0}]
[]
[null,"Tax Related Amounts Forecast from Capital Tax Rate Changes ",null,null,null,null,null,null,null,null,null,null,{"$f":"M27","v":0},null,{"$f":"O27","v":0}]
[]
[null,"Tax Related Amounts Forecast from lncome Tax Rate Changes ",null,null,null,null,null,null,null,null,null,null,{"$f":"M36","v":0},null,{"$f":"O36","v":0}]
[]
[null,"Total Tax Related Amounts",null,null,null,null,null,null,null,null,null,null,{"$f":"SUM(M40,M38)","v":0},null,{"$f":"SUM(O40,O38)","v":0}]
[]
[null,"Incremental Tax Savings",null,null,null,null,null,null,null,null,null,null,null,null,{"$f":"O42-M42","v":0}]
[]
[null,"Sharing of Tax Amount (50%)",null,null,null,null,null,null,null,null,null,null,null,null,{"$f":"0.5*O44","v":0}]

{"sheet":"10. Shared Tax - RR","index":15,"n_rows":48,"n_cols":17,"rows_kept":48,"cut":false,"hidden":false,"merged":[[1,1,8,6],[33,8,41,11]]}
["Back to Index"]
[null,{"$f":"+'1. Information Sheet'!B2","v":"INCENTIVE REGULATION MODEL FOR 2019 FILERS"}]
[]
[]
[]
[]
[]
[]
[]
[]
[]
[null,"Calculation of Rebased Revenue Requirement and Allocation of Tax Sharing Amount.  Enter data from the last OEB-Approved Cost of Service application in columns D through I."]
[null,"As per Chapter 3 Filing Requirements, shared tax rate riders are based on a 1 year disposition."]
[]
[null,"Rate Class",null,"Re-based Billed Customers or Connections","Re-based Billed kWh","Re-based Billed kW","Re-based Service Charge","Re-based Distribution Volumetric Rate kWh","Re-based Distribution Volumetric Rate kW","Service Charge Revenue","Distribution Volumetric Rate Revenue \nkWh","Distribution Volumetric Rate Revenue \nkW","Revenue Requirement from Rates","Service Charge \n% Revenue","Distribution Volumetric Rate \n% Revenue \nkWh","Distribution Volumetric Rate \n% Revenue \nkW","Total % Revenue"]
[null,null,null,"A","B","C","D","E","F","G = A * D *12","H = B * E","I = C * F","J = G + H + I","K = G / J","L = H / J","M = I / J","N = J / R"]
[null,{"$f":"'4. Billing Det. for Def-Var'!B17","v":"RESIDENTIAL SERVICE CLASSIFICATION"},{"$f":"'4. Billing Det. for Def-Var'!C17","v":"kWh"},140979.18172386964,1308264983.2731071,0,11.07,1.55E-2,0,{"$f":"G17*D17*12","v":18727674.500198841},{"$f":"E17*H17","v":20278107.240733158},{"$f":"F17*I17","v":0},{"$f":"J17+K17+L17","v":39005781.740932003},{"$f":"IF(ISERROR(J17/M17),0,J17/M17)","v":0.48012560354729},{"$f":"IF(ISERROR(K17/M17),0,K17/M17)","v":0.51987439645270994},{"$f":"IF(ISERROR(L17/M17),0,L17/M17)","v":0},{"$f":"IF(ISERROR(M17/M$30),0,M17/M$30)","v":0.56143283070244876}]
[null,{"$f":"'4. Billing Det. for Def-Var'!B18","v":"GENERAL SERVICE LESS THAN 50 kW SERVICE CLASSIFICATION"},{"$f":"'4. Billing Det. for Def-Var'!C18","v":"kWh"},8989.460008453565,354668870.2835499,0,24.39,1.61E-2,0,2631035.1552741891,5710168.8115651533,0,8341203.9668393424,{"$f":"IF(ISERROR(J18/M18),0,J18/M18)","v":0.31542630605053334},{"$f":"IF(ISERROR(K18/M18),0,K18/M18)","v":0.68457369394946666},{"$f":"IF(ISERROR(L18/M18),0,L18/M18)","v":0},{"$f":"IF(ISERROR(M18/M$30),0,M18/M$30)","v":0.12005978461533612}]
[null,{"$f":"'4. Billing Det. for Def-Var'!B19","v":"GENERAL SERVICE 50 to 499 kW SERVICE CLASSIFICATION"},{"$f":"'4. Billing Det. for Def-Var'!C19","v":"kW"},1490.7244903381991,1064497598.5537131,2979825.6981246667,121.18,0,2.7446000000000002,2167751.9248701958,0,8178429.6110729603,10346181.535943156,0.20952193012845524,0,{"$f":"IF(ISERROR(L19/M19),0,L19/M19)","v":0.79047806987154479},0.14891858917906109]
[null,{"$f":"'4. Billing Det. for Def-Var'!B20","v":"GENERAL SERVICE 500 to 4,999 kW SERVICE CLASSIFICATION"},{"$f":"'4. Billing Det. for Def-Var'!C20","v":"kW"},114.61641141787759,806154179.88763332,1969146.4021656737,1093.3499999999999,0,3.1861000000000002,1503790.2410848374,0,6273897.3519400535,7777687.5930248909,0.1933467014583424,0,0.80665329854165757,0.11194876674113655]
[null,{"$f":"'4. Billing Det. for Def-Var'!B21","v":"LARGE USE SERVICE CLASSIFICATION"},{"$f":"'4. Billing Det. for Def-Var'!C21","v":"kW"},6,382619513.4019751,719987.09163337958,4549.67,0,2.4121999999999999,327576.24,0,1736752.8624380382,2064329.1024380382,0.15868411660385065,0,0.84131588339614938,2.9713085592821667E-2]
[null,{"$f":"'4. Billing Det. for Def-Var'!B22","v":"STANDBY POWER SERVICE CLASSIFICATION "},{"$f":"'4. Billing Det. for Def-Var'!C22","v":"kW"},1,0,54580,0,0,1.6224000000000001,0,0,88550.592000000004,88550.592000000004,0,0,1,1.2745600090041862E-3]
[null,{"$f":"'4. Billing Det. for Def-Var'!B23","v":"UNMETERED SCATTERED LOAD SERVICE CLASSIFICATION"},{"$f":"'4. Billing Det. for Def-Var'!C23","v":"kWh"},1561.7181617727067,5931732.9043365736,0,1.05,1.9199999999999998E-2,0,19677.648838336107,113889.27176326221,0,133566.92060159831,0.14732426823727068,0.85267573176272937,0,1.9225061253642954E-3]
[null,{"$f":"'4. Billing Det. for Def-Var'!B24","v":"STREET LIGHTING SERVICE CLASSIFICATION"},{"$f":"'4. Billing Det. for Def-Var'!C24","v":"kW"},22334.563518950279,33306954.548778366,100671.89144675127,2.2200000000000002,0,11.1563,594992.77214483556,0,1123125.8225473911,1718118.5946922265,0.34630483249697847,0,0.65369516750302159,2.4729877034827548E-2]
[null,null,null,null,null,null,null,null,null,0,0,0,0,0,0,0,0]
[null,null,null,null,null,null,null,null,null,{"$f":"G26*D26*12","v":0},{"$f":"E26*H26","v":0},{"$f":"F26*I26","v":0},{"$f":"J26+K26+L26","v":0},{"$f":"IF(ISERROR(J26/M26),0,J26/M26)","v":0},{"$f":"IF(ISERROR(K26/M26),0,K26/M26)","v":0},{"$f":"IF(ISERROR(L26/M26),0,L26/M26)","v":0},0]
[null,null,null,null,null,null,null,null,null,0,0,0,0,0,0,0,0]
[null,null,null,null,null,null,null,null,null,0,0,0,0,0,0,0,0]
[null,null,null,null,null,null,null,null,null,0,0,0,0,0,0,0,0]
[null,"Total",null,{"$f":"SUM(D17:D29)","v":175477.26431480228},{"$f":"SUM(E17:E29)","v":3955443832.8530931},5824211.0833704714,null,null,null,{"$f":"SUM(J17:J29)","v":25972498.482411236},{"$f":"SUM(K17:K29)","v":26102165.324061573},17400756.239998445,69475420.046471238,null,null,null,{"$f":"SUM(Q17:Q29)","v":1.0000000000000002}]
[]
[]
[null,"Rate Class",null,"Total kWh\n(most recent RRR filing)","Total kW\n(most recent RRR filing)","Allocation of Tax Savings by Rate Class","Distribution Rate Rider"]
[null,{"$f":"B17","v":"RESIDENTIAL SERVICE CLASSIFICATION"},"kWh",{"$f":"'4. Billing Det. for Def-Var'!D17","v":1440461108.0256596},{"$f":"'4. Billing Det. for Def-Var'!E17","v":0},{"$f":"F$48*Q17","v":0},{"$f":"ROUND(F34/'4. Billing Det. for Def-Var'!U17,2)","v":0},"$/Customer","If the allocated tax sharing amount does not produce a rate rider in one or more rate class (except for the Standby rate class), a distributor is required to transfer the entire OEB-approved tax sharing amount into account 1595 for disposition at a later date (see Filing Requirements, Appendix B)"]
[null,"GENERAL SERVICE LESS THAN 50 kW SERVICE CLASSIFICATION","kWh",{"$f":"'4. Billing Det. for Def-Var'!D18","v":618679646.43210387},{"$f":"'4. Billing Det. for Def-Var'!E18","v":0},0,{"$f":"IFERROR(ROUND(IF(E35<>0,F35/E35,F35/D35),4),\"\")","v":0},"$/kWh"]
[null,"GENERAL SERVICE 50 to 499 kW SERVICE CLASSIFICATION","kW",{"$f":"'4. Billing Det. for Def-Var'!D19","v":1993768779.4230022},{"$f":"'4. Billing Det. for Def-Var'!E19","v":5780039.1019777982},0,{"$f":"IFERROR(ROUND(IF(E36<>0,F36/E36,F36/D36),4),\"\")","v":0},"$/kW"]
[null,"GENERAL SERVICE 500 to 4,999 kW SERVICE CLASSIFICATION","kW",{"$f":"'4. Billing Det. for Def-Var'!D20","v":2006067809.7416933},{"$f":"'4. Billing Det. for Def-Var'!E20","v":4610762.3348864596},0,0,"$/kW"]
[null,"LARGE USE SERVICE CLASSIFICATION","kW",{"$f":"'4. Billing Det. for Def-Var'!D21","v":981267691.25849652},{"$f":"'4. Billing Det. for Def-Var'!E21","v":1753815.618647513},0,0,"$/kWh"]
[null,"STANDBY POWER SERVICE CLASSIFICATION ","kW",{"$f":"'4. Billing Det. for Def-Var'!D22","v":0},{"$f":"'4. Billing Det. for Def-Var'!E22","v":0},0,"","$/kWh"]
[null,"UNMETERED SCATTERED LOAD SERVICE CLASSIFICATION","kWh",{"$f":"'4. Billing Det. for Def-Var'!D23","v":11421124.458372911},{"$f":"'4. Billing Det. for Def-Var'!E23","v":0},0,0,"$/kW"]
[null,"STREET LIGHTING SERVICE CLASSIFICATION","kW",{"$f":"'4. Billing Det. for Def-Var'!D24","v":14875866.197228426},{"$f":"'4. Billing Det. for Def-Var'!E24","v":41239.546182825972},0,0,"$/kW"]
[null,null,null,{"$f":"'4. Billing Det. for Def-Var'!D25","v":0},{"$f":"'4. Billing Det. for Def-Var'!E25","v":0},0,"","$/kWh"]
[null,null,null,{"$f":"'4. Billing Det. for Def-Var'!D26","v":0},{"$f":"'4. Billing Det. for Def-Var'!E26","v":0},{"$f":"F$48*Q30","v":0},"","$/kWh"]
[null,null,null,{"$f":"'4. Billing Det. for Def-Var'!D27","v":0},{"$f":"'4. Billing Det. for Def-Var'!E27","v":0},{"$f":"F$48*Q31","v":0},"","$/kW"]
[null,null,null,null,null,0,{"$f":"IFERROR(ROUND(IF(E45<>\"\",F45/E45,F45/D45),4),\"\")","v":""}]
[null,null,null,null,null,0]
[]
[null,null,null,{"$f":"SUM(D34:D47)","v":7066542025.5365572},{"$f":"SUM(E34:E47)","v":12185856.601694595},{"$f":"ROUND('9. STS-Tax Change'!O46,2)","v":0}]

{"sheet":"11. RTSR - Current Rates","index":16,"n_rows":29,"n_cols":53,"rows_kept":29,"cut":false,"hidden":false,"merged":[[12,1,12,8],[1,1,8,4]]}
["Back to Index","Back to Index",null,null,null,null,null,null,null,null,null,null,null,null,null,null,null,null,null,null,null,null,null,null,null,null,null,null,null,null,null,null,null,null,null,null,null,null,null,null,null,null,null,null,null,null,null,null,null,null,null,null,1]
[null,{"$f":"+'1. Information Sheet'!B2","v":"INCENTIVE REGULATION MODEL FOR 2019 FILERS"}]
[]
[]
[]
[]
[]
[]
[]
[]
[]
[]
[null,"Columns F and G must match the data from the most recent RRR filing.  \nRates have been imported from Tab 2.  As well, the Loss Factor has been imported from \"Model Specs\" tab. \nIf the data needs to be modified, please make the necessary adjustments and note the changes in your manager's summary.  "]
[]
[null,"Rate Class","Rate Description","Unit","Rate","Non-Loss Adjusted Metered kWh","Non-Loss Adjusted Metered kW","Applicable Loss Factor","Loss Adjusted Billed kWh"]
["R_TN",{"$f":"'Model Specs'!C15","v":"RESIDENTIAL SERVICE CLASSIFICATION"},"Retail Transmission Rate – Network Service Rate","$/kWh",{"$f":"VLOOKUP(A16,RATES,4,FALSE)","v":7.5706432419583008E-3},{"$f":"'4. Billing Det. for Def-Var'!D17","v":1440461108.0256596},0,1,{"$f":"IF(D16=\"$/kwh\",F16*H16,\"\")","v":1440461108.0256596}]
["R_TC",{"$f":"B16","v":"RESIDENTIAL SERVICE CLASSIFICATION"},"Retail Transmission Rate – Line and Transformation Connection Service Rate","$/kWh",7.0836618157868745E-3,{"$f":"F16","v":1440461108.0256596},0,{"$f":"H16","v":1},{"$f":"IF(D17=\"$/kwh\",F17*H17,\"\")","v":1440461108.0256596}]
["GSL_TN",{"$f":"'Model Specs'!C16","v":"GENERAL SERVICE LESS THAN 50 kW SERVICE CLASSIFICATION"},"Retail Transmission Rate – Network Service Rate","$/kWh",7.1000000000000004E-3,{"$f":"'4. Billing Det. for Def-Var'!D18","v":618679646.43210387},0,{"$f":"H17","v":1},618679646.43210387]
["GSL_TC",{"$f":"B18","v":"GENERAL SERVICE LESS THAN 50 kW SERVICE CLASSIFICATION"},"Retail Transmission Rate – Line and Transformation Connection Service Rate","$/kWh",6.4000000000000003E-3,{"$f":"F18","v":618679646.43210387},0,1,618679646.43210387]
["GS50_499_TN",{"$f":"'Model Specs'!C17","v":"GENERAL SERVICE 50 to 499 kW SERVICE CLASSIFICATION"},"Retail Transmission Rate – Network Service Rate","$/kW",2.7324999999999999,{"$f":"'4. Billing Det. for Def-Var'!D19","v":1993768779.4230022},{"$f":"'4. Billing Det. for Def-Var'!E19","v":5780039.1019777982},1,""]
["GS50_499_TC",{"$f":"B20","v":"GENERAL SERVICE 50 to 499 kW SERVICE CLASSIFICATION"},"Retail Transmission Rate – Line and Transformation Connection Service Rate","$/kW",2.5347,{"$f":"F20","v":1993768779.4230022},{"$f":"G20","v":5780039.1019777982},1,""]
["GS500_TN",{"$f":"'Model Specs'!C18","v":"GENERAL SERVICE 500 to 4,999 kW SERVICE CLASSIFICATION"},"Retail Transmission Rate – Network Service Rate","$/kW",2.6436000000000002,{"$f":"'4. Billing Det. for Def-Var'!D20","v":2006067809.7416933},{"$f":"'4. Billing Det. for Def-Var'!E20","v":4610762.3348864596},1,""]
["GS500_TC",{"$f":"B22","v":"GENERAL SERVICE 500 to 4,999 kW SERVICE CLASSIFICATION"},"Retail Transmission Rate – Line and Transformation Connection Service Rate","$/kW",2.4803000000000002,{"$f":"F22","v":2006067809.7416933},{"$f":"G22","v":4610762.3348864596},1,""]
["LU_TN",{"$f":"'Model Specs'!C19","v":"LARGE USE SERVICE CLASSIFICATION"},"Retail Transmission Rate – Network Service Rate – Interval Metered","$/kW",2.8210999999999999,{"$f":"'4. Billing Det. for Def-Var'!D21","v":981267691.25849652},{"$f":"'4. Billing Det. for Def-Var'!E21","v":1753815.618647513},1,""]
["LU_TC",{"$f":"B24","v":"LARGE USE SERVICE CLASSIFICATION"},"Retail Transmission Rate – Line and Transformation Connection Service Rate – Interval Metered ","$/kW",2.6490999999999998,{"$f":"F24","v":981267691.25849652},{"$f":"G24","v":1753815.618647513},1,""]
["USL_TN",{"$f":"'Model Specs'!C21","v":"UNMETERED SCATTERED LOAD SERVICE CLASSIFICATION"},"Retail Transmission Rate – Network Service Rate","$/kWh",7.1000000000000004E-3,{"$f":"'4. Billing Det. for Def-Var'!D23","v":11421124.458372911},{"$f":"'4. Billing Det. for Def-Var'!E23","v":0},1,11421124.458372911]
["USL_TC",{"$f":"B26","v":"UNMETERED SCATTERED LOAD SERVICE CLASSIFICATION"},"Retail Transmission Rate – Line and Transformation Connection Service Rate","$/kWh",6.4000000000000003E-3,{"$f":"F26","v":11421124.458372911},{"$f":"G26","v":0},1,11421124.458372911]
["SL_TN",{"$f":"'4. Billing Det. for Def-Var'!B24","v":"STREET LIGHTING SERVICE CLASSIFICATION"},"Retail Transmission Rate – Network Service Rate","$/kW",1.8924000000000001,{"$f":"'4. Billing Det. for Def-Var'!D24","v":14875866.197228426},{"$f":"'4. Billing Det. for Def-Var'!E24","v":41239.546182825972},1,""]
["SL_TC",{"$f":"B28","v":"STREET LIGHTING SERVICE CLASSIFICATION"},"Retail Transmission Rate – Line and Transformation Connection Service Rate","$/kW",1.8329,{"$f":"F28","v":14875866.197228426},{"$f":"G28","v":41239.546182825972},1,""]

{"sheet":"12. RTSR-UTRs & Sub-Tx","index":17,"n_rows":68,"n_cols":10,"rows_kept":68,"cut":false,"hidden":false,"merged":[[37,4,37,5],[52,4,52,5],[66,4,66,5],[56,4,56,5],[64,4,64,5],[49,4,49,5],[41,4,41,5],[30,4,30,5],[32,4,32,5],[34,4,34,5],[1,1,8,7],[22,4,22,5],[11,4,11,5],[13,4,13,5],[15,4,15,5],[17,4,17,5],[19,4,19,5],[28,4,28,5]]}
["Back to Index"]
[null,{"$f":"+'1. Information Sheet'!B2","v":"INCENTIVE REGULATION MODEL FOR 2019 FILERS"}]
[]
[]
[]
[]
[]
[]
[]
[]
[]
[null,"Uniform Transmission Rates","Unit",null,2017,null,null,2018,null,2019]
[]
[null,"Rate Description",null,null,"Rate",null,null,"Rate",null,"Rate"]
[]
[null,"Network Service Rate","kW",null,3.52,null,null,3.61,null,{"$f":"H16","v":3.61}]
[]
[null,"Line Connection Service Rate","kW",null,0.88,null,null,0.95,null,{"$f":"H18","v":0.95}]
[]
[null,"Transformation Connection Service Rate","kW",null,2.13,null,null,2.34,null,{"$f":"H20","v":2.34}]
[]
[]
[null,"Hydro One Sub-Transmission Rates","Unit",null,2017,null,null,2018,null,2019]
[]
[]
[]
[null,"Rate Description",null,null,"Rate","Rate",null,"Rate",null,"Rate"]
[]
[null,"Network Service Rate","kW",null,3.1941999999999999,null,null,3.1941999999999999,null,{"$f":"H29","v":3.1941999999999999}]
[]
[null,"Line Connection Service Rate","kW",null,0.77100000000000002,null,null,0.77100000000000002,null,{"$f":"H31","v":0.77100000000000002}]
[]
[null,"Transformation Connection Service Rate","kW",null,1.7493000000000001,null,null,1.7493000000000001,null,{"$f":"H33","v":1.7493000000000001}]
[]
[null,"Both Line and Transformation Connection Service Rate","kW",null,{"$f":"SUM(E33,E31)","v":2.5203000000000002},null,null,{"$f":"SUM(H33,H31)","v":2.5203000000000002},null,{"$f":"H35","v":2.5203000000000002}]
[]
[]
[null,"If needed, add extra host here. (I)","Unit",null,2016,null,null,2017,null,2018]
[]
[]
[]
[null,"Rate Description",null,null,"Rate",null,null,"Rate",null,"Rate"]
[]
[null,"Network Service Rate","kW"]
[]
[null,"Line Connection Service Rate","kW"]
[]
[null,"Transformation Connection Service Rate","kW"]
[]
[null,"Both Line and Transformation Connection Service Rate","kW",null,{"$f":"F48+F46","v":0},null,null,{"$f":"H48+H46","v":0},null,{"$f":"J48+J46","v":0}]
[]
[]
[null,"If needed, add extra host here. (II)","Unit",null,2016,null,null,2017,null,2018]
[]
[]
[]
[null,"Rate Description",null,null,"Rate",null,null,"Rate",null,"Rate"]
[]
[null,"Network Service Rate","kW"]
[]
[null,"Line Connection Service Rate","kW"]
[]
[null,"Transformation Connection Service Rate","kW"]
[]
[null,"Both Line and Transformation Connection Service Rate","kW",null,{"$f":"F63+F61","v":0},null,null,{"$f":"H63+H61","v":0},null,{"$f":"J63+J61","v":0}]
[]
[null,null,null,null,"Historical 2016",null,null,"Current 2017",null,"Forecast 2018"]
[null,"Low Voltage Switchgear Credit (if applicable, enter as a negative value)","$"]

{"sheet":"13. RTSR-Historic Wholesale","index":18,"n_rows":112,"n_cols":17,"rows_kept":112,"cut":false,"hidden":false,"merged":[[52,3,52,5],[52,7,52,9],[52,11,52,13],[71,3,71,5],[71,7,71,9],[71,11,71,13],[90,3,90,5],[90,7,90,9],[90,11,90,13],[91,3,91,5],[91,7,91,9],[91,11,91,13],[1,1,8,10],[15,11,15,13],[33,3,33,5],[33,7,33,9],[33,11,33,13],[12,1,12,11],[15,3,15,5],[15,7,15,9]]}
["Back to Index"]
[null,{"$f":"+'1. Information Sheet'!B2","v":"INCENTIVE REGULATION MODEL FOR 2019 FILERS"}]
[]
[]
[]
[]
[]
[]
[]
[]
[]
[]
[null,"In the green shaded cells, enter billing detail for wholesale transmission for the same reporting period as the billing determinants on Tab 10.   For Hydro One Sub-transmission Rates, if you are charged a combined Line and Transformer connection rate, please ensure that both the Line Connection and Transformation Connection columns are completed. \nIf any of the Hydro One Sub-transmission rates (column E, I and M) are highlighted in orange, please double check the billing data entered in \"Units Billed\" and \"Amount\" columns. The highlighted rates do not match the Hydro One Sub-transmission rates approved for that time period. If data has been entered correctly, please provide explanation for the discrepancy in rates.\n"]
[]
[]
[null,"IESO",null,"Network",null,null,null,"Line Connection",null,null,null,"Transformation Connection",null,null,null,"Total Line"]
[null,"Month",null,"Units Billed","Rate","Amount",null,"Units Billed","Rate","Amount",null,"Units Billed","Rate","Amount",null,"Amount"]
[]
[null,"January",null,911329,{"$f":"IF(D19<>0,F19/D19,0)","v":3.66},3335464.14,null,993026,{"$f":"IF(H19<>0,J19/H19,0)","v":0.87},863932.62,null,993026,{"$f":"IF(L19<>0,N19/L19,0)","v":2.02},2005912.52,null,{"$f":"J19+N19","v":2869845.14}]
[null,"February",null,885223,3.66,3239916.18,null,924639,0.87000000000000011,804435.93,null,924639,2.02,1867770.78,null,2672206.71]
[null,"March",null,858237,3.6599995106246874,3141147,null,922202,0.870000281933893,802316,null,922202,2.0199999566255551,1862848,null,2665164]
[null,"April",null,814375,3.66,2980612.5,null,861996,0.87402236205272421,753403.78,null,861996,2.0293392660754805,1749282.33,null,2502686.1100000003]
[null,"May",null,923087,3.6599999999999997,3378498.42,null,980758,0.87,853259.46,null,980758,2.02,1981131.16,null,2834390.62]
[null,"June",null,1127983,3.6599999999999997,4128417.78,null,1176871,0.87,1023877.77,null,1176871,2.02,2377279.42,null,3401157.19]
[null,"July",null,1083391,3.66,3965211.06,null,1139021,0.87,990948.27,null,1139021,2.02,2300822.42,null,3291770.69]
[null,"August",null,1084014,3.7550946205491811,4070575.14,null,1122294,0.91819095531117512,1030480.2,null,1122294,2.1318916433661768,2392609.2000000002,null,3423089.4000000004]
[null,"September",null,1111718,3.5672751363205415,3965803.98,null,1181855,0.8332457196525801,984775.62,null,1181855,1.934662475515186,2286490.52,null,3271266.14]
[null,"October",null,846142,3.66,3096879.72,null,911316,0.87,792844.92,null,911316,2.02,1840858.32,null,2633703.2400000002]
[null,"November",null,827342,1.8878214571483134,1561873.98,null,897408,0.99395279516117518,891981.19,null,897408,3.383480746772928,3036362.69,null,3928343.88]
[null,"December",null,961225,4.9248426330983905,4733881.8600000003,null,1022498,0.77998792173676623,797536.09,null,1022498,1.0298671391044287,1053037.0900000001,null,1850573.1800000002,"The IESO adjusted back the adjustment made in November.  Email from Abdi who insisted this is what they needed to do."]
[]
[null,"Total",null,{"$f":"SUM(D19:D30)","v":11434066},{"$f":"IF(D32<>0,F32/D32,0)","v":3.6381005462098956},{"$f":"SUM(F19:F30)","v":41598281.759999998},null,{"$f":"SUM(H19:H30)","v":12133884},{"$f":"IF(H32<>0,J32/H32,0)","v":0.87274543336659549},{"$f":"SUM(J19:J30)","v":10589791.85},null,{"$f":"SUM(L19:L30)","v":12133884},{"$f":"IF(L32<>0,N32/L32,0)","v":2.040105579548972},{"$f":"SUM(N19:N30)","v":24754404.449999999},null,{"$f":"SUM(P19:P30)","v":35344196.300000012}]
[]
[null,"Hydro One",null,"Network",null,null,null,"Line Connection",null,null,null,"Transformation Connection",null,null,null,"Total Line"]
[]
[null,"Month",null,"Units Billed","Rate","Amount",null,"Units Billed","Rate","Amount",null,"Units Billed","Rate","Amount",null,"Amount"]
[]
[null,"January",null,190372.4,{"$f":"IF(D38<>0,F38/D38,0)","v":3.1941999999999999},608087.52007999993,null,174972.79999999999,{"$f":"IF(H38<>0,J38/H38,0)","v":0.77100000000000024},134904.02880000003,null,200561.3,{"$f":"IF(L38<>0,N38/L38,0)","v":1.7493000000000003},350841.88209000003,null,{"$f":"J38+N38","v":485745.91089000006}]
[null,"February",null,173119,{"$f":"IF(D39<>0,F39/D39,0)","v":3.1942000000000004},552976.70980000007,null,149924,0.77100000000000013,115591.40400000002,null,176107.1,1.7493000000000001,308064.15003000002,null,{"$f":"J39+N39","v":423655.55403000006}]
[null,"March",null,184167.3,3.1942000000000004,588267.18966000003,null,159688.29999999999,0.77100000000000013,123119.67930000002,null,188667.8,1.7493000000000001,330036.58253999997,null,453156.26183999999]
[null,"April",null,160011.1,3.1941980037634883,511107.13619999995,null,137658.29999999999,0.77100000000000024,106134.54930000003,null,160018.40000000002,1.7492999999999999,279920.18712000002,null,386054.73642000003]
[null,"May",null,186789.4,3.1942000000000004,596642.70148000005,null,183988.96,0.77100000000000024,141855.48816000004,null,208329.26,1.7492999999999999,364430.374518,null,506285.862678]
[null,"June",null,198958.6,3.1941983945403716,635513.24069999997,null,180215.21,0.77100000000000013,138945.92691000001,null,205609.34999999998,1.7493000000000001,359672.43595499999,null,498618.36286500003]
[null,"July",null,207903,3.1941999999999999,664083.76260000002,null,220222.12,0.77100000000000013,169791.25452000002,null,245742.66,1.7493000000000001,429877.63513800001,null,599668.88965800009]
[null,"August",null,202326.39999999999,3.1942000000000004,646270.9868800001,null,213420,0.77100000000000002,164546.82,null,240730,1.7493000000000003,421108.98900000006,null,585655.80900000012]
[null,"September",null,198923.8,3.1941999999999999,635402.40195999993,null,178943.8,0.77100000000000024,137965.66980000003,null,204012.3,1.7493000000000001,356878.71639000002,null,494844.38619000005]
[null,"October",null,192116.28,3.1941999999999999,613657.82157599996,null,167754.15999999997,0.77100000000000024,129338.45736000003,null,192822.65999999997,1.7493000000000003,337304.67913800001,null,466643.13649800001]
[null,"November",null,194541.61,3.1941999999999999,621404.81066199997,null,171279.58000000002,0.77100000000000002,132056.55618000001,null,194780.84,1.7493000000000001,340730.12341200002,null,472786.67959200003]
[null,"December",null,207697.07,3.1941999999999999,663425.98099399998,null,182641.68,0.77100000000000013,140816.73528000002,null,207697.07,1.7493000000000003,363324.48455100006,null,504141.21983100008]
[]
[null,"Total",null,{"$f":"SUM(D38:D49)","v":2296925.96},{"$f":"IF(D51<>0,F51/D51,0)","v":3.1941997218717488},{"$f":"SUM(F38:F49)","v":7336840.262592},null,{"$f":"SUM(H38:H49)","v":2120708.91},{"$f":"IF(H51<>0,J51/H51,0)","v":0.77100000000000024},{"$f":"SUM(J38:J49)","v":1635066.5696100006},null,{"$f":"SUM(L38:L49)","v":2425078.7399999998},{"$f":"IF(L51<>0,N51/L51,0)","v":1.7493000000000005},{"$f":"SUM(N38:N49)","v":4242190.2398820007},null,{"$f":"SUM(P38:P49)","v":5877256.8094920004}]
[]
[null,"Add Extra Host Here (I)",null,"Network",null,null,null,"Line Connection",null,null,null,"Transformation Connection",null,null,null,"Total Line"]
[null,"(if needed)"]
[null,"Month",null,"Units Billed","Rate","Amount",null,"Units Billed","Rate","Amount",null,"Units Billed","Rate","Amount",null,"Amount"]
[]
[null,"January",null,null,{"$f":"IF(D57<>0,F57/D57,0)","v":0},null,null,null,{"$f":"IF(H57<>0,J57/H57,0)","v":0},null,null,null,{"$f":"IF(L57<>0,N57/L57,0)","v":0},null,null,{"$f":"J57+N57","v":0}]
[null,"February",null,null,0,null,null,null,0,null,null,null,0,null,null,0]
[null,"March",null,null,0,null,null,null,0,null,null,null,0,null,null,0]
[null,"April",null,null,0,null,null,null,0,null,null,null,0,null,null,0]
[null,"May",null,null,0,null,null,null,0,null,null,null,0,null,null,0]
[null,"June",null,null,0,null,null,null,0,null,null,null,0,null,null,0]
[null,"July",null,null,0,null,null,null,0,null,null,null,0,null,null,0]
[null,"August",null,null,0,null,null,null,0,null,null,null,0,null,null,0]
[null,"September",null,null,0,null,null,null,0,null,null,null,0,null,null,0]
[null,"October",null,null,0,null,null,null,0,null,null,null,0,null,null,0]
[null,"November",null,null,0,null,null,null,0,null,null,null,0,null,null,0]
[null,"December",null,null,0,null,null,null,0,null,null,null,0,null,null,0]
[]
[null,"Total",null,{"$f":"SUM(D57:D68)","v":0},{"$f":"IF(D70<>0,F70/D70,0)","v":0},{"$f":"SUM(F57:F68)","v":0},null,{"$f":"SUM(H57:H68)","v":0},{"$f":"IF(H70<>0,J70/H70,0)","v":0},{"$f":"SUM(J57:J68)","v":0},null,{"$f":"SUM(L57:L68)","v":0},{"$f":"IF(L70<>0,N70/L70,0)","v":0},{"$f":"SUM(N57:N68)","v":0},null,{"$f":"SUM(P57:P68)","v":0}]
[]
[null,"Add Extra Host Here (II)",null,"Network",null,null,null,"Line Connection",null,null,null,"Transformation Connection",null,null,null,"Total Line"]
[null,"(if needed)"]
[null,"Month",null,"Units Billed","Rate","Amount",null,"Units Billed","Rate","Amount",null,"Units Billed","Rate","Amount",null,"Amount"]
[]
[null,"January",null,null,{"$f":"IF(D76<>0,F76/D76,0)","v":0},null,null,null,{"$f":"IF(H76<>0,J76/H76,0)","v":0},null,null,null,{"$f":"IF(L76<>0,N76/L76,0)","v":0},null,null,{"$f":"J76+N76","v":0}]
[null,"February",null,null,0,null,null,null,0,null,null,null,0,null,null,0]
[null,"March",null,null,0,null,null,null,0,null,null,null,0,null,null,0]
[null,"April",null,null,0,null,null,null,0,null,null,null,0,null,null,0]
[null,"May",null,null,0,null,null,null,0,null,null,null,0,null,null,0]
[null,"June",null,null,0,null,null,null,0,null,null,null,0,null,null,0]
[null,"July",null,null,0,null,null,null,0,null,null,null,0,null,null,0]
[null,"August",null,null,0,null,null,null,0,null,null,null,0,null,null,0]
[null,"September",null,null,0,null,null,null,0,null,null,null,0,null,null,0]
[null,"October",null,null,0,null,null,null,0,null,null,null,0,null,null,0]
[null,"November",null,null,0,null,null,null,0,null,null,null,0,null,null,0]
[null,"December",null,null,0,null,null,null,0,null,null,null,0,null,null,0]
[]
[null,"Total",null,{"$f":"SUM(D76:D87)","v":0},{"$f":"IF(D89<>0,F89/D89,0)","v":0},{"$f":"SUM(F76:F87)","v":0},null,{"$f":"SUM(H76:H87)","v":0},{"$f":"IF(H89<>0,J89/H89,0)","v":0},{"$f":"SUM(J76:J87)","v":0},null,{"$f":"SUM(L76:L87)","v":0},{"$f":"IF(L89<>0,N89/L89,0)","v":0},{"$f":"SUM(N76:N87)","v":0},null,{"$f":"SUM(P76:P87)","v":0}]
[]
[null,"Total",null,"Network",null,null,null,"Line Connection",null,null,null,"Transformation Connection",null,null,null,"Total Line"]
[]
[null,"Month",null,"Units Billed","Rate","Amount",null,"Units Billed","Rate","Amount",null,"Units Billed","Rate","Amount",null,"Amount"]
[]
[null,"January",null,{"$f":"D19+D38+D57+D76","v":1101701.3999999999},{"$f":"IF(D95<>0,F95/D95,0)","v":3.5795104372927184},{"$f":"F19+F38+F57+F76","v":3943551.6600799998},null,{"$f":"H19+H38+H57+H76","v":1167998.8},{"$f":"IF(H95<>0,J95/H95,0)","v":0.85516924229716673},{"$f":"J19+J38+J57+J76","v":998836.64880000008},null,{"$f":"L19+L38+L57+L76","v":1193587.3},{"$f":"IF(L95<>0,N95/L95,0)","v":1.9745136380807671},{"$f":"N19+N38+N57+N76","v":2356754.40209},null,{"$f":"J95+N95","v":3355591.0508900001}]
[null,"February",null,{"$f":"D20+D39+D58+D77","v":1058342},3.5838064536794345,{"$f":"F20+F39+F58+F77","v":3792892.8898},null,{"$f":"H20+H39+H58+H77","v":1074563},0.85618743061132763,{"$f":"J20+J39+J58+J77","v":920027.33400000003},null,{"$f":"L20+L39+L58+L77","v":1100746.1000000001},1.9766910189643185,{"$f":"N20+N39+N58+N77","v":2175834.9300299999},null,3095862.2640300002]
[null,"March",null,1042404.3,3.5777041495895596,3729414.1896600001,null,1081890.3,0.85538772211933123,925435.67929999996,null,1110869.8,1.9740248430014029,2192884.5825399999,null,3118320.2618399998]
[null,"April",null,974386.1,3.5835072320920838,3491719.6362000001,null,999654.3,0.85983557445809022,859538.3293000001,null,1022014.4,1.9854930782971354,2029202.51712,null,2888740.8464200003]
[null,"May",null,1109876.3999999999,3.5816070343328326,3975141.1214800002,null,1164746.96,0.85436148994971406,995114.94816000003,null,1189087.26,1.9725730931790486,2345561.5345179997,null,3340676.4826779999]
[null,"June",null,1326941.6000000001,3.5901587686300589,4763931.0207000002,null,1357086.21,0.85685322593470314,1162823.6969099999,null,1382480.35,1.979740150342824,2736951.855955,null,3899775.552865]
[null,"July",null,1291294,3.5850045168644784,4629294.8225999996,null,1359243.12,0.85396019846692317,1160739.52452,null,1384763.66,1.9719610891132138,2730700.0551379998,null,3891439.5796579998]
[null,"August",null,1286340.3999999999,3.6668724133052191,4716846.1268800003,null,1335714,0.89467282666798431,1195027.02,null,1363024,2.0643203560612289,2813718.1890000002,null,4008745.2090000003]
[null,"September",null,1310641.8,3.5106513327745228,4601206.3819599999,null,1360798.8,0.82506046433903368,1122741.2897999999,null,1385867.3,1.9073754293719176,2643369.2363900002,null,3766110.5261900001]
[null,"October",null,1038258.28,3.573809728323091,3710537.5415759999,null,1079070.1599999999,0.8546092844973121,922183.37736000004,null,1104138.6599999999,1.9727259610110928,2178162.999138,null,3100346.3764979998]
[null,"November",null,1021883.61,2.1365239341317941,2183278.790662,null,1068687.58,0.95821993756117196,1024037.74618,null,1092188.8400000001,3.0920411285396394,3377092.813412,null,4401130.5595920002]
[null,"December",null,1168922.07,4.6173376134424426,5397307.8409940004,null,1205139.68,0.77862578160234508,938352.82527999999,null,1230195.07,1.1513308816552159,1416361.5745510003,null,2354714.3998310002]
[]
[null,"Total",null,{"$f":"SUM(D95:D106)","v":13730991.960000001},{"$f":"IF(D108<>0,F108/D108,0)","v":3.5638446344696564},{"$f":"SUM(F95:F106)","v":48935122.022591993},null,{"$f":"SUM(H95:H106)","v":14254592.91},{"$f":"IF(H108<>0,J108/H108,0)","v":0.85760838606859935},{"$f":"SUM(J95:J106)","v":12224858.419609999},null,{"$f":"SUM(L95:L106)","v":14558962.740000002},{"$f":"IF(L108<>0,N108/L108,0)","v":1.9916662476383258},{"$f":"SUM(N95:N106)","v":28996594.689882003},null,{"$f":"SUM(P95:P106)","v":41221453.109492004}]
[]
[null,null,null,null,null,null,null,null,null,null,null,null,null,"Low Voltage Switchgear Credit (if applicable)",null,{"$f":"'12. RTSR-UTRs & Sub-Tx'!F68","v":0}]
[]
[null,null,null,null,null,null,null,null,null,null,null,null,null,"Total including deduction for Low Voltage Switchgear Credit",null,{"$f":"P108+P110","v":41221453.109492004}]

{"sheet":"14. RTSR-Current Wholesale","index":19,"n_rows":113,"n_cols":16,"rows_kept":113,"cut":false,"hidden":false,"merged":[[1,1,8,9],[92,3,92,5],[92,7,92,9],[92,11,92,13],[72,3,72,5],[72,7,72,9],[72,11,72,13],[91,3,91,5],[91,7,91,9],[91,11,91,13],[34,3,34,5],[34,7,34,9],[34,11,34,13],[53,3,53,5],[53,7,53,9],[53,11,53,13],[12,1,12,11],[15,3,15,5],[15,7,15,9],[15,11,15,13],[16,3,16,5],[16,7,16,9],[16,11,16,13]]}
["Back to Index"]
[null,{"$f":"+'1. Information Sheet'!B2","v":"INCENTIVE REGULATION MODEL FOR 2019 FILERS"}]
[]
[]
[]
[]
[]
[]
[]
[]
[]
[]
[null,"The purpose of this sheet is to calculate the expected billing when current 2018 Uniform Transmission Rates are applied against historical 2017 transmission units."]
[]
[]
[null,"IESO",null,"Network",null,null,null,"Line Connection",null,null,null,"Transformation Connection",null,null,null,"Total Line"]
[]
[null,"Month",null,"Units Billed","Rate","Amount",null,"Units Billed","Rate","Amount",null,"Units Billed","Rate","Amount",null,"Amount"]
[]
[null,"January",null,{"$f":"'13. RTSR-Historic Wholesale'!D19","v":911329},{"$f":"'12. RTSR-UTRs & Sub-Tx'!H16","v":3.61},{"$f":"D20*E20","v":3289897.69},null,{"$f":"'13. RTSR-Historic Wholesale'!H19","v":993026},{"$f":"'12. RTSR-UTRs & Sub-Tx'!H18","v":0.95},{"$f":"H20*I20","v":943374.7},null,{"$f":"'13. RTSR-Historic Wholesale'!L19","v":993026},{"$f":"'12. RTSR-UTRs & Sub-Tx'!H20","v":2.34},{"$f":"L20*M20","v":2323680.84},null,{"$f":"J20+N20","v":3267055.54}]
[null,"February",null,{"$f":"'13. RTSR-Historic Wholesale'!D20","v":885223},{"$f":"E20","v":3.61},{"$f":"D21*E21","v":3195655.03},null,{"$f":"'13. RTSR-Historic Wholesale'!H20","v":924639},{"$f":"I20","v":0.95},{"$f":"H21*I21","v":878407.04999999993},null,{"$f":"'13. RTSR-Historic Wholesale'!L20","v":924639},{"$f":"M20","v":2.34},{"$f":"L21*M21","v":2163655.2599999998},null,3042062.3099999996]
[null,"March",null,{"$f":"'13. RTSR-Historic Wholesale'!D21","v":858237},{"$f":"E21","v":3.61},3098235.57,null,{"$f":"'13. RTSR-Historic Wholesale'!H21","v":922202},{"$f":"I21","v":0.95},876091.89999999991,null,{"$f":"'13. RTSR-Historic Wholesale'!L21","v":922202},{"$f":"M21","v":2.34},2157952.6799999997,null,3034044.5799999996]
[null,"April",null,{"$f":"'13. RTSR-Historic Wholesale'!D22","v":814375},3.61,2939893.75,null,{"$f":"'13. RTSR-Historic Wholesale'!H22","v":861996},0.95,818896.2,null,{"$f":"'13. RTSR-Historic Wholesale'!L22","v":861996},2.34,2017070.64,null,2835966.84]
[null,"May",null,{"$f":"'13. RTSR-Historic Wholesale'!D23","v":923087},3.61,3332344.07,null,{"$f":"'13. RTSR-Historic Wholesale'!H23","v":980758},0.95,931720.1,null,{"$f":"'13. RTSR-Historic Wholesale'!L23","v":980758},2.34,2294973.7199999997,null,3226693.82]
[null,"June",null,{"$f":"'13. RTSR-Historic Wholesale'!D24","v":1127983},3.61,4072018.63,null,{"$f":"'13. RTSR-Historic Wholesale'!H24","v":1176871},0.95,1118027.45,null,{"$f":"'13. RTSR-Historic Wholesale'!L24","v":1176871},2.34,2753878.1399999997,null,3871905.59]
[null,"July",null,{"$f":"'13. RTSR-Historic Wholesale'!D25","v":1083391},3.61,3911041.51,null,{"$f":"'13. RTSR-Historic Wholesale'!H25","v":1139021},0.95,1082069.95,null,{"$f":"'13. RTSR-Historic Wholesale'!L25","v":1139021},2.34,2665309.1399999997,null,3747379.09]
[null,"August",null,{"$f":"'13. RTSR-Historic Wholesale'!D26","v":1084014},3.61,3913290.54,null,{"$f":"'13. RTSR-Historic Wholesale'!H26","v":1122294},0.95,1066179.3,null,{"$f":"'13. RTSR-Historic Wholesale'!L26","v":1122294},2.34,2626167.96,null,3692347.26]
[null,"September",null,{"$f":"'13. RTSR-Historic Wholesale'!D27","v":1111718},3.61,4013301.98,null,{"$f":"'13. RTSR-Historic Wholesale'!H27","v":1181855},0.95,1122762.25,null,{"$f":"'13. RTSR-Historic Wholesale'!L27","v":1181855},2.34,2765540.6999999997,null,3888302.9499999997]
[null,"October",null,{"$f":"'13. RTSR-Historic Wholesale'!D28","v":846142},3.61,3054572.62,null,{"$f":"'13. RTSR-Historic Wholesale'!H28","v":911316},0.95,865750.2,null,{"$f":"'13. RTSR-Historic Wholesale'!L28","v":911316},2.34,2132479.44,null,2998229.6399999997]
[null,"November",null,{"$f":"'13. RTSR-Historic Wholesale'!D29","v":827342},3.61,2986704.62,null,{"$f":"'13. RTSR-Historic Wholesale'!H29","v":897408},0.95,852537.6,null,{"$f":"'13. RTSR-Historic Wholesale'!L29","v":897408},2.34,2099934.7199999997,null,2952472.32]
[null,"December",null,{"$f":"'13. RTSR-Historic Wholesale'!D30","v":961225},3.61,3470022.25,null,{"$f":"'13. RTSR-Historic Wholesale'!H30","v":1022498},0.95,971373.1,null,{"$f":"'13. RTSR-Historic Wholesale'!L30","v":1022498},2.34,2392645.3199999998,null,3364018.42]
[]
[null,"Total",null,{"$f":"SUM(D20:D31)","v":11434066},{"$f":"IF(D33<>0,F33/D33,0)","v":3.61},{"$f":"SUM(F20:F31)","v":41276978.259999998},null,{"$f":"SUM(H20:H31)","v":12133884},{"$f":"IF(H33<>0,J33/H33,0)","v":0.94999999999999973},{"$f":"SUM(J20:J31)","v":11527189.799999997},null,{"$f":"SUM(L20:L31)","v":12133884},{"$f":"IF(L33<>0,N33/L33,0)","v":2.3400000000000003},{"$f":"SUM(N20:N31)","v":28393288.560000002},null,{"$f":"SUM(P20:P31)","v":39920478.359999999}]
[]
[null,"Hydro One",null,"Network",null,null,null,"Line Connection",null,null,null,"Transformation Connection",null,null,null,"Total Line"]
[]
[null,"Month",null,"Units Billed","Rate","Amount",null,"Units Billed","Rate","Amount",null,"Units Billed","Rate","Amount",null,"Amount"]
[]
[null,"January",null,{"$f":"'13. RTSR-Historic Wholesale'!D38","v":190372.4},{"$f":"'12. RTSR-UTRs & Sub-Tx'!H29","v":3.1941999999999999},{"$f":"D39*E39","v":608087.52007999993},null,{"$f":"'13. RTSR-Historic Wholesale'!H38","v":174972.79999999999},{"$f":"'12. RTSR-UTRs & Sub-Tx'!H31","v":0.77100000000000002},{"$f":"H39*I39","v":134904.0288},null,{"$f":"'13. RTSR-Historic Wholesale'!L38","v":200561.3},{"$f":"'12. RTSR-UTRs & Sub-Tx'!H33","v":1.7493000000000001},{"$f":"L39*M39","v":350841.88208999997},null,{"$f":"J39+N39","v":485745.91088999994}]
[null,"February",null,{"$f":"'13. RTSR-Historic Wholesale'!D39","v":173119},{"$f":"E39","v":3.1941999999999999},{"$f":"D40*E40","v":552976.70979999995},null,{"$f":"'13. RTSR-Historic Wholesale'!H39","v":149924},{"$f":"I39","v":0.77100000000000002},{"$f":"H40*I40","v":115591.40400000001},null,{"$f":"'13. RTSR-Historic Wholesale'!L39","v":176107.1},{"$f":"M39","v":1.7493000000000001},{"$f":"L40*M40","v":308064.15003000002},null,423655.55403]
[null,"March",null,{"$f":"'13. RTSR-Historic Wholesale'!D40","v":184167.3},{"$f":"E40","v":3.1941999999999999},588267.18965999992,null,{"$f":"'13. RTSR-Historic Wholesale'!H40","v":159688.29999999999},{"$f":"I40","v":0.77100000000000002},123119.67929999999,null,{"$f":"'13. RTSR-Historic Wholesale'!L40","v":188667.8},{"$f":"M40","v":1.7493000000000001},330036.58253999997,null,453156.26183999993]
[null,"April",null,{"$f":"'13. RTSR-Historic Wholesale'!D41","v":160011.1},3.1941999999999999,511107.45562000002,null,{"$f":"'13. RTSR-Historic Wholesale'!H41","v":137658.29999999999},0.77100000000000002,106134.5493,null,{"$f":"'13. RTSR-Historic Wholesale'!L41","v":160018.40000000002},{"$f":"M41","v":1.7493000000000001},279920.18712000008,null,386054.73642000009]
[null,"May",null,{"$f":"'13. RTSR-Historic Wholesale'!D42","v":186789.4},3.1941999999999999,596642.70147999993,null,{"$f":"'13. RTSR-Historic Wholesale'!H42","v":183988.96},0.77100000000000002,141855.48816000001,null,{"$f":"'13. RTSR-Historic Wholesale'!L42","v":208329.26},1.7493000000000001,364430.37451800006,null,506285.86267800006]
[null,"June",null,{"$f":"'13. RTSR-Historic Wholesale'!D43","v":198958.6},3.1941999999999999,635513.56012000004,null,{"$f":"'13. RTSR-Historic Wholesale'!H43","v":180215.21},0.77100000000000002,138945.92691000001,null,{"$f":"'13. RTSR-Historic Wholesale'!L43","v":205609.34999999998},1.7493000000000001,359672.43595499999,null,498618.36286500003]
[null,"July",null,{"$f":"'13. RTSR-Historic Wholesale'!D44","v":207903},3.1941999999999999,664083.76260000002,null,{"$f":"'13. RTSR-Historic Wholesale'!H44","v":220222.12},0.77100000000000002,169791.25451999999,null,{"$f":"'13. RTSR-Historic Wholesale'!L44","v":245742.66},1.7493000000000001,429877.63513800001,null,599668.88965799997]
[null,"August",null,{"$f":"'13. RTSR-Historic Wholesale'!D45","v":202326.39999999999},3.1941999999999999,646270.98687999998,null,{"$f":"'13. RTSR-Historic Wholesale'!H45","v":213420},0.77100000000000002,164546.82,null,{"$f":"'13. RTSR-Historic Wholesale'!L45","v":240730},1.7493000000000001,421108.989,null,585655.80900000001]
[null,"September",null,{"$f":"'13. RTSR-Historic Wholesale'!D46","v":198923.8},3.1941999999999999,635402.40195999993,null,{"$f":"'13. RTSR-Historic Wholesale'!H46","v":178943.8},0.77100000000000002,137965.6698,null,{"$f":"'13. RTSR-Historic Wholesale'!L46","v":204012.3},1.7493000000000001,356878.71639000002,null,494844.38618999999]
[null,"October",null,{"$f":"'13. RTSR-Historic Wholesale'!D47","v":192116.28},3.1941999999999999,613657.82157599996,null,{"$f":"'13. RTSR-Historic Wholesale'!H47","v":167754.15999999997},0.77100000000000002,129338.45735999999,null,{"$f":"'13. RTSR-Historic Wholesale'!L47","v":192822.65999999997},1.7493000000000001,337304.67913799995,null,466643.13649799995]
[null,"November",null,{"$f":"'13. RTSR-Historic Wholesale'!D48","v":194541.61},3.1941999999999999,621404.81066199997,null,{"$f":"'13. RTSR-Historic Wholesale'!H48","v":171279.58000000002},0.77100000000000002,132056.55618000001,null,{"$f":"'13. RTSR-Historic Wholesale'!L48","v":194780.84},1.7493000000000001,340730.12341200002,null,472786.67959200003]
[null,"December",null,{"$f":"'13. RTSR-Historic Wholesale'!D49","v":207697.07},3.1941999999999999,663425.98099399998,null,{"$f":"'13. RTSR-Historic Wholesale'!H49","v":182641.68},0.77100000000000002,140816.73527999999,null,{"$f":"'13. RTSR-Historic Wholesale'!L49","v":207697.07},1.7493000000000001,363324.484551,null,504141.21983099997]
[]
[null,"Total",null,{"$f":"SUM(D39:D50)","v":2296925.96},{"$f":"IF(D52<>0,F52/D52,0)","v":3.1942000000000004},{"$f":"SUM(F39:F50)","v":7336840.901432001},null,{"$f":"SUM(H39:H50)","v":2120708.91},{"$f":"IF(H52<>0,J52/H52,0)","v":0.77099999999999991},{"$f":"SUM(J39:J50)","v":1635066.5696099999},null,{"$f":"SUM(L39:L50)","v":2425078.7399999998},{"$f":"IF(L52<>0,N52/L52,0)","v":1.7493000000000005},{"$f":"SUM(N39:N50)","v":4242190.2398820007},null,{"$f":"SUM(P39:P50)","v":5877256.8094919994}]
[]
[null,"Add Extra Host Here (I)",null,"Network",null,null,null,"Line Connection",null,null,null,"Transformation Connection",null,null,null,"Total Line"]
[]
[null,"Month",null,"Units Billed","Rate","Amount",null,"Units Billed","Rate","Amount",null,"Units Billed","Rate","Amount",null,"Amount"]
[]
[null,"January",null,{"$f":"'13. RTSR-Historic Wholesale'!D57","v":0},{"$f":"'12. RTSR-UTRs & Sub-Tx'!H44","v":0},{"$f":"D58*E58","v":0},null,{"$f":"'13. RTSR-Historic Wholesale'!H57","v":0},{"$f":"'12. RTSR-UTRs & Sub-Tx'!H46","v":0},{"$f":"H58*I58","v":0},null,{"$f":"'13. RTSR-Historic Wholesale'!L57","v":0},{"$f":"'12. RTSR-UTRs & Sub-Tx'!H48","v":0},{"$f":"L58*M58","v":0},null,{"$f":"J58+N58","v":0}]
[null,"February",null,{"$f":"'13. RTSR-Historic Wholesale'!D58","v":0},{"$f":"E58","v":0},{"$f":"D59*E59","v":0},null,{"$f":"'13. RTSR-Historic Wholesale'!H58","v":0},{"$f":"I58","v":0},{"$f":"H59*I59","v":0},null,{"$f":"'13. RTSR-Historic Wholesale'!L58","v":0},{"$f":"M58","v":0},{"$f":"L59*M59","v":0},null,0]
[null,"March",null,{"$f":"'13. RTSR-Historic Wholesale'!D59","v":0},{"$f":"E59","v":0},0,null,{"$f":"'13. RTSR-Historic Wholesale'!H59","v":0},{"$f":"I59","v":0},0,null,{"$f":"'13. RTSR-Historic Wholesale'!L59","v":0},{"$f":"M59","v":0},0,null,0]
[null,"April",null,{"$f":"'13. RTSR-Historic Wholesale'!D60","v":0},0,0,null,{"$f":"'13. RTSR-Historic Wholesale'!H60","v":0},0,0,null,{"$f":"'13. RTSR-Historic Wholesale'!L60","v":0},0,0,null,0]
[null,"May",null,{"$f":"'13. RTSR-Historic Wholesale'!D61","v":0},0,0,null,{"$f":"'13. RTSR-Historic Wholesale'!H61","v":0},0,0,null,{"$f":"'13. RTSR-Historic Wholesale'!L61","v":0},0,0,null,0]
[null,"June",null,{"$f":"'13. RTSR-Historic Wholesale'!D62","v":0},0,0,null,{"$f":"'13. RTSR-Historic Wholesale'!H62","v":0},0,0,null,{"$f":"'13. RTSR-Historic Wholesale'!L62","v":0},0,0,null,0]
[null,"July",null,{"$f":"'13. RTSR-Historic Wholesale'!D63","v":0},0,0,null,{"$f":"'13. RTSR-Historic Wholesale'!H63","v":0},0,0,null,{"$f":"'13. RTSR-Historic Wholesale'!L63","v":0},0,0,null,0]
[null,"August",null,{"$f":"'13. RTSR-Historic Wholesale'!D64","v":0},0,0,null,{"$f":"'13. RTSR-Historic Wholesale'!H64","v":0},0,0,null,{"$f":"'13. RTSR-Historic Wholesale'!L64","v":0},0,0,null,0]
[null,"September",null,{"$f":"'13. RTSR-Historic Wholesale'!D65","v":0},0,0,null,{"$f":"'13. RTSR-Historic Wholesale'!H65","v":0},0,0,null,{"$f":"'13. RTSR-Historic Wholesale'!L65","v":0},0,0,null,0]
[null,"October",null,{"$f":"'13. RTSR-Historic Wholesale'!D66","v":0},0,0,null,{"$f":"'13. RTSR-Historic Wholesale'!H66","v":0},0,0,null,{"$f":"'13. RTSR-Historic Wholesale'!L66","v":0},0,0,null,0]
[null,"November",null,{"$f":"'13. RTSR-Historic Wholesale'!D67","v":0},0,0,null,{"$f":"'13. RTSR-Historic Wholesale'!H67","v":0},0,0,null,{"$f":"'13. RTSR-Historic Wholesale'!L67","v":0},0,0,null,0]
[null,"December",null,{"$f":"'13. RTSR-Historic Wholesale'!D68","v":0},0,0,null,{"$f":"'13. RTSR-Historic Wholesale'!H68","v":0},0,0,null,{"$f":"'13. RTSR-Historic Wholesale'!L68","v":0},0,0,null,0]
[]
[null,"Total",null,{"$f":"SUM(D58:D69)","v":0},{"$f":"IF(D71<>0,F71/D71,0)","v":0},{"$f":"SUM(F58:F69)","v":0},null,{"$f":"SUM(H58:H69)","v":0},{"$f":"IF(H71<>0,J71/H71,0)","v":0},{"$f":"SUM(J58:J69)","v":0},null,{"$f":"SUM(L58:L69)","v":0},{"$f":"IF(L71<>0,N71/L71,0)","v":0},{"$f":"SUM(N58:N69)","v":0},null,{"$f":"SUM(P58:P69)","v":0}]
[]
[null,"Add Extra Host Here (II)",null,"Network",null,null,null,"Line Connection",null,null,null,"Transformation Connection",null,null,null,"Total Line"]
[]
[null,"Month",null,"Units Billed","Rate","Amount",null,"Units Billed","Rate","Amount",null,"Units Billed","Rate","Amount",null,"Amount"]
[]
[null,"January",null,{"$f":"'13. RTSR-Historic Wholesale'!D76","v":0},{"$f":"'12. RTSR-UTRs & Sub-Tx'!H59","v":0},{"$f":"D77*E77","v":0},null,{"$f":"'13. RTSR-Historic Wholesale'!H76","v":0},{"$f":"'12. RTSR-UTRs & Sub-Tx'!H61","v":0},{"$f":"H77*I77","v":0},null,{"$f":"'13. RTSR-Historic Wholesale'!L76","v":0},{"$f":"'12. RTSR-UTRs & Sub-Tx'!H63","v":0},{"$f":"L77*M77","v":0},null,{"$f":"J77+N77","v":0}]
[null,"February",null,{"$f":"'13. RTSR-Historic Wholesale'!D77","v":0},{"$f":"E77","v":0},{"$f":"D78*E78","v":0},null,{"$f":"'13. RTSR-Historic Wholesale'!H77","v":0},{"$f":"I77","v":0},{"$f":"H78*I78","v":0},null,{"$f":"'13. RTSR-Historic Wholesale'!L77","v":0},{"$f":"M77","v":0},{"$f":"L78*M78","v":0},null,0]
[null,"March",null,{"$f":"'13. RTSR-Historic Wholesale'!D78","v":0},{"$f":"E78","v":0},0,null,{"$f":"'13. RTSR-Historic Wholesale'!H78","v":0},{"$f":"I78","v":0},0,null,{"$f":"'13. RTSR-Historic Wholesale'!L78","v":0},{"$f":"M78","v":0},0,null,0]
[null,"April",null,{"$f":"'13. RTSR-Historic Wholesale'!D79","v":0},0,0,null,{"$f":"'13. RTSR-Historic Wholesale'!H79","v":0},0,0,null,{"$f":"'13. RTSR-Historic Wholesale'!L79","v":0},{"$f":"M79","v":0},0,null,0]
[null,"May",null,{"$f":"'13. RTSR-Historic Wholesale'!D80","v":0},0,0,null,{"$f":"'13. RTSR-Historic Wholesale'!H80","v":0},0,0,null,{"$f":"'13. RTSR-Historic Wholesale'!L80","v":0},0,0,null,0]
[null,"June",null,{"$f":"'13. RTSR-Historic Wholesale'!D81","v":0},0,0,null,{"$f":"'13. RTSR-Historic Wholesale'!H81","v":0},0,0,null,{"$f":"'13. RTSR-Historic Wholesale'!L81","v":0},0,0,null,0]
[null,"July",null,{"$f":"'13. RTSR-Historic Wholesale'!D82","v":0},0,0,null,{"$f":"'13. RTSR-Historic Wholesale'!H82","v":0},0,0,null,{"$f":"'13. RTSR-Historic Wholesale'!L82","v":0},0,0,null,0]
[null,"August",null,{"$f":"'13. RTSR-Historic Wholesale'!D83","v":0},0,0,null,{"$f":"'13. RTSR-Historic Wholesale'!H83","v":0},0,0,null,{"$f":"'13. RTSR-Historic Wholesale'!L83","v":0},0,0,null,0]
[null,"September",null,{"$f":"'13. RTSR-Historic Wholesale'!D84","v":0},0,0,null,{"$f":"'13. RTSR-Historic Wholesale'!H84","v":0},0,0,null,{"$f":"'13. RTSR-Historic Wholesale'!L84","v":0},0,0,null,0]
[null,"October",null,{"$f":"'13. RTSR-Historic Wholesale'!D85","v":0},0,0,null,{"$f":"'13. RTSR-Historic Wholesale'!H85","v":0},0,0,null,{"$f":"'13. RTSR-Historic Wholesale'!L85","v":0},0,0,null,0]
[null,"November",null,{"$f":"'13. RTSR-Historic Wholesale'!D86","v":0},0,0,null,{"$f":"'13. RTSR-Historic Wholesale'!H86","v":0},0,0,null,{"$f":"'13. RTSR-Historic Wholesale'!L86","v":0},0,0,null,0]
[null,"December",null,{"$f":"'13. RTSR-Historic Wholesale'!D87","v":0},0,0,null,{"$f":"'13. RTSR-Historic Wholesale'!H87","v":0},0,0,null,{"$f":"'13. RTSR-Historic Wholesale'!L87","v":0},0,0,null,0]
[]
[null,"Total",null,{"$f":"SUM(D77:D88)","v":0},{"$f":"IF(D90<>0,F90/D90,0)","v":0},{"$f":"SUM(F77:F88)","v":0},null,{"$f":"SUM(H77:H88)","v":0},{"$f":"IF(H90<>0,J90/H90,0)","v":0},{"$f":"SUM(J77:J88)","v":0},null,{"$f":"SUM(L77:L88)","v":0},{"$f":"IF(L90<>0,N90/L90,0)","v":0},{"$f":"SUM(N77:N88)","v":0},null,{"$f":"SUM(P77:P88)","v":0}]
[]
[null,"Total",null,"Network",null,null,null,"Line Connection",null,null,null,"Transformation Connection",null,null,null,"Total Line"]
[]
[null,"Month",null,"Units Billed","Rate","Amount",null,"Units Billed","Rate","Amount",null,"Units Billed","Rate","Amount",null,"Amount"]
[]
[null,"January",null,{"$f":"D20+D39+D58+D77","v":1101701.3999999999},{"$f":"IF(D96<>0,F96/D96,0)","v":3.5381503645906234},{"$f":"F20+F39+F58+F77","v":3897985.2100799996},null,{"$f":"H20+H39+H58+H77","v":1167998.8},{"$f":"IF(H96<>0,J96/H96,0)","v":0.92318479162821043},{"$f":"J20+J39+J58+J77","v":1078278.7287999999},null,{"$f":"L20+L39+L58+L77","v":1193587.3},{"$f":"IF(L96<>0,N96/L96,0)","v":2.2407432804370488},{"$f":"N20+N39+N58+N77","v":2674522.7220899998},null,{"$f":"J96+N96","v":3752801.45089}]
[null,"February",null,{"$f":"D21+D40+D59+D78","v":1058342},3.5419852370972706,{"$f":"F21+F40+F59+F78","v":3748631.7397999996},null,{"$f":"H21+H40+H59+H78","v":1074563},0.92502575837805689,{"$f":"J21+J40+J59+J78","v":993998.45399999991},null,{"$f":"L21+L40+L59+L78","v":1100746.1000000001},2.2454945877437127,{"$f":"N21+N40+N59+N78","v":2471719.4100299999},null,3465717.8640299998]
[null,"March",null,1042404.3,3.5365383274608515,3686502.75966,null,1081890.3,0.92357938628343361,999211.57929999987,null,1110869.8,2.2396767492824088,2487989.2625399996,null,3487200.8418399994]
[null,"April",null,974386.1,3.5417184272435742,3451001.2056200001,null,999654.3,0.92535064301729097,925030.74929999991,null,1022014.4,2.2475131731216313,2296990.82712,null,3222021.5764199998]
[null,"May",null,1109876.3999999999,3.5400219082773541,3928986.7714799996,null,1164746.96,0.92172431011109923,1073575.58816,null,1189087.26,2.2365087777645516,2659404.0945179998,null,3732979.6826780001]
[null,"June",null,1326941.6000000001,3.5476558954214714,4707532.1901200004,null,1357086.21,0.92622957012436213,1256973.3769099999,null,1382480.35,2.2521481596139861,3113550.5759549998,null,4370523.9528649999]
[null,"July",null,1291294,3.5430546975359598,4575125.2725999998,null,1359243.12,0.92099874268261872,1251861.2045199999,null,1384763.66,2.2351733111901564,3095186.7751379996,null,4347047.9796579992]
[null,"August",null,1286340.3999999999,3.544599490834619,4559561.5268799998,null,1335714,0.92139943131538649,1230726.1200000001,null,1363024,2.2356737291493034,3047276.949,null,4278003.0690000001]
[null,"September",null,1310641.8,3.5468915930805807,4648704.3819599999,null,1360798.8,0.92646166339946801,1260727.9198,null,1385867.3,2.2530435752326357,3122419.4163899999,null,4383147.3361900002]
[null,"October",null,1038258.28,3.5330615823030085,3668230.4415760003,null,1079070.1599999999,0.92217234267695813,995088.65735999995,null,1104138.6599999999,2.2368423537837181,2469784.1191380001,null,3464872.7764980001]
[null,"November",null,1021883.61,3.5308418643313009,3608109.4306620001,null,1068687.58,0.92131149889474706,984594.15617999993,null,1092188.8400000001,2.2346546256707764,2440664.8434119998,null,3425258.9995919997]
[null,"December",null,1168922.07,3.5361195900715603,4133448.2309940001,null,1205139.68,0.92287213983361671,1112189.83528,null,1230195.07,2.2402705650177901,2755969.8045509998,null,3868159.639831]
[]
[null,"Total",null,{"$f":"SUM(D96:D107)","v":13730991.960000001},{"$f":"IF(D109<>0,F109/D109,0)","v":3.5404448056666102},{"$f":"SUM(F96:F107)","v":48613819.161431991},null,{"$f":"SUM(H96:H107)","v":14254592.91},{"$f":"IF(H109<>0,J109/H109,0)","v":0.92336950291834041},{"$f":"SUM(J96:J107)","v":13162256.36961},null,{"$f":"SUM(L96:L107)","v":14558962.740000002},{"$f":"IF(L109<>0,N109/L109,0)","v":2.2416074127463554},{"$f":"SUM(N96:N107)","v":32635478.799881995},null,{"$f":"SUM(P96:P107)","v":45797735.169491999}]
[]
[null,null,null,null,null,null,null,null,null,null,null,null,null,"Low Voltage Switchgear Credit (if applicable)",null,{"$f":"'12. RTSR-UTRs & Sub-Tx'!H68","v":0}]
[]
[null,null,null,null,null,null,null,null,null,null,null,null,null,"Total including deduction for Low Voltage Switchgear Credit",null,{"$f":"P109+P111","v":45797735.169491999}]

{"sheet":"15. RTSR-Forecast Wholesale","index":20,"n_rows":113,"n_cols":16,"rows_kept":113,"cut":false,"hidden":false,"merged":[[1,1,8,9],[92,3,92,5],[92,7,92,9],[92,11,92,13],[72,3,72,5],[72,7,72,9],[72,11,72,13],[91,3,91,5],[91,7,91,9],[91,11,91,13],[34,3,34,5],[34,7,34,9],[34,11,34,13],[53,3,53,5],[53,7,53,9],[53,11,53,13],[12,1,12,12],[15,3,15,5],[15,7,15,9],[15,11,15,13],[16,3,16,5],[16,7,16,9],[16,11,16,13]]}
["Back to Index"]
[null,{"$f":"+'1. Information Sheet'!B2","v":"INCENTIVE REGULATION MODEL FOR 2019 FILERS"}]
[]
[]
[]
[]
[]
[]
[]
[]
[]
[]
[null,"The purpose of this sheet is to calculate the expected billing when forecasted 2019 Uniform Transmission Rates are applied against historical 2017 transmission units."]
[]
[]
[null,"IESO",null,"Network",null,null,null,"Line Connection",null,null,null,"Transformation Connection",null,null,null,"Total Line"]
[]
[null,"Month",null,"Units Billed","Rate","Amount",null,"Units Billed","Rate","Amount",null,"Units Billed","Rate","Amount",null,"Amount"]
[]
[null,"January",null,{"$f":"'13. RTSR-Historic Wholesale'!D19","v":911329},{"$f":"'12. RTSR-UTRs & Sub-Tx'!J16","v":3.61},{"$f":"D20*E20","v":3289897.69},null,{"$f":"'13. RTSR-Historic Wholesale'!H19","v":993026},{"$f":"'12. RTSR-UTRs & Sub-Tx'!J18","v":0.95},{"$f":"H20*I20","v":943374.7},null,{"$f":"'13. RTSR-Historic Wholesale'!L19","v":993026},{"$f":"'12. RTSR-UTRs & Sub-Tx'!J20","v":2.34},{"$f":"L20*M20","v":2323680.84},null,{"$f":"J20+N20","v":3267055.54}]
[null,"February",null,{"$f":"'13. RTSR-Historic Wholesale'!D20","v":885223},{"$f":"E20","v":3.61},3195655.03,null,{"$f":"'13. RTSR-Historic Wholesale'!H20","v":924639},{"$f":"I20","v":0.95},878407.04999999993,null,{"$f":"'13. RTSR-Historic Wholesale'!L20","v":924639},{"$f":"M20","v":2.34},2163655.2599999998,null,3042062.3099999996]
[null,"March",null,{"$f":"'13. RTSR-Historic Wholesale'!D21","v":858237},3.61,3098235.57,null,{"$f":"'13. RTSR-Historic Wholesale'!H21","v":922202},0.95,876091.89999999991,null,{"$f":"'13. RTSR-Historic Wholesale'!L21","v":922202},2.34,2157952.6799999997,null,3034044.5799999996]
[null,"April",null,{"$f":"'13. RTSR-Historic Wholesale'!D22","v":814375},3.61,2939893.75,null,{"$f":"'13. RTSR-Historic Wholesale'!H22","v":861996},0.95,818896.2,null,{"$f":"'13. RTSR-Historic Wholesale'!L22","v":861996},2.34,2017070.64,null,2835966.84]
[null,"May",null,{"$f":"'13. RTSR-Historic Wholesale'!D23","v":923087},3.61,3332344.07,null,{"$f":"'13. RTSR-Historic Wholesale'!H23","v":980758},0.95,931720.1,null,{"$f":"'13. RTSR-Historic Wholesale'!L23","v":980758},2.34,2294973.7199999997,null,3226693.82]
[null,"June",null,{"$f":"'13. RTSR-Historic Wholesale'!D24","v":1127983},3.61,4072018.63,null,{"$f":"'13. RTSR-Historic Wholesale'!H24","v":1176871},0.95,1118027.45,null,{"$f":"'13. RTSR-Historic Wholesale'!L24","v":1176871},2.34,2753878.1399999997,null,3871905.59]
[null,"July",null,{"$f":"'13. RTSR-Historic Wholesale'!D25","v":1083391},3.61,3911041.51,null,{"$f":"'13. RTSR-Historic Wholesale'!H25","v":1139021},0.95,1082069.95,null,{"$f":"'13. RTSR-Historic Wholesale'!L25","v":1139021},2.34,2665309.1399999997,null,3747379.09]
[null,"August",null,{"$f":"'13. RTSR-Historic Wholesale'!D26","v":1084014},3.61,3913290.54,null,{"$f":"'13. RTSR-Historic Wholesale'!H26","v":1122294},0.95,1066179.3,null,{"$f":"'13. RTSR-Historic Wholesale'!L26","v":1122294},2.34,2626167.96,null,3692347.26]
[null,"September",null,{"$f":"'13. RTSR-Historic Wholesale'!D27","v":1111718},3.61,4013301.98,null,{"$f":"'13. RTSR-Historic Wholesale'!H27","v":1181855},0.95,1122762.25,null,{"$f":"'13. RTSR-Historic Wholesale'!L27","v":1181855},2.34,2765540.6999999997,null,3888302.9499999997]
[null,"October",null,{"$f":"'13. RTSR-Historic Wholesale'!D28","v":846142},3.61,3054572.62,null,{"$f":"'13. RTSR-Historic Wholesale'!H28","v":911316},0.95,865750.2,null,{"$f":"'13. RTSR-Historic Wholesale'!L28","v":911316},2.34,2132479.44,null,2998229.6399999997]
[null,"November",null,{"$f":"'13. RTSR-Historic Wholesale'!D29","v":827342},3.61,2986704.62,null,{"$f":"'13. RTSR-Historic Wholesale'!H29","v":897408},0.95,852537.6,null,{"$f":"'13. RTSR-Historic Wholesale'!L29","v":897408},2.34,2099934.7199999997,null,2952472.32]
[null,"December",null,{"$f":"'13. RTSR-Historic Wholesale'!D30","v":961225},3.61,3470022.25,null,{"$f":"'13. RTSR-Historic Wholesale'!H30","v":1022498},0.95,971373.1,null,{"$f":"'13. RTSR-Historic Wholesale'!L30","v":1022498},2.34,2392645.3199999998,null,3364018.42]
[]
[null,"Total",null,{"$f":"SUM(D20:D31)","v":11434066},{"$f":"IF(D33<>0,F33/D33,0)","v":3.61},{"$f":"SUM(F20:F31)","v":41276978.259999998},null,{"$f":"SUM(H20:H31)","v":12133884},{"$f":"IF(H33<>0,J33/H33,0)","v":0.94999999999999973},{"$f":"SUM(J20:J31)","v":11527189.799999997},null,{"$f":"SUM(L20:L31)","v":12133884},{"$f":"IF(L33<>0,N33/L33,0)","v":2.3400000000000003},{"$f":"SUM(N20:N31)","v":28393288.560000002},null,{"$f":"SUM(P20:P31)","v":39920478.359999999}]
[]
[null,"Hydro One",null,"Network",null,null,null,"Line Connection",null,null,null,"Transformation Connection",null,null,null,"Total Line"]
[]
[null,"Month",null,"Units Billed","Rate","Amount",null,"Units Billed","Rate","Amount",null,"Units Billed","Rate","Amount",null,"Amount"]
[]
[null,"January",null,{"$f":"'13. RTSR-Historic Wholesale'!D38","v":190372.4},{"$f":"'12. RTSR-UTRs & Sub-Tx'!J29","v":3.1941999999999999},{"$f":"D39*E39","v":608087.52007999993},null,{"$f":"'13. RTSR-Historic Wholesale'!H38","v":174972.79999999999},{"$f":"'12. RTSR-UTRs & Sub-Tx'!J31","v":0.77100000000000002},{"$f":"H39*I39","v":134904.0288},null,{"$f":"'13. RTSR-Historic Wholesale'!L38","v":200561.3},{"$f":"'12. RTSR-UTRs & Sub-Tx'!J33","v":1.7493000000000001},{"$f":"L39*M39","v":350841.88208999997},null,{"$f":"J39+N39","v":485745.91088999994}]
[null,"February",null,{"$f":"'13. RTSR-Historic Wholesale'!D39","v":173119},{"$f":"E39","v":3.1941999999999999},552976.70979999995,null,{"$f":"'13. RTSR-Historic Wholesale'!H39","v":149924},{"$f":"I39","v":0.77100000000000002},115591.40400000001,null,{"$f":"'13. RTSR-Historic Wholesale'!L39","v":176107.1},{"$f":"M39","v":1.7493000000000001},308064.15003000002,null,423655.55403]
[null,"March",null,{"$f":"'13. RTSR-Historic Wholesale'!D40","v":184167.3},3.1941999999999999,588267.18965999992,null,{"$f":"'13. RTSR-Historic Wholesale'!H40","v":159688.29999999999},0.77100000000000002,123119.67929999999,null,{"$f":"'13. RTSR-Historic Wholesale'!L40","v":188667.8},1.7493000000000001,330036.58253999997,null,453156.26183999993]
[null,"April",null,{"$f":"'13. RTSR-Historic Wholesale'!D41","v":160011.1},3.1941999999999999,511107.45562000002,null,{"$f":"'13. RTSR-Historic Wholesale'!H41","v":137658.29999999999},0.77100000000000002,106134.5493,null,{"$f":"'13. RTSR-Historic Wholesale'!L41","v":160018.40000000002},1.7493000000000001,279920.18712000008,null,386054.73642000009]
[null,"May",null,{"$f":"'13. RTSR-Historic Wholesale'!D42","v":186789.4},3.1941999999999999,596642.70147999993,null,{"$f":"'13. RTSR-Historic Wholesale'!H42","v":183988.96},0.77100000000000002,141855.48816000001,null,{"$f":"'13. RTSR-Historic Wholesale'!L42","v":208329.26},1.7493000000000001,364430.37451800006,null,506285.86267800006]
[null,"June",null,{"$f":"'13. RTSR-Historic Wholesale'!D43","v":198958.6},3.1941999999999999,635513.56012000004,null,{"$f":"'13. RTSR-Historic Wholesale'!H43","v":180215.21},0.77100000000000002,138945.92691000001,null,{"$f":"'13. RTSR-Historic Wholesale'!L43","v":205609.34999999998},1.7493000000000001,359672.43595499999,null,498618.36286500003]
[null,"July",null,{"$f":"'13. RTSR-Historic Wholesale'!D44","v":207903},3.1941999999999999,664083.76260000002,null,{"$f":"'13. RTSR-Historic Wholesale'!H44","v":220222.12},0.77100000000000002,169791.25451999999,null,{"$f":"'13. RTSR-Historic Wholesale'!L44","v":245742.66},1.7493000000000001,429877.63513800001,null,599668.88965799997]
[null,"August",null,{"$f":"'13. RTSR-Historic Wholesale'!D45","v":202326.39999999999},3.1941999999999999,646270.98687999998,null,{"$f":"'13. RTSR-Historic Wholesale'!H45","v":213420},0.77100000000000002,164546.82,null,{"$f":"'13. RTSR-Historic Wholesale'!L45","v":240730},1.7493000000000001,421108.989,null,585655.80900000001]
[null,"September",null,{"$f":"'13. RTSR-Historic Wholesale'!D46","v":198923.8},3.1941999999999999,635402.40195999993,null,{"$f":"'13. RTSR-Historic Wholesale'!H46","v":178943.8},0.77100000000000002,137965.6698,null,{"$f":"'13. RTSR-Historic Wholesale'!L46","v":204012.3},1.7493000000000001,356878.71639000002,null,494844.38618999999]
[null,"October",null,{"$f":"'13. RTSR-Historic Wholesale'!D47","v":192116.28},3.1941999999999999,613657.82157599996,null,{"$f":"'13. RTSR-Historic Wholesale'!H47","v":167754.15999999997},0.77100000000000002,129338.45735999999,null,{"$f":"'13. RTSR-Historic Wholesale'!L47","v":192822.65999999997},1.7493000000000001,337304.67913799995,null,466643.13649799995]
[null,"November",null,{"$f":"'13. RTSR-Historic Wholesale'!D48","v":194541.61},3.1941999999999999,621404.81066199997,null,{"$f":"'13. RTSR-Historic Wholesale'!H48","v":171279.58000000002},0.77100000000000002,132056.55618000001,null,{"$f":"'13. RTSR-Historic Wholesale'!L48","v":194780.84},1.7493000000000001,340730.12341200002,null,472786.67959200003]
[null,"December",null,{"$f":"'13. RTSR-Historic Wholesale'!D49","v":207697.07},3.1941999999999999,663425.98099399998,null,{"$f":"'13. RTSR-Historic Wholesale'!H49","v":182641.68},0.77100000000000002,140816.73527999999,null,{"$f":"'13. RTSR-Historic Wholesale'!L49","v":207697.07},1.7493000000000001,363324.484551,null,504141.21983099997]
[]
[null,"Total",null,{"$f":"SUM(D39:D50)","v":2296925.96},{"$f":"IF(D52<>0,F52/D52,0)","v":3.1942000000000004},{"$f":"SUM(F39:F50)","v":7336840.901432001},null,{"$f":"SUM(H39:H50)","v":2120708.91},{"$f":"IF(H52<>0,J52/H52,0)","v":0.77099999999999991},{"$f":"SUM(J39:J50)","v":1635066.5696099999},null,{"$f":"SUM(L39:L50)","v":2425078.7399999998},{"$f":"IF(L52<>0,N52/L52,0)","v":1.7493000000000005},{"$f":"SUM(N39:N50)","v":4242190.2398820007},null,{"$f":"SUM(P39:P50)","v":5877256.8094919994}]
[]
[null,"Add Extra Host Here (I)",null,"Network",null,null,null,"Line Connection",null,null,null,"Transformation Connection",null,null,null,"Total Line"]
[]
[null,"Month",null,"Units Billed","Rate","Amount",null,"Units Billed","Rate","Amount",null,"Units Billed","Rate","Amount",null,"Amount"]
[]
[null,"January",null,{"$f":"'13. RTSR-Historic Wholesale'!D57","v":0},{"$f":"'12. RTSR-UTRs & Sub-Tx'!J44","v":0},{"$f":"D58*E58","v":0},null,{"$f":"'13. RTSR-Historic Wholesale'!H57","v":0},{"$f":"'12. RTSR-UTRs & Sub-Tx'!J46","v":0},{"$f":"H58*I58","v":0},null,{"$f":"'13. RTSR-Historic Wholesale'!L57","v":0},{"$f":"'12. RTSR-UTRs & Sub-Tx'!J48","v":0},{"$f":"L58*M58","v":0},null,{"$f":"J58+N58","v":0}]
[null,"February",null,{"$f":"'13. RTSR-Historic Wholesale'!D58","v":0},{"$f":"E58","v":0},0,null,{"$f":"'13. RTSR-Historic Wholesale'!H58","v":0},{"$f":"I58","v":0},0,null,{"$f":"'13. RTSR-Historic Wholesale'!L58","v":0},{"$f":"M58","v":0},0,null,0]
[null,"March",null,{"$f":"'13. RTSR-Historic Wholesale'!D59","v":0},0,0,null,{"$f":"'13. RTSR-Historic Wholesale'!H59","v":0},0,0,null,{"$f":"'13. RTSR-Historic Wholesale'!L59","v":0},0,0,null,0]
[null,"April",null,{"$f":"'13. RTSR-Historic Wholesale'!D60","v":0},0,0,null,{"$f":"'13. RTSR-Historic Wholesale'!H60","v":0},0,0,null,{"$f":"'13. RTSR-Historic Wholesale'!L60","v":0},0,0,null,0]
[null,"May",null,{"$f":"'13. RTSR-Historic Wholesale'!D61","v":0},0,0,null,{"$f":"'13. RTSR-Historic Wholesale'!H61","v":0},0,0,null,{"$f":"'13. RTSR-Historic Wholesale'!L61","v":0},0,0,null,0]
[null,"June",null,{"$f":"'13. RTSR-Historic Wholesale'!D62","v":0},0,0,null,{"$f":"'13. RTSR-Historic Wholesale'!H62","v":0},0,0,null,{"$f":"'13. RTSR-Historic Wholesale'!L62","v":0},0,0,null,0]
[null,"July",null,{"$f":"'13. RTSR-Historic Wholesale'!D63","v":0},0,0,null,{"$f":"'13. RTSR-Historic Wholesale'!H63","v":0},0,0,null,{"$f":"'13. RTSR-Historic Wholesale'!L63","v":0},0,0,null,0]
[null,"August",null,{"$f":"'13. RTSR-Historic Wholesale'!D64","v":0},0,0,null,{"$f":"'13. RTSR-Historic Wholesale'!H64","v":0},0,0,null,{"$f":"'13. RTSR-Historic Wholesale'!L64","v":0},0,0,null,0]
[null,"September",null,{"$f":"'13. RTSR-Historic Wholesale'!D65","v":0},0,0,null,{"$f":"'13. RTSR-Historic Wholesale'!H65","v":0},0,0,null,{"$f":"'13. RTSR-Historic Wholesale'!L65","v":0},0,0,null,0]
[null,"October",null,{"$f":"'13. RTSR-Historic Wholesale'!D66","v":0},0,0,null,{"$f":"'13. RTSR-Historic Wholesale'!H66","v":0},0,0,null,{"$f":"'13. RTSR-Historic Wholesale'!L66","v":0},0,0,null,0]
[null,"November",null,{"$f":"'13. RTSR-Historic Wholesale'!D67","v":0},0,0,null,{"$f":"'13. RTSR-Historic Wholesale'!H67","v":0},0,0,null,{"$f":"'13. RTSR-Historic Wholesale'!L67","v":0},0,0,null,0]
[null,"December",null,{"$f":"'13. RTSR-Historic Wholesale'!D68","v":0},0,0,null,{"$f":"'13. RTSR-Historic Wholesale'!H68","v":0},0,0,null,{"$f":"'13. RTSR-Historic Wholesale'!L68","v":0},0,0,null,0]
[]
[null,"Total",null,{"$f":"SUM(D58:D69)","v":0},{"$f":"IF(D71<>0,F71/D71,0)","v":0},{"$f":"SUM(F58:F69)","v":0},null,{"$f":"SUM(H58:H69)","v":0},{"$f":"IF(H71<>0,J71/H71,0)","v":0},{"$f":"SUM(J58:J69)","v":0},null,{"$f":"SUM(L58:L69)","v":0},{"$f":"IF(L71<>0,N71/L71,0)","v":0},{"$f":"SUM(N58:N69)","v":0},null,{"$f":"SUM(P58:P69)","v":0}]
[]
[null,"Add Extra Host Here (II)",null,"Network",null,null,null,"Line Connection",null,null,null,"Transformation Connection",null,null,null,"Total Line"]
[]
[null,"Month",null,"Units Billed","Rate","Amount",null,"Units Billed","Rate","Amount",null,"Units Billed","Rate","Amount",null,"Amount"]
[]
[null,"January",null,{"$f":"'13. RTSR-Historic Wholesale'!D76","v":0},{"$f":"'12. RTSR-UTRs & Sub-Tx'!J59","v":0},{"$f":"D77*E77","v":0},null,{"$f":"'13. RTSR-Historic Wholesale'!H76","v":0},{"$f":"'12. RTSR-UTRs & Sub-Tx'!J61","v":0},{"$f":"H77*I77","v":0},null,{"$f":"'13. RTSR-Historic Wholesale'!L76","v":0},{"$f":"'12. RTSR-UTRs & Sub-Tx'!J63","v":0},{"$f":"L77*M77","v":0},null,{"$f":"J77+N77","v":0}]
[null,"February",null,{"$f":"'13. RTSR-Historic Wholesale'!D77","v":0},{"$f":"E77","v":0},0,null,{"$f":"'13. RTSR-Historic Wholesale'!H77","v":0},{"$f":"I77","v":0},0,null,{"$f":"'13. RTSR-Historic Wholesale'!L77","v":0},{"$f":"M77","v":0},0,null,0]
[null,"March",null,{"$f":"'13. RTSR-Historic Wholesale'!D78","v":0},0,0,null,{"$f":"'13. RTSR-Historic Wholesale'!H78","v":0},0,0,null,{"$f":"'13. RTSR-Historic Wholesale'!L78","v":0},0,0,null,0]
[null,"April",null,{"$f":"'13. RTSR-Historic Wholesale'!D79","v":0},0,0,null,{"$f":"'13. RTSR-Historic Wholesale'!H79","v":0},0,0,null,{"$f":"'13. RTSR-Historic Wholesale'!L79","v":0},0,0,null,0]
[null,"May",null,{"$f":"'13. RTSR-Historic Wholesale'!D80","v":0},0,0,null,{"$f":"'13. RTSR-Historic Wholesale'!H80","v":0},0,0,null,{"$f":"'13. RTSR-Historic Wholesale'!L80","v":0},0,0,null,0]
[null,"June",null,{"$f":"'13. RTSR-Historic Wholesale'!D81","v":0},0,0,null,{"$f":"'13. RTSR-Historic Wholesale'!H81","v":0},0,0,null,{"$f":"'13. RTSR-Historic Wholesale'!L81","v":0},0,0,null,0]
[null,"July",null,{"$f":"'13. RTSR-Historic Wholesale'!D82","v":0},0,0,null,{"$f":"'13. RTSR-Historic Wholesale'!H82","v":0},0,0,null,{"$f":"'13. RTSR-Historic Wholesale'!L82","v":0},0,0,null,0]
[null,"August",null,{"$f":"'13. RTSR-Historic Wholesale'!D83","v":0},0,0,null,{"$f":"'13. RTSR-Historic Wholesale'!H83","v":0},0,0,null,{"$f":"'13. RTSR-Historic Wholesale'!L83","v":0},0,0,null,0]
[null,"September",null,{"$f":"'13. RTSR-Historic Wholesale'!D84","v":0},0,0,null,{"$f":"'13. RTSR-Historic Wholesale'!H84","v":0},0,0,null,{"$f":"'13. RTSR-Historic Wholesale'!L84","v":0},0,0,null,0]
[null,"October",null,{"$f":"'13. RTSR-Historic Wholesale'!D85","v":0},0,0,null,{"$f":"'13. RTSR-Historic Wholesale'!H85","v":0},0,0,null,{"$f":"'13. RTSR-Historic Wholesale'!L85","v":0},0,0,null,0]
[null,"November",null,{"$f":"'13. RTSR-Historic Wholesale'!D86","v":0},0,0,null,{"$f":"'13. RTSR-Historic Wholesale'!H86","v":0},0,0,null,{"$f":"'13. RTSR-Historic Wholesale'!L86","v":0},0,0,null,0]
[null,"December",null,{"$f":"'13. RTSR-Historic Wholesale'!D87","v":0},0,0,null,{"$f":"'13. RTSR-Historic Wholesale'!H87","v":0},0,0,null,{"$f":"'13. RTSR-Historic Wholesale'!L87","v":0},0,0,null,0]
[null,null,null,null,null,null,null,null,null,null,null,{"$f":"'13. RTSR-Historic Wholesale'!L88","v":0}]
[null,"Total",null,{"$f":"SUM(D77:D88)","v":0},{"$f":"IF(D90<>0,F90/D90,0)","v":0},{"$f":"SUM(F77:F88)","v":0},null,{"$f":"SUM(H77:H88)","v":0},{"$f":"IF(H90<>0,J90/H90,0)","v":0},{"$f":"SUM(J77:J88)","v":0},null,{"$f":"SUM(L77:L88)","v":0},{"$f":"IF(L90<>0,N90/L90,0)","v":0},{"$f":"SUM(N77:N88)","v":0},null,{"$f":"SUM(P77:P88)","v":0}]
[]
[null,"Total",null,"Network",null,null,null,"Line Connection",null,null,null,"Transformation Connection",null,null,null,"Total Line"]
[]
[null,"Month",null,"Units Billed","Rate","Amount",null,"Units Billed","Rate","Amount",null,"Units Billed","Rate","Amount",null,"Amount"]
[]
[null,"January",null,{"$f":"D20+D39+D58+D77","v":1101701.3999999999},{"$f":"IF(D96<>0,F96/D96,0)","v":3.5381503645906234},{"$f":"F20+F39+F58+F77","v":3897985.2100799996},null,{"$f":"H20+H39+H58+H77","v":1167998.8},{"$f":"IF(H96<>0,J96/H96,0)","v":0.92318479162821043},{"$f":"J20+J39+J58+J77","v":1078278.7287999999},null,{"$f":"L20+L39+L58+L77","v":1193587.3},{"$f":"IF(L96<>0,N96/L96,0)","v":2.2407432804370488},{"$f":"N20+N39+N58+N77","v":2674522.7220899998},null,{"$f":"J96+N96","v":3752801.45089}]
[null,"February",null,{"$f":"D21+D40+D59+D78","v":1058342},3.5419852370972706,{"$f":"F21+F40+F59+F78","v":3748631.7397999996},null,{"$f":"H21+H40+H59+H78","v":1074563},0.92502575837805689,{"$f":"J21+J40+J59+J78","v":993998.45399999991},null,{"$f":"L21+L40+L59+L78","v":1100746.1000000001},2.2454945877437127,{"$f":"N21+N40+N59+N78","v":2471719.4100299999},null,3465717.8640299998]
[null,"March",null,1042404.3,3.5365383274608515,3686502.75966,null,1081890.3,0.92357938628343361,999211.57929999987,null,1110869.8,2.2396767492824088,2487989.2625399996,null,3487200.8418399994]
[null,"April",null,974386.1,3.5417184272435742,3451001.2056200001,null,999654.3,0.92535064301729097,925030.74929999991,null,1022014.4,2.2475131731216313,2296990.82712,null,3222021.5764199998]
[null,"May",null,1109876.3999999999,3.5400219082773541,3928986.7714799996,null,1164746.96,0.92172431011109923,1073575.58816,null,1189087.26,2.2365087777645516,2659404.0945179998,null,3732979.6826780001]
[null,"June",null,1326941.6000000001,3.5476558954214714,4707532.1901200004,null,1357086.21,0.92622957012436213,1256973.3769099999,null,1382480.35,2.2521481596139861,3113550.5759549998,null,4370523.9528649999]
[null,"July",null,1291294,3.5430546975359598,4575125.2725999998,null,1359243.12,0.92099874268261872,1251861.2045199999,null,1384763.66,2.2351733111901564,3095186.7751379996,null,4347047.9796579992]
[null,"August",null,1286340.3999999999,3.544599490834619,4559561.5268799998,null,1335714,0.92139943131538649,1230726.1200000001,null,1363024,2.2356737291493034,3047276.949,null,4278003.0690000001]
[null,"September",null,1310641.8,3.5468915930805807,4648704.3819599999,null,1360798.8,0.92646166339946801,1260727.9198,null,1385867.3,2.2530435752326357,3122419.4163899999,null,4383147.3361900002]
[null,"October",null,1038258.28,3.5330615823030085,3668230.4415760003,null,1079070.1599999999,0.92217234267695813,995088.65735999995,null,1104138.6599999999,2.2368423537837181,2469784.1191380001,null,3464872.7764980001]
[null,"November",null,1021883.61,3.5308418643313009,3608109.4306620001,null,1068687.58,0.92131149889474706,984594.15617999993,null,1092188.8400000001,2.2346546256707764,2440664.8434119998,null,3425258.9995919997]
[null,"December",null,1168922.07,3.5361195900715603,4133448.2309940001,null,1205139.68,0.92287213983361671,1112189.83528,null,1230195.07,2.2402705650177901,2755969.8045509998,null,3868159.639831]
[]
[null,"Total",null,{"$f":"SUM(D96:D107)","v":13730991.960000001},{"$f":"IF(D109<>0,F109/D109,0)","v":3.5404448056666102},{"$f":"SUM(F96:F107)","v":48613819.161431991},null,{"$f":"SUM(H96:H107)","v":14254592.91},{"$f":"IF(H109<>0,J109/H109,0)","v":0.92336950291834041},{"$f":"SUM(J96:J107)","v":13162256.36961},null,{"$f":"SUM(L96:L107)","v":14558962.740000002},{"$f":"IF(L109<>0,N109/L109,0)","v":2.2416074127463554},{"$f":"SUM(N96:N107)","v":32635478.799881995},null,{"$f":"SUM(P96:P107)","v":45797735.169491999}]
[]
[null,null,null,null,null,null,null,null,null,null,null,null,null,"Low Voltage Switchgear Credit (if applicable)",null,{"$f":"'12. RTSR-UTRs & Sub-Tx'!J68","v":0}]
[]
[null,null,null,null,null,null,null,null,null,null,null,null,null,"Total including deduction for Low Voltage Switchgear Credit",null,{"$f":"P109+P111","v":45797735.169491999}]

{"sheet":"16. RTSR-Rates to Forecast","index":21,"n_rows":63,"n_cols":11,"rows_kept":63,"cut":false,"hidden":false,"merged":[[1,1,8,2]]}
["Back to Index","Back to Index"]
[null,{"$f":"+'1. Information Sheet'!B2","v":"INCENTIVE REGULATION MODEL FOR 2019 FILERS"}]
[]
[]
[]
[]
[]
[]
[]
[]
[]
[]
[null,"The purpose of this table is to re-align the current RTS Network Rates to recover current wholesale network costs."]
[]
[null,"Rate Class","Rate Description","Unit","Current RTSR-Network","Loss Adjusted Billed kWh","Billed kW","Billed Amount","Billed Amount %","Current Wholesale Billing","Adjusted RTSR Network"]
[]
[{"$f":"'11. RTSR - Current Rates'!A16","v":"R_TN"},{"$f":"'4. Billing Det. for Def-Var'!B17","v":"RESIDENTIAL SERVICE CLASSIFICATION"},{"$f":"VLOOKUP(A17,RTSR,3,FALSE)","v":"Retail Transmission Rate – Network Service Rate"},{"$f":"VLOOKUP(A17,RTSR,4,FALSE)","v":"$/kWh"},{"$f":"VLOOKUP(A17,RATES,4,FALSE)","v":7.5706432419583008E-3},{"$f":"VLOOKUP(A17,RTSR,9,FALSE)","v":1440461108.0256596},{"$f":"VLOOKUP(A17,RTSR,7,FALSE)","v":0},{"$f":"IF(ISERROR(E17*F17), 0, ROUND(E17*F17, 2))","v":10905217.15},{"$f":"H17/SUM(H$17:H$26)","v":0.22537199606289307},{"$f":"I17*total_wholesale_TN","v":10956193.460652446},{"$f":"IF(ISERROR(J17/F17), 0, J17/F17)","v":7.6060321237477512E-3}]
[{"$f":"'11. RTSR - Current Rates'!A18","v":"GSL_TN"},{"$f":"'4. Billing Det. for Def-Var'!B18","v":"GENERAL SERVICE LESS THAN 50 kW SERVICE CLASSIFICATION"},"Retail Transmission Rate – Network Service Rate","$/kWh",{"$f":"VLOOKUP(A18,RATES,4,FALSE)","v":7.1000000000000004E-3},{"$f":"VLOOKUP(A18,RTSR,9,FALSE)","v":618679646.43210387},{"$f":"VLOOKUP(A18,RTSR,7,FALSE)","v":0},{"$f":"IF(ISERROR(E18*F18), 0, ROUND(E18*F18, 2))","v":4392625.49},{"$f":"H18/SUM(H$17:H$26)","v":9.0779923134134355E-2},{"$f":"I18*total_wholesale_TN","v":4413158.7667315044},{"$f":"IF(ISERROR(J18/F18), 0, J18/F18)","v":7.1331888679092344E-3}]
[{"$f":"'11. RTSR - Current Rates'!A20","v":"GS50_499_TN"},{"$f":"'4. Billing Det. for Def-Var'!B19","v":"GENERAL SERVICE 50 to 499 kW SERVICE CLASSIFICATION"},"Retail Transmission Rate – Network Service Rate","$/kW",2.7324999999999999,"",5780039.1019777982,{"$f":"IF(ISERROR(E19*G19), 0, ROUND(E19*G19, 2))","v":15793956.85},0.32640483284789085,15867785.517484803,{"$f":"IF(ISERROR(J19/G19), 0, J19/G19)","v":2.7452730401175325}]
[{"$f":"'11. RTSR - Current Rates'!A22","v":"GS500_TN"},{"$f":"'4. Billing Det. for Def-Var'!B20","v":"GENERAL SERVICE 500 to 4,999 kW SERVICE CLASSIFICATION"},"Retail Transmission Rate – Network Service Rate","$/kW",2.6436000000000002,"",4610762.3348864596,{"$f":"IF(ISERROR(E20*G20), 0, ROUND(E20*G20, 2))","v":12189011.310000001},0.25190344870554726,12245988.701512534,{"$f":"IF(ISERROR(J20/G20), 0, J20/G20)","v":2.6559574777592809}]
[{"$f":"'11. RTSR - Current Rates'!A24","v":"LU_TN"},{"$f":"'4. Billing Det. for Def-Var'!B21","v":"LARGE USE SERVICE CLASSIFICATION"},"Retail Transmission Rate – Network Service Rate – Interval Metered","$/kW",2.8210999999999999,"",1753815.618647513,4947689.24,0.1022511138091091,4970817.155771031,2.8342871981060176]
[null,{"$f":"'4. Billing Det. for Def-Var'!B22","v":"STANDBY POWER SERVICE CLASSIFICATION "}]
[{"$f":"'11. RTSR - Current Rates'!A26","v":"USL_TN"},{"$f":"'4. Billing Det. for Def-Var'!B23","v":"UNMETERED SCATTERED LOAD SERVICE CLASSIFICATION"},"Retail Transmission Rate – Network Service Rate","$/kWh",7.1000000000000004E-3,11421124.458372911,0,{"$f":"IF(ISERROR(E23*F23), 0, ROUND(E23*F23, 2))","v":81089.98},1.6758410586349558E-3,81469.034167782491,{"$f":"IF(ISERROR(J23/F23), 0, J23/F23)","v":7.1331885459016194E-3}]
["SL_TN",{"$f":"'4. Billing Det. for Def-Var'!B24","v":"STREET LIGHTING SERVICE CLASSIFICATION"},"Retail Transmission Rate – Network Service Rate","$/kW",1.8924000000000001,"",41239.546182825972,78041.72,1.6128443817903619E-3,78406.52511188823,1.9012460700777616]
[]
[]
[null,"The purpose of this table is to re-align the current RTS Connection Rates to recover current wholesale connection costs."]
[null,"Rate Class","Rate Description","Unit","Current RTSR-Connection","Loss Adjusted Billed kWh","Billed kW","Billed Amount","Billed Amount %","Current Wholesale Billing","Adjusted RTSR-Connection"]
[]
["R_TC",{"$f":"B17","v":"RESIDENTIAL SERVICE CLASSIFICATION"},{"$f":"VLOOKUP(A30,RTSR,3,FALSE)","v":"Retail Transmission Rate – Line and Transformation Connection Service Rate"},{"$f":"VLOOKUP(A30,RTSR,4,FALSE)","v":"$/kWh"},{"$f":"VLOOKUP(A30,RATES,4,FALSE)","v":7.0836618157868745E-3},{"$f":"F17","v":1440461108.0256596},{"$f":"G17","v":0},{"$f":"IF(ISERROR(E30*F30), 0, ROUND(E30*F30, 2))","v":10203739.35},{"$f":"H30/SUM(H$30:H$39)","v":0.2265245267746791},{"$f":"I30*total_wholesale_LinePlus","v":10374310.286621254},{"$f":"IF(ISERROR(J30/F30), 0, J30/F30)","v":7.2020759386142701E-3}]
["GSL_TC",{"$f":"B18","v":"GENERAL SERVICE LESS THAN 50 kW SERVICE CLASSIFICATION"},"Retail Transmission Rate – Line and Transformation Connection Service Rate","$/kWh",6.4000000000000003E-3,{"$f":"F18","v":618679646.43210387},0,{"$f":"IF(ISERROR(E31*F31), 0, ROUND(E31*F31, 2))","v":3959549.74},{"$f":"H31/SUM(H$30:H$39)","v":8.7902591425397761E-2},4025739.6028124248,{"$f":"IF(ISERROR(J31/F31), 0, J31/F31)","v":6.5069856848025852E-3}]
["GS50_499_TC","GENERAL SERVICE 50 to 499 kW SERVICE CLASSIFICATION","Retail Transmission Rate – Line and Transformation Connection Service Rate","$/kW",2.5347,"",5780039.1019777982,{"$f":"IF(ISERROR(E32*G32), 0, ROUND(E32*G32, 2))","v":14650665.109999999},0.32524693812146938,14895573.136775207,{"$f":"IF(ISERROR(J32/G32), 0, J32/G32)","v":2.577071343977289}]
["GS500_TC","GENERAL SERVICE 500 to 4,999 kW SERVICE CLASSIFICATION","Retail Transmission Rate – Line and Transformation Connection Service Rate","$/kW",2.4803000000000002,"",4610762.3348864596,{"$f":"IF(ISERROR(E33*G33), 0, ROUND(E33*G33, 2))","v":11436073.82},0.2538825347626894,11627245.091220995,{"$f":"IF(ISERROR(J33/G33), 0, J33/G33)","v":2.5217619661819581}]
["LU_TC","LARGE USE SERVICE CLASSIFICATION","Retail Transmission Rate – Line and Transformation Connection Service Rate – Interval Metered ","$/kW",2.6490999999999998,"",1753815.618647513,4646032.96,0.10314262071419548,4723698.4281560844,2.6933837160139165]
[null,"STANDBY POWER SERVICE CLASSIFICATION "]
["USL_TC","UNMETERED SCATTERED LOAD SERVICE CLASSIFICATION","Retail Transmission Rate – Line and Transformation Connection Service Rate","$/kWh",6.4000000000000003E-3,11421124.458372911,0,{"$f":"IF(ISERROR(E36*F36), 0, ROUND(E36*F36, 2))","v":73095.199999999997},1.6227242799474806E-3,74317.096826139314,{"$f":"IF(ISERROR(J36/F36), 0, J36/F36)","v":6.5069859887269587E-3}]
["SL_TC","STREET LIGHTING SERVICE CLASSIFICATION","Retail Transmission Rate – Line and Transformation Connection Service Rate","$/kW",1.8329,"",41239.546182825972,75587.960000000006,1.6780639216213784E-3,76851.527079895066,1.8635395922930778]
[]
[]
[null,"The purpose of this table is to update the re-aligned RTS Network Rates to recover future wholesale network costs."]
[null,"Rate Class","Rate Description","Unit","Adjusted RTSR-Network","Loss Adjusted Billed kWh","Billed kW","Billed Amount","Billed Amount %","Current Wholesale Billing","Proposed RTSR-Network"]
[]
["R_TN",{"$f":"B17","v":"RESIDENTIAL SERVICE CLASSIFICATION"},{"$f":"VLOOKUP(A43,RTSR,3,FALSE)","v":"Retail Transmission Rate – Network Service Rate"},{"$f":"VLOOKUP(A43,RTSR,4,FALSE)","v":"$/kWh"},{"$f":"K17","v":7.6060321237477512E-3},{"$f":"VLOOKUP(A43,RTSR,9,FALSE)","v":1440461108.0256596},{"$f":"VLOOKUP(A43,RTSR,7,FALSE)","v":0},{"$f":"IF(ISERROR(E43*F43), 0, ROUND(E43*F43, 2))","v":10956193.460000001},{"$f":"H43/SUM(H$43:H$52)","v":0.22537199600975108},{"$f":"I43*forecast_wholesale_TN","v":10956193.458069012},{"$f":"IF(ISERROR(J43/F43), 0, J43/F43)","v":7.6060321219542735E-3}]
["GSL_TN",{"$f":"B18","v":"GENERAL SERVICE LESS THAN 50 kW SERVICE CLASSIFICATION"},"Retail Transmission Rate – Network Service Rate","$/kWh",{"$f":"K18","v":7.1331888679092344E-3},618679646.43210387,0,{"$f":"IF(ISERROR(E44*F44), 0, ROUND(E44*F44, 2))","v":4413158.7699999996},{"$f":"H44/SUM(H$43:H$52)","v":9.0779923185368594E-2},4413158.7692221962,{"$f":"IF(ISERROR(J44/F44), 0, J44/F44)","v":7.1331888719350523E-3}]
["GS50_499_TN","GENERAL SERVICE 50 to 499 kW SERVICE CLASSIFICATION","Retail Transmission Rate – Network Service Rate","$/kW",2.7452730401175325,"",5780039.1019777982,{"$f":"IF(ISERROR(E45*G45), 0, ROUND(E45*G45, 2))","v":15867785.52},0.32640483284210148,15867785.517203359,{"$f":"IF(ISERROR(J45/G45), 0, J45/G45)","v":2.7452730400688403}]
["GS500_TN","GENERAL SERVICE 500 to 4,999 kW SERVICE CLASSIFICATION","Retail Transmission Rate – Network Service Rate","$/kW",2.6559574777592809,"",4610762.3348864596,{"$f":"IF(ISERROR(E46*G46), 0, ROUND(E46*G46, 2))","v":12245988.699999999},0.25190344863003694,12245988.697841689,{"$f":"IF(ISERROR(J46/G46), 0, J46/G46)","v":2.6559574769631338}]
["LU_TN","LARGE USE SERVICE CLASSIFICATION","Retail Transmission Rate – Network Service Rate – Interval Metered","$/kW",2.8342871981060176,"",1753815.618647513,4970817.16,0.10225111387807879,4970817.1591239115,2.8342872000177808]
[null,"STANDBY POWER SERVICE CLASSIFICATION "]
["USL_TN","UNMETERED SCATTERED LOAD SERVICE CLASSIFICATION","Retail Transmission Rate – Network Service Rate","$/kWh",7.1331885459016194E-3,11421124.458372911,0,{"$f":"IF(ISERROR(E49*F49), 0, ROUND(E49*F49, 2))","v":81469.03},1.6758409726071312E-3,81469.029985641377,{"$f":"IF(ISERROR(J49/F49), 0, J49/F49)","v":7.1331881797256679E-3}]
["SL_TN","STREET LIGHTING SERVICE CLASSIFICATION","Retail Transmission Rate – Network Service Rate","$/kW",1.9012460700777616,"",41239.546182825972,78406.53,1.6128444820559444E-3,78406.529986181122,1.9012461882723912]
[]
[]
[null,"The purpose of this table is to update the re-aligned RTS Connection Rates to recover future wholesale connection costs."]
[null,"Rate Class","Rate Description","Unit","Adjusted RTSR-Connection","Loss Adjusted Billed kWh","Billed kW","Billed Amount","Billed Amount %","Current Wholesale Billing","Proposed RTSR-Connection"]
[]
["R_TC",{"$f":"B17","v":"RESIDENTIAL SERVICE CLASSIFICATION"},{"$f":"VLOOKUP(A56,RTSR,3,FALSE)","v":"Retail Transmission Rate – Line and Transformation Connection Service Rate"},{"$f":"VLOOKUP(A56,RTSR,4,FALSE)","v":"$/kWh"},{"$f":"K30","v":7.2020759386142701E-3},{"$f":"VLOOKUP(A56,RTSR,9,FALSE)","v":1440461108.0256596},{"$f":"VLOOKUP(A56,RTSR,7,FALSE)","v":0},{"$f":"IF(ISERROR(E56*F56), 0, ROUND(E56*F56, 2))","v":10374310.289999999},{"$f":"H56/SUM(H$56:H$65)","v":0.22652452679647983},{"$f":"I56*forecast_wholesale_LNPlus","v":10374310.287619676},{"$f":"IF(ISERROR(J56/F56), 0, J56/F56)","v":7.2020759393073971E-3}]
["GSL_TC",{"$f":"B18","v":"GENERAL SERVICE LESS THAN 50 kW SERVICE CLASSIFICATION"},"Retail Transmission Rate – Line and Transformation Connection Service Rate","$/kWh",{"$f":"K31","v":6.5069856848025852E-3},618679646.43210387,0,{"$f":"IF(ISERROR(E57*F57), 0, ROUND(E57*F57, 2))","v":4025739.6},{"$f":"H57/SUM(H$56:H$65)","v":8.7902591343819364E-2},4025739.599076319,{"$f":"IF(ISERROR(J57/F57), 0, J57/F57)","v":6.5069856787637482E-3}]
["GS50_499_TC","GENERAL SERVICE 50 to 499 kW SERVICE CLASSIFICATION","Retail Transmission Rate – Line and Transformation Connection Service Rate","$/kW",2.577071343977289,"",5780039.1019777982,{"$f":"IF(ISERROR(E58*G58), 0, ROUND(E58*G58, 2))","v":14895573.140000001},0.3252469381172573,14895573.136582302,{"$f":"IF(ISERROR(J58/G58), 0, J58/G58)","v":2.5770713439439148}]
["GS500_TC","GENERAL SERVICE 500 to 4,999 kW SERVICE CLASSIFICATION","Retail Transmission Rate – Line and Transformation Connection Service Rate","$/kW",2.5217619661819581,"",4610762.3348864596,{"$f":"IF(ISERROR(E59*G59), 0, ROUND(E59*G59, 2))","v":11627245.09},0.25388253467777699,11627245.0873322,{"$f":"IF(ISERROR(J59/G59), 0, J59/G59)","v":2.5217619653385412}]
["LU_TC","LARGE USE SERVICE CLASSIFICATION","Retail Transmission Rate – Line and Transformation Connection Service Rate – Interval Metered ","$/kW",2.6933837160139165,"",1753815.618647513,4723698.43,0.10314262073079219,4723698.4289161758,2.6933837164473093]
[null,"STANDBY POWER SERVICE CLASSIFICATION "]
["USL_TC","UNMETERED SCATTERED LOAD SERVICE CLASSIFICATION","Retail Transmission Rate – Line and Transformation Connection Service Rate","$/kWh",6.5069859887269587E-3,11421124.458372911,0,{"$f":"IF(ISERROR(E62*F62), 0, ROUND(E62*F62, 2))","v":74317.100000000006},1.622724348876852E-3,74317.099982948406,{"$f":"IF(ISERROR(J62/F62), 0, J62/F62)","v":6.50698626512786E-3}]
["SL_TC","STREET LIGHTING SERVICE CLASSIFICATION","Retail Transmission Rate – Line and Transformation Connection Service Rate","$/kW",1.8635395922930778,"",41239.546182825972,76851.53,1.6780639849972596E-3,76851.52998236689,1.8635396626738674]

{"sheet":"17. Rev2Cost-GDPIPI","index":22,"n_rows":35,"n_cols":31,"rows_kept":35,"cut":false,"hidden":false,"merged":[[10,2,10,9],[1,2,8,7]]}
["Back to Index",null,"Back to Index",null,null,null,null,null,null,null,null,null,null,null,null,null,null,null,null,null,null,null,null,null,null,null,false,0,null,null,"NO"]
[null,null,{"$f":"+'1. Information Sheet'!B2","v":"INCENTIVE REGULATION MODEL FOR 2019 FILERS"},null,null,null,null,null,null,null,null,null,null,null,null,null,null,null,true]
[]
[]
[]
[]
[]
[]
[]
[]
[null,null,"If applicable, please enter any adjustments related to the revenue to cost ratio model into columns C and E.  The Price Escalator and Stretch Factor have been set at the 2016 values and will be updated by OEB staff at a later date. "]
[null,null,"Price Escalator",1.2E-2,"Productivity Factor",0,"# of Residential Customers\n(approved in the last CoS)\n",176865,"Effective Year of Residential Rate Design Transition (yyyy)",2016]
[null,null,"Choose Stretch Factor Group","III","Price Cap Index",{"$f":"D12-F12-D14","v":9.0000000000000011E-3},"Billed kWh for Residential Class\n(approved in the last CoS)",1423857475,"OEB-approved # of Transition Years",4]
[null,null,"Associated Stretch Factor Value",{"$f":"IF(D13=\"I\", 0%, IF(D13=\"II\", 0.15%, IF(D13=\"III\", 0.3%, IF(D13=\"IV\", 0.45%, 0.6%))))","v":3.0000000000000001E-3},null,null,"Rate Design Transition Years Left",1]
[null,null,"Rate Class","Current MFC","MFC Adjustment from R/C Model","Current  Volumetric Charge","DVR Adjustment from R/C Model","Price Cap Index to be Applied to MFC and DVR","Proposed MFC","Proposed Volumetric Charge"]
[]
["R_F","R_V",{"$f":"'4. Billing Det. for Def-Var'!B17","v":"RESIDENTIAL SERVICE CLASSIFICATION"},{"$f":"IFERROR(VLOOKUP(A17,RATES,4,FALSE),\"\")","v":21.61},null,{"$f":"IFERROR(VLOOKUP(B17,RATES,4,FALSE),\"\")","v":3.5000000000000001E-3},null,{"$f":"F$13","v":9.0000000000000011E-3},{"$f":"J28*(1+F13)","v":24.175639999999998},{"$f":"J29*(1+F13)","v":0}]
["GSL_F","GSL_V",{"$f":"'4. Billing Det. for Def-Var'!B18","v":"GENERAL SERVICE LESS THAN 50 kW SERVICE CLASSIFICATION"},43.99,null,1.2800000000000001E-2,null,{"$f":"F$13","v":9.0000000000000011E-3},{"$f":"(D18+E18)*(1+F$13)","v":44.385909999999996},{"$f":"(F18+G18)*(1+F$13)","v":1.29152E-2}]
["GS50_499_F","GS50_499_V",{"$f":"'4. Billing Det. for Def-Var'!B19","v":"GENERAL SERVICE 50 to 499 kW SERVICE CLASSIFICATION"},77.48,null,4.6628999999999996,null,9.0000000000000011E-3,{"$f":"(D19+E19)*(1+F$13)","v":78.177319999999995},{"$f":"(F19+G19)*(1+F$13)","v":4.7048660999999994}]
["GS500_F","GS500_V",{"$f":"'4. Billing Det. for Def-Var'!B20","v":"GENERAL SERVICE 500 to 4,999 kW SERVICE CLASSIFICATION"},1764.42,null,2.3994,null,9.0000000000000011E-3,{"$f":"(D20+E20)*(1+F$13)","v":1780.2997799999998},2.4209945999999998]
["LU_F","LU_V",{"$f":"'4. Billing Det. for Def-Var'!B21","v":"LARGE USE SERVICE CLASSIFICATION"},13911.73,null,2.9782000000000002,null,9.0000000000000011E-3,14036.935569999998,3.0050037999999999]
[null,null,{"$f":"'4. Billing Det. for Def-Var'!B22","v":"STANDBY POWER SERVICE CLASSIFICATION "},"",null,"",null,9.0000000000000011E-3,0,0]
["USL_F","USL_V",{"$f":"'4. Billing Det. for Def-Var'!B23","v":"UNMETERED SCATTERED LOAD SERVICE CLASSIFICATION"},9.08,null,1.6500000000000001E-2,null,9.0000000000000011E-3,9.161719999999999,1.66485E-2]
["SL_F","SL_V",{"$f":"'4. Billing Det. for Def-Var'!B24","v":"STREET LIGHTING SERVICE CLASSIFICATION"},1.52,null,11.650399999999999,null,9.0000000000000011E-3,1.5336799999999999,11.755253599999998]
[null,null,"microFIT SERVICE CLASSIFICATION",5.4,null,"",null,9.0000000000000011E-3,{"$f":"D25","v":5.4},0]
[]
[null,null,"Rate Design Transition",null,"Revenue from Rates","Current F/V Split","Decoupling MFC Split","Incremental Fixed Charge ($/month/year)","New F/V Split","Adjusted Rates1","Revenue at New F/V Split "]
[null,null,"Current Residential Fixed Rate (inclusive of R/C adj.)",{"$f":"D17+E17","v":21.61},{"$f":"D28*COS_RES_CUSTOMERS*12","v":45864631.799999997},{"$f":"IF(ISERROR(E28/E30), 0, E28/E30)","v":0.90199244550089408},{"$f":"IF(ISERROR((1-F28)/YRS_LEFT), 0, (1-F28)/YRS_LEFT)","v":9.800755449910592E-2},{"$f":"IF(ISERROR(ROUND(G28*E30/COS_RES_CUSTOMERS/12, 2)), 0, ROUND(G28*E30/COS_RES_CUSTOMERS/12, 2))","v":2.35},{"$f":"G28+F28","v":1},{"$f":"IF(ISERROR(ROUND(I28*E30/COS_RES_CUSTOMERS/12, 2)), 0, ROUND(I28*E30/COS_RES_CUSTOMERS/12, 2))","v":23.96},{"$f":"ROUND(J28*COS_RES_CUSTOMERS*12, 2)","v":50852224.799999997}]
[null,null,"Current Residential Variable Rate (inclusive of R/C adj.)",{"$f":"F17+G17","v":3.5000000000000001E-3},{"$f":"D29*COS_RES_KWH","v":4983501.1625000006},{"$f":"IF(ISERROR(E29/E30), 0, E29/E30)","v":9.8007554499105878E-2},null,null,{"$f":"1-I28","v":0},{"$f":"IF(ISERROR(ROUND(I29*E30/COS_RES_KWH, 4)), 0, ROUND(I29*E30/COS_RES_KWH, 4))","v":0},{"$f":"ROUND(J29*COS_RES_KWH, 2)","v":0}]
[null,null,null,null,{"$f":"SUM(E28+E29)","v":50848132.962499999},null,null,null,null,null,{"$f":"SUM(K28+K29)","v":50852224.799999997}]
[]
[]
[null,null,{"$f":"IF((J28-D28)>=4, \"The Rate Design Transition has calculated a monthly fixed charge greater than or equal to $4.  Please refer to Section 3.2.3 of the Chapter 3 Filing Requirements for mitigation instructions.\", \"\")","v":""}]
[]
[null,null,"1 These are the residential rates to which the Price Cap Index will be applied to."]

{"sheet":"18. Regulatory Charges","index":23,"n_rows":24,"n_cols":5,"rows_kept":24,"cut":false,"hidden":false,"merged":[[11,2,11,4],[1,1,8,6],[20,3,20,4]]}
["Back to Index"]
[null,{"$f":"+'1. Information Sheet'!B2","v":"INCENTIVE REGULATION MODEL FOR 2019 FILERS"}]
[]
[]
[]
[]
[]
[]
[]
[]
[]
[null,null,"Update the following rates if an OEB Decision has been issued at the time of completing this application"]
[null,null,null,null,"Proposed"]
[null,null,"Wholesale Market Service Rate (WMS) - not including CBR","$/kWh",3.2000000000000002E-3]
[null,null,"Capacity Based Recovery (CBR) - Applicable for Class B Customers ","$/kWh",4.0000000000000002E-4]
[null,null,"Rural or Remote Electricity Rate Protection Charge (RRRP)","$/kWh",2.9999999999999997E-4]
[null,null,"Standard Supply Service - Administrative Charge (if applicable)","$",0.25]
[]
[]
[null,null,"Time-of-Use RPP Prices"]
[null,null,"As of ","2017-08-01"]
[null,null,"Off-Peak","$/kWh",6.5000000000000002E-2]
[null,null,"Mid-Peak","$/kWh",9.4E-2]
[null,null,"On-Peak","$/kWh",0.13200000000000001]

{"sheet":"19. Additional Rates","index":24,"n_rows":144,"n_cols":28,"rows_kept":144,"cut":false,"hidden":false,"merged":[[10,1,10,6],[1,1,8,6],[11,3,11,5]]}
["Back to Index",null,null,null,null,null,null,null,null,null,null,null,null,null,null,null,null,null,null,null,null,null,null,null,null,null,null,3]
[null,{"$f":"+'1. Information Sheet'!B2","v":"INCENTIVE REGULATION MODEL FOR 2019 FILERS"}]
[]
[]
[]
[]
[]
[]
[]
[]
[null,"In the Green Cells below, enter any proposed rate riders that are not already included in this model (e.g.:  proposed ICM rate riders).  Please note that existing SMIRR and SM Entity Charge do not need to be included below.\nIn column A, the rate rider descriptions must begin with \"Rate Rider for\". \nIn column B, choose the associated unit from the drop-down menu.\nIn column C, enter the rate. All rate riders with a \"$\" unit should be rounded to 2 decimal places and all others rounded to 4 decimal places.\nIn column E, enter the expiry date (e.g. April 30, 2018) or description of the expiry date in text (e.g. the effective date of  the next cost of service-based rate order).\nIn column G, choose the sub-total as applicable in the bill impact calculation from the drop-down menu"]
[null,null,null,"INPUT ICM RATE RIDERS ONLY"]
[null,{"$f":"'4. Billing Det. for Def-Var'!B17","v":"RESIDENTIAL SERVICE CLASSIFICATION"}]
[null,"Rate Rider for Incremental Capital Module (ICM)","$",0.16247976524794513," - effective until ","the effective date of the next cost of service-based rate order",null,"A"]
[null,"Capitalization Policy Rate Rider (2019) effective until December 31, 2019","$",-0.23," - effective until ","2019-12-31"]
[null,null,null,null," - effective until "]
[null,null,null,null," - effective until "]
[null,null,null,null," - effective until "]
[null,null,null,null," - effective until "]
[null,null,null,null," - effective until "]
[null,null,null,null," - effective until "]
[null,null,null,null," - effective until "]
[null,null,null,null," - effective until "]
[]
[]
[null,{"$f":"'4. Billing Det. for Def-Var'!B18","v":"GENERAL SERVICE LESS THAN 50 kW SERVICE CLASSIFICATION"}]
[null,"Rate Rider for Incremental Capital Module (ICM)","$",0.29900791089764595," - effective until ","the effective date of the next cost of service-based rate order",null,"A"]
[null,"Rate Rider for Incremental Capital Module (ICM)","$/kWh",8.7003893145939253E-5," - effective until ","the effective date of the next cost of service-based rate order",null,"A"]
[null,"Capitalization Policy Rate Rider (2019) effective until December 31, 2019","$",-0.42," - effective until "]
[null,"Capitalization Policy Rate Rider (2019) effective until December 31, 2019","$/kWh",-1E-4," - effective until "]
[null,null,null,null," - effective until "]
[null,null,null,null," - effective until "]
[null,null,null,null," - effective until "]
[null,null,null,null," - effective until "]
[null,null,null,null," - effective until "]
[]
[]
[null,{"$f":"'4. Billing Det. for Def-Var'!B19","v":"GENERAL SERVICE 50 to 499 kW SERVICE CLASSIFICATION"}]
[null,"Rate Rider for Incremental Capital Module (ICM)","$",0.52664544069901364," - effective until ","the effective date of the next cost of service-based rate order",null,"A"]
[null,"Rate Rider for Incremental Capital Module (ICM)","$/kW",3.1694566667984383E-2," - effective until ","the effective date of the next cost of service-based rate order",null,"A"]
[null,"Capitalization Policy Rate Rider (2019) effective until December 31, 2019","$",-0.74," - effective until "]
[null,"Capitalization Policy Rate Rider (2019) effective until December 31, 2019","$/kW",-4.4699999999999997E-2," - effective until "]
[null,null,null,null," - effective until "]
[null,null,null,null," - effective until "]
[null,null,null,null," - effective until "]
[null,null,null,null," - effective until "]
[null,null,null,null," - effective until "]
[]
[]
[null,{"$f":"'4. Billing Det. for Def-Var'!B20","v":"GENERAL SERVICE 500 to 4,999 kW SERVICE CLASSIFICATION"}]
[null,"Rate Rider for Incremental Capital Module (ICM)","$",11.993078839418606," - effective until ","the effective date of the next cost of service-based rate order",null,"A"]
[null,"Rate Rider for Incremental Capital Module (ICM)","$/kW",1.6309151657372394E-2," - effective until ","the effective date of the next cost of service-based rate order",null,"A"]
[null,"Capitalization Policy Rate Rider (2019) effective until December 31, 2019","$",-16.899999999999999," - effective until "]
[null,"Capitalization Policy Rate Rider (2019) effective until December 31, 2019","$/kW",-2.3E-2," - effective until "]
[null,null,null,null," - effective until "]
[null,null,null,null," - effective until "]
[null,null,null,null," - effective until "]
[null,null,null,null," - effective until "]
[null,null,null,null," - effective until "]
[]
[]
[null,{"$f":"'4. Billing Det. for Def-Var'!B21","v":"LARGE USE SERVICE CLASSIFICATION"}]
[null,"Rate Rider for Incremental Capital Module (ICM)","$",94.560521124621673," - effective until ","the effective date of the next cost of service-based rate order",null,"A"]
[null,"Rate Rider for Incremental Capital Module (ICM)","$/kW",2.0243358950565338E-2," - effective until ","the effective date of the next cost of service-based rate order",null,"A"]
[null,"Capitalization Policy Rate Rider (2019) effective until December 31, 2019","$",-133.24," - effective until "]
[null,"Capitalization Policy Rate Rider (2019) effective until December 31, 2019","$/kW",-2.8500000000000001E-2," - effective until "]
[null,null,null,null," - effective until "]
[null,null,null,null," - effective until "]
[null,null,null,null," - effective until "]
[null,null,null,null," - effective until "]
[null,null,null,null," - effective until "]
[]
[]
[null,{"$f":"'4. Billing Det. for Def-Var'!B23","v":"UNMETERED SCATTERED LOAD SERVICE CLASSIFICATION"}]
[null,"Rate Rider for Incremental Capital Module (ICM)","$",6.1718386700400661E-2," - effective until ","the effective date of the next cost of service-based rate order",null,"A"]
[null,"Rate Rider for Incremental Capital Module (ICM)","$/kWh",1.1215345600843732E-4," - effective until ","the effective date of the next cost of service-based rate order",null,"A"]
[null,"Capitalization Policy Rate Rider (2019) effective until December 31, 2019","$",-0.09," - effective until "]
[null,"Capitalization Policy Rate Rider (2019) effective until December 31, 2019","$/kWh",-2.0000000000000001E-4," - effective until "]
[null,null,null,null," - effective until "]
[null,null,null,null," - effective until "]
[null,null,null,null," - effective until "]
[null,null,null,null," - effective until "]
[null,null,null,null," - effective until "]
[]
[]
[null,{"$f":"'4. Billing Det. for Def-Var'!B24","v":"STREET LIGHTING SERVICE CLASSIFICATION"}]
[null,"Rate Rider for Incremental Capital Module (ICM)","$",1.0331712311080288E-2," - effective until ","the effective date of the next cost of service-based rate order",null,"A"]
[null,"Rate Rider for Incremental Capital Module (ICM)","$/kW",7.9189855992769578E-2," - effective until ","the effective date of the next cost of service-based rate order",null,"A"]
[null,"Capitalization Policy Rate Rider (2019) effective until December 31, 2019","$",-0.01," - effective until "]
[null,"Capitalization Policy Rate Rider (2019) effective until December 31, 2019","$/kW",-0.1116," - effective until "]
[null,null,null,null," - effective until "]
[null,null,null,null," - effective until "]
[null,null,null,null," - effective until "]
[null,null,null,null," - effective until "]
[null,null,null,null," - effective until "]
[]
[]
[null,{"$f":"'4. Billing Det. for Def-Var'!B25","v":0}]
[null,null,null,null," - effective until "]
[null,null,null,null," - effective until "]
[null,null,null,null," - effective until "]
[null,null,null,null," - effective until "]
[null,null,null,null," - effective until "]
[null,null,null,null," - effective until "]
[null,null,null,null," - effective until "]
[null,null,null,null," - effective until "]
[null,null,null,null," - effective until "]
[]
[]
[null,{"$f":"'4. Billing Det. for Def-Var'!B26","v":0}]
[null,null,null,null," - effective until "]
[null,null,null,null," - effective until "]
[null,null,null,null," - effective until "]
[null,null,null,null," - effective until "]
[null,null,null,null," - effective until "]
[null,null,null,null," - effective until "]
[null,null,null,null," - effective until "]
[null,null,null,null," - effective until "]
[null,null,null,null," - effective until "]
[]
[]
[null,{"$f":"'4. Billing Det. for Def-Var'!B27","v":0}]
[null,null,null,null," - effective until "]
[null,null,null,null," - effective until "]
[null,null,null,null," - effective until "]
[null,null,null,null," - effective until "]
[null,null,null,null," - effective until "]
[null,null,null,null," - effective until "]
[null,null,null,null," - effective until "]
[null,null,null,null," - effective until "]
[null,null,null,null," - effective until "]
[]
[]
[null,"MICROFIT SERVICE CLASSIFICATION"]
[null,null,null,null," - effective until "]
[null,null,null,null," - effective until "]
[null,null,null,null," - effective until "]
[null,null,null,null," - effective until "]
[null,null,null,null," - effective until "]
[null,null,null,null," - effective until "]
[null,null,null,null," - effective until "]
[null,null,null,null," - effective until "]
[null,null,null,null," - effective until "]
[null,null,null,null," - effective until "]

{"sheet":"20. Final Tariff Schedule","index":25,"n_rows":503,"n_cols":4,"rows_kept":503,"cut":false,"hidden":false,"merged":[[481,1,481,3],[422,1,422,3],[424,1,424,3],[426,1,426,3],[428,1,428,3],[470,0,470,1],[498,1,498,3],[443,1,443,3],[473,1,473,3],[475,1,475,3],[477,1,477,3],[479,1,479,3],[430,1,430,3],[439,1,439,3],[441,1,441,3],[445,1,445,3],[487,1,487,3],[490,1,490,3],[491,1,491,3],[492,1,492,3],[373,1,373,3],[374,1,374,3],[376,1,376,3],[378,1,378,3],[417,1,417,3],[402,1,402,3],[404,1,404,3],[406,1,406,3],[408,1,408,3],[410,1,410,3],[412,1,412,3],[414,1,414,3],[116,1,116,3],[207,1,207,3],[119,1,119,3],[173,1,173,3],[155,1,155,3],[157,1,157,3],[159,1,159,3],[161,1,161,3],[163,1,163,3],[165,1,165,3],[166,1,166,3],[167,1,167,3],[168,1,168,3],[169,1,169,3],[170,1,170,3],[171,1,171,3],[107,1,107,3],[109,1,109,3],[111,1,111,3],[113,1,113,3],[115,1,115,3],[19,1,19,3],[23,1,23,3],[59,1,59,3],[61,1,61,3],[63,1,63,3],[67,1,67,3],[69,1,69,3],[71,1,71,3],[29,1,29,3],[31,1,31,3],[25,1,25,3],[72,1,72,3],[65,1,65,3],[17,1,17,3],[18,1,18,3],[103,1,103,3],[105,1,105,3],[1,1,8,3],[10,1,10,2],[11,1,11,2],[12,1,12,2],[13,1,13,2],[15,1,15,2],[16,1,16,2],[21,1,21,3],[27,1,27,3],[420,1,420,3],[219,1,219,3],[220,1,220,3],[249,1,249,3],[251,1,251,3],[253,1,253,3],[255,1,255,3],[257,1,257,3],[259,1,259,3],[289,1,289,3],[222,1,222,3],[248,1,248,3],[301,1,301,3],[331,1,331,3],[260,1,260,3],[288,1,288,3],[293,1,293,3],[295,1,295,3],[297,1,297,3],[299,1,299,3],[332,1,332,3],[334,1,334,3],[336,1,336,3],[338,1,338,3],[291,1,291,3],[208,1,208,3],[210,1,210,3],[212,1,212,3],[214,1,214,3],[216,1,216,3],[218,1,218,3],[342,1,342,3],[418,1,418,3],[340,1,340,3],[349,1,349,3],[351,1,351,3],[353,1,353,3],[355,1,355,3],[357,1,357,3],[343,1,343,3],[346,1,346,3],[347,1,347,3],[380,1,380,3],[382,1,382,3],[384,1,384,3],[386,1,386,3],[401,1,401,3],[359,1,359,3]]}
["Back to Index"]
[null,{"$f":"+'1. Information Sheet'!B2","v":"INCENTIVE REGULATION MODEL FOR 2019 FILERS"}]
[]
[]
[]
[]
[]
[]
[]
[]
[null,{"$f":"'Model Specs'!C4","v":"Alectra - Enersource"}]
[null,"TARIFF OF RATES AND CHARGES"]
[null,"Effective Date January 1, 2019"]
[null,"Implementation Date January 1, 2019"]
[]
[null,"This schedule supersedes and replaces all previously "]
[null,"approved schedules of Rates, Charges and Loss Factors"]
[null,"EB-2018-0016"]
[null,"RESIDENTIAL SERVICE CLASSIFICATION"]
[null,"This classification applies to an account where the electricity is supplied exclusively to single-family dwelling units for domestic or household purposes, including seasonal occupancy. This includes, but is not limited to, detached houses, one unit of a semi-detached, duplex, triplex or quadruplex house, with a residential zoning. Separately metered dwellings within a town house complex also qualify as residential customers. Further servicing details are available in the distributor’s Conditions of Service."]
[]
[null,"APPLICATION"]
[]
[null,"The application of these rates and charges shall be in accordance with the Licence of the Distributor and any Code or Order of the Ontario Energy Board, and amendments thereto as approved by the Ontario Energy Board, which may be applicable to the administration of this schedule."]
[]
[null,"No rates and charges for the distribution of electricity and charges to meet the costs of any work or service done or furnished for the purpose of the distribution of electricity shall be made except as permitted by this schedule, unless required by the Distributor’s Licence or a Code or Order of the Ontario Energy Ontario Energy Board, and amendments thereto as approved by the Ontario Energy Board, or as specified herein."]
[]
[null,"Unless specifically noted, this schedule does not contain any charges for the electricity commodity, be it under the Regulated Price Plan, a contract with a retailer or the wholesale market price, as applicable. In addition, the charges in the MONTHLY RATES AND CHARGES - Regulatory Component of this schedule do not apply to a customer that is an embedded wholesale market participant."]
[]
[null,"It should be noted that this schedule does not list any charges, assessments, or credits that are required by law to be invoiced by a distributor and that are not subject to Ontario Energy Board approval, such as the Debt Retirement Charge, the Global Adjustment and the HST."]
[]
[null,"MONTHLY RATES AND CHARGES - Delivery Component"]
[]
["R_F",{"$f":"RATES!C15","v":"Service Charge"},{"$f":"RATES!G15","v":"$"},{"$f":"RATES!I15","v":24.18}]
[null,{"$f":"RATES!C18","v":"Smart Metering Entity Charge - effective until December 31, 2022"},{"$f":"RATES!G18","v":"$"},{"$f":"RATES!I18","v":0.56999999999999995}]
["R_GA16",{"$f":"RATES!C19","v":"Rate Rider for Recovery of Incremental Capital Module (2017) - in effect until the effective date of the next cost of service based rate order"},{"$f":"RATES!G19","v":"$"},{"$f":"RATES!I19","v":0.6}]
[null,{"$f":"+RATES!C30","v":"Rate Rider for Recovery of Incremental Capital Module (2018) - in effect until the effective date of the next cost of service based rate order"},{"$f":"+RATES!G30","v":"$"},{"$f":"+RATES!I30","v":0.16}]
[null,{"$f":"RATES!C27","v":"Rate Rider for Recovery of Incremental Capital Module (2019) - in effect until the effective date of the next cost of service based rate order"},{"$f":"RATES!G27","v":"$"},{"$f":"RATES!I27","v":0.16}]
[null,{"$f":"+RATES!C28","v":"Rate Rider for Disposition of Capitalization Policy Rate Rider (2019) - effective until December 31, 2019"},{"$f":"+RATES!G28","v":"$"},{"$f":"+ROUND(RATES!I28,2)","v":-0.23}]
["R_V",{"$f":"RATES!C17","v":"Low Voltage Service Rate "},{"$f":"RATES!G17","v":"$/kWh"},{"$f":"RATES!I17","v":2.0000000000000001E-4}]
[null,{"$f":"RATES!C20","v":"Rate Rider for Disposition of Global Adjustment Account (2018) - effective until  April 30, 2019\n        Applicable only for Non-RPP Customers"},{"$f":"RATES!G20","v":"$/kWh"},{"$f":"RATES!I20","v":-5.0000000000000001E-4}]
[null,{"$f":"RATES!C23","v":"Rate Rider for Disposition of Global Adjustment Account (2019) - effective until  December 31, 2019\n        Applicable only for Non-RPP Customers"},{"$f":"RATES!G23","v":"$/kWh"},{"$f":"RATES!I23","v":1.6999999999999999E-3}]
[null,{"$f":"RATES!C21","v":"Rate Rider for Disposition of Deferral/Variance Accounts (2018) - effective until April 30, 2019"},{"$f":"RATES!G21","v":"$/kWh"},{"$f":"RATES!I21","v":-6.9999999999999999E-4}]
[null,{"$f":"RATES!C24","v":"Rate Rider for Disposition of Deferral/Variance Accounts (2019) - effective until December 31, 2019"},{"$f":"RATES!G24","v":"$/kWh"},{"$f":"RATES!I24","v":-4.0000000000000002E-4}]
[null,{"$f":"RATES!C22","v":"Rate Rider for Disposition of Capacity Based Recovery Account (2018) - effective until April 30, 2019\n        Applicable Only for Class B Customers"},{"$f":"RATES!G22","v":"$/kWh"},{"$f":"RATES!I22","v":-5.0000000000000002E-5}]
[null,{"$f":"RATES!C25","v":"Rate Rider for Disposition of Capacity Based Recovery Account (2019) - effective until December 31, 2019\n        Applicable Only for Class B Customers"},{"$f":"RATES!G25","v":"$/kWh"},{"$f":"RATES!I25","v":1.0000000000000001E-5}]
[null,{"$f":"RATES!C29","v":"Rate Rider for Disposition of Lost Revenue Adjustment Mechanism Variance Account (LRAMVA) (2018) - effective until April 30, 2019"},{"$f":"RATES!G29","v":"$/kWh"},{"$f":"RATES!I29","v":-2.0000000000000001E-4}]
[null,{"$f":"RATES!C26","v":"Rate Rider for Disposition of Lost Revenue Adjustment Mechanism Variance Account (LRAMVA) (2019) - effective until December 31, 2019"},{"$f":"RATES!G26","v":"$/kWh"},{"$f":"RATES!I26","v":2.0000000000000001E-4}]
[]
[null,"Retail Transmission Rate – Network Service Rate","$/kWh",{"$f":"'16. RTSR-Rates to Forecast'!K43","v":7.6060321219542735E-3}]
[null,"Retail Transmission Rate – Line and Transformation Connection Service Rate","$/kWh",{"$f":"'16. RTSR-Rates to Forecast'!K56","v":7.2020759393073971E-3}]
[]
[]
[null,"MONTHLY RATES AND CHARGES - Regulatory Component"]
[]
[null,"Wholesale Market Service Rate (WMS) - Not including CBR","$/kWh",3.2000000000000002E-3]
[null,"Capacity Based Recovery (CBR) - Applicable for Class B Customers","$/kWh",4.0000000000000002E-4]
[null,"Rural or Remote Electricity Rate Protection Charge (RRRP)","$/kWh",2.9999999999999997E-4]
[null,"Standard Supply Service - Administrative Charge (if applicable)","$",0.25]
[null,"GENERAL SERVICE LESS THAN 50 KW SERVICE CLASSIFICATION"]
[]
[null,"This classification refers to a non-residential account whose monthly average peak demand is less than, or is forecast to be less than, 50 kW.  Class B consumers are defined in accordance with O. Reg. 429/04.  Further servicing details are available in the distributor’s Conditions of Service."]
[]
[null,"APPLICATION"]
[]
[null,"The application of these rates and charges shall be in accordance with the Licence of the Distributor and any Code or Order of the Ontario Energy Board, and amendments thereto as approved by the Ontario Energy Board, which may be applicable to the administration of this schedule."]
[]
[null,"No rates and charges for the distribution of electricity and charges to meet the costs of any work or service done or furnished for the purpose of the distribution of electricity shall be made except as permitted by this schedule, unless required by the Distributor’s Licence or a Code or Order of the Ontario Energy Board, and amendments thereto as approved by the Ontario Energy Board, or as specified herein."]
[]
[null,"Unless specifically noted, this schedule does not contain any charges for the electricity commodity, be it under the Regulated Price Plan, a contract with a retailer or the wholesale market price, as applicable. In addition, the charges in the MONTHLY RATES AND CHARGES - Regulatory Component of this schedule do not apply to a customer that is an embedded wholesale market participant."]
[]
[null,"It should be noted that this schedule does not list any charges, assessments, or credits that are required by law to be invoiced by a distributor and that are not subject to Ontario Energy Board approval, such as the Debt Retirement Charge, the Global Adjustment and the HST."]
[null,"MONTHLY RATES AND CHARGES - Delivery Component"]
[]
["GSL_F",{"$f":"RATES!C42","v":"Service Charge"},{"$f":"RATES!G42","v":"$"},{"$f":"RATES!I42","v":44.39}]
[null,{"$f":"RATES!C45","v":"Smart Metering Entity Charge - effective until December 31, 2022"},{"$f":"RATES!G45","v":"$"},{"$f":"RATES!I45","v":0.56999999999999995}]
["GSL_GA16",{"$f":"RATES!C46","v":"Rate Rider for Recovery of Incremental Capital Module (2017) - in effect until the effective date of the next cost of service based rate order"},{"$f":"RATES!G46","v":"$"},{"$f":"RATES!I46","v":1.1000000000000001}]
["GSL_GA16",{"$f":"RATES!C61","v":"Rate Rider for Recovery of Incremental Capital Module (2018) - in effect until the effective date of the next cost of service based rate order"},{"$f":"RATES!G61","v":"$"},{"$f":"RATES!I61","v":0.28999999999999998}]
[null,{"$f":"RATES!C56","v":"Rate Rider for Recovery of Incremental Capital Module (2019) - in effect until the effective date of the next cost of service based rate order"},{"$f":"RATES!G56","v":"$"},{"$f":"RATES!I56","v":0.3}]
[null,{"$f":"+RATES!C58","v":"Rate Rider for Disposition of Capitalization Policy Rate Rider (2019) - effective until December 31, 2019"},{"$f":"+RATES!G58","v":"$"},{"$f":"+RATES!I58","v":-0.42}]
[null,{"$f":"RATES!C43","v":"Distribution Volumetric Rate"},{"$f":"RATES!G43","v":"$/kWh"},{"$f":"RATES!I43","v":1.29E-2}]
["GSL_V",{"$f":"RATES!C44","v":"Low Voltage Service Rate "},{"$f":"RATES!G44","v":"$/kWh"},{"$f":"RATES!I44","v":2.0000000000000001E-4}]
["GSL_GA16",{"$f":"RATES!C47","v":"Rate Rider for Disposition of Global Adjustment Account (2018) - effective until  April 30, 2019\n        Applicable only for Non-RPP Customers"},{"$f":"RATES!G47","v":"$/kWh"},{"$f":"RATES!I47","v":-5.0000000000000001E-4}]
[null,{"$f":"RATES!C52","v":"Rate Rider for Disposition of Global Adjustment Account (2019) - effective until  December 31, 2019\n        Applicable only for Non-RPP Customers"},{"$f":"RATES!G52","v":"$/kWh"},{"$f":"RATES!I52","v":1.6999999999999999E-3}]
["GSL_TN",{"$f":"RATES!C48","v":"Rate Rider for Disposition of Deferral/Variance Accounts (2018) - effective until April 30, 2019"},{"$f":"RATES!G48","v":"$/kWh"},{"$f":"RATES!I48","v":-6.9999999999999999E-4}]
["GSL_TN",{"$f":"RATES!C53","v":"Rate Rider for Disposition of Deferral/Variance Accounts (2019) - effective until December 31, 2019"},{"$f":"RATES!G53","v":"$/kWh"},{"$f":"RATES!I53","v":-4.0000000000000002E-4}]
[null,{"$f":"RATES!C50","v":"Rate Rider for Disposition of Capacity Based Recovery Account (2018) - effective until April 30, 2019\n        Applicable Only for Class B Customers"},{"$f":"RATES!G50","v":"$/kWh"},{"$f":"RATES!I50","v":-5.0000000000000002E-5}]
[null,{"$f":"RATES!C54","v":"Rate Rider for Disposition of Capacity Based Recovery Account (2019) - effective until December 31, 2019\n        Applicable Only for Class B Customers"},{"$f":"RATES!G54","v":"$/kWh"},{"$f":"RATES!I54","v":1.0000000000000001E-5}]
["GSL_TN",{"$f":"RATES!C51","v":"Rate Rider for Disposition of Lost Revenue Adjustment Mechanism Variance Account (LRAMVA) (2018) - effective until April 30, 2019"},{"$f":"RATES!G51","v":"$/kWh"},{"$f":"RATES!I51","v":5.9999999999999995E-4}]
[null,{"$f":"RATES!C55","v":"Rate Rider for Disposition of Lost Revenue Adjustment Mechanism Variance Account (LRAMVA) (2019) - effective until December 31, 2019"},{"$f":"RATES!G55","v":"$/kWh"},{"$f":"RATES!I55","v":2.0000000000000001E-4}]
["GSL_1576",{"$f":"RATES!C49","v":"Rate Rider for Recovery of Incremental Capital Module (2017) - in effect until the effective date of the next cost of service based rate order"},{"$f":"RATES!G49","v":"$/kWh"},{"$f":"RATES!I49","v":2.9999999999999997E-4}]
["GSL_1576",{"$f":"RATES!C60","v":"Rate Rider for Recovery of Incremental Capital Module (2018) - in effect until the effective date of the next cost of service based rate order"},{"$f":"RATES!G60","v":"$/kWh"},{"$f":"RATES!I60","v":1E-4}]
[null,{"$f":"RATES!C57","v":"Rate Rider for Recovery of Incremental Capital Module (2019) - in effect until the effective date of the next cost of service based rate order"},{"$f":"RATES!G57","v":"$/kWh"},{"$f":"RATES!I57","v":1E-4}]
[null,{"$f":"+RATES!C59","v":"Rate Rider for Disposition of Capitalization Policy Rate Rider (2019) - effective until December 31, 2019"},{"$f":"+RATES!G59","v":"$/kWh"},{"$f":"+RATES!I59","v":-1E-4}]
["GSL_TC","Retail Transmission Rate – Network Service Rate","$/kWh",{"$f":"RATES!I71","v":7.1000000000000004E-3}]
[null,"Retail Transmission Rate – Line and Transformation Connection Service Rate","$/kWh",{"$f":"RATES!I72","v":6.4999999999999997E-3}]
[]
[null,"MONTHLY RATES AND CHARGES - Regulatory Component"]
[]
[null,"Wholesale Market Service Rate (WMS) - Not including CBR","$/kWh",3.2000000000000002E-3]
[null,"Capacity Based Recovery (CBR) - Applicable for Class B Customers","$/kWh",4.0000000000000002E-4]
[null,"Rural or Remote Electricity Rate Protection Charge (RRRP)","$/kWh",2.9999999999999997E-4]
[null,"Standard Supply Service - Administrative Charge (if applicable)","$",0.25]
[null,"GENERAL SERVICE 50 TO 499 KW SERVICE CLASSIFICATION"]
[]
[null,"This classification refers to a non-residential account whose monthly average peak demand is equal to or greater than, or is forecast to be equal to or greater than, 50 kW but less than 500 kW.  Class B consumers are defined in accordance with O. Reg. 429/04.  Further servicing details are available in the distributor’s Conditions of Service."]
[]
[null,"APPLICATION"]
[]
[null,"The application of these rates and charges shall be in accordance with the Licence of the Distributor and any Code or Order of the Ontario Energy Board, and amendments thereto as approved by the Ontario Energy Board, which may be applicable to the administration of this schedule."]
[]
[null,"No rates and charges for the distribution of electricity and charges to meet the costs of any work or service done or furnished for the purpose of the distribution of electricity shall be made except as permitted by this schedule, unless required by the Distributor’s Licence or a Code or Order of the Ontario Energy Board, and amendments thereto as approved by the Ontario Energy Board, or as specified herein."]
[]
[null,"Unless specifically noted, this schedule does not contain any charges for the electricity commodity, be it under the Regulated Price Plan, a contract with a retailer or the wholesale market price, as applicable. In addition, the charges in the MONTHLY RATES AND CHARGES - Regulatory Component of this schedule do not apply to a customer that is an embedded wholesale market participant."]
[]
[null,"It should be noted that this schedule does not list any charges, assessments, or credits that are required by law to be invoiced by a distributor and that are not subject to Ontario Energy Board approval, such as the Debt Retirement Charge, the Global Adjustment and the HST."]
[]
[null,"Billing demands are established at the greater of 100% of the kW, or 90% of the kVA amounts."]
[]
[null,"MONTHLY RATES AND CHARGES - Delivery Component"]
[]
[null,{"$f":"RATES!C74","v":"Service Charge"},{"$f":"RATES!G74","v":"$"},{"$f":"RATES!I74","v":78.180000000000007}]
["GS50_699_F",{"$f":"RATES!C78","v":"Rate Rider for Recovery of Incremental Capital Module (2017) - in effect until the effective date of the next cost of service based rate order"},{"$f":"RATES!G78","v":"$"},{"$f":"RATES!I78","v":1.93}]
["GS50_699_F",{"$f":"RATES!C93","v":"Rate Rider for Recovery of Incremental Capital Module (2018) - in effect until the effective date of the next cost of service based rate order"},{"$f":"RATES!G93","v":"$"},{"$f":"RATES!I93","v":0.51}]
[null,{"$f":"RATES!C89","v":"Rate Rider for Recovery of Incremental Capital Module (2019) - in effect until the effective date of the next cost of service based rate order"},{"$f":"RATES!G89","v":"$"},{"$f":"RATES!I89","v":0.53}]
[null,{"$f":"+RATES!C91","v":"Rate Rider for Disposition of Capitalization Policy Rate Rider (2019) - effective until December 31, 2019"},{"$f":"+RATES!G91","v":"$"},{"$f":"+RATES!I91","v":-0.74}]
[null,{"$f":"RATES!C75","v":"Distribution Volumetric Rate"},{"$f":"RATES!G75","v":"$/kW"},{"$f":"RATES!I75","v":4.7049000000000003}]
[null,{"$f":"RATES!C76","v":"Low Voltage Service Rate "},{"$f":"RATES!G76","v":"$/kW"},{"$f":"RATES!I76","v":8.0199999999999994E-2}]
["GS50_699_1576",{"$f":"RATES!C79","v":"Rate Rider for Disposition of Global Adjustment Account (2018) - effective until  April 30, 2019\n        Applicable only for Non-RPP Customers"},{"$f":"RATES!G79","v":"$/kWh"},{"$f":"RATES!I79","v":-5.0000000000000001E-4}]
["GS50_699_1576",{"$f":"RATES!C84","v":"Rate Rider for Disposition of Global Adjustment Account (2019) - effective until  December 31, 2019\n        Applicable only for Non-RPP Customers"},{"$f":"RATES!G84","v":"$/kWh"},{"$f":"RATES!I84","v":1.6999999999999999E-3}]
["GS50_699_1576",{"$f":"RATES!C80","v":"Rate Rider for Disposition of Deferral/Variance Accounts (2018) - effective until April 30, 2019"},{"$f":"RATES!G80","v":"$/kW"},{"$f":"RATES!I80","v":0.10050000000000001}]
[null,{"$f":"RATES!C86","v":"Rate Rider for Disposition of Deferral/Variance Accounts (2019) - effective until December 31, 2019"},{"$f":"RATES!G86","v":"$/kW"},{"$f":"RATES!I86","v":0.21879999999999999}]
["GS50_699_1576",{"$f":"RATES!C81","v":"Rate Rider for Disposition of Deferral/Variance Accounts (2018) - effective until April 30, 2019\n         Applicable only for Non-Wholesale Market Participants"},{"$f":"RATES!G81","v":"$/kW"},{"$f":"RATES!I81","v":-0.3538}]
[null,{"$f":"RATES!C85","v":"Rate Rider for Disposition of Deferral/Variance Accounts (2019) - effective until December 31, 2019\n         Applicable only for Non-Wholesale Market Participants"},{"$f":"RATES!G85","v":"$/kW"},{"$f":"RATES!I85","v":-0.34839999999999999}]
["GS50_699_1576",{"$f":"RATES!C83","v":"Rate Rider for Disposition of Capacity Based Recovery Account (2018) - effective until April 30, 2019\n        Applicable Only for Non-WMP Class B Customers"},{"$f":"RATES!G83","v":"$/kW"},{"$f":"RATES!I83","v":-1.6060000000000001E-2}]
[null,{"$f":"RATES!C87","v":"Rate Rider for Disposition of Capacity Based Recovery Account (2019) - effective until December 31, 2019\n        Applicable Only for Non-WMP Class  B Customers"},{"$f":"RATES!G87","v":"$/kW"},{"$f":"RATES!I87","v":2.3700000000000001E-3}]
[null,{"$f":"RATES!C94","v":"Rate Rider for Disposition of Lost Revenue Adjustment Mechanism Variance Account (LRAMVA) (2018) - effective until April 30, 2019"},{"$f":"RATES!G94","v":"$/kW"},{"$f":"RATES!I94","v":0.45850000000000002}]
[null,{"$f":"RATES!C88","v":"Rate Rider for Disposition of Lost Revenue Adjustment Mechanism Variance Account (LRAMVA) (2019) - effective until December 31, 2019"},{"$f":"RATES!G88","v":"$/kW"},{"$f":"RATES!I88","v":0.1951}]
["GS50_699_DVA16",{"$f":"RATES!C82","v":"Rate Rider for Recovery of Incremental Capital Module (2017) - in effect until the effective date of the next cost of service based rate order"},{"$f":"RATES!G82","v":"$/kW"},{"$f":"RATES!I82","v":0.1163}]
["GS50_699_DVA16",{"$f":"RATES!C95","v":"Rate Rider for Recovery of Incremental Capital Module (2018) - in effect until the effective date of the next cost of service based rate order"},{"$f":"RATES!G95","v":"$/kW"},{"$f":"RATES!I95","v":3.0800000000000001E-2}]
[null,{"$f":"RATES!C90","v":"Rate Rider for Recovery of Incremental Capital Module (2019) - in effect until the effective date of the next cost of service based rate order"},{"$f":"RATES!G90","v":"$/kW"},{"$f":"RATES!I90","v":3.1699999999999999E-2}]
[null,{"$f":"+RATES!C92","v":"Rate Rider for Disposition of Capitalization Policy Rate Rider (2019) - effective until December 31, 2019"},{"$f":"+RATES!G92","v":"$/kW"},{"$f":"+RATES!I92","v":-4.4699999999999997E-2}]
[]
["GS50_699_CBR16","Retail Transmission Rate – Network Service Rate","$/kW",{"$f":"RATES!I102","v":2.7452999999999999}]
["GS50_699_TN","Retail Transmission Rate – Line and Transformation Connection Service Rate","$/kW",{"$f":"RATES!I103","v":2.5771000000000002}]
["GS50_699_TC"]
[]
[null,"MONTHLY RATES AND CHARGES - Regulatory Component"]
[]
[null,"Wholesale Market Service Rate (WMS) - Not including CBR","$/kWh",3.2000000000000002E-3]
[null,"Capacity Based Recovery (CBR) - Applicable for Class B Customers","$/kWh",4.0000000000000002E-4]
[null,"Rural or Remote Electricity Rate Protection Charge (RRRP)","$/kWh",2.9999999999999997E-4]
[null,"Standard Supply Service - Administrative Charge (if applicable)","$",0.25]
[null,"GENERAL SERVICE 500 TO 4,999 KW SERVICE CLASSIFICATION"]
[]
[null,"This classification refers to a non-residential account whose monthly average peak demand is equal to or greater than, or is forecast to be equal to or greater than, 500 kW but less than 5,000 kW.  Class A and Class B consumers are defined in accordance with O. Reg. 429/04.  Further servicing details are available in the distributor’s Conditions of Service."]
[]
[null,"APPLICATION"]
[]
[null,"The application of these rates and charges shall be in accordance with the Licence of the Distributor and any Code or Order of the Ontario Energy Board, and amendments thereto as approved by the Ontario Energy Board, which may be applicable to the administration of this schedule."]
[]
[null,"No rates and charges for the distribution of electricity and charges to meet the costs of any work or service done or furnished for the purpose of the distribution of electricity shall be made except as permitted by this schedule, unless required by the Distributor’s Licence or a Code or Order of the Ontario Energy Board, and amendments thereto as approved by the Ontario Energy Board, or as specified herein."]
[]
[null,"Unless specifically noted, this schedule does not contain any charges for the electricity commodity, be it under the Regulated Price Plan, a contract with a retailer or the wholesale market price, as applicable. In addition, the charges in the MONTHLY RATES AND CHARGES - Regulatory Component of this schedule do not apply to a customer that is an embedded wholesale market participant."]
[]
[null,"The rate rider for the disposition of WMS – Sub-account CBR Class B is not applicable to wholesale market participants (WMP), customers that transitioned between Class A and Class B during the variance account accumulation period, or to customers that were in Class A for the entire period. Customers who transitioned are to be charged or refunded their share of the variance disposed through customer specific billing adjustments. This rate rider is to be consistently applied for the entire period to the sunset date of the rate rider. In addition, this rate rider is applicable to all new Class B customers.\n\n\n"]
[]
[null,"The rate rider for the disposition of Global Adjustment is only applicable to non-RPP Class B customers.  It is not applicable to WMP customers that transitioned between Class A and Class B during the variance account accumulation period, or to customers that were in Class A for the entire period.  Customers who transitioned are to be charged or refunded their share of the variance disposed through customer specific billing adjustments.  This rate order is applicable to all new non-RPP Class B customers. "]
[]
[null,"It should be noted that this schedule does not list any charges, assessments, or credits that are required by law to be invoiced by a distributor and that are not subject to Ontario Energy Board approval, such as the Debt Retirement Charge, the Global Adjustment and the HST."]
[]
[null,"Billing demands are established at the greater of 100% of the kW, or 90% of the kVA amounts."]
[]
[null,"MONTHLY RATES AND CHARGES - Delivery Component"]
[]
["GS700_F",{"$f":"RATES!C105","v":"Service Charge"},{"$f":"RATES!G105","v":"$"},{"$f":"RATES!I105","v":1780.3}]
["GS700_LRVA16",{"$f":"RATES!C109","v":"Rate Rider for Recovery of Incremental Capital Module (2017) - in effect until the effective date of the next cost of service based rate order"},{"$f":"RATES!G109","v":"$"},{"$f":"RATES!I109","v":44}]
["GS700_LRVA16",{"$f":"RATES!C124","v":"Rate Rider for Recovery of Incremental Capital Module (2018) - in effect until the effective date of the next cost of service based rate order"},{"$f":"RATES!G124","v":"$"},{"$f":"RATES!I124","v":11.65}]
[null,{"$f":"RATES!C120","v":"Rate Rider for Recovery of Incremental Capital Module (2019) - in effect until the effective date of the next cost of service based rate order"},{"$f":"RATES!G120","v":"$"},{"$f":"RATES!I120","v":11.99}]
[null,{"$f":"+RATES!C122","v":"Rate Rider for Disposition of Capitalization Policy Rate Rider (2019) - effective until December 31, 2019"},{"$f":"+RATES!G122","v":"$"},{"$f":"+RATES!I122","v":-16.899999999999999}]
["GS700_V",{"$f":"RATES!C106","v":"Distribution Volumetric Rate"},{"$f":"RATES!G106","v":"$/kW"},{"$f":"RATES!I106","v":2.4209999999999998}]
[null,{"$f":"RATES!C107","v":"Low Voltage Service Rate "},{"$f":"RATES!G107","v":"$/kW"},{"$f":"RATES!I107","v":7.8399999999999997E-2}]
["GS700_CBR16_A",{"$f":"RATES!C110","v":"Rate Rider for Disposition of Global Adjustment Account (2018) - effective until  April 30, 2019\n        Applicable only for Non-RPP Customers"},{"$f":"RATES!G110","v":"$/kWh"},{"$f":"RATES!I110","v":-5.0000000000000001E-4}]
["GS700_CBR16_A",{"$f":"RATES!C115","v":"Rate Rider for Disposition of Global Adjustment Account (2019) - effective until  December 31, 2019\n        Applicable only for Non-RPP Customers"},{"$f":"RATES!G115","v":"$/kWh"},{"$f":"RATES!I115","v":1.6999999999999999E-3}]
[null,{"$f":"RATES!C111","v":"Rate Rider for Disposition of Deferral/Variance Accounts (2018) - effective until April 30, 2019"},{"$f":"RATES!G111","v":"$/kW"},{"$f":"RATES!I111","v":0.12720000000000001}]
[null,{"$f":"RATES!C117","v":"Rate Rider for Disposition of Deferral/Variance Accounts (2019) - effective until December 31, 2019"},{"$f":"RATES!G117","v":"$/kW"},{"$f":"RATES!I117","v":0.27600000000000002}]
[null,{"$f":"RATES!C112","v":"Rate Rider for Disposition of Deferral/Variance Accounts (2018) - effective until April 30, 2019\n         Applicable only for Non-Wholesale Market Participants"},{"$f":"RATES!G112","v":"$/kW"},{"$f":"RATES!I112","v":-0.44650000000000001}]
[null,{"$f":"RATES!C116","v":"Rate Rider for Disposition of Deferral/Variance Accounts (2019) - effective until December 31, 2019\n          Applicable only for Non-Wholesale Market Participants"},{"$f":"RATES!G116","v":"$/kW"},{"$f":"RATES!I116","v":-0.43880000000000002}]
[null,{"$f":"RATES!C114","v":"Rate Rider for Disposition of Capacity Based Recovery Account (2018) - effective until April 30, 2019\n        Applicable Only for Non-WMP Class B Customers"},{"$f":"RATES!G114","v":"$/kW"},{"$f":"RATES!I114","v":-1.9990000000000001E-2}]
[null,{"$f":"RATES!C118","v":"Rate Rider for Disposition of Capacity Based Recovery Account (2019) - effective until December 31, 2019\n        Applicable Only for Non-WMP Class  B Customers"},{"$f":"RATES!G118","v":"$/kW"},{"$f":"RATES!I118","v":2.7799999999999999E-3}]
[null,{"$f":"RATES!C125","v":"Rate Rider for Disposition of Lost Revenue Adjustment Mechanism Variance Account (LRAMVA) (2018) - effective until April 30, 2019"},{"$f":"RATES!G125","v":"$/kW"},{"$f":"RATES!I125","v":0.14099999999999999}]
[null,{"$f":"RATES!C119","v":"Rate Rider for Disposition of Lost Revenue Adjustment Mechanism Variance Account (LRAMVA) (2019) - effective until December 31, 2019"},{"$f":"RATES!G119","v":"$/kW"},{"$f":"RATES!I119","v":7.5200000000000003E-2}]
["GS700_CBR16",{"$f":"RATES!C113","v":"Rate Rider for Recovery of Incremental Capital Module (2017) - in effect until the effective date of the next cost of service based rate order"},{"$f":"RATES!G113","v":"$/kW"},{"$f":"RATES!I113","v":5.9799999999999999E-2}]
["GS700_CBR16",{"$f":"RATES!C126","v":"Rate Rider for Recovery of Incremental Capital Module (2018) - in effect until the effective date of the next cost of service based rate order"},{"$f":"RATES!G126","v":"$/kW"},{"$f":"RATES!I126","v":1.5800000000000002E-2}]
[null,{"$f":"RATES!C121","v":"Rate Rider for Recovery of Incremental Capital Module (2019) - in effect until the effective date of the next cost of service based rate order"},{"$f":"RATES!G121","v":"$/kW"},{"$f":"RATES!I121","v":1.6299999999999999E-2}]
[null,{"$f":"+RATES!C123","v":"Rate Rider for Disposition of Capitalization Policy Rate Rider (2019) - effective until December 31, 2019"},{"$f":"+RATES!G123","v":"$/kW"},{"$f":"+RATES!I123","v":-2.3E-2}]
[]
[]
["GS700_TN","Retail Transmission Rate – Network Service Rate ","$/kW",{"$f":"RATES!I133","v":2.6560000000000001}]
["GS700_TC","Retail Transmission Rate – Line and Transformation Connection Service Rate ","$/kW",{"$f":"RATES!I134","v":2.5217999999999998}]
[]
[null,"MONTHLY RATES AND CHARGES - Regulatory Component"]
[]
[null,"Wholesale Market Service Rate (WMS) - Not including CBR","$/kWh",3.2000000000000002E-3]
[null,"Capacity Based Recovery (CBR) - Applicable for Class B Customers","$/kWh",4.0000000000000002E-4]
[null,"Rural or Remote Electricity Rate Protection Charge (RRRP)","$/kWh",2.9999999999999997E-4]
[null,"Standard Supply Service - Administrative Charge (if applicable)","$",0.25]
[null,"LARGE USE SERVICE CLASSIFICATION"]
[null,"This classification refers to an account whose monthly average peak demand is equal to or greater than, or is forecast to be equal to or greater than, 5,000 kW.  Class A and Class B consumers are defined in accordance with O. Reg. 429/04.  Further servicing details are available in the distributor’s Conditions of Service."]
[]
[null,"APPLICATION"]
[]
[null,"The application of these rates and charges shall be in accordance with the Licence of the Distributor and any Code or Order of the Ontario Energy Board, and amendments thereto as approved by the Ontario Energy Board, which may be applicable to the administration of this schedule."]
[]
[null,"No rates and charges for the distribution of electricity and charges to meet the costs of any work or service done or furnished for the purpose of the distribution of electricity shall be made except as permitted by this schedule, unless required by the Distributor’s Licence or a Code or Order of the Ontario Energy Board, and amendments thereto as approved by the Ontario Energy Board, or as specified herein."]
[]
[null,"Unless specifically noted, this schedule does not contain any charges for the electricity commodity, be it under the Regulated Price Plan, a contract with a retailer or the wholesale market price, as applicable. In addition, the charges in the MONTHLY RATES AND CHARGES - Regulatory Component of this schedule do not apply to a customer that is an embedded wholesale market participant."]
[]
[null,"It should be noted that this schedule does not list any charges, assessments, or credits that are required by law to be invoiced by a distributor and that are not subject to Ontario Energy Board approval, such as the Debt Retirement Charge, the Global Adjustment and the HST."]
[]
[null,"Billing demands are established at the greater of 100% of the kW, or 90% of the kVA amounts."]
[]
[null,"MONTHLY RATES AND CHARGES - Delivery Component"]
[]
["LU_F",{"$f":"RATES!C136","v":"Service Charge"},{"$f":"RATES!G136","v":"$"},{"$f":"RATES!I136","v":14036.94}]
["LU_DVA16",{"$f":"RATES!C140","v":"Rate Rider for Recovery of Incremental Capital Module (2017) - in effect until the effective date of the next cost of service based rate order"},{"$f":"RATES!G140","v":"$"},{"$f":"RATES!I140","v":346.9}]
["LU_DVA16",{"$f":"RATES!C155","v":"Rate Rider for Recovery of Incremental Capital Module (2018) - in effect until the effective date of the next cost of service based rate order"},{"$f":"RATES!G155","v":"$"},{"$f":"RATES!I155","v":91.89}]
[null,{"$f":"RATES!C149","v":"Rate Rider for Recovery of Incremental Capital Module (2019) - in effect until the effective date of the next cost of service based rate order"},{"$f":"RATES!G149","v":"$"},{"$f":"RATES!I149","v":94.56}]
[null,{"$f":"+RATES!C151","v":"Rate Rider for Disposition of Capitalization Policy Rate Rider (2019) - effective until December 31, 2019"},{"$f":"+RATES!G151","v":"$"},{"$f":"+RATES!I151","v":-133.24}]
["LU_V",{"$f":"RATES!C137","v":"Distribution Volumetric Rate"},{"$f":"RATES!G137","v":"$/kW"},{"$f":"RATES!I137","v":3.0049999999999999}]
[null,{"$f":"RATES!C138","v":"Low Voltage Service Rate "},{"$f":"RATES!G138","v":"$/kW"},{"$f":"RATES!I138","v":8.3799999999999999E-2}]
[null,{"$f":"RATES!C142","v":"Rate Rider for Disposition of Deferral/Variance Accounts (2018) - effective until April 30, 2019"},{"$f":"RATES!G142","v":"$/kW"},{"$f":"RATES!I142","v":-0.40539999999999998}]
[null,{"$f":"RATES!C146","v":"Rate Rider for Disposition of Deferral/Variance Accounts (2019) - effective until December 31, 2019"},{"$f":"RATES!G146","v":"$/kW"},{"$f":"RATES!I146","v":-0.21}]
[null,{"$f":"RATES!C153","v":"Rate Rider for Disposition of Lost Revenue Adjustment Mechanism Variance Account (LRAMVA) (2018) - effective until April 30, 2019"},{"$f":"RATES!G153","v":"$/kW"},{"$f":"RATES!I153","v":8.7999999999999995E-2}]
[null,{"$f":"RATES!C148","v":"Rate Rider for Disposition of Lost Revenue Adjustment Mechanism Variance Account (LRAMVA) (2019) - effective until December 31, 2019"},{"$f":"RATES!G148","v":"$/kW"},{"$f":"RATES!I148","v":6.4000000000000001E-2}]
[null,{"$f":"RATES!C143","v":"Rate Rider for Recovery of Incremental Capital Module (2017) - in effect until the effective date of the next cost of service based rate order"},{"$f":"RATES!G143","v":"$/kW"},{"$f":"RATES!I143","v":7.4300000000000005E-2}]
[null,{"$f":"RATES!C154","v":"Rate Rider for Recovery of Incremental Capital Module (2018) - in effect until the effective date of the next cost of service based rate order"},{"$f":"RATES!G154","v":"$/kW"},{"$f":"RATES!I154","v":1.9699999999999999E-2}]
[null,{"$f":"RATES!C150","v":"Rate Rider for Recovery of Incremental Capital Module (2019) - in effect until the effective date of the next cost of service based rate order"},{"$f":"RATES!G150","v":"$/kW"},{"$f":"RATES!I150","v":2.0199999999999999E-2}]
[null,{"$f":"+RATES!C152","v":"Rate Rider for Disposition of Capitalization Policy Rate Rider (2019) - effective until December 31, 2019"},{"$f":"+RATES!G152","v":"$/kW"},{"$f":"+RATES!I152","v":-2.8500000000000001E-2}]
["LU_TC",{"$f":"RATES!C162","v":"Retail Transmission Rate - Network Service Rate – Interval Metered"},{"$f":"RATES!G162","v":"$/kW"},{"$f":"RATES!I162","v":2.8342999999999998}]
[null,{"$f":"RATES!C163","v":"Retail Transmission Rate - Line and Transformation Connection Service Rate – Interval Metered "},{"$f":"RATES!G163","v":"$/kW"},{"$f":"RATES!I163","v":2.6934}]
[]
[null,"MONTHLY RATES AND CHARGES - Regulatory Component"]
[]
[null,"Wholesale Market Service Rate (WMS) - Not including CBR","$/kWh",3.2000000000000002E-3]
[null,"Capacity Based Recovery (CBR) - Applicable for Class B Customers","$/kWh",4.0000000000000002E-4]
[null,"Rural or Remote Electricity Rate Protection Charge (RRRP)","$/kWh",2.9999999999999997E-4]
[null,"Standard Supply Service - Administrative Charge (if applicable)","$",0.25]
[null,"UNMETERED SCATTERED LOAD SERVICE CLASSIFICATION"]
[null,"This classification applies to an account taking electricity at 750 volts or less whose average monthly maximum demand is less than, or is forecast to be less than, 50 kW and the consumption is unmetered. The amount of electricity consumed by unmetered connections will be based on detailed information/documentation provided by the device's manufacturer abd will be agreed to by Alectra Utilities and the customer and may be subject to periodic monitoring of actual consumption.  Eligible onmetered loads include cable TV power packs, bus  shelters, telephone booths, traffic lights, railway crossings, etc.   Class B consumers are defined in accordance with O. Reg. 429/04.  Further servicing details are available in the distributor’s Conditions of Service."]
[]
[null,"APPLICATION"]
[]
[null,"The application of these rates and charges shall be in accordance with the Licence of the Distributor and any Code or Order of the Ontario Energy Board, and amendments thereto as approved by the Ontario Energy Board, which may be applicable to the administration of this schedule."]
[]
[null,"No rates and charges for the distribution of electricity and charges to meet the costs of any work or service done or furnished for the purpose of the distribution of electricity shall be made except as permitted by this schedule, unless required by the Distributor’s Licence or a Code or Order of the Ontario Energy Board, and amendments thereto as approved by the Ontario Energy Board, or as specified herein."]
[]
[null,"Unless specifically noted, this schedule does not contain any charges for the electricity commodity, be it under the Regulated Price Plan, a contract with a retailer or the wholesale market price, as applicable. In addition, the charges in the MONTHLY RATES AND CHARGES - Regulatory Component of this schedule do not apply to a customer that is an embedded wholesale market participant."]
[]
[null,"It should be noted that this schedule does not list any charges, assessments, or credits that are required by law to be invoiced by a distributor and that are not subject to Ontario Energy Board approval, such as the Debt Retirement Charge, the Global Adjustment and the HST."]
[null,"MONTHLY RATES AND CHARGES - Delivery Component"]
[]
[null,"Service Charge (per connection)",{"$f":"RATES!G165","v":"$"},{"$f":"RATES!I165","v":9.16}]
["USL_V",{"$f":"RATES!C168","v":"Rate Rider for Recovery of Incremental Capital Module (2017) - in effect until the effective date of the next cost of service based rate order"},{"$f":"RATES!G168","v":"$"},{"$f":"RATES!I168","v":0.23}]
["USL_V",{"$f":"RATES!C182","v":"Rate Rider for Recovery of Incremental Capital Module (2018) - in effect until the effective date of the next cost of service based rate order"},{"$f":"RATES!G182","v":"$"},{"$f":"RATES!I182","v":0.06}]
[null,{"$f":"RATES!C177","v":"Rate Rider for Recovery of Incremental Capital Module (2019) - in effect until the effective date of the next cost of service based rate order"},{"$f":"RATES!G177","v":"$"},{"$f":"RATES!I177","v":0.06}]
[null,{"$f":"+RATES!C179","v":"Rate Rider for Disposition of Capitalization Policy Rate Rider (2019) - effective until December 31, 2019"},{"$f":"+RATES!G179","v":"$"},{"$f":"+RATES!I179","v":-0.09}]
["USL_F",{"$f":"RATES!C166","v":"Distribution Volumetric Rate"},{"$f":"RATES!G166","v":"$/kWh"},{"$f":"RATES!I166","v":1.66E-2}]
[null,{"$f":"RATES!C167","v":"Low Voltage Service Rate "},{"$f":"RATES!G167","v":"$/kWh"},{"$f":"RATES!I167","v":2.0000000000000001E-4}]
[null,{"$f":"RATES!C169","v":"Rate Rider for Disposition of Global Adjustment Account (2018) - effective until  April 30, 2019\n        Applicable only for Non-RPP Customers"},{"$f":"RATES!G169","v":"$/kWh"},{"$f":"RATES!I169","v":-5.0000000000000001E-4}]
[null,{"$f":"RATES!C173","v":"Rate Rider for Disposition of Global Adjustment Account (2019) - effective until  December 31, 2019\n        Applicable only for Non-RPP Customers"},{"$f":"RATES!G173","v":"$/kWh"},{"$f":"RATES!I173","v":1.6999999999999999E-3}]
[null,{"$f":"RATES!C170","v":"Rate Rider for Disposition of Deferral/Variance Accounts (2018) - effective until April 30, 2019"},{"$f":"RATES!G170","v":"$/kWh"},{"$f":"RATES!I170","v":-6.9999999999999999E-4}]
["USL_CBR16",{"$f":"RATES!C174","v":"Rate Rider for Disposition of Deferral/Variance Accounts (2019) - effective until December 31, 2019"},{"$f":"RATES!G174","v":"$/kWh"},{"$f":"RATES!I174","v":-4.0000000000000002E-4}]
[null,{"$f":"RATES!C172","v":"Rate Rider for Disposition of Capacity Based Recovery Account (2018) - effective until April 30, 2019\n        Applicable Only for Class B Customers"},{"$f":"RATES!G172","v":"$/kWh"},{"$f":"RATES!I172","v":-5.0000000000000002E-5}]
[null,{"$f":"RATES!C175","v":"Rate Rider for Disposition of Capacity Based Recovery Account (2019) - effective until December 31, 2019\n        Applicable Only for Class B Customers"},{"$f":"RATES!G175","v":"$/kWh"},{"$f":"RATES!I175","v":1.0000000000000001E-5}]
["USL_DVA16",{"$f":"RATES!C171","v":"Rate Rider for Recovery of Incremental Capital Module (2017) - in effect until the effective date of the next cost of service based rate order"},{"$f":"RATES!G171","v":"$/kWh"},{"$f":"RATES!I171","v":4.0000000000000002E-4}]
["USL_V",{"$f":"RATES!C181","v":"Rate Rider for Recovery of Incremental Capital Module (2018) - in effect until the effective date of the next cost of service based rate order"},{"$f":"RATES!G181","v":"$/kWh"},{"$f":"RATES!I181","v":1E-4}]
[null,{"$f":"RATES!C178","v":"Rate Rider for Recovery of Incremental Capital Module (2019) - in effect until the effective date of the next cost of service based rate order"},{"$f":"RATES!G178","v":"$/kWh"},{"$f":"RATES!I178","v":1E-4}]
[null,{"$f":"+RATES!C180","v":"Rate Rider for Disposition of Capitalization Policy Rate Rider (2019) - effective until December 31, 2019"},{"$f":"+RATES!G180","v":"$/kWh"},{"$f":"+ROUND(RATES!I180,4)","v":-2.0000000000000001E-4}]
["USL_TN",{"$f":"RATES!C192","v":"Retail Transmission Rate - Network Service Rate"},{"$f":"RATES!G192","v":"$/kWh"},{"$f":"RATES!I192","v":7.1000000000000004E-3}]
["USL_TC",{"$f":"RATES!C193","v":"Retail Transmission Rate - Line and Transformation Connection Service Rate"},{"$f":"RATES!G193","v":"$/kWh"},{"$f":"RATES!I193","v":6.4999999999999997E-3}]
[]
[null,"MONTHLY RATES AND CHARGES - Regulatory Component"]
[]
[null,"Wholesale Market Service Rate (WMS) - Not including CBR","$/kWh",3.2000000000000002E-3]
[null,"Capacity Based Recovery (CBR) - Applicable for Class B Customers","$/kWh",4.0000000000000002E-4]
[null,"Rural or Remote Electricity Rate Protection Charge (RRRP)","$/kWh",2.9999999999999997E-4]
[null,"Standard Supply Service - Administrative Charge (if applicable)","$",0.25]
[null,"STREET LIGHTING SERVICE CLASSIFICATION"]
[null,"This classification refers to an account for roadway lighting.  Street Lighting is unmetered where energy consumption is estimated based on the connected wattage and calculated hours of use using methods established by the Ontario Energy Board.  Class B consumers are defined in accordance with O. Reg. 429/04.  Further servicing details are available in the distributor’s Conditions of Service."]
[]
[null,"APPLICATION"]
[]
[null,"The application of these rates and charges shall be in accordance with the Licence of the Distributor and any Code or Order of the Ontario Energy Board, and amendments thereto as approved by the Ontario Energy Board, which may be applicable to the administration of this schedule."]
[]
[null,"No rates and charges for the distribution of electricity and charges to meet the costs of any work or service done or furnished for the purpose of the distribution of electricity shall be made except as permitted by this schedule, unless required by the Distributor’s Licence or a Code or Order of the Ontario Energy Board, and amendments thereto as approved by the Ontario Energy Board, or as specified herein."]
[]
[null,"Unless specifically noted, this schedule does not contain any charges for the electricity commodity, be it under the Regulated Price Plan, a contract with a retailer or the wholesale market price, as applicable. In addition, the charges in the MONTHLY RATES AND CHARGES - Regulatory Component of this schedule do not apply to a customer that is an embedded wholesale market participant."]
[]
[null,"It should be noted that this schedule does not list any charges, assessments, or credits that are required by law to be invoiced by a distributor and that are not subject to Ontario Energy Board approval, such as the Debt Retirement Charge, the Global Adjustment and the HST."]
[]
[null,"MONTHLY RATES AND CHARGES - Delivery Component"]
[]
["SL_F","Service Charge (per luminaire)",{"$f":"RATES!G195","v":"$"},{"$f":"RATES!I195","v":1.53}]
["SL_GA16",{"$f":"RATES!C198","v":"Rate Rider for Recovery of Incremental Capital Module (2017) - in effect until the effective date of the next cost of service based rate order"},{"$f":"RATES!G198","v":"$"},{"$f":"RATES!I198","v":0.04}]
["SL_GA16",{"$f":"RATES!C212","v":"Rate Rider for Recovery of Incremental Capital Module (2018) - in effect until the effective date of the next cost of service based rate order"},{"$f":"RATES!G212","v":"$"},{"$f":"RATES!I212","v":0.01}]
[null,{"$f":"RATES!C207","v":"Rate Rider for Recovery of Incremental Capital Module (2019) - in effect until the effective date of the next cost of service based rate order"},{"$f":"RATES!G207","v":"$"},{"$f":"RATES!I207","v":0.01}]
[null,{"$f":"+RATES!C209","v":"Rate Rider for Disposition of Capitalization Policy Rate Rider (2019) - effective until December 31, 2019"},{"$f":"+RATES!G209","v":"$"},{"$f":"+RATES!I209","v":-0.01}]
["SL_V",{"$f":"RATES!C196","v":"Distribution Volumetric Rate"},{"$f":"RATES!G196","v":"$/kW"},{"$f":"RATES!I196","v":11.7553}]
[null,{"$f":"RATES!C197","v":"Low Voltage Service Rate "},{"$f":"RATES!G197","v":"$/kW"},{"$f":"RATES!I197","v":5.8000000000000003E-2}]
[null,{"$f":"RATES!C199","v":"Rate Rider for Disposition of Global Adjustment Account (2018) - effective until  April 30, 2019\n        Applicable only for Non-RPP Customers"},{"$f":"RATES!G199","v":"$/kWh"},{"$f":"RATES!I199","v":-5.0000000000000001E-4}]
[null,{"$f":"RATES!C203","v":"Rate Rider for Disposition of Global Adjustment Account (2019) - effective until  December 31, 2019\n        Applicable only for Non-RPP Customers"},{"$f":"RATES!G203","v":"$/kWh"},{"$f":"RATES!I203","v":1.6999999999999999E-3}]
[null,{"$f":"RATES!C200","v":"Rate Rider for Disposition of Deferral/Variance Accounts (2018) - effective until April 30, 2019"},{"$f":"RATES!G200","v":"$/kW"},{"$f":"RATES!I200","v":-0.2616}]
["SL_TN",{"$f":"RATES!C204","v":"Rate Rider for Disposition of Deferral/Variance Accounts (2019) - effective until December 31, 2019"},{"$f":"RATES!G204","v":"$/kW"},{"$f":"RATES!I204","v":-0.13539999999999999}]
[null,{"$f":"RATES!C202","v":"Rate Rider for Disposition of Capacity Based Recovery Account (2018) - effective until April 30, 2019\n        Applicable Only for Non-WMP Class B Customers"},{"$f":"RATES!G202","v":"$/kW"},{"$f":"RATES!I202","v":-1.6549999999999999E-2}]
[null,{"$f":"RATES!C205","v":"Rate Rider for Disposition of Capacity Based Recovery Account (2019) - effective until December 31, 2019\n        Applicable Only for Non-WMP Class  B Customers"},{"$f":"RATES!G205","v":"$/kW"},{"$f":"RATES!I205","v":2.48E-3}]
[null,{"$f":"RATES!C211","v":"Rate Rider for Disposition of Lost Revenue Adjustment Mechanism Variance Account (LRAMVA) (2018) - effective until April 30, 2019"},{"$f":"RATES!G211","v":"$/kW"},{"$f":"RATES!I211","v":-33.353200000000001}]
[null,{"$f":"RATES!C206","v":"Rate Rider for Disposition of Lost Revenue Adjustment Mechanism Variance Account (LRAMVA) (2019) - effective until December 31, 2019"},{"$f":"RATES!G206","v":"$/kW"},{"$f":"RATES!I206","v":-3.7907999999999999}]
["SL_1576",{"$f":"RATES!C201","v":"Rate Rider for Recovery of Incremental Capital Module (2017) - in effect until the effective date of the next cost of service based rate order"},{"$f":"RATES!G201","v":"$/kW"},{"$f":"RATES!I201","v":0.29049999999999998}]
["SL_1576",{"$f":"RATES!C213","v":"Rate Rider for Recovery of Incremental Capital Module (2018) - in effect until the effective date of the next cost of service based rate order"},{"$f":"RATES!G213","v":"$/kW"},{"$f":"RATES!I213","v":7.6999999999999999E-2}]
[null,{"$f":"RATES!C208","v":"Rate Rider for Recovery of Incremental Capital Module (2019) - in effect until the effective date of the next cost of service based rate order"},{"$f":"RATES!G208","v":"$/kW"},{"$f":"RATES!I208","v":7.9200000000000007E-2}]
[null,{"$f":"+RATES!C210","v":"Rate Rider for Disposition of Capitalization Policy Rate Rider (2019) - effective until December 31, 2019"},{"$f":"+RATES!G210","v":"$/kW"},{"$f":"+RATES!I210","v":-0.1116}]
["SL_TC",{"$f":"RATES!C219","v":"Retail Transmission Rate - Network Service Rate"},{"$f":"RATES!G219","v":"$/kW"},{"$f":"RATES!I219","v":1.9012}]
[null,{"$f":"RATES!C220","v":"Retail Transmission Rate - Line and Transformation Connection Service Rate"},{"$f":"RATES!G220","v":"$/kW"},{"$f":"RATES!I220","v":1.8634999999999999}]
[]
[null,"MONTHLY RATES AND CHARGES - Regulatory Component"]
[]
[null,"Wholesale Market Service Rate (WMS) - Not including CBR","$/kWh",3.2000000000000002E-3]
[null,"Capacity Based Recovery (CBR) - Applicable for Class B Customers","$/kWh",4.0000000000000002E-4]
[null,"Rural or Remote Electricity Rate Protection Charge (RRRP)","$/kWh",2.9999999999999997E-4]
[null,"Standard Supply Service - Administrative Charge (if applicable)","$",0.25]
[null,"STANDBY DISTRIBUTION SERVICE CLASSIFICATION"]
[null,"This classification refers to an account that requires Alectra Utilities to provide distribution service on a standby basis as a back-up supply to an on-site generator.  Further servicing details are available in the distributor’s Conditions of Service."]
[]
[null,"APPLICATION"]
[]
[null,"The application of these rates and charges shall be in accordance with the Licence of the Distributor and any Code or Order of the Ontario Energy Board, and amendments thereto as approved by the Ontario Energy Board, which may be applicable to the administration of this schedule."]
[]
[null,"No rates and charges for the distribution of electricity and charges to meet the costs of any work or service done or furnished for the purpose of the distribution of electricity shall be made except as permitted by this schedule, unless required by the Distributor’s Licence or a Code or Order of the Ontario Energy Board, and amendments thereto as approved by the Ontario Energy Board, or as specified herein."]
[]
[null,"Unless specifically noted, this schedule does not contain any charges for the electricity commodity, be it under the Regulated Price Plan, a contract with a retailer or the wholesale market price, as applicable."]
[]
[null,"It should be noted that this schedule does not list any charges, assessments or credits that are required by law to be invoiced by a distributor and that are not subject to Ontario Energy Board approval, such as the Debt Retirement Charge, the Global Adjustment and the HST."]
[null,"MONTHLY RATES AND CHARGES – Delivery Component "]
[]
["SB_V","A Standby Service Charge will be applied for a month where standby power is not provided.  The applicable rate is the approved Distribution Volumetric Rate of the applicable service class and is applied to gross metered demand or contracted amount, whichever is greater.  A monthly administration charge of $200, for simple metering arrangements, or $500, for complex metering arrangements, will also be applied.  "]
[null,"EMBEDDED DISTRIBUTOR SERVICE CLASSIFICATION"]
[null,"This classification applies to an electricity distributor licensed by the Ontario Energy Board, that is provided electricity by means of this distributor's facilities. Further servicing details are available in the distributor’s Conditions of Service."]
[]
[null,"APPLICATION"]
[]
[null,"The application of these rates and charges shall be in accordance with the Licence of the Distributor and any Code or Order of the Ontario Energy Board, and amendments thereto as approved by the Ontario Energy Board, which may be applicable to the administration of this schedule."]
[]
[null,"No rates and charges for the distribution of electricity and charges to meet the costs of any work or service done or furnished for the purpose of the distribution of electricity shall be made except as permitted by this schedule, unless required by the Distributor’s Licence or a Code or Order of the Ontario Energy Board, and amendments thereto as approved by the Ontario Energy Board, or as specified herein."]
[]
[null,"Unless specifically noted, this schedule does not contain any charges for the electricity commodity, be it under the Regulated Price Plan, a contract with a retailer or the wholesale market price, as applicable. In addition, the charges in the MONTHLY RATES AND CHARGES - Regulatory Component of this schedule do not apply to a customer that is an embedded wholesale market participant."]
[]
[null,"It should be noted that this schedule does not list any charges, assessments, or credits that are required by law to be invoiced by a distributor and that are not subject to Ontario Energy Board approval, such as the Debt Retirement Charge, the Global Adjustment and the HST."]
[]
[null,"MONTHLY RATES AND CHARGES - Delivery Component"]
[]
["EMD_F"]
["EMD_GA16"]
["EMD_DVA16"]
["EMD_CBR16"]
["EMD_TN"]
["EMD_TC"]
[]
[null,"MONTHLY RATES AND CHARGES - Regulatory Component"]
[]
[null,"Wholesale Market Service Rate","$/kWh",3.5999999999999999E-3]
[null,"Rural or Remote Electricity Rate Protection Charge (RRRP)","$/kWh",1.2999999999999999E-3]
[null,"Standard Supply Service - Administrative Charge (if applicable)","$",0.25]
[null,"DISTRIBUTED GENERATION [DGEN] SERVICE CLASSIFICATION"]
[null,"This classification applies to a distributed generator that is not a microFIT or an Energy from Waste Generator and connected to the distributor's distribution system. Further servicing details are available in the distributor’s Conditions of Service."]
[]
[null,"APPLICATION"]
[]
[null,"The application of these rates and charges shall be in accordance with the Licence of the Distributor and any Code or Order of the Ontario Energy Board, and amendments thereto as approved by the Ontario Energy Board, which may be applicable to the administration of this schedule."]
[]
[null,"No rates and charges for the distribution of electricity and charges to meet the costs of any work or service done or furnished for the purpose of the distribution of electricity shall be made except as permitted by this schedule, unless required by the Distributor’s Licence or a Code or Order of the Ontario Energy Board, and amendments thereto as approved by the Ontario Energy Board, or as specified herein."]
[]
[null,"Unless specifically noted, this schedule does not contain any charges for the electricity commodity, be it under the Regulated Price Plan, a contract with a retailer or the wholesale market price, as applicable. In addition, the charges in the MONTHLY RATES AND CHARGES - Regulatory Component of this schedule do not apply to a customer that is an embedded wholesale market participant."]
[]
[null,"It should be noted that this schedule does not list any charges, assessments, or credits that are required by law to be invoiced by a distributor and that are not subject to Ontario Energy Board approval, such as the Debt Retirement Charge, the Global Adjustment and the HST."]
[]
[null,"MONTHLY RATES AND CHARGES - Delivery Component"]
[]
["DG_F"]
["DG_GA16"]
["DG_DVA16"]
["DG_1576"]
["DG_CBR16"]
["DG_TN"]
["DG_TC"]
[]
[null,"MONTHLY RATES AND CHARGES - Regulatory Component"]
[]
[null,"Wholesale Market Service Rate","$/kWh",3.5999999999999999E-3]
[null,"Rural or Remote Electricity Rate Protection Charge (RRRP)","$/kWh",1.2999999999999999E-3]
[null,"Standard Supply Service - Administrative Charge (if applicable)","$",0.25]
[null,"ENERGY FROM WASTE SERVICE CLASSIFICATION"]
[null,"This classification applies to an electricity generation facility that is not covered by a microFIT or Distributed Generation classification which produces energy from combustion of consumer waste with the capability to generate over 4,000 KW. Further servicing details are available in the distributor’s Conditions of Service."]
[]
[null,"APPLICATION"]
[]
[null,"The application of these rates and charges shall be in accordance with the Licence of the Distributor and any Code or Order of the Ontario Energy Board, and amendments thereto as approved by the Ontario Energy Board, which may be applicable to the administration of this schedule."]
[]
[null,"No rates and charges for the distribution of electricity and charges to meet the costs of any work or service done or furnished for the purpose of the distribution of electricity shall be made except as permitted by this schedule, unless required by the Distributor’s Licence or a Code or Order of the Ontario Energy Board, and amendments thereto as approved by the Ontario Energy Board, or as specified herein."]
[]
[null,"Unless specifically noted, this schedule does not contain any charges for the electricity commodity, be it under the Regulated Price Plan, a contract with a retailer or the wholesale market price, as applicable. In addition, the charges in the MONTHLY RATES AND CHARGES - Regulatory Component of this schedule do not apply to a customer that is an embedded wholesale market participant."]
[]
[null,"It should be noted that this schedule does not list any charges, assessments, or credits that are required by law to be invoiced by a distributor and that are not subject to Ontario Energy Board approval, such as the Debt Retirement Charge, the Global Adjustment and the HST."]
[]
[null,"MONTHLY RATES AND CHARGES - Delivery Component"]
[]
["WST_F","Service Charge","$"]
[null,"microFIT SERVICE CLASSIFICATION"]
[null,"This classification applies to an electricity generation facility contracted under the Independent Electricity System Operator’s microFIT program and connected to the distributor’s distribution system.  Further servicing details are available in the distributor’s Conditions of Service."]
[]
[null,"APPLICATION"]
[]
[null,"The application of these rates and charges shall be in accordance with the Licence of the Distributor and any Code or Order of the Ontario Energy Board, and amendments thereto as approved by the Ontario Energy Board, which may be applicable to the administration of this schedule."]
[]
[null,"No rates and charges for the distribution of electricity and charges to meet the costs of any work or service done or furnished for the purpose of the distribution of electricity shall be made except as permitted by this schedule, unless required by the Distributor’s Licence or a Code or Order of the Ontario Energy Board, and amendments thereto as approved by the Ontario Energy Board, or as specified herein."]
[]
[null,"Unless specifically noted, this schedule does not contain any charges for the electricity commodity, be it under the Regulated Price Plan, a contract with a retailer or the wholesale market price, as applicable. In addition, the charges in the MONTHLY RATES AND CHARGES - Regulatory Component of this schedule do not apply to a customer that is an embedded wholesale market participant."]
[]
[null,"It should be noted that this schedule does not list any charges, assessments, or credits that are required by law to be invoiced by a distributor and that are not subject to Ontario Energy Board approval, such as the Debt Retirement Charge, the Global Adjustment and the HST."]
[]
[null,"MONTHLY RATES AND CHARGES - Delivery Component"]
[]
[null,"Service Charge","$",5.4]
[]
[null,"ALLOWANCES"]
[null,"Transformer Allowance for Ownership - per kW of billing demand/month","$/kW",-0.4]
[null,"Primary Metering Allowance for transformer losses - applied to measured demand and energy","%",-1]
[null,"SPECIFIC SERVICE CHARGES"]
[]
[null,"APPLICATION"]
[]
[null,"The application of these rates and charges shall be in accordance with the Licence of the Distributor and any Code or Order of the Ontario Energy Board, and amendments thereto as approved by the Ontario Energy Board, which may be applicable to the administration of this schedule."]
[]
[null,"No charges to meet the costs of any work or service done or furnished for the purpose of the distribution of electricity shall be made except as permitted by this schedule, unless required by the Distributor’s Licence or a Code or Order of the Ontario Energy Board, and amendments thereto as approved by the Ontario Energy Board, or as specified herein."]
[]
[null,"It should be noted that this schedule does not list any charges, assessments or credits that are required by law to be invoiced by a distributor and that are not subject to Ontario Energy Board approval, such as the Debt Retirement Charge, the Global Adjustment and the HST."]
[]
[null,"Customer Administration"]
[null,"Arrears Certificate","$",15]
[null,"Request for other billing information","$",15]
[null,"Credit reference/credit check (plus credit agency costs)","$",15]
[null,"Credit reference/credit check (plus credit agency costs – General Service)","$",25]
[null,"Income tax letter","$",15]
[null,"Returned cheque (plus bank charges)","$",12.5]
[null,"Account set up charge/change of occupancy charge (plus credit agency costs if applicable)","$",30]
[null,"Account set up charge/change of occupancy charge (plus credit agency costs if applicable – Residential)","$",20]
[null,"Meter dispute charge plus Measurement Canada fees (if meter found correct)","$ ",10]
[null,"Special meter reads","$",30]
[null,"Interval meter request change","$",40]
[]
[null,"Non-Payment of Account"]
[null,"Late Payment - per month","%",1.5]
[null,"Late Payment - per annum","%",19.559999999999999]
[null,"Collection of account charge – no disconnection","$",9]
[null,"Disconnect/Reconnect at meter - during regular hours","$",20]
[null,"Disconnect/Reconnect at pole - during regular hours","$",185]
[null,"Disconnect/Reconnect at pole - after regular hours","$",415]
[]
[null,"Other"]
[null,"Temporary service install and remove – overhead – no transformer","$",400]
["      Specific Charge for Access to the Power Poles - $/pole/year (with the exception of wireless attachments) - in effect from January 1, 2019",null,"$",43.63]
[null,"RETAIL SERVICE CHARGES (if applicable)"]
[]
[null,"The application of these rates and charges shall be in accordance with the Licence of the Distributor and any Code or Order of the Ontario Energy Board, and amendments thereto as approved by the Ontario Energy Board, which may be applicable to the administration of this schedule."]
[]
[null,"No rates and charges for the distribution of electricity and charges to meet the costs of any work or service done or furnished for the purpose of the distribution of electricity shall be made except as permitted by this schedule, unless required by the Distributor’s Licence or a Code or Order of the Ontario Energy Board, and amendments thereto as approved by the Ontario Energy Board, or as specified herein."]
[]
[null,"Unless specifically noted, this schedule does not contain any charges for the electricity commodity, be it under the Regulated Price Plan, a contract with a retailer or the wholesale market price, as applicable."]
[]
[null,"It should be noted that this schedule does not list any charges, assessments, or credits that are required by law to be invoiced by a distributor and that are not subject to Ontario Energy Board approval, such as the Debt Retirement Charge, the Global Adjustment and the HST."]
[]
[null,"Retail Service Charges refer to services provided by a distributor to retailers or customers related to the supply of competitive electricity."]
[null,"One-time charge, per retailer, to establish the service agreement between the distributor and the retailer","$",100]
[null,"Monthly Fixed Charge, per retailer","$",20]
[null,"Monthly Variable Charge, per customer, per retailer","$/cust.",0.5]
[null,"Distributor-consolidated billing monthly charge, per customer, per retailer","$/cust.",0.3]
[null,"Retailer-consolidated billing monthly credit, per customer, per retailer","$/cust.",-0.3]
[null,"Service Transaction Requests (STR)"]
[null,"Request fee, per request, applied to the requesting party","$",0.25]
[null,"Processing fee, per request, applied to the requesting party","$",0.5]
[null,"Request for customer information as outlined in Section 10.6.3 and Chapter 11 of the Retail "]
[null,"Settlement Code directly to retailers and customers, if not delivered electronically through the "]
[null,"Electronic Business Transaction (EBT) system, applied to the requesting party"]
[null,"Up to twice a year","$","no charge"]
[null,"More than twice a year, per request (plus incremental delivery costs)","$",2]
[]
[null,"LOSS FACTORS"]
[]
[null,"If the distributor is not capable of prorating changed loss factors jointly with distribution rates, the revised loss factors will be implemented upon the first subsequent billing for each billing cycle."]
[null,"Total Loss Factor - Secondary Metered Customer < 5,000 kW",null,1.036]
[null,"Total Loss Factor - Secondary Metered Customer > 5,000 kW",null,1.0145]
[null,"Total Loss Factor - Primary Metered Customer < 5,000 kW",null,1.0256000000000001]
[null,"Total Loss Factor - Primary Metered Customer > 5,000 kW",null,1.0044999999999999]

{"sheet":"21. Bill Impacts","index":26,"n_rows":650,"n_cols":22,"rows_kept":650,"cut":false,"hidden":false,"merged":[[606,5,607,5],[606,12,607,12],[606,13,607,13],[550,12,550,13],[551,5,552,5],[551,12,552,12],[551,13,552,13],[581,4,581,5],[587,4,587,5],[599,5,599,7],[605,6,605,8],[605,9,605,11],[605,12,605,13],[527,4,527,5],[533,4,533,5],[539,4,539,5],[543,5,543,10],[544,5,544,7],[550,6,550,8],[550,9,550,11],[598,5,598,10],[593,4,593,5],[473,4,473,5],[479,4,479,5],[485,4,485,5],[489,5,489,10],[490,5,490,7],[496,6,496,8],[496,9,496,11],[496,12,496,13],[497,5,498,5],[497,12,498,12],[497,13,498,13],[442,5,443,5],[442,12,443,12],[442,13,443,13],[366,4,366,5],[371,4,371,5],[377,4,377,5],[381,5,381,10],[382,5,382,7],[335,13,336,13],[419,4,419,5],[424,4,424,5],[430,4,430,5],[434,5,434,10],[435,5,435,7],[441,6,441,8],[389,5,390,5],[389,12,390,12],[389,13,390,13],[441,9,441,11],[441,12,441,13],[281,5,282,5],[281,12,282,12],[281,13,282,13],[327,5,327,10],[328,5,328,7],[334,6,334,8],[334,9,334,11],[388,6,388,8],[388,9,388,11],[388,12,388,13],[36,15,36,16],[36,17,36,18],[37,15,37,16],[37,17,37,18],[110,4,110,5],[114,5,114,10],[68,6,68,8],[68,9,68,11],[36,13,36,14],[37,7,37,8],[648,4,648,5],[637,4,637,5],[642,4,642,5],[10,4,10,10],[1,4,8,10],[36,4,38,5],[61,5,61,10],[62,5,62,7],[36,6,38,6],[36,7,36,12],[121,9,121,11],[121,12,121,13],[68,12,68,13],[69,5,70,5],[69,12,70,12],[69,13,70,13],[100,4,100,5],[105,4,105,5],[37,13,37,14],[174,12,174,13],[175,5,176,5],[175,12,176,12],[175,13,176,13],[122,5,123,5],[258,4,258,5],[263,4,263,5],[334,12,334,13],[335,5,336,5],[335,12,336,12],[273,5,273,10],[274,5,274,7],[280,6,280,8],[153,4,153,5],[158,4,158,5],[163,4,163,5],[167,5,167,10],[168,5,168,7],[174,6,174,8],[174,9,174,11],[228,5,229,5],[228,12,229,12],[312,4,312,5],[317,4,317,5],[323,4,323,5],[269,4,269,5],[280,9,280,11],[280,12,280,13],[228,13,229,13],[227,12,227,13],[205,4,205,5],[210,4,210,5],[216,4,216,5],[220,5,220,10],[221,5,221,7],[227,6,227,8],[227,9,227,11],[37,9,37,10],[37,11,37,12],[122,12,123,12],[122,13,123,13],[115,5,115,7],[121,6,121,8]]}
["Back to Index"]
[null,null,null,null,{"$f":"+'1. Information Sheet'!B2","v":"INCENTIVE REGULATION MODEL FOR 2019 FILERS"}]
[]
[]
[]
[]
[]
[]
[]
[]
[null,null,null,null,"The bill comparisons below must be provided for typical customers and consumption levels. Bill impacts must be provided for residential customers consuming 750 kWh per month and general service customers consuming 2,000 kWh per month and having a monthly demand of less than 50 kW. Include bill comparisons for Non-RPP (retailer) as well. To assess the combined effects of the shift to fixed rates and other bill impacts associated with changes in the cost of distribution service, applicants are to include a total bill impact for a residential customer at the distributor’s 10th consumption percentile (In other words, 10% of a distributor’s residential customers consume at or less than this level of consumption on a monthly basis). Refer to page 9 of the Filing Requirements For Electricity Distribution Rate Applications issued July 14, 2016.\n\nFor certain classes where one or more customers have unique consumption and demand patterns and which may be significantly impacted by the proposed rate changes, the distributor must show a typical comparison, and provide an explanation.\n\nNote:  \n1. For those classes that are not eligible for the RPP price, the weighted average price including Class B GA through end of February 2017 of $0.1058/kWh (IESO's Monthly Market Report for February 2017, page 22) has been used to represent the cost of power. For those classes on a retailer contract, applicants should enter the contract price (plus GA) for a more accurate estimate. Changes to the cost of power can be made directly on the bill impact table for the specific class.\n2. Please enter the applicable billing determinant (e.g. number of connections or devices) to be applied to the monthly service charge for unmetered rate classes in column N. If the monthly service charge is applied on a per customer basis, enter the number “1”. Distributors should provide the number of connections or devices reflective of a typical customer in each class."]
[]
[null,null,null,null,"Table 1"]
[null,null,null,null,"RATE CLASSES / CATEGORIES \n(eg: Residential TOU, Residential Retailer)",null,"Units","RPP?\nNon-RPP Retailer?\nNon-RPP\nOther?","Current \nLoss Factor ","Proposed Loss Factor","Consumption (kWh)","Demand kW\n(if applicable)","RTSR\n","Billing Determinant Applied to Fixed Charge for Unmetered Classes (e.g. # of devices/connections)."]
[null,1,{"$f":"IF(ISERROR(VLOOKUP(E15, E$15:V$33, 18, FALSE)),\"\", VLOOKUP(E15, E$15:V$33, 18, FALSE))","v":1},null,"RESIDENTIAL SERVICE CLASSIFICATION",null,{"$f":"IF(ISERROR(VLOOKUP(E15,BILLING_DETERMINANTS,2,FALSE)),\"\",(VLOOKUP(E15,BILLING_DETERMINANTS,2,FALSE)))","v":"kWh"},"RPP",{"$f":"LLF","v":1.036},{"$f":"IF(ISBLANK(I15),\"\", I15)","v":1.036},750,null,"N/A",null,null,null,null,null,null,{"$f":"SUM(I15:L15)","v":752.072},78,1]
[null,2,2,null,"GENERAL SERVICE LESS THAN 50 kW SERVICE CLASSIFICATION",null,"kWh","RPP",{"$f":"LLF","v":1.036},1.036,2000,null,"N/A",null,null,null,null,null,null,2002.0719999999999,{"$f":"U15+68","v":146},2]
[null,3,3,null,"GENERAL SERVICE 50 to 499 kW SERVICE CLASSIFICATION",null,"kW","Non-RPP (Other)",{"$f":"LLF","v":1.036},1.036,100000,230,"DEMAND",null,null,null,null,null,null,100232.072,214,3]
[null,4,4,null,"GENERAL SERVICE 500 to 4,999 kW SERVICE CLASSIFICATION",null,"kW","Non-RPP (Other)",{"$f":"LLF","v":1.036},1.036,400000,2250,"DEMAND",null,null,null,null,null,null,402252.07199999999,282,4]
[null,5,5,null,"LARGE USE SERVICE CLASSIFICATION",null,"kW","Non-RPP (Other)",1.0145,1.0145,3000000,5000,"DEMAND",null,null,null,null,null,null,3005002.0290000001,350,5]
[null,6,6,null,"STANDBY POWER SERVICE CLASSIFICATION ",null,"kW",null,{"$f":"LLF","v":1.036},1.036,0,0,"DEMAND",null,null,null,null,null,null,2.0720000000000001,418,6]
[null,7,7,null,"UNMETERED SCATTERED LOAD SERVICE CLASSIFICATION",null,"kWh","RPP",1.036,1.036,300,null,"N/A",null,null,null,null,null,null,302.072,486,7]
[null,8,8,null,"STREET LIGHTING SERVICE CLASSIFICATION",null,"kW","Non-RPP (Other)",1.036,1.036,33,0.1,"DEMAND",null,null,null,null,null,null,35.172000000000004,554,8]
[null,9,1,null,"RESIDENTIAL SERVICE CLASSIFICATION",null,"kWh","Non-RPP (Retailer)",1.036,1.036,750,null,"N/A",null,null,null,null,null,null,752.072,622,9]
[null,10,2,null,"GENERAL SERVICE LESS THAN 50 kW SERVICE CLASSIFICATION",null,"kWh","Non-RPP (Retailer)",1.036,1.036,2000,null,"N/A",null,null,null,null,null,null,2002.0719999999999,690,10]
[null,11,7,null,"UNMETERED SCATTERED LOAD SERVICE CLASSIFICATION",null,"kWh","Non-RPP (Retailer)",1.036,1.036,300,null,"N/A",null,null,null,null,null,null,302.072,758,11]
[null,12,3,null,"GENERAL SERVICE 50 to 499 kW SERVICE CLASSIFICATION",null,"kW","Non-RPP (Other)",1.036,1.036,100000,230,"DEMAND - INTERVAL",null,null,null,null,null,null,100232.072,826]
[null,13,4,null,"GENERAL SERVICE 500 to 4,999 kW SERVICE CLASSIFICATION",null,"kW","Non-RPP (Other)",1.036,1.036,400000,2250,"DEMAND - INTERVAL",null,null,null,null,null,null,402252.07199999999,894]
[null,14,5,null,"LARGE USE SERVICE CLASSIFICATION",null,"kW","Non-RPP (Other)",{"$f":"I19","v":1.0145},1.0145,3000000,5000,"DEMAND - INTERVAL",null,null,null,null,null,null,3005002.0290000001,962]
[null,15,0,null,"Add additional scenarios if required",null,null,null,null,null,null,null,null,null,null,null,null,null,null,0,1030]
[null,16,0,null,"Add additional scenarios if required",null,null,null,null,{"$f":"IF(ISBLANK(I30),\"\", I30)","v":""},null,null,null,null,null,null,null,null,null,0,1098]
[null,17,0,null,"Add additional scenarios if required",null,null,null,null,{"$f":"IF(ISBLANK(I31),\"\", I31)","v":""},null,null,null,null,null,null,null,null,null,0,1166]
[null,18,0,null,"Add additional scenarios if required",null,null,null,null,{"$f":"IF(ISBLANK(I32),\"\", I32)","v":""},null,null,null,null,null,null,null,null,null,0,1234]
[null,19,0,null,"Add additional scenarios if required",null,null,null,null,{"$f":"IF(ISBLANK(I33),\"\", I33)","v":""},null,null,null,null,null,null,null,null,null,0,1302]
[]
[]
[null,null,null,null,"Table 2"]
[null,null,null,null,"RATE CLASSES / CATEGORIES \n(eg: Residential TOU, Residential Retailer)",null,"Units","Sub-Total",null,null,null,null,null,"Total",null,"Total (Before Tax)",null,"Total"]
[null,null,null,null,null,null,null,"A",null,"B",null,"C",null,"A + B + C",null,"A + B + C",null,"A + B + C"]
[null,null,null,null,null,null,null,"$","%","$","%","$","%","$","%","$","%","$","%"]
[null,{"$f":"H15","v":"RPP"},{"$f":"B15","v":1},null,{"$f":"IF(ISBLANK(E15), \"\", IF(E15 = \"Add additional scenarios if required\", \"\", IF(O15=\"INTERVAL\", E15 & \" - \" & H15 & \" - Interval Customers\", E15 & \" - \" &H15)))","v":"RESIDENTIAL SERVICE CLASSIFICATION - RPP"},null,{"$f":"G15","v":"kWh"},{"$f":"IF(LEN($G40)>1, (SUMPRODUCT(--($C$72:$C$864=$B15), --($A$72:$A$864=$E15), --($B$72:$B$864=\"ST_A\"), $M$72:$M$864)), \"\")","v":-0.14499999999999957},{"$f":"IF(LEN($G40)>1, (SUMPRODUCT(--($C$72:$C$864=$B15), --($A$72:$A$864=$E15), --($B$72:$B$864=\"ST_A\"), $N$72:$N$864)), \"\")","v":-5.7965220867479336E-3},{"$f":"IF(LEN($G40)>1, (SUMPRODUCT(--($C$72:$C$864=$B15), --($A$72:$A$864=$E15), --($B$72:$B$864=\"ST_B\"), $M$72:$M$864)), \"\")","v":-0.43749999999999645},{"$f":"IF(LEN($G40)>1, (SUMPRODUCT(--($C$72:$C$864=$B15), --($A$72:$A$864=$E15), --($B$72:$B$864=\"ST_B\"), $N$72:$N$864)), \"\")","v":-1.5975181688023379E-2},{"$f":"IF(LEN($G40)>1, (SUMPRODUCT(--($C$72:$C$864=$B15), --($A$72:$A$864=$E15), --($B$72:$B$864=\"ST_C\"), $M$72:$M$864)), \"\")","v":-0.36250000000000426},{"$f":"IF(LEN($G40)>1, (SUMPRODUCT(--($C$72:$C$864=$B15), --($A$72:$A$864=$E15), --($B$72:$B$864=\"ST_C\"), $N$72:$N$864)), \"\")","v":-9.4373442350063827E-3},{"$f":"IF(LEN($G40)>1, (SUMPRODUCT(--($C$72:$C$864=$B15), --($A$72:$A$864=$E15), --($B$72:$B$864=$B40&\"_TOTAL\"), $M$72:$M$864)), \"\")","v":-0.38062499999999488},{"$f":"IF(LEN($G40)>1, (SUMPRODUCT(--($C$72:$C$864=$B15), --($A$72:$A$864=$E15), --($B$72:$B$864=$B40&\"_TOTAL\"), $N$72:$N$864)), \"\")","v":-3.5131405509166019E-3},{"$f":"IF(LEN($G40)>1, (SUMPRODUCT(--($C$72:$C$864=$B15), --($A$72:$A$864=$E15), --($B$72:$B$864=$B40&\"_BT\"), $M$72:$M$864)), \"\")","v":-0.36249999999999716},{"$f":"IF(LEN($G40)>1, (SUMPRODUCT(--($C$72:$C$864=$B15), --($A$72:$A$864=$E15), --($B$72:$B$864=$B40&\"_BT\"), $N$72:$N$864)), \"\")","v":-3.5131405509166214E-3},{"$f":"IF(LEN($G40)>1, (SUMPRODUCT(--($C$72:$C$864=$B15), --($A$72:$A$864=$E15), --($B$72:$B$864=$B40&\"_NET\"), $M$72:$M$864)), \"\")","v":-0.40962499999999835},{"$f":"IF(LEN($G40)>1, (SUMPRODUCT(--($C$72:$C$864=$B15), --($A$72:$A$864=$E15), --($B$72:$B$864=$B40&\"_NET\"), $N$72:$N$864)), \"\")","v":-3.5131405509166349E-3}]
[null,"RPP",2,null,"GENERAL SERVICE LESS THAN 50 kW SERVICE CLASSIFICATION - RPP",null,"kWh",0.53000000000000114,7.2276012546024972E-3,-0.25,-3.1764876889501942E-3,-4.9999999999997158E-2,-4.7302221842119907E-4,-14.752500000000055,-4.8114118332924401E-2,-14.050000000000011,-4.8114118332924262E-2,-15.876500000000014,-4.8114118332924269E-2]
[null,"Non-RPP (Other)",3,null,"GENERAL SERVICE 50 to 499 kW SERVICE CLASSIFICATION - Non-RPP (Other)",null,"kW",49.193000000000438,3.8001104660819261E-2,189.93010000000049,0.15814221751358612,202.62610000000086,8.3991339643506802E-2,-562.0325069999999,-3.4854063061078071E-2,-497.3739000000005,-3.4854063061078112E-2,-562.03250700000058,-3.4854063061078112E-2]
[null,"Non-RPP (Other)",4,null,"GENERAL SERVICE 500 to 4,999 kW SERVICE CLASSIFICATION - Non-RPP (Other)",null,"kW",197.51499999999942,2.5577390009388381E-2,517.46999999999935,7.461449645452442E-2,638.74499999999898,3.4594032800815695E-2,-2442.2181500000006,-3.2798515788076334E-2,-2161.2550000000047,-3.2798515788076396E-2,-2442.2181500000061,-3.2798515788076403E-2]
[null,"Non-RPP (Other)",5,null,"LARGE USE SERVICE CLASSIFICATION - Non-RPP (Other)",null,"kW",234.64000000000306,7.7143836893258516E-3,-815.35999999999694,-2.8303337520840525E-2,-527.86000000000058,-9.3993989555709069E-3,-24326.481800000052,-5.3162579128869979E-2,-21527.860000000044,-5.3162579128869972E-2,-24326.481800000052,-5.3162579128869979E-2]
[null,0,6,null,"STANDBY POWER SERVICE CLASSIFICATION  - ",null,"kW",0,0,0,0,0,0,0,0,0,0,0,0]
[null,"RPP",7,null,"UNMETERED SCATTERED LOAD SERVICE CLASSIFICATION - RPP",null,"kWh",0,0,-0.11700000000000266,-7.6769175168362432E-3,-8.7000000000003297E-2,-4.5099938353051483E-3,-2.2963499999999897,-4.6090998594466699E-2,-2.1869999999999976,-4.6090998594466852E-2,-2.4713099999999981,-4.6090998594466873E-2]
[null,"Non-RPP (Other)",8,null,"STREET LIGHTING SERVICE CLASSIFICATION - Non-RPP (Other)",null,"kW",-0.3718300000000001,0.67174317561830421,-0.32902200000000015,0.7019426510665191,-0.32508200000000009,3.3792096930788396,-0.62837265999999969,-0.15055559547518269,-0.55608199999999997,-0.15055559547518274,-0.62837265999999992,-0.15055559547518274]
[null,"Non-RPP (Retailer)",9,null,"RESIDENTIAL SERVICE CLASSIFICATION - Non-RPP (Retailer)",null,"kWh",-0.14499999999999957,-5.7965220867479336E-3,0.83750000000000213,3.034409295618502E-2,0.91249999999999432,2.3624534305412653E-2,0.95812499999998124,7.635638222205708E-3,0.91249999999999432,7.6356382222058103E-3,1.0311249999999923,7.6356382222057999E-3]
[null,"Non-RPP (Retailer)",10,null,"GENERAL SERVICE LESS THAN 50 kW SERVICE CLASSIFICATION - Non-RPP (Retailer)",null,"kWh",0.53000000000000114,7.2276012546024972E-3,3.1500000000000057,3.9735801073749716E-2,3.3500000000000085,3.1522410081149116E-2,-11.182500000000061,-3.1700730813467713E-2,-10.650000000000034,-3.1700730813467644E-2,-12.034500000000037,-3.1700730813467637E-2]
[null,"Non-RPP (Retailer)",11,null,"UNMETERED SCATTERED LOAD SERVICE CLASSIFICATION - Non-RPP (Retailer)",null,"kWh",0,0,0.39299999999999713,2.5642631756148167E-2,0.42299999999999471,2.1831086228145412E-2,-1.8950100000000063,-3.1154696723796716E-2,-1.6770000000000067,-3.1154696723796737E-2,-1.8950100000000081,-3.1154696723796747E-2]
[null,"Non-RPP (Other)",12,null,"GENERAL SERVICE 50 to 499 kW SERVICE CLASSIFICATION - Non-RPP (Other)",null,"kW",0,0,0,0,0,0,0,0,{"$f":"IF(LEN($G51)>1, (SUMPRODUCT(--($C$72:$C$864=$B26), --($A$72:$A$864=$E26), --($B$72:$B$864=$B51&\"_TOTAL\"), $M$72:$M$864)), \"\")","v":0},{"$f":"IF(LEN($G51)>1, (SUMPRODUCT(--($C$72:$C$864=$B26), --($A$72:$A$864=$E26), --($B$72:$B$864=$B51&\"_TOTAL\"), $N$72:$N$864)), \"\")","v":0},{"$f":"IF(LEN($G51)>1, (SUMPRODUCT(--($C$72:$C$864=$B26), --($A$72:$A$864=$E26), --($B$72:$B$864=$B51&\"_TOTAL\"), $M$72:$M$864)), \"\")","v":0},{"$f":"IF(LEN($G51)>1, (SUMPRODUCT(--($C$72:$C$864=$B26), --($A$72:$A$864=$E26), --($B$72:$B$864=$B51&\"_TOTAL\"), $N$72:$N$864)), \"\")","v":0}]
[null,"Non-RPP (Other)",13,null,"GENERAL SERVICE 500 to 4,999 kW SERVICE CLASSIFICATION - Non-RPP (Other)",null,"kW",0,0,0,0,0,0,0,0,0,0,0,0]
[null,"Non-RPP (Other)",14,null,"LARGE USE SERVICE CLASSIFICATION - Non-RPP (Other)",null,"kW",234.64000000000306,7.7143836893258516E-3,-815.35999999999694,-2.8303337520840525E-2,-527.86000000000058,-9.3993989555709069E-3,-24326.481800000052,-5.3162579128869979E-2,-24326.481800000052,-5.3162579128869979E-2,-24326.481800000052,-5.3162579128869979E-2]
[null,0,15,null,"",null,0,"","","","","","","","","","","",""]
[null,0,16,null,{"$f":"IF(ISBLANK(E30), \"\", IF(E30 = \"Add additional scenarios if required\", \"\", IF(O30=\"YES\", E30 & \" - \" & J30 & \" - Interval Customers\", E30 & \" - \" &J30)))","v":""},null,{"$f":"IF(ISBLANK(I30), \"\", I30)","v":""},"","","","","","","","","","","",""]
[null,0,17,null,{"$f":"IF(ISBLANK(E31), \"\", IF(E31 = \"Add additional scenarios if required\", \"\", IF(O31=\"YES\", E31 & \" - \" & J31 & \" - Interval Customers\", E31 & \" - \" &J31)))","v":""},null,{"$f":"IF(ISBLANK(I31), \"\", I31)","v":""},"","","","","","","","","","","",""]
[null,0,18,null,{"$f":"IF(ISBLANK(E32), \"\", IF(E32 = \"Add additional scenarios if required\", \"\", IF(O32=\"YES\", E32 & \" - \" & J32 & \" - Interval Customers\", E32 & \" - \" &J32)))","v":""},null,{"$f":"IF(ISBLANK(I32), \"\", I32)","v":""},"","","","","","","","","","","",""]
[null,0,19,null,{"$f":"IF(ISBLANK(E33), \"\", IF(E33 = \"Add additional scenarios if required\", \"\", IF(O33=\"YES\", E33 & \" - \" & J33 & \" - Interval Customers\", E33 & \" - \" &J33)))","v":""},null,{"$f":"IF(ISBLANK(I33), \"\", I33)","v":""},"","","","","","","","","","","",""]
[null,0,0,null,{"$f":"IF(ISBLANK(E34), \"\", IF(E34 = \"Add additional scenarios if required\", \"\", IF(O34=\"YES\", E34 & \" - \" & J34 & \" - Interval Customers\", E34 & \" - \" &J34)))","v":""},null,{"$f":"IF(ISBLANK(I34), \"\", I34)","v":""},"","","","","","","","","","","",""]
[]
[]
[null,null,null,null,"Customer Class:",{"$f":"E15","v":"RESIDENTIAL SERVICE CLASSIFICATION"},null,null,null,null,null,{"$f":"IF(O14=\"DEMAND - INTERVAL\",\"RTSR - INTERVAL METERED\",\"\")","v":""}]
[null,null,null,null,"RPP / Non-RPP:",{"$f":"H15","v":"RPP"}]
[null,null,null,null,"Consumption",{"$f":"K15","v":750},"kWh"]
[null,null,null,null,"Demand",{"$f":"L15","v":0},"kW"]
[null,null,null,null,"Current Loss Factor",{"$f":"I15","v":1.036}]
[null,null,null,null,"Proposed/Approved Loss Factor",{"$f":"J15","v":1.036}]
[]
[null,null,null,null,null,null,"Current OEB-Approved",null,null,"Proposed",null,null,"Impact"]
[null,null,null,null,null,null,"Rate","Volume","Charge","Rate","Volume","Charge","$ Change","% Change"]
[null,null,null,null,null,null,"($)",null,"($)","($)",null,"($)"]
[{"$f":"F62","v":"RESIDENTIAL SERVICE CLASSIFICATION"},null,null,"R_F","Monthly Service Charge",null,{"$f":"IFERROR(SUMIF(RATES!B:B, '21. Bill Impacts'!D72,RATES!H:H),\"\")","v":21.61},1,{"$f":"H72*G72","v":21.61},{"$f":"IFERROR(SUMIF(RATES!B:B,'21. Bill Impacts'!D72,RATES!I:I),\"\")","v":24.18},1,{"$f":"K72*J72","v":24.18},{"$f":"L72-I72","v":2.5700000000000003},{"$f":"IF(ISERROR(M72/I72), \"\", M72/I72)","v":0.11892642295233689}]
[{"$f":"A72","v":"RESIDENTIAL SERVICE CLASSIFICATION"},null,null,"R_V","Distribution Volumetric Rate",null,{"$f":"IFERROR(SUMIF(RATES!B:B, '21. Bill Impacts'!D73,RATES!H:H),\"\")","v":3.5000000000000001E-3},{"$f":"IF($F65>0, $F65, $F64)","v":750},{"$f":"H73*G73","v":2.625},{"$f":"IFERROR(SUMIF(RATES!B:B,'21. Bill Impacts'!D73,RATES!I:I),\"\")","v":0},{"$f":"IF($F65>0, $F65, $F64)","v":750},{"$f":"K73*J73","v":0},-2.625,{"$f":"IF(ISERROR(M73/I73), \"\", M73/I73)","v":-1}]
["RESIDENTIAL SERVICE CLASSIFICATION",null,null,"R_FRR","Fixed Rate Riders",null,{"$f":"IFERROR(SUMIF(RATES!B:B, '21. Bill Impacts'!D74,RATES!H:H),\"\")","v":0.93},1,{"$f":"H74*G74","v":0.93},{"$f":"IFERROR(SUMIF(RATES!B:B,'21. Bill Impacts'!D74,RATES!I:I),\"\")","v":0.69000000000000006},1,{"$f":"K74*J74","v":0.69000000000000006},-0.24,{"$f":"IF(ISERROR(M74/I74), \"\", M74/I74)","v":-0.25806451612903225}]
["RESIDENTIAL SERVICE CLASSIFICATION",null,null,"R_VRR","Volumetric Rate Riders",null,{"$f":"IFERROR(SUMIF(RATES!B:B, '21. Bill Impacts'!D75,RATES!H:H),\"\")","v":-2.0000000000000001E-4},{"$f":"IF($F65>0, $F65, $F64)","v":750},{"$f":"H75*G75","v":-0.15},{"$f":"IFERROR(SUMIF(RATES!B:B,'21. Bill Impacts'!D75,RATES!I:I),\"\")","v":0},{"$f":"IF($F65>0, $F65, $F64)","v":750},{"$f":"K75*J75","v":0},0.15,{"$f":"IF(ISERROR(M75/I75), \"\", M75/I75)","v":-1}]
["RESIDENTIAL SERVICE CLASSIFICATION","ST_A",{"$f":"B15","v":1},null,"Sub-Total A (excluding pass through)",null,null,null,{"$f":"SUM(I72:I75)","v":25.015000000000001},null,null,{"$f":"SUM(L72:L75)","v":24.87},-0.14499999999999957,{"$f":"IF((I76)=0,\"\",(M76/I76))","v":-5.7965220867479336E-3}]
["RESIDENTIAL SERVICE CLASSIFICATION",null,null,null,"Line Losses on Cost of Power",null,{"$f":"IF((F64*12>=150000), 0, IF(F63=\"RPP\",(G91*0.65+G92*0.17+G93*0.18),IF(F63=\"Non-RPP (Retailer)\",G94,G95)))","v":8.1990000000000007E-2},{"$f":"IF(G77=0, 0, $F64*F66-F64)","v":27},{"$f":"H77*G77","v":2.21373},{"$f":"IF((F64*12>=150000), 0, IF(F63=\"RPP\",(J91*0.65+J92*0.17+J93*0.18),IF(F63=\"Non-RPP (Retailer)\",J94,J95)))","v":8.1990000000000007E-2},{"$f":"IF(G77=0, 0, $F64*F66-F64)","v":27},{"$f":"K77*J77","v":2.21373},0,{"$f":"IF(ISERROR(M77/I77), \"\", M77/I77)","v":0}]
["RESIDENTIAL SERVICE CLASSIFICATION",null,null,"R_DVA","Total Deferral/Variance Account Rate Riders",null,{"$f":"IFERROR(SUMIF(RATES!B:B, '21. Bill Impacts'!D78,RATES!H:H),\"\")","v":-7.5000000000000002E-4},{"$f":"IF($F65>0, $F65, $F64)","v":750},{"$f":"H78*G78","v":-0.5625},{"$f":"IFERROR(SUMIF(RATES!B:B,'21. Bill Impacts'!D78,RATES!I:I),\"\")","v":-1.14E-3},{"$f":"IF($F65>0, $F65, $F64)","v":750},{"$f":"K78*J78","v":-0.85499999999999998},-0.29249999999999998,{"$f":"IF(ISERROR(M78/I78), \"\", M78/I78)","v":0.52}]
["RESIDENTIAL SERVICE CLASSIFICATION",null,null,"R_GA","GA Rate Riders"]
["RESIDENTIAL SERVICE CLASSIFICATION",null,null,"R_LV","Low Voltage Service Charge",null,{"$f":"IFERROR(SUMIF(RATES!B:B, '21. Bill Impacts'!D80,RATES!H:H),\"\")","v":2.0000000000000001E-4},{"$f":"IF($F65>0, $F65, $F64)","v":750},{"$f":"H80*G80","v":0.15},{"$f":"IFERROR(SUMIF(RATES!B:B,'21. Bill Impacts'!D80,RATES!I:I),\"\")","v":2.0000000000000001E-4},{"$f":"IF($F65>0, $F65, $F64)","v":750},{"$f":"K80*J80","v":0.15},{"$f":"L80-I80","v":0},{"$f":"IF(ISERROR(M80/I80), \"\", M80/I80)","v":0}]
["RESIDENTIAL SERVICE CLASSIFICATION",null,null,"R_SME","Smart Meter Entity Charge (if applicable) and/or \nany fixed ($) Deferral/Variance Account Rate Riders",null,{"$f":"IFERROR(SUMIF(RATES!B:B, '21. Bill Impacts'!D81,RATES!H:H),\"\")","v":0.56999999999999995},1,{"$f":"H81*G81","v":0.56999999999999995},{"$f":"IFERROR(SUMIF(RATES!B:B,'21. Bill Impacts'!D81,RATES!I:I),\"\")","v":0.56999999999999995},1,{"$f":"K81*J81","v":0.56999999999999995},0,{"$f":"IF(ISERROR(M81/I81), \"\", M81/I81)","v":0}]
["RESIDENTIAL SERVICE CLASSIFICATION","ST_B",{"$f":"B15","v":1},null,"Sub-Total B - Distribution (includes Sub-Total A)",null,null,null,{"$f":"SUM(I76:I81)","v":27.386229999999998},null,null,{"$f":"SUM(L76:L81)","v":26.948730000000001},-0.43749999999999645,{"$f":"IF((I82)=0,\"\",(M82/I82))","v":-1.5975181688023379E-2}]
["RESIDENTIAL SERVICE CLASSIFICATION",null,null,"R_TN","RTSR - Network",null,{"$f":"IFERROR(SUMIF(RATES!B:B, '21. Bill Impacts'!D83,RATES!H:H),\"\")","v":7.6E-3},{"$f":"F64","v":750},{"$f":"H83*G83","v":5.7},{"$f":"IFERROR(SUMIF(RATES!B:B,'21. Bill Impacts'!D83,RATES!I:I),\"\")","v":7.6E-3},{"$f":"H83","v":750},{"$f":"K83*J83","v":5.7},0,{"$f":"IF(ISERROR(M83/I83), \"\", M83/I83)","v":0}]
["RESIDENTIAL SERVICE CLASSIFICATION",null,null,"R_TC","RTSR - Connection and/or Line and Transformation Connection",null,{"$f":"IFERROR(SUMIF(RATES!B:B, '21. Bill Impacts'!D84,RATES!H:H),\"\")","v":7.1000000000000004E-3},{"$f":"H83","v":750},{"$f":"H84*G84","v":5.3250000000000002},{"$f":"IFERROR(SUMIF(RATES!B:B,'21. Bill Impacts'!D84,RATES!I:I),\"\")","v":7.1999999999999998E-3},{"$f":"H84","v":750},{"$f":"K84*J84","v":5.3999999999999995},7.4999999999999289E-2,{"$f":"IF(ISERROR(M84/I84), \"\", M84/I84)","v":1.4084507042253388E-2}]
["RESIDENTIAL SERVICE CLASSIFICATION","ST_C",{"$f":"B15","v":1},null,"Sub-Total C - Delivery (including Sub-Total B)",null,null,null,{"$f":"SUM(I82:I84)","v":38.411230000000003},null,null,{"$f":"SUM(L82:L84)","v":38.048729999999999},-0.36250000000000426,{"$f":"IF((I85)=0,\"\",(M85/I85))","v":-9.4373442350063827E-3}]
["RESIDENTIAL SERVICE CLASSIFICATION",null,null,null,"Wholesale Market Service Charge (WMSC)",null,3.5999999999999999E-3,{"$f":"F64*F66","v":777},{"$f":"H86*G86","v":2.7972000000000001},3.5999999999999999E-3,{"$f":"F64*F66","v":777},{"$f":"K86*J86","v":2.7972000000000001},0,{"$f":"IF(ISERROR(M86/I86), \"\", M86/I86)","v":0}]
["RESIDENTIAL SERVICE CLASSIFICATION",null,null,null,"Rural and Remote Rate Protection (RRRP)",null,2.9999999999999997E-4,{"$f":"F64*F66","v":777},{"$f":"H87*G87","v":0.23309999999999997},2.9999999999999997E-4,{"$f":"F64*F66","v":777},{"$f":"K87*J87","v":0.23309999999999997},0,{"$f":"IF(ISERROR(M87/I87), \"\", M87/I87)","v":0}]
["RESIDENTIAL SERVICE CLASSIFICATION",null,null,null,"Standard Supply Service Charge",null,0.25,1,{"$f":"H88*G88","v":0.25},0.25,1,{"$f":"K88*J88","v":0.25},0,{"$f":"IF(ISERROR(M88/I88), \"\", M88/I88)","v":0}]
["RESIDENTIAL SERVICE CLASSIFICATION",null,null,null,"Debt Retirement Charge (DRC)"]
["RESIDENTIAL SERVICE CLASSIFICATION"]
["RESIDENTIAL SERVICE CLASSIFICATION","RPP",null,null,"TOU - Off Peak",null,6.5000000000000002E-2,{"$f":"IF(AND(F64*12>=150000),0.65*F64*F66,0.65*F64)","v":487.5},{"$f":"H91*G91","v":31.6875},6.5000000000000002E-2,{"$f":"IF(AND(F64*12>=150000),0.65*F64*F67,0.65*F64)","v":487.5},{"$f":"K91*J91","v":31.6875},{"$f":"L91-I91","v":0},{"$f":"IF(ISERROR(M91/I91), \"\", M91/I91)","v":0}]
["RESIDENTIAL SERVICE CLASSIFICATION","RPP",null,null,"TOU - Mid Peak",null,9.4E-2,{"$f":"IF(AND(F64*12>=150000),0.17*F64*F66,0.17*F64)","v":127.50000000000001},{"$f":"H92*G92","v":11.985000000000001},{"$f":"G92","v":9.4E-2},{"$f":"IF(AND(F64*12>=150000),0.17*F64*F67,0.17*F64)","v":127.50000000000001},{"$f":"K92*J92","v":11.985000000000001},{"$f":"L92-I92","v":0},{"$f":"IF(ISERROR(M92/I92), \"\", M92/I92)","v":0}]
["RESIDENTIAL SERVICE CLASSIFICATION","RPP",null,null,"TOU - On Peak",null,0.13200000000000001,{"$f":"IF(AND(F64*12>=150000),0.18*F64*F66,0.18*F64)","v":135},{"$f":"H93*G93","v":17.82},0.13200000000000001,{"$f":"IF(AND(F64*12>=150000),0.18*F64*F67,0.18*F64)","v":135},{"$f":"K93*J93","v":17.82},{"$f":"L93-I93","v":0},{"$f":"IF(ISERROR(M93/I93), \"\", M93/I93)","v":0}]
["RESIDENTIAL SERVICE CLASSIFICATION","Non-RPP (Retailer)",null,null,"Non-RPP Retailer Avg. Price",null,{"$f":"0.1038","v":0.1038},{"$f":"IF(AND(F64*12>=150000),F64*F66,F64)","v":750},{"$f":"H94*G94","v":77.850000000000009},{"$f":"G94","v":0.1038},{"$f":"IF(AND(F64*12>=150000),F64*F67,F64)","v":750},{"$f":"K94*J94","v":77.850000000000009},{"$f":"L94-I94","v":0},{"$f":"IF(ISERROR(M94/I94), \"\", M94/I94)","v":0}]
["RESIDENTIAL SERVICE CLASSIFICATION","Non-RPP (Other)",null,null,"Average IESO Wholesale Market Price",null,{"$f":"G94","v":0.1038},{"$f":"IF(AND(F64*12>=150000),F64*F66,F64)","v":750},{"$f":"H95*G95","v":77.850000000000009},{"$f":"G95","v":0.1038},{"$f":"IF(AND(F64*12>=150000),F64*F67,F64)","v":750},{"$f":"K95*J95","v":77.850000000000009},{"$f":"L95-I95","v":0},{"$f":"IF(ISERROR(M95/I95), \"\", M95/I95)","v":0}]
["RESIDENTIAL SERVICE CLASSIFICATION"]
["RESIDENTIAL SERVICE CLASSIFICATION","RPP_BT",1,null,"Total Bill on TOU (before Taxes)",null,null,null,{"$f":"SUM(I86:I93,I85)","v":103.18402999999999},null,null,{"$f":"SUM(L86:L93,L85)","v":102.82153},{"$f":"L97-I97","v":-0.36249999999999716},{"$f":"IF((I97)=0,\"\",(M97/I97))","v":-3.5131405509166214E-3}]
["RESIDENTIAL SERVICE CLASSIFICATION","RPP",null,null,"HST",null,0.13,null,{"$f":"I97*G98","v":13.4139239},0.13,null,{"$f":"L97*J98","v":13.366798899999999},{"$f":"L98-I98","v":-4.7125000000001194E-2},{"$f":"IF((I98)=0,\"\",(M98/I98))","v":-3.5131405509167377E-3}]
["RESIDENTIAL SERVICE CLASSIFICATION","RPP_NET",1,null,"Total Bill on TOU (before 8% Provincial Rebate)",null,null,null,{"$f":"SUM(I97:I98)","v":116.59795389999999},null,null,{"$f":"SUM(L97:L98)","v":116.18832889999999},{"$f":"SUM(M97:M98)","v":-0.40962499999999835},{"$f":"IF((I99)=0,\"\",(M99/I99))","v":-3.5131405509166349E-3}]
[{"$f":"A98","v":"RESIDENTIAL SERVICE CLASSIFICATION"},"RPP",null,null,"8% Provincial Rebate",null,-0.08,null,{"$f":"I97*G100","v":-8.2547224000000003},{"$f":"G100","v":-0.08},null,{"$f":"L97*J100","v":-8.2257224000000004},{"$f":"L100-I100","v":2.8999999999999915E-2},{"$f":"IF((I100)=0,\"\",(M100/I100))","v":-3.5131405509166384E-3}]
[{"$f":"A100","v":"RESIDENTIAL SERVICE CLASSIFICATION"},"RPP_TOTAL",{"$f":"B15","v":1},null,"Total Bill on TOU",null,null,null,{"$f":"SUM(I97,I98,I100)","v":108.34323149999999},null,null,{"$f":"L97+L98+L100","v":107.96260649999999},{"$f":"L101-I101","v":-0.38062499999999488},{"$f":"IF((I101)=0,\"\",(M101/I101))","v":-3.5131405509166019E-3}]
["RESIDENTIAL SERVICE CLASSIFICATION","RPP"]
["RESIDENTIAL SERVICE CLASSIFICATION","Non-RPP (Retailer)",null,null,"Total Bill on Non-RPP Avg. Price",null,null,null,{"$f":"SUM(I94,I86:I90,I85)","v":119.54153000000001},null,null,{"$f":"SUM(L94,L86:L90,L85)","v":119.17903000000001},{"$f":"L103-I103","v":-0.36249999999999716},{"$f":"IF((I103)=0,\"\",(M103/I103))","v":-3.032418942605111E-3}]
["RESIDENTIAL SERVICE CLASSIFICATION","Non-RPP (Retailer)",null,null,"HST",null,0.13,null,{"$f":"I103*G104","v":15.540398900000001},0.13,null,{"$f":"L103*J104","v":15.493273900000002},{"$f":"L104-I104","v":-4.7124999999999417E-2},{"$f":"IF((I104)=0,\"\",(M104/I104))","v":-3.0324189426050971E-3}]
["RESIDENTIAL SERVICE CLASSIFICATION","Non-RPP (Retailer)",null,null,"Provincial Rebate",null,-0.08,null,{"$f":"I103*G105","v":-9.5633224000000006},{"$f":"G105","v":-0.08},null,{"$f":"L103*J105","v":-9.5343224000000006},{"$f":"L105-I105","v":2.8999999999999915E-2},{"$f":"IF((I105)=0,\"\",(M105/I105))","v":-3.0324189426051257E-3}]
["RESIDENTIAL SERVICE CLASSIFICATION","Non-RPP (Retailer)_TOTAL",null,null,"Total Bill on Non-RPP Avg. Price",null,null,null,{"$f":"SUM(I103,I104,I105)","v":125.5186065},null,null,{"$f":"SUM(L103,L104,L105)","v":125.1379815},{"$f":"L106-I106","v":-0.38062500000000909},{"$f":"IF((I106)=0,\"\",(M106/I106))","v":-3.0324189426052073E-3}]
["RESIDENTIAL SERVICE CLASSIFICATION","Non-RPP (Retailer)"]
["RESIDENTIAL SERVICE CLASSIFICATION","Non-RPP (Other)",null,null,"Total Bill on Average IESO Wholesale Market Price",null,null,null,{"$f":"SUM(I95,I86:I90,I85)","v":119.54153000000001},null,null,{"$f":"SUM(L95,L86:L90,L85)","v":119.17903000000001},{"$f":"L108-I108","v":-0.36249999999999716},{"$f":"IF((I108)=0,\"\",(M108/I108))","v":-3.032418942605111E-3}]
["RESIDENTIAL SERVICE CLASSIFICATION","Non-RPP (Other)",null,null,"HST",null,0.13,null,{"$f":"I108*G109","v":15.540398900000001},0.13,null,{"$f":"L108*J109","v":15.493273900000002},{"$f":"L109-I109","v":-4.7124999999999417E-2},{"$f":"IF((I109)=0,\"\",(M109/I109))","v":-3.0324189426050971E-3}]
["RESIDENTIAL SERVICE CLASSIFICATION","Non-RPP (Other)",null,null,"Provincial Rebate",null,-0.08,null,{"$f":"I108*G110","v":-9.5633224000000006},{"$f":"G110","v":-0.08},null,{"$f":"L108*J110","v":-9.5343224000000006},{"$f":"L110-I110","v":2.8999999999999915E-2},{"$f":"IF((I110)=0,\"\",(M110/I110))","v":-3.0324189426051257E-3}]
["RESIDENTIAL SERVICE CLASSIFICATION","Non-RPP (Other)_TOTAL",null,null,"Total Bill on Average IESO Wholesale Market Price",null,null,null,{"$f":"SUM(I108,I109,I110)","v":125.5186065},null,null,{"$f":"SUM(L108,L109,L110)","v":125.1379815},{"$f":"L111-I111","v":-0.38062500000000909},{"$f":"IF((I111)=0,\"\",(M111/I111))","v":-3.0324189426052073E-3}]
["RESIDENTIAL SERVICE CLASSIFICATION","Non-RPP (Other)"]
[]
[]
[null,null,null,null,"Customer Class:",{"$f":"E16","v":"GENERAL SERVICE LESS THAN 50 kW SERVICE CLASSIFICATION"},null,null,null,null,null,{"$f":"IF(O66=\"DEMAND - INTERVAL\",\"RTSR - INTERVAL METERED\",\"\")","v":""}]
[null,null,null,null,"RPP / Non-RPP:",{"$f":"H16","v":"RPP"}]
[null,null,null,null,"Consumption",{"$f":"K16","v":2000},"kWh"]
[null,null,null,null,"Demand",{"$f":"L16","v":0},"kW"]
[null,null,null,null,"Current Loss Factor",{"$f":"I16","v":1.036}]
[null,null,null,null,"Proposed/Approved Loss Factor",{"$f":"J16","v":1.036}]
[]
[null,null,null,null,null,null,"Current OEB-Approved",null,null,"Proposed",null,null,"Impact"]
[null,null,null,null,null,null,"Rate","Volume","Charge","Rate","Volume","Charge","$ Change","% Change"]
[null,null,null,null,null,null,"($)",null,"($)","($)",null,"($)"]
[{"$f":"F115","v":"GENERAL SERVICE LESS THAN 50 kW SERVICE CLASSIFICATION"},null,null,"GSL_F","Monthly Service Charge",null,{"$f":"IFERROR(SUMIF(RATES!B:B, '21. Bill Impacts'!D125,RATES!H:H),\"\")","v":43.99},1,{"$f":"H125*G125","v":43.99},{"$f":"IFERROR(SUMIF(RATES!B:B,'21. Bill Impacts'!D125,RATES!I:I),\"\")","v":44.39},1,{"$f":"K125*J125","v":44.39},{"$f":"L125-I125","v":0.39999999999999858},{"$f":"IF(ISERROR(M125/I125), \"\", M125/I125)","v":9.0929756762900341E-3}]
[{"$f":"A125","v":"GENERAL SERVICE LESS THAN 50 kW SERVICE CLASSIFICATION"},null,null,"GSL_V","Distribution Volumetric Rate",null,{"$f":"IFERROR(SUMIF(RATES!B:B, '21. Bill Impacts'!D126,RATES!H:H),\"\")","v":1.2800000000000001E-2},{"$f":"IF($F118>0, $F118, $F117)","v":2000},{"$f":"H126*G126","v":25.6},{"$f":"IFERROR(SUMIF(RATES!B:B,'21. Bill Impacts'!D126,RATES!I:I),\"\")","v":1.29E-2},{"$f":"IF($F118>0, $F118, $F117)","v":2000},{"$f":"K126*J126","v":25.8},0.19999999999999929,{"$f":"IF(ISERROR(M126/I126), \"\", M126/I126)","v":7.8124999999999722E-3}]
["GENERAL SERVICE LESS THAN 50 kW SERVICE CLASSIFICATION",null,null,"GSL_FRR","Fixed Rate Riders",null,{"$f":"IFERROR(SUMIF(RATES!B:B, '21. Bill Impacts'!D127,RATES!H:H),\"\")","v":1.7400000000000002},1,{"$f":"H127*G127","v":1.7400000000000002},{"$f":"IFERROR(SUMIF(RATES!B:B,'21. Bill Impacts'!D127,RATES!I:I),\"\")","v":1.2700000000000002},1,{"$f":"K127*J127","v":1.2700000000000002},-0.47,{"$f":"IF(ISERROR(M127/I127), \"\", M127/I127)","v":-0.27011494252873558}]
["GENERAL SERVICE LESS THAN 50 kW SERVICE CLASSIFICATION",null,null,"GSL_VRR","Volumetric Rate Riders",null,{"$f":"IFERROR(SUMIF(RATES!B:B, '21. Bill Impacts'!D128,RATES!H:H),\"\")","v":1E-3},{"$f":"IF($F118>0, $F118, $F117)","v":2000},{"$f":"H128*G128","v":2},{"$f":"IFERROR(SUMIF(RATES!B:B,'21. Bill Impacts'!D128,RATES!I:I),\"\")","v":1.2000000000000001E-3},{"$f":"IF($F118>0, $F118, $F117)","v":2000},{"$f":"K128*J128","v":2.4000000000000004},0.40000000000000036,{"$f":"IF(ISERROR(M128/I128), \"\", M128/I128)","v":0.20000000000000018}]
["GENERAL SERVICE LESS THAN 50 kW SERVICE CLASSIFICATION","ST_A",{"$f":"B16","v":2},null,"Sub-Total A (excluding pass through)",null,null,null,{"$f":"SUM(I125:I128)","v":73.33},null,null,{"$f":"SUM(L125:L128)","v":73.86},0.53000000000000114,{"$f":"IF((I129)=0,\"\",(M129/I129))","v":7.2276012546024972E-3}]
["GENERAL SERVICE LESS THAN 50 kW SERVICE CLASSIFICATION",null,null,null,"Line Losses on Cost of Power",null,{"$f":"IF((F117*12>=150000), 0, IF(F116=\"RPP\",(G144*0.65+G145*0.17+G146*0.18),IF(F116=\"Non-RPP (Retailer)\",G147,G148)))","v":8.1990000000000007E-2},{"$f":"IF(G130=0, 0, $F117*F119-F117)","v":72},{"$f":"H130*G130","v":5.9032800000000005},{"$f":"IF((F117*12>=150000), 0, IF(F116=\"RPP\",(J144*0.65+J145*0.17+J146*0.18),IF(F116=\"Non-RPP (Retailer)\",J147,J148)))","v":8.1990000000000007E-2},{"$f":"IF(G130=0, 0, $F117*F119-F117)","v":72},{"$f":"K130*J130","v":5.9032800000000005},0,{"$f":"IF(ISERROR(M130/I130), \"\", M130/I130)","v":0}]
["GENERAL SERVICE LESS THAN 50 kW SERVICE CLASSIFICATION",null,null,"GSL_DVA","Total Deferral/Variance Account Rate Riders",null,{"$f":"IFERROR(SUMIF(RATES!B:B, '21. Bill Impacts'!D131,RATES!H:H),\"\")","v":-7.5000000000000002E-4},{"$f":"IF($F118>0, $F118, $F117)","v":2000},{"$f":"H131*G131","v":-1.5},{"$f":"IFERROR(SUMIF(RATES!B:B,'21. Bill Impacts'!D131,RATES!I:I),\"\")","v":-1.14E-3},{"$f":"IF($F118>0, $F118, $F117)","v":2000},{"$f":"K131*J131","v":-2.2799999999999998},-0.7799999999999998,{"$f":"IF(ISERROR(M131/I131), \"\", M131/I131)","v":0.51999999999999991}]
["GENERAL SERVICE LESS THAN 50 kW SERVICE CLASSIFICATION",null,null,"GSL_GA","GA Rate Riders"]
["GENERAL SERVICE LESS THAN 50 kW SERVICE CLASSIFICATION",null,null,"GSL_LV","Low Voltage Service Charge",null,{"$f":"IFERROR(SUMIF(RATES!B:B, '21. Bill Impacts'!D133,RATES!H:H),\"\")","v":2.0000000000000001E-4},{"$f":"IF($F118>0, $F118, $F117)","v":2000},{"$f":"H133*G133","v":0.4},{"$f":"IFERROR(SUMIF(RATES!B:B,'21. Bill Impacts'!D133,RATES!I:I),\"\")","v":2.0000000000000001E-4},{"$f":"IF($F118>0, $F118, $F117)","v":2000},{"$f":"K133*J133","v":0.4},{"$f":"L133-I133","v":0},{"$f":"IF(ISERROR(M133/I133), \"\", M133/I133)","v":0}]
["GENERAL SERVICE LESS THAN 50 kW SERVICE CLASSIFICATION",null,null,"GSL_SME","Smart Meter Entity Charge (if applicable) and/or any fixed ($) Deferral/Variance Account Rate Riders",null,{"$f":"IFERROR(SUMIF(RATES!B:B, '21. Bill Impacts'!D134,RATES!H:H),\"\")","v":0.56999999999999995},1,{"$f":"H134*G134","v":0.56999999999999995},{"$f":"IFERROR(SUMIF(RATES!B:B,'21. Bill Impacts'!D134,RATES!I:I),\"\")","v":0.56999999999999995},1,{"$f":"K134*J134","v":0.56999999999999995},0,{"$f":"IF(ISERROR(M134/I134), \"\", M134/I134)","v":0}]
["GENERAL SERVICE LESS THAN 50 kW SERVICE CLASSIFICATION","ST_B",{"$f":"C129","v":2},null,"Sub-Total B - Distribution (includes Sub-Total A)",null,null,null,{"$f":"SUM(I129:I134)","v":78.703279999999992},null,null,{"$f":"SUM(L129:L134)","v":78.453279999999992},-0.25,{"$f":"IF((I135)=0,\"\",(M135/I135))","v":-3.1764876889501942E-3}]
["GENERAL SERVICE LESS THAN 50 kW SERVICE CLASSIFICATION",null,null,"GSL_TN","RTSR - Network",null,{"$f":"IFERROR(SUMIF(RATES!B:B, '21. Bill Impacts'!D136,RATES!H:H),\"\")","v":7.1000000000000004E-3},{"$f":"F117","v":2000},{"$f":"H136*G136","v":14.200000000000001},{"$f":"IFERROR(SUMIF(RATES!B:B,'21. Bill Impacts'!D136,RATES!I:I),\"\")","v":7.1000000000000004E-3},{"$f":"H136","v":2000},{"$f":"K136*J136","v":14.200000000000001},0,{"$f":"IF(ISERROR(M136/I136), \"\", M136/I136)","v":0}]
["GENERAL SERVICE LESS THAN 50 kW SERVICE CLASSIFICATION",null,null,"GSL_TC","RTSR - Connection and/or Line and Transformation Connection",null,{"$f":"IFERROR(SUMIF(RATES!B:B, '21. Bill Impacts'!D137,RATES!H:H),\"\")","v":6.4000000000000003E-3},{"$f":"H136","v":2000},{"$f":"H137*G137","v":12.8},{"$f":"IFERROR(SUMIF(RATES!B:B,'21. Bill Impacts'!D137,RATES!I:I),\"\")","v":6.4999999999999997E-3},{"$f":"H137","v":2000},{"$f":"K137*J137","v":13},0.19999999999999929,{"$f":"IF(ISERROR(M137/I137), \"\", M137/I137)","v":1.5624999999999944E-2}]
["GENERAL SERVICE LESS THAN 50 kW SERVICE CLASSIFICATION","ST_C",{"$f":"C129","v":2},null,"Sub-Total C - Delivery (including Sub-Total B)",null,null,null,{"$f":"SUM(I135:I137)","v":105.70327999999999},null,null,{"$f":"SUM(L135:L137)","v":105.65328},-4.9999999999997158E-2,{"$f":"IF((I138)=0,\"\",(M138/I138))","v":-4.7302221842119907E-4}]
["GENERAL SERVICE LESS THAN 50 kW SERVICE CLASSIFICATION",null,null,null,"Wholesale Market Service Charge (WMSC)",null,3.5999999999999999E-3,{"$f":"F117*F119","v":2072},{"$f":"H139*G139","v":7.4592000000000001},3.5999999999999999E-3,{"$f":"F117*F119","v":2072},{"$f":"K139*J139","v":7.4592000000000001},0,{"$f":"IF(ISERROR(M139/I139), \"\", M139/I139)","v":0}]
["GENERAL SERVICE LESS THAN 50 kW SERVICE CLASSIFICATION",null,null,null,"Rural and Remote Rate Protection (RRRP)",null,2.9999999999999997E-4,{"$f":"F117*F119","v":2072},{"$f":"H140*G140","v":0.62159999999999993},2.9999999999999997E-4,{"$f":"F117*F119","v":2072},{"$f":"K140*J140","v":0.62159999999999993},0,{"$f":"IF(ISERROR(M140/I140), \"\", M140/I140)","v":0}]
["GENERAL SERVICE LESS THAN 50 kW SERVICE CLASSIFICATION",null,null,null,"Standard Supply Service Charge",null,0.25,1,{"$f":"H141*G141","v":0.25},0.25,1,{"$f":"K141*J141","v":0.25},0,{"$f":"IF(ISERROR(M141/I141), \"\", M141/I141)","v":0}]
["GENERAL SERVICE LESS THAN 50 kW SERVICE CLASSIFICATION",null,null,null,"Debt Retirement Charge (DRC)",null,7.0000000000000001E-3,{"$f":"F117","v":2000},{"$f":"H142*G142","v":14},0,{"$f":"F117","v":2000},{"$f":"K142*J142","v":0},-14,{"$f":"IF(ISERROR(M142/I142), \"\", M142/I142)","v":-1}]
["GENERAL SERVICE LESS THAN 50 kW SERVICE CLASSIFICATION"]
["GENERAL SERVICE LESS THAN 50 kW SERVICE CLASSIFICATION","RPP",null,null,"TOU - Off Peak",null,6.5000000000000002E-2,{"$f":"IF(AND(F117*12>=150000),0.65*F117*F119,0.65*F117)","v":1300},{"$f":"H144*G144","v":84.5},6.5000000000000002E-2,{"$f":"IF(AND(F117*12>=150000),0.65*F117*F120,0.65*F117)","v":1300},{"$f":"K144*J144","v":84.5},{"$f":"L144-I144","v":0},{"$f":"IF(ISERROR(M144/I144), \"\", M144/I144)","v":0}]
["GENERAL SERVICE LESS THAN 50 kW SERVICE CLASSIFICATION","RPP",null,null,"TOU - Mid Peak",null,{"$f":"G92","v":9.4E-2},{"$f":"IF(AND(F117*12>=150000),0.17*F117*F119,0.17*F117)","v":340},{"$f":"H145*G145","v":31.96},{"$f":"G145","v":9.4E-2},{"$f":"IF(AND(F117*12>=150000),0.17*F117*F120,0.17*F117)","v":340},{"$f":"K145*J145","v":31.96},{"$f":"L145-I145","v":0},{"$f":"IF(ISERROR(M145/I145), \"\", M145/I145)","v":0}]
["GENERAL SERVICE LESS THAN 50 kW SERVICE CLASSIFICATION","RPP",null,null,"TOU - On Peak",null,0.13200000000000001,{"$f":"IF(AND(F117*12>=150000),0.18*F117*F119,0.18*F117)","v":360},{"$f":"H146*G146","v":47.52},0.13200000000000001,{"$f":"IF(AND(F117*12>=150000),0.18*F117*F120,0.18*F117)","v":360},{"$f":"K146*J146","v":47.52},{"$f":"L146-I146","v":0},{"$f":"IF(ISERROR(M146/I146), \"\", M146/I146)","v":0}]
["GENERAL SERVICE LESS THAN 50 kW SERVICE CLASSIFICATION","Non-RPP (Retailer)",null,null,"Non-RPP Retailer Avg. Price",null,{"$f":"0.1038","v":0.1038},{"$f":"IF(AND(F117*12>=150000),F117*F119,F117)","v":2000},{"$f":"H147*G147","v":207.6},{"$f":"G147","v":0.1038},{"$f":"IF(AND(F117*12>=150000),F117*F120,F117)","v":2000},{"$f":"K147*J147","v":207.6},{"$f":"L147-I147","v":0},{"$f":"IF(ISERROR(M147/I147), \"\", M147/I147)","v":0}]
["GENERAL SERVICE LESS THAN 50 kW SERVICE CLASSIFICATION","Non-RPP (Other)",null,null,"Average IESO Wholesale Market Price",null,{"$f":"G147","v":0.1038},{"$f":"IF(AND(F117*12>=150000),F117*F119,F117)","v":2000},{"$f":"H148*G148","v":207.6},{"$f":"G148","v":0.1038},{"$f":"IF(AND(F117*12>=150000),F117*F120,F117)","v":2000},{"$f":"K148*J148","v":207.6},{"$f":"L148-I148","v":0},{"$f":"IF(ISERROR(M148/I148), \"\", M148/I148)","v":0}]
["GENERAL SERVICE LESS THAN 50 kW SERVICE CLASSIFICATION"]
["GENERAL SERVICE LESS THAN 50 kW SERVICE CLASSIFICATION","RPP_BT",2,null,"Total Bill on TOU (before Taxes)",null,null,null,{"$f":"SUM(I139:I146,I138)","v":292.01407999999998},null,null,{"$f":"SUM(L139:L146,L138)","v":277.96407999999997},{"$f":"L150-I150","v":-14.050000000000011},{"$f":"IF((I150)=0,\"\",(M150/I150))","v":-4.8114118332924262E-2}]
["GENERAL SERVICE LESS THAN 50 kW SERVICE CLASSIFICATION","RPP",null,null,"HST",null,0.13,null,{"$f":"I150*G151","v":37.961830399999997},0.13,null,{"$f":"L150*J151","v":36.135330399999994},{"$f":"L151-I151","v":-1.8265000000000029},{"$f":"IF((I151)=0,\"\",(M151/I151))","v":-4.8114118332924304E-2}]
["GENERAL SERVICE LESS THAN 50 kW SERVICE CLASSIFICATION","RPP_NET",2,null,"Total Bill on TOU (before 8% Provincial Rebate)",null,null,null,{"$f":"SUM(I150:I151)","v":329.97591039999998},null,null,{"$f":"SUM(L150:L151)","v":314.09941039999995},{"$f":"SUM(M150:M151)","v":-15.876500000000014},{"$f":"IF((I152)=0,\"\",(M152/I152))","v":-4.8114118332924269E-2}]
[{"$f":"A151","v":"GENERAL SERVICE LESS THAN 50 kW SERVICE CLASSIFICATION"},"RPP",null,null,"8% Provincial Rebate",null,-0.08,null,{"$f":"I150*G153","v":-23.3611264},{"$f":"G153","v":-0.08},null,{"$f":"L150*J153","v":-22.237126399999998},{"$f":"L153-I153","v":1.1240000000000023},{"$f":"IF((I153)=0,\"\",(M153/I153))","v":-4.8114118332924317E-2}]
[{"$f":"A153","v":"GENERAL SERVICE LESS THAN 50 kW SERVICE CLASSIFICATION"},"RPP_TOTAL",{"$f":"C129","v":2},null,"Total Bill on TOU",null,null,null,{"$f":"SUM(I150,I151,I153)","v":306.61478399999999},null,null,{"$f":"L150+L151+L153","v":291.86228399999993},{"$f":"L154-I154","v":-14.752500000000055},{"$f":"IF((I154)=0,\"\",(M154/I154))","v":-4.8114118332924401E-2}]
["GENERAL SERVICE LESS THAN 50 kW SERVICE CLASSIFICATION","RPP"]
["GENERAL SERVICE LESS THAN 50 kW SERVICE CLASSIFICATION","Non-RPP (Retailer)",null,null,"Total Bill on Non-RPP Avg. Price",null,null,null,{"$f":"SUM(I147,I139:I143,I138)","v":335.63407999999998},null,null,{"$f":"SUM(L147,L139:L143,L138)","v":321.58407999999997},{"$f":"L156-I156","v":-14.050000000000011},{"$f":"IF((I156)=0,\"\",(M156/I156))","v":-4.1861064883518422E-2}]
["GENERAL SERVICE LESS THAN 50 kW SERVICE CLASSIFICATION","Non-RPP (Retailer)",null,null,"HST",null,0.13,null,{"$f":"I156*G157","v":43.632430399999997},0.13,null,{"$f":"L156*J157","v":41.805930400000001},{"$f":"L157-I157","v":-1.8264999999999958},{"$f":"IF((I157)=0,\"\",(M157/I157))","v":-4.186106488351829E-2}]
["GENERAL SERVICE LESS THAN 50 kW SERVICE CLASSIFICATION","Non-RPP (Retailer)",null,null,"Provincial Rebate",null,-0.08,null,{"$f":"I156*G158","v":-26.850726399999999},{"$f":"G158","v":-0.08},null,{"$f":"L156*J158","v":-25.726726399999997},{"$f":"L158-I158","v":1.1240000000000023},{"$f":"IF((I158)=0,\"\",(M158/I158))","v":-4.186106488351847E-2}]
["GENERAL SERVICE LESS THAN 50 kW SERVICE CLASSIFICATION","Non-RPP (Retailer)_TOTAL",null,null,"Total Bill on Non-RPP Avg. Price",null,null,null,{"$f":"SUM(I156,I157,I158)","v":352.41578399999997},null,null,{"$f":"SUM(L156,L157,L158)","v":337.66328399999998},{"$f":"L159-I159","v":-14.752499999999998},{"$f":"IF((I159)=0,\"\",(M159/I159))","v":-4.186106488351838E-2}]
["GENERAL SERVICE LESS THAN 50 kW SERVICE CLASSIFICATION","Non-RPP (Retailer)"]
["GENERAL SERVICE LESS THAN 50 kW SERVICE CLASSIFICATION","Non-RPP (Other)",null,null,"Total Bill on Average IESO Wholesale Market Price",null,null,null,{"$f":"SUM(I148,I139:I143,I138)","v":335.63407999999998},null,null,{"$f":"SUM(L148,L139:L143,L138)","v":321.58407999999997},{"$f":"L161-I161","v":-14.050000000000011},{"$f":"IF((I161)=0,\"\",(M161/I161))","v":-4.1861064883518422E-2}]
["GENERAL SERVICE LESS THAN 50 kW SERVICE CLASSIFICATION","Non-RPP (Other)",null,null,"HST",null,0.13,null,{"$f":"I161*G162","v":43.632430399999997},0.13,null,{"$f":"L161*J162","v":41.805930400000001},{"$f":"L162-I162","v":-1.8264999999999958},{"$f":"IF((I162)=0,\"\",(M162/I162))","v":-4.186106488351829E-2}]
["GENERAL SERVICE LESS THAN 50 kW SERVICE CLASSIFICATION","Non-RPP (Other)",null,null,"Provincial Rebate",null,-0.08,null,{"$f":"I161*G163","v":-26.850726399999999},{"$f":"G163","v":-0.08},null,{"$f":"L161*J163","v":-25.726726399999997},{"$f":"L163-I163","v":1.1240000000000023},{"$f":"IF((I163)=0,\"\",(M163/I163))","v":-4.186106488351847E-2}]
["GENERAL SERVICE LESS THAN 50 kW SERVICE CLASSIFICATION","Non-RPP (Other)_TOTAL",null,null,"Total Bill on Average IESO Wholesale Market Price",null,null,null,{"$f":"SUM(I161,I162,I163)","v":352.41578399999997},null,null,{"$f":"SUM(L161,L162,L163)","v":337.66328399999998},{"$f":"L164-I164","v":-14.752499999999998},{"$f":"IF((I164)=0,\"\",(M164/I164))","v":-4.186106488351838E-2}]
["GENERAL SERVICE LESS THAN 50 kW SERVICE CLASSIFICATION","Non-RPP (Other)"]
[]
[]
[null,null,null,null,"Customer Class:",{"$f":"E17","v":"GENERAL SERVICE 50 to 499 kW SERVICE CLASSIFICATION"},null,null,null,null,null,{"$f":"IF(O119=\"DEMAND - INTERVAL\",\"RTSR - INTERVAL METERED\",\"\")","v":""}]
[null,null,null,null,"RPP / Non-RPP:",{"$f":"H17","v":"Non-RPP (Other)"}]
[null,null,null,null,"Consumption",{"$f":"K17","v":100000},"kWh"]
[null,null,null,null,"Demand",{"$f":"L17","v":230},"kW"]
[null,null,null,null,"Current Loss Factor",{"$f":"I17","v":1.036}]
[null,null,null,null,"Proposed/Approved Loss Factor",{"$f":"J17","v":1.036}]
[]
[null,null,null,null,null,null,"Current OEB-Approved",null,null,"Proposed",null,null,"Impact"]
[null,null,null,null,null,null,"Rate","Volume","Charge","Rate","Volume","Charge","$ Change","% Change"]
[null,null,null,null,null,null,"($)",null,"($)","($)",null,"($)"]
[{"$f":"F168","v":"GENERAL SERVICE 50 to 499 kW SERVICE CLASSIFICATION"},null,null,"GS50_499_F","Monthly Service Charge",null,{"$f":"IFERROR(SUMIF(RATES!B:B, '21. Bill Impacts'!D178,RATES!H:H),\"\")","v":77.48},1,{"$f":"H178*G178","v":77.48},{"$f":"IFERROR(SUMIF(RATES!B:B,'21. Bill Impacts'!D178,RATES!I:I),\"\")","v":78.180000000000007},1,{"$f":"K178*J178","v":78.180000000000007},{"$f":"L178-I178","v":0.70000000000000284},{"$f":"IF(ISERROR(M178/I178), \"\", M178/I178)","v":9.0345895715023602E-3}]
[{"$f":"A178","v":"GENERAL SERVICE 50 to 499 kW SERVICE CLASSIFICATION"},null,null,"GS50_499_V","Distribution Volumetric Rate",null,{"$f":"IFERROR(SUMIF(RATES!B:B, '21. Bill Impacts'!D179,RATES!H:H),\"\")","v":4.6628999999999996},{"$f":"IF($F171>0, $F171, $F170)","v":230},{"$f":"H179*G179","v":1072.4669999999999},{"$f":"IFERROR(SUMIF(RATES!B:B,'21. Bill Impacts'!D179,RATES!I:I),\"\")","v":4.7049000000000003},{"$f":"IF($F171>0, $F171, $F170)","v":230},{"$f":"K179*J179","v":1082.1270000000002},9.6600000000003092,{"$f":"IF(ISERROR(M179/I179), \"\", M179/I179)","v":9.0072701537672589E-3}]
["GENERAL SERVICE 50 to 499 kW SERVICE CLASSIFICATION",null,null,"GS50_499_FRR","Fixed Rate Riders",null,{"$f":"IFERROR(SUMIF(RATES!B:B, '21. Bill Impacts'!D180,RATES!H:H),\"\")","v":5.2799999999999994},1,{"$f":"H180*G180","v":5.2799999999999994},{"$f":"IFERROR(SUMIF(RATES!B:B,'21. Bill Impacts'!D180,RATES!I:I),\"\")","v":2.23},1,{"$f":"K180*J180","v":2.23},-3.0499999999999994,{"$f":"IF(ISERROR(M180/I180), \"\", M180/I180)","v":-0.57765151515151514}]
["GENERAL SERVICE 50 to 499 kW SERVICE CLASSIFICATION",null,null,"GS50_499_VRR","Volumetric Rate Riders",null,{"$f":"IFERROR(SUMIF(RATES!B:B, '21. Bill Impacts'!D181,RATES!H:H),\"\")","v":0.60560000000000003},{"$f":"IF($F171>0, $F171, $F170)","v":230},{"$f":"H181*G181","v":139.28800000000001},{"$f":"IFERROR(SUMIF(RATES!B:B,'21. Bill Impacts'!D181,RATES!I:I),\"\")","v":0.78770000000000007},{"$f":"IF($F171>0, $F171, $F170)","v":230},{"$f":"K181*J181","v":181.17100000000002},41.88300000000001,{"$f":"IF(ISERROR(M181/I181), \"\", M181/I181)","v":0.30069352708058128}]
["GENERAL SERVICE 50 to 499 kW SERVICE CLASSIFICATION","ST_A",{"$f":"B17","v":3},null,"Sub-Total A (excluding pass through)",null,null,null,{"$f":"SUM(I178:I181)","v":1294.5149999999999},null,null,{"$f":"SUM(L178:L181)","v":1343.7080000000003},49.193000000000438,{"$f":"IF((I182)=0,\"\",(M182/I182))","v":3.8001104660819261E-2}]
["GENERAL SERVICE 50 to 499 kW SERVICE CLASSIFICATION",null,null,null,"Line Losses on Cost of Power",null,{"$f":"IF((F170*12>=150000), 0, IF(F169=\"RPP\",(G197*0.65+G198*0.17+G199*0.18),IF(F169=\"Non-RPP (Retailer)\",G200,G201)))","v":0},{"$f":"IF(G183=0, 0, $F170*F172-F170)","v":0},{"$f":"H183*G183","v":0},{"$f":"IF((F170*12>=150000), 0, IF(F169=\"RPP\",(J197*0.65+J198*0.17+J199*0.18),IF(F169=\"Non-RPP (Retailer)\",J200,J201)))","v":0},{"$f":"IF(G183=0, 0, $F170*F172-F170)","v":0},{"$f":"K183*J183","v":0},0,{"$f":"IF(ISERROR(M183/I183), \"\", M183/I183)","v":""}]
["GENERAL SERVICE 50 to 499 kW SERVICE CLASSIFICATION",null,null,"GS50_499_DVA","Total Deferral/Variance Account Rate Riders",null,{"$f":"IFERROR(SUMIF(RATES!B:B, '21. Bill Impacts'!D184,RATES!H:H),\"\")","v":-0.26935999999999999},{"$f":"IF($F171>0, $F171, $F170)","v":230},{"$f":"H184*G184","v":-61.952799999999996},{"$f":"IFERROR(SUMIF(RATES!B:B,'21. Bill Impacts'!D184,RATES!I:I),\"\")","v":-0.39659},{"$f":"IF($F171>0, $F171, $F170)","v":230},{"$f":"K184*J184","v":-91.215699999999998},-29.262900000000002,{"$f":"IF(ISERROR(M184/I184), \"\", M184/I184)","v":0.47234184734184742}]
["GENERAL SERVICE 50 to 499 kW SERVICE CLASSIFICATION",null,null,"GS50_499_GA","GA Rate Riders",null,{"$f":"IFERROR(SUMIF(RATES!B:B, '21. Bill Impacts'!D185,RATES!H:H),\"\")","v":-5.0000000000000001E-4},{"$f":"F170","v":100000},{"$f":"H185*G185","v":-50},{"$f":"IFERROR(SUMIF(RATES!B:B,'21. Bill Impacts'!D185,RATES!I:I),\"\")","v":1.1999999999999999E-3},{"$f":"K195","v":100000},{"$f":"K185*J185","v":119.99999999999999},170,{"$f":"IF(ISERROR(M185/I185), \"\", M185/I185)","v":-3.4}]
["GENERAL SERVICE 50 to 499 kW SERVICE CLASSIFICATION",null,null,"GS50_499_LV","Low Voltage Service Charge",null,{"$f":"IFERROR(SUMIF(RATES!B:B, '21. Bill Impacts'!D186,RATES!H:H),\"\")","v":8.0199999999999994E-2},{"$f":"IF($F171>0, $F171, $F170)","v":230},{"$f":"H186*G186","v":18.445999999999998},{"$f":"IFERROR(SUMIF(RATES!B:B,'21. Bill Impacts'!D186,RATES!I:I),\"\")","v":8.0199999999999994E-2},{"$f":"IF($F171>0, $F171, $F170)","v":230},{"$f":"K186*J186","v":18.445999999999998},0,{"$f":"IF(ISERROR(M186/I186), \"\", M186/I186)","v":0}]
["GENERAL SERVICE 50 to 499 kW SERVICE CLASSIFICATION",null,null,null,"Smart Meter Entity Charge (if applicable) and/or any fixed ($) Deferral/Variance Account Rate Riders",null,{"$f":"IFERROR(SUMIF(RATES!B:B, '21. Bill Impacts'!D187,RATES!H:H),\"\")","v":0},1,{"$f":"H187*G187","v":0},0,1,{"$f":"K187*J187","v":0},0,{"$f":"IF(ISERROR(M187/I187), \"\", M187/I187)","v":""}]
["GENERAL SERVICE 50 to 499 kW SERVICE CLASSIFICATION","ST_B",{"$f":"C182","v":3},null,"Sub-Total B - Distribution (includes Sub-Total A)",null,null,null,{"$f":"SUM(I182:I187)","v":1201.0081999999998},null,null,{"$f":"SUM(L182:L187)","v":1390.9383000000003},189.93010000000049,{"$f":"IF((I188)=0,\"\",(M188/I188))","v":0.15814221751358612}]
["GENERAL SERVICE 50 to 499 kW SERVICE CLASSIFICATION",null,null,"GS50_499_TN","RTSR - Network",null,{"$f":"IFERROR(SUMIF(RATES!B:B, '21. Bill Impacts'!D189,RATES!H:H),\"\")","v":2.7324999999999999},{"$f":"IF($F171>0, $F171, $F170*$F172)","v":230},{"$f":"H189*G189","v":628.47500000000002},{"$f":"IFERROR(SUMIF(RATES!B:B,'21. Bill Impacts'!D189,RATES!I:I),\"\")","v":2.7452999999999999},{"$f":"IF($F171>0, $F171, $F170*$F172)","v":230},{"$f":"K189*J189","v":631.41899999999998},2.94399999999996,{"$f":"IF(ISERROR(M189/I189), \"\", M189/I189)","v":4.6843549862762403E-3}]
["GENERAL SERVICE 50 to 499 kW SERVICE CLASSIFICATION",null,null,"GS50_499_TC","RTSR - Connection and/or Line and Transformation Connection",null,{"$f":"IFERROR(SUMIF(RATES!B:B, '21. Bill Impacts'!D190,RATES!H:H),\"\")","v":2.5347},{"$f":"IF($F171>0, $F171, $F170*$F172)","v":230},{"$f":"H190*G190","v":582.98099999999999},{"$f":"IFERROR(SUMIF(RATES!B:B,'21. Bill Impacts'!D190,RATES!I:I),\"\")","v":2.5771000000000002},{"$f":"IF($F171>0, $F171, $F170*$F172)","v":230},{"$f":"K190*J190","v":592.73300000000006},9.7520000000000664,{"$f":"IF(ISERROR(M190/I190), \"\", M190/I190)","v":1.6727817887718582E-2}]
["GENERAL SERVICE 50 to 499 kW SERVICE CLASSIFICATION","ST_C",{"$f":"C182","v":3},null,"Sub-Total C - Delivery (including Sub-Total B)",null,null,null,{"$f":"SUM(I188:I190)","v":2412.4641999999994},null,null,{"$f":"SUM(L188:L190)","v":2615.0903000000003},202.62610000000086,{"$f":"IF((I191)=0,\"\",(M191/I191))","v":8.3991339643506802E-2}]
["GENERAL SERVICE 50 to 499 kW SERVICE CLASSIFICATION",null,null,null,"Wholesale Market Service Charge (WMSC)",null,3.5999999999999999E-3,{"$f":"F170*F172","v":103600},{"$f":"H192*G192","v":372.96},3.5999999999999999E-3,{"$f":"F170*F172","v":103600},{"$f":"K192*J192","v":372.96},0,{"$f":"IF(ISERROR(M192/I192), \"\", M192/I192)","v":0}]
["GENERAL SERVICE 50 to 499 kW SERVICE CLASSIFICATION",null,null,null,"Rural and Remote Rate Protection (RRRP)",null,2.9999999999999997E-4,{"$f":"F170*F172","v":103600},{"$f":"H193*G193","v":31.08},2.9999999999999997E-4,{"$f":"F170*F172","v":103600},{"$f":"K193*J193","v":31.08},0,{"$f":"IF(ISERROR(M193/I193), \"\", M193/I193)","v":0}]
["GENERAL SERVICE 50 to 499 kW SERVICE CLASSIFICATION",null,null,null,"Standard Supply Service Charge",null,0.25,null,{"$f":"H194*G194","v":0},0.25,null,{"$f":"K194*J194","v":0},0,{"$f":"IF(ISERROR(M194/I194), \"\", M194/I194)","v":""}]
["GENERAL SERVICE 50 to 499 kW SERVICE CLASSIFICATION",null,null,null,"Debt Retirement Charge (DRC)",null,7.0000000000000001E-3,{"$f":"F170","v":100000},{"$f":"H195*G195","v":700},0,{"$f":"F170","v":100000},{"$f":"K195*J195","v":0},-700,{"$f":"IF(ISERROR(M195/I195), \"\", M195/I195)","v":-1}]
["GENERAL SERVICE 50 to 499 kW SERVICE CLASSIFICATION"]
["GENERAL SERVICE 50 to 499 kW SERVICE CLASSIFICATION","RPP",null,null,"TOU - Off Peak",null,6.5000000000000002E-2,{"$f":"IF(AND(F170*12>=150000),0.65*F170*F172,0.65*F170)","v":67340},{"$f":"H197*G197","v":4377.1000000000004},6.5000000000000002E-2,{"$f":"IF(AND(F170*12>=150000),0.65*F170*F173,0.65*F170)","v":67340},{"$f":"K197*J197","v":4377.1000000000004},{"$f":"L197-I197","v":0},{"$f":"IF(ISERROR(M197/I197), \"\", M197/I197)","v":0}]
["GENERAL SERVICE 50 to 499 kW SERVICE CLASSIFICATION","RPP",null,null,"TOU - Mid Peak",null,{"$f":"G92","v":9.4E-2},{"$f":"IF(AND(F170*12>=150000),0.17*F170*F172,0.17*F170)","v":17612},{"$f":"H198*G198","v":1655.528},{"$f":"G198","v":9.4E-2},{"$f":"IF(AND(F170*12>=150000),0.17*F170*F173,0.17*F170)","v":17612},{"$f":"K198*J198","v":1655.528},{"$f":"L198-I198","v":0},{"$f":"IF(ISERROR(M198/I198), \"\", M198/I198)","v":0}]
["GENERAL SERVICE 50 to 499 kW SERVICE CLASSIFICATION","RPP",null,null,"TOU - On Peak",null,0.13200000000000001,{"$f":"IF(AND(F170*12>=150000),0.18*F170*F172,0.18*F170)","v":18648},{"$f":"H199*G199","v":2461.5360000000001},0.13200000000000001,{"$f":"IF(AND(F170*12>=150000),0.18*F170*F173,0.18*F170)","v":18648},{"$f":"K199*J199","v":2461.5360000000001},{"$f":"L199-I199","v":0},{"$f":"IF(ISERROR(M199/I199), \"\", M199/I199)","v":0}]
["GENERAL SERVICE 50 to 499 kW SERVICE CLASSIFICATION","Non-RPP (Retailer)",null,null,"Non-RPP Retailer Avg. Price",null,{"$f":"0.1038","v":0.1038},{"$f":"IF(AND(F170*12>=150000),F170*F172,F170)","v":103600},{"$f":"H200*G200","v":10753.68},{"$f":"G200","v":0.1038},{"$f":"IF(AND(F170*12>=150000),F170*F173,F170)","v":103600},{"$f":"K200*J200","v":10753.68},{"$f":"L200-I200","v":0},{"$f":"IF(ISERROR(M200/I200), \"\", M200/I200)","v":0}]
["GENERAL SERVICE 50 to 499 kW SERVICE CLASSIFICATION","Non-RPP (Other)",null,null,"Average IESO Wholesale Market Price",null,0.1038,{"$f":"IF(AND(F170*12>=150000),F170*F172,F170)","v":103600},{"$f":"H201*G201","v":10753.68},{"$f":"G201","v":0.1038},{"$f":"IF(AND(F170*12>=150000),F170*F173,F170)","v":103600},{"$f":"K201*J201","v":10753.68},{"$f":"L201-I201","v":0},{"$f":"IF(ISERROR(M201/I201), \"\", M201/I201)","v":0}]
["GENERAL SERVICE 50 to 499 kW SERVICE CLASSIFICATION"]
["GENERAL SERVICE 50 to 499 kW SERVICE CLASSIFICATION","RPP",null,null,"Total Bill on TOU (before Taxes)",null,null,null,{"$f":"SUM(I192:I199,I191)","v":12010.6682},null,null,{"$f":"SUM(L192:L199,L191)","v":11513.294300000001},{"$f":"L203-I203","v":-497.37389999999868},{"$f":"IF((I203)=0,\"\",(M203/I203))","v":-4.1411009921995735E-2}]
["GENERAL SERVICE 50 to 499 kW SERVICE CLASSIFICATION","RPP",null,null,"HST",null,0.13,null,{"$f":"I203*G204","v":1561.3868660000001},0.13,null,{"$f":"L203*J204","v":1496.7282590000002},{"$f":"L204-I204","v":-64.658606999999847},{"$f":"IF((I204)=0,\"\",(M204/I204))","v":-4.1411009921995749E-2}]
["GENERAL SERVICE 50 to 499 kW SERVICE CLASSIFICATION","RPP",null,null,"8% Provincial Rebate",null,-0.08,null,{"$f":"I203*G205","v":-960.85345600000005},{"$f":"G205","v":-0.08},null,{"$f":"L203*J205","v":-921.06354400000009},{"$f":"L205-I205","v":39.789911999999958},{"$f":"IF((I205)=0,\"\",(M205/I205))","v":-4.1411009921995805E-2}]
["GENERAL SERVICE 50 to 499 kW SERVICE CLASSIFICATION","RPP_TOTAL",null,null,"Total Bill on TOU",null,null,null,{"$f":"SUM(I203,I204,I205)","v":12611.20161},null,null,{"$f":"L203+L204+L205","v":12088.959015},{"$f":"L206-I206","v":-522.24259499999971},{"$f":"IF((I206)=0,\"\",(M206/I206))","v":-4.1411009921995826E-2}]
["GENERAL SERVICE 50 to 499 kW SERVICE CLASSIFICATION","RPP"]
["GENERAL SERVICE 50 to 499 kW SERVICE CLASSIFICATION","Non-RPP (Retailer)",null,null,"Total Bill on Non-RPP Avg. Price",null,null,null,{"$f":"SUM(I200,I192:I196,I191)","v":14270.1842},null,null,{"$f":"SUM(L200,L192:L196,L191)","v":13772.810299999999},{"$f":"L208-I208","v":-497.3739000000005},{"$f":"IF((I208)=0,\"\",(M208/I208))","v":-3.4854063061078112E-2}]
["GENERAL SERVICE 50 to 499 kW SERVICE CLASSIFICATION","Non-RPP (Retailer)",null,null,"HST",null,0.13,null,{"$f":"I208*G209","v":1855.1239459999999},0.13,null,{"$f":"L208*J209","v":1790.4653389999999},{"$f":"L209-I209","v":-64.658607000000075},{"$f":"IF((I209)=0,\"\",(M209/I209))","v":-3.4854063061078119E-2}]
["GENERAL SERVICE 50 to 499 kW SERVICE CLASSIFICATION","Non-RPP (Retailer)",null,null,"8% Provincial Rebate",null,-0.08,null,{"$f":"I208*G210","v":-1141.614736},{"$f":"G210","v":-0.08},null,{"$f":"L208*J210","v":-1101.824824},{"$f":"L210-I210","v":39.789911999999958},{"$f":"IF((I210)=0,\"\",(M210/I210))","v":-3.4854063061078043E-2}]
["GENERAL SERVICE 50 to 499 kW SERVICE CLASSIFICATION","Non-RPP (Retailer)_TOTAL",null,null,"Total Bill on Non-RPP Avg. Price",null,null,null,{"$f":"SUM(I208,I209,I210)","v":14983.69341},null,null,{"$f":"SUM(L208,L209,L210)","v":14461.450815},{"$f":"L211-I211","v":-522.24259499999971},{"$f":"IF((I211)=0,\"\",(M211/I211))","v":-3.4854063061078057E-2}]
["GENERAL SERVICE 50 to 499 kW SERVICE CLASSIFICATION","Non-RPP (Retailer)"]
["GENERAL SERVICE 50 to 499 kW SERVICE CLASSIFICATION","Non-RPP (Other)_BT",3,null,"Total Bill on Average IESO Wholesale Market Price",null,null,null,{"$f":"SUM(I201,I192:I196,I191)","v":14270.1842},null,null,{"$f":"SUM(L201,L192:L196,L191)","v":13772.810299999999},{"$f":"L213-I213","v":-497.3739000000005},{"$f":"IF((I213)=0,\"\",(M213/I213))","v":-3.4854063061078112E-2}]
["GENERAL SERVICE 50 to 499 kW SERVICE CLASSIFICATION","Non-RPP (Other)",null,null,"HST",null,0.13,null,{"$f":"I213*G214","v":1855.1239459999999},0.13,null,{"$f":"L213*J214","v":1790.4653389999999},{"$f":"L214-I214","v":-64.658607000000075},{"$f":"IF((I214)=0,\"\",(M214/I214))","v":-3.4854063061078119E-2}]
["GENERAL SERVICE 50 to 499 kW SERVICE CLASSIFICATION","Non-RPP (Other)_NET",3,null,"Total Bill on Average IESO WMP (before 8% Provincial Rebate)",null,null,null,{"$f":"SUM(I213:I214)","v":16125.308145999999},null,null,{"$f":"SUM(L213:L214)","v":15563.275639},{"$f":"SUM(M213:M214)","v":-562.03250700000058},{"$f":"IF((I215)=0,\"\",(M215/I215))","v":-3.4854063061078112E-2}]
[{"$f":"A214","v":"GENERAL SERVICE 50 to 499 kW SERVICE CLASSIFICATION"},"Non-RPP (Other)",null,null,"8% Provincial Rebate",null,0,null,{"$f":"I213*G216","v":0},{"$f":"G216","v":0},null,{"$f":"L213*J216","v":0},{"$f":"L216-I216","v":0},{"$f":"IF((I216)=0,\"\",(M216/I216))","v":""}]
[{"$f":"A216","v":"GENERAL SERVICE 50 to 499 kW SERVICE CLASSIFICATION"},"Non-RPP (Other)_TOTAL",{"$f":"C182","v":3},null,"Total Bill on Average IESO Wholesale Market Price",null,null,null,{"$f":"SUM(I213,I214,I216)","v":16125.308145999999},null,null,{"$f":"SUM(L213,L214,L216)","v":15563.275639},{"$f":"L217-I217","v":-562.0325069999999},{"$f":"IF((I217)=0,\"\",(M217/I217))","v":-3.4854063061078071E-2}]
[{"$f":"A217","v":"GENERAL SERVICE 50 to 499 kW SERVICE CLASSIFICATION"},"Non-RPP (Other)"]
[]
[]
[null,null,null,null,"Customer Class:",{"$f":"E18","v":"GENERAL SERVICE 500 to 4,999 kW SERVICE CLASSIFICATION"},null,null,null,null,null,{"$f":"IF(O172=\"DEMAND - INTERVAL\",\"RTSR - INTERVAL METERED\",\"\")","v":""}]
[null,null,null,null,"RPP / Non-RPP:",{"$f":"H18","v":"Non-RPP (Other)"}]
[null,null,null,null,"Consumption",{"$f":"K18","v":400000},"kWh"]
[null,null,null,null,"Demand",{"$f":"L18","v":2250},"kW"]
[null,null,null,null,"Current Loss Factor",{"$f":"I18","v":1.036}]
[null,null,null,null,"Proposed/Approved Loss Factor",{"$f":"J18","v":1.036}]
[]
[null,null,null,null,null,null,"Current OEB-Approved",null,null,"Proposed",null,null,"Impact"]
[null,null,null,null,null,null,"Rate","Volume","Charge","Rate","Volume","Charge","$ Change","% Change"]
[null,null,null,null,null,null,"($)",null,"($)","($)",null,"($)"]
[{"$f":"F221","v":"GENERAL SERVICE 500 to 4,999 kW SERVICE CLASSIFICATION"},null,null,"GS500_F","Monthly Service Charge",null,{"$f":"IFERROR(SUMIF(RATES!B:B, '21. Bill Impacts'!D231,RATES!H:H),\"\")","v":1764.42},1,{"$f":"H231*G231","v":1764.42},{"$f":"IFERROR(SUMIF(RATES!B:B,'21. Bill Impacts'!D231,RATES!I:I),\"\")","v":1780.3},1,{"$f":"K231*J231","v":1780.3},{"$f":"L231-I231","v":15.879999999999882},{"$f":"IF(ISERROR(M231/I231), \"\", M231/I231)","v":9.0001246868658714E-3}]
[{"$f":"A231","v":"GENERAL SERVICE 500 to 4,999 kW SERVICE CLASSIFICATION"},null,null,"GS500_V","Distribution Volumetric Rate",null,{"$f":"IFERROR(SUMIF(RATES!B:B, '21. Bill Impacts'!D232,RATES!H:H),\"\")","v":2.3994},{"$f":"IF($F224>0, $F224, $F223)","v":2250},{"$f":"H232*G232","v":5398.65},{"$f":"IFERROR(SUMIF(RATES!B:B,'21. Bill Impacts'!D232,RATES!I:I),\"\")","v":2.4209999999999998},{"$f":"IF($F224>0, $F224, $F223)","v":2250},{"$f":"K232*J232","v":5447.25},48.600000000000364,{"$f":"IF(ISERROR(M232/I232), \"\", M232/I232)","v":9.002250562640729E-3}]
["GENERAL SERVICE 500 to 4,999 kW SERVICE CLASSIFICATION",null,null,"GS500_FRR","Fixed Rate Riders",null,{"$f":"IFERROR(SUMIF(RATES!B:B, '21. Bill Impacts'!D233,RATES!H:H),\"\")","v":71.83},1,{"$f":"H233*G233","v":71.83},{"$f":"IFERROR(SUMIF(RATES!B:B,'21. Bill Impacts'!D233,RATES!I:I),\"\")","v":50.74},1,{"$f":"K233*J233","v":50.74},-21.089999999999996,{"$f":"IF(ISERROR(M233/I233), \"\", M233/I233)","v":-0.29360991229291378}]
["GENERAL SERVICE 500 to 4,999 kW SERVICE CLASSIFICATION",null,null,"GS500_VRR","Volumetric Rate Riders",null,{"$f":"IFERROR(SUMIF(RATES!B:B, '21. Bill Impacts'!D234,RATES!H:H),\"\")","v":0.21659999999999999},{"$f":"IF($F224>0, $F224, $F223)","v":2250},{"$f":"H234*G234","v":487.34999999999997},{"$f":"IFERROR(SUMIF(RATES!B:B,'21. Bill Impacts'!D234,RATES!I:I),\"\")","v":0.28509999999999996},{"$f":"IF($F224>0, $F224, $F223)","v":2250},{"$f":"K234*J234","v":641.47499999999991},154.12499999999994,{"$f":"IF(ISERROR(M234/I234), \"\", M234/I234)","v":0.31625115420129263}]
["GENERAL SERVICE 500 to 4,999 kW SERVICE CLASSIFICATION","ST_A",{"$f":"B18","v":4},null,"Sub-Total A (excluding pass through)",null,null,null,{"$f":"SUM(I231:I234)","v":7722.25},null,null,{"$f":"SUM(L231:L234)","v":7919.7649999999994},197.51499999999942,{"$f":"IF((I235)=0,\"\",(M235/I235))","v":2.5577390009388381E-2}]
["GENERAL SERVICE 500 to 4,999 kW SERVICE CLASSIFICATION",null,null,null,"Line Losses on Cost of Power",null,{"$f":"IF((F223*12>=150000), 0, IF(F222=\"RPP\",(G250*0.65+G251*0.17+G252*0.18),IF(F222=\"Non-RPP (Retailer)\",G253,G254)))","v":0},{"$f":"IF(G236=0, 0, $F223*F225-F223)","v":0},{"$f":"H236*G236","v":0},{"$f":"IF((F223*12>=150000), 0, IF(F222=\"RPP\",(J250*0.65+J251*0.17+J252*0.18),IF(F222=\"Non-RPP (Retailer)\",J253,J254)))","v":0},{"$f":"IF(G236=0, 0, $F223*F225-F223)","v":0},{"$f":"K236*J236","v":0},0,{"$f":"IF(ISERROR(M236/I236), \"\", M236/I236)","v":""}]
["GENERAL SERVICE 500 to 4,999 kW SERVICE CLASSIFICATION",null,null,"GS500_DVA","Total Deferral/Variance Account Rate Riders",null,{"$f":"IFERROR(SUMIF(RATES!B:B, '21. Bill Impacts'!D237,RATES!H:H),\"\")","v":-0.33929000000000004},{"$f":"IF($F224>0, $F224, $F223)","v":2250},{"$f":"H237*G237","v":-763.40250000000003},{"$f":"IFERROR(SUMIF(RATES!B:B,'21. Bill Impacts'!D237,RATES!I:I),\"\")","v":-0.49931000000000003},{"$f":"IF($F224>0, $F224, $F223)","v":2250},{"$f":"K237*J237","v":-1123.4475},-360.04499999999996,{"$f":"IF(ISERROR(M237/I237), \"\", M237/I237)","v":0.47163193728079217}]
["GENERAL SERVICE 500 to 4,999 kW SERVICE CLASSIFICATION",null,null,"GS500_GA","GA Rate Riders",null,{"$f":"IFERROR(SUMIF(RATES!B:B, '21. Bill Impacts'!D238,RATES!H:H),\"\")","v":-5.0000000000000001E-4},{"$f":"F223","v":400000},{"$f":"H238*G238","v":-200},{"$f":"IFERROR(SUMIF(RATES!B:B,'21. Bill Impacts'!D238,RATES!I:I),\"\")","v":1.1999999999999999E-3},{"$f":"K248","v":400000},{"$f":"K238*J238","v":479.99999999999994},680,{"$f":"IF(ISERROR(M238/I238), \"\", M238/I238)","v":-3.4}]
["GENERAL SERVICE 500 to 4,999 kW SERVICE CLASSIFICATION",null,null,"GS500_LV","Low Voltage Service Charge",null,{"$f":"IFERROR(SUMIF(RATES!B:B, '21. Bill Impacts'!D239,RATES!H:H),\"\")","v":7.8399999999999997E-2},{"$f":"IF($F224>0, $F224, $F223)","v":2250},{"$f":"H239*G239","v":176.4},{"$f":"IFERROR(SUMIF(RATES!B:B,'21. Bill Impacts'!D239,RATES!I:I),\"\")","v":7.8399999999999997E-2},{"$f":"IF($F224>0, $F224, $F223)","v":2250},{"$f":"K239*J239","v":176.4},0,{"$f":"IF(ISERROR(M239/I239), \"\", M239/I239)","v":0}]
["GENERAL SERVICE 500 to 4,999 kW SERVICE CLASSIFICATION",null,null,null,"Smart Meter Entity Charge (if applicable) and/or any fixed ($) Deferral/Variance Account Rate Riders",null,{"$f":"IFERROR(SUMIF(RATES!B:B, '21. Bill Impacts'!D240,RATES!H:H),\"\")","v":0},1,{"$f":"H240*G240","v":0},0,1,{"$f":"K240*J240","v":0},0,{"$f":"IF(ISERROR(M240/I240), \"\", M240/I240)","v":""}]
["GENERAL SERVICE 500 to 4,999 kW SERVICE CLASSIFICATION","ST_B",{"$f":"C235","v":4},null,"Sub-Total B - Distribution (includes Sub-Total A)",null,null,null,{"$f":"SUM(I235:I240)","v":6935.2474999999995},null,null,{"$f":"SUM(L235:L240)","v":7452.7174999999988},517.46999999999935,{"$f":"IF((I241)=0,\"\",(M241/I241))","v":7.461449645452442E-2}]
["GENERAL SERVICE 500 to 4,999 kW SERVICE CLASSIFICATION",null,null,"GS500_TN","RTSR - Network",null,{"$f":"IFERROR(SUMIF(RATES!B:B, '21. Bill Impacts'!D242,RATES!H:H),\"\")","v":2.6436000000000002},{"$f":"IF($F224>0, $F224, $F223*$F225)","v":2250},{"$f":"H242*G242","v":5948.1},{"$f":"IFERROR(SUMIF(RATES!B:B,'21. Bill Impacts'!D242,RATES!I:I),\"\")","v":2.6560000000000001},{"$f":"IF($F224>0, $F224, $F223*$F225)","v":2250},{"$f":"K242*J242","v":5976},27.899999999999636,{"$f":"IF(ISERROR(M242/I242), \"\", M242/I242)","v":4.6905734604326815E-3}]
["GENERAL SERVICE 500 to 4,999 kW SERVICE CLASSIFICATION",null,null,"GS500_TC","RTSR - Connection and/or Line and Transformation Connection",null,{"$f":"IFERROR(SUMIF(RATES!B:B, '21. Bill Impacts'!D243,RATES!H:H),\"\")","v":2.4803000000000002},{"$f":"IF($F224>0, $F224, $F223*$F225)","v":2250},{"$f":"H243*G243","v":5580.6750000000002},{"$f":"IFERROR(SUMIF(RATES!B:B,'21. Bill Impacts'!D243,RATES!I:I),\"\")","v":2.5217999999999998},{"$f":"IF($F224>0, $F224, $F223*$F225)","v":2250},{"$f":"K243*J243","v":5674.0499999999993},93.374999999999091,{"$f":"IF(ISERROR(M243/I243), \"\", M243/I243)","v":1.6731846953997338E-2}]
["GENERAL SERVICE 500 to 4,999 kW SERVICE CLASSIFICATION","ST_C",{"$f":"C235","v":4},null,"Sub-Total C - Delivery (including Sub-Total B)",null,null,null,{"$f":"SUM(I241:I243)","v":18464.022499999999},null,null,{"$f":"SUM(L241:L243)","v":19102.767499999998},638.74499999999898,{"$f":"IF((I244)=0,\"\",(M244/I244))","v":3.4594032800815695E-2}]
["GENERAL SERVICE 500 to 4,999 kW SERVICE CLASSIFICATION",null,null,null,"Wholesale Market Service Charge (WMSC)",null,3.5999999999999999E-3,{"$f":"F223*F225","v":414400},{"$f":"H245*G245","v":1491.84},3.5999999999999999E-3,{"$f":"F223*F225","v":414400},{"$f":"K245*J245","v":1491.84},0,{"$f":"IF(ISERROR(M245/I245), \"\", M245/I245)","v":0}]
["GENERAL SERVICE 500 to 4,999 kW SERVICE CLASSIFICATION",null,null,null,"Rural and Remote Rate Protection (RRRP)",null,2.9999999999999997E-4,{"$f":"F223*F225","v":414400},{"$f":"H246*G246","v":124.32},2.9999999999999997E-4,{"$f":"F223*F225","v":414400},{"$f":"K246*J246","v":124.32},0,{"$f":"IF(ISERROR(M246/I246), \"\", M246/I246)","v":0}]
["GENERAL SERVICE 500 to 4,999 kW SERVICE CLASSIFICATION",null,null,null,"Standard Supply Service Charge",null,0.25,null,{"$f":"H247*G247","v":0},0.25,null,{"$f":"K247*J247","v":0},0,{"$f":"IF(ISERROR(M247/I247), \"\", M247/I247)","v":""}]
["GENERAL SERVICE 500 to 4,999 kW SERVICE CLASSIFICATION",null,null,null,"Debt Retirement Charge (DRC)",null,7.0000000000000001E-3,{"$f":"F223","v":400000},{"$f":"H248*G248","v":2800},0,{"$f":"F223","v":400000},{"$f":"K248*J248","v":0},-2800,{"$f":"IF(ISERROR(M248/I248), \"\", M248/I248)","v":-1}]
["GENERAL SERVICE 500 to 4,999 kW SERVICE CLASSIFICATION"]
["GENERAL SERVICE 500 to 4,999 kW SERVICE CLASSIFICATION","RPP",null,null,"TOU - Off Peak",null,6.5000000000000002E-2,{"$f":"IF(AND(F223*12>=150000),0.65*F223*F225,0.65*F223)","v":269360},{"$f":"H250*G250","v":17508.400000000001},6.5000000000000002E-2,{"$f":"IF(AND(F223*12>=150000),0.65*F223*F226,0.65*F223)","v":269360},{"$f":"K250*J250","v":17508.400000000001},{"$f":"L250-I250","v":0},{"$f":"IF(ISERROR(M250/I250), \"\", M250/I250)","v":0}]
["GENERAL SERVICE 500 to 4,999 kW SERVICE CLASSIFICATION","RPP",null,null,"TOU - Mid Peak",null,{"$f":"G92","v":9.4E-2},{"$f":"IF(AND(F223*12>=150000),0.17*F223*F225,0.17*F223)","v":70448},{"$f":"H251*G251","v":6622.1120000000001},{"$f":"G251","v":9.4E-2},{"$f":"IF(AND(F223*12>=150000),0.17*F223*F226,0.17*F223)","v":70448},{"$f":"K251*J251","v":6622.1120000000001},{"$f":"L251-I251","v":0},{"$f":"IF(ISERROR(M251/I251), \"\", M251/I251)","v":0}]
["GENERAL SERVICE 500 to 4,999 kW SERVICE CLASSIFICATION","RPP",null,null,"TOU - On Peak",null,0.13200000000000001,{"$f":"IF(AND(F223*12>=150000),0.18*F223*F225,0.18*F223)","v":74592},{"$f":"H252*G252","v":9846.1440000000002},0.13200000000000001,{"$f":"IF(AND(F223*12>=150000),0.18*F223*F226,0.18*F223)","v":74592},{"$f":"K252*J252","v":9846.1440000000002},{"$f":"L252-I252","v":0},{"$f":"IF(ISERROR(M252/I252), \"\", M252/I252)","v":0}]
["GENERAL SERVICE 500 to 4,999 kW SERVICE CLASSIFICATION","Non-RPP (Retailer)",null,null,"Non-RPP Retailer Avg. Price",null,{"$f":"0.1038","v":0.1038},{"$f":"IF(AND(F223*12>=150000),F223*F225,F223)","v":414400},{"$f":"H253*G253","v":43014.720000000001},{"$f":"G253","v":0.1038},{"$f":"IF(AND(F223*12>=150000),F223*F226,F223)","v":414400},{"$f":"K253*J253","v":43014.720000000001},{"$f":"L253-I253","v":0},{"$f":"IF(ISERROR(M253/I253), \"\", M253/I253)","v":0}]
["GENERAL SERVICE 500 to 4,999 kW SERVICE CLASSIFICATION","Non-RPP (Other)",null,null,"Average IESO Wholesale Market Price",null,0.1038,{"$f":"IF(AND(F223*12>=150000),F223*F225,F223)","v":414400},{"$f":"H254*G254","v":43014.720000000001},{"$f":"G254","v":0.1038},{"$f":"IF(AND(F223*12>=150000),F223*F226,F223)","v":414400},{"$f":"K254*J254","v":43014.720000000001},{"$f":"L254-I254","v":0},{"$f":"IF(ISERROR(M254/I254), \"\", M254/I254)","v":0}]
["GENERAL SERVICE 500 to 4,999 kW SERVICE CLASSIFICATION"]
["GENERAL SERVICE 500 to 4,999 kW SERVICE CLASSIFICATION","RPP",null,null,"Total Bill on TOU (before Taxes)",null,null,null,{"$f":"SUM(I245:I252,I244)","v":56856.838500000005},null,null,{"$f":"SUM(L245:L252,L244)","v":54695.583500000008},{"$f":"L256-I256","v":-2161.2549999999974},{"$f":"IF((I256)=0,\"\",(M256/I256))","v":-3.8012226093084599E-2}]
["GENERAL SERVICE 500 to 4,999 kW SERVICE CLASSIFICATION","RPP",null,null,"HST",null,0.13,null,{"$f":"I256*G257","v":7391.3890050000009},0.13,null,{"$f":"L256*J257","v":7110.4258550000013},{"$f":"L257-I257","v":-280.96314999999959},{"$f":"IF((I257)=0,\"\",(M257/I257))","v":-3.8012226093084592E-2}]
["GENERAL SERVICE 500 to 4,999 kW SERVICE CLASSIFICATION","RPP",null,null,"8% Provincial Rebate",null,-0.08,null,{"$f":"I256*G258","v":-4548.5470800000003},{"$f":"G258","v":-0.08},null,{"$f":"L256*J258","v":-4375.6466800000007},{"$f":"L258-I258","v":172.90039999999954},{"$f":"IF((I258)=0,\"\",(M258/I258))","v":-3.801222609308455E-2}]
["GENERAL SERVICE 500 to 4,999 kW SERVICE CLASSIFICATION","RPP_TOTAL",null,null,"Total Bill on TOU",null,null,null,{"$f":"SUM(I256,I257,I258)","v":59699.680424999999},null,null,{"$f":"L256+L257+L258","v":57430.362675000011},{"$f":"L259-I259","v":-2269.3177499999874},{"$f":"IF((I259)=0,\"\",(M259/I259))","v":-3.8012226093084439E-2}]
["GENERAL SERVICE 500 to 4,999 kW SERVICE CLASSIFICATION","RPP"]
["GENERAL SERVICE 500 to 4,999 kW SERVICE CLASSIFICATION","Non-RPP (Retailer)",null,null,"Total Bill on Non-RPP Avg. Price",null,null,null,{"$f":"SUM(I253,I245:I249,I244)","v":65894.902499999997},null,null,{"$f":"SUM(L253,L245:L249,L244)","v":63733.647499999992},{"$f":"L261-I261","v":-2161.2550000000047},{"$f":"IF((I261)=0,\"\",(M261/I261))","v":-3.2798515788076396E-2}]
["GENERAL SERVICE 500 to 4,999 kW SERVICE CLASSIFICATION","Non-RPP (Retailer)",null,null,"HST",null,0.13,null,{"$f":"I261*G262","v":8566.3373250000004},0.13,null,{"$f":"L261*J262","v":8285.374174999999},{"$f":"L262-I262","v":-280.96315000000141},{"$f":"IF((I262)=0,\"\",(M262/I262))","v":-3.2798515788076486E-2}]
["GENERAL SERVICE 500 to 4,999 kW SERVICE CLASSIFICATION","Non-RPP (Retailer)",null,null,"8% Provincial Rebate",null,-0.08,null,{"$f":"I261*G263","v":-5271.5922},{"$f":"G263","v":-0.08},null,{"$f":"L261*J263","v":-5098.6917999999996},{"$f":"L263-I263","v":172.90040000000045},{"$f":"IF((I263)=0,\"\",(M263/I263))","v":-3.279851578807641E-2}]
["GENERAL SERVICE 500 to 4,999 kW SERVICE CLASSIFICATION","Non-RPP (Retailer)_TOTAL",null,null,"Total Bill on Non-RPP Avg. Price",null,null,null,{"$f":"SUM(I261,I262,I263)","v":69189.647624999998},null,null,{"$f":"SUM(L261,L262,L263)","v":66920.329874999996},{"$f":"L264-I264","v":-2269.317750000002},{"$f":"IF((I264)=0,\"\",(M264/I264))","v":-3.2798515788076354E-2}]
["GENERAL SERVICE 500 to 4,999 kW SERVICE CLASSIFICATION","Non-RPP (Retailer)"]
["GENERAL SERVICE 500 to 4,999 kW SERVICE CLASSIFICATION","Non-RPP (Other)_BT",4,null,"Total Bill on Average IESO Wholesale Market Price",null,null,null,{"$f":"SUM(I254,I245:I249,I244)","v":65894.902499999997},null,null,{"$f":"SUM(L254,L245:L249,L244)","v":63733.647499999992},{"$f":"L266-I266","v":-2161.2550000000047},{"$f":"IF((I266)=0,\"\",(M266/I266))","v":-3.2798515788076396E-2}]
["GENERAL SERVICE 500 to 4,999 kW SERVICE CLASSIFICATION","Non-RPP (Other)",null,null,"HST",null,0.13,null,{"$f":"I266*G267","v":8566.3373250000004},0.13,null,{"$f":"L266*J267","v":8285.374174999999},{"$f":"L267-I267","v":-280.96315000000141},{"$f":"IF((I267)=0,\"\",(M267/I267))","v":-3.2798515788076486E-2}]
["GENERAL SERVICE 500 to 4,999 kW SERVICE CLASSIFICATION","Non-RPP (Other)_NET",4,null,"Total Bill on Average IESO WMP (before 8% Provincial Rebate)",null,null,null,{"$f":"SUM(I266:I267)","v":74461.239824999997},null,null,{"$f":"SUM(L266:L267)","v":72019.021674999996},{"$f":"SUM(M266:M267)","v":-2442.2181500000061},{"$f":"IF((I268)=0,\"\",(M268/I268))","v":-3.2798515788076403E-2}]
[{"$f":"A267","v":"GENERAL SERVICE 500 to 4,999 kW SERVICE CLASSIFICATION"},"Non-RPP (Other)",null,null,"8% Provincial Rebate",null,0,null,{"$f":"I266*G269","v":0},{"$f":"G269","v":0},null,{"$f":"L266*J269","v":0},{"$f":"L269-I269","v":0},{"$f":"IF((I269)=0,\"\",(M269/I269))","v":""}]
[{"$f":"A269","v":"GENERAL SERVICE 500 to 4,999 kW SERVICE CLASSIFICATION"},"Non-RPP (Other)_TOTAL",{"$f":"C235","v":4},null,"Total Bill on Average IESO Wholesale Market Price",null,null,null,{"$f":"SUM(I266,I267,I269)","v":74461.239824999997},null,null,{"$f":"SUM(L266,L267,L269)","v":72019.021674999996},{"$f":"L270-I270","v":-2442.2181500000006},{"$f":"IF((I270)=0,\"\",(M270/I270))","v":-3.2798515788076334E-2}]
[{"$f":"A270","v":"GENERAL SERVICE 500 to 4,999 kW SERVICE CLASSIFICATION"},"Non-RPP (Other)"]
[]
[]
[null,null,null,null,"Customer Class:",{"$f":"E19","v":"LARGE USE SERVICE CLASSIFICATION"},null,null,null,null,null,{"$f":"IF(O225=\"DEMAND - INTERVAL\",\"RTSR - INTERVAL METERED\",\"\")","v":""}]
[null,null,null,null,"RPP / Non-RPP:",{"$f":"H19","v":"Non-RPP (Other)"},null,null,"Class A"]
[null,null,null,null,"Consumption",{"$f":"K19","v":3000000},"kWh"]
[null,null,null,null,"Demand",{"$f":"L19","v":5000},"kW"]
[null,null,null,null,"Current Loss Factor",{"$f":"I19","v":1.0145}]
[null,null,null,null,"Proposed/Approved Loss Factor",{"$f":"J19","v":1.0145}]
[]
[null,null,null,null,null,null,"Current OEB-Approved",null,null,"Proposed",null,null,"Impact"]
[null,null,null,null,null,null,"Rate","Volume","Charge","Rate","Volume","Charge","$ Change","% Change"]
[null,null,null,null,null,null,"($)",null,"($)","($)",null,"($)"]
[{"$f":"F274","v":"LARGE USE SERVICE CLASSIFICATION"},null,null,"LU_F","Monthly Service Charge",null,{"$f":"IFERROR(SUMIF(RATES!B:B, '21. Bill Impacts'!D284,RATES!H:H),\"\")","v":13911.73},1,{"$f":"H284*G284","v":13911.73},{"$f":"IFERROR(SUMIF(RATES!B:B,'21. Bill Impacts'!D284,RATES!I:I),\"\")","v":14036.94},1,{"$f":"K284*J284","v":14036.94},{"$f":"L284-I284","v":125.21000000000095},{"$f":"IF(ISERROR(M284/I284), \"\", M284/I284)","v":9.0003184363124464E-3}]
[{"$f":"A284","v":"LARGE USE SERVICE CLASSIFICATION"},null,null,"LU_V","Distribution Volumetric Rate",null,{"$f":"IFERROR(SUMIF(RATES!B:B, '21. Bill Impacts'!D285,RATES!H:H),\"\")","v":2.9782000000000002},{"$f":"IF($F277>0, $F277, $F276)","v":5000},{"$f":"H285*G285","v":14891},{"$f":"IFERROR(SUMIF(RATES!B:B,'21. Bill Impacts'!D285,RATES!I:I),\"\")","v":3.0049999999999999},{"$f":"IF($F277>0, $F277, $F276)","v":5000},{"$f":"K285*J285","v":15025},134,{"$f":"IF(ISERROR(M285/I285), \"\", M285/I285)","v":8.9987240615136653E-3}]
["LARGE USE SERVICE CLASSIFICATION",null,null,"LU_FRR","Fixed Rate Riders",null,{"$f":"IFERROR(SUMIF(RATES!B:B, '21. Bill Impacts'!D286,RATES!H:H),\"\")","v":703.18},1,{"$f":"H286*G286","v":703.18},{"$f":"IFERROR(SUMIF(RATES!B:B,'21. Bill Impacts'!D286,RATES!I:I),\"\")","v":400.10999999999996},1,{"$f":"K286*J286","v":400.10999999999996},-303.07,{"$f":"IF(ISERROR(M286/I286), \"\", M286/I286)","v":-0.43099917517563074}]
["LARGE USE SERVICE CLASSIFICATION",null,null,"LU_VRR","Volumetric Rate Riders",null,{"$f":"IFERROR(SUMIF(RATES!B:B, '21. Bill Impacts'!D287,RATES!H:H),\"\")","v":0.182},{"$f":"IF($F277>0, $F277, $F276)","v":5000},{"$f":"H287*G287","v":910},{"$f":"IFERROR(SUMIF(RATES!B:B,'21. Bill Impacts'!D287,RATES!I:I),\"\")","v":0.23769999999999999},{"$f":"IF($F277>0, $F277, $F276)","v":5000},{"$f":"K287*J287","v":1188.5},278.5,{"$f":"IF(ISERROR(M287/I287), \"\", M287/I287)","v":0.30604395604395607}]
["LARGE USE SERVICE CLASSIFICATION","ST_A",{"$f":"B19","v":5},null,"Sub-Total A (excluding pass through)",null,null,null,{"$f":"SUM(I284:I287)","v":30415.91},null,null,{"$f":"SUM(L284:L287)","v":30650.550000000003},234.64000000000306,{"$f":"IF((I288)=0,\"\",(M288/I288))","v":7.7143836893258516E-3}]
["LARGE USE SERVICE CLASSIFICATION",null,null,null,"Line Losses on Cost of Power",null,{"$f":"IF((F276*12>=150000), 0, IF(F275=\"RPP\",(G303*0.65+G304*0.17+G305*0.18),IF(F275=\"Non-RPP (Retailer)\",G306,G307)))","v":0},{"$f":"IF(G289=0, 0, $F276*F278-F276)","v":0},{"$f":"H289*G289","v":0},{"$f":"IF((F276*12>=150000), 0, IF(F275=\"RPP\",(J303*0.65+J304*0.17+J305*0.18),IF(F275=\"Non-RPP (Retailer)\",J306,J307)))","v":0},{"$f":"IF(G289=0, 0, $F276*F278-F276)","v":0},{"$f":"K289*J289","v":0},0,{"$f":"IF(ISERROR(M289/I289), \"\", M289/I289)","v":""}]
["LARGE USE SERVICE CLASSIFICATION",null,null,"LU_DVA","Total Deferral/Variance Account Rate Riders",null,{"$f":"IFERROR(SUMIF(RATES!B:B, '21. Bill Impacts'!D290,RATES!H:H),\"\")","v":-0.40539999999999998},{"$f":"IF($F277>0, $F277, $F276)","v":5000},{"$f":"H290*G290","v":-2027},{"$f":"IFERROR(SUMIF(RATES!B:B,'21. Bill Impacts'!D290,RATES!I:I),\"\")","v":-0.61539999999999995},{"$f":"IF($F277>0, $F277, $F276)","v":5000},{"$f":"K290*J290","v":-3076.9999999999995},-1049.9999999999995,{"$f":"IF(ISERROR(M290/I290), \"\", M290/I290)","v":0.5180069067587566}]
["LARGE USE SERVICE CLASSIFICATION",null,null,"LU_GA","GA Rate Riders",null,{"$f":"IFERROR(SUMIF(RATES!B:B, '21. Bill Impacts'!D291,RATES!H:H),\"\")","v":0},{"$f":"F276","v":3000000},{"$f":"H291*G291","v":0},{"$f":"IFERROR(SUMIF(RATES!B:B,'21. Bill Impacts'!D291,RATES!I:I),\"\")","v":0},{"$f":"F276","v":3000000},{"$f":"K291*J291","v":0},0,{"$f":"IF(ISERROR(M291/I291), \"\", M291/I291)","v":""}]
["LARGE USE SERVICE CLASSIFICATION",null,null,"LU_LV","Low Voltage Service Charge",null,{"$f":"IFERROR(SUMIF(RATES!B:B, '21. Bill Impacts'!D292,RATES!H:H),\"\")","v":8.3799999999999999E-2},{"$f":"IF($F277>0, $F277, $F276)","v":5000},{"$f":"H292*G292","v":419},{"$f":"IFERROR(SUMIF(RATES!B:B,'21. Bill Impacts'!D292,RATES!I:I),\"\")","v":8.3799999999999999E-2},{"$f":"IF($F277>0, $F277, $F276)","v":5000},{"$f":"K292*J292","v":419},0,{"$f":"IF(ISERROR(M292/I292), \"\", M292/I292)","v":0}]
["LARGE USE SERVICE CLASSIFICATION",null,null,null,"Smart Meter Entity Charge (if applicable) and/or any fixed ($) Deferral/Variance Account Rate Riders",null,{"$f":"IFERROR(SUMIF(RATES!B:B, '21. Bill Impacts'!D293,RATES!H:H),\"\")","v":0},1,{"$f":"H293*G293","v":0},null,1,{"$f":"K293*J293","v":0},0,{"$f":"IF(ISERROR(M293/I293), \"\", M293/I293)","v":""}]
["LARGE USE SERVICE CLASSIFICATION","ST_B",{"$f":"C288","v":5},null,"Sub-Total B - Distribution (includes Sub-Total A)",null,null,null,{"$f":"SUM(I288:I293)","v":28807.91},null,null,{"$f":"SUM(L288:L293)","v":27992.550000000003},-815.35999999999694,{"$f":"IF((I294)=0,\"\",(M294/I294))","v":-2.8303337520840525E-2}]
["LARGE USE SERVICE CLASSIFICATION",null,null,"LU_TN","RTSR - Network",null,{"$f":"IFERROR(SUMIF(RATES!B:B, '21. Bill Impacts'!D295,RATES!H:H),\"\")","v":2.8210999999999999},{"$f":"IF($F277>0, $F277, $F276*$F278)","v":5000},{"$f":"H295*G295","v":14105.5},{"$f":"IFERROR(SUMIF(RATES!B:B,'21. Bill Impacts'!D295,RATES!I:I),\"\")","v":2.8342999999999998},{"$f":"IF($F277>0, $F277, $F276*$F278)","v":5000},{"$f":"K295*J295","v":14171.5},66,{"$f":"IF(ISERROR(M295/I295), \"\", M295/I295)","v":4.6790259118783453E-3}]
["LARGE USE SERVICE CLASSIFICATION",null,null,"LU_TC","RTSR - Connection and/or Line and Transformation Connection",null,{"$f":"IFERROR(SUMIF(RATES!B:B, '21. Bill Impacts'!D296,RATES!H:H),\"\")","v":2.6490999999999998},{"$f":"IF($F277>0, $F277, $F276*$F278)","v":5000},{"$f":"H296*G296","v":13245.499999999998},{"$f":"IFERROR(SUMIF(RATES!B:B,'21. Bill Impacts'!D296,RATES!I:I),\"\")","v":2.6934},{"$f":"IF($F277>0, $F277, $F276*$F278)","v":5000},{"$f":"K296*J296","v":13467},221.50000000000182,{"$f":"IF(ISERROR(M296/I296), \"\", M296/I296)","v":1.6722660526216591E-2}]
["LARGE USE SERVICE CLASSIFICATION","ST_C",{"$f":"C288","v":5},null,"Sub-Total C - Delivery (including Sub-Total B)",null,null,null,{"$f":"SUM(I294:I296)","v":56158.91},null,null,{"$f":"SUM(L294:L296)","v":55631.05},-527.86000000000058,{"$f":"IF((I297)=0,\"\",(M297/I297))","v":-9.3993989555709069E-3}]
["LARGE USE SERVICE CLASSIFICATION",null,null,null,"Wholesale Market Service Charge (WMSC)",null,3.5999999999999999E-3,{"$f":"F276*F278","v":3043500},{"$f":"H298*G298","v":10956.6},3.5999999999999999E-3,{"$f":"F276*F278","v":3043500},{"$f":"K298*J298","v":10956.6},0,{"$f":"IF(ISERROR(M298/I298), \"\", M298/I298)","v":0}]
["LARGE USE SERVICE CLASSIFICATION",null,null,null,"Rural and Remote Rate Protection (RRRP)",null,2.9999999999999997E-4,{"$f":"F276*F278","v":3043500},{"$f":"H299*G299","v":913.05},2.9999999999999997E-4,{"$f":"F276*F278","v":3043500},{"$f":"K299*J299","v":913.05},0,{"$f":"IF(ISERROR(M299/I299), \"\", M299/I299)","v":0}]
["LARGE USE SERVICE CLASSIFICATION",null,null,null,"Standard Supply Service Charge",null,null,1,{"$f":"H300*G300","v":0},null,1,{"$f":"K300*J300","v":0},0,{"$f":"IF(ISERROR(M300/I300), \"\", M300/I300)","v":""}]
["LARGE USE SERVICE CLASSIFICATION",null,null,null,"Debt Retirement Charge (DRC)",null,7.0000000000000001E-3,{"$f":"F276","v":3000000},{"$f":"H301*G301","v":21000},0,{"$f":"F276","v":3000000},{"$f":"K301*J301","v":0},-21000,{"$f":"IF(ISERROR(M301/I301), \"\", M301/I301)","v":-1}]
["LARGE USE SERVICE CLASSIFICATION"]
["LARGE USE SERVICE CLASSIFICATION","RPP",null,null,"TOU - Off Peak",null,6.5000000000000002E-2,{"$f":"IF(AND(F276*12>=150000),0.65*F276*F278,0.65*F276)","v":1978275},{"$f":"H303*G303","v":128587.875},6.5000000000000002E-2,{"$f":"IF(AND(F276*12>=150000),0.65*F276*F279,0.65*F276)","v":1978275},{"$f":"K303*J303","v":128587.875},{"$f":"L303-I303","v":0},{"$f":"IF(ISERROR(M303/I303), \"\", M303/I303)","v":0}]
["LARGE USE SERVICE CLASSIFICATION","RPP",null,null,"TOU - Mid Peak",null,{"$f":"G92","v":9.4E-2},{"$f":"IF(AND(F276*12>=150000),0.17*F276*F278,0.17*F276)","v":517395.00000000006},{"$f":"H304*G304","v":48635.130000000005},{"$f":"G304","v":9.4E-2},{"$f":"IF(AND(F276*12>=150000),0.17*F276*F279,0.17*F276)","v":517395.00000000006},{"$f":"K304*J304","v":48635.130000000005},{"$f":"L304-I304","v":0},{"$f":"IF(ISERROR(M304/I304), \"\", M304/I304)","v":0}]
["LARGE USE SERVICE CLASSIFICATION","RPP",null,null,"TOU - On Peak",null,0.13200000000000001,{"$f":"IF(AND(F276*12>=150000),0.18*F276*F278,0.18*F276)","v":547830},{"$f":"H305*G305","v":72313.56},0.13200000000000001,{"$f":"IF(AND(F276*12>=150000),0.18*F276*F279,0.18*F276)","v":547830},{"$f":"K305*J305","v":72313.56},{"$f":"L305-I305","v":0},{"$f":"IF(ISERROR(M305/I305), \"\", M305/I305)","v":0}]
["LARGE USE SERVICE CLASSIFICATION","Non-RPP (Retailer)",null,null,"Non-RPP Retailer Avg. Price",null,{"$f":"0.1038","v":0.1038},{"$f":"IF(AND(F276*12>=150000),F276*F278,F276)","v":3043500},{"$f":"H306*G306","v":315915.3},{"$f":"G306","v":0.1038},{"$f":"IF(AND(F276*12>=150000),F276*F279,F276)","v":3043500},{"$f":"K306*J306","v":315915.3},{"$f":"L306-I306","v":0},{"$f":"IF(ISERROR(M306/I306), \"\", M306/I306)","v":0}]
["LARGE USE SERVICE CLASSIFICATION","Non-RPP (Other)",null,null,"Average IESO Wholesale Market Price",null,0.1038,{"$f":"IF(AND(F276*12>=150000),F276*F278,F276)","v":3043500},{"$f":"H307*G307","v":315915.3},{"$f":"G307","v":0.1038},{"$f":"IF(AND(F276*12>=150000),F276*F279,F276)","v":3043500},{"$f":"K307*J307","v":315915.3},{"$f":"L307-I307","v":0},{"$f":"IF(ISERROR(M307/I307), \"\", M307/I307)","v":0}]
["LARGE USE SERVICE CLASSIFICATION"]
["LARGE USE SERVICE CLASSIFICATION","RPP_BT",null,null,"Total Bill on TOU (before Taxes)",null,null,null,{"$f":"SUM(I298:I305,I297)","v":338565.125},null,null,{"$f":"SUM(L298:L305,L297)","v":317037.26500000001},{"$f":"L309-I309","v":-21527.859999999986},{"$f":"IF((I309)=0,\"\",(M309/I309))","v":-6.3585580469931707E-2}]
["LARGE USE SERVICE CLASSIFICATION","RPP",null,null,"HST",null,0.13,null,{"$f":"I309*G310","v":44013.466250000005},0.13,null,{"$f":"L309*J310","v":41214.844450000004},{"$f":"L310-I310","v":-2798.6218000000008},{"$f":"IF((I310)=0,\"\",(M310/I310))","v":-6.3585580469931763E-2}]
["LARGE USE SERVICE CLASSIFICATION","RPP_NET",null,null,"Total Bill on TOU (before 8% Provincial Rebate)",null,null,null,{"$f":"SUM(I309:I310)","v":382578.59125},null,null,{"$f":"SUM(L309:L310)","v":358252.10944999999},{"$f":"SUM(M309:M310)","v":-24326.481799999987},{"$f":"IF((I311)=0,\"\",(M311/I311))","v":-6.3585580469931707E-2}]
[{"$f":"A310","v":"LARGE USE SERVICE CLASSIFICATION"},"RPP",null,null,"8% Provincial Rebate",null,-0.08,null,{"$f":"I309*G312","v":-27085.21},{"$f":"G312","v":-0.08},null,{"$f":"L309*J312","v":-25362.981200000002},{"$f":"L312-I312","v":1722.2287999999971},{"$f":"IF((I312)=0,\"\",(M312/I312))","v":-6.3585580469931638E-2}]
[{"$f":"A312","v":"LARGE USE SERVICE CLASSIFICATION"},"RPP_TOTAL",null,null,"Total Bill on TOU",null,null,null,{"$f":"SUM(I309,I310,I312)","v":355493.38124999998},null,null,{"$f":"L309+L310+L312","v":332889.12825000001},{"$f":"L313-I313","v":-22604.252999999968},{"$f":"IF((I313)=0,\"\",(M313/I313))","v":-6.3585580469931666E-2}]
["LARGE USE SERVICE CLASSIFICATION","RPP"]
["LARGE USE SERVICE CLASSIFICATION","Non-RPP (Retailer)",null,null,"Total Bill on Non-RPP Avg. Price",null,null,null,{"$f":"SUM(I306,I298:I302,I297)","v":404943.86},null,null,{"$f":"SUM(L306,L298:L302,L297)","v":383415.99999999994},{"$f":"L315-I315","v":-21527.860000000044},{"$f":"IF((I315)=0,\"\",(M315/I315))","v":-5.3162579128869972E-2}]
["LARGE USE SERVICE CLASSIFICATION","Non-RPP (Retailer)",null,null,"HST",null,0.13,null,{"$f":"I315*G316","v":52642.701800000003},0.13,null,{"$f":"L315*J316","v":49844.079999999994},{"$f":"L316-I316","v":-2798.6218000000081},{"$f":"IF((I316)=0,\"\",(M316/I316))","v":-5.3162579128870013E-2}]
["LARGE USE SERVICE CLASSIFICATION","Non-RPP (Retailer)",null,null,"Provincial Rebate",null,-0.08,null,{"$f":"I315*G317","v":-32395.5088},{"$f":"G317","v":-0.08},null,{"$f":"L315*J317","v":-30673.279999999995},{"$f":"L317-I317","v":1722.2288000000044},{"$f":"IF((I317)=0,\"\",(M317/I317))","v":-5.3162579128869999E-2}]
["LARGE USE SERVICE CLASSIFICATION","Non-RPP (Retailer)_TOTAL",null,null,"Total Bill on Non-RPP Avg. Price",null,null,null,{"$f":"SUM(I315,I316,I317)","v":425191.05299999996},null,null,{"$f":"SUM(L315,L316,L317)","v":402586.8},{"$f":"L318-I318","v":-22604.252999999968},{"$f":"IF((I318)=0,\"\",(M318/I318))","v":-5.3162579128869791E-2}]
["LARGE USE SERVICE CLASSIFICATION","Non-RPP (Retailer)"]
["LARGE USE SERVICE CLASSIFICATION","Non-RPP (Other)_BT",{"$f":"C288","v":5},null,"Total Bill on Average IESO Wholesale Market Price",null,null,null,{"$f":"SUM(I307,I298:I302,I297)","v":404943.86},null,null,{"$f":"SUM(L307,L298:L302,L297)","v":383415.99999999994},{"$f":"L320-I320","v":-21527.860000000044},{"$f":"IF((I320)=0,\"\",(M320/I320))","v":-5.3162579128869972E-2}]
["LARGE USE SERVICE CLASSIFICATION","Non-RPP (Other)",null,null,"HST",null,0.13,null,{"$f":"I320*G321","v":52642.701800000003},0.13,null,{"$f":"L320*J321","v":49844.079999999994},{"$f":"L321-I321","v":-2798.6218000000081},{"$f":"IF((I321)=0,\"\",(M321/I321))","v":-5.3162579128870013E-2}]
["LARGE USE SERVICE CLASSIFICATION","Non-RPP (Other)_NET",{"$f":"C288","v":5},null,"Total Bill on Average IESO WMP (before 8% Provincial Rebate)",null,null,null,{"$f":"SUM(I320:I321)","v":457586.56179999997},null,null,{"$f":"SUM(L320:L321)","v":433260.07999999996},{"$f":"SUM(M320:M321)","v":-24326.481800000052},{"$f":"IF((I322)=0,\"\",(M322/I322))","v":-5.3162579128869979E-2}]
[{"$f":"A321","v":"LARGE USE SERVICE CLASSIFICATION"},"Non-RPP (Other)",null,null,"8% Provincial Rebate",null,0,null,{"$f":"I320*G323","v":0},{"$f":"G323","v":0},null,{"$f":"L320*J323","v":0},{"$f":"L323-I323","v":0},{"$f":"IF((I323)=0,\"\",(M323/I323))","v":""}]
[{"$f":"A323","v":"LARGE USE SERVICE CLASSIFICATION"},"Non-RPP (Other)_TOTAL",{"$f":"C288","v":5},null,"Total Bill on Average IESO Wholesale Market Price",null,null,null,{"$f":"SUM(I322:I323)","v":457586.56179999997},null,null,{"$f":"SUM(L322:L323)","v":433260.07999999996},{"$f":"SUM(M322:M323)","v":-24326.481800000052},{"$f":"IF((I324)=0,\"\",(M324/I324))","v":-5.3162579128869979E-2}]
[{"$f":"A324","v":"LARGE USE SERVICE CLASSIFICATION"},"Non-RPP (Other)"]
[]
[]
[null,null,null,null,"Customer Class:",{"$f":"E21","v":"UNMETERED SCATTERED LOAD SERVICE CLASSIFICATION"},null,null,null,null,null,{"$f":"IF(O278=\"DEMAND - INTERVAL\",\"RTSR - INTERVAL METERED\",\"\")","v":""}]
[null,null,null,null,"RPP / Non-RPP:",{"$f":"H21","v":"RPP"}]
[null,null,null,null,"Consumption",{"$f":"K21","v":300},"kWh"]
[null,null,null,null,"Demand",{"$f":"L21","v":0},"kW"]
[null,null,null,null,"Current Loss Factor",{"$f":"I21","v":1.036}]
[null,null,null,null,"Proposed/Approved Loss Factor",{"$f":"J21","v":1.036}]
[]
[null,null,null,null,null,null,"Current OEB-Approved",null,null,"Proposed",null,null,"Impact"]
[null,null,null,null,null,null,"Rate","Volume","Charge","Rate","Volume","Charge","$ Change","% Change"]
[null,null,null,null,null,null,"($)",null,"($)","($)",null,"($)"]
[{"$f":"F328","v":"UNMETERED SCATTERED LOAD SERVICE CLASSIFICATION"},null,null,"USL_F","Monthly Service Charge",null,{"$f":"IFERROR(SUMIF(RATES!B:B, '21. Bill Impacts'!D338,RATES!H:H),\"\")","v":9.08},1,{"$f":"H338*G338","v":9.08},{"$f":"IFERROR(SUMIF(RATES!B:B,'21. Bill Impacts'!D338,RATES!I:I),\"\")","v":9.16},{"$f":"H338","v":1},{"$f":"K338*J338","v":9.16},{"$f":"L338-I338","v":8.0000000000000071E-2},{"$f":"IF(ISERROR(M338/I338), \"\", M338/I338)","v":8.8105726872246774E-3}]
[{"$f":"A338","v":"UNMETERED SCATTERED LOAD SERVICE CLASSIFICATION"},null,null,"USL_V","Distribution Volumetric Rate",null,{"$f":"IFERROR(SUMIF(RATES!B:B, '21. Bill Impacts'!D339,RATES!H:H),\"\")","v":1.6500000000000001E-2},{"$f":"IF($F331>0, $F331, $F330)","v":300},{"$f":"H339*G339","v":4.95},{"$f":"IFERROR(SUMIF(RATES!B:B,'21. Bill Impacts'!D339,RATES!I:I),\"\")","v":1.66E-2},{"$f":"IF($F331>0, $F331, $F330)","v":300},{"$f":"K339*J339","v":4.9800000000000004},3.0000000000000249E-2,{"$f":"IF(ISERROR(M339/I339), \"\", M339/I339)","v":6.0606060606061109E-3}]
["UNMETERED SCATTERED LOAD SERVICE CLASSIFICATION",null,null,"USL_FRR","Fixed Rate Riders",null,{"$f":"IFERROR(SUMIF(RATES!B:B, '21. Bill Impacts'!D340,RATES!H:H),\"\")","v":0.34},{"$f":"H338","v":1},{"$f":"H340*G340","v":0.34},{"$f":"IFERROR(SUMIF(RATES!B:B,'21. Bill Impacts'!D340,RATES!I:I),\"\")","v":0.26},{"$f":"K338","v":1},{"$f":"K340*J340","v":0.26},-8.0000000000000016E-2,{"$f":"IF(ISERROR(M340/I340), \"\", M340/I340)","v":-0.23529411764705885}]
["UNMETERED SCATTERED LOAD SERVICE CLASSIFICATION",null,null,"USL_VRR","Volumetric Rate Riders",null,{"$f":"IFERROR(SUMIF(RATES!B:B, '21. Bill Impacts'!D341,RATES!H:H),\"\")","v":5.0000000000000001E-4},{"$f":"IF($F331>0, $F331, $F330)","v":300},{"$f":"H341*G341","v":0.15},{"$f":"IFERROR(SUMIF(RATES!B:B,'21. Bill Impacts'!D341,RATES!I:I),\"\")","v":4.0000000000000002E-4},{"$f":"IF($F331>0, $F331, $F330)","v":300},{"$f":"K341*J341","v":0.12000000000000001},-2.9999999999999985E-2,{"$f":"IF(ISERROR(M341/I341), \"\", M341/I341)","v":-0.1999999999999999}]
["UNMETERED SCATTERED LOAD SERVICE CLASSIFICATION","ST_A",{"$f":"B21","v":7},null,"Sub-Total A (excluding pass through)",null,null,null,{"$f":"SUM(I338:I341)","v":14.520000000000001},null,null,{"$f":"SUM(L338:L341)","v":14.52},0,{"$f":"IF((I342)=0,\"\",(M342/I342))","v":0}]
["UNMETERED SCATTERED LOAD SERVICE CLASSIFICATION",null,null,null,"Line Losses on Cost of Power",null,{"$f":"IF((F330*12>=150000), 0, IF(F329=\"RPP\",(G357*0.65+G358*0.17+G359*0.18),IF(F329=\"Non-RPP (Retailer)\",G360,G361)))","v":8.1990000000000007E-2},{"$f":"IF(G343=0, 0, $F330*F332-F330)","v":10.800000000000011},{"$f":"H343*G343","v":0.88549200000000106},{"$f":"IF((F330*12>=150000), 0, IF(F329=\"RPP\",(J357*0.65+J358*0.17+J359*0.18),IF(F329=\"Non-RPP (Retailer)\",J360,J361)))","v":8.1990000000000007E-2},{"$f":"IF(G343=0, 0, $F330*F332-F330)","v":10.800000000000011},{"$f":"K343*J343","v":0.88549200000000106},0,{"$f":"IF(ISERROR(M343/I343), \"\", M343/I343)","v":0}]
["UNMETERED SCATTERED LOAD SERVICE CLASSIFICATION",null,null,"USL_DVA","Total Deferral/Variance Account Rate Riders",null,{"$f":"IFERROR(SUMIF(RATES!B:B, '21. Bill Impacts'!D344,RATES!H:H),\"\")","v":-7.5000000000000002E-4},{"$f":"IF($F331>0, $F331, $F330)","v":300},{"$f":"H344*G344","v":-0.22500000000000001},{"$f":"IFERROR(SUMIF(RATES!B:B,'21. Bill Impacts'!D344,RATES!I:I),\"\")","v":-1.14E-3},{"$f":"IF($F331>0, $F331, $F330)","v":300},{"$f":"K344*J344","v":-0.34199999999999997},-0.11699999999999997,{"$f":"IF(ISERROR(M344/I344), \"\", M344/I344)","v":0.5199999999999998}]
["UNMETERED SCATTERED LOAD SERVICE CLASSIFICATION",null,null,"USL_GA","GA Rate Riders",null,null,null,{"$f":"H345*G345","v":0},null,null,{"$f":"K345*J345","v":0},0,{"$f":"IF(ISERROR(M345/I345), \"\", M345/I345)","v":""}]
["UNMETERED SCATTERED LOAD SERVICE CLASSIFICATION",null,null,"USL_LV","Low Voltage Service Charge",null,{"$f":"IFERROR(SUMIF(RATES!B:B, '21. Bill Impacts'!D346,RATES!H:H),\"\")","v":2.0000000000000001E-4},{"$f":"IF($F331>0, $F331, $F330)","v":300},{"$f":"H346*G346","v":6.0000000000000005E-2},{"$f":"IFERROR(SUMIF(RATES!B:B,'21. Bill Impacts'!D346,RATES!I:I),\"\")","v":2.0000000000000001E-4},{"$f":"IF($F331>0, $F331, $F330)","v":300},{"$f":"K346*J346","v":6.0000000000000005E-2},0,{"$f":"IF(ISERROR(M346/I346), \"\", M346/I346)","v":0}]
["UNMETERED SCATTERED LOAD SERVICE CLASSIFICATION",null,null,null,"Smart Meter Entity Charge (if applicable) and/or any fixed ($) Deferral/Variance Account Rate Riders",null,{"$f":"IFERROR(SUMIF(RATES!B:B, '21. Bill Impacts'!D347,RATES!H:H),\"\")","v":0},{"$f":"H338","v":1},{"$f":"H347*G347","v":0},0,{"$f":"K338","v":1},{"$f":"K347*J347","v":0},0,{"$f":"IF(ISERROR(M347/I347), \"\", M347/I347)","v":""}]
["UNMETERED SCATTERED LOAD SERVICE CLASSIFICATION","ST_B",{"$f":"C342","v":7},null,"Sub-Total B - Distribution (includes Sub-Total A)",null,null,null,{"$f":"SUM(I342:I347)","v":15.240492000000003},null,null,{"$f":"SUM(L342:L347)","v":15.123492000000001},-0.11700000000000266,{"$f":"IF((I348)=0,\"\",(M348/I348))","v":-7.6769175168362432E-3}]
["UNMETERED SCATTERED LOAD SERVICE CLASSIFICATION",null,null,"USL_TN","RTSR - Network",null,{"$f":"IFERROR(SUMIF(RATES!B:B, '21. Bill Impacts'!D349,RATES!H:H),\"\")","v":7.1000000000000004E-3},{"$f":"F330","v":300},{"$f":"H349*G349","v":2.1300000000000003},{"$f":"IFERROR(SUMIF(RATES!B:B,'21. Bill Impacts'!D349,RATES!I:I),\"\")","v":7.1000000000000004E-3},{"$f":"H349","v":300},{"$f":"K349*J349","v":2.1300000000000003},0,{"$f":"IF(ISERROR(M349/I349), \"\", M349/I349)","v":0}]
["UNMETERED SCATTERED LOAD SERVICE CLASSIFICATION",null,null,"USL_TC","RTSR - Connection and/or Line and Transformation Connection",null,{"$f":"IFERROR(SUMIF(RATES!B:B, '21. Bill Impacts'!D350,RATES!H:H),\"\")","v":6.4000000000000003E-3},{"$f":"H349","v":300},{"$f":"H350*G350","v":1.9200000000000002},{"$f":"IFERROR(SUMIF(RATES!B:B,'21. Bill Impacts'!D350,RATES!I:I),\"\")","v":6.4999999999999997E-3},{"$f":"H350","v":300},{"$f":"K350*J350","v":1.95},2.9999999999999805E-2,{"$f":"IF(ISERROR(M350/I350), \"\", M350/I350)","v":1.5624999999999898E-2}]
["UNMETERED SCATTERED LOAD SERVICE CLASSIFICATION","ST_C",{"$f":"C342","v":7},null,"Sub-Total C - Delivery (including Sub-Total B)",null,null,null,{"$f":"SUM(I348:I350)","v":19.290492000000004},null,null,{"$f":"SUM(L348:L350)","v":19.203492000000001},-8.7000000000003297E-2,{"$f":"IF((I351)=0,\"\",(M351/I351))","v":-4.5099938353051483E-3}]
["UNMETERED SCATTERED LOAD SERVICE CLASSIFICATION",null,null,null,"Wholesale Market Service Charge (WMSC)",null,3.5999999999999999E-3,{"$f":"F330*F332","v":310.8},{"$f":"H352*G352","v":1.1188800000000001},3.5999999999999999E-3,{"$f":"F330*F332","v":310.8},{"$f":"K352*J352","v":1.1188800000000001},0,{"$f":"IF(ISERROR(M352/I352), \"\", M352/I352)","v":0}]
["UNMETERED SCATTERED LOAD SERVICE CLASSIFICATION",null,null,null,"Rural and Remote Rate Protection (RRRP)",null,2.9999999999999997E-4,{"$f":"F330*F332","v":310.8},{"$f":"H353*G353","v":9.323999999999999E-2},2.9999999999999997E-4,{"$f":"F330*F332","v":310.8},{"$f":"K353*J353","v":9.323999999999999E-2},0,0]
["UNMETERED SCATTERED LOAD SERVICE CLASSIFICATION",null,null,null,"Standard Supply Service Charge",null,0.25,1,{"$f":"H354*G354","v":0.25},0.25,1,{"$f":"K354*J354","v":0.25},0,0]
["UNMETERED SCATTERED LOAD SERVICE CLASSIFICATION",null,null,null,"Debt Retirement Charge (DRC)",null,7.0000000000000001E-3,{"$f":"F330","v":300},{"$f":"H355*G355","v":2.1},0,{"$f":"F330","v":300},{"$f":"K355*J355","v":0},-2.1,-1]
["UNMETERED SCATTERED LOAD SERVICE CLASSIFICATION",null,null,null,null,null,null,null,null,null,null,null,0,""]
["UNMETERED SCATTERED LOAD SERVICE CLASSIFICATION","RPP",null,null,"TOU - Off Peak",null,6.5000000000000002E-2,{"$f":"IF(AND(F330*12>=150000),0.65*F330*F332,0.65*F330)","v":195},{"$f":"H357*G357","v":12.675000000000001},6.5000000000000002E-2,{"$f":"IF(AND(F330*12>=150000),0.65*F330*F333,0.65*F330)","v":195},{"$f":"K357*J357","v":12.675000000000001},0,0]
["UNMETERED SCATTERED LOAD SERVICE CLASSIFICATION","RPP",null,null,"TOU - Mid Peak",null,{"$f":"G92","v":9.4E-2},{"$f":"IF(AND(F330*12>=150000),0.17*F330*F332,0.17*F330)","v":51.000000000000007},{"$f":"H358*G358","v":4.7940000000000005},{"$f":"G358","v":9.4E-2},{"$f":"IF(AND(F330*12>=150000),0.17*F330*F333,0.17*F330)","v":51.000000000000007},{"$f":"K358*J358","v":4.7940000000000005},0,0]
["UNMETERED SCATTERED LOAD SERVICE CLASSIFICATION","RPP",null,null,"TOU - On Peak",null,0.13200000000000001,{"$f":"IF(AND(F330*12>=150000),0.18*F330*F332,0.18*F330)","v":54},{"$f":"H359*G359","v":7.1280000000000001},0.13200000000000001,{"$f":"IF(AND(F330*12>=150000),0.18*F330*F333,0.18*F330)","v":54},{"$f":"K359*J359","v":7.1280000000000001},0,0]
["UNMETERED SCATTERED LOAD SERVICE CLASSIFICATION","Non-RPP (Retailer)",null,null,"Non-RPP Retailer Avg. Price",null,{"$f":"0.1038","v":0.1038},{"$f":"IF(AND(F330*12>=150000),F330*F332,F330)","v":300},{"$f":"H360*G360","v":31.14},{"$f":"G360","v":0.1038},{"$f":"IF(AND(F330*12>=150000),F330*F333,F330)","v":300},{"$f":"K360*J360","v":31.14},0,0]
["UNMETERED SCATTERED LOAD SERVICE CLASSIFICATION","Non-RPP (Other)",null,null,"Average IESO Wholesale Market Price",null,{"$f":"G360","v":0.1038},{"$f":"IF(AND(F330*12>=150000),F330*F332,F330)","v":300},{"$f":"H361*G361","v":31.14},{"$f":"G361","v":0.1038},{"$f":"IF(AND(F330*12>=150000),F330*F333,F330)","v":300},{"$f":"K361*J361","v":31.14},0,0]
["UNMETERED SCATTERED LOAD SERVICE CLASSIFICATION"]
["UNMETERED SCATTERED LOAD SERVICE CLASSIFICATION","RPP_BT",{"$f":"C342","v":7},null,"Total Bill on TOU (before Taxes)",null,null,null,{"$f":"SUM(I352:I359,I351)","v":47.449612000000002},null,null,{"$f":"SUM(L352:L359,L351)","v":45.262612000000004},{"$f":"L363-I363","v":-2.1869999999999976},{"$f":"IF((I363)=0,\"\",(M363/I363))","v":-4.6090998594466852E-2}]
["UNMETERED SCATTERED LOAD SERVICE CLASSIFICATION","RPP",null,null,"HST",null,0.13,null,{"$f":"I363*G364","v":6.1684495600000009},0.13,null,{"$f":"L363*J364","v":5.8841395600000004},{"$f":"L364-I364","v":-0.28431000000000051},{"$f":"IF((I364)=0,\"\",(M364/I364))","v":-4.6090998594466984E-2}]
["UNMETERED SCATTERED LOAD SERVICE CLASSIFICATION","RPP_NET",{"$f":"C363","v":7},null,"Total Bill on TOU (before 8% Provincial Rebate)",null,null,null,{"$f":"SUM(I363:I364)","v":53.618061560000001},null,null,{"$f":"SUM(L363:L364)","v":51.146751560000006},{"$f":"SUM(M363:M364)","v":-2.4713099999999981},{"$f":"IF((I365)=0,\"\",(M365/I365))","v":-4.6090998594466873E-2}]
[{"$f":"A364","v":"UNMETERED SCATTERED LOAD SERVICE CLASSIFICATION"},"RPP",null,null,"8% Provincial Rebate",null,-0.08,null,{"$f":"I363*G366","v":-3.7959689600000002},{"$f":"G366","v":-0.08},null,{"$f":"L363*J366","v":-3.6210089600000006},{"$f":"L366-I366","v":0.17495999999999956},{"$f":"IF((I366)=0,\"\",(M366/I366))","v":-4.6090998594466789E-2}]
[{"$f":"A366","v":"UNMETERED SCATTERED LOAD SERVICE CLASSIFICATION"},"RPP_TOTAL",{"$f":"C363","v":7},null,"Total Bill on TOU",null,null,null,{"$f":"SUM(I363,I364,I366)","v":49.822092599999998},null,null,{"$f":"L363+L364+L366","v":47.525742600000008},{"$f":"L367-I367","v":-2.2963499999999897},{"$f":"IF((I367)=0,\"\",(M367/I367))","v":-4.6090998594466699E-2}]
["UNMETERED SCATTERED LOAD SERVICE CLASSIFICATION","RPP"]
["UNMETERED SCATTERED LOAD SERVICE CLASSIFICATION","Non-RPP (Retailer)",null,null,"Total Bill on Non-RPP Avg. Price",null,null,null,{"$f":"SUM(I360,I352:I356,I351)","v":53.992612000000008},null,null,{"$f":"SUM(L360,L352:L356,L351)","v":51.805611999999996},{"$f":"L369-I369","v":-2.1870000000000118},{"$f":"IF((I369)=0,\"\",(M369/I369))","v":-4.0505541758194832E-2}]
["UNMETERED SCATTERED LOAD SERVICE CLASSIFICATION","Non-RPP (Retailer)",null,null,"HST",null,0.13,null,{"$f":"I369*G370","v":7.0190395600000013},0.13,null,{"$f":"L369*J370","v":6.7347295599999999},{"$f":"L370-I370","v":-0.28431000000000139},{"$f":"IF((I370)=0,\"\",(M370/I370))","v":-4.0505541758194812E-2}]
["UNMETERED SCATTERED LOAD SERVICE CLASSIFICATION","Non-RPP (Retailer)",null,null,"Provincial Rebate",null,-0.08,null,{"$f":"I369*G371","v":-4.3194089600000005},{"$f":"G371","v":-0.08},null,{"$f":"L369*J371","v":-4.1444489600000001},{"$f":"L371-I371","v":0.17496000000000045},{"$f":"IF((I371)=0,\"\",(M371/I371))","v":-4.0505541758194721E-2}]
["UNMETERED SCATTERED LOAD SERVICE CLASSIFICATION","Non-RPP (Retailer)_TOTAL",null,null,"Total Bill on Non-RPP Avg. Price",null,null,null,{"$f":"SUM(I369,I370,I371)","v":56.692242600000014},null,null,{"$f":"SUM(L369,L370,L371)","v":54.395892599999996},{"$f":"L372-I372","v":-2.2963500000000181},{"$f":"IF((I372)=0,\"\",(M372/I372))","v":-4.050554175819493E-2}]
["UNMETERED SCATTERED LOAD SERVICE CLASSIFICATION","Non-RPP (Retailer)"]
["UNMETERED SCATTERED LOAD SERVICE CLASSIFICATION","Non-RPP (Other)_BT",null,null,"Total Bill on Average IESO Wholesale Market Price",null,null,null,{"$f":"SUM(I361,I352:I356,I351)","v":53.992612000000008},null,null,{"$f":"SUM(L361,L352:L356,L351)","v":51.805611999999996},{"$f":"L374-I374","v":-2.1870000000000118},{"$f":"IF((I374)=0,\"\",(M374/I374))","v":-4.0505541758194832E-2}]
["UNMETERED SCATTERED LOAD SERVICE CLASSIFICATION","Non-RPP (Other)",null,null,"HST",null,0.13,null,{"$f":"I374*G375","v":7.0190395600000013},0.13,null,{"$f":"L374*J375","v":6.7347295599999999},{"$f":"L375-I375","v":-0.28431000000000139},{"$f":"IF((I375)=0,\"\",(M375/I375))","v":-4.0505541758194812E-2}]
["UNMETERED SCATTERED LOAD SERVICE CLASSIFICATION","Non-RPP (Other)_NET",null,null,"Total Bill on Average IESO WMP (before 8% Provincial Rebate)",null,null,null,{"$f":"SUM(I374:I375)","v":61.011651560000011},null,null,{"$f":"SUM(L374:L375)","v":58.540341559999995},{"$f":"SUM(M374:M375)","v":-2.4713100000000132},{"$f":"IF((I376)=0,\"\",(M376/I376))","v":-4.0505541758194832E-2}]
[{"$f":"A375","v":"UNMETERED SCATTERED LOAD SERVICE CLASSIFICATION"},"Non-RPP (Other)",null,null,"8% Provincial Rebate",null,-0.08,null,{"$f":"I374*G377","v":-4.3194089600000005},{"$f":"G377","v":-0.08},null,{"$f":"L374*J377","v":-4.1444489600000001},{"$f":"L377-I377","v":0.17496000000000045},{"$f":"IF((I377)=0,\"\",(M377/I377))","v":-4.0505541758194721E-2}]
[{"$f":"A377","v":"UNMETERED SCATTERED LOAD SERVICE CLASSIFICATION"},"Non-RPP (Other)_TOTAL",null,null,"Total Bill on Average IESO Wholesale Market Price",null,null,null,{"$f":"SUM(I374,I375,I377)","v":56.692242600000014},null,null,{"$f":"SUM(L374,L375,L377)","v":54.395892599999996},{"$f":"L378-I378","v":-2.2963500000000181},{"$f":"IF((I378)=0,\"\",(M378/I378))","v":-4.050554175819493E-2}]
[{"$f":"A378","v":"UNMETERED SCATTERED LOAD SERVICE CLASSIFICATION"},"Non-RPP (Other)"]
[]
[]
[null,null,null,null,"Customer Class:",{"$f":"E22","v":"STREET LIGHTING SERVICE CLASSIFICATION"},null,null,null,null,null,{"$f":"IF(O332=\"DEMAND - INTERVAL\",\"RTSR - INTERVAL METERED\",\"\")","v":""}]
[null,null,null,null,"RPP / Non-RPP:",{"$f":"H22","v":"Non-RPP (Other)"}]
[null,null,null,null,"Consumption",{"$f":"K22","v":33},"kWh"]
[null,null,null,null,"Demand",{"$f":"L22","v":0.1},"kW"]
[null,null,null,null,"Current Loss Factor",{"$f":"I22","v":1.036}]
[null,null,null,null,"Proposed/Approved Loss Factor",{"$f":"J22","v":1.036}]
[]
[null,null,null,null,null,null,"Current OEB-Approved",null,null,"Proposed",null,null,"Impact"]
[null,null,null,null,null,null,"Rate","Volume","Charge","Rate","Volume","Charge","$ Change","% Change"]
[null,null,null,null,null,null,"($)",null,"($)","($)",null,"($)"]
[{"$f":"F382","v":"STREET LIGHTING SERVICE CLASSIFICATION"},null,null,"SL_F","Monthly Service Charge",null,{"$f":"IFERROR(SUMIF(RATES!B:B, '21. Bill Impacts'!D392,RATES!H:H),\"\")","v":1.52},1,{"$f":"H392*G392","v":1.52},{"$f":"IFERROR(SUMIF(RATES!B:B,'21. Bill Impacts'!D392,RATES!I:I),\"\")","v":1.53},{"$f":"H392","v":1},{"$f":"K392*J392","v":1.53},{"$f":"L392-I392","v":1.0000000000000009E-2},{"$f":"IF(ISERROR(M392/I392), \"\", M392/I392)","v":6.5789473684210583E-3}]
[{"$f":"A392","v":"STREET LIGHTING SERVICE CLASSIFICATION"},null,null,"SL_V","Distribution Volumetric Rate",null,{"$f":"IFERROR(SUMIF(RATES!B:B, '21. Bill Impacts'!D393,RATES!H:H),\"\")","v":11.650399999999999},{"$f":"IF($F385>0, $F385, $F384)","v":0.1},{"$f":"H393*G393","v":1.1650400000000001},{"$f":"IFERROR(SUMIF(RATES!B:B,'21. Bill Impacts'!D393,RATES!I:I),\"\")","v":11.7553},{"$f":"IF($F385>0, $F385, $F384)","v":0.1},{"$f":"K393*J393","v":1.17553},1.0489999999999888E-2,{"$f":"IF(ISERROR(M393/I393), \"\", M393/I393)","v":9.0039826958730074E-3}]
["STREET LIGHTING SERVICE CLASSIFICATION",null,null,"SL_FRR","Fixed Rate Riders",null,{"$f":"IFERROR(SUMIF(RATES!B:B, '21. Bill Impacts'!D394,RATES!H:H),\"\")","v":6.0000000000000005E-2},{"$f":"H392","v":1},{"$f":"H394*G394","v":6.0000000000000005E-2},{"$f":"IFERROR(SUMIF(RATES!B:B,'21. Bill Impacts'!D394,RATES!I:I),\"\")","v":0.05},{"$f":"K392","v":1},{"$f":"K394*J394","v":0.05},-1.0000000000000002E-2,{"$f":"IF(ISERROR(M394/I394), \"\", M394/I394)","v":-0.16666666666666669}]
["STREET LIGHTING SERVICE CLASSIFICATION",null,null,"SL_VRR","Volumetric Rate Riders",null,{"$f":"IFERROR(SUMIF(RATES!B:B, '21. Bill Impacts'!D395,RATES!H:H),\"\")","v":-32.985700000000001},{"$f":"IF($F385>0, $F385, $F384)","v":0.1},{"$f":"H395*G395","v":-3.2985700000000002},{"$f":"IFERROR(SUMIF(RATES!B:B,'21. Bill Impacts'!D395,RATES!I:I),\"\")","v":-36.808900000000001},{"$f":"IF($F385>0, $F385, $F384)","v":0.1},{"$f":"K395*J395","v":-3.6808900000000002},-0.38231999999999999,{"$f":"IF(ISERROR(M395/I395), \"\", M395/I395)","v":0.11590477085524939}]
["STREET LIGHTING SERVICE CLASSIFICATION","ST_A",{"$f":"B22","v":8},null,"Sub-Total A (excluding pass through)",null,null,null,{"$f":"SUM(I392:I395)","v":-0.5535300000000003},null,null,{"$f":"SUM(L392:L395)","v":-0.9253600000000004},-0.3718300000000001,{"$f":"IF((I396)=0,\"\",(M396/I396))","v":0.67174317561830421}]
["STREET LIGHTING SERVICE CLASSIFICATION",null,null,null,"Line Losses on Cost of Power",null,{"$f":"IF((F384*12>=150000), 0, IF(F383=\"RPP\",(G411*0.65+G412*0.17+G413*0.18),IF(F383=\"Non-RPP (Retailer)\",G414,G415)))","v":0.1038},{"$f":"IF(G397=0, 0, $F384*F386-F384)","v":1.1880000000000024},{"$f":"H397*G397","v":0.12331440000000025},{"$f":"IF((F384*12>=150000), 0, IF(F383=\"RPP\",(J411*0.65+J412*0.17+J413*0.18),IF(F383=\"Non-RPP (Retailer)\",J414,J415)))","v":0.1038},{"$f":"IF(G397=0, 0, $F384*F386-F384)","v":1.1880000000000024},{"$f":"K397*J397","v":0.12331440000000025},0,{"$f":"IF(ISERROR(M397/I397), \"\", M397/I397)","v":0}]
["STREET LIGHTING SERVICE CLASSIFICATION",null,null,"SL_DVA","Total Deferral/Variance Account Rate Riders",null,{"$f":"IFERROR(SUMIF(RATES!B:B, '21. Bill Impacts'!D398,RATES!H:H),\"\")","v":-0.27815000000000001},{"$f":"IF($F385>0, $F385, $F384)","v":0.1},{"$f":"H398*G398","v":-2.7815000000000003E-2},{"$f":"IFERROR(SUMIF(RATES!B:B,'21. Bill Impacts'!D398,RATES!I:I),\"\")","v":-0.41106999999999999},{"$f":"IF($F385>0, $F385, $F384)","v":0.1},{"$f":"K398*J398","v":-4.1107000000000005E-2},-1.3292000000000002E-2,{"$f":"IF(ISERROR(M398/I398), \"\", M398/I398)","v":0.4778716519863383}]
["STREET LIGHTING SERVICE CLASSIFICATION",null,null,"SL_GA","GA Rate Riders",null,{"$f":"IFERROR(SUMIF(RATES!B:B, '21. Bill Impacts'!D399,RATES!H:H),\"\")","v":-5.0000000000000001E-4},{"$f":"F384","v":33},{"$f":"H399*G399","v":-1.6500000000000001E-2},{"$f":"IFERROR(SUMIF(RATES!B:B,'21. Bill Impacts'!D399,RATES!I:I),\"\")","v":1.1999999999999999E-3},{"$f":"K409","v":33},{"$f":"K399*J399","v":3.9599999999999996E-2},5.6099999999999997E-2,{"$f":"IF(ISERROR(M399/I399), \"\", M399/I399)","v":-3.3999999999999995}]
["STREET LIGHTING SERVICE CLASSIFICATION",null,null,"SL_LV","Low Voltage Service Charge",null,{"$f":"IFERROR(SUMIF(RATES!B:B, '21. Bill Impacts'!D400,RATES!H:H),\"\")","v":5.8000000000000003E-2},{"$f":"IF($F385>0, $F385, $F384)","v":0.1},{"$f":"H400*G400","v":5.8000000000000005E-3},{"$f":"IFERROR(SUMIF(RATES!B:B,'21. Bill Impacts'!D400,RATES!I:I),\"\")","v":5.8000000000000003E-2},{"$f":"IF($F385>0, $F385, $F384)","v":0.1},{"$f":"K400*J400","v":5.8000000000000005E-3},0,{"$f":"IF(ISERROR(M400/I400), \"\", M400/I400)","v":0}]
["STREET LIGHTING SERVICE CLASSIFICATION",null,null,null,"Smart Meter Entity Charge (if applicable) and/or any fixed ($) Deferral/Variance Account Rate Riders",null,{"$f":"IFERROR(SUMIF(RATES!B:B, '21. Bill Impacts'!D401,RATES!H:H),\"\")","v":0},{"$f":"H392","v":1},{"$f":"H401*G401","v":0},0,{"$f":"K392","v":1},{"$f":"K401*J401","v":0},0,{"$f":"IF(ISERROR(M401/I401), \"\", M401/I401)","v":""}]
["STREET LIGHTING SERVICE CLASSIFICATION","ST_B",{"$f":"C396","v":8},null,"Sub-Total B - Distribution (includes Sub-Total A)",null,null,null,{"$f":"SUM(I396:I401)","v":-0.4687306},null,null,{"$f":"SUM(L396:L401)","v":-0.79775260000000014},-0.32902200000000015,{"$f":"IF((I402)=0,\"\",(M402/I402))","v":0.7019426510665191}]
["STREET LIGHTING SERVICE CLASSIFICATION",null,null,"SL_TN","RTSR - Network",null,{"$f":"IFERROR(SUMIF(RATES!B:B, '21. Bill Impacts'!D403,RATES!H:H),\"\")","v":1.8924000000000001},{"$f":"F385","v":0.1},{"$f":"H403*G403","v":0.18924000000000002},{"$f":"IFERROR(SUMIF(RATES!B:B,'21. Bill Impacts'!D403,RATES!I:I),\"\")","v":1.9012},{"$f":"H403","v":0.1},{"$f":"K403*J403","v":0.19012000000000001},8.799999999999919E-4,{"$f":"IF(ISERROR(M403/I403), \"\", M403/I403)","v":4.6501796660325077E-3}]
["STREET LIGHTING SERVICE CLASSIFICATION",null,null,"SL_TC","RTSR - Connection and/or Line and Transformation Connection",null,{"$f":"IFERROR(SUMIF(RATES!B:B, '21. Bill Impacts'!D404,RATES!H:H),\"\")","v":1.8329},{"$f":"F385","v":0.1},{"$f":"H404*G404","v":0.18329000000000001},{"$f":"IFERROR(SUMIF(RATES!B:B,'21. Bill Impacts'!D404,RATES!I:I),\"\")","v":1.8634999999999999},{"$f":"H404","v":0.1},{"$f":"K404*J404","v":0.18635000000000002},3.0600000000000072E-3,{"$f":"IF(ISERROR(M404/I404), \"\", M404/I404)","v":1.6694855147580377E-2}]
["STREET LIGHTING SERVICE CLASSIFICATION","ST_C",{"$f":"C396","v":8},null,"Sub-Total C - Delivery (including Sub-Total B)",null,null,null,{"$f":"SUM(I402:I404)","v":-9.6200599999999969E-2},null,null,{"$f":"SUM(L402:L404)","v":-0.42128260000000006},-0.32508200000000009,{"$f":"IF((I405)=0,\"\",(M405/I405))","v":3.3792096930788396}]
["STREET LIGHTING SERVICE CLASSIFICATION",null,null,null,"Wholesale Market Service Charge (WMSC)",null,3.5999999999999999E-3,{"$f":"F384*F386","v":34.188000000000002},{"$f":"H406*G406","v":0.1230768},3.5999999999999999E-3,{"$f":"F384*F386","v":34.188000000000002},{"$f":"K406*J406","v":0.1230768},0,{"$f":"IF(ISERROR(M406/I406), \"\", M406/I406)","v":0}]
["STREET LIGHTING SERVICE CLASSIFICATION",null,null,null,"Rural and Remote Rate Protection (RRRP)",null,2.9999999999999997E-4,{"$f":"F384*F386","v":34.188000000000002},{"$f":"H407*G407","v":1.0256400000000001E-2},2.9999999999999997E-4,{"$f":"F384*F386","v":34.188000000000002},{"$f":"K407*J407","v":1.0256400000000001E-2},0,0]
["STREET LIGHTING SERVICE CLASSIFICATION",null,null,null,"Standard Supply Service Charge",null,0.25,null,{"$f":"H408*G408","v":0},0.25,null,{"$f":"K408*J408","v":0},0,""]
["STREET LIGHTING SERVICE CLASSIFICATION",null,null,null,"Debt Retirement Charge (DRC)",null,7.0000000000000001E-3,{"$f":"F384","v":33},{"$f":"H409*G409","v":0.23100000000000001},0,{"$f":"F384","v":33},{"$f":"K409*J409","v":0},-0.23100000000000001,-1]
["STREET LIGHTING SERVICE CLASSIFICATION",null,null,null,null,null,null,null,null,null,null,null,0,""]
["STREET LIGHTING SERVICE CLASSIFICATION","RPP",null,null,"TOU - Off Peak",null,6.5000000000000002E-2,{"$f":"IF(AND(F384*12>=150000),0.65*F384*F386,0.65*F384)","v":21.45},{"$f":"H411*G411","v":1.39425},6.5000000000000002E-2,{"$f":"IF(AND(F384*12>=150000),0.65*F384*F387,0.65*F384)","v":21.45},{"$f":"K411*J411","v":1.39425},0,0]
["STREET LIGHTING SERVICE CLASSIFICATION","RPP",null,null,"TOU - Mid Peak",null,{"$f":"G92","v":9.4E-2},{"$f":"IF(AND(F384*12>=150000),0.17*F384*F386,0.17*F384)","v":5.61},{"$f":"H412*G412","v":0.52734000000000003},{"$f":"G412","v":9.4E-2},{"$f":"IF(AND(F384*12>=150000),0.17*F384*F387,0.17*F384)","v":5.61},{"$f":"K412*J412","v":0.52734000000000003},0,0]
["STREET LIGHTING SERVICE CLASSIFICATION","RPP",null,null,"TOU - On Peak",null,0.13200000000000001,{"$f":"IF(AND(F384*12>=150000),0.18*F384*F386,0.18*F384)","v":5.9399999999999995},{"$f":"H413*G413","v":0.78408},0.13200000000000001,{"$f":"IF(AND(F384*12>=150000),0.18*F384*F387,0.18*F384)","v":5.9399999999999995},{"$f":"K413*J413","v":0.78408},0,0]
["STREET LIGHTING SERVICE CLASSIFICATION","Non-RPP (Retailer)",null,null,"Non-RPP Retailer Avg. Price",null,{"$f":"0.1038","v":0.1038},{"$f":"IF(AND(F384*12>=150000),F384*F386,F384)","v":33},{"$f":"H414*G414","v":3.4254000000000002},{"$f":"G414","v":0.1038},{"$f":"IF(AND(F384*12>=150000),F384*F387,F384)","v":33},{"$f":"K414*J414","v":3.4254000000000002},0,0]
["STREET LIGHTING SERVICE CLASSIFICATION","Non-RPP (Other)",null,null,"Average IESO Wholesale Market Price",null,0.1038,{"$f":"IF(AND(F384*12>=150000),F384*F386,F384)","v":33},{"$f":"H415*G415","v":3.4254000000000002},{"$f":"G415","v":0.1038},{"$f":"IF(AND(F384*12>=150000),F384*F387,F384)","v":33},{"$f":"K415*J415","v":3.4254000000000002},0,0]
["STREET LIGHTING SERVICE CLASSIFICATION"]
["STREET LIGHTING SERVICE CLASSIFICATION","RPP",null,null,"Total Bill on TOU (before Taxes)",null,null,null,{"$f":"SUM(I406:I413,I405)","v":2.9738026},null,null,{"$f":"SUM(L406:L413,L405)","v":2.4177206},{"$f":"L417-I417","v":-0.55608199999999997},{"$f":"IF((I417)=0,\"\",(M417/I417))","v":-0.1869935818873788}]
["STREET LIGHTING SERVICE CLASSIFICATION","RPP",null,null,"HST",null,0.13,null,{"$f":"I417*G418","v":0.38659433799999998},0.13,null,{"$f":"L417*J418","v":0.31430367800000003},{"$f":"L418-I418","v":-7.2290659999999951E-2},{"$f":"IF((I418)=0,\"\",(M418/I418))","v":-0.18699358188737869}]
["STREET LIGHTING SERVICE CLASSIFICATION","RPP",null,null,"Provincial Rebate",null,-0.08,null,{"$f":"I417*G419","v":-0.23790420800000001},{"$f":"G419","v":-0.08},null,{"$f":"L417*J419","v":-0.193417648},{"$f":"L419-I419","v":4.4486560000000008E-2},{"$f":"IF((I419)=0,\"\",(M419/I419))","v":-0.18699358188737883}]
["STREET LIGHTING SERVICE CLASSIFICATION","RPP_TOTAL",null,null,"Total Bill on TOU",null,null,null,{"$f":"SUM(I417,I418,I419)","v":3.1224927300000003},null,null,{"$f":"L417+L418+L419","v":2.5386066299999999},{"$f":"L420-I420","v":-0.58388610000000041},{"$f":"IF((I420)=0,\"\",(M420/I420))","v":-0.18699358188737891}]
["STREET LIGHTING SERVICE CLASSIFICATION","RPP"]
["STREET LIGHTING SERVICE CLASSIFICATION","Non-RPP (Retailer)",null,null,"Total Bill on Non-RPP Avg. Price",null,null,null,{"$f":"SUM(I414,I406:I410,I405)","v":3.6935326000000002},null,null,{"$f":"SUM(L414,L406:L410,L405)","v":3.1374506000000002},{"$f":"L422-I422","v":-0.55608199999999997},{"$f":"IF((I422)=0,\"\",(M422/I422))","v":-0.15055559547518274}]
["STREET LIGHTING SERVICE CLASSIFICATION","Non-RPP (Retailer)",null,null,"HST",null,0.13,null,{"$f":"I422*G423","v":0.48015923800000004},0.13,null,{"$f":"L422*J423","v":0.40786857800000004},{"$f":"L423-I423","v":-7.2290660000000007E-2},{"$f":"IF((I423)=0,\"\",(M423/I423))","v":-0.15055559547518277}]
["STREET LIGHTING SERVICE CLASSIFICATION","Non-RPP (Retailer)",null,null,"Provincial Rebate",null,-0.08,null,{"$f":"I422*G424","v":-0.29548260800000004},{"$f":"G424","v":-0.08},null,{"$f":"L422*J424","v":-0.25099604800000003},{"$f":"L424-I424","v":4.4486560000000008E-2},{"$f":"IF((I424)=0,\"\",(M424/I424))","v":-0.15055559547518277}]
["STREET LIGHTING SERVICE CLASSIFICATION","Non-RPP (Retailer)_TOTAL",null,null,"Total Bill on Non-RPP Avg. Price",null,null,null,{"$f":"SUM(I422,I423,I424)","v":3.87820923},null,null,{"$f":"SUM(L422,L423,L424)","v":3.29432313},{"$f":"L425-I425","v":-0.58388609999999996},{"$f":"IF((I425)=0,\"\",(M425/I425))","v":-0.15055559547518274}]
["STREET LIGHTING SERVICE CLASSIFICATION","Non-RPP (Retailer)"]
["STREET LIGHTING SERVICE CLASSIFICATION","Non-RPP (Other)_BT",8,null,"Total Bill on Average IESO Wholesale Market Price",null,null,null,{"$f":"SUM(I415,I406:I410,I405)","v":3.6935326000000002},null,null,{"$f":"SUM(L415,L406:L410,L405)","v":3.1374506000000002},{"$f":"L427-I427","v":-0.55608199999999997},{"$f":"IF((I427)=0,\"\",(M427/I427))","v":-0.15055559547518274}]
["STREET LIGHTING SERVICE CLASSIFICATION","Non-RPP (Other)",null,null,"HST",null,0.13,null,{"$f":"I427*G428","v":0.48015923800000004},0.13,null,{"$f":"L427*J428","v":0.40786857800000004},{"$f":"L428-I428","v":-7.2290660000000007E-2},{"$f":"IF((I428)=0,\"\",(M428/I428))","v":-0.15055559547518277}]
["STREET LIGHTING SERVICE CLASSIFICATION","Non-RPP (Other)_NET",8,null,"Total Bill on Average IESO WMP (before 8% Provincial Rebate)",null,null,null,{"$f":"SUM(I427:I428)","v":4.1736918379999999},null,null,{"$f":"SUM(L427:L428)","v":3.5453191780000002},{"$f":"SUM(M427:M428)","v":-0.62837265999999992},{"$f":"IF((I429)=0,\"\",(M429/I429))","v":-0.15055559547518274}]
[{"$f":"A428","v":"STREET LIGHTING SERVICE CLASSIFICATION"},"Non-RPP (Other)",null,null,"8% Provincial Rebate",null,0,null,{"$f":"I427*G430","v":0},{"$f":"G430","v":0},null,{"$f":"L427*J430","v":0},{"$f":"L430-I430","v":0},{"$f":"IF((I430)=0,\"\",(M430/I430))","v":""}]
[{"$f":"A430","v":"STREET LIGHTING SERVICE CLASSIFICATION"},"Non-RPP (Other)_TOTAL",8,null,"Total Bill on Average IESO Wholesale Market Price",null,null,null,{"$f":"SUM(I427,I428,I430)","v":4.1736918379999999},null,null,{"$f":"SUM(L427,L428,L430)","v":3.5453191780000002},{"$f":"L431-I431","v":-0.62837265999999969},{"$f":"IF((I431)=0,\"\",(M431/I431))","v":-0.15055559547518269}]
[{"$f":"A431","v":"STREET LIGHTING SERVICE CLASSIFICATION"},"Non-RPP (Other)"]
[]
[]
[null,null,null,null,"Customer Class:",{"$f":"E23","v":"RESIDENTIAL SERVICE CLASSIFICATION"},null,null,null,null,null,{"$f":"IF(O386=\"DEMAND - INTERVAL\",\"RTSR - INTERVAL METERED\",\"\")","v":""}]
[null,null,null,null,"RPP / Non-RPP:",{"$f":"H23","v":"Non-RPP (Retailer)"}]
[null,null,null,null,"Consumption",{"$f":"K23","v":750},"kWh"]
[null,null,null,null,"Demand",{"$f":"L23","v":0},"kW"]
[null,null,null,null,"Current Loss Factor",{"$f":"I23","v":1.036}]
[null,null,null,null,"Proposed/Approved Loss Factor",{"$f":"J23","v":1.036}]
[]
[null,null,null,null,null,null,"Current OEB-Approved",null,null,"Proposed",null,null,"Impact"]
[null,null,null,null,null,null,"Rate","Volume","Charge","Rate","Volume","Charge","$ Change","% Change"]
[null,null,null,null,null,null,"($)",null,"($)","($)",null,"($)"]
[{"$f":"F435","v":"RESIDENTIAL SERVICE CLASSIFICATION"},null,null,"R_F","Monthly Service Charge",null,{"$f":"IFERROR(SUMIF(RATES!B:B, '21. Bill Impacts'!D445,RATES!H:H),\"\")","v":21.61},1,{"$f":"H445*G445","v":21.61},{"$f":"IFERROR(SUMIF(RATES!B:B,'21. Bill Impacts'!D445,RATES!I:I),\"\")","v":24.18},1,{"$f":"K445*J445","v":24.18},{"$f":"L445-I445","v":2.5700000000000003},{"$f":"IF(ISERROR(M445/I445), \"\", M445/I445)","v":0.11892642295233689}]
[{"$f":"A445","v":"RESIDENTIAL SERVICE CLASSIFICATION"},null,null,"R_V","Distribution Volumetric Rate",null,{"$f":"IFERROR(SUMIF(RATES!B:B, '21. Bill Impacts'!D446,RATES!H:H),\"\")","v":3.5000000000000001E-3},{"$f":"IF($F438>0, $F438, $F437)","v":750},{"$f":"H446*G446","v":2.625},{"$f":"IFERROR(SUMIF(RATES!B:B,'21. Bill Impacts'!D446,RATES!I:I),\"\")","v":0},{"$f":"IF($F438>0, $F438, $F437)","v":750},{"$f":"K446*J446","v":0},-2.625,{"$f":"IF(ISERROR(M446/I446), \"\", M446/I446)","v":-1}]
["RESIDENTIAL SERVICE CLASSIFICATION",null,null,"R_FRR","Fixed Rate Riders",null,{"$f":"IFERROR(SUMIF(RATES!B:B, '21. Bill Impacts'!D447,RATES!H:H),\"\")","v":0.93},1,{"$f":"H447*G447","v":0.93},{"$f":"IFERROR(SUMIF(RATES!B:B,'21. Bill Impacts'!D447,RATES!I:I),\"\")","v":0.69000000000000006},1,{"$f":"K447*J447","v":0.69000000000000006},-0.24,{"$f":"IF(ISERROR(M447/I447), \"\", M447/I447)","v":-0.25806451612903225}]
["RESIDENTIAL SERVICE CLASSIFICATION",null,null,"R_VRR","Volumetric Rate Riders",null,{"$f":"IFERROR(SUMIF(RATES!B:B, '21. Bill Impacts'!D448,RATES!H:H),\"\")","v":-2.0000000000000001E-4},{"$f":"IF($F438>0, $F438, $F437)","v":750},{"$f":"H448*G448","v":-0.15},{"$f":"IFERROR(SUMIF(RATES!B:B,'21. Bill Impacts'!D448,RATES!I:I),\"\")","v":0},{"$f":"IF($F438>0, $F438, $F437)","v":750},{"$f":"K448*J448","v":0},0.15,{"$f":"IF(ISERROR(M448/I448), \"\", M448/I448)","v":-1}]
["RESIDENTIAL SERVICE CLASSIFICATION","ST_A",{"$f":"B23","v":9},null,"Sub-Total A (excluding pass through)",null,null,null,{"$f":"SUM(I445:I448)","v":25.015000000000001},null,null,{"$f":"SUM(L445:L448)","v":24.87},-0.14499999999999957,{"$f":"IF((I449)=0,\"\",(M449/I449))","v":-5.7965220867479336E-3}]
["RESIDENTIAL SERVICE CLASSIFICATION",null,null,null,"Line Losses on Cost of Power",null,{"$f":"IF((F437*12>=150000), 0, IF(F436=\"RPP\",(G464*0.65+G465*0.17+G466*0.18),IF(F436=\"Non-RPP (Retailer)\",G467,G468)))","v":0.1038},{"$f":"IF(G450=0, 0, $F437*F439-F437)","v":27},{"$f":"H450*G450","v":2.8026},{"$f":"IF((F437*12>=150000), 0, IF(F436=\"RPP\",(J464*0.65+J465*0.17+J466*0.18),IF(F436=\"Non-RPP (Retailer)\",J467,J468)))","v":0.1038},{"$f":"IF(G450=0, 0, $F437*F439-F437)","v":27},{"$f":"K450*J450","v":2.8026},0,{"$f":"IF(ISERROR(M450/I450), \"\", M450/I450)","v":0}]
["RESIDENTIAL SERVICE CLASSIFICATION",null,null,"R_DVA","Total Deferral/Variance Account Rate Riders",null,{"$f":"IFERROR(SUMIF(RATES!B:B, '21. Bill Impacts'!D451,RATES!H:H),\"\")","v":-7.5000000000000002E-4},{"$f":"IF($F438>0, $F438, $F437)","v":750},{"$f":"H451*G451","v":-0.5625},{"$f":"IFERROR(SUMIF(RATES!B:B,'21. Bill Impacts'!D451,RATES!I:I),\"\")","v":-1.14E-3},{"$f":"IF($F438>0, $F438, $F437)","v":750},{"$f":"K451*J451","v":-0.85499999999999998},-0.29249999999999998,{"$f":"IF(ISERROR(M451/I451), \"\", M451/I451)","v":0.52}]
["RESIDENTIAL SERVICE CLASSIFICATION",null,null,"R_GA","GA Rate Riders",null,{"$f":"IFERROR(SUMIF(RATES!B:B, '21. Bill Impacts'!D452,RATES!H:H),\"\")","v":-5.0000000000000001E-4},{"$f":"F437","v":750},{"$f":"H452*G452","v":-0.375},{"$f":"IFERROR(SUMIF(RATES!B:B,'21. Bill Impacts'!D452,RATES!I:I),\"\")","v":1.1999999999999999E-3},{"$f":"F437","v":750},{"$f":"K452*J452","v":0.89999999999999991},1.2749999999999999,{"$f":"IF(ISERROR(M452/I452), \"\", M452/I452)","v":-3.4}]
["RESIDENTIAL SERVICE CLASSIFICATION",null,null,"R_LV","Low Voltage Service Charge",null,{"$f":"IFERROR(SUMIF(RATES!B:B, '21. Bill Impacts'!D453,RATES!H:H),\"\")","v":2.0000000000000001E-4},{"$f":"IF($F438>0, $F438, $F437)","v":750},{"$f":"H453*G453","v":0.15},{"$f":"IFERROR(SUMIF(RATES!B:B,'21. Bill Impacts'!D453,RATES!I:I),\"\")","v":2.0000000000000001E-4},{"$f":"IF($F438>0, $F438, $F437)","v":750},{"$f":"K453*J453","v":0.15},0,{"$f":"IF(ISERROR(M453/I453), \"\", M453/I453)","v":0}]
["RESIDENTIAL SERVICE CLASSIFICATION",null,null,null,"Smart Meter Entity Charge (if applicable) and/or any fixed ($) Deferral/Variance Account Rate Riders",null,0.56999999999999995,1,{"$f":"H454*G454","v":0.56999999999999995},0.56999999999999995,1,{"$f":"K454*J454","v":0.56999999999999995},0,{"$f":"IF(ISERROR(M454/I454), \"\", M454/I454)","v":0}]
["RESIDENTIAL SERVICE CLASSIFICATION","ST_B",{"$f":"C449","v":9},null,"Sub-Total B - Distribution (includes Sub-Total A)",null,null,null,{"$f":"SUM(I449:I454)","v":27.600099999999998},null,null,{"$f":"SUM(L449:L454)","v":28.4376},0.83750000000000213,{"$f":"IF((I455)=0,\"\",(M455/I455))","v":3.034409295618502E-2}]
["RESIDENTIAL SERVICE CLASSIFICATION",null,null,"R_TN","RTSR - Network",null,{"$f":"IFERROR(SUMIF(RATES!B:B, '21. Bill Impacts'!D456,RATES!H:H),\"\")","v":7.6E-3},{"$f":"F437","v":750},{"$f":"H456*G456","v":5.7},{"$f":"IFERROR(SUMIF(RATES!B:B,'21. Bill Impacts'!D456,RATES!I:I),\"\")","v":7.6E-3},{"$f":"H456","v":750},{"$f":"K456*J456","v":5.7},0,{"$f":"IF(ISERROR(M456/I456), \"\", M456/I456)","v":0}]
["RESIDENTIAL SERVICE CLASSIFICATION",null,null,"R_TC","RTSR - Connection and/or Line and Transformation Connection",null,{"$f":"IFERROR(SUMIF(RATES!B:B, '21. Bill Impacts'!D457,RATES!H:H),\"\")","v":7.1000000000000004E-3},{"$f":"H456","v":750},{"$f":"H457*G457","v":5.3250000000000002},{"$f":"IFERROR(SUMIF(RATES!B:B,'21. Bill Impacts'!D457,RATES!I:I),\"\")","v":7.1999999999999998E-3},{"$f":"H457","v":750},{"$f":"K457*J457","v":5.3999999999999995},7.4999999999999289E-2,{"$f":"IF(ISERROR(M457/I457), \"\", M457/I457)","v":1.4084507042253388E-2}]
["RESIDENTIAL SERVICE CLASSIFICATION","ST_C",{"$f":"C449","v":9},null,"Sub-Total C - Delivery (including Sub-Total B)",null,null,null,{"$f":"SUM(I455:I457)","v":38.625100000000003},null,null,{"$f":"SUM(L455:L457)","v":39.537599999999998},0.91249999999999432,{"$f":"IF((I458)=0,\"\",(M458/I458))","v":2.3624534305412653E-2}]
["RESIDENTIAL SERVICE CLASSIFICATION",null,null,null,"Wholesale Market Service Charge (WMSC)",null,3.5999999999999999E-3,{"$f":"F437*F439","v":777},{"$f":"H459*G459","v":2.7972000000000001},3.5999999999999999E-3,{"$f":"F437*F439","v":777},{"$f":"K459*J459","v":2.7972000000000001},0,{"$f":"IF(ISERROR(M459/I459), \"\", M459/I459)","v":0}]
["RESIDENTIAL SERVICE CLASSIFICATION",null,null,null,"Rural and Remote Rate Protection (RRRP)",null,2.9999999999999997E-4,{"$f":"F437*F439","v":777},{"$f":"H460*G460","v":0.23309999999999997},2.9999999999999997E-4,{"$f":"F437*F439","v":777},{"$f":"K460*J460","v":0.23309999999999997},0,0]
["RESIDENTIAL SERVICE CLASSIFICATION",null,null,null,"Standard Supply Service Charge",null,0.25,null,{"$f":"H461*G461","v":0},0.25,null,{"$f":"K461*J461","v":0},0,""]
["RESIDENTIAL SERVICE CLASSIFICATION",null,null,null,"Debt Retirement Charge (DRC)",null,7.0000000000000001E-3,null,{"$f":"H462*G462","v":0},0,null,{"$f":"K462*J462","v":0},0,""]
["RESIDENTIAL SERVICE CLASSIFICATION",null,null,null,null,null,null,null,null,null,null,null,0,""]
["RESIDENTIAL SERVICE CLASSIFICATION","RPP",null,null,"TOU - Off Peak",null,6.5000000000000002E-2,{"$f":"IF(AND(F437*12>=150000),0.65*F437*F439,0.65*F437)","v":487.5},{"$f":"H464*G464","v":31.6875},6.5000000000000002E-2,{"$f":"IF(AND(F437*12>=150000),0.65*F437*F440,0.65*F437)","v":487.5},{"$f":"K464*J464","v":31.6875},0,0]
["RESIDENTIAL SERVICE CLASSIFICATION","RPP",null,null,"TOU - Mid Peak",null,{"$f":"G92","v":9.4E-2},{"$f":"IF(AND(F437*12>=150000),0.17*F437*F439,0.17*F437)","v":127.50000000000001},{"$f":"H465*G465","v":11.985000000000001},{"$f":"G465","v":9.4E-2},{"$f":"IF(AND(F437*12>=150000),0.17*F437*F440,0.17*F437)","v":127.50000000000001},{"$f":"K465*J465","v":11.985000000000001},0,0]
["RESIDENTIAL SERVICE CLASSIFICATION","RPP",null,null,"TOU - On Peak",null,0.13200000000000001,{"$f":"IF(AND(F437*12>=150000),0.18*F437*F439,0.18*F437)","v":135},{"$f":"H466*G466","v":17.82},0.13200000000000001,{"$f":"IF(AND(F437*12>=150000),0.18*F437*F440,0.18*F437)","v":135},{"$f":"K466*J466","v":17.82},0,0]
["RESIDENTIAL SERVICE CLASSIFICATION","Non-RPP (Retailer)",null,null,"Non-RPP Retailer Avg. Price",null,0.1038,{"$f":"IF(AND(F437*12>=150000),F437*F439,F437)","v":750},{"$f":"H467*G467","v":77.850000000000009},{"$f":"G467","v":0.1038},{"$f":"IF(AND(F437*12>=150000),F437*F440,F437)","v":750},{"$f":"K467*J467","v":77.850000000000009},0,0]
["RESIDENTIAL SERVICE CLASSIFICATION","Non-RPP (Other)",null,null,"Average IESO Wholesale Market Price",null,{"$f":"G467","v":0.1038},{"$f":"IF(AND(F437*12>=150000),F437*F439,F437)","v":750},{"$f":"H468*G468","v":77.850000000000009},{"$f":"G468","v":0.1038},{"$f":"IF(AND(F437*12>=150000),F437*F440,F437)","v":750},{"$f":"K468*J468","v":77.850000000000009},0,0]
["RESIDENTIAL SERVICE CLASSIFICATION"]
["RESIDENTIAL SERVICE CLASSIFICATION","RPP_BT",null,null,"Total Bill on TOU (before Taxes)",null,null,null,{"$f":"SUM(I459:I466,I458)","v":103.14789999999999},null,null,{"$f":"SUM(L459:L466,L458)","v":104.06039999999999},{"$f":"L470-I470","v":0.91249999999999432},{"$f":"IF((I470)=0,\"\",(M470/I470))","v":8.8465203848066155E-3}]
["RESIDENTIAL SERVICE CLASSIFICATION","RPP",null,null,"HST",null,0.13,null,{"$f":"I470*G471","v":13.409227},0.13,null,{"$f":"L470*J471","v":13.527851999999999},{"$f":"L471-I471","v":0.11862499999999976},{"$f":"IF((I471)=0,\"\",(M471/I471))","v":8.8465203848066536E-3}]
["RESIDENTIAL SERVICE CLASSIFICATION","RPP_NET",null,null,"Total Bill on TOU (before 8% Provincial Rebate)",null,null,null,{"$f":"SUM(I470:I471)","v":116.55712699999999},null,null,{"$f":"SUM(L470:L471)","v":117.58825199999998},{"$f":"SUM(M470:M471)","v":1.0311249999999941},{"$f":"IF((I472)=0,\"\",(M472/I472))","v":8.8465203848066207E-3}]
[{"$f":"A471","v":"RESIDENTIAL SERVICE CLASSIFICATION"},"RPP",null,null,"8% Provincial Rebate",null,-0.08,null,{"$f":"I470*G473","v":-8.2518320000000003},{"$f":"G473","v":-0.08},null,{"$f":"L470*J473","v":-8.3248319999999989},{"$f":"L473-I473","v":-7.2999999999998622E-2},{"$f":"IF((I473)=0,\"\",(M473/I473))","v":8.8465203848065027E-3}]
[{"$f":"A473","v":"RESIDENTIAL SERVICE CLASSIFICATION"},"RPP_TOTAL",null,null,"Total Bill on TOU",null,null,null,{"$f":"SUM(I470,I471,I473)","v":108.305295},null,null,{"$f":"L470+L471+L473","v":109.26341999999998},{"$f":"L474-I474","v":0.95812499999998124},{"$f":"IF((I474)=0,\"\",(M474/I474))","v":8.8465203848064975E-3}]
[{"$f":"A474","v":"RESIDENTIAL SERVICE CLASSIFICATION"},"RPP"]
[{"$f":"A475","v":"RESIDENTIAL SERVICE CLASSIFICATION"},"Non-RPP (Retailer)_BT",{"$f":"C449","v":9},null,"Total Bill on Non-RPP Avg. Price",null,null,null,{"$f":"SUM(I467,I459:I463,I458)","v":119.50540000000001},null,null,{"$f":"SUM(L467,L459:L463,L458)","v":120.4179},{"$f":"L476-I476","v":0.91249999999999432},{"$f":"IF((I476)=0,\"\",(M476/I476))","v":7.6356382222058103E-3}]
[{"$f":"A476","v":"RESIDENTIAL SERVICE CLASSIFICATION"},"Non-RPP (Retailer)",null,null,"HST",null,0.13,null,{"$f":"I476*G477","v":15.535702000000002},0.13,null,{"$f":"L476*J477","v":15.654327},{"$f":"L477-I477","v":0.11862499999999798},{"$f":"IF((I477)=0,\"\",(M477/I477))","v":7.6356382222057271E-3}]
[{"$f":"A477","v":"RESIDENTIAL SERVICE CLASSIFICATION"},"Non-RPP (Retailer)_NET",{"$f":"C476","v":9},null,"Total  Bill on Non-RPP Avg. price (before 8% Provincial Rebate)",null,null,null,{"$f":"SUM(I476:I477)","v":135.04110200000002},null,null,{"$f":"SUM(L476:L477)","v":136.072227},{"$f":"SUM(M476:M477)","v":1.0311249999999923},{"$f":"IF((I478)=0,\"\",(M478/I478))","v":7.6356382222057999E-3}]
[{"$f":"A477","v":"RESIDENTIAL SERVICE CLASSIFICATION"},"Non-RPP (Retailer)",null,null,"Provincial Rebate",null,-0.08,null,{"$f":"I476*G479","v":-9.5604320000000005},{"$f":"G479","v":-0.08},null,{"$f":"L476*J479","v":-9.6334320000000009},{"$f":"L479-I479","v":-7.3000000000000398E-2},{"$f":"IF((I479)=0,\"\",(M479/I479))","v":7.6356382222058997E-3}]
[{"$f":"A479","v":"RESIDENTIAL SERVICE CLASSIFICATION"},"Non-RPP (Retailer)_TOTAL",{"$f":"C476","v":9},null,"Total Bill on Non-RPP Avg. Price",null,null,null,{"$f":"SUM(I476,I477,I479)","v":125.48067000000002},null,null,{"$f":"SUM(L476,L477,L479)","v":126.438795},{"$f":"L480-I480","v":0.95812499999998124},{"$f":"IF((I480)=0,\"\",(M480/I480))","v":7.635638222205708E-3}]
[{"$f":"A480","v":"RESIDENTIAL SERVICE CLASSIFICATION"},"Non-RPP (Retailer)"]
[{"$f":"A481","v":"RESIDENTIAL SERVICE CLASSIFICATION"},"Non-RPP (Other)_BT",null,null,"Total Bill on Average IESO Wholesale Market Price",null,null,null,{"$f":"SUM(I468,I459:I463,I458)","v":119.50540000000001},null,null,{"$f":"SUM(L468,L459:L463,L458)","v":120.4179},{"$f":"L482-I482","v":0.91249999999999432},{"$f":"IF((I482)=0,\"\",(M482/I482))","v":7.6356382222058103E-3}]
[{"$f":"A482","v":"RESIDENTIAL SERVICE CLASSIFICATION"},"Non-RPP (Other)",null,null,"HST",null,0.13,null,{"$f":"I482*G483","v":15.535702000000002},0.13,null,{"$f":"L482*J483","v":15.654327},{"$f":"L483-I483","v":0.11862499999999798},{"$f":"IF((I483)=0,\"\",(M483/I483))","v":7.6356382222057271E-3}]
[{"$f":"A483","v":"RESIDENTIAL SERVICE CLASSIFICATION"},"Non-RPP (Other)_NET",null,null,"Total Bill on Average IESO WMP (before 8% Provincial Rebate)",null,null,null,{"$f":"SUM(I482:I483)","v":135.04110200000002},null,null,{"$f":"SUM(L482:L483)","v":136.072227},{"$f":"SUM(M482:M483)","v":1.0311249999999923},{"$f":"IF((I484)=0,\"\",(M484/I484))","v":7.6356382222057999E-3}]
[{"$f":"A483","v":"RESIDENTIAL SERVICE CLASSIFICATION"},"Non-RPP (Other)",null,null,"8% Provincial Rebate",null,-0.08,null,{"$f":"I482*G485","v":-9.5604320000000005},{"$f":"G485","v":-0.08},null,{"$f":"L482*J485","v":-9.6334320000000009},{"$f":"L485-I485","v":-7.3000000000000398E-2},{"$f":"IF((I485)=0,\"\",(M485/I485))","v":7.6356382222058997E-3}]
[{"$f":"A485","v":"RESIDENTIAL SERVICE CLASSIFICATION"},"Non-RPP (Other)_TOTAL",null,null,"Total Bill on Average IESO Wholesale Market Price",null,null,null,{"$f":"SUM(I482,I483,I485)","v":125.48067000000002},null,null,{"$f":"SUM(L482,L483,L485)","v":126.438795},{"$f":"L486-I486","v":0.95812499999998124},{"$f":"IF((I486)=0,\"\",(M486/I486))","v":7.635638222205708E-3}]
[{"$f":"A486","v":"RESIDENTIAL SERVICE CLASSIFICATION"},"Non-RPP (Other)"]
[]
[]
[null,null,null,null,"Customer Class:",{"$f":"E24","v":"GENERAL SERVICE LESS THAN 50 kW SERVICE CLASSIFICATION"},null,null,null,null,null,{"$f":"IF(O439=\"DEMAND - INTERVAL\",\"RTSR - INTERVAL METERED\",\"\")","v":""}]
[null,null,null,null,"RPP / Non-RPP:",{"$f":"H24","v":"Non-RPP (Retailer)"}]
[null,null,null,null,"Consumption",{"$f":"K24","v":2000},"kWh"]
[null,null,null,null,"Demand",{"$f":"L24","v":0},"kW"]
[null,null,null,null,"Current Loss Factor",{"$f":"I24","v":1.036}]
[null,null,null,null,"Proposed/Approved Loss Factor",{"$f":"J24","v":1.036}]
[]
[null,null,null,null,null,null,"Current OEB-Approved",null,null,"Proposed",null,null,"Impact"]
[null,null,null,null,null,null,"Rate","Volume","Charge","Rate","Volume","Charge","$ Change","% Change"]
[null,null,null,null,null,null,"($)",null,"($)","($)",null,"($)"]
[{"$f":"F490","v":"GENERAL SERVICE LESS THAN 50 kW SERVICE CLASSIFICATION"},null,null,"GSL_F","Monthly Service Charge",null,{"$f":"IFERROR(SUMIF(RATES!B:B, '21. Bill Impacts'!D500,RATES!H:H),\"\")","v":43.99},1,{"$f":"H500*G500","v":43.99},{"$f":"IFERROR(SUMIF(RATES!B:B,'21. Bill Impacts'!D500,RATES!I:I),\"\")","v":44.39},1,{"$f":"K500*J500","v":44.39},{"$f":"L500-I500","v":0.39999999999999858},{"$f":"IF(ISERROR(M500/I500), \"\", M500/I500)","v":9.0929756762900341E-3}]
[{"$f":"A500","v":"GENERAL SERVICE LESS THAN 50 kW SERVICE CLASSIFICATION"},null,null,"GSL_V","Distribution Volumetric Rate",null,{"$f":"IFERROR(SUMIF(RATES!B:B, '21. Bill Impacts'!D501,RATES!H:H),\"\")","v":1.2800000000000001E-2},{"$f":"IF($F493>0, $F493, $F492)","v":2000},{"$f":"H501*G501","v":25.6},{"$f":"IFERROR(SUMIF(RATES!B:B,'21. Bill Impacts'!D501,RATES!I:I),\"\")","v":1.29E-2},{"$f":"IF($F493>0, $F493, $F492)","v":2000},{"$f":"K501*J501","v":25.8},0.19999999999999929,{"$f":"IF(ISERROR(M501/I501), \"\", M501/I501)","v":7.8124999999999722E-3}]
["GENERAL SERVICE LESS THAN 50 kW SERVICE CLASSIFICATION",null,null,"GSL_FRR","Fixed Rate Riders",null,{"$f":"IFERROR(SUMIF(RATES!B:B, '21. Bill Impacts'!D502,RATES!H:H),\"\")","v":1.7400000000000002},1,{"$f":"H502*G502","v":1.7400000000000002},{"$f":"IFERROR(SUMIF(RATES!B:B,'21. Bill Impacts'!D502,RATES!I:I),\"\")","v":1.2700000000000002},1,{"$f":"K502*J502","v":1.2700000000000002},-0.47,{"$f":"IF(ISERROR(M502/I502), \"\", M502/I502)","v":-0.27011494252873558}]
["GENERAL SERVICE LESS THAN 50 kW SERVICE CLASSIFICATION",null,null,"GSL_VRR","Volumetric Rate Riders",null,{"$f":"IFERROR(SUMIF(RATES!B:B, '21. Bill Impacts'!D503,RATES!H:H),\"\")","v":1E-3},{"$f":"IF($F493>0, $F493, $F492)","v":2000},{"$f":"H503*G503","v":2},{"$f":"IFERROR(SUMIF(RATES!B:B,'21. Bill Impacts'!D503,RATES!I:I),\"\")","v":1.2000000000000001E-3},{"$f":"IF($F493>0, $F493, $F492)","v":2000},{"$f":"K503*J503","v":2.4000000000000004},0.40000000000000036,{"$f":"IF(ISERROR(M503/I503), \"\", M503/I503)","v":0.20000000000000018}]
["GENERAL SERVICE LESS THAN 50 kW SERVICE CLASSIFICATION","ST_A",{"$f":"B24","v":10},null,"Sub-Total A (excluding pass through)",null,null,null,{"$f":"SUM(I500:I503)","v":73.33},null,null,{"$f":"SUM(L500:L503)","v":73.86},0.53000000000000114,{"$f":"IF((I504)=0,\"\",(M504/I504))","v":7.2276012546024972E-3}]
["GENERAL SERVICE LESS THAN 50 kW SERVICE CLASSIFICATION",null,null,null,"Line Losses on Cost of Power",null,{"$f":"IF((F492*12>=150000), 0, IF(F491=\"RPP\",(G519*0.65+G520*0.17+G521*0.18),IF(F491=\"Non-RPP (Retailer)\",G522,G523)))","v":0.1038},{"$f":"IF(G505=0, 0, $F492*F494-F492)","v":72},{"$f":"H505*G505","v":7.4736000000000002},{"$f":"IF((F492*12>=150000), 0, IF(F491=\"RPP\",(J519*0.65+J520*0.17+J521*0.18),IF(F491=\"Non-RPP (Retailer)\",J522,J523)))","v":0.1038},{"$f":"IF(G505=0, 0, $F492*F494-F492)","v":72},{"$f":"K505*J505","v":7.4736000000000002},0,{"$f":"IF(ISERROR(M505/I505), \"\", M505/I505)","v":0}]
["GENERAL SERVICE LESS THAN 50 kW SERVICE CLASSIFICATION",null,null,"GSL_DVA","Total Deferral/Variance Account Rate Riders",null,{"$f":"IFERROR(SUMIF(RATES!B:B, '21. Bill Impacts'!D506,RATES!H:H),\"\")","v":-7.5000000000000002E-4},{"$f":"IF($F493>0, $F493, $F492)","v":2000},{"$f":"H506*G506","v":-1.5},{"$f":"IFERROR(SUMIF(RATES!B:B,'21. Bill Impacts'!D506,RATES!I:I),\"\")","v":-1.14E-3},{"$f":"IF($F493>0, $F493, $F492)","v":2000},{"$f":"K506*J506","v":-2.2799999999999998},-0.7799999999999998,{"$f":"IF(ISERROR(M506/I506), \"\", M506/I506)","v":0.51999999999999991}]
["GENERAL SERVICE LESS THAN 50 kW SERVICE CLASSIFICATION",null,null,"GSL_GA","GA Rate Riders",null,{"$f":"IFERROR(SUMIF(RATES!B:B, '21. Bill Impacts'!D507,RATES!H:H),\"\")","v":-5.0000000000000001E-4},{"$f":"IF($F493>0, $F493, $F492)","v":2000},{"$f":"H507*G507","v":-1},{"$f":"IFERROR(SUMIF(RATES!B:B,'21. Bill Impacts'!D507,RATES!I:I),\"\")","v":1.1999999999999999E-3},{"$f":"IF($F493>0, $F493, $F492)","v":2000},{"$f":"K507*J507","v":2.4},3.4,{"$f":"IF(ISERROR(M507/I507), \"\", M507/I507)","v":-3.4}]
["GENERAL SERVICE LESS THAN 50 kW SERVICE CLASSIFICATION",null,null,"GSL_LV","Low Voltage Service Charge",null,{"$f":"IFERROR(SUMIF(RATES!B:B, '21. Bill Impacts'!D508,RATES!H:H),\"\")","v":2.0000000000000001E-4},{"$f":"IF($F493>0, $F493, $F492)","v":2000},{"$f":"H508*G508","v":0.4},{"$f":"IFERROR(SUMIF(RATES!B:B,'21. Bill Impacts'!D508,RATES!I:I),\"\")","v":2.0000000000000001E-4},{"$f":"IF($F493>0, $F493, $F492)","v":2000},{"$f":"K508*J508","v":0.4},0,{"$f":"IF(ISERROR(M508/I508), \"\", M508/I508)","v":0}]
["GENERAL SERVICE LESS THAN 50 kW SERVICE CLASSIFICATION",null,null,null,"Smart Meter Entity Charge (if applicable) and/or any fixed ($) Deferral/Variance Account Rate Riders",null,0.56999999999999995,1,{"$f":"H509*G509","v":0.56999999999999995},0.56999999999999995,1,{"$f":"K509*J509","v":0.56999999999999995},0,{"$f":"IF(ISERROR(M509/I509), \"\", M509/I509)","v":0}]
["GENERAL SERVICE LESS THAN 50 kW SERVICE CLASSIFICATION","ST_B",{"$f":"C504","v":10},null,"Sub-Total B - Distribution (includes Sub-Total A)",null,null,null,{"$f":"SUM(I504:I509)","v":79.273600000000002},null,null,{"$f":"SUM(L504:L509)","v":82.423600000000008},3.1500000000000057,{"$f":"IF((I510)=0,\"\",(M510/I510))","v":3.9735801073749716E-2}]
["GENERAL SERVICE LESS THAN 50 kW SERVICE CLASSIFICATION",null,null,"GSL_TN","RTSR - Network",null,{"$f":"IFERROR(SUMIF(RATES!B:B, '21. Bill Impacts'!D511,RATES!H:H),\"\")","v":7.1000000000000004E-3},{"$f":"F492","v":2000},{"$f":"H511*G511","v":14.200000000000001},{"$f":"IFERROR(SUMIF(RATES!B:B,'21. Bill Impacts'!D511,RATES!I:I),\"\")","v":7.1000000000000004E-3},{"$f":"H511","v":2000},{"$f":"K511*J511","v":14.200000000000001},0,{"$f":"IF(ISERROR(M511/I511), \"\", M511/I511)","v":0}]
["GENERAL SERVICE LESS THAN 50 kW SERVICE CLASSIFICATION",null,null,"GSL_TC","RTSR - Connection and/or Line and Transformation Connection",null,{"$f":"IFERROR(SUMIF(RATES!B:B, '21. Bill Impacts'!D512,RATES!H:H),\"\")","v":6.4000000000000003E-3},{"$f":"H511","v":2000},{"$f":"H512*G512","v":12.8},{"$f":"IFERROR(SUMIF(RATES!B:B,'21. Bill Impacts'!D512,RATES!I:I),\"\")","v":6.4999999999999997E-3},{"$f":"H512","v":2000},{"$f":"K512*J512","v":13},0.19999999999999929,{"$f":"IF(ISERROR(M512/I512), \"\", M512/I512)","v":1.5624999999999944E-2}]
["GENERAL SERVICE LESS THAN 50 kW SERVICE CLASSIFICATION","ST_C",{"$f":"C504","v":10},null,"Sub-Total C - Delivery (including Sub-Total B)",null,null,null,{"$f":"SUM(I510:I512)","v":106.2736},null,null,{"$f":"SUM(L510:L512)","v":109.62360000000001},3.3500000000000085,{"$f":"IF((I513)=0,\"\",(M513/I513))","v":3.1522410081149116E-2}]
["GENERAL SERVICE LESS THAN 50 kW SERVICE CLASSIFICATION",null,null,null,"Wholesale Market Service Charge (WMSC)",null,3.5999999999999999E-3,{"$f":"F492*F494","v":2072},{"$f":"H514*G514","v":7.4592000000000001},3.5999999999999999E-3,{"$f":"F492*F494","v":2072},{"$f":"K514*J514","v":7.4592000000000001},0,{"$f":"IF(ISERROR(M514/I514), \"\", M514/I514)","v":0}]
["GENERAL SERVICE LESS THAN 50 kW SERVICE CLASSIFICATION",null,null,null,"Rural and Remote Rate Protection (RRRP)",null,2.9999999999999997E-4,{"$f":"F492*F494","v":2072},{"$f":"H515*G515","v":0.62159999999999993},2.9999999999999997E-4,{"$f":"F492*F494","v":2072},{"$f":"K515*J515","v":0.62159999999999993},0,0]
["GENERAL SERVICE LESS THAN 50 kW SERVICE CLASSIFICATION",null,null,null,"Standard Supply Service Charge",null,0.25,null,{"$f":"H516*G516","v":0},0.25,null,{"$f":"K516*J516","v":0},0,""]
["GENERAL SERVICE LESS THAN 50 kW SERVICE CLASSIFICATION",null,null,null,"Debt Retirement Charge (DRC)",null,7.0000000000000001E-3,{"$f":"F492","v":2000},{"$f":"H517*G517","v":14},0,{"$f":"F492","v":2000},{"$f":"K517*J517","v":0},-14,-1]
["GENERAL SERVICE LESS THAN 50 kW SERVICE CLASSIFICATION",null,null,null,null,null,null,null,null,null,null,null,0,""]
["GENERAL SERVICE LESS THAN 50 kW SERVICE CLASSIFICATION","RPP",null,null,"TOU - Off Peak",null,6.5000000000000002E-2,{"$f":"IF(AND(F492*12>=150000),0.65*F492*F494,0.65*F492)","v":1300},{"$f":"H519*G519","v":84.5},6.5000000000000002E-2,{"$f":"IF(AND(F492*12>=150000),0.65*F492*F495,0.65*F492)","v":1300},{"$f":"K519*J519","v":84.5},0,0]
["GENERAL SERVICE LESS THAN 50 kW SERVICE CLASSIFICATION","RPP",null,null,"TOU - Mid Peak",null,{"$f":"G92","v":9.4E-2},{"$f":"IF(AND(F492*12>=150000),0.17*F492*F494,0.17*F492)","v":340},{"$f":"H520*G520","v":31.96},{"$f":"G520","v":9.4E-2},{"$f":"IF(AND(F492*12>=150000),0.17*F492*F495,0.17*F492)","v":340},{"$f":"K520*J520","v":31.96},0,0]
["GENERAL SERVICE LESS THAN 50 kW SERVICE CLASSIFICATION","RPP",null,null,"TOU - On Peak",null,0.13200000000000001,{"$f":"IF(AND(F492*12>=150000),0.18*F492*F494,0.18*F492)","v":360},{"$f":"H521*G521","v":47.52},0.13200000000000001,{"$f":"IF(AND(F492*12>=150000),0.18*F492*F495,0.18*F492)","v":360},{"$f":"K521*J521","v":47.52},0,0]
["GENERAL SERVICE LESS THAN 50 kW SERVICE CLASSIFICATION","Non-RPP (Retailer)",null,null,"Non-RPP Retailer Avg. Price",null,0.1038,{"$f":"IF(AND(F492*12>=150000),F492*F494,F492)","v":2000},{"$f":"H522*G522","v":207.6},{"$f":"G522","v":0.1038},{"$f":"IF(AND(F492*12>=150000),F492*F495,F492)","v":2000},{"$f":"K522*J522","v":207.6},0,0]
["GENERAL SERVICE LESS THAN 50 kW SERVICE CLASSIFICATION","Non-RPP (Other)",null,null,"Average IESO Wholesale Market Price",null,{"$f":"G522","v":0.1038},{"$f":"IF(AND(F492*12>=150000),F492*F494,F492)","v":2000},{"$f":"H523*G523","v":207.6},{"$f":"G523","v":0.1038},{"$f":"IF(AND(F492*12>=150000),F492*F495,F492)","v":2000},{"$f":"K523*J523","v":207.6},0,0]
["GENERAL SERVICE LESS THAN 50 kW SERVICE CLASSIFICATION"]
["GENERAL SERVICE LESS THAN 50 kW SERVICE CLASSIFICATION","RPP",null,null,"Total Bill on TOU (before Taxes)",null,null,null,{"$f":"SUM(I514:I521,I513)","v":292.33440000000002},null,null,{"$f":"SUM(L514:L521,L513)","v":281.68439999999998},{"$f":"L525-I525","v":-10.650000000000034},{"$f":"IF((I525)=0,\"\",(M525/I525))","v":-3.6430881894159682E-2}]
["GENERAL SERVICE LESS THAN 50 kW SERVICE CLASSIFICATION","RPP",null,null,"HST",null,0.13,null,{"$f":"I525*G526","v":38.003472000000002},0.13,null,{"$f":"L525*J526","v":36.618971999999999},{"$f":"L526-I526","v":-1.3845000000000027},{"$f":"IF((I526)=0,\"\",(M526/I526))","v":-3.6430881894159634E-2}]
["GENERAL SERVICE LESS THAN 50 kW SERVICE CLASSIFICATION","RPP",null,null,"Provincial Rebate",null,-0.08,null,{"$f":"I525*G527","v":-23.386752000000001},{"$f":"G527","v":-0.08},null,{"$f":"L525*J527","v":-22.534751999999997},{"$f":"L527-I527","v":0.85200000000000387},{"$f":"IF((I527)=0,\"\",(M527/I527))","v":-3.6430881894159731E-2}]
["GENERAL SERVICE LESS THAN 50 kW SERVICE CLASSIFICATION","RPP_TOTAL",null,null,"Total Bill on TOU",null,null,null,{"$f":"SUM(I525,I526,I527)","v":306.95112},null,null,{"$f":"L525+L526+L527","v":295.76861999999994},{"$f":"L528-I528","v":-11.182500000000061},{"$f":"IF((I528)=0,\"\",(M528/I528))","v":-3.6430881894159765E-2}]
["GENERAL SERVICE LESS THAN 50 kW SERVICE CLASSIFICATION","RPP"]
["GENERAL SERVICE LESS THAN 50 kW SERVICE CLASSIFICATION","Non-RPP (Retailer)_BT",{"$f":"C504","v":10},null,"Total Bill on Non-RPP Avg. Price",null,null,null,{"$f":"SUM(I522,I514:I518,I513)","v":335.95440000000002},null,null,{"$f":"SUM(L522,L514:L518,L513)","v":325.30439999999999},{"$f":"L530-I530","v":-10.650000000000034},{"$f":"IF((I530)=0,\"\",(M530/I530))","v":-3.1700730813467644E-2}]
["GENERAL SERVICE LESS THAN 50 kW SERVICE CLASSIFICATION","Non-RPP (Retailer)",null,null,"HST",null,0.13,null,{"$f":"I530*G531","v":43.674072000000002},0.13,null,{"$f":"L530*J531","v":42.289572},{"$f":"L531-I531","v":-1.3845000000000027},{"$f":"IF((I531)=0,\"\",(M531/I531))","v":-3.1700730813467602E-2}]
["GENERAL SERVICE LESS THAN 50 kW SERVICE CLASSIFICATION","Non-RPP (Retailer)_NET",{"$f":"C530","v":10},null,"Total Bill on Non-RPP Avg. Price (before 8% Provincial Rebate)",null,null,null,{"$f":"SUM(I530:I531)","v":379.62847200000004},null,null,{"$f":"SUM(L530:L531)","v":367.59397200000001},{"$f":"SUM(M530:M531)","v":-12.034500000000037},{"$f":"IF((I532)=0,\"\",(M532/I532))","v":-3.1700730813467637E-2}]
[{"$f":"A531","v":"GENERAL SERVICE LESS THAN 50 kW SERVICE CLASSIFICATION"},"Non-RPP (Retailer)",null,null,"8% Provincial Rebate",null,-0.08,null,{"$f":"I530*G533","v":-26.876352000000001},{"$f":"G533","v":-0.08},null,{"$f":"L530*J533","v":-26.024352},{"$f":"L533-I533","v":0.85200000000000031},{"$f":"IF((I533)=0,\"\",(M533/I533))","v":-3.1700730813467554E-2}]
[{"$f":"A533","v":"GENERAL SERVICE LESS THAN 50 kW SERVICE CLASSIFICATION"},"Non-RPP (Retailer)_TOTAL",{"$f":"C530","v":10},null,"Total Bill on Non-RPP Avg. Price",null,null,null,{"$f":"SUM(I530,I531,I533)","v":352.75212000000005},null,null,{"$f":"SUM(L530,L531,L533)","v":341.56961999999999},{"$f":"L534-I534","v":-11.182500000000061},{"$f":"IF((I534)=0,\"\",(M534/I534))","v":-3.1700730813467713E-2}]
["GENERAL SERVICE LESS THAN 50 kW SERVICE CLASSIFICATION","Non-RPP (Retailer)"]
["GENERAL SERVICE LESS THAN 50 kW SERVICE CLASSIFICATION","Non-RPP (Other)_BT",null,null,"Total Bill on Average IESO Wholesale Market Price",null,null,null,{"$f":"SUM(I523,I514:I518,I513)","v":335.95440000000002},null,null,{"$f":"SUM(L523,L514:L518,L513)","v":325.30439999999999},{"$f":"L536-I536","v":-10.650000000000034},{"$f":"IF((I536)=0,\"\",(M536/I536))","v":-3.1700730813467644E-2}]
["GENERAL SERVICE LESS THAN 50 kW SERVICE CLASSIFICATION","Non-RPP (Other)",null,null,"HST",null,0.13,null,{"$f":"I536*G537","v":43.674072000000002},0.13,null,{"$f":"L536*J537","v":42.289572},{"$f":"L537-I537","v":-1.3845000000000027},{"$f":"IF((I537)=0,\"\",(M537/I537))","v":-3.1700730813467602E-2}]
["GENERAL SERVICE LESS THAN 50 kW SERVICE CLASSIFICATION","Non-RPP (Other)_NET",null,null,"Total Bill on Average IESO WMP (before 8% Provincial Rebate)",null,null,null,{"$f":"SUM(I536:I537)","v":379.62847200000004},null,null,{"$f":"SUM(L536:L537)","v":367.59397200000001},{"$f":"SUM(M536:M537)","v":-12.034500000000037},{"$f":"IF((I538)=0,\"\",(M538/I538))","v":-3.1700730813467637E-2}]
["GENERAL SERVICE LESS THAN 50 kW SERVICE CLASSIFICATION","Non-RPP (Other)",null,null,"8% Provincial Rebate",null,-0.08,null,{"$f":"I536*G539","v":-26.876352000000001},{"$f":"G539","v":-0.08},null,{"$f":"L536*J539","v":-26.024352},{"$f":"L539-I539","v":0.85200000000000031},{"$f":"IF((I539)=0,\"\",(M539/I539))","v":-3.1700730813467554E-2}]
["GENERAL SERVICE LESS THAN 50 kW SERVICE CLASSIFICATION","Non-RPP (Other)_TOTAL",null,null,"Total Bill on Average IESO Wholesale Market Price",null,null,null,{"$f":"SUM(I536,I537,I539)","v":352.75212000000005},null,null,{"$f":"SUM(L536,L537,L539)","v":341.56961999999999},{"$f":"L540-I540","v":-11.182500000000061},{"$f":"IF((I540)=0,\"\",(M540/I540))","v":-3.1700730813467713E-2}]
["GENERAL SERVICE LESS THAN 50 kW SERVICE CLASSIFICATION","Non-RPP (Other)"]
[]
[]
[null,null,null,null,"Customer Class:",{"$f":"E25","v":"UNMETERED SCATTERED LOAD SERVICE CLASSIFICATION"},null,null,null,null,null,{"$f":"IF(O494=\"DEMAND - INTERVAL\",\"RTSR - INTERVAL METERED\",\"\")","v":""}]
[null,null,null,null,"RPP / Non-RPP:",{"$f":"H25","v":"Non-RPP (Retailer)"}]
[null,null,null,null,"Consumption",{"$f":"K25","v":300},"kWh"]
[null,null,null,null,"Demand",{"$f":"L25","v":0},"kW"]
[null,null,null,null,"Current Loss Factor",{"$f":"I25","v":1.036}]
[null,null,null,null,"Proposed/Approved Loss Factor",{"$f":"J25","v":1.036}]
[]
[null,null,null,null,null,null,"Current OEB-Approved",null,null,"Proposed",null,null,"Impact"]
[null,null,null,null,null,null,"Rate","Volume","Charge","Rate","Volume","Charge","$ Change","% Change"]
[null,null,null,null,null,null,"($)",null,"($)","($)",null,"($)"]
[{"$f":"F544","v":"UNMETERED SCATTERED LOAD SERVICE CLASSIFICATION"},null,null,"USL_F","Monthly Service Charge",null,{"$f":"IFERROR(SUMIF(RATES!B:B, '21. Bill Impacts'!D554,RATES!H:H),\"\")","v":9.08},1,{"$f":"H554*G554","v":9.08},{"$f":"IFERROR(SUMIF(RATES!B:B,'21. Bill Impacts'!D554,RATES!I:I),\"\")","v":9.16},1,{"$f":"K554*J554","v":9.16},{"$f":"L554-I554","v":8.0000000000000071E-2},{"$f":"IF(ISERROR(M554/I554), \"\", M554/I554)","v":8.8105726872246774E-3}]
[{"$f":"A554","v":"UNMETERED SCATTERED LOAD SERVICE CLASSIFICATION"},null,null,"USL_V","Distribution Volumetric Rate",null,{"$f":"IFERROR(SUMIF(RATES!B:B, '21. Bill Impacts'!D555,RATES!H:H),\"\")","v":1.6500000000000001E-2},{"$f":"IF($F547>0, $F547, $F546)","v":300},{"$f":"H555*G555","v":4.95},{"$f":"IFERROR(SUMIF(RATES!B:B,'21. Bill Impacts'!D555,RATES!I:I),\"\")","v":1.66E-2},{"$f":"IF($F547>0, $F547, $F546)","v":300},{"$f":"K555*J555","v":4.9800000000000004},3.0000000000000249E-2,{"$f":"IF(ISERROR(M555/I555), \"\", M555/I555)","v":6.0606060606061109E-3}]
["UNMETERED SCATTERED LOAD SERVICE CLASSIFICATION",null,null,"USL_FRR","Fixed Rate Riders",null,{"$f":"IFERROR(SUMIF(RATES!B:B, '21. Bill Impacts'!D556,RATES!H:H),\"\")","v":0.34},1,{"$f":"H556*G556","v":0.34},{"$f":"IFERROR(SUMIF(RATES!B:B,'21. Bill Impacts'!D556,RATES!I:I),\"\")","v":0.26},1,{"$f":"K556*J556","v":0.26},-8.0000000000000016E-2,{"$f":"IF(ISERROR(M556/I556), \"\", M556/I556)","v":-0.23529411764705885}]
["UNMETERED SCATTERED LOAD SERVICE CLASSIFICATION",null,null,"USL_VRR","Volumetric Rate Riders",null,{"$f":"IFERROR(SUMIF(RATES!B:B, '21. Bill Impacts'!D557,RATES!H:H),\"\")","v":5.0000000000000001E-4},{"$f":"IF($F547>0, $F547, $F546)","v":300},{"$f":"H557*G557","v":0.15},{"$f":"IFERROR(SUMIF(RATES!B:B,'21. Bill Impacts'!D557,RATES!I:I),\"\")","v":4.0000000000000002E-4},{"$f":"IF($F547>0, $F547, $F546)","v":300},{"$f":"K557*J557","v":0.12000000000000001},-2.9999999999999985E-2,{"$f":"IF(ISERROR(M557/I557), \"\", M557/I557)","v":-0.1999999999999999}]
["UNMETERED SCATTERED LOAD SERVICE CLASSIFICATION","ST_A",{"$f":"B25","v":11},null,"Sub-Total A (excluding pass through)",null,null,null,{"$f":"SUM(I554:I557)","v":14.520000000000001},null,null,{"$f":"SUM(L554:L557)","v":14.52},0,{"$f":"IF((I558)=0,\"\",(M558/I558))","v":0}]
["UNMETERED SCATTERED LOAD SERVICE CLASSIFICATION",null,null,null,"Line Losses on Cost of Power",null,{"$f":"IF((F546*12>=150000), 0, IF(F545=\"RPP\",(G573*0.65+G574*0.17+G575*0.18),IF(F545=\"Non-RPP (Retailer)\",G576,G577)))","v":0.1038},{"$f":"IF(G559=0, 0, $F546*F548-F546)","v":10.800000000000011},{"$f":"H559*G559","v":1.1210400000000011},{"$f":"IF((F546*12>=150000), 0, IF(F545=\"RPP\",(J573*0.65+J574*0.17+J575*0.18),IF(F545=\"Non-RPP (Retailer)\",J576,J577)))","v":0.1038},{"$f":"IF(G559=0, 0, $F546*F548-F546)","v":10.800000000000011},{"$f":"K559*J559","v":1.1210400000000011},0,{"$f":"IF(ISERROR(M559/I559), \"\", M559/I559)","v":0}]
["UNMETERED SCATTERED LOAD SERVICE CLASSIFICATION",null,null,"USL_DVA","Total Deferral/Variance Account Rate Riders",null,{"$f":"IFERROR(SUMIF(RATES!B:B, '21. Bill Impacts'!D560,RATES!H:H),\"\")","v":-7.5000000000000002E-4},{"$f":"IF($F547>0, $F547, $F546)","v":300},{"$f":"H560*G560","v":-0.22500000000000001},{"$f":"IFERROR(SUMIF(RATES!B:B,'21. Bill Impacts'!D560,RATES!I:I),\"\")","v":-1.14E-3},{"$f":"IF($F547>0, $F547, $F546)","v":300},{"$f":"K560*J560","v":-0.34199999999999997},-0.11699999999999997,{"$f":"IF(ISERROR(M560/I560), \"\", M560/I560)","v":0.5199999999999998}]
["UNMETERED SCATTERED LOAD SERVICE CLASSIFICATION",null,null,"USL_GA","GA Rate Riders",null,{"$f":"IFERROR(SUMIF(RATES!B:B, '21. Bill Impacts'!D561,RATES!H:H),\"\")","v":-5.0000000000000001E-4},{"$f":"IF($F547>0, $F547, $F546)","v":300},{"$f":"H561*G561","v":-0.15},{"$f":"IFERROR(SUMIF(RATES!B:B,'21. Bill Impacts'!D561,RATES!I:I),\"\")","v":1.1999999999999999E-3},{"$f":"IF($F547>0, $F547, $F546)","v":300},{"$f":"K561*J561","v":0.36},0.51,{"$f":"IF(ISERROR(M561/I561), \"\", M561/I561)","v":-3.4000000000000004}]
["UNMETERED SCATTERED LOAD SERVICE CLASSIFICATION",null,null,"USL_LV","Low Voltage Service Charge",null,{"$f":"IFERROR(SUMIF(RATES!B:B, '21. Bill Impacts'!D562,RATES!H:H),\"\")","v":2.0000000000000001E-4},{"$f":"IF($F547>0, $F547, $F546)","v":300},{"$f":"H562*G562","v":6.0000000000000005E-2},{"$f":"IFERROR(SUMIF(RATES!B:B,'21. Bill Impacts'!D562,RATES!I:I),\"\")","v":2.0000000000000001E-4},{"$f":"IF($F547>0, $F547, $F546)","v":300},{"$f":"K562*J562","v":6.0000000000000005E-2},0,{"$f":"IF(ISERROR(M562/I562), \"\", M562/I562)","v":0}]
["UNMETERED SCATTERED LOAD SERVICE CLASSIFICATION",null,null,null,"Smart Meter Entity Charge (if applicable) and/or any fixed ($) Deferral/Variance Account Rate Riders",null,0.56999999999999995,null,{"$f":"H563*G563","v":0},0.56999999999999995,null,{"$f":"K563*J563","v":0},0,{"$f":"IF(ISERROR(M563/I563), \"\", M563/I563)","v":""}]
["UNMETERED SCATTERED LOAD SERVICE CLASSIFICATION","ST_B",{"$f":"C558","v":11},null,"Sub-Total B - Distribution (includes Sub-Total A)",null,null,null,{"$f":"SUM(I558:I563)","v":15.326040000000003},null,null,{"$f":"SUM(L558:L563)","v":15.71904},0.39299999999999713,{"$f":"IF((I564)=0,\"\",(M564/I564))","v":2.5642631756148167E-2}]
["UNMETERED SCATTERED LOAD SERVICE CLASSIFICATION",null,null,"USL_TN","RTSR - Network",null,{"$f":"IFERROR(SUMIF(RATES!B:B, '21. Bill Impacts'!D565,RATES!H:H),\"\")","v":7.1000000000000004E-3},{"$f":"F546","v":300},{"$f":"H565*G565","v":2.1300000000000003},{"$f":"IFERROR(SUMIF(RATES!B:B,'21. Bill Impacts'!D565,RATES!I:I),\"\")","v":7.1000000000000004E-3},{"$f":"H565","v":300},{"$f":"K565*J565","v":2.1300000000000003},0,{"$f":"IF(ISERROR(M565/I565), \"\", M565/I565)","v":0}]
["UNMETERED SCATTERED LOAD SERVICE CLASSIFICATION",null,null,"USL_TC","RTSR - Connection and/or Line and Transformation Connection",null,{"$f":"IFERROR(SUMIF(RATES!B:B, '21. Bill Impacts'!D566,RATES!H:H),\"\")","v":6.4000000000000003E-3},{"$f":"H565","v":300},{"$f":"H566*G566","v":1.9200000000000002},{"$f":"IFERROR(SUMIF(RATES!B:B,'21. Bill Impacts'!D566,RATES!I:I),\"\")","v":6.4999999999999997E-3},{"$f":"H566","v":300},{"$f":"K566*J566","v":1.95},2.9999999999999805E-2,{"$f":"IF(ISERROR(M566/I566), \"\", M566/I566)","v":1.5624999999999898E-2}]
["UNMETERED SCATTERED LOAD SERVICE CLASSIFICATION","ST_C",{"$f":"C558","v":11},null,"Sub-Total C - Delivery (including Sub-Total B)",null,null,null,{"$f":"SUM(I564:I566)","v":19.376040000000003},null,null,{"$f":"SUM(L564:L566)","v":19.799039999999998},0.42299999999999471,{"$f":"IF((I567)=0,\"\",(M567/I567))","v":2.1831086228145412E-2}]
["UNMETERED SCATTERED LOAD SERVICE CLASSIFICATION",null,null,null,"Wholesale Market Service Charge (WMSC)",null,3.5999999999999999E-3,{"$f":"F546*F548","v":310.8},{"$f":"H568*G568","v":1.1188800000000001},3.5999999999999999E-3,{"$f":"F546*F548","v":310.8},{"$f":"K568*J568","v":1.1188800000000001},0,{"$f":"IF(ISERROR(M568/I568), \"\", M568/I568)","v":0}]
["UNMETERED SCATTERED LOAD SERVICE CLASSIFICATION",null,null,null,"Rural and Remote Rate Protection (RRRP)",null,2.9999999999999997E-4,{"$f":"F546*F548","v":310.8},{"$f":"H569*G569","v":9.323999999999999E-2},2.9999999999999997E-4,{"$f":"F546*F548","v":310.8},{"$f":"K569*J569","v":9.323999999999999E-2},0,{"$f":"IF(ISERROR(M569/I569), \"\", M569/I569)","v":0}]
["UNMETERED SCATTERED LOAD SERVICE CLASSIFICATION",null,null,null,"Standard Supply Service Charge"]
["UNMETERED SCATTERED LOAD SERVICE CLASSIFICATION",null,null,null,"Debt Retirement Charge (DRC)",null,7.0000000000000001E-3,{"$f":"F546","v":300},{"$f":"H571*G571","v":2.1},0,{"$f":"F546","v":300},{"$f":"K571*J571","v":0},{"$f":"L571-I571","v":-2.1},{"$f":"IF(ISERROR(M571/I571), \"\", M571/I571)","v":-1}]
["UNMETERED SCATTERED LOAD SERVICE CLASSIFICATION",null,null,null,null,null,null,null,null,null,null,null,0,""]
["UNMETERED SCATTERED LOAD SERVICE CLASSIFICATION","RPP",null,null,"TOU - Off Peak",null,6.5000000000000002E-2,{"$f":"IF(AND(F546*12>=150000),0.65*F546*F548,0.65*F546)","v":195},{"$f":"H573*G573","v":12.675000000000001},6.5000000000000002E-2,{"$f":"IF(AND(F546*12>=150000),0.65*F546*F549,0.65*F546)","v":195},{"$f":"K573*J573","v":12.675000000000001},0,0]
["UNMETERED SCATTERED LOAD SERVICE CLASSIFICATION","RPP",null,null,"TOU - Mid Peak",null,{"$f":"G92","v":9.4E-2},{"$f":"IF(AND(F546*12>=150000),0.17*F546*F548,0.17*F546)","v":51.000000000000007},{"$f":"H574*G574","v":4.7940000000000005},{"$f":"G574","v":9.4E-2},{"$f":"IF(AND(F546*12>=150000),0.17*F546*F549,0.17*F546)","v":51.000000000000007},{"$f":"K574*J574","v":4.7940000000000005},0,0]
["UNMETERED SCATTERED LOAD SERVICE CLASSIFICATION","RPP",null,null,"TOU - On Peak",null,0.13200000000000001,{"$f":"IF(AND(F546*12>=150000),0.18*F546*F548,0.18*F546)","v":54},{"$f":"H575*G575","v":7.1280000000000001},0.13200000000000001,{"$f":"IF(AND(F546*12>=150000),0.18*F546*F549,0.18*F546)","v":54},{"$f":"K575*J575","v":7.1280000000000001},0,0]
["UNMETERED SCATTERED LOAD SERVICE CLASSIFICATION","Non-RPP (Retailer)",null,null,"Non-RPP Retailer Avg. Price",null,0.1038,{"$f":"IF(AND(F546*12>=150000),F546*F548,F546)","v":300},{"$f":"H576*G576","v":31.14},{"$f":"G576","v":0.1038},{"$f":"IF(AND(F546*12>=150000),F546*F549,F546)","v":300},{"$f":"K576*J576","v":31.14},0,0]
["UNMETERED SCATTERED LOAD SERVICE CLASSIFICATION","Non-RPP (Other)",null,null,"Average IESO Wholesale Market Price",null,{"$f":"G576","v":0.1038},{"$f":"IF(AND(F546*12>=150000),F546*F548,F546)","v":300},{"$f":"H577*G577","v":31.14},{"$f":"G577","v":0.1038},{"$f":"IF(AND(F546*12>=150000),F546*F549,F546)","v":300},{"$f":"K577*J577","v":31.14},0,0]
["UNMETERED SCATTERED LOAD SERVICE CLASSIFICATION"]
["UNMETERED SCATTERED LOAD SERVICE CLASSIFICATION","RPP",null,null,"Total Bill on TOU (before Taxes)",null,null,null,{"$f":"SUM(I568:I575,I567)","v":47.285160000000005},null,null,{"$f":"SUM(L568:L575,L567)","v":45.608159999999998},{"$f":"L579-I579","v":-1.6770000000000067},{"$f":"IF((I579)=0,\"\",(M579/I579))","v":-3.5465672528125242E-2}]
["UNMETERED SCATTERED LOAD SERVICE CLASSIFICATION","RPP",null,null,"HST",null,0.13,null,{"$f":"I579*G580","v":6.1470708000000007},0.13,null,{"$f":"L579*J580","v":5.9290608000000002},{"$f":"L580-I580","v":-0.21801000000000048},{"$f":"IF((I580)=0,\"\",(M580/I580))","v":-3.5465672528125179E-2}]
["UNMETERED SCATTERED LOAD SERVICE CLASSIFICATION","RPP",null,null,"Provincial Rebate",null,-0.08,null,{"$f":"I579*G581","v":-3.7828128000000003},{"$f":"G581","v":-0.08},null,{"$f":"L579*J581","v":-3.6486527999999998},{"$f":"L581-I581","v":0.1341600000000005},{"$f":"IF((I581)=0,\"\",(M581/I581))","v":-3.5465672528125235E-2}]
["UNMETERED SCATTERED LOAD SERVICE CLASSIFICATION","RPP_TOTAL",null,null,"Total Bill on TOU",null,null,null,{"$f":"SUM(I579,I580,I581)","v":49.649418000000004},null,null,{"$f":"L579+L580+L581","v":47.888567999999999},{"$f":"L582-I582","v":-1.7608500000000049},{"$f":"IF((I582)=0,\"\",(M582/I582))","v":-3.54656725281252E-2}]
["UNMETERED SCATTERED LOAD SERVICE CLASSIFICATION","RPP"]
["UNMETERED SCATTERED LOAD SERVICE CLASSIFICATION","Non-RPP (Retailer)_BT",{"$f":"C558","v":11},null,"Total Bill on Non-RPP Avg. Price",null,null,null,{"$f":"SUM(I576,I568:I572,I567)","v":53.828160000000004},null,null,{"$f":"SUM(L576,L568:L572,L567)","v":52.151159999999997},{"$f":"L584-I584","v":-1.6770000000000067},{"$f":"IF((I584)=0,\"\",(M584/I584))","v":-3.1154696723796737E-2}]
["UNMETERED SCATTERED LOAD SERVICE CLASSIFICATION","Non-RPP (Retailer)",null,null,"HST",null,0.13,null,{"$f":"I584*G585","v":6.9976608000000011},0.13,null,{"$f":"L584*J585","v":6.7796507999999998},{"$f":"L585-I585","v":-0.21801000000000137},{"$f":"IF((I585)=0,\"\",(M585/I585))","v":-3.1154696723796806E-2}]
["UNMETERED SCATTERED LOAD SERVICE CLASSIFICATION","Non-RPP (Retailer)_NET",{"$f":"C584","v":11},null,"Total Bill on Non-RPP Avg. Price (before 8% Provincial Rebate)",null,null,null,{"$f":"SUM(I584:I585)","v":60.825820800000002},null,null,{"$f":"SUM(L584:L585)","v":58.930810799999996},{"$f":"SUM(M584:M585)","v":-1.8950100000000081},{"$f":"IF((I586)=0,\"\",(M586/I586))","v":-3.1154696723796747E-2}]
[{"$f":"A585","v":"UNMETERED SCATTERED LOAD SERVICE CLASSIFICATION"},"Non-RPP (Retailer)",null,null,"8% Provincial Rebate",null,null,null,{"$f":"I584*G587","v":0},{"$f":"G587","v":0},null,{"$f":"L584*J587","v":0},{"$f":"L587-I587","v":0},{"$f":"IF((I587)=0,\"\",(M587/I587))","v":""}]
[{"$f":"A587","v":"UNMETERED SCATTERED LOAD SERVICE CLASSIFICATION"},"Non-RPP (Retailer)_TOTAL",{"$f":"C584","v":11},null,"Total Bill on Non-RPP Avg. Price",null,null,null,{"$f":"SUM(I584,I585,I587)","v":60.825820800000002},null,null,{"$f":"SUM(L584,L585,L587)","v":58.930810799999996},{"$f":"L588-I588","v":-1.8950100000000063},{"$f":"IF((I588)=0,\"\",(M588/I588))","v":-3.1154696723796716E-2}]
[{"$f":"A588","v":"UNMETERED SCATTERED LOAD SERVICE CLASSIFICATION"},"Non-RPP (Retailer)"]
[{"$f":"A589","v":"UNMETERED SCATTERED LOAD SERVICE CLASSIFICATION"},"Non-RPP (Other)_BT",null,null,"Total Bill on Average IESO Wholesale Market Price",null,null,null,{"$f":"SUM(I577,I568:I572,I567)","v":53.828160000000004},null,null,{"$f":"SUM(L577,L568:L572,L567)","v":52.151159999999997},{"$f":"L590-I590","v":-1.6770000000000067},{"$f":"IF((I590)=0,\"\",(M590/I590))","v":-3.1154696723796737E-2}]
[{"$f":"A590","v":"UNMETERED SCATTERED LOAD SERVICE CLASSIFICATION"},"Non-RPP (Other)",null,null,"HST",null,0.13,null,{"$f":"I590*G591","v":6.9976608000000011},0.13,null,{"$f":"L590*J591","v":6.7796507999999998},{"$f":"L591-I591","v":-0.21801000000000137},{"$f":"IF((I591)=0,\"\",(M591/I591))","v":-3.1154696723796806E-2}]
[{"$f":"A591","v":"UNMETERED SCATTERED LOAD SERVICE CLASSIFICATION"},"Non-RPP (Other)_NET",null,null,"Total Bill on Average IESO WMP (before 8% Provincial Rebate)",null,null,null,{"$f":"SUM(I590:I591)","v":60.825820800000002},null,null,{"$f":"SUM(L590:L591)","v":58.930810799999996},{"$f":"SUM(M590:M591)","v":-1.8950100000000081},{"$f":"IF((I592)=0,\"\",(M592/I592))","v":-3.1154696723796747E-2}]
[{"$f":"A591","v":"UNMETERED SCATTERED LOAD SERVICE CLASSIFICATION"},"Non-RPP (Other)",null,null,"8% Provincial Rebate",null,-0.08,null,{"$f":"I590*G593","v":-4.3062528000000002},{"$f":"G593","v":-0.08},null,{"$f":"L590*J593","v":-4.1720927999999997},{"$f":"L593-I593","v":0.1341600000000005},{"$f":"IF((I593)=0,\"\",(M593/I593))","v":-3.115469672379673E-2}]
[{"$f":"A593","v":"UNMETERED SCATTERED LOAD SERVICE CLASSIFICATION"},"Non-RPP (Other)_TOTAL",null,null,"Total Bill on Average IESO Wholesale Market Price",null,null,null,{"$f":"SUM(I590,I591,I593)","v":56.519568},null,null,{"$f":"SUM(L590,L591,L593)","v":54.758717999999995},{"$f":"L594-I594","v":-1.7608500000000049},{"$f":"IF((I594)=0,\"\",(M594/I594))","v":-3.1154696723796702E-2}]
[{"$f":"A594","v":"UNMETERED SCATTERED LOAD SERVICE CLASSIFICATION"},"Non-RPP (Other)"]
[]
[]
[]
[null,null,null,null,"Customer Class:",{"$f":"E28","v":"LARGE USE SERVICE CLASSIFICATION"},null,null,null,null,null,{"$f":"IF(#REF!=\"DEMAND - INTERVAL\",\"RTSR - INTERVAL METERED\",\"\")","v":{"$error":"#REF!"}}]
[null,null,null,null,"RPP / Non-RPP:",{"$f":"H28","v":"Non-RPP (Other)"},null,null,"Class B"]
[null,null,null,null,"Consumption",{"$f":"K28","v":3000000},"kWh"]
[null,null,null,null,"Demand",{"$f":"L28","v":5000},"kW"]
[null,null,null,null,"Current Loss Factor",{"$f":"I28","v":1.0145}]
[null,null,null,null,"Proposed/Approved Loss Factor",{"$f":"J28","v":1.0145}]
[]
[null,null,null,null,null,null,"Current OEB-Approved",null,null,"Proposed",null,null,"Impact"]
[null,null,null,null,null,null,"Rate","Volume","Charge","Rate","Volume","Charge","$ Change","% Change"]
[null,null,null,null,null,null,"($)",null,"($)","($)",null,"($)"]
[{"$f":"F599","v":"LARGE USE SERVICE CLASSIFICATION"},null,null,"LU_F","Monthly Service Charge",null,{"$f":"IFERROR(SUMIF(RATES!B:B, '21. Bill Impacts'!D609,RATES!H:H),\"\")","v":13911.73},1,{"$f":"H609*G609","v":13911.73},{"$f":"IFERROR(SUMIF(RATES!B:B,'21. Bill Impacts'!D609,RATES!I:I),\"\")","v":14036.94},1,{"$f":"K609*J609","v":14036.94},{"$f":"L609-I609","v":125.21000000000095},{"$f":"IF(ISERROR(M609/I609), \"\", M609/I609)","v":9.0003184363124464E-3}]
[{"$f":"A609","v":"LARGE USE SERVICE CLASSIFICATION"},null,null,"LU_V","Distribution Volumetric Rate",null,{"$f":"IFERROR(SUMIF(RATES!B:B, '21. Bill Impacts'!D610,RATES!H:H),\"\")","v":2.9782000000000002},{"$f":"IF($F602>0, $F602, $F601)","v":5000},{"$f":"H610*G610","v":14891},{"$f":"IFERROR(SUMIF(RATES!B:B,'21. Bill Impacts'!D610,RATES!I:I),\"\")","v":3.0049999999999999},{"$f":"IF($F602>0, $F602, $F601)","v":5000},{"$f":"K610*J610","v":15025},134,{"$f":"IF(ISERROR(M610/I610), \"\", M610/I610)","v":8.9987240615136653E-3}]
["LARGE USE SERVICE CLASSIFICATION",null,null,"LU_FRR","Fixed Rate Riders",null,{"$f":"IFERROR(SUMIF(RATES!B:B, '21. Bill Impacts'!D611,RATES!H:H),\"\")","v":703.18},1,{"$f":"H611*G611","v":703.18},{"$f":"IFERROR(SUMIF(RATES!B:B,'21. Bill Impacts'!D611,RATES!I:I),\"\")","v":400.10999999999996},1,{"$f":"K611*J611","v":400.10999999999996},-303.07,{"$f":"IF(ISERROR(M611/I611), \"\", M611/I611)","v":-0.43099917517563074}]
["LARGE USE SERVICE CLASSIFICATION",null,null,"LU_VRR","Volumetric Rate Riders",null,{"$f":"IFERROR(SUMIF(RATES!B:B, '21. Bill Impacts'!D612,RATES!H:H),\"\")","v":0.182},{"$f":"IF($F602>0, $F602, $F601)","v":5000},{"$f":"H612*G612","v":910},{"$f":"IFERROR(SUMIF(RATES!B:B,'21. Bill Impacts'!D612,RATES!I:I),\"\")","v":0.23769999999999999},{"$f":"IF($F602>0, $F602, $F601)","v":5000},{"$f":"K612*J612","v":1188.5},278.5,{"$f":"IF(ISERROR(M612/I612), \"\", M612/I612)","v":0.30604395604395607}]
["LARGE USE SERVICE CLASSIFICATION","ST_A",{"$f":"B28","v":14},null,"Sub-Total A (excluding pass through)",null,null,null,{"$f":"SUM(I609:I612)","v":30415.91},null,null,{"$f":"SUM(L609:L612)","v":30650.550000000003},234.64000000000306,{"$f":"IF((I613)=0,\"\",(M613/I613))","v":7.7143836893258516E-3}]
["LARGE USE SERVICE CLASSIFICATION",null,null,null,"Line Losses on Cost of Power",null,{"$f":"IF((F601*12>=150000), 0, IF(F600=\"RPP\",(G628*0.65+G629*0.17+G630*0.18),IF(F600=\"Non-RPP (Retailer)\",G631,G632)))","v":0},{"$f":"IF(G614=0, 0, $F601*F603-F601)","v":0},{"$f":"H614*G614","v":0},{"$f":"IF((F601*12>=150000), 0, IF(F600=\"RPP\",(J628*0.65+J629*0.17+J630*0.18),IF(F600=\"Non-RPP (Retailer)\",J631,J632)))","v":0},{"$f":"IF(G614=0, 0, $F601*F603-F601)","v":0},{"$f":"K614*J614","v":0},0,{"$f":"IF(ISERROR(M614/I614), \"\", M614/I614)","v":""}]
["LARGE USE SERVICE CLASSIFICATION",null,null,"LU_DVA","Total Deferral/Variance Account Rate Riders",null,{"$f":"IFERROR(SUMIF(RATES!B:B, '21. Bill Impacts'!D615,RATES!H:H),\"\")+RATES!H144","v":-0.40539999999999998},{"$f":"IF($F602>0, $F602, $F601)","v":5000},{"$f":"H615*G615","v":-2027},{"$f":"IFERROR(SUMIF(RATES!B:B,'21. Bill Impacts'!D615,RATES!I:I),\"\")","v":-0.61539999999999995},{"$f":"IF($F602>0, $F602, $F601)","v":5000},{"$f":"K615*J615","v":-3076.9999999999995},-1049.9999999999995,{"$f":"IF(ISERROR(M615/I615), \"\", M615/I615)","v":0.5180069067587566}]
["LARGE USE SERVICE CLASSIFICATION",null,null,"LU_GA","GA Rate Riders",null,{"$f":"RATES!H141","v":0},{"$f":"F601","v":3000000},{"$f":"H616*G616","v":0},{"$f":"IFERROR(SUMIF(RATES!B:B,'21. Bill Impacts'!D616,RATES!I:I),\"\")","v":0},{"$f":"F601","v":3000000},{"$f":"K616*J616","v":0},0,{"$f":"IF(ISERROR(M616/I616), \"\", M616/I616)","v":""}]
["LARGE USE SERVICE CLASSIFICATION",null,null,"LU_LV","Low Voltage Service Charge",null,{"$f":"IFERROR(SUMIF(RATES!B:B, '21. Bill Impacts'!D617,RATES!H:H),\"\")","v":8.3799999999999999E-2},{"$f":"IF($F602>0, $F602, $F601)","v":5000},{"$f":"H617*G617","v":419},{"$f":"IFERROR(SUMIF(RATES!B:B,'21. Bill Impacts'!D617,RATES!I:I),\"\")","v":8.3799999999999999E-2},{"$f":"IF($F602>0, $F602, $F601)","v":5000},{"$f":"K617*J617","v":419},0,{"$f":"IF(ISERROR(M617/I617), \"\", M617/I617)","v":0}]
["LARGE USE SERVICE CLASSIFICATION",null,null,null,"Smart Meter Entity Charge (if applicable) and/or any fixed ($) Deferral/Variance Account Rate Riders",null,null,1,{"$f":"H618*G618","v":0},null,1,{"$f":"K618*J618","v":0},0,{"$f":"IF(ISERROR(M618/I618), \"\", M618/I618)","v":""}]
["LARGE USE SERVICE CLASSIFICATION","ST_B",{"$f":"C613","v":14},null,"Sub-Total B - Distribution (includes Sub-Total A)",null,null,null,{"$f":"SUM(I613:I618)","v":28807.91},null,null,{"$f":"SUM(L613:L618)","v":27992.550000000003},-815.35999999999694,{"$f":"IF((I619)=0,\"\",(M619/I619))","v":-2.8303337520840525E-2}]
["LARGE USE SERVICE CLASSIFICATION",null,null,"LU_TN","RTSR - Network",null,{"$f":"IFERROR(SUMIF(RATES!B:B, '21. Bill Impacts'!D620,RATES!H:H),\"\")","v":2.8210999999999999},{"$f":"IF($F602>0, $F602, $F601*$F603)","v":5000},{"$f":"H620*G620","v":14105.5},{"$f":"IFERROR(SUMIF(RATES!B:B,'21. Bill Impacts'!D620,RATES!I:I),\"\")","v":2.8342999999999998},{"$f":"IF($F602>0, $F602, $F601*$F603)","v":5000},{"$f":"K620*J620","v":14171.5},66,{"$f":"IF(ISERROR(M620/I620), \"\", M620/I620)","v":4.6790259118783453E-3}]
["LARGE USE SERVICE CLASSIFICATION",null,null,"LU_TC","RTSR - Connection and/or Line and Transformation Connection",null,{"$f":"IFERROR(SUMIF(RATES!B:B, '21. Bill Impacts'!D621,RATES!H:H),\"\")","v":2.6490999999999998},{"$f":"IF($F602>0, $F602, $F601*$F603)","v":5000},{"$f":"H621*G621","v":13245.499999999998},{"$f":"IFERROR(SUMIF(RATES!B:B,'21. Bill Impacts'!D621,RATES!I:I),\"\")","v":2.6934},{"$f":"IF($F602>0, $F602, $F601*$F603)","v":5000},{"$f":"K621*J621","v":13467},221.50000000000182,{"$f":"IF(ISERROR(M621/I621), \"\", M621/I621)","v":1.6722660526216591E-2}]
["LARGE USE SERVICE CLASSIFICATION","ST_C",{"$f":"C613","v":14},null,"Sub-Total C - Delivery (including Sub-Total B)",null,null,null,{"$f":"SUM(I619:I621)","v":56158.91},null,null,{"$f":"SUM(L619:L621)","v":55631.05},-527.86000000000058,{"$f":"IF((I622)=0,\"\",(M622/I622))","v":-9.3993989555709069E-3}]
["LARGE USE SERVICE CLASSIFICATION",null,null,null,"Wholesale Market Service Charge (WMSC)",null,3.5999999999999999E-3,{"$f":"F601*F603","v":3043500},{"$f":"H623*G623","v":10956.6},3.5999999999999999E-3,{"$f":"F601*F603","v":3043500},{"$f":"K623*J623","v":10956.6},0,{"$f":"IF(ISERROR(M623/I623), \"\", M623/I623)","v":0}]
["LARGE USE SERVICE CLASSIFICATION",null,null,null,"Rural and Remote Rate Protection (RRRP)",null,2.9999999999999997E-4,{"$f":"F601*F603","v":3043500},{"$f":"H624*G624","v":913.05},2.9999999999999997E-4,{"$f":"F601*F603","v":3043500},{"$f":"K624*J624","v":913.05},0,0]
["LARGE USE SERVICE CLASSIFICATION",null,null,null,"Standard Supply Service Charge",null,null,1,{"$f":"H625*G625","v":0},null,1,{"$f":"K625*J625","v":0},0,""]
["LARGE USE SERVICE CLASSIFICATION",null,null,null,"Debt Retirement Charge (DRC)",null,7.0000000000000001E-3,{"$f":"F601","v":3000000},{"$f":"H626*G626","v":21000},0,{"$f":"F601","v":3000000},{"$f":"K626*J626","v":0},-21000,-1]
["LARGE USE SERVICE CLASSIFICATION",null,null,null,null,null,null,null,null,null,null,null,0,""]
["LARGE USE SERVICE CLASSIFICATION","RPP",null,null,"TOU - Off Peak",null,6.5000000000000002E-2,{"$f":"IF(AND(F601*12>=150000),0.65*F601*F603,0.65*F601)","v":1978275},{"$f":"H628*G628","v":128587.875},6.5000000000000002E-2,{"$f":"IF(AND(F601*12>=150000),0.65*F601*F604,0.65*F601)","v":1978275},{"$f":"K628*J628","v":128587.875},0,0]
["LARGE USE SERVICE CLASSIFICATION","RPP",null,null,"TOU - Mid Peak",null,{"$f":"G92","v":9.4E-2},{"$f":"IF(AND(F601*12>=150000),0.17*F601*F603,0.17*F601)","v":517395.00000000006},{"$f":"H629*G629","v":48635.130000000005},{"$f":"G629","v":9.4E-2},{"$f":"IF(AND(F601*12>=150000),0.17*F601*F604,0.17*F601)","v":517395.00000000006},{"$f":"K629*J629","v":48635.130000000005},0,0]
["LARGE USE SERVICE CLASSIFICATION","RPP",null,null,"TOU - On Peak",null,0.13200000000000001,{"$f":"IF(AND(F601*12>=150000),0.18*F601*F603,0.18*F601)","v":547830},{"$f":"H630*G630","v":72313.56},0.13200000000000001,{"$f":"IF(AND(F601*12>=150000),0.18*F601*F604,0.18*F601)","v":547830},{"$f":"K630*J630","v":72313.56},0,0]
["LARGE USE SERVICE CLASSIFICATION","Non-RPP (Retailer)",null,null,"Non-RPP Retailer Avg. Price",null,{"$f":"0.1038","v":0.1038},{"$f":"IF(AND(F601*12>=150000),F601*F603,F601)","v":3043500},{"$f":"H631*G631","v":315915.3},{"$f":"G631","v":0.1038},{"$f":"IF(AND(F601*12>=150000),F601*F604,F601)","v":3043500},{"$f":"K631*J631","v":315915.3},0,0]
["LARGE USE SERVICE CLASSIFICATION","Non-RPP (Other)",null,null,"Average IESO Wholesale Market Price",null,0.1038,{"$f":"IF(AND(F601*12>=150000),F601*F603,F601)","v":3043500},{"$f":"H632*G632","v":315915.3},{"$f":"G632","v":0.1038},{"$f":"IF(AND(F601*12>=150000),F601*F604,F601)","v":3043500},{"$f":"K632*J632","v":315915.3},0,0]
["LARGE USE SERVICE CLASSIFICATION"]
["LARGE USE SERVICE CLASSIFICATION","RPP_BT",null,null,"Total Bill on TOU (before Taxes)",null,null,null,{"$f":"SUM(I623:I630,I622)","v":338565.125},null,null,{"$f":"SUM(L623:L630,L622)","v":317037.26500000001},{"$f":"L634-I634","v":-21527.859999999986},{"$f":"IF((I634)=0,\"\",(M634/I634))","v":-6.3585580469931707E-2}]
["LARGE USE SERVICE CLASSIFICATION","RPP",null,null,"HST",null,0.13,null,{"$f":"I634*G635","v":44013.466250000005},0.13,null,{"$f":"L634*J635","v":41214.844450000004},{"$f":"L635-I635","v":-2798.6218000000008},{"$f":"IF((I635)=0,\"\",(M635/I635))","v":-6.3585580469931763E-2}]
["LARGE USE SERVICE CLASSIFICATION","RPP_NET",null,null,"Total Bill on TOU (before 8% Provincial Rebate)",null,null,null,{"$f":"SUM(I634:I635)","v":382578.59125},null,null,{"$f":"SUM(L634:L635)","v":358252.10944999999},{"$f":"SUM(M634:M635)","v":-24326.481799999987},{"$f":"IF((I636)=0,\"\",(M636/I636))","v":-6.3585580469931707E-2}]
[{"$f":"A635","v":"LARGE USE SERVICE CLASSIFICATION"},"RPP",null,null,"8% Provincial Rebate",null,-0.08,null,{"$f":"I634*G637","v":-27085.21},{"$f":"G637","v":-0.08},null,{"$f":"L634*J637","v":-25362.981200000002},{"$f":"L637-I637","v":1722.2287999999971},{"$f":"IF((I637)=0,\"\",(M637/I637))","v":-6.3585580469931638E-2}]
[{"$f":"A637","v":"LARGE USE SERVICE CLASSIFICATION"},"RPP_TOTAL",null,null,"Total Bill on TOU",null,null,null,{"$f":"SUM(I634,I635,I637)","v":355493.38124999998},null,null,{"$f":"L634+L635+L637","v":332889.12825000001},{"$f":"L638-I638","v":-22604.252999999968},{"$f":"IF((I638)=0,\"\",(M638/I638))","v":-6.3585580469931666E-2}]
["LARGE USE SERVICE CLASSIFICATION","RPP"]
["LARGE USE SERVICE CLASSIFICATION","Non-RPP (Retailer)",null,null,"Total Bill on Non-RPP Avg. Price",null,null,null,{"$f":"SUM(I631,I623:I627,I622)","v":404943.86},null,null,{"$f":"SUM(L631,L623:L627,L622)","v":383415.99999999994},{"$f":"L640-I640","v":-21527.860000000044},{"$f":"IF((I640)=0,\"\",(M640/I640))","v":-5.3162579128869972E-2}]
["LARGE USE SERVICE CLASSIFICATION","Non-RPP (Retailer)",null,null,"HST",null,0.13,null,{"$f":"I640*G641","v":52642.701800000003},0.13,null,{"$f":"L640*J641","v":49844.079999999994},{"$f":"L641-I641","v":-2798.6218000000081},{"$f":"IF((I641)=0,\"\",(M641/I641))","v":-5.3162579128870013E-2}]
["LARGE USE SERVICE CLASSIFICATION","Non-RPP (Retailer)",null,null,"Provincial Rebate",null,-0.08,null,{"$f":"I640*G642","v":-32395.5088},{"$f":"G642","v":-0.08},null,{"$f":"L640*J642","v":-30673.279999999995},{"$f":"L642-I642","v":1722.2288000000044},{"$f":"IF((I642)=0,\"\",(M642/I642))","v":-5.3162579128869999E-2}]
["LARGE USE SERVICE CLASSIFICATION","Non-RPP (Retailer)_TOTAL",null,null,"Total Bill on Non-RPP Avg. Price",null,null,null,{"$f":"SUM(I640,I641,I642)","v":425191.05299999996},null,null,{"$f":"SUM(L640,L641,L642)","v":402586.8},{"$f":"L643-I643","v":-22604.252999999968},{"$f":"IF((I643)=0,\"\",(M643/I643))","v":-5.3162579128869791E-2}]
["LARGE USE SERVICE CLASSIFICATION","Non-RPP (Retailer)"]
["LARGE USE SERVICE CLASSIFICATION","Non-RPP (Other)_BT",{"$f":"C613","v":14},null,"Total Bill on Average IESO Wholesale Market Price",null,null,null,{"$f":"SUM(I632,I623:I627,I622)","v":404943.86},null,null,{"$f":"SUM(L632,L623:L627,L622)","v":383415.99999999994},{"$f":"L645-I645","v":-21527.860000000044},{"$f":"IF((I645)=0,\"\",(M645/I645))","v":-5.3162579128869972E-2}]
["LARGE USE SERVICE CLASSIFICATION","Non-RPP (Other)",null,null,"HST",null,0.13,null,{"$f":"I645*G646","v":52642.701800000003},0.13,null,{"$f":"L645*J646","v":49844.079999999994},{"$f":"L646-I646","v":-2798.6218000000081},{"$f":"IF((I646)=0,\"\",(M646/I646))","v":-5.3162579128870013E-2}]
["LARGE USE SERVICE CLASSIFICATION","Non-RPP (Other)_NET",{"$f":"C613","v":14},null,"Total Bill on Average IESO WMP (before 8% Provincial Rebate)",null,null,null,{"$f":"SUM(I645:I646)","v":457586.56179999997},null,null,{"$f":"SUM(L645:L646)","v":433260.07999999996},{"$f":"SUM(M645:M646)","v":-24326.481800000052},{"$f":"IF((I647)=0,\"\",(M647/I647))","v":-5.3162579128869979E-2}]
[{"$f":"A646","v":"LARGE USE SERVICE CLASSIFICATION"},"Non-RPP (Other)",null,null,"8% Provincial Rebate",null,null,null,{"$f":"I645*G648","v":0},{"$f":"G648","v":0},null,{"$f":"L645*J648","v":0},{"$f":"L648-I648","v":0},{"$f":"IF((I648)=0,\"\",(M648/I648))","v":""}]
[{"$f":"A648","v":"LARGE USE SERVICE CLASSIFICATION"},"Non-RPP (Other)_TOTAL",{"$f":"C613","v":14},null,"Total Bill on Average IESO Wholesale Market Price",null,null,null,{"$f":"SUM(I647:I648)","v":457586.56179999997},null,null,{"$f":"SUM(L647:L648)","v":433260.07999999996},{"$f":"SUM(M647:M648)","v":-24326.481800000052},{"$f":"IF((I649)=0,\"\",(M649/I649))","v":-5.3162579128869979E-2}]
[{"$f":"A649","v":"LARGE USE SERVICE CLASSIFICATION"},"Non-RPP (Other)"]

{"sheet":"RATES","index":27,"n_rows":222,"n_cols":9,"rows_kept":222,"cut":false,"hidden":false,"merged":[[10,7,12,7],[10,8,12,8]]}
["Back to Index",null,"Back to Index"]
[]
[]
[null,null,{"$f":"'Model Specs'!C4","v":"Alectra - Enersource"}]
[null,null,"Rates"]
[]
[]
["A",null,"MONTHLY RATES AND CHARGES  - DELIVERY COMPONENT"]
[]
[1,null,{"$f":"1+A10","v":2},null,3,4,5,6,7]
[null,null,"Description",null,null,null,null,2018,2019]
[]
[null,null,null,"Effective until","Type","Customers","Billing\nDeterminant"]
[null,null,"RESIDENTIAL"]
["R_F","R_F","Service Charge",null,"Rate",null,"$",21.61,{"$f":"ROUND('17. Rev2Cost-GDPIPI'!I17,2)","v":24.18}]
["R_V","R_V","Distribution Volumetric Rate",null,"Rate",null,"$/kWh",3.5000000000000001E-3,{"$f":"ROUND('17. Rev2Cost-GDPIPI'!J17,4)","v":0}]
["R_LV","R_LV","Low Voltage Service Rate ",null,"Rate",null,"$/kWh",2.0000000000000001E-4,{"$f":"H17","v":2.0000000000000001E-4}]
["R_SME","R_SME","Smart Metering Entity Charge - effective until December 31, 2022",null,"Rate Rider",null,"$",0.56999999999999995,0.56999999999999995]
["R_ICM","R_FRR","Rate Rider for Recovery of Incremental Capital Module (2017) - in effect until the effective date of the next cost of service based rate order",null,"Rate Rider",null,"$",0.6,{"$f":"H19","v":0.6}]
["R_GA16","R_GA","Rate Rider for Disposition of Global Adjustment Account (2018) - effective until  April 30, 2019\n        Applicable only for Non-RPP Customers","2019-04-30","Rate Rider","non-RPP","$/kWh",-5.0000000000000001E-4,-5.0000000000000001E-4]
["R_DVA16","R_DVA","Rate Rider for Disposition of Deferral/Variance Accounts (2018) - effective until April 30, 2019","2019-04-30","Rate Rider",null,"$/kWh",-6.9999999999999999E-4,-6.9999999999999999E-4]
["R_CBR16","R_DVA","Rate Rider for Disposition of Capacity Based Recovery Account (2018) - effective until April 30, 2019\n        Applicable Only for Class B Customers","2019-04-30","Rate Rider","Class B","$/kWh",-5.0000000000000002E-5,-5.0000000000000002E-5]
["R_GA17","R_GA","Rate Rider for Disposition of Global Adjustment Account (2019) - effective until  December 31, 2019\n        Applicable only for Non-RPP Customers","2019-12-31","Rate Rider","non-RPP","$/kWh",null,{"$f":"ROUND('6. GA Calculation'!M17,4)","v":1.6999999999999999E-3}]
["R_DVA17","R_DVA","Rate Rider for Disposition of Deferral/Variance Accounts (2019) - effective until December 31, 2019","2019-12-31","Rate Rider",null,"$/kWh",null,{"$f":"ROUND('8. Calculation of Def-Var RR'!J17,4)","v":-4.0000000000000002E-4}]
["R_CBR17","R_DVA","Rate Rider for Disposition of Capacity Based Recovery Account (2019) - effective until December 31, 2019\n        Applicable Only for Class B Customers","2019-12-31","Rate Rider","Class B","$/kWh",null,{"$f":"ROUND('7. CBR Allocation'!O22,5)","v":1.0000000000000001E-5}]
["R_LRV17","R_VRR","Rate Rider for Disposition of Lost Revenue Adjustment Mechanism Variance Account (LRAMVA) (2019) - effective until December 31, 2019","2019-12-31","Rate Rider",null,"$/kWh",null,{"$f":"ROUND('8. Calculation of Def-Var RR'!L17,4)","v":2.0000000000000001E-4}]
["R_ICM","R_FRR","Rate Rider for Recovery of Incremental Capital Module (2019) - in effect until the effective date of the next cost of service based rate order",null,"Rate Rider",null,"$",null,{"$f":"ROUND('19. Additional Rates'!D14,2)","v":0.16}]
["R_CPF19","R_FRR","Rate Rider for Disposition of Capitalization Policy Rate Rider (2019) - effective until December 31, 2019","2019-12-31","Rate Rider",null,"$",null,{"$f":"+'19. Additional Rates'!D15","v":-0.23}]
[null,"R_VRR","Rate Rider for Disposition of Lost Revenue Adjustment Mechanism Variance Account (LRAMVA) (2018) - effective until April 30, 2019","2019-04-30",null,null,"$/kWh",-2.0000000000000001E-4,-2.0000000000000001E-4]
[null,"R_FRR","Rate Rider for Recovery of Incremental Capital Module (2018) - in effect until the effective date of the next cost of service based rate order",null,null,null,"$",0.16,{"$f":"H30","v":0.16}]
[null,"R_FRR","Rate Rider for Recovery of 2018 Foregone Revenue - effective until December 31, 2018","2018-12-31",null,null,"$",0.17]
[]
[]
[]
[]
[]
[]
[]
["R_TN","R_TN","Retail Transmission Rate – Network Service Rate",null,"Rate",null,"$/kWh",7.6E-3,{"$f":"ROUND('16. RTSR-Rates to Forecast'!K43,4)","v":7.6E-3}]
["R_TC","R_TC","Retail Transmission Rate – Line and Transformation Connection Service Rate",null,"Rate",null,"$/kWh",7.1000000000000004E-3,{"$f":"ROUND('16. RTSR-Rates to Forecast'!K56,4)","v":7.1999999999999998E-3}]
[null,null,"GENERAL SERVICE LESS THAN 50 KW"]
["GSL_F","GSL_F","Service Charge",null,"Rate",null,"$",43.99,{"$f":"ROUND('17. Rev2Cost-GDPIPI'!I18,2)","v":44.39}]
["GSL_V","GSL_V","Distribution Volumetric Rate",null,"Rate",null,"$/kWh",1.2800000000000001E-2,{"$f":"ROUND('17. Rev2Cost-GDPIPI'!J18,4)","v":1.29E-2}]
["GSL_LV","GSL_LV","Low Voltage Service Rate ",null,"Rate",null,"$/kWh",2.0000000000000001E-4,{"$f":"H44","v":2.0000000000000001E-4}]
["GSL_SME","GSL_SME","Smart Metering Entity Charge - effective until December 31, 2022",null,"Rate Rider",null,"$",0.56999999999999995,0.56999999999999995]
["GSL_ICMF","GSL_FRR","Rate Rider for Recovery of Incremental Capital Module (2017) - in effect until the effective date of the next cost of service based rate order",null,"Rate Rider",null,"$",1.1000000000000001,{"$f":"H46","v":1.1000000000000001}]
["GSL_GA16","GSL_GA","Rate Rider for Disposition of Global Adjustment Account (2018) - effective until  April 30, 2019\n        Applicable only for Non-RPP Customers","2019-04-30","Rate Rider",null,"$/kWh",-5.0000000000000001E-4,-5.0000000000000001E-4]
["GSL_DVA16","GSL_DVA","Rate Rider for Disposition of Deferral/Variance Accounts (2018) - effective until April 30, 2019","2019-04-30","Rate Rider",null,"$/kWh",-6.9999999999999999E-4,-6.9999999999999999E-4]
["GSL_ICMV","GSL_VRR","Rate Rider for Recovery of Incremental Capital Module (2017) - in effect until the effective date of the next cost of service based rate order",null,"Rate Rider",null,"$/kWh",2.9999999999999997E-4,{"$f":"H49","v":2.9999999999999997E-4}]
["GSL_CBR16","GSL_DVA","Rate Rider for Disposition of Capacity Based Recovery Account (2018) - effective until April 30, 2019\n        Applicable Only for Class B Customers","2019-04-30","Rate Rider",null,"$/kWh",-5.0000000000000002E-5,-5.0000000000000002E-5]
[null,"GSL_VRR","Rate Rider for Disposition of Lost Revenue Adjustment Mechanism Variance Account (LRAMVA) (2018) - effective until April 30, 2019","2019-04-30",null,null,"$/kWh",5.9999999999999995E-4,5.9999999999999995E-4]
["GSL_GA17","GSL_GA","Rate Rider for Disposition of Global Adjustment Account (2019) - effective until  December 31, 2019\n        Applicable only for Non-RPP Customers","2019-12-31","Rate Rider",null,"$/kWh",null,{"$f":"ROUND('6. GA Calculation'!M18,4)","v":1.6999999999999999E-3}]
["GSL_DVA17","GSL_DVA","Rate Rider for Disposition of Deferral/Variance Accounts (2019) - effective until December 31, 2019","2019-12-31","Rate Rider",null,"$/kWh",null,{"$f":"ROUND('8. Calculation of Def-Var RR'!J18,4)","v":-4.0000000000000002E-4}]
["GSL_CBR17","GSL_DVA","Rate Rider for Disposition of Capacity Based Recovery Account (2019) - effective until December 31, 2019\n        Applicable Only for Class B Customers","2019-12-31","Rate Rider",null,"$/kWh",null,{"$f":"ROUND('7. CBR Allocation'!O23,5)","v":1.0000000000000001E-5}]
["GSL_LRV17","GSL_VRR","Rate Rider for Disposition of Lost Revenue Adjustment Mechanism Variance Account (LRAMVA) (2019) - effective until December 31, 2019","2019-12-31","Rate Rider",null,"$/kWh",null,{"$f":"ROUND('8. Calculation of Def-Var RR'!L18,4)","v":2.0000000000000001E-4}]
["GSL_ICMF","GSL_FRR","Rate Rider for Recovery of Incremental Capital Module (2019) - in effect until the effective date of the next cost of service based rate order",null,"Rate Rider",null,"$",null,{"$f":"ROUND('19. Additional Rates'!D27,2)","v":0.3}]
["GSL_ICMV","GSL_VRR","Rate Rider for Recovery of Incremental Capital Module (2019) - in effect until the effective date of the next cost of service based rate order",null,"Rate Rider",null,"$/kWh",null,{"$f":"ROUND('19. Additional Rates'!D28,4)","v":1E-4}]
["GSL_CPF19","GSL_FRR","Rate Rider for Disposition of Capitalization Policy Rate Rider (2019) - effective until December 31, 2019","2019-12-31","Rate Rider",null,"$",null,{"$f":"+'19. Additional Rates'!D29","v":-0.42}]
["GSL_CPV19","GSL_VRR","Rate Rider for Disposition of Capitalization Policy Rate Rider (2019) - effective until December 31, 2019","2019-12-31","Rate Rider",null,"$/kWh",null,{"$f":"+'19. Additional Rates'!D30","v":-1E-4}]
[null,"GSL_VRR","Rate Rider for Recovery of Incremental Capital Module (2018) - in effect until the effective date of the next cost of service based rate order",null,null,null,"$/kWh",1E-4,1E-4]
[null,"GSL_FRR","Rate Rider for Recovery of Incremental Capital Module (2018) - in effect until the effective date of the next cost of service based rate order",null,null,null,"$",0.28999999999999998,0.28999999999999998]
[null,"GSL_FRR","Rate Rider for Recovery of 2018 Foregone Revenue - effective until December 31, 2018","2018-12-31",null,null,"$",0.35]
[]
[]
[]
[]
[]
[]
[]
[]
["GSL_TN","GSL_TN","Retail Transmission Rate - Network Service Rate",null,"Rate",null,"$/kWh",7.1000000000000004E-3,{"$f":"ROUND('16. RTSR-Rates to Forecast'!K44,4)","v":7.1000000000000004E-3}]
["GSL_TC","GSL_TC","Retail Transmission Rate - Line and Transformation Connection Service Rate",null,"Rate",null,"$/kWh",6.4000000000000003E-3,{"$f":"ROUND('16. RTSR-Rates to Forecast'!K57,4)","v":6.4999999999999997E-3}]
[null,null,"GENERAL SERVICE 50 - 499 KW"]
["GS50_499_F","GS50_499_F","Service Charge",null,"Rate",null,"$",77.48,{"$f":"ROUND('17. Rev2Cost-GDPIPI'!I19,2)","v":78.180000000000007}]
["GS50_499_V","GS50_499_V","Distribution Volumetric Rate",null,"Rate",null,"$/kW",4.6628999999999996,{"$f":"ROUND('17. Rev2Cost-GDPIPI'!J19,4)","v":4.7049000000000003}]
["GS50_499_LV","GS50_499_LV","Low Voltage Service Rate ",null,"Rate",null,"$/kW",8.0199999999999994E-2,{"$f":"H76","v":8.0199999999999994E-2}]
[null,null,"Transformer Discount",null,"Rate",null,"$/kW",-0.4,{"$f":"H77","v":-0.4}]
["GS50_499_ICMF","GS50_499_FRR","Rate Rider for Recovery of Incremental Capital Module (2017) - in effect until the effective date of the next cost of service based rate order",null,"Rate Rider",null,"$",1.93,{"$f":"H78","v":1.93}]
["GS50_499_GA16","GS50_499_GA","Rate Rider for Disposition of Global Adjustment Account (2018) - effective until  April 30, 2019\n        Applicable only for Non-RPP Customers","2019-04-30","Rate Rider",null,"$/kWh",-5.0000000000000001E-4,-5.0000000000000001E-4]
["GS50_499_DVA_nonWMP","GS50_499_DVA","Rate Rider for Disposition of Deferral/Variance Accounts (2018) - effective until April 30, 2019","2019-04-30","Rate Rider",null,"$/kW",0.10050000000000001,0.10050000000000001]
["GS50_499_DVA16","GS50_499_DVA","Rate Rider for Disposition of Deferral/Variance Accounts (2018) - effective until April 30, 2019\n         Applicable only for Non-Wholesale Market Participants","2019-04-30","Rate Rider",null,"$/kW",-0.3538,-0.3538]
["GS50_499_ICMV","GS50_499_VRR","Rate Rider for Recovery of Incremental Capital Module (2017) - in effect until the effective date of the next cost of service based rate order",null,"Rate Rider",null,"$/kW",0.1163,{"$f":"H82","v":0.1163}]
["GS50_499_CBR16","GS50_499_DVA","Rate Rider for Disposition of Capacity Based Recovery Account (2018) - effective until April 30, 2019\n        Applicable Only for Non-WMP Class B Customers","2019-04-30","Rate Rider",null,"$/kW",-1.6060000000000001E-2,-1.6060000000000001E-2]
["GS50_499_GA17","GS50_499_GA","Rate Rider for Disposition of Global Adjustment Account (2019) - effective until  December 31, 2019\n        Applicable only for Non-RPP Customers","2019-12-31","Rate Rider",null,"$/kWh",null,{"$f":"ROUND('6. GA Calculation'!M19,4)","v":1.6999999999999999E-3}]
["GS50_499_DVA_nonWMP","GS50_499_DVA","Rate Rider for Disposition of Deferral/Variance Accounts (2019) - effective until December 31, 2019\n         Applicable only for Non-Wholesale Market Participants","2019-12-31","Rate Rider",null,"$/kW",null,{"$f":"ROUND('8. Calculation of Def-Var RR'!K19,4)","v":-0.34839999999999999}]
["GS50_499_DVA17","GS50_499_DVA","Rate Rider for Disposition of Deferral/Variance Accounts (2019) - effective until December 31, 2019","2019-12-31","Rate Rider",null,"$/kW",null,{"$f":"ROUND('8. Calculation of Def-Var RR'!J19,4)","v":0.21879999999999999}]
["GS50_499_CBR17","GS50_499_DVA","Rate Rider for Disposition of Capacity Based Recovery Account (2019) - effective until December 31, 2019\n        Applicable Only for Non-WMP Class  B Customers","2019-12-31","Rate Rider",null,"$/kW",null,{"$f":"ROUND('7. CBR Allocation'!O24,5)","v":2.3700000000000001E-3}]
["GS50_499_LRV17","GS50_499_VRR","Rate Rider for Disposition of Lost Revenue Adjustment Mechanism Variance Account (LRAMVA) (2019) - effective until December 31, 2019","2019-12-31","Rate Rider",null,"$/kW",null,{"$f":"ROUND('8. Calculation of Def-Var RR'!L19,4)","v":0.1951}]
[null,"GS50_499_FRR","Rate Rider for Recovery of Incremental Capital Module (2019) - in effect until the effective date of the next cost of service based rate order",null,"Rate Rider",null,"$",null,{"$f":"ROUND('19. Additional Rates'!D39,2)","v":0.53}]
[null,"GS50_499_VRR","Rate Rider for Recovery of Incremental Capital Module (2019) - in effect until the effective date of the next cost of service based rate order",null,"Rate Rider",null,"$/kW",null,{"$f":"ROUND('19. Additional Rates'!D40,4)","v":3.1699999999999999E-2}]
["GS50_499_CPF19","GS50_499_FRR","Rate Rider for Disposition of Capitalization Policy Rate Rider (2019) - effective until December 31, 2019","2019-12-31","Rate Rider",null,"$",null,{"$f":"+'19. Additional Rates'!D41","v":-0.74}]
["GS50_499_CPFV19","GS50_499_VRR","Rate Rider for Disposition of Capitalization Policy Rate Rider (2019) - effective until December 31, 2019","2019-12-31","Rate Rider",null,"$/kW",null,{"$f":"+'19. Additional Rates'!D42","v":-4.4699999999999997E-2}]
[null,"GS50_499_FRR","Rate Rider for Recovery of Incremental Capital Module (2018) - in effect until the effective date of the next cost of service based rate order",null,null,null,"$",0.51,0.51]
[null,"GS50_499_VRR","Rate Rider for Disposition of Lost Revenue Adjustment Mechanism Variance Account (LRAMVA) (2018) - effective until April 30, 2019","2019-04-30",null,null,"$/kW",0.45850000000000002,0.45850000000000002]
[null,"GS50_499_VRR","Rate Rider for Recovery of Incremental Capital Module (2018) - in effect until the effective date of the next cost of service based rate order",null,null,null,"$/kW",3.0800000000000001E-2,3.0800000000000001E-2]
[null,"GS50_499_FRR","Rate Rider for Recovery of 2018 Foregone Revenue - effective until December 31, 2018","2018-12-31",null,null,"$",2.84]
[]
[]
[]
[]
[]
["GS50_499_TN","GS50_499_TN","Retail Transmission Rate - Network Service Rate",null,"Rate",null,"$/kW",2.7324999999999999,{"$f":"ROUND('16. RTSR-Rates to Forecast'!K45,4)","v":2.7452999999999999}]
["GS50_499_TC","GS50_499_TC","Retail Transmission Rate - Line and Transformation Connection Service Rate",null,"Rate",null,"$/kW",2.5347,{"$f":"ROUND('16. RTSR-Rates to Forecast'!K58,4)","v":2.5771000000000002}]
[null,null,"GENERAL SERVICE 500 - 4999 KW"]
["GS500_F","GS500_F","Service Charge",null,"Rate",null,"$",1764.42,{"$f":"ROUND('17. Rev2Cost-GDPIPI'!I20,2)","v":1780.3}]
["GS500_V","GS500_V","Distribution Volumetric Rate",null,"Rate",null,"$/kW",2.3994,{"$f":"ROUND('17. Rev2Cost-GDPIPI'!J20,4)","v":2.4209999999999998}]
["GS500_LV","GS500_LV","Low Voltage Service Rate ",null,"Rate",null,"$/kW",7.8399999999999997E-2,{"$f":"H107","v":7.8399999999999997E-2}]
[null,null,"Transformer Discount",null,"Rate",null,"$/kW",-0.4,{"$f":"H108","v":-0.4}]
["GS500_ICMF","GS500_FRR","Rate Rider for Recovery of Incremental Capital Module (2017) - in effect until the effective date of the next cost of service based rate order",null,"Rate Rider",null,"$",44,{"$f":"H109","v":44}]
["GS500_GA16","GS500_GA","Rate Rider for Disposition of Global Adjustment Account (2018) - effective until  April 30, 2019\n        Applicable only for Non-RPP Customers","2019-04-30","Rate Rider",null,"$/kWh",-5.0000000000000001E-4,-5.0000000000000001E-4]
["GS500_DVA_nonWMP","GS500_DVA","Rate Rider for Disposition of Deferral/Variance Accounts (2018) - effective until April 30, 2019","2019-04-30","Rate Rider",null,"$/kW",0.12720000000000001,0.12720000000000001]
["GS500_DVA16","GS500_DVA","Rate Rider for Disposition of Deferral/Variance Accounts (2018) - effective until April 30, 2019\n         Applicable only for Non-Wholesale Market Participants","2019-04-30","Rate Rider",null,"$/kW",-0.44650000000000001,-0.44650000000000001]
["GS500_ICMV","GS500_VRR","Rate Rider for Recovery of Incremental Capital Module (2017) - in effect until the effective date of the next cost of service based rate order",null,"Rate Rider",null,"$/kW",5.9799999999999999E-2,{"$f":"H113","v":5.9799999999999999E-2}]
["GS500_CBR16","GS500_DVA","Rate Rider for Disposition of Capacity Based Recovery Account (2018) - effective until April 30, 2019\n        Applicable Only for Non-WMP Class B Customers","2019-04-30","Rate Rider",null,"$/kW",-1.9990000000000001E-2,-1.9990000000000001E-2]
["GS500_GA17","GS500_GA","Rate Rider for Disposition of Global Adjustment Account (2019) - effective until  December 31, 2019\n        Applicable only for Non-RPP Customers","2019-12-31","Rate Rider",null,"$/kWh",null,{"$f":"ROUND('6. GA Calculation'!M20,4)","v":1.6999999999999999E-3}]
["GS500_DVA_nonWMP","GS500_DVA","Rate Rider for Disposition of Deferral/Variance Accounts (2019) - effective until December 31, 2019\n          Applicable only for Non-Wholesale Market Participants","2019-12-31","Rate Rider",null,"$/kW",null,{"$f":"ROUND('8. Calculation of Def-Var RR'!K20,4)","v":-0.43880000000000002}]
["GS500_DVA17","GS500_DVA","Rate Rider for Disposition of Deferral/Variance Accounts (2019) - effective until December 31, 2019","2019-12-31","Rate Rider",null,"$/kW",null,{"$f":"ROUND('8. Calculation of Def-Var RR'!J20,4)","v":0.27600000000000002}]
["GS500_CBR17","GS500_DVA","Rate Rider for Disposition of Capacity Based Recovery Account (2019) - effective until December 31, 2019\n        Applicable Only for Non-WMP Class  B Customers","2019-12-31","Rate Rider",null,"$/kW",null,{"$f":"ROUND('7. CBR Allocation'!O25,5)","v":2.7799999999999999E-3}]
["GS500_LRV17","GS500_VRR","Rate Rider for Disposition of Lost Revenue Adjustment Mechanism Variance Account (LRAMVA) (2019) - effective until December 31, 2019","2019-12-31","Rate Rider",null,"$/kW",null,{"$f":"ROUND('8. Calculation of Def-Var RR'!L20,4)","v":7.5200000000000003E-2}]
[null,"GS500_FRR","Rate Rider for Recovery of Incremental Capital Module (2019) - in effect until the effective date of the next cost of service based rate order",null,"Rate Rider",null,"$",null,{"$f":"ROUND('19. Additional Rates'!D51,2)","v":11.99}]
[null,"GS500_VRR","Rate Rider for Recovery of Incremental Capital Module (2019) - in effect until the effective date of the next cost of service based rate order",null,"Rate Rider",null,"$/kW",null,{"$f":"ROUND('19. Additional Rates'!D52,4)","v":1.6299999999999999E-2}]
[null,"GS500_FRR","Rate Rider for Disposition of Capitalization Policy Rate Rider (2019) - effective until December 31, 2019","2019-12-31","Rate Rider",null,"$",null,{"$f":"+'19. Additional Rates'!D53","v":-16.899999999999999}]
[null,"GS500_VRR","Rate Rider for Disposition of Capitalization Policy Rate Rider (2019) - effective until December 31, 2019","2019-12-31","Rate Rider",null,"$/kW",null,{"$f":"+'19. Additional Rates'!D54","v":-2.3E-2}]
[null,"GS500_FRR","Rate Rider for Recovery of Incremental Capital Module (2018) - in effect until the effective date of the next cost of service based rate order",null,null,null,"$",11.65,11.65]
[null,"GS500_VRR","Rate Rider for Disposition of Lost Revenue Adjustment Mechanism Variance Account (LRAMVA) (2018) - effective until April 30, 2019","2019-04-30",null,null,"$/kW",0.14099999999999999,0.14099999999999999]
[null,"GS500_VRR","Rate Rider for Recovery of Incremental Capital Module (2018) - in effect until the effective date of the next cost of service based rate order",null,null,null,"$/kW",1.5800000000000002E-2,1.5800000000000002E-2]
[null,"GS500_FRR","Rate Rider for Recovery of 2018 Foregone Revenue - effective until December 31, 2018","2018-12-31",null,null,"$",16.18]
[]
[]
[]
[]
[]
["GS500_TN","GS500_TN","Retail Transmission Rate - Network Service Rate",null,"Rate",null,"$/kW",2.6436000000000002,{"$f":"ROUND('16. RTSR-Rates to Forecast'!K46,4)","v":2.6560000000000001}]
["GS500_TC","GS500_TC","Retail Transmission Rate - Line and Transformation Connection Service Rate",null,"Rate",null,"$/kW",2.4803000000000002,{"$f":"ROUND('16. RTSR-Rates to Forecast'!K59,4)","v":2.5217999999999998}]
[null,null,"LARGE USE"]
["LU_F","LU_F","Service Charge",null,"Rate",null,"$",13911.73,{"$f":"ROUND('17. Rev2Cost-GDPIPI'!I21,2)","v":14036.94}]
["LU_V","LU_V","Distribution Volumetric Rate",null,"Rate",null,"$/kW",2.9782000000000002,{"$f":"ROUND('17. Rev2Cost-GDPIPI'!J21,4)","v":3.0049999999999999}]
["LU_LV","LU_LV","Low Voltage Service Rate ",null,"Rate",null,"$/kW",8.3799999999999999E-2,{"$f":"H138","v":8.3799999999999999E-2}]
[null,null,"Transformer Discount",null,"Rate",null,"$/kW",-0.4,{"$f":"H139","v":-0.4}]
["LU_ICMF","LU_FRR","Rate Rider for Recovery of Incremental Capital Module (2017) - in effect until the effective date of the next cost of service based rate order",null,"Rate Rider",null,"$",346.9,{"$f":"H140","v":346.9}]
["LU_GA16"]
["LU_DVA16","LU_DVA","Rate Rider for Disposition of Deferral/Variance Accounts (2018) - effective until April 30, 2019","2019-04-30","Rate Rider",null,"$/kW",-0.40539999999999998,-0.40539999999999998]
["LU_ICMV","LU_VRR","Rate Rider for Recovery of Incremental Capital Module (2017) - in effect until the effective date of the next cost of service based rate order",null,"Rate Rider",null,"$/kW",7.4300000000000005E-2,{"$f":"H143","v":7.4300000000000005E-2}]
["LU_CBR16"]
["LU_GA17",null,"Rate Rider for Disposition of Global Adjustment Account (2019) - effective until  December 31, 2019\n        Applicable only for Non-RPP Customers","2019-12-31","Rate Rider",null,"$/kWh",null,0]
["LU_DVA17","LU_DVA","Rate Rider for Disposition of Deferral/Variance Accounts (2019) - effective until December 31, 2019","2019-12-31","Rate Rider",null,"$/kW",null,{"$f":"ROUND('8. Calculation of Def-Var RR'!J21,4)","v":-0.21}]
["LU_CBR17",null,"Rate Rider for Disposition of Capacity Based Recovery Account (2019) - effective until December 31, 2019\n        Applicable Only for Non-WMP Class  B Customers","2019-12-31","Rate Rider",null,"$/kW",null,{"$f":"ROUND('7. CBR Allocation'!O26,5)","v":1.0000000000000001E-5}]
["LU_LRV17","LU_VRR","Rate Rider for Disposition of Lost Revenue Adjustment Mechanism Variance Account (LRAMVA) (2019) - effective until December 31, 2019","2019-12-31","Rate Rider",null,"$/kW",null,{"$f":"ROUND('8. Calculation of Def-Var RR'!L21,4)","v":6.4000000000000001E-2}]
[null,"LU_FRR","Rate Rider for Recovery of Incremental Capital Module (2019) - in effect until the effective date of the next cost of service based rate order",null,"Rate Rider",null,"$",null,{"$f":"ROUND('19. Additional Rates'!D63,2)","v":94.56}]
[null,"LU_VRR","Rate Rider for Recovery of Incremental Capital Module (2019) - in effect until the effective date of the next cost of service based rate order",null,"Rate Rider",null,"$/kW",null,{"$f":"ROUND('19. Additional Rates'!D64,4)","v":2.0199999999999999E-2}]
[null,"LU_FRR","Rate Rider for Disposition of Capitalization Policy Rate Rider (2019) - effective until December 31, 2019","2019-12-31","Rate Rider",null,"$",null,{"$f":"+'19. Additional Rates'!D65","v":-133.24}]
[null,"LU_VRR","Rate Rider for Disposition of Capitalization Policy Rate Rider (2019) - effective until December 31, 2019","2019-12-31","Rate Rider",null,"$/kW",null,{"$f":"+'19. Additional Rates'!D66","v":-2.8500000000000001E-2}]
[null,"LU_VRR","Rate Rider for Disposition of Lost Revenue Adjustment Mechanism Variance Account (LRAMVA) (2018) - effective until April 30, 2019","2019-04-30",null,null,"$/kW",8.7999999999999995E-2,8.7999999999999995E-2]
[null,"LU_VRR","Rate Rider for Recovery of Incremental Capital Module (2018) - in effect until the effective date of the next cost of service based rate order",null,null,null,"$/kW",1.9699999999999999E-2,1.9699999999999999E-2]
[null,"LU_FRR","Rate Rider for Recovery of Incremental Capital Module (2018) - in effect until the effective date of the next cost of service based rate order",null,null,null,"$",91.89,91.89]
[null,"LU_FRR","Rate Rider for Recovery of 2018 Foregone Revenue - effective until December 31, 2018","2018-12-31",null,null,"$",264.39]
[]
[]
[]
[]
[]
["LU_TN","LU_TN","Retail Transmission Rate - Network Service Rate – Interval Metered",null,"Rate",null,"$/kW",2.8210999999999999,{"$f":"ROUND('16. RTSR-Rates to Forecast'!K47,4)","v":2.8342999999999998}]
["LU_TC","LU_TC","Retail Transmission Rate - Line and Transformation Connection Service Rate – Interval Metered ",null,"Rate",null,"$/kW",2.6490999999999998,{"$f":"ROUND('16. RTSR-Rates to Forecast'!K60,4)","v":2.6934}]
[null,null,"UNMETERED SCATTERED LOAD"]
["USL_F","USL_F","Service Charge",null,"Rate",null,"$",9.08,{"$f":"ROUND('17. Rev2Cost-GDPIPI'!I23,2)","v":9.16}]
["USL_V","USL_V","Distribution Volumetric Rate",null,"Rate",null,"$/kWh",1.6500000000000001E-2,{"$f":"ROUND('17. Rev2Cost-GDPIPI'!J23,4)","v":1.66E-2}]
["USL_LV","USL_LV","Low Voltage Service Rate ",null,"Rate",null,"$/kWh",2.0000000000000001E-4,{"$f":"H167","v":2.0000000000000001E-4}]
["USL_ICMF","USL_FRR","Rate Rider for Recovery of Incremental Capital Module (2017) - in effect until the effective date of the next cost of service based rate order",null,"Rate Rider",null,"$",0.23,{"$f":"H168","v":0.23}]
["USL_GA16","USL_GA","Rate Rider for Disposition of Global Adjustment Account (2018) - effective until  April 30, 2019\n        Applicable only for Non-RPP Customers","2019-04-30","Rate Rider",null,"$/kWh",-5.0000000000000001E-4,-5.0000000000000001E-4]
["USL_DVA16","USL_DVA","Rate Rider for Disposition of Deferral/Variance Accounts (2018) - effective until April 30, 2019","2019-04-30","Rate Rider",null,"$/kWh",-6.9999999999999999E-4,-6.9999999999999999E-4]
["USL_ICMV","USL_VRR","Rate Rider for Recovery of Incremental Capital Module (2017) - in effect until the effective date of the next cost of service based rate order",null,"Rate Rider",null,"$/kWh",4.0000000000000002E-4,{"$f":"H171","v":4.0000000000000002E-4}]
["USL_CBR16","USL_DVA","Rate Rider for Disposition of Capacity Based Recovery Account (2018) - effective until April 30, 2019\n        Applicable Only for Class B Customers","2019-04-30","Rate Rider",null,"$/kWh",-5.0000000000000002E-5,-5.0000000000000002E-5]
["USL_GA17","USL_GA","Rate Rider for Disposition of Global Adjustment Account (2019) - effective until  December 31, 2019\n        Applicable only for Non-RPP Customers","2019-12-31","Rate Rider",null,"$/kWh",null,{"$f":"ROUND('6. GA Calculation'!M23,4)","v":1.6999999999999999E-3}]
["USL_DVA17","USL_DVA","Rate Rider for Disposition of Deferral/Variance Accounts (2019) - effective until December 31, 2019","2019-12-31","Rate Rider",null,"$/kWh",null,{"$f":"ROUND('8. Calculation of Def-Var RR'!J23,4)","v":-4.0000000000000002E-4}]
["USL_CBR17","USL_DVA","Rate Rider for Disposition of Capacity Based Recovery Account (2019) - effective until December 31, 2019\n        Applicable Only for Class B Customers","2019-12-31","Rate Rider",null,"$/kWh",null,{"$f":"ROUND('7. CBR Allocation'!O28,5)","v":1.0000000000000001E-5}]
["USL_LRV17","USL_VRR","Rate Rider for Disposition of Lost Revenue Adjustment Mechanism Variance Account (LRAMVA) (2019) - effective until December 31, 2019","2019-12-31","Rate Rider",null,"$/kWh",null,{"$f":"ROUND('8. Calculation of Def-Var RR'!L23,4)","v":0}]
[null,"USL_FRR","Rate Rider for Recovery of Incremental Capital Module (2019) - in effect until the effective date of the next cost of service based rate order",null,"Rate Rider",null,"$",null,{"$f":"ROUND('19. Additional Rates'!D75,2)","v":0.06}]
[null,"USL_VRR","Rate Rider for Recovery of Incremental Capital Module (2019) - in effect until the effective date of the next cost of service based rate order",null,"Rate Rider",null,"$/kWh",null,{"$f":"ROUND('19. Additional Rates'!D76,4)","v":1E-4}]
[null,"USL_FRR","Rate Rider for Disposition of Capitalization Policy Rate Rider (2019) - effective until December 31, 2019","2019-12-31","Rate Rider",null,"$",null,{"$f":"+'19. Additional Rates'!D77","v":-0.09}]
[null,"USL_VRR","Rate Rider for Disposition of Capitalization Policy Rate Rider (2019) - effective until December 31, 2019","2019-12-31","Rate Rider",null,"$/kWh",null,{"$f":"+'19. Additional Rates'!D78","v":-2.0000000000000001E-4}]
[null,"USL_VRR","Rate Rider for Recovery of Incremental Capital Module (2018) - in effect until the effective date of the next cost of service based rate order",null,null,null,"$/kWh",1E-4,1E-4]
[null,"USL_FRR","Rate Rider for Recovery of Incremental Capital Module (2018) - in effect until the effective date of the next cost of service based rate order",null,null,null,"$",0.06,0.06]
[null,"USL_FRR","Rate Rider for Recovery of 2018 Foregone Revenue - effective until December 31, 2018","2018-12-31",null,null,"$",0.05]
[]
[]
[]
[]
[]
[]
[]
[]
["USL_TN","USL_TN","Retail Transmission Rate - Network Service Rate",null,"Rate",null,"$/kWh",7.1000000000000004E-3,{"$f":"ROUND('16. RTSR-Rates to Forecast'!K49,4)","v":7.1000000000000004E-3}]
["USL_TC","USL_TC","Retail Transmission Rate - Line and Transformation Connection Service Rate",null,"Rate",null,"$/kWh",6.4000000000000003E-3,{"$f":"ROUND('16. RTSR-Rates to Forecast'!K62,4)","v":6.4999999999999997E-3}]
[null,null,"STREET LIGHTING"]
["SL_F","SL_F","Service Charge",null,"Rate",null,"$",1.52,{"$f":"ROUND('17. Rev2Cost-GDPIPI'!I24,2)","v":1.53}]
["SL_V","SL_V","Distribution Volumetric Rate",null,"Rate",null,"$/kW",11.650399999999999,{"$f":"ROUND('17. Rev2Cost-GDPIPI'!J24,4)","v":11.7553}]
["SL_LV","SL_LV","Low Voltage Service Rate ",null,"Rate",null,"$/kW",5.8000000000000003E-2,{"$f":"H197","v":5.8000000000000003E-2}]
["SL_ICMF","SL_FRR","Rate Rider for Recovery of Incremental Capital Module (2017) - in effect until the effective date of the next cost of service based rate order",null,"Rate Rider",null,"$",0.04,{"$f":"H198","v":0.04}]
["SL_GA16","SL_GA","Rate Rider for Disposition of Global Adjustment Account (2018) - effective until  April 30, 2019\n        Applicable only for Non-RPP Customers","2019-04-30","Rate Rider",null,"$/kWh",-5.0000000000000001E-4,-5.0000000000000001E-4]
["SL_DVA16","SL_DVA","Rate Rider for Disposition of Deferral/Variance Accounts (2018) - effective until April 30, 2019","2019-04-30","Rate Rider",null,"$/kW",-0.2616,-0.2616]
["SL_ICMV","SL_VRR","Rate Rider for Recovery of Incremental Capital Module (2017) - in effect until the effective date of the next cost of service based rate order",null,"Rate Rider",null,"$/kW",0.29049999999999998,{"$f":"H201","v":0.29049999999999998}]
["SL_CBR16","SL_DVA","Rate Rider for Disposition of Capacity Based Recovery Account (2018) - effective until April 30, 2019\n        Applicable Only for Non-WMP Class B Customers","2019-04-30","Rate Rider",null,"$/kW",-1.6549999999999999E-2,-1.6549999999999999E-2]
["SL_GA17","SL_GA","Rate Rider for Disposition of Global Adjustment Account (2019) - effective until  December 31, 2019\n        Applicable only for Non-RPP Customers","2019-12-31","Rate Rider",null,"$/kWh",null,{"$f":"ROUND('6. GA Calculation'!M24,4)","v":1.6999999999999999E-3}]
["SL_DVA17","SL_DVA","Rate Rider for Disposition of Deferral/Variance Accounts (2019) - effective until December 31, 2019","2019-12-31","Rate Rider",null,"$/kW",null,{"$f":"ROUND('8. Calculation of Def-Var RR'!J24,4)","v":-0.13539999999999999}]
["SL_CBR17","SL_DVA","Rate Rider for Disposition of Capacity Based Recovery Account (2019) - effective until December 31, 2019\n        Applicable Only for Non-WMP Class  B Customers","2019-12-31","Rate Rider",null,"$/kW",null,{"$f":"ROUND('7. CBR Allocation'!O29,5)","v":2.48E-3}]
["SL_LRV17","SL_VRR","Rate Rider for Disposition of Lost Revenue Adjustment Mechanism Variance Account (LRAMVA) (2019) - effective until December 31, 2019","2019-12-31","Rate Rider",null,"$/kW",null,{"$f":"ROUND('8. Calculation of Def-Var RR'!L24,4)","v":-3.7907999999999999}]
[null,"SL_FRR","Rate Rider for Recovery of Incremental Capital Module (2019) - in effect until the effective date of the next cost of service based rate order",null,"Rate Rider",null,"$",null,{"$f":"ROUND('19. Additional Rates'!D87,2)","v":0.01}]
[null,"SL_VRR","Rate Rider for Recovery of Incremental Capital Module (2019) - in effect until the effective date of the next cost of service based rate order",null,"Rate Rider",null,"$/kW",null,{"$f":"ROUND('19. Additional Rates'!D88,4)","v":7.9200000000000007E-2}]
[null,"SL_FRR","Rate Rider for Disposition of Capitalization Policy Rate Rider (2019) - effective until December 31, 2019","2019-12-31","Rate Rider",null,"$",null,{"$f":"+'19. Additional Rates'!D89","v":-0.01}]
[null,"SL_VRR","Rate Rider for Disposition of Capitalization Policy Rate Rider (2019) - effective until December 31, 2019","2019-12-31","Rate Rider",null,"$/kW",null,{"$f":"+'19. Additional Rates'!D90","v":-0.1116}]
[null,"SL_VRR","Rate Rider for Disposition of Lost Revenue Adjustment Mechanism Variance Account (LRAMVA) (2018) - effective until April 30, 2019","2019-04-30",null,null,"$/kW",-33.353200000000001,-33.353200000000001]
[null,"SL_FRR","Rate Rider for Recovery of Incremental Capital Module (2018) - in effect until the effective date of the next cost of service based rate order",null,null,null,"$",0.01,0.01]
[null,"SL_VRR","Rate Rider for Recovery of Incremental Capital Module (2018) - in effect until the effective date of the next cost of service based rate order",null,null,null,"$/kW",7.6999999999999999E-2,7.6999999999999999E-2]
[null,"SL_FRR","Rate Rider for Recovery of 2018 Foregone Revenue - effective until December 31, 2018","2018-12-31",null,null,"$",0.01]
[]
[]
[]
[]
["SL_TN","SL_TN","Retail Transmission Rate - Network Service Rate",null,"Rate",null,"$/kW",1.8924000000000001,{"$f":"ROUND('16. RTSR-Rates to Forecast'!K50,4)","v":1.9012}]
["SL_TC","SL_TC","Retail Transmission Rate - Line and Transformation Connection Service Rate",null,"Rate",null,"$/kW",1.8329,{"$f":"ROUND('16. RTSR-Rates to Forecast'!K63,4)","v":1.8634999999999999}]
[null,null,"MICROFIT "]
[null,null,"Service Charge",null,"Rate",null,"$",5.4,{"$f":"H222","v":5.4}]

{"sheet":"BoD Reporting","index":28,"n_rows":63,"n_cols":17,"rows_kept":63,"cut":false,"hidden":false,"merged":[[2,9,3,9],[2,10,3,10],[2,11,3,11],[2,12,2,13],[2,15,2,16],[12,1,12,5],[1,1,1,5],[2,1,3,1],[2,2,3,2],[2,3,3,3],[2,4,2,5],[26,1,26,5],[27,1,28,1],[27,2,28,2],[27,3,28,3],[27,4,27,5],[50,1,50,5],[37,1,37,5],[39,1,39,5],[40,1,41,1],[40,2,41,2],[40,3,41,3],[40,4,40,5],[53,1,54,1],[53,2,54,2],[53,3,54,3],[53,4,53,5],[52,1,52,5]]}
["Back to Index","Back to Index"]
[null,"Distribution Bill Impacts",null,null,null,null,null,"Alectra - Enersource"]
[null,"Customer Class","Billing Units","Average Monthly Volume","2019 vs. 2018",null,null,null,null,"Customer Class","Billing Units","Average Monthly Volume","Impacts Related to:",null,null,"2018 vs. 2017"]
[null,null,null,null,"$","%",null,null,null,null,null,null,"2018 Price  Cap","ADD: ICM Impact (excl. HST)",null,"$","%"]
[{"$f":"'21. Bill Impacts'!E15","v":"RESIDENTIAL SERVICE CLASSIFICATION"},"Residential",{"$f":"'21. Bill Impacts'!G15","v":"kWh"},{"$f":"'21. Bill Impacts'!K15","v":750},{"$f":"'21. Bill Impacts'!H40","v":-0.14499999999999957},{"$f":"'21. Bill Impacts'!I40","v":-5.7965220867479336E-3},null,null,null,"Residential","kWh",750,{"$f":"'21. Bill Impacts'!M72+'21. Bill Impacts'!M73","v":-5.4999999999999716E-2},{"$f":"'21. Bill Impacts'!M74","v":-0.24},null,{"$f":"SUM(M5:N5)","v":-0.29499999999999971},{"$f":"'21. Bill Impacts'!T40","v":0}]
[{"$f":"'21. Bill Impacts'!E16","v":"GENERAL SERVICE LESS THAN 50 kW SERVICE CLASSIFICATION"},"GS<50",{"$f":"'21. Bill Impacts'!G16","v":"kWh"},{"$f":"'21. Bill Impacts'!K16","v":2000},{"$f":"'21. Bill Impacts'!H41","v":0.53000000000000114},{"$f":"'21. Bill Impacts'!I41","v":7.2276012546024972E-3},null,null,null,"GS<50","kWh",2000,{"$f":"'21. Bill Impacts'!M125+'21. Bill Impacts'!M126","v":0.59999999999999787},1.05,null,{"$f":"SUM(M6:N6)","v":1.6499999999999979},{"$f":"'21. Bill Impacts'!T41","v":0}]
[{"$f":"'21. Bill Impacts'!E17","v":"GENERAL SERVICE 50 to 499 kW SERVICE CLASSIFICATION"},"GS 50-499 kW",{"$f":"'21. Bill Impacts'!G17","v":"kW"},{"$f":"'21. Bill Impacts'!L17","v":230},{"$f":"'21. Bill Impacts'!H42","v":49.193000000000438},{"$f":"'21. Bill Impacts'!I42","v":3.8001104660819261E-2},null,null,null,"GS 50-499 kW","kW",230,{"$f":"'21. Bill Impacts'!M178+'21. Bill Impacts'!M179","v":10.360000000000312},17.059999999999999,null,27.420000000000311,{"$f":"'21. Bill Impacts'!T42","v":0}]
[{"$f":"'21. Bill Impacts'!E18","v":"GENERAL SERVICE 500 to 4,999 kW SERVICE CLASSIFICATION"},"GS 500-4,999 kW",{"$f":"'21. Bill Impacts'!G18","v":"kW"},{"$f":"'21. Bill Impacts'!L18","v":2250},{"$f":"'21. Bill Impacts'!H43","v":197.51499999999942},{"$f":"'21. Bill Impacts'!I43","v":2.5577390009388381E-2},null,null,null,"GS 500-4,999 kW","kW",2250,{"$f":"'21. Bill Impacts'!M231+'21. Bill Impacts'!M232","v":64.480000000000246},106.3,null,170.78000000000026,{"$f":"'21. Bill Impacts'!T43","v":0}]
[{"$f":"'21. Bill Impacts'!E19","v":"LARGE USE SERVICE CLASSIFICATION"},"Large User",{"$f":"'21. Bill Impacts'!G19","v":"kW"},{"$f":"'21. Bill Impacts'!L19","v":5000},{"$f":"'21. Bill Impacts'!H44","v":234.64000000000306},{"$f":"'21. Bill Impacts'!I44","v":7.7143836893258516E-3},null,null,null,"Large User","kW",5000,{"$f":"'21. Bill Impacts'!M284+'21. Bill Impacts'!M285","v":259.21000000000095},427.57,null,686.78000000000088,{"$f":"'21. Bill Impacts'!T44","v":0}]
[{"$f":"'21. Bill Impacts'!E20","v":"STANDBY POWER SERVICE CLASSIFICATION "},"Stanby Power",{"$f":"'21. Bill Impacts'!G20","v":"kW"},{"$f":"'21. Bill Impacts'!L21","v":0},{"$f":"'21. Bill Impacts'!H45","v":0},{"$f":"'21. Bill Impacts'!I45","v":0},null,null,null,"Stanby Power","kW",0,{"$f":"'21. Bill Impacts'!P45","v":0},{"$f":"'21. Bill Impacts'!Q45","v":0},null,0,{"$f":"'21. Bill Impacts'!T45","v":0}]
[{"$f":"'21. Bill Impacts'!E21","v":"UNMETERED SCATTERED LOAD SERVICE CLASSIFICATION"},"Unmetered Scattered Load",{"$f":"'21. Bill Impacts'!G21","v":"kWh"},{"$f":"'21. Bill Impacts'!L22","v":0.1},{"$f":"'21. Bill Impacts'!H46","v":0},{"$f":"'21. Bill Impacts'!I46","v":0},null,null,null,"Unmetered Scattered Load","kWh",0.1,{"$f":"'21. Bill Impacts'!M338+'21. Bill Impacts'!M339","v":0.11000000000000032},null,null,0.11000000000000032,{"$f":"'21. Bill Impacts'!T46","v":0}]
[{"$f":"'21. Bill Impacts'!E22","v":"STREET LIGHTING SERVICE CLASSIFICATION"},"Street Lighting",{"$f":"'21. Bill Impacts'!G22","v":"kW"},{"$f":"'21. Bill Impacts'!L23","v":0},{"$f":"'21. Bill Impacts'!H47","v":-0.3718300000000001},{"$f":"'21. Bill Impacts'!I47","v":0.67174317561830421},null,null,null,"Street Lighting","kW",0.1,{"$f":"'21. Bill Impacts'!M392+'21. Bill Impacts'!M393","v":2.0489999999999897E-2},0.04,null,6.0489999999999898E-2,{"$f":"'21. Bill Impacts'!T47","v":0}]
[null,"Table excludes the impact of HST (13%) & Provinicial Rebate (8%)"]
[]
[]
[]
[]
[]
[]
[]
[]
[]
[]
[]
[]
[]
[null,"Distribution Bill and All Rate Rider Bill Impacts"]
[null,"Customer Class","Billing Units","Average Monthly Volume",{"$f":"E3","v":"2019 vs. 2018"}]
[null,null,null,null,"$","%"]
[null,{"$f":"B5","v":"Residential"},"kWh",750,{"$f":"'21. Bill Impacts'!J40","v":-0.43749999999999645},{"$f":"'21. Bill Impacts'!K40","v":-1.5975181688023379E-2}]
[null,"GS<50","kWh",2000,{"$f":"'21. Bill Impacts'!J41","v":-0.25},{"$f":"'21. Bill Impacts'!K41","v":-3.1764876889501942E-3}]
[null,"GS 50-499 kW","kW",230,{"$f":"'21. Bill Impacts'!J42","v":189.93010000000049},{"$f":"'21. Bill Impacts'!K42","v":0.15814221751358612}]
[null,"GS 500-4,999 kW","kW",2250,{"$f":"'21. Bill Impacts'!J43","v":517.46999999999935},{"$f":"'21. Bill Impacts'!K43","v":7.461449645452442E-2}]
[null,"Large User","kW",5000,{"$f":"'21. Bill Impacts'!J44","v":-815.35999999999694},{"$f":"'21. Bill Impacts'!K44","v":-2.8303337520840525E-2}]
[null,"Stanby Power","kW",0,{"$f":"'21. Bill Impacts'!J45","v":0},{"$f":"'21. Bill Impacts'!K45","v":0}]
[null,"Unmetered Scattered Load","kWh",0.1,{"$f":"'21. Bill Impacts'!J46","v":-0.11700000000000266},{"$f":"'21. Bill Impacts'!K46","v":-7.6769175168362432E-3}]
[null,"Street Lighting","kW",0,{"$f":"'21. Bill Impacts'!J47","v":-0.32902200000000015},{"$f":"'21. Bill Impacts'!K47","v":0.7019426510665191}]
[null,"Table excludes the impact of HST (13%) & Provinicial Rebate (8%)"]
[]
[null,"Total Bill Impacts"]
[null,"Customer Class","Billing Units","Average Monthly Volume",{"$f":"E3","v":"2019 vs. 2018"}]
[null,null,null,null,"$","%"]
[null,{"$f":"B5","v":"Residential"},"kWh",750,{"$f":"'21. Bill Impacts'!P40","v":-0.36249999999999716},{"$f":"'21. Bill Impacts'!Q40","v":-3.5131405509166214E-3}]
[null,"GS<50","kWh",2000,{"$f":"'21. Bill Impacts'!P41","v":-14.050000000000011},{"$f":"'21. Bill Impacts'!Q41","v":-4.8114118332924262E-2}]
[null,"GS 50-499 kW","kW",230,{"$f":"'21. Bill Impacts'!P42","v":-497.3739000000005},{"$f":"'21. Bill Impacts'!Q42","v":-3.4854063061078112E-2}]
[null,"GS 500-4,999 kW","kW",2250,{"$f":"'21. Bill Impacts'!P43","v":-2161.2550000000047},{"$f":"'21. Bill Impacts'!Q43","v":-3.2798515788076396E-2}]
[null,"Large User","kW",5000,{"$f":"'21. Bill Impacts'!P44","v":-21527.860000000044},{"$f":"'21. Bill Impacts'!Q44","v":-5.3162579128869972E-2}]
[null,"Stanby Power","kW",0,{"$f":"'21. Bill Impacts'!P45","v":0},{"$f":"'21. Bill Impacts'!Q45","v":0}]
[null,"Unmetered Scattered Load","kWh",0.1,{"$f":"'21. Bill Impacts'!P46","v":-2.1869999999999976},{"$f":"'21. Bill Impacts'!Q46","v":-4.6090998594466852E-2}]
[null,"Street Lighting","kW",0,{"$f":"'21. Bill Impacts'!P47","v":-0.55608199999999997},{"$f":"'21. Bill Impacts'!Q47","v":-0.15055559547518274}]
[null,"Table excludes the impact of HST (13%) & Provinicial Rebate (8%)"]
[]
[null,"Total Bill Impacts including HST"]
[null,"Customer Class","Billing Units","Average Monthly Volume","2018 vs. 2017"]
[null,null,null,null,"$","%"]
[null,{"$f":"B5","v":"Residential"},"kWh",750,{"$f":"'21. Bill Impacts'!N40","v":-0.38062499999999488},{"$f":"'21. Bill Impacts'!O40","v":-3.5131405509166019E-3}]
[null,"GS<50","kWh",2000,{"$f":"'21. Bill Impacts'!N41","v":-14.752500000000055},{"$f":"'21. Bill Impacts'!O41","v":-4.8114118332924401E-2}]
[null,"GS 50-499 kW","kW",230,{"$f":"'21. Bill Impacts'!N42","v":-562.0325069999999},{"$f":"'21. Bill Impacts'!O42","v":-3.4854063061078071E-2}]
[null,"GS 500-4,999 kW","kW",2250,{"$f":"'21. Bill Impacts'!N43","v":-2442.2181500000006},{"$f":"'21. Bill Impacts'!O43","v":-3.2798515788076334E-2}]
[null,"Large User","kW",5000,{"$f":"'21. Bill Impacts'!N44","v":-24326.481800000052},{"$f":"'21. Bill Impacts'!O44","v":-5.3162579128869979E-2}]
[null,"Stanby Power","kW",0,{"$f":"'21. Bill Impacts'!N45","v":0},{"$f":"'21. Bill Impacts'!O45","v":0}]
[null,"Unmetered Scattered Load","kWh",0.1,{"$f":"'21. Bill Impacts'!N46","v":-2.2963499999999897},{"$f":"'21. Bill Impacts'!O46","v":-4.6090998594466699E-2}]
[null,"Street Lighting","kW",0,{"$f":"'21. Bill Impacts'!N47","v":-0.62837265999999969},{"$f":"'21. Bill Impacts'!O47","v":-0.15055559547518269}]

{"sheet":"10th Percentile","index":29,"n_rows":112,"n_cols":22,"rows_kept":112,"cut":false,"hidden":false,"merged":[[68,12,68,13],[69,5,70,5],[69,12,70,12],[69,13,70,13],[1,4,8,10],[10,4,10,10],[36,4,38,5],[36,6,38,6],[36,7,36,12],[36,15,36,16],[36,17,36,18],[37,7,37,8],[37,9,37,10],[37,11,37,12],[37,13,37,14],[37,15,37,16],[37,17,37,18],[36,13,36,14],[105,4,105,5],[110,4,110,5],[61,5,61,10],[62,5,62,7],[68,6,68,8],[68,9,68,11],[100,4,100,5]]}
["Back to Index"]
[null,null,null,null,{"$f":"+'1. Information Sheet'!B2","v":"INCENTIVE REGULATION MODEL FOR 2019 FILERS"}]
[]
[]
[]
[]
[]
[]
[]
[]
[null,null,null,null,"The bill comparisons below must be provided for typical customers and consumption levels. Bill impacts must be provided for residential customers consuming 750 kWh per month and general service customers consuming 2,000 kWh per month and having a monthly demand of less than 50 kW. Include bill comparisons for Non-RPP (retailer) as well. To assess the combined effects of the shift to fixed rates and other bill impacts associated with changes in the cost of distribution service, applicants are to include a total bill impact for a residential customer at the distributor’s 10th consumption percentile (In other words, 10% of a distributor’s residential customers consume at or less than this level of consumption on a monthly basis). Refer to page 9 of the Filing Requirements For Electricity Distribution Rate Applications issued July 14, 2016.\n\nFor certain classes where one or more customers have unique consumption and demand patterns and which may be significantly impacted by the proposed rate changes, the distributor must show a typical comparison, and provide an explanation.\n\nNote:  \n1. For those classes that are not eligible for the RPP price, the weighted average price including Class B GA through end of February 2017 of $0.1058/kWh (IESO's Monthly Market Report for February 2017, page 22) has been used to represent the cost of power. For those classes on a retailer contract, applicants should enter the contract price (plus GA) for a more accurate estimate. Changes to the cost of power can be made directly on the bill impact table for the specific class.\n2. Please enter the applicable billing determinant (e.g. number of connections or devices) to be applied to the monthly service charge for unmetered rate classes in column N. If the monthly service charge is applied on a per customer basis, enter the number “1”. Distributors should provide the number of connections or devices reflective of a typical customer in each class."]
[]
[null,null,null,null,"Table 1"]
[null,null,null,null,"RATE CLASSES / CATEGORIES \n(eg: Residential TOU, Residential Retailer)",null,"Units","RPP?\nNon-RPP Retailer?\nNon-RPP\nOther?","Current \nLoss Factor ","Proposed Loss Factor","Consumption (kWh)","Demand kW\n(if applicable)","RTSR\n","Billing Determinant Applied to Fixed Charge for Unmetered Classes (e.g. # of devices/connections)."]
[null,1,{"$f":"IF(ISERROR(VLOOKUP(E15, E$15:V$33, 18, FALSE)),\"\", VLOOKUP(E15, E$15:V$33, 18, FALSE))","v":1},null,{"$f":"'4. Billing Det. for Def-Var'!B17","v":"RESIDENTIAL SERVICE CLASSIFICATION"},null,{"$f":"IF(ISERROR(VLOOKUP(E15,BILLING_DETERMINANTS,2,FALSE)),\"\",(VLOOKUP(E15,BILLING_DETERMINANTS,2,FALSE)))","v":"kWh"},"RPP",{"$f":"LLF","v":1.036},{"$f":"IF(ISBLANK(I15),\"\", I15)","v":1.036},750,null,"N/A",null,null,null,null,null,null,{"$f":"SUM(I15:L15)","v":752.072},78,1]
[null,2,2,null,{"$f":"'4. Billing Det. for Def-Var'!B18","v":"GENERAL SERVICE LESS THAN 50 kW SERVICE CLASSIFICATION"},null,"kWh","RPP",{"$f":"LLF","v":1.036},{"$f":"IF(ISBLANK(I16),\"\", I16)","v":1.036},2000,null,"N/A",null,null,null,null,null,null,2002.0719999999999,{"$f":"U15+68","v":146},2]
[null,3,3,null,{"$f":"'4. Billing Det. for Def-Var'!B19","v":"GENERAL SERVICE 50 to 499 kW SERVICE CLASSIFICATION"},null,"kW","Non-RPP (Other)",{"$f":"LLF","v":1.036},1.036,100000,230,"DEMAND",null,null,null,null,null,null,100232.072,{"$f":"U16+68","v":214},3]
[null,4,4,null,{"$f":"'4. Billing Det. for Def-Var'!B20","v":"GENERAL SERVICE 500 to 4,999 kW SERVICE CLASSIFICATION"},null,"kW","Non-RPP (Other)",{"$f":"LLF","v":1.036},1.036,400000,2250,"DEMAND",null,null,null,null,null,null,402252.07199999999,282,4]
[null,5,5,null,{"$f":"'4. Billing Det. for Def-Var'!B21","v":"LARGE USE SERVICE CLASSIFICATION"},null,"kW","Non-RPP (Other)",1.0145,1.0145,3000000,5000,"DEMAND",null,null,null,null,null,null,3005002.0290000001,350,5]
[null,6,6,null,{"$f":"'4. Billing Det. for Def-Var'!B22","v":"STANDBY POWER SERVICE CLASSIFICATION "},null,"kW",null,{"$f":"LLF","v":1.036},1.036,0,0,"DEMAND",null,null,null,null,null,null,2.0720000000000001,418,6]
[null,7,7,null,{"$f":"'4. Billing Det. for Def-Var'!B23","v":"UNMETERED SCATTERED LOAD SERVICE CLASSIFICATION"},null,"kWh","RPP",{"$f":"LLF","v":1.036},1.036,300,null,"N/A",null,null,null,null,null,null,302.072,486,7]
[null,8,8,null,{"$f":"'4. Billing Det. for Def-Var'!B24","v":"STREET LIGHTING SERVICE CLASSIFICATION"},null,"kW","Non-RPP (Other)",{"$f":"LLF","v":1.036},1.036,33,0.1,"DEMAND",null,null,null,null,null,null,35.172000000000004,554,8]
[null,9,1,null,"RESIDENTIAL SERVICE CLASSIFICATION",null,"kWh","Non-RPP (Retailer)",{"$f":"LLF","v":1.036},1.036,750,null,"N/A",null,null,null,null,null,null,752.072,622,9]
[null,10,2,null,"GENERAL SERVICE LESS THAN 50 kW SERVICE CLASSIFICATION",null,"kWh","Non-RPP (Retailer)",{"$f":"LLF","v":1.036},1.036,2000,null,"N/A",null,null,null,null,null,null,2002.0719999999999,690,10]
[null,11,7,null,"UNMETERED SCATTERED LOAD SERVICE CLASSIFICATION",null,"kWh","Non-RPP (Retailer)",1.036,1.036,300,null,"N/A",null,null,null,null,null,null,302.072,758,11]
[null,12,3,null,"GENERAL SERVICE 50 to 499 kW SERVICE CLASSIFICATION",null,"kW","Non-RPP (Other)",1.036,1.036,100000,230,"DEMAND - INTERVAL",null,null,null,null,null,null,100232.072,{"$f":"U25+68","v":826}]
[null,13,4,null,"GENERAL SERVICE 500 to 4,999 kW SERVICE CLASSIFICATION",null,"kW","Non-RPP (Other)",1.036,1.036,400000,2250,"DEMAND - INTERVAL",null,null,null,null,null,null,402252.07199999999,894]
[null,14,5,null,"LARGE USE SERVICE CLASSIFICATION",null,"kW","Non-RPP (Other)",{"$f":"I19","v":1.0145},1.0145,3000000,5000,"DEMAND - INTERVAL",null,null,null,null,null,null,3005002.0290000001,962]
[null,15,{"$f":"IF(ISERROR(VLOOKUP(E29, E$15:V$33, 18, FALSE)),\"\", VLOOKUP(E29, E$15:V$33, 18, FALSE))","v":0},null,"Add additional scenarios if required",null,null,null,null,null,null,null,null,null,null,null,null,null,null,0,{"$f":"U28+68","v":1030}]
[null,16,{"$f":"IF(ISERROR(VLOOKUP(E30, E$15:V$33, 18, FALSE)),\"\", VLOOKUP(E30, E$15:V$33, 18, FALSE))","v":0},null,"Add additional scenarios if required",null,null,null,null,{"$f":"IF(ISBLANK(I30),\"\", I30)","v":""},null,null,null,null,null,null,null,null,null,0,1098]
[null,17,{"$f":"IF(ISERROR(VLOOKUP(E31, E$15:V$33, 18, FALSE)),\"\", VLOOKUP(E31, E$15:V$33, 18, FALSE))","v":0},null,"Add additional scenarios if required",null,null,null,null,"",null,null,null,null,null,null,null,null,null,0,1166]
[null,18,{"$f":"IF(ISERROR(VLOOKUP(E32, E$15:V$33, 18, FALSE)),\"\", VLOOKUP(E32, E$15:V$33, 18, FALSE))","v":0},null,"Add additional scenarios if required",null,null,null,null,"",null,null,null,null,null,null,null,null,null,0,1234]
[null,19,{"$f":"IF(ISERROR(VLOOKUP(E33, E$15:V$33, 18, FALSE)),\"\", VLOOKUP(E33, E$15:V$33, 18, FALSE))","v":0},null,"Add additional scenarios if required",null,null,null,null,"",null,null,null,null,null,null,null,null,null,0,1302]
[]
[]
[null,null,null,null,"Table 2"]
[null,null,null,null,"RATE CLASSES / CATEGORIES \n(eg: Residential TOU, Residential Retailer)",null,"Units","Sub-Total",null,null,null,null,null,"Total",null,"Total (Before Tax)",null,"Total"]
[null,null,null,null,null,null,null,"A",null,"B",null,"C",null,"A + B + C",null,"A + B + C",null,"A + B + C"]
[null,null,null,null,null,null,null,"$","%","$","%","$","%","$","%","$","%","$","%"]
[null,{"$f":"H15","v":"RPP"},{"$f":"B15","v":1},null,{"$f":"IF(ISBLANK(E15), \"\", IF(E15 = \"Add additional scenarios if required\", \"\", IF(O15=\"INTERVAL\", E15 & \" - \" & H15 & \" - Interval Customers\", E15 & \" - \" &H15)))","v":"RESIDENTIAL SERVICE CLASSIFICATION - RPP"},null,{"$f":"G15","v":"kWh"},{"$f":"IF(LEN($G40)>1, (SUMPRODUCT(--($C$72:$C$280=$B15), --($A$72:$A$280=$E15), --($B$72:$B$280=\"ST_A\"), $M$72:$M$280)), \"\")","v":1.313600000000001},{"$f":"IF(LEN($G40)>1, (SUMPRODUCT(--($C$72:$C$280=$B15), --($A$72:$A$280=$E15), --($B$72:$B$280=\"ST_A\"), $N$72:$N$280)), \"\")","v":5.5764038647671162E-2},{"$f":"IF(LEN($G40)>1, (SUMPRODUCT(--($C$72:$C$280=$B15), --($A$72:$A$280=$E15), --($B$72:$B$280=\"ST_B\"), $M$72:$M$280)), \"\")","v":1.1915950400000028},{"$f":"IF(LEN($G40)>1, (SUMPRODUCT(--($C$72:$C$280=$B15), --($A$72:$A$280=$E15), --($B$72:$B$280=\"ST_B\"), $N$72:$N$280)), \"\")","v":4.7916821430548151E-2},{"$f":"IF(LEN($G40)>1, (SUMPRODUCT(--($C$72:$C$280=$B15), --($A$72:$A$280=$E15), --($B$72:$B$280=\"ST_C\"), $M$72:$M$280)), \"\")","v":1.2223950400000021},{"$f":"IF(LEN($G40)>1, (SUMPRODUCT(--($C$72:$C$280=$B15), --($A$72:$A$280=$E15), --($B$72:$B$280=\"ST_C\"), $N$72:$N$280)), \"\")","v":4.1584300116897059E-2},{"$f":"IF(LEN($G40)>1, (SUMPRODUCT(--($C$72:$C$280=$B15), --($A$72:$A$280=$E15), --($B$72:$B$280=$B40&\"_TOTAL\"), $M$72:$M$280)), \"\")","v":1.228536792000007},{"$f":"IF(LEN($G40)>1, (SUMPRODUCT(--($C$72:$C$280=$B15), --($A$72:$A$280=$E15), --($B$72:$B$280=$B40&\"_TOTAL\"), $N$72:$N$280)), \"\")","v":2.0820865152404514E-2},{"$f":"IF(LEN($G40)>1, (SUMPRODUCT(--($C$72:$C$280=$B15), --($A$72:$A$280=$E15), --($B$72:$B$280=$B40&\"_BT\"), $M$72:$M$280)), \"\")","v":1.1700350400000019},{"$f":"IF(LEN($G40)>1, (SUMPRODUCT(--($C$72:$C$280=$B15), --($A$72:$A$280=$E15), --($B$72:$B$280=$B40&\"_BT\"), $N$72:$N$280)), \"\")","v":2.0820865152404427E-2},{"$f":"IF(LEN($G40)>1, (SUMPRODUCT(--($C$72:$C$280=$B15), --($A$72:$A$280=$E15), --($B$72:$B$280=$B40&\"_NET\"), $M$72:$M$280)), \"\")","v":1.3221395952000021},{"$f":"IF(LEN($G40)>1, (SUMPRODUCT(--($C$72:$C$280=$B15), --($A$72:$A$280=$E15), --($B$72:$B$280=$B40&\"_NET\"), $N$72:$N$280)), \"\")","v":2.0820865152404427E-2}]
[null,"RPP",2,null,"GENERAL SERVICE LESS THAN 50 kW SERVICE CLASSIFICATION - RPP",null,"kWh",0,0,0,0,0,0,0,0,0,0,0,0]
[null,"Non-RPP (Other)",3,null,"GENERAL SERVICE 50 to 499 kW SERVICE CLASSIFICATION - Non-RPP (Other)",null,"kW",0,0,0,0,0,0,0,0,0,0,0,0]
[null,"Non-RPP (Other)",4,null,"GENERAL SERVICE 500 to 4,999 kW SERVICE CLASSIFICATION - Non-RPP (Other)",null,"kW",0,0,0,0,0,0,0,0,0,0,0,0]
[null,"Non-RPP (Other)",5,null,"LARGE USE SERVICE CLASSIFICATION - Non-RPP (Other)",null,"kW",0,0,0,0,0,0,0,0,0,0,0,0]
[null,0,6,null,"STANDBY POWER SERVICE CLASSIFICATION  - ",null,"kW",0,0,0,0,0,0,0,0,0,0,0,0]
[null,"RPP",7,null,"UNMETERED SCATTERED LOAD SERVICE CLASSIFICATION - RPP",null,"kWh",0,0,0,0,0,0,0,0,0,0,0,0]
[null,"Non-RPP (Other)",8,null,"STREET LIGHTING SERVICE CLASSIFICATION - Non-RPP (Other)",null,"kW",0,0,0,0,0,0,0,0,0,0,0,0]
[null,"Non-RPP (Retailer)",9,null,"RESIDENTIAL SERVICE CLASSIFICATION - Non-RPP (Retailer)",null,"kWh",0,0,0,0,0,0,0,0,0,0,0,0]
[null,"Non-RPP (Retailer)",10,null,"GENERAL SERVICE LESS THAN 50 kW SERVICE CLASSIFICATION - Non-RPP (Retailer)",null,"kWh",0,0,0,0,0,0,0,0,0,0,0,0]
[null,"Non-RPP (Retailer)",11,null,"UNMETERED SCATTERED LOAD SERVICE CLASSIFICATION - Non-RPP (Retailer)",null,"kWh",0,0,0,0,0,0,0,0,0,0,0,0]
[null,"Non-RPP (Other)",12,null,"GENERAL SERVICE 50 to 499 kW SERVICE CLASSIFICATION - Non-RPP (Other)",null,"kW",0,0,0,0,0,0,0,0,{"$f":"IF(LEN($G51)>1, (SUMPRODUCT(--($C$72:$C$280=$B26), --($A$72:$A$280=$E26), --($B$72:$B$280=$B51&\"_TOTAL\"), $M$72:$M$280)), \"\")","v":0},{"$f":"IF(LEN($G51)>1, (SUMPRODUCT(--($C$72:$C$280=$B26), --($A$72:$A$280=$E26), --($B$72:$B$280=$B51&\"_TOTAL\"), $N$72:$N$280)), \"\")","v":0},{"$f":"IF(LEN($G51)>1, (SUMPRODUCT(--($C$72:$C$280=$B26), --($A$72:$A$280=$E26), --($B$72:$B$280=$B51&\"_TOTAL\"), $M$72:$M$280)), \"\")","v":0},{"$f":"IF(LEN($G51)>1, (SUMPRODUCT(--($C$72:$C$280=$B26), --($A$72:$A$280=$E26), --($B$72:$B$280=$B51&\"_TOTAL\"), $N$72:$N$280)), \"\")","v":0}]
[null,"Non-RPP (Other)",13,null,"GENERAL SERVICE 500 to 4,999 kW SERVICE CLASSIFICATION - Non-RPP (Other)",null,"kW",0,0,0,0,0,0,0,0,0,0,0,0]
[null,"Non-RPP (Other)",14,null,"LARGE USE SERVICE CLASSIFICATION - Non-RPP (Other)",null,"kW",0,0,0,0,0,0,0,0,0,0,0,0]
[null,0,15,null,"",null,0,"","","","","","","","","","","",""]
[null,0,16,null,{"$f":"IF(ISBLANK(E30), \"\", IF(E30 = \"Add additional scenarios if required\", \"\", IF(O30=\"YES\", E30 & \" - \" & J30 & \" - Interval Customers\", E30 & \" - \" &J30)))","v":""},null,{"$f":"IF(ISBLANK(I30), \"\", I30)","v":""},"","","","","","","","","","","",""]
[null,0,17,null,"",null,{"$f":"IF(ISBLANK(I31), \"\", I31)","v":""},"","","","","","","","","","","",""]
[null,0,18,null,"",null,{"$f":"IF(ISBLANK(I32), \"\", I32)","v":""},"","","","","","","","","","","",""]
[null,0,19,null,"",null,{"$f":"IF(ISBLANK(I33), \"\", I33)","v":""},"","","","","","","","","","","",""]
[null,0,0,null,"",null,{"$f":"IF(ISBLANK(I34), \"\", I34)","v":""},"","","","","","","","","","","",""]
[]
[]
[null,null,null,null,"Customer Class:",{"$f":"E15","v":"RESIDENTIAL SERVICE CLASSIFICATION"},null,null,null,null,null,{"$f":"IF(O14=\"DEMAND - INTERVAL\",\"RTSR - INTERVAL METERED\",\"\")","v":""}]
[null,null,null,null,"RPP / Non-RPP:",{"$f":"H15","v":"RPP"},null,null,"10th percentile"]
[null,null,null,null,"Consumption",308,"kWh"]
[null,null,null,null,"Demand",{"$f":"L15","v":0},"kW"]
[null,null,null,null,"Current Loss Factor",{"$f":"I15","v":1.036}]
[null,null,null,null,"Proposed/Approved Loss Factor",{"$f":"J15","v":1.036}]
[]
[null,null,null,null,null,null,"Current OEB-Approved",null,null,"Proposed",null,null,"Impact"]
[null,null,null,null,null,null,"Rate","Volume","Charge","Rate","Volume","Charge","$ Change","% Change"]
[null,null,null,null,null,null,"($)",null,"($)","($)",null,"($)"]
[{"$f":"F62","v":"RESIDENTIAL SERVICE CLASSIFICATION"},null,null,"R_F","Monthly Service Charge",null,{"$f":"IFERROR(SUMIF(RATES!B:B,'10th Percentile'!D72,RATES!H:H),\"\")","v":21.61},1,{"$f":"H72*G72","v":21.61},{"$f":"IFERROR(SUMIF(RATES!B:B,'10th Percentile'!D72,RATES!I:I),\"\")","v":24.18},1,{"$f":"K72*J72","v":24.18},{"$f":"L72-I72","v":2.5700000000000003},{"$f":"IF(ISERROR(M72/I72), \"\", M72/I72)","v":0.11892642295233689}]
[{"$f":"A72","v":"RESIDENTIAL SERVICE CLASSIFICATION"},null,null,"R_V","Distribution Volumetric Rate",null,{"$f":"IFERROR(SUMIF(RATES!B:B,'10th Percentile'!D73,RATES!H:H),\"\")","v":3.5000000000000001E-3},{"$f":"IF($F65>0, $F65, $F64)","v":308},{"$f":"H73*G73","v":1.0780000000000001},{"$f":"IFERROR(SUMIF(RATES!B:B,'10th Percentile'!D73,RATES!I:I),\"\")","v":0},{"$f":"IF($F65>0, $F65, $F64)","v":308},{"$f":"K73*J73","v":0},-1.0780000000000001,{"$f":"IF(ISERROR(M73/I73), \"\", M73/I73)","v":-1}]
[{"$f":"A73","v":"RESIDENTIAL SERVICE CLASSIFICATION"},null,null,"R_FRR","Fixed Rate Riders",null,{"$f":"IFERROR(SUMIF(RATES!B:B,'10th Percentile'!D74,RATES!H:H),\"\")","v":0.93},1,0.93,{"$f":"IFERROR(SUMIF(RATES!B:B,'10th Percentile'!D74,RATES!I:I),\"\")","v":0.69000000000000006},1,{"$f":"K74*J74","v":0.69000000000000006},-0.24,-0.25806451612903225]
[{"$f":"A74","v":"RESIDENTIAL SERVICE CLASSIFICATION"},null,null,"R_VRR","Volumetric Rate Riders",null,{"$f":"IFERROR(SUMIF(RATES!B:B,'10th Percentile'!D75,RATES!H:H),\"\")","v":-2.0000000000000001E-4},{"$f":"IF($F65>0, $F65, $F64)","v":308},-6.1600000000000002E-2,{"$f":"IFERROR(SUMIF(RATES!B:B,'10th Percentile'!D75,RATES!I:I),\"\")","v":0},{"$f":"IF($F65>0, $F65, $F64)","v":308},0,6.1600000000000002E-2,-1]
["RESIDENTIAL SERVICE CLASSIFICATION","ST_A",{"$f":"B15","v":1},null,"Sub-Total A (excluding pass through)",null,null,null,{"$f":"SUM(I72:I75)","v":23.5564},null,null,{"$f":"SUM(L72:L75)","v":24.87},1.313600000000001,{"$f":"IF((I76)=0,\"\",(M76/I76))","v":5.5764038647671162E-2}]
["RESIDENTIAL SERVICE CLASSIFICATION",null,null,null,"Line Losses on Cost of Power",null,{"$f":"IF((F64*12>=150000), 0, IF(F63=\"RPP\",(G91*0.65+G92*0.17+G93*0.18),IF(F63=\"Non-RPP (Retailer)\",G94,G95)))","v":8.2160000000000011E-2},{"$f":"IF(G77=0, 0, $F64*F66-F64)","v":11.088000000000022},{"$f":"H77*G77","v":0.91099008000000192},{"$f":"IF((F64*12>=150000), 0, IF(F63=\"RPP\",(J91*0.65+J92*0.17+J93*0.18),IF(F63=\"Non-RPP (Retailer)\",J94,J95)))","v":8.1990000000000007E-2},{"$f":"IF(G77=0, 0, $F64*F66-F64)","v":11.088000000000022},{"$f":"K77*J77","v":0.90910512000000188},{"$f":"L77-I77","v":-1.8849600000000466E-3},{"$f":"IF(ISERROR(M77/I77), \"\", M77/I77)","v":-2.069133398247369E-3}]
["RESIDENTIAL SERVICE CLASSIFICATION",null,null,"R_DVA","Total Deferral/Variance Account Rate Riders",null,{"$f":"IFERROR(SUMIF(RATES!B:B,'10th Percentile'!D78,RATES!H:H),\"\")","v":-7.5000000000000002E-4},{"$f":"IF($F65>0, $F65, $F64)","v":308},-0.23100000000000001,{"$f":"IFERROR(SUMIF(RATES!B:B,'10th Percentile'!D78,RATES!I:I),\"\")","v":-1.14E-3},{"$f":"IF($F65>0, $F65, $F64)","v":308},-0.35111999999999999,-0.12011999999999998,0.51999999999999991]
["RESIDENTIAL SERVICE CLASSIFICATION",null,null,"R_GA","GA Rate Riders"]
["RESIDENTIAL SERVICE CLASSIFICATION",null,null,"R_LV","Low Voltage Service Charge",null,{"$f":"IFERROR(SUMIF(RATES!B:B,'10th Percentile'!D80,RATES!H:H),\"\")","v":2.0000000000000001E-4},{"$f":"IF($F65>0, $F65, $F64)","v":308},6.1600000000000002E-2,{"$f":"IFERROR(SUMIF(RATES!B:B,'10th Percentile'!D80,RATES!I:I),\"\")","v":2.0000000000000001E-4},{"$f":"IF($F65>0, $F65, $F64)","v":308},6.1600000000000002E-2,0,0]
["RESIDENTIAL SERVICE CLASSIFICATION",null,null,null,"Smart Meter Entity Charge (if applicable)",null,0.56999999999999995,1,{"$f":"H81*G81","v":0.56999999999999995},0.56999999999999995,1,{"$f":"K81*J81","v":0.56999999999999995},0,{"$f":"IF(ISERROR(M81/I81), \"\", M81/I81)","v":0}]
["RESIDENTIAL SERVICE CLASSIFICATION","ST_B",{"$f":"B15","v":1},null,"Sub-Total B - Distribution (includes Sub-Total A)",null,null,null,{"$f":"SUM(I76:I81)","v":24.867990079999998},null,null,{"$f":"SUM(L76:L81)","v":26.059585120000001},1.1915950400000028,{"$f":"IF((I82)=0,\"\",(M82/I82))","v":4.7916821430548151E-2}]
["RESIDENTIAL SERVICE CLASSIFICATION",null,null,"R_TN","RTSR - Network",null,{"$f":"IFERROR(SUMIF(RATES!B:B,'10th Percentile'!D83,RATES!H:H),\"\")","v":7.6E-3},{"$f":"F64","v":308},{"$f":"H83*G83","v":2.3408000000000002},{"$f":"IFERROR(SUMIF(RATES!B:B,'10th Percentile'!D83,RATES!I:I),\"\")","v":7.6E-3},{"$f":"H83","v":308},{"$f":"K83*J83","v":2.3408000000000002},0,{"$f":"IF(ISERROR(M83/I83), \"\", M83/I83)","v":0}]
["RESIDENTIAL SERVICE CLASSIFICATION",null,null,"R_TC","RTSR - Connection and/or Line and Transformation Connection",null,{"$f":"IFERROR(SUMIF(RATES!B:B,'10th Percentile'!D84,RATES!H:H),\"\")","v":7.1000000000000004E-3},{"$f":"F64","v":308},{"$f":"H84*G84","v":2.1868000000000003},{"$f":"IFERROR(SUMIF(RATES!B:B,'10th Percentile'!D84,RATES!I:I),\"\")","v":7.1999999999999998E-3},{"$f":"H84","v":308},{"$f":"K84*J84","v":2.2176},3.0799999999999716E-2,{"$f":"IF(ISERROR(M84/I84), \"\", M84/I84)","v":1.408450704225339E-2}]
["RESIDENTIAL SERVICE CLASSIFICATION","ST_C",{"$f":"B15","v":1},null,"Sub-Total C - Delivery (including Sub-Total B)",null,null,null,{"$f":"SUM(I82:I84)","v":29.395590080000002},null,null,{"$f":"SUM(L82:L84)","v":30.617985120000004},1.2223950400000021,{"$f":"IF((I85)=0,\"\",(M85/I85))","v":4.1584300116897059E-2}]
["RESIDENTIAL SERVICE CLASSIFICATION",null,null,null,"Wholesale Market Service Charge (WMSC)",null,3.5999999999999999E-3,{"$f":"F64*F66","v":319.08800000000002},{"$f":"H86*G86","v":1.1487168000000001},3.5999999999999999E-3,{"$f":"F64*F66","v":319.08800000000002},{"$f":"K86*J86","v":1.1487168000000001},0,{"$f":"IF(ISERROR(M86/I86), \"\", M86/I86)","v":0}]
["RESIDENTIAL SERVICE CLASSIFICATION",null,null,null,"Rural and Remote Rate Protection (RRRP)",null,2.9999999999999997E-4,{"$f":"F64*F66","v":319.08800000000002},9.5726400000000003E-2,2.9999999999999997E-4,{"$f":"F64*F66","v":319.08800000000002},9.5726400000000003E-2,0,0]
["RESIDENTIAL SERVICE CLASSIFICATION",null,null,null,"Standard Supply Service Charge",null,0.25,1,0.25,0.25,1,0.25,0,0]
["RESIDENTIAL SERVICE CLASSIFICATION",null,null,null,"Debt Retirement Charge (DRC)"]
["RESIDENTIAL SERVICE CLASSIFICATION"]
["RESIDENTIAL SERVICE CLASSIFICATION","RPP",null,null,"TOU - Off Peak",null,6.5000000000000002E-2,{"$f":"IF(AND(F64*12>=150000),0.65*F64*F66,0.65*F64)","v":200.20000000000002},13.013000000000002,6.5000000000000002E-2,{"$f":"IF(AND(F64*12>=150000),0.65*F64*F67,0.65*F64)","v":200.20000000000002},13.013000000000002,0,0]
["RESIDENTIAL SERVICE CLASSIFICATION","RPP",null,null,"TOU - Mid Peak",null,9.5000000000000001E-2,{"$f":"IF(AND(F64*12>=150000),0.17*F64*F66,0.17*F64)","v":52.360000000000007},4.9742000000000006,9.4E-2,{"$f":"IF(AND(F64*12>=150000),0.17*F64*F67,0.17*F64)","v":52.360000000000007},4.9218400000000004,-5.2360000000000184E-2,-1.052631578947372E-2]
["RESIDENTIAL SERVICE CLASSIFICATION","RPP",null,null,"TOU - On Peak",null,0.13200000000000001,{"$f":"IF(AND(F64*12>=150000),0.18*F64*F66,0.18*F64)","v":55.44},7.3180800000000001,0.13200000000000001,{"$f":"IF(AND(F64*12>=150000),0.18*F64*F67,0.18*F64)","v":55.44},7.3180800000000001,0,0]
["RESIDENTIAL SERVICE CLASSIFICATION","Non-RPP (Retailer)",null,null,"Non-RPP Retailer Avg. Price",null,{"$f":"0.1061","v":0.1061},{"$f":"IF(AND(F64*12>=150000),F64*F66,F64)","v":308},{"$f":"H94*G94","v":32.678800000000003},{"$f":"G94","v":0.1061},{"$f":"IF(AND(F64*12>=150000),F64*F67,F64)","v":308},{"$f":"K94*J94","v":32.678800000000003},0,0]
["RESIDENTIAL SERVICE CLASSIFICATION","Non-RPP (Other)",null,null,"Average IESO Wholesale Market Price",null,{"$f":"G94","v":0.1061},{"$f":"IF(AND(F64*12>=150000),F64*F66,F64)","v":308},{"$f":"H95*G95","v":32.678800000000003},{"$f":"G95","v":0.1061},{"$f":"IF(AND(F64*12>=150000),F64*F67,F64)","v":308},{"$f":"K95*J95","v":32.678800000000003},0,0]
["RESIDENTIAL SERVICE CLASSIFICATION"]
["RESIDENTIAL SERVICE CLASSIFICATION","RPP_BT",1,null,"Total Bill on TOU (before Taxes)",null,null,null,{"$f":"SUM(I86:I93,I85)","v":56.195313280000008},null,null,{"$f":"SUM(L86:L93,L85)","v":57.36534832000001},{"$f":"L97-I97","v":1.1700350400000019},{"$f":"IF((I97)=0,\"\",(M97/I97))","v":2.0820865152404427E-2}]
["RESIDENTIAL SERVICE CLASSIFICATION","RPP",null,null,"HST",null,0.13,null,{"$f":"I97*G98","v":7.3053907264000015},0.13,null,{"$f":"L97*J98","v":7.4574952816000017},{"$f":"L98-I98","v":0.15210455520000021},{"$f":"IF((I98)=0,\"\",(M98/I98))","v":2.082086515240442E-2}]
["RESIDENTIAL SERVICE CLASSIFICATION","RPP_NET",1,null,"Total Bill on TOU (before 8% Provincial Rebate)",null,null,null,{"$f":"SUM(I97:I98)","v":63.500704006400007},null,null,{"$f":"SUM(L97:L98)","v":64.822843601600013},{"$f":"SUM(M97:M98)","v":1.3221395952000021},{"$f":"IF((I99)=0,\"\",(M99/I99))","v":2.0820865152404427E-2}]
[{"$f":"A98","v":"RESIDENTIAL SERVICE CLASSIFICATION"},"RPP",null,null,"8% Provincial Rebate",null,-0.08,null,{"$f":"I97*G100","v":-4.4956250624000011},{"$f":"G100","v":-0.08},null,{"$f":"L97*J100","v":-4.5892278656000007},{"$f":"L100-I100","v":-9.3602803199999585E-2},{"$f":"IF((I100)=0,\"\",(M100/I100))","v":2.0820865152404298E-2}]
["RESIDENTIAL SERVICE CLASSIFICATION","RPP_TOTAL",{"$f":"B15","v":1},null,"Total Bill on TOU",null,null,null,{"$f":"SUM(I97,I98,I100)","v":59.005078944000005},null,null,{"$f":"L97+L98+L100","v":60.233615736000012},{"$f":"L101-I101","v":1.228536792000007},{"$f":"IF((I101)=0,\"\",(M101/I101))","v":2.0820865152404514E-2}]
["RESIDENTIAL SERVICE CLASSIFICATION","RPP"]
["RESIDENTIAL SERVICE CLASSIFICATION","Non-RPP (Retailer)",null,null,"Total Bill on Non-RPP Avg. Price",null,null,null,{"$f":"SUM(I94,I86:I90,I85)","v":63.568833280000007},null,null,{"$f":"SUM(L94,L86:L90,L85)","v":64.791228320000002},{"$f":"L103-I103","v":1.222395039999995},{"$f":"IF((I103)=0,\"\",(M103/I103))","v":1.9229471061954887E-2}]
["RESIDENTIAL SERVICE CLASSIFICATION","Non-RPP (Retailer)",null,null,"HST",null,0.13,null,{"$f":"I103*G104","v":8.2639483264000013},0.13,null,{"$f":"L103*J104","v":8.4228596816000003},{"$f":"L104-I104","v":0.15891135519999899},{"$f":"IF((I104)=0,\"\",(M104/I104))","v":1.9229471061954845E-2}]
["RESIDENTIAL SERVICE CLASSIFICATION","Non-RPP (Retailer)",null,null,"Provincial Rebate",null,-0.08,null,{"$f":"I103*G105","v":-5.0855066624000003},{"$f":"G105","v":-0.08},null,{"$f":"L103*J105","v":-5.1832982656000004},{"$f":"L105-I105","v":-9.7791603200000132E-2},{"$f":"IF((I105)=0,\"\",(M105/I105))","v":1.9229471061954995E-2}]
["RESIDENTIAL SERVICE CLASSIFICATION","Non-RPP (Retailer)_TOTAL",null,null,"Total Bill on Non-RPP Avg. Price",null,null,null,{"$f":"SUM(I103,I104,I105)","v":66.747274943999997},null,null,{"$f":"SUM(L103,L104,L105)","v":68.030789736000003},{"$f":"L106-I106","v":1.2835147920000054},{"$f":"IF((I106)=0,\"\",(M106/I106))","v":1.922947106195505E-2}]
["RESIDENTIAL SERVICE CLASSIFICATION","Non-RPP (Retailer)"]
["RESIDENTIAL SERVICE CLASSIFICATION","Non-RPP (Other)",null,null,"Total Bill on Average IESO Wholesale Market Price",null,null,null,{"$f":"SUM(I95,I86:I90,I85)","v":63.568833280000007},null,null,{"$f":"SUM(L95,L86:L90,L85)","v":64.791228320000002},{"$f":"L108-I108","v":1.222395039999995},{"$f":"IF((I108)=0,\"\",(M108/I108))","v":1.9229471061954887E-2}]
["RESIDENTIAL SERVICE CLASSIFICATION","Non-RPP (Other)",null,null,"HST",null,0.13,null,{"$f":"I108*G109","v":8.2639483264000013},0.13,null,{"$f":"L108*J109","v":8.4228596816000003},{"$f":"L109-I109","v":0.15891135519999899},{"$f":"IF((I109)=0,\"\",(M109/I109))","v":1.9229471061954845E-2}]
["RESIDENTIAL SERVICE CLASSIFICATION","Non-RPP (Other)",null,null,"Provincial Rebate",null,-0.08,null,{"$f":"I108*G110","v":-5.0855066624000003},{"$f":"G110","v":-0.08},null,{"$f":"L108*J110","v":-5.1832982656000004},{"$f":"L110-I110","v":-9.7791603200000132E-2},{"$f":"IF((I110)=0,\"\",(M110/I110))","v":1.9229471061954995E-2}]
["RESIDENTIAL SERVICE CLASSIFICATION","Non-RPP (Other)_TOTAL",null,null,"Total Bill on Average IESO Wholesale Market Price",null,null,null,{"$f":"SUM(I108,I109,I110)","v":66.747274943999997},null,null,{"$f":"SUM(L108,L109,L110)","v":68.030789736000003},{"$f":"L111-I111","v":1.2835147920000054},{"$f":"IF((I111)=0,\"\",(M111/I111))","v":1.922947106195505E-2}]
["RESIDENTIAL SERVICE CLASSIFICATION","Non-RPP (Other)"]