{"text_format":"1","workbook":"xlsx","n_sheets":41,"sheets":["LDC Info","Index","COS Flowchart","List of Key References","App.2-A_Requested_Approvals","App.2-AA_Capital Projects","App.2-AB_Capital Expenditures","App.2-AC_Customer Engagement","App.2-B_Acctg Instructions","App.2-BA_Fixed Asset Cont","Appendix 2-BB Service Life  ","App.2-C_DepExp","App.2-D_Overhead","App.2-EA_Account 1575 (2015)","App.2-EB_Account 1576 (2012)","App.2-EC_Account 1576 (2013)","App.2-FA Proposed REG Invest.","App.2-FB Calc of REG Improvemnt","App.2-FC Calc of REG Expansion","App.2-G SQI","App.2-H_Other_Oper_Rev","App_2-I LF_CDM","App.2-IA_Load_Forecast_Instrct","App.2-IB_Load_Forecast_Analysis","App.2-JA_OM&A_Summary_Analys","App.2-JB_OM&A_Cost _Drivers","App.2-JC_OMA Programs","App.2-K_Employee Costs","App.2-L_OM&A_per_Cust_FTE","App.2-L_OM&A_per_Cust_FTEE_exp","App.2-M_Regulatory_Costs","App.2-N_Corp_Cost_Allocation","App.2-OA Capital Structure","App.2-OB_Debt Instruments","App.2-Q_Cost of Serv. Emb. Dx","App.2-R_Loss Factors","App.2-S_Stranded Meters","App.2-Y_MIFRS Summary Impacts","Sheet19","App.2-YA_IFRS Transition Costs","Sheet1"],"not_rendered":{"charts":0,"images":4,"macros":1,"external_links":13,"defined_names":514,"comments":7,"pivot_tables":0},"unopened":[],"bounds":{"document_bytes":16777216,"sheet_cells":100000,"rows_first":2000,"rows_last":500,"rows_between":2000,"halvings":0,"cell_chars":16384,"cell_head_chars":4096},"cells_cut":0,"cells_raw":0,"read":"whole","date_system":"1900"}

{"sheet":"LDC Info","index":0,"n_rows":77,"n_cols":27,"rows_kept":77,"cut":false,"hidden":false,"merged":[[17,4,17,10],[13,4,13,10],[15,4,15,8],[19,4,19,8],[25,4,25,6],[23,4,23,6],[21,4,21,8],[45,0,45,3],[50,2,50,11],[54,2,54,12],[52,2,52,13],[27,4,27,6],[30,4,30,6],[29,0,30,3],[42,0,43,3],[38,0,39,3],[39,4,39,6],[32,0,33,3],[33,4,33,6],[35,0,36,3]]}
[]
[]
[null,null,null,null,null,null,null,null,null,null,null,null,null,null,null,null,null,null,null,null,null,null,null,null,null,1,"Alectra Utilities Corporation"]
[null,null,null,null,null,null,null,null,null,null,null,null,null,null,null,null,null,null,null,null,null,null,null,null,null,2,"Alectra Utilities Corporation - Brampton service territory"]
[null,null,null,null,null,null,null,null,null,null,null,null,null,null,null,null,null,null,null,null,null,null,null,null,null,3,"Alectra Utilities Corporation - Horizon Utilities service territory"]
[null,null,null,null,null,null,null,null,null,null,null,null,null,null,null,null,null,null,null,null,null,null,null,null,null,4,"Alectra Utilities Corporation - Mississauga service territory"]
[null,null,null,null,null,null,null,null,null,null,null,null,null,null,null,null,null,null,null,null,null,null,null,null,null,5,"Alectra Utilities Corporation - PowerStream service territory"]
[null,null,null,null,null,null,null,null,null,null,null,null,null,null,null,null,null,null,null,null,null,null,null,null,null,6,"Algoma Power Inc."]
[null,null,null,null,null,null,null,null,null,null,null,null,null,null,null,null,null,null,null,null,null,null,null,null,null,7,"Atikokan Hydro Inc."]
[null,null,null,null,null,null,null,null,null,null,null,null,null,null,null,null,null,null,null,null,null,null,null,null,null,8,"Attawapiskat Power Corporation"]
[null,null,null,null,null,null,null,null,null,null,null,null,null,null,null,null,null,null,null,null,null,null,null,null,null,9,"Bluewater Power Distribution Corporation"]
[null,null,null,null,null,null,null,null,null,null,null,null,null,null,null,null,null,null,null,null,null,null,null,null,null,10,"Brantford Power Inc."]
[null,null,null,null,null,null,null,null,null,null,null,null,null,null,null,null,null,null,null,null,null,null,null,null,null,11,"Burlington Hydro Inc."]
[null,null,null,"Utility Name   ","PUC Distribution Inc.",null,null,null,null,null,null,null,null,null,null,null,null,null,null,null,null,null,null,null,null,12,"Canadian Niagara Power Inc. (Eastern Ontario Power/Fort Erie/Port Colborne)"]
[null,null,null,null,null,null,null,null,null,null,null,null,null,null,null,null,null,null,null,null,null,null,null,null,null,13,"Centre Wellington Hydro Ltd."]
[null,null,null,"Assigned EB Number","EB-2017-0071",null,null,null,null,null,null,null,null,null,null,null,null,null,null,null,null,null,null,null,null,14,"Chapleau Public Utilities Corporation"]
[null,null,null,null,null,null,null,null,null,null,null,null,null,null,null,null,null,null,null,null,null,null,null,null,null,15,"COLLUS PowerStream Corp."]
[null,null,null,"Name of Contact and Title","Andrew Belsito, Rates and Regulatory Affairs Officer",null,null,null,null,null,null,null,null,null,null,null,null,null,null,null,null,null,null,null,null,16,"Cooperative Hydro Embrun Inc."]
[null,null,null,null,null,null,null,null,null,null,null,null,null,null,null,null,null,null,null,null,null,null,null,null,null,17,"E.L.K. Energy Inc."]
[null,null,null,"Phone Number   ","705-759-3009",null,null,null,null,null,null,null,null,null,null,null,null,null,null,null,null,null,null,null,null,18,"Energy + Inc."]
[null,null,null,null,null,null,null,null,null,null,null,null,null,null,null,null,null,null,null,null,null,null,null,null,null,19,"Enersource Hydro Mississauga Inc."]
[null,null,null,"Email Address   ","andrew.belsito@ssmpuc.com",null,null,null,null,null,null,null,null,null,null,null,null,null,null,null,null,null,null,null,null,20,"Entegrus Powerlines Inc."]
[null,null,null,null,null,null,null,null,null,null,null,null,null,null,null,null,null,null,null,null,null,null,null,null,null,21,"ENWIN Utilities Ltd."]
[null,null,null,"Test Year",2018,null,null,null,null,null,null,null,null,null,null,null,null,null,null,null,null,null,null,null,null,22,"Erie Thames Powerlines Corporation"]
[null,null,null,null,null,null,null,null,null,null,null,null,null,null,null,null,null,null,null,null,null,null,null,null,null,23,"Espanola Regional Hydro Distribution Corporation"]
[null,null,null,"Bridge Year",{"$f":"IF(ISBLANK(E24), \"\", E24-1)","v":2017},null,null,null,null,null,null,null,null,null,null,null,null,null,null,null,null,null,null,null,null,24,"Essex Powerlines Corporation"]
[null,null,null,null,null,null,null,null,null,null,null,null,null,null,null,null,null,null,null,null,null,null,null,null,null,25,"Festival Hydro Inc."]
[null,null,null,"Last Rebasing Year",2013,null,null,null,null,null,null,null,null,null,null,null,null,null,null,null,null,null,null,null,null,26,"Fort Albany Power Corporation"]
[null,null,null,null,null,null,null,null,null,null,null,null,null,null,null,null,null,null,null,null,null,null,null,null,null,27,"Fort Frances Power Corporation"]
["Identify the accounting standard used for the test year",null,null,null,null,null,null,null,null,null,null,null,null,null,null,null,null,null,null,null,null,null,null,null,null,28,"Greater Sudbury Hydro Inc."]
[null,null,null,null,"MIFRS",null,null,null,null,null,null,null,null,null,null,null,null,null,null,null,null,null,null,null,null,29,"Grimsby Power Inc."]
[null,null,null,null,null,null,null,null,null,null,null,null,null,null,null,null,null,null,null,null,null,null,null,null,null,30,"Guelph Hydro Electric Systems Inc."]
["Did you update your depreciation and capitalization policies and reflect the changes in policies in a prior rebasing application?",null,null,null,null,null,null,null,null,null,null,null,null,null,null,null,null,null,null,null,null,null,null,null,null,31,"Halton Hills Hydro Inc."]
[null,null,null,null,"Yes",null,null,null,null,null,null,null,null,null,null,null,null,null,null,null,null,null,null,null,null,32,"Hearst Power Distribution Company Limited"]
[null,null,null,null,null,null,null,null,null,null,null,null,null,null,null,null,null,null,null,null,null,null,null,null,null,33,"Hydro 2000 Inc."]
["When did you update your actual depreciation and capitalization policies?",null,null,null,null,null,null,null,null,null,null,null,null,null,null,null,null,null,null,null,null,null,null,null,null,34,"Hydro Hawkesbury Inc."]
[null,null,null,null,"2001-01-01",2013,null,null,null,null,null,null,null,null,null,null,null,null,null,null,null,null,null,null,null,35,"Hydro One Networks Inc."]
[null,null,null,null,null,null,null,null,null,null,null,null,null,null,null,null,null,null,null,null,null,null,null,null,null,36,"Hydro One Networks Inc. - Norfolk, Haldimand, Woodstock"]
["Identify the year the applicant adopted IFRS for financial reporting purposes",null,null,null,null,null,null,null,null,null,null,null,null,null,null,null,null,null,null,null,null,null,null,null,null,37,"Hydro One Remote Communities Inc."]
[null,null,null,null,2015,null,null,null,null,null,null,null,null,null,null,null,null,null,null,null,null,null,null,null,null,38,"Hydro Ottawa Limited"]
[null,null,null,null,null,null,null,null,null,null,null,null,null,null,null,null,null,null,null,null,null,null,null,null,null,39,"Innpower Corporation"]
[null,null,null,null,null,null,null,null,null,null,null,null,null,null,null,null,null,null,null,null,null,null,null,null,null,40,"Kashechewan Power Corporation"]
["Are you applying for cost recovery for the test and/or future year(s) for Green Energy initiatives?",null,null,null,null,null,null,null,null,null,null,null,null,null,null,null,null,null,null,null,null,null,null,null,null,41,"Kenora Hydro Electric Corporation Ltd."]
[null,null,null,null,"No",null,null,null,null,null,null,null,null,null,null,null,null,null,null,null,null,null,null,null,null,42,"Kingston Hydro Corporation"]
[null,null,null,null,null,null,null,null,null,null,null,null,null,null,null,null,null,null,null,null,null,null,null,null,null,43,"Kitchener-Wilmot Hydro Inc."]
[{"$f":"\"Is \" & E14 & \" an embedded distributor?\"","v":"Is PUC Distribution Inc. an embedded distributor?"},null,null,null,"No",null,null,null,null,null,null,null,null,null,null,null,null,null,null,null,null,null,null,null,null,44,"Lakefront Utilities Inc."]
[null,null,null,null,null,null,null,null,null,null,null,null,null,null,null,null,null,null,null,null,null,null,null,null,null,45,"Lakeland Power Distribution Ltd."]
[null,null,null,null,null,null,null,null,null,null,null,null,null,null,null,null,null,null,null,null,null,null,null,null,null,46,"London Hydro Inc."]
[null,"Notes",null,null,null,null,null,null,null,null,null,null,null,null,null,null,null,null,null,null,null,null,null,null,null,47,"Midland Power Utility Corporation"]
[null,null,null,null,null,null,null,null,null,null,null,null,null,null,null,null,null,null,null,null,null,null,null,null,null,48,"Milton Hydro Distribution Inc."]
[null,null,"Pale green cells represent input cells.",null,null,null,null,null,null,null,null,null,null,null,null,null,null,null,null,null,null,null,null,null,null,49,"Newmarket-Tay Power Distribution Ltd."]
[null,null,null,null,null,null,null,null,null,null,null,null,null,null,null,null,null,null,null,null,null,null,null,null,null,50,"Niagara Peninsula Energy Inc."]
[null,null,"Pale blue cells represent drop-down lists.  The applicant should select the appropriate item from the drop-down list.",null,null,null,null,null,null,null,null,null,null,null,null,null,null,null,null,null,null,null,null,null,null,51,"Niagara-on-the-Lake Hydro Inc."]
[null,null,null,null,null,null,null,null,null,null,null,null,null,null,null,null,null,null,null,null,null,null,null,null,null,52,"North Bay Hydro Distribution Limited"]
[null,null,"White cells contain fixed values, automatically generated values or formulae. ",null,null,null,null,null,null,null,null,null,null,{"$f":"IF(LEN($G55)>1, (SUMPRODUCT(--($C$78:$C$1000=$C55),--($A$78:$A$1000=$D55), --($B$78:$B$1000=$B55&\"_TOTAL\"), $L$78:$L$1000)), \"\")","v":""},{"$f":"IF(LEN($G55)>1, (SUMPRODUCT(--($C$78:$C$1000=$C55),--($A$78:$A$1000=$D55), --($B$78:$B$1000=$B55&\"_TOTAL\"), $M$78:$M$1000)), \"\")","v":""},null,null,null,null,null,null,null,null,null,null,53,"Northern Ontario Wires Inc."]
[null,null,null,null,null,null,null,null,null,null,null,null,null,{"$f":"IF(LEN($G56)>1, (SUMPRODUCT(--($C$78:$C$1000=$C56),--($A$78:$A$1000=$D56), --($B$78:$B$1000=$B56&\"_TOTAL\"), $L$78:$L$1000)), \"\")","v":""},{"$f":"IF(LEN($G56)>1, (SUMPRODUCT(--($C$78:$C$1000=$C56),--($A$78:$A$1000=$D56), --($B$78:$B$1000=$B56&\"_TOTAL\"), $M$78:$M$1000)), \"\")","v":""},null,null,null,null,null,null,null,null,null,null,54,"Oakville Hydro Electricity Distribution Inc."]
[null,null,null,null,null,null,null,null,null,null,null,null,null,"","",null,null,null,null,null,null,null,null,null,null,55,"Orangeville Hydro Limited"]
[null,null,null,null,null,null,null,null,null,null,null,null,null,"","",null,null,null,null,null,null,null,null,null,null,56,"Orillia Power Distribution Corporation"]
[null,null,null,null,null,null,null,null,null,null,null,null,null,"","",null,null,null,null,null,null,null,null,null,null,57,"Oshawa PUC Networks Inc."]
[null,null,null,null,null,null,null,null,null,null,null,null,null,"","",null,null,null,null,null,null,null,null,null,null,58,"Ottawa River Power Corporation"]
[null,null,null,null,null,null,null,null,null,null,null,null,null,"","",null,null,null,null,null,null,null,null,null,null,59,"Peterborough Distribution Inc."]
[null,null,null,null,null,null,null,null,null,null,null,null,null,"","",null,null,null,null,null,null,null,null,null,null,60,"PUC Distribution Inc."]
[null,null,null,null,null,null,null,null,null,null,null,null,null,"","",null,null,null,null,null,null,null,null,null,null,61,"Renfrew Hydro Inc."]
[null,null,null,null,null,null,null,null,null,null,null,null,null,"","",null,null,null,null,null,null,null,null,null,null,62,"Rideau St. Lawrence Distribution Inc."]
[null,null,null,null,null,null,null,null,null,null,null,null,null,"","",null,null,null,null,null,null,null,null,null,null,63,"Sioux Lookout Hydro Inc."]
[null,null,null,null,null,null,null,null,null,null,null,null,null,"","",null,null,null,null,null,null,null,null,null,null,64,"St. Thomas Energy Inc."]
[null,null,null,null,null,null,null,null,null,null,null,null,null,"","",null,null,null,null,null,null,null,null,null,null,65,"Thunder Bay Hydro Electricity Distribution Inc."]
[null,null,null,null,null,null,null,null,null,null,null,null,null,"","",null,null,null,null,null,null,null,null,null,null,66,"Tillsonburg Hydro Inc."]
[null,null,null,null,null,null,null,null,null,null,null,null,null,"","",null,null,null,null,null,null,null,null,null,null,67,"Toronto Hydro-Electric System Limited"]
[null,null,null,null,null,null,null,null,null,null,null,null,null,"","",null,null,null,null,null,null,null,null,null,null,68,"Veridian Connections Inc."]
[null,null,null,null,null,null,null,null,null,null,null,null,null,"","",null,null,null,null,null,null,null,null,null,null,69,"Wasaga Distribution Inc."]
[null,null,null,null,null,null,null,null,null,null,null,null,null,"","",null,null,null,null,null,null,null,null,null,null,70,"Waterloo North Hydro Inc."]
[null,null,null,null,null,null,null,null,null,null,null,null,null,"","",null,null,null,null,null,null,null,null,null,null,71,"Welland Hydro-Electric System Corp."]
[null,null,null,null,null,null,null,null,null,null,null,null,null,"","",null,null,null,null,null,null,null,null,null,null,72,"Wellington North Power Inc."]
[null,null,null,null,null,null,null,null,null,null,null,null,null,null,null,null,null,null,null,null,null,null,null,null,null,73,"West Coast Huron Energy Inc."]
[null,null,null,null,null,null,null,null,null,null,null,null,null,null,null,null,null,null,null,null,null,null,null,null,null,74,"Westario Power Inc."]
[null,null,null,null,null,null,null,null,null,null,null,null,null,null,null,null,null,null,null,null,null,null,null,null,null,75,"Whitby Hydro Electric Corporation"]

{"sheet":"Index","index":1,"n_rows":42,"n_cols":6,"rows_kept":42,"cut":false,"hidden":false,"merged":[[41,1,41,5]]}
[]
[]
[]
[]
[]
[]
[]
[]
[]
[]
[]
[]
[]
[]
[1,"LDC Information Sheet",null,null,20,"App.2-G: Service Reliability Indicators"]
[2,"Index",null,null,21,"App.2-H: Other Operating Revenue"]
[3,"Cost of Service Application Flowchart",null,null,22,"App.2-I: Load Forecast CDM Adjustment Workform"]
[4,"List of Key References",null,null,23,"App.2-IA: Load Forecast Data Instructions"]
[5,"App.2-A: List of Requested Approvals",null,null,24,"App.2-IB:  Actual and Forecast Load and Customer Data"]
[6,"App.2-AA: Capital Projects Table",null,null,25,"App.2-JA: OM&A Summary Analysis"]
[7,"App.2-AB: Capital Expenditures",null,null,26,"App.2-JB: Recoverable OM&A Cost Driver Table"]
[8,"App. 2-AC: Customer Engagement Worksheet",null,null,27,"App.2-JC: OM&A Programs Table"]
[9,"App.2-B: General Accounting Instructions",null,null,28,"App.2-K: Employee Costs"]
[10,"App.2-BA: Fixed Asset Continuity Schedule",null,null,29,"App.2-L: Recoverable OM&A Cost per Customer and per FTE"]
[11,"Appendix 2-BB: Service Life Comparison",null,null,30,"App.2-M: Regulatory Costs Schedule"]
[12,"App.2-C_DepExp: Depreciation and Amortization Expense",null,null,31,"App.2-N: Shared Services and Corporate Cost Allocation"]
[13,"App.2-D: Overhead Expenses",null,null,32,"App.2-OA: Capital Structure and Cost of Capital"]
[14,"App.2-EA: Account 1575 PP&E Deferral Account (2015 IFRS Adopters)",null,null,33,"App.2-OB: Debt Instruments"]
[15,"App.2-EB: Account 1576 - Accounting Changes Under CGAAP (2012 Changes)",null,null,34,"App.2-Q: Cost of Serving Embedded Distributor(s)"]
[16,"App.2-EC: Account 1576 - Accounting Changes Under CGAAP (2013 Changes)",null,null,35,"App.2-R: Loss Factors"]
[17,"App.2-FA: Renewable Generation Connection Investment Summary",null,null,36,"App.2-S: Stranded Meter Treatment"]
[18,"App.2-FB: Calculation of Renewable Generation Connection Direct Benefits/Provincial Amount: Renewable Enabling Improvement Investments",null,null,37,"App.2-Y: Transition to MIFRS Summary Impact"]
[19,"App.2-FC: Calculation of Renewable Generation Connection Direct Benefits/Provincial Amount: Renewable Expansion Investments",null,null,38,"App.2-YA: One-Time Incremental IFRS Transition Costs"]
[]
[]
[]
[]
[]
[]
[]
[]
["Note:","Appendices for the Tariff of Rates and Charges at Current and Proposed Rates, and for the Bill Impacts are now in a separate spreadsheet model. These appendices were formerly 2-Z and 2-W."]

{"sheet":"COS Flowchart","index":2,"n_rows":6,"n_cols":2,"rows_kept":6,"cut":false,"hidden":false,"merged":[[5,1,5,6],[2,1,2,6],[3,1,3,6]]}
[]
[]
[]
[null,"Cost of Service Rate Application Schematic"]
[]
[null,"The Cost of Service Rate Application Schematic is a flowchart that is included as a guide for the components of an application. The schematic demonstrates how demand and costs interrelate to derive the revenue requirement and how the revenue requirement is allocated between classes and through fixed/variable splits to derive rates that will be compensatory for the annual revenue requirement, based on the the forecasted demand.  There is no form to be filled out; therefore, this Schedule is not required to be filed."]

{"sheet":"List of Key References","index":3,"n_rows":5,"n_cols":2,"rows_kept":5,"cut":false,"hidden":false,"merged":[[2,1,2,11],[4,0,4,11]]}
[]
[]
[null,"List of Key References"]
[]
["A list of key references for understanding the Filing Requirements has been embedded in the document below. To access the list of references and associated hyperlinks double-click the icon below."]

{"sheet":"App.2-A_Requested_Approvals","index":4,"n_rows":38,"n_cols":8,"rows_kept":38,"cut":false,"hidden":false,"merged":[[41,5,41,7],[11,1,11,7],[29,5,29,7],[23,5,23,7],[25,5,25,7],[27,5,27,7],[31,5,31,7],[21,5,21,7],[13,1,13,7],[15,1,15,7],[17,1,17,7],[19,5,19,7],[8,1,8,7],[33,5,33,7],[35,5,35,7],[37,5,37,7],[39,5,39,7],[9,1,9,7]]}
[null,null,null,null,null,null,"File Number:",{"$f":"EBNUMBER","v":"EB-2017-0071"}]
[null,null,null,null,null,null,"Exhibit:",1]
[null,null,null,null,null,null,"Tab:"]
[null,null,null,null,null,null,"Schedule:"]
[null,null,null,null,null,null,"Page:","23-24"]
[]
[null,null,null,null,null,null,"Date:","2018-03-29"]
[]
[null,"Appendix 2-A"]
[null,"List of Requested Approvals"]
[]
[null,"The distributor must fill out the following sheet with the complete list of specific approvals requested and relevant section(s) of the legislation must be provided. All approvals, including accounting orders (deferral and variance accounts) new rate classes, revised specific service charges or retail service charges which the applicant is seeking, must be separately identified, as well being clearly documented in the appropriate sections of the application."]
[]
[null,"Additional requests may be added by copying and pasting blank input rows, as needed."]
[]
[null,"If additional requests arise, or requested approvals are removed, during the processing of the application, the distributor should update this list."]
[]
[null,{"$f":"CONCATENATE('LDC Info'!E14,\" is seeking the following approvals in this application:\")","v":"PUC Distribution Inc. is seeking the following approvals in this application:"}]
[]
[null,1,null,null,null,"Approval to charge rates effective May 1, 2018 to recover a revenue requirements of $22,081,244 which includes a revenue deficiency of $3,679,687 as set out in Exhibit 6."]
[]
[null,2,null,null,null,"Approval of the proposed loss factor of 1.0481 as set out in Exhibit 8."]
[]
[null,3,null,null,null,"Approval to charge a Retail Transmission Netowrk Service rate as proposed and described in Exhibit 8."]
[]
[null,4,null,null,null,"Approval to continue to charge Wholesale Market Service Charge."]
[]
[null,5,null,null,null,"Approval to continue the Specific Service Charges and Transformer Allowance."]
[]
[null,6,null,null,null,"Approval to dispose of Account 1508, Other Regulatory Assets, sub-account Productivity Initiatives Variance Account."]
[]
[null,7,null,null,null,"Approval of the updated province-wide fixed monthly charge of $5.40 for MicroFIT Generator Service Classification."]
[]
[null,8,null,null,null,"Approval of the rate riders for a one year disposition of the Lost Revenue Adjustment Mechanism Variance Account (\"LRAMVA\") and Lost Revenue Adjustment Mechanism (\"LRAM\") for lost revenue for the 2011-2014 program years, with persistence from January 1, 2011 to December 31, 2014.  For additional information, please refer to Exhibit 4."]
[]
[null,9,null,null,null,"Approval of the DSP as outlined in Exhibit 2, Attachment XX."]
[]
[null,10,null,null,null,"Approval of the rate riders for a one year disposition of the Group 1 and Group 2 and Other Deferral and Variance Accounts as detailed in Exhibit 9."]

{"sheet":"App.2-AA_Capital Projects","index":5,"n_rows":178,"n_cols":10,"rows_kept":178,"cut":false,"hidden":false,"merged":[[180,0,181,10],[176,0,176,9],[178,0,178,9],[177,0,177,9],[8,0,8,8],[9,0,9,8]]}
[null,null,null,null,null,null,null,null,"File Number:",{"$f":"EBNUMBER","v":"EB-2017-0071"}]
[null,null,null,null,null,null,null,null,"Exhibit:",2]
[null,null,null,null,null,null,null,null,"Tab:"]
[null,null,null,null,null,null,null,null,"Schedule:"]
[null,null,null,null,null,null,null,null,"Page:",51]
[]
[null,null,null,null,null,null,null,null,"Date:","2018-03-29"]
[]
["Appendix 2-AA"]
["Capital Projects Table"]
[]
[]
["Projects","2013 Board Approved",{"$f":"D13-1","v":2013},{"$f":"E13-1","v":2014},{"$f":"F13-1","v":2015},{"$f":"BridgeYear - 1","v":2016},{"$f":"BridgeYear & \" Bridge Year\"","v":"2017 Bridge Year"},2017,{"$f":"TestYear & \" Test Year\"","v":"2018 Test Year"}]
["Reporting Basis","CGAAP","CGAAP","MIFRS","MIFRS","MIFRS","MIFRS","MIFRS","MIFRS"]
["New Services & Subdivisions"]
["Land Rights (Formally known as Account 1906)",null,null,3411,null,1736.43,1056.5413696177322,5268,1138.2781457285646]
["Buildings"]
["Transformer Station Equipment >50 kV",null,10633,null,14422,null,5142.856483900593,null,5540.7211781593851]
["Distribution Station Equipment <50 kV",null,null,41,null,467.59,104.42335687096043,524,112.50181814729585]
["Poles, Towers & Fixtures",799166,256877,401663,184799,274915.33,229540.61214936836,95521,247298.46826662062]
["Overhead Conductors & Devices",null,64863,200363,70055,101891.19,89736.851749128444,{"$f":"93380+316","v":93696},96679.126960711757]
["Underground Conduit",null,114781,177913,39290,37654.51,75874.35348756185,85536,81744.189938746757]
["Underground Conductors & Devices",null,107784,171551,209801,94176.24,119734.41104547905,142631,128997.37511845957]
["Line Transformers",null,238554,367159,418565,279567.19,267636.10711670539,216824,288341.12936726591]
["Services (Overhead & Underground)",643595,810182,527136,357901,347856.61,419375.61813651404,365987,451819.60186652973]
["Meters",null,799,76,10431,1375.99,2603.2251048534572,15530,2804.6173396303034]
["Sub-Total",{"$f":"SUM(B16:B26)","v":1442761},{"$f":"SUM(C16:C26)","v":1604473},{"$f":"SUM(D16:D26)","v":1849313},1305264,1139641.0799999998,{"$f":"SUM(G16:G26)","v":1210805},1021517,1304476.01]
["Joint Use"]
["Poles, Towers & Fixtures",null,1132204.8600000001,1010214.52,74737.48,35201.440000000002,86256.577188644427,105436,123905.97144277018]
["Overhead Conductors & Devices",null,114062.5,66940.179999999993,null,28981.75,8041.5883186562733,37263,11551.592296397235]
["Line Transformers",null,19507.45,10385.59,-4856.38,8696.1200000000008,1291.8344926993016,null,1855.6962608325903]
["Sub-Total",{"$f":"SUM(B29:B31)","v":0},{"$f":"SUM(C29:C31)","v":1265774.81},1087540.29,69881.099999999991,72879.31,95590,142699,137313.26]
["Meters "]
["Transformer Station Equipment >50 kV",null,null,null,null,529.48,219.93613581816589,null,146.4785771272598]
["Line Transformers",null,null,null,null,11410.12,4739.5514505204565,12473,3156.5652006710161]
["Services (Overhead & Underground)",null,null,560.97,null,null,233.0164956370713,null,155.1901628221631]
["Meters",319666,229273.63,139712.26999999999,42513.16,82277.27,205105.4959180243,76378,136601.29605937956]
["Sub-Total",{"$f":"SUM(B34:B37)","v":319666},{"$f":"SUM(C34:C37)","v":229273.63},140273.24,42513.16,94216.87000000001,210298,88851,140059.53]
["City Projects"]
["Poles, Towers & Fixtures",null,null,41491.279999999999,63780.800000000003,15327.86,19708.784543979091,62878,22649.043246492773]
["Overhead Conductors & Devices",null,null,8524.0499999999993,24949.22,11466.03,7344.107975984396,90909,8439.7400957837363]
["Underground Conduit",null,12345.3,{"$f":"73276.29+5423.3","v":78699.59},120025.95,86961.7,48705.3237170336,9373,55971.436530748579]
["Underground Conductors & Devices",null,213578.63,{"$f":"199843.68+148454.33","v":348298.01},379453.93,41380.79,160597.48009128921,2585,184556.24514788092]
["Line Transformers",null,null,10421.44,-1653.76,-3117.62,923.34884412508416,null,1061.0988138574444]
["Services (Overhead & Underground)",null,null,10197.98,null,179.73,1695.9548275886141,null,1948.9661652365703]
["Sub-Total",{"$f":"SUM(B40:B45)","v":0},{"$f":"SUM(C40:C45)","v":225923.93},497632.35,586556.14,152198.49000000002,238975,165745,274626.52999999997]
["Distribution Overhead Renewal"]
["Land Rights (Formally known as Account 1906)",null,null,3387.16,null,null,449.68781883173546,null,482.90187187796772]
["Distribution Station Equipment <50 kV",null,null,224.39,null,{"$f":"169.52-96854.44","v":-96684.92},-12806.340810311054,null,-13752.220296455103]
["Poles, Towers & Fixtures",null,166341.85,{"$f":"262671.95+368706.17","v":631378.12},{"$f":"191698.83+452394.16","v":644092.99},{"$f":"242031.24+113582.66","v":355613.9},238630.87783953967,409840,256256.21324582773]
["Overhead Conductors & Devices",null,84447.46,{"$f":"114916.15+72240.01","v":187156.15999999997},{"$f":"150593.41+160140.09","v":310733.5},{"$f":"178694.1+31997.28","v":210691.38},105284.44373351213,83344,113060.7786767017]
["Underground Conduit",null,48060.99,515.37,null,849.52,6561.9032378272932,null,7046.5670270125429]
["Underground Conductors & Devices",null,null,{"$f":"2014.56+16288.01","v":18302.57},{"$f":"25048.12+7212.59","v":32260.71},15357.38,8751.7914156250172,null,9398.2008849393223]
["Line Transformers",null,30758,{"$f":"115771.35+7128.6","v":122899.95000000001},{"$f":"11710.16+28433.95","v":40144.11},128906.28,42843.564972841581,60225,46008.001233077754]
["Services (Overhead & Underground)",null,null,null,null,1465.07,194.50635126058725,null,208.87263826694166]
["Meters",null,13967.48,null,null,null,1854.3575195077553,null,1991.320822582363]
["System Supervisor Equipment",null,1154,null,null,null,153.20792136533933,null,164.52389616881837]
["Sub-Total",{"$f":"SUM(B48:B57)","v":0},{"$f":"SUM(C48:C57)","v":344729.77999999997},963863.72,1027231.3099999999,616198.61,391918.00000000006,553409,420865.16]
["Distribution Underground Renewal"]
["Land Rights (Formally known as Account 1906)",null,null,null,null,4739.6499999999996,940.07622964398047]
["Poles, Towers & Fixtures",null,105.81,6556.48,2026.12,21084.45,5905.2373011758418,1319]
["Overhead Conductors & Devices",null,922.8,null,2060.42,225.82,636.4905054121549,7594]
["Underground Conduit",null,50541.82,17967.66,128515.39,{"$f":"75055.75+10969.46","v":86025.209999999992},56140.991846829842]
["Underground Conductors & Devices",159833,14007.64,43641.17,145481.57,149431.10999999999,69928.090942762428,39074]
["Line Transformers",null,null,9389.49,117080.24,114162.51,47727.711731875868,607]
["Services (Overhead & Underground)",null,1726.31,null,null,null,342.40144229989556]
["Sub-Total",{"$f":"SUM(B60:B66)","v":159833},{"$f":"SUM(C60:C66)","v":67304.38},77554.8,395163.74,375668.75,{"$f":"SUM(G60:G66)","v":181621},{"$f":"SUM(H60:H66)","v":48594},0]
["Forced Overhead Renewal"]
["Poles, Towers & Fixtures",null,{"$f":"10821.51+163931.06","v":174752.57},145134.5,107905.92,155817.69,177115.77754812411,265935,190817.64729175396]
["Overhead Conductors & Devices",null,{"$f":"23250.86+47575.4","v":70826.260000000009},28380.1,30341.279999999999,42914.31,52339.227876562691,55720,56388.247635132568]
["Underground Conduit",null,null,null,46.4,2390.34,739.5085706495571,null,796.71776030847934]
["Underground Conductors & Devices",null,null,null,1074.6199999999999,3833.81,1489.6238636183612,null,1604.8627905443129]
["Line Transformers",null,40397.5,8803.6200000000008,40493.74,72397.25,49192.16025495981,99164,52997.719429596778]
["Services (Overhead & Underground)",null,1571.8,3662.35,null,null,1588.4742668751605,781,1711.3603688200737]
["Meters",null,12886.2,1299.8699999999999,null,null,4305.2276192103218,null,4638.2847238438681]
["Sub-Total",{"$f":"SUM(B69:B75)","v":0},{"$f":"SUM(C69:C75)","v":300434.33},187280.44,179861.96,277353.40000000002,286770,421600,308954.84000000003]
["Forced Underground Renewal"]
["Overhead Conductors & Devices",null,null,null,null,2010.79,1299.1042081869991,null,1574.5589856015199]
["Underground Conductors & Devices",null,null,null,null,23637.21,15271.211305407238,92560,18509.233385908079]
["Line Transformers",958998,null,null,132840.21,236062.46,238335.68448640578,306023,288871.04762849043]
["Sub-Total",{"$f":"SUM(B78:B80)","v":958998},{"$f":"SUM(C78:C80)","v":0},0,132840.21,261710.46,254906,398583,308954.84000000003]
["Restricted Wire Replacement"]
["Poles, Towers & Fixtures",532777,166907.87,23679.46,130895.22,372009.77,274814.04699639697,400224,418175.30584792036]
["Overhead Conductors & Devices",null,195223.63,59650.080000000002,90997.62,371775.62,284385.93616165913,408070,432740.52812448901]
["Line Transformers",null,15436.45,12128.24,36008.870000000003,133425.76999999999,78066.016841943841,81726,118790.43602759058]
["Sub-Total",{"$f":"SUM(B83:B85)","v":532777},{"$f":"SUM(C83:C85)","v":377567.95},95457.780000000013,257901.71,877211.16,637266,890020,969706.2699999999]
["Transformers"]
["Line Transformers",null,88124.6,null,null,59775,null,null,56023.81]
["Sub-Total",{"$f":"SUM(B88:B88)","v":0},{"$f":"SUM(C88:C88)","v":88124.6},0,0,59775,0,0,56023.81]
["Substation 16"]
["Distribution Station Equipment <50 kV",null,19870.509999999998,null,null,35584.69,73445.371572957782,186746,121064.91282885254]
["Overhead Conductors & Devices",null,14420.19,null,null,null,19098.230872896504,null,31480.889895365832]
["Line Transformers",null,122592.33,null,null,null,162362.39755414569,null,267632.78727578162]
["Sub-Total",{"$f":"SUM(B91:B93)","v":0},{"$f":"SUM(C91:C93)","v":156883.03},0,0,35584.69,254905.99999999997,186746,420178.58999999997]
["Station Upgrades - Dx"]
["Transformer Station Equipment >50 kV",null,49279.14,null,null,null,12288.281784859682,null,7758.863640206413]
["Distribution Station Equipment <50 kV",213111,{"$f":"5492.5+17396.68+182297.71+295056.48+347727.88+7100.38","v":855071.63},358361.91,433145.66,{"$f":"6852.96+2054.6+117420.68+98.42+83104.38+71098.68+31832.79+3437.29","v":315899.79999999993},489365.17457223573,118749,308986.86457938678]
["Poles, Towers & Fixtures",null,347.64,563.16,null,{"$f":"175.59+674.39","v":849.98},439.06936689936617,null,277.22991757572572]
["Overhead Conductors & Devices",530000,3134.65,null,null,{"$f":"479.16+50078.18","v":50557.340000000004},13388.673233945809,null,8453.6546088532868]
["Underground Conduit",{"$f":"988415+319666","v":1308081},null,7041.64,null,null,1755.908413733262,null,1108.686648416005]
["Services (Overhead & Underground)",null,null,null,null,51.37,12.809660137905041,null,8.0880637364492038]
["System Supervisor Equipment",null,null,6466.08,null,9707.61,4033.0829681883083,null,2546.5025418254063]
["Sub-Total",{"$f":"SUM(B96:B102)","v":2051192},{"$f":"SUM(C96:C102)","v":907833.06},372432.79,433145.66,377066.09999999992,521283.00000000006,118749,329139.89]
["Station Upgrades - Tx"]
["Transformer Station Equipment >50 kV",213111,{"$f":"5534.99+5511.9+11286.85+258870.82+106762.35","v":387966.91000000003},459405.56,73235.72,{"$f":"975.61+70979.48","v":71955.09},null,{"$f":"67119+59287","v":126406},105162.77997881317]
["Distribution Station Equipment <50 kV",null,11738.33,30373.87,null,21671.99,null,null,6757.9799437037573]
["Poles, Towers & Fixtures",null,995.04,null,null,null,null,null,105.4251902106617]
["Overhead Conductors & Devices",null,null,null,null,202.31,null,8951,21.434887272390021]
["Sub-Total",{"$f":"SUM(B105:B108)","v":213111},{"$f":"SUM(C105:C108)","v":400700.28},489779.43,73235.72,93829.39,0,135357,112047.61999999998]
["Voltage Conversion"]
["Distribution Station Equipment <50 kV",{"$f":"1763492+965395","v":2728887},934.71,null,257568.82,null,86788.092263464132,2998,81568.404640066714]
["Poles, Towers & Fixtures",null,20689.330000000002,null,646132.92000000004,371099.47,348464.27821551752,282276,327506.62569936283]
["Overhead Conductors & Devices",null,30174.78,45055.3,336556.72,457601.29,291882.02485156333,464974,274327.39318637055]
["Underground Conduit",null,526.49,null,51596.85,163259.45000000001,72311.049100499018,{"$f":"4757+17610","v":22367},67962.052847891537]
["Underground Conductors & Devices",null,5787.2,null,17822.39,5605.7,9808.5286650586986,{"$f":"11525+19768","v":31293},9218.6152985875851]
["Line Transformers",null,19693.560000000001,681.46,299308.21000000002,149899.70000000001,157654.35255057376,{"$f":"130496+134270","v":264766},148172.56246484575]
["Services (Overhead & Underground)",null,5169.8100000000004,null,null,null,1735.6743533234517,264,1631.285862874922]
["Sub-Total",{"$f":"SUM(B111:B117)","v":2728887},{"$f":"SUM(C111:C117)","v":82975.87999999999},45736.76,1608985.91,1147465.6099999999,968643.99999999988,1068938,910386.94]
["Switch Replacement"]
["Distribution Station Equipment <50 kV"]
["Poles, Towers & Fixtures",null,null,13236.09]
["Overhead Conductors & Devices",null,66736.179999999993,105123.67,99881.12]
["Underground Conductors & Devices",106555,null,18.71]
["Line Transformers",null,46481.72,4578.38]
["Services (Overhead & Underground)",null,14590.29]
["Sub-Total",{"$f":"SUM(B120:B125)","v":106555},{"$f":"SUM(C120:C125)","v":127808.19},122956.85,99881.12,0,0,0,0]
["Insulator Replacement"]
["Poles, Towers & Fixtures",null,291484.14,4489.3599999999997]
["Overhead Conductors & Devices",null,10490.61,242586.42,185049.1]
["Sub-Total",{"$f":"SUM(B128:B129)","v":0},{"$f":"SUM(C128:C129)","v":301974.75},247075.78,185049.1,0,0,0,0]
["New Building"]
["Buildings",null,1861207.34,244853.87,66531.539999999994,82629.7,null,8109]
["Poles, Towers & Fixtures",null,11.29]
["Sub-Total",{"$f":"SUM(B132:B133)","v":0},{"$f":"SUM(C132:C133)","v":1861218.6300000001},244853.87,66531.539999999994,82629.7,0,8109,0]
["POD Generation"]
["Poles, Towers & Fixtures",null,null,2725.79]
["Sub-Total",{"$f":"SUM(B136:B136)","v":0},{"$f":"SUM(C136:C136)","v":0},2725.79,0,0,0,0,0]
["34.5 kV Expansion"]
["Distribution Station Equipment <50 kV",null,null,85.87]
["Transformer Station Equipment >50 kV",null,null,null,null,null,null,1157]
["Underground Conductors & Devices",null,null,902.05]
["Sub-Total",{"$f":"SUM(B139:B141)","v":0},{"$f":"SUM(C139:C141)","v":0},987.92,0,0,0,1157,0]
["Substation 19"]
["Distribution Station Equipment <50 kV",null,null,163163.66]
["Sub-Total",{"$f":"SUM(B144:B144)","v":0},{"$f":"SUM(C144:C144)","v":0},163163.66,0,0,0,0,0]
["Energy Storage Project"]
["Transformer Station Equipment >50 kV",null,null,158517.75,-12821.56,203252.56,425000,971770]
["Sub-Total",{"$f":"SUM(B147:B147)","v":0},{"$f":"SUM(C147:C147)","v":0},158517.75,-12821.56,203252.56,425000,971770,0]
["PMH Replacement Program"]
["Distribution Station Equipment <50 kV",null,null,16237.77]
["Poles, Towers & Fixtures",null,null,836.63]
["Overhead Conductors & Devices",null,11064.49,10455.85]
["Underground Conductors & Devices",null,1975.93]
["Line Transformers",159833,null,99485.92,49302.52,87998.64,null,35936]
["Sub-Total",{"$f":"SUM(B150:B154)","v":159833},{"$f":"SUM(C150:C154)","v":13040.42},127016.17,49302.52,87998.64,0,35936,0]
["Substation 10"]
["Distribution Station Equipment <50 kV",null,{"$f":"2935985.69+6329.4","v":2942315.09},674216.04,174343.51]
["Poles, Towers & Fixtures",null,109520.99]
["Overhead Conductors & Devices",null,97288.46,5815.08,236.58]
["Underground Conductors & Devices",null,57863.23,6.34]
["Line Transformers",null,35219.35]
["System Supervisor Equipment",null,32152.65,21741.08,4349.42]
["Sub-Total",{"$f":"SUM(B157:B162)","v":0},{"$f":"SUM(C157:C162)","v":3274359.77},701778.53999999992,178929.51,0,0,0,0]
["SCADA"]
["Transformer Station Equipment >50 kV",null,null,null,25346.66,null,null,77560,4170.1197727658164]
["Distribution Station Equipment <50 kV",266389,128475,970.39,null,null,null,1853,21296.801248463606]
["Overhead Conductors & Devices",null,null,null,null,null,null,148]
["System Supervisor Equipment",null,2498.29,128386.27,201.65,33358.92,null,14852,27055.07897877058]
["Sub-Total",{"$f":"SUM(B165:B168)","v":266389},{"$f":"SUM(C165:C168)","v":130973.29},129356.66,25548.31,33358.92,0,94413,52522]
["Miscellaneous",null,36153,1483,5693,588,0,null,63099]
["Total",{"$f":"SUMPRODUCT(--($A15:$A170=\"Sub-Total\"), B$15:B$170)+B170","v":8940002},{"$f":"SUMPRODUCT(--($A15:$A170=\"Sub-Total\"), C$15:C$170)+C170","v":11797526.709999999},7706780.5900000008,6710694.1599999992,5988626.7399999993,5677982,6352193,5808354.2899999991]
["Less Renewable Generation Facility Assets and Other Non-Rate-Regulated Utility Assets (input as negative)"]
["Total",{"$f":"B171+B172","v":8940002},{"$f":"C171+C172","v":11797526.709999999},7706780.5900000008,6710694.1599999992,5988626.7399999993,5677982,6352193,5808354.2899999991]
[]
["Notes:"]
[]
["1   Please provide a breakdown of the major components of each capital project undertaken in each year.  Please ensure that all projects below the materiality threshold are included in the miscellaneous line.  Add more projects as required."]
["2   The applicant should group projects appropriately and avoid presentations that result in classification of significant components of the capital budget in the miscellaneous category."]

{"sheet":"App.2-AB_Capital Expenditures","index":6,"n_rows":39,"n_cols":24,"rows_kept":39,"cut":false,"hidden":false,"merged":[[8,0,8,20],[9,0,9,20],[13,7,13,9],[13,10,13,12],[13,13,13,15],[13,20,14,20],[13,19,14,19],[12,0,15,0],[15,1,15,2],[15,4,15,5],[15,7,15,8],[15,10,15,11],[15,13,15,14],[15,16,15,17],[15,19,15,23],[13,21,14,21],[13,22,14,22],[13,16,13,18],[12,1,12,18],[12,19,12,23],[13,23,14,23],[13,1,13,3],[13,4,13,6],[27,0,27,20],[35,0,36,20],[38,0,39,20],[37,0,37,20],[30,0,30,20],[31,0,31,20],[32,0,33,20],[34,0,34,20],[28,0,28,7]]}
[null,null,null,null,null,null,null,null,null,null,null,null,null,null,null,null,null,null,"File Number:",null,{"$f":"EBNUMBER","v":"EB-2017-0071"}]
[null,null,null,null,null,null,null,null,null,null,null,null,null,null,null,null,null,null,"Exhibit:",null,2]
[null,null,null,null,null,null,null,null,null,null,null,null,null,null,null,null,null,null,"Tab:"]
[null,null,null,null,null,null,null,null,null,null,null,null,null,null,null,null,null,null,"Schedule:"]
[null,null,null,null,null,null,null,null,null,null,null,null,null,null,null,null,null,null,"Page:",null,"Page 70 - Appendix 3"]
[]
[null,null,null,null,null,null,null,null,null,null,null,null,null,null,null,null,null,null,"Date:",null,"2018-03-29"]
[]
["Appendix 2-AB"]
["Table 26 - Capital Expenditure Summary from Chapter 5 Consolidated\nDistribution System Plan Filing Requirements"]
[]
["First year of Forecast Period:",2018]
["CATEGORY","Historical Period (previous plan1 & actual)",null,null,null,null,null,null,null,null,null,null,null,null,null,null,null,null,null,"Forecast Period (planned)"]
[null,2012,null,null,2013,null,null,2014,null,null,2015,null,null,2016,null,null,2017,null,null,2018,2019,2020,2021,2022]
[null,"Plan","Actual","Var","Plan","Actual","Var","Plan","Actual","Var","Plan","Actual","Var","Plan","Actual2","Var","Plan","Actual2","Var"]
[null,"$ '000",null,"%","$ '000",null,"%","$ '000",null,"%","$ '000",null,"%","$ '000",null,"%","$ '000",null,"%","$ '000"]
["System Access",{"$f":"1132235/1000","v":1132.2349999999999},{"$f":"7938036/1000","v":7938.0360000000001},{"$f":"IF(ISERROR((C17-B17)/B17),\"--\",(C17-B17)/B17)","v":6.0109438411637166},{"$f":"1068766/1000","v":1068.7660000000001},{"$f":"2310000/1000","v":2310},{"$f":"IF(ISERROR((F17-E17)/E17),\"--\",(F17-E17)/E17)","v":1.1613711514026455},{"$f":"2957353/1000","v":2957.3530000000001},{"$f":"(3577484.2-1045731)/1000","v":2531.7532000000001},{"$f":"IF(ISERROR((I17-H17)/H17),\"--\",(I17-H17)/H17)","v":-0.1439124108620107},{"$f":"1265490/1000","v":1265.49},{"$f":"(2004212.49-454801)/1000","v":1549.41149},{"$f":"IF(ISERROR((L17-K17)/K17),\"--\",(L17-K17)/K17)","v":0.22435696054492721},{"$f":"1214680/1000","v":1214.68},{"$f":"1211917/1000","v":1211.9169999999999},{"$f":"IF(ISERROR((O17-N17)/N17),\"--\",(O17-N17)/N17)","v":-2.2746731649489144E-3},{"$f":"1271457/1000","v":1271.4570000000001},{"$f":"1383575/1000","v":1383.575},{"$f":"IF(ISERROR((R17-Q17)/Q17),\"--\",(R17-Q17)/Q17)","v":8.8180724947835382E-2},{"$f":"1511028/1000","v":1511.028},{"$f":"1615276/1000","v":1615.2760000000001},{"$f":"2086480/1000","v":2086.48},{"$f":"1603804/1000","v":1603.8040000000001},{"$f":"1560434/1000","v":1560.434}]
["System Renewal",{"$f":"6042853.74/1000","v":6042.8537400000005},{"$f":"(5116293-295233)/1000","v":4821.0600000000004},{"$f":"IF(ISERROR((C18-B18)/B18),\"--\",(C18-B18)/B18)","v":-0.20218820321803785},{"$f":"6525051/1000","v":6525.0510000000004},{"$f":"6082921/1000","v":6082.9210000000003},{"$f":"IF(ISERROR((F18-E18)/E18),\"--\",(F18-E18)/E18)","v":-6.775885736372024E-2},{"$f":"3813022/1000","v":3813.0219999999999},{"$f":"3753602/1000","v":3753.6019999999999},{"$f":"IF(ISERROR((I18-H18)/H18),\"--\",(I18-H18)/H18)","v":-1.5583440116527016E-2},{"$f":"4752934/1000","v":4752.9340000000002},{"$f":"4639948.17/1000","v":4639.9481699999997},{"$f":"IF(ISERROR((L18-K18)/K18),\"--\",(L18-K18)/K18)","v":-2.3771807056441458E-2},{"$f":"4542992/1000","v":4542.9920000000002},{"$f":"4243808/1000","v":4243.808},{"$f":"IF(ISERROR((O18-N18)/N18),\"--\",(O18-N18)/N18)","v":-6.5856158232283968E-2},{"$f":"3372227/1000","v":3372.2269999999999},{"$f":"3823783/1000","v":3823.7829999999999},{"$f":"IF(ISERROR((R18-Q18)/Q18),\"--\",(R18-Q18)/Q18)","v":0.13390439018488379},{"$f":"3761033/1000","v":3761.0329999999999},{"$f":"6905898/1000","v":6905.8980000000001},{"$f":"3296444/1000","v":3296.444},{"$f":"4532889/1000","v":4532.8890000000001},{"$f":"7092642/1000","v":7092.6419999999998}]
["System Service",0,0,"--",0,0,"--",0,0,"--",0,0,"--",0,0,"--",{"$f":"38236/1000","v":38.235999999999997},0,-1,0,0,0,0,0]
["General Plant",{"$f":"17802500/1000","v":17802.5},{"$f":"(22974140+295233)/1000","v":23269.373},0.30708456677432944,{"$f":"1313518/1000","v":1313.518},{"$f":"2028344/1000","v":2028.3440000000001},0.54420723583536734,{"$f":"175445/1000","v":175.44499999999999},{"$f":"375693/1000","v":375.69299999999998},1.1413719399241928,{"$f":"68653/1000","v":68.653000000000006},{"$f":"66531.54/1000","v":66.531539999999993},-3.0901198782282101E-2,0,{"$f":"82629.6958339626/1000","v":82.6296958339626},"--",0,{"$f":"8109/1000","v":8.109},"--",{"$f":"86294/1000","v":86.293999999999997},{"$f":"54629/1000","v":54.628999999999998},{"$f":"61932/1000","v":61.932000000000002},{"$f":"59853/1000","v":59.853000000000002},{"$f":"55100/1000","v":55.1}]
["TOTAL EXPENDITURE",{"$f":"SUM(B17:B20)","v":24977.588739999999},{"$f":"SUM(C17:C20)","v":36028.468999999997},0.44243182858971192,8907.3350000000009,10421.264999999999,0.16996441696646622,6945.82,6661.0482000000002,-4.0999018114491817E-2,6087.0770000000002,6255.8912,2.7733212509058091E-2,5757.6720000000005,5538.354695833963,-3.8091316102417346E-2,{"$f":"SUM(Q17:Q20)","v":4681.92},5215.4670000000006,0.11395901681361503,{"$f":"SUM(T17:T20)","v":5358.3549999999996},{"$f":"SUM(U17:U20)","v":8575.8030000000017},{"$f":"SUM(V17:V20)","v":5444.8559999999998},{"$f":"SUM(W17:W20)","v":6196.5460000000003},{"$f":"SUM(X17:X20)","v":8708.1759999999995}]
["System O&M",{"$f":"6259122/1000","v":6259.1220000000003},{"$f":"5852889/1000","v":5852.8890000000001},-6.4902553425224843E-2,{"$f":"6153732/1000","v":6153.732},{"$f":"5992120/1000","v":5992.12},-2.6262437168209484E-2,{"$f":"5529970/1000","v":5529.97},{"$f":"5773408/1000","v":5773.4080000000004},4.4021576970580324E-2,{"$f":"5819316/1000","v":5819.3159999999998},{"$f":"5977598/1000","v":5977.598},2.7199416563733633E-2,{"$f":"6200512/1000","v":6200.5119999999997},{"$f":"5977871/1000","v":5977.8710000000001},-3.5906873496898264E-2,{"$f":"5856582/1000","v":5856.5820000000003},{"$f":"5916615/1000","v":5916.6149999999998},1.0250518134980343E-2,{"$f":"6212629/1000","v":6212.6289999999999},6306,6400,6496,6594]
[]
[]
["Net of Contributed Capital"]
[]
["Notes to the Table:"]
["1. Historical “previous plan” data is not required unless a plan has previously been filed. However, use the last Board-approved, at least on a Total (Capital) Expenditure basis for the last cost of service rebasing year, and the applicant should include their planned budget in each subsequent historical year up to and including the Bridge Year."]
["2. Indicate the number of months of 'actual' data included in the last year of the Historical Period (normally a 'bridge' year):"]
[]
["Explanatory Notes on Variances (complete only if applicable)"]
["Notes on shifts in forecast vs. historical budgets by category"]
["The capital expenditure during the historic five years, after removing the extra ordinary expenditure related to construction of the office building and upgrade of the revenue meters with smart meteres in 2012 and 2013, amounts to an average annual capital expenditure of $6,680,745.  These were excluded on the basis that they represent a one-time capital investment and are not attributable to the normal five-year asset management process applided in the DSP.  This compares to the foreacst average amount of $6,856,747 for the 2018 to 2022.  The five year average (2012-2016) capital expenditure, inclusive of the one-time extraordinary capital expenditures, amounted to $12,981,005.  Average annual capital for System Access has been forecast at 88% of historical average actual expenditures (2013-2016).  Avertage annual capital for System Renewal has been forecast at 109% of historical average actual expenditures (2013-2016) due primarily to the planned construction of two substations in the forecast period.  General Plant for the forecast period is generally unchanged from 2015 and 2016 actual expenditures."]
[]
["Notes on year over year Plan vs. Actual variances for Total Expenditures"]
["Refer to Section 2.3.5.1 of the DSP for a high level summary of the budget versus actual capital variances on an annual basis. The key extraordinary expenditures pertained to the construction of a new office building as well as the upgrade of revenue meters wiht smart meters.  The impacts of these one-time projects primarily impacted 2012 and 2013.  There was an overall 2.1% increase in actual O&M expenditures from $5.85 million over the 2012-2016 period.  The variability of budgeted to actual O&M over the 5 year historical period ranged from -6.5% to 4.4%."]
[]
["Notes on Plan vs. Actual variance trends for individual expenditure categories"]
["In the System Access category, variance trends are contingent upon variable customer demand.  For the years 2013 to 2016 for the System Renewal category, the general trend is that actual expenditures are slightly below budget."]

{"sheet":"App.2-AC_Customer Engagement","index":7,"n_rows":51,"n_cols":3,"rows_kept":51,"cut":false,"hidden":false,"merged":[[42,0,42,2],[44,0,44,2],[22,0,22,2],[24,0,24,2],[27,0,27,2],[33,0,33,2],[36,0,36,2],[9,0,9,2],[8,0,8,2],[12,0,12,2],[14,0,14,2],[18,0,18,2]]}
[null,"File Number:",{"$f":"EBNUMBER","v":"EB-2017-0071"}]
[null,"Exhibit:",1]
[null,"Tab:"]
[null,"Schedule:"]
[null,"Page:","Page 41 and Appendix 10"]
[]
[null,"Date:","2018-03-29"]
[]
["Appendix 2-AC"]
["Customer Engagement Activities Summary"]
[]
["Provide a list of customer engagement activities","Provide a list of customer needs and preferences identified through each engagement activity","Actions taken to respond to identified needs and preferences.  If no action was taken, explain why."]
["COS-SPECIFIC CUSTOMER ENGAGEMENT "]
["Customer Engagement Online Survey (in-house, 2017/18)\n\n","In 2018, PUC released a customer engagement survey that would provide customers with a new level of insight and transparency into operations, and infrastructure renewal projects. PUC's goal was to help customers stay informed,  voice their opinions, create an open and honest dialogue about the state of the utility, the electrical distribution system, and plans for the future. Here are a list of priorities as per customer preference.\n\n1. Customers believe PUC's first priority should be to keep rates as low as practical while maintaining good quality electrical service = 58% said this was their first choice as PUC's # 1 priority\n\n2. Maintaining reliable electrical service (e.g. prevent/reduce power outages) = 34% said this was their first choice as PUC's # 2 priority\n\n3. Helping customers reduce/manage consumption and by doing so reduce costs  = 34% said this was their first choice as PUC's # 3 priority\n\n\n4. Providing more information during power outages  = 41% said this was their first choice as PUC's # 4 priority\n\n\n5. Community Engagement/Communication  = 55% said this was their first choice as PUC's # 5 priority","PUC plans to host an information session about the application process for customers to better understand how the proposed rate increase will affect them, and capital investment projects in the DSP.\nLow rates/maintain quality electrical service\nProlonged re-build of transformer stations\nDeclined rate increase during 2015/16 \nImproved Reliability stats for SAIDI & SAIFI\n\nMaintain reliable electrical service (prevent/reduce power outages): Infrastructure renewal projects such as those in the DSP\nVoltage conversion projects (4kv to 12kv system)\nImprovements with vegetation management to reduce outages\nFocus on neighbourhoods with high equipment failure rates \n\nHelp customers reduce costs/manage consumption: \nConservation (CDM) information sessions, retail events, advertising\nCommunity partnership for energy-saving presentations\nCustomer Connect - online portal that details consumption\nCustomer Care phone calls include bill explanation with customers \nBusiness case studies (CDM-related projects)\n\nOutage Notification: \nAtlas Notification System (pro-active planned outage notification)\nFuture plans to include text, email alerts\nPublic Notices, website notifications, media releases\nCommunity engagement/communication: \nFTE providing information source for PUC operations, industry changes\nCustomer consultations about infrastructure renewal in neighbourhoods\nUpgraded website to user-friendly\nCustomer Connect - online account for accessibility \nInformation sessions"]
["SURVEYS"]
["Bi-annual Customer Satisfaction Survey - Residential and Commercial Customers (2015 & 2017)","In 2015 and 2017, customer satisfaction surveys were conducted by the third party organization, UtilityPulse, with both residential and commercial customers. \n\n1. Reliability\n\n2.Better prices / lower rates\n\n3. Customer communication / online access\n\n4. Outage Notification","PUC has made improvements such as, but not limited to, the following areas:\n\n1. Reliability\nSmart Meter/AMI data utilization for pro-active service delivery\nCustomer Information System (CIS) & MCare (Electronic Service Orders) upgrade to improve services and response times for customers\nImprovements in vegetation management and infrastructure renewal\nVPR Partnership for assistance for those in need during emergencies\n2. Better prices/lower costs\nExpanding the tree trimming program to a 4-year cycle to cut costs\nDeclining a rate increase in 2015/2016 based off the local economy and the status of Sault Ste. Marie's major employer\nAccountability training to ensure employees work efficiently\n3. Customer Communication/Online Access\nCustomer Connect online platform to view detailed consumption\nImprovements in customer service; rebranding as Customer Care\nCustomer Care training for management and staff\nWebsite upgrades, social media and local media communications\nCustomer consultations for planned infrastructure renewal\nEnergy conservation promoted via events, advertising, website, social media\nCOS Customer Engagement Survey \n4. Outage Notification\nUpgrades to the phone system to handle more calls during outages\nAtlas Notification System for planned outages\nWebsite and media release information \nUpgraded phone system to handle more calls\nPublic Notices, hand-delivered to affected areas\n"]
["Strategic Direction Plan Survey (2016)\n","In 2016, PUC started developing a new Corporate Strategic Plan to set direction and priorities for the utility over the coming years. \n\n1. High cost of electricity/PUC advocating for customers\n\n2. Aging infrastructure\n\n3. Customer Sensitivity Training\n\n4. Information on lowering bills\n\n5. Moving services (online services made available)\n\n6. Incentives for upgrades (CDM, provincial initiatives)\n\n7. Accountability\n\n8. TOU Elimination \n\n","1. High cost of electricity/PUC advocating for customers\nPUC advocated for customers during the February 2017 moratorium on winter disconnections\nPublished media releases stating the breakdown of where the charges on the electricity bill go\n2. Aging Infrastructure\nInclusion of renewal projects in the DSP\nNeighbourhood consultations with customers \nInformation provided to customers about the distribution system\n3. Customer Sensitivity Training\nManagement and employee participation in C.A.R.E. training\nRe-branded Customer Service to Customer Care\n4. Information on lowering bills\nInformation sessions\nCustomer Care trained on new CDM programs/initiatives available\nCDM promotions on website, social media, retail events, community events, Chamber of Commerce and B2B-related events\n5. Moving Services\nThere are future opportunities to provide these services available online, rather than coming into the office to sign contracts\n6. Incentives for upgrades (CDM programs/Gov't initiatives)\nCDM presentations in the community, home shows (interactions)\nCDM advertising, social media, website\nFocus Groups to target electric heated-homes\n7. Accountability\nPUC participated in Accountability and Leadership training in 2017 to improve management and employee responsibility. \nAn internal Business Improvement Committee was struck with a mandate to review internal business and process efficiencies. \n8. TOU Elimination\nTime-of-Use is a provincially mandated initiative.\nPUC continues to promote TOU, and understanding of the electricity bill\nCustomer Care assists customers with consumption analysis and CDM promotes ways to conserve."]
["Public Awareness of Electrical Safety Survey (2015 & 2016)","Ensuring the utility can provide safe electrical distribution \nEducation and awareness about electrical safety, equipment, infrastructure\nEnsuring the utilities' operations are safe for workers and public\nOntario One Call - Call Before You Dig Awareness","PUC scored the highest out of 36 LDC's with an awareness of 86%\nOngoing Elementary School Safety program Caution and Chance\nWebsite Safety Section \nPurchase of Promotional \"Dig Safe\" for the Ontario One Call program\nContribution to the production of electrical safety videos\n\"Give 'Em a Brake\" marketing for worker safety\nParticipation in Science Festivals and Innovation Expos"]
["INFORMATION SESSIONS"]
["Sault Ste. Marie Public Library (April 2017)","Lower Rates\nBetter understanding of bill charges\nHow to control energy usage \nRegulations like the Fair Hydro Act, Disconnections\n","Face-to-face interactive Information session at the library (advertised)\nPowerPoint presentation \nConservation tips, upcoming/available programs\nBreaking down the costs in the electricity bill\nUnderstanding of disconnections, new industry regulations \n\nPUC received positive feedback about the event, stating the information provided was helpful and clarified concerns\n "]
[" ","Lower Bills\nUnderstand bill charges\nHow the electricity industry works\nTips for Northern Ontario residents that deal with extreme cold\nAlternative energy \nWhat can they do to conserve?","Presentation at the Innovation Centre (partnership)\nHow much the cost of electricity has risen in the last decade\nBill breakdown\nFlow of electricity/how the industry operates\nLighting tips, air sealing, energy efficient products/appliances, insulating, water heating, heating & cooling, windows\nAlternative energy like solar panels\n"]
[]
["MEETINGS"]
["Neighbourhood Project Meetings","Reliability \nOperational Transparency\nMore involvement in decision-making \n","Engineering met with specific neighbourhoods and spoke with residents that would be affected by capital projects such as rear-lot pole replacements and underground cable replacements.\nMet with homeowners to discuss project objectives, logistics and impact to the property, if any."]
["FOCUS GROUPS"]
["HEAR (Home Energy Assessment and Retrofit)","Lower bills in the Winter \nHigh costs for electric heating\nResidential and Commercial customers with electric baseboards","CDM partnership presentation (local electricians/contractors)\nPilot program offered residential home assessments\nInstallation of programmable thermostats, low-flow shower heads, pipe wrap and block timers."]
["Customer First (Group of LDC's) Marketing Communications","Conservation information\nUnderstanding for residential and commercial customer base\nKnowledge of programs","CDM partnership with seven (7) other LDC's\nImprovements in marketing communications\nResidential and Commercial customers targeted\nSave on Energy branding\nProgram availability knowledge with each customer base"]
["COMMUNITY EVENT INTERACTIONS"]
["Retail Product Consultation Coupon Campaigns","Energy efficient products\nConservation home upgrades","Partnerships with local hardware and home supply stores\nCDM product consultations in-store\nPromote energy efficient products, how it will help kWh usage\nCoupons to purchase products\nConservation tips/tools available"]
["Chamber of Commerce Business Breakfast","Business customers incentives\nLower costs\nIncrease energy efficiency","PowerPoint presentation on business incentives\nPartnered event with Algoma Power\nCDM provided awareness and program eligibility for businesses to minimize costs. \nBreakfast event and presentations for small business incentives, such as lighting, retro-fit programs and Save on Energy promotions.\nCDM would like to include a channel partner event and a business customer event in the future opportunities to meet with business customers"]
["Chamber of Commerce Bridges to a Better Business ","Small Business customer incentives\nLooking to minimize costs","CDM branded Save on Energy promotions and programs available\nSpeaking opportunities with customers"]
["Home/Trade Shows","Rate information\nProvincial rebates and regulations \nFace-to-face interactions with customers\nAbility to ask questions and have conversations about high costs\nIndividual concerns ","CDM promoted HEAR program, initiatives\nExplained Time-of-Use, Smart Meters, Online Services such as Customer Connect), capital projects, and sign-up customers for programs when eligible\nCustomer Care & CDM reps on-site to answer questions personally"]
["Festivals (RotaryFest and Bushplane Days)","Customers that have families may use more energy\nSafety awareness during an outage - downed power lines\nTime-of-Use, and what they can do to better manage usage","Explain Time-of-Use and consumption habits\nElectrical safety for children\nProvide information on program eligibility"]
["SAFETY"]
["Caution and Chance Electrical Safety Awareness Program","Providing a safe electrical service to the community\nEnsuring children are safe and aware of any electrical hazards\n","Since 1995, this educational program has been implemented in elementary schools. \nWebsite Caution & Chance information section\nSocial Media safety information posts"]
["Marketing Campaigns\n\"Give Our Workers a Brake\" and the \"Call Before you Dig\"","Providing a safe electrical service\nEnsuring that safety is our top priority with workers/community","Marketing campaigns to promote safety\nProviding in-house underground utility location services to the community "]
["CUSTOMER CARE"]
["Customer C.A.R.E. Training","Customers want to be treated fairly\nCustomer-focus and valued\nSpeak with a professional that can resolve their problems\nStrategic Direction Plan survey results revealed customers wanted employees to have \"customer sensitivity\" training\n\n","Entire organization underwent customer care training that included:\nHow to ensure PUC is customer centered in everything we do\nCustomer Loyalty\nReview of Customer Satisfaction survey (UtilityPulse-2017), what actual PUC customers have said they want/need\nEffective communication, active listening\nWhy customers get upset, resolving customer concerns\n\nPUC has also re-branded its Customer Service to Customer Care to improve overall experience for each customer. \nCustomer Care department will take the time to go through a person's bill with them. The representatives will connect customers with an Engineer or Planner to assist with questions related to neighbourhood projects. Being a local company, PUC is able to communicate in a more efficient manner as everyone involved in the electrical distribution system works out of the same building."]
["Internal Training","Consistent messaging from employees\nKnowledgeable, professional staff\nInformation about electricity rates, industry changes, government rebates, and conservation program initiatives\n","Monthly staff meetings (include info about OEB backgrounders, winter disconnections, rate changes)\nCDM and Line Departments provide Customer Care, Billing and Metering departments with presentations review programs available\nLine department provides Customer Care department with presentations to help with terminology and understanding of the electrical distribution system\n"]
["Customer Information System (CIS) and \nMare (Electronic Service Orders)","Customer wait times for metering services\nReliability with services offered\nCustomer satisfaction\nOverall trust in PUC","PUC introduced the system upgrades to assist with inefficiencies with metering services, wrong meter readings, and customer billing issues.\nUpgraded from Harris to NorthStar system\nReal-time electronic communication with Meter department to improve services for customers\nShorter wait times, quicker response\nImproved communication between customer, Customer Care, and the Meter Reading technicians to ensure we can provide reliable services for our customers, especially with Metering."]
["Customer Connect ","Monitoring consumption\nCustomer control, ability to review bills\nNeeded assistance with understanding bill breakdown\nHow to manage usage, Time-of-Use\nHelp with lowering bills","PUC introduced the Customer Connect option\nOnline customer platform for easy access to information\nAbility to view current and historical data\nAllows for real-time access so the Customer Care department can analyze customer's bills, review spikes and provide information for better consumption habits based on the individual's usage\nAs of November 2017, 8,596 PUC customers are signed up"]
["Vulnerable Persons' Registry ","Disabled customers or customers that experience any type of barrier\nEmergency services \nReliability\nEnsuring safety is a priority for the community","PUC partnered with the Canadian Red Cross and the SSM Community Geomatics Centre for a service for vulnerable persons.\nConfidential database, links to PUC's GIS system\nAlerts Operations and Customer Care whenever an outage may impact a vulnerable person(s). Standard operating procedure includes cooperation with emergency services so PUC contacts first responders. \nBetter communication during emergencies\nAbility to assist those in need, vulnerable/disabled "]
["COMMUNITY SUPPORT"]
["Community Outreach \n","Corporate Social Responsibility\nDonations\nEvent Sponsorships\nInvestments back into the Community","SSM Downtown Association - banner installation & sponsorship\nSSM Community Tree Lighting - sponsorship \nSSM Christmas Lighting Awards Program - co-sponsor the event\nThe Lung Association Festival of Trees - sponsor a CDM related tree, filled with energy efficient products\nSSM Santa Claus Parade - decorate a line truck, volunteer\nBon Soo Winter Festival - Sponsorship \nARCH Hospice - Employee Association Donation of over $7,500\nChristmas Safety Breakfast - Donations to the SSM Food Bank\nUnited Way - $301, 222 fundraised/donated from 2008 - 2016\nLEAP Program - Since 2012, donated over $130,000 to help low-income customers pay their electricity bills\n\n"]
["COMMUNICATIONS"]
["Online Communications","Accessibility to information\nKnowledge of power outages\nIndustry changes\nConservation Program Availability\nUpcoming events, promotions\nOnline services","Website - Upgraded to user-friendly, online Customer-focused portal \"Customer Connect\" for monitored consumption data, tree trimming services, \"Call Before You Dig\", infrastructure renewal projects, conservation tips, and program initiatives for homes and businesses\nSocial Media (Facebook, Twitter) - Communications with different demographic audience and ability to post a variety of topics, more frequently"]
["Public Notices","Accessibility to information\nKnowledge of power outages\nReliability\n","PUC provides public notices to neighbourhoods in advance of planned projects and service modifications \nThese notices are hand delivered to ensure customers receive them and are aware of any issues that may affect them or their routines"]
["Public Relations / Media Relations","Accessibility to information\nPower Outage Notification\nIndustry updates, Government rebates\nConservation Program Availability\nUpcoming events, promotions\nRate changes\n","PUC Communications department provides information to local online, print and radio media channels to ensure customers of all demographics receive the same information.\nMedia interviews\nPress releases\n\n"]
["Advertising","Accessibility to information\n\n","Public Service Announcements\nTime-of-Use ads\nHoliday lighting ads\nConservation tips\nTree trimming, worker safety\n"]
["Bill Inserts","Improve rates\nIncrease communication\n","PUC utilizes bill inserts to communicate regulatory information, new initiatives (such as the Atlas Outage Notification System), Government rebates, CDM programs and eligibility"]
["Paperless Billing (E-Billing)","Reducing environmental impact\nOnline access to bill (current and previous)\nConvenience","Online resource for customers\n24/7 Access with Customer Connect platform (historical & current data)\nPaperless Billing Campaign is a future initiative to increase enrollment"]

{"sheet":"App.2-B_Acctg Instructions","index":8,"n_rows":54,"n_cols":7,"rows_kept":54,"cut":false,"hidden":false,"merged":[[107,0,107,10],[107,11,107,18],[108,0,108,10],[108,11,108,18],[109,0,109,10],[109,11,109,18],[104,0,104,10],[104,11,104,18],[105,0,105,10],[105,11,105,18],[106,0,106,10],[106,11,106,18],[101,0,101,10],[101,11,101,18],[102,0,102,10],[102,11,102,18],[103,0,103,10],[103,11,103,18],[98,0,98,10],[98,11,98,18],[99,0,99,10],[99,11,99,18],[100,0,100,10],[100,11,100,18],[95,0,95,10],[95,11,95,18],[96,0,96,10],[96,11,96,18],[97,0,97,10],[97,11,97,18],[92,0,92,10],[92,11,92,18],[93,0,93,10],[93,11,93,18],[94,0,94,10],[94,11,94,18],[89,0,89,10],[89,11,89,18],[90,0,90,10],[90,11,90,18],[91,0,91,10],[91,11,91,18],[86,0,86,10],[86,11,86,18],[87,0,87,10],[87,11,87,18],[88,0,88,10],[88,11,88,18],[83,0,83,10],[83,11,83,18],[84,0,84,10],[84,11,84,18],[85,0,85,10],[85,11,85,18],[80,0,80,10],[80,11,80,18],[81,0,81,10],[81,11,81,18],[82,0,82,10],[82,11,82,18],[76,11,76,18],[77,0,77,10],[77,11,77,18],[78,0,78,10],[78,11,78,18],[79,0,79,10],[79,11,79,18],[73,0,73,10],[73,11,73,18],[74,0,74,10],[74,11,74,18],[75,0,75,10],[75,11,75,18],[70,0,70,10],[70,11,70,18],[71,0,71,10],[71,11,71,18],[72,0,72,10],[72,11,72,18],[67,0,67,10],[67,11,67,18],[68,0,68,10],[68,11,68,18],[69,0,69,10],[69,11,69,18],[64,0,64,10],[64,11,64,18],[65,0,65,10],[65,11,65,18],[66,0,66,10],[66,11,66,18],[61,0,61,10],[61,11,61,18],[62,0,62,10],[62,11,62,18],[63,0,63,10],[63,11,63,18],[57,0,57,10],[57,11,57,18],[58,0,58,10],[58,11,58,18],[59,11,59,18],[60,0,60,10],[60,11,60,18],[42,1,42,12],[43,1,43,12],[46,1,46,11],[47,0,48,12],[53,0,53,12],[56,0,56,10],[56,11,56,18],[19,0,19,8],[20,0,20,8],[26,0,28,10],[30,0,30,9],[36,0,36,10],[37,0,37,11],[0,0,0,10],[1,0,1,10],[5,0,5,10],[8,4,8,5],[10,0,16,0],[18,0,18,9]]}
["General Instructions to MIFRS Appendices"]
["Types of Schedules to File"]
[]
["The purpose of this tab is to provide general instructions.  The specific instructions to each appendix are listed in footnotes of each appendix."]
[]
["The typical applicant is expected to have made capitalization and depreciation policy changes under CGAAP as permitted by the Board on January 1, 2012 or mandated by the Board by January 1, 2013, and adopted IFRS for reporting purposes on January 1, 2015 (transition date January 1, 2014).  Some distributors filing for 2018 rates have rebased with these accounting changes reflected in a prior rebasing application.  If that is the case, information relating to pre-accounting policy changes is not generally required.  The information to be provided by applicants will depend on when the accounting policy changes were made and when they last rebased.  In general, applicants should provide the following information in the appendices: "]
[]
[]
[null,null,null,null,"Reflecting Accounting Policy Changes in Current Application",null,"Reflected Accounting Policy Changes in Prior Application3"]
[null,null,null,null,"Accounting Policy Changes in 2012 and Adopted IFRS in 2015","Accounting Policy Changes in 2013 and Adopted IFRS in 2015","Adopted IFRS in 2015"]
["Information to be filed in 2018 CoS Application",2018,"Test",null,"MIFRS","MIFRS","MIFRS"]
[null,2017,"Bridge",null,"MIFRS","MIFRS","MIFRS"]
[null,2016,"Historical",null,"MIFRS","MIFRS","MIFRS"]
[null,2015,"Historical",null,"MIFRS","MIFRS","MIFRS"]
[null,2014,"Historical",null," MIFRS and Revised CGAAP1"," MIFRS and Revised CGAAP1"," MIFRS and Revised CGAAP1"]
[null,2013,"Historical",null,"Revised CGAAP","CGAAP and Revised CGAAP2","N/A"]
[null,2012,"Historical",null,"CGAAP and Revised CGAAP2","N/A","N/A"]
[]
["1)  For the transition year (2014), the applicant may file two appendices, one under Revised CGAAP and one under MIFRS, depending on the materiality of impacts.  See the specific instructions under each appendix below for further details."]
["2) For applicants that are reflecting accounting policy changes for the first time in a rebasing application, the applicant must file two appendices in the year that the applicant implemented changes to its capitalization and depreciation policies (2012 or 2013), one before and one after the policy changes."]
["3) Applicants should provide CGAAP and Revised CGAAP schedules (i.e. as indicated in the first two columns of the above table) to support balances in Account 1576 if the account has yet to be disposed of."]
[]
[]
["Appendix 2-BA - Fixed Asset Schedule "]
[]
["Applicants are to provide Appendix 2-BA in accordance with the years and corresponding accounting standards noted in the above table to provide a year over year continuity in fixed assets."]
["For the transition year (2014), the applicant should file two appendices, one under Revised CGAAP and one under MIFRS if the change between Revised CGAAP and MIFRS is material.  If the change from the accounting standards is not material, the applicant may choose to only provide one appendix under MIFRS.  However, the applicant must also indicate the fixed asset net book value balance under Revised CGAAP, the total dollar value of the change and explain why it is not material."]
[]
[]
[]
["The applicant must establish the continuity of historic cost for gross assets and accumulated depreciation by asset class by ensuring that the opening balance in the year agrees to the closing balance in the prior year."]
[]
[]
["Appendix 2-Cx - Depreciation and Amortization "]
[]
["Applicants are to provide Appendix 2-C in accordance with the years and corresponding accounting standards listed in the above table.  "]
["Appendix 2-C is to be used under all three of the scenarios presented in the table above. In the appendix, the applicant will need to indicate which scenario applies. The appendix is to be duplicated for each year and accounting standard required under the scenario."]
["Depreciation accounting policy changes were mandated by the Board by January 1, 2013. In general, no further changes to an applicant's depreciation policy (i.e.  assets' service lives) are expected after the Board mandated changes by January 1, 2013.    If the applicant has made any changes to its depreciation policy subsequent to the Board mandated changes, for the year of the change, applicants must complete Appendix 2-C before and after the change. Applicants must also  explain the nature of the change, the reason for the change, quantify the impact of the change, and quantify the depreciation expense before and after the change."]
[]
["Appendix 2-E - Account 1575, IFRS-CGAAP Transitional PP&E Amounts (2-EA), Account 1576, Accounting Changes Under CGAAP (2-EB, 2-EC)"]
[]
["1) For an applicant that has a balance in Account 1576 to dispose:"]
["·       ","If an applicant changed capitalization and depreciation policies effective January 1, 2012, the applicant must complete Appendix 2-EB "]
["·       ","If an applicant changed capitalization and depreciation policies effective January 1, 2013, the applicant must complete Appendix 2-EC"]
[]
["2) For an applicant that has a balance in Account 1575 to dispose:"]
["·       ","The applicant must complete 2-EA"]
[" If the applicant did not make any further PP&E accounting policy changes beyond the capitalization and depreciation policy changes as mandated by the Board by January 1, 2013 (i.e. no further changes made on transition to IFRS), the applicant must indicate this and does not need to complete Appendix 2-EA."]
[]
[]
[]
["Appendix 2-Y - Summary of Impacts to Revenue Requirement from Transition to MIFRS"]
[]
["An applicant must provide a summary of the dollar impacts of MIFRS to each component of the revenue requirement (e.g. rate base, operating costs, etc.), including the overall impact on the proposed revenue requirement.  Accordingly,  the applicant must identify financial differences and resulting revenue requirement impacts arising from the adoption of  MIFRS as compared to CGAAP.  If the applicant is reflecting the changes in capitalization and depreciation policies for the first time in a rebasing application, then a comparison between MIFRS and CGAAP before the change in accounting policies should be completed.  If the applicant changed capitalization and depreciation policies and  reflected these changes in a prior rebasing application, then a comparison between MIFRS and CGAAP after the change in accounting policies should be completed.  "]

{"sheet":"App.2-BA_Fixed Asset Cont","index":9,"n_rows":502,"n_cols":15,"rows_kept":502,"cut":false,"hidden":false,"merged":[[505,1,506,12],[501,1,503,12],[492,1,493,12],[495,1,495,12],[8,0,8,12],[9,0,9,12],[82,3,82,6],[135,2,135,8],[136,2,136,8],[489,1,490,12],[145,0,145,12],[146,0,146,12],[151,3,151,6],[204,2,204,8],[205,2,205,8],[213,0,213,12],[476,2,476,8],[477,2,477,8],[350,0,350,12],[355,3,355,6],[408,2,408,8],[409,2,409,8],[417,0,417,12],[14,3,14,6],[67,2,67,8],[68,2,68,8],[418,0,418,12],[423,3,423,6],[282,0,282,12],[349,0,349,12],[214,0,214,12],[219,3,219,6],[272,2,272,8],[273,2,273,8],[281,0,281,12],[76,0,76,12],[77,0,77,12]]}
[null,null,null,null,null,null,null,null,null,null,null,"File Number:",{"$f":"EBNUMBER","v":"EB-2017-0071"}]
[null,null,null,null,null,null,null,null,null,null,null,"Exhibit:",2]
[null,null,null,null,null,null,null,null,null,null,null,"Tab:"]
[null,null,null,null,null,null,null,null,null,null,null,"Schedule:"]
[null,null,null,null,null,null,null,null,null,null,null,"Page:","Page 68 or Appendix 1"]
[]
[null,null,null,null,null,null,null,null,null,null,null,"Date:","2018-03-29"]
[]
["Appendix 2-BA"]
["Fixed Asset Continuity Schedule 1 "]
[]
[null,null,null,null,"Accounting Standard","CGAAP"]
[null,null,null,null,"Year ",2012]
[]
[null,null,null,"Cost",null,null,null,null,null,"Accumulated Depreciation"]
["CCA Class 2","OEB Account 3","Description 3","Opening Balance","Additions 4","Disposals 6","Closing Balance",null,"Opening Balance","Additions","Disposals 6","Closing Balance","Net Book Value"]
["N/A",1706,"Land Rights",602307.44999999995,null,null,{"$f":"D17+E17+F17","v":602307.44999999995},null,null,null,null,{"$f":"I17+J17+K17","v":0},{"$f":"G17+L17","v":602307.44999999995}]
[47,1725,"Poles and Fixtures",2018423.69,null,-143123.57,{"$f":"D18+E18+F18","v":1875300.1199999999},null,-276243.34999999998,-71122.41,143123.57,{"$f":"I18+J18+K18","v":-204242.19},{"$f":"G18+L18","v":1671057.93}]
[47,1730,"Overhead Conductors & Devices",97606,null,-7532,{"$f":"D19+E19+F19","v":90074},null,-19044.96,-7567.74,7532,{"$f":"I19+J19+K19","v":-19080.699999999997},{"$f":"G19+L19","v":70993.3}]
[47,1735,"Underground Conduit",1017684.79,null,-357.22,{"$f":"D20+E20+F20","v":1017327.5700000001},null,-71149.149999999994,-38779.279999999999,357.22,{"$f":"I20+J20+K20","v":-109571.20999999999},{"$f":"G20+L20","v":907756.3600000001}]
[47,1740,"Underground Conductors & Devices",244903,null,-84,244819,null,-13869.1,-7998.5,84,-21783.599999999999,223035.4]
[12,1611,"Computer Software (Formally known as Account 1925)",null,null,null,{"$f":"D22+E22+F22","v":0},null,null,null,null,{"$f":"I22+J22+K22","v":0},{"$f":"G22+L22","v":0}]
["CEC",1612,"Land Rights (Formally known as Account 1906)",null,null,null,{"$f":"D23+E23+F23","v":0},null,null,null,null,{"$f":"I23+J23+K23","v":0},{"$f":"G23+L23","v":0}]
["N/A",1805,"Land",89159.57,null,null,{"$f":"D24+E24+F24","v":89159.57},null,null,null,null,{"$f":"I24+J24+K24","v":0},{"$f":"G24+L24","v":89159.57}]
["CEC",1806,"Land Rights",234274.82,8432.6,-89134,{"$f":"D25+E25+F25","v":153573.42000000001},null,null,null,null,{"$f":"I25+J25+K25","v":0},{"$f":"G25+L25","v":153573.42000000001}]
[47,1808,"Buildings",1242325.6100000001,22916497.309999999,-20404,{"$f":"D26+E26+F26","v":24138418.919999998},null,-674422.15,-38839.06,null,{"$f":"I26+J26+K26","v":-713261.21},{"$f":"G26+L26","v":23425157.709999997}]
[13,1810,"Leasehold Improvements",null,null,null,0,null,null,null,null,0,0]
[47,1815,"Transformer Station Equipment >50 kV",8312485.3200000003,442023.05,-146448.54,8608059.8300000019,null,-3295804.78,-204327.5,146448.54,-3353683.7399999998,5254376.0900000017]
[47,1820,"Distribution Station Equipment <50 kV",9490317.2200000007,1158544.8799999999,null,10648862.100000001,null,-6284040.3799999999,-144410.9,null,-6428451.2800000003,4220410.8200000012]
[47,1825,"Storage Battery Equipment",19241,null,null,19241,null,-4238.78,-640.33000000000004,null,-4879.1099999999997,14361.89]
[47,1830,"Poles, Towers & Fixtures",11395085.91,1453463.52,null,12848549.43,null,-4206991.68,-231936.17,null,-4438927.8499999996,8409621.5800000001]
[47,1835,"Overhead Conductors & Devices",11820056.52,1368569.65,null,13188626.17,null,-5281195.71,-156301.26,null,-5437496.9699999997,7751129.2000000002]
[47,1840,"Underground Conduit",10185019.73,332904.82,108931,10626855.550000001,null,-8153825.6600000001,-74364.570000000007,null,-8228190.2300000004,2398665.3200000003]
[47,1845,"Underground Conductors & Devices",19164687.010000002,597638.47,null,19762325.48,null,-7896802.6399999997,-401917.29,null,-8298719.9299999997,11463605.550000001]
[47,1850,"Line Transformers",15659948.029999999,1124624.28,null,16784572.309999999,null,-7614082.0599999996,-300327.76,null,-7914409.8199999994,8870162.4899999984]
[47,1855,"Services (Overhead & Underground)",3623556.42,449031.61,null,4072588.03,null,-263427.21999999997,-88270.06,null,-351697.27999999997,3720890.75]
[47,1860,"Meters",null,null,null,0,null,null,null,null,0,0]
[47,1860,"Meters (Smart Meters)",4478778.99,6129074.9199999999,-241081.7,10366772.210000001,null,-2933376.44,-1588344.53,241081.7,-4280639.2699999996,6086132.9400000013]
["N/A",1905,"Land",null,null,null,0,null,null,null,null,0,0]
[47,1908,"Buildings & Fixtures",null,null,null,0,null,null,null,null,0,0]
[13,1910,"Leasehold Improvements",null,null,null,0,null,null,null,null,0,0]
[8,1915,"Office Furniture & Equipment (10 years)",null,null,null,0,null,null,null,null,0,0]
[8,1915,"Office Furniture & Equipment (5 years)",null,null,null,0,null,null,null,null,0,0]
[10,1920,"Computer Equipment - Hardware",13578.34,6760,null,20338.34,null,-9315.76,-7534.67,null,-16850.43,3487.91]
[45,1920,"Computer Equip.-Hardware(Post Mar. 22/04)",null,null,null,0,null,null,null,null,0,0]
[45.1,1920,"Computer Equip.-Hardware(Post Mar. 19/07)",null,null,null,0,null,null,null,null,0,0]
[12,1925,"Compute rSoftware",38397,521482.63,-25872.01,534007.62,null,-38372,-312436.92,25872.01,-324936.90999999997,209070.71000000002]
[10,1930,"Transportation Equipment",null,null,null,0,null,null,null,null,0,0]
[8,1935,"Stores Equipment",null,null,null,0,null,null,null,null,0,0]
[8,1940,"Tools, Shop & Garage Equipment",null,null,null,0,null,null,null,null,0,0]
[8,1945,"Measurement & Testing Equipment",null,null,null,0,null,null,null,null,0,0]
[8,1950,"Power Operated Equipment",null,null,null,0,null,null,null,null,0,0]
[8,1955,"Communications Equipment",null,null,null,0,null,null,null,null,0,0]
[8,1955,"Communication Equipment (Smart Meters)",null,null,null,0,null,null,null,null,0,0]
[8,1960,"Miscellaneous Equipment ",null,null,null,0,null,null,null,null,0,0]
[47,1970,"Load Management Controls Customer Premises",27814,null,-27814,0,null,-12542,null,12542,0,0]
[47,1975,"Load Management Controls Utility Premises",null,null,null,0,null,null,null,null,0,0]
[47,1980,"System Supervisor Equipment",3887893.04,305142.88,null,4193035.92,null,-2571456.37,-196831.06,null,-2768287.43,1424748.4899999998]
[47,1985,"Miscellaneous Fixed Assets",null,null,null,0,null,null,null,null,0,0]
[47,1990,"Other Tangible Property",null,null,null,0,null,null,null,null,0,0]
[47,1995,"Contributions & Grants",-10987086.369999999,-785722.21,null,-11772808.579999998,null,1388648.16,282137.15000000002,null,1670785.31,-10102023.269999998]
[47,2440,"Deferred Revenue5"]
[null,null,null,null,null,null,{"$f":"D63+E63+F63","v":0},null,null,null,null,{"$f":"I63+J63+K63","v":0},{"$f":"G63+L63","v":0}]
[null,null,"Sub-Total",{"$f":"SUM(D17:D63)","v":92676457.090000004},{"$f":"SUM(E17:E63)","v":36028468.410000004},{"$f":"SUM(F17:F63)","v":-592920.04},{"$f":"SUM(G17:G63)","v":128112005.45999999},null,{"$f":"SUM(I17:I63)","v":-48231552.029999994},{"$f":"SUM(J17:J63)","v":-3589812.8600000003},{"$f":"SUM(K17:K63)","v":577041.04},{"$f":"SUM(L17:L63)","v":-51244323.849999994},{"$f":"SUM(M17:M63)","v":76867681.609999985}]
[null,null,"Less Socialized Renewable Energy Generation Investments (input as negative)",null,null,null,{"$f":"D65+E65+F65","v":0},null,null,null,null,{"$f":"I65+J65+K65","v":0},{"$f":"G65+L65","v":0}]
[null,null,"Less Other Non Rate-Regulated Utility Assets (input as negative)",null,null,null,0,null,null,null,null,0,0]
[null,null,"Total PP&E",{"$f":"SUM(D64:D66)","v":92676457.090000004},{"$f":"SUM(E64:E66)","v":36028468.410000004},-592920.04,128112005.45999999,null,{"$f":"SUM(I64:I66)","v":-48231552.029999994},-3589812.8600000003,577041.04,-51244323.849999994,76867681.609999985]
[null,null,"Depreciation Expense adj. from gain or loss on the retirement of assets (pool of like assets), if applicable6"]
[null,null,"Total",null,null,null,null,null,null,{"$f":"J67+J68","v":-3589812.8600000003}]
[]
[null,null,null,null,null,null,null,null,"Less: Fully Allocated Depreciation"]
[10,null,"Transportation",null,null,null,null,null,"Transportation"]
[8,null,"Stores Equipment",null,null,null,null,null,"Stores Equipment"]
[null,null,null,null,null,null,null,null,"Net Depreciation",null,{"$f":"J69-K72-K73","v":-3589812.8600000003}]
[]
[]
["Appendix 2-BA"]
["Fixed Asset Continuity Schedule 1 "]
[]
[null,null,null,null,"Accounting Standard","CGAAP"]
[null,null,null,null,"Year ",2013]
[]
[null,null,null,"Cost",null,null,null,null,null,"Accumulated Depreciation"]
["CCA Class 2","OEB Account 3","Description 3","Opening Balance","Additions 4","Disposals 6","Closing Balance",null,"Opening Balance","Additions","Disposals 6","Closing Balance","Net Book Value"]
["N/A",1706,"Land Rights",602307,null,null,{"$f":"D85+E85+F85","v":602307},null,null,null,null,{"$f":"I85+J85+K85","v":0},{"$f":"G85+L85","v":602307}]
[47,1725,"Poles and Fixtures",1875300,null,-121813,{"$f":"D86+E86+F86","v":1753487},null,-204242,-66718,121813,{"$f":"I86+J86+K86","v":-149147},{"$f":"G86+L86","v":1604340}]
[47,1730,"Overhead Conductors & Devices",90074,null,null,{"$f":"D87+E87+F87","v":90074},null,-19081,-7099,null,{"$f":"I87+J87+K87","v":-26180},{"$f":"G87+L87","v":63894}]
[47,1735,"Underground Conduit",1017328,null,-31461,{"$f":"D88+E88+F88","v":985867},null,-109571,-37736,31461,{"$f":"I88+J88+K88","v":-115846},{"$f":"G88+L88","v":870021}]
[47,1740,"Underground Conductors & Devices",244819,null,null,244819,null,-21784,-7783,null,-29567,215252]
[12,1611,"Computer Software (Formally known as Account 1925)",null,null,null,{"$f":"D90+E90+F90","v":0},null,null,null,null,{"$f":"I90+J90+K90","v":0},{"$f":"G90+L90","v":0}]
["CEC",1612,"Land Rights (Formally known as Account 1906)",null,null,null,{"$f":"D91+E91+F91","v":0},null,null,null,null,{"$f":"I91+J91+K91","v":0},{"$f":"G91+L91","v":0}]
["N/A",1805,"Land",89160,null,null,{"$f":"D92+E92+F92","v":89160},null,null,null,null,{"$f":"I92+J92+K92","v":0},{"$f":"G92+L92","v":89160}]
["CEC",1806,"Land Rights",153573,555,null,{"$f":"D93+E93+F93","v":154128},null,null,null,null,{"$f":"I93+J93+K93","v":0},{"$f":"G93+L93","v":154128}]
[47,1808,"Buildings",24138419,1861467,null,{"$f":"D94+E94+F94","v":25999886},null,-713261,-661658,null,{"$f":"I94+J94+K94","v":-1374919},{"$f":"G94+L94","v":24624967}]
[13,1810,"Leasehold Improvements",null,null,null,0,null,null,null,null,0,0]
[47,1815,"Transformer Station Equipment >50 kV",8608060,448214,null,9056274,null,-3353684,-210868,null,-3564552,5491722]
[47,1820,"Distribution Station Equipment <50 kV",10648862,3832429,null,14481291,null,-6428451,-240222,null,-6668673,7812618]
[47,1825,"Storage Battery Equipment",19241,null,null,19241,null,-4879,-640,null,-5519,13722]
[47,1830,"Poles, Towers & Fixtures",12848549,2320239,null,15168788,null,-4438928,-283445,null,-4722373,10446415]
[47,1835,"Overhead Conductors & Devices",13188626,763655,null,13952281,null,-5437497,-169054,null,-5606551,8345730]
[47,1840,"Underground Conduit",10626856,226255,null,10853111,null,-8228190,-78890,null,-8307080,2546031]
[47,1845,"Underground Conductors & Devices",19762325,400996,null,20163321,null,-8298720,-427501,null,-8726221,11437100]
[47,1850,"Line Transformers",16784572,675571,-25049,17435094,null,-7914410,-316591,null,-8231001,9204093]
[47,1855,"Services (Overhead & Underground)",4072588,833240,null,4905828,null,-351697,-93542,null,-445239,4460589]
[47,1860,"Meters",10366772,271622,-4298049,6340345,null,-4280639,-428593,2837860,-1871372,4468973]
[47,1860,"Meters (Smart Meters)",null,null,null,0,null,null,null,null,0,0]
["N/A",1905,"Land",null,null,null,0,null,null,null,null,0,0]
[47,1908,"Buildings & Fixtures",null,null,null,0,null,null,null,null,0,0]
[13,1910,"Leasehold Improvements",null,null,null,0,null,null,null,null,0,0]
[8,1915,"Office Furniture & Equipment (10 years)",null,null,null,0,null,null,null,null,0,0]
[8,1915,"Office Furniture & Equipment (5 years)",null,null,null,0,null,null,null,null,0,0]
[10,1920,"Computer Equipment - Hardware",20338,null,null,20338,null,-16850,-2127,null,-18977,1361]
[45,1920,"Computer Equip.-Hardware(Post Mar. 22/04)",null,null,null,0,null,null,null,null,0,0]
[45.1,1920,"Computer Equip.-Hardware(Post Mar. 19/07)",null,null,null,0,null,null,null,null,0,0]
[12,1925,"Compute rSoftware",534008,1500,null,535508,null,-324937,-104597,null,{"$f":"I115+J115+K115","v":-429534},{"$f":"G115+L115","v":105974}]
[10,1930,"Transportation Equipment",null,null,null,0,null,null,null,null,0,0]
[8,1935,"Stores Equipment",null,null,null,0,null,null,null,null,0,0]
[8,1940,"Tools, Shop & Garage Equipment",null,null,null,0,null,null,null,null,0,0]
[8,1945,"Measurement & Testing Equipment",null,null,null,0,null,null,null,null,0,0]
[8,1950,"Power Operated Equipment",null,null,null,0,null,null,null,null,0,0]
[8,1955,"Communications Equipment",null,null,null,0,null,null,null,null,0,0]
[8,1955,"Communication Equipment (Smart Meters)",null,null,null,0,null,null,null,null,0,0]
[8,1960,"Miscellaneous Equipment ",null,null,null,0,null,null,null,null,0,0]
[47,1970,"Load Management Controls Customer Premises",null,null,null,0,null,null,null,null,0,0]
[47,1975,"Load Management Controls Utility Premises",null,null,null,0,null,null,null,null,0,0]
[47,1980,"System Supervisor Equipment",4193036,161782,null,4354818,null,-2768287,-204920,null,-2973207,1381611]
[47,1985,"Miscellaneous Fixed Assets",null,null,null,0,null,null,null,null,0,0]
[47,1990,"Other Tangible Property",null,null,null,0,null,null,null,null,0,0]
[47,1995,"Contributions & Grants",-11772809,-1376260,null,-13149069,null,1670785,{"$f":"--316544","v":316544},null,1987329,-11161740]
[47,2440,"Deferred Revenue5"]
[null,null,null,null,null,null,0,null,null,null,null,0,0]
[null,null,"Sub-Total",{"$f":"SUM(D85:D131)","v":128112004},{"$f":"SUM(E85:E131)","v":10421265},{"$f":"SUM(F85:F131)","v":-4476372},{"$f":"SUM(G85:G131)","v":134056897},null,{"$f":"SUM(I85:I131)","v":-51244323},{"$f":"SUM(J85:J131)","v":-3025440},{"$f":"SUM(K85:K131)","v":2991134},{"$f":"SUM(L85:L131)","v":-51278629},{"$f":"SUM(M85:M131)","v":82778268}]
[null,null,"Less Socialized Renewable Energy Generation Investments (input as negative)",null,null,null,{"$f":"D133+E133+F133","v":0},null,null,null,null,{"$f":"I133+J133+K133","v":0},{"$f":"G133+L133","v":0}]
[null,null,"Less Other Non Rate-Regulated Utility Assets (input as negative)",null,null,null,0,null,null,null,null,0,0]
[null,null,"Total PP&E",{"$f":"SUM(D132:D134)","v":128112004},{"$f":"SUM(E132:E134)","v":10421265},-4476372,134056897,null,{"$f":"SUM(I132:I134)","v":-51244323},-3025440,2991134,-51278629,82778268]
[null,null,"Depreciation Expense adj. from gain or loss on the retirement of assets (pool of like assets), if applicable6"]
[null,null,"Total",null,null,null,null,null,null,{"$f":"J135+J136","v":-3025440}]
[]
[null,null,null,null,null,null,null,null,"Less: Fully Allocated Depreciation"]
[10,null,"Transportation",null,null,null,null,null,"Transportation"]
[8,null,"Stores Equipment",null,null,null,null,null,"Stores Equipment"]
[null,null,null,null,null,null,null,null,"Net Depreciation",null,{"$f":"J137-K140-K141","v":-3025440}]
[]
[]
[]
["Appendix 2-BA"]
["Fixed Asset Continuity Schedule 1 "]
[]
[null,null,null,null,"Accounting Standard","MIFRS"]
[null,null,null,null,"Year ",2014]
[]
[null,null,null,"Cost",null,null,null,null,null,"Accumulated Depreciation"]
["CCA Class 2","OEB Account 3","Description 3","Opening Balance","Additions 4","Disposals 6","Closing Balance",null,"Opening Balance","Additions","Disposals 6","Closing Balance","Net Book Value"]
["N/A",1706,"Land Rights",{"$f":"+M85","v":602307},null,null,{"$f":"D154+E154+F154","v":602307},null,0,null,null,{"$f":"I154+J154+K154","v":0},{"$f":"G154+L154","v":602307}]
[47,1725,"Poles and Fixtures",{"$f":"+M86","v":1604340},null,null,{"$f":"D155+E155+F155","v":1604340},null,0,-39130,null,{"$f":"I155+J155+K155","v":-39130},{"$f":"G155+L155","v":1565210}]
[47,1730,"Overhead Conductors & Devices",63894,null,null,{"$f":"D156+E156+F156","v":63894},null,0,-1997,null,{"$f":"I156+J156+K156","v":-1997},{"$f":"G156+L156","v":61897}]
[47,1735,"Underground Conduit",870021,null,null,{"$f":"D157+E157+F157","v":870021},null,0,-24858,null,{"$f":"I157+J157+K157","v":-24858},{"$f":"G157+L157","v":845163}]
[47,1740,"Underground Conductors & Devices",215252,null,null,215252,null,0,-9784,null,-9784,205468]
[12,1611,"Computer Software (Formally known as Account 1925)",0,null,null,{"$f":"D159+E159+F159","v":0},null,0,null,null,{"$f":"I159+J159+K159","v":0},{"$f":"G159+L159","v":0}]
["CEC",1612,"Land Rights (Formally known as Account 1906)",0,null,null,{"$f":"D160+E160+F160","v":0},null,0,null,null,{"$f":"I160+J160+K160","v":0},{"$f":"G160+L160","v":0}]
["N/A",1805,"Land",89160,null,null,{"$f":"D161+E161+F161","v":89160},null,0,null,null,{"$f":"I161+J161+K161","v":0},{"$f":"G161+L161","v":89160}]
["CEC",1806,"Land Rights",154128,6798,null,{"$f":"D162+E162+F162","v":160926},null,0,null,null,{"$f":"I162+J162+K162","v":0},{"$f":"G162+L162","v":160926}]
[47,1808,"Buildings",24624967,244854,null,{"$f":"D163+E163+F163","v":24869821},null,0,-675297,null,{"$f":"I163+J163+K163","v":-675297},{"$f":"G163+L163","v":24194524}]
[13,1810,"Leasehold Improvements",0,null,null,0,null,0,null,null,0,0]
[47,1815,"Transformer Station Equipment >50 kV",5491722,617923,null,6109645,null,0,-236546,null,-236546,5873099]
[47,1820,"Distribution Station Equipment <50 kV",7812618,1245158,null,9057776,null,0,-370683,null,-370683,8687093]
[47,1825,"Storage Battery Equipment",13722,null,null,13722,null,0,-653,null,-653,13069]
[47,1830,"Poles, Towers & Fixtures",10446415,2281968,null,12728383,null,0,-262774,null,-262774,12465609]
[47,1835,"Overhead Conductors & Devices",8345730,960049,null,9305779,null,0,-239826,null,-239826,9065953]
[47,1840,"Underground Conduit",2546031,282137,null,2828168,null,0,-214991,null,-214991,2613177]
[47,1845,"Underground Conductors & Devices",11437100,582719,null,12019819,null,0,-504549,null,-504549,11515270]
[47,1850,"Line Transformers",9204093,645934,null,9850027,null,0,-244077,null,-244077,9605950]
[47,1855,"Services (Overhead & Underground)",4460589,541557,null,5002146,null,0,-130675,null,-130675,4871471]
[47,1860,"Meters",4468973,141089,null,4610062,null,0,-410973,null,-410973,4199089]
[47,1860,"Meters (Smart Meters)",0,null,null,0,null,0,null,null,0,0]
["N/A",1905,"Land",0,null,null,0,null,0,null,null,0,0]
[47,1908,"Buildings & Fixtures",0,null,null,0,null,0,null,null,0,0]
[13,1910,"Leasehold Improvements",0,null,null,0,null,0,null,null,0,0]
[8,1915,"Office Furniture & Equipment (10 years)",0,null,null,0,null,0,null,null,0,0]
[8,1915,"Office Furniture & Equipment (5 years)",0,null,null,0,null,0,null,null,0,0]
[10,1920,"Computer Equipment - Hardware",1361,null,null,1361,null,0,-1361,null,-1361,0]
[45,1920,"Computer Equip.-Hardware(Post Mar. 22/04)",0,null,null,0,null,0,null,null,0,0]
[45.1,1920,"Computer Equip.-Hardware(Post Mar. 19/07)",0,null,null,0,null,0,null,null,0,0]
[12,1925,"Compute rSoftware",105974,null,null,105974,null,0,-105974,null,-105974,0]
[10,1930,"Transportation Equipment",0,null,null,0,null,0,null,null,0,0]
[8,1935,"Stores Equipment",0,null,null,0,null,0,null,null,0,0]
[8,1940,"Tools, Shop & Garage Equipment",0,null,null,0,null,0,null,null,0,0]
[8,1945,"Measurement & Testing Equipment",0,null,null,0,null,0,null,null,0,0]
[8,1950,"Power Operated Equipment",0,null,null,0,null,0,null,null,0,0]
[8,1955,"Communications Equipment",0,null,null,0,null,0,null,null,0,0]
[8,1955,"Communication Equipment (Smart Meters)",0,null,null,0,null,0,null,null,0,0]
[8,1960,"Miscellaneous Equipment ",0,null,null,0,null,0,null,null,0,0]
[47,1970,"Load Management Controls Customer Premises",0,null,null,0,null,0,null,null,0,0]
[47,1975,"Load Management Controls Utility Premises",0,null,null,0,null,0,null,null,0,0]
[47,1980,"System Supervisor Equipment",1381611,156593,null,1538204,null,0,-234183,null,-234183,1304021]
[47,1985,"Miscellaneous Fixed Assets",0,null,null,0,null,0,null,null,0,0]
[47,1990,"Other Tangible Property",0,null,null,0,null,0,null,null,0,0]
[47,1995,"Contributions & Grants",-11161740,0,null,{"$f":"D198+E198+F198","v":-11161740},null,0,328286,null,328286,-10833454]
[47,2440,"Deferred Revenue5",0,-1045731,null,{"$f":"D199+E199+F199","v":-1045731},null,0,13072,null,{"$f":"I199+J199+K199","v":13072},{"$f":"G199+L199","v":-1032659}]
[null,null,null,null,null,null,{"$f":"D200+E200+F200","v":0},null,null,null,null,{"$f":"I200+J200+K200","v":0},{"$f":"G200+L200","v":0}]
[null,null,"Sub-Total",{"$f":"SUM(D154:D200)","v":82778268},{"$f":"SUM(E154:E200)","v":6661048},{"$f":"SUM(F154:F200)","v":0},{"$f":"SUM(G154:G200)","v":89439316},null,{"$f":"SUM(I154:I200)","v":0},{"$f":"SUM(J154:J200)","v":-3366973},{"$f":"SUM(K154:K200)","v":0},{"$f":"SUM(L154:L200)","v":-3366973},{"$f":"SUM(M154:M200)","v":86072343}]
[null,null,"Less Socialized Renewable Energy Generation Investments (input as negative)",null,null,null,{"$f":"D202+E202+F202","v":0},null,null,null,null,{"$f":"I202+J202+K202","v":0},{"$f":"G202+L202","v":0}]
[null,null,"Less Other Non Rate-Regulated Utility Assets (input as negative)",null,null,null,0,null,null,null,null,0,0]
[null,null,"Total PP&E",{"$f":"SUM(D201:D203)","v":82778268},{"$f":"SUM(E201:E203)","v":6661048},0,89439316,null,{"$f":"SUM(I201:I203)","v":0},-3366973,0,-3366973,86072343]
[null,null,"Depreciation Expense adj. from gain or loss on the retirement of assets (pool of like assets), if applicable6"]
[null,null,"Total",null,null,null,null,null,null,{"$f":"J204+J205","v":-3366973}]
[]
[null,null,null,null,null,null,null,null,"Less: Fully Allocated Depreciation"]
[10,null,"Transportation",null,null,null,null,null,"Transportation"]
[8,null,"Stores Equipment",null,null,null,null,null,"Stores Equipment"]
[null,null,null,null,null,null,null,null,"Net Depreciation",null,{"$f":"J206-K209-K210","v":-3366973}]
[]
[]
["Appendix 2-BA"]
["Fixed Asset Continuity Schedule 1 "]
[]
[null,null,null,null,"Accounting Standard","MIFRS"]
[null,null,null,null,"Year ",2015]
[]
[null,null,null,"Cost",null,null,null,null,null,"Accumulated Depreciation"]
["CCA Class 2","OEB Account 3","Description 3","Opening Balance","Additions 4","Disposals 6","Closing Balance",null,"Opening Balance","Additions","Disposals 6","Closing Balance","Net Book Value"]
["N/A",1706,"Land Rights",{"$f":"+G154","v":602307},null,null,{"$f":"D222+E222+F222","v":602307},null,{"$f":"+L154","v":0},null,null,{"$f":"I222+J222+K222","v":0},{"$f":"G222+L222","v":602307}]
[47,1725,"Poles and Fixtures",1604340,null,null,{"$f":"D223+E223+F223","v":1604340},null,-39130,-39130,null,{"$f":"I223+J223+K223","v":-78260},{"$f":"G223+L223","v":1526080}]
[47,1730,"Overhead Conductors & Devices",63894,null,null,{"$f":"D224+E224+F224","v":63894},null,-1997,-1997,null,{"$f":"I224+J224+K224","v":-3994},{"$f":"G224+L224","v":59900}]
[47,1735,"Underground Conduit",870021,null,null,{"$f":"D225+E225+F225","v":870021},null,-24858,-24858,null,{"$f":"I225+J225+K225","v":-49716},{"$f":"G225+L225","v":820305}]
[47,1740,"Underground Conductors & Devices",215252,null,null,215252,null,-9784,-9784,null,-19568,195684]
[12,1611,"Computer Software (Formally known as Account 1925)",0,null,null,{"$f":"D227+E227+F227","v":0},null,0,null,null,{"$f":"I227+J227+K227","v":0},{"$f":"G227+L227","v":0}]
["CEC",1612,"Land Rights (Formally known as Account 1906)",0,null,null,{"$f":"D228+E228+F228","v":0},null,0,null,null,{"$f":"I228+J228+K228","v":0},{"$f":"G228+L228","v":0}]
["N/A",1805,"Land",89160,null,null,{"$f":"D229+E229+F229","v":89160},null,0,null,null,{"$f":"I229+J229+K229","v":0},{"$f":"G229+L229","v":89160}]
["CEC",1806,"Land Rights",160926,5693,null,{"$f":"D230+E230+F230","v":166619},null,null,null,null,{"$f":"I230+J230+K230","v":0},{"$f":"G230+L230","v":166619}]
[47,1808,"Buildings",24869821,66532,null,{"$f":"D231+E231+F231","v":24936353},null,{"$f":"+L163","v":-675297},-678518,null,{"$f":"I231+J231+K231","v":-1353815},{"$f":"G231+L231","v":23582538}]
[13,1810,"Leasehold Improvements",0,null,null,0,null,0,null,null,0,0]
[47,1815,"Transformer Station Equipment >50 kV",6109645,100183,null,6209828,null,-236546,-245522,null,-482068,5727760]
[47,1820,"Distribution Station Equipment <50 kV",9057776,865058,null,9922834,null,-370683,-397061,null,-767744,9155090]
[47,1825,"Storage Battery Equipment",13722,null,null,13722,null,-653,-653,null,-1306,12416]
[47,1830,"Poles, Towers & Fixtures",12728383,1854371,null,14582754,null,-262774,-308733,null,-571507,14011247]
[47,1835,"Overhead Conductors & Devices",9305779,1150860,null,10456639,null,-239826,-257417,null,-497243,9959396]
[47,1840,"Underground Conduit",2828168,339474,null,3167642,null,-214991,-221207,null,-436198,2731444]
[47,1845,"Underground Conductors & Devices",12019819,785894,null,12805713,null,-504549,-521657,null,-1026206,11779507]
[47,1850,"Line Transformers",9850027,1127232,null,10977259,null,-244077,-266241,null,-510318,10466941]
[47,1855,"Services (Overhead & Underground)",5002146,357901,null,5360047,null,-130675,-141918,null,-272593,5087454]
[47,1860,"Meters",4610062,52944,null,4663006,null,-410973,-417441,null,-828414,3834592]
[47,1860,"Meters (Smart Meters)",0,null,null,0,null,0,null,null,0,0]
["N/A",1905,"Land",0,null,null,0,null,0,null,null,0,0]
[47,1908,"Buildings & Fixtures",0,null,null,0,null,0,null,null,0,0]
[13,1910,"Leasehold Improvements",0,null,null,0,null,0,null,null,0,0]
[8,1915,"Office Furniture & Equipment (10 years)",0,null,null,0,null,0,null,null,0,0]
[8,1915,"Office Furniture & Equipment (5 years)",0,null,null,0,null,0,null,null,0,0]
[10,1920,"Computer Equipment - Hardware",1361,null,-1361,0,null,-1361,null,1361,0,0]
[45,1920,"Computer Equip.-Hardware(Post Mar. 22/04)",0,null,null,0,null,0,null,null,0,0]
[45.1,1920,"Computer Equip.-Hardware(Post Mar. 19/07)",0,null,null,0,null,0,null,null,0,0]
[12,1925,"Compute rSoftware",105974,null,-105974,0,null,-105974,null,105974,0,0]
[10,1930,"Transportation Equipment",0,null,null,0,null,0,null,null,0,0]
[8,1935,"Stores Equipment",0,null,null,0,null,0,null,null,0,0]
[8,1940,"Tools, Shop & Garage Equipment",0,null,null,0,null,0,null,null,0,0]
[8,1945,"Measurement & Testing Equipment",0,null,null,0,null,0,null,null,0,0]
[8,1950,"Power Operated Equipment",0,null,null,0,null,0,null,null,0,0]
[8,1955,"Communications Equipment",0,null,null,0,null,0,null,null,0,0]
[8,1955,"Communication Equipment (Smart Meters)",0,null,null,0,null,0,null,null,0,0]
[8,1960,"Miscellaneous Equipment ",0,null,null,0,null,0,null,null,0,0]
[47,1970,"Load Management Controls Customer Premises",0,null,null,0,null,0,null,null,0,0]
[47,1975,"Load Management Controls Utility Premises",0,null,null,0,null,0,null,null,0,0]
[47,1980,"System Supervisor Equipment",1538204,4551,null,1542755,null,-234183,-238212,null,-472395,1070360]
[47,1985,"Miscellaneous Fixed Assets",0,null,null,0,null,0,null,null,0,0]
[47,1990,"Other Tangible Property",0,null,null,0,null,0,null,null,0,0]
[47,1995,"Contributions & Grants",-11161740,0,null,-11161740,null,328286,328286,null,656572,-10505168]
[47,2440,"Deferred Revenue5",-1045731,-454801,null,-1500532,null,13072,31829,null,{"$f":"I267+J267+K267","v":44901},{"$f":"G267+L267","v":-1455631}]
[null,null,null,null,null,null,{"$f":"D268+E268+F268","v":0},null,null,null,null,{"$f":"I268+J268+K268","v":0},{"$f":"G268+L268","v":0}]
[null,null,"Sub-Total",{"$f":"SUM(D222:D268)","v":89439316},{"$f":"SUM(E222:E268)","v":6255892},-107335,95587873,null,-3366973,-3410234,107335,-6669872,88918001]
[null,null,"Less Socialized Renewable Energy Generation Investments (input as negative)",null,null,null,{"$f":"D270+E270+F270","v":0},null,null,null,null,{"$f":"I270+J270+K270","v":0},{"$f":"G270+L270","v":0}]
[null,null,"Less Other Non Rate-Regulated Utility Assets (input as negative)",null,null,null,0,null,null,null,null,0,0]
[null,null,"Total PP&E",{"$f":"SUM(D269:D271)","v":89439316},{"$f":"SUM(E269:E271)","v":6255892},-107335,95587873,null,{"$f":"SUM(I269:I271)","v":-3366973},-3410234,107335,-6669872,88918001]
[null,null,"Depreciation Expense adj. from gain or loss on the retirement of assets (pool of like assets), if applicable6"]
[null,null,"Total",null,null,null,null,null,null,{"$f":"J272+J273","v":-3410234}]
[]
[null,null,null,null,null,null,null,null,"Less: Fully Allocated Depreciation"]
[10,null,"Transportation",null,null,null,null,null,"Transportation"]
[8,null,"Stores Equipment",null,null,null,null,null,"Stores Equipment"]
[null,null,null,null,null,null,null,null,"Net Depreciation",null,{"$f":"J274-K277-K278","v":-3410234}]
[]
[]
["Appendix 2-BA"]
["Fixed Asset Continuity Schedule 1 "]
[]
[null,null,null,null,"Accounting Standard","MIFRS"]
[null,null,null,null,"Year ",2016]
[]
[null,null,null,"Cost",null,null,null,null,null,"Accumulated Depreciation"]
["CCA Class 2","OEB Account 3","Description 3","Opening Balance","Additions 4","Disposals 6","Closing Balance",null,"Opening Balance","Additions","Disposals 6","Closing Balance","Net Book Value"]
["N/A",1706,"Land Rights",{"$f":"+G222","v":602307},null,null,{"$f":"D290+E290+F290","v":602307},null,{"$f":"+L222","v":0},null,null,{"$f":"I290+J290+K290","v":0},{"$f":"G290+L290","v":602307}]
[47,1725,"Poles and Fixtures",1604340,null,null,1604340,null,-78260,-39130,null,-117390,1486950]
[47,1730,"Overhead Conductors & Devices",63894,null,null,63894,null,-3994,-1997,null,-5991,57903]
[47,1735,"Underground Conduit",870021,null,null,870021,null,-49716,-24858,null,-74574,795447]
[47,1740,"Underground Conductors & Devices",215252,null,null,215252,null,-19568,-9784,null,-29352,185900]
[12,1611,"Computer Software (Formally known as Account 1925)",0,null,null,0,null,0,null,null,0,0]
["CEC",1612,"Land Rights (Formally known as Account 1906)",0,null,null,0,null,0,null,null,0,0]
["N/A",1805,"Land",89160,null,null,89160,null,0,null,null,0,89160]
["CEC",1806,"Land Rights",166619,7064,null,173683,null,null,null,null,0,173683]
[47,1808,"Buildings",24936353,82630,null,25018983,null,{"$f":"+L231","v":-1353815},-680892,null,-2034707,22984276]
[13,1810,"Leasehold Improvements",0,null,null,0,null,0,null,null,0,0]
[47,1815,"Transformer Station Equipment >50 kV",6209828,275737,null,6485565,null,-482068,-250221,null,-732289,5753276]
[47,1820,"Distribution Station Equipment <50 kV",9922834,276939,null,10199773,null,-767744,-411336,null,-1179080,9020693]
[47,1825,"Storage Battery Equipment",13722,null,null,13722,null,-1306,-653,null,-1959,11763]
[47,1830,"Poles, Towers & Fixtures",14582754,1601920,null,16184674,null,-571507,-347136,null,-918643,15266031]
[47,1835,"Overhead Conductors & Devices",10456639,1278318,null,11734957,null,-497243,-277660,null,-774903,10960054]
[47,1840,"Underground Conduit",3167642,377141,null,3544783,null,-436198,-228373,null,-664571,2880212]
[47,1845,"Underground Conductors & Devices",12805713,333422,null,13139135,null,-1026206,-535648,null,-1561854,11577281]
[47,1850,"Line Transformers",10977259,1279182,null,12256441,null,-510318,-295574,null,-805892,11450549]
[47,1855,"Services (Overhead & Underground)",5360047,349553,null,5709600,null,-272593,-150761,null,-423354,5286246]
[47,1860,"Meters",4663006,83653,null,4746659,null,-828414,-421994,null,-1250408,3496251]
[47,1860,"Meters (Smart Meters)",0,null,null,0,null,0,null,null,0,0]
["N/A",1905,"Land",0,null,null,0,null,0,null,null,0,0]
[47,1908,"Buildings & Fixtures",0,null,null,0,null,0,null,null,0,0]
[13,1910,"Leasehold Improvements",0,null,null,0,null,0,null,null,0,0]
[8,1915,"Office Furniture & Equipment (10 years)",0,null,null,0,null,0,null,null,0,0]
[8,1915,"Office Furniture & Equipment (5 years)",0,null,null,0,null,0,null,null,0,0]
[10,1920,"Computer Equipment - Hardware",0,null,null,0,null,0,null,null,0,0]
[45,1920,"Computer Equip.-Hardware(Post Mar. 22/04)",0,null,null,0,null,0,null,null,0,0]
[45.1,1920,"Computer Equip.-Hardware(Post Mar. 19/07)",0,null,null,0,null,0,null,null,0,0]
[12,1925,"Compute rSoftware",0,null,null,{"$f":"D320+E320+F320","v":0},null,null,null,null,{"$f":"I320+J320+K320","v":0},{"$f":"G320+L320","v":0}]
[10,1930,"Transportation Equipment",0,null,null,{"$f":"D321+E321+F321","v":0},null,{"$f":"+L253","v":0},null,null,{"$f":"I321+J321+K321","v":0},{"$f":"G321+L321","v":0}]
[8,1935,"Stores Equipment",0,null,null,0,null,0,null,null,0,0]
[8,1940,"Tools, Shop & Garage Equipment",0,null,null,0,null,0,null,null,0,0]
[8,1945,"Measurement & Testing Equipment",0,null,null,0,null,0,null,null,0,0]
[8,1950,"Power Operated Equipment",0,null,null,0,null,0,null,null,0,0]
[8,1955,"Communications Equipment",0,null,null,0,null,0,null,null,0,0]
[8,1955,"Communication Equipment (Smart Meters)",0,null,null,0,null,0,null,null,0,0]
[8,1960,"Miscellaneous Equipment ",0,null,null,0,null,0,null,null,0,0]
[47,1970,"Load Management Controls Customer Premises",0,null,null,0,null,0,null,null,0,0]
[47,1975,"Load Management Controls Utility Premises",0,null,null,0,null,0,null,null,0,0]
[47,1980,"System Supervisor Equipment",1542755,43067,null,1585822,null,-472395,-239402,null,-711797,874025]
[47,1985,"Miscellaneous Fixed Assets",0,null,null,0,null,0,null,null,0,0]
[47,1990,"Other Tangible Property",0,null,null,0,null,0,null,null,0,0]
[47,1995,"Contributions & Grants",-11161740,0,null,-11161740,null,656572,328286,null,984858,-10176882]
[47,2440,"Deferred Revenue5",{"$f":"+G267","v":-1500532},-450272,null,-1950804,null,44901,43142,null,88043,-1862761]
[null,null,null,null,null,null,0,null,null,null,null,0,{"$f":"G336+L336","v":0}]
[null,null,"Sub-Total",{"$f":"SUM(D290:D336)","v":95587873},{"$f":"SUM(E290:E336)","v":5538354},{"$f":"SUM(F290:F336)","v":0},{"$f":"SUM(G290:G336)","v":101126227},null,{"$f":"SUM(I290:I336)","v":-6669872},-3543991,0,-10213863,90912364]
[null,null,"Less Socialized Renewable Energy Generation Investments (input as negative)",null,null,null,{"$f":"D338+E338+F338","v":0},null,null,null,null,{"$f":"I338+J338+K338","v":0},{"$f":"G338+L338","v":0}]
[null,null,"Less Other Non Rate-Regulated Utility Assets (input as negative)",null,null,null,{"$f":"D339+E339+F339","v":0},null,null,null,null,{"$f":"I339+J339+K339","v":0},{"$f":"G339+L339","v":0}]
[null,null,"Total PP&E",{"$f":"SUM(D337:D339)","v":95587873},{"$f":"SUM(E337:E339)","v":5538354},0,101126227,null,{"$f":"SUM(I337:I339)","v":-6669872},-3543991,0,-10213863,90912364]
[null,null,"Depreciation Expense adj. from gain or loss on the retirement of assets (pool of like assets), if applicable6"]
[null,null,"Total",null,null,null,null,null,null,{"$f":"J340+J341","v":-3543991}]
[]
[null,null,null,null,null,null,null,null,"Less: Fully Allocated Depreciation"]
[10,null,"Transportation",null,null,null,null,null,"Transportation"]
[8,null,"Stores Equipment",null,null,null,null,null,"Stores Equipment"]
[null,null,null,null,null,null,null,null,"Net Depreciation",null,{"$f":"J342-K345-K346","v":-3543991}]
[]
[]
["Appendix 2-BA"]
["Fixed Asset Continuity Schedule 1 "]
[]
[null,null,null,null,"Accounting Standard","MIFRS"]
[null,null,null,null,"Year ",2017]
[]
[null,null,null,"Cost",null,null,null,null,null,"Accumulated Depreciation"]
["CCA Class 2","OEB Account 3","Description 3","Opening Balance","Additions 4","Disposals 6","Closing Balance",null,"Opening Balance","Additions","Disposals 6","Closing Balance","Net Book Value"]
["N/A",1706,"Land Rights",{"$f":"+G290","v":602307},null,null,{"$f":"D358+E358-F358","v":602307},null,{"$f":"+L290","v":0},null,null,{"$f":"I358+J358+K358","v":0},{"$f":"G358+L358","v":602307}]
[47,1725,"Poles and Fixtures",1604340,null,null,{"$f":"D359+E359-F359","v":1604340},null,-117390,-39130,null,{"$f":"I359+J359+K359","v":-156520},{"$f":"G359+L359","v":1447820}]
[47,1730,"Overhead Conductors & Devices",63894,null,null,63894,null,-5991,-1997,null,{"$f":"I360+J360+K360","v":-7988},{"$f":"G360+L360","v":55906}]
[47,1735,"Underground Conduit",870021,null,null,870021,null,-74574,-24858,null,{"$f":"I361+J361+K361","v":-99432},{"$f":"G361+L361","v":770589}]
[47,1740,"Underground Conductors & Devices",215252,null,null,215252,null,-29352,-9784,null,-39136,176116]
[12,1611,"Computer Software (Formally known as Account 1925)",0,null,null,0,null,0,null,null,{"$f":"I363+J363+K363","v":0},{"$f":"G363+L363","v":0}]
["CEC",1612,"Land Rights (Formally known as Account 1906)",0,null,null,0,null,0,null,null,{"$f":"I364+J364+K364","v":0},{"$f":"G364+L364","v":0}]
["N/A",1805,"Land",89160,null,null,89160,null,0,null,null,{"$f":"I365+J365+K365","v":0},{"$f":"G365+L365","v":89160}]
["CEC",1806,"Land Rights",173683,5268,null,178951,null,null,null,null,{"$f":"I366+J366+K366","v":0},{"$f":"G366+L366","v":178951}]
[47,1808,"Buildings",25018983,8109,null,25027092,null,{"$f":"+L299","v":-2034707},-682707,null,{"$f":"I367+J367+K367","v":-2717414},{"$f":"G367+L367","v":22309678}]
[13,1810,"Leasehold Improvements",0,null,null,0,null,0,null,null,0,0]
[47,1815,"Transformer Station Equipment >50 kV",6485565,1177041,null,7662606,null,-732289,-268381,null,-1000670,6661936]
[47,1820,"Distribution Station Equipment <50 kV",10199773,310869,null,10510642,null,-1179080,-418684,null,-1597764,8912878]
[47,1825,"Storage Battery Equipment",13722,null,null,13722,null,-1959,-653,null,-2612,11110]
[47,1830,"Poles, Towers & Fixtures",16184674,1623430,null,17808104,null,-918643,-382973,null,-1301616,16506488]
[47,1835,"Overhead Conductors & Devices",11734957,1250521,null,12985478,null,-774903,-298734,null,-1073637,11911841]
[47,1840,"Underground Conduit",3544783,117276,null,3662059,null,-664571,-233317,null,-897888,2764171]
[47,1845,"Underground Conductors & Devices",13139135,308142,null,13447277,null,-1561854,-543668,null,-2105522,11341755]
[47,1850,"Line Transformers",{"$f":"+G308-70895","v":12185546},1077745,6657,13256634,null,-805892,-324289,null,-1130181,12126453]
[47,1855,"Services (Overhead & Underground)",5709600,367032,null,6076632,null,-423354,-159718,null,-583072,5493560]
[47,1860,"Meters",4746659,91908,null,4838567,null,-1250408,-427846,null,-1678254,3160313]
[47,1860,"Meters (Smart Meters)",0,null,null,0,null,0,null,null,0,0]
["N/A",1905,"Land",0,null,null,0,null,0,null,null,0,0]
[47,1908,"Buildings & Fixtures",0,null,null,0,null,0,null,null,0,0]
[13,1910,"Leasehold Improvements",0,null,null,0,null,0,null,null,0,0]
[8,1915,"Office Furniture & Equipment (10 years)",0,null,null,0,null,0,null,null,0,0]
[8,1915,"Office Furniture & Equipment (5 years)",0,null,null,0,null,0,null,null,0,0]
[10,1920,"Computer Equipment - Hardware",0,null,null,0,null,0,null,null,0,0]
[45,1920,"Computer Equip.-Hardware(Post Mar. 22/04)",0,null,null,0,null,0,null,null,0,0]
[45.1,1920,"Computer Equip.-Hardware(Post Mar. 19/07)",0,null,null,0,null,0,null,null,0,0]
[12,1925,"Compute rSoftware",0,null,null,0,null,null,null,null,0,0]
[10,1930,"Transportation Equipment",0,null,null,0,null,{"$f":"+L321","v":0},null,null,0,0]
[8,1935,"Stores Equipment",0,null,null,0,null,0,null,null,0,0]
[8,1940,"Tools, Shop & Garage Equipment",0,null,null,0,null,0,null,null,0,0]
[8,1945,"Measurement & Testing Equipment",0,null,null,0,null,0,null,null,0,0]
[8,1950,"Power Operated Equipment",0,null,null,0,null,0,null,null,0,0]
[8,1955,"Communications Equipment",0,null,null,0,null,0,null,null,0,0]
[8,1955,"Communication Equipment (Smart Meters)",0,null,null,0,null,0,null,null,0,0]
[8,1960,"Miscellaneous Equipment ",0,null,null,0,null,0,null,null,0,0]
[47,1970,"Load Management Controls Customer Premises",0,null,null,0,null,0,null,null,0,0]
[47,1975,"Load Management Controls Utility Premises",0,null,null,0,null,0,null,null,0,0]
[47,1980,"System Supervisor Equipment",1585822,14852,null,1600674,null,-711797,-240850,null,-952647,648027]
[47,1985,"Miscellaneous Fixed Assets",0,null,null,0,null,0,null,null,0,0]
[47,1990,"Other Tangible Property",0,null,null,0,null,0,null,null,0,0]
[47,1995,"Contributions & Grants",-11161740,0,null,-11161740,null,984858,328286,null,1313144,-9848596]
[47,2440,"Deferred Revenue5",-1950804,-1136727,null,-3087531,null,88043,62979,null,{"$f":"I403+J403+K403","v":151022},{"$f":"G403+L403","v":-2936509}]
[null,null,null,null,null,null,{"$f":"D404+E404+F404","v":0},null,null,null,null,{"$f":"I404+J404+K404","v":0},{"$f":"G404+L404","v":0}]
[null,null,"Sub-Total",{"$f":"SUM(D358:D404)","v":101055332},{"$f":"SUM(E358:E404)","v":5215466},{"$f":"SUM(F358:F404)","v":6657},{"$f":"SUM(G358:G404)","v":106264141},null,{"$f":"SUM(I358:I404)","v":-10213863},{"$f":"SUM(J358:J404)","v":-3666324},{"$f":"SUM(K358:K404)","v":0},{"$f":"SUM(L358:L404)","v":-13880187},{"$f":"SUM(M358:M404)","v":92383954}]
[null,2055,"Work in Progress",null,37675,null,{"$f":"D406+E406+F406","v":37675},null,null,null,null,{"$f":"I406+J406+K406","v":0},{"$f":"G406+L406","v":37675}]
[null,null,"Less Other Non Rate-Regulated Utility Assets (input as negative)",null,null,null,0,null,null,null,null,0,0]
[null,null,"Total PP&E",{"$f":"SUM(D405:D407)","v":101055332},{"$f":"SUM(E405:E407)","v":5253141},6657,106301816,null,{"$f":"SUM(I405:I407)","v":-10213863},-3666324,0,-13880187,92421629]
[null,null,"Depreciation Expense adj. from gain or loss on the retirement of assets (pool of like assets), if applicable6"]
[null,null,"Total",null,null,null,null,null,null,{"$f":"J408+J409","v":-3666324}]
[]
[null,null,null,null,null,null,null,null,"Less: Fully Allocated Depreciation"]
[10,null,"Transportation",null,null,null,null,null,"Transportation"]
[8,null,"Stores Equipment",null,null,null,null,null,"Stores Equipment"]
[null,null,null,null,null,null,null,null,"Net Depreciation",null,{"$f":"J410-K413-K414","v":-3666324}]
[]
[]
["Appendix 2-BA"]
["Fixed Asset Continuity Schedule 1 "]
[]
[null,null,null,null,"Accounting Standard","MIFRS"]
[null,null,null,null,"Year ",2018]
[]
[null,null,null,"Cost",null,null,null,null,null,"Accumulated Depreciation"]
["CCA Class 2","OEB Account 3","Description 3","Opening Balance","Additions 4","Disposals 6","Closing Balance",null,"Opening Balance","Additions","Disposals 6","Closing Balance","Net Book Value"]
["N/A",1706,"Land Rights",{"$f":"+G358","v":602307},null,null,{"$f":"D426+E426+F426","v":602307},null,{"$f":"+L358","v":0},null,null,{"$f":"I426+J426+K426","v":0},{"$f":"G426+L426","v":602307}]
[47,1725,"Poles and Fixtures",1604340,null,null,{"$f":"D427+E427+F427","v":1604340},null,-156520,-39130,null,{"$f":"I427+J427+K427","v":-195650},{"$f":"G427+L427","v":1408690}]
[47,1730,"Overhead Conductors & Devices",63894,null,null,{"$f":"D428+E428+F428","v":63894},null,-7988,-1997,null,{"$f":"I428+J428+K428","v":-9985},{"$f":"G428+L428","v":53909}]
[47,1735,"Underground Conduit",870021,null,null,{"$f":"D429+E429+F429","v":870021},null,-99432,-24858,null,{"$f":"I429+J429+K429","v":-124290},{"$f":"G429+L429","v":745731}]
[47,1740,"Underground Conductors & Devices",215252,null,null,215252,null,-39136,-9784,null,-48920,166332]
[12,1611,"Computer Software (Formally known as Account 1925)",0,null,null,{"$f":"D431+E431+F431","v":0},null,0,null,null,{"$f":"I431+J431+K431","v":0},{"$f":"G431+L431","v":0}]
["CEC",1612,"Land Rights (Formally known as Account 1906)",0,null,null,{"$f":"D432+E432+F432","v":0},null,0,null,null,{"$f":"I432+J432+K432","v":0},{"$f":"G432+L432","v":0}]
["N/A",1805,"Land",89160,null,null,{"$f":"D433+E433+F433","v":89160},null,0,null,null,{"$f":"I433+J433+K433","v":0},{"$f":"G433+L433","v":89160}]
["CEC",1806,"Land Rights",178951,1621,null,{"$f":"D434+E434+F434","v":180572},null,null,null,null,{"$f":"I434+J434+K434","v":0},{"$f":"G434+L434","v":180572}]
[47,1808,"Buildings",25027092,63099,null,{"$f":"D435+E435+F435","v":25090191},null,{"$f":"+L367","v":-2717414},-683596,null,{"$f":"I435+J435+K435","v":-3401010},{"$f":"G435+L435","v":21689181}]
[13,1810,"Leasehold Improvements",0,null,null,0,null,0,null,null,0,0]
[47,1815,"Transformer Station Equipment >50 kV",7662606,122779,null,7785385,null,-1000670,-266269,null,-1266939,6518446]
[47,1820,"Distribution Station Equipment <50 kV",10510642,526035,null,11036677,null,-1597764,-437296,null,-2035060,9001617]
[47,1825,"Storage Battery Equipment",13722,null,null,13722,null,-2612,-653,null,-3265,10457]
[47,1830,"Poles, Towers & Fixtures",17808104,1586992,null,19395096,null,-1301616,-413255,null,-1714871,17680225]
[47,1835,"Overhead Conductors & Devices",12985478,1034718,null,14020196,null,-1073637,-311493,null,-1385130,12635066]
[47,1840,"Underground Conduit",3662059,214630,null,3876689,null,-897888,-239532,null,-1137420,2739269]
[47,1845,"Underground Conductors & Devices",13447277,352285,null,13799562,null,-2105522,-553859,null,-2659381,11140181]
[47,1850,"Line Transformers",13256634,1272911,null,14529545,null,-1130181,-352997,null,-1483178,13046367]
[47,1855,"Services (Overhead & Underground)",6076632,457483,null,6534115,null,-583072,-171479,null,-754551,5779564]
[47,1860,"Meters",4838567,146036,null,4984603,null,-1678254,-443908,null,-2122162,2862441]
[47,1860,"Meters (Smart Meters)",0,null,null,0,null,0,null,null,0,0]
["N/A",1905,"Land",0,null,null,0,null,0,null,null,0,0]
[47,1908,"Buildings & Fixtures",0,null,null,0,null,0,null,null,0,0]
[13,1910,"Leasehold Improvements",0,null,null,0,null,0,null,null,0,0]
[8,1915,"Office Furniture & Equipment (10 years)",0,null,null,0,null,0,null,null,0,0]
[8,1915,"Office Furniture & Equipment (5 years)",0,null,null,0,null,0,null,null,0,0]
[10,1920,"Computer Equipment - Hardware",0,null,null,0,null,0,null,null,0,0]
[45,1920,"Computer Equip.-Hardware(Post Mar. 22/04)",0,null,null,0,null,0,null,null,0,0]
[45.1,1920,"Computer Equip.-Hardware(Post Mar. 19/07)",0,null,null,0,null,0,null,null,0,0]
[12,1925,"Compute rSoftware",0,null,null,0,null,null,null,null,0,0]
[10,1930,"Transportation Equipment",0,null,null,0,null,{"$f":"+L389","v":0},null,null,0,0]
[8,1935,"Stores Equipment",0,null,null,0,null,0,null,null,0,0]
[8,1940,"Tools, Shop & Garage Equipment",0,null,null,0,null,0,null,null,0,0]
[8,1945,"Measurement & Testing Equipment",0,null,null,0,null,0,null,null,0,0]
[8,1950,"Power Operated Equipment",0,null,null,0,null,0,null,null,0,0]
[8,1955,"Communications Equipment",0,null,null,0,null,0,null,null,0,0]
[8,1955,"Communication Equipment (Smart Meters)",0,null,null,0,null,0,null,null,0,0]
[8,1960,"Miscellaneous Equipment ",0,null,null,0,null,0,null,null,0,0]
[47,1970,"Load Management Controls Customer Premises",0,null,null,0,null,0,null,null,0,0]
[47,1975,"Load Management Controls Utility Premises",0,null,null,0,null,0,null,null,0,0]
[47,1980,"System Supervisor Equipment",1600674,29766,null,1630440,null,-952647,-241432,null,-1194079,436361]
[47,1985,"Miscellaneous Fixed Assets",0,null,null,0,null,0,null,null,0,0]
[47,1990,"Other Tangible Property",0,null,null,0,null,0,null,null,0,0]
[47,1995,"Contributions & Grants",-11161740,0,null,-11161740,null,1313144,328286,null,1641430,-9520310,null,407583]
[47,2440,"Deferred Revenue5",-3087531,-450000,null,-3537531,null,151022,79297,null,{"$f":"I471+J471+K471","v":230319},{"$f":"G471+L471","v":-3307212}]
[null,null,null,null,null,null,{"$f":"D472+E472+F472","v":0},null,null,null,null,{"$f":"I472+J472+K472","v":0},{"$f":"G472+L472","v":0}]
[null,null,"Sub-Total",{"$f":"SUM(D426:D472)","v":106264141},{"$f":"SUM(E426:E472)","v":5358355},{"$f":"SUM(F426:F472)","v":0},{"$f":"SUM(G426:G472)","v":111622496},null,{"$f":"SUM(I426:I472)","v":-13880187},{"$f":"SUM(J426:J472)","v":-3783955},{"$f":"SUM(K426:K472)","v":0},{"$f":"SUM(L426:L472)","v":-17664142},{"$f":"SUM(M426:M472)","v":93958354}]
[null,2055,"Work in Progress",{"$f":"+G406","v":37675},null,null,{"$f":"D474+E474+F474","v":37675},null,null,null,null,{"$f":"I474+J474+K474","v":0},{"$f":"G474+L474","v":37675}]
[null,null,"Less Other Non Rate-Regulated Utility Assets (input as negative)",null,null,null,0,null,null,null,null,0,0]
[null,null,"Total PP&E",{"$f":"SUM(D473:D475)","v":106301816},{"$f":"SUM(E473:E475)","v":5358355},0,111660171,null,{"$f":"SUM(I473:I475)","v":-13880187},-3783955,0,-17664142,93996029]
[null,null,"Depreciation Expense adj. from gain or loss on the retirement of assets (pool of like assets), if applicable6"]
[null,null,"Total",null,null,null,null,null,null,{"$f":"J476+J477","v":-3783955}]
[]
[null,null,null,null,null,null,null,null,"Less: Fully Allocated Depreciation"]
[10,null,"Transportation",null,null,null,null,null,"Transportation"]
[8,null,"Stores Equipment",null,null,null,null,null,"Stores Equipment"]
[null,null,null,null,null,null,null,null,"Net Depreciation",null,{"$f":"J478-K481-K482","v":-3783955}]
[]
[]
[]
[]
["Notes:"]
[]
[1,"Tables in the format outlined above covering all fixed asset accounts should be submitted for the Test Year, Bridge Year and all relevant historical years.  At a minimum , the applicant must provide data for the earlier of: 1) all historical years back to its last rebasing; or 2) at least three years of historical actuals, in addition to Bridge Year and Test Year forecasts."]
[]
[]
[2,"The \"CCA Class\" for fixed assets should agree with the CCA Class used for tax purposes in Tax Returns. Fixed Assets sub-components may be used where the underlying asset components are classified under multiple CCA Classes for tax purposes. If an applicant uses any different classes from those shown in the table, an explanation should be provided. (also see note 3)."]
[]
[]
[3,"The table may need to be customized for a utility's asset categories or for any new asset accounts announced or authorized by the Board."]
[]
[4,"The additions in column (E) must not include construction work in progress (CWIP)."]
[]
[5,"Effective on the date of IFRS adoption, customer contributions will no longer be recorded in Account 1995 Contributions & Grants, but will be recorded in Account 2440, Deferred Revenues.  "]
[]
[6,"The applicant must ensure that all asset disposals have been clearly identified in the Chapter 2 Appendices for all historic, bridge and test years.  Where a distributor for general financial reporting purposes under IFRS has accounted for the amount of gain or loss on the retirement of assets in a pool of like assets as a charge or credit to income, for reporting and rate application filings, the distributor shall reclassify such gains and losses as depreciation expense, and disclose the amount separately."]

{"sheet":"Appendix 2-BB Service Life  ","index":10,"n_rows":119,"n_cols":17,"rows_kept":119,"cut":false,"hidden":false,"merged":[[118,1,118,2],[0,15,0,16],[1,15,1,16],[2,15,2,16],[3,15,3,16],[4,15,4,16],[6,15,6,16],[14,11,14,12],[14,13,14,14],[35,2,35,4],[14,2,14,4],[14,5,14,7],[14,9,15,9],[14,10,15,10],[8,0,8,16],[9,0,9,16],[10,0,10,16],[14,15,14,16],[15,2,15,4],[40,3,40,4],[41,2,41,4],[42,2,42,4],[16,0,36,0],[16,1,19,1],[16,3,16,4],[18,3,19,3],[26,2,26,4],[28,2,28,4],[29,2,29,4],[30,2,30,4],[32,2,32,4],[34,2,34,4],[33,2,33,4],[16,2,19,2],[17,3,17,4],[31,2,31,4],[27,2,27,4],[20,1,22,1],[20,2,22,2],[20,3,20,4],[21,3,22,3],[23,1,25,1],[23,2,25,2],[23,3,23,4],[24,3,25,3],[36,2,36,4],[53,2,53,4],[64,2,64,4],[66,1,67,1],[66,2,67,2],[66,3,66,4],[67,3,67,4],[43,1,45,1],[43,2,45,2],[43,3,43,4],[44,3,44,4],[45,3,45,4],[46,1,47,1],[46,3,46,4],[47,3,47,4],[59,2,59,4],[61,2,61,4],[63,2,63,4],[65,2,65,4],[52,2,52,4],[37,2,37,4],[68,2,68,4],[54,2,54,4],[55,0,80,0],[55,2,55,4],[56,2,56,4],[57,2,57,4],[58,2,58,4],[60,2,60,4],[62,2,62,4],[74,2,74,4],[75,2,75,4],[77,2,77,4],[79,2,79,4],[80,2,80,4],[38,0,54,0],[38,1,40,1],[38,2,40,2],[38,3,38,4],[39,3,39,4],[48,2,48,4],[49,2,49,4],[50,2,50,4],[51,2,51,4],[84,0,84,7],[86,2,86,4],[86,5,87,7],[86,9,87,9],[90,6,90,7],[91,3,91,4],[91,6,91,7],[81,2,81,4],[69,2,69,4],[70,2,70,4],[72,1,73,1],[72,2,73,2],[72,3,72,4],[73,3,73,4],[89,1,91,1],[89,2,91,2],[89,3,89,4],[78,2,78,4],[71,2,71,4],[76,2,76,4],[92,2,92,4],[92,6,92,7],[93,2,93,4],[93,5,93,7],[86,13,86,14],[86,15,86,16],[87,2,87,4],[88,2,88,4],[88,6,88,7],[86,10,87,10],[86,11,86,12],[89,6,89,7],[90,3,90,4],[98,1,99,1],[98,2,99,2],[98,3,98,4],[98,6,98,7],[99,3,99,4],[99,6,99,7],[94,1,97,1],[94,2,97,2],[94,3,94,4],[94,6,94,7],[95,3,95,4],[95,6,95,7],[96,3,96,4],[96,6,96,7],[97,3,97,4],[97,6,97,7],[100,1,103,1],[100,2,103,2],[100,3,100,4],[100,6,100,7],[101,3,101,4],[101,6,101,7],[102,3,102,4],[102,6,102,7],[103,3,103,4],[103,6,103,7],[106,2,106,4],[106,6,106,7],[107,2,107,4],[107,6,107,7],[108,2,108,4],[108,6,108,7],[104,1,105,1],[104,2,105,2],[104,3,104,4],[104,6,104,7],[105,3,105,4],[105,6,105,7],[112,2,112,4],[112,6,112,7],[115,0,115,7],[109,2,109,4],[109,6,109,7],[110,2,110,4],[110,6,110,7],[111,2,111,4],[111,6,111,7]]}
[null,null,null,null,null,null,null,null,null,null,null,null,null,"File Number:",null,{"$f":"'LDC Info'!E16","v":"EB-2017-0071"}]
[null,null,null,null,null,null,null,null,null,null,null,null,null,"Exhibit:",null,2]
[null,null,null,null,null,null,null,null,null,null,null,null,null,"Tab:"]
[null,null,null,null,null,null,null,null,null,null,null,null,null,"Schedule:"]
[null,null,null,null,null,null,null,null,null,null,null,null,null,"Page:",null,"Page 77 or Appendix 10"]
[]
[null,null,null,null,null,null,null,null,null,null,null,null,null,"Date:",null,"2018-03-29"]
[]
["Appendix 2-BB"]
["Service Life Comparison"]
["Table F-1 from Kinetrics Report1"]
[]
[]
[]
[null,null,"Asset Details",null,null,"Useful Life",null,null,null,"USoA Account Number","USoA Account Description","Current",null,"Proposed",null,"Outside Range of Min, Max TUL?"]
["Parent*","#","Category| Component | Type",null,null,"MIN UL","TUL","MAX UL",null,null,null,"Years","Rate","Years","Rate","Below Min TUL","Above Max TUL"]
["OH",1,"Fully Dressed Wood Poles","Overall",null,35,45,75,null,1830,"Poles, Towers and Fixtures",45,{"$f":"IF(ISERROR(1/L17), \"\", 1/L17)","v":2.2222222222222223E-2},45,{"$f":"IF(ISERROR(1/N17), \"\", 1/N17)","v":2.2222222222222223E-2},{"$f":"IF(ISBLANK(N17),\"\",IF(N17<F17,\"Yes\",\"No\"))","v":"No"},{"$f":"IF(ISBLANK(N17),\"\",IF(N17>H17,\"Yes\",\"No\"))","v":"No"}]
[null,null,null,"Overall",null,35,45,75,null,1725,"Poles, Towers and Fixtures",45,null,45]
[null,null,null,"Cross Arm","Wood",20,40,55,null,null,null,null,{"$f":"IF(ISERROR(1/L19), \"\", 1/L19)","v":""},null,{"$f":"IF(ISERROR(1/N19), \"\", 1/N19)","v":""},{"$f":"IF(ISBLANK(N19),\"\",IF(N19<F19,\"Yes\",\"No\"))","v":""},{"$f":"IF(ISBLANK(N19),\"\",IF(N19>H19,\"Yes\",\"No\"))","v":""}]
[null,null,null,null,"Steel",30,70,95,null,null,null,null,"",null,"","",""]
[null,2,"Fully Dressed Concrete Poles","Overall",null,50,60,80,null,null,null,null,"",null,"","",""]
[null,null,null,"Cross Arm","Wood",20,40,55,null,null,null,null,"",null,"","",""]
[null,null,null,null,"Steel",30,70,95,null,null,null,null,"",null,"","",""]
[null,3,"Fully Dressed Steel Poles","Overall",null,60,60,80,null,null,null,null,"",null,"","",""]
[null,null,null,"Cross Arm","Wood",20,40,55,null,null,null,null,"",null,"","",""]
[null,null,null,null,"Steel",30,70,95,null,null,null,null,"",null,"","",""]
[null,4,"OH Line Switch",null,null,30,45,55,null,null,null,null,"",null,"","",""]
[null,4,"OH Line Switch",null,null,30,45,55,null,null,null,null,{"$f":"IF(ISERROR(1/L28), \"\", 1/L28)","v":""},null,{"$f":"IF(ISERROR(1/N28), \"\", 1/N28)","v":""},{"$f":"IF(ISBLANK(N28),\"\",IF(N28<F28,\"Yes\",\"No\"))","v":""},{"$f":"IF(ISBLANK(N28),\"\",IF(N28>H28,\"Yes\",\"No\"))","v":""}]
[null,5,"OH Line Switch Motor",null,null,15,25,25,null,null,null,null,"",null,"","",""]
[null,6,"OH Line Switch RTU",null,null,15,20,20,null,null,null,null,"",null,"","",""]
[null,7,"OH Integral Switches",null,null,35,45,60,null,null,null,null,"",null,"","",""]
[null,7,"OH Integral Switches",null,null,35,45,60,null,null,null,null,{"$f":"IF(ISERROR(1/L32), \"\", 1/L32)","v":""},null,{"$f":"IF(ISERROR(1/N32), \"\", 1/N32)","v":""},{"$f":"IF(ISBLANK(N32),\"\",IF(N32<F32,\"Yes\",\"No\"))","v":""},{"$f":"IF(ISBLANK(N32),\"\",IF(N32>H32,\"Yes\",\"No\"))","v":""}]
[null,8,"OH Conductors",null,null,50,60,75,null,1835,"Overhead Conductors and Devices",60,1.6666666666666666E-2,60,1.6666666666666666E-2,"No","No"]
[null,8,"OH Conductors",null,null,50,60,75,null,1730,"Overhead Conductors and Devices",45,null,45]
[null,9,"OH Transformers & Voltage Regulators",null,null,30,40,60,null,1850,"Line Transformers",40,2.5000000000000001E-2,40,2.5000000000000001E-2,"No","No"]
[null,10,"OH Shunt Capacitor Banks",null,null,25,30,40,null,null,null,null,"",null,"","",""]
[null,11,"Reclosers",null,null,25,40,55,null,null,null,null,"",null,"","",""]
[null,11,"Reclosers",null,null,25,40,55,null,1730,"Overhead Conductors and Devices",45,{"$f":"IF(ISERROR(1/L38), \"\", 1/L38)","v":2.2222222222222223E-2},45,{"$f":"IF(ISERROR(1/N38), \"\", 1/N38)","v":2.2222222222222223E-2},{"$f":"IF(ISBLANK(N38),\"\",IF(N38<F38,\"Yes\",\"No\"))","v":"No"},{"$f":"IF(ISBLANK(N38),\"\",IF(N38>H38,\"Yes\",\"No\"))","v":"No"}]
["TS & MS",12,"Power Transformers","Overall",null,30,45,60,null,1820,"Distribution Station Equipment<50kV",40,2.5000000000000001E-2,40,2.5000000000000001E-2,"No","No"]
[null,null,null,"Bushing",null,10,20,30,null,null,null,null,"",null,"","",""]
[null,null,null,"Tap Changer",null,20,30,60,null,null,null,null,"",null,"","",""]
[null,13,"Station Service Transformer",null,null,30,45,55,null,1820,"Distribution Station Equipment<50kV",40,2.5000000000000001E-2,40,2.5000000000000001E-2,"No","No"]
[null,14,"Station Grounding Transformer",null,null,30,40,40,null,null,null,null,"",null,"","",""]
[null,15,"Station DC System","Overall",null,10,20,30,null,null,null,null,"",null,"","",{"$f":"IF(ISBLANK(N44),\"\",IF(N44>H44,\"Yes\",\"No\"))","v":""}]
[null,null,null,"Battery Bank",null,10,15,15,null,null,null,null,"",null,"","",""]
[null,null,null,"Charger",null,20,20,30,null,null,null,null,"",null,"","",""]
[null,16,"Station Metal Clad Switchgear","Overall",null,30,40,60,null,1820,"Distribution Station Equipment<50kV",40,2.5000000000000001E-2,40,2.5000000000000001E-2,"No","No"]
[null,null,null,"Removable Breaker",null,25,40,60,null,null,null,null,"",null,"","",""]
[null,17,"Station Independent Breakers",null,null,35,45,65,null,1820,"Distribution Station Equipment<50kV",40,2.5000000000000001E-2,40,2.5000000000000001E-2,"No","No"]
[null,18,"Station Switch",null,null,30,50,60,null,1820,"Distribution Station Equipment<50kV",40,2.5000000000000001E-2,40,2.5000000000000001E-2,"No","No"]
[null,19,"Electromechanical Relays",null,null,25,35,50,null,null,null,null,"",null,"","",""]
[null,20,"Solid State Relays",null,null,10,30,45,null,null,null,null,"",null,"","",""]
[null,21,"Digital & Numeric Relays",null,null,15,20,20,null,null,null,null,"",null,"","",""]
[null,22,"Rigid Busbars",null,null,30,55,60,null,null,null,null,"",null,"","",""]
[null,23,"Steel Structure",null,null,35,50,90,null,null,null,null,"",null,"","",""]
["UG",24,"Primary Paper Insulated Lead Covered (PILC) Cables",null,null,60,65,75,null,null,null,null,"",null,"","",""]
[null,25,"Primary Ethylene-Propylene Rubber (EPR) Cables",null,null,20,25,25,null,null,null,null,"",null,"","",""]
[null,26,"Primary Non-Tree Retardant (TR) Cross Linked \nPolyethylene (XLPE) Cables Direct Buried",null,null,20,25,30,null,null,null,null,"",null,"","",""]
[null,27,"Primary Non-TR XLPE Cables in Duct",null,null,20,25,30,null,null,null,null,"",null,"","",""]
[null,27,"Primary Non-TR XLPE Cables in Duct",null,null,20,25,30,null,1740,"Underground Conductors and Devices",25,{"$f":"IF(ISERROR(1/L60), \"\", 1/L60)","v":0.04},25,{"$f":"IF(ISERROR(1/N60), \"\", 1/N60)","v":0.04},{"$f":"IF(ISBLANK(N60),\"\",IF(N60<F60,\"Yes\",\"No\"))","v":"No"},{"$f":"IF(ISBLANK(N60),\"\",IF(N60>H60,\"Yes\",\"No\"))","v":"No"}]
[null,30,"Secondary PILC Cables",null,null,70,75,80,null,null,null,null,"",null,"","",""]
[null,30,"Secondary PILC Cables",null,null,70,75,80,null,null,null,null,{"$f":"IF(ISERROR(1/L62), \"\", 1/L62)","v":""},null,{"$f":"IF(ISERROR(1/N62), \"\", 1/N62)","v":""},{"$f":"IF(ISBLANK(N62),\"\",IF(N62<F62,\"Yes\",\"No\"))","v":""},{"$f":"IF(ISBLANK(N62),\"\",IF(N62>H62,\"Yes\",\"No\"))","v":""}]
[null,31,"Secondary Cables Direct Buried",null,null,25,35,40,null,1845,"Underground Conductors and Devices",40,2.5000000000000001E-2,40,2.5000000000000001E-2,"No","No"]
[null,31,"Secondary Cables Direct Buried",null,null,25,35,40,null,1740,"Underground Conductors and Devices",25,{"$f":"IF(ISERROR(1/L64), \"\", 1/L64)","v":0.04},25,{"$f":"IF(ISERROR(1/N64), \"\", 1/N64)","v":0.04},{"$f":"IF(ISBLANK(N64),\"\",IF(N64<F64,\"Yes\",\"No\"))","v":"No"},{"$f":"IF(ISBLANK(N64),\"\",IF(N64>H64,\"Yes\",\"No\"))","v":"No"}]
[null,32,"Secondary Cables in Duct",null,null,35,40,60,null,1845,"Underground Conductors and Devices",40,2.5000000000000001E-2,40,2.5000000000000001E-2,"No","No"]
[null,32,"Secondary Cables in Duct",null,null,35,40,60,null,null,null,null,{"$f":"IF(ISERROR(1/L66), \"\", 1/L66)","v":""},null,{"$f":"IF(ISERROR(1/N66), \"\", 1/N66)","v":""},{"$f":"IF(ISBLANK(N66),\"\",IF(N66<F66,\"Yes\",\"No\"))","v":""},{"$f":"IF(ISBLANK(N66),\"\",IF(N66>H66,\"Yes\",\"No\"))","v":""}]
[null,33,"Network Tranformers","Overall",null,20,35,50,null,null,null,null,"",null,"","",""]
[null,null,null,"Protector",null,20,35,40,null,null,null,null,"",null,"","",""]
[null,34,"Pad-Mounted Transformers",null,null,25,40,45,null,1850,"Line Transformers",40,2.5000000000000001E-2,40,2.5000000000000001E-2,"No","No"]
[null,35,"Submersible/Vault Transformers",null,null,25,35,45,null,null,null,null,"",null,"","",""]
[null,36,"UG Foundation",null,null,35,55,70,null,1840,"Underground Conduit",50,0.02,50,0.02,"No","No"]
[null,36,"UG Foundation",null,null,35,55,70,null,1735,"Underground Conduit",40,{"$f":"IF(ISERROR(1/L72), \"\", 1/L72)","v":2.5000000000000001E-2},40,{"$f":"IF(ISERROR(1/N72), \"\", 1/N72)","v":2.5000000000000001E-2},{"$f":"IF(ISBLANK(N72),\"\",IF(N72<F72,\"Yes\",\"No\"))","v":"No"},{"$f":"IF(ISBLANK(N72),\"\",IF(N72>H72,\"Yes\",\"No\"))","v":"No"}]
[null,37,"UG Vaults","Overall",null,40,60,80,null,null,null,null,"",null,"","",""]
[null,null,null,"Roof",null,20,30,45,null,null,null,null,"",null,"","",""]
[null,38,"UG Vault Switches",null,null,20,35,50,null,null,null,null,"",null,"","",""]
[null,39,"Pad-Mounted Switchgear",null,null,20,30,45,null,1845,"Underground Conductors and Devices",40,2.5000000000000001E-2,40,2.5000000000000001E-2,"No","No"]
[null,39,"Pad-Mounted Switchgear",null,null,20,30,45,null,1740,"Underground Conductors and Devices",25,{"$f":"IF(ISERROR(1/L77), \"\", 1/L77)","v":0.04},25,{"$f":"IF(ISERROR(1/N77), \"\", 1/N77)","v":0.04},{"$f":"IF(ISBLANK(N77),\"\",IF(N77<F77,\"Yes\",\"No\"))","v":"No"},{"$f":"IF(ISBLANK(N77),\"\",IF(N77>H77,\"Yes\",\"No\"))","v":"No"}]
[null,40,"Ducts",null,null,30,50,85,null,1840,"Underground Conduit",50,0.02,50,0.02,"No","No"]
[null,40,"Ducts",null,null,30,50,85,null,1735,"Underground Conduit",40,{"$f":"IF(ISERROR(1/L79), \"\", 1/L79)","v":2.5000000000000001E-2},40,{"$f":"IF(ISERROR(1/N79), \"\", 1/N79)","v":2.5000000000000001E-2},{"$f":"IF(ISBLANK(N79),\"\",IF(N79<F79,\"Yes\",\"No\"))","v":"No"},{"$f":"IF(ISBLANK(N79),\"\",IF(N79>H79,\"Yes\",\"No\"))","v":"No"}]
[null,41,"Concrete Encased Duct Banks",null,null,35,55,80,null,null,null,null,"",null,"","",""]
[null,42,"Cable Chambers",null,null,50,60,80,null,null,null,null,"",null,"","",""]
["S",43,"Remote SCADA",null,null,15,20,30,null,1980,"System Supervisory Equipment",20,0.05,20,0.05,"No","No"]
[]
[]
["Table F-2 from Kinetrics Report1"]
[]
[null,null,"Asset Details",null,null,"Useful Life Range",null,null,null,"USoA Account Number","USoA Account Description","Current",null,"Proposed",null,"Outside Range of Min, Max TUL?"]
[null,"#","Category| Component | Type",null,null,null,null,null,null,null,null,"Years","Rate","Years","Rate","Below Min Range","Above Max Range"]
[null,1,"Office Equipment",null,null,5,15,null,null,null,null,null,{"$f":"IF(ISERROR(1/L89), \"\", 1/L89)","v":""},null,{"$f":"IF(ISERROR(1/N89), \"\", 1/N89)","v":""},{"$f":"IF(ISBLANK(N89),\"\",IF(N89<F89,\"Yes\",\"No\"))","v":""},{"$f":"IF(ISBLANK(N89),\"\",IF(N89>G89,\"Yes\",\"No\"))","v":""}]
[null,2,"Vehicles","Trucks & Buckets",null,5,15,null,null,null,null,null,{"$f":"IF(ISERROR(1/L90), \"\", 1/L90)","v":""},null,{"$f":"IF(ISERROR(1/N90), \"\", 1/N90)","v":""},{"$f":"IF(ISBLANK(N90),\"\",IF(N90<F90,\"Yes\",\"No\"))","v":""},{"$f":"IF(ISBLANK(N90),\"\",IF(N90>G90,\"Yes\",\"No\"))","v":""}]
[null,null,null,"Trailers",null,5,20,null,null,null,null,null,"",null,"","",""]
[null,null,null,"Vans",null,5,10,null,null,null,null,null,"",null,"","",""]
[null,3,"Administrative Buildings",null,null,50,75,null,null,1808,"Buildings and Fixtures",50,0.02,50,0.02,"No","No"]
[null,4,"Leasehold Improvements",null,null,"Lease dependent",null,null,null,null,null,null,"",null,""]
[null,5,"Station Buildings","Station Buildings",null,50,75,null,null,null,null,null,"",null,"","",""]
[null,null,null,"Parking",null,25,30,null,null,null,null,null,"",null,"","",""]
[null,null,null,"Fence",null,25,60,null,null,null,null,null,"",null,"","",""]
[null,null,null,"Roof",null,20,30,null,null,null,null,null,"",null,"","",""]
[null,6,"Computer Equipment","Hardware",null,3,5,null,null,1920,"Computer Equipment-Hardware",5,0.2,5,0.2,"No","No"]
[null,null,null,"Software",null,2,5,null,null,1925,"Computer Software",5,0.2,5,0.2,"No","No"]
[null,7,"Equipment","Power Operated",null,5,10,null,null,null,null,null,"",null,"","",""]
[null,null,null,"Stores",null,5,10,null,null,null,null,null,"",null,"","",""]
[null,null,null,"Tools, Shop, Garage Equipment",null,5,10,null,null,null,null,null,"",null,"","",""]
[null,null,null,"Measurement & Testing Equipment",null,5,10,null,null,null,null,null,"",null,"","",""]
[null,8,"Communication","Towers",null,60,70,null,null,null,null,null,"",null,"","",""]
[null,null,null,"Wireless",null,2,10,null,null,null,null,null,"",null,"","",""]
[null,9,"Residential Energy Meters",null,null,25,35,null,null,null,null,null,"",null,"","",""]
[null,10,"Industrial/Commercial Energy Meters",null,null,25,35,null,null,null,null,null,"",null,"","",""]
[null,11,"Wholesale Energy Meters",null,null,15,30,null,null,1860,"Meters",15,6.6666666666666666E-2,15,6.6666666666666666E-2,"No","No"]
[null,12,"Current & Potential Transformer (CT & PT)",null,null,35,50,null,null,null,null,null,"",null,"","",""]
[null,13,"Smart Meters",null,null,5,15,null,null,1860,"Meters",15,6.6666666666666666E-2,15,6.6666666666666666E-2,"No","No"]
[null,14,"Repeaters - Smart Metering",null,null,10,15,null,null,1860,"Meters",15,6.6666666666666666E-2,15,6.6666666666666666E-2,"No","No"]
[null,15,"Data Collectors - Smart Metering",null,null,15,20,null,null,1860,"Meters",15,6.6666666666666666E-2,15,6.6666666666666666E-2,"No","No"]
[]
[]
["* TS & MS = Transformer and Municipal Stations UG = Underground Systems S = Monitoring and Control Systems"]
[]
["Note 1:","Tables F-1 and F-2 above are to be used as a reference in order to complete columns J, K, L and N."]
[null,"See pages 17-19 of Kinetrics Report"]

{"sheet":"App.2-C_DepExp","index":11,"n_rows":360,"n_cols":25,"rows_kept":360,"cut":false,"hidden":false,"merged":[[312,0,313,0],[312,1,313,1],[14,0,14,1],[14,2,14,16],[15,0,15,1],[15,2,15,16],[20,2,20,8],[20,9,20,12],[20,13,20,16],[21,0,22,0],[21,1,22,1],[248,0,248,1],[248,2,248,16],[249,0,249,1],[249,2,249,16],[250,0,250,1],[250,2,250,16],[253,2,253,8],[253,9,253,12],[253,13,253,16],[254,0,255,0],[254,1,255,1],[189,0,189,1],[189,2,189,16],[190,0,190,1],[190,2,190,16],[191,0,191,1],[191,2,191,16],[137,2,137,8],[137,9,137,12],[137,13,137,16],[138,0,139,0],[138,1,139,1],[132,2,132,16],[133,0,133,1],[133,2,133,16],[134,0,134,1],[134,2,134,16],[196,0,197,0],[196,1,197,1],[8,0,8,18],[9,0,9,18],[10,0,10,18],[131,0,131,1],[131,2,131,16],[75,0,75,1],[75,2,75,16],[76,0,76,1],[76,2,76,16],[73,0,73,1],[73,2,73,16],[74,0,74,1],[192,0,192,1],[192,2,192,16],[247,0,247,1],[247,2,247,16],[74,2,74,16],[16,0,16,1],[16,2,16,16],[17,0,17,1],[17,2,17,16],[79,2,79,8],[79,9,79,12],[79,13,79,16],[80,0,81,0],[80,1,81,1],[132,0,132,1],[195,2,195,8],[195,9,195,12],[195,13,195,16],[305,0,305,1],[305,2,305,16],[306,0,306,1],[306,2,306,16],[307,0,307,1],[307,2,307,16],[308,0,308,1],[308,2,308,16],[311,2,311,8],[311,9,311,12],[311,13,311,16]]}
[]
[]
[]
[]
[]
[]
[]
[]
["Appendix 2-C",null,null,null,null,null,null,null,null,null,null,null,null,null,null,null,null,null,null,null,null,null,null,null,"CGAAP"]
["Depreciation and Amortization Expense",null,null,null,null,null,null,null,null,null,null,null,null,null,null,null,null,null,null,null,null,null,null,null,"Revised CGAAP"]
[null,null,null,null,null,null,null,null,null,null,null,null,null,null,null,null,null,null,null,null,null,null,null,null,"MIFRS"]
["This appendix is to be completed in conjunction with the accounting instructions in Appendix 2-B"]
[]
[]
["Scenario that applies",null,"Applicable Years and Accounting Standard",null,null,null,null,null,null,null,null,null,null,null,null,null,null,"Year Reflected in Schedule Below","Accounting Standard Reflected in Schedule Below",null,null,null,null,null,2012]
["Rebasing for the first time with depreciation policy changes made in 2012.",null,"This appendix must be duplicated and completed for the years 2012 to 2018. The appendix for 2012 is to be completed under CGAAP (prior to changes in depreciation policies). The appendix for 2012 to 2014 must be completed under Revised CGAAP (after changes in depreciation policies). The appendix for 2014 to 2018 is to be completed under MIFRS (2014 if changes to MIFRS are material).",null,null,null,null,null,null,null,null,null,null,null,null,null,null,null,null,null,null,null,null,null,2013]
["Rebasing for the first time with depreciation policy changes made in 2013.",null,"This appendix must be duplicated and completed for the years 2013 to 2018. The appendix for 2013 is to be completed under CGAAP (prior to changes in depreciation policies). The appendix for 2013 to 2014 must be completed under Revised CGAAP (after changes in depreciation policies). The appendix for 2014 to 2018 is to be completed under MIFRS (2014 if changes to MIFRS are material).",null,null,null,null,null,null,null,null,null,null,null,null,null,null,null,null,null,null,null,null,null,2014]
["Already rebased with depreciation policy changes in a prior rate application",null,"This appendix must be completed for 2014 to 2018. The appendix for 2014 is to be completed under Revised CGAAP (after changes in depreciation policies). The appendix for 2014 to 2018 is to be completed under MIFRS (2014 if changes to MIFRS are material).",null,null,null,null,null,null,null,null,null,null,null,null,null,null,2014,"Revised CGAAP",null,null,null,null,null,2015]
[null,null,null,null,null,null,null,null,null,null,null,null,null,null,null,null,null,null,null,null,null,null,null,null,2016]
[null,null,null,null,null,null,null,null,null,null,null,null,null,null,null,null,null,null,null,null,null,null,null,null,2017]
[null,null,"Book Values",null,null,null,null,null,null,"Service Lives",null,null,null,"Depreciation Expense",null,null,null,null,null,null,null,null,null,null,2018]
["Account","Description","Opening Net  Book Value of Existing Assets as at Date of Policy Change (Jan. 1) 1","Less Fully Depreciated 7","Net Amount of Existing Assets Before Policy Change to be Depreciated ","Opening Gross Book Value of Assets Acquired After Policy Change 2","Less Fully Depreciated 8","Net Amount of Assets Acquired After Policy Change to be Depreciated ","Current Year Additions","Average Remaining Life of Assets Existing Before Policy Change 3","Depreciation Rate Assets Acquired After Policy Change","Life of Assets Acquired After Policy Change 4","Depreciation Rate on New Additions","Depreciation Expense on Assets Existing Before Policy Change","Depreciation Expense on Assets Acquired After Policy Change","Depreciation Expense on Current Year Additions 5","Total Current Year Depreciation Expense ","Depreciation Expense per Appendix 2-BA Fixed Assets, Column J \n ","Variance 6"]
[null,null,"a","b","c = a-b","d","e","f = d- e","g","h","i = 1/h","j","k = 1/j","l = c/h","m = f/j","n = g*0.5/j","o = l+m+n","p","q = p-o"]
[1706,"Land Rights",{"$f":"SUMIF('App.2-BA_Fixed Asset Cont'!$B$154:$B$199,'App.2-C_DepExp'!A24,'App.2-BA_Fixed Asset Cont'!$D$154:$D$199)","v":602307},null,{"$f":"C24-D24","v":602307},null,null,{"$f":"F24-G24","v":0},{"$f":"SUMIF('App.2-BA_Fixed Asset Cont'!$B$154:$B$199,'App.2-C_DepExp'!A24,'App.2-BA_Fixed Asset Cont'!$E$154:$E$199)","v":0},null,{"$f":"IF(J24=0,0,1/J24)","v":0},0,{"$f":"IF(L24=0,0,1/L24)","v":0},{"$f":"IF(J24=0,0,+E24/J24)","v":0},{"$f":"IF(L24=0,0,+H24/L24)","v":0},{"$f":"IF(L24=0,0,+(I24*0.5)/L24)","v":0},{"$f":"IF(ISERROR(+N24+O24+P24), 0, +N24+O24+P24)","v":0},{"$f":"-SUMIF('App.2-BA_Fixed Asset Cont'!$B$154:$B$199,'App.2-C_DepExp'!A24,'App.2-BA_Fixed Asset Cont'!$J$154:$J$199)","v":0},{"$f":"IF(ISERROR(+R24-122), 0, +R24-Q24)","v":0}]
[1725,"Poles and Fixtures",{"$f":"SUMIF('App.2-BA_Fixed Asset Cont'!$B$154:$B$199,'App.2-C_DepExp'!A25,'App.2-BA_Fixed Asset Cont'!$D$154:$D$199)","v":1604340},null,1604340,null,null,0,{"$f":"SUMIF('App.2-BA_Fixed Asset Cont'!$B$154:$B$199,'App.2-C_DepExp'!A25,'App.2-BA_Fixed Asset Cont'!$E$154:$E$199)","v":0},41,2.4390243902439025E-2,45,2.2222222222222223E-2,39130.243902439026,0,0,39130.243902439026,{"$f":"-SUMIF('App.2-BA_Fixed Asset Cont'!$B$154:$B$199,'App.2-C_DepExp'!A25,'App.2-BA_Fixed Asset Cont'!$J$154:$J$199)","v":39130},{"$f":"IF(ISERROR(+R25-122), 0, +R25-Q25)","v":-0.24390243902598741}]
[1730,"Overhead Conductors & Devices",{"$f":"SUMIF('App.2-BA_Fixed Asset Cont'!$B$154:$B$199,'App.2-C_DepExp'!A26,'App.2-BA_Fixed Asset Cont'!$D$154:$D$199)","v":63894},null,63894,null,null,0,{"$f":"SUMIF('App.2-BA_Fixed Asset Cont'!$B$154:$B$199,'App.2-C_DepExp'!A26,'App.2-BA_Fixed Asset Cont'!$E$154:$E$199)","v":0},32,3.125E-2,45,2.2222222222222223E-2,1996.6875,0,0,1996.6875,{"$f":"-SUMIF('App.2-BA_Fixed Asset Cont'!$B$154:$B$199,'App.2-C_DepExp'!A26,'App.2-BA_Fixed Asset Cont'!$J$154:$J$199)","v":1997},{"$f":"IF(ISERROR(+R26-122), 0, +R26-Q26)","v":0.3125}]
[1735,"Underground Conduit",{"$f":"SUMIF('App.2-BA_Fixed Asset Cont'!$B$154:$B$199,'App.2-C_DepExp'!A27,'App.2-BA_Fixed Asset Cont'!$D$154:$D$199)","v":870021},null,870021,null,null,0,{"$f":"SUMIF('App.2-BA_Fixed Asset Cont'!$B$154:$B$199,'App.2-C_DepExp'!A27,'App.2-BA_Fixed Asset Cont'!$E$154:$E$199)","v":0},35,2.8571428571428571E-2,40,2.5000000000000001E-2,24857.742857142857,0,0,24857.742857142857,{"$f":"-SUMIF('App.2-BA_Fixed Asset Cont'!$B$154:$B$199,'App.2-C_DepExp'!A27,'App.2-BA_Fixed Asset Cont'!$J$154:$J$199)","v":24858},0.2571428571427532]
[1740,"Underground Conductors & Devices",{"$f":"SUMIF('App.2-BA_Fixed Asset Cont'!$B$154:$B$199,'App.2-C_DepExp'!A28,'App.2-BA_Fixed Asset Cont'!$D$154:$D$199)","v":215252},null,215252,null,null,0,{"$f":"SUMIF('App.2-BA_Fixed Asset Cont'!$B$154:$B$199,'App.2-C_DepExp'!A28,'App.2-BA_Fixed Asset Cont'!$E$154:$E$199)","v":0},22,4.5454545454545456E-2,25,0.04,9784.181818181818,0,0,9784.181818181818,{"$f":"-SUMIF('App.2-BA_Fixed Asset Cont'!$B$154:$B$199,'App.2-C_DepExp'!A28,'App.2-BA_Fixed Asset Cont'!$J$154:$J$199)","v":9784},-0.18181818181801646]
[1611,"Computer Software (Formally known as Account 1925)",{"$f":"SUMIF('App.2-BA_Fixed Asset Cont'!$B$154:$B$199,'App.2-C_DepExp'!A29,'App.2-BA_Fixed Asset Cont'!$D$154:$D$199)","v":0},null,{"$f":"C29-D29","v":0},null,null,{"$f":"F29-G29","v":0},{"$f":"SUMIF('App.2-BA_Fixed Asset Cont'!$B$154:$B$199,'App.2-C_DepExp'!A29,'App.2-BA_Fixed Asset Cont'!$E$154:$E$199)","v":0},0,{"$f":"IF(J29=0,0,1/J29)","v":0},0,{"$f":"IF(L29=0,0,1/L29)","v":0},{"$f":"IF(J29=0,0,+E29/J29)","v":0},{"$f":"IF(L29=0,0,+H29/L29)","v":0},{"$f":"IF(L29=0,0,+(I29*0.5)/L29)","v":0},{"$f":"IF(ISERROR(+N29+O29+P29), 0, +N29+O29+P29)","v":0},{"$f":"-SUMIF('App.2-BA_Fixed Asset Cont'!$B$154:$B$199,'App.2-C_DepExp'!A29,'App.2-BA_Fixed Asset Cont'!$J$154:$J$199)","v":0},{"$f":"IF(ISERROR(+R29-122), 0, +R29-Q29)","v":0}]
[1612,"Land Rights (Formally known as Account 1906)",{"$f":"SUMIF('App.2-BA_Fixed Asset Cont'!$B$154:$B$199,'App.2-C_DepExp'!A30,'App.2-BA_Fixed Asset Cont'!$D$154:$D$199)","v":0},null,{"$f":"C30-D30","v":0},null,null,{"$f":"F30-G30","v":0},{"$f":"SUMIF('App.2-BA_Fixed Asset Cont'!$B$154:$B$199,'App.2-C_DepExp'!A30,'App.2-BA_Fixed Asset Cont'!$E$154:$E$199)","v":0},0,{"$f":"IF(J30=0,0,1/J30)","v":0},0,{"$f":"IF(L30=0,0,1/L30)","v":0},{"$f":"IF(J30=0,0,+E30/J30)","v":0},{"$f":"IF(L30=0,0,+H30/L30)","v":0},{"$f":"IF(L30=0,0,+(I30*0.5)/L30)","v":0},{"$f":"IF(ISERROR(+N30+O30+P30), 0, +N30+O30+P30)","v":0},{"$f":"-SUMIF('App.2-BA_Fixed Asset Cont'!$B$154:$B$199,'App.2-C_DepExp'!A30,'App.2-BA_Fixed Asset Cont'!$J$154:$J$199)","v":0},{"$f":"IF(ISERROR(+R30-122), 0, +R30-Q30)","v":0}]
[1805,"Land",{"$f":"SUMIF('App.2-BA_Fixed Asset Cont'!$B$154:$B$199,'App.2-C_DepExp'!A31,'App.2-BA_Fixed Asset Cont'!$D$154:$D$199)","v":89160},null,89160,null,null,0,{"$f":"SUMIF('App.2-BA_Fixed Asset Cont'!$B$154:$B$199,'App.2-C_DepExp'!A31,'App.2-BA_Fixed Asset Cont'!$E$154:$E$199)","v":0},0,0,0,0,0,{"$f":"IF(L31=0,0,+H31/L31)","v":0},0,0,{"$f":"-SUMIF('App.2-BA_Fixed Asset Cont'!$B$154:$B$199,'App.2-C_DepExp'!A31,'App.2-BA_Fixed Asset Cont'!$J$154:$J$199)","v":0},0]
[1806,"Land Rights",{"$f":"SUMIF('App.2-BA_Fixed Asset Cont'!$B$154:$B$199,'App.2-C_DepExp'!A32,'App.2-BA_Fixed Asset Cont'!$D$154:$D$199)","v":154128},null,154128,null,null,0,{"$f":"SUMIF('App.2-BA_Fixed Asset Cont'!$B$154:$B$199,'App.2-C_DepExp'!A32,'App.2-BA_Fixed Asset Cont'!$E$154:$E$199)","v":6798},0,0,0,0,0,0,0,0,{"$f":"-SUMIF('App.2-BA_Fixed Asset Cont'!$B$154:$B$199,'App.2-C_DepExp'!A32,'App.2-BA_Fixed Asset Cont'!$J$154:$J$199)","v":0},0]
[1808,"Buildings",{"$f":"SUMIF('App.2-BA_Fixed Asset Cont'!$B$154:$B$199,'App.2-C_DepExp'!A33,'App.2-BA_Fixed Asset Cont'!$D$154:$D$199)","v":24624967},null,24624967,null,null,0,{"$f":"SUMIF('App.2-BA_Fixed Asset Cont'!$B$154:$B$199,'App.2-C_DepExp'!A33,'App.2-BA_Fixed Asset Cont'!$E$154:$E$199)","v":244854},36.598100000000002,2.7323822821403294E-2,50,0.02,672848.23529090302,0,2448.54,675296.77529090305,{"$f":"-SUMIF('App.2-BA_Fixed Asset Cont'!$B$154:$B$199,'App.2-C_DepExp'!A33,'App.2-BA_Fixed Asset Cont'!$J$154:$J$199)","v":675297},{"$f":"IF(ISERROR(+R33-122), 0, +R33-Q33)","v":0.22470909694675356}]
[1810,"Leasehold Improvements",{"$f":"SUMIF('App.2-BA_Fixed Asset Cont'!$B$154:$B$199,'App.2-C_DepExp'!A34,'App.2-BA_Fixed Asset Cont'!$D$154:$D$199)","v":0},null,0,null,null,0,{"$f":"SUMIF('App.2-BA_Fixed Asset Cont'!$B$154:$B$199,'App.2-C_DepExp'!A34,'App.2-BA_Fixed Asset Cont'!$E$154:$E$199)","v":0},0,0,0,0,0,0,0,0,{"$f":"-SUMIF('App.2-BA_Fixed Asset Cont'!$B$154:$B$199,'App.2-C_DepExp'!A34,'App.2-BA_Fixed Asset Cont'!$J$154:$J$199)","v":0},{"$f":"IF(ISERROR(+R34-122), 0, +R34-Q34)","v":0}]
[1815,"Transformer Station Equipment >50 kV",{"$f":"SUMIF('App.2-BA_Fixed Asset Cont'!$B$154:$B$199,'App.2-C_DepExp'!A35,'App.2-BA_Fixed Asset Cont'!$D$154:$D$199)","v":5491722},null,5491722,null,null,0,{"$f":"SUMIF('App.2-BA_Fixed Asset Cont'!$B$154:$B$199,'App.2-C_DepExp'!A35,'App.2-BA_Fixed Asset Cont'!$E$154:$E$199)","v":617923},24,4.1666666666666664E-2,40,2.5000000000000001E-2,228821.75,0,7724.0375000000004,236545.78750000001,{"$f":"-SUMIF('App.2-BA_Fixed Asset Cont'!$B$154:$B$199,'App.2-C_DepExp'!A35,'App.2-BA_Fixed Asset Cont'!$J$154:$J$199)","v":236546},0.21249999999417923]
[1820,"Distribution Station Equipment <50 kV",{"$f":"SUMIF('App.2-BA_Fixed Asset Cont'!$B$154:$B$199,'App.2-C_DepExp'!A36,'App.2-BA_Fixed Asset Cont'!$D$154:$D$199)","v":7812618},null,7812618,null,null,0,{"$f":"SUMIF('App.2-BA_Fixed Asset Cont'!$B$154:$B$199,'App.2-C_DepExp'!A36,'App.2-BA_Fixed Asset Cont'!$E$154:$E$199)","v":1245158},22,4.5454545454545456E-2,40,2.5000000000000001E-2,355119,0,15564.475,370683.47499999998,{"$f":"-SUMIF('App.2-BA_Fixed Asset Cont'!$B$154:$B$199,'App.2-C_DepExp'!A36,'App.2-BA_Fixed Asset Cont'!$J$154:$J$199)","v":370683},-0.47499999997671694]
[1825,"Storage Battery Equipment",{"$f":"SUMIF('App.2-BA_Fixed Asset Cont'!$B$154:$B$199,'App.2-C_DepExp'!A37,'App.2-BA_Fixed Asset Cont'!$D$154:$D$199)","v":13722},null,13722,null,null,0,{"$f":"SUMIF('App.2-BA_Fixed Asset Cont'!$B$154:$B$199,'App.2-C_DepExp'!A37,'App.2-BA_Fixed Asset Cont'!$E$154:$E$199)","v":0},21,4.7619047619047616E-2,30,3.3333333333333333E-2,653.42857142857144,0,0,653.42857142857144,{"$f":"-SUMIF('App.2-BA_Fixed Asset Cont'!$B$154:$B$199,'App.2-C_DepExp'!A37,'App.2-BA_Fixed Asset Cont'!$J$154:$J$199)","v":653},-0.42857142857144481]
[1830,"Poles, Towers & Fixtures",{"$f":"SUMIF('App.2-BA_Fixed Asset Cont'!$B$154:$B$199,'App.2-C_DepExp'!A38,'App.2-BA_Fixed Asset Cont'!$D$154:$D$199)","v":10446415},null,10446415,null,null,0,{"$f":"SUMIF('App.2-BA_Fixed Asset Cont'!$B$154:$B$199,'App.2-C_DepExp'!A38,'App.2-BA_Fixed Asset Cont'!$E$154:$E$199)","v":2281968},44,2.2727272727272728E-2,45,2.2222222222222223E-2,237418.52272727274,0,25355.200000000001,262773.72272727272,{"$f":"-SUMIF('App.2-BA_Fixed Asset Cont'!$B$154:$B$199,'App.2-C_DepExp'!A38,'App.2-BA_Fixed Asset Cont'!$J$154:$J$199)","v":262774},0.27727272728225216]
[1835,"Overhead Conductors & Devices",{"$f":"SUMIF('App.2-BA_Fixed Asset Cont'!$B$154:$B$199,'App.2-C_DepExp'!A39,'App.2-BA_Fixed Asset Cont'!$D$154:$D$199)","v":8345730},null,8345730,null,null,0,{"$f":"SUMIF('App.2-BA_Fixed Asset Cont'!$B$154:$B$199,'App.2-C_DepExp'!A39,'App.2-BA_Fixed Asset Cont'!$E$154:$E$199)","v":960049},36,2.7777777777777776E-2,60,1.6666666666666666E-2,231825.83333333334,0,8000.4083333333338,239826.24166666667,{"$f":"-SUMIF('App.2-BA_Fixed Asset Cont'!$B$154:$B$199,'App.2-C_DepExp'!A39,'App.2-BA_Fixed Asset Cont'!$J$154:$J$199)","v":239826},-0.24166666666860692]
[1840,"Underground Conduit",{"$f":"SUMIF('App.2-BA_Fixed Asset Cont'!$B$154:$B$199,'App.2-C_DepExp'!A40,'App.2-BA_Fixed Asset Cont'!$D$154:$D$199)","v":2546031},null,2546031,null,null,0,{"$f":"SUMIF('App.2-BA_Fixed Asset Cont'!$B$154:$B$199,'App.2-C_DepExp'!A40,'App.2-BA_Fixed Asset Cont'!$E$154:$E$199)","v":282137},12,8.3333333333333329E-2,50,0.02,212169.25,0,2821.37,214990.62,{"$f":"-SUMIF('App.2-BA_Fixed Asset Cont'!$B$154:$B$199,'App.2-C_DepExp'!A40,'App.2-BA_Fixed Asset Cont'!$J$154:$J$199)","v":214991},0.38000000000465661]
[1845,"Underground Conductors & Devices",{"$f":"SUMIF('App.2-BA_Fixed Asset Cont'!$B$154:$B$199,'App.2-C_DepExp'!A41,'App.2-BA_Fixed Asset Cont'!$D$154:$D$199)","v":11437100},null,11437100,null,null,0,{"$f":"SUMIF('App.2-BA_Fixed Asset Cont'!$B$154:$B$199,'App.2-C_DepExp'!A41,'App.2-BA_Fixed Asset Cont'!$E$154:$E$199)","v":582719},23,4.3478260869565216E-2,40,2.5000000000000001E-2,497265.21739130432,0,7283.9875000000002,504549.20489130431,{"$f":"-SUMIF('App.2-BA_Fixed Asset Cont'!$B$154:$B$199,'App.2-C_DepExp'!A41,'App.2-BA_Fixed Asset Cont'!$J$154:$J$199)","v":504549},-0.20489130431087688]
[1850,"Line Transformers",{"$f":"SUMIF('App.2-BA_Fixed Asset Cont'!$B$154:$B$199,'App.2-C_DepExp'!A42,'App.2-BA_Fixed Asset Cont'!$D$154:$D$199)","v":9204093},null,9204093,null,null,0,{"$f":"SUMIF('App.2-BA_Fixed Asset Cont'!$B$154:$B$199,'App.2-C_DepExp'!A42,'App.2-BA_Fixed Asset Cont'!$E$154:$E$199)","v":645934},39,2.564102564102564E-2,40,2.5000000000000001E-2,236002.38461538462,0,8074.1750000000002,244076.55961538461,{"$f":"-SUMIF('App.2-BA_Fixed Asset Cont'!$B$154:$B$199,'App.2-C_DepExp'!A42,'App.2-BA_Fixed Asset Cont'!$J$154:$J$199)","v":244077},0.44038461538730189]
[1855,"Services (Overhead & Underground)",{"$f":"SUMIF('App.2-BA_Fixed Asset Cont'!$B$154:$B$199,'App.2-C_DepExp'!A43,'App.2-BA_Fixed Asset Cont'!$D$154:$D$199)","v":4460589},null,4460589,null,null,0,{"$f":"SUMIF('App.2-BA_Fixed Asset Cont'!$B$154:$B$199,'App.2-C_DepExp'!A43,'App.2-BA_Fixed Asset Cont'!$E$154:$E$199)","v":541557},36,2.7777777777777776E-2,40,2.5000000000000001E-2,123905.25,0,6769.4624999999996,130674.71249999999,{"$f":"-SUMIF('App.2-BA_Fixed Asset Cont'!$B$154:$B$199,'App.2-C_DepExp'!A43,'App.2-BA_Fixed Asset Cont'!$J$154:$J$199)","v":130675},0.28750000000582077]
[1860,"Meters",0,null,0,null,null,0,0,null,0,null,0,0,0,0,0,0,0]
[1860,"Meters (Smart Meters)",{"$f":"SUMIF('App.2-BA_Fixed Asset Cont'!$B$154:$B$199,'App.2-C_DepExp'!A45,'App.2-BA_Fixed Asset Cont'!$D$154:$D$199)","v":4468973},null,4468973,null,null,0,{"$f":"SUMIF('App.2-BA_Fixed Asset Cont'!$B$154:$B$199,'App.2-C_DepExp'!A45,'App.2-BA_Fixed Asset Cont'!$E$154:$E$199)","v":141089},11,9.0909090909090912E-2,15,6.6666666666666666E-2,406270.27272727271,0,4702.9666666666662,410973.23939393938,{"$f":"-SUMIF('App.2-BA_Fixed Asset Cont'!$B$154:$B$199,'App.2-C_DepExp'!A45,'App.2-BA_Fixed Asset Cont'!$J$154:$J$199)","v":410973},-0.23939393938053399]
[1905,"Land",{"$f":"SUMIF('App.2-BA_Fixed Asset Cont'!$B$154:$B$199,'App.2-C_DepExp'!A46,'App.2-BA_Fixed Asset Cont'!$D$154:$D$199)","v":0},null,0,null,null,0,{"$f":"SUMIF('App.2-BA_Fixed Asset Cont'!$B$154:$B$199,'App.2-C_DepExp'!A46,'App.2-BA_Fixed Asset Cont'!$E$154:$E$199)","v":0},0,0,null,0,0,0,0,0,{"$f":"-SUMIF('App.2-BA_Fixed Asset Cont'!$B$154:$B$199,'App.2-C_DepExp'!A46,'App.2-BA_Fixed Asset Cont'!$J$154:$J$199)","v":0},0]
[1908,"Buildings & Fixtures",{"$f":"SUMIF('App.2-BA_Fixed Asset Cont'!$B$154:$B$199,'App.2-C_DepExp'!A47,'App.2-BA_Fixed Asset Cont'!$D$154:$D$199)","v":0},null,0,null,null,0,{"$f":"SUMIF('App.2-BA_Fixed Asset Cont'!$B$154:$B$199,'App.2-C_DepExp'!A47,'App.2-BA_Fixed Asset Cont'!$E$154:$E$199)","v":0},0,0,null,0,0,0,0,0,{"$f":"-SUMIF('App.2-BA_Fixed Asset Cont'!$B$154:$B$199,'App.2-C_DepExp'!A47,'App.2-BA_Fixed Asset Cont'!$J$154:$J$199)","v":0},0]
[1910,"Leasehold Improvements",{"$f":"SUMIF('App.2-BA_Fixed Asset Cont'!$B$154:$B$199,'App.2-C_DepExp'!A48,'App.2-BA_Fixed Asset Cont'!$D$154:$D$199)","v":0},null,0,null,null,0,{"$f":"SUMIF('App.2-BA_Fixed Asset Cont'!$B$154:$B$199,'App.2-C_DepExp'!A48,'App.2-BA_Fixed Asset Cont'!$E$154:$E$199)","v":0},0,0,null,0,0,0,0,0,{"$f":"-SUMIF('App.2-BA_Fixed Asset Cont'!$B$154:$B$199,'App.2-C_DepExp'!A48,'App.2-BA_Fixed Asset Cont'!$J$154:$J$199)","v":0},0]
[1915,"Office Furniture & Equipment (10 years)",{"$f":"SUMIF('App.2-BA_Fixed Asset Cont'!$B$154:$B$199,'App.2-C_DepExp'!A49,'App.2-BA_Fixed Asset Cont'!$D$154:$D$199)","v":0},null,0,null,null,0,{"$f":"SUMIF('App.2-BA_Fixed Asset Cont'!$B$154:$B$199,'App.2-C_DepExp'!A49,'App.2-BA_Fixed Asset Cont'!$E$154:$E$199)","v":0},0,0,null,0,0,0,0,0,{"$f":"-SUMIF('App.2-BA_Fixed Asset Cont'!$B$154:$B$199,'App.2-C_DepExp'!A49,'App.2-BA_Fixed Asset Cont'!$J$154:$J$199)","v":0},0]
[1915,"Office Furniture & Equipment (5 years)",{"$f":"SUMIF('App.2-BA_Fixed Asset Cont'!$B$154:$B$199,'App.2-C_DepExp'!A50,'App.2-BA_Fixed Asset Cont'!$D$154:$D$199)","v":0},null,0,null,null,0,{"$f":"SUMIF('App.2-BA_Fixed Asset Cont'!$B$154:$B$199,'App.2-C_DepExp'!A50,'App.2-BA_Fixed Asset Cont'!$E$154:$E$199)","v":0},0,0,null,0,0,0,0,0,{"$f":"-SUMIF('App.2-BA_Fixed Asset Cont'!$B$154:$B$199,'App.2-C_DepExp'!A50,'App.2-BA_Fixed Asset Cont'!$J$154:$J$199)","v":0},0]
[1920,"Computer Equipment - Hardware",{"$f":"SUMIF('App.2-BA_Fixed Asset Cont'!$B$154:$B$199,'App.2-C_DepExp'!A51,'App.2-BA_Fixed Asset Cont'!$D$154:$D$199)","v":1361},null,1361,null,null,0,{"$f":"SUMIF('App.2-BA_Fixed Asset Cont'!$B$154:$B$199,'App.2-C_DepExp'!A51,'App.2-BA_Fixed Asset Cont'!$E$154:$E$199)","v":0},1,1,5,0.2,1361,0,0,1361,{"$f":"-SUMIF('App.2-BA_Fixed Asset Cont'!$B$154:$B$199,'App.2-C_DepExp'!A51,'App.2-BA_Fixed Asset Cont'!$J$154:$J$199)","v":1361},0]
[1920,"Computer Equip.-Hardware(Post Mar. 22/04)",0,null,0,null,null,0,{"$f":"SUMIF('App.2-BA_Fixed Asset Cont'!$B$154:$B$199,'App.2-C_DepExp'!A52,'App.2-BA_Fixed Asset Cont'!$E$154:$E$199)","v":0},0,0,5,0.2,0,0,0,0,0,0]
[1920,"Computer Equip.-Hardware(Post Mar. 19/07)",0,null,0,null,null,0,{"$f":"SUMIF('App.2-BA_Fixed Asset Cont'!$B$154:$B$199,'App.2-C_DepExp'!A53,'App.2-BA_Fixed Asset Cont'!$E$154:$E$199)","v":0},0,0,5,0.2,0,0,0,0,0,0]
[1925,"Computer Software",{"$f":"SUMIF('App.2-BA_Fixed Asset Cont'!$B$154:$B$199,'App.2-C_DepExp'!A54,'App.2-BA_Fixed Asset Cont'!$D$154:$D$199)","v":105974},null,105974,null,null,0,{"$f":"SUMIF('App.2-BA_Fixed Asset Cont'!$B$154:$B$199,'App.2-C_DepExp'!A54,'App.2-BA_Fixed Asset Cont'!$E$154:$E$199)","v":0},1,1,5,0.2,105974,0,0,105974,{"$f":"-SUMIF('App.2-BA_Fixed Asset Cont'!$B$154:$B$199,'App.2-C_DepExp'!A54,'App.2-BA_Fixed Asset Cont'!$J$154:$J$199)","v":105974},0]
[1930,"Transportation Equipment",{"$f":"SUMIF('App.2-BA_Fixed Asset Cont'!$B$154:$B$199,'App.2-C_DepExp'!A55,'App.2-BA_Fixed Asset Cont'!$D$154:$D$199)","v":0},null,0,null,null,0,{"$f":"SUMIF('App.2-BA_Fixed Asset Cont'!$B$154:$B$199,'App.2-C_DepExp'!A55,'App.2-BA_Fixed Asset Cont'!$E$154:$E$199)","v":0},0,0,null,0,0,0,0,0,{"$f":"-SUMIF('App.2-BA_Fixed Asset Cont'!$B$154:$B$199,'App.2-C_DepExp'!A55,'App.2-BA_Fixed Asset Cont'!$J$154:$J$199)","v":0},0]
[1935,"Stores Equipment",{"$f":"SUMIF('App.2-BA_Fixed Asset Cont'!$B$154:$B$199,'App.2-C_DepExp'!A56,'App.2-BA_Fixed Asset Cont'!$D$154:$D$199)","v":0},null,0,null,null,0,{"$f":"SUMIF('App.2-BA_Fixed Asset Cont'!$B$154:$B$199,'App.2-C_DepExp'!A56,'App.2-BA_Fixed Asset Cont'!$E$154:$E$199)","v":0},0,0,null,0,0,0,0,0,{"$f":"-SUMIF('App.2-BA_Fixed Asset Cont'!$B$154:$B$199,'App.2-C_DepExp'!A56,'App.2-BA_Fixed Asset Cont'!$J$154:$J$199)","v":0},0]
[1940,"Tools, Shop & Garage Equipment",{"$f":"SUMIF('App.2-BA_Fixed Asset Cont'!$B$154:$B$199,'App.2-C_DepExp'!A57,'App.2-BA_Fixed Asset Cont'!$D$154:$D$199)","v":0},null,0,null,null,0,{"$f":"SUMIF('App.2-BA_Fixed Asset Cont'!$B$154:$B$199,'App.2-C_DepExp'!A57,'App.2-BA_Fixed Asset Cont'!$E$154:$E$199)","v":0},0,0,null,0,0,0,0,0,{"$f":"-SUMIF('App.2-BA_Fixed Asset Cont'!$B$154:$B$199,'App.2-C_DepExp'!A57,'App.2-BA_Fixed Asset Cont'!$J$154:$J$199)","v":0},0]
[1945,"Measurement & Testing Equipment",{"$f":"SUMIF('App.2-BA_Fixed Asset Cont'!$B$154:$B$199,'App.2-C_DepExp'!A58,'App.2-BA_Fixed Asset Cont'!$D$154:$D$199)","v":0},null,0,null,null,0,{"$f":"SUMIF('App.2-BA_Fixed Asset Cont'!$B$154:$B$199,'App.2-C_DepExp'!A58,'App.2-BA_Fixed Asset Cont'!$E$154:$E$199)","v":0},0,0,null,0,0,0,0,0,{"$f":"-SUMIF('App.2-BA_Fixed Asset Cont'!$B$154:$B$199,'App.2-C_DepExp'!A58,'App.2-BA_Fixed Asset Cont'!$J$154:$J$199)","v":0},0]
[1950,"Power Operated Equipment",{"$f":"SUMIF('App.2-BA_Fixed Asset Cont'!$B$154:$B$199,'App.2-C_DepExp'!A59,'App.2-BA_Fixed Asset Cont'!$D$154:$D$199)","v":0},null,0,null,null,0,{"$f":"SUMIF('App.2-BA_Fixed Asset Cont'!$B$154:$B$199,'App.2-C_DepExp'!A59,'App.2-BA_Fixed Asset Cont'!$E$154:$E$199)","v":0},0,0,null,0,0,0,0,0,{"$f":"-SUMIF('App.2-BA_Fixed Asset Cont'!$B$154:$B$199,'App.2-C_DepExp'!A59,'App.2-BA_Fixed Asset Cont'!$J$154:$J$199)","v":0},0]
[1955,"Communications Equipment",{"$f":"SUMIF('App.2-BA_Fixed Asset Cont'!$B$154:$B$199,'App.2-C_DepExp'!A60,'App.2-BA_Fixed Asset Cont'!$D$154:$D$199)","v":0},null,0,null,null,0,{"$f":"SUMIF('App.2-BA_Fixed Asset Cont'!$B$154:$B$199,'App.2-C_DepExp'!A60,'App.2-BA_Fixed Asset Cont'!$E$154:$E$199)","v":0},0,0,null,0,0,0,0,0,{"$f":"-SUMIF('App.2-BA_Fixed Asset Cont'!$B$154:$B$199,'App.2-C_DepExp'!A60,'App.2-BA_Fixed Asset Cont'!$J$154:$J$199)","v":0},0]
[1955,"Communication Equipment (Smart Meters)",{"$f":"SUMIF('App.2-BA_Fixed Asset Cont'!$B$154:$B$199,'App.2-C_DepExp'!A61,'App.2-BA_Fixed Asset Cont'!$D$154:$D$199)","v":0},null,0,null,null,0,{"$f":"SUMIF('App.2-BA_Fixed Asset Cont'!$B$154:$B$199,'App.2-C_DepExp'!A61,'App.2-BA_Fixed Asset Cont'!$E$154:$E$199)","v":0},0,0,null,0,0,0,0,0,{"$f":"-SUMIF('App.2-BA_Fixed Asset Cont'!$B$154:$B$199,'App.2-C_DepExp'!A61,'App.2-BA_Fixed Asset Cont'!$J$154:$J$199)","v":0},0]
[1960,"Miscellaneous Equipment ",{"$f":"SUMIF('App.2-BA_Fixed Asset Cont'!$B$154:$B$199,'App.2-C_DepExp'!A62,'App.2-BA_Fixed Asset Cont'!$D$154:$D$199)","v":0},null,0,null,null,0,{"$f":"SUMIF('App.2-BA_Fixed Asset Cont'!$B$154:$B$199,'App.2-C_DepExp'!A62,'App.2-BA_Fixed Asset Cont'!$E$154:$E$199)","v":0},0,0,null,0,0,0,0,0,{"$f":"-SUMIF('App.2-BA_Fixed Asset Cont'!$B$154:$B$199,'App.2-C_DepExp'!A62,'App.2-BA_Fixed Asset Cont'!$J$154:$J$199)","v":0},0]
[1970,"Load Management Controls Customer Premises",{"$f":"SUMIF('App.2-BA_Fixed Asset Cont'!$B$154:$B$199,'App.2-C_DepExp'!A63,'App.2-BA_Fixed Asset Cont'!$D$154:$D$199)","v":0},null,0,null,null,0,{"$f":"SUMIF('App.2-BA_Fixed Asset Cont'!$B$154:$B$199,'App.2-C_DepExp'!A63,'App.2-BA_Fixed Asset Cont'!$E$154:$E$199)","v":0},0,0,null,0,0,0,0,0,{"$f":"-SUMIF('App.2-BA_Fixed Asset Cont'!$B$154:$B$199,'App.2-C_DepExp'!A63,'App.2-BA_Fixed Asset Cont'!$J$154:$J$199)","v":0},0]
[1975,"Load Management Controls Utility Premises",{"$f":"SUMIF('App.2-BA_Fixed Asset Cont'!$B$154:$B$199,'App.2-C_DepExp'!A64,'App.2-BA_Fixed Asset Cont'!$D$154:$D$199)","v":0},null,0,null,null,0,{"$f":"SUMIF('App.2-BA_Fixed Asset Cont'!$B$154:$B$199,'App.2-C_DepExp'!A64,'App.2-BA_Fixed Asset Cont'!$E$154:$E$199)","v":0},0,0,null,0,0,0,0,0,{"$f":"-SUMIF('App.2-BA_Fixed Asset Cont'!$B$154:$B$199,'App.2-C_DepExp'!A64,'App.2-BA_Fixed Asset Cont'!$J$154:$J$199)","v":0},0]
[1980,"System Supervisor Equipment",{"$f":"SUMIF('App.2-BA_Fixed Asset Cont'!$B$154:$B$199,'App.2-C_DepExp'!A65,'App.2-BA_Fixed Asset Cont'!$D$154:$D$199)","v":1381611},null,1381611,null,null,0,{"$f":"SUMIF('App.2-BA_Fixed Asset Cont'!$B$154:$B$199,'App.2-C_DepExp'!A65,'App.2-BA_Fixed Asset Cont'!$E$154:$E$199)","v":156593},6,0.16666666666666666,20,0.05,230268.5,0,3914.8249999999998,234183.32500000001,{"$f":"-SUMIF('App.2-BA_Fixed Asset Cont'!$B$154:$B$199,'App.2-C_DepExp'!A65,'App.2-BA_Fixed Asset Cont'!$J$154:$J$199)","v":234183},-0.32500000001164153]
[1985,"Miscellaneous Fixed Assets",{"$f":"SUMIF('App.2-BA_Fixed Asset Cont'!$B$154:$B$199,'App.2-C_DepExp'!A66,'App.2-BA_Fixed Asset Cont'!$D$154:$D$199)","v":0},null,0,null,null,0,{"$f":"SUMIF('App.2-BA_Fixed Asset Cont'!$B$154:$B$199,'App.2-C_DepExp'!A66,'App.2-BA_Fixed Asset Cont'!$E$154:$E$199)","v":0},0,0,null,0,0,0,0,0,{"$f":"-SUMIF('App.2-BA_Fixed Asset Cont'!$B$154:$B$199,'App.2-C_DepExp'!A66,'App.2-BA_Fixed Asset Cont'!$J$154:$J$199)","v":0},0]
[1990,"Other Tangible Property",{"$f":"SUMIF('App.2-BA_Fixed Asset Cont'!$B$154:$B$199,'App.2-C_DepExp'!A67,'App.2-BA_Fixed Asset Cont'!$D$154:$D$199)","v":0},null,0,null,null,0,{"$f":"SUMIF('App.2-BA_Fixed Asset Cont'!$B$154:$B$199,'App.2-C_DepExp'!A67,'App.2-BA_Fixed Asset Cont'!$E$154:$E$199)","v":0},0,0,null,0,0,0,0,0,{"$f":"-SUMIF('App.2-BA_Fixed Asset Cont'!$B$154:$B$199,'App.2-C_DepExp'!A67,'App.2-BA_Fixed Asset Cont'!$J$154:$J$199)","v":0},0]
[1995,"Contributions & Grants",{"$f":"SUMIF('App.2-BA_Fixed Asset Cont'!$B$154:$B$199,'App.2-C_DepExp'!A68,'App.2-BA_Fixed Asset Cont'!$D$154:$D$199)","v":-11161740},null,-11161740,null,null,0,{"$f":"SUMIF('App.2-BA_Fixed Asset Cont'!$B$154:$B$199,'App.2-C_DepExp'!A68,'App.2-BA_Fixed Asset Cont'!$E$154:$E$199)","v":0},34,2.9411764705882353E-2,40,2.5000000000000001E-2,-328286.4705882353,0,0,-328286.4705882353,{"$f":"-SUMIF('App.2-BA_Fixed Asset Cont'!$B$154:$B$199,'App.2-C_DepExp'!A68,'App.2-BA_Fixed Asset Cont'!$J$154:$J$199)","v":-328286},0.47058823530096561]
[null,"Total",{"$f":"SUM(C24:C68)","v":82778268},{"$f":"SUM(D24:D68)","v":0},82778268,0,0,0,7706779,null,null,null,null,{"$f":"SUM(N24:N68)","v":3287385.0301464275},0,92659.447499999995,3380044.4776464282,3380045,0.5223535723008581]
[]
[]
[]
[]
["Scenario that applies",null,"Applicable Years and Accounting Standard",null,null,null,null,null,null,null,null,null,null,null,null,null,null,"Year Reflected in Schedule Below","Accounting Standard Reflected in Schedule Below",null,null,null,null,null,2012]
["Rebasing for the first time with depreciation policy changes made in 2012.",null,"This appendix must be duplicated and completed for the years 2012 to 2018. The appendix for 2012 is to be completed under CGAAP (prior to changes in depreciation policies). The appendix for 2012 to 2014 must be completed under Revised CGAAP (after changes in depreciation policies). The appendix for 2014 to 2018 is to be completed under MIFRS (2014 if changes to MIFRS are material).",null,null,null,null,null,null,null,null,null,null,null,null,null,null,null,null,null,null,null,null,null,2013]
["Rebasing for the first time with depreciation policy changes made in 2013.",null,"This appendix must be duplicated and completed for the years 2013 to 2018. The appendix for 2013 is to be completed under CGAAP (prior to changes in depreciation policies). The appendix for 2013 to 2014 must be completed under Revised CGAAP (after changes in depreciation policies). The appendix for 2014 to 2018 is to be completed under MIFRS (2014 if changes to MIFRS are material).",null,null,null,null,null,null,null,null,null,null,null,null,null,null,null,null,null,null,null,null,null,2014]
["Already rebased with depreciation policy changes in a prior rate application",null,"This appendix must be completed for 2014 to 2018. The appendix for 2014 is to be completed under Revised CGAAP (after changes in depreciation policies). The appendix for 2014 to 2018 is to be completed under MIFRS (2014 if changes to MIFRS are material).",null,null,null,null,null,null,null,null,null,null,null,null,null,null,2014,"MIFRS",null,null,null,null,null,2015]
[null,null,null,null,null,null,null,null,null,null,null,null,null,null,null,null,null,null,null,null,null,null,null,null,2016]
[null,null,null,null,null,null,null,null,null,null,null,null,null,null,null,null,null,null,null,null,null,null,null,null,2017]
[null,null,"Book Values",null,null,null,null,null,null,"Service Lives",null,null,null,"Depreciation Expense",null,null,null,null,null,null,null,null,null,null,2018]
["Account","Description","Opening Net  Book Value of Existing Assets as at Date of Policy Change (Jan. 1) 1","Less Fully Depreciated 7","Net Amount of Existing Assets Before Policy Change to be Depreciated ","Opening Gross Book Value of Assets Acquired After Policy Change 2","Less Fully Depreciated 8","Net Amount of Assets Acquired After Policy Change to be Depreciated ","Current Year Additions","Average Remaining Life of Assets Existing Before Policy Change 3","Depreciation Rate Assets Acquired After Policy Change","Life of Assets Acquired After Policy Change 4","Depreciation Rate on New Additions","Depreciation Expense on Assets Existing Before Policy Change","Depreciation Expense on Assets Acquired After Policy Change","Depreciation Expense on Current Year Additions 5","Total Current Year Depreciation Expense ","Depreciation Expense per Appendix 2-BA Fixed Assets, Column J \n ","Variance 6"]
[null,null,"a","b","c = a-b","d","e","f = d- e","g","h","i = 1/h","j","k = 1/j","l = c/h","m = f/j","n = g*0.5/j","o = l+m+n","p","q = p-o"]
[1706,"Land Rights",{"$f":"SUMIF('App.2-BA_Fixed Asset Cont'!$B$154:$B$199,'App.2-C_DepExp'!A83,'App.2-BA_Fixed Asset Cont'!$D$154:$D$199)","v":602307},null,{"$f":"C83-D83","v":602307},null,null,{"$f":"F83-G83","v":0},{"$f":"SUMIF('App.2-BA_Fixed Asset Cont'!$B$154:$B$199,'App.2-C_DepExp'!A83,'App.2-BA_Fixed Asset Cont'!$E$154:$E$199)","v":0},null,{"$f":"IF(J83=0,0,1/J83)","v":0},0,{"$f":"IF(L83=0,0,1/L83)","v":0},{"$f":"IF(J83=0,0,+E83/J83)","v":0},{"$f":"IF(L83=0,0,+H83/L83)","v":0},{"$f":"IF(L83=0,0,+(I83*0.5)/L83)","v":0},{"$f":"IF(ISERROR(+N83+O83+P83), 0, +N83+O83+P83)","v":0},{"$f":"-SUMIF('App.2-BA_Fixed Asset Cont'!$B$154:$B$199,'App.2-C_DepExp'!A83,'App.2-BA_Fixed Asset Cont'!$J$154:$J$199)","v":0},{"$f":"IF(ISERROR(+R83-122), 0, +R83-Q83)","v":0}]
[1725,"Poles and Fixtures",{"$f":"SUMIF('App.2-BA_Fixed Asset Cont'!$B$154:$B$199,'App.2-C_DepExp'!A84,'App.2-BA_Fixed Asset Cont'!$D$154:$D$199)","v":1604340},null,1604340,null,null,0,{"$f":"SUMIF('App.2-BA_Fixed Asset Cont'!$B$154:$B$199,'App.2-C_DepExp'!A84,'App.2-BA_Fixed Asset Cont'!$E$154:$E$199)","v":0},41,2.4390243902439025E-2,45,2.2222222222222223E-2,39130.243902439026,0,0,39130.243902439026,{"$f":"-SUMIF('App.2-BA_Fixed Asset Cont'!$B$154:$B$199,'App.2-C_DepExp'!A84,'App.2-BA_Fixed Asset Cont'!$J$154:$J$199)","v":39130},{"$f":"IF(ISERROR(+R84-122), 0, +R84-Q84)","v":-0.24390243902598741}]
[1730,"Overhead Conductors & Devices",{"$f":"SUMIF('App.2-BA_Fixed Asset Cont'!$B$154:$B$199,'App.2-C_DepExp'!A85,'App.2-BA_Fixed Asset Cont'!$D$154:$D$199)","v":63894},null,63894,null,null,0,{"$f":"SUMIF('App.2-BA_Fixed Asset Cont'!$B$154:$B$199,'App.2-C_DepExp'!A85,'App.2-BA_Fixed Asset Cont'!$E$154:$E$199)","v":0},32,3.125E-2,45,2.2222222222222223E-2,1996.6875,0,0,1996.6875,{"$f":"-SUMIF('App.2-BA_Fixed Asset Cont'!$B$154:$B$199,'App.2-C_DepExp'!A85,'App.2-BA_Fixed Asset Cont'!$J$154:$J$199)","v":1997},{"$f":"IF(ISERROR(+R85-122), 0, +R85-Q85)","v":0.3125}]
[1735,"Underground Conduit",{"$f":"SUMIF('App.2-BA_Fixed Asset Cont'!$B$154:$B$199,'App.2-C_DepExp'!A86,'App.2-BA_Fixed Asset Cont'!$D$154:$D$199)","v":870021},null,870021,null,null,0,{"$f":"SUMIF('App.2-BA_Fixed Asset Cont'!$B$154:$B$199,'App.2-C_DepExp'!A86,'App.2-BA_Fixed Asset Cont'!$E$154:$E$199)","v":0},35,2.8571428571428571E-2,40,2.5000000000000001E-2,24857.742857142857,0,0,24857.742857142857,{"$f":"-SUMIF('App.2-BA_Fixed Asset Cont'!$B$154:$B$199,'App.2-C_DepExp'!A86,'App.2-BA_Fixed Asset Cont'!$J$154:$J$199)","v":24858},0.2571428571427532]
[1740,"Underground Conductors & Devices",{"$f":"SUMIF('App.2-BA_Fixed Asset Cont'!$B$154:$B$199,'App.2-C_DepExp'!A87,'App.2-BA_Fixed Asset Cont'!$D$154:$D$199)","v":215252},null,215252,null,null,0,{"$f":"SUMIF('App.2-BA_Fixed Asset Cont'!$B$154:$B$199,'App.2-C_DepExp'!A87,'App.2-BA_Fixed Asset Cont'!$E$154:$E$199)","v":0},22,4.5454545454545456E-2,25,0.04,9784.181818181818,0,0,9784.181818181818,{"$f":"-SUMIF('App.2-BA_Fixed Asset Cont'!$B$154:$B$199,'App.2-C_DepExp'!A87,'App.2-BA_Fixed Asset Cont'!$J$154:$J$199)","v":9784},-0.18181818181801646]
[1611,"Computer Software (Formally known as Account 1925)",{"$f":"SUMIF('App.2-BA_Fixed Asset Cont'!$B$154:$B$199,'App.2-C_DepExp'!A88,'App.2-BA_Fixed Asset Cont'!$D$154:$D$199)","v":0},null,{"$f":"C88-D88","v":0},null,null,{"$f":"F88-G88","v":0},{"$f":"SUMIF('App.2-BA_Fixed Asset Cont'!$B$154:$B$199,'App.2-C_DepExp'!A88,'App.2-BA_Fixed Asset Cont'!$E$154:$E$199)","v":0},0,{"$f":"IF(J88=0,0,1/J88)","v":0},0,{"$f":"IF(L88=0,0,1/L88)","v":0},{"$f":"IF(J88=0,0,+E88/J88)","v":0},{"$f":"IF(L88=0,0,+H88/L88)","v":0},{"$f":"IF(L88=0,0,+(I88*0.5)/L88)","v":0},{"$f":"IF(ISERROR(+N88+O88+P88), 0, +N88+O88+P88)","v":0},{"$f":"-SUMIF('App.2-BA_Fixed Asset Cont'!$B$154:$B$199,'App.2-C_DepExp'!A88,'App.2-BA_Fixed Asset Cont'!$J$154:$J$199)","v":0},{"$f":"IF(ISERROR(+R88-122), 0, +R88-Q88)","v":0}]
[1612,"Land Rights (Formally known as Account 1906)",{"$f":"SUMIF('App.2-BA_Fixed Asset Cont'!$B$154:$B$199,'App.2-C_DepExp'!A89,'App.2-BA_Fixed Asset Cont'!$D$154:$D$199)","v":0},null,{"$f":"C89-D89","v":0},null,null,{"$f":"F89-G89","v":0},{"$f":"SUMIF('App.2-BA_Fixed Asset Cont'!$B$154:$B$199,'App.2-C_DepExp'!A89,'App.2-BA_Fixed Asset Cont'!$E$154:$E$199)","v":0},0,{"$f":"IF(J89=0,0,1/J89)","v":0},0,{"$f":"IF(L89=0,0,1/L89)","v":0},{"$f":"IF(J89=0,0,+E89/J89)","v":0},{"$f":"IF(L89=0,0,+H89/L89)","v":0},{"$f":"IF(L89=0,0,+(I89*0.5)/L89)","v":0},{"$f":"IF(ISERROR(+N89+O89+P89), 0, +N89+O89+P89)","v":0},{"$f":"-SUMIF('App.2-BA_Fixed Asset Cont'!$B$154:$B$199,'App.2-C_DepExp'!A89,'App.2-BA_Fixed Asset Cont'!$J$154:$J$199)","v":0},{"$f":"IF(ISERROR(+R89-122), 0, +R89-Q89)","v":0}]
[1805,"Land",{"$f":"SUMIF('App.2-BA_Fixed Asset Cont'!$B$154:$B$199,'App.2-C_DepExp'!A90,'App.2-BA_Fixed Asset Cont'!$D$154:$D$199)","v":89160},null,89160,null,null,0,{"$f":"SUMIF('App.2-BA_Fixed Asset Cont'!$B$154:$B$199,'App.2-C_DepExp'!A90,'App.2-BA_Fixed Asset Cont'!$E$154:$E$199)","v":0},0,0,0,0,0,{"$f":"IF(L90=0,0,+H90/L90)","v":0},0,0,{"$f":"-SUMIF('App.2-BA_Fixed Asset Cont'!$B$154:$B$199,'App.2-C_DepExp'!A90,'App.2-BA_Fixed Asset Cont'!$J$154:$J$199)","v":0},0]
[1806,"Land Rights",{"$f":"SUMIF('App.2-BA_Fixed Asset Cont'!$B$154:$B$199,'App.2-C_DepExp'!A91,'App.2-BA_Fixed Asset Cont'!$D$154:$D$199)","v":154128},null,154128,null,null,0,{"$f":"SUMIF('App.2-BA_Fixed Asset Cont'!$B$154:$B$199,'App.2-C_DepExp'!A91,'App.2-BA_Fixed Asset Cont'!$E$154:$E$199)","v":6798},0,0,0,0,0,0,0,0,{"$f":"-SUMIF('App.2-BA_Fixed Asset Cont'!$B$154:$B$199,'App.2-C_DepExp'!A91,'App.2-BA_Fixed Asset Cont'!$J$154:$J$199)","v":0},0]
[1808,"Buildings",{"$f":"SUMIF('App.2-BA_Fixed Asset Cont'!$B$154:$B$199,'App.2-C_DepExp'!A92,'App.2-BA_Fixed Asset Cont'!$D$154:$D$199)","v":24624967},null,24624967,null,null,0,{"$f":"SUMIF('App.2-BA_Fixed Asset Cont'!$B$154:$B$199,'App.2-C_DepExp'!A92,'App.2-BA_Fixed Asset Cont'!$E$154:$E$199)","v":244854},36.598100000000002,2.7323822821403294E-2,50,0.02,672848.23529090302,0,2448.54,675296.77529090305,{"$f":"-SUMIF('App.2-BA_Fixed Asset Cont'!$B$154:$B$199,'App.2-C_DepExp'!A92,'App.2-BA_Fixed Asset Cont'!$J$154:$J$199)","v":675297},{"$f":"IF(ISERROR(+R92-122), 0, +R92-Q92)","v":0.22470909694675356}]
[1810,"Leasehold Improvements",{"$f":"SUMIF('App.2-BA_Fixed Asset Cont'!$B$154:$B$199,'App.2-C_DepExp'!A93,'App.2-BA_Fixed Asset Cont'!$D$154:$D$199)","v":0},null,0,null,null,0,{"$f":"SUMIF('App.2-BA_Fixed Asset Cont'!$B$154:$B$199,'App.2-C_DepExp'!A93,'App.2-BA_Fixed Asset Cont'!$E$154:$E$199)","v":0},0,0,0,0,0,0,0,0,{"$f":"-SUMIF('App.2-BA_Fixed Asset Cont'!$B$154:$B$199,'App.2-C_DepExp'!A93,'App.2-BA_Fixed Asset Cont'!$J$154:$J$199)","v":0},0]
[1815,"Transformer Station Equipment >50 kV",{"$f":"SUMIF('App.2-BA_Fixed Asset Cont'!$B$154:$B$199,'App.2-C_DepExp'!A94,'App.2-BA_Fixed Asset Cont'!$D$154:$D$199)","v":5491722},null,5491722,null,null,0,{"$f":"SUMIF('App.2-BA_Fixed Asset Cont'!$B$154:$B$199,'App.2-C_DepExp'!A94,'App.2-BA_Fixed Asset Cont'!$E$154:$E$199)","v":617923},24,4.1666666666666664E-2,40,2.5000000000000001E-2,228821.75,0,7724.0375000000004,236545.78750000001,{"$f":"-SUMIF('App.2-BA_Fixed Asset Cont'!$B$154:$B$199,'App.2-C_DepExp'!A94,'App.2-BA_Fixed Asset Cont'!$J$154:$J$199)","v":236546},0.21249999999417923]
[1820,"Distribution Station Equipment <50 kV",{"$f":"SUMIF('App.2-BA_Fixed Asset Cont'!$B$154:$B$199,'App.2-C_DepExp'!A95,'App.2-BA_Fixed Asset Cont'!$D$154:$D$199)","v":7812618},null,7812618,null,null,0,{"$f":"SUMIF('App.2-BA_Fixed Asset Cont'!$B$154:$B$199,'App.2-C_DepExp'!A95,'App.2-BA_Fixed Asset Cont'!$E$154:$E$199)","v":1245158},22,4.5454545454545456E-2,40,2.5000000000000001E-2,355119,0,15564.475,370683.47499999998,{"$f":"-SUMIF('App.2-BA_Fixed Asset Cont'!$B$154:$B$199,'App.2-C_DepExp'!A95,'App.2-BA_Fixed Asset Cont'!$J$154:$J$199)","v":370683},-0.47499999997671694]
[1825,"Storage Battery Equipment",{"$f":"SUMIF('App.2-BA_Fixed Asset Cont'!$B$154:$B$199,'App.2-C_DepExp'!A96,'App.2-BA_Fixed Asset Cont'!$D$154:$D$199)","v":13722},null,13722,null,null,0,{"$f":"SUMIF('App.2-BA_Fixed Asset Cont'!$B$154:$B$199,'App.2-C_DepExp'!A96,'App.2-BA_Fixed Asset Cont'!$E$154:$E$199)","v":0},21,4.7619047619047616E-2,30,3.3333333333333333E-2,653.42857142857144,0,0,653.42857142857144,{"$f":"-SUMIF('App.2-BA_Fixed Asset Cont'!$B$154:$B$199,'App.2-C_DepExp'!A96,'App.2-BA_Fixed Asset Cont'!$J$154:$J$199)","v":653},-0.42857142857144481]
[1830,"Poles, Towers & Fixtures",{"$f":"SUMIF('App.2-BA_Fixed Asset Cont'!$B$154:$B$199,'App.2-C_DepExp'!A97,'App.2-BA_Fixed Asset Cont'!$D$154:$D$199)","v":10446415},null,10446415,null,null,0,{"$f":"SUMIF('App.2-BA_Fixed Asset Cont'!$B$154:$B$199,'App.2-C_DepExp'!A97,'App.2-BA_Fixed Asset Cont'!$E$154:$E$199)","v":2281968},44,2.2727272727272728E-2,45,2.2222222222222223E-2,237418.52272727274,0,25355.200000000001,262773.72272727272,{"$f":"-SUMIF('App.2-BA_Fixed Asset Cont'!$B$154:$B$199,'App.2-C_DepExp'!A97,'App.2-BA_Fixed Asset Cont'!$J$154:$J$199)","v":262774},0.27727272728225216]
[1835,"Overhead Conductors & Devices",{"$f":"SUMIF('App.2-BA_Fixed Asset Cont'!$B$154:$B$199,'App.2-C_DepExp'!A98,'App.2-BA_Fixed Asset Cont'!$D$154:$D$199)","v":8345730},null,8345730,null,null,0,{"$f":"SUMIF('App.2-BA_Fixed Asset Cont'!$B$154:$B$199,'App.2-C_DepExp'!A98,'App.2-BA_Fixed Asset Cont'!$E$154:$E$199)","v":960049},36,2.7777777777777776E-2,60,1.6666666666666666E-2,231825.83333333334,0,8000.4083333333338,239826.24166666667,{"$f":"-SUMIF('App.2-BA_Fixed Asset Cont'!$B$154:$B$199,'App.2-C_DepExp'!A98,'App.2-BA_Fixed Asset Cont'!$J$154:$J$199)","v":239826},-0.24166666666860692]
[1840,"Underground Conduit",{"$f":"SUMIF('App.2-BA_Fixed Asset Cont'!$B$154:$B$199,'App.2-C_DepExp'!A99,'App.2-BA_Fixed Asset Cont'!$D$154:$D$199)","v":2546031},null,2546031,null,null,0,{"$f":"SUMIF('App.2-BA_Fixed Asset Cont'!$B$154:$B$199,'App.2-C_DepExp'!A99,'App.2-BA_Fixed Asset Cont'!$E$154:$E$199)","v":282137},12,8.3333333333333329E-2,50,0.02,212169.25,0,2821.37,214990.62,{"$f":"-SUMIF('App.2-BA_Fixed Asset Cont'!$B$154:$B$199,'App.2-C_DepExp'!A99,'App.2-BA_Fixed Asset Cont'!$J$154:$J$199)","v":214991},0.38000000000465661]
[1845,"Underground Conductors & Devices",{"$f":"SUMIF('App.2-BA_Fixed Asset Cont'!$B$154:$B$199,'App.2-C_DepExp'!A100,'App.2-BA_Fixed Asset Cont'!$D$154:$D$199)","v":11437100},null,11437100,null,null,0,{"$f":"SUMIF('App.2-BA_Fixed Asset Cont'!$B$154:$B$199,'App.2-C_DepExp'!A100,'App.2-BA_Fixed Asset Cont'!$E$154:$E$199)","v":582719},23,4.3478260869565216E-2,40,2.5000000000000001E-2,497265.21739130432,0,7283.9875000000002,504549.20489130431,{"$f":"-SUMIF('App.2-BA_Fixed Asset Cont'!$B$154:$B$199,'App.2-C_DepExp'!A100,'App.2-BA_Fixed Asset Cont'!$J$154:$J$199)","v":504549},-0.20489130431087688]
[1850,"Line Transformers",{"$f":"SUMIF('App.2-BA_Fixed Asset Cont'!$B$154:$B$199,'App.2-C_DepExp'!A101,'App.2-BA_Fixed Asset Cont'!$D$154:$D$199)","v":9204093},null,9204093,null,null,0,{"$f":"SUMIF('App.2-BA_Fixed Asset Cont'!$B$154:$B$199,'App.2-C_DepExp'!A101,'App.2-BA_Fixed Asset Cont'!$E$154:$E$199)","v":645934},39,2.564102564102564E-2,40,2.5000000000000001E-2,236002.38461538462,0,8074.1750000000002,244076.55961538461,{"$f":"-SUMIF('App.2-BA_Fixed Asset Cont'!$B$154:$B$199,'App.2-C_DepExp'!A101,'App.2-BA_Fixed Asset Cont'!$J$154:$J$199)","v":244077},0.44038461538730189]
[1855,"Services (Overhead & Underground)",{"$f":"SUMIF('App.2-BA_Fixed Asset Cont'!$B$154:$B$199,'App.2-C_DepExp'!A102,'App.2-BA_Fixed Asset Cont'!$D$154:$D$199)","v":4460589},null,4460589,null,null,0,{"$f":"SUMIF('App.2-BA_Fixed Asset Cont'!$B$154:$B$199,'App.2-C_DepExp'!A102,'App.2-BA_Fixed Asset Cont'!$E$154:$E$199)","v":541557},36,2.7777777777777776E-2,40,2.5000000000000001E-2,123905.25,0,6769.4624999999996,130674.71249999999,{"$f":"-SUMIF('App.2-BA_Fixed Asset Cont'!$B$154:$B$199,'App.2-C_DepExp'!A102,'App.2-BA_Fixed Asset Cont'!$J$154:$J$199)","v":130675},0.28750000000582077]
[1860,"Meters",0,null,0,null,null,0,0,null,0,null,0,0,0,0,0,0,0]
[1860,"Meters (Smart Meters)",{"$f":"SUMIF('App.2-BA_Fixed Asset Cont'!$B$154:$B$199,'App.2-C_DepExp'!A104,'App.2-BA_Fixed Asset Cont'!$D$154:$D$199)","v":4468973},null,4468973,null,null,0,{"$f":"SUMIF('App.2-BA_Fixed Asset Cont'!$B$154:$B$199,'App.2-C_DepExp'!A104,'App.2-BA_Fixed Asset Cont'!$E$154:$E$199)","v":141089},11,9.0909090909090912E-2,15,6.6666666666666666E-2,406270.27272727271,0,4702.9666666666662,410973.23939393938,{"$f":"-SUMIF('App.2-BA_Fixed Asset Cont'!$B$154:$B$199,'App.2-C_DepExp'!A104,'App.2-BA_Fixed Asset Cont'!$J$154:$J$199)","v":410973},-0.23939393938053399]
[1905,"Land",{"$f":"SUMIF('App.2-BA_Fixed Asset Cont'!$B$154:$B$199,'App.2-C_DepExp'!A105,'App.2-BA_Fixed Asset Cont'!$D$154:$D$199)","v":0},null,0,null,null,0,{"$f":"SUMIF('App.2-BA_Fixed Asset Cont'!$B$154:$B$199,'App.2-C_DepExp'!A105,'App.2-BA_Fixed Asset Cont'!$E$154:$E$199)","v":0},0,0,null,0,0,0,0,0,{"$f":"-SUMIF('App.2-BA_Fixed Asset Cont'!$B$154:$B$199,'App.2-C_DepExp'!A105,'App.2-BA_Fixed Asset Cont'!$J$154:$J$199)","v":0},0]
[1908,"Buildings & Fixtures",{"$f":"SUMIF('App.2-BA_Fixed Asset Cont'!$B$154:$B$199,'App.2-C_DepExp'!A106,'App.2-BA_Fixed Asset Cont'!$D$154:$D$199)","v":0},null,0,null,null,0,{"$f":"SUMIF('App.2-BA_Fixed Asset Cont'!$B$154:$B$199,'App.2-C_DepExp'!A106,'App.2-BA_Fixed Asset Cont'!$E$154:$E$199)","v":0},0,0,null,0,0,0,0,0,{"$f":"-SUMIF('App.2-BA_Fixed Asset Cont'!$B$154:$B$199,'App.2-C_DepExp'!A106,'App.2-BA_Fixed Asset Cont'!$J$154:$J$199)","v":0},0]
[1910,"Leasehold Improvements",{"$f":"SUMIF('App.2-BA_Fixed Asset Cont'!$B$154:$B$199,'App.2-C_DepExp'!A107,'App.2-BA_Fixed Asset Cont'!$D$154:$D$199)","v":0},null,0,null,null,0,{"$f":"SUMIF('App.2-BA_Fixed Asset Cont'!$B$154:$B$199,'App.2-C_DepExp'!A107,'App.2-BA_Fixed Asset Cont'!$E$154:$E$199)","v":0},0,0,null,0,0,0,0,0,{"$f":"-SUMIF('App.2-BA_Fixed Asset Cont'!$B$154:$B$199,'App.2-C_DepExp'!A107,'App.2-BA_Fixed Asset Cont'!$J$154:$J$199)","v":0},0]
[1915,"Office Furniture & Equipment (10 years)",{"$f":"SUMIF('App.2-BA_Fixed Asset Cont'!$B$154:$B$199,'App.2-C_DepExp'!A108,'App.2-BA_Fixed Asset Cont'!$D$154:$D$199)","v":0},null,0,null,null,0,{"$f":"SUMIF('App.2-BA_Fixed Asset Cont'!$B$154:$B$199,'App.2-C_DepExp'!A108,'App.2-BA_Fixed Asset Cont'!$E$154:$E$199)","v":0},0,0,null,0,0,0,0,0,{"$f":"-SUMIF('App.2-BA_Fixed Asset Cont'!$B$154:$B$199,'App.2-C_DepExp'!A108,'App.2-BA_Fixed Asset Cont'!$J$154:$J$199)","v":0},0]
[1915,"Office Furniture & Equipment (5 years)",{"$f":"SUMIF('App.2-BA_Fixed Asset Cont'!$B$154:$B$199,'App.2-C_DepExp'!A109,'App.2-BA_Fixed Asset Cont'!$D$154:$D$199)","v":0},null,0,null,null,0,{"$f":"SUMIF('App.2-BA_Fixed Asset Cont'!$B$154:$B$199,'App.2-C_DepExp'!A109,'App.2-BA_Fixed Asset Cont'!$E$154:$E$199)","v":0},0,0,null,0,0,0,0,0,{"$f":"-SUMIF('App.2-BA_Fixed Asset Cont'!$B$154:$B$199,'App.2-C_DepExp'!A109,'App.2-BA_Fixed Asset Cont'!$J$154:$J$199)","v":0},0]
[1920,"Computer Equipment - Hardware",{"$f":"SUMIF('App.2-BA_Fixed Asset Cont'!$B$154:$B$199,'App.2-C_DepExp'!A110,'App.2-BA_Fixed Asset Cont'!$D$154:$D$199)","v":1361},null,1361,null,null,0,{"$f":"SUMIF('App.2-BA_Fixed Asset Cont'!$B$154:$B$199,'App.2-C_DepExp'!A110,'App.2-BA_Fixed Asset Cont'!$E$154:$E$199)","v":0},1,1,5,0.2,1361,0,0,1361,{"$f":"-SUMIF('App.2-BA_Fixed Asset Cont'!$B$154:$B$199,'App.2-C_DepExp'!A110,'App.2-BA_Fixed Asset Cont'!$J$154:$J$199)","v":1361},0]
[1920,"Computer Equip.-Hardware(Post Mar. 22/04)",0,null,0,null,null,0,{"$f":"SUMIF('App.2-BA_Fixed Asset Cont'!$B$154:$B$199,'App.2-C_DepExp'!A111,'App.2-BA_Fixed Asset Cont'!$E$154:$E$199)","v":0},0,0,5,0.2,0,0,0,0,0,0]
[1920,"Computer Equip.-Hardware(Post Mar. 19/07)",0,null,0,null,null,0,{"$f":"SUMIF('App.2-BA_Fixed Asset Cont'!$B$154:$B$199,'App.2-C_DepExp'!A112,'App.2-BA_Fixed Asset Cont'!$E$154:$E$199)","v":0},0,0,5,0.2,0,0,0,0,0,0]
[1925,"Computer Software",{"$f":"SUMIF('App.2-BA_Fixed Asset Cont'!$B$154:$B$199,'App.2-C_DepExp'!A113,'App.2-BA_Fixed Asset Cont'!$D$154:$D$199)","v":105974},null,105974,null,null,0,{"$f":"SUMIF('App.2-BA_Fixed Asset Cont'!$B$154:$B$199,'App.2-C_DepExp'!A113,'App.2-BA_Fixed Asset Cont'!$E$154:$E$199)","v":0},1,1,5,0.2,105974,0,0,105974,{"$f":"-SUMIF('App.2-BA_Fixed Asset Cont'!$B$154:$B$199,'App.2-C_DepExp'!A113,'App.2-BA_Fixed Asset Cont'!$J$154:$J$199)","v":105974},0]
[1930,"Transportation Equipment",{"$f":"SUMIF('App.2-BA_Fixed Asset Cont'!$B$154:$B$199,'App.2-C_DepExp'!A114,'App.2-BA_Fixed Asset Cont'!$D$154:$D$199)","v":0},null,0,null,null,0,{"$f":"SUMIF('App.2-BA_Fixed Asset Cont'!$B$154:$B$199,'App.2-C_DepExp'!A114,'App.2-BA_Fixed Asset Cont'!$E$154:$E$199)","v":0},0,0,null,0,0,0,0,0,{"$f":"-SUMIF('App.2-BA_Fixed Asset Cont'!$B$154:$B$199,'App.2-C_DepExp'!A114,'App.2-BA_Fixed Asset Cont'!$J$154:$J$199)","v":0},0]
[1935,"Stores Equipment",{"$f":"SUMIF('App.2-BA_Fixed Asset Cont'!$B$154:$B$199,'App.2-C_DepExp'!A115,'App.2-BA_Fixed Asset Cont'!$D$154:$D$199)","v":0},null,0,null,null,0,{"$f":"SUMIF('App.2-BA_Fixed Asset Cont'!$B$154:$B$199,'App.2-C_DepExp'!A115,'App.2-BA_Fixed Asset Cont'!$E$154:$E$199)","v":0},0,0,null,0,0,0,0,0,{"$f":"-SUMIF('App.2-BA_Fixed Asset Cont'!$B$154:$B$199,'App.2-C_DepExp'!A115,'App.2-BA_Fixed Asset Cont'!$J$154:$J$199)","v":0},0]
[1940,"Tools, Shop & Garage Equipment",{"$f":"SUMIF('App.2-BA_Fixed Asset Cont'!$B$154:$B$199,'App.2-C_DepExp'!A116,'App.2-BA_Fixed Asset Cont'!$D$154:$D$199)","v":0},null,0,null,null,0,{"$f":"SUMIF('App.2-BA_Fixed Asset Cont'!$B$154:$B$199,'App.2-C_DepExp'!A116,'App.2-BA_Fixed Asset Cont'!$E$154:$E$199)","v":0},0,0,null,0,0,0,0,0,{"$f":"-SUMIF('App.2-BA_Fixed Asset Cont'!$B$154:$B$199,'App.2-C_DepExp'!A116,'App.2-BA_Fixed Asset Cont'!$J$154:$J$199)","v":0},0]
[1945,"Measurement & Testing Equipment",{"$f":"SUMIF('App.2-BA_Fixed Asset Cont'!$B$154:$B$199,'App.2-C_DepExp'!A117,'App.2-BA_Fixed Asset Cont'!$D$154:$D$199)","v":0},null,0,null,null,0,{"$f":"SUMIF('App.2-BA_Fixed Asset Cont'!$B$154:$B$199,'App.2-C_DepExp'!A117,'App.2-BA_Fixed Asset Cont'!$E$154:$E$199)","v":0},0,0,null,0,0,0,0,0,{"$f":"-SUMIF('App.2-BA_Fixed Asset Cont'!$B$154:$B$199,'App.2-C_DepExp'!A117,'App.2-BA_Fixed Asset Cont'!$J$154:$J$199)","v":0},0]
[1950,"Power Operated Equipment",{"$f":"SUMIF('App.2-BA_Fixed Asset Cont'!$B$154:$B$199,'App.2-C_DepExp'!A118,'App.2-BA_Fixed Asset Cont'!$D$154:$D$199)","v":0},null,0,null,null,0,{"$f":"SUMIF('App.2-BA_Fixed Asset Cont'!$B$154:$B$199,'App.2-C_DepExp'!A118,'App.2-BA_Fixed Asset Cont'!$E$154:$E$199)","v":0},0,0,null,0,0,0,0,0,{"$f":"-SUMIF('App.2-BA_Fixed Asset Cont'!$B$154:$B$199,'App.2-C_DepExp'!A118,'App.2-BA_Fixed Asset Cont'!$J$154:$J$199)","v":0},0]
[1955,"Communications Equipment",{"$f":"SUMIF('App.2-BA_Fixed Asset Cont'!$B$154:$B$199,'App.2-C_DepExp'!A119,'App.2-BA_Fixed Asset Cont'!$D$154:$D$199)","v":0},null,0,null,null,0,{"$f":"SUMIF('App.2-BA_Fixed Asset Cont'!$B$154:$B$199,'App.2-C_DepExp'!A119,'App.2-BA_Fixed Asset Cont'!$E$154:$E$199)","v":0},0,0,null,0,0,0,0,0,{"$f":"-SUMIF('App.2-BA_Fixed Asset Cont'!$B$154:$B$199,'App.2-C_DepExp'!A119,'App.2-BA_Fixed Asset Cont'!$J$154:$J$199)","v":0},0]
[1955,"Communication Equipment (Smart Meters)",{"$f":"SUMIF('App.2-BA_Fixed Asset Cont'!$B$154:$B$199,'App.2-C_DepExp'!A120,'App.2-BA_Fixed Asset Cont'!$D$154:$D$199)","v":0},null,0,null,null,0,{"$f":"SUMIF('App.2-BA_Fixed Asset Cont'!$B$154:$B$199,'App.2-C_DepExp'!A120,'App.2-BA_Fixed Asset Cont'!$E$154:$E$199)","v":0},0,0,null,0,0,0,0,0,{"$f":"-SUMIF('App.2-BA_Fixed Asset Cont'!$B$154:$B$199,'App.2-C_DepExp'!A120,'App.2-BA_Fixed Asset Cont'!$J$154:$J$199)","v":0},0]
[1960,"Miscellaneous Equipment ",{"$f":"SUMIF('App.2-BA_Fixed Asset Cont'!$B$154:$B$199,'App.2-C_DepExp'!A121,'App.2-BA_Fixed Asset Cont'!$D$154:$D$199)","v":0},null,0,null,null,0,{"$f":"SUMIF('App.2-BA_Fixed Asset Cont'!$B$154:$B$199,'App.2-C_DepExp'!A121,'App.2-BA_Fixed Asset Cont'!$E$154:$E$199)","v":0},0,0,null,0,0,0,0,0,{"$f":"-SUMIF('App.2-BA_Fixed Asset Cont'!$B$154:$B$199,'App.2-C_DepExp'!A121,'App.2-BA_Fixed Asset Cont'!$J$154:$J$199)","v":0},0]
[1970,"Load Management Controls Customer Premises",{"$f":"SUMIF('App.2-BA_Fixed Asset Cont'!$B$154:$B$199,'App.2-C_DepExp'!A122,'App.2-BA_Fixed Asset Cont'!$D$154:$D$199)","v":0},null,0,null,null,0,{"$f":"SUMIF('App.2-BA_Fixed Asset Cont'!$B$154:$B$199,'App.2-C_DepExp'!A122,'App.2-BA_Fixed Asset Cont'!$E$154:$E$199)","v":0},0,0,null,0,0,0,0,0,{"$f":"-SUMIF('App.2-BA_Fixed Asset Cont'!$B$154:$B$199,'App.2-C_DepExp'!A122,'App.2-BA_Fixed Asset Cont'!$J$154:$J$199)","v":0},0]
[1975,"Load Management Controls Utility Premises",{"$f":"SUMIF('App.2-BA_Fixed Asset Cont'!$B$154:$B$199,'App.2-C_DepExp'!A123,'App.2-BA_Fixed Asset Cont'!$D$154:$D$199)","v":0},null,0,null,null,0,{"$f":"SUMIF('App.2-BA_Fixed Asset Cont'!$B$154:$B$199,'App.2-C_DepExp'!A123,'App.2-BA_Fixed Asset Cont'!$E$154:$E$199)","v":0},0,0,null,0,0,0,0,0,{"$f":"-SUMIF('App.2-BA_Fixed Asset Cont'!$B$154:$B$199,'App.2-C_DepExp'!A123,'App.2-BA_Fixed Asset Cont'!$J$154:$J$199)","v":0},0]
[1980,"System Supervisor Equipment",{"$f":"SUMIF('App.2-BA_Fixed Asset Cont'!$B$154:$B$199,'App.2-C_DepExp'!A124,'App.2-BA_Fixed Asset Cont'!$D$154:$D$199)","v":1381611},null,1381611,null,null,0,{"$f":"SUMIF('App.2-BA_Fixed Asset Cont'!$B$154:$B$199,'App.2-C_DepExp'!A124,'App.2-BA_Fixed Asset Cont'!$E$154:$E$199)","v":156593},6,0.16666666666666666,20,0.05,230268.5,0,3914.8249999999998,234183.32500000001,{"$f":"-SUMIF('App.2-BA_Fixed Asset Cont'!$B$154:$B$199,'App.2-C_DepExp'!A124,'App.2-BA_Fixed Asset Cont'!$J$154:$J$199)","v":234183},-0.32500000001164153]
[1985,"Miscellaneous Fixed Assets",{"$f":"SUMIF('App.2-BA_Fixed Asset Cont'!$B$154:$B$199,'App.2-C_DepExp'!A125,'App.2-BA_Fixed Asset Cont'!$D$154:$D$199)","v":0},null,0,null,null,0,{"$f":"SUMIF('App.2-BA_Fixed Asset Cont'!$B$154:$B$199,'App.2-C_DepExp'!A125,'App.2-BA_Fixed Asset Cont'!$E$154:$E$199)","v":0},0,0,null,0,0,0,0,0,{"$f":"-SUMIF('App.2-BA_Fixed Asset Cont'!$B$154:$B$199,'App.2-C_DepExp'!A125,'App.2-BA_Fixed Asset Cont'!$J$154:$J$199)","v":0},0]
[1990,"Other Tangible Property",{"$f":"SUMIF('App.2-BA_Fixed Asset Cont'!$B$154:$B$199,'App.2-C_DepExp'!A126,'App.2-BA_Fixed Asset Cont'!$D$154:$D$199)","v":0},null,0,null,null,0,{"$f":"SUMIF('App.2-BA_Fixed Asset Cont'!$B$154:$B$199,'App.2-C_DepExp'!A126,'App.2-BA_Fixed Asset Cont'!$E$154:$E$199)","v":0},0,0,null,0,0,0,0,0,{"$f":"-SUMIF('App.2-BA_Fixed Asset Cont'!$B$154:$B$199,'App.2-C_DepExp'!A126,'App.2-BA_Fixed Asset Cont'!$J$154:$J$199)","v":0},0]
[1995,"Contributions & Grants",{"$f":"SUMIF('App.2-BA_Fixed Asset Cont'!$B$154:$B$199,'App.2-C_DepExp'!A127,'App.2-BA_Fixed Asset Cont'!$D$154:$D$199)","v":-11161740},null,-11161740,null,null,0,{"$f":"SUMIF('App.2-BA_Fixed Asset Cont'!$B$154:$B$199,'App.2-C_DepExp'!A127,'App.2-BA_Fixed Asset Cont'!$E$154:$E$199)","v":0},34,2.9411764705882353E-2,40,2.5000000000000001E-2,-328286.4705882353,0,0,-328286.4705882353,{"$f":"-SUMIF('App.2-BA_Fixed Asset Cont'!$B$154:$B$199,'App.2-C_DepExp'!A127,'App.2-BA_Fixed Asset Cont'!$J$154:$J$199)","v":-328286},0.47058823530096561]
[null,"Total",{"$f":"SUM(C83:C127)","v":82778268},{"$f":"SUM(D83:D127)","v":0},82778268,0,0,0,7706779,null,null,null,null,{"$f":"SUM(N83:N127)","v":3287385.0301464275},0,92659.447499999995,3380044.4776464282,3380045,0.5223535723008581]
[]
[]
[]
["Scenario that applies",null,"Applicable Years and Accounting Standard",null,null,null,null,null,null,null,null,null,null,null,null,null,null,"Year Reflected in Schedule Below","Accounting Standard Reflected in Schedule Below",null,null,null,null,null,2012]
["Rebasing for the first time with depreciation policy changes made in 2012.",null,"This appendix must be duplicated and completed for the years 2012 to 2018. The appendix for 2012 is to be completed under CGAAP (prior to changes in depreciation policies). The appendix for 2012 to 2014 must be completed under Revised CGAAP (after changes in depreciation policies). The appendix for 2014 to 2018 is to be completed under MIFRS (2014 if changes to MIFRS are material).",null,null,null,null,null,null,null,null,null,null,null,null,null,null,null,null,null,null,null,null,null,2013]
["Rebasing for the first time with depreciation policy changes made in 2013.",null,"This appendix must be duplicated and completed for the years 2013 to 2018. The appendix for 2013 is to be completed under CGAAP (prior to changes in depreciation policies). The appendix for 2013 to 2014 must be completed under Revised CGAAP (after changes in depreciation policies). The appendix for 2014 to 2018 is to be completed under MIFRS (2014 if changes to MIFRS are material).",null,null,null,null,null,null,null,null,null,null,null,null,null,null,null,null,null,null,null,null,null,2014]
["Already rebased with depreciation policy changes in a prior rate application",null,"This appendix must be completed for 2014 to 2018. The appendix for 2014 is to be completed under Revised CGAAP (after changes in depreciation policies). The appendix for 2014 to 2018 is to be completed under MIFRS (2014 if changes to MIFRS are material).",null,null,null,null,null,null,null,null,null,null,null,null,null,null,2015,"MIFRS",null,null,null,null,null,2015]
[null,null,null,null,null,null,null,null,null,null,null,null,null,null,null,null,null,null,null,null,null,null,null,null,2016]
[null,null,null,null,null,null,null,null,null,null,null,null,null,null,null,null,null,null,null,null,null,null,null,null,2017]
[null,null,"Book Values",null,null,null,null,null,null,"Service Lives",null,null,null,"Depreciation Expense",null,null,null,null,null,null,null,null,null,null,2018]
["Account","Description","Opening Net  Book Value of Existing Assets as at Date of Policy Change (Jan. 1) 1","Less Fully Depreciated 7","Net Amount of Existing Assets Before Policy Change to be Depreciated ","Opening Gross Book Value of Assets Acquired After Policy Change 2","Less Fully Depreciated 8","Net Amount of Assets Acquired After Policy Change to be Depreciated ","Current Year Additions","Average Remaining Life of Assets Existing Before Policy Change 3","Depreciation Rate Assets Acquired After Policy Change","Life of Assets Acquired After Policy Change 4","Depreciation Rate on New Additions","Depreciation Expense on Assets Existing Before Policy Change","Depreciation Expense on Assets Acquired After Policy Change","Depreciation Expense on Current Year Additions 5","Total Current Year Depreciation Expense ","Depreciation Expense per Appendix 2-BA Fixed Assets, Column J \n ","Variance 6"]
[null,null,"a","b","c = a-b","d","e","f = d- e","g","h","i = 1/h","j","k = 1/j","l = c/h","m = f/j","n = g*0.5/j","o = l+m+n","p","q = p-o"]
[1706,"Land Rights",{"$f":"SUMIF('App.2-BA_Fixed Asset Cont'!$B$154:$B$199,'App.2-C_DepExp'!A141,'App.2-BA_Fixed Asset Cont'!$D$154:$D$199)","v":602307},null,{"$f":"C141-D141","v":602307},{"$f":"+F83+I83","v":0},null,{"$f":"F141-G141","v":0},{"$f":"SUMIF('App.2-BA_Fixed Asset Cont'!$B$222:$B$267,'App.2-C_DepExp'!A141,'App.2-BA_Fixed Asset Cont'!$E$222:$E$267)","v":0},null,{"$f":"IF(J141=0,0,1/J141)","v":0},0,{"$f":"IF(L141=0,0,1/L141)","v":0},{"$f":"IF(J141=0,0,+E141/J141)","v":0},{"$f":"IF(L141=0,0,+H141/L141)","v":0},{"$f":"IF(L141=0,0,+(I141*0.5)/L141)","v":0},{"$f":"IF(ISERROR(+N141+O141+P141), 0, +N141+O141+P141)","v":0},{"$f":"-SUMIF('App.2-BA_Fixed Asset Cont'!$B$222:$B$267,'App.2-C_DepExp'!A141,'App.2-BA_Fixed Asset Cont'!$J$222:$J$267)","v":0},{"$f":"IF(ISERROR(+R141-122), 0, +R141-Q141)","v":0}]
[1725,"Poles and Fixtures",{"$f":"SUMIF('App.2-BA_Fixed Asset Cont'!$B$154:$B$199,'App.2-C_DepExp'!A142,'App.2-BA_Fixed Asset Cont'!$D$154:$D$199)","v":1604340},null,1604340,{"$f":"+F84+I84","v":0},null,0,{"$f":"SUMIF('App.2-BA_Fixed Asset Cont'!$B$222:$B$267,'App.2-C_DepExp'!A142,'App.2-BA_Fixed Asset Cont'!$E$222:$E$267)","v":0},41,2.4390243902439025E-2,45,2.2222222222222223E-2,39130.243902439026,0,0,39130.243902439026,{"$f":"-SUMIF('App.2-BA_Fixed Asset Cont'!$B$222:$B$267,'App.2-C_DepExp'!A142,'App.2-BA_Fixed Asset Cont'!$J$222:$J$267)","v":39130},{"$f":"IF(ISERROR(+R142-122), 0, +R142-Q142)","v":-0.24390243902598741}]
[1730,"Overhead Conductors & Devices",{"$f":"SUMIF('App.2-BA_Fixed Asset Cont'!$B$154:$B$199,'App.2-C_DepExp'!A143,'App.2-BA_Fixed Asset Cont'!$D$154:$D$199)","v":63894},null,63894,0,null,0,{"$f":"SUMIF('App.2-BA_Fixed Asset Cont'!$B$222:$B$267,'App.2-C_DepExp'!A143,'App.2-BA_Fixed Asset Cont'!$E$222:$E$267)","v":0},32,3.125E-2,45,2.2222222222222223E-2,1996.6875,0,0,1996.6875,{"$f":"-SUMIF('App.2-BA_Fixed Asset Cont'!$B$222:$B$267,'App.2-C_DepExp'!A143,'App.2-BA_Fixed Asset Cont'!$J$222:$J$267)","v":1997},{"$f":"IF(ISERROR(+R143-122), 0, +R143-Q143)","v":0.3125}]
[1735,"Underground Conduit",{"$f":"SUMIF('App.2-BA_Fixed Asset Cont'!$B$154:$B$199,'App.2-C_DepExp'!A144,'App.2-BA_Fixed Asset Cont'!$D$154:$D$199)","v":870021},null,870021,0,null,0,{"$f":"SUMIF('App.2-BA_Fixed Asset Cont'!$B$222:$B$267,'App.2-C_DepExp'!A144,'App.2-BA_Fixed Asset Cont'!$E$222:$E$267)","v":0},35,2.8571428571428571E-2,40,2.5000000000000001E-2,24857.742857142857,0,0,24857.742857142857,{"$f":"-SUMIF('App.2-BA_Fixed Asset Cont'!$B$222:$B$267,'App.2-C_DepExp'!A144,'App.2-BA_Fixed Asset Cont'!$J$222:$J$267)","v":24858},0.2571428571427532]
[1740,"Underground Conductors & Devices",{"$f":"SUMIF('App.2-BA_Fixed Asset Cont'!$B$154:$B$199,'App.2-C_DepExp'!A145,'App.2-BA_Fixed Asset Cont'!$D$154:$D$199)","v":215252},null,215252,0,null,0,{"$f":"SUMIF('App.2-BA_Fixed Asset Cont'!$B$222:$B$267,'App.2-C_DepExp'!A145,'App.2-BA_Fixed Asset Cont'!$E$222:$E$267)","v":0},22,4.5454545454545456E-2,25,0.04,9784.181818181818,0,0,9784.181818181818,{"$f":"-SUMIF('App.2-BA_Fixed Asset Cont'!$B$222:$B$267,'App.2-C_DepExp'!A145,'App.2-BA_Fixed Asset Cont'!$J$222:$J$267)","v":9784},-0.18181818181801646]
[1611,"Computer Software (Formally known as Account 1925)",{"$f":"SUMIF('App.2-BA_Fixed Asset Cont'!$B$154:$B$199,'App.2-C_DepExp'!A146,'App.2-BA_Fixed Asset Cont'!$D$154:$D$199)","v":0},null,{"$f":"C146-D146","v":0},0,null,{"$f":"F146-G146","v":0},{"$f":"SUMIF('App.2-BA_Fixed Asset Cont'!$B$222:$B$267,'App.2-C_DepExp'!A146,'App.2-BA_Fixed Asset Cont'!$E$222:$E$267)","v":0},0,{"$f":"IF(J146=0,0,1/J146)","v":0},0,{"$f":"IF(L146=0,0,1/L146)","v":0},{"$f":"IF(J146=0,0,+E146/J146)","v":0},{"$f":"IF(L146=0,0,+H146/L146)","v":0},{"$f":"IF(L146=0,0,+(I146*0.5)/L146)","v":0},{"$f":"IF(ISERROR(+N146+O146+P146), 0, +N146+O146+P146)","v":0},{"$f":"-SUMIF('App.2-BA_Fixed Asset Cont'!$B$222:$B$267,'App.2-C_DepExp'!A146,'App.2-BA_Fixed Asset Cont'!$J$222:$J$267)","v":0},{"$f":"IF(ISERROR(+R146-122), 0, +R146-Q146)","v":0}]
[1612,"Land Rights (Formally known as Account 1906)",{"$f":"SUMIF('App.2-BA_Fixed Asset Cont'!$B$154:$B$199,'App.2-C_DepExp'!A147,'App.2-BA_Fixed Asset Cont'!$D$154:$D$199)","v":0},null,{"$f":"C147-D147","v":0},0,null,{"$f":"F147-G147","v":0},{"$f":"SUMIF('App.2-BA_Fixed Asset Cont'!$B$222:$B$267,'App.2-C_DepExp'!A147,'App.2-BA_Fixed Asset Cont'!$E$222:$E$267)","v":0},0,{"$f":"IF(J147=0,0,1/J147)","v":0},0,{"$f":"IF(L147=0,0,1/L147)","v":0},{"$f":"IF(J147=0,0,+E147/J147)","v":0},{"$f":"IF(L147=0,0,+H147/L147)","v":0},{"$f":"IF(L147=0,0,+(I147*0.5)/L147)","v":0},{"$f":"IF(ISERROR(+N147+O147+P147), 0, +N147+O147+P147)","v":0},{"$f":"-SUMIF('App.2-BA_Fixed Asset Cont'!$B$222:$B$267,'App.2-C_DepExp'!A147,'App.2-BA_Fixed Asset Cont'!$J$222:$J$267)","v":0},{"$f":"IF(ISERROR(+R147-122), 0, +R147-Q147)","v":0}]
[1805,"Land",{"$f":"SUMIF('App.2-BA_Fixed Asset Cont'!$B$154:$B$199,'App.2-C_DepExp'!A148,'App.2-BA_Fixed Asset Cont'!$D$154:$D$199)","v":89160},null,89160,0,null,0,{"$f":"SUMIF('App.2-BA_Fixed Asset Cont'!$B$222:$B$267,'App.2-C_DepExp'!A148,'App.2-BA_Fixed Asset Cont'!$E$222:$E$267)","v":0},0,0,0,0,0,{"$f":"IF(L148=0,0,+H148/L148)","v":0},0,0,{"$f":"-SUMIF('App.2-BA_Fixed Asset Cont'!$B$222:$B$267,'App.2-C_DepExp'!A148,'App.2-BA_Fixed Asset Cont'!$J$222:$J$267)","v":0},0]
[1806,"Land Rights",{"$f":"SUMIF('App.2-BA_Fixed Asset Cont'!$B$154:$B$199,'App.2-C_DepExp'!A149,'App.2-BA_Fixed Asset Cont'!$D$154:$D$199)","v":154128},null,154128,6798,null,6798,{"$f":"SUMIF('App.2-BA_Fixed Asset Cont'!$B$222:$B$267,'App.2-C_DepExp'!A149,'App.2-BA_Fixed Asset Cont'!$E$222:$E$267)","v":5693},0,0,0,0,0,0,0,0,{"$f":"-SUMIF('App.2-BA_Fixed Asset Cont'!$B$222:$B$267,'App.2-C_DepExp'!A149,'App.2-BA_Fixed Asset Cont'!$J$222:$J$267)","v":0},0]
[1808,"Buildings",{"$f":"SUMIF('App.2-BA_Fixed Asset Cont'!$B$154:$B$199,'App.2-C_DepExp'!A150,'App.2-BA_Fixed Asset Cont'!$D$154:$D$199)","v":24624967},null,24624967,244854,null,244854,{"$f":"SUMIF('App.2-BA_Fixed Asset Cont'!$B$222:$B$267,'App.2-C_DepExp'!A150,'App.2-BA_Fixed Asset Cont'!$E$222:$E$267)","v":66532},36.598100000000002,2.7323822821403294E-2,49.05,2.0387359836901122E-2,672848.23529090302,4991.9266055045873,678.20591233435277,678518.36780874198,{"$f":"-SUMIF('App.2-BA_Fixed Asset Cont'!$B$222:$B$267,'App.2-C_DepExp'!A150,'App.2-BA_Fixed Asset Cont'!$J$222:$J$267)","v":678518},{"$f":"IF(ISERROR(+R150-122), 0, +R150-Q150)","v":-0.36780874198302627}]
[1810,"Leasehold Improvements",{"$f":"SUMIF('App.2-BA_Fixed Asset Cont'!$B$154:$B$199,'App.2-C_DepExp'!A151,'App.2-BA_Fixed Asset Cont'!$D$154:$D$199)","v":0},null,0,0,null,0,{"$f":"SUMIF('App.2-BA_Fixed Asset Cont'!$B$222:$B$267,'App.2-C_DepExp'!A151,'App.2-BA_Fixed Asset Cont'!$E$222:$E$267)","v":0},0,0,0,0,0,0,0,0,{"$f":"-SUMIF('App.2-BA_Fixed Asset Cont'!$B$222:$B$267,'App.2-C_DepExp'!A151,'App.2-BA_Fixed Asset Cont'!$J$222:$J$267)","v":0},{"$f":"IF(ISERROR(+R151-122), 0, +R151-Q151)","v":0}]
[1815,"Transformer Station Equipment >50 kV",{"$f":"SUMIF('App.2-BA_Fixed Asset Cont'!$B$154:$B$199,'App.2-C_DepExp'!A152,'App.2-BA_Fixed Asset Cont'!$D$154:$D$199)","v":5491722},null,5491722,617923,null,617923,{"$f":"SUMIF('App.2-BA_Fixed Asset Cont'!$B$222:$B$267,'App.2-C_DepExp'!A152,'App.2-BA_Fixed Asset Cont'!$E$222:$E$267)","v":100183},24,4.1666666666666664E-2,40,2.5000000000000001E-2,228821.75,15448.075000000001,1252.2874999999999,245522.11250000002,{"$f":"-SUMIF('App.2-BA_Fixed Asset Cont'!$B$222:$B$267,'App.2-C_DepExp'!A152,'App.2-BA_Fixed Asset Cont'!$J$222:$J$267)","v":245522},-0.1125000000174623]
[1820,"Distribution Station Equipment <50 kV",{"$f":"SUMIF('App.2-BA_Fixed Asset Cont'!$B$154:$B$199,'App.2-C_DepExp'!A153,'App.2-BA_Fixed Asset Cont'!$D$154:$D$199)","v":7812618},null,7812618,1245158,null,1245158,{"$f":"SUMIF('App.2-BA_Fixed Asset Cont'!$B$222:$B$267,'App.2-C_DepExp'!A153,'App.2-BA_Fixed Asset Cont'!$E$222:$E$267)","v":865058},22,4.5454545454545456E-2,40,2.5000000000000001E-2,355119,31128.95,10813.225,397061.17499999999,{"$f":"-SUMIF('App.2-BA_Fixed Asset Cont'!$B$222:$B$267,'App.2-C_DepExp'!A153,'App.2-BA_Fixed Asset Cont'!$J$222:$J$267)","v":397061},-0.17499999998835847]
[1825,"Storage Battery Equipment",{"$f":"SUMIF('App.2-BA_Fixed Asset Cont'!$B$154:$B$199,'App.2-C_DepExp'!A154,'App.2-BA_Fixed Asset Cont'!$D$154:$D$199)","v":13722},null,13722,0,null,0,{"$f":"SUMIF('App.2-BA_Fixed Asset Cont'!$B$222:$B$267,'App.2-C_DepExp'!A154,'App.2-BA_Fixed Asset Cont'!$E$222:$E$267)","v":0},21,4.7619047619047616E-2,30,3.3333333333333333E-2,653.42857142857144,0,0,653.42857142857144,{"$f":"-SUMIF('App.2-BA_Fixed Asset Cont'!$B$222:$B$267,'App.2-C_DepExp'!A154,'App.2-BA_Fixed Asset Cont'!$J$222:$J$267)","v":653},-0.42857142857144481]
[1830,"Poles, Towers & Fixtures",{"$f":"SUMIF('App.2-BA_Fixed Asset Cont'!$B$154:$B$199,'App.2-C_DepExp'!A155,'App.2-BA_Fixed Asset Cont'!$D$154:$D$199)","v":10446415},null,10446415,2281968,null,2281968,{"$f":"SUMIF('App.2-BA_Fixed Asset Cont'!$B$222:$B$267,'App.2-C_DepExp'!A155,'App.2-BA_Fixed Asset Cont'!$E$222:$E$267)","v":1854371},44,2.2727272727272728E-2,45,2.2222222222222223E-2,237418.52272727274,50710.400000000001,20604.12222222222,308733.04494949494,{"$f":"-SUMIF('App.2-BA_Fixed Asset Cont'!$B$222:$B$267,'App.2-C_DepExp'!A155,'App.2-BA_Fixed Asset Cont'!$J$222:$J$267)","v":308733},-4.4949494942557067E-2]
[1835,"Overhead Conductors & Devices",{"$f":"SUMIF('App.2-BA_Fixed Asset Cont'!$B$154:$B$199,'App.2-C_DepExp'!A156,'App.2-BA_Fixed Asset Cont'!$D$154:$D$199)","v":8345730},null,8345730,960049,null,960049,{"$f":"SUMIF('App.2-BA_Fixed Asset Cont'!$B$222:$B$267,'App.2-C_DepExp'!A156,'App.2-BA_Fixed Asset Cont'!$E$222:$E$267)","v":1150860},36,2.7777777777777776E-2,60,1.6666666666666666E-2,231825.83333333334,16000.816666666668,9590.5,257417.15000000002,{"$f":"-SUMIF('App.2-BA_Fixed Asset Cont'!$B$222:$B$267,'App.2-C_DepExp'!A156,'App.2-BA_Fixed Asset Cont'!$J$222:$J$267)","v":257417},-0.15000000002328306]
[1840,"Underground Conduit",{"$f":"SUMIF('App.2-BA_Fixed Asset Cont'!$B$154:$B$199,'App.2-C_DepExp'!A157,'App.2-BA_Fixed Asset Cont'!$D$154:$D$199)","v":2546031},null,2546031,282137,null,282137,{"$f":"SUMIF('App.2-BA_Fixed Asset Cont'!$B$222:$B$267,'App.2-C_DepExp'!A157,'App.2-BA_Fixed Asset Cont'!$E$222:$E$267)","v":339474},12,8.3333333333333329E-2,50,0.02,212169.25,5642.74,3394.74,221206.72999999998,{"$f":"-SUMIF('App.2-BA_Fixed Asset Cont'!$B$222:$B$267,'App.2-C_DepExp'!A157,'App.2-BA_Fixed Asset Cont'!$J$222:$J$267)","v":221207},0.27000000001862645]
[1845,"Underground Conductors & Devices",{"$f":"SUMIF('App.2-BA_Fixed Asset Cont'!$B$154:$B$199,'App.2-C_DepExp'!A158,'App.2-BA_Fixed Asset Cont'!$D$154:$D$199)","v":11437100},null,11437100,582719,null,582719,{"$f":"SUMIF('App.2-BA_Fixed Asset Cont'!$B$222:$B$267,'App.2-C_DepExp'!A158,'App.2-BA_Fixed Asset Cont'!$E$222:$E$267)","v":785894},23,4.3478260869565216E-2,40,2.5000000000000001E-2,497265.21739130432,14567.975,9823.6749999999993,521656.86739130429,{"$f":"-SUMIF('App.2-BA_Fixed Asset Cont'!$B$222:$B$267,'App.2-C_DepExp'!A158,'App.2-BA_Fixed Asset Cont'!$J$222:$J$267)","v":521657},0.13260869571240619]
[1850,"Line Transformers",{"$f":"SUMIF('App.2-BA_Fixed Asset Cont'!$B$154:$B$199,'App.2-C_DepExp'!A159,'App.2-BA_Fixed Asset Cont'!$D$154:$D$199)","v":9204093},null,9204093,645934,null,645934,{"$f":"SUMIF('App.2-BA_Fixed Asset Cont'!$B$222:$B$267,'App.2-C_DepExp'!A159,'App.2-BA_Fixed Asset Cont'!$E$222:$E$267)","v":1127232},39,2.564102564102564E-2,40,2.5000000000000001E-2,236002.38461538462,16148.35,14090.4,266241.13461538462,{"$f":"-SUMIF('App.2-BA_Fixed Asset Cont'!$B$222:$B$267,'App.2-C_DepExp'!A159,'App.2-BA_Fixed Asset Cont'!$J$222:$J$267)","v":266241},-0.13461538462433964]
[1855,"Services (Overhead & Underground)",{"$f":"SUMIF('App.2-BA_Fixed Asset Cont'!$B$154:$B$199,'App.2-C_DepExp'!A160,'App.2-BA_Fixed Asset Cont'!$D$154:$D$199)","v":4460589},null,4460589,541557,null,541557,{"$f":"SUMIF('App.2-BA_Fixed Asset Cont'!$B$222:$B$267,'App.2-C_DepExp'!A160,'App.2-BA_Fixed Asset Cont'!$E$222:$E$267)","v":357901},36,2.7777777777777776E-2,40,2.5000000000000001E-2,123905.25,13538.924999999999,4473.7624999999998,141917.9375,{"$f":"-SUMIF('App.2-BA_Fixed Asset Cont'!$B$222:$B$267,'App.2-C_DepExp'!A160,'App.2-BA_Fixed Asset Cont'!$J$222:$J$267)","v":141918},6.25E-2]
[1860,"Meters",0,null,0,0,null,0,0,null,0,null,0,0,0,0,0,0,0]
[1860,"Meters (Smart Meters)",{"$f":"SUMIF('App.2-BA_Fixed Asset Cont'!$B$154:$B$199,'App.2-C_DepExp'!A162,'App.2-BA_Fixed Asset Cont'!$D$154:$D$199)","v":4468973},null,4468973,141089,null,141089,{"$f":"SUMIF('App.2-BA_Fixed Asset Cont'!$B$222:$B$267,'App.2-C_DepExp'!A162,'App.2-BA_Fixed Asset Cont'!$E$222:$E$267)","v":52944},11,9.0909090909090912E-2,15,6.6666666666666666E-2,406270.27272727271,9405.9333333333325,1764.8,417441.00606060604,{"$f":"-SUMIF('App.2-BA_Fixed Asset Cont'!$B$222:$B$267,'App.2-C_DepExp'!A162,'App.2-BA_Fixed Asset Cont'!$J$222:$J$267)","v":417441},-6.0606060433201492E-3]
[1905,"Land",{"$f":"SUMIF('App.2-BA_Fixed Asset Cont'!$B$154:$B$199,'App.2-C_DepExp'!A163,'App.2-BA_Fixed Asset Cont'!$D$154:$D$199)","v":0},null,0,0,null,0,{"$f":"SUMIF('App.2-BA_Fixed Asset Cont'!$B$222:$B$267,'App.2-C_DepExp'!A163,'App.2-BA_Fixed Asset Cont'!$E$222:$E$267)","v":0},0,0,null,0,0,0,0,0,{"$f":"-SUMIF('App.2-BA_Fixed Asset Cont'!$B$222:$B$267,'App.2-C_DepExp'!A163,'App.2-BA_Fixed Asset Cont'!$J$222:$J$267)","v":0},0]
[1908,"Buildings & Fixtures",{"$f":"SUMIF('App.2-BA_Fixed Asset Cont'!$B$154:$B$199,'App.2-C_DepExp'!A164,'App.2-BA_Fixed Asset Cont'!$D$154:$D$199)","v":0},null,0,0,null,0,{"$f":"SUMIF('App.2-BA_Fixed Asset Cont'!$B$222:$B$267,'App.2-C_DepExp'!A164,'App.2-BA_Fixed Asset Cont'!$E$222:$E$267)","v":0},0,0,null,0,0,0,0,0,{"$f":"-SUMIF('App.2-BA_Fixed Asset Cont'!$B$222:$B$267,'App.2-C_DepExp'!A164,'App.2-BA_Fixed Asset Cont'!$J$222:$J$267)","v":0},0]
[1910,"Leasehold Improvements",{"$f":"SUMIF('App.2-BA_Fixed Asset Cont'!$B$154:$B$199,'App.2-C_DepExp'!A165,'App.2-BA_Fixed Asset Cont'!$D$154:$D$199)","v":0},null,0,0,null,0,{"$f":"SUMIF('App.2-BA_Fixed Asset Cont'!$B$222:$B$267,'App.2-C_DepExp'!A165,'App.2-BA_Fixed Asset Cont'!$E$222:$E$267)","v":0},0,0,null,0,0,0,0,0,{"$f":"-SUMIF('App.2-BA_Fixed Asset Cont'!$B$222:$B$267,'App.2-C_DepExp'!A165,'App.2-BA_Fixed Asset Cont'!$J$222:$J$267)","v":0},0]
[1915,"Office Furniture & Equipment (10 years)",{"$f":"SUMIF('App.2-BA_Fixed Asset Cont'!$B$154:$B$199,'App.2-C_DepExp'!A166,'App.2-BA_Fixed Asset Cont'!$D$154:$D$199)","v":0},null,0,0,null,0,{"$f":"SUMIF('App.2-BA_Fixed Asset Cont'!$B$222:$B$267,'App.2-C_DepExp'!A166,'App.2-BA_Fixed Asset Cont'!$E$222:$E$267)","v":0},0,0,null,0,0,0,0,0,{"$f":"-SUMIF('App.2-BA_Fixed Asset Cont'!$B$222:$B$267,'App.2-C_DepExp'!A166,'App.2-BA_Fixed Asset Cont'!$J$222:$J$267)","v":0},0]
[1915,"Office Furniture & Equipment (5 years)",{"$f":"SUMIF('App.2-BA_Fixed Asset Cont'!$B$154:$B$199,'App.2-C_DepExp'!A167,'App.2-BA_Fixed Asset Cont'!$D$154:$D$199)","v":0},null,0,0,null,0,{"$f":"SUMIF('App.2-BA_Fixed Asset Cont'!$B$222:$B$267,'App.2-C_DepExp'!A167,'App.2-BA_Fixed Asset Cont'!$E$222:$E$267)","v":0},0,0,null,0,0,0,0,0,{"$f":"-SUMIF('App.2-BA_Fixed Asset Cont'!$B$222:$B$267,'App.2-C_DepExp'!A167,'App.2-BA_Fixed Asset Cont'!$J$222:$J$267)","v":0},0]
[1920,"Computer Equipment - Hardware",{"$f":"SUMIF('App.2-BA_Fixed Asset Cont'!$B$154:$B$199,'App.2-C_DepExp'!A168,'App.2-BA_Fixed Asset Cont'!$D$154:$D$199)","v":1361},1361,0,0,null,0,{"$f":"SUMIF('App.2-BA_Fixed Asset Cont'!$B$222:$B$267,'App.2-C_DepExp'!A168,'App.2-BA_Fixed Asset Cont'!$E$222:$E$267)","v":0},1,1,5,0.2,0,0,0,0,{"$f":"-SUMIF('App.2-BA_Fixed Asset Cont'!$B$222:$B$267,'App.2-C_DepExp'!A168,'App.2-BA_Fixed Asset Cont'!$J$222:$J$267)","v":0},0]
[1920,"Computer Equip.-Hardware(Post Mar. 22/04)",0,null,0,0,null,0,{"$f":"SUMIF('App.2-BA_Fixed Asset Cont'!$B$222:$B$267,'App.2-C_DepExp'!A169,'App.2-BA_Fixed Asset Cont'!$E$222:$E$267)","v":0},0,0,5,0.2,0,0,0,0,{"$f":"-SUMIF('App.2-BA_Fixed Asset Cont'!$B$222:$B$267,'App.2-C_DepExp'!A169,'App.2-BA_Fixed Asset Cont'!$J$222:$J$267)","v":0},0]
[1920,"Computer Equip.-Hardware(Post Mar. 19/07)",0,null,0,0,null,0,{"$f":"SUMIF('App.2-BA_Fixed Asset Cont'!$B$222:$B$267,'App.2-C_DepExp'!A170,'App.2-BA_Fixed Asset Cont'!$E$222:$E$267)","v":0},0,0,5,0.2,0,0,0,0,{"$f":"-SUMIF('App.2-BA_Fixed Asset Cont'!$B$222:$B$267,'App.2-C_DepExp'!A170,'App.2-BA_Fixed Asset Cont'!$J$222:$J$267)","v":0},0]
[1925,"Computer Software",{"$f":"SUMIF('App.2-BA_Fixed Asset Cont'!$B$154:$B$199,'App.2-C_DepExp'!A171,'App.2-BA_Fixed Asset Cont'!$D$154:$D$199)","v":105974},105974,0,0,null,0,{"$f":"SUMIF('App.2-BA_Fixed Asset Cont'!$B$222:$B$267,'App.2-C_DepExp'!A171,'App.2-BA_Fixed Asset Cont'!$E$222:$E$267)","v":0},1,1,5,0.2,0,0,0,0,{"$f":"-SUMIF('App.2-BA_Fixed Asset Cont'!$B$222:$B$267,'App.2-C_DepExp'!A171,'App.2-BA_Fixed Asset Cont'!$J$222:$J$267)","v":0},0]
[1930,"Transportation Equipment",{"$f":"SUMIF('App.2-BA_Fixed Asset Cont'!$B$154:$B$199,'App.2-C_DepExp'!A172,'App.2-BA_Fixed Asset Cont'!$D$154:$D$199)","v":0},null,0,0,null,0,{"$f":"SUMIF('App.2-BA_Fixed Asset Cont'!$B$222:$B$267,'App.2-C_DepExp'!A172,'App.2-BA_Fixed Asset Cont'!$E$222:$E$267)","v":0},0,0,null,0,0,0,0,0,{"$f":"-SUMIF('App.2-BA_Fixed Asset Cont'!$B$222:$B$267,'App.2-C_DepExp'!A172,'App.2-BA_Fixed Asset Cont'!$J$222:$J$267)","v":0},0]
[1935,"Stores Equipment",{"$f":"SUMIF('App.2-BA_Fixed Asset Cont'!$B$154:$B$199,'App.2-C_DepExp'!A173,'App.2-BA_Fixed Asset Cont'!$D$154:$D$199)","v":0},null,0,0,null,0,{"$f":"SUMIF('App.2-BA_Fixed Asset Cont'!$B$222:$B$267,'App.2-C_DepExp'!A173,'App.2-BA_Fixed Asset Cont'!$E$222:$E$267)","v":0},0,0,null,0,0,0,0,0,{"$f":"-SUMIF('App.2-BA_Fixed Asset Cont'!$B$222:$B$267,'App.2-C_DepExp'!A173,'App.2-BA_Fixed Asset Cont'!$J$222:$J$267)","v":0},0]
[1940,"Tools, Shop & Garage Equipment",{"$f":"SUMIF('App.2-BA_Fixed Asset Cont'!$B$154:$B$199,'App.2-C_DepExp'!A174,'App.2-BA_Fixed Asset Cont'!$D$154:$D$199)","v":0},null,0,0,null,0,{"$f":"SUMIF('App.2-BA_Fixed Asset Cont'!$B$222:$B$267,'App.2-C_DepExp'!A174,'App.2-BA_Fixed Asset Cont'!$E$222:$E$267)","v":0},0,0,null,0,0,0,0,0,{"$f":"-SUMIF('App.2-BA_Fixed Asset Cont'!$B$222:$B$267,'App.2-C_DepExp'!A174,'App.2-BA_Fixed Asset Cont'!$J$222:$J$267)","v":0},0]
[1945,"Measurement & Testing Equipment",{"$f":"SUMIF('App.2-BA_Fixed Asset Cont'!$B$154:$B$199,'App.2-C_DepExp'!A175,'App.2-BA_Fixed Asset Cont'!$D$154:$D$199)","v":0},null,0,0,null,0,{"$f":"SUMIF('App.2-BA_Fixed Asset Cont'!$B$222:$B$267,'App.2-C_DepExp'!A175,'App.2-BA_Fixed Asset Cont'!$E$222:$E$267)","v":0},0,0,null,0,0,0,0,0,{"$f":"-SUMIF('App.2-BA_Fixed Asset Cont'!$B$222:$B$267,'App.2-C_DepExp'!A175,'App.2-BA_Fixed Asset Cont'!$J$222:$J$267)","v":0},0]
[1950,"Power Operated Equipment",{"$f":"SUMIF('App.2-BA_Fixed Asset Cont'!$B$154:$B$199,'App.2-C_DepExp'!A176,'App.2-BA_Fixed Asset Cont'!$D$154:$D$199)","v":0},null,0,0,null,0,{"$f":"SUMIF('App.2-BA_Fixed Asset Cont'!$B$222:$B$267,'App.2-C_DepExp'!A176,'App.2-BA_Fixed Asset Cont'!$E$222:$E$267)","v":0},0,0,null,0,0,0,0,0,{"$f":"-SUMIF('App.2-BA_Fixed Asset Cont'!$B$222:$B$267,'App.2-C_DepExp'!A176,'App.2-BA_Fixed Asset Cont'!$J$222:$J$267)","v":0},0]
[1955,"Communications Equipment",{"$f":"SUMIF('App.2-BA_Fixed Asset Cont'!$B$154:$B$199,'App.2-C_DepExp'!A177,'App.2-BA_Fixed Asset Cont'!$D$154:$D$199)","v":0},null,0,0,null,0,{"$f":"SUMIF('App.2-BA_Fixed Asset Cont'!$B$222:$B$267,'App.2-C_DepExp'!A177,'App.2-BA_Fixed Asset Cont'!$E$222:$E$267)","v":0},0,0,null,0,0,0,0,0,{"$f":"-SUMIF('App.2-BA_Fixed Asset Cont'!$B$222:$B$267,'App.2-C_DepExp'!A177,'App.2-BA_Fixed Asset Cont'!$J$222:$J$267)","v":0},0]
[1955,"Communication Equipment (Smart Meters)",{"$f":"SUMIF('App.2-BA_Fixed Asset Cont'!$B$154:$B$199,'App.2-C_DepExp'!A178,'App.2-BA_Fixed Asset Cont'!$D$154:$D$199)","v":0},null,0,0,null,0,{"$f":"SUMIF('App.2-BA_Fixed Asset Cont'!$B$222:$B$267,'App.2-C_DepExp'!A178,'App.2-BA_Fixed Asset Cont'!$E$222:$E$267)","v":0},0,0,null,0,0,0,0,0,{"$f":"-SUMIF('App.2-BA_Fixed Asset Cont'!$B$222:$B$267,'App.2-C_DepExp'!A178,'App.2-BA_Fixed Asset Cont'!$J$222:$J$267)","v":0},0]
[1960,"Miscellaneous Equipment ",{"$f":"SUMIF('App.2-BA_Fixed Asset Cont'!$B$154:$B$199,'App.2-C_DepExp'!A179,'App.2-BA_Fixed Asset Cont'!$D$154:$D$199)","v":0},null,0,0,null,0,{"$f":"SUMIF('App.2-BA_Fixed Asset Cont'!$B$222:$B$267,'App.2-C_DepExp'!A179,'App.2-BA_Fixed Asset Cont'!$E$222:$E$267)","v":0},0,0,null,0,0,0,0,0,{"$f":"-SUMIF('App.2-BA_Fixed Asset Cont'!$B$222:$B$267,'App.2-C_DepExp'!A179,'App.2-BA_Fixed Asset Cont'!$J$222:$J$267)","v":0},0]
[1970,"Load Management Controls Customer Premises",{"$f":"SUMIF('App.2-BA_Fixed Asset Cont'!$B$154:$B$199,'App.2-C_DepExp'!A180,'App.2-BA_Fixed Asset Cont'!$D$154:$D$199)","v":0},null,0,0,null,0,{"$f":"SUMIF('App.2-BA_Fixed Asset Cont'!$B$222:$B$267,'App.2-C_DepExp'!A180,'App.2-BA_Fixed Asset Cont'!$E$222:$E$267)","v":0},0,0,null,0,0,0,0,0,{"$f":"-SUMIF('App.2-BA_Fixed Asset Cont'!$B$222:$B$267,'App.2-C_DepExp'!A180,'App.2-BA_Fixed Asset Cont'!$J$222:$J$267)","v":0},0]
[1975,"Load Management Controls Utility Premises",{"$f":"SUMIF('App.2-BA_Fixed Asset Cont'!$B$154:$B$199,'App.2-C_DepExp'!A181,'App.2-BA_Fixed Asset Cont'!$D$154:$D$199)","v":0},null,0,0,null,0,{"$f":"SUMIF('App.2-BA_Fixed Asset Cont'!$B$222:$B$267,'App.2-C_DepExp'!A181,'App.2-BA_Fixed Asset Cont'!$E$222:$E$267)","v":0},0,0,null,0,0,0,0,0,{"$f":"-SUMIF('App.2-BA_Fixed Asset Cont'!$B$222:$B$267,'App.2-C_DepExp'!A181,'App.2-BA_Fixed Asset Cont'!$J$222:$J$267)","v":0},0]
[1980,"System Supervisor Equipment",{"$f":"SUMIF('App.2-BA_Fixed Asset Cont'!$B$154:$B$199,'App.2-C_DepExp'!A182,'App.2-BA_Fixed Asset Cont'!$D$154:$D$199)","v":1381611},null,1381611,156593,null,156593,{"$f":"SUMIF('App.2-BA_Fixed Asset Cont'!$B$222:$B$267,'App.2-C_DepExp'!A182,'App.2-BA_Fixed Asset Cont'!$E$222:$E$267)","v":4551},6,0.16666666666666666,20,0.05,230268.5,7829.65,113.77500000000001,238211.92499999999,{"$f":"-SUMIF('App.2-BA_Fixed Asset Cont'!$B$222:$B$267,'App.2-C_DepExp'!A182,'App.2-BA_Fixed Asset Cont'!$J$222:$J$267)","v":238212},7.5000000011641532E-2]
[1985,"Miscellaneous Fixed Assets",{"$f":"SUMIF('App.2-BA_Fixed Asset Cont'!$B$154:$B$199,'App.2-C_DepExp'!A183,'App.2-BA_Fixed Asset Cont'!$D$154:$D$199)","v":0},null,0,0,null,0,{"$f":"SUMIF('App.2-BA_Fixed Asset Cont'!$B$222:$B$267,'App.2-C_DepExp'!A183,'App.2-BA_Fixed Asset Cont'!$E$222:$E$267)","v":0},0,0,null,0,0,0,0,0,{"$f":"-SUMIF('App.2-BA_Fixed Asset Cont'!$B$222:$B$267,'App.2-C_DepExp'!A183,'App.2-BA_Fixed Asset Cont'!$J$222:$J$267)","v":0},0]
[1990,"Other Tangible Property",{"$f":"SUMIF('App.2-BA_Fixed Asset Cont'!$B$154:$B$199,'App.2-C_DepExp'!A184,'App.2-BA_Fixed Asset Cont'!$D$154:$D$199)","v":0},null,0,0,null,0,{"$f":"SUMIF('App.2-BA_Fixed Asset Cont'!$B$222:$B$267,'App.2-C_DepExp'!A184,'App.2-BA_Fixed Asset Cont'!$E$222:$E$267)","v":0},0,0,null,0,0,0,0,0,{"$f":"-SUMIF('App.2-BA_Fixed Asset Cont'!$B$222:$B$267,'App.2-C_DepExp'!A184,'App.2-BA_Fixed Asset Cont'!$J$222:$J$267)","v":0},0]
[1995,"Contributions & Grants",{"$f":"SUMIF('App.2-BA_Fixed Asset Cont'!$B$154:$B$199,'App.2-C_DepExp'!A185,'App.2-BA_Fixed Asset Cont'!$D$154:$D$199)","v":-11161740},null,-11161740,0,null,0,{"$f":"SUMIF('App.2-BA_Fixed Asset Cont'!$B$222:$B$267,'App.2-C_DepExp'!A185,'App.2-BA_Fixed Asset Cont'!$E$222:$E$267)","v":0},34,2.9411764705882353E-2,40,2.5000000000000001E-2,-328286.4705882353,0,0,-328286.4705882353,{"$f":"-SUMIF('App.2-BA_Fixed Asset Cont'!$B$222:$B$267,'App.2-C_DepExp'!A185,'App.2-BA_Fixed Asset Cont'!$J$222:$J$267)","v":-328286},0.47058823530096561]
[null,"Total",{"$f":"SUM(C141:C185)","v":82778268},{"$f":"SUM(D141:D185)","v":107335},82670933,7706779,0,7706779,6710693,null,null,null,null,{"$f":"SUM(N141:N185)","v":3180050.0301464275},185413.74160550456,76599.493134556556,3442063.2648864887,3442063,-0.26488648885140265]
[]
[]
[]
["Scenario that applies",null,"Applicable Years and Accounting Standard",null,null,null,null,null,null,null,null,null,null,null,null,null,null,"Year Reflected in Schedule Below","Accounting Standard Reflected in Schedule Below",null,null,null,null,null,2012]
["Rebasing for the first time with depreciation policy changes made in 2012.",null,"This appendix must be duplicated and completed for the years 2012 to 2018. The appendix for 2012 is to be completed under CGAAP (prior to changes in depreciation policies). The appendix for 2012 to 2014 must be completed under Revised CGAAP (after changes in depreciation policies). The appendix for 2014 to 2018 is to be completed under MIFRS (2014 if changes to MIFRS are material).",null,null,null,null,null,null,null,null,null,null,null,null,null,null,null,null,null,null,null,null,null,2013]
["Rebasing for the first time with depreciation policy changes made in 2013.",null,"This appendix must be duplicated and completed for the years 2013 to 2018. The appendix for 2013 is to be completed under CGAAP (prior to changes in depreciation policies). The appendix for 2013 to 2014 must be completed under Revised CGAAP (after changes in depreciation policies). The appendix for 2014 to 2018 is to be completed under MIFRS (2014 if changes to MIFRS are material).",null,null,null,null,null,null,null,null,null,null,null,null,null,null,null,null,null,null,null,null,null,2014]
["Already rebased with depreciation policy changes in a prior rate application",null,"This appendix must be completed for 2014 to 2018. The appendix for 2014 is to be completed under Revised CGAAP (after changes in depreciation policies). The appendix for 2014 to 2018 is to be completed under MIFRS (2014 if changes to MIFRS are material).",null,null,null,null,null,null,null,null,null,null,null,null,null,null,2016,"MIFRS",null,null,null,null,null,2015]
[null,null,null,null,null,null,null,null,null,null,null,null,null,null,null,null,null,null,null,null,null,null,null,null,2016]
[null,null,null,null,null,null,null,null,null,null,null,null,null,null,null,null,null,null,null,null,null,null,null,null,2017]
[null,null,"Book Values",null,null,null,null,null,null,"Service Lives",null,null,null,"Depreciation Expense",null,null,null,null,null,null,null,null,null,null,2018]
["Account","Description","Opening Net  Book Value of Existing Assets as at Date of Policy Change (Jan. 1) 1","Less Fully Depreciated 7","Net Amount of Existing Assets Before Policy Change to be Depreciated ","Opening Gross Book Value of Assets Acquired After Policy Change 2","Less Fully Depreciated 8","Net Amount of Assets Acquired After Policy Change to be Depreciated ","Current Year Additions","Average Remaining Life of Assets Existing Before Policy Change 3","Depreciation Rate Assets Acquired After Policy Change","Life of Assets Acquired After Policy Change 4","Depreciation Rate on New Additions","Depreciation Expense on Assets Existing Before Policy Change","Depreciation Expense on Assets Acquired After Policy Change","Depreciation Expense on Current Year Additions 5","Total Current Year Depreciation Expense ","Depreciation Expense per Appendix 2-BA Fixed Assets, Column J \n ","Variance 6"]
[null,null,"a","b","c = a-b","d","e","f = d- e","g","h","i = 1/h","j","k = 1/j","l = c/h","m = f/j","n = g*0.5/j","o = l+m+n","p","q = p-o"]
[1706,"Land Rights",{"$f":"SUMIF('App.2-BA_Fixed Asset Cont'!$B$154:$B$199,'App.2-C_DepExp'!A199,'App.2-BA_Fixed Asset Cont'!$D$154:$D$199)","v":602307},null,{"$f":"C199-D199","v":602307},{"$f":"+F141+I141","v":0},null,{"$f":"F199-G199","v":0},{"$f":"SUMIF('App.2-BA_Fixed Asset Cont'!$B$290:$B$335,'App.2-C_DepExp'!A199,'App.2-BA_Fixed Asset Cont'!$E$290:$E$335)","v":0},null,{"$f":"IF(J199=0,0,1/J199)","v":0},0,{"$f":"IF(L199=0,0,1/L199)","v":0},{"$f":"IF(J199=0,0,+E199/J199)","v":0},{"$f":"IF(L199=0,0,+H199/L199)","v":0},{"$f":"IF(L199=0,0,+(I199*0.5)/L199)","v":0},{"$f":"IF(ISERROR(+N199+O199+P199), 0, +N199+O199+P199)","v":0},{"$f":"-SUMIF('App.2-BA_Fixed Asset Cont'!$B$290:$B$335,'App.2-C_DepExp'!A199,'App.2-BA_Fixed Asset Cont'!$J$290:$J$335)","v":0},{"$f":"IF(ISERROR(+R199-122), 0, +R199-Q199)","v":0}]
[1725,"Poles and Fixtures",{"$f":"SUMIF('App.2-BA_Fixed Asset Cont'!$B$154:$B$199,'App.2-C_DepExp'!A200,'App.2-BA_Fixed Asset Cont'!$D$154:$D$199)","v":1604340},null,1604340,{"$f":"+F142+I142","v":0},null,0,{"$f":"SUMIF('App.2-BA_Fixed Asset Cont'!$B$290:$B$335,'App.2-C_DepExp'!A200,'App.2-BA_Fixed Asset Cont'!$E$290:$E$335)","v":0},41,2.4390243902439025E-2,45,2.2222222222222223E-2,39130.243902439026,0,0,39130.243902439026,{"$f":"-SUMIF('App.2-BA_Fixed Asset Cont'!$B$290:$B$335,'App.2-C_DepExp'!A200,'App.2-BA_Fixed Asset Cont'!$J$290:$J$335)","v":39130},{"$f":"IF(ISERROR(+R200-122), 0, +R200-Q200)","v":-0.24390243902598741}]
[1730,"Overhead Conductors & Devices",{"$f":"SUMIF('App.2-BA_Fixed Asset Cont'!$B$154:$B$199,'App.2-C_DepExp'!A201,'App.2-BA_Fixed Asset Cont'!$D$154:$D$199)","v":63894},null,63894,0,null,0,{"$f":"SUMIF('App.2-BA_Fixed Asset Cont'!$B$290:$B$335,'App.2-C_DepExp'!A201,'App.2-BA_Fixed Asset Cont'!$E$290:$E$335)","v":0},32,3.125E-2,45,2.2222222222222223E-2,1996.6875,0,0,1996.6875,{"$f":"-SUMIF('App.2-BA_Fixed Asset Cont'!$B$290:$B$335,'App.2-C_DepExp'!A201,'App.2-BA_Fixed Asset Cont'!$J$290:$J$335)","v":1997},{"$f":"IF(ISERROR(+R201-122), 0, +R201-Q201)","v":0.3125}]
[1735,"Underground Conduit",{"$f":"SUMIF('App.2-BA_Fixed Asset Cont'!$B$154:$B$199,'App.2-C_DepExp'!A202,'App.2-BA_Fixed Asset Cont'!$D$154:$D$199)","v":870021},null,870021,0,null,0,{"$f":"SUMIF('App.2-BA_Fixed Asset Cont'!$B$290:$B$335,'App.2-C_DepExp'!A202,'App.2-BA_Fixed Asset Cont'!$E$290:$E$335)","v":0},35,2.8571428571428571E-2,40,2.5000000000000001E-2,24857.742857142857,0,0,24857.742857142857,{"$f":"-SUMIF('App.2-BA_Fixed Asset Cont'!$B$290:$B$335,'App.2-C_DepExp'!A202,'App.2-BA_Fixed Asset Cont'!$J$290:$J$335)","v":24858},0.2571428571427532]
[1740,"Underground Conductors & Devices",{"$f":"SUMIF('App.2-BA_Fixed Asset Cont'!$B$154:$B$199,'App.2-C_DepExp'!A203,'App.2-BA_Fixed Asset Cont'!$D$154:$D$199)","v":215252},null,215252,0,null,0,{"$f":"SUMIF('App.2-BA_Fixed Asset Cont'!$B$290:$B$335,'App.2-C_DepExp'!A203,'App.2-BA_Fixed Asset Cont'!$E$290:$E$335)","v":0},22,4.5454545454545456E-2,25,0.04,9784.181818181818,0,0,9784.181818181818,{"$f":"-SUMIF('App.2-BA_Fixed Asset Cont'!$B$290:$B$335,'App.2-C_DepExp'!A203,'App.2-BA_Fixed Asset Cont'!$J$290:$J$335)","v":9784},-0.18181818181801646]
[1611,"Computer Software (Formally known as Account 1925)",{"$f":"SUMIF('App.2-BA_Fixed Asset Cont'!$B$154:$B$199,'App.2-C_DepExp'!A204,'App.2-BA_Fixed Asset Cont'!$D$154:$D$199)","v":0},null,{"$f":"C204-D204","v":0},0,null,{"$f":"F204-G204","v":0},{"$f":"SUMIF('App.2-BA_Fixed Asset Cont'!$B$290:$B$335,'App.2-C_DepExp'!A204,'App.2-BA_Fixed Asset Cont'!$E$290:$E$335)","v":0},0,{"$f":"IF(J204=0,0,1/J204)","v":0},0,{"$f":"IF(L204=0,0,1/L204)","v":0},{"$f":"IF(J204=0,0,+E204/J204)","v":0},{"$f":"IF(L204=0,0,+H204/L204)","v":0},{"$f":"IF(L204=0,0,+(I204*0.5)/L204)","v":0},{"$f":"IF(ISERROR(+N204+O204+P204), 0, +N204+O204+P204)","v":0},{"$f":"-SUMIF('App.2-BA_Fixed Asset Cont'!$B$290:$B$335,'App.2-C_DepExp'!A204,'App.2-BA_Fixed Asset Cont'!$J$290:$J$335)","v":0},{"$f":"IF(ISERROR(+R204-122), 0, +R204-Q204)","v":0}]
[1612,"Land Rights (Formally known as Account 1906)",{"$f":"SUMIF('App.2-BA_Fixed Asset Cont'!$B$154:$B$199,'App.2-C_DepExp'!A205,'App.2-BA_Fixed Asset Cont'!$D$154:$D$199)","v":0},null,{"$f":"C205-D205","v":0},0,null,{"$f":"F205-G205","v":0},{"$f":"SUMIF('App.2-BA_Fixed Asset Cont'!$B$290:$B$335,'App.2-C_DepExp'!A205,'App.2-BA_Fixed Asset Cont'!$E$290:$E$335)","v":0},0,{"$f":"IF(J205=0,0,1/J205)","v":0},0,{"$f":"IF(L205=0,0,1/L205)","v":0},{"$f":"IF(J205=0,0,+E205/J205)","v":0},{"$f":"IF(L205=0,0,+H205/L205)","v":0},{"$f":"IF(L205=0,0,+(I205*0.5)/L205)","v":0},{"$f":"IF(ISERROR(+N205+O205+P205), 0, +N205+O205+P205)","v":0},{"$f":"-SUMIF('App.2-BA_Fixed Asset Cont'!$B$290:$B$335,'App.2-C_DepExp'!A205,'App.2-BA_Fixed Asset Cont'!$J$290:$J$335)","v":0},{"$f":"IF(ISERROR(+R205-122), 0, +R205-Q205)","v":0}]
[1805,"Land",{"$f":"SUMIF('App.2-BA_Fixed Asset Cont'!$B$154:$B$199,'App.2-C_DepExp'!A206,'App.2-BA_Fixed Asset Cont'!$D$154:$D$199)","v":89160},null,89160,0,null,0,{"$f":"SUMIF('App.2-BA_Fixed Asset Cont'!$B$290:$B$335,'App.2-C_DepExp'!A206,'App.2-BA_Fixed Asset Cont'!$E$290:$E$335)","v":0},0,0,0,0,0,{"$f":"IF(L206=0,0,+H206/L206)","v":0},0,0,{"$f":"-SUMIF('App.2-BA_Fixed Asset Cont'!$B$290:$B$335,'App.2-C_DepExp'!A206,'App.2-BA_Fixed Asset Cont'!$J$290:$J$335)","v":0},0]
[1806,"Land Rights",{"$f":"SUMIF('App.2-BA_Fixed Asset Cont'!$B$154:$B$199,'App.2-C_DepExp'!A207,'App.2-BA_Fixed Asset Cont'!$D$154:$D$199)","v":154128},null,154128,12491,null,12491,{"$f":"SUMIF('App.2-BA_Fixed Asset Cont'!$B$290:$B$335,'App.2-C_DepExp'!A207,'App.2-BA_Fixed Asset Cont'!$E$290:$E$335)","v":7064},0,0,0,0,0,0,0,0,{"$f":"-SUMIF('App.2-BA_Fixed Asset Cont'!$B$290:$B$335,'App.2-C_DepExp'!A207,'App.2-BA_Fixed Asset Cont'!$J$290:$J$335)","v":0},0]
[1808,"Buildings",{"$f":"SUMIF('App.2-BA_Fixed Asset Cont'!$B$154:$B$199,'App.2-C_DepExp'!A208,'App.2-BA_Fixed Asset Cont'!$D$154:$D$199)","v":24624967},null,24624967,311386,null,311386,{"$f":"SUMIF('App.2-BA_Fixed Asset Cont'!$B$290:$B$335,'App.2-C_DepExp'!A208,'App.2-BA_Fixed Asset Cont'!$E$290:$E$335)","v":82630},36.598100000000002,2.7323822821403294E-2,43.85,2.2805017103762829E-2,672848.23529090302,7101.1630558722918,942.1892816419612,680891.5876284173,{"$f":"-SUMIF('App.2-BA_Fixed Asset Cont'!$B$290:$B$335,'App.2-C_DepExp'!A208,'App.2-BA_Fixed Asset Cont'!$J$290:$J$335)","v":680892},{"$f":"IF(ISERROR(+R208-122), 0, +R208-Q208)","v":0.41237158270087093}]
[1810,"Leasehold Improvements",{"$f":"SUMIF('App.2-BA_Fixed Asset Cont'!$B$154:$B$199,'App.2-C_DepExp'!A209,'App.2-BA_Fixed Asset Cont'!$D$154:$D$199)","v":0},null,0,0,null,0,{"$f":"SUMIF('App.2-BA_Fixed Asset Cont'!$B$290:$B$335,'App.2-C_DepExp'!A209,'App.2-BA_Fixed Asset Cont'!$E$290:$E$335)","v":0},0,0,0,0,0,0,0,0,{"$f":"-SUMIF('App.2-BA_Fixed Asset Cont'!$B$290:$B$335,'App.2-C_DepExp'!A209,'App.2-BA_Fixed Asset Cont'!$J$290:$J$335)","v":0},{"$f":"IF(ISERROR(+R209-122), 0, +R209-Q209)","v":0}]
[1815,"Transformer Station Equipment >50 kV",{"$f":"SUMIF('App.2-BA_Fixed Asset Cont'!$B$154:$B$199,'App.2-C_DepExp'!A210,'App.2-BA_Fixed Asset Cont'!$D$154:$D$199)","v":5491722},null,5491722,718106,null,718106,{"$f":"SUMIF('App.2-BA_Fixed Asset Cont'!$B$290:$B$335,'App.2-C_DepExp'!A210,'App.2-BA_Fixed Asset Cont'!$E$290:$E$335)","v":275737},24,4.1666666666666664E-2,40,2.5000000000000001E-2,228821.75,17952.650000000001,3446.7125000000001,250221.11249999999,{"$f":"-SUMIF('App.2-BA_Fixed Asset Cont'!$B$290:$B$335,'App.2-C_DepExp'!A210,'App.2-BA_Fixed Asset Cont'!$J$290:$J$335)","v":250221},-0.11249999998835847]
[1820,"Distribution Station Equipment <50 kV",{"$f":"SUMIF('App.2-BA_Fixed Asset Cont'!$B$154:$B$199,'App.2-C_DepExp'!A211,'App.2-BA_Fixed Asset Cont'!$D$154:$D$199)","v":7812618},null,7812618,2110216,null,2110216,{"$f":"SUMIF('App.2-BA_Fixed Asset Cont'!$B$290:$B$335,'App.2-C_DepExp'!A211,'App.2-BA_Fixed Asset Cont'!$E$290:$E$335)","v":276939},22,4.5454545454545456E-2,40,2.5000000000000001E-2,355119,52755.4,3461.7375000000002,411336.13750000001,{"$f":"-SUMIF('App.2-BA_Fixed Asset Cont'!$B$290:$B$335,'App.2-C_DepExp'!A211,'App.2-BA_Fixed Asset Cont'!$J$290:$J$335)","v":411336},-0.13750000001164153]
[1825,"Storage Battery Equipment",{"$f":"SUMIF('App.2-BA_Fixed Asset Cont'!$B$154:$B$199,'App.2-C_DepExp'!A212,'App.2-BA_Fixed Asset Cont'!$D$154:$D$199)","v":13722},null,13722,0,null,0,{"$f":"SUMIF('App.2-BA_Fixed Asset Cont'!$B$290:$B$335,'App.2-C_DepExp'!A212,'App.2-BA_Fixed Asset Cont'!$E$290:$E$335)","v":0},21,4.7619047619047616E-2,30,3.3333333333333333E-2,653.42857142857144,0,0,653.42857142857144,{"$f":"-SUMIF('App.2-BA_Fixed Asset Cont'!$B$290:$B$335,'App.2-C_DepExp'!A212,'App.2-BA_Fixed Asset Cont'!$J$290:$J$335)","v":653},-0.42857142857144481]
[1830,"Poles, Towers & Fixtures",{"$f":"SUMIF('App.2-BA_Fixed Asset Cont'!$B$154:$B$199,'App.2-C_DepExp'!A213,'App.2-BA_Fixed Asset Cont'!$D$154:$D$199)","v":10446415},null,10446415,4136339,null,4136339,{"$f":"SUMIF('App.2-BA_Fixed Asset Cont'!$B$290:$B$335,'App.2-C_DepExp'!A213,'App.2-BA_Fixed Asset Cont'!$E$290:$E$335)","v":1601920},44,2.2727272727272728E-2,45,2.2222222222222223E-2,237418.52272727274,91918.64444444445,17799.111111111109,347136.27828282828,{"$f":"-SUMIF('App.2-BA_Fixed Asset Cont'!$B$290:$B$335,'App.2-C_DepExp'!A213,'App.2-BA_Fixed Asset Cont'!$J$290:$J$335)","v":347136},-0.27828282827977091]
[1835,"Overhead Conductors & Devices",{"$f":"SUMIF('App.2-BA_Fixed Asset Cont'!$B$154:$B$199,'App.2-C_DepExp'!A214,'App.2-BA_Fixed Asset Cont'!$D$154:$D$199)","v":8345730},null,8345730,2110909,null,2110909,{"$f":"SUMIF('App.2-BA_Fixed Asset Cont'!$B$290:$B$335,'App.2-C_DepExp'!A214,'App.2-BA_Fixed Asset Cont'!$E$290:$E$335)","v":1278318},36,2.7777777777777776E-2,60,1.6666666666666666E-2,231825.83333333334,35181.816666666666,10652.65,277660.30000000005,{"$f":"-SUMIF('App.2-BA_Fixed Asset Cont'!$B$290:$B$335,'App.2-C_DepExp'!A214,'App.2-BA_Fixed Asset Cont'!$J$290:$J$335)","v":277660},-0.30000000004656613]
[1840,"Underground Conduit",{"$f":"SUMIF('App.2-BA_Fixed Asset Cont'!$B$154:$B$199,'App.2-C_DepExp'!A215,'App.2-BA_Fixed Asset Cont'!$D$154:$D$199)","v":2546031},null,2546031,621611,null,621611,{"$f":"SUMIF('App.2-BA_Fixed Asset Cont'!$B$290:$B$335,'App.2-C_DepExp'!A215,'App.2-BA_Fixed Asset Cont'!$E$290:$E$335)","v":377141},12,8.3333333333333329E-2,50,0.02,212169.25,12432.22,3771.41,228372.88,{"$f":"-SUMIF('App.2-BA_Fixed Asset Cont'!$B$290:$B$335,'App.2-C_DepExp'!A215,'App.2-BA_Fixed Asset Cont'!$J$290:$J$335)","v":228373},0.11999999999534339]
[1845,"Underground Conductors & Devices",{"$f":"SUMIF('App.2-BA_Fixed Asset Cont'!$B$154:$B$199,'App.2-C_DepExp'!A216,'App.2-BA_Fixed Asset Cont'!$D$154:$D$199)","v":11437100},null,11437100,1368613,null,1368613,{"$f":"SUMIF('App.2-BA_Fixed Asset Cont'!$B$290:$B$335,'App.2-C_DepExp'!A216,'App.2-BA_Fixed Asset Cont'!$E$290:$E$335)","v":333422},23,4.3478260869565216E-2,40,2.5000000000000001E-2,497265.21739130432,34215.324999999997,4167.7749999999996,535648.3173913043,{"$f":"-SUMIF('App.2-BA_Fixed Asset Cont'!$B$290:$B$335,'App.2-C_DepExp'!A216,'App.2-BA_Fixed Asset Cont'!$J$290:$J$335)","v":535648},-0.31739130429923534]
[1850,"Line Transformers",{"$f":"SUMIF('App.2-BA_Fixed Asset Cont'!$B$154:$B$199,'App.2-C_DepExp'!A217,'App.2-BA_Fixed Asset Cont'!$D$154:$D$199)","v":9204093},null,9204093,1773166,null,1773166,{"$f":"SUMIF('App.2-BA_Fixed Asset Cont'!$B$290:$B$335,'App.2-C_DepExp'!A217,'App.2-BA_Fixed Asset Cont'!$E$290:$E$335)","v":1279182},39,2.564102564102564E-2,40.499989999999997,2.4691364121324475E-2,236002.38461538462,43781.88735355244,15792.374269722042,295576.6462386591,{"$f":"-SUMIF('App.2-BA_Fixed Asset Cont'!$B$290:$B$335,'App.2-C_DepExp'!A217,'App.2-BA_Fixed Asset Cont'!$J$290:$J$335)","v":295574},-2.6462386591010727]
[1855,"Services (Overhead & Underground)",{"$f":"SUMIF('App.2-BA_Fixed Asset Cont'!$B$154:$B$199,'App.2-C_DepExp'!A218,'App.2-BA_Fixed Asset Cont'!$D$154:$D$199)","v":4460589},null,4460589,899458,null,899458,{"$f":"SUMIF('App.2-BA_Fixed Asset Cont'!$B$290:$B$335,'App.2-C_DepExp'!A218,'App.2-BA_Fixed Asset Cont'!$E$290:$E$335)","v":349553},36,2.7777777777777776E-2,40,2.5000000000000001E-2,123905.25,22486.45,4369.4125000000004,150761.11250000002,{"$f":"-SUMIF('App.2-BA_Fixed Asset Cont'!$B$290:$B$335,'App.2-C_DepExp'!A218,'App.2-BA_Fixed Asset Cont'!$J$290:$J$335)","v":150761},-0.1125000000174623]
[1860,"Meters",0,null,0,0,null,0,0,null,0,null,0,0,0,0,0,0,0]
[1860,"Meters (Smart Meters)",{"$f":"SUMIF('App.2-BA_Fixed Asset Cont'!$B$154:$B$199,'App.2-C_DepExp'!A220,'App.2-BA_Fixed Asset Cont'!$D$154:$D$199)","v":4468973},null,4468973,194033,null,194033,{"$f":"SUMIF('App.2-BA_Fixed Asset Cont'!$B$290:$B$335,'App.2-C_DepExp'!A220,'App.2-BA_Fixed Asset Cont'!$E$290:$E$335)","v":83653},11,9.0909090909090912E-2,15,6.6666666666666666E-2,406270.27272727271,12935.533333333333,2788.4333333333334,421994.23939393938,{"$f":"-SUMIF('App.2-BA_Fixed Asset Cont'!$B$290:$B$335,'App.2-C_DepExp'!A220,'App.2-BA_Fixed Asset Cont'!$J$290:$J$335)","v":421994},-0.23939393938053399]
[1905,"Land",{"$f":"SUMIF('App.2-BA_Fixed Asset Cont'!$B$154:$B$199,'App.2-C_DepExp'!A221,'App.2-BA_Fixed Asset Cont'!$D$154:$D$199)","v":0},null,0,0,null,0,{"$f":"SUMIF('App.2-BA_Fixed Asset Cont'!$B$290:$B$335,'App.2-C_DepExp'!A221,'App.2-BA_Fixed Asset Cont'!$E$290:$E$335)","v":0},0,0,null,0,0,0,0,0,{"$f":"-SUMIF('App.2-BA_Fixed Asset Cont'!$B$290:$B$335,'App.2-C_DepExp'!A221,'App.2-BA_Fixed Asset Cont'!$J$290:$J$335)","v":0},0]
[1908,"Buildings & Fixtures",{"$f":"SUMIF('App.2-BA_Fixed Asset Cont'!$B$154:$B$199,'App.2-C_DepExp'!A222,'App.2-BA_Fixed Asset Cont'!$D$154:$D$199)","v":0},null,0,0,null,0,{"$f":"SUMIF('App.2-BA_Fixed Asset Cont'!$B$290:$B$335,'App.2-C_DepExp'!A222,'App.2-BA_Fixed Asset Cont'!$E$290:$E$335)","v":0},0,0,null,0,0,0,0,0,{"$f":"-SUMIF('App.2-BA_Fixed Asset Cont'!$B$290:$B$335,'App.2-C_DepExp'!A222,'App.2-BA_Fixed Asset Cont'!$J$290:$J$335)","v":0},0]
[1910,"Leasehold Improvements",{"$f":"SUMIF('App.2-BA_Fixed Asset Cont'!$B$154:$B$199,'App.2-C_DepExp'!A223,'App.2-BA_Fixed Asset Cont'!$D$154:$D$199)","v":0},null,0,0,null,0,{"$f":"SUMIF('App.2-BA_Fixed Asset Cont'!$B$290:$B$335,'App.2-C_DepExp'!A223,'App.2-BA_Fixed Asset Cont'!$E$290:$E$335)","v":0},0,0,null,0,0,0,0,0,{"$f":"-SUMIF('App.2-BA_Fixed Asset Cont'!$B$290:$B$335,'App.2-C_DepExp'!A223,'App.2-BA_Fixed Asset Cont'!$J$290:$J$335)","v":0},0]
[1915,"Office Furniture & Equipment (10 years)",{"$f":"SUMIF('App.2-BA_Fixed Asset Cont'!$B$154:$B$199,'App.2-C_DepExp'!A224,'App.2-BA_Fixed Asset Cont'!$D$154:$D$199)","v":0},null,0,0,null,0,{"$f":"SUMIF('App.2-BA_Fixed Asset Cont'!$B$290:$B$335,'App.2-C_DepExp'!A224,'App.2-BA_Fixed Asset Cont'!$E$290:$E$335)","v":0},0,0,null,0,0,0,0,0,{"$f":"-SUMIF('App.2-BA_Fixed Asset Cont'!$B$290:$B$335,'App.2-C_DepExp'!A224,'App.2-BA_Fixed Asset Cont'!$J$290:$J$335)","v":0},0]
[1915,"Office Furniture & Equipment (5 years)",{"$f":"SUMIF('App.2-BA_Fixed Asset Cont'!$B$154:$B$199,'App.2-C_DepExp'!A225,'App.2-BA_Fixed Asset Cont'!$D$154:$D$199)","v":0},null,0,0,null,0,{"$f":"SUMIF('App.2-BA_Fixed Asset Cont'!$B$290:$B$335,'App.2-C_DepExp'!A225,'App.2-BA_Fixed Asset Cont'!$E$290:$E$335)","v":0},0,0,null,0,0,0,0,0,{"$f":"-SUMIF('App.2-BA_Fixed Asset Cont'!$B$290:$B$335,'App.2-C_DepExp'!A225,'App.2-BA_Fixed Asset Cont'!$J$290:$J$335)","v":0},0]
[1920,"Computer Equipment - Hardware",{"$f":"SUMIF('App.2-BA_Fixed Asset Cont'!$B$154:$B$199,'App.2-C_DepExp'!A226,'App.2-BA_Fixed Asset Cont'!$D$154:$D$199)","v":1361},1361,0,0,null,0,{"$f":"SUMIF('App.2-BA_Fixed Asset Cont'!$B$290:$B$335,'App.2-C_DepExp'!A226,'App.2-BA_Fixed Asset Cont'!$E$290:$E$335)","v":0},1,1,5,0.2,0,0,0,0,{"$f":"-SUMIF('App.2-BA_Fixed Asset Cont'!$B$290:$B$335,'App.2-C_DepExp'!A226,'App.2-BA_Fixed Asset Cont'!$J$290:$J$335)","v":0},0]
[1920,"Computer Equip.-Hardware(Post Mar. 22/04)",0,null,0,0,null,0,{"$f":"SUMIF('App.2-BA_Fixed Asset Cont'!$B$290:$B$335,'App.2-C_DepExp'!A227,'App.2-BA_Fixed Asset Cont'!$E$290:$E$335)","v":0},0,0,5,0.2,0,0,0,0,{"$f":"-SUMIF('App.2-BA_Fixed Asset Cont'!$B$290:$B$335,'App.2-C_DepExp'!A227,'App.2-BA_Fixed Asset Cont'!$J$290:$J$335)","v":0},0]
[1920,"Computer Equip.-Hardware(Post Mar. 19/07)",0,null,0,0,null,0,{"$f":"SUMIF('App.2-BA_Fixed Asset Cont'!$B$290:$B$335,'App.2-C_DepExp'!A228,'App.2-BA_Fixed Asset Cont'!$E$290:$E$335)","v":0},0,0,5,0.2,0,0,0,0,{"$f":"-SUMIF('App.2-BA_Fixed Asset Cont'!$B$290:$B$335,'App.2-C_DepExp'!A228,'App.2-BA_Fixed Asset Cont'!$J$290:$J$335)","v":0},0]
[1925,"Computer Software",{"$f":"SUMIF('App.2-BA_Fixed Asset Cont'!$B$154:$B$199,'App.2-C_DepExp'!A229,'App.2-BA_Fixed Asset Cont'!$D$154:$D$199)","v":105974},105974,0,0,null,0,{"$f":"SUMIF('App.2-BA_Fixed Asset Cont'!$B$290:$B$335,'App.2-C_DepExp'!A229,'App.2-BA_Fixed Asset Cont'!$E$290:$E$335)","v":0},1,1,5,0.2,0,0,0,0,{"$f":"-SUMIF('App.2-BA_Fixed Asset Cont'!$B$290:$B$335,'App.2-C_DepExp'!A229,'App.2-BA_Fixed Asset Cont'!$J$290:$J$335)","v":0},0]
[1930,"Transportation Equipment",{"$f":"SUMIF('App.2-BA_Fixed Asset Cont'!$B$154:$B$199,'App.2-C_DepExp'!A230,'App.2-BA_Fixed Asset Cont'!$D$154:$D$199)","v":0},null,0,0,null,0,{"$f":"SUMIF('App.2-BA_Fixed Asset Cont'!$B$290:$B$335,'App.2-C_DepExp'!A230,'App.2-BA_Fixed Asset Cont'!$E$290:$E$335)","v":0},0,0,null,0,0,0,0,0,{"$f":"-SUMIF('App.2-BA_Fixed Asset Cont'!$B$290:$B$335,'App.2-C_DepExp'!A230,'App.2-BA_Fixed Asset Cont'!$J$290:$J$335)","v":0},0]
[1935,"Stores Equipment",{"$f":"SUMIF('App.2-BA_Fixed Asset Cont'!$B$154:$B$199,'App.2-C_DepExp'!A231,'App.2-BA_Fixed Asset Cont'!$D$154:$D$199)","v":0},null,0,0,null,0,{"$f":"SUMIF('App.2-BA_Fixed Asset Cont'!$B$290:$B$335,'App.2-C_DepExp'!A231,'App.2-BA_Fixed Asset Cont'!$E$290:$E$335)","v":0},0,0,null,0,0,0,0,0,{"$f":"-SUMIF('App.2-BA_Fixed Asset Cont'!$B$290:$B$335,'App.2-C_DepExp'!A231,'App.2-BA_Fixed Asset Cont'!$J$290:$J$335)","v":0},0]
[1940,"Tools, Shop & Garage Equipment",{"$f":"SUMIF('App.2-BA_Fixed Asset Cont'!$B$154:$B$199,'App.2-C_DepExp'!A232,'App.2-BA_Fixed Asset Cont'!$D$154:$D$199)","v":0},null,0,0,null,0,{"$f":"SUMIF('App.2-BA_Fixed Asset Cont'!$B$290:$B$335,'App.2-C_DepExp'!A232,'App.2-BA_Fixed Asset Cont'!$E$290:$E$335)","v":0},0,0,null,0,0,0,0,0,{"$f":"-SUMIF('App.2-BA_Fixed Asset Cont'!$B$290:$B$335,'App.2-C_DepExp'!A232,'App.2-BA_Fixed Asset Cont'!$J$290:$J$335)","v":0},0]
[1945,"Measurement & Testing Equipment",{"$f":"SUMIF('App.2-BA_Fixed Asset Cont'!$B$154:$B$199,'App.2-C_DepExp'!A233,'App.2-BA_Fixed Asset Cont'!$D$154:$D$199)","v":0},null,0,0,null,0,{"$f":"SUMIF('App.2-BA_Fixed Asset Cont'!$B$290:$B$335,'App.2-C_DepExp'!A233,'App.2-BA_Fixed Asset Cont'!$E$290:$E$335)","v":0},0,0,null,0,0,0,0,0,{"$f":"-SUMIF('App.2-BA_Fixed Asset Cont'!$B$290:$B$335,'App.2-C_DepExp'!A233,'App.2-BA_Fixed Asset Cont'!$J$290:$J$335)","v":0},0]
[1950,"Power Operated Equipment",{"$f":"SUMIF('App.2-BA_Fixed Asset Cont'!$B$154:$B$199,'App.2-C_DepExp'!A234,'App.2-BA_Fixed Asset Cont'!$D$154:$D$199)","v":0},null,0,0,null,0,{"$f":"SUMIF('App.2-BA_Fixed Asset Cont'!$B$290:$B$335,'App.2-C_DepExp'!A234,'App.2-BA_Fixed Asset Cont'!$E$290:$E$335)","v":0},0,0,null,0,0,0,0,0,{"$f":"-SUMIF('App.2-BA_Fixed Asset Cont'!$B$290:$B$335,'App.2-C_DepExp'!A234,'App.2-BA_Fixed Asset Cont'!$J$290:$J$335)","v":0},0]
[1955,"Communications Equipment",{"$f":"SUMIF('App.2-BA_Fixed Asset Cont'!$B$154:$B$199,'App.2-C_DepExp'!A235,'App.2-BA_Fixed Asset Cont'!$D$154:$D$199)","v":0},null,0,0,null,0,{"$f":"SUMIF('App.2-BA_Fixed Asset Cont'!$B$290:$B$335,'App.2-C_DepExp'!A235,'App.2-BA_Fixed Asset Cont'!$E$290:$E$335)","v":0},0,0,null,0,0,0,0,0,{"$f":"-SUMIF('App.2-BA_Fixed Asset Cont'!$B$290:$B$335,'App.2-C_DepExp'!A235,'App.2-BA_Fixed Asset Cont'!$J$290:$J$335)","v":0},0]
[1955,"Communication Equipment (Smart Meters)",{"$f":"SUMIF('App.2-BA_Fixed Asset Cont'!$B$154:$B$199,'App.2-C_DepExp'!A236,'App.2-BA_Fixed Asset Cont'!$D$154:$D$199)","v":0},null,0,0,null,0,{"$f":"SUMIF('App.2-BA_Fixed Asset Cont'!$B$290:$B$335,'App.2-C_DepExp'!A236,'App.2-BA_Fixed Asset Cont'!$E$290:$E$335)","v":0},0,0,null,0,0,0,0,0,{"$f":"-SUMIF('App.2-BA_Fixed Asset Cont'!$B$290:$B$335,'App.2-C_DepExp'!A236,'App.2-BA_Fixed Asset Cont'!$J$290:$J$335)","v":0},0]
[1960,"Miscellaneous Equipment ",{"$f":"SUMIF('App.2-BA_Fixed Asset Cont'!$B$154:$B$199,'App.2-C_DepExp'!A237,'App.2-BA_Fixed Asset Cont'!$D$154:$D$199)","v":0},null,0,0,null,0,{"$f":"SUMIF('App.2-BA_Fixed Asset Cont'!$B$290:$B$335,'App.2-C_DepExp'!A237,'App.2-BA_Fixed Asset Cont'!$E$290:$E$335)","v":0},0,0,null,0,0,0,0,0,{"$f":"-SUMIF('App.2-BA_Fixed Asset Cont'!$B$290:$B$335,'App.2-C_DepExp'!A237,'App.2-BA_Fixed Asset Cont'!$J$290:$J$335)","v":0},0]
[1970,"Load Management Controls Customer Premises",{"$f":"SUMIF('App.2-BA_Fixed Asset Cont'!$B$154:$B$199,'App.2-C_DepExp'!A238,'App.2-BA_Fixed Asset Cont'!$D$154:$D$199)","v":0},null,0,0,null,0,{"$f":"SUMIF('App.2-BA_Fixed Asset Cont'!$B$290:$B$335,'App.2-C_DepExp'!A238,'App.2-BA_Fixed Asset Cont'!$E$290:$E$335)","v":0},0,0,null,0,0,0,0,0,{"$f":"-SUMIF('App.2-BA_Fixed Asset Cont'!$B$290:$B$335,'App.2-C_DepExp'!A238,'App.2-BA_Fixed Asset Cont'!$J$290:$J$335)","v":0},0]
[1975,"Load Management Controls Utility Premises",{"$f":"SUMIF('App.2-BA_Fixed Asset Cont'!$B$154:$B$199,'App.2-C_DepExp'!A239,'App.2-BA_Fixed Asset Cont'!$D$154:$D$199)","v":0},null,0,0,null,0,{"$f":"SUMIF('App.2-BA_Fixed Asset Cont'!$B$290:$B$335,'App.2-C_DepExp'!A239,'App.2-BA_Fixed Asset Cont'!$E$290:$E$335)","v":0},0,0,null,0,0,0,0,0,{"$f":"-SUMIF('App.2-BA_Fixed Asset Cont'!$B$290:$B$335,'App.2-C_DepExp'!A239,'App.2-BA_Fixed Asset Cont'!$J$290:$J$335)","v":0},0]
[1980,"System Supervisor Equipment",{"$f":"SUMIF('App.2-BA_Fixed Asset Cont'!$B$154:$B$199,'App.2-C_DepExp'!A240,'App.2-BA_Fixed Asset Cont'!$D$154:$D$199)","v":1381611},null,1381611,161144,null,161144,{"$f":"SUMIF('App.2-BA_Fixed Asset Cont'!$B$290:$B$335,'App.2-C_DepExp'!A240,'App.2-BA_Fixed Asset Cont'!$E$290:$E$335)","v":43067},6,0.16666666666666666,20,0.05,230268.5,8057.2,1076.675,239402.375,{"$f":"-SUMIF('App.2-BA_Fixed Asset Cont'!$B$290:$B$335,'App.2-C_DepExp'!A240,'App.2-BA_Fixed Asset Cont'!$J$290:$J$335)","v":239402},-0.375]
[1985,"Miscellaneous Fixed Assets",{"$f":"SUMIF('App.2-BA_Fixed Asset Cont'!$B$154:$B$199,'App.2-C_DepExp'!A241,'App.2-BA_Fixed Asset Cont'!$D$154:$D$199)","v":0},null,0,0,null,0,{"$f":"SUMIF('App.2-BA_Fixed Asset Cont'!$B$290:$B$335,'App.2-C_DepExp'!A241,'App.2-BA_Fixed Asset Cont'!$E$290:$E$335)","v":0},0,0,null,0,0,0,0,0,{"$f":"-SUMIF('App.2-BA_Fixed Asset Cont'!$B$290:$B$335,'App.2-C_DepExp'!A241,'App.2-BA_Fixed Asset Cont'!$J$290:$J$335)","v":0},0]
[1990,"Other Tangible Property",{"$f":"SUMIF('App.2-BA_Fixed Asset Cont'!$B$154:$B$199,'App.2-C_DepExp'!A242,'App.2-BA_Fixed Asset Cont'!$D$154:$D$199)","v":0},null,0,0,null,0,{"$f":"SUMIF('App.2-BA_Fixed Asset Cont'!$B$290:$B$335,'App.2-C_DepExp'!A242,'App.2-BA_Fixed Asset Cont'!$E$290:$E$335)","v":0},0,0,null,0,0,0,0,0,{"$f":"-SUMIF('App.2-BA_Fixed Asset Cont'!$B$290:$B$335,'App.2-C_DepExp'!A242,'App.2-BA_Fixed Asset Cont'!$J$290:$J$335)","v":0},0]
[1995,"Contributions & Grants",{"$f":"SUMIF('App.2-BA_Fixed Asset Cont'!$B$154:$B$199,'App.2-C_DepExp'!A243,'App.2-BA_Fixed Asset Cont'!$D$154:$D$199)","v":-11161740},null,-11161740,0,null,0,{"$f":"SUMIF('App.2-BA_Fixed Asset Cont'!$B$290:$B$335,'App.2-C_DepExp'!A243,'App.2-BA_Fixed Asset Cont'!$E$290:$E$335)","v":0},34,2.9411764705882353E-2,40,2.5000000000000001E-2,-328286.4705882353,0,0,-328286.4705882353,{"$f":"-SUMIF('App.2-BA_Fixed Asset Cont'!$B$290:$B$335,'App.2-C_DepExp'!A243,'App.2-BA_Fixed Asset Cont'!$J$290:$J$335)","v":-328286},0.47058823530096561]
[null,"Total",{"$f":"SUM(C199:C243)","v":82778268},{"$f":"SUM(D199:D243)","v":107335},82670933,14417472,0,14417472,5988626,null,null,null,null,{"$f":"SUM(N199:N243)","v":3180050.0301464275},338818.28985386918,68268.480495808457,3587136.8004961051,3587133,-3.8004961054001569]
[]
[]
[]
["Scenario that applies",null,"Applicable Years and Accounting Standard",null,null,null,null,null,null,null,null,null,null,null,null,null,null,"Year Reflected in Schedule Below","Accounting Standard Reflected in Schedule Below",null,null,null,null,null,2012]
["Rebasing for the first time with depreciation policy changes made in 2012.",null,"This appendix must be duplicated and completed for the years 2012 to 2018. The appendix for 2012 is to be completed under CGAAP (prior to changes in depreciation policies). The appendix for 2012 to 2014 must be completed under Revised CGAAP (after changes in depreciation policies). The appendix for 2014 to 2018 is to be completed under MIFRS (2014 if changes to MIFRS are material).",null,null,null,null,null,null,null,null,null,null,null,null,null,null,null,null,null,null,null,null,null,2013]
["Rebasing for the first time with depreciation policy changes made in 2013.",null,"This appendix must be duplicated and completed for the years 2013 to 2018. The appendix for 2013 is to be completed under CGAAP (prior to changes in depreciation policies). The appendix for 2013 to 2014 must be completed under Revised CGAAP (after changes in depreciation policies). The appendix for 2014 to 2018 is to be completed under MIFRS (2014 if changes to MIFRS are material).",null,null,null,null,null,null,null,null,null,null,null,null,null,null,null,null,null,null,null,null,null,2014]
["Already rebased with depreciation policy changes in a prior rate application",null,"This appendix must be completed for 2014 to 2018. The appendix for 2014 is to be completed under Revised CGAAP (after changes in depreciation policies). The appendix for 2014 to 2018 is to be completed under MIFRS (2014 if changes to MIFRS are material).",null,null,null,null,null,null,null,null,null,null,null,null,null,null,2017,"MIFRS",null,null,null,null,null,2015]
[null,null,null,null,null,null,null,null,null,null,null,null,null,null,null,null,null,null,null,null,null,null,null,null,2016]
[null,null,null,null,null,null,null,null,null,null,null,null,null,null,null,null,null,null,null,null,null,null,null,null,2017]
[null,null,"Book Values",null,null,null,null,null,null,"Service Lives",null,null,null,"Depreciation Expense",null,null,null,null,null,null,null,null,null,null,2018]
["Account","Description","Opening Net  Book Value of Existing Assets as at Date of Policy Change (Jan. 1) 1","Less Fully Depreciated 7","Net Amount of Existing Assets Before Policy Change to be Depreciated ","Opening Gross Book Value of Assets Acquired After Policy Change 2","Less Fully Depreciated 8","Net Amount of Assets Acquired After Policy Change to be Depreciated ","Current Year Additions","Average Remaining Life of Assets Existing Before Policy Change 3","Depreciation Rate Assets Acquired After Policy Change","Life of Assets Acquired After Policy Change 4","Depreciation Rate on New Additions","Depreciation Expense on Assets Existing Before Policy Change","Depreciation Expense on Assets Acquired After Policy Change","Depreciation Expense on Current Year Additions 5","Total Current Year Depreciation Expense ","Depreciation Expense per Appendix 2-BA Fixed Assets, Column J \n ","Variance 6"]
[null,null,"a","b","c = a-b","d","e","f = d- e","g","h","i = 1/h","j","k = 1/j","l = c/h","m = f/j","n = g*0.5/j","o = l+m+n","p","q = p-o"]
[1706,"Land Rights",{"$f":"SUMIF('App.2-BA_Fixed Asset Cont'!$B$154:$B$199,'App.2-C_DepExp'!A257,'App.2-BA_Fixed Asset Cont'!$D$154:$D$199)","v":602307},null,{"$f":"C257-D257","v":602307},{"$f":"+F199+I199","v":0},null,{"$f":"F257-G257","v":0},{"$f":"SUMIF('App.2-BA_Fixed Asset Cont'!$B$358:$B$403,'App.2-C_DepExp'!A257,'App.2-BA_Fixed Asset Cont'!$E$358:$E$403)","v":0},null,{"$f":"IF(J257=0,0,1/J257)","v":0},0,{"$f":"IF(L257=0,0,1/L257)","v":0},{"$f":"IF(J257=0,0,+E257/J257)","v":0},{"$f":"IF(L257=0,0,+H257/L257)","v":0},{"$f":"IF(L257=0,0,+(I257*0.5)/L257)","v":0},{"$f":"IF(ISERROR(+N257+O257+P257), 0, +N257+O257+P257)","v":0},{"$f":"-SUMIF('App.2-BA_Fixed Asset Cont'!$B$358:$B$403,'App.2-C_DepExp'!A257,'App.2-BA_Fixed Asset Cont'!$J$358:$J$403)","v":0},{"$f":"IF(ISERROR(+R257-122), 0, +R257-Q257)","v":0}]
[1725,"Poles and Fixtures",{"$f":"SUMIF('App.2-BA_Fixed Asset Cont'!$B$154:$B$199,'App.2-C_DepExp'!A258,'App.2-BA_Fixed Asset Cont'!$D$154:$D$199)","v":1604340},null,1604340,{"$f":"+F200+I200","v":0},null,0,{"$f":"SUMIF('App.2-BA_Fixed Asset Cont'!$B$358:$B$403,'App.2-C_DepExp'!A258,'App.2-BA_Fixed Asset Cont'!$E$358:$E$403)","v":0},41,2.4390243902439025E-2,45,2.2222222222222223E-2,39130.243902439026,0,0,39130.243902439026,{"$f":"-SUMIF('App.2-BA_Fixed Asset Cont'!$B$358:$B$403,'App.2-C_DepExp'!A258,'App.2-BA_Fixed Asset Cont'!$J$358:$J$403)","v":39130},{"$f":"IF(ISERROR(+R258-122), 0, +R258-Q258)","v":-0.24390243902598741}]
[1730,"Overhead Conductors & Devices",{"$f":"SUMIF('App.2-BA_Fixed Asset Cont'!$B$154:$B$199,'App.2-C_DepExp'!A259,'App.2-BA_Fixed Asset Cont'!$D$154:$D$199)","v":63894},null,63894,0,null,0,{"$f":"SUMIF('App.2-BA_Fixed Asset Cont'!$B$358:$B$403,'App.2-C_DepExp'!A259,'App.2-BA_Fixed Asset Cont'!$E$358:$E$403)","v":0},32,3.125E-2,45,2.2222222222222223E-2,1996.6875,0,0,1996.6875,{"$f":"-SUMIF('App.2-BA_Fixed Asset Cont'!$B$358:$B$403,'App.2-C_DepExp'!A259,'App.2-BA_Fixed Asset Cont'!$J$358:$J$403)","v":1997},{"$f":"IF(ISERROR(+R259-122), 0, +R259-Q259)","v":0.3125}]
[1735,"Underground Conduit",{"$f":"SUMIF('App.2-BA_Fixed Asset Cont'!$B$154:$B$199,'App.2-C_DepExp'!A260,'App.2-BA_Fixed Asset Cont'!$D$154:$D$199)","v":870021},null,870021,0,null,0,{"$f":"SUMIF('App.2-BA_Fixed Asset Cont'!$B$358:$B$403,'App.2-C_DepExp'!A260,'App.2-BA_Fixed Asset Cont'!$E$358:$E$403)","v":0},35,2.8571428571428571E-2,40,2.5000000000000001E-2,24857.742857142857,0,0,24857.742857142857,{"$f":"-SUMIF('App.2-BA_Fixed Asset Cont'!$B$358:$B$403,'App.2-C_DepExp'!A260,'App.2-BA_Fixed Asset Cont'!$J$358:$J$403)","v":24858},0.2571428571427532]
[1740,"Underground Conductors & Devices",{"$f":"SUMIF('App.2-BA_Fixed Asset Cont'!$B$154:$B$199,'App.2-C_DepExp'!A261,'App.2-BA_Fixed Asset Cont'!$D$154:$D$199)","v":215252},null,215252,0,null,0,{"$f":"SUMIF('App.2-BA_Fixed Asset Cont'!$B$358:$B$403,'App.2-C_DepExp'!A261,'App.2-BA_Fixed Asset Cont'!$E$358:$E$403)","v":0},22,4.5454545454545456E-2,25,0.04,9784.181818181818,0,0,9784.181818181818,{"$f":"-SUMIF('App.2-BA_Fixed Asset Cont'!$B$358:$B$403,'App.2-C_DepExp'!A261,'App.2-BA_Fixed Asset Cont'!$J$358:$J$403)","v":9784},-0.18181818181801646]
[1611,"Computer Software (Formally known as Account 1925)",{"$f":"SUMIF('App.2-BA_Fixed Asset Cont'!$B$154:$B$199,'App.2-C_DepExp'!A262,'App.2-BA_Fixed Asset Cont'!$D$154:$D$199)","v":0},null,{"$f":"C262-D262","v":0},0,null,{"$f":"F262-G262","v":0},{"$f":"SUMIF('App.2-BA_Fixed Asset Cont'!$B$358:$B$403,'App.2-C_DepExp'!A262,'App.2-BA_Fixed Asset Cont'!$E$358:$E$403)","v":0},0,{"$f":"IF(J262=0,0,1/J262)","v":0},0,{"$f":"IF(L262=0,0,1/L262)","v":0},{"$f":"IF(J262=0,0,+E262/J262)","v":0},{"$f":"IF(L262=0,0,+H262/L262)","v":0},{"$f":"IF(L262=0,0,+(I262*0.5)/L262)","v":0},{"$f":"IF(ISERROR(+N262+O262+P262), 0, +N262+O262+P262)","v":0},{"$f":"-SUMIF('App.2-BA_Fixed Asset Cont'!$B$358:$B$403,'App.2-C_DepExp'!A262,'App.2-BA_Fixed Asset Cont'!$J$358:$J$403)","v":0},{"$f":"IF(ISERROR(+R262-122), 0, +R262-Q262)","v":0}]
[1612,"Land Rights (Formally known as Account 1906)",{"$f":"SUMIF('App.2-BA_Fixed Asset Cont'!$B$154:$B$199,'App.2-C_DepExp'!A263,'App.2-BA_Fixed Asset Cont'!$D$154:$D$199)","v":0},null,{"$f":"C263-D263","v":0},0,null,{"$f":"F263-G263","v":0},{"$f":"SUMIF('App.2-BA_Fixed Asset Cont'!$B$358:$B$403,'App.2-C_DepExp'!A263,'App.2-BA_Fixed Asset Cont'!$E$358:$E$403)","v":0},0,{"$f":"IF(J263=0,0,1/J263)","v":0},0,{"$f":"IF(L263=0,0,1/L263)","v":0},{"$f":"IF(J263=0,0,+E263/J263)","v":0},{"$f":"IF(L263=0,0,+H263/L263)","v":0},{"$f":"IF(L263=0,0,+(I263*0.5)/L263)","v":0},{"$f":"IF(ISERROR(+N263+O263+P263), 0, +N263+O263+P263)","v":0},{"$f":"-SUMIF('App.2-BA_Fixed Asset Cont'!$B$358:$B$403,'App.2-C_DepExp'!A263,'App.2-BA_Fixed Asset Cont'!$J$358:$J$403)","v":0},{"$f":"IF(ISERROR(+R263-122), 0, +R263-Q263)","v":0}]
[1805,"Land",{"$f":"SUMIF('App.2-BA_Fixed Asset Cont'!$B$154:$B$199,'App.2-C_DepExp'!A264,'App.2-BA_Fixed Asset Cont'!$D$154:$D$199)","v":89160},null,89160,0,null,0,{"$f":"SUMIF('App.2-BA_Fixed Asset Cont'!$B$358:$B$403,'App.2-C_DepExp'!A264,'App.2-BA_Fixed Asset Cont'!$E$358:$E$403)","v":0},0,0,0,0,0,{"$f":"IF(L264=0,0,+H264/L264)","v":0},0,0,{"$f":"-SUMIF('App.2-BA_Fixed Asset Cont'!$B$358:$B$403,'App.2-C_DepExp'!A264,'App.2-BA_Fixed Asset Cont'!$J$358:$J$403)","v":0},0]
[1806,"Land Rights",{"$f":"SUMIF('App.2-BA_Fixed Asset Cont'!$B$154:$B$199,'App.2-C_DepExp'!A265,'App.2-BA_Fixed Asset Cont'!$D$154:$D$199)","v":154128},null,154128,19555,null,19555,{"$f":"SUMIF('App.2-BA_Fixed Asset Cont'!$B$358:$B$403,'App.2-C_DepExp'!A265,'App.2-BA_Fixed Asset Cont'!$E$358:$E$403)","v":5268},0,0,0,0,0,0,0,0,{"$f":"-SUMIF('App.2-BA_Fixed Asset Cont'!$B$358:$B$403,'App.2-C_DepExp'!A265,'App.2-BA_Fixed Asset Cont'!$J$358:$J$403)","v":0},0]
[1808,"Buildings",{"$f":"SUMIF('App.2-BA_Fixed Asset Cont'!$B$154:$B$199,'App.2-C_DepExp'!A266,'App.2-BA_Fixed Asset Cont'!$D$154:$D$199)","v":24624967},null,24624967,394016,null,394016,{"$f":"SUMIF('App.2-BA_Fixed Asset Cont'!$B$358:$B$403,'App.2-C_DepExp'!A266,'App.2-BA_Fixed Asset Cont'!$E$358:$E$403)","v":8109},36.598100000000002,2.7323822821403294E-2,43.85,2.2805017103762829E-2,672848.23529090302,8985.5416191562144,92.46294184720638,681926.23985190643,{"$f":"-SUMIF('App.2-BA_Fixed Asset Cont'!$B$358:$B$403,'App.2-C_DepExp'!A266,'App.2-BA_Fixed Asset Cont'!$J$358:$J$403)","v":682707},{"$f":"IF(ISERROR(+R266-122), 0, +R266-Q266)","v":780.76014809357002}]
[1810,"Leasehold Improvements",{"$f":"SUMIF('App.2-BA_Fixed Asset Cont'!$B$154:$B$199,'App.2-C_DepExp'!A267,'App.2-BA_Fixed Asset Cont'!$D$154:$D$199)","v":0},null,0,0,null,0,{"$f":"SUMIF('App.2-BA_Fixed Asset Cont'!$B$358:$B$403,'App.2-C_DepExp'!A267,'App.2-BA_Fixed Asset Cont'!$E$358:$E$403)","v":0},0,0,0,0,0,0,0,0,{"$f":"-SUMIF('App.2-BA_Fixed Asset Cont'!$B$358:$B$403,'App.2-C_DepExp'!A267,'App.2-BA_Fixed Asset Cont'!$J$358:$J$403)","v":0},{"$f":"IF(ISERROR(+R267-122), 0, +R267-Q267)","v":0}]
[1815,"Transformer Station Equipment >50 kV",{"$f":"SUMIF('App.2-BA_Fixed Asset Cont'!$B$154:$B$199,'App.2-C_DepExp'!A268,'App.2-BA_Fixed Asset Cont'!$D$154:$D$199)","v":5491722},null,5491722,993843,null,993843,{"$f":"SUMIF('App.2-BA_Fixed Asset Cont'!$B$358:$B$403,'App.2-C_DepExp'!A268,'App.2-BA_Fixed Asset Cont'!$E$358:$E$403)","v":1177041},24,4.1666666666666664E-2,40,2.5000000000000001E-2,228821.75,24846.075000000001,14713.012500000001,268380.83750000002,{"$f":"-SUMIF('App.2-BA_Fixed Asset Cont'!$B$358:$B$403,'App.2-C_DepExp'!A268,'App.2-BA_Fixed Asset Cont'!$J$358:$J$403)","v":268381},0.16249999997671694]
[1820,"Distribution Station Equipment <50 kV",{"$f":"SUMIF('App.2-BA_Fixed Asset Cont'!$B$154:$B$199,'App.2-C_DepExp'!A269,'App.2-BA_Fixed Asset Cont'!$D$154:$D$199)","v":7812618},null,7812618,2387155,null,2387155,{"$f":"SUMIF('App.2-BA_Fixed Asset Cont'!$B$358:$B$403,'App.2-C_DepExp'!A269,'App.2-BA_Fixed Asset Cont'!$E$358:$E$403)","v":310869},22,4.5454545454545456E-2,40,2.5000000000000001E-2,355119,59678.875,3885.8625000000002,418683.73749999999,{"$f":"-SUMIF('App.2-BA_Fixed Asset Cont'!$B$358:$B$403,'App.2-C_DepExp'!A269,'App.2-BA_Fixed Asset Cont'!$J$358:$J$403)","v":418684},0.26250000001164153]
[1825,"Storage Battery Equipment",{"$f":"SUMIF('App.2-BA_Fixed Asset Cont'!$B$154:$B$199,'App.2-C_DepExp'!A270,'App.2-BA_Fixed Asset Cont'!$D$154:$D$199)","v":13722},null,13722,0,null,0,{"$f":"SUMIF('App.2-BA_Fixed Asset Cont'!$B$358:$B$403,'App.2-C_DepExp'!A270,'App.2-BA_Fixed Asset Cont'!$E$358:$E$403)","v":0},21,4.7619047619047616E-2,30,3.3333333333333333E-2,653.42857142857144,0,0,653.42857142857144,{"$f":"-SUMIF('App.2-BA_Fixed Asset Cont'!$B$358:$B$403,'App.2-C_DepExp'!A270,'App.2-BA_Fixed Asset Cont'!$J$358:$J$403)","v":653},-0.42857142857144481]
[1830,"Poles, Towers & Fixtures",{"$f":"SUMIF('App.2-BA_Fixed Asset Cont'!$B$154:$B$199,'App.2-C_DepExp'!A271,'App.2-BA_Fixed Asset Cont'!$D$154:$D$199)","v":10446415},null,10446415,5738259,null,5738259,{"$f":"SUMIF('App.2-BA_Fixed Asset Cont'!$B$358:$B$403,'App.2-C_DepExp'!A271,'App.2-BA_Fixed Asset Cont'!$E$358:$E$403)","v":1623430},44,2.2727272727272728E-2,45,2.2222222222222223E-2,237418.52272727274,127516.86666666667,18038.111111111109,382973.50050505053,{"$f":"-SUMIF('App.2-BA_Fixed Asset Cont'!$B$358:$B$403,'App.2-C_DepExp'!A271,'App.2-BA_Fixed Asset Cont'!$J$358:$J$403)","v":382973},-0.5005050505278632]
[1835,"Overhead Conductors & Devices",{"$f":"SUMIF('App.2-BA_Fixed Asset Cont'!$B$154:$B$199,'App.2-C_DepExp'!A272,'App.2-BA_Fixed Asset Cont'!$D$154:$D$199)","v":8345730},null,8345730,3389227,null,3389227,{"$f":"SUMIF('App.2-BA_Fixed Asset Cont'!$B$358:$B$403,'App.2-C_DepExp'!A272,'App.2-BA_Fixed Asset Cont'!$E$358:$E$403)","v":1250521},36,2.7777777777777776E-2,60,1.6666666666666666E-2,231825.83333333334,56487.116666666669,10421.008333333333,298733.95833333337,{"$f":"-SUMIF('App.2-BA_Fixed Asset Cont'!$B$358:$B$403,'App.2-C_DepExp'!A272,'App.2-BA_Fixed Asset Cont'!$J$358:$J$403)","v":298734},4.1666666627861559E-2]
[1840,"Underground Conduit",{"$f":"SUMIF('App.2-BA_Fixed Asset Cont'!$B$154:$B$199,'App.2-C_DepExp'!A273,'App.2-BA_Fixed Asset Cont'!$D$154:$D$199)","v":2546031},null,2546031,998752,null,998752,{"$f":"SUMIF('App.2-BA_Fixed Asset Cont'!$B$358:$B$403,'App.2-C_DepExp'!A273,'App.2-BA_Fixed Asset Cont'!$E$358:$E$403)","v":117276},12,8.3333333333333329E-2,50,0.02,212169.25,19975.04,1172.76,233317.05000000002,{"$f":"-SUMIF('App.2-BA_Fixed Asset Cont'!$B$358:$B$403,'App.2-C_DepExp'!A273,'App.2-BA_Fixed Asset Cont'!$J$358:$J$403)","v":233317},-5.0000000017462298E-2]
[1845,"Underground Conductors & Devices",{"$f":"SUMIF('App.2-BA_Fixed Asset Cont'!$B$154:$B$199,'App.2-C_DepExp'!A274,'App.2-BA_Fixed Asset Cont'!$D$154:$D$199)","v":11437100},null,11437100,1702035,null,1702035,{"$f":"SUMIF('App.2-BA_Fixed Asset Cont'!$B$358:$B$403,'App.2-C_DepExp'!A274,'App.2-BA_Fixed Asset Cont'!$E$358:$E$403)","v":308142},23,4.3478260869565216E-2,40,2.5000000000000001E-2,497265.21739130432,42550.875,3851.7750000000001,543667.86739130435,{"$f":"-SUMIF('App.2-BA_Fixed Asset Cont'!$B$358:$B$403,'App.2-C_DepExp'!A274,'App.2-BA_Fixed Asset Cont'!$J$358:$J$403)","v":543668},0.13260869565419853]
[1850,"Line Transformers",{"$f":"SUMIF('App.2-BA_Fixed Asset Cont'!$B$154:$B$199,'App.2-C_DepExp'!A275,'App.2-BA_Fixed Asset Cont'!$D$154:$D$199)","v":9204093},null,9204093,3052348,null,3052348,{"$f":"SUMIF('App.2-BA_Fixed Asset Cont'!$B$358:$B$403,'App.2-C_DepExp'!A275,'App.2-BA_Fixed Asset Cont'!$E$358:$E$403)","v":1077745},39,2.564102564102564E-2,40,2.5000000000000001E-2,236002.38461538462,76308.7,13471.8125,325782.89711538464,{"$f":"-SUMIF('App.2-BA_Fixed Asset Cont'!$B$358:$B$403,'App.2-C_DepExp'!A275,'App.2-BA_Fixed Asset Cont'!$J$358:$J$403)","v":324289},-1493.897115384636]
[1855,"Services (Overhead & Underground)",{"$f":"SUMIF('App.2-BA_Fixed Asset Cont'!$B$154:$B$199,'App.2-C_DepExp'!A276,'App.2-BA_Fixed Asset Cont'!$D$154:$D$199)","v":4460589},null,4460589,1249011,null,1249011,{"$f":"SUMIF('App.2-BA_Fixed Asset Cont'!$B$358:$B$403,'App.2-C_DepExp'!A276,'App.2-BA_Fixed Asset Cont'!$E$358:$E$403)","v":367032},36,2.7777777777777776E-2,40,2.5000000000000001E-2,123905.25,31225.275000000001,4587.8999999999996,159718.42499999999,{"$f":"-SUMIF('App.2-BA_Fixed Asset Cont'!$B$358:$B$403,'App.2-C_DepExp'!A276,'App.2-BA_Fixed Asset Cont'!$J$358:$J$403)","v":159718},-0.42499999998835847]
[1860,"Meters",0,null,0,0,null,0,0,null,0,null,0,0,0,0,0,0,0]
[1860,"Meters (Smart Meters)",{"$f":"SUMIF('App.2-BA_Fixed Asset Cont'!$B$154:$B$199,'App.2-C_DepExp'!A278,'App.2-BA_Fixed Asset Cont'!$D$154:$D$199)","v":4468973},null,4468973,277686,null,277686,{"$f":"SUMIF('App.2-BA_Fixed Asset Cont'!$B$358:$B$403,'App.2-C_DepExp'!A278,'App.2-BA_Fixed Asset Cont'!$E$358:$E$403)","v":91908},11,9.0909090909090912E-2,15,6.6666666666666666E-2,406270.27272727271,18512.400000000001,3063.6,427846.27272727271,{"$f":"-SUMIF('App.2-BA_Fixed Asset Cont'!$B$358:$B$403,'App.2-C_DepExp'!A278,'App.2-BA_Fixed Asset Cont'!$J$358:$J$403)","v":427846},-0.27272727270610631]
[1905,"Land",{"$f":"SUMIF('App.2-BA_Fixed Asset Cont'!$B$154:$B$199,'App.2-C_DepExp'!A279,'App.2-BA_Fixed Asset Cont'!$D$154:$D$199)","v":0},null,0,0,null,0,{"$f":"SUMIF('App.2-BA_Fixed Asset Cont'!$B$358:$B$403,'App.2-C_DepExp'!A279,'App.2-BA_Fixed Asset Cont'!$E$358:$E$403)","v":0},0,0,null,0,0,0,0,0,{"$f":"-SUMIF('App.2-BA_Fixed Asset Cont'!$B$358:$B$403,'App.2-C_DepExp'!A279,'App.2-BA_Fixed Asset Cont'!$J$358:$J$403)","v":0},0]
[1908,"Buildings & Fixtures",{"$f":"SUMIF('App.2-BA_Fixed Asset Cont'!$B$154:$B$199,'App.2-C_DepExp'!A280,'App.2-BA_Fixed Asset Cont'!$D$154:$D$199)","v":0},null,0,0,null,0,{"$f":"SUMIF('App.2-BA_Fixed Asset Cont'!$B$358:$B$403,'App.2-C_DepExp'!A280,'App.2-BA_Fixed Asset Cont'!$E$358:$E$403)","v":0},0,0,null,0,0,0,0,0,{"$f":"-SUMIF('App.2-BA_Fixed Asset Cont'!$B$358:$B$403,'App.2-C_DepExp'!A280,'App.2-BA_Fixed Asset Cont'!$J$358:$J$403)","v":0},0]
[1910,"Leasehold Improvements",{"$f":"SUMIF('App.2-BA_Fixed Asset Cont'!$B$154:$B$199,'App.2-C_DepExp'!A281,'App.2-BA_Fixed Asset Cont'!$D$154:$D$199)","v":0},null,0,0,null,0,{"$f":"SUMIF('App.2-BA_Fixed Asset Cont'!$B$358:$B$403,'App.2-C_DepExp'!A281,'App.2-BA_Fixed Asset Cont'!$E$358:$E$403)","v":0},0,0,null,0,0,0,0,0,{"$f":"-SUMIF('App.2-BA_Fixed Asset Cont'!$B$358:$B$403,'App.2-C_DepExp'!A281,'App.2-BA_Fixed Asset Cont'!$J$358:$J$403)","v":0},0]
[1915,"Office Furniture & Equipment (10 years)",{"$f":"SUMIF('App.2-BA_Fixed Asset Cont'!$B$154:$B$199,'App.2-C_DepExp'!A282,'App.2-BA_Fixed Asset Cont'!$D$154:$D$199)","v":0},null,0,0,null,0,{"$f":"SUMIF('App.2-BA_Fixed Asset Cont'!$B$358:$B$403,'App.2-C_DepExp'!A282,'App.2-BA_Fixed Asset Cont'!$E$358:$E$403)","v":0},0,0,null,0,0,0,0,0,{"$f":"-SUMIF('App.2-BA_Fixed Asset Cont'!$B$358:$B$403,'App.2-C_DepExp'!A282,'App.2-BA_Fixed Asset Cont'!$J$358:$J$403)","v":0},0]
[1915,"Office Furniture & Equipment (5 years)",{"$f":"SUMIF('App.2-BA_Fixed Asset Cont'!$B$154:$B$199,'App.2-C_DepExp'!A283,'App.2-BA_Fixed Asset Cont'!$D$154:$D$199)","v":0},null,0,0,null,0,{"$f":"SUMIF('App.2-BA_Fixed Asset Cont'!$B$358:$B$403,'App.2-C_DepExp'!A283,'App.2-BA_Fixed Asset Cont'!$E$358:$E$403)","v":0},0,0,null,0,0,0,0,0,{"$f":"-SUMIF('App.2-BA_Fixed Asset Cont'!$B$358:$B$403,'App.2-C_DepExp'!A283,'App.2-BA_Fixed Asset Cont'!$J$358:$J$403)","v":0},0]
[1920,"Computer Equipment - Hardware",{"$f":"SUMIF('App.2-BA_Fixed Asset Cont'!$B$154:$B$199,'App.2-C_DepExp'!A284,'App.2-BA_Fixed Asset Cont'!$D$154:$D$199)","v":1361},1361,0,0,null,0,{"$f":"SUMIF('App.2-BA_Fixed Asset Cont'!$B$358:$B$403,'App.2-C_DepExp'!A284,'App.2-BA_Fixed Asset Cont'!$E$358:$E$403)","v":0},1,1,5,0.2,0,0,0,0,{"$f":"-SUMIF('App.2-BA_Fixed Asset Cont'!$B$358:$B$403,'App.2-C_DepExp'!A284,'App.2-BA_Fixed Asset Cont'!$J$358:$J$403)","v":0},0]
[1920,"Computer Equip.-Hardware(Post Mar. 22/04)",0,null,0,0,null,0,{"$f":"SUMIF('App.2-BA_Fixed Asset Cont'!$B$358:$B$403,'App.2-C_DepExp'!A285,'App.2-BA_Fixed Asset Cont'!$E$358:$E$403)","v":0},0,0,5,0.2,0,0,0,0,{"$f":"-SUMIF('App.2-BA_Fixed Asset Cont'!$B$358:$B$403,'App.2-C_DepExp'!A285,'App.2-BA_Fixed Asset Cont'!$J$358:$J$403)","v":0},0]
[1920,"Computer Equip.-Hardware(Post Mar. 19/07)",0,null,0,0,null,0,{"$f":"SUMIF('App.2-BA_Fixed Asset Cont'!$B$358:$B$403,'App.2-C_DepExp'!A286,'App.2-BA_Fixed Asset Cont'!$E$358:$E$403)","v":0},0,0,5,0.2,0,0,0,0,{"$f":"-SUMIF('App.2-BA_Fixed Asset Cont'!$B$358:$B$403,'App.2-C_DepExp'!A286,'App.2-BA_Fixed Asset Cont'!$J$358:$J$403)","v":0},0]
[1925,"Computer Software",{"$f":"SUMIF('App.2-BA_Fixed Asset Cont'!$B$154:$B$199,'App.2-C_DepExp'!A287,'App.2-BA_Fixed Asset Cont'!$D$154:$D$199)","v":105974},105974,0,0,null,0,{"$f":"SUMIF('App.2-BA_Fixed Asset Cont'!$B$358:$B$403,'App.2-C_DepExp'!A287,'App.2-BA_Fixed Asset Cont'!$E$358:$E$403)","v":0},1,1,5,0.2,0,0,0,0,{"$f":"-SUMIF('App.2-BA_Fixed Asset Cont'!$B$358:$B$403,'App.2-C_DepExp'!A287,'App.2-BA_Fixed Asset Cont'!$J$358:$J$403)","v":0},0]
[1930,"Transportation Equipment",{"$f":"SUMIF('App.2-BA_Fixed Asset Cont'!$B$154:$B$199,'App.2-C_DepExp'!A288,'App.2-BA_Fixed Asset Cont'!$D$154:$D$199)","v":0},null,0,0,null,0,{"$f":"SUMIF('App.2-BA_Fixed Asset Cont'!$B$358:$B$403,'App.2-C_DepExp'!A288,'App.2-BA_Fixed Asset Cont'!$E$358:$E$403)","v":0},0,0,null,0,0,0,0,0,{"$f":"-SUMIF('App.2-BA_Fixed Asset Cont'!$B$358:$B$403,'App.2-C_DepExp'!A288,'App.2-BA_Fixed Asset Cont'!$J$358:$J$403)","v":0},0]
[1935,"Stores Equipment",{"$f":"SUMIF('App.2-BA_Fixed Asset Cont'!$B$154:$B$199,'App.2-C_DepExp'!A289,'App.2-BA_Fixed Asset Cont'!$D$154:$D$199)","v":0},null,0,0,null,0,{"$f":"SUMIF('App.2-BA_Fixed Asset Cont'!$B$358:$B$403,'App.2-C_DepExp'!A289,'App.2-BA_Fixed Asset Cont'!$E$358:$E$403)","v":0},0,0,null,0,0,0,0,0,{"$f":"-SUMIF('App.2-BA_Fixed Asset Cont'!$B$358:$B$403,'App.2-C_DepExp'!A289,'App.2-BA_Fixed Asset Cont'!$J$358:$J$403)","v":0},0]
[1940,"Tools, Shop & Garage Equipment",{"$f":"SUMIF('App.2-BA_Fixed Asset Cont'!$B$154:$B$199,'App.2-C_DepExp'!A290,'App.2-BA_Fixed Asset Cont'!$D$154:$D$199)","v":0},null,0,0,null,0,{"$f":"SUMIF('App.2-BA_Fixed Asset Cont'!$B$358:$B$403,'App.2-C_DepExp'!A290,'App.2-BA_Fixed Asset Cont'!$E$358:$E$403)","v":0},0,0,null,0,0,0,0,0,{"$f":"-SUMIF('App.2-BA_Fixed Asset Cont'!$B$358:$B$403,'App.2-C_DepExp'!A290,'App.2-BA_Fixed Asset Cont'!$J$358:$J$403)","v":0},0]
[1945,"Measurement & Testing Equipment",{"$f":"SUMIF('App.2-BA_Fixed Asset Cont'!$B$154:$B$199,'App.2-C_DepExp'!A291,'App.2-BA_Fixed Asset Cont'!$D$154:$D$199)","v":0},null,0,0,null,0,{"$f":"SUMIF('App.2-BA_Fixed Asset Cont'!$B$358:$B$403,'App.2-C_DepExp'!A291,'App.2-BA_Fixed Asset Cont'!$E$358:$E$403)","v":0},0,0,null,0,0,0,0,0,{"$f":"-SUMIF('App.2-BA_Fixed Asset Cont'!$B$358:$B$403,'App.2-C_DepExp'!A291,'App.2-BA_Fixed Asset Cont'!$J$358:$J$403)","v":0},0]
[1950,"Power Operated Equipment",{"$f":"SUMIF('App.2-BA_Fixed Asset Cont'!$B$154:$B$199,'App.2-C_DepExp'!A292,'App.2-BA_Fixed Asset Cont'!$D$154:$D$199)","v":0},null,0,0,null,0,{"$f":"SUMIF('App.2-BA_Fixed Asset Cont'!$B$358:$B$403,'App.2-C_DepExp'!A292,'App.2-BA_Fixed Asset Cont'!$E$358:$E$403)","v":0},0,0,null,0,0,0,0,0,{"$f":"-SUMIF('App.2-BA_Fixed Asset Cont'!$B$358:$B$403,'App.2-C_DepExp'!A292,'App.2-BA_Fixed Asset Cont'!$J$358:$J$403)","v":0},0]
[1955,"Communications Equipment",{"$f":"SUMIF('App.2-BA_Fixed Asset Cont'!$B$154:$B$199,'App.2-C_DepExp'!A293,'App.2-BA_Fixed Asset Cont'!$D$154:$D$199)","v":0},null,0,0,null,0,{"$f":"SUMIF('App.2-BA_Fixed Asset Cont'!$B$358:$B$403,'App.2-C_DepExp'!A293,'App.2-BA_Fixed Asset Cont'!$E$358:$E$403)","v":0},0,0,null,0,0,0,0,0,{"$f":"-SUMIF('App.2-BA_Fixed Asset Cont'!$B$358:$B$403,'App.2-C_DepExp'!A293,'App.2-BA_Fixed Asset Cont'!$J$358:$J$403)","v":0},0]
[1955,"Communication Equipment (Smart Meters)",{"$f":"SUMIF('App.2-BA_Fixed Asset Cont'!$B$154:$B$199,'App.2-C_DepExp'!A294,'App.2-BA_Fixed Asset Cont'!$D$154:$D$199)","v":0},null,0,0,null,0,{"$f":"SUMIF('App.2-BA_Fixed Asset Cont'!$B$358:$B$403,'App.2-C_DepExp'!A294,'App.2-BA_Fixed Asset Cont'!$E$358:$E$403)","v":0},0,0,null,0,0,0,0,0,{"$f":"-SUMIF('App.2-BA_Fixed Asset Cont'!$B$358:$B$403,'App.2-C_DepExp'!A294,'App.2-BA_Fixed Asset Cont'!$J$358:$J$403)","v":0},0]
[1960,"Miscellaneous Equipment ",{"$f":"SUMIF('App.2-BA_Fixed Asset Cont'!$B$154:$B$199,'App.2-C_DepExp'!A295,'App.2-BA_Fixed Asset Cont'!$D$154:$D$199)","v":0},null,0,0,null,0,{"$f":"SUMIF('App.2-BA_Fixed Asset Cont'!$B$358:$B$403,'App.2-C_DepExp'!A295,'App.2-BA_Fixed Asset Cont'!$E$358:$E$403)","v":0},0,0,null,0,0,0,0,0,{"$f":"-SUMIF('App.2-BA_Fixed Asset Cont'!$B$358:$B$403,'App.2-C_DepExp'!A295,'App.2-BA_Fixed Asset Cont'!$J$358:$J$403)","v":0},0]
[1970,"Load Management Controls Customer Premises",{"$f":"SUMIF('App.2-BA_Fixed Asset Cont'!$B$154:$B$199,'App.2-C_DepExp'!A296,'App.2-BA_Fixed Asset Cont'!$D$154:$D$199)","v":0},null,0,0,null,0,{"$f":"SUMIF('App.2-BA_Fixed Asset Cont'!$B$358:$B$403,'App.2-C_DepExp'!A296,'App.2-BA_Fixed Asset Cont'!$E$358:$E$403)","v":0},0,0,null,0,0,0,0,0,{"$f":"-SUMIF('App.2-BA_Fixed Asset Cont'!$B$358:$B$403,'App.2-C_DepExp'!A296,'App.2-BA_Fixed Asset Cont'!$J$358:$J$403)","v":0},0]
[1975,"Load Management Controls Utility Premises",{"$f":"SUMIF('App.2-BA_Fixed Asset Cont'!$B$154:$B$199,'App.2-C_DepExp'!A297,'App.2-BA_Fixed Asset Cont'!$D$154:$D$199)","v":0},null,0,0,null,0,{"$f":"SUMIF('App.2-BA_Fixed Asset Cont'!$B$358:$B$403,'App.2-C_DepExp'!A297,'App.2-BA_Fixed Asset Cont'!$E$358:$E$403)","v":0},0,0,null,0,0,0,0,0,{"$f":"-SUMIF('App.2-BA_Fixed Asset Cont'!$B$358:$B$403,'App.2-C_DepExp'!A297,'App.2-BA_Fixed Asset Cont'!$J$358:$J$403)","v":0},0]
[1980,"System Supervisor Equipment",{"$f":"SUMIF('App.2-BA_Fixed Asset Cont'!$B$154:$B$199,'App.2-C_DepExp'!A298,'App.2-BA_Fixed Asset Cont'!$D$154:$D$199)","v":1381611},null,1381611,204211,null,204211,{"$f":"SUMIF('App.2-BA_Fixed Asset Cont'!$B$358:$B$403,'App.2-C_DepExp'!A298,'App.2-BA_Fixed Asset Cont'!$E$358:$E$403)","v":14852},6,0.16666666666666666,20,0.05,230268.5,10210.549999999999,371.3,240850.34999999998,{"$f":"-SUMIF('App.2-BA_Fixed Asset Cont'!$B$358:$B$403,'App.2-C_DepExp'!A298,'App.2-BA_Fixed Asset Cont'!$J$358:$J$403)","v":240850},-0.34999999997671694]
[1985,"Miscellaneous Fixed Assets",{"$f":"SUMIF('App.2-BA_Fixed Asset Cont'!$B$154:$B$199,'App.2-C_DepExp'!A299,'App.2-BA_Fixed Asset Cont'!$D$154:$D$199)","v":0},null,0,0,null,0,{"$f":"SUMIF('App.2-BA_Fixed Asset Cont'!$B$358:$B$403,'App.2-C_DepExp'!A299,'App.2-BA_Fixed Asset Cont'!$E$358:$E$403)","v":0},0,0,null,0,0,0,0,0,{"$f":"-SUMIF('App.2-BA_Fixed Asset Cont'!$B$358:$B$403,'App.2-C_DepExp'!A299,'App.2-BA_Fixed Asset Cont'!$J$358:$J$403)","v":0},0]
[1990,"Other Tangible Property",{"$f":"SUMIF('App.2-BA_Fixed Asset Cont'!$B$154:$B$199,'App.2-C_DepExp'!A300,'App.2-BA_Fixed Asset Cont'!$D$154:$D$199)","v":0},null,0,0,null,0,{"$f":"SUMIF('App.2-BA_Fixed Asset Cont'!$B$358:$B$403,'App.2-C_DepExp'!A300,'App.2-BA_Fixed Asset Cont'!$E$358:$E$403)","v":0},0,0,null,0,0,0,0,0,{"$f":"-SUMIF('App.2-BA_Fixed Asset Cont'!$B$358:$B$403,'App.2-C_DepExp'!A300,'App.2-BA_Fixed Asset Cont'!$J$358:$J$403)","v":0},0]
[1995,"Contributions & Grants",{"$f":"SUMIF('App.2-BA_Fixed Asset Cont'!$B$154:$B$199,'App.2-C_DepExp'!A301,'App.2-BA_Fixed Asset Cont'!$D$154:$D$199)","v":-11161740},null,-11161740,0,null,0,{"$f":"SUMIF('App.2-BA_Fixed Asset Cont'!$B$358:$B$403,'App.2-C_DepExp'!A301,'App.2-BA_Fixed Asset Cont'!$E$358:$E$403)","v":0},34,2.9411764705882353E-2,40,2.5000000000000001E-2,-328286.4705882353,0,0,-328286.4705882353,{"$f":"-SUMIF('App.2-BA_Fixed Asset Cont'!$B$358:$B$403,'App.2-C_DepExp'!A301,'App.2-BA_Fixed Asset Cont'!$J$358:$J$403)","v":-328286},0.47058823530096561]
[null,"Total",{"$f":"SUM(C257:C301)","v":82778268},{"$f":"SUM(D257:D301)","v":107335},82670933,20406098,0,20406098,6352193,null,null,null,null,{"$f":"SUM(N257:N301)","v":3180050.0301464275},476297.31495248957,73669.60488629165,3730016.9499852094,3729303,-713.94998520898378]
[]
[]
[]
["Scenario that applies",null,"Applicable Years and Accounting Standard",null,null,null,null,null,null,null,null,null,null,null,null,null,null,"Year Reflected in Schedule Below","Accounting Standard Reflected in Schedule Below",null,null,null,null,null,2012]
["Rebasing for the first time with depreciation policy changes made in 2012.",null,"This appendix must be duplicated and completed for the years 2012 to 2018. The appendix for 2012 is to be completed under CGAAP (prior to changes in depreciation policies). The appendix for 2012 to 2014 must be completed under Revised CGAAP (after changes in depreciation policies). The appendix for 2014 to 2018 is to be completed under MIFRS (2014 if changes to MIFRS are material).",null,null,null,null,null,null,null,null,null,null,null,null,null,null,null,null,null,null,null,null,null,2013]
["Rebasing for the first time with depreciation policy changes made in 2013.",null,"This appendix must be duplicated and completed for the years 2013 to 2018. The appendix for 2013 is to be completed under CGAAP (prior to changes in depreciation policies). The appendix for 2013 to 2014 must be completed under Revised CGAAP (after changes in depreciation policies). The appendix for 2014 to 2018 is to be completed under MIFRS (2014 if changes to MIFRS are material).",null,null,null,null,null,null,null,null,null,null,null,null,null,null,null,null,null,null,null,null,null,2014]
["Already rebased with depreciation policy changes in a prior rate application",null,"This appendix must be completed for 2014 to 2018. The appendix for 2014 is to be completed under Revised CGAAP (after changes in depreciation policies). The appendix for 2014 to 2018 is to be completed under MIFRS (2014 if changes to MIFRS are material).",null,null,null,null,null,null,null,null,null,null,null,null,null,null,2018,"MIFRS",null,null,null,null,null,2015]
[null,null,null,null,null,null,null,null,null,null,null,null,null,null,null,null,null,null,null,null,null,null,null,null,2016]
[null,null,null,null,null,null,null,null,null,null,null,null,null,null,null,null,null,null,null,null,null,null,null,null,2017]
[null,null,"Book Values",null,null,null,null,null,null,"Service Lives",null,null,null,"Depreciation Expense",null,null,null,null,null,null,null,null,null,null,2018]
["Account","Description","Opening Net  Book Value of Existing Assets as at Date of Policy Change (Jan. 1) 1","Less Fully Depreciated 7","Net Amount of Existing Assets Before Policy Change to be Depreciated ","Opening Gross Book Value of Assets Acquired After Policy Change 2","Less Fully Depreciated 8","Net Amount of Assets Acquired After Policy Change to be Depreciated ","Current Year Additions","Average Remaining Life of Assets Existing Before Policy Change 3","Depreciation Rate Assets Acquired After Policy Change","Life of Assets Acquired After Policy Change 4","Depreciation Rate on New Additions","Depreciation Expense on Assets Existing Before Policy Change","Depreciation Expense on Assets Acquired After Policy Change","Depreciation Expense on Current Year Additions 5","Total Current Year Depreciation Expense ","Depreciation Expense per Appendix 2-BA Fixed Assets, Column J \n ","Variance 6"]
[null,null,"a","b","c = a-b","d","e","f = d- e","g","h","i = 1/h","j","k = 1/j","l = c/h","m = f/j","n = g*0.5/j","o = l+m+n","p","q = p-o"]
[1706,"Land Rights",{"$f":"SUMIF('App.2-BA_Fixed Asset Cont'!$B$154:$B$199,'App.2-C_DepExp'!A315,'App.2-BA_Fixed Asset Cont'!$D$154:$D$199)","v":602307},null,{"$f":"C315-D315","v":602307},{"$f":"+F257+I257","v":0},null,{"$f":"F315-G315","v":0},{"$f":"SUMIF('App.2-BA_Fixed Asset Cont'!$B$426:$B$471,'App.2-C_DepExp'!A315,'App.2-BA_Fixed Asset Cont'!$E$426:$E$471)","v":0},null,{"$f":"IF(J315=0,0,1/J315)","v":0},0,{"$f":"IF(L315=0,0,1/L315)","v":0},{"$f":"IF(J315=0,0,+E315/J315)","v":0},{"$f":"IF(L315=0,0,+H315/L315)","v":0},{"$f":"IF(L315=0,0,+(I315*0.5)/L315)","v":0},{"$f":"IF(ISERROR(+N315+O315+P315), 0, +N315+O315+P315)","v":0},{"$f":"-SUMIF('App.2-BA_Fixed Asset Cont'!$B$426:$B$471,'App.2-C_DepExp'!A315,'App.2-BA_Fixed Asset Cont'!$J$426:$J$471)","v":0},{"$f":"IF(ISERROR(+R315-122), 0, +R315-Q315)","v":0}]
[1725,"Poles and Fixtures",{"$f":"SUMIF('App.2-BA_Fixed Asset Cont'!$B$154:$B$199,'App.2-C_DepExp'!A316,'App.2-BA_Fixed Asset Cont'!$D$154:$D$199)","v":1604340},null,1604340,{"$f":"+F258+I258","v":0},null,0,{"$f":"SUMIF('App.2-BA_Fixed Asset Cont'!$B$426:$B$471,'App.2-C_DepExp'!A316,'App.2-BA_Fixed Asset Cont'!$E$426:$E$471)","v":0},41,2.4390243902439025E-2,45,2.2222222222222223E-2,39130.243902439026,0,0,39130.243902439026,{"$f":"-SUMIF('App.2-BA_Fixed Asset Cont'!$B$426:$B$471,'App.2-C_DepExp'!A316,'App.2-BA_Fixed Asset Cont'!$J$426:$J$471)","v":39130},{"$f":"IF(ISERROR(+R316-122), 0, +R316-Q316)","v":-0.24390243902598741}]
[1730,"Overhead Conductors & Devices",{"$f":"SUMIF('App.2-BA_Fixed Asset Cont'!$B$154:$B$199,'App.2-C_DepExp'!A317,'App.2-BA_Fixed Asset Cont'!$D$154:$D$199)","v":63894},null,63894,0,null,0,{"$f":"SUMIF('App.2-BA_Fixed Asset Cont'!$B$426:$B$471,'App.2-C_DepExp'!A317,'App.2-BA_Fixed Asset Cont'!$E$426:$E$471)","v":0},32,3.125E-2,45,2.2222222222222223E-2,1996.6875,0,0,1996.6875,{"$f":"-SUMIF('App.2-BA_Fixed Asset Cont'!$B$426:$B$471,'App.2-C_DepExp'!A317,'App.2-BA_Fixed Asset Cont'!$J$426:$J$471)","v":1997},{"$f":"IF(ISERROR(+R317-122), 0, +R317-Q317)","v":0.3125}]
[1735,"Underground Conduit",{"$f":"SUMIF('App.2-BA_Fixed Asset Cont'!$B$154:$B$199,'App.2-C_DepExp'!A318,'App.2-BA_Fixed Asset Cont'!$D$154:$D$199)","v":870021},null,870021,0,null,0,{"$f":"SUMIF('App.2-BA_Fixed Asset Cont'!$B$426:$B$471,'App.2-C_DepExp'!A318,'App.2-BA_Fixed Asset Cont'!$E$426:$E$471)","v":0},35,2.8571428571428571E-2,40,2.5000000000000001E-2,24857.742857142857,0,0,24857.742857142857,{"$f":"-SUMIF('App.2-BA_Fixed Asset Cont'!$B$426:$B$471,'App.2-C_DepExp'!A318,'App.2-BA_Fixed Asset Cont'!$J$426:$J$471)","v":24858},0.2571428571427532]
[1740,"Underground Conductors & Devices",{"$f":"SUMIF('App.2-BA_Fixed Asset Cont'!$B$154:$B$199,'App.2-C_DepExp'!A319,'App.2-BA_Fixed Asset Cont'!$D$154:$D$199)","v":215252},null,215252,0,null,0,{"$f":"SUMIF('App.2-BA_Fixed Asset Cont'!$B$426:$B$471,'App.2-C_DepExp'!A319,'App.2-BA_Fixed Asset Cont'!$E$426:$E$471)","v":0},22,4.5454545454545456E-2,25,0.04,9784.181818181818,0,0,9784.181818181818,{"$f":"-SUMIF('App.2-BA_Fixed Asset Cont'!$B$426:$B$471,'App.2-C_DepExp'!A319,'App.2-BA_Fixed Asset Cont'!$J$426:$J$471)","v":9784},-0.18181818181801646]
[1611,"Computer Software (Formally known as Account 1925)",{"$f":"SUMIF('App.2-BA_Fixed Asset Cont'!$B$154:$B$199,'App.2-C_DepExp'!A320,'App.2-BA_Fixed Asset Cont'!$D$154:$D$199)","v":0},null,{"$f":"C320-D320","v":0},0,null,{"$f":"F320-G320","v":0},{"$f":"SUMIF('App.2-BA_Fixed Asset Cont'!$B$426:$B$471,'App.2-C_DepExp'!A320,'App.2-BA_Fixed Asset Cont'!$E$426:$E$471)","v":0},0,{"$f":"IF(J320=0,0,1/J320)","v":0},0,{"$f":"IF(L320=0,0,1/L320)","v":0},{"$f":"IF(J320=0,0,+E320/J320)","v":0},{"$f":"IF(L320=0,0,+H320/L320)","v":0},{"$f":"IF(L320=0,0,+(I320*0.5)/L320)","v":0},{"$f":"IF(ISERROR(+N320+O320+P320), 0, +N320+O320+P320)","v":0},{"$f":"-SUMIF('App.2-BA_Fixed Asset Cont'!$B$426:$B$471,'App.2-C_DepExp'!A320,'App.2-BA_Fixed Asset Cont'!$J$426:$J$471)","v":0},{"$f":"IF(ISERROR(+R320-122), 0, +R320-Q320)","v":0}]
[1612,"Land Rights (Formally known as Account 1906)",{"$f":"SUMIF('App.2-BA_Fixed Asset Cont'!$B$154:$B$199,'App.2-C_DepExp'!A321,'App.2-BA_Fixed Asset Cont'!$D$154:$D$199)","v":0},null,{"$f":"C321-D321","v":0},0,null,{"$f":"F321-G321","v":0},{"$f":"SUMIF('App.2-BA_Fixed Asset Cont'!$B$426:$B$471,'App.2-C_DepExp'!A321,'App.2-BA_Fixed Asset Cont'!$E$426:$E$471)","v":0},0,{"$f":"IF(J321=0,0,1/J321)","v":0},0,{"$f":"IF(L321=0,0,1/L321)","v":0},{"$f":"IF(J321=0,0,+E321/J321)","v":0},{"$f":"IF(L321=0,0,+H321/L321)","v":0},{"$f":"IF(L321=0,0,+(I321*0.5)/L321)","v":0},{"$f":"IF(ISERROR(+N321+O321+P321), 0, +N321+O321+P321)","v":0},{"$f":"-SUMIF('App.2-BA_Fixed Asset Cont'!$B$426:$B$471,'App.2-C_DepExp'!A321,'App.2-BA_Fixed Asset Cont'!$J$426:$J$471)","v":0},{"$f":"IF(ISERROR(+R321-122), 0, +R321-Q321)","v":0}]
[1805,"Land",{"$f":"SUMIF('App.2-BA_Fixed Asset Cont'!$B$154:$B$199,'App.2-C_DepExp'!A322,'App.2-BA_Fixed Asset Cont'!$D$154:$D$199)","v":89160},null,89160,0,null,0,{"$f":"SUMIF('App.2-BA_Fixed Asset Cont'!$B$426:$B$471,'App.2-C_DepExp'!A322,'App.2-BA_Fixed Asset Cont'!$E$426:$E$471)","v":0},0,0,0,0,0,{"$f":"IF(L322=0,0,+H322/L322)","v":0},0,0,{"$f":"-SUMIF('App.2-BA_Fixed Asset Cont'!$B$426:$B$471,'App.2-C_DepExp'!A322,'App.2-BA_Fixed Asset Cont'!$J$426:$J$471)","v":0},0]
[1806,"Land Rights",{"$f":"SUMIF('App.2-BA_Fixed Asset Cont'!$B$154:$B$199,'App.2-C_DepExp'!A323,'App.2-BA_Fixed Asset Cont'!$D$154:$D$199)","v":154128},null,154128,24823,null,24823,{"$f":"SUMIF('App.2-BA_Fixed Asset Cont'!$B$426:$B$471,'App.2-C_DepExp'!A323,'App.2-BA_Fixed Asset Cont'!$E$426:$E$471)","v":1621},0,0,0,0,0,0,0,0,{"$f":"-SUMIF('App.2-BA_Fixed Asset Cont'!$B$426:$B$471,'App.2-C_DepExp'!A323,'App.2-BA_Fixed Asset Cont'!$J$426:$J$471)","v":0},0]
[1808,"Buildings",{"$f":"SUMIF('App.2-BA_Fixed Asset Cont'!$B$154:$B$199,'App.2-C_DepExp'!A324,'App.2-BA_Fixed Asset Cont'!$D$154:$D$199)","v":24624967},null,24624967,402125,null,402125,{"$f":"SUMIF('App.2-BA_Fixed Asset Cont'!$B$426:$B$471,'App.2-C_DepExp'!A324,'App.2-BA_Fixed Asset Cont'!$E$426:$E$471)","v":63099},36.598100000000002,2.7323822821403294E-2,39.6,2.5252525252525252E-2,672848.23529090302,10154.671717171717,796.70454545454538,683799.61155352928,{"$f":"-SUMIF('App.2-BA_Fixed Asset Cont'!$B$426:$B$471,'App.2-C_DepExp'!A324,'App.2-BA_Fixed Asset Cont'!$J$426:$J$471)","v":683596},{"$f":"IF(ISERROR(+R324-122), 0, +R324-Q324)","v":-203.61155352927744}]
[1810,"Leasehold Improvements",{"$f":"SUMIF('App.2-BA_Fixed Asset Cont'!$B$154:$B$199,'App.2-C_DepExp'!A325,'App.2-BA_Fixed Asset Cont'!$D$154:$D$199)","v":0},null,0,0,null,0,{"$f":"SUMIF('App.2-BA_Fixed Asset Cont'!$B$426:$B$471,'App.2-C_DepExp'!A325,'App.2-BA_Fixed Asset Cont'!$E$426:$E$471)","v":0},0,0,0,0,0,0,0,0,{"$f":"-SUMIF('App.2-BA_Fixed Asset Cont'!$B$426:$B$471,'App.2-C_DepExp'!A325,'App.2-BA_Fixed Asset Cont'!$J$426:$J$471)","v":0},{"$f":"IF(ISERROR(+R325-122), 0, +R325-Q325)","v":0}]
[1815,"Transformer Station Equipment >50 kV",{"$f":"SUMIF('App.2-BA_Fixed Asset Cont'!$B$154:$B$199,'App.2-C_DepExp'!A326,'App.2-BA_Fixed Asset Cont'!$D$154:$D$199)","v":5491722},null,5491722,2170884,null,2170884,{"$f":"SUMIF('App.2-BA_Fixed Asset Cont'!$B$426:$B$471,'App.2-C_DepExp'!A326,'App.2-BA_Fixed Asset Cont'!$E$426:$E$471)","v":122779},24,4.1666666666666664E-2,40,2.5000000000000001E-2,228821.75,54272.1,1534.7375,284628.58749999997,{"$f":"-SUMIF('App.2-BA_Fixed Asset Cont'!$B$426:$B$471,'App.2-C_DepExp'!A326,'App.2-BA_Fixed Asset Cont'!$J$426:$J$471)","v":266269},-18359.587499999965]
[1820,"Distribution Station Equipment <50 kV",{"$f":"SUMIF('App.2-BA_Fixed Asset Cont'!$B$154:$B$199,'App.2-C_DepExp'!A327,'App.2-BA_Fixed Asset Cont'!$D$154:$D$199)","v":7812618},null,7812618,2698024,null,2698024,{"$f":"SUMIF('App.2-BA_Fixed Asset Cont'!$B$426:$B$471,'App.2-C_DepExp'!A327,'App.2-BA_Fixed Asset Cont'!$E$426:$E$471)","v":526035},22,4.5454545454545456E-2,40,2.5000000000000001E-2,355119,67450.600000000006,6575.4375,429145.03749999998,{"$f":"-SUMIF('App.2-BA_Fixed Asset Cont'!$B$426:$B$471,'App.2-C_DepExp'!A327,'App.2-BA_Fixed Asset Cont'!$J$426:$J$471)","v":437296},8150.9625000000233]
[1825,"Storage Battery Equipment",{"$f":"SUMIF('App.2-BA_Fixed Asset Cont'!$B$154:$B$199,'App.2-C_DepExp'!A328,'App.2-BA_Fixed Asset Cont'!$D$154:$D$199)","v":13722},null,13722,0,null,0,{"$f":"SUMIF('App.2-BA_Fixed Asset Cont'!$B$426:$B$471,'App.2-C_DepExp'!A328,'App.2-BA_Fixed Asset Cont'!$E$426:$E$471)","v":0},21,4.7619047619047616E-2,30,3.3333333333333333E-2,653.42857142857144,0,0,653.42857142857144,{"$f":"-SUMIF('App.2-BA_Fixed Asset Cont'!$B$426:$B$471,'App.2-C_DepExp'!A328,'App.2-BA_Fixed Asset Cont'!$J$426:$J$471)","v":653},-0.42857142857144481]
[1830,"Poles, Towers & Fixtures",{"$f":"SUMIF('App.2-BA_Fixed Asset Cont'!$B$154:$B$199,'App.2-C_DepExp'!A329,'App.2-BA_Fixed Asset Cont'!$D$154:$D$199)","v":10446415},null,10446415,7361689,null,7361689,{"$f":"SUMIF('App.2-BA_Fixed Asset Cont'!$B$426:$B$471,'App.2-C_DepExp'!A329,'App.2-BA_Fixed Asset Cont'!$E$426:$E$471)","v":1586992},44,2.2727272727272728E-2,45,2.2222222222222223E-2,237418.52272727274,163593.08888888889,17633.244444444445,418644.85606060608,{"$f":"-SUMIF('App.2-BA_Fixed Asset Cont'!$B$426:$B$471,'App.2-C_DepExp'!A329,'App.2-BA_Fixed Asset Cont'!$J$426:$J$471)","v":413255},-5389.8560606060782]
[1835,"Overhead Conductors & Devices",{"$f":"SUMIF('App.2-BA_Fixed Asset Cont'!$B$154:$B$199,'App.2-C_DepExp'!A330,'App.2-BA_Fixed Asset Cont'!$D$154:$D$199)","v":8345730},null,8345730,4639748,null,4639748,{"$f":"SUMIF('App.2-BA_Fixed Asset Cont'!$B$426:$B$471,'App.2-C_DepExp'!A330,'App.2-BA_Fixed Asset Cont'!$E$426:$E$471)","v":1034718},36,2.7777777777777776E-2,60,1.6666666666666666E-2,231825.83333333334,77329.133333333331,8622.65,317777.6166666667,{"$f":"-SUMIF('App.2-BA_Fixed Asset Cont'!$B$426:$B$471,'App.2-C_DepExp'!A330,'App.2-BA_Fixed Asset Cont'!$J$426:$J$471)","v":311493},-6284.6166666666977]
[1840,"Underground Conduit",{"$f":"SUMIF('App.2-BA_Fixed Asset Cont'!$B$154:$B$199,'App.2-C_DepExp'!A331,'App.2-BA_Fixed Asset Cont'!$D$154:$D$199)","v":2546031},null,2546031,1116028,null,1116028,{"$f":"SUMIF('App.2-BA_Fixed Asset Cont'!$B$426:$B$471,'App.2-C_DepExp'!A331,'App.2-BA_Fixed Asset Cont'!$E$426:$E$471)","v":214630},12,8.3333333333333329E-2,50,0.02,212169.25,22320.560000000001,2146.3000000000002,236636.11,{"$f":"-SUMIF('App.2-BA_Fixed Asset Cont'!$B$426:$B$471,'App.2-C_DepExp'!A331,'App.2-BA_Fixed Asset Cont'!$J$426:$J$471)","v":239532},2895.890000000014]
[1845,"Underground Conductors & Devices",{"$f":"SUMIF('App.2-BA_Fixed Asset Cont'!$B$154:$B$199,'App.2-C_DepExp'!A332,'App.2-BA_Fixed Asset Cont'!$D$154:$D$199)","v":11437100},null,11437100,2010177,null,2010177,{"$f":"SUMIF('App.2-BA_Fixed Asset Cont'!$B$426:$B$471,'App.2-C_DepExp'!A332,'App.2-BA_Fixed Asset Cont'!$E$426:$E$471)","v":352285},23,4.3478260869565216E-2,40,2.5000000000000001E-2,497265.21739130432,50254.425000000003,4403.5625,551923.20489130437,{"$f":"-SUMIF('App.2-BA_Fixed Asset Cont'!$B$426:$B$471,'App.2-C_DepExp'!A332,'App.2-BA_Fixed Asset Cont'!$J$426:$J$471)","v":553859},1935.7951086956309]
[1850,"Line Transformers",{"$f":"SUMIF('App.2-BA_Fixed Asset Cont'!$B$154:$B$199,'App.2-C_DepExp'!A333,'App.2-BA_Fixed Asset Cont'!$D$154:$D$199)","v":9204093},null,9204093,4130093,null,4130093,{"$f":"SUMIF('App.2-BA_Fixed Asset Cont'!$B$426:$B$471,'App.2-C_DepExp'!A333,'App.2-BA_Fixed Asset Cont'!$E$426:$E$471)","v":1272911},39,2.564102564102564E-2,40,2.5000000000000001E-2,236002.38461538462,103252.325,15911.387500000001,355166.09711538465,{"$f":"-SUMIF('App.2-BA_Fixed Asset Cont'!$B$426:$B$471,'App.2-C_DepExp'!A333,'App.2-BA_Fixed Asset Cont'!$J$426:$J$471)","v":352997},-2169.0971153846476]
[1855,"Services (Overhead & Underground)",{"$f":"SUMIF('App.2-BA_Fixed Asset Cont'!$B$154:$B$199,'App.2-C_DepExp'!A334,'App.2-BA_Fixed Asset Cont'!$D$154:$D$199)","v":4460589},null,4460589,1616043,null,1616043,{"$f":"SUMIF('App.2-BA_Fixed Asset Cont'!$B$426:$B$471,'App.2-C_DepExp'!A334,'App.2-BA_Fixed Asset Cont'!$E$426:$E$471)","v":457483},36,2.7777777777777776E-2,40,2.5000000000000001E-2,123905.25,40401.074999999997,5718.5375000000004,170024.86250000002,{"$f":"-SUMIF('App.2-BA_Fixed Asset Cont'!$B$426:$B$471,'App.2-C_DepExp'!A334,'App.2-BA_Fixed Asset Cont'!$J$426:$J$471)","v":171479},1454.1374999999825]
[1860,"Meters",0,null,0,0,null,0,0,null,0,null,0,0,0,0,0,0,0]
[1860,"Meters (Smart Meters)",{"$f":"SUMIF('App.2-BA_Fixed Asset Cont'!$B$154:$B$199,'App.2-C_DepExp'!A336,'App.2-BA_Fixed Asset Cont'!$D$154:$D$199)","v":4468973},null,4468973,369594,null,369594,{"$f":"SUMIF('App.2-BA_Fixed Asset Cont'!$B$426:$B$471,'App.2-C_DepExp'!A336,'App.2-BA_Fixed Asset Cont'!$E$426:$E$471)","v":146036},11,9.0909090909090912E-2,15,6.6666666666666666E-2,406270.27272727271,24639.599999999999,4867.8666666666668,435777.73939393932,{"$f":"-SUMIF('App.2-BA_Fixed Asset Cont'!$B$426:$B$471,'App.2-C_DepExp'!A336,'App.2-BA_Fixed Asset Cont'!$J$426:$J$471)","v":443908},8130.2606060606777]
[1905,"Land",{"$f":"SUMIF('App.2-BA_Fixed Asset Cont'!$B$154:$B$199,'App.2-C_DepExp'!A337,'App.2-BA_Fixed Asset Cont'!$D$154:$D$199)","v":0},null,0,0,null,0,{"$f":"SUMIF('App.2-BA_Fixed Asset Cont'!$B$426:$B$471,'App.2-C_DepExp'!A337,'App.2-BA_Fixed Asset Cont'!$E$426:$E$471)","v":0},0,0,null,0,0,0,0,0,{"$f":"-SUMIF('App.2-BA_Fixed Asset Cont'!$B$426:$B$471,'App.2-C_DepExp'!A337,'App.2-BA_Fixed Asset Cont'!$J$426:$J$471)","v":0},0]
[1908,"Buildings & Fixtures",{"$f":"SUMIF('App.2-BA_Fixed Asset Cont'!$B$154:$B$199,'App.2-C_DepExp'!A338,'App.2-BA_Fixed Asset Cont'!$D$154:$D$199)","v":0},null,0,0,null,0,{"$f":"SUMIF('App.2-BA_Fixed Asset Cont'!$B$426:$B$471,'App.2-C_DepExp'!A338,'App.2-BA_Fixed Asset Cont'!$E$426:$E$471)","v":0},0,0,null,0,0,0,0,0,{"$f":"-SUMIF('App.2-BA_Fixed Asset Cont'!$B$426:$B$471,'App.2-C_DepExp'!A338,'App.2-BA_Fixed Asset Cont'!$J$426:$J$471)","v":0},0]
[1910,"Leasehold Improvements",{"$f":"SUMIF('App.2-BA_Fixed Asset Cont'!$B$154:$B$199,'App.2-C_DepExp'!A339,'App.2-BA_Fixed Asset Cont'!$D$154:$D$199)","v":0},null,0,0,null,0,{"$f":"SUMIF('App.2-BA_Fixed Asset Cont'!$B$426:$B$471,'App.2-C_DepExp'!A339,'App.2-BA_Fixed Asset Cont'!$E$426:$E$471)","v":0},0,0,null,0,0,0,0,0,{"$f":"-SUMIF('App.2-BA_Fixed Asset Cont'!$B$426:$B$471,'App.2-C_DepExp'!A339,'App.2-BA_Fixed Asset Cont'!$J$426:$J$471)","v":0},0]
[1915,"Office Furniture & Equipment (10 years)",{"$f":"SUMIF('App.2-BA_Fixed Asset Cont'!$B$154:$B$199,'App.2-C_DepExp'!A340,'App.2-BA_Fixed Asset Cont'!$D$154:$D$199)","v":0},null,0,0,null,0,{"$f":"SUMIF('App.2-BA_Fixed Asset Cont'!$B$426:$B$471,'App.2-C_DepExp'!A340,'App.2-BA_Fixed Asset Cont'!$E$426:$E$471)","v":0},0,0,null,0,0,0,0,0,{"$f":"-SUMIF('App.2-BA_Fixed Asset Cont'!$B$426:$B$471,'App.2-C_DepExp'!A340,'App.2-BA_Fixed Asset Cont'!$J$426:$J$471)","v":0},0]
[1915,"Office Furniture & Equipment (5 years)",{"$f":"SUMIF('App.2-BA_Fixed Asset Cont'!$B$154:$B$199,'App.2-C_DepExp'!A341,'App.2-BA_Fixed Asset Cont'!$D$154:$D$199)","v":0},null,0,0,null,0,{"$f":"SUMIF('App.2-BA_Fixed Asset Cont'!$B$426:$B$471,'App.2-C_DepExp'!A341,'App.2-BA_Fixed Asset Cont'!$E$426:$E$471)","v":0},0,0,null,0,0,0,0,0,{"$f":"-SUMIF('App.2-BA_Fixed Asset Cont'!$B$426:$B$471,'App.2-C_DepExp'!A341,'App.2-BA_Fixed Asset Cont'!$J$426:$J$471)","v":0},0]
[1920,"Computer Equipment - Hardware",{"$f":"SUMIF('App.2-BA_Fixed Asset Cont'!$B$154:$B$199,'App.2-C_DepExp'!A342,'App.2-BA_Fixed Asset Cont'!$D$154:$D$199)","v":1361},1361,0,0,null,0,{"$f":"SUMIF('App.2-BA_Fixed Asset Cont'!$B$426:$B$471,'App.2-C_DepExp'!A342,'App.2-BA_Fixed Asset Cont'!$E$426:$E$471)","v":0},1,1,5,0.2,0,0,0,0,{"$f":"-SUMIF('App.2-BA_Fixed Asset Cont'!$B$426:$B$471,'App.2-C_DepExp'!A342,'App.2-BA_Fixed Asset Cont'!$J$426:$J$471)","v":0},0]
[1920,"Computer Equip.-Hardware(Post Mar. 22/04)",0,null,0,0,null,0,{"$f":"SUMIF('App.2-BA_Fixed Asset Cont'!$B$426:$B$471,'App.2-C_DepExp'!A343,'App.2-BA_Fixed Asset Cont'!$E$426:$E$471)","v":0},0,0,5,0.2,0,0,0,0,{"$f":"-SUMIF('App.2-BA_Fixed Asset Cont'!$B$426:$B$471,'App.2-C_DepExp'!A343,'App.2-BA_Fixed Asset Cont'!$J$426:$J$471)","v":0},0]
[1920,"Computer Equip.-Hardware(Post Mar. 19/07)",0,null,0,0,null,0,{"$f":"SUMIF('App.2-BA_Fixed Asset Cont'!$B$426:$B$471,'App.2-C_DepExp'!A344,'App.2-BA_Fixed Asset Cont'!$E$426:$E$471)","v":0},0,0,5,0.2,0,0,0,0,{"$f":"-SUMIF('App.2-BA_Fixed Asset Cont'!$B$426:$B$471,'App.2-C_DepExp'!A344,'App.2-BA_Fixed Asset Cont'!$J$426:$J$471)","v":0},0]
[1925,"Computer Software",{"$f":"SUMIF('App.2-BA_Fixed Asset Cont'!$B$154:$B$199,'App.2-C_DepExp'!A345,'App.2-BA_Fixed Asset Cont'!$D$154:$D$199)","v":105974},105974,0,0,null,0,{"$f":"SUMIF('App.2-BA_Fixed Asset Cont'!$B$426:$B$471,'App.2-C_DepExp'!A345,'App.2-BA_Fixed Asset Cont'!$E$426:$E$471)","v":0},1,1,5,0.2,0,0,0,0,{"$f":"-SUMIF('App.2-BA_Fixed Asset Cont'!$B$426:$B$471,'App.2-C_DepExp'!A345,'App.2-BA_Fixed Asset Cont'!$J$426:$J$471)","v":0},0]
[1930,"Transportation Equipment",{"$f":"SUMIF('App.2-BA_Fixed Asset Cont'!$B$154:$B$199,'App.2-C_DepExp'!A346,'App.2-BA_Fixed Asset Cont'!$D$154:$D$199)","v":0},null,0,0,null,0,{"$f":"SUMIF('App.2-BA_Fixed Asset Cont'!$B$426:$B$471,'App.2-C_DepExp'!A346,'App.2-BA_Fixed Asset Cont'!$E$426:$E$471)","v":0},0,0,null,0,0,0,0,0,{"$f":"-SUMIF('App.2-BA_Fixed Asset Cont'!$B$426:$B$471,'App.2-C_DepExp'!A346,'App.2-BA_Fixed Asset Cont'!$J$426:$J$471)","v":0},0]
[1935,"Stores Equipment",{"$f":"SUMIF('App.2-BA_Fixed Asset Cont'!$B$154:$B$199,'App.2-C_DepExp'!A347,'App.2-BA_Fixed Asset Cont'!$D$154:$D$199)","v":0},null,0,0,null,0,{"$f":"SUMIF('App.2-BA_Fixed Asset Cont'!$B$426:$B$471,'App.2-C_DepExp'!A347,'App.2-BA_Fixed Asset Cont'!$E$426:$E$471)","v":0},0,0,null,0,0,0,0,0,{"$f":"-SUMIF('App.2-BA_Fixed Asset Cont'!$B$426:$B$471,'App.2-C_DepExp'!A347,'App.2-BA_Fixed Asset Cont'!$J$426:$J$471)","v":0},0]
[1940,"Tools, Shop & Garage Equipment",{"$f":"SUMIF('App.2-BA_Fixed Asset Cont'!$B$154:$B$199,'App.2-C_DepExp'!A348,'App.2-BA_Fixed Asset Cont'!$D$154:$D$199)","v":0},null,0,0,null,0,{"$f":"SUMIF('App.2-BA_Fixed Asset Cont'!$B$426:$B$471,'App.2-C_DepExp'!A348,'App.2-BA_Fixed Asset Cont'!$E$426:$E$471)","v":0},0,0,null,0,0,0,0,0,{"$f":"-SUMIF('App.2-BA_Fixed Asset Cont'!$B$426:$B$471,'App.2-C_DepExp'!A348,'App.2-BA_Fixed Asset Cont'!$J$426:$J$471)","v":0},0]
[1945,"Measurement & Testing Equipment",{"$f":"SUMIF('App.2-BA_Fixed Asset Cont'!$B$154:$B$199,'App.2-C_DepExp'!A349,'App.2-BA_Fixed Asset Cont'!$D$154:$D$199)","v":0},null,0,0,null,0,{"$f":"SUMIF('App.2-BA_Fixed Asset Cont'!$B$426:$B$471,'App.2-C_DepExp'!A349,'App.2-BA_Fixed Asset Cont'!$E$426:$E$471)","v":0},0,0,null,0,0,0,0,0,{"$f":"-SUMIF('App.2-BA_Fixed Asset Cont'!$B$426:$B$471,'App.2-C_DepExp'!A349,'App.2-BA_Fixed Asset Cont'!$J$426:$J$471)","v":0},0]
[1950,"Power Operated Equipment",{"$f":"SUMIF('App.2-BA_Fixed Asset Cont'!$B$154:$B$199,'App.2-C_DepExp'!A350,'App.2-BA_Fixed Asset Cont'!$D$154:$D$199)","v":0},null,0,0,null,0,{"$f":"SUMIF('App.2-BA_Fixed Asset Cont'!$B$426:$B$471,'App.2-C_DepExp'!A350,'App.2-BA_Fixed Asset Cont'!$E$426:$E$471)","v":0},0,0,null,0,0,0,0,0,{"$f":"-SUMIF('App.2-BA_Fixed Asset Cont'!$B$426:$B$471,'App.2-C_DepExp'!A350,'App.2-BA_Fixed Asset Cont'!$J$426:$J$471)","v":0},0]
[1955,"Communications Equipment",{"$f":"SUMIF('App.2-BA_Fixed Asset Cont'!$B$154:$B$199,'App.2-C_DepExp'!A351,'App.2-BA_Fixed Asset Cont'!$D$154:$D$199)","v":0},null,0,0,null,0,{"$f":"SUMIF('App.2-BA_Fixed Asset Cont'!$B$426:$B$471,'App.2-C_DepExp'!A351,'App.2-BA_Fixed Asset Cont'!$E$426:$E$471)","v":0},0,0,null,0,0,0,0,0,{"$f":"-SUMIF('App.2-BA_Fixed Asset Cont'!$B$426:$B$471,'App.2-C_DepExp'!A351,'App.2-BA_Fixed Asset Cont'!$J$426:$J$471)","v":0},0]
[1955,"Communication Equipment (Smart Meters)",{"$f":"SUMIF('App.2-BA_Fixed Asset Cont'!$B$154:$B$199,'App.2-C_DepExp'!A352,'App.2-BA_Fixed Asset Cont'!$D$154:$D$199)","v":0},null,0,0,null,0,{"$f":"SUMIF('App.2-BA_Fixed Asset Cont'!$B$426:$B$471,'App.2-C_DepExp'!A352,'App.2-BA_Fixed Asset Cont'!$E$426:$E$471)","v":0},0,0,null,0,0,0,0,0,{"$f":"-SUMIF('App.2-BA_Fixed Asset Cont'!$B$426:$B$471,'App.2-C_DepExp'!A352,'App.2-BA_Fixed Asset Cont'!$J$426:$J$471)","v":0},0]
[1960,"Miscellaneous Equipment ",{"$f":"SUMIF('App.2-BA_Fixed Asset Cont'!$B$154:$B$199,'App.2-C_DepExp'!A353,'App.2-BA_Fixed Asset Cont'!$D$154:$D$199)","v":0},null,0,0,null,0,{"$f":"SUMIF('App.2-BA_Fixed Asset Cont'!$B$426:$B$471,'App.2-C_DepExp'!A353,'App.2-BA_Fixed Asset Cont'!$E$426:$E$471)","v":0},0,0,null,0,0,0,0,0,{"$f":"-SUMIF('App.2-BA_Fixed Asset Cont'!$B$426:$B$471,'App.2-C_DepExp'!A353,'App.2-BA_Fixed Asset Cont'!$J$426:$J$471)","v":0},0]
[1970,"Load Management Controls Customer Premises",{"$f":"SUMIF('App.2-BA_Fixed Asset Cont'!$B$154:$B$199,'App.2-C_DepExp'!A354,'App.2-BA_Fixed Asset Cont'!$D$154:$D$199)","v":0},null,0,0,null,0,{"$f":"SUMIF('App.2-BA_Fixed Asset Cont'!$B$426:$B$471,'App.2-C_DepExp'!A354,'App.2-BA_Fixed Asset Cont'!$E$426:$E$471)","v":0},0,0,null,0,0,0,0,0,{"$f":"-SUMIF('App.2-BA_Fixed Asset Cont'!$B$426:$B$471,'App.2-C_DepExp'!A354,'App.2-BA_Fixed Asset Cont'!$J$426:$J$471)","v":0},0]
[1975,"Load Management Controls Utility Premises",{"$f":"SUMIF('App.2-BA_Fixed Asset Cont'!$B$154:$B$199,'App.2-C_DepExp'!A355,'App.2-BA_Fixed Asset Cont'!$D$154:$D$199)","v":0},null,0,0,null,0,{"$f":"SUMIF('App.2-BA_Fixed Asset Cont'!$B$426:$B$471,'App.2-C_DepExp'!A355,'App.2-BA_Fixed Asset Cont'!$E$426:$E$471)","v":0},0,0,null,0,0,0,0,0,{"$f":"-SUMIF('App.2-BA_Fixed Asset Cont'!$B$426:$B$471,'App.2-C_DepExp'!A355,'App.2-BA_Fixed Asset Cont'!$J$426:$J$471)","v":0},0]
[1980,"System Supervisor Equipment",{"$f":"SUMIF('App.2-BA_Fixed Asset Cont'!$B$154:$B$199,'App.2-C_DepExp'!A356,'App.2-BA_Fixed Asset Cont'!$D$154:$D$199)","v":1381611},null,1381611,219063,null,219063,{"$f":"SUMIF('App.2-BA_Fixed Asset Cont'!$B$426:$B$471,'App.2-C_DepExp'!A356,'App.2-BA_Fixed Asset Cont'!$E$426:$E$471)","v":29766},6,0.16666666666666666,20,0.05,230268.5,10953.15,744.15,241965.8,{"$f":"-SUMIF('App.2-BA_Fixed Asset Cont'!$B$426:$B$471,'App.2-C_DepExp'!A356,'App.2-BA_Fixed Asset Cont'!$J$426:$J$471)","v":241432},-533.79999999998836]
[1985,"Miscellaneous Fixed Assets",{"$f":"SUMIF('App.2-BA_Fixed Asset Cont'!$B$154:$B$199,'App.2-C_DepExp'!A357,'App.2-BA_Fixed Asset Cont'!$D$154:$D$199)","v":0},null,0,0,null,0,{"$f":"SUMIF('App.2-BA_Fixed Asset Cont'!$B$426:$B$471,'App.2-C_DepExp'!A357,'App.2-BA_Fixed Asset Cont'!$E$426:$E$471)","v":0},0,0,null,0,0,0,0,0,{"$f":"-SUMIF('App.2-BA_Fixed Asset Cont'!$B$426:$B$471,'App.2-C_DepExp'!A357,'App.2-BA_Fixed Asset Cont'!$J$426:$J$471)","v":0},0]
[1990,"Other Tangible Property",{"$f":"SUMIF('App.2-BA_Fixed Asset Cont'!$B$154:$B$199,'App.2-C_DepExp'!A358,'App.2-BA_Fixed Asset Cont'!$D$154:$D$199)","v":0},null,0,0,null,0,{"$f":"SUMIF('App.2-BA_Fixed Asset Cont'!$B$426:$B$471,'App.2-C_DepExp'!A358,'App.2-BA_Fixed Asset Cont'!$E$426:$E$471)","v":0},0,0,null,0,0,0,0,0,{"$f":"-SUMIF('App.2-BA_Fixed Asset Cont'!$B$426:$B$471,'App.2-C_DepExp'!A358,'App.2-BA_Fixed Asset Cont'!$J$426:$J$471)","v":0},0]
[1995,"Contributions & Grants",{"$f":"SUMIF('App.2-BA_Fixed Asset Cont'!$B$154:$B$199,'App.2-C_DepExp'!A359,'App.2-BA_Fixed Asset Cont'!$D$154:$D$199)","v":-11161740},null,-11161740,0,null,0,{"$f":"SUMIF('App.2-BA_Fixed Asset Cont'!$B$426:$B$471,'App.2-C_DepExp'!A359,'App.2-BA_Fixed Asset Cont'!$E$426:$E$471)","v":0},34,2.9411764705882353E-2,40,2.5000000000000001E-2,-328286.4705882353,0,0,-328286.4705882353,{"$f":"-SUMIF('App.2-BA_Fixed Asset Cont'!$B$426:$B$471,'App.2-C_DepExp'!A359,'App.2-BA_Fixed Asset Cont'!$J$426:$J$471)","v":-328286},0.47058823530096561]
[null,"Total",{"$f":"SUM(C315:C359)","v":82778268},{"$f":"SUM(D315:D359)","v":107335},82670933,26758291,0,26758291,5808355,null,null,null,null,{"$f":"SUM(N315:N359)","v":3180050.0301464275},624620.72893939377,68954.578156565651,3873625.3372423872,3863252,-10373.337242387301]

{"sheet":"App.2-D_Overhead","index":12,"n_rows":37,"n_cols":8,"rows_kept":37,"cut":false,"hidden":false,"merged":[[50,0,51,0],[37,0,38,0],[37,1,38,1],[8,0,8,7],[9,0,9,7],[13,0,15,0],[20,0,22,0],[20,7,22,7],[11,0,11,5],[18,0,18,5]]}
[null,null,null,null,null,"File Number:",{"$f":"EBNUMBER","v":"EB-2017-0071"}]
[null,null,null,null,null,"Exhibit:","2 & 4"]
[null,null,null,null,null,"Tab:"]
[null,null,null,null,null,"Schedule:"]
[null,null,null,null,null,"Page:","Page 72 or Appendix 5 & Page 29 "]
[]
[null,null,null,null,null,"Date:","2018-03-29"]
[]
["Appendix 2-D"]
["Overhead Expense"]
[]
["Applicants are to provide a breakdown of OM&A before capitalization in the below table.  OM&A before capitalization may be broken down by cost center, program, drivers or another format best suited to focus on capitalized vs. uncapitalized OM&A."]
[]
[" OM&A Before Capitalization"]
[null,{"$f":"F15-4","v":2014},{"$f":"F15-3","v":2015},{"$f":"F15-2","v":2016},{"$f":"F15-1","v":2017},{"$f":"TestYear","v":2018}]
[null,"Historical Year","Historical Year","Historical Year","Bridge Year","Test Year"]
["Total OM&A Before Capitalization (B)",{"$f":"'App.2-JA_OM&A_Summary_Analys'!D26+'App.2-D_Overhead'!B35","v":12900367.107999999},{"$f":"'App.2-JA_OM&A_Summary_Analys'!E26+'App.2-D_Overhead'!C35","v":13023046.486},{"$f":"'App.2-JA_OM&A_Summary_Analys'!F26+'App.2-D_Overhead'!D35","v":12985960.578},{"$f":"'App.2-JA_OM&A_Summary_Analys'!H26+'App.2-D_Overhead'!E35","v":13139549.205999998},{"$f":"'App.2-JA_OM&A_Summary_Analys'!I26+'App.2-D_Overhead'!F35","v":13576654.84853}]
[]
["Applicants are to provide a breakdown of capitalized OM&A in the below table.  Capitalized OM&A may be broken down using the categories listed in the table below if possible.  Otherwise, applicants are to provide its own break down of capitalized OM&A."]
[]
["Capitalized OM&A",null,null,null,null,null,"Directly","Explanation for Change in Overhead Capitalized"]
[null,{"$f":"F22-4","v":2014},{"$f":"F22-3","v":2015},{"$f":"F22-2","v":2016},{"$f":"F22-1","v":2017},{"$f":"TestYear","v":2018},"Attributable?"]
[null,"Historical Year","Historical Year","Historical Year","Bridge Year","Test Year","(Yes/No)"]
["Material",{"$f":"(1354870.04/1.25)*0.25","v":270974.00800000003},{"$f":"(1697298.03/1.25)*0.25","v":339459.60600000003},{"$f":"(1503561.69/1.25)*0.25","v":300712.33799999999},276147.12599999999,281670.06851999997,"Yes"]
["Engineering",632250.57999999996,564975.04,553561.4,470469.789999998,549312.00373,"Yes"]
["Trucking",595906.01,570833.42000000004,491515.19,535908.29,546626.4558,"Yes"]
["Supervisory",363895.51,269955.42,275236.65000000002,207260,243212.90047999998,"Yes"]
[]
[]
[]
[]
[]
[]
[]
["Total Capitalized OM&A (A)",{"$f":"SUM(B24:B34)","v":1863026.108},{"$f":"SUM(C24:C34)","v":1745223.486},{"$f":"SUM(D24:D34)","v":1621025.5780000002},{"$f":"SUM(E24:E34)","v":1489785.2059999979},{"$f":"SUM(F24:F34)","v":1620821.4285299999}]
[]
["% of Capitalized OM&A (=A/B)",{"$f":"IF(ISERROR(B35/B17),\"0%\",B35/B17)","v":0.14441651872408096},{"$f":"IF(ISERROR(C35/C17),\"0%\",C35/C17)","v":0.13401038596277343},{"$f":"IF(ISERROR(D35/D17),\"0%\",D35/D17)","v":0.12482908509257606},{"$f":"IF(ISERROR(E35/E17),\"0%\",E35/E17)","v":0.11338175934679004},{"$f":"IF(ISERROR(F35/F17),\"0%\",F35/F17)","v":0.11938297368629747}]

{"sheet":"App.2-EA_Account 1575 (2015)","index":13,"n_rows":47,"n_cols":9,"rows_kept":47,"cut":false,"hidden":false,"merged":[[47,0,47,9],[52,0,53,8],[25,1,26,5],[31,1,31,5],[37,6,38,7],[37,8,38,8],[20,1,20,5],[8,0,8,8],[9,0,9,8],[10,0,10,8],[12,0,12,8],[14,0,14,8]]}
[null,null,null,null,null,null,null,"File Number:",{"$f":"EBNUMBER","v":"EB-2017-0071"}]
[null,null,null,null,null,null,null,"Exhibit:","N/A"]
[null,null,null,null,null,null,null,"Tab:"]
[null,null,null,null,null,null,null,"Schedule:"]
[null,null,null,null,null,null,null,"Page:"]
[]
[null,null,null,null,null,null,null,"Date:","2018-03-29"]
[]
["Appendix 2-EA"]
["Account 1575 - IFRS-CGAAP Transitional PP&E Amounts"]
["2015 Adopters of IFRS for Financial Reporting Purposes"]
[]
["For applicants that adopted IFRS on January 1, 2015 for financial reporting purposes"]
[]
[]
[]
[null,2014,{"$f":"TestYear-3","v":2015},{"$f":"TestYear-2","v":2016},{"$f":"CONCATENATE(TestYear-1,\" Bridge Year\")","v":"2017 Bridge Year"},{"$f":"CONCATENATE(TestYear,\" Rebasing Year\")","v":"2018 Rebasing Year"}]
["Reporting Basis","CGAAP","CGAAP","CGAAP","MIFRS","MIFRS"]
[null,"Actual","Actual","Actual","Forecast","Forecast"]
[null,null,null,"$","$"]
["PP&E Values under CGAAP"]
["            Opening net PP&E - Note 1",null,{"$f":"+B25","v":0},{"$f":"+C25","v":0},{"$f":"+D25","v":0}]
["            Net Additions - Note 4"]
["            Net Depreciation (amounts should be negative) - Note 4"]
["            Closing net PP&E (1)",{"$f":"SUM(B22:B24)","v":0},{"$f":"SUM(C22:C24)","v":0},{"$f":"SUM(D22:D24)","v":0},{"$f":"SUM(E22:E24)","v":0}]
[]
["PP&E Values under MIFRS (Starts from 2014, the transition year)"]
["            Opening net PP&E  - Note 1",null,{"$f":"+B31","v":0},{"$f":"+C31","v":0},{"$f":"+D31","v":0}]
["            Net Additions - Note 4"]
["            Net Depreciation (amounts should be negative) - Note 4"]
["            Closing net PP&E (2)",{"$f":"SUM(B28:B30)","v":0},{"$f":"SUM(C28:C30)","v":0},{"$f":"SUM(D28:D30)","v":0},{"$f":"SUM(E28:E30)","v":0}]
[]
["Difference in Closing net PP&E, former CGAAP vs. revised CGAAP ",{"$f":"B25-B31","v":0},{"$f":"C25-C31","v":0},{"$f":"D25-D31","v":0},{"$f":"E25-E31","v":0}]
[]
[]
["Effect on Deferral and Variance Account Rate Riders"]
["Closing balance in Account 1575",null,null,null,null,{"$f":"IF(ISERROR(E33), 0, E33)","v":0},null,"WACC"]
["Return on Rate Base Associated with Account 1575 balance at WACC  - Note 2",null,null,null,null,{"$f":"E33*I37*I38","v":0},"# of years of rate rider disposition period"]
["     Amount included in Deferral and Variance Account Rate Rider Calculation",null,null,null,null,{"$f":"F37+F38","v":0}]
[]
["Notes:"]
["1  For an applicant that adopted IFRS on January 1, 2015, the PP&E values as of January 1, 2014 under both CGAAP and MIFRS should be the same. "]
["2 Return on rate base associated with deferred balance is calculated as:"]
["     the deferral account closing balance as of 2017 x WACC X # of years of rate rider disposition period"]
["     * Please note that the calculation should be adjusted once WACC is updated and finalized in the rate application."]
["3  The  PP&E deferral account is cleared by including the total balance in the deferral and variance account rate rider calculation."]
["4  Net additions are additions net of disposals; Net depreciation is additions to depreciation net of disposals."]

{"sheet":"App.2-EB_Account 1576 (2012)","index":14,"n_rows":48,"n_cols":12,"rows_kept":48,"cut":false,"hidden":false,"merged":[[41,0,41,12],[45,0,45,10],[8,0,8,11],[9,0,9,11],[10,0,10,11],[12,0,13,11],[14,0,14,11],[20,1,20,8],[25,1,26,8],[31,1,31,8],[37,9,38,10],[37,11,38,11]]}
[null,null,null,null,null,null,null,null,null,null,"File Number:",{"$f":"EBNUMBER","v":"EB-2017-0071"}]
[null,null,null,null,null,null,null,null,null,null,"Exhibit:","N/A"]
[null,null,null,null,null,null,null,null,null,null,"Tab:"]
[null,null,null,null,null,null,null,null,null,null,"Schedule:"]
[null,null,null,null,null,null,null,null,null,null,"Page:"]
[]
[null,null,null,null,null,null,null,null,null,null,"Date:","2018-03-29"]
[]
["Appendix 2-EB"]
["Account 1576 - Accounting Changes under CGAAP"]
["2012 Changes in Accounting Policies under CGAAP"]
[]
["For applicants with a balance in Account 1576 and made capitalization and depreciation expense accounting policy changes under CGAAP effective January 1, 2012.  This is the first time the applicant is rebasing with changes in these accounting policies."]
[]
[]
[]
[null,"Prior Years Rebasing",2012,2013,2014,2015,2016,2017,"2018 Rebasing Year"]
["Reporting Basis","CGAAP","CGAAP","CGAAP","CGAAP","MIFRS - Note 5","MIFRS","MIFRS","MIFRS"]
[null,"Forecast","Actual","Actual","Actual","Actual","Actual","Forecast","Forecast"]
[null,null,"$","$","$","$","$","$"]
["PP&E Values under former CGAAP"]
["            Opening net PP&E - Note 1",null,null,{"$f":"+C25","v":0},{"$f":"+D25","v":0},{"$f":"+E25","v":0},{"$f":"+F25","v":0},{"$f":"+G25","v":0}]
["            Net Additions - Note 4"]
["            Net Depreciation (amounts should be negative) - Note 4"]
["            Closing net PP&E (1)",null,{"$f":"C22+C23+C24","v":0},0,0,0,0,0]
[]
["PP&E Values under revised CGAAP (Starts from 2012)"]
["            Opening net PP&E  - Note 1",null,null,{"$f":"+C31","v":0},{"$f":"+D31","v":0},{"$f":"+E31","v":0},{"$f":"+F31","v":0},{"$f":"+G31","v":0}]
["            Net Additions - Note 4"]
["            Net Depreciation (amounts should be negative) - Note 4"]
["            Closing net PP&E (2)",null,{"$f":"SUM(C28:C30)","v":0},0,0,0,0,0]
[]
["Difference in Closing net PP&E, former CGAAP vs. revised CGAAP ",null,{"$f":"C25-C31","v":0},0,0,0,0,0]
[]
[]
["Effect on Deferral and Variance Account Rate Riders"]
["Closing balance in Account 1576",null,null,null,null,null,null,null,{"$f":"IF(ISERROR(H33), 0, H33)","v":0},null,"WACC"]
["Return on Rate Base Associated with Account 1576 balance at WACC  - Note 2",null,null,null,null,null,null,null,{"$f":"H33*L37*L38","v":0},"# of years of rate rider disposition period"]
["     Amount included in Deferral and Variance Account Rate Rider Calculation",null,null,null,null,null,null,null,{"$f":"I37+I38","v":0}]
[]
["Notes:"]
["1  For an applicant that made the capitalization and depreciation expense accounting policy changes on January 1, 2012, the PP&E values as of January 1, 2012 under both former CGAAP and revised CGAAP should be the same. "]
["2 Return on rate base associated with Account 1576 balance is calculated as:"]
["     the variance account ending balance as of 2017 x WACC X # of years of rate rider disposition period"]
["     * Please note that the calculation should be adjusted once WACC is updated and finalized in the rate application."]
["3  Account 1576 is cleared by including the total balance in the deferral and variance account rate rider calculation."]
["4  Net additions are additions net of disposals; Net depreciation is additions to depreciation net of disposals."]
["5 Differences due to the adoption of MIFRS are to be shown separately in Account 1575 in Appendix 2-EA as Accounts 1575 and 1576 cannot be used interchangably."]

{"sheet":"App.2-EC_Account 1576 (2013)","index":15,"n_rows":48,"n_cols":11,"rows_kept":48,"cut":false,"hidden":false,"merged":[[45,0,45,9],[8,0,8,10],[9,0,9,10],[10,0,10,10],[12,0,12,10],[14,0,14,10],[37,10,38,10],[20,1,20,7],[25,1,26,7],[31,1,31,7],[37,8,38,9],[41,0,41,11]]}
[null,null,null,null,null,null,null,null,null,"File Number:",{"$f":"EBNUMBER","v":"EB-2017-0071"}]
[null,null,null,null,null,null,null,null,null,"Exhibit:","N/A"]
[null,null,null,null,null,null,null,null,null,"Tab:"]
[null,null,null,null,null,null,null,null,null,"Schedule:"]
[null,null,null,null,null,null,null,null,null,"Page:"]
[]
[null,null,null,null,null,null,null,null,null,"Date:","2018-03-29"]
[]
["Appendix 2-EC"]
["Account 1576 - Accounting Changes under CGAAP"]
["2013 Changes in Accounting Policies under CGAAP"]
[]
["For applicants with a balance in Account 1576 and made capitalization and depreciation expense accounting policy changes under CGAAP effective January 1, 2013.  This is the first time the applicant is rebasing with changes in these accounting policies."]
[]
[]
[]
[null,"Prior Years Rebasing",2013,2014,2015,2016,2017,"2018 Rebasing Year"]
["Reporting Basis","CGAAP","CGAAP","CGAAP","MIFRS - Note 5","MIFRS","MIFRS","MIFRS"]
[null,"Actual","Actual","Actual","Actual","Actual","Forecast","Forecast"]
[null,null,"$","$",null,"$"]
["PP&E Values under former CGAAP"]
["            Opening net PP&E - Note 1",null,null,{"$f":"+C25","v":0},{"$f":"+D25","v":0},{"$f":"+E25","v":0},{"$f":"+F25","v":0}]
["            Net Additions - Note 4"]
["            Net Depreciation (amounts should be negative) - Note 4"]
["            Closing net PP&E (1)",null,{"$f":"C22+C23+C24","v":0},{"$f":"D22+D23+D24","v":0},{"$f":"E22+E23+E24","v":0},{"$f":"F22+F23+F24","v":0},{"$f":"G22+G23+G24","v":0}]
[]
["PP&E Values under revised CGAAP (Starts from 2012)"]
["            Opening net PP&E  - Note 1",null,null,{"$f":"+C31","v":0},{"$f":"+D31","v":0},{"$f":"+E31","v":0},{"$f":"+F31","v":0}]
["            Net Additions - Note 4"]
["            Net Depreciation (amounts should be negative) - Note 4"]
["            Closing net PP&E (2)",null,{"$f":"SUM(C28:C30)","v":0},{"$f":"SUM(D28:D30)","v":0},{"$f":"SUM(E28:E30)","v":0},{"$f":"SUM(F28:F30)","v":0},{"$f":"SUM(G28:G30)","v":0}]
[]
["Difference in Closing net PP&E, former CGAAP vs. revised CGAAP ",null,{"$f":"C25-C31","v":0},{"$f":"D25-D31","v":0},{"$f":"E25-E31","v":0},{"$f":"F25-F31","v":0},{"$f":"G25-G31","v":0}]
[]
[]
["Effect on Deferral and Variance Account Rate Riders"]
["Closing balance in Account 1576",null,null,null,null,null,null,{"$f":"IF(ISERROR(G33), 0, G33)","v":0},null,"WACC"]
["Return on Rate Base Associated with Account 1576 balance at WACC  - Note 2",null,null,null,null,null,null,{"$f":"G33*K37*K38","v":0},"# of years of rate rider disposition period"]
["     Amount included in Deferral and Variance Account Rate Rider Calculation",null,null,null,null,null,null,{"$f":"H37+H38","v":0}]
[]
["Notes:"]
["1  For an applicant that made the capitalization and depreciation expense accounting policy changes on January 1, 2013, the PP&E values as of January 1, 2013 under both former CGAAP and revised CGAAP should be the same. "]
["2 Return on rate base associated with Account 1576 balance is calculated as:"]
["     the variance account ending balance as of 2017 x WACC X # of years of rate rider disposition period"]
["     * Please note that the calculation should be adjusted once WACC is updated and finalized in the rate application."]
["3  Account 1576 is cleared by including the total balance in the deferral and variance account rate rider calculation."]
["4  Net additions are additions net of disposals; Net depreciation is additions to depreciation net of disposals."]
["5 Differences due to the adoption of MIFRS are to be shown separately in Account 1575 in Appendix 2-EA as Accounts 1575 and 1576 cannot be used interchangably."]

{"sheet":"App.2-FA Proposed REG Invest.","index":16,"n_rows":101,"n_cols":11,"rows_kept":101,"cut":false,"hidden":false,"merged":[[8,0,8,10],[17,0,17,8],[16,0,16,9],[12,0,12,6],[13,0,13,5],[14,0,14,5],[11,0,11,6],[9,0,9,10]]}
[null,null,null,null,null,null,null,null,null,"File Number:",{"$f":"EBNUMBER","v":"EB-2017-0071"}]
[null,null,null,null,null,null,null,null,null,"Exhibit:",2]
[null,null,null,null,null,null,null,null,null,"Tab:"]
[null,null,null,null,null,null,null,null,null,"Schedule:"]
[null,null,null,null,null,null,null,null,null,"Page:","Page 73 or Appendix 6"]
[]
[null,null,null,null,null,null,null,null,null,"Date:","2018-03-29"]
[]
["Appendix 2-FA"]
["Renewable Generation Connection Investment Summary (past investments or over the future rate setting period)"]
[]
["Enter the details of the Renewable Generation Connection projects as described in the appropriate section of the Filing Requirements."]
["All costs entered on this page will be transferred to the appropriate cells in the appendices that follow."]
["For Part A, Renewable Enabling Improvements (REI), these amounts will be transferred to Appendix 2 - FB"]
["For Part B, Expansions, these amounts will be transferred to Appendix 2 - FC"]
[]
["If there are more than five projects proposed to be in-service in a certain year, please amend the tables below and ensure that the formulae for the Total Amounts in any given rate year are updated."]
["Based on the current methodology and allocation, amounts allocated represent 6% for REI Connection Investments and 17% for Expansion Investments. (EB-2009-0349, 6-10-2010, p. 15, note 9)"]
[]
["There are two scenarios described below.  Separate sets of spreadsheets (2-FA, 2-FB, 2-FC) should be submited for each scenario as required."]
["Scenario 1:  Past Investments with No Recovery.  The distributor has made investments in the past (during the IRM Years), but has not received approval for these projects and therefore did not receive"]
["revenue from the IESO under Regulation 330/09 and did not receive ratepayer revenue for the direct benefit portion of the investment."]
["The WCA percentage, debt percentages, interest rates, kWh, tax rates, amortization period, CCA Class and percentage should correspond to the distributor's last Cost of Service approval. "]
["The Direct Benefit portion of the calculated Revenue Requirement for each year should be summed and can be applied for recovery from the distributor's ratepayers through a rate rider."]
["The Provincial Recovery portion of the calculated Revenue Requirement for each year should be summed and can be applied for recovery from the IESO through a separate order."]
[]
["Scenario 2:  Investments in the Test Year and Beyond.  Distributor plans to make investments in 2017 and/or beyond.  These investments should be added to 2-FA in the appropriate year."]
["The WCA percentage, debt percentages, interest rates, kWh, tax rates, amortization period, CCA Class and percentage should correspond to the distributor's current application. "]
[]
["Part A",null,null,null,null,null,"Test Year"]
["REI Investments (Direct Benefit at 6%)",null,{"$f":"D31-1","v":2014},{"$f":"E31-1","v":2015},{"$f":"F31-1","v":2016},{"$f":"G31-1","v":2017},{"$f":"TestYear","v":2018},{"$f":"G31+1","v":2019},{"$f":"H31+1","v":2020},{"$f":"I31+1","v":2021},{"$f":"J31+1","v":2022}]
["Project 1"]
["Name: REI Connection Project"]
["Capital Costs",null,0,0,0,0,0,0,0,0,0]
["OM&A (Start-Up)",null,0,0,0,0,0,0,0,0,0]
["OM&A (Ongoing)",null,0,0,0,0,0,0,0,0,0]
[]
["Project 2"]
["Name: REI Connection Project"]
["Capital Costs",null,0,0,0,0,0,0,0,0,0]
["OM&A (Start-Up)",null,0,0,0,0,0,0,0,0,0]
["OM&A (Ongoing)",null,0,0,0,0,0,0,0,0,0]
[]
["Project 3"]
["Name: REI Connection Project"]
["Capital Costs",null,0,0,0,0,0,0,0,0,0]
["OM&A (Start-Up)",null,0,0,0,0,0,0,0,0,0]
["OM&A (Ongoing)",null,0,0,0,0,0,0,0,0,0]
[]
["Project 4"]
["Name: REI Connection Project"]
["Capital Costs",null,0,0,0,0,0,0,0,0,0]
["OM&A (Start-Up)",null,0,0,0,0,0,0,0,0,0]
["OM&A (Ongoing)",null,0,0,0,0,0,0,0,0,0]
[]
["Project 5"]
["Name: REI Connection Project"]
["Capital Costs",null,0,0,0,0,0,0,0,0,0]
["OM&A (Start-Up)",null,0,0,0,0,0,0,0,0,0]
["OM&A (Ongoing)",null,0,0,0,0,0,0,0,0,0]
[]
["Total Capital Costs",null,{"$f":"SUM(C58,C52,C46,C40,C34)","v":0},0,0,0,{"$f":"SUM(G58,G52,G46,G40,G34)","v":0},{"$f":"SUM(H58,H52,H46,H40,H34)","v":0},0,0,0]
["Total OM&A (Start-Up)",null,0,0,0,0,{"$f":"SUM(G59,G53,G47,G41,G35)","v":0},0,0,0,0]
["Total OM&A (Ongoing)",null,0,0,0,0,{"$f":"SUM(G60,G54,G48,G42,G36)","v":0},0,0,0,0]
[]
[]
["Part B",null,null,null,null,null,"Test Year"]
["Expansion Investments (Direct Benefit at 17%)",null,{"$f":"D68-1","v":2014},{"$f":"E68-1","v":2015},{"$f":"F68-1","v":2016},{"$f":"G68-1","v":2017},{"$f":"TestYear","v":2018},{"$f":"G68+1","v":2019},{"$f":"H68+1","v":2020},2021,2022]
["Project 1"]
["Name: Expansion Connection Project"]
["Capital Costs",null,0,0,0,0,0,0,0,0,0]
["OM&A (Start-Up)",null,0,0,0,0,0,0,0,0,0]
["OM&A (Ongoing)",null,0,0,0,0,0,0,0,0,0]
[]
["Project 2"]
["Name: Expansion Connection Project"]
["Capital Costs",null,0,0,0,0,0,0,0,0,0]
["OM&A (Start-Up)",null,0,0,0,0,0,0,0,0,0]
["OM&A (Ongoing)",null,0,0,0,0,0,0,0,0,0]
[]
["Project 3"]
["Name: Expansion Connection Project"]
["Capital Costs",null,0,0,0,0,0,0,0,0,0]
["OM&A (Start-Up)",null,0,0,0,0,0,0,0,0,0]
["OM&A (Ongoing)",null,0,0,0,0,0,0,0,0,0]
[]
["Project 4"]
["Name: Expansion Connection Project"]
["Capital Costs",null,0,0,0,0,0,0,0,0,0]
["OM&A (Start-Up)",null,0,0,0,0,0,0,0,0,0]
["OM&A (Ongoing)",null,0,0,0,0,0,0,0,0,0]
[]
["Project 5"]
["Name: Expansion Connection Project"]
["Capital Costs",null,0,0,0,0,0,0,0,0,0]
["OM&A (Start-Up)",null,0,0,0,0,0,0,0,0,0]
["OM&A (Ongoing)",null,0,0,0,0,0,0,0,0,0]
[]
["Total Capital Costs",null,{"$f":"SUM(C95,C89,C83,C77,C71)","v":0},0,0,0,{"$f":"SUM(G95,G89,G83,G77,G71)","v":0},{"$f":"SUM(H95,H89,H83,H77,H71)","v":0},0,0,0]
["Total OM&A (Start-Up)",null,0,0,0,0,{"$f":"SUM(G96,G90,G84,G78,G72)","v":0},0,0,0,0]
["Total OM&A (Ongoing)",null,0,0,0,0,{"$f":"SUM(G97,G91,G85,G79,G73)","v":0},0,0,0,0]

{"sheet":"App.2-FB Calc of REG Improvemnt","index":17,"n_rows":95,"n_cols":29,"rows_kept":95,"cut":false,"hidden":false,"merged":[[16,26,16,28],[8,0,8,17],[9,0,9,17],[11,0,11,17],[12,0,12,17],[14,0,14,17],[46,0,46,22],[16,14,16,16],[16,17,16,19],[16,20,16,22],[16,23,16,25],[16,11,16,13],[16,8,16,10],[16,5,16,7],[16,2,16,4],[51,24,51,25],[51,27,51,28],[48,0,48,22],[49,0,49,1],[51,15,51,16],[51,18,51,19],[51,21,51,22],[51,12,51,13],[51,9,51,10],[51,6,51,7],[51,3,51,4]]}
[null,null,null,null,null,null,null,null,null,null,null,null,null,"File Number:",{"$f":"EBNUMBER","v":"EB-2017-0071"}]
[null,null,null,null,null,null,null,null,null,null,null,null,null,"Exhibit:",2]
[null,null,null,null,null,null,null,null,null,null,null,null,null,"Tab:"]
[null,null,null,null,null,null,null,null,null,null,null,null,null,"Schedule:"]
[null,null,null,null,null,null,null,null,null,null,null,null,null,"Page:","Page 74 or Appendix 7"]
[]
[null,null,null,null,null,null,null,null,null,null,null,null,null,"Date:","2018-03-29"]
[]
["Appendix 2-FB"]
["Calculation of Renewable Generation Connection Direct Benefits/Provincial Amount: Renewable Enabling Improvement Investments"]
[]
["This table will calculate the distributor/provincial shares of the investments entered in Part A of Appendix 2-FA."]
["Enter values in green shaded cells: WCA percentage, debt percentages, interest rates, kWh, tax rates, amortization period, CCA Class and percentage."]
["For historical investments, enter these variables for your last cost of service test year.  For 2017 and beyond, enter variables as in the application."]
["Rate Riders are not calculated for the Test Year as these assets and costs are already in the distributor's rate base/revenue requirement."]
[]
[null,null,{"$f":"F17-1","v":2014},null,null,{"$f":"I17-1","v":2015},null,null,{"$f":"L17-1","v":2016},null,null,{"$f":"BridgeYear","v":2017},null,null,{"$f":"CONCATENATE(TestYear,\" Test Year\")","v":"2018 Test Year"},null,null,{"$f":"TestYear+1","v":2019},null,null,{"$f":"R17+1","v":2020},2016,null,{"$f":"U17+1","v":2021},null,null,{"$f":"X17+1","v":2022}]
[null,null,null,"Direct Benefit","Provincial",null,"Direct Benefit","Provincial",null,"Direct Benefit","Provincial",null,"Direct Benefit","Provincial",null,"Direct Benefit","Provincial",null,"Direct Benefit","Provincial",null,"Direct Benefit","Provincial",null,"Direct Benefit","Provincial",null,"Direct Benefit","Provincial"]
[null,null,"Total",0.06,0.94,"Total",0.06,0.94,"Total",0.06,0.94,"Total",0.06,0.94,"Total",0.06,0.94,"Total",0.06,0.94,"Total",0.06,0.94,"Total",0.06,0.94,"Total",0.06,0.94]
["Net Fixed Assets (average)",null,{"$f":"D82","v":0},{"$f":"C20*D19","v":0},{"$f":"C20*E19","v":0},{"$f":"E82","v":0},{"$f":"F20*G19","v":0},{"$f":"F20*H19","v":0},{"$f":"F82","v":0},{"$f":"I20*J19","v":0},{"$f":"I20*K19","v":0},{"$f":"G82","v":0},{"$f":"L20*M19","v":0},{"$f":"L20*N19","v":0},{"$f":"H82","v":0},{"$f":"O20*P19","v":0},{"$f":"O20*Q19","v":0},{"$f":"I82","v":0},{"$f":"R20*S19","v":0},{"$f":"R20*T19","v":0},{"$f":"J82","v":0},{"$f":"U20*V19","v":0},{"$f":"U20*W19","v":0},{"$f":"K82","v":0},{"$f":"X20*Y19","v":0},{"$f":"X20*Z19","v":0},{"$f":"L82","v":0},{"$f":"AA20*AB19","v":0},{"$f":"AA20*AC19","v":0}]
["Incremental OM&A (on-going, N/A for Provincial Recovery)",null,{"$f":"'App.2-FA Proposed REG Invest.'!C64","v":0},{"$f":"C21","v":0},null,{"$f":"'App.2-FA Proposed REG Invest.'!D64","v":0},{"$f":"F21","v":0},null,{"$f":"'App.2-FA Proposed REG Invest.'!E64","v":0},{"$f":"I21","v":0},null,{"$f":"'App.2-FA Proposed REG Invest.'!F64","v":0},{"$f":"L21","v":0},null,{"$f":"'App.2-FA Proposed REG Invest.'!G64","v":0},{"$f":"O21","v":0},null,{"$f":"'App.2-FA Proposed REG Invest.'!H64","v":0},{"$f":"R21","v":0},null,{"$f":"'App.2-FA Proposed REG Invest.'!I64","v":0},{"$f":"U21","v":0},null,{"$f":"'App.2-FA Proposed REG Invest.'!J64","v":0},{"$f":"X21","v":0},null,{"$f":"'App.2-FA Proposed REG Invest.'!K64","v":0},{"$f":"AA21","v":0}]
["Incremental OM&A (start-up, applicable for Provincial Recovery)",null,{"$f":"'App.2-FA Proposed REG Invest.'!C63","v":0},{"$f":"C22*D19","v":0},{"$f":"C22*E19","v":0},{"$f":"'App.2-FA Proposed REG Invest.'!D63","v":0},{"$f":"F22*G19","v":0},{"$f":"F22*H19","v":0},{"$f":"'App.2-FA Proposed REG Invest.'!E63","v":0},{"$f":"I22*J19","v":0},{"$f":"I22*K19","v":0},{"$f":"'App.2-FA Proposed REG Invest.'!F63","v":0},{"$f":"L22*M19","v":0},{"$f":"L22*N19","v":0},{"$f":"'App.2-FA Proposed REG Invest.'!G63","v":0},{"$f":"O22*P19","v":0},{"$f":"O22*Q19","v":0},{"$f":"'App.2-FA Proposed REG Invest.'!H63","v":0},{"$f":"R22*S19","v":0},{"$f":"R22*T19","v":0},{"$f":"'App.2-FA Proposed REG Invest.'!I63","v":0},{"$f":"U22*V19","v":0},{"$f":"U22*W19","v":0},{"$f":"'App.2-FA Proposed REG Invest.'!J63","v":0},{"$f":"X22*Y19","v":0},{"$f":"X22*Z19","v":0},{"$f":"'App.2-FA Proposed REG Invest.'!K63","v":0},{"$f":"AA22*AB19","v":0},{"$f":"AA22*AC19","v":0}]
["WCA",7.4999999999999997E-2,null,{"$f":"(D21+D22)*$B$23","v":0},{"$f":"E22*$B$23","v":0},null,{"$f":"(G21+G22)*$B$23","v":0},{"$f":"H22*$B$23","v":0},null,{"$f":"(J21+J22)*$B$23","v":0},{"$f":"K22*$B$23","v":0},null,{"$f":"(M21+M22)*$B$23","v":0},{"$f":"N22*$B$23","v":0},null,{"$f":"(P21+P22)*$B$23","v":0},{"$f":"Q22*$B$23","v":0},null,{"$f":"(S21+S22)*$B$23","v":0},{"$f":"T22*$B$23","v":0},null,{"$f":"(V21+V22)*$B$23","v":0},{"$f":"W22*$B$23","v":0},null,{"$f":"(Y21+Y22)*$B$23","v":0},{"$f":"Z22*$B$23","v":0},null,{"$f":"(AB21+AB22)*$B$23","v":0},{"$f":"AC22*$B$23","v":0}]
["Rate Base",null,null,{"$f":"SUM(D20+D23)","v":0},{"$f":"SUM(E20+E23)","v":0},null,{"$f":"SUM(G20+G23)","v":0},{"$f":"SUM(H20+H23)","v":0},null,{"$f":"SUM(J20+J23)","v":0},{"$f":"SUM(K20+K23)","v":0},null,{"$f":"SUM(M20+M23)","v":0},{"$f":"SUM(N20+N23)","v":0},null,{"$f":"SUM(P20+P23)","v":0},{"$f":"SUM(Q20+Q23)","v":0},null,{"$f":"SUM(S20+S23)","v":0},{"$f":"SUM(T20+T23)","v":0},null,{"$f":"SUM(V20+V23)","v":0},{"$f":"SUM(W20+W23)","v":0},null,{"$f":"SUM(Y20+Y23)","v":0},{"$f":"SUM(Z20+Z23)","v":0},null,{"$f":"SUM(AB20+AB23)","v":0},{"$f":"SUM(AC20+AC23)","v":0}]
[]
[]
["Deemed ST Debt",0.04,null,{"$f":"D24*$B$27","v":0},{"$f":"E24*$B$27","v":0},null,{"$f":"G24*$B$27","v":0},{"$f":"H24*$B$27","v":0},null,{"$f":"J24*$B$27","v":0},{"$f":"K24*$B$27","v":0},null,{"$f":"M24*$B$27","v":0},{"$f":"N24*$B$27","v":0},null,{"$f":"P24*$B$27","v":0},{"$f":"Q24*$B$27","v":0},null,{"$f":"S24*$B$27","v":0},{"$f":"T24*$B$27","v":0},null,{"$f":"V24*$B$27","v":0},{"$f":"W24*$B$27","v":0},null,{"$f":"Y24*$B$27","v":0},{"$f":"Z24*$B$27","v":0},null,{"$f":"AB24*$B$27","v":0},{"$f":"AC24*$B$27","v":0}]
["Deemed LT Debt",0.56000000000000005,null,{"$f":"D24*$B$28","v":0},{"$f":"E24*$B$28","v":0},null,{"$f":"G24*$B$28","v":0},{"$f":"H24*$B$28","v":0},null,{"$f":"J24*$B$28","v":0},{"$f":"K24*$B$28","v":0},null,{"$f":"M24*$B$28","v":0},{"$f":"N24*$B$28","v":0},null,{"$f":"P24*$B$28","v":0},{"$f":"Q24*$B$28","v":0},null,{"$f":"S24*$B$28","v":0},{"$f":"T24*$B$28","v":0},null,{"$f":"V24*$B$28","v":0},{"$f":"W24*$B$28","v":0},null,{"$f":"Y24*$B$28","v":0},{"$f":"Z24*$B$28","v":0},null,{"$f":"AB24*$B$28","v":0},{"$f":"AC24*$B$28","v":0}]
["Deemed Equity",0.4,null,{"$f":"D24*$B$29","v":0},{"$f":"E24*$B$29","v":0},null,{"$f":"G24*$B$29","v":0},{"$f":"H24*$B$29","v":0},null,{"$f":"J24*$B$29","v":0},{"$f":"K24*$B$29","v":0},null,{"$f":"M24*$B$29","v":0},{"$f":"N24*$B$29","v":0},null,{"$f":"P24*$B$29","v":0},{"$f":"Q24*$B$29","v":0},null,{"$f":"S24*$B$29","v":0},{"$f":"T24*$B$29","v":0},null,{"$f":"V24*$B$29","v":0},{"$f":"W24*$B$29","v":0},null,{"$f":"Y24*$B$29","v":0},{"$f":"Z24*$B$29","v":0},null,{"$f":"AB24*$B$29","v":0},{"$f":"AC24*$B$29","v":0}]
[]
["ST Interest",2.29E-2,null,{"$f":"D27*$B31","v":0},{"$f":"E27*$B31","v":0},null,{"$f":"G27*$B31","v":0},{"$f":"H27*$B31","v":0},null,{"$f":"J27*$B31","v":0},{"$f":"K27*$B31","v":0},null,{"$f":"M27*$B31","v":0},{"$f":"N27*$B31","v":0},null,{"$f":"P27*$B31","v":0},{"$f":"Q27*$B31","v":0},null,{"$f":"S27*$B31","v":0},{"$f":"T27*$B31","v":0},null,{"$f":"V27*$B31","v":0},{"$f":"W27*$B31","v":0},null,{"$f":"Y27*$B31","v":0},{"$f":"Z27*$B31","v":0},null,{"$f":"AB27*$B31","v":0},{"$f":"AC27*$B31","v":0}]
["LT Interest",4.1200000000000001E-2,null,{"$f":"D28*$B32","v":0},0,null,{"$f":"G28*$B32","v":0},0,null,{"$f":"J28*$B32","v":0},0,null,{"$f":"M28*$B32","v":0},0,null,{"$f":"P28*$B32","v":0},0,null,{"$f":"S28*$B32","v":0},0,null,{"$f":"V28*$B32","v":0},0,null,{"$f":"Y28*$B32","v":0},0,null,{"$f":"AB28*$B32","v":0},0]
["ROE",0.09,null,0,0,null,0,0,null,0,0,null,0,0,null,0,0,null,0,0,null,0,0,null,0,0,null,0,0]
["Cost of Capital Total",null,null,{"$f":"SUM(D31:D33)","v":0},{"$f":"SUM(E31:E33)","v":0},null,{"$f":"SUM(G31:G33)","v":0},{"$f":"SUM(H31:H33)","v":0},null,{"$f":"SUM(J31:J33)","v":0},{"$f":"SUM(K31:K33)","v":0},null,{"$f":"SUM(M31:M33)","v":0},{"$f":"SUM(N31:N33)","v":0},null,{"$f":"SUM(P31:P33)","v":0},{"$f":"SUM(Q31:Q33)","v":0},null,{"$f":"SUM(S31:S33)","v":0},{"$f":"SUM(T31:T33)","v":0},null,{"$f":"SUM(V31:V33)","v":0},{"$f":"SUM(W31:W33)","v":0},null,{"$f":"SUM(Y31:Y33)","v":0},{"$f":"SUM(Z31:Z33)","v":0},null,{"$f":"SUM(AB31:AB33)","v":0},{"$f":"SUM(AC31:AC33)","v":0}]
[]
["OM&A",null,null,{"$f":"D21+D22","v":0},{"$f":"E22","v":0},null,{"$f":"G21+G22","v":0},{"$f":"H22","v":0},null,{"$f":"J21+J22","v":0},{"$f":"K22","v":0},null,{"$f":"M21+M22","v":0},{"$f":"N22","v":0},null,{"$f":"P21+P22","v":0},{"$f":"Q22","v":0},null,{"$f":"S21+S22","v":0},{"$f":"T22","v":0},null,{"$f":"V21+V22","v":0},{"$f":"W22","v":0},null,{"$f":"Y21+Y22","v":0},{"$f":"Z22","v":0},null,{"$f":"AB21+AB22","v":0},{"$f":"AC22","v":0}]
["Amortization",null,{"$f":"D77","v":0},{"$f":"C37*D$19","v":0},{"$f":"C37*E$19","v":0},{"$f":"E77","v":0},{"$f":"F37*G$19","v":0},{"$f":"F37*H$19","v":0},{"$f":"F77","v":0},{"$f":"I37*J$19","v":0},{"$f":"I37*K$19","v":0},{"$f":"G77","v":0},{"$f":"L37*M$19","v":0},{"$f":"L37*N$19","v":0},{"$f":"H77","v":0},{"$f":"O37*P$19","v":0},{"$f":"O37*Q$19","v":0},{"$f":"I76+I77","v":0},{"$f":"R37*S$19","v":0},{"$f":"R37*T$19","v":0},{"$f":"J76+J77","v":0},{"$f":"U37*V$19","v":0},{"$f":"U37*W$19","v":0},{"$f":"K76+K77","v":0},{"$f":"X37*Y$19","v":0},{"$f":"X37*Z$19","v":0},{"$f":"L76+L77","v":0},{"$f":"AA37*AB$19","v":0},{"$f":"AA37*AC$19","v":0}]
["Grossed-up PILs",null,null,{"$f":"D65","v":0},{"$f":"E65","v":0},null,{"$f":"G65","v":0},{"$f":"H65","v":0},null,{"$f":"J65","v":0},{"$f":"K65","v":0},null,{"$f":"M65","v":0},{"$f":"N65","v":0},null,{"$f":"P65","v":0},{"$f":"Q65","v":0},null,{"$f":"S65","v":0},{"$f":"T65","v":0},null,{"$f":"V65","v":0},{"$f":"W65","v":0},null,{"$f":"Y65","v":0},{"$f":"Z65","v":0},null,{"$f":"AB65","v":0},{"$f":"AC65","v":0}]
[]
["Revenue Requirement",null,null,{"$f":"SUM(D34:D38)","v":0},{"$f":"SUM(E34:E38)","v":0},null,{"$f":"SUM(G34:G38)","v":0},{"$f":"SUM(H34:H38)","v":0},null,{"$f":"SUM(J34:J38)","v":0},{"$f":"SUM(K34:K38)","v":0},null,{"$f":"SUM(M34:M38)","v":0},{"$f":"SUM(N34:N38)","v":0},null,{"$f":"SUM(P34:P38)","v":0},{"$f":"SUM(Q34:Q38)","v":0},null,{"$f":"SUM(S34:S38)","v":0},{"$f":"SUM(T34:T38)","v":0},null,{"$f":"SUM(V34:V38)","v":0},{"$f":"SUM(W34:W38)","v":0},null,{"$f":"SUM(Y34:Y38)","v":0},{"$f":"SUM(Z34:Z38)","v":0},null,{"$f":"SUM(AB34:AB38)","v":0},{"$f":"SUM(AC34:AC38)","v":0}]
[]
[]
["Provincial Rate Protection",null,null,null,{"$f":"E40","v":0},null,null,{"$f":"H40","v":0},null,null,{"$f":"K40","v":0},null,null,{"$f":"N40","v":0},null,null,{"$f":"Q40","v":0},null,null,{"$f":"T40","v":0},null,null,{"$f":"W40","v":0},null,null,{"$f":"Z40","v":0},null,null,{"$f":"AC40","v":0}]
[]
["Monthly Amount Paid by IESO",null,null,null,{"$f":"E43/12","v":0},null,null,{"$f":"H43/12","v":0},null,null,{"$f":"K43/12","v":0},null,null,{"$f":"N43/12","v":0},null,null,{"$f":"Q43/12","v":0},null,null,{"$f":"T43/12","v":0},null,null,{"$f":"W43/12","v":0},null,null,{"$f":"Z43/12","v":0},null,null,{"$f":"AC43/12","v":0}]
[]
["Note 1: The difference between the actual costs of approved eligible investments and revenue received from the IESO should be recorded in a variance account.  The Board may provide "]
["regulatory accounting guidance regarding a variance account either in an individual proceeding or on a generic basis."]
["Note 2: For the 2016 Test Year, Costs and Revenues of the Direct Benefit are to be included in the test year applicant Rate Base and Revenues.  "]
[]
["PILs Calculation"]
[null,null,null,{"$f":"C17","v":2014},null,null,{"$f":"F17","v":2015},null,null,{"$f":"I17","v":2016},null,null,{"$f":"L17","v":2017},null,null,{"$f":"O17","v":"2018 Test Year"},null,null,{"$f":"R17","v":2019},null,null,{"$f":"U17","v":2020},null,null,{"$f":"X17","v":2021},null,null,{"$f":"AA17","v":2022}]
["Income Tax",null,null,"Direct Benefit","Provincial",null,"Direct Benefit","Provincial",null,"Direct Benefit","Provincial",null,"Direct Benefit","Provincial",null,"Direct Benefit","Provincial",null,"Direct Benefit","Provincial",null,"Direct Benefit","Provincial",null,"Direct Benefit","Provincial",null,"Direct Benefit","Provincial"]
[null,null,null,null,null,null,null,null,null,null,null,null,null,null,null,null,null,null,null,null,null,null,null,"Total",null,null,"Total"]
["Net Income - ROE on Rate Base",null,null,{"$f":"D33","v":0},{"$f":"E33","v":0},null,{"$f":"G33","v":0},{"$f":"H33","v":0},null,{"$f":"J33","v":0},{"$f":"K33","v":0},null,{"$f":"M33","v":0},{"$f":"N33","v":0},null,{"$f":"P33","v":0},{"$f":"Q33","v":0},null,{"$f":"S33","v":0},{"$f":"T33","v":0},null,{"$f":"V33","v":0},{"$f":"W33","v":0},null,{"$f":"Y33","v":0},{"$f":"Z33","v":0},null,{"$f":"AB33","v":0},{"$f":"AC33","v":0}]
["Amortization (6% DB and 94% P)",null,null,{"$f":"D37","v":0},{"$f":"E37","v":0},null,{"$f":"G37","v":0},{"$f":"H37","v":0},null,{"$f":"J37","v":0},{"$f":"K37","v":0},null,{"$f":"M37","v":0},{"$f":"N37","v":0},null,{"$f":"P37","v":0},{"$f":"Q37","v":0},null,{"$f":"S37","v":0},{"$f":"T37","v":0},null,{"$f":"V37","v":0},{"$f":"W37","v":0},null,{"$f":"Y37","v":0},{"$f":"Z37","v":0},null,{"$f":"AB37","v":0},{"$f":"AC37","v":0}]
["CCA (6% DB and 94% P)",null,null,{"$f":"-D94*D$19","v":0},{"$f":"-D94*E$19","v":0},null,{"$f":"-E94*G19","v":0},{"$f":"-E94*H$19","v":0},null,{"$f":"-F94*J$19","v":0},{"$f":"-F94*K$19","v":0},null,{"$f":"-G94*M$19","v":0},{"$f":"-G94*N$19","v":0},null,{"$f":"-H94*P$19","v":0},{"$f":"-H94*Q$19","v":0},null,{"$f":"-I94*S$19","v":0},{"$f":"-I94*T$19","v":0},null,{"$f":"-J94*V$19","v":0},{"$f":"-J94*W$19","v":0},null,{"$f":"-K94*Y$19","v":0},{"$f":"-K94*Z$19","v":0},null,{"$f":"-L94*AB$19","v":0},{"$f":"-L94*AC$19","v":0}]
["Taxable income",null,null,{"$f":"SUM(D55:D57)","v":0},{"$f":"SUM(E55:E57)","v":0},null,{"$f":"SUM(G55:G57)","v":0},{"$f":"SUM(H55:H57)","v":0},null,{"$f":"SUM(J55:J57)","v":0},{"$f":"SUM(K55:K57)","v":0},null,{"$f":"SUM(M55:M57)","v":0},{"$f":"SUM(N55:N57)","v":0},null,{"$f":"SUM(P55:P57)","v":0},{"$f":"SUM(Q55:Q57)","v":0},null,{"$f":"SUM(S55:S57)","v":0},{"$f":"SUM(T55:T57)","v":0},null,{"$f":"SUM(V55:V57)","v":0},{"$f":"SUM(W55:W57)","v":0},null,{"$f":"SUM(Y55:Y57)","v":0},{"$f":"SUM(Z55:Z57)","v":0},null,{"$f":"SUM(AB55:AB57)","v":0},{"$f":"SUM(AC55:AC57)","v":0}]
[]
["Tax Rate  (to be entered)"]
[]
["Income Taxes Payable",null,null,{"$f":"D58*D60","v":0},{"$f":"E58*E60","v":0},null,{"$f":"G58*G60","v":0},{"$f":"H58*H60","v":0},null,{"$f":"J58*J60","v":0},{"$f":"K58*K60","v":0},null,{"$f":"M58*M60","v":0},{"$f":"N58*N60","v":0},null,{"$f":"P58*P60","v":0},{"$f":"Q58*Q60","v":0},null,{"$f":"S58*S60","v":0},{"$f":"T58*T60","v":0},null,{"$f":"V58*V60","v":0},{"$f":"W58*W60","v":0},null,{"$f":"Y58*Y60","v":0},{"$f":"Z58*Z60","v":0},null,{"$f":"AB58*AB60","v":0},{"$f":"AC58*AC60","v":0}]
["Gross Up"]
["Income Taxes Payable",null,null,{"$f":"D62/(1-D60)","v":0},{"$f":"E62/(1-E60)","v":0},null,{"$f":"G62/(1-G60)","v":0},{"$f":"H62/(1-H60)","v":0},null,{"$f":"J62/(1-J60)","v":0},{"$f":"K62/(1-K60)","v":0},null,{"$f":"M62/(1-M60)","v":0},{"$f":"N62/(1-N60)","v":0},null,{"$f":"P62/(1-P60)","v":0},{"$f":"Q62/(1-Q60)","v":0},null,{"$f":"S62/(1-S60)","v":0},{"$f":"T62/(1-T60)","v":0},null,{"$f":"V62/(1-V60)","v":0},{"$f":"W62/(1-W60)","v":0},null,{"$f":"Y62/(1-Y60)","v":0},{"$f":"Z62/(1-Z60)","v":0},null,{"$f":"AB62/(1-AB60)","v":0},{"$f":"AC62/(1-AC60)","v":0}]
["Grossed Up PILs",null,null,{"$f":"SUM(D64:D64)","v":0},{"$f":"SUM(E64:E64)","v":0},null,{"$f":"SUM(G64:G64)","v":0},{"$f":"SUM(H64:H64)","v":0},null,{"$f":"SUM(J64:J64)","v":0},{"$f":"SUM(K64:K64)","v":0},null,{"$f":"SUM(M64:M64)","v":0},{"$f":"SUM(N64:N64)","v":0},null,{"$f":"SUM(P64:P64)","v":0},{"$f":"SUM(Q64:Q64)","v":0},null,{"$f":"SUM(S64:S64)","v":0},{"$f":"SUM(T64:T64)","v":0},null,{"$f":"SUM(V64:V64)","v":0},{"$f":"SUM(W64:W64)","v":0},null,{"$f":"SUM(Y64:Y64)","v":0},{"$f":"SUM(Z64:Z64)","v":0},null,{"$f":"SUM(AB64:AB64)","v":0},{"$f":"SUM(AC64:AC64)","v":0}]
[]
[]
[null,null,null,{"$f":"E68-1","v":2014},{"$f":"F68-1","v":2015},{"$f":"G68-1","v":2016},{"$f":"H68-1","v":2017},{"$f":"TestYear","v":2018},{"$f":"H68+1","v":2019},{"$f":"I68+1","v":2020},{"$f":"J68+1","v":2021},{"$f":"K68+1","v":2022}]
["Net Fixed Assets"]
[null,"Enter applicable amortization in years:",25]
["Opening Gross Fixed Assets",null,null,null,{"$f":"D73","v":0},0,0,0,{"$f":"H73","v":0},{"$f":"I73","v":0},{"$f":"J73","v":0},{"$f":"K73","v":0}]
["Gross Capital Additions",null,null,{"$f":"'App.2-FA Proposed REG Invest.'!C62","v":0},{"$f":"'App.2-FA Proposed REG Invest.'!D62","v":0},{"$f":"'App.2-FA Proposed REG Invest.'!E62","v":0},{"$f":"'App.2-FA Proposed REG Invest.'!F62","v":0},{"$f":"'App.2-FA Proposed REG Invest.'!G62","v":0},{"$f":"'App.2-FA Proposed REG Invest.'!H62","v":0},{"$f":"'App.2-FA Proposed REG Invest.'!I62","v":0},{"$f":"'App.2-FA Proposed REG Invest.'!J62","v":0},{"$f":"'App.2-FA Proposed REG Invest.'!K62","v":0}]
["Closing Gross Fixed Assets",null,null,{"$f":"SUM(D71:D72)","v":0},0,0,0,{"$f":"SUM(H71:H72)","v":0},{"$f":"SUM(I71:I72)","v":0},0,0,0]
[]
["Opening Accumulated Amortization",null,null,null,{"$f":"+D78","v":0},{"$f":"E78","v":0},0,0,0,0,0,0]
["Current Year Amortization (before additions)",null,null,{"$f":"IF(ISERROR(D71/$C$70), 0, D71/$C$70)","v":0},0,0,0,0,{"$f":"IF(ISERROR(I71/$C$70), 0, I71/$C$70)","v":0},{"$f":"IF(ISERROR(J71/$C$70), 0, J71/$C$70)","v":0},{"$f":"IF(ISERROR(K71/$C$70), 0, K71/$C$70)","v":0},{"$f":"IF(ISERROR(L71/$C$70), 0, L71/$C$70)","v":0}]
["Additions (half year)",null,null,{"$f":"D72/$C$70/2","v":0},{"$f":"E72/$C$70/2","v":0},{"$f":"F72/$C$70/2","v":0},0,{"$f":"H72/$C$70/2","v":0},{"$f":"I72/C70/2","v":0},{"$f":"J72/C70/2","v":0},{"$f":"K72/C70/2","v":0},{"$f":"L72/C70/2","v":0}]
["Closing Accumulated Amortization",null,null,{"$f":"SUM(D75+D76+D77)","v":0},{"$f":"SUM(E75+E76+E77)","v":0},{"$f":"SUM(F75+F76+F77)","v":0},{"$f":"SUM(G75+G76+G77)","v":0},{"$f":"SUM(H75+H76+H77)","v":0},{"$f":"SUM(I75:I77)","v":0},{"$f":"SUM(J75:J77)","v":0},{"$f":"SUM(K75:K77)","v":0},{"$f":"SUM(L75:L77)","v":0}]
[]
["Opening Net Fixed Assets",null,null,{"$f":"D71-D75","v":0},0,{"$f":"F71-F75","v":0},0,{"$f":"H71-H75","v":0},{"$f":"H81","v":0},{"$f":"I81","v":0},{"$f":"J81","v":0},{"$f":"K81","v":0}]
["Closing Net Fixed Assets",null,null,{"$f":"D73-D78","v":0},{"$f":"E73-E78","v":0},0,0,{"$f":"H73-H78","v":0},{"$f":"I73-I78","v":0},{"$f":"J73-J78","v":0},{"$f":"K73-K78","v":0},{"$f":"L73-L78","v":0}]
["Average Net Fixed Assets",null,null,{"$f":"SUM(D80:D81)/2","v":0},0,0,0,{"$f":"SUM(H80:H81)/2","v":0},{"$f":"SUM(I80:I81)/2","v":0},{"$f":"SUM(J80:J81)/2","v":0},{"$f":"SUM(K80:K81)/2","v":0},{"$f":"SUM(L80:L81)/2","v":0}]
[]
["UCC for PILs Calculation"]
[null,null,null,{"$f":"D68","v":2014},{"$f":"E68","v":2015},2016,2017,2018,2019,2020,2021,2022]
[]
["Opening UCC",null,null,null,{"$f":"D95","v":0},0,0,0,0,0,0,0]
["Capital Additions (from Appendix 2-FA)",null,null,{"$f":"D72","v":0},0,0,0,{"$f":"H72","v":0},{"$f":"I72","v":0},0,0,0]
["UCC Before Half Year Rule",null,null,{"$f":"SUM(D87:D88)","v":0},0,0,0,{"$f":"SUM(H87:H88)","v":0},{"$f":"SUM(I87:I88)","v":0},{"$f":"SUM(J87:J88)","v":0},{"$f":"SUM(K87:K88)","v":0},{"$f":"SUM(L87:L88)","v":0}]
["Half Year Rule (1/2 Additions - Disposals)",null,null,{"$f":"D88/2","v":0},0,0,0,{"$f":"H88/2","v":0},{"$f":"I88/2","v":0},{"$f":"J88/2","v":0},{"$f":"K88/2","v":0},{"$f":"L88/2","v":0}]
["Reduced UCC",null,null,{"$f":"D89-D90","v":0},0,0,0,{"$f":"H89-H90","v":0},{"$f":"I89-I90","v":0},{"$f":"J89-J90","v":0},{"$f":"K89-K90","v":0},{"$f":"L89-L90","v":0}]
["CCA Rate Class (to be entered)",null,47,{"$f":"C92","v":47},{"$f":"D92","v":47},47,47,47,47,47,47,47]
["CCA Rate  (to be entered)",null,0.08,{"$f":"C93","v":0.08},0.08,0.08,0.08,0.08,0.08,0.08,0.08,0.08]
["CCA",null,null,{"$f":"D91*D93","v":0},0,0,0,{"$f":"H91*H93","v":0},{"$f":"I91*I93","v":0},0,0,{"$f":"L91*L93","v":0}]
["Closing UCC",null,null,{"$f":"D89-D94","v":0},0,0,0,{"$f":"H89-H94","v":0},{"$f":"I89-I94","v":0},{"$f":"J89-J94","v":0},{"$f":"K89-K94","v":0},{"$f":"L89-L94","v":0}]

{"sheet":"App.2-FC Calc of REG Expansion","index":18,"n_rows":95,"n_cols":30,"rows_kept":95,"cut":false,"hidden":false,"merged":[[8,0,8,14],[9,0,9,14],[11,0,11,14],[12,0,12,14],[14,0,14,14],[17,3,17,5],[17,6,17,8],[17,9,17,11],[17,12,17,14],[17,15,17,17],[17,18,17,20],[17,21,17,23],[17,24,17,26],[17,27,17,29],[52,22,52,23],[52,25,52,26],[52,28,52,29],[47,0,47,20],[49,0,49,21],[50,0,50,1],[52,4,52,5],[52,7,52,8],[52,10,52,11],[52,13,52,14],[52,16,52,17],[52,19,52,20]]}
[null,null,null,null,null,null,null,null,null,null,null,null,null,"File Number:",{"$f":"EBNUMBER","v":"EB-2017-0071"}]
[null,null,null,null,null,null,null,null,null,null,null,null,null,"Exhibit:",2]
[null,null,null,null,null,null,null,null,null,null,null,null,null,"Tab:"]
[null,null,null,null,null,null,null,null,null,null,null,null,null,"Schedule:"]
[null,null,null,null,null,null,null,null,null,null,null,null,null,"Page:","Page 75 or Appendix 8"]
[]
[null,null,null,null,null,null,null,null,null,null,null,null,null,"Date:","2018-03-29"]
[]
["Appendix 2-FC"]
["Calculation of Renewable Generation Connection Direct Benefits/Provincial Amount: Renewable Expansion Investments"]
[]
["This table will calculate the distributor/provincial shares of the investments entered in Part B of Appendix 2-FA."]
["Enter values in green shaded cells: WCA percentage, debt percentages, interest rates, kWh, tax rates, amortization period, CCA Class and percentage."]
["For historical investments, enter these variables for your last cost of service test year.  For 2016 and beyond, enter variables as in the application."]
["Rate Riders are not calculated for the Test Year as these assets and costs are already in the distributor's rate base."]
[]
[]
[null,null,null,{"$f":"G18-1","v":2014},null,null,{"$f":"J18-1","v":2015},null,null,{"$f":"M18-1","v":2016},null,null,{"$f":"BridgeYear","v":2017},null,null,{"$f":"CONCATENATE(TestYear,\" Test Year\")","v":"2018 Test Year"},null,null,{"$f":"TestYear+1","v":2019},2016,null,{"$f":"S18+1","v":2020},null,null,{"$f":"V18+1","v":2021},null,null,{"$f":"Y18+1","v":2022}]
[null,null,null,null,"Direct Benefit","Provincial",null,"Direct Benefit","Provincial",null,"Direct Benefit","Provincial",null,"Direct Benefit","Provincial",null,"Direct Benefit","Provincial",null,"Direct Benefit","Provincial",null,"Direct Benefit","Provincial",null,"Direct Benefit","Provincial",null,"Direct Benefit","Provincial"]
[null,null,null,"Total",0.17,0.83,"Total",0.17,0.83,"Total",0.17,0.83,"Total",0.17,0.83,"Total",0.17,0.83,"Total",0.17,0.83,"Total",0.17,0.83,"Total",0.17,0.83,"Total",0.17,0.83]
["Net Fixed Assets (average)",null,null,{"$f":"D82","v":0},{"$f":"D21*E20","v":0},{"$f":"D21*F20","v":0},{"$f":"E82","v":0},{"$f":"G21*H20","v":0},{"$f":"G21*I20","v":0},{"$f":"F82","v":0},{"$f":"J21*K20","v":0},{"$f":"J21*L20","v":0},{"$f":"G82","v":0},{"$f":"M21*N20","v":0},{"$f":"M21*O20","v":0},{"$f":"H82","v":0},{"$f":"P21*Q20","v":0},{"$f":"P21*R20","v":0},{"$f":"I82","v":0},{"$f":"S21*T20","v":0},{"$f":"S21*U20","v":0},{"$f":"J82","v":0},{"$f":"V21*W20","v":0},{"$f":"V21*X20","v":0},{"$f":"K82","v":0},{"$f":"Y21*Z20","v":0},{"$f":"Y21*AA20","v":0},{"$f":"L82","v":0},{"$f":"AB21*AC20","v":0},{"$f":"AB21*AD20","v":0}]
["Incremental OM&A (on-going, N/A for Provincial Recovery)",null,null,{"$f":"'App.2-FA Proposed REG Invest.'!C101","v":0},{"$f":"D22","v":0},null,{"$f":"'App.2-FA Proposed REG Invest.'!D$101","v":0},{"$f":"G22","v":0},null,{"$f":"'App.2-FA Proposed REG Invest.'!E$101","v":0},{"$f":"J22","v":0},null,{"$f":"'App.2-FA Proposed REG Invest.'!F$101","v":0},{"$f":"M22","v":0},null,{"$f":"'App.2-FA Proposed REG Invest.'!G$101","v":0},{"$f":"P22","v":0},null,{"$f":"'App.2-FA Proposed REG Invest.'!H$101","v":0},{"$f":"S22","v":0},null,{"$f":"'App.2-FA Proposed REG Invest.'!I$101","v":0},{"$f":"V22","v":0},null,{"$f":"'App.2-FA Proposed REG Invest.'!J$101","v":0},{"$f":"Y22","v":0},null,{"$f":"'App.2-FA Proposed REG Invest.'!K$101","v":0},{"$f":"AB22","v":0}]
["Incremental OM&A (start-up, applicable for Provincial Recovery)",null,null,{"$f":"'App.2-FA Proposed REG Invest.'!C100","v":0},{"$f":"D23*E20","v":0},{"$f":"D23*F20","v":0},{"$f":"'App.2-FA Proposed REG Invest.'!D$100","v":0},{"$f":"G23*H20","v":0},{"$f":"G23*I20","v":0},{"$f":"'App.2-FA Proposed REG Invest.'!E$100","v":0},{"$f":"J23*K20","v":0},{"$f":"J23*L20","v":0},{"$f":"'App.2-FA Proposed REG Invest.'!F$100","v":0},{"$f":"M23*N20","v":0},{"$f":"M23*O20","v":0},{"$f":"'App.2-FA Proposed REG Invest.'!G$100","v":0},{"$f":"P23*Q20","v":0},{"$f":"P23*R20","v":0},{"$f":"'App.2-FA Proposed REG Invest.'!H$100","v":0},{"$f":"S23*T20","v":0},{"$f":"S23*U20","v":0},{"$f":"'App.2-FA Proposed REG Invest.'!I$100","v":0},{"$f":"V23*W20","v":0},{"$f":"V23*X20","v":0},{"$f":"'App.2-FA Proposed REG Invest.'!J$100","v":0},{"$f":"Y23*Z20","v":0},{"$f":"Y23*AA20","v":0},{"$f":"'App.2-FA Proposed REG Invest.'!K$100","v":0},{"$f":"AB23*AC20","v":0},{"$f":"AB23*AD20","v":0}]
["WCA",7.4999999999999997E-2,null,null,{"$f":"(E22+E23)*$B$24","v":0},{"$f":"F23*$B$24","v":0},null,{"$f":"(H22+H23)*$B$24","v":0},{"$f":"I23*$B$24","v":0},null,{"$f":"(K22+K23)*$B$24","v":0},{"$f":"L23*$B$24","v":0},null,{"$f":"(N22+N23)*$B$24","v":0},{"$f":"O23*$B$24","v":0},null,{"$f":"(Q22+Q23)*$B$24","v":0},{"$f":"R23*$B$24","v":0},null,{"$f":"(T22+T23)*$B$24","v":0},{"$f":"U23*$B$24","v":0},null,{"$f":"(W22+W23)*$B$24","v":0},{"$f":"X23*$B$24","v":0},null,{"$f":"(Z22+Z23)*$B$24","v":0},{"$f":"AA23*$B$24","v":0},null,{"$f":"(AC22+AC23)*$B$24","v":0},{"$f":"AD23*$B$24","v":0}]
["Rate Base",null,null,null,{"$f":"SUM(E21+E24)","v":0},{"$f":"SUM(F21+F24)","v":0},null,{"$f":"SUM(H21+H24)","v":0},{"$f":"SUM(I21+I24)","v":0},null,{"$f":"SUM(K21+K24)","v":0},{"$f":"SUM(L21+L24)","v":0},null,{"$f":"SUM(N21+N24)","v":0},{"$f":"SUM(O21+O24)","v":0},null,{"$f":"SUM(Q21+Q24)","v":0},{"$f":"SUM(R21+R24)","v":0},null,{"$f":"SUM(T21+T24)","v":0},{"$f":"SUM(U21+U24)","v":0},null,{"$f":"SUM(W21+W24)","v":0},{"$f":"SUM(X21+X24)","v":0},null,{"$f":"SUM(Z21+Z24)","v":0},{"$f":"SUM(AA21+AA24)","v":0},null,{"$f":"SUM(AC21+AC24)","v":0},{"$f":"SUM(AD21+AD24)","v":0}]
[]
[]
["Deemed ST Debt",0.04,null,null,{"$f":"E25*$B$28","v":0},{"$f":"F25*$B$28","v":0},null,{"$f":"H25*$B$28","v":0},{"$f":"I25*$B$28","v":0},null,{"$f":"K25*$B$28","v":0},{"$f":"L25*$B$28","v":0},null,{"$f":"N25*$B$28","v":0},{"$f":"O25*$B$28","v":0},null,{"$f":"Q25*$B$28","v":0},{"$f":"R25*$B$28","v":0},null,{"$f":"T25*$B$28","v":0},{"$f":"U25*$B$28","v":0},null,{"$f":"W25*$B$28","v":0},{"$f":"X25*$B$28","v":0},null,{"$f":"Z25*$B$28","v":0},{"$f":"AA25*$B$28","v":0},null,{"$f":"AC25*$B$28","v":0},{"$f":"AD25*$B$28","v":0}]
["Deemed LT Debt",0.56000000000000005,null,null,{"$f":"E25*$B$29","v":0},{"$f":"F25*$B$29","v":0},null,{"$f":"H25*$B$29","v":0},{"$f":"I25*$B$29","v":0},null,{"$f":"K25*$B$29","v":0},{"$f":"L25*$B$29","v":0},null,{"$f":"N25*$B$29","v":0},{"$f":"O25*$B$29","v":0},null,{"$f":"Q25*$B$29","v":0},{"$f":"R25*$B$29","v":0},null,{"$f":"T25*$B$29","v":0},{"$f":"U25*$B$29","v":0},null,{"$f":"W25*$B$29","v":0},{"$f":"X25*$B$29","v":0},null,{"$f":"Z25*$B$29","v":0},{"$f":"AA25*$B$29","v":0},null,{"$f":"AC25*$B$29","v":0},{"$f":"AD25*$B$29","v":0}]
["Deemed Equity",0.4,null,null,{"$f":"E25*$B$30","v":0},{"$f":"F25*$B$30","v":0},null,{"$f":"H25*$B$30","v":0},{"$f":"I25*$B$30","v":0},null,{"$f":"K25*$B$30","v":0},{"$f":"L25*$B$30","v":0},null,{"$f":"N25*$B$30","v":0},{"$f":"O25*$B$30","v":0},null,{"$f":"Q25*$B$30","v":0},{"$f":"R25*$B$30","v":0},null,{"$f":"T25*$B$30","v":0},{"$f":"U25*$B$30","v":0},null,{"$f":"W25*$B$30","v":0},{"$f":"X25*$B$30","v":0},null,{"$f":"Z25*$B$30","v":0},{"$f":"AA25*$B$30","v":0},null,{"$f":"AC25*$B$30","v":0},{"$f":"AD25*$B$30","v":0}]
[]
["ST Interest",2.29E-2,null,null,{"$f":"E28*$B$32","v":0},{"$f":"F28*$B$32","v":0},null,{"$f":"H28*$B$32","v":0},{"$f":"I28*$B$32","v":0},null,{"$f":"K28*$B$32","v":0},{"$f":"L28*$B$32","v":0},null,{"$f":"N28*$B$32","v":0},{"$f":"O28*$B$32","v":0},null,{"$f":"Q28*$B$32","v":0},{"$f":"R28*$B$32","v":0},null,{"$f":"T28*$B$32","v":0},{"$f":"U28*$B$32","v":0},null,{"$f":"W28*$B$32","v":0},{"$f":"X28*$B$32","v":0},null,{"$f":"Z28*$B$32","v":0},{"$f":"AA28*$B$32","v":0},null,{"$f":"AC28*$B$32","v":0},{"$f":"AD28*$B$32","v":0}]
["LT Interest",4.1200000000000001E-2,null,null,{"$f":"E29*$B$33","v":0},{"$f":"F29*$B$33","v":0},null,{"$f":"H29*$B$33","v":0},{"$f":"I29*$B$33","v":0},null,{"$f":"K29*$B$33","v":0},{"$f":"L29*$B$33","v":0},null,{"$f":"N29*$B$33","v":0},{"$f":"O29*$B$33","v":0},null,{"$f":"Q29*$B$33","v":0},{"$f":"R29*$B$33","v":0},null,{"$f":"T29*$B$33","v":0},{"$f":"U29*$B$33","v":0},null,{"$f":"W29*$B$33","v":0},{"$f":"X29*$B$33","v":0},null,{"$f":"Z29*$B$33","v":0},{"$f":"AA29*$B$33","v":0},null,{"$f":"AC29*$B$33","v":0},{"$f":"AD29*$B$33","v":0}]
["ROE",0.09,null,null,{"$f":"E30*$B$34","v":0},{"$f":"F30*$B$34","v":0},null,{"$f":"H30*$B$34","v":0},{"$f":"I30*$B$34","v":0},null,{"$f":"K30*$B$34","v":0},{"$f":"L30*$B$34","v":0},null,{"$f":"N30*$B$34","v":0},{"$f":"O30*$B$34","v":0},null,{"$f":"Q30*$B$34","v":0},{"$f":"R30*$B$34","v":0},null,{"$f":"T30*$B$34","v":0},{"$f":"U30*$B$34","v":0},null,{"$f":"W30*$B$34","v":0},{"$f":"X30*$B$34","v":0},null,{"$f":"Z30*$B$34","v":0},{"$f":"AA30*$B$34","v":0},null,{"$f":"AC30*$B$34","v":0},{"$f":"AD30*$B$34","v":0}]
["Cost of Capital Total",null,null,null,{"$f":"SUM(E32:E34)","v":0},{"$f":"SUM(F32:F34)","v":0},null,{"$f":"SUM(H32:H34)","v":0},{"$f":"SUM(I32:I34)","v":0},null,{"$f":"SUM(K32:K34)","v":0},{"$f":"SUM(L32:L34)","v":0},null,{"$f":"SUM(N32:N34)","v":0},{"$f":"SUM(O32:O34)","v":0},null,{"$f":"SUM(Q32:Q34)","v":0},{"$f":"SUM(R32:R34)","v":0},null,{"$f":"SUM(T32:T34)","v":0},{"$f":"SUM(U32:U34)","v":0},null,{"$f":"SUM(W32:W34)","v":0},{"$f":"SUM(X32:X34)","v":0},null,{"$f":"SUM(Z32:Z34)","v":0},{"$f":"SUM(AA32:AA34)","v":0},null,{"$f":"SUM(AC32:AC34)","v":0},{"$f":"SUM(AD32:AD34)","v":0}]
[]
["OM&A",null,null,null,{"$f":"E22+E23","v":0},{"$f":"F23","v":0},null,{"$f":"H22+H23","v":0},{"$f":"I23","v":0},null,{"$f":"K22+K23","v":0},{"$f":"L23","v":0},null,{"$f":"N22+N23","v":0},{"$f":"O23","v":0},null,{"$f":"Q22+Q23","v":0},{"$f":"R23","v":0},null,{"$f":"T22+T23","v":0},{"$f":"U23","v":0},null,{"$f":"W22+W23","v":0},{"$f":"X23","v":0},null,{"$f":"Z22+Z23","v":0},{"$f":"AA23","v":0},null,{"$f":"AC22+AC23","v":0},{"$f":"AD23","v":0}]
["Amortization",null,null,{"$f":"D78","v":0},{"$f":"D38*E$20","v":0},{"$f":"D38*F$20","v":0},{"$f":"E78","v":0},{"$f":"G38*H$20","v":0},{"$f":"G38*I$20","v":0},{"$f":"F78","v":0},{"$f":"J38*K$20","v":0},{"$f":"J38*L$20","v":0},{"$f":"G78","v":0},{"$f":"M38*N$20","v":0},{"$f":"M38*O$20","v":0},{"$f":"H76+H77","v":0},{"$f":"P38*Q$20","v":0},{"$f":"P38*R$20","v":0},{"$f":"I76+I77","v":0},{"$f":"S38*T$20","v":0},{"$f":"S38*U$20","v":0},{"$f":"J76+J77","v":0},{"$f":"V38*W$20","v":0},{"$f":"V38*X$20","v":0},{"$f":"K76+K77","v":0},{"$f":"Y38*Z$20","v":0},{"$f":"Y38*AA$20","v":0},{"$f":"L76+L77","v":0},{"$f":"AB38*AC$20","v":0},{"$f":"AB38*AD$20","v":0}]
["Grossed-up PILs",null,null,null,{"$f":"E66","v":0},{"$f":"F66","v":0},null,{"$f":"H66","v":0},{"$f":"I66","v":0},null,{"$f":"K66","v":0},{"$f":"L66","v":0},null,{"$f":"N66","v":0},{"$f":"O66","v":0},null,{"$f":"Q66","v":0},{"$f":"R66","v":0},null,{"$f":"T66","v":0},{"$f":"U66","v":0},null,{"$f":"W66","v":0},{"$f":"X66","v":0},null,{"$f":"Z66","v":0},{"$f":"AA66","v":0},null,{"$f":"AC66","v":0},{"$f":"AD66","v":0}]
[]
["Revenue Requirement",null,null,null,{"$f":"SUM(E35:E39)","v":0},{"$f":"SUM(F35:F39)","v":0},null,{"$f":"SUM(H35:H39)","v":0},{"$f":"SUM(I35:I39)","v":0},null,{"$f":"SUM(K35:K39)","v":0},{"$f":"SUM(L35:L39)","v":0},null,{"$f":"SUM(N35:N39)","v":0},{"$f":"SUM(O35:O39)","v":0},null,{"$f":"SUM(Q35:Q39)","v":0},{"$f":"SUM(R35:R39)","v":0},null,{"$f":"SUM(T35:T39)","v":0},{"$f":"SUM(U35:U39)","v":0},null,{"$f":"SUM(W35:W39)","v":0},{"$f":"SUM(X35:X39)","v":0},null,{"$f":"SUM(Z35:Z39)","v":0},{"$f":"SUM(AA35:AA39)","v":0},null,{"$f":"SUM(AC35:AC39)","v":0},{"$f":"SUM(AD35:AD39)","v":0}]
[]
[]
["Provincial Rate Protection",null,null,null,null,{"$f":"F41","v":0},null,null,{"$f":"I41","v":0},null,null,{"$f":"L41","v":0},null,null,{"$f":"O41","v":0},null,null,{"$f":"R41","v":0},null,null,{"$f":"U41","v":0},null,null,{"$f":"X41","v":0},null,null,{"$f":"AA41","v":0},null,null,{"$f":"AD41","v":0}]
[]
["Monthly Amount Paid by IESO",null,null,null,null,{"$f":"F44/12","v":0},null,null,{"$f":"I44/12","v":0},null,null,{"$f":"L44/12","v":0},null,null,{"$f":"O44/12","v":0},null,null,{"$f":"R44/12","v":0},null,null,{"$f":"U44/12","v":0},null,null,{"$f":"X44/12","v":0},null,null,{"$f":"AA44/12","v":0},null,null,{"$f":"AD44/12","v":0}]
[]
["Note 1: The difference between the actual costs of approved eligible investments and revenue received from the IESO should be recorded in a variance account.  The Board may provide "]
["regulatory accounting guidance regarding a variance account either in an individual proceeding or on a generic basis."]
["Note 2: For the 2016 Test Year, Costs and Revenues of the Direct Benefit are to be included in the test year applicant Rate Base and Revenues."]
[]
["PILs Calculation"]
[null,null,null,null,{"$f":"D18","v":2014},null,null,{"$f":"G18","v":2015},null,null,{"$f":"J18","v":2016},null,null,{"$f":"M18","v":2017},null,null,{"$f":"P18","v":"2018 Test Year"},null,null,{"$f":"S18","v":2019},null,null,{"$f":"V18","v":2020},null,null,{"$f":"Y18","v":2021},null,null,{"$f":"AB18","v":2022}]
["Income Tax",null,null,null,"Direct Benefit","Provincial",null,"Direct Benefit","Provincial",null,"Direct Benefit","Provincial",null,"Direct Benefit","Provincial",null,"Direct Benefit","Provincial",null,"Direct Benefit","Provincial",null,"Direct Benefit","Provincial",null,"Direct Benefit","Provincial",null,"Direct Benefit","Provincial"]
[null,null,null,null,null,null,null,null,null,null,null,null,null,null,null,null,null,null,null,null,null,"Total",null,null,"Total",null,null,"Total"]
["Net Income - ROE on Rate Base",null,null,null,{"$f":"E34","v":0},{"$f":"F34","v":0},null,{"$f":"H34","v":0},{"$f":"I34","v":0},null,{"$f":"K34","v":0},{"$f":"L34","v":0},null,{"$f":"N34","v":0},{"$f":"O34","v":0},null,{"$f":"Q34","v":0},{"$f":"R34","v":0},null,{"$f":"T34","v":0},{"$f":"U34","v":0},null,{"$f":"W34","v":0},{"$f":"X34","v":0},null,{"$f":"Z34","v":0},{"$f":"AA34","v":0},null,{"$f":"AC34","v":0},{"$f":"AD34","v":0}]
["Amortization (17% DB and 83% P)",null,null,null,{"$f":"E38","v":0},{"$f":"F38","v":0},null,{"$f":"H38","v":0},{"$f":"I38","v":0},null,{"$f":"K38","v":0},{"$f":"L38","v":0},null,{"$f":"N38","v":0},{"$f":"O38","v":0},null,{"$f":"Q38","v":0},{"$f":"R38","v":0},null,{"$f":"T38","v":0},{"$f":"U38","v":0},null,{"$f":"W38","v":0},{"$f":"X38","v":0},null,{"$f":"Z38","v":0},{"$f":"AA38","v":0},null,{"$f":"AC38","v":0},{"$f":"AD38","v":0}]
["CCA (17% DB and 83% P)",null,null,null,{"$f":"-D94*E$20","v":0},{"$f":"-D94*F$20","v":0},null,{"$f":"-E94*H$20","v":0},{"$f":"-E94*I$20","v":0},null,{"$f":"-F94*K$20","v":0},{"$f":"-F94*L$20","v":0},null,{"$f":"-G94*N$20","v":0},{"$f":"-G94*O$20","v":0},null,{"$f":"-H94*Q$20","v":0},{"$f":"-H94*R$20","v":0},null,{"$f":"-I94*T$20","v":0},{"$f":"-I94*U$20","v":0},null,{"$f":"-J94*W$20","v":0},{"$f":"-J94*X$20","v":0},null,{"$f":"-K94*Z$20","v":0},{"$f":"-K94*AA$20","v":0},null,{"$f":"-L94*AC$20","v":0},{"$f":"-L94*AD$20","v":0}]
["Taxable income",null,null,null,{"$f":"SUM(E56:E58)","v":0},{"$f":"SUM(F56:F58)","v":0},null,{"$f":"SUM(H56:H58)","v":0},{"$f":"SUM(I56:I58)","v":0},null,{"$f":"SUM(K56:K58)","v":0},{"$f":"SUM(L56:L58)","v":0},null,{"$f":"SUM(N56:N58)","v":0},{"$f":"SUM(O56:O58)","v":0},null,{"$f":"SUM(Q56:Q58)","v":0},{"$f":"SUM(R56:R58)","v":0},null,{"$f":"SUM(T56:T58)","v":0},{"$f":"SUM(U56:U58)","v":0},null,{"$f":"SUM(W56:W58)","v":0},{"$f":"SUM(X56:X58)","v":0},null,{"$f":"SUM(Z56:Z58)","v":0},{"$f":"SUM(AA56:AA58)","v":0},null,{"$f":"SUM(AC56:AC58)","v":0},{"$f":"SUM(AD56:AD58)","v":0}]
[]
["Tax Rate  (to be entered)"]
[]
["Income Taxes Payable",null,null,null,{"$f":"E59*E61","v":0},{"$f":"F59*F61","v":0},null,{"$f":"H59*H61","v":0},{"$f":"I59*I61","v":0},null,{"$f":"K59*K61","v":0},{"$f":"L59*L61","v":0},null,{"$f":"N59*N61","v":0},{"$f":"O59*O61","v":0},null,{"$f":"Q59*Q61","v":0},{"$f":"R59*R61","v":0},null,{"$f":"T59*T61","v":0},{"$f":"U59*U61","v":0},null,{"$f":"W59*W61","v":0},{"$f":"X59*X61","v":0},null,{"$f":"Z59*Z61","v":0},{"$f":"AA59*AA61","v":0},null,{"$f":"AC59*AC61","v":0},{"$f":"AD59*AD61","v":0}]
["Gross Up"]
["Income Taxes Payable",null,null,null,{"$f":"E63/(1-E61)","v":0},{"$f":"F63/(1-F61)","v":0},null,{"$f":"H63/(1-H61)","v":0},{"$f":"I63/(1-I61)","v":0},null,{"$f":"K63/(1-K61)","v":0},{"$f":"L63/(1-L61)","v":0},null,{"$f":"N63/(1-N61)","v":0},{"$f":"O63/(1-O61)","v":0},null,{"$f":"Q63/(1-Q61)","v":0},{"$f":"R63/(1-R61)","v":0},null,{"$f":"T63/(1-T61)","v":0},{"$f":"U63/(1-U61)","v":0},null,{"$f":"W63/(1-W61)","v":0},{"$f":"X63/(1-X61)","v":0},null,{"$f":"Z63/(1-Z61)","v":0},{"$f":"AA63/(1-AA61)","v":0},null,{"$f":"AC63/(1-AC61)","v":0},{"$f":"AD63/(1-AD61)","v":0}]
["Grossed Up PILs",null,null,null,{"$f":"SUM(E65:E65)","v":0},{"$f":"SUM(F65:F65)","v":0},null,{"$f":"SUM(H65:H65)","v":0},{"$f":"SUM(I65:I65)","v":0},null,{"$f":"SUM(K65:K65)","v":0},{"$f":"SUM(L65:L65)","v":0},null,{"$f":"SUM(N65:N65)","v":0},{"$f":"SUM(O65:O65)","v":0},null,{"$f":"SUM(Q65:Q65)","v":0},{"$f":"SUM(R65:R65)","v":0},null,{"$f":"SUM(T65:T65)","v":0},{"$f":"SUM(U65:U65)","v":0},null,{"$f":"SUM(W65:W65)","v":0},{"$f":"SUM(X65:X65)","v":0},null,{"$f":"SUM(Z65:Z65)","v":0},{"$f":"SUM(AA65:AA65)","v":0},null,{"$f":"SUM(AC65:AC65)","v":0},{"$f":"SUM(AD65:AD65)","v":0}]
[]
[]
["Net Fixed Assets",null,null,2011,2012,2013,2014,2015,2016,2017,2018,2019]
[null,"Enter applicable amortization in years:",25]
["Opening Gross Fixed Assets",null,null,null,{"$f":"D73","v":0},0,0,0,0,0,0,0]
["Gross Capital Additions",null,null,{"$f":"'App.2-FA Proposed REG Invest.'!C99","v":0},{"$f":"'App.2-FA Proposed REG Invest.'!D99","v":0},{"$f":"'App.2-FA Proposed REG Invest.'!E99","v":0},{"$f":"'App.2-FA Proposed REG Invest.'!F99","v":0},{"$f":"'App.2-FA Proposed REG Invest.'!G99","v":0},{"$f":"'App.2-FA Proposed REG Invest.'!H99","v":0},{"$f":"'App.2-FA Proposed REG Invest.'!I99","v":0},{"$f":"'App.2-FA Proposed REG Invest.'!J99","v":0},{"$f":"'App.2-FA Proposed REG Invest.'!K99","v":0}]
["Closing Gross Fixed Assets",null,null,{"$f":"SUM(D71:D72)","v":0},0,0,0,0,0,0,0,0]
[]
["Opening Accumulated Amortization",null,null,null,{"$f":"+D78","v":0},{"$f":"E78","v":0},0,{"$f":"G78","v":0},{"$f":"H78","v":0},{"$f":"I78","v":0},{"$f":"J78","v":0},{"$f":"K78","v":0}]
["Current Year Amortization (before additions)",null,null,null,{"$f":"IF(ISERROR(E71/$C$70), 0, E71/$C$70)","v":0},0,0,{"$f":"H71/$C$70","v":0},{"$f":"I71/$C$70","v":0},{"$f":"J71/$C$70","v":0},{"$f":"K71/$C$70","v":0},{"$f":"L71/$C$70","v":0}]
["Additions (half year)",null,null,{"$f":"D72/C70/2","v":0},{"$f":"E72/C70/2","v":0},{"$f":"F72/C70/2","v":0},{"$f":"G72/C70/2","v":0},{"$f":"H72/C70/2","v":0},{"$f":"I72/C70/2","v":0},{"$f":"J72/C70/2","v":0},{"$f":"K72/C70/2","v":0},{"$f":"L72/C70/2","v":0}]
["Closing Accumulated Amortization",null,null,{"$f":"SUM(D75+D77)","v":0},{"$f":"SUM(E75:E77)","v":0},0,0,0,0,0,0,0]
[]
["Opening Net Fixed Assets",null,null,{"$f":"D71-D75","v":0},{"$f":"E71-E75","v":0},{"$f":"F71-F75","v":0},{"$f":"G71-G75","v":0},{"$f":"G81","v":0},{"$f":"H81","v":0},{"$f":"I81","v":0},{"$f":"J81","v":0},{"$f":"K81","v":0}]
["Closing Net Fixed Assets",null,null,{"$f":"D73-D78","v":0},0,0,0,0,0,0,0,0]
["Average Net Fixed Assets",null,null,{"$f":"SUM(D80:D81)/2","v":0},0,0,0,0,0,0,0,0]
[]
["UCC for PILs Calculation"]
[null,null,null,2014,2014,2014,2014,2015,2016,2017,2018,2019]
[]
["Opening UCC",null,null,null,{"$f":"D95","v":0},0,0,0,0,0,0,0]
["Capital Additions (from Appendix 2-FA)",null,null,{"$f":"D72","v":0},0,0,0,0,0,0,0,0]
["UCC Before Half Year Rule",null,null,{"$f":"SUM(D87:D88)","v":0},0,0,0,0,0,0,0,0]
["Half Year Rule (1/2 Additions - Disposals)",null,null,{"$f":"D88/2","v":0},0,0,0,0,0,0,0,0]
["Reduced UCC",null,null,{"$f":"D89-D90","v":0},0,0,0,0,0,0,0,0]
["CCA Rate Class (to be entered)",null,47,{"$f":"$C$92","v":47},{"$f":"$C$92","v":47},47,47,47,47,47,47,47]
["CCA Rate  (to be entered)",null,0.08,{"$f":"$C$93","v":0.08},{"$f":"$C$93","v":0.08},0.08,0.08,0.08,0.08,0.08,0.08,0.08]
["CCA",null,null,{"$f":"D91*D$93","v":0},{"$f":"E91*E$93","v":0},{"$f":"F91*F$93","v":0},{"$f":"G91*G$93","v":0},{"$f":"H91*H$93","v":0},0,0,0,0]
["Closing UCC",null,null,{"$f":"D89-D94","v":0},0,0,0,0,0,0,0,0]

{"sheet":"App.2-G SQI","index":19,"n_rows":40,"n_cols":19,"rows_kept":40,"cut":false,"hidden":false,"merged":[[39,4,39,5],[29,0,29,3],[30,0,30,3],[34,0,34,3],[32,0,32,3],[36,0,36,3],[37,0,37,3],[38,0,38,3],[35,0,35,3],[31,0,31,3],[33,0,33,3],[39,0,39,3],[32,4,32,5],[36,4,36,5],[37,4,37,5],[38,4,38,5],[35,4,35,5],[28,4,28,5],[29,4,29,5],[30,4,30,5],[34,4,34,5],[31,4,31,5],[33,4,33,5],[28,0,28,3],[20,11,20,14],[21,11,21,14],[19,0,19,15],[20,1,20,4],[20,6,20,9],[23,0,23,10],[24,0,24,10],[26,0,26,10],[21,1,21,4],[21,6,21,9],[14,7,14,12],[14,13,14,18],[0,14,0,15],[8,0,8,15],[9,0,9,15],[10,0,10,15],[12,0,12,15],[14,0,15,0],[14,1,14,6]]}
[null,null,null,null,null,null,null,null,null,null,null,null,"File Number:",null,{"$f":"EBNUMBER","v":"EB-2017-0071"}]
[null,null,null,null,null,null,null,null,null,null,null,null,"Exhibit:",null,2]
[null,null,null,null,null,null,null,null,null,null,null,null,"Tab:"]
[null,null,null,null,null,null,null,null,null,null,null,null,"Schedule:"]
[null,null,null,null,null,null,null,null,null,null,null,null,"Page:",null,"Page 76 or Appendix 9"]
[]
[null,null,null,null,null,null,null,null,null,null,null,null,"Date:",null,"2018-03-29"]
[]
["Appendix 2-G"]
["Service Reliability and Quality Indicators"]
["2012 - 2017"]
[]
["Service Reliability"]
[]
["Index","Including outages caused by loss of supply",null,null,null,null,null,"Excluding outages caused by loss of supply",null,null,null,null,null,"Excluding Major Event Days"]
[null,{"$f":"TestYear-6","v":2012},{"$f":"TestYear-5","v":2013},{"$f":"TestYear-4","v":2014},{"$f":"TestYear-3","v":2015},{"$f":"TestYear-2","v":2016},2017,{"$f":"B16","v":2012},{"$f":"C16","v":2013},{"$f":"D16","v":2014},{"$f":"E16","v":2015},{"$f":"F16","v":2016},2017,{"$f":"H16","v":2012},2013,2014,2015,{"$f":"L16","v":2016},{"$f":"M16","v":2017}]
["SAIDI ",1.65,2.65,1.19,3.35,2.5299999999999998,1.96,1.65,2.48,1.19,3.35,2.46,1.96,1.65,1.42,1.19,1.37,1.49,1.43]
["SAIFI",2.17,3.53,1.21,1.84,2.21,1.61,2.17,2.67,1.21,1.84,2.11,1.61,2.17,1.78,1.21,1.03,1.41,1.21]
[]
["5 Year Historical Average"]
["SAIDI ",null,null,null,null,{"$f":"IF(ISERROR(AVERAGE(B17:F17)), \"\", AVERAGE(B17:F17))","v":2.274},null,null,null,null,{"$f":"IF(ISERROR(AVERAGE(H17:L17)), \"\", AVERAGE(H17:L17))","v":2.226},null,null,null,null,{"$f":"IF(ISERROR(AVERAGE(N17:R17)), \"\", AVERAGE(N17:R17))","v":1.4239999999999999}]
["SAIFI",null,null,null,null,{"$f":"IF(ISERROR(AVERAGE(B18:F18)), \"\", AVERAGE(B18:F18))","v":2.1920000000000002},null,null,null,null,{"$f":"IF(ISERROR(AVERAGE(H18:L18)), \"\", AVERAGE(H18:L18))","v":2},null,null,null,null,{"$f":"IF(ISERROR(AVERAGE(N18:R18)), \"\", AVERAGE(N18:R18))","v":1.52}]
[]
["SAIDI = System Average Interruption Duration Index"]
["SAIFI = System Average Interruption Frequency Index "]
[]
["Service Quality"]
[]
["Indicator",null,null,null,"OEB Minimum Standard",null,{"$f":"B16","v":2012},{"$f":"C16","v":2013},{"$f":"D16","v":2014},{"$f":"E16","v":2015},{"$f":"F16","v":2016},2017]
["Low Voltage Connections",null,null,null,0.9,null,0.95799999999999996,0.96499999999999997,0.93,0.97199999999999998,0.98899999999999999,0.9667]
["High Voltage Connections",null,null,null,0.9,null,0.95799999999999996,1,1,0.98299999999999998,1,1]
["Appointment Scheduling",null,null,null,0.9,null,0.98499999999999999,0.97599999999999998,0.86699999999999999,0.92,0.98499999999999999,0.91069999999999995]
["Appointments Met",null,null,null,0.9,null,0.98399999999999999,0.97099999999999997,0.95399999999999996,0.97399999999999998,0.98299999999999998,0.97619999999999996]
["Rescheduling a Missed Appointment",null,null,null,1,null,1,1,0.96,0.6,1,1]
["Telephone Accessibility",null,null,null,0.65,null,0.746,0.80900000000000005,0.81899999999999995,0.82299999999999995,0.81299999999999994,0.79879999999999995]
["Telephone Call Abandon Rate",null,null,null,0.1,null,3.6999999999999998E-2,2.1000000000000001E-2,1.7999999999999999E-2,1.6E-2,1.4999999999999999E-2,3.0700000000000002E-2]
["Written Response to Enquires",null,null,null,0.8,null,0.97599999999999998,0.98499999999999999,0.98399999999999999,0.97299999999999998,0.99199999999999999,0.99280000000000002]
["Emergency Urban Response",null,null,null,0.8,null,0.83799999999999997,0.95599999999999996,0.875,0.98399999999999999,0.89800000000000002,0.8659]
["Emergency Rural Response",null,null,null,0.8,null,0,0,0,0,0,0]
["Reconnection Performance Standard",null,null,null,0.85,null,0.97699999999999998,1,1,1,1,0.99719999999999998]

{"sheet":"App.2-H_Other_Oper_Rev","index":20,"n_rows":65,"n_cols":9,"rows_kept":65,"cut":false,"hidden":false,"merged":[[70,1,70,7],[68,1,68,7],[69,1,69,7],[54,0,54,1],[47,0,48,7],[53,0,53,1],[59,0,59,1],[55,0,55,1],[56,0,56,1],[57,0,57,1],[58,0,58,1],[64,1,64,7],[44,0,44,7],[31,0,31,1],[32,0,32,1],[8,0,8,7],[9,0,9,7],[30,0,30,1],[39,2,39,7],[40,2,41,7],[33,0,33,1],[34,0,34,1],[37,0,37,1],[38,0,38,1],[39,0,39,1],[40,0,40,1]]}
[null,null,null,null,null,null,"File Number:",{"$f":"EBNUMBER","v":"EB-2017-0071"}]
[null,null,null,null,null,null,"Exhibit:",3]
[null,null,null,null,null,null,"Tab:"]
[null,null,null,null,null,null,"Schedule:"]
[null,null,null,null,null,null,"Page:",39]
[]
[null,null,null,null,null,null,"Date:","2018-03-29"]
[]
["Appendix 2-H"]
["Other Operating Revenue"]
[]
["USoA #","USoA Description",{"$f":"C13&\" Actual\"&CHAR(178)","v":"2013 Actual²"},{"$f":"D13&\" Actual\"&CHAR(178)","v":"2014 Actual²"},{"$f":"E13 & \" Actual\" & CHAR(178)","v":"2015 Actual²"},{"$f":"F13 & \" Actual\" & CHAR(178)","v":"2016 Actual²"},"2017 Actual","Test Year","Revised Test Year"]
[null,null,{"$f":"D13-1","v":2013},{"$f":"E13-1","v":2014},{"$f":"F13-1","v":2015},{"$f":"G13-1","v":2016},{"$f":"BridgeYear","v":2017},{"$f":"TestYear","v":2018},{"$f":"TestYear","v":2018}]
[null,"Reporting Basis","CGAAP","MIFRS","MIFRS","MIFRS","MIFRS","MIFRS","MIFRS"]
["4080-2","SSS Revenue",119697,119614,121349,118839,127859,105000,121000]
[4082,"Retail Services Revenue",29639,28305,27321,23850,18458,23500,23500]
[4084,"STR Revenues",470,408,360,275,126,300,300]
[4210,"Rent from Electric Property",2662462,1609979,1628387,1731777,1708952,1719261,2093714]
[4225,"Late Payment Charges",245293,270758,246557,177225,244224,259000,259000]
[4235,"Miscellaneous Service Revenues",247215,238812,291424,316019,218201,170100,170100]
[4245,"Government & Other Assistance",0,{"$f":"'App.2-BA_Fixed Asset Cont'!J199","v":13072},{"$f":"+'App.2-BA_Fixed Asset Cont'!J267","v":31829},{"$f":"+'App.2-BA_Fixed Asset Cont'!J335","v":43142},{"$f":"+'App.2-BA_Fixed Asset Cont'!J403","v":62979},{"$f":"+'App.2-BA_Fixed Asset Cont'!J471","v":79297},{"$f":"+H21","v":79297}]
[4305,"Regulatory Debits",43830,0,0,0,0,0,0]
[4325,"Revenues from Merchandise",213339,83547,80941,229685,111201,80000,100000]
[4330,"Costs & Expenses of Merchandising ",-7548,-8212,-12050,-2507,-18760,-7500,-7500]
[4360,"Loss on Disposition of Utility and Other Property",-110632,0,0,0,0,0,0]
[4375,"Revenues of Non-Utility Operations",1381145,1779725,1110897,766822,1822767,1537447,1537447]
[4380,"Expenses of Non-Utility Operations",-1381145,-1958374,-858672,-762273,-1822767,-1537447,-1537447]
[4390,"Miscellaneous Non-Operating Income",46721,21014,35229,19338,25859,20000,20000]
[4405,"Interest and Dividend Income",41984,7555,26460,33313,22622,20000,20000]
[]
["Specific Service Charges",null,{"$f":"+C20","v":247215},{"$f":"+D20","v":238812},291424,316019,218201,170100,{"$f":"+I20","v":170100}]
["Late Payment Charges",null,{"$f":"+C19","v":245293},{"$f":"+D19","v":270758},246557,177225,244224,259000,{"$f":"+I19","v":259000}]
["Other Operating Revenues",null,{"$f":"+C16+C17+C18+C15","v":2812268},{"$f":"+D16+D17+D18+D15","v":1758306},1777417,1874741,1855395,1848061,{"$f":"+I16+I17+I18+I15","v":2238514}]
["Other Income or Deductions",null,{"$f":"SUM(C22:C29)","v":227694},{"$f":"SUM(D22:D29)","v":-74745},382805,284378,140922,112500,{"$f":"SUM(I22:I29)","v":132500}]
["Total",null,{"$f":"SUM(C31:C34)","v":3532470},2193131,2698203,2652363,2458742,2389661,{"$f":"SUM(I31:I34)","v":2800114}]
[]
["Description",null,"Account(s)"]
["Specific Service Charges:",null,4235]
["Late Payment Charges:",null,4225]
["Other Distribution Revenues:",null,"4080, 4082, 4084, 4090, 4205, 4210, 4215, 4220, 4240, 4245"]
["Other Income and Expenses:",null,"4305, 4310, 4315, 4320, 4325, 4330, 4335, 4340, 4345, 4350, 4355, 4360, 4365, 4370, 4375, 4380, 4385, 4390, 4395, 4398, 4405, 4415"]
[]
[]
["Note: Add all applicable accounts listed above to the table and include all relevant information."]
[]
["Account Breakdown Details"]
[]
["For each \"Other Operating Revenue\" and \"Other Income or Deductions\" Account, a detailed breakdown of the account components is required.  See the example below for Account 4405, Interest and Dividend Income."]
[]
[]
["Account 4405 - Interest and Dividend Income"]
[null,null,{"$f":"C12","v":"2013 Actual²"},"2014 Actual²","2015 Actual²","2016 Actual²","2017 Actual","Test Year"]
[null,null,null,null,null,{"$f":"F13","v":2016},{"$f":"G13","v":2017},{"$f":"H13","v":2018}]
["Reporting Basis",null,{"$f":"IF(C14=0, \"\", C14)","v":"CGAAP"},"MIFRS","MIFRS","MIFRS","MIFRS","MIFRS"]
["Short-term Investment Interest"]
["Bank Deposit Interest"]
["Miscellaneous Interest Revenue",null,-41984,-7555,-26460,-33313,-20500,-20000]
["etc.1"]
[]
["Total",null,{"$f":"SUM(C55:C59)","v":-41984},-7555,-26460,-33313,-20500,-20000]
[]
[]
["Notes:"]
[1,"List and specify any other interest revenue."]
[2,"In the transition year to IFRS, the applicant is to present information in both MIFRS and CGAAP.  For the typical applicant that adopted IFRS on January 1, 2015, 2014 must be presented in both a CGAAP and MIFRS basis."]

{"sheet":"App_2-I LF_CDM","index":21,"n_rows":98,"n_cols":14,"rows_kept":98,"cut":false,"hidden":false,"merged":[[97,0,97,7],[50,0,50,5],[52,0,52,4],[55,0,55,1],[63,0,63,1],[67,0,67,7],[19,0,19,7],[21,0,21,7],[22,0,22,7],[17,0,17,5],[8,0,8,7],[9,0,9,7],[11,0,11,7],[13,0,13,7],[15,0,15,7],[24,0,24,7],[32,0,32,7],[84,0,84,7],[65,0,65,7],[74,0,74,7],[76,0,76,7],[78,0,78,7],[80,0,80,7],[82,0,82,7],[40,6,40,7],[42,0,42,7],[44,0,44,7],[46,0,46,7],[48,0,48,7],[69,0,69,5]]}
[null,null,null,null,null,null,"File Number:",{"$f":"EBNUMBER","v":"EB-2017-0071"}]
[null,null,null,null,null,null,"Exhibit:",3]
[null,null,null,null,null,null,"Tab:"]
[null,null,null,null,null,null,"Schedule:"]
[null,null,null,null,null,null,"Page:","Appendix 2"]
[]
[null,null,null,null,null,null,"Date:","2018-03-29"]
[]
["Appendix 2-I"]
["Load Forecast CDM Adjustment Work Form (2018)"]
[]
["Appendix 2-I was initially developed to help determine what would be the amount of CDM savings needed in each year to cumulatively achieve the four year 2011-2014 CDM target.  This then determined the amount of kWh (and with translation, kW of demand) savings that were converted into dollar balances for the LRAMVA, and also to determine the related adjustment to the load forecast to account for OPA-reported savings.  Beginning in the 2015 year, it has been adjusted because the persistence of 2011-2014 CDM programs will be an adjustment to the load forecast in addition to the estimated savings for the first year (2015) for the new 2015-2020 CDM plan."]
[]
["2018 is the fourth year of the six-year (2015-2020) Conservation First program. Final results for the 2011-14 program were issued in the fall of 2015, and the program is completed, although in some instances disposition of the amounts has been deferred. For the purposes of the 2015-2020 LRAMVA, and the impact of CDM on the load forecast, CDM programs in 2014 and earlier are implicit in the historical data on which the base load forecast is developed. Only actual and forecasted impacts of 2015 to 2018 CDM programs need to be reflected in the manual load forecast adjustment and for the LRAMVA threshold amount in 2018 and carrying forward, although the full year impact of 2015 CDM programs and half-year impact of 2016 CDM programs on 2016 historical data is also assumed to be reflected in the base load forecast. "]
[]
["The new six year (2015-2020) CDM program works in a slightly different manner to the previous 2011-2014 CDM program. Distributors will offer programs each year that, over the six years (from January 1, 2015 to December 31, 2020) will strive to achieve savings equal to the new six year CDM target with the full target in place (i.e., persisting) on December 31, 2020. In other words, distributors will be able to offer and execute programs on a basis so that, as long as savings equal to the full target are in place at the end the period, the distributor's 2015-2020 CDM target will have been met."]
[]
["2015-2020 CDM Program - 2018 fourth year of the current CDM plan"]
[]
["For the first year of the new 2015-2020 CDM plan, it is assumed that each year's program will achieve an equal amount of new CDM savings.  This results in each year's program being about 1/6 (16.67%) of the cumulative 2015-2020 CDM target for kWh savings.  A distributor may propose an alternative approach but would be expected to document in its application why it believes that its proposal is more reasonable.  In its proposal, the distributor should ensure that the sum of the results for each year's CDM program from 2015 to 2020 add up to its 2015-2020 CDM target as established by the IESO."]
[]
["6 Year (2015-2020) kWh Target:"]
[26410000]
[null,2015,2016,2017,2018,2019,2020,"Total"]
["%"]
["2015 CDM Programs",null,null,null,null,null,{"$f":"G34/G40","v":0.19679447179098827},{"$f":"H34/H40","v":0.19679447179098827}]
["2016 CDM Programs",null,null,null,null,null,{"$f":"G35/G40","v":0.3329485043544112},{"$f":"H35/H40","v":0.3329485043544112}]
["2017 CDM Programs",null,null,null,null,null,{"$f":"G36/$H$40","v":0.12746505917860884},{"$f":"H36/H40","v":0.12746505917860884}]
["2018 CDM Programs",null,null,null,null,null,0.14820136312003029,{"$f":"H37/H40","v":0.14820136312003029}]
["2019 CDM Programs",null,null,null,null,null,9.7295300777980667E-2,{"$f":"H38/H40","v":9.7295300777980667E-2}]
["2020 CDM Programs",null,null,null,null,null,{"$f":"G39/$H$40","v":9.7295300777980667E-2},{"$f":"H39/H40","v":9.7295300777980667E-2}]
["Total in Year",{"$f":"SUM(B26:B31)","v":0},{"$f":"SUM(C26:C31)","v":0},{"$f":"SUM(D26:D31)","v":0},{"$f":"SUM(E26:E29)","v":0},{"$f":"SUM(F26:F30)","v":0},{"$f":"SUM(G26:G31)","v":0.99999999999999989},{"$f":"SUM(H26:H31)","v":0.99999999999999989}]
["kWh"]
[{"$f":"A26","v":"2015 CDM Programs"},5400747,5259083,5227909,5222016,5211179,5197342,{"$f":"G34","v":5197342}]
["2016 CDM Programs",null,8818120,8793170,8793170,8793170,8793170,8793170,null,null,2011,2012,2013,2014]
["2017 CDM Programs",null,null,3375904,3366352.2129070596,3366352.2129070596,3366352.2129070596,3366352.2129070596,null,"2011 CDM Programs",{"$f":"50%","v":0.5},1,1,1]
["2018 CDM Programs",null,null,null,3913998,3913998,3913998,3913998,null,"2012 CDM Programs",null,0.5,1,1]
["2019 CDM Programs",null,null,null,null,2569568.8935464695,2569568.8935464695,2569568.8935464695,null,"2013 CDM Programs",null,null,0.5,1]
["2020 CDM Programs",null,null,null,null,null,2569568.8935464695,2569568.8935464695,null,"2014 CDM Programs",null,null,null,0.5]
["Total in Year",{"$f":"SUM(B34:B39)","v":5400747},{"$f":"SUM(C34:C39)","v":14077203},17396983,{"$f":"SUM(E34:E37)","v":21295536.212907061},{"$f":"SUM(F34:F38)","v":23854268.10645353},{"$f":"SUM(G34:G39)","v":26410000},{"$f":"A23","v":26410000}]
[null,null,null,null,null,null,{"$f":"IF(G40-H40<>0,\"Inputs do no match 2015-20 CDM target\",\"\")","v":""}]
[]
["Note: The default formulae in the above table assume that the 2015-2020 kWh CDM target is achieved through persistence of CDM savings to the end of 2020. The distributor should enter measured CDM savings for 2015, and persistence of 2015 programs for 2016-2020 in row 34. When available, (preliminary/final) CDM savings for 2016 can be entered into row 35. The distributor can also input estimates or forecasts of the 2017 CDM programs if it believes that these are more realistic and can be supported; such information would typically be derived from the CDM plans that the distributor has filed with the IESO. Similarly, CDM savings and persistence into future years can be estimated for 2018, 2019 and 2020 CDM programs. However, the distributor will have to support its proposals for estimated or forecasted savings, particularly beyond the 2017 bridge year. The sum of persistent savings to the end of 2020, should equal the target entered into cell A23."]
[]
["Determination of 2018 Load Forecast Adjustment"]
[]
["The Board determined that the \"net\" number should be used in its Decision and Order with respect to Centre Wellington Hydro Ltd.'s 2013 Cost of Service rates (EB-2012-0113).  This approach has also been used in Settlement Agreements accepted by the Board in other 2013 and 2014 applications.  The distributor should select whether the adjustment is done on a \"net\" or \"gross\" basis, but must support a proposal for the adjustment being done on a \"gross\" basis.  Sheet 2-I defaults to the adjustment being done on a \"net\" basis consistent with Board policy and practice."]
[]
["From each of the 2006-2010 CDM Final Report,  and the 2011 to 2016 CDM Final Reports, issued by the OPA/IESO for the distributor, the distributor should input the \"gross\" and \"net\" results of the cumulative CDM savings for 2018 into cells C57 to C63 and D57 to D63.  The model will calculate the cumulative savings for all programs from 2006 to 2016 and determine the \"net\" to \"gross\" factor \"g\"."]
[]
["Net-to-Gross Conversion"]
[]
["Is CDM adjustment being done on a \"net\" or \"gross\" basis?",null,null,null,null,"net"]
[]
[null,null,"\"Gross\"","\"Net\"","Difference","\"Net-to-Gross\" Conversion Factor"]
["Persistence of Historical CDM programs to 2015",null,"kWh","kWh","kWh","('g')"]
["2006-2010 CDM programs",null,null,null,{"$f":"IF(ISBLANK(D57),\"\",C57-D57)","v":""},{"$f":"IF(D57=\"\",0,D57/C57)","v":0}]
["2011 CDM program",null,null,null,"",{"$f":"IF(D58=\"\",0,D58/C58)","v":0}]
["2012 CDM program",null,null,null,"",0]
["2013 CDM program",null,null,null,"",0]
["2014 CDM program",null,null,null,"",0]
["2015 CDM program",null,null,null,"",0]
["2016 CDM program",null,null,null,"",0]
["2006 to 2016 OPA CDM programs:  Persistence to 2018.",null,{"$f":"SUM(C57:C63)","v":0},{"$f":"SUM(D57:D63)","v":0},{"$f":"C64-D64","v":0},{"$f":"IF(D64=0,0,IF(F53=\"net\",0,E64/D64))","v":0}]
[]
["The default values below represent the factor used for how each year's CDM program is factored into the manual CDM adjustment.  Distributors can choose alternative weights of \"0\", \"0.5\" or \"1\" from the drop-down menu for each cell, but must support its alternatives."]
[]
["These factors do not mean that CDM programs are excluded, but the assumption that impacts of previous year CDM programs are already implicitly reflected in the actual data for historical years that are used to derive the load forecast prior to any manual CDM adjustment for the 2018 test year."]
[]
["Weight Factor for Inclusion in CDM Adjustment to 2018 Load Forecast"]
[null,2015,2016,2017,2018,2019,2020]
["Weight Factor for each year's CDM program impact on 2018 load forecast",0,null,1,0.5,0,0,"Distributor can select \"0\", \"0.5\", or \"1\" from drop-down list"]
["Default Value selection rationale.  ","Full year impact of 2015 CDM is assumed to be reflected in the base forecast, as the full year persistence of 2015 CDM programs is in the 2016 historical actual data. No further impact is necessary for the manual adjustment to the load forecast.","Default is 0.5, but one option is for full year impact of persistence of 2016 CDM programs on 2018 load forecast, but 50% impact in base forecast (first year impact of 2016 CDM programs on 2016 actuals, which is part of the data underlying the base load forecast).","Full year impact of persistence of 2017 programs on 2018 load forecast.  2017 CDM program impacts are not in the base forecast.","Only 50% of 2017 CDM programs are assumed to impact the 2018 load forecast based on the \"half-year\" rule.","2019 and 2020 are future years beyond the 2018 test year. No impacts of CDM programs beyond the 2018 test year are factored into the test year load forecast."]
[]
["2015-2020 LRAMVA and 2018 CDM adjustment to Load Forecast"]
[]
["One manual adjustment for CDM impacts to the 2018 load forecast is made.  There is a different but related threshold amount that is used for the 2018 LRAMVA amount for Account 1568."]
[]
["The amount used for the CDM threshold of the LRAMVA is the kWh that will be used to determine the base amount for the LRAMVA balance for 2018, for assessing performance against the six-year target."]
[]
["If used to determine the manual CDM adjustment for the system purchased kWh, the proposed loss factor should correspond with the proposed total loss factor calculated in Appendix 2-R ."]
[]
["The Manual Adjustment for the 2018 Load Forecast is the amount manually subtracted from the system-wide load forecast (either based on a purchased or billed basis) derived from the base forecast from historical data. If the distributor has developed their load forecast on a system purchased basis, then the manual adjustment should be on a system purchased basis, including the adjustment for losses.  If the load forecast has been developed on a billed basis, either on a system basis or on a class-specific basis, the manual adjustment should be on a billed basis, excluding losses."]
[]
["The distributor should determine the allocation of the savings to all customer classes in a reasonable manner (e.g. taking into account what programs and what IESO-measured impacts were directed at specific customer classes), for both the LRAMVA and for the load forecast adjustment."]
[]
[null,2015,2016,2017,2018,2019,2020,"Total for 2018"]
[]
["Amount used for CDM threshold for LRAMVA (2018)",null,null,{"$f":"E36","v":3366352.2129070596},{"$f":"E37","v":3913998},null,null,{"$f":"SUM(B89:G89)","v":7280350.2129070591}]
[]
["Manual Adjustment for 2018 Load Forecast (billed basis)",{"$f":"B89*(1+F64)*B72","v":0},{"$f":"C89*(1+F64)*C72","v":0},{"$f":"D89*(1+F64)*D72","v":3366352.2129070596},{"$f":"E89*(1+G64)*E72","v":1956999},null,null,{"$f":"SUM(B91:G91)","v":5323351.2129070591}]
["Manual Adjustment for 2018 LDC-only CDM programs (billed basis)"]
["Total Manual Forecast to Load Forecast",{"$f":"B91+B92","v":0},0,3366352.2129070596,1956999,null,null,{"$f":"SUM(B93:G93)","v":5323351.2129070591}]
[]
["Proposed Loss Factor (TLF)",4.8099999999999997E-2," Format: X.XX%"]
["Manual Adjustment for 2018 Load Forecast (system purchased basis)",{"$f":"B93*(1+$B95)","v":0},0,3528273.7543478892,2051130.6519000002,null,null,{"$f":"SUM(B96:G96)","v":5579404.4062478896}]
[]
["Manual adjustment uses \"gross\" versus \"net\" (i.e. numbers multiplied by (1 + g).  The Weight factor is also used to calculate the impact of each year's program on the CDM adjustment to the 2018 load forecast."]

{"sheet":"App.2-IA_Load_Forecast_Instrct","index":22,"n_rows":45,"n_cols":18,"rows_kept":45,"cut":false,"hidden":false,"merged":[[9,1,9,17],[8,1,8,17],[18,1,18,17],[20,1,20,17],[22,1,22,17],[24,1,24,17],[26,1,26,17],[43,2,43,17],[44,2,44,17],[28,8,28,10],[28,12,28,14],[29,13,29,14],[29,9,29,10],[41,2,41,17],[42,2,42,17],[28,16,28,17]]}
[null,null,null,null,null,null,null,null,null,null,null,null,null,null,null,null,"File Number:",{"$f":"EBNUMBER","v":"EB-2017-0071"}]
[null,null,null,null,null,null,null,null,null,null,null,null,null,null,null,null,"Exhibit:",3]
[null,null,null,null,null,null,null,null,null,null,null,null,null,null,null,null,"Tab:"]
[null,null,null,null,null,null,null,null,null,null,null,null,null,null,null,null,"Schedule:"]
[null,null,null,null,null,null,null,null,null,null,null,null,null,null,null,null,"Page:",29]
[]
[null,null,null,null,null,null,null,null,null,null,null,null,null,null,null,null,"Date:","2018-03-29"]
[]
[null,"Appendix 2-IA"]
[null,"Instructions on Customer, Connections, Load Forecast and Revenues Data and Analysis"]
[]
[null,"This sheet requires no inputs, but serves as a summary of the hiostorical and forecasted data to be provided with respect to:"]
[]
[null,"1)","Customers and connections"]
[null,"2)","Consumption (kWh)"]
[null,"3)","Demand (kW or kCA) for applicable demand-billed customer classes"]
[null,"4)","Revenues"]
[]
[null,"The spreadsheet summarizes the data provided and the analyses (variance or year-over-year) that are required. Data are required to be provided on a customer class level. Consumption (kWh) must also be provided on a total distribution system level."]
[]
[null,"Appendix 2-IB (formerly 2-IA) is the appendix spreadsheet that the distributor populates, and the spreadsheet is laid out for inputting the necessary data. The spreadsheet also calculates necessary statistics such as average consumption per customer/connection per year, and variances and % annual changes, as necessary."]
[]
[null,"The distributor is required to provide suitable documentation in Exhibit 3 of its Application, in accordance with section 2.3.2 of Chaoter 2 of the Filing Requirements. This would include explanations for material variations or of trends in the data."]
[]
[null,"The distributor is also required to input its test year customer/connection and load forecast in Sheet 10 - Load Forecast of the Revenue Requirement Work Form. This sheet should also be updated to reflect changes in the load forecast made through the stages of processing of the rates application."]
[]
[null,"The applicant must demonstrate the historical accuracy of its load forecast approach for at least the past 5 years. Such analysis will cover both customer/connections and consumption (kWh) and demand (kW or kVA) by providing the following, as shown in the following table:"]
[]
[null,null,null,"Calendar Year",null,"Customers / Connections",null,null,"Consumption (kWh) (3)",null,null,null,"Demand (kW or kVA)",null,null,null,"Revenues"]
[null,null,null,{"$f":"\"(for \"&TestYear&\" Cost of Service)\"","v":"(for 2018 Cost of Service)"},null,null,null,null,"Weather-actual","Weather-normalized",null,null,"Weather-actual","Weather-normalized",null,null,"Weather-actual","Weather-normalized"]
[null,null,"Historical",{"$f":"D32-1","v":2012},null,"Actual",null,null,"Actual","Actual (1)",null,null,"Actual","Actual (1)",null,null,"Actual"]
[null,null,"Historical",2013,null,"Actual","Board-approved (2)",null,"Actual","Actual (1)","Board-approved (2)",null,"Actual","Actual (1)","Board-approved (2)",null,"Actual"]
[null,null,"Historical",2014,null,"Actual",null,null,"Actual","Actual (1)",null,null,"Actual","Actual (1)",null,null,"Actual"]
[null,null,"Historical",2015,null,"Actual",null,null,"Actual","Actual (1)",null,null,"Actual","Actual (1)",null,null,"Actual"]
[null,null,"Historical",2016,null,"Actual",null,null,"Actual","Actual (1)",null,null,"Actual","Actual (1)",null,null,"Actual"]
[null,null,"Bridge Year (Forecast)",2017,null,"Forecast",null,null,null,"Forecast",null,null,null,"Forecast",null,null,null,"Forecast"]
[null,null,"Test Year (Forecast)",{"$f":"TestYear","v":2018},null,"Forecast",null,null,null,"Forecast",null,null,null,"Forecast",null,null,null,"Forecast"]
[]
[]
[null,"Notes:"]
[]
[null,"(1)","“Weather-normalized actuals” are estimated by replacing the actual weather-related values (typically Heating Degree Days (HDD) and Cooling Degree Days (CDD)) by the “typical” or “weather-normalized” values. These “weather-normalized HDD and CDD values would be the same as used to estimate the Bridge Year and Test Year forecasts."]
[null,"(2)","For 2017 Cost of Service rebasers, the typical situation is that 2013 would have been the most recent cost of service rebasing application. If the most recent rebasing application was for a rate year other than 2013, that year should be used. An applicant must provide historical information back to the greater of: a) at least five (5) historical actual years; or b) to its last cost of service application."]
[null,"(3)","Consumption must be provided on a total distribution system basis as well as at a customer class level."]
[null,"(4)","Revenues exclude commodity charges."]

{"sheet":"App.2-IB_Load_Forecast_Analysis","index":23,"n_rows":489,"n_cols":21,"rows_kept":489,"cut":false,"hidden":false,"merged":[[211,5,211,7],[220,11,220,12],[220,17,220,18],[190,5,190,7],[199,11,199,12],[199,17,199,18],[210,5,210,8],[210,10,210,14],[210,16,210,20],[167,5,167,8],[167,10,167,14],[167,16,167,20],[168,5,168,7],[177,11,177,12],[177,17,177,18],[187,3,187,5],[189,5,189,8],[189,10,189,14],[189,16,189,20],[134,11,134,12],[134,17,134,18],[144,3,144,5],[146,5,146,8],[146,10,146,14],[146,16,146,20],[147,5,147,7],[156,11,156,12],[156,17,156,18],[91,11,91,12],[81,5,81,8],[82,5,82,7],[70,17,70,18],[81,16,81,20],[91,17,91,18],[125,5,125,7],[46,11,46,12],[101,3,101,5],[103,5,103,8],[103,10,103,14],[113,11,113,12],[113,17,113,18],[124,5,124,8],[124,10,124,14],[124,16,124,20],[230,3,230,5],[232,5,232,8],[232,10,232,14],[232,16,232,20],[233,5,233,7],[24,1,24,21],[8,1,8,21],[9,1,9,21],[18,1,18,21],[20,1,20,21],[22,1,22,21],[26,1,26,21],[60,10,60,14],[60,16,60,20],[36,10,36,14],[37,5,37,7],[28,1,28,21],[58,3,58,5],[61,5,61,7],[60,5,60,8],[103,16,103,20],[104,5,104,7],[70,11,70,12],[81,10,81,14],[254,5,254,7],[263,11,263,12],[263,17,263,18],[273,3,273,5],[275,5,275,8],[275,10,275,14],[275,16,275,20],[242,11,242,12],[242,17,242,18],[253,5,253,8],[253,10,253,14],[253,16,253,20],[297,5,297,7],[306,11,306,12],[306,17,306,18],[316,3,316,5],[318,5,318,8],[318,10,318,14],[318,16,318,20],[276,5,276,7],[285,11,285,12],[285,17,285,18],[296,5,296,8],[296,10,296,14],[296,16,296,20],[340,5,340,7],[349,11,349,12],[349,17,349,18],[359,3,359,5],[361,5,361,8],[361,10,361,14],[361,16,361,20],[319,5,319,7],[328,11,328,12],[328,17,328,18],[339,5,339,8],[339,10,339,14],[339,16,339,20],[383,5,383,7],[392,11,392,12],[392,17,392,18],[402,3,402,5],[404,5,404,8],[404,10,404,14],[404,16,404,20],[362,5,362,7],[371,11,371,12],[371,17,371,18],[382,5,382,8],[382,10,382,14],[382,16,382,20],[426,5,426,7],[435,11,435,12],[435,17,435,18],[445,3,445,5],[447,5,447,8],[447,10,447,14],[447,16,447,20],[405,5,405,7],[414,11,414,12],[414,17,414,18],[425,5,425,8],[425,10,425,14],[425,16,425,20],[469,5,469,7],[478,11,478,12],[478,17,478,18],[448,5,448,7],[457,11,457,12],[457,17,457,18],[468,5,468,8],[468,10,468,14],[468,16,468,20]]}
[null,null,null,null,null,null,null,null,null,null,null,null,null,null,null,null,null,null,null,"File Number:",{"$f":"EBNUMBER","v":"EB-2017-0071"}]
[null,null,null,null,null,null,null,null,null,null,null,null,null,null,null,null,null,null,null,"Exhibit:",3]
[null,null,null,null,null,null,null,null,null,null,null,null,null,null,null,null,null,null,null,"Tab:"]
[null,null,null,null,null,null,null,null,null,null,null,null,null,null,null,null,null,null,null,"Schedule:"]
[null,null,null,null,null,null,null,null,null,null,null,null,null,null,null,null,null,null,null,"Page:",29]
[]
[null,null,null,null,null,null,null,null,null,null,null,null,null,null,null,null,null,null,null,"Date:","2018-03-29"]
[]
[null,"Appendix 2-IB"]
[null,"Customer, Connections, Load Forecast and Revenues Data and Analysis"]
[]
[null,"This sheet requires no inputs, but serves as a summary of the hiostorical and forecasted data to be provided with respect to:"]
[]
[null,"1)","Customers and connections"]
[null,"2)","Consumption (kWh)"]
[null,"3)","Demand (kW or kCA) for applicable demand-billed customer classes"]
[null,"4)","Revenues"]
[]
[null,"The spreadsheet summarizes the data provided and the analyses (variance or year-over-year) that are required. Data are required to be provided on a customer class level. Consumption (kWh) must also be provided on a total distribution system level."]
[]
[null,"Appendix 2-IB (formerly 2-IA) is the appendix spreadsheet that the distributor populates, and the spreadsheet is laid out for inputting the necessary data. The spreadsheet also calculates necessary statistics such as average consumption per customer/connection per year, and variances and % annual changes, as necessary."]
[]
[null,"The distributor is required to provide suitable documentation in Exhibit 3 of its Application, in accordance with section 2.3.2 of Chaoter 2 of the Filing Requirements. This would include explanations for material variations or of trends in the data."]
[]
[null,"The distributor is also required to input its test year customer/connection and load forecast in Sheet 10 - Load Forecast of the Revenue Requirement Work Form. This sheet should also be updated to reflect changes in the load forecast made through the stages of processing of the rates application."]
[]
[null,"The applicant must demonstrate the historical accuracy of its load forecast approach for at least the past 5 years. Such analysis will cover both customer/connections and consumption (kWh) and demand (kW or kVA) by providing the following, as shown in the following table:"]
[]
[null,"This sheet is to be filled in accordance with the instructions documented in section 2.3.2 of Chapter 2 of the Filing Requirements for Distribution Rate Applications, in terms of one set of tables per customer class."]
[]
[null,"Color coding for Cells:",null,null,null,"Data input",null,null,null,null,"Drop-down List"]
[]
[null,null,null,null,null,"No data entry required",null,null,null,null,"Blank or calculated value"]
[]
[null,"Distribution System (Total)"]
[]
[null,null,null,"Calendar Year",null,null,null,null,null,null,"Consumption (kWh) (3)"]
[null,null,null,{"$f":"CONCATENATE(\"(for \",TestYear,\" Cost of Service\")","v":"(for 2018 Cost of Service"},null,null,null,null,null,null,null,"Actual (Weather actual)","Weather-normalized",null,"Weather-normalized"]
[null,null,"Historical",{"$f":"D40-1","v":2012},null,null,null,null,null,null,"Actual",676765709,{"$f":"L39*1.04577","v":707741275.50093007},{"$f":"IF(D39=RebaseYear,\"Board-approved\",\"\")","v":""}]
[null,null,"Historical",2013,null,null,null,null,null,null,"Actual",688244167,{"$f":"L40*1.01368","v":697659347.20455992},"Board-approved",703408249]
[null,null,"Historical",2014,null,null,null,null,null,null,"Actual",701843127,{"$f":"L41*0.95873","v":672878061.14871001},""]
[null,null,"Historical",2015,null,null,null,null,null,null,"Actual",669387526,{"$f":"L42*0.98231","v":657546060.66506004},""]
[null,null,"Historical",2016,null,null,null,null,null,null,"Actual",636876244,{"$f":"L43*1.00801","v":641977622.71443999},""]
[null,null,"Bridge Year",2017,null,null,null,null,null,null,"Actual",622542513,{"$f":"+L44*1.01105","v":629421607.76865005},""]
[null,null,"Test Year",{"$f":"TestYear","v":2018},null,null,null,null,null,null,"Forecast",null,629144064,""]
[null,null,null,null,null,null,null,null,null,null,null,null,null,null,{"$f":"SUM(O39:O44)","v":703408249}]
[null,null,"Variance Analysis",null,null,null,null,null,null,null,"Year","Year-over-year",null,null,"Versus Board-approved"]
[null,null,null,{"$f":"D39","v":2012},null,null,null,null,null,null,{"$f":"D48","v":2012}]
[null,null,null,2013,null,null,null,null,null,null,{"$f":"D49","v":2013},{"$f":"IF(L39=0,\"\",L40/L39-1)","v":1.6960755912058145E-2},-1.4245217349001305E-2]
[null,null,null,2014,null,null,null,null,null,null,2014,1.9758917913212048E-2,-3.552061067503165E-2]
[null,null,null,2015,null,null,null,null,null,null,2015,-4.6243383672830318E-2,-2.2785704229196901E-2]
[null,null,null,2016,null,null,null,null,null,null,2016,-4.8568700098543527E-2,-2.3676573980039861E-2]
[null,null,null,2017,null,null,null,null,null,null,2017,{"$f":"IF(K44=\"Forecast\",\"\",IF(L43=0,\"\",L44/L43-1))","v":-2.2506305008292982E-2},{"$f":"IF(M43=0,\"\",M44/M43-1)","v":-1.9558337396091807E-2}]
[null,null,null,2018,null,null,null,null,null,null,2018,{"$f":"IF(K45=\"Forecast\",\"\",IF(L44=0,\"\",L45/L44-1))","v":""},{"$f":"IF(M44=0,\"\",M45/M44-1)","v":-4.4095049363490624E-4},null,{"$f":"IF(O46=0,\"\",M45/O46-1)","v":-0.10557764300543482}]
[null,null,null,"Geometric Mean",null,null,null,null,null,null,"Geometric Mean",{"$f":"IF(L39=0,\"\",(L43/L39)^(1/($D43-$D39-1))-1)","v":-2.0046274971979194E-2},{"$f":"IF(M39=0,\"\",(M45/M39)^(1/($D45-$D39-1))-1)","v":-2.3268676169920122E-2},null,{"$f":"IF(O46=0,\"\",(M45/O46)^(1/(TestYear-RebaseYear-1))-1)","v":-2.7508841515487048E-2}]
[]
[null,"Customer Class Analysis (one for each Customer Class, excluding MicroFIT and Standby)"]
[]
[null,1,"Customer Class:","Residential",null,null,null,"Is the customer class billed on consumption (kWh) or demand (kW or kVA)?",null,null,null,null,null,"kWh"]
[]
[null,null,null,"Calendar Year",null,"Customers",null,null,null,null,"Consumption (kWh) (3)",null,null,null,null,null,{"$f":"CONCATENATE(\"Consumption (kWh) per \",LEFT(F61,LEN(F61)-1))","v":"Consumption (kWh) per Customer"}]
[null,null,null,{"$f":"CONCATENATE(\"(for \",TestYear,\" Cost of Service\")","v":"(for 2018 Cost of Service"},null,null,null,null,null,null,null,"Actual (Weather actual)","Weather-normalized",null,"Weather-normalized",null,null,{"$f":"L62","v":"Actual (Weather actual)"},{"$f":"M62","v":"Weather-normalized"},null,{"$f":"O62","v":"Weather-normalized"}]
[null,null,"Historical",{"$f":"D64-1","v":2012},null,{"$f":"K39","v":"Actual"},29327,{"$f":"IF(D63=RebaseYear,\"Board-approved\",\"\")","v":""},null,null,{"$f":"F63","v":"Actual"},316127645,{"$f":"L63*1.04577","v":330596807.31165004},{"$f":"H63","v":""},null,null,{"$f":"K63","v":"Actual"},{"$f":"IF(G63=0,\"\",L63/G63)","v":10779.406178606745},{"$f":"IF(G63=0,\"\",M63/G63)","v":11272.779599401576},{"$f":"N63","v":""},{"$f":"IF(T63=\"\",\"\",IF(I63=0,\"\",O63/I63))","v":""}]
[null,null,"Historical",2013,null,{"$f":"K40","v":"Actual"},29504,"Board-approved",29271,null,{"$f":"F64","v":"Actual"},324185392,{"$f":"L64*1.01368","v":328620248.16255999},{"$f":"H64","v":"Board-approved"},3430561449,null,{"$f":"K64","v":"Actual"},{"$f":"IF(G64=0,\"\",L64/G64)","v":10987.845444685467},{"$f":"IF(G64=0,\"\",M64/G64)","v":11138.159170368763},{"$f":"N64","v":"Board-approved"},{"$f":"IF(T64=\"\",\"\",IF(I64=0,\"\",O64/I64))","v":117200.00850671313}]
[null,null,"Historical",2014,null,"Actual",29514,"",null,null,"Actual",334950383,{"$f":"L65*0.95873","v":321126980.69358999},"",null,null,"Actual",11348.864369451785,10880.49673692451,"",""]
[null,null,"Historical",2015,null,"Actual",29566,"",null,null,"Actual",310458240,{"$f":"L66*0.98231","v":304966233.73440003},"",null,null,"Actual",10500.515456943787,10314.761338510452,"",""]
[null,null,"Historical",2016,null,"Actual",29620,"",null,null,"Actual",288746486,{"$f":"L67*1.00801","v":291059345.35286003},"",null,null,"Actual",9748.3621201890619,9826.4465007717772,"",""]
[null,null,"Bridge Year",2017,null,"Actual",29729,"",null,null,"Actual",282820547,{"$f":"+L68*1.01105","v":285945714.04435003},"",null,null,"Actual",9513.2882707120989,9618.4101061034689,"",""]
[null,null,"Test Year",{"$f":"TestYear","v":2018},null,"Forecast",29816,"",null,null,"Forecast",null,287663507,"",null,null,"Forecast",0,9647.9577072712636,"",""]
[null,null,null,null,null,null,null,null,{"$f":"SUM(I63:I68)","v":29271},null,null,null,null,null,{"$f":"SUM(O63:O68)","v":3430561449},null,null,null,null,null,{"$f":"SUM(U63:U68)","v":117200.00850671313}]
[null,null,"Variance Analysis","Year",null,null,"Year-over-year",null,"Test Year Versus Board-approved",null,"Year","Year-over-year",null,null,{"$f":"I71","v":"Test Year Versus Board-approved"},null,"Year","Year-over-year",null,null,{"$f":"O71","v":"Test Year Versus Board-approved"}]
[null,null,null,{"$f":"D63","v":2012},null,null,null,null,null,null,{"$f":"D72","v":2012},null,null,null,null,null,{"$f":"K72","v":2012}]
[null,null,null,2013,null,null,{"$f":"IF(G63=0,\"\",G64/G63-1)","v":6.0353940055239974E-3},null,null,null,{"$f":"D73","v":2013},{"$f":"IF(L63=0,\"\",L64/L63-1)","v":2.5488903382682615E-2},-5.9787605487271467E-3,null,null,null,{"$f":"K73","v":2013},{"$f":"IF(R63=\"\",\"\",IF(R63=0,\"\",R64/R63-1))","v":1.9336804145333897E-2},{"$f":"IF(S63=\"\",\"\",IF(S63=0,\"\",S64/S63-1))","v":-1.1942079399827832E-2}]
[null,null,null,2014,null,null,3.3893709327559307E-4,null,null,null,2014,3.3206280312593428E-2,-2.2802208661419021E-2,null,null,null,2014,{"$f":"IF(R64=\"\",\"\",IF(R64=0,\"\",R65/R64-1))","v":3.285620703201042E-2},-2.3133305019533368E-2]
[null,null,null,2015,null,null,1.7618757199973079E-3,null,null,null,2015,-7.3121704715292113E-2,-5.0325098577157723E-2,null,null,null,2015,-7.4751876918322746E-2,-5.1995364926139209E-2]
[null,null,null,2016,null,null,1.8264222417641029E-3,null,null,null,2016,-6.993453934416427E-2,-4.5601403838208987E-2,null,null,null,2016,-7.1630134714705029E-2,-4.7341360765715268E-2]
[null,null,null,2017,null,null,3.6799459824443659E-3,null,null,null,2017,{"$f":"IF(K68=\"Forecast\",\"\",IF(L67=0,\"\",L68/L67-1))","v":-2.0522982226007125E-2},{"$f":"IF(M67=0,\"\",M68/M67-1)","v":-1.7569033223484354E-2},null,null,null,2017,{"$f":"IF(Q68=\"Forecast\",\"\",IF(R67=0,\"\",R68/R67-1))","v":-2.4114189294437538E-2},{"$f":"IF(S67=\"\",\"\",IF(S67=0,\"\",S68/S67-1))","v":-2.117107080896119E-2}]
[null,null,null,2018,null,null,2.9264354670524018E-3,null,{"$f":"IF(I70=0,\"\",G69/I70-1)","v":1.8619111065559801E-2},null,2018,{"$f":"IF(K69=\"Forecast\",\"\",IF(L68=0,\"\",L69/L68-1))","v":""},{"$f":"IF(M68=0,\"\",M69/M68-1)","v":6.0074093482778146E-3},null,{"$f":"IF(O70=0,\"\",M69/O70-1)","v":-0.91614681407795417},null,2018,{"$f":"IF(Q69=\"Forecast\",\"\",IF(R68=0,\"\",R69/R68-1))","v":""},3.0719839185318065E-3,null,{"$f":"IF(U70=0,\"\",S69/U70-1)","v":-0.91767954772188742}]
[null,null,null,"Geometric Mean",null,null,{"$f":"IF(G63=0,\"\",(G69/G63)^(1/($D69-$D63-1))-1)","v":3.3127889504322994E-3},null,{"$f":"IF(I70=0,\"\",(G69/I70)^(1/(TestYear-RebaseYear-1))-1)","v":4.6226258679953336E-3},null,"Geometric Mean",{"$f":"IF(L63=0,\"\",(L67/L63)^(1/($D67-$D63-1))-1)","v":-2.9747559376469557E-2},{"$f":"IF(M63=0,\"\",(M69/M63)^(1/($D69-$D63-1))-1)","v":-2.7438164940022047E-2},null,{"$f":"IF(O70=0,\"\",(M69/O70)^(1/(TestYear-RebaseYear-1))-1)","v":-0.46187906023758452},null,"Geometric Mean",{"$f":"IF(R63=\"\",\"\",IF(R63=0,\"\",(R67/R63)^(1/($D67-$D63-1))-1))","v":-3.2957400996674324E-2},{"$f":"IF(S63=\"\",\"\",IF(S63=0,\"\",(S69/S63)^(1/($D69-$D63-1))-1))","v":-3.0649418834402531E-2},null,{"$f":"IF(U70=0,\"\",(S69/U70)^(1/(TestYear-RebaseYear-1))-1)","v":-0.46435514599576322}]
[]
[]
[null,null,null,"Calendar Year",null,"Revenues",null,null,null,null,{"$f":"IF(ISBLANK(N59),\"\",CONCATENATE(\"Demand (\",N59,\")\"))","v":"Demand (kWh)"},null,null,null,null,null,{"$f":"CONCATENATE(\"Demand (\",N59,\") per \",LEFT(F61,LEN(F61)-1))","v":"Demand (kWh) per Customer"}]
[null,null,null,{"$f":"CONCATENATE(\"(for \",TestYear,\" Cost of Service\")","v":"(for 2018 Cost of Service"},null,null,null,null,null,null,null,"Actual (Weather actual)","Weather-normalized",null,{"$f":"M83","v":"Weather-normalized"},null,null,{"$f":"L83","v":"Actual (Weather actual)"},{"$f":"M83","v":"Weather-normalized"},null,{"$f":"O83","v":"Weather-normalized"}]
[null,null,"Historical",{"$f":"D85-1","v":2012},null,{"$f":"F63","v":"Actual"},7893410.6200000001,{"$f":"IF(D84=RebaseYear,\"Board-approved\",\"\")","v":""},null,null,{"$f":"K63","v":"Actual"},null,null,{"$f":"N63","v":""},null,null,{"$f":"K84","v":"Actual"},{"$f":"IF(G84=0,\"\",L84/G84)","v":0},{"$f":"IF(G84=0,\"\",M84/G84)","v":0},{"$f":"N84","v":""},{"$f":"IF(T84=\"\",\"\",IF(I84=0,\"\",O84/I84))","v":""}]
[null,null,"Historical",2013,null,"Actual",8383231,"Board-approved",9069512,null,"Actual",null,null,"Board-approved",null,null,{"$f":"K85","v":"Actual"},{"$f":"IF(G85=0,\"\",L85/G85)","v":0},{"$f":"IF(G85=0,\"\",M85/G85)","v":0},{"$f":"N85","v":"Board-approved"},{"$f":"IF(T85=\"\",\"\",IF(I85=0,\"\",O85/I85))","v":0}]
[null,null,"Historical",2014,null,"Actual",9058873,"",null,null,"Actual",null,null,"",null,null,"Actual",0,0,"",""]
[null,null,"Historical",2015,null,"Actual",8805836,"",null,null,"Actual",null,null,"",null,null,"Actual",0,0,"",""]
[null,null,"Historical",2016,null,"Actual",8499404,"",null,null,"Actual",null,null,"",null,null,"Actual",0,0,"",""]
[null,null,"Bridge Year (Forecast)",2017,null,"Actual",9399841,"",null,null,"Actual",null,null,"",null,null,"Actual",0,0,"",""]
[null,null,"Test Year (Forecast)",{"$f":"TestYear","v":2018},null,"Forecast",11487469,"",null,null,"Forecast",null,null,"",null,null,"Forecast",0,0,"",""]
[null,null,null,null,null,null,null,null,{"$f":"SUM(I84:I89)","v":9069512},null,null,null,null,null,{"$f":"SUM(O84:O89)","v":0},null,null,null,null,null,{"$f":"SUM(U84:U89)","v":0}]
[null,null,"Variance Analysis","Year",null,null,"Year-over-year",null,{"$f":"I71","v":"Test Year Versus Board-approved"},null,"Year","Year-over-year",null,null,{"$f":"I92","v":"Test Year Versus Board-approved"},null,"Year","Year-over-year",null,null,{"$f":"O92","v":"Test Year Versus Board-approved"}]
[null,null,null,{"$f":"D84","v":2012},null,null,null,null,null,null,{"$f":"D93","v":2012},null,null,null,null,null,{"$f":"K93","v":2012}]
[null,null,null,{"$f":"D85","v":2013},null,null,{"$f":"IF(G84=0,\"\",G85/G84-1)","v":6.2054339192606278E-2},null,null,null,{"$f":"D94","v":2013},{"$f":"IF(L84=0,\"\",L85/L84-1)","v":""},{"$f":"IF(M84=0,\"\",M85/M84-1)","v":""},null,null,null,{"$f":"K94","v":2013},{"$f":"IF(R84=\"\",\"\",IF(R84=0,\"\",R85/R84-1))","v":""},{"$f":"IF(S84=\"\",\"\",IF(S84=0,\"\",S85/S84-1))","v":""}]
[null,null,null,{"$f":"D86","v":2014},null,null,{"$f":"IF(G85=0,\"\",G86/G85-1)","v":8.0594462922469967E-2},null,null,null,2014,{"$f":"IF(L85=0,\"\",L86/L85-1)","v":""},"",null,null,null,2014,{"$f":"IF(R85=\"\",\"\",IF(R85=0,\"\",R86/R85-1))","v":""},""]
[null,null,null,2015,null,null,-2.7932503303667033E-2,null,null,null,2015,{"$f":"IF(L86=0,\"\",L87/L86-1)","v":""},"",null,null,null,2015,"",""]
[null,null,null,2016,null,null,-3.4798740289962216E-2,null,null,null,2016,{"$f":"IF(L87=0,\"\",L88/L87-1)","v":""},"",null,null,null,2016,"",""]
[null,null,null,2017,null,null,0.10594119305306582,null,null,null,2017,{"$f":"IF(K89=\"Forecast\",\"\",IF(L88=0,\"\",L89/L88-1))","v":""},{"$f":"IF(M88=0,\"\",M89/M88-1)","v":""},null,null,null,2017,{"$f":"IF(Q89=\"Forecast\",\"\",IF(R88=0,\"\",R89/R88-1))","v":""},{"$f":"IF(S88=\"\",\"\",IF(S88=0,\"\",S89/S88-1))","v":""}]
[null,null,null,2018,null,null,0.22209184176625962,null,{"$f":"IF(I91=0,\"\",G90/I91-1)","v":0.26660276760204948},null,2018,{"$f":"IF(K90=\"Forecast\",\"\",IF(L89=0,\"\",L90/L89-1))","v":""},{"$f":"IF(M89=0,\"\",M90/M89-1)","v":""},null,{"$f":"IF(O91=0,\"\",M90/O91-1)","v":""},null,2018,{"$f":"IF(Q90=\"Forecast\",\"\",IF(R89=0,\"\",R90/R89-1))","v":""},"",null,{"$f":"IF(U91=0,\"\",S90/U91-1)","v":""}]
[null,null,null,"Geometric Mean",null,null,{"$f":"IF(G84=0,\"\",(G90/G84)^(1/($D90-$D84-1))-1)","v":7.7933406229766078E-2},null,{"$f":"IF(I91=0,\"\",(G90/I91)^(1/(TestYear-RebaseYear-1))-1)","v":6.0864967599475461E-2},null,"Geometric Mean",{"$f":"IF(L84=0,\"\",(L88/L84)^(1/($D88-$D84-1))-1)","v":""},{"$f":"IF(M84=0,\"\",(M90/M84)^(1/($D90-$D84-1))-1)","v":""},null,{"$f":"IF(O91=0,\"\",(M90/O91)^(1/(TestYear-RebaseYear-1))-1)","v":""},null,"Geometric Mean",{"$f":"IF(R84=\"\",\"\",IF(R84=0,\"\",(R88/R84)^(1/($D88-$D84-1))-1))","v":""},{"$f":"IF(S84=\"\",\"\",IF(S84=0,\"\",(S90/S84)^(1/($D90-$D84-1))-1))","v":""},null,{"$f":"IF(U91=0,\"\",(S90/U91)^(1/(TestYear-RebaseYear-1))-1)","v":""}]
[]
[null,2,"Customer Class:","GS < 50 kW",null,null,null,"Is the customer class billed on consumption (kWh) or demand (kW or kVA)?",null,null,null,null,null,"kWh"]
[]
[null,null,null,"Calendar Year",null,"Customers",null,null,null,null,"Consumption (kWh) (3)",null,null,null,null,null,{"$f":"CONCATENATE(\"Consumption (kWh) per \",LEFT(F104,LEN(F104)-1))","v":"Consumption (kWh) per Customer"}]
[null,null,null,{"$f":"CONCATENATE(\"(for \",TestYear,\" Cost of Service\")","v":"(for 2018 Cost of Service"},null,null,null,null,null,null,null,"Actual (Weather actual)","Weather-normalized",null,"Weather-normalized",null,null,{"$f":"L105","v":"Actual (Weather actual)"},{"$f":"M105","v":"Weather-normalized"},null,{"$f":"O105","v":"Weather-normalized"}]
[null,null,"Historical",{"$f":"D107-1","v":2012},null,{"$f":"F63","v":"Actual"},3448,{"$f":"IF(D106=RebaseYear,\"Board-approved\",\"\")","v":""},null,null,{"$f":"F106","v":"Actual"},97479014,{"$f":"L106*1.04577","v":101940628.47078001},{"$f":"H106","v":""},null,null,{"$f":"K106","v":"Actual"},{"$f":"IF(G106=0,\"\",L106/G106)","v":28271.175754060325},{"$f":"IF(G106=0,\"\",M106/G106)","v":29565.14746832367},{"$f":"N106","v":""},{"$f":"IF(T106=\"\",\"\",IF(I106=0,\"\",O106/I106))","v":""}]
[null,null,"Historical",2013,null,{"$f":"F64","v":"Actual"},3474,"Board-approved",3401,null,{"$f":"F107","v":"Actual"},95827695,{"$f":"L107*1.01368","v":97138617.867599994},{"$f":"H107","v":"Board-approved"},102179766,null,{"$f":"K107","v":"Actual"},{"$f":"IF(G107=0,\"\",L107/G107)","v":27584.253022452504},{"$f":"IF(G107=0,\"\",M107/G107)","v":27961.605603799653},{"$f":"N107","v":"Board-approved"},{"$f":"IF(T107=\"\",\"\",IF(I107=0,\"\",O107/I107))","v":30044.035871802411}]
[null,null,"Historical",2014,null,"Actual",3464,"",null,null,"Actual",99153426,{"$f":"L108*0.95873","v":95061364.10898},"",null,null,"Actual",28623.968244803695,27442.657075340645,"",""]
[null,null,"Historical",2015,null,"Actual",3431,"",null,null,"Actual",95701162,{"$f":"L109*0.98231","v":94008208.444220006},"",null,null,"Actual",27893.081317400174,27399.652708895366,"",""]
[null,null,"Historical",2016,null,"Actual",3414,"",null,null,"Actual",92174996,{"$f":"L110*1.00801","v":92913317.71796},"",null,null,"Actual",26999.120093731693,27215.383045682483,"",""]
[null,null,"Bridge Year",2017,null,"Actual",3417,"",null,null,"Actual",91035995,{"$f":"+L111*1.01105","v":92041942.744749993},"",null,null,"Actual",26642.082235879425,26936.477244585891,"",""]
[null,null,"Test Year",{"$f":"TestYear","v":2018},null,"Forecast",3431,"",null,null,"Forecast",null,92683979,"",null,null,"Forecast",0,27013.692509472457,"",""]
[null,null,null,null,null,null,null,null,{"$f":"SUM(I106:I111)","v":3401},null,null,null,null,null,{"$f":"SUM(O106:O111)","v":102179766},null,null,null,null,null,{"$f":"SUM(U106:U111)","v":30044.035871802411}]
[null,null,"Variance Analysis","Year",null,null,"Year-over-year",null,"Test Year Versus Board-approved",null,"Year","Year-over-year",null,null,{"$f":"I114","v":"Test Year Versus Board-approved"},null,"Year","Year-over-year",null,null,{"$f":"O114","v":"Test Year Versus Board-approved"}]
[null,null,null,{"$f":"D106","v":2012},null,null,null,null,null,null,{"$f":"D115","v":2012},null,null,null,null,null,{"$f":"K115","v":2012}]
[null,null,null,2013,null,null,{"$f":"IF(G106=0,\"\",G107/G106-1)","v":7.5406032482598917E-3},null,null,null,{"$f":"D116","v":2013},{"$f":"IF(L106=0,\"\",L107/L106-1)","v":-1.6940251365283654E-2},-4.7105954467962285E-2,null,null,null,{"$f":"K116","v":2013},{"$f":"IF(R106=\"\",\"\",IF(R106=0,\"\",R107/R106-1))","v":-2.4297635782238869E-2},{"$f":"IF(S106=\"\",\"\",IF(S106=0,\"\",S107/S106-1))","v":-5.423757369186355E-2}]
[null,null,null,2014,null,null,-2.8785261945883933E-3,null,null,null,2014,{"$f":"IF(L107=0,\"\",L108/L107-1)","v":3.4705321880068141E-2},-2.1384427781866222E-2,null,null,null,2014,{"$f":"IF(R107=\"\",\"\",IF(R107=0,\"\",R108/R107-1))","v":3.7692346481338568E-2},-1.8559325090705459E-2]
[null,null,null,2015,null,null,-9.5265588914549282E-3,null,null,null,2015,{"$f":"IF(L108=0,\"\",L109/L108-1)","v":-3.4817395013662988E-2},-1.1078692954086367E-2,null,null,null,2015,{"$f":"IF(R108=\"\",\"\",IF(R108=0,\"\",R109/R108-1))","v":-2.5534088116388354E-2},-1.5670627784771796E-3]
[null,null,null,2016,null,null,-4.9548236665695189E-3,null,null,null,2016,{"$f":"IF(L109=0,\"\",L110/L109-1)","v":-3.6845592324155851E-2},-1.1646756643699518E-2,null,null,null,2016,{"$f":"IF(R109=\"\",\"\",IF(R109=0,\"\",R110/R109-1))","v":-3.2049568618681579E-2},-6.7252554319077174E-3]
[null,null,null,2017,null,null,8.7873462214416165E-4,null,null,null,2017,{"$f":"IF(K111=\"Forecast\",\"\",IF(L110=0,\"\",L111/L110-1))","v":-1.2356941138353839E-2},{"$f":"IF(M110=0,\"\",M111/M110-1)","v":-9.3783646371888851E-3},null,null,null,2017,{"$f":"IF(Q111=\"Forecast\",\"\",IF(R110=0,\"\",R111/R110-1))","v":-1.3224055325238626E-2},-1.0248093904408173E-2]
[null,null,null,2018,null,null,4.0971612525606549E-3,null,{"$f":"IF(I113=0,\"\",G112/I113-1)","v":8.820935019111964E-3},null,2018,{"$f":"IF(K112=\"Forecast\",\"\",IF(L111=0,\"\",L112/L111-1))","v":""},{"$f":"IF(M111=0,\"\",M112/M111-1)","v":6.9754748335821848E-3},null,{"$f":"IF(O113=0,\"\",M112/O113-1)","v":-9.2932166237295943E-2},null,2018,{"$f":"IF(Q112=\"Forecast\",\"\",IF(R111=0,\"\",R112/R111-1))","v":""},2.8665687864617428E-3,null,{"$f":"IF(U113=0,\"\",S112/U113-1)","v":-0.10086339183125714}]
[null,null,null,"Geometric Mean",null,null,{"$f":"IF(G106=0,\"\",(G112/G106)^(1/($D112-$D106-1))-1)","v":-9.8802936227260219E-4},null,{"$f":"IF(I113=0,\"\",(G112/I113)^(1/(TestYear-RebaseYear-1))-1)","v":2.1979764793915724E-3},null,"Geometric Mean",{"$f":"IF(L106=0,\"\",(L110/L106)^(1/($D110-$D106-1))-1)","v":-1.847658024368648E-2},{"$f":"IF(M106=0,\"\",(M112/M106)^(1/($D112-$D106-1))-1)","v":-1.8858890974117859E-2},null,{"$f":"IF(O113=0,\"\",(M112/O113)^(1/(TestYear-RebaseYear-1))-1)","v":-2.4089610310955134E-2},null,"Geometric Mean",{"$f":"IF(R106=\"\",\"\",IF(R106=0,\"\",(R110/R106)^(1/($D110-$D106-1))-1))","v":-1.5229009260007031E-2},{"$f":"IF(S106=\"\",\"\",IF(S106=0,\"\",(S112/S106)^(1/($D112-$D106-1))-1))","v":-1.7888536010671863E-2},null,{"$f":"IF(U113=0,\"\",(S112/U113)^(1/(TestYear-RebaseYear-1))-1)","v":-2.6229934012331757E-2}]
[]
[]
[null,null,null,"Calendar Year",null,"Revenues",null,null,null,null,{"$f":"IF(ISBLANK(N102),\"\",CONCATENATE(\"Demand (\",N102,\")\"))","v":"Demand (kWh)"},null,null,null,null,null,{"$f":"CONCATENATE(\"Demand (\",N102,\") per \",LEFT(F104,LEN(F104)-1))","v":"Demand (kWh) per Customer"}]
[null,null,null,{"$f":"CONCATENATE(\"(for \",TestYear,\" Cost of Service\")","v":"(for 2018 Cost of Service"},null,null,null,null,null,null,null,"Actual (Weather actual)","Weather-normalized",null,{"$f":"M126","v":"Weather-normalized"},null,null,{"$f":"L126","v":"Actual (Weather actual)"},{"$f":"M126","v":"Weather-normalized"},null,{"$f":"O126","v":"Weather-normalized"}]
[null,null,"Historical",{"$f":"D128-1","v":2012},null,{"$f":"F106","v":"Actual"},2319239.65,{"$f":"IF(D127=RebaseYear,\"Board-approved\",\"\")","v":""},null,null,{"$f":"K106","v":"Actual"},null,null,{"$f":"N106","v":""},null,null,{"$f":"K127","v":"Actual"},{"$f":"IF(G127=0,\"\",L127/G127)","v":0},{"$f":"IF(G127=0,\"\",M127/G127)","v":0},{"$f":"N127","v":""},{"$f":"IF(T127=\"\",\"\",IF(I127=0,\"\",O127/I127))","v":""}]
[null,null,"Historical",2013,null,"Actual",2479550,"Board-approved",2664966,null,"Actual",null,null,"Board-approved",null,null,{"$f":"K128","v":"Actual"},{"$f":"IF(G128=0,\"\",L128/G128)","v":0},{"$f":"IF(G128=0,\"\",M128/G128)","v":0},{"$f":"N128","v":"Board-approved"},{"$f":"IF(T128=\"\",\"\",IF(I128=0,\"\",O128/I128))","v":0}]
[null,null,"Historical",2014,null,"Actual",2662132,"",null,null,"Actual",null,null,"",null,null,"Actual",0,0,"",""]
[null,null,"Historical",2015,null,"Actual",2636671,"",null,null,"Actual",null,null,"",null,null,"Actual",0,0,"",""]
[null,null,"Historical",2016,null,"Actual",2537809,"",null,null,"Actual",null,null,"",null,null,"Actual",0,0,"",""]
[null,null,"Bridge Year (Forecast)",2017,null,"Actual",2640479,"",null,null,"Actual",null,null,"",null,null,"Actual",0,0,"",""]
[null,null,"Test Year (Forecast)",{"$f":"TestYear","v":2018},null,"Forecast",3247287,"",null,null,"Forecast",null,null,"",null,null,"Forecast",0,0,"",""]
[null,null,null,null,null,null,null,null,{"$f":"SUM(I127:I132)","v":2664966},null,null,null,null,null,{"$f":"SUM(O127:O132)","v":0},null,null,null,null,null,{"$f":"SUM(U127:U132)","v":0}]
[null,null,"Variance Analysis","Year",null,null,"Year-over-year",null,{"$f":"I114","v":"Test Year Versus Board-approved"},null,"Year","Year-over-year",null,null,{"$f":"I135","v":"Test Year Versus Board-approved"},null,"Year","Year-over-year",null,null,{"$f":"O135","v":"Test Year Versus Board-approved"}]
[null,null,null,{"$f":"D127","v":2012},null,null,null,null,null,null,{"$f":"D136","v":2012},null,null,null,null,null,{"$f":"K136","v":2012}]
[null,null,null,{"$f":"D128","v":2013},null,null,{"$f":"IF(G127=0,\"\",G128/G127-1)","v":6.9121942615977705E-2},null,null,null,{"$f":"D137","v":2013},{"$f":"IF(L127=0,\"\",L128/L127-1)","v":""},{"$f":"IF(M127=0,\"\",M128/M127-1)","v":""},null,null,null,{"$f":"K137","v":2013},{"$f":"IF(R127=\"\",\"\",IF(R127=0,\"\",R128/R127-1))","v":""},{"$f":"IF(S127=\"\",\"\",IF(S127=0,\"\",S128/S127-1))","v":""}]
[null,null,null,{"$f":"D129","v":2014},null,null,{"$f":"IF(G128=0,\"\",G129/G128-1)","v":7.3635135407634555E-2},null,null,null,2014,{"$f":"IF(L128=0,\"\",L129/L128-1)","v":""},"",null,null,null,2014,{"$f":"IF(R128=\"\",\"\",IF(R128=0,\"\",R129/R128-1))","v":""},""]
[null,null,null,2015,null,null,-9.5641388180600639E-3,null,null,null,2015,{"$f":"IF(L129=0,\"\",L130/L129-1)","v":""},"",null,null,null,2015,{"$f":"IF(R129=\"\",\"\",IF(R129=0,\"\",R130/R129-1))","v":""},""]
[null,null,null,2016,null,null,-3.7495007909595146E-2,null,null,null,2016,{"$f":"IF(L130=0,\"\",L131/L130-1)","v":""},"",null,null,null,2016,{"$f":"IF(R130=\"\",\"\",IF(R130=0,\"\",R131/R130-1))","v":""},""]
[null,null,null,2017,null,null,4.0456157260061687E-2,null,null,null,2017,{"$f":"IF(K132=\"Forecast\",\"\",IF(L131=0,\"\",L132/L131-1))","v":""},"",null,null,null,2017,{"$f":"IF(Q132=\"Forecast\",\"\",IF(R131=0,\"\",R132/R131-1))","v":""},""]
[null,null,null,2018,null,null,0.22980981859730742,null,{"$f":"IF(I134=0,\"\",G133/I134-1)","v":0.21850972958003978},null,2018,{"$f":"IF(K133=\"Forecast\",\"\",IF(L132=0,\"\",L133/L132-1))","v":""},"",null,{"$f":"IF(O134=0,\"\",M133/O134-1)","v":""},null,2018,{"$f":"IF(Q133=\"Forecast\",\"\",IF(R132=0,\"\",R133/R132-1))","v":""},"",null,{"$f":"IF(U134=0,\"\",S133/U134-1)","v":""}]
[null,null,null,"Geometric Mean",null,null,{"$f":"IF(G127=0,\"\",(G133/G127)^(1/($D133-$D127-1))-1)","v":6.9633532395195763E-2},null,{"$f":"IF(I134=0,\"\",(G133/I134)^(1/(TestYear-RebaseYear-1))-1)","v":5.0648029482599277E-2},null,"Geometric Mean",{"$f":"IF(L127=0,\"\",(L131/L127)^(1/($D131-$D127-1))-1)","v":""},{"$f":"IF(M127=0,\"\",(M133/M127)^(1/($D133-$D127-1))-1)","v":""},null,{"$f":"IF(O134=0,\"\",(M133/O134)^(1/(TestYear-RebaseYear-1))-1)","v":""},null,"Geometric Mean",{"$f":"IF(R127=\"\",\"\",IF(R127=0,\"\",(R131/R127)^(1/($D131-$D127-1))-1))","v":""},{"$f":"IF(S127=\"\",\"\",IF(S127=0,\"\",(S133/S127)^(1/($D133-$D127-1))-1))","v":""},null,{"$f":"IF(U134=0,\"\",(S133/U134)^(1/(TestYear-RebaseYear-1))-1)","v":""}]
[]
[null,3,"Customer Class:","GS > 50 kW",null,null,null,"Is the customer class billed on consumption (kWh) or demand (kW or kVA)?",null,null,null,null,null,"kW"]
[]
[null,null,null,"Calendar Year",null,"Customers",null,null,null,null,"Consumption (kWh) (3)",null,null,null,null,null,{"$f":"CONCATENATE(\"Consumption (kWh) per \",LEFT(F147,LEN(F147)-1))","v":"Consumption (kWh) per Customer"}]
[null,null,null,{"$f":"CONCATENATE(\"(for \",TestYear,\" Cost of Service\")","v":"(for 2018 Cost of Service"},null,null,null,null,null,null,null,"Actual (Weather actual)","Weather-normalized",null,"Weather-normalized",null,null,{"$f":"L148","v":"Actual (Weather actual)"},{"$f":"M148","v":"Weather-normalized"},null,{"$f":"O148","v":"Weather-normalized"}]
[null,null,"Historical",{"$f":"D150-1","v":2012},null,{"$f":"F106","v":"Actual"},366,{"$f":"IF(D149=RebaseYear,\"Board-approved\",\"\")","v":""},null,null,{"$f":"F149","v":"Actual"},254314087,{"$f":"L149*1.04577","v":265954042.76199001},{"$f":"H149","v":""},null,null,{"$f":"K149","v":"Actual"},{"$f":"IF(G149=0,\"\",L149/G149)","v":694847.23224043718},{"$f":"IF(G149=0,\"\",M149/G149)","v":726650.39006008196},{"$f":"N149","v":""},{"$f":"IF(T149=\"\",\"\",IF(I149=0,\"\",O149/I149))","v":""}]
[null,null,"Historical",2013,null,{"$f":"F107","v":"Actual"},373,"Board-approved",399,null,{"$f":"F150","v":"Actual"},259048750,{"$f":"L150*1.01368","v":262592536.89999998},{"$f":"H150","v":"Board-approved"},251632820,null,{"$f":"K150","v":"Actual"},{"$f":"IF(G150=0,\"\",L150/G150)","v":694500.67024128686},{"$f":"IF(G150=0,\"\",M150/G150)","v":704001.43941018765},{"$f":"N150","v":"Board-approved"},{"$f":"IF(T150=\"\",\"\",IF(I150=0,\"\",O150/I150))","v":630658.69674185466}]
[null,null,"Historical",2014,null,"Actual",370,"",null,null,"Actual",258807830,{"$f":"L151*0.95873","v":248126830.85589999},"",null,null,"Actual",699480.62162162166,670613.05636729731,"",""]
[null,null,"Historical",2015,null,"Actual",373,"",null,null,"Actual",254784565,{"$f":"L152*0.98231","v":250277426.04515001},"",null,null,"Actual",683068.53887399461,670985.05642131367,"",""]
[null,null,"Historical",2016,null,"Actual",361,"",null,null,"Actual",249955178,{"$f":"L153*1.00801","v":251957318.97578001},"",null,null,"Actual",692396.6149584488,697942.71184426593,"",""]
[null,null,"Bridge Year",2017,null,"Actual",361,"",null,null,"Actual",245166376,{"$f":"+L154*1.01105","v":247875464.45480001},"",null,null,"Actual",679131.23545706377,686635.63560886425,"",""]
[null,null,"Test Year",{"$f":"TestYear","v":2018},null,"Forecast",357,"",null,null,"Forecast",null,245243826,"",null,null,"Forecast",0,686957.49579831935,"",""]
[null,null,null,null,null,null,null,null,{"$f":"SUM(I149:I154)","v":399},null,null,null,null,null,{"$f":"SUM(O149:O154)","v":251632820},null,null,null,null,null,{"$f":"SUM(U149:U154)","v":630658.69674185466}]
[null,null,"Variance Analysis","Year",null,null,"Year-over-year",null,"Test Year Versus Board-approved",null,"Year","Year-over-year",null,null,{"$f":"I157","v":"Test Year Versus Board-approved"},null,"Year","Year-over-year",null,null,{"$f":"O157","v":"Test Year Versus Board-approved"}]
[null,null,null,{"$f":"D149","v":2012},null,null,null,null,null,null,{"$f":"D158","v":2012},null,null,null,null,null,{"$f":"K158","v":2012}]
[null,null,null,2013,null,null,{"$f":"IF(G149=0,\"\",G150/G149-1)","v":1.91256830601092E-2},null,null,null,{"$f":"D159","v":2013},{"$f":"IF(L149=0,\"\",L150/L149-1)","v":1.8617383943815957E-2},-1.2639423815784423E-2,null,null,null,{"$f":"K159","v":2013},{"$f":"IF(R149=\"\",\"\",IF(R149=0,\"\",R150/R149-1))","v":-4.9875999078652367E-4},{"$f":"IF(S149=\"\",\"\",IF(S149=0,\"\",S150/S149-1))","v":-3.1168978864817842E-2}]
[null,null,null,2014,null,null,-8.0428954423592547E-3,null,null,null,2014,{"$f":"IF(L150=0,\"\",L151/L150-1)","v":-9.3001799854275369E-4},-5.5088031879629518E-2,null,null,null,2014,{"$f":"IF(R150=\"\",\"\",IF(R150=0,\"\",R151/R150-1))","v":7.1705494230906996E-3},-4.742658348946438E-2]
[null,null,null,2015,null,null,8.1081081081080253E-3,null,null,null,2015,{"$f":"IF(L151=0,\"\",L152/L151-1)","v":-1.5545375887584201E-2},8.6673221990207772E-3,null,null,null,2015,{"$f":"IF(R151=\"\",\"\",IF(R151=0,\"\",R152/R151-1))","v":-2.3463241497067577E-2},5.5471639044957222E-4]
[null,null,null,2016,null,null,-3.2171581769437019E-2,null,null,null,2016,{"$f":"IF(L152=0,\"\",L153/L152-1)","v":-1.8954786370202648E-2},6.7121232512872275E-3,null,null,null,2016,{"$f":"IF(R152=\"\",\"\",IF(R152=0,\"\",R153/R152-1))","v":1.3656134858488933E-2},4.0176238151607091E-2]
[null,null,null,2017,null,null,0,null,null,null,2017,{"$f":"IF(K154=\"Forecast\",\"\",IF(L153=0,\"\",L154/L153-1))","v":-1.9158642914770874E-2},{"$f":"IF(M153=0,\"\",M154/M153-1)","v":-1.6200579278954685E-2},null,null,null,2017,{"$f":"IF(Q154=\"Forecast\",\"\",IF(R153=0,\"\",R154/R153-1))","v":-1.9158642914770874E-2},{"$f":"IF(S153=\"\",\"\",IF(S153=0,\"\",S154/S153-1))","v":-1.6200579278954685E-2}]
[null,null,null,2018,null,null,-1.1080332409972304E-2,null,{"$f":"IF(I156=0,\"\",G155/I156-1)","v":-0.10526315789473684},null,2018,{"$f":"IF(K155=\"Forecast\",\"\",IF(L154=0,\"\",L155/L154-1))","v":""},{"$f":"IF(M154=0,\"\",M155/M154-1)","v":-1.0616776697073615E-2},null,{"$f":"IF(O156=0,\"\",M155/O156-1)","v":-2.539014584822441E-2},null,2018,{"$f":"IF(Q155=\"Forecast\",\"\",IF(R154=0,\"\",R155/R154-1))","v":""},{"$f":"IF(S154=\"\",\"\",IF(S154=0,\"\",S155/S154-1))","v":4.6874961444398622E-4},null,{"$f":"IF(U156=0,\"\",S155/U156-1)","v":8.9269836993161045E-2}]
[null,null,null,"Geometric Mean",null,null,{"$f":"IF(G149=0,\"\",(G155/G149)^(1/($D155-$D149-1))-1)","v":-4.9671331154789167E-3},null,{"$f":"IF(I156=0,\"\",(G155/I156)^(1/(TestYear-RebaseYear-1))-1)","v":-2.7423369123585561E-2},null,"Geometric Mean",{"$f":"IF(L149=0,\"\",(L153/L149)^(1/($D153-$D149-1))-1)","v":-5.7462442549883752E-3},{"$f":"IF(M149=0,\"\",(M155/M149)^(1/($D155-$D149-1))-1)","v":-1.6083378426567707E-2},null,{"$f":"IF(O156=0,\"\",(M155/O156)^(1/(TestYear-RebaseYear-1))-1)","v":-6.4088843444058963E-3},null,"Geometric Mean",{"$f":"IF(R149=\"\",\"\",IF(R149=0,\"\",(R153/R149)^(1/($D153-$D149-1))-1))","v":-1.1769992056503975E-3},{"$f":"IF(S149=\"\",\"\",IF(S149=0,\"\",(S155/S149)^(1/($D155-$D149-1))-1))","v":-1.1171736814979849E-2},null,{"$f":"IF(U156=0,\"\",(S155/U156)^(1/(TestYear-RebaseYear-1))-1)","v":2.1607022122506647E-2}]
[]
[]
[null,null,null,"Calendar Year",null,"Revenues",null,null,null,null,{"$f":"IF(ISBLANK(N145),\"\",CONCATENATE(\"Demand (\",N145,\")\"))","v":"Demand (kW)"},null,null,null,null,null,{"$f":"CONCATENATE(\"Demand (\",N145,\") per \",LEFT(F147,LEN(F147)-1))","v":"Demand (kW) per Customer"}]
[null,null,null,{"$f":"CONCATENATE(\"(for \",TestYear,\" Cost of Service\")","v":"(for 2018 Cost of Service"},null,null,null,null,null,null,null,"Actual (Weather actual)","Weather-normalized",null,{"$f":"M169","v":"Weather-normalized"},null,null,{"$f":"L169","v":"Actual (Weather actual)"},{"$f":"M169","v":"Weather-normalized"},null,{"$f":"O169","v":"Weather-normalized"}]
[null,null,"Historical",{"$f":"D171-1","v":2012},null,{"$f":"F149","v":"Actual"},3354046.36,{"$f":"IF(D170=RebaseYear,\"Board-approved\",\"\")","v":""},null,null,{"$f":"K149","v":"Actual"},627836,{"$f":"L170*1.04577","v":656572.05372000008},{"$f":"N149","v":""},null,null,{"$f":"K170","v":"Actual"},{"$f":"IF(G170=0,\"\",L170/G170)","v":0.18718763326813409},{"$f":"IF(G170=0,\"\",M170/G170)","v":0.19575521124281661},{"$f":"N170","v":""},{"$f":"IF(T170=\"\",\"\",IF(I170=0,\"\",O170/I170))","v":""}]
[null,null,"Historical",2013,null,"Actual",3723727,"Board-approved",3725714,null,"Actual",656137,{"$f":"L171*1.01368","v":665112.95415999996},"Board-approved",628286,null,{"$f":"K171","v":"Actual"},{"$f":"IF(G171=0,\"\",L171/G171)","v":0.17620437803308353},{"$f":"IF(G171=0,\"\",M171/G171)","v":0.1786148539245761},{"$f":"N171","v":"Board-approved"},{"$f":"IF(T171=\"\",\"\",IF(I171=0,\"\",O171/I171))","v":0.16863505894440636}]
[null,null,"Historical",2014,null,"Actual",3753660,"",null,null,"Actual",634289,{"$f":"L172*0.95873","v":608111.89296999993},"",null,null,"Actual",0.16897881001475892,0.1620050545254498,"",""]
[null,null,"Historical",2015,null,"Actual",4011125,"",null,null,"Actual",711311,{"$f":"L173*0.98231","v":698727.90841000003},"",null,null,"Actual",0.17733453831531054,0.17419749033251269,"",""]
[null,null,"Historical",2016,null,"Actual",3820758,"",null,null,"Actual",622066,{"$f":"L174*1.00801","v":627048.74866000004},"",null,null,"Actual",0.16281219590458229,0.16411632159377801,"",""]
[null,null,"Bridge Year (Forecast)",2017,null,"Actual",3797584,"",null,null,"Actual",610764,{"$f":"+L175*1.01105","v":617512.94220000005},"",null,null,"Actual",0.16082962220190522,0.16260678952723628,"",""]
[null,null,"Test Year (Forecast)",{"$f":"TestYear","v":2018},null,"Forecast",4670305,"",null,null,"Forecast",null,616309,"",null,null,"Forecast",0,0.13196333001806093,"",""]
[null,null,null,null,null,null,null,null,{"$f":"SUM(I170:I175)","v":3725714},null,null,null,null,null,{"$f":"SUM(O170:O175)","v":628286},null,null,null,null,null,{"$f":"SUM(U170:U175)","v":0.16863505894440636}]
[null,null,"Variance Analysis","Year",null,null,"Year-over-year",null,{"$f":"I157","v":"Test Year Versus Board-approved"},null,"Year","Year-over-year",null,null,{"$f":"I178","v":"Test Year Versus Board-approved"},null,"Year","Year-over-year",null,null,{"$f":"O178","v":"Test Year Versus Board-approved"}]
[null,null,null,{"$f":"D170","v":2012},null,null,null,null,null,null,{"$f":"D179","v":2012},null,null,null,null,null,{"$f":"K179","v":2012}]
[null,null,null,{"$f":"D171","v":2013},null,null,{"$f":"IF(G170=0,\"\",G171/G170-1)","v":0.1102192994136193},null,null,null,{"$f":"D180","v":2013},{"$f":"IF(L170=0,\"\",L171/L170-1)","v":4.5077058340076137E-2},{"$f":"IF(M170=0,\"\",M171/M170-1)","v":1.3008321617724805E-2},null,null,null,{"$f":"K180","v":2013},{"$f":"IF(R170=\"\",\"\",IF(R170=0,\"\",R171/R170-1))","v":-5.8675111401818691E-2},{"$f":"IF(S170=\"\",\"\",IF(S170=0,\"\",S171/S170-1))","v":-8.7560158472509086E-2}]
[null,null,null,{"$f":"D172","v":2014},null,null,{"$f":"IF(G171=0,\"\",G172/G171-1)","v":8.0384517984266601E-3},null,null,null,2014,{"$f":"IF(L171=0,\"\",L172/L171-1)","v":-3.3297924061590822E-2},-8.5701324614838037E-2,null,null,null,2014,{"$f":"IF(R171=\"\",\"\",IF(R171=0,\"\",R172/R171-1))","v":-4.1006745115992338E-2},-9.2992262592786035E-2]
[null,null,null,2015,null,null,6.8590389113558414E-2,null,null,null,2015,{"$f":"IF(L172=0,\"\",L173/L172-1)","v":0.12143045204946001},0.14901207571756947,null,null,null,2015,{"$f":"IF(R172=\"\",\"\",IF(R172=0,\"\",R173/R172-1))","v":4.9448379354913197E-2},7.5259601268474974E-2]
[null,null,null,2016,null,null,-4.7459752563183688E-2,null,null,null,2016,{"$f":"IF(L173=0,\"\",L174/L173-1)","v":-0.12546551367826453},-0.10258522507439338,null,null,null,2016,{"$f":"IF(R173=\"\",\"\",IF(R173=0,\"\",R174/R173-1))","v":-8.1892351871730273E-2},-5.78720664660064E-2]
[null,null,null,2017,null,null,-6.0652886155050378E-3,null,null,null,2017,{"$f":"IF(K175=\"Forecast\",\"\",IF(L174=0,\"\",L175/L174-1))","v":-1.8168490160208051E-2},{"$f":"IF(M174=0,\"\",M175/M174-1)","v":-1.5207440379042203E-2},null,null,null,2017,{"$f":"IF(Q175=\"Forecast\",\"\",IF(R174=0,\"\",R175/R174-1))","v":-1.2177058921550188E-2},{"$f":"IF(S174=\"\",\"\",IF(S174=0,\"\",S175/S174-1))","v":-9.1979399238433235E-3}]
[null,null,null,2018,null,null,0.22980953153373296,null,{"$f":"IF(I177=0,\"\",G176/I177-1)","v":0.25353287987215345},null,2018,{"$f":"IF(K176=\"Forecast\",\"\",IF(L175=0,\"\",L176/L175-1))","v":""},{"$f":"IF(M175=0,\"\",M176/M175-1)","v":-1.9496631045671231E-3},null,{"$f":"IF(O177=0,\"\",M176/O177-1)","v":-1.9062974505241193E-2},null,2018,{"$f":"IF(Q176=\"Forecast\",\"\",IF(R175=0,\"\",R176/R175-1))","v":""},{"$f":"IF(S175=\"\",\"\",IF(S175=0,\"\",S176/S175-1))","v":-0.18845129159900575},null,{"$f":"IF(U177=0,\"\",S176/U177-1)","v":-0.21746206960697856}]
[null,null,null,"Geometric Mean",null,null,{"$f":"IF(G170=0,\"\",(G176/G170)^(1/($D176-$D170-1))-1)","v":6.8452541606619954E-2},null,{"$f":"IF(I177=0,\"\",(G176/I177)^(1/(TestYear-RebaseYear-1))-1)","v":5.8117586036036561E-2},null,"Geometric Mean",{"$f":"IF(L170=0,\"\",(L174/L170)^(1/($D174-$D170-1))-1)","v":-3.0728655318386089E-3},{"$f":"IF(M170=0,\"\",(M176/M170)^(1/($D176-$D170-1))-1)","v":-1.2577035796400904E-2},null,{"$f":"IF(O177=0,\"\",(M176/O177)^(1/(TestYear-RebaseYear-1))-1)","v":-4.8001959756022172E-3},null,"Geometric Mean",{"$f":"IF(R170=\"\",\"\",IF(R170=0,\"\",(R174/R170)^(1/($D174-$D170-1))-1))","v":-4.543993735249241E-2},{"$f":"IF(S170=\"\",\"\",IF(S170=0,\"\",(S176/S170)^(1/($D176-$D170-1))-1))","v":-7.5838256026961703E-2},null,{"$f":"IF(U177=0,\"\",(S176/U177)^(1/(TestYear-RebaseYear-1))-1)","v":-5.9461994434232945E-2}]
[]
[null,4,"Customer Class:","Streetlighting",null,null,null,"Is the customer class billed on consumption (kWh) or demand (kW or kVA)?",null,null,null,null,null,"kW"]
[]
[null,null,null,"Calendar Year",null,"Customers",null,null,null,null,"Consumption (kWh) (3)",null,null,null,null,null,{"$f":"CONCATENATE(\"Consumption (kWh) per \",LEFT(F190,LEN(F190)-1))","v":"Consumption (kWh) per Customer"}]
[null,null,null,{"$f":"CONCATENATE(\"(for \",TestYear,\" Cost of Service\")","v":"(for 2018 Cost of Service"},null,null,null,null,null,null,null,"Actual (Weather actual)","Weather-normalized",null,"Weather-normalized",null,null,{"$f":"L191","v":"Actual (Weather actual)"},{"$f":"M191","v":"Weather-normalized"},null,{"$f":"O191","v":"Weather-normalized"}]
[null,null,"Historical",{"$f":"D193-1","v":2012},null,{"$f":"F149","v":"Actual"},8846,{"$f":"IF(D192=RebaseYear,\"Board-approved\",\"\")","v":""},null,null,{"$f":"F192","v":"Actual"},7736459,{"$f":"L192*1.04577","v":8090556.7284300011},{"$f":"H192","v":""},null,null,{"$f":"K192","v":"Actual"},{"$f":"IF(G192=0,\"\",L192/G192)","v":874.57144472077778},{"$f":"IF(G192=0,\"\",M192/G192)","v":914.60057974564791},{"$f":"N192","v":""},{"$f":"IF(T192=\"\",\"\",IF(I192=0,\"\",O192/I192))","v":""}]
[null,null,"Historical",2013,null,{"$f":"F150","v":"Actual"},8846,"Board-approved",8904,null,{"$f":"F193","v":"Actual"},8087592,{"$f":"L193*1.01368","v":8198230.2585599991},{"$f":"H193","v":"Board-approved"},7907160,null,{"$f":"K193","v":"Actual"},{"$f":"IF(G193=0,\"\",L193/G193)","v":914.26543070314267},{"$f":"IF(G193=0,\"\",M193/G193)","v":926.7725817951615},{"$f":"N193","v":"Board-approved"},{"$f":"IF(T193=\"\",\"\",IF(I193=0,\"\",O193/I193))","v":888.04582210242586}]
[null,null,"Historical",2014,null,"Actual",8846,"",null,null,"Actual",7812115,{"$f":"L194*0.95873","v":7489709.0139499996},"",null,null,"Actual",883.12401085236263,846.67748292448562,"",""]
[null,null,"Historical",2015,null,"Actual",8839,"",null,null,"Actual",7295612,{"$f":"L195*0.98231","v":7166552.6237200005},"",null,null,"Actual",825.38884489195607,810.78771622581746,"",""]
[null,null,"Historical",2016,null,"Actual",8872,"",null,null,"Actual",4869277,{"$f":"L196*1.00801","v":4908279.9087700006},"",null,null,"Actual",548.8364517583409,553.23263173692521,"",""]
[null,null,"Bridge Year",2017,null,"Actual",8070,"",null,null,"Actual",2398221,{"$f":"+L197*1.01105","v":2424721.3420500001},"",null,null,"Actual",297.17732342007434,300.46113284386621,"",""]
[null,null,"Test Year",{"$f":"TestYear","v":2018},null,"Forecast",8070,"",null,null,"Forecast",null,2398221,"",null,null,"Forecast",0,297.17732342007434,"",""]
[null,null,null,null,null,null,null,null,{"$f":"SUM(I192:I197)","v":8904},null,null,null,null,null,{"$f":"SUM(O192:O197)","v":7907160},null,null,null,null,null,{"$f":"SUM(U192:U197)","v":888.04582210242586}]
[null,null,"Variance Analysis","Year",null,null,"Year-over-year",null,"Test Year Versus Board-approved",null,"Year","Year-over-year",null,null,{"$f":"I200","v":"Test Year Versus Board-approved"},null,"Year","Year-over-year",null,null,{"$f":"O200","v":"Test Year Versus Board-approved"}]
[null,null,null,{"$f":"D192","v":2012},null,null,null,null,null,null,{"$f":"D201","v":2012},null,null,null,null,null,{"$f":"K201","v":2012}]
[null,null,null,2013,null,null,{"$f":"IF(G192=0,\"\",G193/G192-1)","v":0},null,null,null,{"$f":"D202","v":2013},{"$f":"IF(L192=0,\"\",L193/L192-1)","v":4.5386784832699201E-2},1.3308543990753652E-2,null,null,null,{"$f":"K202","v":2013},{"$f":"IF(R192=\"\",\"\",IF(R192=0,\"\",R193/R192-1))","v":4.5386784832699201E-2},{"$f":"IF(S192=\"\",\"\",IF(S192=0,\"\",S193/S192-1))","v":1.330854399075343E-2}]
[null,null,null,2014,null,null,0,null,null,null,2014,{"$f":"IF(L193=0,\"\",L194/L193-1)","v":-3.4061683625979167E-2},-8.6423681973339606E-2,null,null,null,2014,{"$f":"IF(R193=\"\",\"\",IF(R193=0,\"\",R194/R193-1))","v":-3.4061683625979167E-2},-8.6423681973339606E-2]
[null,null,null,2015,null,null,-7.9131810988020135E-4,null,null,null,2015,{"$f":"IF(L194=0,\"\",L195/L194-1)","v":-6.6115642178846579E-2},-4.3146721672110644E-2,null,null,null,2015,{"$f":"IF(R194=\"\",\"\",IF(R194=0,\"\",R195/R194-1))","v":-6.537605732708196E-2},-4.2388946703415642E-2]
[null,null,null,2016,null,null,3.7334540106346292E-3,null,null,null,2016,{"$f":"IF(L195=0,\"\",L196/L195-1)","v":-0.33257456673956898},-0.31511283507156895,null,null,null,2016,{"$f":"IF(R195=\"\",\"\",IF(R195=0,\"\",R196/R195-1))","v":-0.33505710047464488},-0.31766031889062196]
[null,null,null,2017,null,null,-9.0396753832281296E-2,null,null,null,2017,{"$f":"IF(K197=\"Forecast\",\"\",IF(L196=0,\"\",L197/L196-1))","v":-0.50747903641546777},{"$f":"IF(M196=0,\"\",M197/M196-1)","v":-0.50599367046741484},null,null,null,2017,{"$f":"IF(Q197=\"Forecast\",\"\",IF(R196=0,\"\",R197/R196-1))","v":-0.45853209554870278},{"$f":"IF(S196=\"\",\"\",IF(S196=0,\"\",S197/S196-1))","v":-0.45689911330692734}]
[null,null,null,2018,null,null,0,null,{"$f":"IF(I199=0,\"\",G198/I199-1)","v":-9.3665768194070131E-2},null,2018,{"$f":"IF(K198=\"Forecast\",\"\",IF(L197=0,\"\",L198/L197-1))","v":""},{"$f":"IF(M197=0,\"\",M198/M197-1)","v":-1.0929231986548715E-2},null,{"$f":"IF(O199=0,\"\",M198/O199-1)","v":-0.69670260877483192},null,2018,{"$f":"IF(Q198=\"Forecast\",\"\",IF(R197=0,\"\",R198/R197-1))","v":""},{"$f":"IF(S197=\"\",\"\",IF(S197=0,\"\",S198/S197-1))","v":-1.0929231986548826E-2},null,{"$f":"IF(U199=0,\"\",S198/U199-1)","v":-0.66535812001624572}]
[null,null,null,"Geometric Mean",null,null,{"$f":"IF(G192=0,\"\",(G198/G192)^(1/($D198-$D192-1))-1)","v":-1.8194818119236844E-2},null,{"$f":"IF(I199=0,\"\",(G198/I199)^(1/(TestYear-RebaseYear-1))-1)","v":-2.4286989982749474E-2},null,"Geometric Mean",{"$f":"IF(L192=0,\"\",(L196/L192)^(1/($D196-$D192-1))-1)","v":-0.14301329542689534},{"$f":"IF(M192=0,\"\",(M198/M192)^(1/($D198-$D192-1))-1)","v":-0.21588067237866104},null,{"$f":"IF(O199=0,\"\",(M198/O199)^(1/(TestYear-RebaseYear-1))-1)","v":-0.25789190542629892},null,"Geometric Mean",{"$f":"IF(R192=\"\",\"\",IF(R192=0,\"\",(R196/R192)^(1/($D196-$D192-1))-1))","v":-0.14385126716545904},{"$f":"IF(S192=\"\",\"\",IF(S192=0,\"\",(S198/S192)^(1/($D198-$D192-1))-1))","v":-0.20134936941434123},null,{"$f":"IF(U199=0,\"\",(S198/U199)^(1/(TestYear-RebaseYear-1))-1)","v":-0.23941969928167639}]
[]
[]
[null,null,null,"Calendar Year",null,"Revenues",null,null,null,null,{"$f":"IF(ISBLANK(N188),\"\",CONCATENATE(\"Demand (\",N188,\")\"))","v":"Demand (kW)"},null,null,null,null,null,{"$f":"CONCATENATE(\"Demand (\",N188,\") per \",LEFT(F190,LEN(F190)-1))","v":"Demand (kW) per Customer"}]
[null,null,null,{"$f":"CONCATENATE(\"(for \",TestYear,\" Cost of Service\")","v":"(for 2018 Cost of Service"},null,null,null,null,null,null,null,"Actual (Weather actual)","Weather-normalized",null,{"$f":"M212","v":"Weather-normalized"},null,null,{"$f":"L212","v":"Actual (Weather actual)"},{"$f":"M212","v":"Weather-normalized"},null,{"$f":"O212","v":"Weather-normalized"}]
[null,null,"Historical",{"$f":"D214-1","v":2012},null,{"$f":"F192","v":"Actual"},597512.80000000005,{"$f":"IF(D213=RebaseYear,\"Board-approved\",\"\")","v":""},null,null,{"$f":"K192","v":"Actual"},21596,{"$f":"L213*1.04577","v":22584.448920000003},{"$f":"N192","v":""},null,null,{"$f":"K213","v":"Actual"},{"$f":"IF(G213=0,\"\",L213/G213)","v":3.6143158774171867E-2},{"$f":"IF(G213=0,\"\",M213/G213)","v":3.7797431151265715E-2},{"$f":"N213","v":""},{"$f":"IF(T213=\"\",\"\",IF(I213=0,\"\",O213/I213))","v":""}]
[null,null,"Historical",2013,null,"Actual",663166,"Board-approved",720198,null,"Actual",21588,{"$f":"L214*1.01368","v":21883.323839999997},"Board-approved",22680,null,{"$f":"K214","v":"Actual"},{"$f":"IF(G214=0,\"\",L214/G214)","v":3.2552935464122107E-2},{"$f":"IF(G214=0,\"\",M214/G214)","v":3.2998259621271293E-2},{"$f":"N214","v":"Board-approved"},{"$f":"IF(T214=\"\",\"\",IF(I214=0,\"\",O214/I214))","v":3.1491339881532576E-2}]
[null,null,"Historical",2014,null,"Actual",702906,"",null,null,"Actual",21876,{"$f":"L215*0.95873","v":20973.177479999998},"",null,null,"Actual",3.1122226869595648E-2,2.9837812566687435E-2,"",""]
[null,null,"Historical",2015,null,"Actual",727781,"",null,null,"Actual",21794,{"$f":"L216*0.98231","v":21408.46414},"",null,null,"Actual",2.9945821613919572E-2,2.9416080029569334E-2,"",""]
[null,null,"Historical",2016,null,"Actual",577771,"",null,null,"Actual",14262,{"$f":"L217*1.00801","v":14376.238620000002},"",null,null,"Actual",2.4684520337642422E-2,2.488224334554694E-2,"",""]
[null,null,"Bridge Year (Forecast)",2017,null,"Actual",456676,"",null,null,"Actual",7030,{"$f":"+L218*1.01105","v":7107.6814999999997},"",null,null,"Actual",1.5393845965191952E-2,1.5563947963107323E-2,"",""]
[null,null,"Test Year (Forecast)",{"$f":"TestYear","v":2018},null,"Forecast",203298,"",null,null,"Forecast",null,7030,"",null,null,"Forecast",0,3.4579779437082507E-2,"",""]
[null,null,null,null,null,null,null,null,{"$f":"SUM(I213:I218)","v":720198},null,null,null,null,null,{"$f":"SUM(O213:O218)","v":22680},null,null,null,null,null,{"$f":"SUM(U213:U218)","v":3.1491339881532576E-2}]
[null,null,"Variance Analysis","Year",null,null,"Year-over-year",null,{"$f":"I200","v":"Test Year Versus Board-approved"},null,"Year","Year-over-year",null,null,{"$f":"I221","v":"Test Year Versus Board-approved"},null,"Year","Year-over-year",null,null,{"$f":"O221","v":"Test Year Versus Board-approved"}]
[null,null,null,{"$f":"D213","v":2012},null,null,null,null,null,null,{"$f":"D222","v":2012},null,null,null,null,null,{"$f":"K222","v":2012}]
[null,null,null,{"$f":"D214","v":2013},null,null,{"$f":"IF(G213=0,\"\",G214/G213-1)","v":0.10987747877535003},null,null,null,{"$f":"D223","v":2013},{"$f":"IF(L213=0,\"\",L214/L213-1)","v":-3.7043897017963179E-4},{"$f":"IF(M213=0,\"\",M214/M213-1)","v":-3.1044595441915512E-2},null,null,null,{"$f":"K223","v":2013},{"$f":"IF(R213=\"\",\"\",IF(R213=0,\"\",R214/R213-1))","v":-9.9333412790012066E-2},{"$f":"IF(S213=\"\",\"\",IF(S213=0,\"\",S214/S213-1))","v":-0.12697083859450886}]
[null,null,null,{"$f":"D215","v":2014},null,null,{"$f":"IF(G214=0,\"\",G215/G214-1)","v":5.992466441283173E-2},null,null,null,2014,{"$f":"IF(L214=0,\"\",L215/L214-1)","v":1.3340744858254538E-2},-4.1590864653584525E-2,null,null,null,2014,{"$f":"IF(R214=\"\",\"\",IF(R214=0,\"\",R215/R214-1))","v":-4.3950217518887058E-2},-9.5776173981811263E-2]
[null,null,null,2015,null,null,3.538880020941626E-2,null,null,null,2015,{"$f":"IF(L215=0,\"\",L216/L215-1)","v":-3.7484000731394795E-3},2.0754445072287631E-2,null,null,null,2015,{"$f":"IF(R215=\"\",\"\",IF(R215=0,\"\",R216/R215-1))","v":-3.7799520600029668E-2},-1.4134164030138896E-2]
[null,null,null,2016,null,null,-0.20611969809599318,null,null,null,2016,{"$f":"IF(L216=0,\"\",L217/L216-1)","v":-0.34559970634119486},-0.32847874905985652,null,null,null,2016,{"$f":"IF(R216=\"\",\"\",IF(R216=0,\"\",R217/R216-1))","v":-0.17569400312701933},-0.15412783346608172]
[null,null,null,2017,null,null,-0.20958995865143804,null,null,null,2017,{"$f":"IF(K218=\"Forecast\",\"\",IF(L217=0,\"\",L218/L217-1))","v":-0.50708175571448599},{"$f":"IF(M217=0,\"\",M218/M217-1)","v":-0.50559519163017352},null,null,null,2017,{"$f":"IF(Q218=\"Forecast\",\"\",IF(R217=0,\"\",R218/R217-1))","v":-0.37637654065664572},{"$f":"IF(S217=\"\",\"\",IF(S217=0,\"\",S218/S217-1))","v":-0.37449579015178591}]
[null,null,null,2018,null,null,-0.55483099615482312,null,{"$f":"IF(I220=0,\"\",G219/I220-1)","v":-0.71771929386085498},null,2018,{"$f":"IF(K219=\"Forecast\",\"\",IF(L218=0,\"\",L219/L218-1))","v":""},{"$f":"IF(M218=0,\"\",M219/M218-1)","v":-1.0929231986548604E-2},null,{"$f":"IF(O220=0,\"\",M219/O220-1)","v":-0.69003527336860671},null,2018,{"$f":"IF(Q219=\"Forecast\",\"\",IF(R218=0,\"\",R219/R218-1))","v":""},{"$f":"IF(S218=\"\",\"\",IF(S218=0,\"\",S219/S218-1))","v":1.2217871403226344},null,{"$f":"IF(U220=0,\"\",S219/U220-1)","v":9.8072662743736716E-2}]
[null,null,null,"Geometric Mean",null,null,{"$f":"IF(G213=0,\"\",(G219/G213)^(1/($D219-$D213-1))-1)","v":-0.19395891566363155},null,{"$f":"IF(I220=0,\"\",(G219/I220)^(1/(TestYear-RebaseYear-1))-1)","v":-0.27109605826598038},null,"Geometric Mean",{"$f":"IF(L213=0,\"\",(L217/L213)^(1/($D217-$D213-1))-1)","v":-0.12916534317849848},{"$f":"IF(M213=0,\"\",(M219/M213)^(1/($D219-$D213-1))-1)","v":-0.2081750802635659},null,{"$f":"IF(O220=0,\"\",(M219/O220)^(1/(TestYear-RebaseYear-1))-1)","v":-0.25384669205198551},null,"Geometric Mean",{"$f":"IF(R213=\"\",\"\",IF(R213=0,\"\",(R217/R213)^(1/($D217-$D213-1))-1))","v":-0.11935772666102396},{"$f":"IF(S213=\"\",\"\",IF(S213=0,\"\",(S219/S213)^(1/($D219-$D213-1))-1))","v":-1.7637022325777463E-2},null,{"$f":"IF(U220=0,\"\",(S219/U220)^(1/(TestYear-RebaseYear-1))-1)","v":2.3664800293108135E-2}]
[]
[null,5,"Customer Class:","Unmetered Scattered Load",null,null,null,"Is the customer class billed on consumption (kWh) or demand (kW or kVA)?",null,null,null,null,null,"kWh"]
[]
[null,null,null,"Calendar Year",null,"Customers",null,null,null,null,"Consumption (kWh) (3)",null,null,null,null,null,{"$f":"CONCATENATE(\"Consumption (kWh) per \",LEFT(F233,LEN(F233)-1))","v":"Consumption (kWh) per Customer"}]
[null,null,null,{"$f":"CONCATENATE(\"(for \",TestYear,\" Cost of Service\")","v":"(for 2018 Cost of Service"},null,null,null,null,null,null,null,"Actual (Weather actual)","Weather-normalized",null,"Weather-normalized",null,null,{"$f":"L234","v":"Actual (Weather actual)"},{"$f":"M234","v":"Weather-normalized"},null,{"$f":"O234","v":"Weather-normalized"}]
[null,null,"Historical",{"$f":"D236-1","v":2012},null,{"$f":"F192","v":"Actual"},21,{"$f":"IF(D235=RebaseYear,\"Board-approved\",\"\")","v":""},null,null,{"$f":"F235","v":"Actual"},861992,{"$f":"L235*1.04577","v":901445.37384000013},{"$f":"H235","v":""},null,null,{"$f":"K235","v":"Actual"},{"$f":"IF(G235=0,\"\",L235/G235)","v":41047.238095238092},{"$f":"IF(G235=0,\"\",M235/G235)","v":42925.970182857149},{"$f":"N235","v":""},{"$f":"IF(T235=\"\",\"\",IF(I235=0,\"\",O235/I235))","v":""}]
[null,null,"Historical",2013,null,{"$f":"F193","v":"Actual"},21,"Board-approved",21,null,{"$f":"F236","v":"Actual"},857423,{"$f":"L236*1.01368","v":869152.54663999996},{"$f":"H236","v":"Board-approved"},872889,null,{"$f":"K236","v":"Actual"},{"$f":"IF(G236=0,\"\",L236/G236)","v":40829.666666666664},{"$f":"IF(G236=0,\"\",M236/G236)","v":41388.216506666664},{"$f":"N236","v":"Board-approved"},{"$f":"IF(T236=\"\",\"\",IF(I236=0,\"\",O236/I236))","v":41566.142857142855}]
[null,null,"Historical",2014,null,"Actual",21,"",null,null,"Actual",876024,{"$f":"L237*0.95873","v":839870.48951999994},"",null,null,"Actual",41715.428571428572,39993.832834285713,"",""]
[null,null,"Historical",2015,null,"Actual",21,"",null,null,"Actual",912709,{"$f":"L238*0.98231","v":896563.17778999999},"",null,null,"Actual",43462.333333333336,42693.484656666667,"",""]
[null,null,"Historical",2016,null,"Actual",21,"",null,null,"Actual",903251,{"$f":"L239*1.00801","v":910486.04051000008},"",null,null,"Actual",43011.952380952382,43356.47811952381,"",""]
[null,null,"Bridge Year",2017,null,"Actual",21,"",null,null,"Actual",907713,{"$f":"+L240*1.01105","v":917743.22864999995},"",null,null,"Actual",43224.428571428572,43702.058507142858,"",""]
[null,null,"Test Year",{"$f":"TestYear","v":2018},null,"Forecast",22,"",null,null,"Forecast",null,944731,"",null,null,"Forecast",0,42942.318181818184,"",""]
[null,null,null,null,null,null,null,null,{"$f":"SUM(I235:I240)","v":21},null,null,null,null,null,{"$f":"SUM(O235:O240)","v":872889},null,null,null,null,null,{"$f":"SUM(U235:U240)","v":41566.142857142855}]
[null,null,"Variance Analysis","Year",null,null,"Year-over-year",null,"Test Year Versus Board-approved",null,"Year","Year-over-year",null,null,{"$f":"I243","v":"Test Year Versus Board-approved"},null,"Year","Year-over-year",null,null,{"$f":"O243","v":"Test Year Versus Board-approved"}]
[null,null,null,{"$f":"D235","v":2012},null,null,null,null,null,null,{"$f":"D244","v":2012},null,null,null,null,null,{"$f":"K244","v":2012}]
[null,null,null,2013,null,null,{"$f":"IF(G235=0,\"\",G236/G235-1)","v":0},null,null,null,{"$f":"D245","v":2013},{"$f":"IF(L235=0,\"\",L236/L235-1)","v":-5.3005132298211688E-3},-3.5823387791584449E-2,null,null,null,{"$f":"K245","v":2013},{"$f":"IF(R235=\"\",\"\",IF(R235=0,\"\",R236/R235-1))","v":-5.3005132298211688E-3},{"$f":"IF(S235=\"\",\"\",IF(S235=0,\"\",S236/S235-1))","v":-3.5823387791584449E-2}]
[null,null,null,2014,null,null,0,null,null,null,2014,{"$f":"IF(L236=0,\"\",L237/L236-1)","v":2.1694076319389577E-2},-3.369035416532995E-2,null,null,null,2014,{"$f":"IF(R236=\"\",\"\",IF(R236=0,\"\",R237/R236-1))","v":2.1694076319389799E-2},-3.3690354165329839E-2]
[null,null,null,2015,null,null,0,null,null,null,2015,{"$f":"IF(L237=0,\"\",L238/L237-1)","v":4.1876706574249134E-2},6.750170291422064E-2,null,null,null,2015,{"$f":"IF(R237=\"\",\"\",IF(R237=0,\"\",R238/R237-1))","v":4.1876706574249134E-2},6.750170291422064E-2]
[null,null,null,2016,null,null,0,null,null,null,2016,{"$f":"IF(L238=0,\"\",L239/L238-1)","v":-1.0362558055196147E-2},1.5529148491598255E-2,null,null,null,2016,{"$f":"IF(R238=\"\",\"\",IF(R238=0,\"\",R239/R238-1))","v":-1.0362558055196147E-2},1.5529148491598033E-2]
[null,null,null,2017,null,null,0,null,null,null,2017,{"$f":"IF(K240=\"Forecast\",\"\",IF(L239=0,\"\",L240/L239-1))","v":4.9399336397080162E-3},{"$f":"IF(M239=0,\"\",M240/M239-1)","v":7.9706748012686734E-3},null,null,null,2017,{"$f":"IF(Q240=\"Forecast\",\"\",IF(R239=0,\"\",R240/R239-1))","v":4.9399336397082383E-3},{"$f":"IF(S239=\"\",\"\",IF(S239=0,\"\",S240/S239-1))","v":7.9706748012686734E-3}]
[null,null,null,2018,null,null,4.7619047619047672E-2,null,{"$f":"IF(I242=0,\"\",G241/I242-1)","v":4.7619047619047672E-2},null,2018,{"$f":"IF(K241=\"Forecast\",\"\",IF(L240=0,\"\",L241/L240-1))","v":""},{"$f":"IF(M240=0,\"\",M241/M240-1)","v":2.9406668997927765E-2},null,{"$f":"IF(O242=0,\"\",M241/O242-1)","v":8.2303706427735879E-2},null,2018,{"$f":"IF(Q241=\"Forecast\",\"\",IF(R240=0,\"\",R241/R240-1))","v":""},{"$f":"IF(S240=\"\",\"\",IF(S240=0,\"\",S241/S240-1))","v":-1.7384543229250871E-2},null,{"$f":"IF(U242=0,\"\",S241/U242-1)","v":3.310808340829352E-2}]
[null,null,null,"Geometric Mean",null,null,{"$f":"IF(G235=0,\"\",(G241/G235)^(1/($D241-$D235-1))-1)","v":9.3474199095688881E-3},null,{"$f":"IF(I242=0,\"\",(G241/I242)^(1/(TestYear-RebaseYear-1))-1)","v":1.1697895341449271E-2},null,"Geometric Mean",{"$f":"IF(L235=0,\"\",(L239/L235)^(1/($D239-$D235-1))-1)","v":1.5706905893797085E-2},{"$f":"IF(M235=0,\"\",(M241/M235)^(1/($D241-$D235-1))-1)","v":9.4242885156707867E-3},null,{"$f":"IF(O242=0,\"\",(M241/O242)^(1/(TestYear-RebaseYear-1))-1)","v":1.9969737485708627E-2},null,"Geometric Mean",{"$f":"IF(R235=\"\",\"\",IF(R235=0,\"\",(R239/R235)^(1/($D239-$D235-1))-1))","v":1.5706905893797085E-2},{"$f":"IF(S235=\"\",\"\",IF(S235=0,\"\",(S241/S235)^(1/($D241-$D235-1))-1))","v":7.6156737101262806E-5},null,{"$f":"IF(U242=0,\"\",(S241/U242)^(1/(TestYear-RebaseYear-1))-1)","v":8.1761978376635458E-3}]
[]
[]
[null,null,null,"Calendar Year",null,"Revenues",null,null,null,null,{"$f":"IF(ISBLANK(N231),\"\",CONCATENATE(\"Demand (\",N231,\")\"))","v":"Demand (kWh)"},null,null,null,null,null,{"$f":"CONCATENATE(\"Demand (\",N231,\") per \",LEFT(F233,LEN(F233)-1))","v":"Demand (kWh) per Customer"}]
[null,null,null,{"$f":"CONCATENATE(\"(for \",TestYear,\" Cost of Service\")","v":"(for 2018 Cost of Service"},null,null,null,null,null,null,null,"Actual (Weather actual)","Weather-normalized",null,{"$f":"M255","v":"Weather-normalized"},null,null,{"$f":"L255","v":"Actual (Weather actual)"},{"$f":"M255","v":"Weather-normalized"},null,{"$f":"O255","v":"Weather-normalized"}]
[null,null,"Historical",{"$f":"D257-1","v":2012},null,{"$f":"F235","v":"Actual"},17125.009999999998,{"$f":"IF(D256=RebaseYear,\"Board-approved\",\"\")","v":""},null,null,{"$f":"K235","v":"Actual"},null,null,{"$f":"N235","v":""},null,null,{"$f":"K256","v":"Actual"},{"$f":"IF(G256=0,\"\",L256/G256)","v":0},{"$f":"IF(G256=0,\"\",M256/G256)","v":0},{"$f":"N256","v":""},{"$f":"IF(T256=\"\",\"\",IF(I256=0,\"\",O256/I256))","v":""}]
[null,null,"Historical",2013,null,"Actual",27443,"Board-approved",29206,null,"Actual",null,null,"Board-approved",null,null,{"$f":"K257","v":"Actual"},{"$f":"IF(G257=0,\"\",L257/G257)","v":0},{"$f":"IF(G257=0,\"\",M257/G257)","v":0},{"$f":"N257","v":"Board-approved"},{"$f":"IF(T257=\"\",\"\",IF(I257=0,\"\",O257/I257))","v":0}]
[null,null,"Historical",2014,null,"Actual",29446,"",null,null,"Actual",null,null,"",null,null,"Actual",0,0,"",""]
[null,null,"Historical",2015,null,"Actual",30919,"",null,null,"Actual",null,null,"",null,null,"Actual",0,0,"",""]
[null,null,"Historical",2016,null,"Actual",30762,"",null,null,"Actual",null,null,"",null,null,"Actual",0,0,"",""]
[null,null,"Bridge Year (Forecast)",2017,null,"Actual",31815,"",null,null,"Actual",null,null,"",null,null,"Actual",0,0,"",""]
[null,null,"Test Year (Forecast)",{"$f":"TestYear","v":2018},null,"Forecast",47454,"",null,null,"Forecast",null,null,"",null,null,"Forecast",0,0,"",""]
[null,null,null,null,null,null,null,null,{"$f":"SUM(I256:I261)","v":29206},null,null,null,null,null,{"$f":"SUM(O256:O261)","v":0},null,null,null,null,null,{"$f":"SUM(U256:U261)","v":0}]
[null,null,"Variance Analysis","Year",null,null,"Year-over-year",null,{"$f":"I243","v":"Test Year Versus Board-approved"},null,"Year","Year-over-year",null,null,{"$f":"I264","v":"Test Year Versus Board-approved"},null,"Year","Year-over-year",null,null,{"$f":"O264","v":"Test Year Versus Board-approved"}]
[null,null,null,{"$f":"D256","v":2012},null,null,null,null,null,null,{"$f":"D265","v":2012},null,null,null,null,null,{"$f":"K265","v":2012}]
[null,null,null,{"$f":"D257","v":2013},null,null,{"$f":"IF(G256=0,\"\",G257/G256-1)","v":0.60251001313283914},null,null,null,{"$f":"D266","v":2013},{"$f":"IF(L256=0,\"\",L257/L256-1)","v":""},{"$f":"IF(M256=0,\"\",M257/M256-1)","v":""},null,null,null,{"$f":"K266","v":2013},{"$f":"IF(R256=\"\",\"\",IF(R256=0,\"\",R257/R256-1))","v":""},{"$f":"IF(S256=\"\",\"\",IF(S256=0,\"\",S257/S256-1))","v":""}]
[null,null,null,{"$f":"D258","v":2014},null,null,{"$f":"IF(G257=0,\"\",G258/G257-1)","v":7.2987647123127886E-2},null,null,null,2014,{"$f":"IF(L257=0,\"\",L258/L257-1)","v":""},"",null,null,null,2014,{"$f":"IF(R257=\"\",\"\",IF(R257=0,\"\",R258/R257-1))","v":""},""]
[null,null,null,2015,null,null,5.002377232900912E-2,null,null,null,2015,{"$f":"IF(L258=0,\"\",L259/L258-1)","v":""},"",null,null,null,2015,{"$f":"IF(R258=\"\",\"\",IF(R258=0,\"\",R259/R258-1))","v":""},""]
[null,null,null,2016,null,null,-5.0777838869303649E-3,null,null,null,2016,{"$f":"IF(L259=0,\"\",L260/L259-1)","v":""},"",null,null,null,2016,{"$f":"IF(R259=\"\",\"\",IF(R259=0,\"\",R260/R259-1))","v":""},""]
[null,null,null,2017,null,null,3.423054417788185E-2,null,null,null,2017,{"$f":"IF(K261=\"Forecast\",\"\",IF(L260=0,\"\",L261/L260-1))","v":""},{"$f":"IF(M260=0,\"\",M261/M260-1)","v":""},null,null,null,2017,{"$f":"IF(Q261=\"Forecast\",\"\",IF(R260=0,\"\",R261/R260-1))","v":""},{"$f":"IF(S260=\"\",\"\",IF(S260=0,\"\",S261/S260-1))","v":""}]
[null,null,null,2018,null,null,0.49156058462989161,null,{"$f":"IF(I263=0,\"\",G262/I263-1)","v":0.62480312264603155},null,2018,{"$f":"IF(K262=\"Forecast\",\"\",IF(L261=0,\"\",L262/L261-1))","v":""},{"$f":"IF(M261=0,\"\",M262/M261-1)","v":""},null,{"$f":"IF(O263=0,\"\",M262/O263-1)","v":""},null,2018,{"$f":"IF(Q262=\"Forecast\",\"\",IF(R261=0,\"\",R262/R261-1))","v":""},{"$f":"IF(S261=\"\",\"\",IF(S261=0,\"\",S262/S261-1))","v":""},null,{"$f":"IF(U263=0,\"\",S262/U263-1)","v":""}]
[null,null,null,"Geometric Mean",null,null,{"$f":"IF(G256=0,\"\",(G262/G256)^(1/($D262-$D256-1))-1)","v":0.22610707495939342},null,{"$f":"IF(I263=0,\"\",(G262/I263)^(1/(TestYear-RebaseYear-1))-1)","v":0.12901623301332044},null,"Geometric Mean",{"$f":"IF(L256=0,\"\",(L260/L256)^(1/($D260-$D256-1))-1)","v":""},{"$f":"IF(M256=0,\"\",(M262/M256)^(1/($D262-$D256-1))-1)","v":""},null,{"$f":"IF(O263=0,\"\",(M262/O263)^(1/(TestYear-RebaseYear-1))-1)","v":""},null,"Geometric Mean",{"$f":"IF(R256=\"\",\"\",IF(R256=0,\"\",(R260/R256)^(1/($D260-$D256-1))-1))","v":""},{"$f":"IF(S256=\"\",\"\",IF(S256=0,\"\",(S262/S256)^(1/($D262-$D256-1))-1))","v":""},null,{"$f":"IF(U263=0,\"\",(S262/U263)^(1/(TestYear-RebaseYear-1))-1)","v":""}]
[]
[null,{"$f":"B231+1","v":6},"Customer Class:","Sentinel",null,null,null,"Is the customer class billed on consumption (kWh) or demand (kW or kVA)?",null,null,null,null,null,"kW"]
[]
[null,null,null,"Calendar Year",null,"Customers",null,null,null,null,"Consumption (kWh) (3)",null,null,null,null,null,{"$f":"CONCATENATE(\"Consumption (kWh) per \",LEFT(F276,LEN(F276)-1))","v":"Consumption (kWh) per Customer"}]
[null,null,null,{"$f":"CONCATENATE(\"(for \",TestYear,\" Cost of Service\")","v":"(for 2018 Cost of Service"},null,null,null,null,null,null,null,"Actual (Weather actual)","Weather-normalized",null,"Weather-normalized",null,null,{"$f":"L277","v":"Actual (Weather actual)"},{"$f":"M277","v":"Weather-normalized"},null,{"$f":"O277","v":"Weather-normalized"}]
[null,null,"Historical",{"$f":"D279-1","v":2012},null,{"$f":"F235","v":"Actual"},392,{"$f":"IF(D278=RebaseYear,\"Board-approved\",\"\")","v":""},null,null,{"$f":"F278","v":"Actual"},246512,{"$f":"L278*1.04577","v":257794.85424000002},{"$f":"H278","v":""},null,null,{"$f":"K278","v":"Actual"},{"$f":"IF(G278=0,\"\",L278/G278)","v":628.85714285714289},{"$f":"IF(G278=0,\"\",M278/G278)","v":657.63993428571428},{"$f":"N278","v":""},{"$f":"IF(T278=\"\",\"\",IF(I278=0,\"\",O278/I278))","v":""}]
[null,null,"Historical",2013,null,{"$f":"F236","v":"Actual"},374,"Board-approved",387,null,{"$f":"F279","v":"Actual"},237315,{"$f":"L279*1.01368","v":240561.46919999999},{"$f":"H279","v":"Board-approved"},254165,null,{"$f":"K279","v":"Actual"},{"$f":"IF(G279=0,\"\",L279/G279)","v":634.5320855614973},{"$f":"IF(G279=0,\"\",M279/G279)","v":643.21248449197856},{"$f":"N279","v":"Board-approved"},{"$f":"IF(T279=\"\",\"\",IF(I279=0,\"\",O279/I279))","v":656.75710594315251}]
[null,null,"Historical",2014,null,"Actual",362,"",null,null,"Actual",243349,{"$f":"L280*0.95873","v":233305.98676999999},"",null,null,"Actual",672.23480662983422,644.491676160221,"",""]
[null,null,"Historical",2015,null,"Actual",360,"",null,null,"Actual",235238,{"$f":"L281*0.98231","v":231076.63978},"",null,null,"Actual",653.43888888888887,641.87955494444441,"",""]
[null,null,"Historical",2016,null,"Actual",362,"",null,null,"Actual",227056,{"$f":"L282*1.00801","v":228874.71856000001},"",null,null,"Actual",627.22651933701661,632.25060375690612,"",""]
[null,null,"Bridge Year",2017,null,"Actual",361,"",null,null,"Actual",213661,{"$f":"+L283*1.01105","v":216021.95405},"",null,null,"Actual",591.8587257617728,598.39876468144041,"",""]
[null,null,"Test Year",{"$f":"TestYear","v":2018},null,"Forecast",354,"",null,null,"Forecast",null,209800,"",null,null,"Forecast",0,592.65536723163837,"",""]
[null,null,null,null,null,null,null,null,{"$f":"SUM(I278:I283)","v":387},null,null,null,null,null,{"$f":"SUM(O278:O283)","v":254165},null,null,null,null,null,{"$f":"SUM(U278:U283)","v":656.75710594315251}]
[null,null,"Variance Analysis","Year",null,null,"Year-over-year",null,"Test Year Versus Board-approved",null,"Year","Year-over-year",null,null,{"$f":"I286","v":"Test Year Versus Board-approved"},null,"Year","Year-over-year",null,null,{"$f":"O286","v":"Test Year Versus Board-approved"}]
[null,null,null,{"$f":"D278","v":2012},null,null,null,null,null,null,{"$f":"D287","v":2012},null,null,null,null,null,{"$f":"K287","v":2012}]
[null,null,null,2013,null,null,{"$f":"IF(G278=0,\"\",G279/G278-1)","v":-4.5918367346938771E-2},null,null,null,{"$f":"D288","v":2013},{"$f":"IF(L278=0,\"\",L279/L278-1)","v":-3.7308528590900281E-2},-6.6849220442376289E-2,null,null,null,{"$f":"K288","v":2013},{"$f":"IF(R278=\"\",\"\",IF(R278=0,\"\",R279/R278-1))","v":9.0242160223719114E-3},{"$f":"IF(S278=\"\",\"\",IF(S278=0,\"\",S279/S278-1))","v":-2.1938220356715221E-2}]
[null,null,null,2014,null,null,-3.208556149732622E-2,null,null,null,2014,{"$f":"IF(L279=0,\"\",L280/L279-1)","v":2.5426121399827251E-2},-3.0160617384523358E-2,null,null,null,2014,{"$f":"IF(R279=\"\",\"\",IF(R279=0,\"\",R280/R279-1))","v":5.9418147523578435E-2},1.9887544148848857E-3]
[null,null,null,2015,null,null,-5.5248618784530246E-3,null,null,null,2015,{"$f":"IF(L280=0,\"\",L281/L280-1)","v":-3.3330730761170213E-2},-9.5554641390225292E-3,null,null,null,2015,{"$f":"IF(R280=\"\",\"\",IF(R280=0,\"\",R281/R280-1))","v":-2.7960345932065533E-2},-4.0529944953504593E-3]
[null,null,null,2016,null,null,5.5555555555555358E-3,null,null,null,2016,{"$f":"IF(L281=0,\"\",L282/L281-1)","v":-3.4781795458216802E-2},-9.5289650312396779E-3,null,null,null,2016,{"$f":"IF(R281=\"\",\"\",IF(R281=0,\"\",R282/R281-1))","v":-4.0114492720878525E-2},-1.5001180694050431E-2]
[null,null,null,2017,null,null,-2.7624309392265678E-3,null,null,null,2017,{"$f":"IF(K283=\"Forecast\",\"\",IF(L282=0,\"\",L283/L282-1))","v":-5.8994256923402211E-2},{"$f":"IF(M282=0,\"\",M283/M282-1)","v":-5.6156331249100466E-2},null,null,null,2017,{"$f":"IF(Q283=\"Forecast\",\"\",IF(R282=0,\"\",R283/R282-1))","v":-5.6387592815156817E-2},{"$f":"IF(S282=\"\",\"\",IF(S282=0,\"\",S283/S282-1))","v":-5.3541805850898627E-2}]
[null,null,null,2018,null,null,-1.939058171745156E-2,null,{"$f":"IF(I285=0,\"\",G284/I285-1)","v":-8.5271317829457405E-2},null,2018,{"$f":"IF(K284=\"Forecast\",\"\",IF(L283=0,\"\",L284/L283-1))","v":""},{"$f":"IF(M283=0,\"\",M284/M283-1)","v":-2.8802415371911083E-2},null,{"$f":"IF(O285=0,\"\",M284/O285-1)","v":-0.17455196427517561},null,2018,{"$f":"IF(Q284=\"Forecast\",\"\",IF(R283=0,\"\",R284/R283-1))","v":""},{"$f":"IF(S283=\"\",\"\",IF(S283=0,\"\",S284/S283-1))","v":-9.5979433594913788E-3},null,{"$f":"IF(U285=0,\"\",S284/U285-1)","v":-9.7603418572014156E-2}]
[null,null,null,"Geometric Mean",null,null,{"$f":"IF(G278=0,\"\",(G284/G278)^(1/($D284-$D278-1))-1)","v":-2.0186454713862934E-2},null,{"$f":"IF(I285=0,\"\",(G284/I285)^(1/(TestYear-RebaseYear-1))-1)","v":-2.2035535988472854E-2},null,"Geometric Mean",{"$f":"IF(L278=0,\"\",(L282/L278)^(1/($D282-$D278-1))-1)","v":-2.7032562638164448E-2},{"$f":"IF(M278=0,\"\",(M284/M278)^(1/($D284-$D278-1))-1)","v":-4.0364627336976211E-2},null,{"$f":"IF(O285=0,\"\",(M284/O285)^(1/(TestYear-RebaseYear-1))-1)","v":-4.6825457588024144E-2},null,"Geometric Mean",{"$f":"IF(R278=\"\",\"\",IF(R278=0,\"\",(R282/R278)^(1/($D282-$D278-1))-1))","v":-8.6507986332562403E-4},{"$f":"IF(S278=\"\",\"\",IF(S278=0,\"\",(S284/S278)^(1/($D284-$D278-1))-1))","v":-2.0593890256151326E-2},null,{"$f":"IF(U285=0,\"\",(S284/U285)^(1/(TestYear-RebaseYear-1))-1)","v":-2.5348489144344954E-2}]
[]
[]
[null,null,null,"Calendar Year",null,"Revenues",null,null,null,null,{"$f":"IF(ISBLANK(N274),\"\",CONCATENATE(\"Demand (\",N274,\")\"))","v":"Demand (kW)"},null,null,null,null,null,{"$f":"CONCATENATE(\"Demand (\",N274,\") per \",LEFT(F276,LEN(F276)-1))","v":"Demand (kW) per Customer"}]
[null,null,null,{"$f":"CONCATENATE(\"(for \",TestYear,\" Cost of Service\")","v":"(for 2018 Cost of Service"},null,null,null,null,null,null,null,"Actual (Weather actual)","Weather-normalized",null,{"$f":"M298","v":"Weather-normalized"},null,null,{"$f":"L298","v":"Actual (Weather actual)"},{"$f":"M298","v":"Weather-normalized"},null,{"$f":"O298","v":"Weather-normalized"}]
[null,null,"Historical",{"$f":"D300-1","v":2012},null,{"$f":"F278","v":"Actual"},28210.1,{"$f":"IF(D299=RebaseYear,\"Board-approved\",\"\")","v":""},null,null,{"$f":"K278","v":"Actual"},687,{"$f":"L299*1.04577","v":718.4439900000001},{"$f":"N278","v":""},null,null,{"$f":"K299","v":"Actual"},{"$f":"IF(G299=0,\"\",L299/G299)","v":2.435297996107777E-2},{"$f":"IF(G299=0,\"\",M299/G299)","v":2.5467615853896303E-2},{"$f":"N299","v":""},{"$f":"IF(T299=\"\",\"\",IF(I299=0,\"\",O299/I299))","v":""}]
[null,null,"Historical",2013,null,"Actual",28613,"Board-approved",31753,null,"Actual",660,{"$f":"L300*1.01368","v":669.02879999999993},"Board-approved",710,null,{"$f":"K300","v":"Actual"},{"$f":"IF(G300=0,\"\",L300/G300)","v":2.3066438332226609E-2},{"$f":"IF(G300=0,\"\",M300/G300)","v":2.3381987208611468E-2},{"$f":"N300","v":"Board-approved"},{"$f":"IF(T300=\"\",\"\",IF(I300=0,\"\",O300/I300))","v":2.236009195981482E-2}]
[null,null,"Historical",2014,null,"Actual",31255,"",null,null,"Actual",676,{"$f":"L301*0.95873","v":648.10147999999992},"",null,null,"Actual",2.162853943369061E-2,2.0735929611262197E-2,"",""]
[null,null,"Historical",2015,null,"Actual",28967,"",null,null,"Actual",752,{"$f":"L302*0.98231","v":738.69712000000004},"",null,null,"Actual",2.5960575827665963E-2,2.5501333241274557E-2,"",""]
[null,null,"Historical",2016,null,"Actual",29440,"",null,null,"Actual",630,{"$f":"L303*1.00801","v":635.04630000000009},"",null,null,"Actual",2.1399456521739132E-2,2.1570866168478264E-2,"",""]
[null,null,"Bridge Year (Forecast)",2017,null,"Actual",29796,"",null,null,"Actual",619,{"$f":"+L304*1.01105","v":625.83995000000004},"",null,null,"Actual",2.0774600617532554E-2,2.100415995435629E-2,"",""]
[null,null,"Test Year (Forecast)",{"$f":"TestYear","v":2018},null,"Forecast",35771,"",null,null,"Forecast",null,593,"",null,null,"Forecast",0,1.657767465265159E-2,"",""]
[null,null,null,null,null,null,null,null,{"$f":"SUM(I299:I304)","v":31753},null,null,null,null,null,{"$f":"SUM(O299:O304)","v":710},null,null,null,null,null,{"$f":"SUM(U299:U304)","v":2.236009195981482E-2}]
[null,null,"Variance Analysis","Year",null,null,"Year-over-year",null,{"$f":"I286","v":"Test Year Versus Board-approved"},null,"Year","Year-over-year",null,null,{"$f":"I307","v":"Test Year Versus Board-approved"},null,"Year","Year-over-year",null,null,{"$f":"O307","v":"Test Year Versus Board-approved"}]
[null,null,null,{"$f":"D299","v":2012},null,null,null,null,null,null,{"$f":"D308","v":2012},null,null,null,null,null,{"$f":"K308","v":2012}]
[null,null,null,{"$f":"D300","v":2013},null,null,{"$f":"IF(G299=0,\"\",G300/G299-1)","v":1.4282118815601486E-2},null,null,null,{"$f":"D309","v":2013},{"$f":"IF(L299=0,\"\",L300/L299-1)","v":-3.9301310043668103E-2},{"$f":"IF(M299=0,\"\",M300/M299-1)","v":-6.8780852352874677E-2},null,null,null,{"$f":"K309","v":2013},{"$f":"IF(R299=\"\",\"\",IF(R299=0,\"\",R300/R299-1))","v":-5.2828919947677022E-2},{"$f":"IF(S299=\"\",\"\",IF(S299=0,\"\",S300/S299-1))","v":-8.189336046411877E-2}]
[null,null,null,{"$f":"D301","v":2014},null,null,{"$f":"IF(G300=0,\"\",G301/G300-1)","v":9.2335651626882953E-2},null,null,null,2014,{"$f":"IF(L300=0,\"\",L301/L300-1)","v":2.4242424242424176E-2},-3.1280148178972289E-2,null,null,null,2014,{"$f":"IF(R300=\"\",\"\",IF(R300=0,\"\",R301/R300-1))","v":-6.2337274520925079E-2},-0.11316649751543539]
[null,null,null,2015,null,null,-7.3204287314029726E-2,null,null,null,2015,{"$f":"IF(L301=0,\"\",L302/L301-1)","v":0.11242603550295849},0.13978619521128111,null,null,null,2015,{"$f":"IF(R301=\"\",\"\",IF(R301=0,\"\",R302/R301-1))","v":0.20029259984275094},0.2298138409682946]
[null,null,null,2016,null,null,1.632892601926339E-2,null,null,null,2016,{"$f":"IF(L302=0,\"\",L303/L302-1)","v":-0.16223404255319152},-0.14031572236263756,null,null,null,2016,{"$f":"IF(R302=\"\",\"\",IF(R302=0,\"\",R303/R302-1))","v":-0.17569407305157247},-0.15412790522005859]
[null,null,null,2017,null,null,1.2092391304347805E-2,null,null,null,2017,{"$f":"IF(K304=\"Forecast\",\"\",IF(L303=0,\"\",L304/L303-1))","v":-1.7460317460317509E-2},{"$f":"IF(M303=0,\"\",M304/M303-1)","v":-1.4497131941403341E-2},null,null,null,2017,{"$f":"IF(Q304=\"Forecast\",\"\",IF(R303=0,\"\",R304/R303-1))","v":-2.9199615587050309E-2},{"$f":"IF(S303=\"\",\"\",IF(S303=0,\"\",S304/S303-1))","v":-2.6271833949352841E-2}]
[null,null,null,2018,null,null,0.20053027251980127,null,{"$f":"IF(I306=0,\"\",G305/I306-1)","v":0.12653922464019152},null,2018,{"$f":"IF(K305=\"Forecast\",\"\",IF(L304=0,\"\",L305/L304-1))","v":""},{"$f":"IF(M304=0,\"\",M305/M304-1)","v":-5.2473399948341437E-2},null,{"$f":"IF(O306=0,\"\",M305/O306-1)","v":-0.1647887323943662},null,2018,{"$f":"IF(Q305=\"Forecast\",\"\",IF(R304=0,\"\",R305/R304-1))","v":""},{"$f":"IF(S304=\"\",\"\",IF(S304=0,\"\",S305/S304-1))","v":-0.21074326758717343},null,{"$f":"IF(U306=0,\"\",S305/U306-1)","v":-0.25860436162585076}]
[null,null,null,"Geometric Mean",null,null,{"$f":"IF(G299=0,\"\",(G305/G299)^(1/($D305-$D299-1))-1)","v":4.8637274960814603E-2},null,{"$f":"IF(I306=0,\"\",(G305/I306)^(1/(TestYear-RebaseYear-1))-1)","v":3.0235662949410491E-2},null,"Geometric Mean",{"$f":"IF(L299=0,\"\",(L303/L299)^(1/($D303-$D299-1))-1)","v":-2.8458691700498973E-2},{"$f":"IF(M299=0,\"\",(M305/M299)^(1/($D305-$D299-1))-1)","v":-3.7651540491457136E-2},null,{"$f":"IF(O306=0,\"\",(M305/O306)^(1/(TestYear-RebaseYear-1))-1)","v":-4.4019384451683297E-2},null,"Geometric Mean",{"$f":"IF(R299=\"\",\"\",IF(R299=0,\"\",(R303/R299)^(1/($D303-$D299-1))-1))","v":-4.2180787497190675E-2},{"$f":"IF(S299=\"\",\"\",IF(S299=0,\"\",(S305/S299)^(1/($D305-$D299-1))-1))","v":-8.2286618559783808E-2},null,{"$f":"IF(U306=0,\"\",(S305/U306)^(1/(TestYear-RebaseYear-1))-1)","v":-7.20757881633729E-2}]
[]
[null,{"$f":"B274+1","v":7},"Customer Class:",null,null,null,null,"Is the customer class billed on consumption (kWh) or demand (kW or kVA)?"]
[]
[null,null,null,"Calendar Year",null,"Customers",null,null,null,null,"Consumption (kWh) (3)",null,null,null,null,null,{"$f":"CONCATENATE(\"Consumption (kWh) per \",LEFT(F319,LEN(F319)-1))","v":"Consumption (kWh) per Customer"}]
[null,null,null,{"$f":"CONCATENATE(\"(for \",TestYear,\" Cost of Service\")","v":"(for 2018 Cost of Service"},null,null,null,null,null,null,null,"Actual (Weather actual)","Weather-normalized",null,"Weather-normalized",null,null,{"$f":"L320","v":"Actual (Weather actual)"},{"$f":"M320","v":"Weather-normalized"},null,{"$f":"O320","v":"Weather-normalized"}]
[null,null,"Historical",{"$f":"D322-1","v":2012},null,{"$f":"F278","v":"Actual"},null,{"$f":"IF(D321=RebaseYear,\"Board-approved\",\"\")","v":""},null,null,{"$f":"F321","v":"Actual"},null,null,{"$f":"H321","v":""},null,null,{"$f":"K321","v":"Actual"},{"$f":"IF(G321=0,\"\",L321/G321)","v":""},{"$f":"IF(G321=0,\"\",M321/G321)","v":""},{"$f":"N321","v":""},{"$f":"IF(T321=\"\",\"\",IF(I321=0,\"\",O321/I321))","v":""}]
[null,null,"Historical",2013,null,{"$f":"F279","v":"Actual"},null,"Board-approved",null,null,{"$f":"F322","v":"Actual"},null,null,{"$f":"H322","v":"Board-approved"},null,null,{"$f":"K322","v":"Actual"},{"$f":"IF(G322=0,\"\",L322/G322)","v":""},{"$f":"IF(G322=0,\"\",M322/G322)","v":""},{"$f":"N322","v":"Board-approved"},{"$f":"IF(T322=\"\",\"\",IF(I322=0,\"\",O322/I322))","v":""}]
[null,null,"Historical",2014,null,"Actual",null,"",null,null,"Actual",null,null,"",null,null,"Actual","","","",""]
[null,null,"Historical",2015,null,"Actual",null,"",null,null,"Actual",null,null,"",null,null,"Actual","","","",""]
[null,null,"Historical",2016,null,"Actual",null,"",null,null,"Actual",null,null,"",null,null,"Actual","","","",""]
[null,null,"Bridge Year",2017,null,"Actual",null,"",null,null,"Actual",null,null,"",null,null,"Actual","","","",""]
[null,null,"Test Year",{"$f":"TestYear","v":2018},null,"Forecast",null,"",null,null,"Forecast",null,null,"",null,null,"Forecast","","","",""]
[null,null,null,null,null,null,null,null,{"$f":"SUM(I321:I326)","v":0},null,null,null,null,null,{"$f":"SUM(O321:O326)","v":0},null,null,null,null,null,{"$f":"SUM(U321:U326)","v":0}]
[null,null,"Variance Analysis","Year",null,null,"Year-over-year",null,"Test Year Versus Board-approved",null,"Year","Year-over-year",null,null,{"$f":"I329","v":"Test Year Versus Board-approved"},null,"Year","Year-over-year",null,null,{"$f":"O329","v":"Test Year Versus Board-approved"}]
[null,null,null,{"$f":"D321","v":2012},null,null,null,null,null,null,{"$f":"D330","v":2012},null,null,null,null,null,{"$f":"K330","v":2012}]
[null,null,null,2013,null,null,{"$f":"IF(G321=0,\"\",G322/G321-1)","v":""},null,null,null,{"$f":"D331","v":2013},{"$f":"IF(L321=0,\"\",L322/L321-1)","v":""},"",null,null,null,{"$f":"K331","v":2013},{"$f":"IF(R321=\"\",\"\",IF(R321=0,\"\",R322/R321-1))","v":""},{"$f":"IF(S321=\"\",\"\",IF(S321=0,\"\",S322/S321-1))","v":""}]
[null,null,null,2014,null,null,"",null,null,null,2014,{"$f":"IF(L322=0,\"\",L323/L322-1)","v":""},"",null,null,null,2014,{"$f":"IF(R322=\"\",\"\",IF(R322=0,\"\",R323/R322-1))","v":""},""]
[null,null,null,2015,null,null,"",null,null,null,2015,{"$f":"IF(L323=0,\"\",L324/L323-1)","v":""},"",null,null,null,2015,{"$f":"IF(R323=\"\",\"\",IF(R323=0,\"\",R324/R323-1))","v":""},""]
[null,null,null,2016,null,null,"",null,null,null,2016,{"$f":"IF(L324=0,\"\",L325/L324-1)","v":""},"",null,null,null,2016,{"$f":"IF(R324=\"\",\"\",IF(R324=0,\"\",R325/R324-1))","v":""},""]
[null,null,null,2017,null,null,"",null,null,null,2017,{"$f":"IF(K326=\"Forecast\",\"\",IF(L325=0,\"\",L326/L325-1))","v":""},{"$f":"IF(M325=0,\"\",M326/M325-1)","v":""},null,null,null,2017,{"$f":"IF(Q326=\"Forecast\",\"\",IF(R325=0,\"\",R326/R325-1))","v":{"$error":"#VALUE!"}},{"$f":"IF(S325=\"\",\"\",IF(S325=0,\"\",S326/S325-1))","v":""}]
[null,null,null,2018,null,null,"",null,{"$f":"IF(I328=0,\"\",G327/I328-1)","v":""},null,2018,{"$f":"IF(K327=\"Forecast\",\"\",IF(L326=0,\"\",L327/L326-1))","v":""},{"$f":"IF(M326=0,\"\",M327/M326-1)","v":""},null,{"$f":"IF(O328=0,\"\",M327/O328-1)","v":""},null,2018,{"$f":"IF(Q327=\"Forecast\",\"\",IF(R326=0,\"\",R327/R326-1))","v":""},{"$f":"IF(S326=\"\",\"\",IF(S326=0,\"\",S327/S326-1))","v":""},null,{"$f":"IF(U328=0,\"\",S327/U328-1)","v":""}]
[null,null,null,"Geometric Mean",null,null,{"$f":"IF(G321=0,\"\",(G327/G321)^(1/($D327-$D321-1))-1)","v":""},null,{"$f":"IF(I328=0,\"\",(G327/I328)^(1/(TestYear-RebaseYear-1))-1)","v":""},null,"Geometric Mean",{"$f":"IF(L321=0,\"\",(L325/L321)^(1/($D325-$D321-1))-1)","v":""},{"$f":"IF(M321=0,\"\",(M327/M321)^(1/($D327-$D321-1))-1)","v":""},null,{"$f":"IF(O328=0,\"\",(M327/O328)^(1/(TestYear-RebaseYear-1))-1)","v":""},null,"Geometric Mean",{"$f":"IF(R321=\"\",\"\",IF(R321=0,\"\",(R325/R321)^(1/($D325-$D321-1))-1))","v":""},{"$f":"IF(S321=\"\",\"\",IF(S321=0,\"\",(S327/S321)^(1/($D327-$D321-1))-1))","v":""},null,{"$f":"IF(U328=0,\"\",(S327/U328)^(1/(TestYear-RebaseYear-1))-1)","v":""}]
[]
[]
[null,null,null,"Calendar Year",null,"Revenues",null,null,null,null,{"$f":"IF(ISBLANK(N317),\"\",CONCATENATE(\"Demand (\",N317,\")\"))","v":""},null,null,null,null,null,{"$f":"CONCATENATE(\"Demand (\",N317,\") per \",LEFT(F319,LEN(F319)-1))","v":"Demand () per Customer"}]
[null,null,null,{"$f":"CONCATENATE(\"(for \",TestYear,\" Cost of Service\")","v":"(for 2018 Cost of Service"},null,null,null,null,null,null,null,"Actual (Weather actual)","Weather-normalized",null,{"$f":"M341","v":"Weather-normalized"},null,null,{"$f":"L341","v":"Actual (Weather actual)"},{"$f":"M341","v":"Weather-normalized"},null,{"$f":"O341","v":"Weather-normalized"}]
[null,null,"Historical",{"$f":"D343-1","v":2012},null,{"$f":"F321","v":"Actual"},null,{"$f":"IF(D342=RebaseYear,\"Board-approved\",\"\")","v":""},null,null,{"$f":"K321","v":"Actual"},null,null,{"$f":"N321","v":""},null,null,{"$f":"K342","v":"Actual"},{"$f":"IF(G342=0,\"\",L342/G342)","v":""},{"$f":"IF(G342=0,\"\",M342/G342)","v":""},{"$f":"N342","v":""},{"$f":"IF(T342=\"\",\"\",IF(I342=0,\"\",O342/I342))","v":""}]
[null,null,"Historical",2013,null,"Actual",null,"Board-approved",null,null,"Actual",null,null,"Board-approved",null,null,{"$f":"K343","v":"Actual"},{"$f":"IF(G343=0,\"\",L343/G343)","v":""},{"$f":"IF(G343=0,\"\",M343/G343)","v":""},{"$f":"N343","v":"Board-approved"},{"$f":"IF(T343=\"\",\"\",IF(I343=0,\"\",O343/I343))","v":""}]
[null,null,"Historical",2014,null,"Actual",null,"",null,null,"Actual",null,null,"",null,null,"Actual","","","",""]
[null,null,"Historical",2015,null,"Actual",null,"",null,null,"Actual",null,null,"",null,null,"Actual","","","",""]
[null,null,"Historical",2016,null,"Actual",null,"",null,null,"Actual",null,null,"",null,null,"Actual","","","",""]
[null,null,"Bridge Year (Forecast)",2017,null,"Actual",null,"",null,null,"Actual",null,null,"",null,null,"Actual","","","",""]
[null,null,"Test Year (Forecast)",{"$f":"TestYear","v":2018},null,"Forecast",null,"",null,null,"Forecast",null,null,"",null,null,"Forecast","","","",""]
[null,null,null,null,null,null,null,null,{"$f":"SUM(I342:I347)","v":0},null,null,null,null,null,{"$f":"SUM(O342:O347)","v":0},null,null,null,null,null,{"$f":"SUM(U342:U347)","v":0}]
[null,null,"Variance Analysis","Year",null,null,"Year-over-year",null,{"$f":"I329","v":"Test Year Versus Board-approved"},null,"Year","Year-over-year",null,null,{"$f":"I350","v":"Test Year Versus Board-approved"},null,"Year","Year-over-year",null,null,{"$f":"O350","v":"Test Year Versus Board-approved"}]
[null,null,null,{"$f":"D342","v":2012},null,null,null,null,null,null,{"$f":"D351","v":2012},null,null,null,null,null,{"$f":"K351","v":2012}]
[null,null,null,{"$f":"D343","v":2013},null,null,{"$f":"IF(G342=0,\"\",G343/G342-1)","v":""},null,null,null,{"$f":"D352","v":2013},{"$f":"IF(L342=0,\"\",L343/L342-1)","v":""},{"$f":"IF(M342=0,\"\",M343/M342-1)","v":""},null,null,null,{"$f":"K352","v":2013},{"$f":"IF(R342=\"\",\"\",IF(R342=0,\"\",R343/R342-1))","v":""},{"$f":"IF(S342=\"\",\"\",IF(S342=0,\"\",S343/S342-1))","v":""}]
[null,null,null,{"$f":"D344","v":2014},null,null,{"$f":"IF(G343=0,\"\",G344/G343-1)","v":""},null,null,null,2014,{"$f":"IF(L343=0,\"\",L344/L343-1)","v":""},"",null,null,null,2014,{"$f":"IF(R343=\"\",\"\",IF(R343=0,\"\",R344/R343-1))","v":""},""]
[null,null,null,2015,null,null,"",null,null,null,2015,{"$f":"IF(L344=0,\"\",L345/L344-1)","v":""},"",null,null,null,2015,{"$f":"IF(R344=\"\",\"\",IF(R344=0,\"\",R345/R344-1))","v":""},""]
[null,null,null,2016,null,null,"",null,null,null,2016,{"$f":"IF(L345=0,\"\",L346/L345-1)","v":""},"",null,null,null,2016,{"$f":"IF(R345=\"\",\"\",IF(R345=0,\"\",R346/R345-1))","v":""},""]
[null,null,null,2017,null,null,"",null,null,null,2017,{"$f":"IF(K347=\"Forecast\",\"\",IF(L346=0,\"\",L347/L346-1))","v":""},{"$f":"IF(M346=0,\"\",M347/M346-1)","v":""},null,null,null,2017,{"$f":"IF(Q347=\"Forecast\",\"\",IF(R346=0,\"\",R347/R346-1))","v":{"$error":"#VALUE!"}},{"$f":"IF(S346=\"\",\"\",IF(S346=0,\"\",S347/S346-1))","v":""}]
[null,null,null,2018,null,null,"",null,{"$f":"IF(I349=0,\"\",G348/I349-1)","v":""},null,2018,{"$f":"IF(K348=\"Forecast\",\"\",IF(L347=0,\"\",L348/L347-1))","v":""},{"$f":"IF(M347=0,\"\",M348/M347-1)","v":""},null,{"$f":"IF(O349=0,\"\",M348/O349-1)","v":""},null,2018,{"$f":"IF(Q348=\"Forecast\",\"\",IF(R347=0,\"\",R348/R347-1))","v":""},{"$f":"IF(S347=\"\",\"\",IF(S347=0,\"\",S348/S347-1))","v":""},null,{"$f":"IF(U349=0,\"\",S348/U349-1)","v":""}]
[null,null,null,"Geometric Mean",null,null,{"$f":"IF(G342=0,\"\",(G348/G342)^(1/($D348-$D342-1))-1)","v":""},null,{"$f":"IF(I349=0,\"\",(G348/I349)^(1/(TestYear-RebaseYear-1))-1)","v":""},null,"Geometric Mean",{"$f":"IF(L342=0,\"\",(L346/L342)^(1/($D346-$D342-1))-1)","v":""},{"$f":"IF(M342=0,\"\",(M348/M342)^(1/($D348-$D342-1))-1)","v":""},null,{"$f":"IF(O349=0,\"\",(M348/O349)^(1/(TestYear-RebaseYear-1))-1)","v":""},null,"Geometric Mean",{"$f":"IF(R342=\"\",\"\",IF(R342=0,\"\",(R346/R342)^(1/($D346-$D342-1))-1))","v":""},{"$f":"IF(S342=\"\",\"\",IF(S342=0,\"\",(S348/S342)^(1/($D348-$D342-1))-1))","v":""},null,{"$f":"IF(U349=0,\"\",(S348/U349)^(1/(TestYear-RebaseYear-1))-1)","v":""}]
[]
[null,{"$f":"B317+1","v":8},"Customer Class:",null,null,null,null,"Is the customer class billed on consumption (kWh) or demand (kW or kVA)?"]
[]
[null,null,null,"Calendar Year",null,"Customers",null,null,null,null,"Consumption (kWh) (3)",null,null,null,null,null,{"$f":"CONCATENATE(\"Consumption (kWh) per \",LEFT(F362,LEN(F362)-1))","v":"Consumption (kWh) per Customer"}]
[null,null,null,{"$f":"CONCATENATE(\"(for \",TestYear,\" Cost of Service\")","v":"(for 2018 Cost of Service"},null,null,null,null,null,null,null,"Actual (Weather actual)","Weather-normalized",null,"Weather-normalized",null,null,{"$f":"L363","v":"Actual (Weather actual)"},{"$f":"M363","v":"Weather-normalized"},null,{"$f":"O363","v":"Weather-normalized"}]
[null,null,"Historical",{"$f":"D365-1","v":2012},null,{"$f":"F321","v":"Actual"},null,{"$f":"IF(D364=RebaseYear,\"Board-approved\",\"\")","v":""},null,null,{"$f":"F364","v":"Actual"},null,null,{"$f":"H364","v":""},null,null,{"$f":"K364","v":"Actual"},{"$f":"IF(G364=0,\"\",L364/G364)","v":""},{"$f":"IF(G364=0,\"\",M364/G364)","v":""},{"$f":"N364","v":""},{"$f":"IF(T364=\"\",\"\",IF(I364=0,\"\",O364/I364))","v":""}]
[null,null,"Historical",2013,null,{"$f":"F322","v":"Actual"},null,"Board-approved",null,null,{"$f":"F365","v":"Actual"},null,null,{"$f":"H365","v":"Board-approved"},null,null,{"$f":"K365","v":"Actual"},{"$f":"IF(G365=0,\"\",L365/G365)","v":""},{"$f":"IF(G365=0,\"\",M365/G365)","v":""},{"$f":"N365","v":"Board-approved"},{"$f":"IF(T365=\"\",\"\",IF(I365=0,\"\",O365/I365))","v":""}]
[null,null,"Historical",2014,null,"Actual",null,"",null,null,"Actual",null,null,"",null,null,"Actual","","","",""]
[null,null,"Historical",2015,null,"Actual",null,"",null,null,"Actual",null,null,"",null,null,"Actual","","","",""]
[null,null,"Historical",2016,null,"Actual",null,"",null,null,"Actual",null,null,"",null,null,"Actual","","","",""]
[null,null,"Bridge Year",2017,null,"Actual",null,"",null,null,"Actual",null,null,"",null,null,"Actual","","","",""]
[null,null,"Test Year",{"$f":"TestYear","v":2018},null,"Forecast",null,"",null,null,"Forecast",null,null,"",null,null,"Forecast","","","",""]
[null,null,null,null,null,null,null,null,{"$f":"SUM(I364:I369)","v":0},null,null,null,null,null,{"$f":"SUM(O364:O369)","v":0},null,null,null,null,null,{"$f":"SUM(U364:U369)","v":0}]
[null,null,"Variance Analysis","Year",null,null,"Year-over-year",null,"Test Year Versus Board-approved",null,"Year","Year-over-year",null,null,{"$f":"I372","v":"Test Year Versus Board-approved"},null,"Year","Year-over-year",null,null,{"$f":"O372","v":"Test Year Versus Board-approved"}]
[null,null,null,{"$f":"D364","v":2012},null,null,null,null,null,null,{"$f":"D373","v":2012},null,null,null,null,null,{"$f":"K373","v":2012}]
[null,null,null,2013,null,null,{"$f":"IF(G364=0,\"\",G365/G364-1)","v":""},null,null,null,{"$f":"D374","v":2013},{"$f":"IF(L364=0,\"\",L365/L364-1)","v":""},"",null,null,null,{"$f":"K374","v":2013},{"$f":"IF(R364=\"\",\"\",IF(R364=0,\"\",R365/R364-1))","v":""},{"$f":"IF(S364=\"\",\"\",IF(S364=0,\"\",S365/S364-1))","v":""}]
[null,null,null,2014,null,null,"",null,null,null,2014,{"$f":"IF(L365=0,\"\",L366/L365-1)","v":""},"",null,null,null,2014,{"$f":"IF(R365=\"\",\"\",IF(R365=0,\"\",R366/R365-1))","v":""},""]
[null,null,null,2015,null,null,"",null,null,null,2015,{"$f":"IF(L366=0,\"\",L367/L366-1)","v":""},"",null,null,null,2015,{"$f":"IF(R366=\"\",\"\",IF(R366=0,\"\",R367/R366-1))","v":""},""]
[null,null,null,2016,null,null,"",null,null,null,2016,{"$f":"IF(L367=0,\"\",L368/L367-1)","v":""},"",null,null,null,2016,{"$f":"IF(R367=\"\",\"\",IF(R367=0,\"\",R368/R367-1))","v":""},""]
[null,null,null,2017,null,null,"",null,null,null,2017,{"$f":"IF(K369=\"Forecast\",\"\",IF(L368=0,\"\",L369/L368-1))","v":""},{"$f":"IF(M368=0,\"\",M369/M368-1)","v":""},null,null,null,2017,{"$f":"IF(Q369=\"Forecast\",\"\",IF(R368=0,\"\",R369/R368-1))","v":{"$error":"#VALUE!"}},{"$f":"IF(S368=\"\",\"\",IF(S368=0,\"\",S369/S368-1))","v":""}]
[null,null,null,2018,null,null,"",null,{"$f":"IF(I371=0,\"\",G370/I371-1)","v":""},null,2018,{"$f":"IF(K370=\"Forecast\",\"\",IF(L369=0,\"\",L370/L369-1))","v":""},{"$f":"IF(M369=0,\"\",M370/M369-1)","v":""},null,{"$f":"IF(O371=0,\"\",M370/O371-1)","v":""},null,2018,{"$f":"IF(Q370=\"Forecast\",\"\",IF(R369=0,\"\",R370/R369-1))","v":""},{"$f":"IF(S369=\"\",\"\",IF(S369=0,\"\",S370/S369-1))","v":""},null,{"$f":"IF(U371=0,\"\",S370/U371-1)","v":""}]
[null,null,null,"Geometric Mean",null,null,{"$f":"IF(G364=0,\"\",(G370/G364)^(1/($D370-$D364-1))-1)","v":""},null,{"$f":"IF(I371=0,\"\",(G370/I371)^(1/(TestYear-RebaseYear-1))-1)","v":""},null,"Geometric Mean",{"$f":"IF(L364=0,\"\",(L368/L364)^(1/($D368-$D364-1))-1)","v":""},{"$f":"IF(M364=0,\"\",(M370/M364)^(1/($D370-$D364-1))-1)","v":""},null,{"$f":"IF(O371=0,\"\",(M370/O371)^(1/(TestYear-RebaseYear-1))-1)","v":""},null,"Geometric Mean",{"$f":"IF(R364=\"\",\"\",IF(R364=0,\"\",(R368/R364)^(1/($D368-$D364-1))-1))","v":""},{"$f":"IF(S364=\"\",\"\",IF(S364=0,\"\",(S370/S364)^(1/($D370-$D364-1))-1))","v":""},null,{"$f":"IF(U371=0,\"\",(S370/U371)^(1/(TestYear-RebaseYear-1))-1)","v":""}]
[]
[]
[null,null,null,"Calendar Year",null,"Revenues",null,null,null,null,{"$f":"IF(ISBLANK(N360),\"\",CONCATENATE(\"Demand (\",N360,\")\"))","v":""},null,null,null,null,null,{"$f":"CONCATENATE(\"Demand (\",N360,\") per \",LEFT(F362,LEN(F362)-1))","v":"Demand () per Customer"}]
[null,null,null,{"$f":"CONCATENATE(\"(for \",TestYear,\" Cost of Service\")","v":"(for 2018 Cost of Service"},null,null,null,null,null,null,null,"Actual (Weather actual)","Weather-normalized",null,{"$f":"M384","v":"Weather-normalized"},null,null,{"$f":"L384","v":"Actual (Weather actual)"},{"$f":"M384","v":"Weather-normalized"},null,{"$f":"O384","v":"Weather-normalized"}]
[null,null,"Historical",{"$f":"D386-1","v":2012},null,{"$f":"F364","v":"Actual"},null,{"$f":"IF(D385=RebaseYear,\"Board-approved\",\"\")","v":""},null,null,{"$f":"K364","v":"Actual"},null,null,{"$f":"N364","v":""},null,null,{"$f":"K385","v":"Actual"},{"$f":"IF(G385=0,\"\",L385/G385)","v":""},{"$f":"IF(G385=0,\"\",M385/G385)","v":""},{"$f":"N385","v":""},{"$f":"IF(T385=\"\",\"\",IF(I385=0,\"\",O385/I385))","v":""}]
[null,null,"Historical",2013,null,"Actual",null,"Board-approved",null,null,"Actual",null,null,"Board-approved",null,null,{"$f":"K386","v":"Actual"},{"$f":"IF(G386=0,\"\",L386/G386)","v":""},{"$f":"IF(G386=0,\"\",M386/G386)","v":""},{"$f":"N386","v":"Board-approved"},{"$f":"IF(T386=\"\",\"\",IF(I386=0,\"\",O386/I386))","v":""}]
[null,null,"Historical",2014,null,"Actual",null,"",null,null,"Actual",null,null,"",null,null,"Actual","","","",""]
[null,null,"Historical",2015,null,"Actual",null,"",null,null,"Actual",null,null,"",null,null,"Actual","","","",""]
[null,null,"Historical",2016,null,"Actual",null,"",null,null,"Actual",null,null,"",null,null,"Actual","","","",""]
[null,null,"Bridge Year (Forecast)",2017,null,"Actual",null,"",null,null,"Actual",null,null,"",null,null,"Actual","","","",""]
[null,null,"Test Year (Forecast)",{"$f":"TestYear","v":2018},null,"Forecast",null,"",null,null,"Forecast",null,null,"",null,null,"Forecast","","","",""]
[null,null,null,null,null,null,null,null,{"$f":"SUM(I385:I390)","v":0},null,null,null,null,null,{"$f":"SUM(O385:O390)","v":0},null,null,null,null,null,{"$f":"SUM(U385:U390)","v":0}]
[null,null,"Variance Analysis","Year",null,null,"Year-over-year",null,{"$f":"I372","v":"Test Year Versus Board-approved"},null,"Year","Year-over-year",null,null,{"$f":"I393","v":"Test Year Versus Board-approved"},null,"Year","Year-over-year",null,null,{"$f":"O393","v":"Test Year Versus Board-approved"}]
[null,null,null,{"$f":"D385","v":2012},null,null,null,null,null,null,{"$f":"D394","v":2012},null,null,null,null,null,{"$f":"K394","v":2012}]
[null,null,null,{"$f":"D386","v":2013},null,null,{"$f":"IF(G385=0,\"\",G386/G385-1)","v":""},null,null,null,{"$f":"D395","v":2013},{"$f":"IF(L385=0,\"\",L386/L385-1)","v":""},{"$f":"IF(M385=0,\"\",M386/M385-1)","v":""},null,null,null,{"$f":"K395","v":2013},{"$f":"IF(R385=\"\",\"\",IF(R385=0,\"\",R386/R385-1))","v":""},{"$f":"IF(S385=\"\",\"\",IF(S385=0,\"\",S386/S385-1))","v":""}]
[null,null,null,{"$f":"D387","v":2014},null,null,{"$f":"IF(G386=0,\"\",G387/G386-1)","v":""},null,null,null,2014,{"$f":"IF(L386=0,\"\",L387/L386-1)","v":""},"",null,null,null,2014,{"$f":"IF(R386=\"\",\"\",IF(R386=0,\"\",R387/R386-1))","v":""},""]
[null,null,null,2015,null,null,"",null,null,null,2015,{"$f":"IF(L387=0,\"\",L388/L387-1)","v":""},"",null,null,null,2015,{"$f":"IF(R387=\"\",\"\",IF(R387=0,\"\",R388/R387-1))","v":""},""]
[null,null,null,2016,null,null,"",null,null,null,2016,{"$f":"IF(L388=0,\"\",L389/L388-1)","v":""},"",null,null,null,2016,{"$f":"IF(R388=\"\",\"\",IF(R388=0,\"\",R389/R388-1))","v":""},""]
[null,null,null,2017,null,null,"",null,null,null,2017,{"$f":"IF(K390=\"Forecast\",\"\",IF(L389=0,\"\",L390/L389-1))","v":""},{"$f":"IF(M389=0,\"\",M390/M389-1)","v":""},null,null,null,2017,{"$f":"IF(Q390=\"Forecast\",\"\",IF(R389=0,\"\",R390/R389-1))","v":{"$error":"#VALUE!"}},{"$f":"IF(S389=\"\",\"\",IF(S389=0,\"\",S390/S389-1))","v":""}]
[null,null,null,2018,null,null,"",null,{"$f":"IF(I392=0,\"\",G391/I392-1)","v":""},null,2018,{"$f":"IF(K391=\"Forecast\",\"\",IF(L390=0,\"\",L391/L390-1))","v":""},{"$f":"IF(M390=0,\"\",M391/M390-1)","v":""},null,{"$f":"IF(O392=0,\"\",M391/O392-1)","v":""},null,2018,{"$f":"IF(Q391=\"Forecast\",\"\",IF(R390=0,\"\",R391/R390-1))","v":""},{"$f":"IF(S390=\"\",\"\",IF(S390=0,\"\",S391/S390-1))","v":""},null,{"$f":"IF(U392=0,\"\",S391/U392-1)","v":""}]
[null,null,null,"Geometric Mean",null,null,{"$f":"IF(G385=0,\"\",(G391/G385)^(1/($D391-$D385-1))-1)","v":""},null,{"$f":"IF(I392=0,\"\",(G391/I392)^(1/(TestYear-RebaseYear-1))-1)","v":""},null,"Geometric Mean",{"$f":"IF(L385=0,\"\",(L389/L385)^(1/($D389-$D385-1))-1)","v":""},{"$f":"IF(M385=0,\"\",(M391/M385)^(1/($D391-$D385-1))-1)","v":""},null,{"$f":"IF(O392=0,\"\",(M391/O392)^(1/(TestYear-RebaseYear-1))-1)","v":""},null,"Geometric Mean",{"$f":"IF(R385=\"\",\"\",IF(R385=0,\"\",(R389/R385)^(1/($D389-$D385-1))-1))","v":""},{"$f":"IF(S385=\"\",\"\",IF(S385=0,\"\",(S391/S385)^(1/($D391-$D385-1))-1))","v":""},null,{"$f":"IF(U392=0,\"\",(S391/U392)^(1/(TestYear-RebaseYear-1))-1)","v":""}]
[]
[null,{"$f":"B360+1","v":9},"Customer Class:",null,null,null,null,"Is the customer class billed on consumption (kWh) or demand (kW or kVA)?"]
[]
[null,null,null,"Calendar Year",null,"Customers",null,null,null,null,"Consumption (kWh) (3)",null,null,null,null,null,{"$f":"CONCATENATE(\"Consumption (kWh) per \",LEFT(F405,LEN(F405)-1))","v":"Consumption (kWh) per Customer"}]
[null,null,null,{"$f":"CONCATENATE(\"(for \",TestYear,\" Cost of Service\")","v":"(for 2018 Cost of Service"},null,null,null,null,null,null,null,"Actual (Weather actual)","Weather-normalized",null,"Weather-normalized",null,null,{"$f":"L406","v":"Actual (Weather actual)"},{"$f":"M406","v":"Weather-normalized"},null,{"$f":"O406","v":"Weather-normalized"}]
[null,null,"Historical",{"$f":"D408-1","v":2012},null,{"$f":"F364","v":"Actual"},null,{"$f":"IF(D407=RebaseYear,\"Board-approved\",\"\")","v":""},null,null,{"$f":"F407","v":"Actual"},null,null,{"$f":"H407","v":""},null,null,{"$f":"K407","v":"Actual"},{"$f":"IF(G407=0,\"\",L407/G407)","v":""},{"$f":"IF(G407=0,\"\",M407/G407)","v":""},{"$f":"N407","v":""},{"$f":"IF(T407=\"\",\"\",IF(I407=0,\"\",O407/I407))","v":""}]
[null,null,"Historical",2013,null,{"$f":"F365","v":"Actual"},null,"Board-approved",null,null,{"$f":"F408","v":"Actual"},null,null,{"$f":"H408","v":"Board-approved"},null,null,{"$f":"K408","v":"Actual"},{"$f":"IF(G408=0,\"\",L408/G408)","v":""},{"$f":"IF(G408=0,\"\",M408/G408)","v":""},{"$f":"N408","v":"Board-approved"},{"$f":"IF(T408=\"\",\"\",IF(I408=0,\"\",O408/I408))","v":""}]
[null,null,"Historical",2014,null,"Actual",null,"",null,null,"Actual",null,null,"",null,null,"Actual","","","",""]
[null,null,"Historical",2015,null,"Actual",null,"",null,null,"Actual",null,null,"",null,null,"Actual","","","",""]
[null,null,"Historical",2016,null,"Actual",null,"",null,null,"Actual",null,null,"",null,null,"Actual","","","",""]
[null,null,"Bridge Year",2017,null,"Actual",null,"",null,null,"Actual",null,null,"",null,null,"Actual","","","",""]
[null,null,"Test Year",{"$f":"TestYear","v":2018},null,"Forecast",null,"",null,null,"Forecast",null,null,"",null,null,"Forecast","","","",""]
[null,null,null,null,null,null,null,null,{"$f":"SUM(I407:I412)","v":0},null,null,null,null,null,{"$f":"SUM(O407:O412)","v":0},null,null,null,null,null,{"$f":"SUM(U407:U412)","v":0}]
[null,null,"Variance Analysis","Year",null,null,"Year-over-year",null,"Test Year Versus Board-approved",null,"Year","Year-over-year",null,null,{"$f":"I415","v":"Test Year Versus Board-approved"},null,"Year","Year-over-year",null,null,{"$f":"O415","v":"Test Year Versus Board-approved"}]
[null,null,null,{"$f":"D407","v":2012},null,null,null,null,null,null,{"$f":"D416","v":2012},null,null,null,null,null,{"$f":"K416","v":2012}]
[null,null,null,2013,null,null,{"$f":"IF(G407=0,\"\",G408/G407-1)","v":""},null,null,null,{"$f":"D417","v":2013},{"$f":"IF(L407=0,\"\",L408/L407-1)","v":""},"",null,null,null,{"$f":"K417","v":2013},{"$f":"IF(R407=\"\",\"\",IF(R407=0,\"\",R408/R407-1))","v":""},{"$f":"IF(S407=\"\",\"\",IF(S407=0,\"\",S408/S407-1))","v":""}]
[null,null,null,2014,null,null,"",null,null,null,2014,{"$f":"IF(L408=0,\"\",L409/L408-1)","v":""},"",null,null,null,2014,{"$f":"IF(R408=\"\",\"\",IF(R408=0,\"\",R409/R408-1))","v":""},""]
[null,null,null,2015,null,null,"",null,null,null,2015,{"$f":"IF(L409=0,\"\",L410/L409-1)","v":""},"",null,null,null,2015,{"$f":"IF(R409=\"\",\"\",IF(R409=0,\"\",R410/R409-1))","v":""},""]
[null,null,null,2016,null,null,"",null,null,null,2016,{"$f":"IF(L410=0,\"\",L411/L410-1)","v":""},"",null,null,null,2016,{"$f":"IF(R410=\"\",\"\",IF(R410=0,\"\",R411/R410-1))","v":""},""]
[null,null,null,2017,null,null,"",null,null,null,2017,{"$f":"IF(K412=\"Forecast\",\"\",IF(L411=0,\"\",L412/L411-1))","v":""},{"$f":"IF(M411=0,\"\",M412/M411-1)","v":""},null,null,null,2017,{"$f":"IF(Q412=\"Forecast\",\"\",IF(R411=0,\"\",R412/R411-1))","v":{"$error":"#VALUE!"}},{"$f":"IF(S411=\"\",\"\",IF(S411=0,\"\",S412/S411-1))","v":""}]
[null,null,null,2018,null,null,"",null,{"$f":"IF(I414=0,\"\",G413/I414-1)","v":""},null,2018,{"$f":"IF(K413=\"Forecast\",\"\",IF(L412=0,\"\",L413/L412-1))","v":""},{"$f":"IF(M412=0,\"\",M413/M412-1)","v":""},null,{"$f":"IF(O414=0,\"\",M413/O414-1)","v":""},null,2018,{"$f":"IF(Q413=\"Forecast\",\"\",IF(R412=0,\"\",R413/R412-1))","v":""},{"$f":"IF(S412=\"\",\"\",IF(S412=0,\"\",S413/S412-1))","v":""},null,{"$f":"IF(U414=0,\"\",S413/U414-1)","v":""}]
[null,null,null,"Geometric Mean",null,null,{"$f":"IF(G407=0,\"\",(G413/G407)^(1/($D413-$D407-1))-1)","v":""},null,{"$f":"IF(I414=0,\"\",(G413/I414)^(1/(TestYear-RebaseYear-1))-1)","v":""},null,"Geometric Mean",{"$f":"IF(L407=0,\"\",(L411/L407)^(1/($D411-$D407-1))-1)","v":""},{"$f":"IF(M407=0,\"\",(M413/M407)^(1/($D413-$D407-1))-1)","v":""},null,{"$f":"IF(O414=0,\"\",(M413/O414)^(1/(TestYear-RebaseYear-1))-1)","v":""},null,"Geometric Mean",{"$f":"IF(R407=\"\",\"\",IF(R407=0,\"\",(R411/R407)^(1/($D411-$D407-1))-1))","v":""},{"$f":"IF(S407=\"\",\"\",IF(S407=0,\"\",(S413/S407)^(1/($D413-$D407-1))-1))","v":""},null,{"$f":"IF(U414=0,\"\",(S413/U414)^(1/(TestYear-RebaseYear-1))-1)","v":""}]
[]
[]
[null,null,null,"Calendar Year",null,"Revenues",null,null,null,null,{"$f":"IF(ISBLANK(N403),\"\",CONCATENATE(\"Demand (\",N403,\")\"))","v":""},null,null,null,null,null,{"$f":"CONCATENATE(\"Demand (\",N403,\") per \",LEFT(F405,LEN(F405)-1))","v":"Demand () per Customer"}]
[null,null,null,{"$f":"CONCATENATE(\"(for \",TestYear,\" Cost of Service\")","v":"(for 2018 Cost of Service"},null,null,null,null,null,null,null,"Actual (Weather actual)","Weather-normalized",null,{"$f":"M427","v":"Weather-normalized"},null,null,{"$f":"L427","v":"Actual (Weather actual)"},{"$f":"M427","v":"Weather-normalized"},null,{"$f":"O427","v":"Weather-normalized"}]
[null,null,"Historical",{"$f":"D429-1","v":2012},null,{"$f":"F407","v":"Actual"},null,{"$f":"IF(D428=RebaseYear,\"Board-approved\",\"\")","v":""},null,null,{"$f":"K407","v":"Actual"},null,null,{"$f":"N407","v":""},null,null,{"$f":"K428","v":"Actual"},{"$f":"IF(G428=0,\"\",L428/G428)","v":""},{"$f":"IF(G428=0,\"\",M428/G428)","v":""},{"$f":"N428","v":""},{"$f":"IF(T428=\"\",\"\",IF(I428=0,\"\",O428/I428))","v":""}]
[null,null,"Historical",2013,null,"Actual",null,"Board-approved",null,null,"Actual",null,null,"Board-approved",null,null,{"$f":"K429","v":"Actual"},{"$f":"IF(G429=0,\"\",L429/G429)","v":""},{"$f":"IF(G429=0,\"\",M429/G429)","v":""},{"$f":"N429","v":"Board-approved"},{"$f":"IF(T429=\"\",\"\",IF(I429=0,\"\",O429/I429))","v":""}]
[null,null,"Historical",2014,null,"Actual",null,"",null,null,"Actual",null,null,"",null,null,"Actual","","","",""]
[null,null,"Historical",2015,null,"Actual",null,"",null,null,"Actual",null,null,"",null,null,"Actual","","","",""]
[null,null,"Historical",2016,null,"Actual",null,"",null,null,"Actual",null,null,"",null,null,"Actual","","","",""]
[null,null,"Bridge Year (Forecast)",2017,null,"Actual",null,"",null,null,"Actual",null,null,"",null,null,"Actual","","","",""]
[null,null,"Test Year (Forecast)",{"$f":"TestYear","v":2018},null,"Forecast",null,"",null,null,"Forecast",null,null,"",null,null,"Forecast","","","",""]
[null,null,null,null,null,null,null,null,{"$f":"SUM(I428:I433)","v":0},null,null,null,null,null,{"$f":"SUM(O428:O433)","v":0},null,null,null,null,null,{"$f":"SUM(U428:U433)","v":0}]
[null,null,"Variance Analysis","Year",null,null,"Year-over-year",null,{"$f":"I415","v":"Test Year Versus Board-approved"},null,"Year","Year-over-year",null,null,{"$f":"I436","v":"Test Year Versus Board-approved"},null,"Year","Year-over-year",null,null,{"$f":"O436","v":"Test Year Versus Board-approved"}]
[null,null,null,{"$f":"D428","v":2012},null,null,null,null,null,null,{"$f":"D437","v":2012},null,null,null,null,null,{"$f":"K437","v":2012}]
[null,null,null,{"$f":"D429","v":2013},null,null,{"$f":"IF(G428=0,\"\",G429/G428-1)","v":""},null,null,null,{"$f":"D438","v":2013},{"$f":"IF(L428=0,\"\",L429/L428-1)","v":""},{"$f":"IF(M428=0,\"\",M429/M428-1)","v":""},null,null,null,{"$f":"K438","v":2013},{"$f":"IF(R428=\"\",\"\",IF(R428=0,\"\",R429/R428-1))","v":""},{"$f":"IF(S428=\"\",\"\",IF(S428=0,\"\",S429/S428-1))","v":""}]
[null,null,null,{"$f":"D430","v":2014},null,null,{"$f":"IF(G429=0,\"\",G430/G429-1)","v":""},null,null,null,2014,{"$f":"IF(L429=0,\"\",L430/L429-1)","v":""},"",null,null,null,2014,{"$f":"IF(R429=\"\",\"\",IF(R429=0,\"\",R430/R429-1))","v":""},""]
[null,null,null,2015,null,null,"",null,null,null,2015,{"$f":"IF(L430=0,\"\",L431/L430-1)","v":""},"",null,null,null,2015,{"$f":"IF(R430=\"\",\"\",IF(R430=0,\"\",R431/R430-1))","v":""},""]
[null,null,null,2016,null,null,"",null,null,null,2016,{"$f":"IF(L431=0,\"\",L432/L431-1)","v":""},"",null,null,null,2016,{"$f":"IF(R431=\"\",\"\",IF(R431=0,\"\",R432/R431-1))","v":""},""]
[null,null,null,2017,null,null,"",null,null,null,2017,{"$f":"IF(K433=\"Forecast\",\"\",IF(L432=0,\"\",L433/L432-1))","v":""},{"$f":"IF(M432=0,\"\",M433/M432-1)","v":""},null,null,null,2017,{"$f":"IF(Q433=\"Forecast\",\"\",IF(R432=0,\"\",R433/R432-1))","v":{"$error":"#VALUE!"}},{"$f":"IF(S432=\"\",\"\",IF(S432=0,\"\",S433/S432-1))","v":""}]
[null,null,null,2018,null,null,"",null,{"$f":"IF(I435=0,\"\",G434/I435-1)","v":""},null,2018,{"$f":"IF(K434=\"Forecast\",\"\",IF(L433=0,\"\",L434/L433-1))","v":""},{"$f":"IF(M433=0,\"\",M434/M433-1)","v":""},null,{"$f":"IF(O435=0,\"\",M434/O435-1)","v":""},null,2018,{"$f":"IF(Q434=\"Forecast\",\"\",IF(R433=0,\"\",R434/R433-1))","v":""},{"$f":"IF(S433=\"\",\"\",IF(S433=0,\"\",S434/S433-1))","v":""},null,{"$f":"IF(U435=0,\"\",S434/U435-1)","v":""}]
[null,null,null,"Geometric Mean",null,null,{"$f":"IF(G428=0,\"\",(G434/G428)^(1/($D434-$D428-1))-1)","v":""},null,{"$f":"IF(I435=0,\"\",(G434/I435)^(1/(TestYear-RebaseYear-1))-1)","v":""},null,"Geometric Mean",{"$f":"IF(L428=0,\"\",(L432/L428)^(1/($D432-$D428-1))-1)","v":""},{"$f":"IF(M428=0,\"\",(M434/M428)^(1/($D434-$D428-1))-1)","v":""},null,{"$f":"IF(O435=0,\"\",(M434/O435)^(1/(TestYear-RebaseYear-1))-1)","v":""},null,"Geometric Mean",{"$f":"IF(R428=\"\",\"\",IF(R428=0,\"\",(R432/R428)^(1/($D432-$D428-1))-1))","v":""},{"$f":"IF(S428=\"\",\"\",IF(S428=0,\"\",(S434/S428)^(1/($D434-$D428-1))-1))","v":""},null,{"$f":"IF(U435=0,\"\",(S434/U435)^(1/(TestYear-RebaseYear-1))-1)","v":""}]
[]
[null,{"$f":"B403+1","v":10},"Customer Class:",null,null,null,null,"Is the customer class billed on consumption (kWh) or demand (kW or kVA)?"]
[]
[null,null,null,"Calendar Year",null,"Customers",null,null,null,null,"Consumption (kWh) (3)",null,null,null,null,null,{"$f":"CONCATENATE(\"Consumption (kWh) per \",LEFT(F448,LEN(F448)-1))","v":"Consumption (kWh) per Customer"}]
[null,null,null,{"$f":"CONCATENATE(\"(for \",TestYear,\" Cost of Service\")","v":"(for 2018 Cost of Service"},null,null,null,null,null,null,null,"Actual (Weather actual)","Weather-normalized",null,"Weather-normalized",null,null,{"$f":"L449","v":"Actual (Weather actual)"},{"$f":"M449","v":"Weather-normalized"},null,{"$f":"O449","v":"Weather-normalized"}]
[null,null,"Historical",{"$f":"D451-1","v":2012},null,{"$f":"F407","v":"Actual"},null,{"$f":"IF(D450=RebaseYear,\"Board-approved\",\"\")","v":""},null,null,{"$f":"F450","v":"Actual"},null,null,{"$f":"H450","v":""},null,null,{"$f":"K450","v":"Actual"},{"$f":"IF(G450=0,\"\",L450/G450)","v":""},{"$f":"IF(G450=0,\"\",M450/G450)","v":""},{"$f":"N450","v":""},{"$f":"IF(T450=\"\",\"\",IF(I450=0,\"\",O450/I450))","v":""}]
[null,null,"Historical",2013,null,{"$f":"F408","v":"Actual"},null,"Board-approved",null,null,{"$f":"F451","v":"Actual"},null,null,{"$f":"H451","v":"Board-approved"},null,null,{"$f":"K451","v":"Actual"},{"$f":"IF(G451=0,\"\",L451/G451)","v":""},{"$f":"IF(G451=0,\"\",M451/G451)","v":""},{"$f":"N451","v":"Board-approved"},{"$f":"IF(T451=\"\",\"\",IF(I451=0,\"\",O451/I451))","v":""}]
[null,null,"Historical",2014,null,"Actual",null,"",null,null,"Actual",null,null,"",null,null,"Actual","","","",""]
[null,null,"Historical",2015,null,"Actual",null,"",null,null,"Actual",null,null,"",null,null,"Actual","","","",""]
[null,null,"Historical",2016,null,"Actual",null,"",null,null,"Actual",null,null,"",null,null,"Actual","","","",""]
[null,null,"Bridge Year",2017,null,"Actual",null,"",null,null,"Actual",null,null,"",null,null,"Actual","","","",""]
[null,null,"Test Year",{"$f":"TestYear","v":2018},null,"Forecast",null,"",null,null,"Forecast",null,null,"",null,null,"Forecast","","","",""]
[null,null,null,null,null,null,null,null,{"$f":"SUM(I450:I455)","v":0},null,null,null,null,null,{"$f":"SUM(O450:O455)","v":0},null,null,null,null,null,{"$f":"SUM(U450:U455)","v":0}]
[null,null,"Variance Analysis","Year",null,null,"Year-over-year",null,"Test Year Versus Board-approved",null,"Year","Year-over-year",null,null,{"$f":"I458","v":"Test Year Versus Board-approved"},null,"Year","Year-over-year",null,null,{"$f":"O458","v":"Test Year Versus Board-approved"}]
[null,null,null,{"$f":"D450","v":2012},null,null,null,null,null,null,{"$f":"D459","v":2012},null,null,null,null,null,{"$f":"K459","v":2012}]
[null,null,null,2013,null,null,{"$f":"IF(G450=0,\"\",G451/G450-1)","v":""},null,null,null,{"$f":"D460","v":2013},{"$f":"IF(L450=0,\"\",L451/L450-1)","v":""},"",null,null,null,{"$f":"K460","v":2013},{"$f":"IF(R450=\"\",\"\",IF(R450=0,\"\",R451/R450-1))","v":""},{"$f":"IF(S450=\"\",\"\",IF(S450=0,\"\",S451/S450-1))","v":""}]
[null,null,null,2014,null,null,"",null,null,null,2014,{"$f":"IF(L451=0,\"\",L452/L451-1)","v":""},"",null,null,null,2014,{"$f":"IF(R451=\"\",\"\",IF(R451=0,\"\",R452/R451-1))","v":""},""]
[null,null,null,2015,null,null,"",null,null,null,2015,{"$f":"IF(L452=0,\"\",L453/L452-1)","v":""},"",null,null,null,2015,{"$f":"IF(R452=\"\",\"\",IF(R452=0,\"\",R453/R452-1))","v":""},""]
[null,null,null,2016,null,null,"",null,null,null,2016,{"$f":"IF(L453=0,\"\",L454/L453-1)","v":""},"",null,null,null,2016,{"$f":"IF(R453=\"\",\"\",IF(R453=0,\"\",R454/R453-1))","v":""},""]
[null,null,null,2017,null,null,"",null,null,null,2017,{"$f":"IF(K455=\"Forecast\",\"\",IF(L454=0,\"\",L455/L454-1))","v":""},{"$f":"IF(M454=0,\"\",M455/M454-1)","v":""},null,null,null,2017,{"$f":"IF(Q455=\"Forecast\",\"\",IF(R454=0,\"\",R455/R454-1))","v":{"$error":"#VALUE!"}},{"$f":"IF(S454=\"\",\"\",IF(S454=0,\"\",S455/S454-1))","v":""}]
[null,null,null,2018,null,null,"",null,{"$f":"IF(I457=0,\"\",G456/I457-1)","v":""},null,2018,{"$f":"IF(K456=\"Forecast\",\"\",IF(L455=0,\"\",L456/L455-1))","v":""},{"$f":"IF(M455=0,\"\",M456/M455-1)","v":""},null,{"$f":"IF(O457=0,\"\",M456/O457-1)","v":""},null,2018,{"$f":"IF(Q456=\"Forecast\",\"\",IF(R455=0,\"\",R456/R455-1))","v":""},{"$f":"IF(S455=\"\",\"\",IF(S455=0,\"\",S456/S455-1))","v":""},null,{"$f":"IF(U457=0,\"\",S456/U457-1)","v":""}]
[null,null,null,"Geometric Mean",null,null,{"$f":"IF(G450=0,\"\",(G456/G450)^(1/($D456-$D450-1))-1)","v":""},null,{"$f":"IF(I457=0,\"\",(G456/I457)^(1/(TestYear-RebaseYear-1))-1)","v":""},null,"Geometric Mean",{"$f":"IF(L450=0,\"\",(L454/L450)^(1/($D454-$D450-1))-1)","v":""},{"$f":"IF(M450=0,\"\",(M456/M450)^(1/($D456-$D450-1))-1)","v":""},null,{"$f":"IF(O457=0,\"\",(M456/O457)^(1/(TestYear-RebaseYear-1))-1)","v":""},null,"Geometric Mean",{"$f":"IF(R450=\"\",\"\",IF(R450=0,\"\",(R454/R450)^(1/($D454-$D450-1))-1))","v":""},{"$f":"IF(S450=\"\",\"\",IF(S450=0,\"\",(S456/S450)^(1/($D456-$D450-1))-1))","v":""},null,{"$f":"IF(U457=0,\"\",(S456/U457)^(1/(TestYear-RebaseYear-1))-1)","v":""}]
[]
[]
[null,null,null,"Calendar Year",null,"Revenues",null,null,null,null,{"$f":"IF(ISBLANK(N446),\"\",CONCATENATE(\"Demand (\",N446,\")\"))","v":""},null,null,null,null,null,{"$f":"CONCATENATE(\"Demand (\",N446,\") per \",LEFT(F448,LEN(F448)-1))","v":"Demand () per Customer"}]
[null,null,null,{"$f":"CONCATENATE(\"(for \",TestYear,\" Cost of Service\")","v":"(for 2018 Cost of Service"},null,null,null,null,null,null,null,"Actual (Weather actual)","Weather-normalized",null,{"$f":"M470","v":"Weather-normalized"},null,null,{"$f":"L470","v":"Actual (Weather actual)"},{"$f":"M470","v":"Weather-normalized"},null,{"$f":"O470","v":"Weather-normalized"}]
[null,null,"Historical",{"$f":"D472-1","v":2012},null,{"$f":"F450","v":"Actual"},null,{"$f":"IF(D471=RebaseYear,\"Board-approved\",\"\")","v":""},null,null,{"$f":"K450","v":"Actual"},null,null,{"$f":"N450","v":""},null,null,{"$f":"K471","v":"Actual"},{"$f":"IF(G471=0,\"\",L471/G471)","v":""},{"$f":"IF(G471=0,\"\",M471/G471)","v":""},{"$f":"N471","v":""},{"$f":"IF(T471=\"\",\"\",IF(I471=0,\"\",O471/I471))","v":""}]
[null,null,"Historical",2013,null,"Actual",null,"Board-approved",null,null,"Actual",null,null,"Board-approved",null,null,{"$f":"K472","v":"Actual"},{"$f":"IF(G472=0,\"\",L472/G472)","v":""},{"$f":"IF(G472=0,\"\",M472/G472)","v":""},{"$f":"N472","v":"Board-approved"},{"$f":"IF(T472=\"\",\"\",IF(I472=0,\"\",O472/I472))","v":""}]
[null,null,"Historical",2014,null,"Actual",null,"",null,null,"Actual",null,null,"",null,null,"Actual","","","",""]
[null,null,"Historical",2015,null,"Actual",null,"",null,null,"Actual",null,null,"",null,null,"Actual","","","",""]
[null,null,"Historical",2016,null,"Actual",null,"",null,null,"Actual",null,null,"",null,null,"Actual","","","",""]
[null,null,"Bridge Year (Forecast)",2017,null,"Actual",null,"",null,null,"Actual",null,null,"",null,null,"Actual","","","",""]
[null,null,"Test Year (Forecast)",{"$f":"TestYear","v":2018},null,"Forecast",null,"",null,null,"Forecast",null,null,"",null,null,"Forecast","","","",""]
[null,null,null,null,null,null,null,null,{"$f":"SUM(I471:I476)","v":0},null,null,null,null,null,{"$f":"SUM(O471:O476)","v":0},null,null,null,null,null,{"$f":"SUM(U471:U476)","v":0}]
[null,null,"Variance Analysis","Year",null,null,"Year-over-year",null,{"$f":"I458","v":"Test Year Versus Board-approved"},null,"Year","Year-over-year",null,null,{"$f":"I479","v":"Test Year Versus Board-approved"},null,"Year","Year-over-year",null,null,{"$f":"O479","v":"Test Year Versus Board-approved"}]
[null,null,null,{"$f":"D471","v":2012},null,null,null,null,null,null,{"$f":"D480","v":2012},null,null,null,null,null,{"$f":"K480","v":2012}]
[null,null,null,{"$f":"D472","v":2013},null,null,{"$f":"IF(G471=0,\"\",G472/G471-1)","v":""},null,null,null,{"$f":"D481","v":2013},{"$f":"IF(L471=0,\"\",L472/L471-1)","v":""},{"$f":"IF(M471=0,\"\",M472/M471-1)","v":""},null,null,null,{"$f":"K481","v":2013},{"$f":"IF(R471=\"\",\"\",IF(R471=0,\"\",R472/R471-1))","v":""},{"$f":"IF(S471=\"\",\"\",IF(S471=0,\"\",S472/S471-1))","v":""}]
[null,null,null,{"$f":"D473","v":2014},null,null,{"$f":"IF(G472=0,\"\",G473/G472-1)","v":""},null,null,null,2014,{"$f":"IF(L472=0,\"\",L473/L472-1)","v":""},"",null,null,null,2014,{"$f":"IF(R472=\"\",\"\",IF(R472=0,\"\",R473/R472-1))","v":""},""]
[null,null,null,2015,null,null,"",null,null,null,2015,{"$f":"IF(L473=0,\"\",L474/L473-1)","v":""},"",null,null,null,2015,{"$f":"IF(R473=\"\",\"\",IF(R473=0,\"\",R474/R473-1))","v":""},""]
[null,null,null,2016,null,null,"",null,null,null,2016,{"$f":"IF(L474=0,\"\",L475/L474-1)","v":""},"",null,null,null,2016,{"$f":"IF(R474=\"\",\"\",IF(R474=0,\"\",R475/R474-1))","v":""},""]
[null,null,null,2017,null,null,"",null,null,null,2017,{"$f":"IF(K476=\"Forecast\",\"\",IF(L475=0,\"\",L476/L475-1))","v":""},{"$f":"IF(M475=0,\"\",M476/M475-1)","v":""},null,null,null,2017,{"$f":"IF(Q476=\"Forecast\",\"\",IF(R475=0,\"\",R476/R475-1))","v":{"$error":"#VALUE!"}},{"$f":"IF(S475=\"\",\"\",IF(S475=0,\"\",S476/S475-1))","v":""}]
[null,null,null,2018,null,null,"",null,{"$f":"IF(I478=0,\"\",G477/I478-1)","v":""},null,2018,{"$f":"IF(K477=\"Forecast\",\"\",IF(L476=0,\"\",L477/L476-1))","v":""},{"$f":"IF(M476=0,\"\",M477/M476-1)","v":""},null,{"$f":"IF(O478=0,\"\",M477/O478-1)","v":""},null,2018,{"$f":"IF(Q477=\"Forecast\",\"\",IF(R476=0,\"\",R477/R476-1))","v":""},{"$f":"IF(S476=\"\",\"\",IF(S476=0,\"\",S477/S476-1))","v":""},null,{"$f":"IF(U478=0,\"\",S477/U478-1)","v":""}]
[null,null,null,"Geometric Mean",null,null,{"$f":"IF(G471=0,\"\",(G477/G471)^(1/($D477-$D471-1))-1)","v":""},null,{"$f":"IF(I478=0,\"\",(G477/I478)^(1/(TestYear-RebaseYear-1))-1)","v":""},null,"Geometric Mean",{"$f":"IF(L471=0,\"\",(L475/L471)^(1/($D475-$D471-1))-1)","v":""},{"$f":"IF(M471=0,\"\",(M477/M471)^(1/($D477-$D471-1))-1)","v":""},null,{"$f":"IF(O478=0,\"\",(M477/O478)^(1/(TestYear-RebaseYear-1))-1)","v":""},null,"Geometric Mean",{"$f":"IF(R471=\"\",\"\",IF(R471=0,\"\",(R475/R471)^(1/($D475-$D471-1))-1))","v":""},{"$f":"IF(S471=\"\",\"\",IF(S471=0,\"\",(S477/S471)^(1/($D477-$D471-1))-1))","v":""},null,{"$f":"IF(U478=0,\"\",(S477/U478)^(1/(TestYear-RebaseYear-1))-1)","v":""}]
[]
[null,"Note: If there are more than ten (10) customer classes, please contact OEB Staff to add tables for additional customer classes."]

{"sheet":"App.2-JA_OM&A_Summary_Analys","index":24,"n_rows":60,"n_cols":14,"rows_kept":60,"cut":false,"hidden":false,"merged":[[62,1,63,5],[57,0,58,11],[8,0,8,6],[9,0,9,6],[12,9,12,10],[59,0,59,11]]}
[null,null,null,null,null,null,null,null,null,null,"File Number:",{"$f":"EBNUMBER","v":"EB-2017-0071"}]
[null,null,null,null,null,null,null,null,null,null,"Exhibit:",4]
[null,null,null,null,null,null,null,null,null,null,"Tab:"]
[null,null,null,null,null,null,null,null,null,null,"Schedule:"]
[null,null,null,null,null,null,null,null,null,null,"Page:","Appendix 1"]
[]
[null,null,null,null,null,null,null,null,null,null,"Date:","2018-03-29"]
[]
["Appendix 2-JA"]
["Summary of Recoverable OM&A Expenses"]
[]
[]
[null,{"$f":"\"Last Rebasing Year (\" & RebaseYear & \" Board-Approved)\"","v":"Last Rebasing Year (2013 Board-Approved)"},{"$f":"\"Last Rebasing Year (\" & RebaseYear & \" Actuals)\"","v":"Last Rebasing Year (2013 Actuals)"},{"$f":"BridgeYear -3 & \" Actuals\"","v":"2014 Actuals"},{"$f":"BridgeYear -2 & \" Actuals\"","v":"2015 Actuals"},{"$f":"BridgeYear -1 & \" Actuals\"","v":"2016 Actuals"},"2017 Bridge Year","2017 Actuals",{"$f":"TestYear & \" Test Year\"","v":"2018 Test Year"}]
["Reporting Basis","CGAAP","CGAAP","MIFRS","MIFRS","MIFRS","MIFRS","MIFRS","MIFRS"]
["Operations",3560312.2099999995,3667835,3558777,3702949,3771352,3752937,3924735,4026056.63]
["Maintenance",1978404.9300000004,2324284,2214631,2274649,2206518,2103645,1991880,2186572.79]
["SubTotal",{"$f":"SUM(B15:B16)","v":5538717.1399999997},{"$f":"SUM(C15:C16)","v":5992119},{"$f":"SUM(D15:D16)","v":5773408},5977598,5977870,{"$f":"SUM(G15:G16)","v":5856582},5916615,6212629.4199999999]
["%Change (year over year)",null,null,{"$f":"IF(ISERROR((D17-C17)/C17), \"\", (D17-C17)/C17)","v":-3.6499775788831963E-2},{"$f":"IF(ISERROR((E17-D17)/D17), \"\", (E17-D17)/D17)","v":3.5367325503411505E-2},{"$f":"IF(ISERROR((F17-E17)/E17), \"\", (F17-E17)/E17)","v":4.5503227216015528E-5},-2.0289501109927114E-2,{"$f":"IF(ISERROR((H17-F17)/F17), \"\", (H17-F17)/F17)","v":-1.0246960874023691E-2},5.0031043087981883E-2]
["%Change (Test Year vs \nLast Rebasing Year - Actual)",null,null,null,null,null,null,null,{"$f":"IF(ISERROR((I17-C17)/C17), \"\", (I17-C17)/C17)","v":3.6800073563292041E-2}]
["Billing and Collecting",1163141.2243999999,1274108,1373301,1417758,1572173,1618876,1682623,1575376]
["Community Relations",544548.31640000013,501391,557701,670544,626657,741795,702566,618800]
["Administrative and General",2706539.3188699996,4438267,3332931,3211923,3188235,3378987,3347960,3549028]
["SubTotal",{"$f":"SUM(B20:B22)","v":4414228.8596700002},{"$f":"SUM(C20:C22)","v":6213766},{"$f":"SUM(D20:D22)","v":5263933},5300225,5387065,{"$f":"SUM(G20:G22)","v":5739658},5733149,5743204]
["%Change (year over year)",null,null,{"$f":"IF(ISERROR((D23-C23)/C23), \"\", (D23-C23)/C23)","v":-0.15285947362678284},{"$f":"IF(ISERROR((E23-D23)/D23), \"\", (E23-D23)/D23)","v":6.8944646521906716E-3},{"$f":"IF(ISERROR((F23-E23)/E23), \"\", (F23-E23)/E23)","v":1.6384210104288026E-2},6.5451781257512207E-2,{"$f":"IF(ISERROR((H23-F23)/F23), \"\", (H23-F23)/F23)","v":6.4243516645891591E-2},{"$f":"IF(ISERROR((I23-H23)/H23), \"\", (I23-H23)/H23)","v":1.7538354576167477E-3}]
["%Change (Test Year vs \nLast Rebasing Year - Actual)",null,null,null,null,null,null,null,{"$f":"IF(ISERROR((I23-C23)/C23), \"\", (I23-C23)/C23)","v":-7.5728954067468907E-2}]
["Total",{"$f":"SUM(B23,B17)","v":9952945.9996699989},{"$f":"SUM(C23,C17)","v":12205885},11037341,11277823,11364935,{"$f":"SUM(G23,G17)","v":11596240},11649764,11955833.42]
["%Change (year over year)",null,null,{"$f":"IF(ISERROR((D26-C26)/C26), \"\", (D26-C26)/C26)","v":-9.5736114177710177E-2},{"$f":"IF(ISERROR((E26-D26)/D26), \"\", (E26-D26)/D26)","v":2.1788037535489753E-2},{"$f":"IF(ISERROR((F26-E26)/E26), \"\", (F26-E26)/E26)","v":7.7241857759250167E-3},2.0352514114686974E-2,{"$f":"IF(ISERROR((H26-F26)/F26), \"\", (H26-F26)/F26)","v":2.5062087904594264E-2},{"$f":"IF(ISERROR((I26-H26)/H26), \"\", (I26-H26)/H26)","v":2.627258543606548E-2}]
[]
[]
[null,{"$f":"B13","v":"Last Rebasing Year (2013 Board-Approved)"},{"$f":"C13","v":"Last Rebasing Year (2013 Actuals)"},"2014 Actuals","2015 Actuals","2016 Actuals","2017 Bridge Year",{"$f":"H13","v":"2017 Actuals"},{"$f":"I13","v":"2018 Test Year"}]
["Operations",{"$f":"B15","v":3560312.2099999995},{"$f":"C15","v":3667835},{"$f":"D15","v":3558777},3702949,3771352,{"$f":"G15","v":3752937},{"$f":"H15","v":3924735},{"$f":"I15","v":4026056.63}]
["Maintenance",{"$f":"B16","v":1978404.9300000004},{"$f":"C16","v":2324284},{"$f":"D16","v":2214631},2274649,2206518,{"$f":"G16","v":2103645},{"$f":"H16","v":1991880},{"$f":"I16","v":2186572.79}]
["Billing and Collecting",{"$f":"B20","v":1163141.2243999999},{"$f":"C20","v":1274108},{"$f":"D20","v":1373301},1417758,1572173,{"$f":"G20","v":1618876},{"$f":"H20","v":1682623},1575376]
["Community Relations",{"$f":"B21","v":544548.31640000013},{"$f":"C21","v":501391},{"$f":"D21","v":557701},670544,626657,{"$f":"G21","v":741795},702566,618800]
["Administrative and General",{"$f":"B22","v":2706539.3188699996},{"$f":"C22","v":4438267},{"$f":"D22","v":3332931},3211923,3188235,{"$f":"G22","v":3378987},3347960,3549028]
["Total",{"$f":"SUM(B31:B35)","v":9952945.9996699989},{"$f":"SUM(C31:C35)","v":12205885},{"$f":"SUM(D31:D35)","v":11037341},11277823,11364935,{"$f":"SUM(G31:G35)","v":11596240},11649764,11955833.42]
["%Change (year over year)",null,null,{"$f":"IF(ISERROR((D36-C36)/C36), \"\", (D36-C36)/C36)","v":-9.5736114177710177E-2},{"$f":"IF(ISERROR((E36-D36)/D36), \"\", (E36-D36)/D36)","v":2.1788037535489753E-2},{"$f":"IF(ISERROR((F36-E36)/E36), \"\", (F36-E36)/E36)","v":7.7241857759250167E-3},2.0352514114686974E-2,{"$f":"IF(ISERROR((H36-F36)/F36), \"\", (H36-F36)/F36)","v":2.5062087904594264E-2},{"$f":"IF(ISERROR((I36-H36)/H36), \"\", (I36-H36)/H36)","v":2.627258543606548E-2}]
[]
[]
[null,{"$f":"B13","v":"Last Rebasing Year (2013 Board-Approved)"},{"$f":"C13","v":"Last Rebasing Year (2013 Actuals)"},{"$f":"\"Variance \" & 'LDC Info'!E28 & \"  Board-approved – \" & 'LDC Info'!E28 & \" Actuals\"","v":"Variance 2013  Board-approved – 2013 Actuals"},{"$f":"D13","v":"2014 Actuals"},"Variance 2014 vs. 2013 Actuals",{"$f":"E13","v":"2015 Actuals"},"Variance 2015 vs. 2014 Actuals",{"$f":"F13","v":"2016 Actuals"},{"$f":"\"Variance \" & 'LDC Info'!E26 -1 & \" Actuals vs. \" &  'LDC Info'!E26-2 & \" Actuals\"","v":"Variance 2016 Actuals vs. 2015 Actuals"},{"$f":"H13","v":"2017 Actuals"},{"$f":"\"Variance \" & 'LDC Info'!E26 & \" Bridge vs. \" & 'LDC Info'!E26 -1 & \" Actuals\"","v":"Variance 2017 Bridge vs. 2016 Actuals"},{"$f":"I13","v":"2018 Test Year"},{"$f":"\"Variance \" & TestYear & \" Test vs. \" & BridgeYear & \" Bridge\"","v":"Variance 2018 Test vs. 2017 Bridge"}]
["Operations",{"$f":"B15","v":3560312.2099999995},3667835,{"$f":"C41-B41","v":107522.7900000005},{"$f":"D15","v":3558777},{"$f":"E41-C41","v":-109058},{"$f":"E15","v":3702949},{"$f":"G41-E41","v":144172},{"$f":"F15","v":3771352},{"$f":"I41-G41","v":68403},{"$f":"H15","v":3924735},{"$f":"K41-I41","v":153383},{"$f":"I15","v":4026056.63},{"$f":"M41-K41","v":101321.62999999989}]
["Maintenance ",1978404.9300000004,2324284,{"$f":"C42-B42","v":345879.0699999996},{"$f":"D16","v":2214631},{"$f":"E42-C42","v":-109653},{"$f":"E16","v":2274649},{"$f":"G42-E42","v":60018},{"$f":"F16","v":2206518},{"$f":"I42-G42","v":-68131},{"$f":"H16","v":1991880},-214638,{"$f":"I16","v":2186572.79},194692.79000000004]
["Billing and Collecting ",{"$f":"B20","v":1163141.2243999999},1274108,110966.77560000005,{"$f":"D20","v":1373301},99193,{"$f":"E20","v":1417758},44457,{"$f":"F20","v":1572173},154415,{"$f":"H20","v":1682623},110450,{"$f":"I20","v":1575376},-107247]
["Community Relations ",544548.31640000013,501391,-43157.316400000127,{"$f":"D21","v":557701},56310,{"$f":"E21","v":670544},112843,{"$f":"F21","v":626657},-43887,{"$f":"H21","v":702566},75909,{"$f":"I21","v":618800},-83766]
["Administrative and General ",2706539.3188699996,4438267,1731727.6811300004,{"$f":"D22","v":3332931},-1105336,{"$f":"E22","v":3211923},-121008,{"$f":"F22","v":3188235},-23688,{"$f":"H22","v":3347960},159725,{"$f":"I22","v":3549028},201068]
["Total OM&A Expenses ",{"$f":"SUM(B41:B45)","v":9952945.9996699989},{"$f":"SUM(C41:C45)","v":12205885},2252939.0003300011,{"$f":"SUM(E41:E45)","v":11037341},{"$f":"SUM(F41:F45)","v":-1168544},11277823,240482,11364935,87112,11649764,284829,11955833.42,306069.41999999993]
["Adjustments for Total non-recoverable items (from Appendices 2-JA and 2-JB)"]
["Total Recoverable OM&A Expenses ",{"$f":"B46-B47","v":9952945.9996699989},{"$f":"C46-C47","v":12205885},{"$f":"D46-D47","v":2252939.0003300011},11037341,-1168544,11277823,240482,11364935,87112,11649764,284829,11955833.42,306069.41999999993]
["Variance from previous year ",null,null,null,{"$f":"E48-C48","v":-1168544},null,{"$f":"G48-E48","v":240482},null,{"$f":"I48-G48","v":87112},null,{"$f":"K48-I48","v":284829},null,{"$f":"M48-K48","v":306069.41999999993}]
["Percent change (year over year) ",null,null,null,{"$f":"IF(ISERROR(E49/C48), \"\", E49/C48)","v":-9.5736114177710177E-2},null,{"$f":"IF(ISERROR(G49/E48), \"\", G49/E48)","v":2.1788037535489753E-2},null,{"$f":"IF(ISERROR(I49/G48), \"\", I49/G48)","v":7.7241857759250167E-3},null,{"$f":"IF(ISERROR(K49/I48), \"\", K49/I48)","v":2.5062087904594264E-2},null,{"$f":"IF(ISERROR(M49/K48), \"\", M49/K48)","v":2.627258543606548E-2}]
["Percent Change:                                                    Test year vs. Most Current Actual ",null,null,null,null,null,null,null,{"$f":"IF(ISERROR((M48-I48)/I48), \"\", (M48-I48)/I48)","v":5.1993119186339379E-2}]
["Simple average of % variance for all years",null,null,null,null,null,null,null,{"$f":"IF(ISERROR((M46-C46)/C46), \"\", (M46-C46)/C46)","v":-2.0486149099389356E-2},null,null,null,null,{"$f":"IF(ISERROR(AVERAGE(G50,I50,K50,M50)), \"\", AVERAGE(G50,I50,K50,M50))","v":2.0211724163018627E-2}]
["Compound Annual Growth Rate for all years",null,null,null,null,null,null,null,{"$f":"IF(ISERROR((M49-C49)/C49), \"\", (M49-C49)/C49)","v":""},null,null,null,null,{"$f":"IF((M48-C48)=0, \"\", (M48/C48)^(1/5)-1)","v":-4.1312231043910685E-3}]
[{"$f":"\"Compound Growth Rate                                                            (\" & F13 & \" vs. \" & 'LDC Info'!E28 & \" Actuals)\"","v":"Compound Growth Rate                                                            (2016 Actuals vs. 2013 Actuals)"},null,null,null,null,null,null,null,{"$f":"IF(ISERROR((I48/C48)^(1/(3)) - 1), \"\", (I48/C48)^(1/(3)) - 1)","v":-2.3514285605933605E-2}]
[]
["Note:"]
[]
["1     If it has been more than three years since the applicant last filed a cost of service application, additional years of historical actuals should be incorporated into the table, as necessary, to go back to the last cost of service application.  If the applicant last filed a cost of service application less than three years ago, a minimum of three years of actual information is required."]
[]
["2     Recoverable OM&A that is included on these tables should be identical to the recoverable OM&A that is shown for the corresponding periods on Appendix 2-JB."]

{"sheet":"App.2-JB_OM&A_Cost _Drivers","index":25,"n_rows":42,"n_cols":8,"rows_kept":42,"cut":false,"hidden":false,"merged":[[9,0,9,5],[10,0,10,5],[44,1,44,5],[39,1,39,6],[40,1,40,6],[41,1,43,6]]}
[null,null,null,null,null,"File Number:",{"$f":"EBNUMBER","v":"EB-2017-0071"}]
[null,null,null,null,null,"Exhibit:",4]
[null,null,null,null,null,"Tab:"]
[null,null,null,null,null,"Schedule:"]
[null,null,null,null,null,"Page:","Appendix 2"]
[]
[null,null,null,null,null,"Date:","2018-03-29"]
[]
[]
["Appendix 2-JB"]
[{"$f":"\"Recoverable OM&A Cost Driver Table\" & CHAR(185)&CHAR(183)&CHAR(179)","v":"Recoverable OM&A Cost Driver Table¹·³"}]
[]
["OM&A",{"$f":"\"Last Rebasing Year (\"&RebaseYear&\" Actuals)\"","v":"Last Rebasing Year (2013 Actuals)"},{"$f":"BridgeYear -3 & \" Actuals\"","v":"2014 Actuals"},{"$f":"BridgeYear -2 & \" Actuals\"","v":"2015 Actuals"},{"$f":"BridgeYear -1 & \" Actuals\"","v":"2016 Actuals"},"2017 Bridge Year","2017 Actuals",{"$f":"TestYear & \" Test Year\"","v":"2018 Test Year"}]
["Reporting Basis","CGAAP","MIFRS","MIFRS","MIFRS","MIFRS","MIFRS","MIFRS"]
[{"$f":"\"Opening Balance\" & CHAR(178)","v":"Opening Balance²"},9952946,{"$f":"B36","v":12205886.088972993},{"$f":"C36","v":11037339.989049518},{"$f":"D36","v":11277822.82895435},{"$f":"E36","v":11364937.106367141},{"$f":"E36","v":11364937.106367141},{"$f":"F36","v":11596240.721511701}]
[]
["Salaries, Wages & Benefits",416110.42745999526,-62523.302050062455,373054.36632952467,50664.865058388561,-56404.885352360085,157473.4278951548,339234.83324750792]
["Administrative",-55700.773633999983,-23580.18304530828,46586.416065380152,24711.662400780944,-29985.098796852282,-27620.358796852641,-5204.5800000005402]
["Training",-18739.952727999989,-719.56272869546956,-1855.4500216900196,-50130.118600028101,67417.445050413604,35229.405050413567,6394.789999999979]
["Material",34342.420000000042,7414.570000000007,-84895.959999999992,93963.640000000043,-84618.990000000049,-89877.580000000104,0]
["Trucking/Equipment",24429.479561000015,-32088.961613706371,399.71630201279186,28556.609747382812,25388.522449599055,12876.341705310799,-7.4428832158446312E-4]
["Bad Debt Expense",74345.280000000013,-63203.060000000012,53145.58,207209.47400000005,-41703.964000000036,23462.925999999861,-87473.07]
["Community Relations",-54077.030000000042,-10576.252399999968,34152.133999999962,-41471.915200000003,104315.8872,81220.477200000227,-11547.02999999997]
["Building",1486260.1424689996,-1151579.6328273492,-126779.33486676111,-21395.223833306925,41351.831438883906,-317917.43936958187,42331.479191533639]
["Insurance",47521.221544999993,42338.201710850059,4113.6819458736281,-5801.3261587440211,-62931.857603517943,-84715.240479979635,-2.8764617163687944E-3]
["Property Taxes",3240.9400000000023,5295.5799999999945,4906.0400000000009,4858.3799999999974,4650.9900000000052,294964.83999999997,1022]
["Outside Services",232799.04078400019,90395.996847889153,-40609.122306557139,-125910.3125880796,99127.174483747687,63556.99448374752,9833.9899999999907]
["Postage",-14737.902704999986,14889.268814707233,-2686.9017738710681,-27132.355401230016,44319.780720393814,29697.100720393675,0]
["Professional Fees",77491.140420000011,-20838.342474999779,19009.337795449566,-55553.488488476432,71996.406248026615,76402.506248026533,60000]
["Memberships, Licenses, Fees",6568.1716660000384,9049.1923988312483,-2363.5517401195539,0.74559686277643777,-6361.1425475744763,1171.867452425533,0]
["Computers",-28416.899967999954,34476.85772867687,-38616.321372104518,39282.711462802894,20347.938313624705,6937.6383136248915,0]
["Telephone/Fibre",25645.024102999989,-1974.8302843066631,7502.7495476963522,-30334.850583564184,26148.927540174496,8751.927540174438,0]
["Income Tax",-4140.6399999999994,-5321.6399999999994,-4580.5400000000009,-4404.2200000000012,8244.6500000000015,13212.650000000001,5000]
[]
[]
[{"$f":"\"Closing Balance\"&CHAR(178)","v":"Closing Balance²"},{"$f":"SUM(B15:B35)","v":12205886.088972993},11037339.989049518,11277822.82895435,11364937.106367141,{"$f":"SUM(F15:F35)","v":11596240.721511701},11649764.590329999,11955833.130329991]
[]
["Notes:"]
[]
[1,"For each year, a detailed explanation for each cost driver and associated amount is requied in Exhibit 4."]
[2,"Opening Balance for \"Last Rebasing Year\" (cell B15) should be equal to the Board-Approved amount. For purposes of assessing incremental cost drivers, the closing balance for each year becomes the opening balance for the next year."]
[3,"If it has been more than four years since the applicant last filed a cost of service application, additional years of historical actuals should be incorporated into the table, as necessary, to go back to the last cost of service application.  If the applicant last filed a cost of service application less than four years ago, a minimum of three years of actual information is required."]

{"sheet":"App.2-JC_OMA Programs","index":26,"n_rows":55,"n_cols":11,"rows_kept":55,"cut":false,"hidden":false,"merged":[[57,0,58,8],[8,0,8,7],[9,0,9,7],[11,0,11,7],[55,0,55,7],[53,0,53,8],[54,0,54,8]]}
[null,null,null,null,null,null,null,"File Number:",{"$f":"EBNUMBER","v":"EB-2017-0071"}]
[null,null,null,null,null,null,null,"Exhibit:",4]
[null,null,null,null,null,null,null,"Tab:"]
[null,null,null,null,null,null,null,"Schedule:"]
[null,null,null,null,null,null,null,"Page:","Appendix 3"]
[]
[null,null,null,null,null,null,null,"Date:","2018-03-29"]
[]
["Appendix 2-JC"]
["OM&A Programs Table"]
[]
[]
["Programs",{"$f":"\"Last Rebasing Year (\" & RebaseYear & \" Board-Approved)\"","v":"Last Rebasing Year (2013 Board-Approved)"},{"$f":"\"Last Rebasing Year (\" & RebaseYear & \" Actuals)\"","v":"Last Rebasing Year (2013 Actuals)"},{"$f":"BridgeYear-3&\" Actuals\"","v":"2014 Actuals"},{"$f":"BridgeYear -2 & \" Actuals\"","v":"2015 Actuals"},{"$f":"BridgeYear -1 & \" Actuals\"","v":"2016 Actuals"},{"$f":"BridgeYear & \" Bridge Year\"","v":"2017 Bridge Year"},"2017 Actuals",{"$f":"TestYear & \" Test Year\"","v":"2018 Test Year"},{"$f":"\"Variance \n(Test Year vs. \" & F13 &\")\"","v":"Variance \n(Test Year vs. 2016 Actuals)"},{"$f":"\"Variance \n(Test Year vs. \" & B13","v":"Variance \n(Test Year vs. Last Rebasing Year (2013 Board-Approved)"}]
["Reporting Basis","CGAAP","CGAAP","MIFRS","MIFRS","MIFRS","MIFRS","MIFRS","MIFRS","MIFRS","MIFRS"]
["Operations"]
["Overhead Lines",891022.1399999999,886027.29999999993,999996.20999999985,833709.7699999999,913150.80000000016,977516.1800000004,973078.15999999677,970784.30999999971,{"$f":"I16-F16","v":57633.509999999544},{"$f":"I16-B16","v":79762.169999999809}]
["Underground Lines",99541.360000000015,103879.41,204384.42,194355.35999999996,183526.39999999997,157705.87000000002,172149.05999999965,204472.67,20946.270000000048,104931.31]
["Operations Supervisory",575828.34000000008,677615.57,607190.29999999993,661002.52999999991,622027.98000000021,649054.91,655091.49000000395,646624.99,24597.009999999776,70796.649999999907]
["Load Dispatching",255220.95999999996,269911.99,252337.87,223193.58,232037.56,199330.68,279809.31000000087,214484.99000000002,-17552.569999999978,-40735.969999999943]
["Stations",848217.11,905156.05000000028,741855.57000000007,747612.36999999976,733615.00999999943,798953.58999999985,808188.18000000366,930301.21999999986,196686.21000000043,82084.10999999987]
["Transformers",14242.46,8202.4599999999991,1012.8000000000001,3983.9799999999977,15664.480000000001,17275.66,11996.31,9256.6299999999992,-6407.8500000000022,-4985.83]
["Meters",423007.64000000007,369650.41,319705.76,485787.31999999995,550629.51,497222.96,548616.73000000091,584371.2699999999,33741.759999999893,161363.62999999983]
["Transmission",1136.28,43833.94,38620.100000000006,40955.33,50381.46,82221.25,51237.26999999999,83563.320000000007,33181.860000000008,82427.040000000008]
["Miscellaneous Operating",452095.91999999993,403559.15,397480.87999999995,512348.67000000004,470319.59999999992,373655.8,424568.2900000005,382197.23000000004,-88122.369999999879,-69898.689999999886]
["Sub-Total",{"$f":"SUM(B16:B24)","v":3560312.2099999995},{"$f":"SUM(C16:C24)","v":3667836.2800000003},3562583.9099999997,3702948.9099999992,3771352.8000000003,{"$f":"SUM(G16:G24)","v":3752936.9000000004},3924734.8000000063,4026056.6299999994,254703.82999999914,465744.41999999993]
["Maintenance"]
["Overhead Lines",1332909.3000000003,1688545.7599999998,1576852.9799999997,1288038.1100000003,1371983.0099999995,1343955.74,1297624.4699999993,1367903.0500000003,{"$f":"I27-F27","v":-4079.9599999992643},{"$f":"I27-B27","v":34993.75}]
["Underground Lines",258634.15,344540.47,306555.32999999996,342920.34999999992,360487,297418.75,291935.74000000028,304846.74,-55640.260000000009,46212.59]
["Stations",265799.14,190298.82999999996,243581.19,350954.77,345772.68999999994,348350.90000000008,275757.49000000005,339887.57,-5885.1199999999371,74088.429999999993]
["Transformers",46919.82,22016.94,27815.379999999997,211053.87000000002,71121.48,32373.96,64205.4,121563.16999999998,50441.689999999988,74643.349999999977]
["Meters",74142.51999999999,78882.35000000002,56018.41,81681.84,57154.310000000005,81546.14,62357.220000000052,52372.259999999995,-4782.0500000000102,-21770.259999999995]
["Sub-Total",{"$f":"SUM(B27:B31)","v":1978404.9300000004},2324284.3499999996,2210823.2899999996,2274648.94,2206518.4899999998,{"$f":"SUM(G27:G31)","v":2103645.4900000002},1991880.3199999994,2186572.79,-19945.699999999721,208167.85999999964]
["Customer Service"]
["Bad Debt Expense",107679.73999999999,182025.04,127592.73000000001,181321.21,378851.89,350000,421718.37999999995,261613.23,{"$f":"I34-F34","v":-117238.66},{"$f":"I34-B34","v":153933.49000000002}]
["Customer Billing",757150.11160000006,811475.89760000014,966424.74760000012,888033.46080000012,851360.4972000001,914837.07000000007,896854.32999999973,962453.48999999964,111092.99279999954,205303.37839999958]
["Customer Collections",298311.37279999995,280606.7300000001,279283.40260000009,348403.49779999995,341960.50780000002,354038.49000000005,364050.71000000025,351308.99,9348.4821999999695,52997.617200000037]
["Community Relations",544548.31640000013,501391.02480000001,557700.98280000011,670544.26240000012,626657.47320000036,741795.32999999984,702565.73000000056,618799.55999999994,-7857.9132000004174,74251.243599999812]
[null,null,null,null,null,null,null,null,null,0,0]
["Sub-Total",{"$f":"SUM(B34:B38)","v":1707689.5408000001},1775498.6924000003,1931001.8630000004,2088302.4310000003,2198830.3682000004,{"$f":"SUM(G34:G38)","v":2360670.8899999997},2385189.1500000004,2194175.2699999996,-4655.0982000008225,486485.72919999948]
["Administration"]
["Income Tax",50202.39,46061.75,40740.11,36159.57,31755.35,40000,325523.92,45000,{"$f":"I41-F41","v":13244.650000000001},{"$f":"I41-B41","v":-5202.3899999999994}]
["Insurance",61588.066701999996,147363.04946399998,198627.05606322124,205612.26144764852,198795.70713439095,131135.905410612,115188.39000000001,127641.68,-71154.027134390955,66053.613297999997]
["LEAP",19054,19873,22610,22926,23270,24000,23270,24000,730,4946]
["Audit, Legal & Consulting",116024.534011,134156.75570400001,230840.42723693835,227541.98497614727,139565.60249052258,255252.31,174484.7899999998,209184.52000000002,69618.91750947744,93159.985989000023]
["Regulatory Affairs",206942.73,297502.92999999993,121885.47,149855.77000000002,246739.35,350292.1,451155.98000000033,405760.6,159021.24999999997,198817.86999999997]
["Building",512531.6524410001,2005467.6534439996,823330.0345092488,653778.48443622247,699549.33935485838,653602.04577109579,378662.27000000025,741039.68,41490.340645141667,228508.02755899995]
["Administrative",1740195.9457159997,1787841.6276310005,1894897.81951011,1916048.4767643351,1848560.0988573765,1924705.0800000005,1879674.9699999995,1996401.9599999995,147841.86114262301,256206.0142839998]
["Sub-Total",{"$f":"SUM(B41:B47)","v":2706539.3188699996},4438266.7662429996,3332930.9173195185,3211922.5476243533,3188235.4478371488,{"$f":"SUM(G41:G47)","v":3378987.4411817081},3347960.32,3549028.4399999995,360792.99216285069,842489.12112999987]
["Miscellaneous",null,null,null,null,null,null,null,null,0,0]
["Total",{"$f":"SUMPRODUCT(--($A15:$A49=\"Sub-Total\"), B$15:B$49)+B49","v":9952945.9996699989},12205886.088643,11037339.980319519,11277822.828624353,11364937.106037149,{"$f":"SUMPRODUCT(--($A15:$A49=\"Sub-Total\"), G$15:G$49)+G49","v":11596240.721181709},11649764.590000005,11955833.129999999,590896.02396284975,2002887.1303300001]
[]
["Notes:"]
[]
["1   Please provide a breakdown of the major components of each OM&A Program undertaken in each year.  Please ensure that all Programs below the materiality threshold are included in the miscellaneous line.  Add more Programs as required."]
["2   The applicant should group projects appropriately and avoid presentations that result in classification of significant components of the OM&A budget in the miscellaneous category"]

{"sheet":"App.2-K_Employee Costs","index":27,"n_rows":32,"n_cols":9,"rows_kept":32,"cut":false,"hidden":false,"merged":[[31,0,31,7],[8,0,8,7],[9,0,9,7]]}
[null,null,null,null,null,null,"File Number:",{"$f":"EBNUMBER","v":"EB-2017-0071"}]
[null,null,null,null,null,null,"Exhibit:",4]
[null,null,null,null,null,null,"Tab:"]
[null,null,null,null,null,null,"Schedule:"]
[null,null,null,null,null,null,"Page:","Appendix 4"]
[]
[null,null,null,null,null,null,"Date:","2018-03-29"]
[]
["Appendix 2-K"]
["Employee Costs"]
[]
[null,{"$f":"\"Last Rebasing Year - \"&RebaseYear&\"- Board Approved\"","v":"Last Rebasing Year - 2013- Board Approved"},{"$f":"\"Last Rebasing Year - \"&RebaseYear&\"-  Actual\"","v":"Last Rebasing Year - 2013-  Actual"},{"$f":"BridgeYear-3 & \" Actuals\"","v":"2014 Actuals"},{"$f":"BridgeYear -2 & \" Actuals\"","v":"2015 Actuals"},{"$f":"BridgeYear -1 & \" Actuals\"","v":"2016 Actuals"},"2017 Bridge Year","2017 Actuals",{"$f":"TestYear & \" Test Year\"","v":"2018 Test Year"}]
["Number of Employees (FTEs including Part-Time)1"]
["Management (including executive)",19.420000000000005,18.34810597910613,18.580097480683119,18.153814354991731,19.747473043566405,20.190000000000001,18.86,19.104528254534106]
["Non-Management (union and non-union)",67.570000000000007,69.266277861836727,69.636468145795575,66.471734980367856,65.167404052686095,65.510000000000005,65.91,65.051971808616869]
["Total",{"$f":"SUM(B14:B15)","v":86.990000000000009},87.61438384094285,88.216565626478697,84.62554933535958,84.914877096252496,{"$f":"SUM(G14:G15)","v":85.7},84.77,84.156500063150972]
["Total Salary and Wages including ovetime and incentive pay"]
["Management (including executive)",1917059,1980372,2072404,1999948,2164199,2264896,2084559.69,2219285.0348839588]
["Non-Management (union and non-union)",4130942,5239956,5556363,5181452,5102891,5321163,5159093.6500000004,5475807.2243933948]
["Total",{"$f":"SUM(B18:B19)","v":6048001},7220328,7628767,7181400,7267090,{"$f":"SUM(G18:G19)","v":7586059},7243653.3399999999,7695092.2592773531]
["Total Benefits (Current + Accrued) 2"]
["Management (including executive)",429613,396127,475333,513666,585138.74,572644,514860.5564154794,562868.65201609931]
["Non-Management (union and non-union)",1617450,1393211,1414264,1386930,1401771.48,1455969,1418842.758229028,1445295.783817722]
["Total",{"$f":"SUM(B22:B23)","v":2047063},{"$f":"SUM(C22:C23)","v":1789338},1889597,1900596,1986910.22,{"$f":"SUM(G22:G23)","v":2028613},1933703.3146445074,2008164.4358338213]
["Total Compensation (Salary, Wages, & Benefits)"]
["Management (including executive)",{"$f":"B18+B22","v":2346672},2376499,{"$f":"D18+D22","v":2547737},2513614,2749337.74,{"$f":"+G18+G22","v":2837540},2599420.2464154791,2782153.6869000578]
["Non-Management (union and non-union)",5748392,6633167,{"$f":"D19+D23","v":6970627},6568382,6504662.4800000004,{"$f":"+G19+G23","v":6777132},6577936.4082290288,6921103.0082111172]
["Total",8095064,9009666,{"$f":"D20+D24","v":9518364},9081996,9254000.2200000007,9614672,9177356.6546445079,9703256.6951111741]
[]
["Note:"]
["1 If an applicant wishes to use headcount, it must also file the same schedule on an FTE basis."]
["2 Current employee benefits, plus Pension and Other Post-Employment Benefits costs, as recorded for recovery in distribution rates. Should be consistent with OPEBs costs as documented in Appendix 2-KA."]

{"sheet":"App.2-L_OM&A_per_Cust_FTE","index":28,"n_rows":38,"n_cols":11,"rows_kept":38,"cut":false,"hidden":false,"merged":[[13,1,13,2],[14,1,14,2],[15,1,15,2],[8,1,8,9],[9,1,9,9],[22,1,22,2],[25,1,25,2],[26,1,26,2],[16,1,16,2],[17,1,17,2],[18,1,18,2],[19,1,19,2],[20,1,20,2],[21,1,21,2],[37,2,37,9],[34,2,34,9],[35,2,35,9],[36,2,36,9],[32,2,33,9]]}
[null,null,null,null,null,null,null,null,"File Number:",{"$f":"EBNUMBER","v":"EB-2017-0071"}]
[null,null,null,null,null,null,null,null,"Exhibit:",4]
[null,null,null,null,null,null,null,null,"Tab:"]
[null,null,null,null,null,null,null,null,"Schedule:"]
[null,null,null,null,null,null,null,null,"Page:","Appendix 5"]
[]
[null,null,null,null,null,null,null,null,"Date:","2018-03-29"]
[]
[null,"Appendix 2-L"]
[null,"Recoverable OM&A Cost per Customer and per FTE 1"]
[]
[]
[null,null,null,{"$f":"\"Last Rebasing Year - \"&RebaseYear&\"- Board Approved\"","v":"Last Rebasing Year - 2013- Board Approved"},{"$f":"\"Last Rebasing Year - \"&RebaseYear&\"-  Actual\"","v":"Last Rebasing Year - 2013-  Actual"},{"$f":"BridgeYear -3 & \" Actuals\"","v":"2014 Actuals"},{"$f":"BridgeYear -2 & \" Actuals\"","v":"2015 Actuals"},{"$f":"BridgeYear -1 & \" Actuals\"","v":"2016 Actuals"},{"$f":"BridgeYear & \" Bridge Year\"","v":"2017 Bridge Year"},"2017 Actuals",{"$f":"TestYear & \" Test Year\"","v":"2018 Test Year"}]
[null,"Reporting Basis",null,"CGAAP","CGAAP","MIFRS","MIFRS","MIFRS","MIFRS","MIFRS","MIFRS"]
[null,"OM&A Costs"]
[null,"     O&M",null,{"$f":"+'App.2-JA_OM&A_Summary_Analys'!B17","v":5538717.1399999997},{"$f":"+'App.2-JA_OM&A_Summary_Analys'!C17","v":5992119},{"$f":"+'App.2-JA_OM&A_Summary_Analys'!D17","v":5773408},{"$f":"+'App.2-JA_OM&A_Summary_Analys'!E17","v":5977598},{"$f":"+'App.2-JA_OM&A_Summary_Analys'!F17","v":5977870},5856582,{"$f":"+'App.2-JA_OM&A_Summary_Analys'!H17","v":5916615},{"$f":"+'App.2-JA_OM&A_Summary_Analys'!I17","v":6212629.4199999999}]
[null,"     Admin Expenses",null,{"$f":"+'App.2-JA_OM&A_Summary_Analys'!B23","v":4414228.8596700002},{"$f":"+'App.2-JA_OM&A_Summary_Analys'!C23","v":6213766},{"$f":"+'App.2-JA_OM&A_Summary_Analys'!D23","v":5263933},{"$f":"+'App.2-JA_OM&A_Summary_Analys'!E23","v":5300225},{"$f":"+'App.2-JA_OM&A_Summary_Analys'!F23","v":5387065},5739658,{"$f":"+'App.2-JA_OM&A_Summary_Analys'!H23","v":5733149},{"$f":"+'App.2-JA_OM&A_Summary_Analys'!I23","v":5743204}]
[null,"Total Recoverable OM&A from Appendix 2-JB 5",null,{"$f":"SUM(D16:D17)","v":9952945.9996699989},{"$f":"SUM(E16:E17)","v":12205885},11037341,11277823,11364935,{"$f":"SUM(I16:I17)","v":11596240},11649764,11955833.42]
[null,"Number of Customers 2,4",null,{"$f":"+'App.2-IB_Load_Forecast_Analysis'!I64+'App.2-IB_Load_Forecast_Analysis'!I107+'App.2-IB_Load_Forecast_Analysis'!I150","v":33071},{"$f":"+'App.2-IB_Load_Forecast_Analysis'!G64+'App.2-IB_Load_Forecast_Analysis'!G107+'App.2-IB_Load_Forecast_Analysis'!G150","v":33351},{"$f":"+'App.2-IB_Load_Forecast_Analysis'!G65+'App.2-IB_Load_Forecast_Analysis'!G108+'App.2-IB_Load_Forecast_Analysis'!G151","v":33348},{"$f":"+'App.2-IB_Load_Forecast_Analysis'!G66+'App.2-IB_Load_Forecast_Analysis'!G109+'App.2-IB_Load_Forecast_Analysis'!G152","v":33370},{"$f":"+'App.2-IB_Load_Forecast_Analysis'!G67+'App.2-IB_Load_Forecast_Analysis'!G110+'App.2-IB_Load_Forecast_Analysis'!G153","v":33395},33490,{"$f":"+'App.2-IB_Load_Forecast_Analysis'!G68+'App.2-IB_Load_Forecast_Analysis'!G111+'App.2-IB_Load_Forecast_Analysis'!G154","v":33507},{"$f":"+'App.2-IB_Load_Forecast_Analysis'!G69+'App.2-IB_Load_Forecast_Analysis'!G112+'App.2-IB_Load_Forecast_Analysis'!G155","v":33604}]
[null,"Number of FTEs 3,4",null,{"$f":"+'App.2-K_Employee Costs'!B16","v":86.990000000000009},{"$f":"+'App.2-K_Employee Costs'!C16","v":87.61438384094285},{"$f":"+'App.2-K_Employee Costs'!D16","v":88.216565626478697},{"$f":"+'App.2-K_Employee Costs'!E16","v":84.62554933535958},{"$f":"+'App.2-K_Employee Costs'!F16","v":84.914877096252496},{"$f":"+'App.2-K_Employee Costs'!G16","v":85.7},{"$f":"+'App.2-K_Employee Costs'!H16","v":84.77},{"$f":"+'App.2-K_Employee Costs'!I16","v":84.156500063150972}]
[null,"Customers/FTEs",null,{"$f":"IF(D20=0,\"\",D19/D20)","v":380.17013449821815},{"$f":"IF(E20=0,\"\",E19/E20)","v":380.65667459975714},{"$f":"IF(F20=0,\"\",F19/F20)","v":378.02423800083204},394.32535755554403,393.27619778741695,{"$f":"IF(I20=0,\"\",I19/I20)","v":390.78179696616104},395.26955290786839,399.30367796645044]
[null,"OM&A cost per customer"]
[null,"     O&M per customer",null,{"$f":"IF(D19=0,\"\",D16/D19)","v":167.47957848265852},{"$f":"IF(E19=0,\"\",E16/E19)","v":179.66834577673833},{"$f":"IF(F19=0,\"\",F16/F19)","v":173.12606453160609},179.13089601438418,179.00494085941008,{"$f":"IF(I19=0,\"\",I16/I19)","v":174.8755449387877},176.57847613931418,184.87767587192002]
[null,"     Admin per customer",null,{"$f":"IF(D19=0,\"\",D17/D19)","v":133.47733239605697},{"$f":"IF(E19=0,\"\",E17/E19)","v":186.31423345626817},{"$f":"IF(F19=0,\"\",F17/F19)","v":157.84853664387668},158.83203476176206,161.31351998802216,{"$f":"IF(I19=0,\"\",I17/I19)","v":171.38423409973126},171.10302324887337,170.90834424473277]
[null,"     Total OM&A per customer",null,{"$f":"IF(D19=0,\"\",D18/D19)","v":300.95691087871546},{"$f":"IF(E19=0,\"\",E18/E19)","v":365.9825792330065},{"$f":"IF(F19=0,\"\",F18/F19)","v":330.9746011754828},337.96293077614627,340.31846084743228,{"$f":"IF(I19=0,\"\",I18/I19)","v":346.25977903851896},347.68149938818755,355.78602011665276]
[null,"OM&A cost per FTE"]
[null,"     O&M per FTE",null,{"$f":"IF(D20=0,\"\",D16/D20)","v":63670.733877457169},{"$f":"IF(E20=0,\"\",E16/E20)","v":68391.955034212529},{"$f":"IF(F20=0,\"\",F16/F20)","v":65445.848622643265},70635.854620117025,70398.382526350237,{"$f":"IF(I20=0,\"\",I16/I20)","v":68338.179696616106},69796.095316739418,73822.335949546949]
[null,"     Admin per FTE",null,{"$f":"IF(D20=0,\"\",D17/D20)","v":50744.095409472349},{"$f":"IF(E20=0,\"\",E17/E20)","v":70921.756538065849},{"$f":"IF(F20=0,\"\",F17/F20)","v":59670.572784347896},62631.498898706428,63440.767792593841,{"$f":"IF(I20=0,\"\",I17/I20)","v":66973.838973162186},67631.815500766781,68244.330452078022]
[null,"     Total OM&A per FTE",null,{"$f":"IF(D20=0,\"\",D18/D20)","v":114414.82928692951},{"$f":"IF(E20=0,\"\",E18/E20)","v":139313.71157227838},{"$f":"IF(F20=0,\"\",F18/F20)","v":125116.42140699117},133267.35351882345,133839.15031894407,{"$f":"IF(I20=0,\"\",I18/I20)","v":135312.01866977828},137427.9108175062,142066.66640162497]
[]
[null,"Notes:"]
[]
[null,1,"If it has been more than four years since the applicant last filed a cost of service application, additional years of historical actuals should be incorporated into the table, as necessary, to go back to the last cost of service application. If the applicant last filed a cost of service application less than four years ago, a minimum of three years of actual information is required."]
[]
[null,2,"The method of calculating the number of customers must be identified. Should correspond with data provided in Appendix 2-IB."]
[null,3,"The method of calculating the number of FTEs must be identified. See also Appendix 2-K."]
[null,4,"The number of customers and the number of FTEs should correspond to mid-year or average of January 1 and December 31 figures."]
[null,5,"For the test year, the applicant should take into account the system O&M (line 22 of Appendix 2-AB) in developing its forecasted OM&A."]

{"sheet":"App.2-L_OM&A_per_Cust_FTEE_exp","index":29,"n_rows":38,"n_cols":12,"rows_kept":38,"cut":false,"hidden":true,"merged":[[37,1,38,11],[36,1,36,11],[32,1,33,11],[19,0,19,1],[18,0,18,1],[20,0,20,1],[26,0,26,1],[8,0,8,11],[9,0,9,11],[34,1,34,6],[35,1,35,6],[21,0,21,1],[22,0,22,1],[25,0,25,1],[14,0,14,1],[13,0,13,1],[11,7,11,11],[15,0,15,1],[16,0,16,1],[17,0,17,1]]}
[null,null,null,null,null,null,null,null,null,null,"File Number:",{"$f":"EBNUMBER","v":"EB-2017-0071"}]
[null,null,null,null,null,null,null,null,null,null,"Exhibit:"]
[null,null,null,null,null,null,null,null,null,null,"Tab:"]
[null,null,null,null,null,null,null,null,null,null,"Schedule:"]
[null,null,null,null,null,null,null,null,null,null,"Page:"]
[]
[null,null,null,null,null,null,null,null,null,null,"Date:"]
[]
["Appendix 2-L"]
["Recoverable OM&A Cost per Customer and per FTE 1"]
[]
[null,null,null,null,null,null,null,"5-year Distribution System Plan Period"]
[null,null,{"$f":"\"Last Rebasing Year - \"&RebaseYear&\"- Board Approved\"","v":"Last Rebasing Year - 2013- Board Approved"},{"$f":"\"Last Rebasing Year - \"&RebaseYear&\"-  Actual\"","v":"Last Rebasing Year - 2013-  Actual"},{"$f":"BridgeYear -2 & \" Actuals\"","v":"2015 Actuals"},{"$f":"BridgeYear -1 & \" Actuals\"","v":"2016 Actuals"},{"$f":"BridgeYear & \" Bridge Year\"","v":"2017 Bridge Year"},{"$f":"TestYear & \" Test Year\"","v":"2018 Test Year"},{"$f":"TestYear+1 & \" Year\"","v":"2019 Year"},{"$f":"TestYear+2 & \" Year\"","v":"2020 Year"},{"$f":"TestYear+3 & \" Year\"","v":"2021 Year"},{"$f":"TestYear+4 & \" Year\"","v":"2022 Year"}]
["Reporting Basis"]
["OM&A Costs"]
["     O&M"]
["     Admin Expenses"]
["Total Recoverable OM&A from Appendix 2-JB 5",null,{"$f":"SUM(C16:C17)","v":0},{"$f":"SUM(D16:D17)","v":0},0,0,0,0,0,0,0,0]
["Number of Customers 2,4"]
["Number of FTEs 3,4"]
["Customers/FTEs",null,{"$f":"IF(C20=0,\"\",C19/C20)","v":""},{"$f":"IF(D20=0,\"\",D19/D20)","v":""},"","","","","","","",""]
["OM&A cost per customer"]
["     O&M per customer",null,{"$f":"IF(C19=0,\"\",C16/C19)","v":""},{"$f":"IF(D19=0,\"\",D16/D19)","v":""},"","","","","","","",""]
["     Admin per customer",null,{"$f":"IF(C19=0,\"\",C17/C19)","v":""},{"$f":"IF(D19=0,\"\",D17/D19)","v":""},"","","","","","","",""]
["     Total OM&A per customer",null,{"$f":"IF(C19=0,\"\",C18/C19)","v":""},{"$f":"IF(D19=0,\"\",D18/D19)","v":""},"","","","","","","",""]
["OM&A cost per FTE"]
["     O&M per FTE",null,{"$f":"IF(C20=0,\"\",C16/C20)","v":""},{"$f":"IF(D20=0,\"\",D16/D20)","v":""},"","","","","","","",""]
["     Admin per FTE",null,{"$f":"IF(C20=0,\"\",C17/C20)","v":""},{"$f":"IF(D20=0,\"\",D17/D20)","v":""},"","","","","","","",""]
["     Total OM&A per FTE",null,{"$f":"IF(C20=0,\"\",C18/C20)","v":""},{"$f":"IF(D20=0,\"\",D18/D20)","v":""},"","","","","","","",""]
[]
["Notes:"]
[]
[1,"If it has been more than three years since the applicant last filed a cost of service application, additional years of historical actuals should be incorporated into the table, as necessary, to go back to the last cost of service application.  If the applicant last filed a cost of service application less than three years ago, a minimum of three years of actual information is required."]
[]
[2,"The method of calculating the number of customers must be identified. Should be linked back to Appendix 2-IA"]
[3,"The method of calculating the number of FTEs must be identified.  See also Appendix 2-K"]
[4,"The number of customers and the number of FTEs should correspond to mid-year or average of January 1 and December 31 figures."]
[5,"For the test year and in the subsequent four years of the DSP period, the applicant should take into account the system O&M (line X of Appendix 2-AB) in developing its forecasted OM&A. Admin expenses beyond the test year also need to be forecasted (separately)."]

{"sheet":"App.2-M_Regulatory_Costs","index":30,"n_rows":48,"n_cols":11,"rows_kept":48,"cut":false,"hidden":false,"merged":[[12,0,12,1],[13,0,13,1],[8,0,8,10],[9,0,9,10]]}
[null,null,null,null,null,null,null,null,null,"File Number:",{"$f":"EBNUMBER","v":"EB-2017-0071"}]
[null,null,null,null,null,null,null,null,null,"Exhibit:",4]
[null,null,null,null,null,null,null,null,null,"Tab:"]
[null,null,null,null,null,null,null,null,null,"Schedule:"]
[null,null,null,null,null,null,null,null,null,"Page:",64]
[]
[null,null,null,null,null,null,null,null,null,"Date:","2018-03-29"]
[]
["Appendix 2-M"]
["Regulatory Cost Schedule"]
[null,null,null,null,"On-going"]
[null,null,null,null,"One-time"]
["Regulatory Cost Category",null,"USoA Account","USoA Account Balance","Ongoing or One-time Cost? 2",{"$f":"\"Last Rebasing Year (\" & RebaseYear & \" Board Approved)\"","v":"Last Rebasing Year (2013 Board Approved)"},{"$f":"\"Most Current Actuals               Year \" & TestYear - 2","v":"Most Current Actuals               Year 2016"},{"$f":"TestYear -1 & \" Bridge Year\"","v":"2017 Bridge Year"},"Annual % Change",{"$f":"TestYear & \" Test Year\"","v":"2018 Test Year"},"Annual % Change"]
["(A)",null,"(B)","(C )","(D)","(E)","(F)","(G)","(H) = [(G)-(F)]/(F)","(I)","(J) = [(I)-(G)]/(G)"]
[1,"OEB Annual Assessment",5655,null,"On-Going",102000,{"$f":"151624+800","v":152424},154350,{"$f":"IF(G15=0,\"\",(H15-G15)/G15)","v":1.2635805384978743E-2},180000,{"$f":"IF(H15=0,\"\",(J15-H15)/H15)","v":0.16618075801749271}]
[2,"OEB Section 30 Costs (Applicant-originated)",null,null,null,null,null,null,"",null,""]
[3,"OEB Section 30 Costs (OEB-initiated)",5655,null,"On-Going",5000,8019.31,10000,0.24699007769995168,10000,0]
[4,"Expert Witness costs for regulatory matters",null,null,null,null,null,null,"",null,""]
[5,"Legal costs for regulatory matters",null,null,null,null,null,null,"",null,""]
[6,"Consultants' costs for regulatory matters",5655,null,"On-Going",31250,48199.77,{"$f":"150000+800","v":150800},2.1286456346160993,106816,-0.29167108753315651]
[7,"Operating expenses associated with staff resources allocated to regulatory matters",5655,null,"On-Going",132791,{"$f":"21229.47+16723.25+143.55","v":38096.270000000004},{"$f":"11112.74+2809.69+3500+4050.93+1024.22+246.88+62.42+2374.86+14310.36","v":39492.100000000006},3.663954502632414E-2,95341,1.4141790383393131]
[8,"Operating expenses associated with other resources allocated to regulatory matters 1",null,null,null,null,null,null,"",null,""]
[9,"Other regulatory agency fees or assessments",null,null,null,null,null,null,"",null,""]
[10,"Any other costs for regulatory matters (please define) - Training, Conferences",null,null,null,null,null,null,"",null,""]
[11,"Intervenor costs",5655,null,"On-Going",null,null,null,"",14000,""]
[12,"Settlement conferences expenses",null,null,null,null,null,null,null,null,""]
[13,"Sub-total - Ongoing Costs 3",null,{"$f":"SUMIF($E15:$E25,$E11,D15:D25)","v":0},null,{"$f":"SUMIF($E15:$E25,$E11,F15:F25)","v":271041},{"$f":"SUMIF($E15:$E25,$E11,G15:G25)","v":246739.34999999998},{"$f":"SUMIF($E15:$E25,$E11,H15:H25)","v":354642.1},{"$f":"IF(G27=0,\"\",(H27-G27)/G27)","v":0.43731472097985186},{"$f":"SUMIF($E15:$E25,$E11,J15:J25)","v":406157},0.14525883982753324]
[14,"Sub-total - One-time Costs 4",null,{"$f":"SUMIF($E15:$E25,$E12,D15:D25)","v":0},null,{"$f":"SUMIF($E15:$E25,$E12,F15:F25)","v":0},{"$f":"SUMIF($E15:$E25,$E12,G15:G25)","v":0},{"$f":"SUMIF($E15:$E25,$E12,H15:H25)","v":0},{"$f":"IF(G28=0,\"\",(H28-G28)/G28)","v":""},{"$f":"SUMIF($E15:$E26,$E12,J15:J26)","v":0},""]
[15,"Total",null,{"$f":"D27+D28","v":0},null,{"$f":"F27+F28","v":271041},{"$f":"G27+G28","v":246739.34999999998},{"$f":"H27+H28","v":354642.1},{"$f":"IF(G29=0,\"\",(H29-G29)/G29)","v":0.43731472097985186},{"$f":"J27+J28","v":406157},0.14525883982753324]
[]
[]
["Please fill out the following table for all one-time costs related to this cost of service application to be amortized over the test year plus the IRM period."]
[]
[null,null,"Historical Year(s)",{"$f":"H13","v":"2017 Bridge Year"},{"$f":"J13","v":"2018 Test Year"}]
[4,"Expert Witness costs"]
[5,"Legal costs"]
[6,"Consultants' costs",null,150800,515000]
[7,"Incremental operating expenses associated with staff resources allocated to this application."]
[8,"Incremental operating expenses associated with other resources allocated to this application. 1"]
[9,"Settlement conference expenses",null,null,10000]
[11,"Intervenor costs",null,null,60000]
[]
["Notes:"]
[]
["1","Please identify the resources involved."]
["2","Where a category's costs include both one-time and ongoing costs, the applicant should prove a separate breakdown between one-time and ongoing costs."]
["3","Sum of all ongoing costs identified in rows 1 to 11 inclusive."]
["4","Sum of all one-time costs identified in rows 1 to 11 inclusive."]

{"sheet":"App.2-N_Corp_Cost_Allocation","index":31,"n_rows":221,"n_cols":9,"rows_kept":221,"cut":false,"hidden":false,"merged":[[15,7,16,7],[25,7,26,7],[54,1,54,6],[56,1,56,2],[56,3,58,3],[56,4,58,4],[56,5,57,5],[56,6,57,6],[35,7,36,7],[36,1,37,1],[36,2,37,2],[43,1,43,6],[45,1,45,2],[45,3,47,3],[45,4,47,4],[45,5,46,5],[45,6,46,6],[45,7,46,7],[46,1,47,1],[46,2,47,2],[56,7,57,7],[57,1,58,1],[57,2,58,2],[23,1,23,6],[92,1,92,2],[92,3,94,3],[92,4,94,4],[92,6,93,6],[92,5,93,5],[93,1,94,1],[93,2,94,2],[90,1,90,6],[67,7,68,7],[68,1,69,1],[68,2,69,2],[78,7,79,7],[79,1,80,1],[79,2,80,2],[85,1,85,6],[86,1,86,6],[76,1,76,6],[78,1,78,2],[78,3,80,3],[25,1,25,2],[25,3,27,3],[25,4,27,4],[25,5,26,5],[25,6,26,6],[26,1,27,1],[26,2,27,2],[33,1,33,6],[35,1,35,2],[35,3,37,3],[35,4,37,4],[35,5,36,5],[35,6,36,6],[65,1,65,6],[67,1,67,2],[78,4,80,4],[78,5,79,5],[78,6,79,6],[67,3,69,3],[67,4,69,4],[67,5,68,5],[67,6,68,6],[214,1,214,6],[217,1,217,6],[125,5,126,5],[125,6,126,6],[126,1,127,1],[126,2,127,2],[140,1,140,6],[142,1,142,2],[142,3,144,3],[142,4,144,4],[142,5,143,5],[142,6,143,6],[143,1,144,1],[143,2,144,2],[158,1,158,6],[160,1,160,2],[160,3,162,3],[193,1,193,6],[195,1,195,2],[195,3,197,3],[195,4,197,4],[195,5,196,5],[195,6,196,6],[196,1,197,1],[220,1,220,6],[13,1,13,6],[8,1,8,6],[9,1,9,6],[210,2,211,6],[16,1,17,1],[16,2,17,2],[15,3,17,3],[15,4,17,4],[15,1,15,2],[15,5,16,5],[15,6,16,6],[106,1,106,6],[108,1,108,2],[108,3,110,3],[108,4,110,4],[108,5,109,5],[108,6,109,6],[109,1,110,1],[109,2,110,2],[123,1,123,6],[125,1,125,2],[125,3,127,3],[125,4,127,4],[196,2,197,2],[160,4,162,4],[160,5,161,5],[160,6,161,6],[161,1,162,1],[161,2,162,2],[176,1,176,6],[178,1,178,2],[178,3,180,3],[178,4,180,4],[178,5,179,5],[178,6,179,6],[179,1,180,1],[179,2,180,2]]}
[null,null,null,null,null,null,"File Number:",{"$f":"EBNUMBER","v":"EB-2017-0071"}]
[null,null,null,null,null,null,"Exhibit:","3 & 4"]
[null,null,null,null,null,null,"Tab:"]
[null,null,null,null,null,null,"Schedule:"]
[null,null,null,null,null,null,"Page:","Appendix 3 & Page 52"]
[]
[null,null,null,null,null,null,"Date:","2018-03-29"]
[]
[null,"Appendix 2-N"]
[null,"Shared Services and Corporate Cost Allocation 1"]
[]
[null,null,"Year:","2013 Approved"]
[]
[null,"Shared Services"]
[]
[null,"Name of Company",null,"Service Offered","Pricing Methodology","Price for the Service","Cost for the Service"]
[null,"From","To"]
[null,null,null,null,null,"$","$"]
[null,"PUC Distribution","PUC Services","Building rental",null,0,0]
[]
[]
[null,null,"Year:","2013 Actual"]
[]
[null,"Shared Services"]
[]
[null,"Name of Company",null,"Service Offered","Pricing Methodology","Price for the Service","Cost for the Service"]
[null,"From","To"]
[null,null,null,null,null,"$","$"]
[null,"PUC Distribution","PUC Services","Building rental - 2013 - Account 4327","Cost - no markup",2281174.7999999998,{"$f":"F29","v":2281174.7999999998}]
[]
[]
[null,null,"Year:","2014 Actual"]
[]
[null,"Shared Services"]
[]
[null,"Name of Company",null,"Service Offered","Pricing Methodology","Price for the Service","Cost for the Service"]
[null,"From","To"]
[null,null,null,null,null,"$","$"]
[null,"PUC Distribution","PUC Services","Building rental - 2014 - Account 4327","Cost - no markup",1246600.4099999999,{"$f":"F39","v":1246600.4099999999}]
[]
[]
[null,null,"Year:","2015 Actual"]
[]
[null,"Shared Services"]
[]
[null,"Name of Company",null,"Service Offered","Pricing Methodology","Price for the Service","Cost for the Service"]
[null,"From","To"]
[null,null,null,null,null,"$","$"]
[null,"PUC Distribution","PUC Services","Building rental - 2015 - Account 4327","Cost - no markup",1240120.24,{"$f":"F49","v":1240120.24}]
[]
[]
[]
[null,null,"Year:","2016 Actual"]
[]
[null,"Shared Services"]
[]
[null,"Name of Company",null,"Service Offered","Pricing Methodology","Price for the Service","Cost for the Service"]
[null,"From","To"]
[null,null,null,null,null,"$","$"]
[null,"PUC Distribution","PUC Services","Building rental - 2016 - Account 4327","Cost - no markup",1293858,{"$f":"F60","v":1293858}]
[]
[]
[]
[null,null,"Year:","2017 Bridge Year"]
[]
[null,"Shared Services"]
[]
[null,"Name of Company",null,"Service Offered","Pricing Methodology","Price for the Service","Cost for the Service"]
[null,"From","To"]
[null,null,null,null,null,"$","$"]
[null,"PUC Distribution","PUC Services","Building rental - 2017 - Account 4327","Cost - no markup",1332390.95,{"$f":"F71","v":1332390.95}]
[]
[]
[]
[null,null,"Year:","2018 Test Year"]
[]
[null,"Shared Services"]
[]
[null,"Name of Company",null,"Service Offered","Pricing Methodology","Price for the Service","Cost for the Service"]
[null,"From","To"]
[null,null,null,null,null,"$","$"]
[null,"PUC Distribution","PUC Services","Building rental - 2018 - Account 4327","Cost - no markup",1334160.93,{"$f":"F82","v":1334160.93}]
[]
[]
[]
[null,"Appendix 2-N"]
[null,"Shared Services and Corporate Cost Allocation 1"]
[]
[]
[null,null,"Year:","2013 approved"]
[null,"Corporate Cost Allocation"]
[]
[null,"Name of Company",null,"Service Offered","Pricing Methodology","% of Corporate Costs Allocated","Amount Allocated"]
[null,"From","To"]
[null,null,null,null,null,"%","$"]
[null,"PUC Services","PUC Distribution","Billing Acct 5305 to 5315","Cost - no markup",0.56000000000000005,425073]
[null,"PUC Services","PUC Distribution","Collections Acct 5320 to 5335","Cost - no markup",0.56000000000000005,122869]
[null,"PUC Services","PUC Distribution","Collections Arrears Acct portion of 5320","Cost - no markup",0.74,134797]
[null,"PUC Services","PUC Distribution","Customer Services Acct 5405 to 5420","Cost - no markup",0.56000000000000005,392125]
[null,"PUC Services","PUC Distribution","Admin Acct 5605 to 5635, 5655, 5665","Cost - no markup",0.45710000000000001,2182350]
[null,null,null,null,null,null,{"$f":"SUM(G96:G100)","v":3257214}]
[]
[]
[]
[null,null,"Year:","2013 Actual"]
[]
[null,"Corporate Cost Allocation"]
[]
[null,"Name of Company",null,"Service Offered","Pricing Methodology","% of Corporate Costs Allocated","Amount Allocated"]
[null,"From","To",null,null,null,null,null," "]
[null,null,null,null,null,"%","$"]
[]
[null,"PUC Services","PUC Distribution","Billing Acct 5305 to 5315","Cost - no markup",0.56000000000000005,394555.38760000007]
[null,"PUC Services","PUC Distribution","Collections Acct 5320 to 5335","Cost - no markup",0.56000000000000005,112401]
[null,"PUC Services","PUC Distribution","Collections Arrears Acct portion of 5320","Cost - no markup",0.74,125101]
[null,"PUC Services","PUC Distribution","Customer Services Acct 5405 to 5420","Cost - no markup",0.56000000000000005,403080.34480000002]
[null,"PUC Services","PUC Distribution","Admin Acct 5605 to 5635, 5655, 5665, 5675","Cost - no markup",0.45710000000000001,3760721.6762430007]
[null,null,null,null,null,null,{"$f":"SUM(G113:G117)","v":4795859.4086430008}]
[]
[]
[]
[null,null,"Year:",2014]
[]
[null,"Corporate Cost Allocation"]
[]
[null,"Name of Company",null,"Service Offered","Pricing Methodology","% of Corporate Costs Allocated","Amount Allocated"]
[null,"From","To"]
[null,null,null,null,null,"%","$"]
[]
[null,"PUC Services","PUC Distribution","Billing Acct 5305 to 5315","Cost - no markup",0.56000000000000005,506727.53760000004]
[null,"PUC Services","PUC Distribution","Collections Acct 5320 to 5335","Cost - no markup",0.56000000000000005,111314]
[null,"PUC Services","PUC Distribution","Collections Arrears Acct portion of 5320","Cost - no markup",0.74,127061]
[null,"PUC Services","PUC Distribution","Customer Services Acct 5405 to 5420","Cost - no markup",0.56000000000000005,475209.36280000018]
[null,"PUC Services","PUC Distribution","Admin Acct 5605 to 5635, 5655, 5665","Cost - no markup",0.42309999999999998,1852229.1228102699]
[null,"PUC Services","PUC Distribution","Building Acct 5675","Cost - no markup",0.46450000000000002,823324.0145092489]
[null,null,null,null,null,null,{"$f":"SUM(G130:G135)","v":3895865.0377195193}]
[]
[]
[null,null,"Year:",2015]
[]
[null,"Corporate Cost Allocation"]
[]
[null,"Name of Company",null,"Service Offered","Pricing Methodology","% of Corporate Costs Allocated","Amount Allocated"]
[null,"From","To"]
[null,null,null,null,null,"%","$"]
[]
[null,"PUC Services","PUC Distribution","Billing Acct 5305 to 5315","Cost - no markup",0.56000000000000005,537963.29079999996]
[null,"PUC Services","PUC Distribution","Collections Acct 5320 to 5335","Cost - no markup",0.56000000000000005,128381]
[null,"PUC Services","PUC Distribution","Collections Arrears Acct portion of 5320","Cost - no markup",0.74,158806]
[null,"PUC Services","PUC Distribution","Customer Services Acct 5405 to 5420","Cost - no markup",0.56000000000000005,583187.01240000001]
[null,"PUC Services","PUC Distribution","Admin Acct 5605 to 5635, 5655, 5665","Cost - no markup",0.42309999999999998,1867667.4231881304]
[null,"PUC Services","PUC Distribution","Building Acct 5675","Cost - no markup",0.46450000000000002,653778.4844362227]
[null,null,null,null,null,null,{"$f":"SUM(G147:G152)","v":3929783.2108243532}]
[]
[]
[]
[null,null,"Year:",2016]
[]
[null,"Corporate Cost Allocation"]
[]
[null,"Name of Company",null,"Service Offered","Pricing Methodology","% of Corporate Costs Allocated","Amount Allocated"]
[null,"From","To"]
[null,null,null,null,null,"%","$"]
[]
[null,"PUC Services","PUC Distribution","Billing Acct 5305 to 5315","Cost - no markup",0.56000000000000005,477913.99719999998]
[null,"PUC Services","PUC Distribution","Collections Acct 5320 to 5335","Cost - no markup",0.56000000000000005,109527]
[null,"PUC Services","PUC Distribution","Collections Arrears Acct portion of 5320","Cost - no markup",0.74,154520]
[null,"PUC Services","PUC Distribution","Customer Services Acct 5405 to 5420","Cost - no markup",0.56000000000000005,552393.53319999983]
[null,"PUC Services","PUC Distribution","Admin Acct 5605 to 5635, 5655, 5665","Cost - no markup",0.42309999999999998,1695803.0084822902]
[null,"PUC Services","PUC Distribution","Building Acct 5675","Cost - no markup",0.46450000000000002,699549.33935485838]
[null,null,null,null,null,null,{"$f":"SUM(G165:G170)","v":3689706.8782371483}]
[]
[]
[]
[null,null,"Year:","2017 Bridge"]
[]
[null,"Corporate Cost Allocation"]
[]
[null,"Name of Company",null,"Service Offered","Pricing Methodology","% of Corporate Costs Allocated","Amount Allocated"]
[null,"From","To"]
[null,null,null,null,null,"%","$"]
[]
[null,"PUC Services","PUC Distribution","Billing Acct 5305 to 5315","Cost - no markup",0.56000000000000005,553231.53999999992]
[null,"PUC Services","PUC Distribution","Collections Acct 5320 to 5335","Cost - no markup",0.56000000000000005,131465]
[null,"PUC Services","PUC Distribution","Collections Arrears Acct portion of 5320","Cost - no markup",0.74,151398]
[null,"PUC Services","PUC Distribution","Customer Services Acct 5405 to 5420","Cost - no markup",0.56000000000000005,637503.13]
[null,"PUC Services","PUC Distribution","Admin Acct 5605 to 5635, 5655, 5665","Cost - no markup",0.41310000000000002,1856868.4354106118]
[null,"PUC Services","PUC Distribution","Building Acct 5675","Cost - no markup",0.46450000000000002,652802.04577109579]
[null,null,null,null,null,null,{"$f":"SUM(G183:G188)","v":3983268.1511817076}]
[]
[]
[null,null,"Year:","2018 Test"]
[]
[null,"Corporate Cost Allocation"]
[]
[null,"Name of Company",null,"Service Offered","Pricing Methodology","% of Corporate Costs Allocated","Amount Allocated"]
[null,"From","To"]
[null,null,null,null,null,"%","$"]
[]
[null,"PUC Services","PUC Distribution","Billing Acct 5305 to 5315","Cost - no markup",0.56000000000000005,566235]
[null,"PUC Services","PUC Distribution","Collections Acct 5320 to 5335","Cost - no markup",0.56000000000000005,132569]
[null,"PUC Services","PUC Distribution","Collections Arrears Acct portion of 5320","Cost - no markup",0.74,162036]
[null,"PUC Services","PUC Distribution","Customer Services Acct 5405 to 5420","Cost - no markup",0.56000000000000005,524535]
[null,"PUC Services","PUC Distribution","Admin Acct 5605 to 5635, 5655, 5665","Cost - no markup",0.41310000000000002,1847687]
[null,"PUC Services","PUC Distribution","Building Acct 5675","Cost - no markup",0.46450000000000002,740240]
[null,null,null,null,null,null,{"$f":"SUM(G200:G205)","v":3973302}]
[]
[]
[]
[null,"Note: "]
[null,1,"This appendix must be completed in relation to each service provided or received for the Historical (actuals), Bridge and Test years. The required information includes:"]
[]
[]
[null,"·         Type of Service:"]
[null,"Services such as billing, accounting, payroll, etc.  The applicant must identify any costs related to the Board of Directors of the parent company that are allocated to the applicant."]
[]
[null,"·         Pricing Methodology:"]
[null,"Pricing Methodology includes approaches such as cost-base, market-base, tendering, etc.  The applicant must provide evidence demonstrating the pricing methodology used.  The applicant must also provide a description of why that pricing methodology was chosen, whether or not it is in conformity with ARC, and why it is appropriate."]
[]
[null,"·         % Allocation:"]
[null,"The applicant must provide the percentage of the costs allocated to the entity for the service being offered.  The Applicant must also provide a description of the allocator and why it is an appropriate allocator."]

{"sheet":"App.2-OA Capital Structure","index":32,"n_rows":58,"n_cols":15,"rows_kept":58,"cut":false,"hidden":false,"merged":[[63,2,63,14],[12,0,12,14],[57,2,57,14],[58,2,58,14],[59,2,59,14],[60,2,60,14],[61,2,61,14],[62,2,62,14],[56,0,56,14],[33,2,33,14],[34,2,34,14],[36,0,36,14],[38,7,38,9],[40,0,41,0],[41,4,41,8],[9,2,9,14],[10,2,10,14],[16,0,17,0],[17,4,17,8],[14,7,14,9]]}
[null,null,null,null,null,null,null,null,null,null,"File Number:",null,null,null,{"$f":"EBNUMBER","v":"EB-2017-0071"}]
[null,null,null,null,null,null,null,null,null,null,"Exhibit:",null,null,null,5]
[null,null,null,null,null,null,null,null,null,null,"Tab:"]
[null,null,null,null,null,null,null,null,null,null,"Schedule:"]
[null,null,null,null,null,null,null,null,null,null,"Page:",null,null,null,4]
[]
[null,null,null,null,null,null,null,null,null,null,"Date:",null,null,null,"2018-03-29"]
[]
[]
[null,null,"Appendix 2-OA"]
[null,null,"Capital Structure and Cost of Capital"]
[]
["This table must be completed for the last Board-approved year and the test year."]
[]
[null,null,null,null,null,null,"Year:",2013]
[]
["Line No."]
[null,null,"Particulars",null,"Capitalization Ratio",null,null,null,null,null,"Cost Rate",null,null,null,"Return"]
[]
[null,null,null,null,"(%)",null,null,null,"($)",null,"(%)",null,null,null,"($)"]
[null,null,"Debt"]
[1,null,"  Long-term Debt",null,0.56000000000000005,null,null,null,{"$f":"$I$31*E22","v":51775168.480000004},null,3.9100000000000003E-2,null,null,null,{"$f":"K22*I22","v":2024409.0875680004}]
[2,null,"  Short-term Debt",null,0.04,null,"(1)",null,{"$f":"$I$31*E23","v":3698226.3200000003},null,2.07E-2,null,null,null,{"$f":"K23*I23","v":76553.284824000002}]
[3,null,"Total Debt",null,{"$f":"SUM(E22:E23)","v":0.60000000000000009},null,null,null,{"$f":"SUM(I22:I23)","v":55473394.800000004},null,{"$f":"IF(E24=0,0,SUMPRODUCT(E22:E23,K22:K23)/E24)","v":3.7873333333333328E-2},null,null,null,{"$f":"SUM(O22:O23)","v":2100962.3723920006}]
[]
[null,null,"Equity"]
[4,null,"  Common Equity",null,0.4,null,null,null,{"$f":"$I$31*E27","v":36982263.200000003},null,8.9800000000000005E-2,null,null,null,{"$f":"K27*I27","v":3321007.2353600003}]
[5,null,"  Preferred Shares",null,null,null,null,null,{"$f":"$I$31*E28","v":0},null,null,null,null,null,{"$f":"K28*I28","v":0}]
[6,null,"Total Equity",null,{"$f":"SUM(E27:E28)","v":0.4},null,null,null,{"$f":"SUM(I27:I28)","v":36982263.200000003},null,{"$f":"IF(E29=0,0,SUMPRODUCT(E27:E28,K27:K28)/E29)","v":8.9799999999999991E-2},null,null,null,{"$f":"SUM(O27:O28)","v":3321007.2353600003}]
[]
[7,null,"Total",null,1,null,null,null,92455658,null,{"$f":"(K24*E24)+(K29*E29)","v":5.8644000000000002E-2},null,null,null,{"$f":"O24+O29","v":5421969.6077520009}]
[]
[]
[null,null,"Appendix 2-OA"]
[null,null,"Capital Structure and Cost of Capital"]
[]
["This table must be completed for the last Board-approved year and the test year."]
[]
[null,null,null,null,null,null,"Year:",2018]
[]
["Line No."]
[null,null,"Particulars",null,"Capitalization Ratio",null,null,null,null,null,"Cost Rate",null,null,null,"Return"]
[]
[null,null,null,null,"(%)",null,null,null,"($)",null,"(%)",null,null,null,"($)"]
[null,null,"Debt"]
[1,null,"  Long-term Debt",null,0.56000000000000005,null,null,null,{"$f":"$I$55*E46","v":55778073.680000007},null,4.1200000000000001E-2,null,null,null,{"$f":"K46*I46","v":2298056.6356160003}]
[2,null,"  Short-term Debt",null,0.04,null,"(1)",null,{"$f":"$I$55*E47","v":3984148.12},null,2.29E-2,null,null,null,{"$f":"K47*I47","v":91236.99194800001}]
[3,null,"Total Debt",null,{"$f":"SUM(E46:E47)","v":0.60000000000000009},null,null,null,{"$f":"SUM(I46:I47)","v":59762221.800000004},null,{"$f":"IF(E48=0,0,SUMPRODUCT(E46:E47,K46:K47)/E48)","v":3.9979999999999995E-2},null,null,null,{"$f":"SUM(O46:O47)","v":2389293.6275640004}]
[]
[null,null,"Equity"]
[4,null,"  Common Equity",null,0.4,null,null,null,{"$f":"$I$55*E51","v":39841481.200000003},null,0.09,null,null,null,{"$f":"K51*I51","v":3585733.3080000002}]
[5,null,"  Preferred Shares",null,null,null,null,null,{"$f":"$I$55*E52","v":0},null,null,null,null,null,{"$f":"K52*I52","v":0}]
[6,null,"Total Equity",null,{"$f":"SUM(E51:E52)","v":0.4},null,null,null,{"$f":"SUM(I51:I52)","v":39841481.200000003},null,{"$f":"IF(E53=0,0,SUMPRODUCT(E51:E52,K51:K52)/E53)","v":8.9999999999999983E-2},null,null,null,{"$f":"SUM(O51:O52)","v":3585733.3080000002}]
[]
[7,null,"Total",null,1,null,null,null,99603703,null,{"$f":"(K48*E48)+(K53*E53)","v":5.9988E-2},null,null,null,{"$f":"O48+O53","v":5975026.9355640002}]
[]
["Notes"]
["(1)",null,"4.0% unless an applicant has proposed or been approved for a different amount."]

{"sheet":"App.2-OB_Debt Instruments","index":33,"n_rows":116,"n_cols":11,"rows_kept":116,"cut":false,"hidden":false,"merged":[[81,0,81,10],[83,0,83,10],[95,0,95,10],[96,0,96,10],[98,0,98,10],[54,0,54,10],[65,0,65,10],[66,0,66,10],[68,0,68,10],[80,0,80,10],[115,1,115,10],[9,0,9,10],[10,0,10,10],[10,11,10,14],[12,0,12,10],[114,1,114,10],[113,1,113,10],[23,0,23,10],[24,0,24,10],[24,11,24,14],[26,0,26,10],[37,0,37,10],[38,0,38,10],[40,0,40,10],[51,0,51,10],[52,0,52,10]]}
[null,null,null,null,null,null,null,null,null,"File Number:",{"$f":"EBNUMBER","v":"EB-2017-0071"}]
[null,null,null,null,null,null,null,null,null,"Exhibit:",5]
[null,null,null,null,null,null,null,null,null,"Tab:"]
[null,null,null,null,null,null,null,null,null,"Schedule:"]
[null,null,null,null,null,null,null,null,null,"Page:",6]
[]
[null,null,null,null,null,null,null,null,null,"Date:","2018-03-29"]
[]
[]
["Appendix 2-OB"]
["Debt Instruments"]
[]
["This table must be completed for all required historical years, the bridge year and the test year."]
[null,null,null,"Year",2012]
[]
["Row","Description","Lender","Affiliated or Third-Party Debt?","Fixed or Variable-Rate?","Start Date","Term              (years)","Principal                         ($)","Rate (%) 2","Interest ($) 1","Additional Comments, if any"]
[1,"Promissory Note","PUC Inc.","Affiliated","Fixed Rate","1905-06-23","No Term",26534040,6.0999999999999999E-2,{"$f":"H17*I17","v":1618576.44}]
[2,"Loan ","Infrastructure Ontario","Third-Party","Variable Rate","2012-12-31","No Term",5000000,1.7899999999999999E-2,{"$f":"H18*I18","v":89500}]
[3,"Loan ","Infrastructure Ontario","Third-Party","Variable Rate","2012-12-31","No Term",17470930,1.7899999999999999E-2,312729.647]
[]
["Total",null,null,null,null,null,null,{"$f":"SUM(H17:H19)","v":49004970},{"$f":"IF(H21=0,\"\",J21/H21)","v":4.1236757965569609E-2},{"$f":"SUM(J17:J19)","v":2020806.0869999998}]
[]
[]
["Appendix 2-OB"]
["Debt Instruments"]
[]
["This table must be completed for all required historical years, the bridge year and the test year."]
[null,null,null,"Year",2013]
[]
["Row","Description","Lender","Affiliated or Third-Party Debt?","Fixed or Variable-Rate?","Start Date","Term              (years)","Principal                         ($)","Rate (%) 2","Interest ($) 1","Additional Comments, if any"]
[4,"Promissory Note","PUC Inc.","Affiliated","Fixed Rate","1905-06-23","No Term",26534040,6.0999999999999999E-2,{"$f":"H31*I31","v":1618576.44}]
[5,"Loan","Infrastructure Ontario","Third-Party","Fixed Rate","2013-12-31",15,5000000,3.8199999999999998E-2,191000]
[6,"Loan","Infrastructure Ontario","Third-Party","Fixed Rate","2013-12-31",25,21180000,4.6100000000000002E-2,976398]
[]
["Total",null,null,null,null,null,null,{"$f":"SUM(H31:H33)","v":52714040},{"$f":"IF(H35=0,\"\",J35/H35)","v":5.2850709981629183E-2},{"$f":"SUM(J31:J33)","v":2785974.44}]
[]
[]
["Appendix 2-OB"]
["Debt Instruments"]
[]
["This table must be completed for all required historical years, the bridge year and the test year."]
[null,null,null,"Year",2014]
[]
["Row","Description","Lender","Affiliated or Third-Party Debt?","Fixed or Variable-Rate?","Start Date","Term              (years)","Principal                         ($)","Rate (%) 2","Interest ($) 1","Additional Comments, if any"]
[1,"Promissory Note","PUC Inc.","Affiliated","Fixed Rate",2001,"No Term",26534040,6.0999999999999999E-2,{"$f":"H45*I45","v":1618576.44}]
[2,"Loan","Infrastructure Ontario","Third-Party","Fixed Rate",2013,15,5000000,3.8199999999999998E-2,{"$f":"H46*I46","v":191000}]
[3,"Loan","Infrastructure Ontario","Third-Party","Fixed Rate",2013,25,21180000,4.6100000000000002E-2,976398]
[4,"Loan","Infrastructure Ontario","Third-Party","Variable Rate","2014-12-31","No Term",15000000,1.84E-2,276000]
[]
["Total",null,null,null,null,null,null,{"$f":"SUM(H45:H48)","v":67714040},{"$f":"IF(H50=0,\"\",J50/H50)","v":4.5219195900879638E-2},{"$f":"SUM(J45:J48)","v":3061974.44}]
[]
["Appendix 2-OB"]
["Debt Instruments"]
[]
["This table must be completed for all required historical years, the bridge year and the test year."]
[null,null,null,"Year",2015]
[]
["Row","Description","Lender","Affiliated or Third-Party Debt?","Fixed or Variable-Rate?","Start Date","Term              (years)","Principal                         ($)","Rate (%) 2","Interest ($) 1","Additional Comments, if any"]
[1,"Promissory Note","PUC Inc.","Affiliated","Fixed Rate",2001,"No Term",26534040,6.0999999999999999E-2,{"$f":"H59*I59","v":1618576.44}]
[2,"Loan","Infrastructure Ontario","Third-Party","Fixed Rate",2013,15,5000000,3.8199999999999998E-2,{"$f":"H60*I60","v":191000}]
[3,"Loan","Infrastructure Ontario","Third-Party","Fixed Rate",2013,25,21180000,4.6100000000000002E-2,976398]
[4,"Loan","Infrastructure Ontario","Third-Party","Variable Rate","2015-12-31","No Term",15000000,1.55E-2,232500]
[]
["Total",null,null,null,null,null,null,{"$f":"SUM(H59:H62)","v":67714040},{"$f":"IF(H64=0,\"\",J64/H64)","v":4.4576788506489939E-2},{"$f":"SUM(J59:J62)","v":3018474.44}]
[]
["Appendix 2-OB"]
["Debt Instruments"]
[]
["This table must be completed for all required historical years, the bridge year and the test year."]
[null,null,null,"Year",2016]
[]
["Row","Description","Lender","Affiliated or Third-Party Debt?","Fixed or Variable-Rate?","Start Date","Term              (years)","Principal                         ($)","Rate (%) 2","Interest ($) 1","Additional Comments, if any"]
[1,"Promissory Note","PUC Inc.","Affiliated","Fixed Rate",2001,"No Term",26534040,6.0999999999999999E-2,{"$f":"H73*I73","v":1618576.44}]
[2,"Loan","Infrastructure Ontario","Third-Party","Fixed Rate",2013,15,5000000,3.8199999999999998E-2,{"$f":"H74*I74","v":191000}]
[3,"Loan","Infrastructure Ontario","Third-Party","Fixed Rate",2013,25,21180000,4.6100000000000002E-2,976398]
[4,"Loan","Infrastructure Ontario","Third-Party","Fixed Rate","2016-12-31","No Term",15000000,1.55E-2,232500]
[]
["Total",null,null,null,null,null,null,{"$f":"SUM(H73:H76)","v":67714040},{"$f":"IF(H78=0,\"\",J78/H78)","v":4.4576788506489939E-2},{"$f":"SUM(J73:J76)","v":3018474.44}]
[]
[]
["Appendix 2-OB"]
["Debt Instruments"]
[]
["This table must be completed for all required historical years, the bridge year and the test year."]
[null,null,null,"Year",2017]
[]
["Row","Description","Lender","Affiliated or Third-Party Debt?","Fixed or Variable-Rate?","Start Date","Term              (years)","Principal                         ($)","Rate (%) 2","Interest ($) 1","Additional Comments, if any"]
[1,"Promissory Note","PUC Inc.","Affiliated","Fixed Rate",2001,"No Term",26534040,6.0999999999999999E-2,{"$f":"H88*I88","v":1618576.44}]
[2,"Loan","Infrastructure Ontario","Third-Party","Fixed Rate",2013,15,5000000,3.8199999999999998E-2,{"$f":"H89*I89","v":191000}]
[3,"Loan","Infrastructure Ontario","Third-Party","Fixed Rate",2013,25,21180000,4.6100000000000002E-2,976398]
[4,"Loan","Infrastructure Ontario","Third-Party","Fixed Rate",2016,25,15000000,3.4700000000000002E-2,520500]
[]
["Total",null,null,null,null,null,null,{"$f":"SUM(H88:H91)","v":67714040},{"$f":"IF(H93=0,\"\",J93/H93)","v":4.8829968496932101E-2},{"$f":"SUM(J88:J91)","v":3306474.44}]
[]
[]
["Appendix 2-OB"]
["Debt Instruments"]
[]
["This table must be completed for all required historical years, the bridge year and the test year."]
[null,null,null,"Year",2018]
[]
["Row","Description","Lender","Affiliated or Third-Party Debt?","Fixed or Variable-Rate?","Start Date","Term              (years)","Principal                         ($)","Rate (%) 2","Interest ($) 1","Additional Comments, if any"]
[1,"Promissory Note","PUC Inc.","Affiliated","Fixed Rate",2001,"No Term",26534040,4.1599999999999998E-2,{"$f":"H103*I103","v":1103816.064}]
[2,"Loan","Infrastructure Ontario","Third-Party","Fixed Rate",2013,15,5000000,3.8199999999999998E-2,{"$f":"H104*I104","v":191000}]
[3,"Loan","Infrastructure Ontario","Third-Party","Fixed Rate",2013,25,21180000,4.6100000000000002E-2,976398]
[4,"Loan","Infrastructure Ontario","Third-Party","Fixed Rate",2016,25,15000000,3.4700000000000002E-2,520500]
[]
["Total",null,null,null,null,null,null,{"$f":"SUM(H103:H106)","v":67714040},{"$f":"IF(H108=0,\"\",J108/H108)","v":4.1227994430697093E-2},{"$f":"SUM(J103:J106)","v":2791714.0640000002}]
[]
[]
[]
["Notes"]
[]
[1,"If financing is in place only part of the year, separately calculate the pro-rated interest in the year and input in the cell."]
[2,"Input actual or deemed long-term debt rate in accordance with the guidelines in The Report of the Board on the Cost of Capital for Ontario's Regulated Utilities, issued December 11, 2009, or with any subsequent update issued by the Board."]
[3,"Add more lines above row 12 if necessary."]

{"sheet":"App.2-Q_Cost of Serv. Emb. Dx","index":34,"n_rows":60,"n_cols":7,"rows_kept":60,"cut":false,"hidden":false,"merged":[[9,7,9,11],[12,0,12,6],[11,0,11,6],[58,3,59,3],[58,4,59,4],[53,4,54,4],[8,0,8,6],[9,0,9,6],[15,0,15,1],[15,2,15,3],[53,3,54,3]]}
[null,null,null,null,null,"File Number:",{"$f":"EBNUMBER","v":"EB-2017-0071"}]
[null,null,null,null,null,"Exhibit:","N/A"]
[null,null,null,null,null,"Tab:"]
[null,null,null,null,null,"Schedule:"]
[null,null,null,null,null,"Page:"]
[]
[null,null,null,null,null,"Date:","2018-03-29"]
[]
["Appendix 2-Q"]
["Cost of Serving Embedded Distributor(s) "]
[]
["To be completed by Host Distributors ONLY"]
["(Not required if Host Distributor has an Embedded Distributor rate class, i.e. a separate row on Sheet 11 of the RRWF.)"]
[]
[]
["Proposed Rate Class for Billing Embedded Distributor(s)"]
[]
["Host's Distribution Facilities used by Embedded Distributor(s)"]
[]
["(1)","(2)","(3)","(4)","(5)","(6) = '(3) + (4)"]
["Asset Class","Total OM&A costs asociated with asset class ","Original cost of asset class ","Accumulated amortization of asset class","Annual amortization of asset class","Net Book Value of asset class"]
["Totals for Host Distributor:","($)","($)","($)","($)"]
["Distribution Stations",null,null,null,null,{"$f":"C23+D23","v":0}]
["Low Voltage Line",null,null,null,null,0]
["LV Line category # 2 (if applcable)",null,null,null,null,0]
["TS (owned by host)",null,null,null,null,0]
["add rows if necessary... ",null,null,null,null,0]
[null,null,null,null,null,0]
[null,null,null,null,null,0]
[]
["(1)","(7)","(8)","(9)","(10)","(11)"]
[{"$f":"A21","v":"Asset Class"},"Total line length or station capacity in asset class","Line length or capacity required to provide LV service to Embedded Distributor(s)","Annual total demand on station/line providing LV services (sum of 12 monthly peaks)","Annual billed Embedded Distributor demand on station/line providing LV services","Embedded Distributor(s)' Responsibility Share "]
["Embedded Distributor's share:","kW or kVa; km","kW or kVA; km","kW or kVA","kW or kVA","percent"]
["Distribution Stations",null,null,null,null,{"$f":"IF(D34=0,0,(C34/B34)*(E34/D34))","v":0}]
["Low Voltage Line",null,null,null,null,{"$f":"IF(D35=0,0,(C35/B35)*(E35/D35))","v":0}]
["LV Line # 2 (if applicable) ",null,null,null,null,{"$f":"IF(D36=0,0,(C36/B36)*(E36/D36))","v":0}]
["TS (owned by host)",null,null,null,null,{"$f":"IF(D37=0,0,(C37/B37)*(E37/D37))","v":0}]
["add rows if necessary ",null,null,null,null,{"$f":"IF(D38=0,0,(C38/B38)*(E38/D38))","v":0}]
[]
["(1)","(12)","(12a)","(13)","(14)","(15)","(16)"]
[{"$f":"A32","v":"Asset Class"},"Return on Assets used to Provide LV services","Taxes/PILs","Annual amortization on assets used to provide LV services","OM&A costs with burden associated with assets used to provide LV services","Total annual cost associated with assets used to provide LV services","Monthly cost associated with the delivery of LV services"]
[null,"($)","($)","($)","($)","($)","$/kW or $/kVA"]
["Distribution Stations",{"$f":"E$54*(F23+B23*E$59)*F34","v":0},{"$f":"(B43-(B$54*C$54*F34*(F23+B23*E57)+B$55*C$55*F34*(F23+B23*E$57)))*E$57/(1-E$57)","v":0},{"$f":"E23*F34","v":0},{"$f":"B23*F34","v":0},{"$f":"SUM(B43:E43)","v":0},{"$f":"IF(E34=0,0,(D43/E34))","v":0}]
["Low Voltage Line",{"$f":"E$54*(F24+B24*E$59)*F35","v":0},{"$f":"(B44-(B$54*C$54*F35*(F24+B24*E58)+B$55*C$55*F35*(F24+B24*E58)))*E$57/(1-E$57)","v":0},{"$f":"E24*F35","v":0},{"$f":"B24*F35","v":0},{"$f":"SUM(B44:E44)","v":0},{"$f":"IF(E35=0,0,(D44/E35))","v":0}]
["LV Line # 2 (if applicable) ",{"$f":"E$54*(F25+B25*E$59)*F36","v":0},{"$f":"(B45-(B$54*C$54*F36*(F25+B25*E59)+B$55*C$55*F36*(F25+B25*E$59)))*E$57/(1-E$57)","v":0},{"$f":"E25*F36","v":0},{"$f":"B25*F36","v":0},{"$f":"SUM(B45:E45)","v":0},{"$f":"IF(E36=0,0,(D45/E36))","v":0}]
["TS (owned by host)",{"$f":"E$54*(F26+B26*E$59)*F37","v":0},{"$f":"(B46-(B$54*C$54*F37*(F26+B26*E60)+B$55*C$55*F37*(F26+B26*E60)))*E$57/(1-E$57)","v":0},{"$f":"E26*F37","v":0},{"$f":"B26*F37","v":0},{"$f":"SUM(B46:E46)","v":0},{"$f":"IF(E37=0,0,(D46/E37))","v":0}]
["add rows if necessary ",{"$f":"E$54*(F27+B27*E$59)*F38","v":0},{"$f":"(B47-(B$54*C$54*F38*(F27+B27*I61)+B$55*C$55*F38*(F27+B27*I61)))*E$57/(1-E$57)","v":0},{"$f":"E27*F38","v":0},{"$f":"B27*F38","v":0},{"$f":"SUM(B47:E47)","v":0},{"$f":"IF(E38=0,0,(D47/E38))","v":0}]
[]
["Total",null,null,null,null,{"$f":"SUM(F43:F47)","v":0},{"$f":"SUM(G43:G47)","v":0}]
[]
["(17)","(18)","(19)","(20)","(21)"]
[null,"Capital Structure","Cost Rate"]
[null,"(%)","(%)",null,"(%)"]
["Long-Term Debt",null,null,"Weighted Average Cost of Capital",{"$f":"IF(B60=0%,0,SUMPRODUCT(B54:B58,C54:C58)/B60)","v":0}]
["Short-term Debt"]
[]
["Common Equity",null,null,"Tax/PILs Rate"]
["Preferred Shares"]
[null,null,null,"Working Capital Allowance Factor"]
["Total",{"$f":"SUM(B54:B58)","v":0}]

{"sheet":"App.2-R_Loss Factors","index":35,"n_rows":70,"n_cols":9,"rows_kept":70,"cut":false,"hidden":false,"merged":[[55,2,56,8],[58,2,58,8],[30,2,32,8],[68,2,68,8],[60,2,60,8],[62,2,62,8],[64,2,66,7],[50,2,50,8],[14,2,14,8],[23,2,23,8],[25,2,25,8],[52,2,53,8],[34,2,37,8],[41,2,43,8],[45,2,48,8],[8,1,8,8],[9,1,9,8],[10,1,10,8],[12,1,13,2],[12,3,12,7],[12,8,13,8]]}
[null,null,null,null,null,null,null,"File Number:",{"$f":"EBNUMBER","v":"EB-2017-0071"}]
[null,null,null,null,null,null,null,"Exhibit:",8]
[null,null,null,null,null,null,null,"Tab:"]
[null,null,null,null,null,null,null,"Schedule:"]
[null,null,null,null,null,null,null,"Page:",12]
[]
[null,null,null,null,null,null,null,"Date:","2018-03-29"]
[]
[null,"Appendix 2-R"]
[null,"Loss Factors"]
[]
[]
[null,null,null,"Historical Years",null,null,null,null,"5-Year Average"]
[null,null,null,{"$f":"IF(ISBLANK('LDC Info'!E26-5), \"Year 5\", 'LDC Info'!E26-5)","v":2012},{"$f":"IF(ISBLANK('LDC Info'!E26-4), \"Year 5\", 'LDC Info'!E26-4)","v":2013},{"$f":"IF(ISBLANK('LDC Info'!E26-3), \"Year 5\", 'LDC Info'!E26-3)","v":2014},{"$f":"IF(ISBLANK('LDC Info'!E26-2), \"Year 5\", 'LDC Info'!E26-2)","v":2015},{"$f":"IF(ISBLANK('LDC Info'!E26-1), \"Year 5\", 'LDC Info'!E26-1)","v":2016}]
[null,null,"Losses Within Distributor's System"]
[null,"A(1)","\"Wholesale\" kWh delivered to distributor (higher value)",706953513,730568311,730490285,698517377,669958462,{"$f":"IF(SUM(D16:H16)=0,0,AVERAGE(D16:H16))","v":707297589.60000002}]
[null,"A(2)","\"Wholesale\" kWh delivered to distributor (lower value)",{"$f":"+D16/D25","v":706953513},{"$f":"+E16/E25","v":730568311},730490285,698517377,669958462,{"$f":"IF(SUM(D17:H17)=0,0,AVERAGE(D17:H17))","v":707297589.60000002}]
[null,"B","Portion of \"Wholesale\" kWh delivered to distributor for its Large Use Customer(s)",null,null,null,null,null,{"$f":"IF(SUM(D18:H18)=0,0,AVERAGE(D18:H18))","v":0}]
[null,"C","Net \"Wholesale\" kWh delivered to distributor  = A(2) - B",{"$f":"D17-D18","v":706953513},730568311,730490285,698517377,669958462,707297589.60000002]
[null,"D","\"Retail\" kWh delivered by distributor",676765709,688834667,701843127,669387526,637462404,{"$f":"IF(SUM(D20:H20)=0,0,AVERAGE(D20:H20))","v":674858686.60000002}]
[null,"E","Portion of \"Retail\" kWh delivered by distributor to its Large Use Customer(s)",null,null,null,null,null,{"$f":"IF(SUM(D21:H21)=0,0,AVERAGE(D21:H21))","v":0}]
[null,"F","Net \"Retail\" kWh delivered by distributor = D - E",{"$f":"D20-D21","v":676765709},688834667,701843127,669387526,637462404,674858686.60000002]
[null,"G","Loss Factor in Distributor's system = C / F",{"$f":"IF(D22=0,\"\",D19/D22)","v":1.0446059893380324},1.0605858647935906,1.0408170385915883,1.043517170351334,1.0509772149637235,1.0480676971995873]
[null,null,"Losses Upstream of Distributor's System"]
[null,"H","Supply Facilities Loss Factor",1,1,1,1,1,{"$f":"IF(SUM(D25:H25)=0,0,AVERAGE(D25:H25))","v":1}]
[null,null,"Total Losses"]
[null,"I","Total Loss Factor = G x H",{"$f":"IF(D23=\"\",\"\",D23*D25)","v":1.0446059893380324},1.0605858647935906,1.0408170385915883,1.043517170351334,1.0509772149637235,1.0480676971995873]
[]
[null,"Notes:"]
[]
[null,"A(1)","If directly connected to the IESO-controlled grid, kWh pertains to the virtual meter on the primary or high voltage side of the transformer at the interface with the transmission grid.  This corresponds to the \"With Losses\" kWh value provided by the IESO's MV-WEB.  It is the higher of the two values provided by MV-WEB."]
[]
[]
[]
[null,null,"If fully embedded within a host distributor, kWh pertains to the virtual meter on the primary or high voltage side of the transformer, at the interface between the host distributor and the transmission grid.  For example, if the host distributor is Hydro One Networks Inc., kWh from the Hydro One Networks' invoice corresponding to \"Total kWh w Losses\" should be reported.  This corresponds to the higher of the two kWh values provided in Hydro One Networks' invoice."]
[]
[]
[]
[]
[null,null,"If partially embedded, kWh pertains to the sum of the above."]
[]
[null,"A(2)","If directly connected to the IESO-controlled grid, kWh pertains to a metering installation on the secondary or low voltage side of the transformer at the interface with the transmission grid.  This corresponds to the \"Without Losses\" kWh value provided by the IESO's MV-WEB.  It is the lower of the two kWh values provided by MV-WEB."]
[]
[]
[]
[null,null,"If fully embedded with the host distributor, kWh pertains to a metering installation on the secondary or low voltage side of the transformer at the interface between the embedded distributor and the host distributor.  For example, if the host distributor is Hydro One Networks Inc., kWh from the Hydro One Networks' invoice corresponding to \"Total kWh\" should be reported.  This corresponds to the lower of the two kWh values provided in Hydro One Networks' invoice."]
[]
[]
[]
[]
[null,null,"If partially embedded, kWh pertains to the sum of the above."]
[]
[null,null,"Additionally, kWh pertaining to distributed generation directly connected to the distributor's own distribution network should be included in A(2)."]
[]
[]
[null,"B","If a Large Use Customer is metered on the secondary or low voltage side of the transformer, the default loss is 1%                         (i.e., B = 1.01 X E)."]
[]
[]
[null,"D","kWh corresponding to D should equal metered or estimated kWh at the customer’s delivery point."]
[]
[null,"G and I","These loss factors pertain to secondary-metered customers with demand less than 5,000 kW."]
[]
[null,"H","If directly connected to the IESO-controlled grid, SFLF = 1.0045."]
[]
[null,null,"If fully embedded within a host distributor, SFLF = loss factor re losses in transformer at grid interface X loss factor re losses in host distributor's system.  If the host distributor is Hydro One Networks Inc., SFLF = 1.0060 X 1.0278 = 1.0340. If partially embedded, SFLF should be calculated as the weighted average of above."]
[]
[]
[]
[null,null,"Distributors that wish to propose a different SFLF should provide appropriate justification for any such proposal including supporting"]
[null,null,"calculations and any other relevant material."]

{"sheet":"App.2-S_Stranded Meters","index":36,"n_rows":93,"n_cols":8,"rows_kept":93,"cut":false,"hidden":false,"merged":[[8,0,8,7],[9,0,9,7],[30,0,33,7],[35,0,36,7],[55,2,56,7],[63,2,65,7],[67,0,68,7],[38,1,39,7],[41,1,43,7],[45,1,48,7],[50,1,53,7],[58,2,61,7],[92,0,95,7],[85,1,87,7],[89,1,90,7],[70,1,71,7],[77,1,79,7],[81,1,83,7],[73,1,75,7]]}
[null,null,null,null,null,null,"File Number:",{"$f":"EBNUMBER","v":"EB-2017-0071"}]
[null,null,null,null,null,null,"Exhibit:","N/A"]
[null,null,null,null,null,null,"Tab:"]
[null,null,null,null,null,null,"Schedule:"]
[null,null,null,null,null,null,"Page:"]
[]
[null,null,null,null,null,null,"Date:","2018-03-29"]
[]
["Appendix 2-S"]
["Stranded Meter Treatment"]
[]
["Year","Notes","Gross Asset Value","Accumulated Amortization","Contributed Capital (Net of Amortization)","Net Asset","Proceeds on Disposition","Residual Net Book Value"]
[null,null,"(A)","(B)","(C)","(D ) = (A) - (B) - (C)","(E)","(F) = (D) - (E)"]
[2006,null,null,null,null,{"$f":"C14-D14-E14","v":0},null,{"$f":"F14-G14","v":0}]
[2007,null,null,null,null,0,null,0]
[2008,null,null,null,null,0,null,0]
[2009,null,null,null,null,0,null,0]
[2010,null,null,null,null,0,null,0]
[2011,null,null,null,null,0,null,0]
[2012,null,null,null,null,0,null,0]
[2013,null,null,null,null,{"$f":"C21-D21-E21","v":0},null,{"$f":"F21-G21","v":0}]
[2014,null,null,null,null,0,null,0]
[2015,null,null,null,null,0,null,0]
[2016,null,null,null,null,0,null,0]
[2017,"(1)",null,null,null,0,null,0]
[]
["Notes:"]
[]
["(1)","For 2017, please indicate whether the amounts provided are on a forecast or actual basis."]
[]
["Some distributors have transferred the cost of stranded meters from Account 1860 - Meters to \"Sub-account Stranded Meter Costs of Account 1555\", while in some cases distributors have left these costs in Account 1860.  Depending on which treatment the applicant has chosen. please provide the information under either of the two scenarios (A and B below), as applicable."]
[]
[]
[]
[]
["Scenario A:  If the stranded meter costs were transferred to \"Sub-account Stranded Meter Costs\" of Account 1555, the above table should be completed and the following information should be provided in Exhibit 9."]
[]
[]
[1,"A description of the accounting treatment followed by the applicant on stranded meter costs for financial accounting and reporting purposes."]
[]
[]
[2,"The amount of the pooled residual net book value of the removed from service stranded meters, less any contributed capital (net of accumulated amortization), and less any net proceeds from sales, which were transferred to this sub-account as of December 31, 2010."]
[]
[]
[]
[3,"A statement as to whether or not, since transferring the removed stranded meter costs to the sub-account, the recording of depreciation expenses was continued in order to reduce the net book value through accumulated depreciation.  If so, the total depreciation expense amount for the period from the time the costs for the stranded meters were transferred to the sub-account to December 31, 2010 should be provided."]
[]
[]
[]
[]
[null,"If no depreciation expenses were recorded to reduce the net book value of stranded meter costs through accumulated depreciation, the total depreciation expense amount that would have been applicable from the time that the stranded meter costs were transferred to the sub-account of Account 1555 to December 31, 2010 should be provided.  In addition, the following information should be provided:"]
[]
[]
[]
[]
[null,"a)","Whether or not carrying charges were recorded for the stranded meter cost balances in the sub-account, and if so, the total carrying charges recorded to December 31, 2010."]
[]
[]
[null,"b)","The estimated amount of the pooled residual net book value of the removed from service meters, less any net proceeds from sales and contributed capital, at the time when the smart meters will have been fully deployed (e.g., as of December 31, 2010).  If the smart meters have been fully deployed, the actual amount should be provided."]
[]
[]
[]
[]
[null,"c)","A description as to how the applicant intends to recover in rates the remaining costs for stranded meters, including the proposed accounting treatment, the proposed disposition period, and the associated bill impacts."]
[]
[]
[]
["Scenario B:  If the stranded meter costs remained recorded in Account 1860, the above table should be completed and the following information should be provided in Exhibit 9:"]
[]
[]
[1,"A description of the accounting treatment followed by the applicant on stranded meter costs for financial accounting and reporting purposes."]
[]
[]
[2,"The amount of the pooled residual net book value of the removed from service stranded meters, less any contributed capital (net of accumulated amortization), and less any net proceeds from sales, as of December 31, 2010."]
[]
[]
[]
[3,"A statement as to whether or not the recording of depreciation expenses continued in order to reduce the net book value through accumulated depreciation.  If so, provision of the total (cumulative) depreciation expense for the period from the time that the meters became stranded to December 31, 2010."]
[]
[]
[]
[4,"If no depreciation expenses were recorded to reduce the net book value of stranded meters through accumulated depreciation, the total (cumulative) depreciation expense amount that would have been applicable for the period from the time that the meters became stranded to December 31, 2010."]
[]
[]
[]
[5,"The estimated amount of the pooled residual net book value of the removed from service meters, less any net proceeds from sales and contributed capital, at the time when smart meters will have been fully deployed.  If the smart meters have been fully deployed, please provide the actual amount."]
[]
[]
[]
[6,"A description as to how the applicant intends to recover in rates the costs for stranded meters, including the proposed accounting treatment, the proposed disposition period and the associated bill impacts."]
[]
[]
["Distributors should also provide the Net Book Value per class of meter as of December 31, 2010 as well as the number of meters that were removed / stranded.  In preparing this information, distributors should review the Board's letter of January 16, 2007 Stranded Meter Costs Related to the Installation of Smart Meters which stated that records were to be kept of the type and number of each meter to support the stranded meter costs."]

{"sheet":"App.2-Y_MIFRS Summary Impacts","index":37,"n_rows":37,"n_cols":9,"rows_kept":37,"cut":false,"hidden":false,"merged":[[8,0,8,8],[9,0,9,8],[10,0,10,8],[14,0,16,2],[14,6,14,8],[15,6,15,8],[17,0,17,2],[17,6,17,8],[18,0,18,2],[18,6,18,8],[19,0,19,2],[19,6,19,8],[20,0,20,2],[20,6,20,8],[21,0,21,2],[21,6,21,8],[22,0,22,2],[22,3,22,5],[22,6,22,8],[23,0,23,2],[23,6,23,8],[24,0,24,2],[24,6,24,8],[25,0,25,2],[25,6,25,8],[26,0,26,2],[26,6,26,8],[27,0,27,2],[27,6,27,8],[28,0,28,2],[28,6,28,8],[36,0,36,8],[29,0,29,2],[29,6,29,8],[30,0,30,2],[30,6,30,8],[31,0,31,2],[31,6,31,8],[32,0,32,2],[32,6,32,8],[33,0,33,2],[33,6,33,8],[34,0,34,2],[34,6,34,8]]}
[null,null,null,null,null,null,null,"File Number:",{"$f":"EBNUMBER","v":"EB-2017-0071"}]
[null,null,null,null,null,null,null,"Exhibit:","N/A"]
[null,null,null,null,null,null,null,"Tab:"]
[null,null,null,null,null,null,null,"Schedule:"]
[null,null,null,null,null,null,null,"Page:"]
[]
[null,null,null,null,null,null,null,"Date:","2018-03-29"]
[]
["Appendix 2-Y"]
["Summary of Impacts to Revenue Requirement"]
["from Transition to MIFRS"]
[]
[]
[]
["Revenue Requirement Component",null,null,{"$f":"TestYear","v":2018},{"$f":"TestYear","v":2018},"Difference","Reasons why the revenue requirement "]
[null,null,null,"MIFRS","CGAAP 1",null,"component is different under MIFRS"]
[]
["Closing NBV 2017",null,null,null,null,{"$f":"+D18-E18","v":0}]
["Closing NBV 2018",null,null,null,null,0]
["Average NBV",null,null,{"$f":"(D18+D19)/2","v":0},{"$f":"(E18+E19)/2","v":0},0]
["Working Capital",null,null,null,null,{"$f":"+D21-E21","v":0}]
["Rate Base",null,null,{"$f":"SUM(D20:D21)","v":0},{"$f":"SUM(E20:E21)","v":0},{"$f":"+D22-E22","v":0}]
[null,null,null,null,null,{"$f":"+D23-E23","v":0}]
["Return on Rate Base",null,null,null,null,0]
[null,null,null,null,null,0]
["OM&A",null,null,null,null,0]
["Depreciation",null,null,null,null,0]
["PILs or Income Taxes",null,null,null,null,0]
[null,null,null,null,null,0]
["Less: Revenue Offsets",null,null,null,null,0]
[null,null,null,null,null,0]
[null,null,null,null,null,0]
[null,null,null,null,null,0]
["Insert description of additional item(s) and new rows if needed.",null,null,null,null,0]
["Total Base Revenue Requirement",null,null,{"$f":"SUM(D24:D34)","v":0},{"$f":"SUM(E24:E34)","v":0},{"$f":"SUM(F24:F34)","v":0}]
[]
["1.  Applicants must provide a summary of the dollar impacts of MIFRS to each component of the revenue requirement (e.g. rate base, operating costs, etc.), including the overall impact on the proposed revenue requirement.  Accordingly, the applicants must identify financial differences and resulting revenue requirement impacts arising from the adoption of  MIFRS as compared to CGAAP.  If the applicant is reflecting the changes in capitalization and depreciation policies for the first time in a rebasing application, then the comparison in the above table should be between MIFRS and CGAAP before the change in accounting policies. If the applicant changed capitalization and depreciation policies and reflected these changes in a previous rebasing application, the comparison in the above table should be between MIFRS and CGAAP after the change in accounting policies.  "]

{"sheet":"Sheet19","index":38,"n_rows":72,"n_cols":9,"rows_kept":72,"cut":false,"hidden":true,"merged":[]}
[null,"CGAAP","CGAAP","CGAAP","MIFRS","USGAAP","ASPE","ASPE","ASPE"]
[null,"N/A",2012,2013,null,null,"N/A",2012,2013]
["LDC Info","x","x","x","x","x","x","x","x"]
["Table of Contents","x","x","x","x","x","x","x","x"]
["COS Flowchart","x","x","x","x","x","x","x","x"]
["List of Key References","x","x","x","x","x","x","x","x"]
["App.2-AA_Capital Projects","x","x","x","x","x","x","x","x"]
["App.2-AB_Capital Expenditures","x","x","x","x","x","x","x","x"]
["App.2-BA1_Fix Asset Cont.CGAAP","x","x","x","n","x","x","x","x"]
["App.2-BA2_Fix Asset Cont.MIFRS","n","n","n","x","n","n","n","n"]
["Appendix 2-BB Service Life Comp","x","x","x","x","x","x","x","x"]
["Instruction for App. 2-C MIFRS","n","n","n","x","n","n","n","n"]
["App.2-CA_CGAAP_DepExp_2011","n","n","n","x","n","n","n","n"]
["App.2-CB_MIFRS_DepExp_2011","n","n","n","x","n","n","n","n"]
["App.2-CC_MIFRS_DepExp_2012","n","n","n","x","n","n","n","n"]
["App.2-CD_MIFRS_DepExp_2013","n","n","n","x","n","n","n","n"]
["App.2-CE_MIFRS_DepExp_2014","n","n","n","x","n","n","n","n"]
["App.2-CF_CGAAP_DepExp_2012","n","n","n","x","n","n","n","n"]
["App.2-CG_MIFRS_DepExp_2012","n","n","n","x","n","n","n","n"]
["App.2-CH_MIFRS_DepExp_2013","n","n","n","x","n","n","n","n"]
["App.2-CI_MIFRS_DepExp_2014","n","n","n","x","n","n","n","n"]
["App.2-CJ_CGAAP_DepExp_2012","n","n","n","x","n","n","n","n"]
["App.2-CK_CGAAP_DepExp_2013","n","n","n","x","n","n","n","n"]
["App.2-CL_MIFRS_DepExp_2013","n","n","n","x","n","n","n","n"]
["App.2-CM_MIFRS_DepExp_2014","n","n","n","x","n","n","n","n"]
["Instruction for App. 2-C CGAAP","x","x","x","n","n","x","x","x"]
["App.2-CN_OldCGAAP_DepExp_2012","x","x","n","n","n","x","x","n"]
["App.2-CO_NewCGAAP_DepExp_2012","x","x","n","n","n","x","x","n"]
["App.2-CP_NewCGAAP_DepExp_2013","x","x","n","n","n","x","x","n"]
["App.2-CQ NewCGAAP_DepExp_2014","x","x","n","n","n","x","x","n"]
["App.2-CR_OldCGAAP_DepExp_2012","x","n","x","n","n","x","n","x"]
["App.2-CS_OldCGAAP_DepExp_2013","x","n","x","n","n","x","n","x"]
["App.2-CT_NewCGAAP_DepExp_2013","x","n","x","n","n","x","n","x"]
["App.2-CU_NewCGAAP_DepExp_2014","x","n","x","n","n","x","n","x"]
["App.2-CV_USGAAP_DepExp","n","n","n","n","x","n","n","n"]
["App.2-DA_Overhead","n","n","n","x","n","n","n","n"]
["App.2-DB_Overhead","x","x","x","n","n","x","x","x"]
["App.2-EA_PP&E Deferral Account","n","n","n","x","x","n","n","n"]
["App.2-EB_PP&E Deferral Account","n","n","n","x","x","n","n","n"]
["App.2-EC_PP&E Deferral Account","n","n","n","x","x","n","n","n"]
["App.2-ED_Account 1576 (2012)","x","x","n","x","x","x","x","n"]
["App.2-EE_Account 1576 (2013)","x","n","x","x","x","x","n","x"]
["App.2-FA Proposed REG Invest.","o","o","o","o","o","o","o","o"]
["App.2-FB Calc of REG Improvemnt","o","o","o","o","o","o","o","o"]
["App.2-FC Calc of REG Expansion","o","o","o","o","o","o","o","o"]
["App.2-G SQI","x","x","x","x","x","x","x","x"]
["App.2-H_Other_Oper_Rev","x","x","x","x","x","x","x","x"]
["App.2-I LF_CDM_WF","x","x","x","x","x","x","x","x"]
["App.2-JA_OM&A_Summary_Analys","x","x","x","x","x","x","x","x"]
["App.2-JB_OM&A_Cost _Drivers","x","x","x","x","x","x","x","x"]
["App.2-JC_OMA Programs","x","x","x","x","x","x","x","x"]
["App.2-K_Employee Costs","x","x","x","x","x","x","x","x"]
["App.2-L_OM&A_per_Cust_FTEE","x","x","x","x","x","x","x","x"]
["App.2-M_Regulatory_Costs","x","x","x","x","x","x","x","x"]
["App.2-N_Corp_Cost_Allocation","x","x","x","x","x","x","x","x"]
["App.2-OA Capital Structure","x","x","x","x","x","x","x","x"]
["App.2-OB_Debt Instruments","x","x","x","x","x","x","x","x"]
["App.2-P_Cost_Allocation","x","x","x","x","x","x","x","x"]
["App.2-Q_Cost of Serv. Emb. Dx","e","e","e","e","e","e","e","e"]
["App.2-R_Loss Factors","x","x","x","x","x","x","x","x"]
["App.2-S_Stranded Meters","x","x","x","x","x","x","x","x"]
["App.2-TA_1592_Tax_Variance","x","x","x","x","x","x","x","x"]
["App.2-TB_1592_HST-OVAT","x","x","x","x","x","x","x","x"]
["App.2-U_IFRS Transition Costs","x","x","x","x","x","x","x","x"]
["App.2-V_Rev_Reconciliation","x","x","x","x","x","x","x","x"]
["App.2-W_Bill Impacts","x","x","x","x","x","x","x","x"]
["App.2-YA_MIFRS Summary Impacts","n","n","n","x","n","n","n","n"]
["App. 2-YB_CGAAP Summary Impacts","x","x","x","n","n","x","x","x"]
["App. 2-Z_Tariff","x","x","x","x","x","x","x","x"]
["lists","n","n","n","n","n","n","n","n"]
["lists2","n","n","n","n","n","n","n","n"]
["Sheet19","n","n","n","n","n","n","n","n"]

{"sheet":"App.2-YA_IFRS Transition Costs","index":39,"n_rows":34,"n_cols":15,"rows_kept":34,"cut":false,"hidden":false,"merged":[[16,0,16,2],[13,0,15,2],[13,13,15,13],[13,10,14,10],[13,12,15,12],[8,0,8,16],[9,0,9,16],[11,0,11,14],[13,11,14,11],[13,14,15,14],[28,0,28,2],[17,0,17,2],[18,0,18,2],[19,0,19,2],[20,0,20,2],[21,0,21,2],[22,0,22,2],[23,0,23,2],[24,0,24,2],[25,0,25,2],[26,0,26,2],[27,0,27,2],[44,0,45,0],[44,1,45,3],[33,0,34,0],[36,0,37,0],[36,1,37,3],[32,1,32,4],[32,5,32,6],[31,1,31,14],[33,1,33,14],[39,0,42,0],[39,1,42,3]]}
[]
[null,null,null,null,null,null,null,null,null,null,null,null,null,"File Number:",{"$f":"EBNUMBER","v":"EB-2017-0071"}]
[null,null,null,null,null,null,null,null,null,null,null,null,null,"Exhibit:","N/A"]
[null,null,null,null,null,null,null,null,null,null,null,null,null,"Tab:"]
[null,null,null,null,null,null,null,null,null,null,null,null,null,"Schedule:"]
[null,null,null,null,null,null,null,null,null,null,null,null,null,"Page:"]
[]
[null,null,null,null,null,null,null,null,null,null,null,null,null,"Date:","2018-03-29"]
["Appendix 2-YA"]
["One-Time Incremental IFRS Transition Costs"]
[]
["The following table should be completed based on the information requested below. An explanation should be provided for any blank entries.  The entries should include one-time incremental IFRS transition costs that are currently included in Account 1508, Other Regulatory Assets, sub-account Deferred IFRS Transition Costs Account, or Account 1508, Other Regulatory Assets, sub-account IFRS Transition Costs Variance Account."]
[]
["Nature of One-Time Incremental IFRS Transition Costs 1",null,null,null,"Audited Actual Costs Incurred","Audited Actual Costs Incurred","Audited Actual Costs Incurred","Audited Actual Costs Incurred","Audited Actual Costs Incurred","Audited Carrying Charges ","Forecasted Costs ","Forecasted Costs ","Carrying Charges January 1, 2017 to December 31, 2017 or April 30, 2017 (As appropriate)","Total Costs and Carrying Charges","Reasons why the costs recorded meet the criteria of one-time IFRS administrative incremental costs"]
[]
[null,null,null,null,2012,2013,2014,2015,"2016 3","To December 31, 2016","2017 3","2018 3"]
["Professional accounting fees",null,null,null,null,null,null,null,null,null,null,null,null,{"$f":"SUM(E17:M17)","v":0}]
["Professional legal fees",null,null,null,null,null,null,null,null,null,null,null,null,0]
["Salaries, wages and benefits of staff added to support the transition to IFRS",null,null,null,null,null,null,null,null,null,null,null,null,0]
["Associated staff training and development costs",null,null,null,null,null,null,null,null,null,null,null,null,0]
["Costs related to system upgrades, or replacements or changes where IFRS was the major reason for conversion",null,null,null,null,null,null,null,null,null,null,null,null,0]
[null,null,null,null,null,null,null,null,null,null,null,null,null,0]
[null,null,null,null,null,null,null,null,null,null,null,null,null,0]
[null,null,null,null,null,null,null,null,null,null,null,null,null,0]
[null,null,null,null,null,null,null,null,null,null,null,null,null,0]
["Amounts, if any, included in previous Board approved rates (amounts should be negative) 2",null,null,null,null,null,null,null,null,null,null,null,null,0]
[null,null,null,null,null,null,null,null,null,null,null,null,null,0]
["Insert description of additional item(s) and new rows if needed.",null,null,null,null,null,null,null,null,null,null,null,null,0]
["Total",null,null,null,{"$f":"SUM(E17:E28)","v":0},0,null,{"$f":"SUM(H17:H28)","v":0},null,0,null,0,null,{"$f":"SUM(N17:N28)","v":0}]
[]
["Note:"]
[1,"The Deferred IFRS Transition Costs Account and the IFRS Transition Costs Variance Account are exclusively for necessary, incremental transition costs and shall not include ongoing IFRS compliance costs or impacts arising from adopting accounting policy changes that reflect changes in the timing of the recognition of income. The incremental costs in these accounts shall not include costs related to system upgrades, or replacements or changes where IFRS was not the major reason for conversion. In addition, incremental IFRS costs shall not include capital assets or expenditures."]
[2,"If there were any amounts approved in previous Board approved rates, please state the EB #:"]
[3,"Any forecasted One-time costs past 2015 should be fully explained in the application, since distributors were required to adopt IFRS or an alternative accounting standard by January 1, 2015."]

{"sheet":"Sheet1","index":40,"n_rows":0,"n_cols":0,"rows_kept":0,"cut":false,"hidden":false,"merged":[]}