{"text_format":"1","workbook":"xlsx","n_sheets":10,"sheets":["1. Info","2. Table of Contents","3. Rate Classes","4. RRR Data","5. UTRs and Sub-Transmission","6. Historical Wholesale","7. Current Wholesale","8. Forecast Wholesale","9. RTSR Rates to Forecast","hidden1"],"not_rendered":{"charts":0,"images":2,"macros":1,"external_links":2,"defined_names":20,"comments":0,"pivot_tables":0},"unopened":[],"bounds":{"document_bytes":16777216,"sheet_cells":100000,"rows_first":2000,"rows_last":500,"rows_between":2000,"halvings":0,"cell_chars":16384,"cell_head_chars":4096},"cells_cut":0,"cells_raw":0,"read":"whole","date_system":"1900"}

{"sheet":"1. Info","index":0,"n_rows":75,"n_cols":28,"rows_kept":75,"cut":false,"hidden":false,"merged":[[24,3,24,4],[20,3,20,4],[1,2,1,9],[2,2,2,9],[3,2,3,9],[4,2,4,9],[14,3,14,4],[16,3,16,4]]}
[null,null,null,null,null,null,null,null,null,null,null,null,null,null,null,null,null,null,null,null,null,null,null,null,null,null,null,"Alectra Utilities Corporation - Enersource Hydro"]
[null,null,null,null,null,null,null,null,null,null,null,null,null,null,null,null,null,null,null,null,null,null,null,null,null,null,null,"Alectra Utilities Corporation - Horizon Utilities"]
[null,null,null,null,null,null,null,null,null,null,null,null,null,null,null,null,null,null,null,null,null,null,null,null,null,null,null,"Alectra Utilities Corporation - Hydro One Brampton "]
[null,null,null,null,null,null,null,null,null,null,null,null,null,null,null,null,null,null,null,null,null,null,null,null,null,null,null,"Alectra Utilities Corporation - PowerStream Inc."]
[null,null,null,null,null,null,null,null,null,null,null,null,null,null,null,null,null,null,null,null,null,null,null,null,null,null,null,"Algoma Power Inc."]
[null,null,null,null,null,null,null,null,null,null,null,null,null,null,null,null,null,null,null,null,null,null,null,null,null,null,null,"Atikokan Hydro Inc."]
[null,null,null,null,null,null,null,null,null,null,null,null,null,null,null,null,null,null,null,null,null,null,null,null,null,null,null,"Attawapiskat Power Corp. "]
[null,null,null,null,null,null,null,null,null,null,null,null,null,null,null,null,null,null,null,null,null,null,null,null,null,null,null,"Bluewater Power Distribution Corporation"]
[null,null,null,null,null,null,null,null,null,null,null,null,null,null,null,null,null,null,null,null,null,null,null,null,null,null,null,"Brantford Power Inc."]
[null,null,null,null,null,null,null,null,null,null,null,null,null,null,null,null,null,null,null,null,null,null,null,null,null,null,null,"Burlington Hydro Inc."]
[null,null,null,null,null,null,null,null,null,null,null,null,null,null,null,null,null,null,null,null,null,null,null,null,null,null,null,"Canadian Niagara Power Inc."]
[null,null,null,null,null,null,null,null,null,null,null,null,null,null,null,null,null,null,null,null,null,null,null,null,null,null,null,"Centre Wellington Hydro Ltd."]
["Drop-down lists are shaded blue; Input cells are shaded green.",null,null,null,null,null,null,null,null,null,null,null,null,null,null,null,null,null,null,null,null,null,null,null,null,null,null,"Chapleau Public Utilities Corporation"]
[null,null,null,null,null,null,null,null,null,null,null,null,null,null,null,null,null,null,null,null,null,null,null,null,null,null,null,"COLLUS PowerStream Corporation"]
[null,null,"Utility Name   ","Energy + Inc.",null,null,null,null,null,null,null,null,null,null,null,null,null,null,null,null,null,null,null,null,null,null,null,"Cooperative Hydro Embrun Inc."]
[null,null,null,null,null,null,null,null,null,null,null,null,null,null,null,null,null,null,null,null,null,null,null,null,null,null,null,"E.L.K. Energy Inc."]
[null,null,"Service Territory",null,null,null,null,null,null,null,null,null,null,null,null,null,null,null,null,null,null,null,null,null,null,null,null,"Energy + Inc."]
[null,null,null,null,null,null,null,null,null,null,null,null,null,null,null,null,null,null,null,null,null,null,null,null,null,null,null,"Entegrus Powerlines Inc."]
[null,null,"Assigned EB Number","EB-2018-0028",null,null,null,null,null,null,null,null,null,null,null,null,null,null,null,null,null,null,null,null,null,null,null,"ENWIN Utilities Ltd."]
[null,null,null,null,null,null,null,null,null,null,null,null,null,null,null,null,null,null,null,null,null,null,null,null,null,null,null,"Erie Thames Powerlines Corporation"]
{"$rows_left_out":56}
{"sheet":"2. Table of Contents","index":1,"n_rows":28,"n_cols":9,"rows_kept":28,"cut":false,"hidden":false,"merged":[]}
[]
[]
[]
[]
[]
[]
[]
[]
[]
[]
[]
[]
[]
[]
[]
[]
[]
[]
[]
[null,null,null,"1. Info",null,null,null,null,"6. Historical Wholesale"]
{"$rows_left_out":9}
{"sheet":"3. Rate Classes","index":2,"n_rows":100,"n_cols":23,"rows_kept":100,"cut":false,"hidden":false,"merged":[[12,2,12,8]]}
[]
[]
[]
[]
[]
[]
[]
[]
[]
[]
[]
[]
[null,null,"1.  Select the appropriate rate classes that appear on your most recent Board-Approved Tariff of Rates and Charges.\n2.  Enter the RTS Network and Connection Rate as it appears on the Tariff of Rates and Charges"]
[]
[null,null,"Rate Class",null,"Unit",null,"RTSR-Network",null,"RTSR-Connection"]
[]
[null,null,"Residential",null,"kWh",null,5.9399238706380553E-3,null,4.4000000000000003E-3,null,null,{"$f":"IF(OR(ISBLANK(C17), ISERROR(FIND(\"Choose\", C17))=FALSE), 0, 1)","v":1},{"$f":"\"C\" & ROW(C17)","v":"C17"},{"$f":"IF(OR(C17=\"General Service Intermediate Rate Class 1,000 To 4,999 kW (formerly General Service > 50 kW Customers)\", C17=\"General Service Intermediate Rate Class 1,000 To 4,999 kW (formerly Large Use Customers)\"), \"x\", \"\")","v":""},null,null,null,null,null,null,null,null,"Choose Rate Class"]
[null,null,"General Service Less Than 50 kW",null,"kWh",null,5.1999999999999998E-3,null,4.1000000000000003E-3,null,null,1,"C18",{"$f":"IF(OR(C18=\"General Service Intermediate Rate Class 1,000 To 4,999 kW (formerly General Service > 50 kW Customers)\", C18=\"General Service Intermediate Rate Class 1,000 To 4,999 kW (formerly Large Use Customers)\"), \"x\", \"\")","v":""},null,null,null,null,null,null,null,null,"Residential"]
[null,null,"General Service 50 to 999 kW",null,"kW",null,3.3563000000000001,null,2.4847000000000001,null,null,1,"C19","",null,null,null,null,null,null,null,null,"Residential Regular"]
[null,null,"General Service 1,000 to 4,999 kW",null,"kW",null,2.5491000000000001,null,1.9499,null,null,1,"C20","",null,null,null,null,null,null,null,null,"Residential Urban"]
{"$rows_left_out":81}
{"sheet":"4. RRR Data","index":3,"n_rows":34,"n_cols":9,"rows_kept":34,"cut":false,"hidden":false,"merged":[[12,1,12,8]]}
[]
[]
[]
[]
[]
[]
[]
[]
[]
[]
[]
[]
[]
[]
[null,"Rate Class","Rate Description","Unit","Rate","Non-Loss Adjusted Metered kWh","Non-Loss Adjusted Metered kW","Applicable \nLoss Factor\neg: (1.0325)","Loss Adjusted Billed kWh"]
[]
[null,"Residential","RTSR - Network","kWh",5.9399238706380553E-3,389779994.58054686,null,1.030684649944027,{"$f":"F17*H17","v":401740257.26943564}]
[null,"Residential","RTSR - Connection","kWh",4.4000000000000003E-3,389779994.58054686,null,1.030684649944027,{"$f":"F18*H18","v":401740257.26943564}]
[null,"General Service Less Than 50 kW","RTSR - Network","kWh",5.1999999999999998E-3,152724958.40449628,null,1.030684649944027,{"$f":"F19*H19","v":157411270.29085433}]
[null,"General Service Less Than 50 kW","RTSR - Connection","kWh",4.1000000000000003E-3,152724958.40449628,null,1.030684649944027,{"$f":"F20*H20","v":157411270.29085433}]
{"$rows_left_out":15}
{"sheet":"5. UTRs and Sub-Transmission","index":4,"n_rows":75,"n_cols":10,"rows_kept":75,"cut":false,"hidden":false,"merged":[[69,4,69,5],[71,4,71,5],[74,4,74,5],[73,4,73,5],[50,4,50,5],[52,4,52,5],[54,4,54,5],[56,4,56,5],[65,4,65,5],[67,4,67,5],[48,4,48,5],[44,4,44,5],[59,4,59,5],[28,4,28,5],[17,4,17,5],[33,4,33,5],[19,4,19,5],[21,4,21,5],[23,4,23,5],[25,4,25,5],[35,4,35,5],[37,4,37,5],[38,4,39,5],[41,4,41,5]]}
[]
[]
[]
[]
[]
[]
[]
[]
[]
[]
[]
[]
[]
[]
[]
[]
[]
[null,"Uniform Transmission Rates","Unit",null,2017,null,null,2018,null,2019]
[]
[null,"Rate Description",null,null,"Rate",null,null,"Rate",null,"Rate"]
{"$rows_left_out":56}
{"sheet":"6. Historical Wholesale","index":5,"n_rows":16,"n_cols":10,"rows_kept":16,"cut":false,"hidden":false,"merged":[]}
[]
[]
["The purpose of this table is to re-align the current RTS Connection Rates to recover current wholesale connection costs."]
[null,null,null,"Current RTSR-Connection",null,null,null,null,null,"Adjusted RTSR-Connection"]
["The purpose of this table is to update the re-aligned RTS Network Rates to recover future wholesale network costs."]
[null,null,null,"Adjusted RTSR-Network",null,null,null,null,null,"Proposed RTSR-Network"]
[]
[]
[]
["The purpose of this table is to re-align the current RTS Connection Rates to recover current wholesale connection costs."]
[null,null,null,"Adjusted RTSR-Connection"]
["The purpose of this table is to update the re-aligned RTS Network Rates to recover future wholesale network costs."]
[]
["The purpose of this table is to update the re-aligned RTS Connection Rates to recover future wholesale connection costs."]
[null,null,null,"Adjusted RTSR-Connection",null,null,null,null,null,"Proposed RTSR-Connection"]
["The purpose of this table is to re-align the current RTS Connection Rates to recover current wholesale connection costs."]

{"sheet":"7. Current Wholesale","index":6,"n_rows":117,"n_cols":16,"rows_kept":117,"cut":false,"hidden":false,"merged":[[96,7,96,9],[96,11,96,13],[20,3,20,5],[20,7,20,9],[20,11,20,13],[96,3,96,5],[95,3,95,5],[95,7,95,9],[95,11,95,13],[57,3,57,5],[57,7,57,9],[57,11,57,13],[76,3,76,5],[76,7,76,9],[76,11,76,13],[12,1,12,11],[19,3,19,5],[19,7,19,9],[19,11,19,13],[38,3,38,5],[38,7,38,9],[38,11,38,13]]}
[]
[]
[]
[]
[]
[]
[]
[]
[]
[]
[]
[]
[null,"The purpose of this sheet is to calculate the expected billing when current 2018 Uniform Transmission Rates are applied against historical 2017 transmission units."]
[]
[]
[]
[]
[]
[]
[null,"IESO",null,"Network",null,null,null,"Line Connection",null,null,null,"Transformation Connection",null,null,null,"Total Line"]
{"$rows_left_out":98}
{"sheet":"8. Forecast Wholesale","index":7,"n_rows":117,"n_cols":16,"rows_kept":117,"cut":false,"hidden":false,"merged":[[96,7,96,9],[96,11,96,13],[20,3,20,5],[20,7,20,9],[20,11,20,13],[96,3,96,5],[95,3,95,5],[95,7,95,9],[95,11,95,13],[57,3,57,5],[57,7,57,9],[57,11,57,13],[76,3,76,5],[76,7,76,9],[76,11,76,13],[12,1,12,12],[19,3,19,5],[19,7,19,9],[19,11,19,13],[38,3,38,5],[38,7,38,9],[38,11,38,13]]}
[]
[]
[]
[]
[]
[]
[]
[]
[]
[]
[]
[]
[null,"The purpose of this sheet is to calculate the expected billing when forecasted 2019 Uniform Transmission Rates are applied against historical 2017 transmission units."]
[]
[]
[]
[]
[]
[]
[null,"IESO",null,"Network",null,null,null,"Line Connection",null,null,null,"Transformation Connection",null,null,null,"Total Line"]
{"$rows_left_out":98}
{"sheet":"9. RTSR Rates to Forecast","index":8,"n_rows":64,"n_cols":10,"rows_kept":64,"cut":false,"hidden":false,"merged":[]}
[null,null,null,null,null,null,{"$f":"ROUND(D1*F1, 2)","v":0},{"$f":"G1/0","v":{"$error":"#DIV/0!"}},{"$f":"H1*total_current_wholesale_network","v":{"$error":"#DIV/0!"}},{"$f":"IF(ISERROR(I1/F1), 0, I1/F1)","v":0}]
[null,null,null,null,null,null,{"$f":"ROUND(D2*F2, 2)","v":0},{"$f":"G2/0","v":{"$error":"#DIV/0!"}},{"$f":"H2*total_current_wholesale_network","v":{"$error":"#DIV/0!"}},{"$f":"IF(ISERROR(I2/F2), 0, I2/F2)","v":0}]
[null,null,null,null,null,null,{"$f":"ROUND(D3*F3, 2)","v":0},{"$f":"G3/0","v":{"$error":"#DIV/0!"}},{"$f":"H3*Total_Current_Wholesale_Lineplus","v":{"$error":"#DIV/0!"}},{"$f":"IF(ISERROR(I3/F3), 0, I3/F3)","v":0}]
[null,null,null,null,null,null,{"$f":"ROUND(D4*F4, 2)","v":0},{"$f":"G4/0","v":{"$error":"#DIV/0!"}},{"$f":"H4*Total_Current_Wholesale_Lineplus","v":{"$error":"#DIV/0!"}},{"$f":"IF(ISERROR(I4/F4), 0, I4/F4)","v":0}]
[null,null,null,null,null,null,{"$f":"ROUND(D5*F5, 2)","v":0},{"$f":"G5/0","v":{"$error":"#DIV/0!"}},{"$f":"H5*Total_Current_Wholesale_Lineplus","v":{"$error":"#DIV/0!"}},{"$f":"IF(ISERROR(I5/F5), 0, I5/F5)","v":0}]
["Residential","RTSR - Connection","kWh",4.4000000000000003E-3,null,null,{"$f":"ROUND(D6*E6, 2)","v":0},{"$f":"G6/0","v":{"$error":"#DIV/0!"}},{"$f":"H6*Total_Current_Wholesale_Lineplus","v":{"$error":"#DIV/0!"}},{"$f":"IF(ISERROR(I6/E6), 0, I6/E6)","v":0}]
["General Service Less Than 50 kW","RTSR - Connection","kWh",4.1000000000000003E-3,null,null,{"$f":"ROUND(D7*F7, 2)","v":0},{"$f":"G7/0","v":{"$error":"#DIV/0!"}},{"$f":"H7*total_current_wholesale_network","v":{"$error":"#DIV/0!"}},{"$f":"IF(ISERROR(I7/F7), 0, I7/F7)","v":0}]
["General Service 50 to 999 kW","RTSR - Connection","kW",2.4847000000000001,null,null,{"$f":"ROUND(D8*F8, 2)","v":0},0,{"$f":"H8*forecast_wholesale_network","v":{"$error":"#REF!"}},{"$f":"IF(ISERROR(I8/F8), 0, I8/F8)","v":0}]
["General Service 1,000 to 4,999 kW","RTSR - Connection","kW",1.9499,null,null,{"$f":"ROUND(D9*F9, 2)","v":0},0,{"$f":"H9*forecast_wholesale_network","v":{"$error":"#REF!"}},{"$f":"IF(ISERROR(I9/F9), 0, I9/F9)","v":0}]
["Large Use","RTSR - Connection","kW",1.9849000000000001,null,null,{"$f":"ROUND(D10*F10, 2)","v":0},0,{"$f":"H10*forecast_wholesale_network","v":{"$error":"#REF!"}},{"$f":"IF(ISERROR(I10/F10), 0, I10/F10)","v":0}]
["Street Lighting","RTSR - Connection","kW",1.2485999999999999,null,null,{"$f":"ROUND(D11*F11, 2)","v":0},0,{"$f":"H11*forecast_wholesale_network","v":{"$error":"#REF!"}},{"$f":"IF(ISERROR(I11/F11), 0, I11/F11)","v":0}]
["Unmetered Scattered Load","RTSR - Connection","kWh",4.1000000000000003E-3,null,null,{"$f":"IF(ISERROR(D12*E12), 0, ROUND(D12*E12, 2))","v":0},0,{"$f":"H12*forecast_wholesale_network","v":{"$error":"#REF!"}},{"$f":"IF(ISERROR(I12/E12), 0, I12/E12)","v":0}]
["Embedded Distributor","RTSR - Connection","kW",1.9849000000000001,null,null,{"$f":"ROUND(D13*F13, 2)","v":0},{"$f":"G13/0","v":{"$error":"#DIV/0!"}},{"$f":"H13*total_current_wholesale_network","v":{"$error":"#DIV/0!"}},{"$f":"IF(ISERROR(I13/F13), 0, I13/F13)","v":0}]
["Embedded Distributor","RTSR - Connection","kW",1.9849000000000001,null,null,{"$f":"ROUND(D14*F14, 2)","v":0},{"$f":"G14/0","v":{"$error":"#DIV/0!"}},{"$f":"H14*total_current_wholesale_network","v":{"$error":"#DIV/0!"}},{"$f":"IF(ISERROR(I14/F14), 0, I14/F14)","v":0}]
[null,null,null,null,"Loss Adjusted Billed kWh","Billed kW",{"$f":"ROUND(D15*F15, 2)","v":{"$error":"#VALUE!"}},{"$f":"G15/0","v":{"$error":"#VALUE!"}},{"$f":"H15*total_current_wholesale_network","v":{"$error":"#VALUE!"}},{"$f":"IF(ISERROR(I15/F15), 0, I15/F15)","v":0}]
[null,null,null,null,null,null,{"$f":"ROUND(D16*F16, 2)","v":0},{"$f":"G16/0","v":{"$error":"#DIV/0!"}},{"$f":"H16*Total_Current_Wholesale_Lineplus","v":{"$error":"#DIV/0!"}},{"$f":"IF(ISERROR(I16/F16), 0, I16/F16)","v":0}]
["Residential","RTSR - Network","kWh",5.9399238706380553E-3,401740257.26943564,null,{"$f":"ROUND(D17*E17, 2)","v":2386306.54},{"$f":"G17/0","v":{"$error":"#DIV/0!"}},{"$f":"H17*Total_Current_Wholesale_Lineplus","v":{"$error":"#DIV/0!"}},{"$f":"IF(ISERROR(I17/E17), 0, I17/E17)","v":0}]
["General Service Less Than 50 kW","RTSR - Network","kWh",5.1999999999999998E-3,157411270.29085433,null,{"$f":"ROUND(D18*E18, 2)","v":818538.61},{"$f":"G18/0","v":{"$error":"#DIV/0!"}},{"$f":"H18*Total_Current_Wholesale_Lineplus","v":{"$error":"#DIV/0!"}},{"$f":"IF(ISERROR(I18/E18), 0, I18/E18)","v":0}]
["Residential","RTSR - Connection","kWh",4.4000000000000003E-3,null,1358720.1996617641,{"$f":"ROUND(D19*E19, 2)","v":0},{"$f":"G19/0","v":{"$error":"#DIV/0!"}},{"$f":"H19*Total_Current_Wholesale_Lineplus","v":{"$error":"#DIV/0!"}},{"$f":"IF(ISERROR(I19/E19), 0, I19/E19)","v":0}]
["General Service Less Than 50 kW","RTSR - Connection","kWh",4.1000000000000003E-3,null,473291.02078337281,{"$f":"ROUND(D20*F20, 2)","v":1940.49},{"$f":"G20/10207890.1","v":1.900970701085428E-4},{"$f":"H20*total_current_wholesale_network","v":{"$error":"#REF!"}},{"$f":"IF(ISERROR(I20/F20), 0, I20/F20)","v":0}]
{"$rows_left_out":45}
{"sheet":"hidden1","index":9,"n_rows":22,"n_cols":2,"rows_kept":22,"cut":false,"hidden":true,"merged":[]}
[{"$f":"IF('3. Rate Classes'!L17=1, '3. Rate Classes'!C17, \"\")","v":"Residential"},1]
[{"$f":"IF('3. Rate Classes'!L18=1, '3. Rate Classes'!C18, \"\")","v":"General Service Less Than 50 kW"},2]
[{"$f":"IF('3. Rate Classes'!L19=1, '3. Rate Classes'!C19, \"\")","v":"General Service 50 to 999 kW"},3]
[{"$f":"IF('3. Rate Classes'!L20=1, '3. Rate Classes'!C20, \"\")","v":"General Service 1,000 to 4,999 kW"},4]
[{"$f":"IF('3. Rate Classes'!L21=1, '3. Rate Classes'!C21, \"\")","v":"Large Use"},5]
[{"$f":"IF('3. Rate Classes'!L22=1, '3. Rate Classes'!C22, \"\")","v":"Street Lighting"},6]
[{"$f":"IF('3. Rate Classes'!L23=1, '3. Rate Classes'!C23, \"\")","v":"Unmetered Scattered Load"},7]
[{"$f":"IF('3. Rate Classes'!L24=1, '3. Rate Classes'!C24, \"\")","v":"Embedded Distributor"},8]
[{"$f":"IF('3. Rate Classes'!L25=1, '3. Rate Classes'!C25, \"\")","v":"Embedded Distributor"},9]
[{"$f":"IF('3. Rate Classes'!L26=1, '3. Rate Classes'!C26, \"\")","v":""},10]
[{"$f":"IF('3. Rate Classes'!L27=1, '3. Rate Classes'!C27, \"\")","v":""},11]
[{"$f":"IF('3. Rate Classes'!L28=1, '3. Rate Classes'!C28, \"\")","v":""},12]
[{"$f":"IF('3. Rate Classes'!L29=1, '3. Rate Classes'!C29, \"\")","v":""},13]
[{"$f":"IF('3. Rate Classes'!L30=1, '3. Rate Classes'!C30, \"\")","v":""},14]
[{"$f":"IF('3. Rate Classes'!L31=1, '3. Rate Classes'!C31, \"\")","v":""},15]
[{"$f":"IF('3. Rate Classes'!L32=1, '3. Rate Classes'!C32, \"\")","v":""},16]
[{"$f":"IF('3. Rate Classes'!L33=1, '3. Rate Classes'!C33, \"\")","v":""},17]
[{"$f":"IF('3. Rate Classes'!L34=1, '3. Rate Classes'!C34, \"\")","v":""},18]
[{"$f":"IF('3. Rate Classes'!L35=1, '3. Rate Classes'!C35, \"\")","v":""},19]
[{"$f":"IF('3. Rate Classes'!L36=1, '3. Rate Classes'!C36, \"\")","v":""},20]
{"$rows_left_out":2}