{"text_format":"1","workbook":"xlsx","n_sheets":14,"sheets":["Overview","Project Inputs","Capital Cont Inputs","Standard Inputs","Prelim Calc","NPV Calc","S92 RevReq Calc","Standard Report","S92 Report Before Cont $M p1","S92 Report Before Cont $M p2","S92 Rate Impact p1","S92 Rate Impact p2","Warnings","Menus"],"not_rendered":{"charts":0,"images":2,"macros":1,"external_links":0,"defined_names":95,"comments":1,"pivot_tables":0},"unopened":[],"bounds":{"document_bytes":16777216,"sheet_cells":100000,"rows_first":2000,"rows_last":500,"rows_between":2000,"halvings":0,"cell_chars":16384,"cell_head_chars":4096},"cells_cut":0,"cells_raw":0,"read":"whole","date_system":"1900"}

{"sheet":"Overview","index":0,"n_rows":4,"n_cols":2,"rows_kept":4,"cut":false,"hidden":false,"merged":[[4,1,4,3]]}
[]
[]
[null,"Lake Superior Link"]
[null,"SEC 22b IR Response"]

{"sheet":"Project Inputs","index":1,"n_rows":95,"n_cols":27,"rows_kept":95,"cut":false,"hidden":false,"merged":[[77,4,77,10],[27,2,27,11],[8,1,8,6],[22,1,22,6],[70,10,70,15],[69,10,69,15],[68,10,68,15],[73,1,73,4],[68,1,68,2],[69,1,69,2],[70,1,70,2],[20,2,20,9],[12,1,12,6],[68,3,68,5],[10,1,10,6],[70,3,70,5],[68,7,68,8],[69,7,69,8],[70,7,70,8],[4,1,4,3],[37,2,37,11],[48,2,48,11],[54,2,54,11],[60,2,60,11],[69,3,69,5]]}
["A: PROJECT INFORMATION"]
[]
["To reset all user inputs, please click here:"]
[]
["Analysis prepared by:","Hydro One inc."]
[]
["Plan Number:","25032"]
[]
["Project name:","Hydro One Lake Superior Link proposal"]
[]
{"$rows_left_out":86}
{"sheet":"Capital Cont Inputs","index":2,"n_rows":53,"n_cols":54,"rows_kept":53,"cut":false,"hidden":false,"merged":[[15,28,15,53],[11,1,11,10],[12,1,12,10],[31,0,31,2],[51,3,51,8]]}
["SUMMARY OF CAPITAL CONTRIBUTIONS & ECONOMIC EVALUATION PERIOD"]
[]
["Summary of Key Dates:"]
["In-service year",{"$f":"YEAR('Project Inputs'!B15)","v":2021}]
["Duration of Economic Evaluation",{"$f":"IF(ISNUMBER('Project Inputs'!B21),'Project Inputs'!B21,'Project Inputs'!E19)","v":25},{"$f":"\"Based on \"&'Project Inputs'!B19&\" \"&'Project Inputs'!A19&IF(ISNUMBER('Project Inputs'!B21),\" with alternate evaluation period of \"&'Project Inputs'!B21&\" years.\",\".\")","v":"Based on Low Customer Risk Classification."}]
[]
[null,"Year","Stage"]
["Current Stage Data",{"$f":"VLOOKUP('Project Inputs'!B19&\" - \"&'Project Inputs'!B28,'Standard Inputs'!$A$73:$F$105,MATCH('Standard Inputs'!$F$73,'Standard Inputs'!$A$73:$F$73,0),0)","v":2021},{"$f":"'Project Inputs'!B28","v":"Estimated cost"}]
[]
["End of Economic Evaluation",{"$f":"B4+B5","v":2046}]
{"$rows_left_out":44}
{"sheet":"Standard Inputs","index":3,"n_rows":105,"n_cols":28,"rows_kept":105,"cut":false,"hidden":false,"merged":[[35,5,35,10],[36,5,36,10],[37,5,37,10],[42,27,42,32],[78,6,78,14],[79,6,79,14],[68,1,68,4],[74,6,74,14],[75,6,75,14],[76,6,76,14],[77,6,77,14],[80,6,80,14],[84,6,84,14],[85,6,85,14],[86,6,86,14],[87,6,87,14],[88,6,88,14],[92,6,92,14],[93,6,93,14],[94,6,94,14],[95,6,95,14],[104,6,104,14],[96,6,96,14],[100,6,100,14],[101,6,101,14],[102,6,102,14],[103,6,103,14]]}
[]
[]
[]
["REVENUE INPUTS:"]
["Pool","Tariffs ($/kW/Month)","Revenue Requirement ($k)","Annual Billing (MW)"]
["Line",0.94,226748.08300000001,240445.584,"EB-2016-0160 - Hydro One Networks' 2017-2018 Transmission Revenue Requirement"]
["Network",3.59,893562.07400000002,249132.40700000001,"& Charge Determinants"]
["Transformation",2.33,475639.75199999998,203770.823,"EB-2017-0359 - 2018 Uniform Transmission Rates"]
[]
["DISCOUNT RATE INPUTS:"]
{"$rows_left_out":96}
{"sheet":"Prelim Calc","index":4,"n_rows":131,"n_cols":30,"rows_kept":131,"cut":false,"hidden":false,"merged":[]}
[]
[null,null,"Calculation of Discount Rate","Capital","Allowed","Regulated",null,"After-tax"]
[null,null,null,"Structure","Return*","Return","Tax Rate","Discount Rate"]
[null,null,"Debt:"]
[null,null,"Third-Party Long-term Debt",{"$f":"'Standard Inputs'!B13","v":0.49049999999999999},{"$f":"'Standard Inputs'!B19","v":4.6800000000000001E-2},{"$f":"D5*E5","v":2.2955400000000001E-2},{"$f":"'Standard Inputs'!B28","v":0.26500000000000001},{"$f":"D5*E5*(1-G5)","v":1.6872219000000001E-2}]
[null,null,"Deemed Long-term Debt",{"$f":"'Standard Inputs'!B14","v":6.9500000000000006E-2},{"$f":"'Standard Inputs'!B20","v":4.6800000000000001E-2},{"$f":"D6*E6","v":3.2526000000000005E-3},{"$f":"G5","v":0.26500000000000001},{"$f":"D6*E6*(1-G6)","v":2.3906610000000001E-3}]
[null,null,"Short-term Debt",{"$f":"'Standard Inputs'!B15","v":0.04},{"$f":"'Standard Inputs'!B21","v":2.29E-2},{"$f":"D7*E7","v":9.1600000000000004E-4},{"$f":"G6","v":0.26500000000000001},{"$f":"D7*E7*(1-G7)","v":6.7326000000000007E-4}]
[null,null,null,null,null,{"$f":"SUM(F5:F7)","v":2.7124000000000002E-2},null,{"$f":"SUM(H5:H7)","v":1.9936139999999998E-2}]
[]
[null,null,"Equity:"]
{"$rows_left_out":122}
{"sheet":"NPV Calc","index":5,"n_rows":152,"n_cols":30,"rows_kept":152,"cut":false,"hidden":false,"merged":[]}
[]
[null,"Capital Contribution flag (select Yes to include in calculation of NPV):","No"]
[]
[null,null,null,"Project Year:",{"$f":"'Capital Cont Inputs'!B16","v":0},{"$f":"'Capital Cont Inputs'!C16","v":1},{"$f":"'Capital Cont Inputs'!D16","v":2},{"$f":"'Capital Cont Inputs'!E16","v":3},{"$f":"'Capital Cont Inputs'!F16","v":4},{"$f":"'Capital Cont Inputs'!G16","v":5},{"$f":"'Capital Cont Inputs'!H16","v":6},{"$f":"'Capital Cont Inputs'!I16","v":7},{"$f":"'Capital Cont Inputs'!J16","v":8},{"$f":"'Capital Cont Inputs'!K16","v":9},{"$f":"'Capital Cont Inputs'!L16","v":10},{"$f":"'Capital Cont Inputs'!M16","v":11},{"$f":"'Capital Cont Inputs'!N16","v":12},{"$f":"'Capital Cont Inputs'!O16","v":13},{"$f":"'Capital Cont Inputs'!P16","v":14},{"$f":"'Capital Cont Inputs'!Q16","v":15},{"$f":"'Capital Cont Inputs'!R16","v":16},{"$f":"'Capital Cont Inputs'!S16","v":17},{"$f":"'Capital Cont Inputs'!T16","v":18},{"$f":"'Capital Cont Inputs'!U16","v":19},{"$f":"'Capital Cont Inputs'!V16","v":20},{"$f":"'Capital Cont Inputs'!W16","v":21},{"$f":"'Capital Cont Inputs'!X16","v":22},{"$f":"'Capital Cont Inputs'!Y16","v":23},{"$f":"'Capital Cont Inputs'!Z16","v":24},{"$f":"'Capital Cont Inputs'!AA16","v":25}]
[null,null,null,"Year Ended:",{"$f":"'Capital Cont Inputs'!B15","v":2021},{"$f":"'Capital Cont Inputs'!C15","v":2022},{"$f":"'Capital Cont Inputs'!D15","v":2023},{"$f":"'Capital Cont Inputs'!E15","v":2024},{"$f":"'Capital Cont Inputs'!F15","v":2025},{"$f":"'Capital Cont Inputs'!G15","v":2026},{"$f":"'Capital Cont Inputs'!H15","v":2027},{"$f":"'Capital Cont Inputs'!I15","v":2028},{"$f":"'Capital Cont Inputs'!J15","v":2029},{"$f":"'Capital Cont Inputs'!K15","v":2030},{"$f":"'Capital Cont Inputs'!L15","v":2031},{"$f":"'Capital Cont Inputs'!M15","v":2032},{"$f":"'Capital Cont Inputs'!N15","v":2033},{"$f":"'Capital Cont Inputs'!O15","v":2034},{"$f":"'Capital Cont Inputs'!P15","v":2035},{"$f":"'Capital Cont Inputs'!Q15","v":2036},{"$f":"'Capital Cont Inputs'!R15","v":2037},{"$f":"'Capital Cont Inputs'!S15","v":2038},{"$f":"'Capital Cont Inputs'!T15","v":2039},{"$f":"'Capital Cont Inputs'!U15","v":2040},{"$f":"'Capital Cont Inputs'!V15","v":2041},{"$f":"'Capital Cont Inputs'!W15","v":2042},{"$f":"'Capital Cont Inputs'!X15","v":2043},{"$f":"'Capital Cont Inputs'!Y15","v":2044},{"$f":"'Capital Cont Inputs'!Z15","v":2045},{"$f":"'Capital Cont Inputs'!AA15","v":2046}]
[]
["Discount","Calculation of Net Present Value:","Undiscounted","Cum. NPV at "]
["Method",null,"Cash Flow","IS Date"]
[null,"Incremental revenues:"]
[null,{"$f":"CONCATENATE('Project Inputs'!B28,\" - \",\"Load Forecast (MW)\")","v":"Estimated cost - Load Forecast (MW)"},null,null,null,{"$f":"'Prelim Calc'!F129","v":0},{"$f":"'Prelim Calc'!G129","v":0},{"$f":"'Prelim Calc'!H129","v":0},{"$f":"'Prelim Calc'!I129","v":0},{"$f":"'Prelim Calc'!J129","v":0},{"$f":"'Prelim Calc'!K129","v":0},{"$f":"'Prelim Calc'!L129","v":0},{"$f":"'Prelim Calc'!M129","v":0},{"$f":"'Prelim Calc'!N129","v":0},{"$f":"'Prelim Calc'!O129","v":0},{"$f":"'Prelim Calc'!P129","v":0},{"$f":"'Prelim Calc'!Q129","v":0},{"$f":"'Prelim Calc'!R129","v":0},{"$f":"'Prelim Calc'!S129","v":0},{"$f":"'Prelim Calc'!T129","v":0},{"$f":"'Prelim Calc'!U129","v":0},{"$f":"'Prelim Calc'!V129","v":0},{"$f":"'Prelim Calc'!W129","v":0},{"$f":"'Prelim Calc'!X129","v":0},{"$f":"'Prelim Calc'!Y129","v":0},{"$f":"'Prelim Calc'!Z129","v":0},{"$f":"'Prelim Calc'!AA129","v":0},{"$f":"'Prelim Calc'!AB129","v":0},{"$f":"'Prelim Calc'!AC129","v":0},{"$f":"'Prelim Calc'!AD129","v":0}]
{"$rows_left_out":143}
{"sheet":"S92 RevReq Calc","index":6,"n_rows":107,"n_cols":30,"rows_kept":107,"cut":false,"hidden":false,"merged":[]}
[]
[null,null,"Calculation of Revenue Requirement"]
[null,null,null,"Project Year:",{"$f":"'Capital Cont Inputs'!B16","v":0},{"$f":"'Capital Cont Inputs'!C16","v":1},{"$f":"'Capital Cont Inputs'!D16","v":2},{"$f":"'Capital Cont Inputs'!E16","v":3},{"$f":"'Capital Cont Inputs'!F16","v":4},{"$f":"'Capital Cont Inputs'!G16","v":5},{"$f":"'Capital Cont Inputs'!H16","v":6},{"$f":"'Capital Cont Inputs'!I16","v":7},{"$f":"'Capital Cont Inputs'!J16","v":8},{"$f":"'Capital Cont Inputs'!K16","v":9},{"$f":"'Capital Cont Inputs'!L16","v":10},{"$f":"'Capital Cont Inputs'!M16","v":11},{"$f":"'Capital Cont Inputs'!N16","v":12},{"$f":"'Capital Cont Inputs'!O16","v":13},{"$f":"'Capital Cont Inputs'!P16","v":14},{"$f":"'Capital Cont Inputs'!Q16","v":15},{"$f":"'Capital Cont Inputs'!R16","v":16},{"$f":"'Capital Cont Inputs'!S16","v":17},{"$f":"'Capital Cont Inputs'!T16","v":18},{"$f":"'Capital Cont Inputs'!U16","v":19},{"$f":"'Capital Cont Inputs'!V16","v":20},{"$f":"'Capital Cont Inputs'!W16","v":21},{"$f":"'Capital Cont Inputs'!X16","v":22},{"$f":"'Capital Cont Inputs'!Y16","v":23},{"$f":"'Capital Cont Inputs'!Z16","v":24},{"$f":"'Capital Cont Inputs'!AA16","v":25}]
[null,null,null,"Year Ended:",{"$f":"'Capital Cont Inputs'!B15","v":2021},{"$f":"'Capital Cont Inputs'!C15","v":2022},{"$f":"'Capital Cont Inputs'!D15","v":2023},{"$f":"'Capital Cont Inputs'!E15","v":2024},{"$f":"'Capital Cont Inputs'!F15","v":2025},{"$f":"'Capital Cont Inputs'!G15","v":2026},{"$f":"'Capital Cont Inputs'!H15","v":2027},{"$f":"'Capital Cont Inputs'!I15","v":2028},{"$f":"'Capital Cont Inputs'!J15","v":2029},{"$f":"'Capital Cont Inputs'!K15","v":2030},{"$f":"'Capital Cont Inputs'!L15","v":2031},{"$f":"'Capital Cont Inputs'!M15","v":2032},{"$f":"'Capital Cont Inputs'!N15","v":2033},{"$f":"'Capital Cont Inputs'!O15","v":2034},{"$f":"'Capital Cont Inputs'!P15","v":2035},{"$f":"'Capital Cont Inputs'!Q15","v":2036},{"$f":"'Capital Cont Inputs'!R15","v":2037},{"$f":"'Capital Cont Inputs'!S15","v":2038},{"$f":"'Capital Cont Inputs'!T15","v":2039},{"$f":"'Capital Cont Inputs'!U15","v":2040},{"$f":"'Capital Cont Inputs'!V15","v":2041},{"$f":"'Capital Cont Inputs'!W15","v":2042},{"$f":"'Capital Cont Inputs'!X15","v":2043},{"$f":"'Capital Cont Inputs'!Y15","v":2044},{"$f":"'Capital Cont Inputs'!Z15","v":2045},{"$f":"'Capital Cont Inputs'!AA15","v":2046}]
[null,null,{"$f":"'NPV Calc'!B96","v":"Land costs - $k:"}]
[null,null,"Net Book Value, beginning of year",null,0,{"$f":"IF(ISNUMBER(F$3),E8,0)","v":0},14064.540999999999,14064.540999999999,14064.540999999999,14064.540999999999,14064.540999999999,14064.540999999999,14064.540999999999,14064.540999999999,14064.540999999999,14064.540999999999,14064.540999999999,14064.540999999999,14064.540999999999,14064.540999999999,14064.540999999999,14064.540999999999,14064.540999999999,14064.540999999999,14064.540999999999,14064.540999999999,14064.540999999999,14064.540999999999,14064.540999999999,14064.540999999999]
[null,null,"Additions during year",null,{"$f":"IF(E$3=1,SUM('NPV Calc'!$E$98:$AD$98),0)","v":0},{"$f":"IF(F$3=1,SUM('NPV Calc'!$E$98:$AD$98),0)","v":14064.540999999999},{"$f":"IF(G$3=1,SUM('NPV Calc'!$E$98:$AD$98),0)","v":0},{"$f":"IF(H$3=1,SUM('NPV Calc'!$E$98:$AD$98),0)","v":0},{"$f":"IF(I$3=1,SUM('NPV Calc'!$E$98:$AD$98),0)","v":0},{"$f":"IF(J$3=1,SUM('NPV Calc'!$E$98:$AD$98),0)","v":0},{"$f":"IF(K$3=1,SUM('NPV Calc'!$E$98:$AD$98),0)","v":0},{"$f":"IF(L$3=1,SUM('NPV Calc'!$E$98:$AD$98),0)","v":0},{"$f":"IF(M$3=1,SUM('NPV Calc'!$E$98:$AD$98),0)","v":0},{"$f":"IF(N$3=1,SUM('NPV Calc'!$E$98:$AD$98),0)","v":0},{"$f":"IF(O$3=1,SUM('NPV Calc'!$E$98:$AD$98),0)","v":0},{"$f":"IF(P$3=1,SUM('NPV Calc'!$E$98:$AD$98),0)","v":0},{"$f":"IF(Q$3=1,SUM('NPV Calc'!$E$98:$AD$98),0)","v":0},{"$f":"IF(R$3=1,SUM('NPV Calc'!$E$98:$AD$98),0)","v":0},{"$f":"IF(S$3=1,SUM('NPV Calc'!$E$98:$AD$98),0)","v":0},{"$f":"IF(T$3=1,SUM('NPV Calc'!$E$98:$AD$98),0)","v":0},{"$f":"IF(U$3=1,SUM('NPV Calc'!$E$98:$AD$98),0)","v":0},{"$f":"IF(V$3=1,SUM('NPV Calc'!$E$98:$AD$98),0)","v":0},{"$f":"IF(W$3=1,SUM('NPV Calc'!$E$98:$AD$98),0)","v":0},{"$f":"IF(X$3=1,SUM('NPV Calc'!$E$98:$AD$98),0)","v":0},{"$f":"IF(Y$3=1,SUM('NPV Calc'!$E$98:$AD$98),0)","v":0},{"$f":"IF(Z$3=1,SUM('NPV Calc'!$E$98:$AD$98),0)","v":0},{"$f":"IF(AA$3=1,SUM('NPV Calc'!$E$98:$AD$98),0)","v":0},{"$f":"IF(AB$3=1,SUM('NPV Calc'!$E$98:$AD$98),0)","v":0},{"$f":"IF(AC$3=1,SUM('NPV Calc'!$E$98:$AD$98),0)","v":0},{"$f":"IF(AD$3=1,SUM('NPV Calc'!$E$98:$AD$98),0)","v":0}]
[null,null,"Net Book Value, end of year",null,{"$f":"E6+E7","v":0},14064.540999999999,14064.540999999999,14064.540999999999,14064.540999999999,14064.540999999999,14064.540999999999,14064.540999999999,14064.540999999999,14064.540999999999,14064.540999999999,14064.540999999999,14064.540999999999,14064.540999999999,14064.540999999999,14064.540999999999,14064.540999999999,14064.540999999999,14064.540999999999,14064.540999999999,14064.540999999999,14064.540999999999,14064.540999999999,14064.540999999999,14064.540999999999,14064.540999999999]
[null,null,"Average Net Book Value for the year",null,null,{"$f":"IF(ISNUMBER(F$3),AVERAGE(E8:F8),0)","v":7032.2704999999996},14064.540999999999,14064.540999999999,14064.540999999999,14064.540999999999,14064.540999999999,14064.540999999999,14064.540999999999,14064.540999999999,14064.540999999999,14064.540999999999,14064.540999999999,14064.540999999999,14064.540999999999,14064.540999999999,14064.540999999999,14064.540999999999,14064.540999999999,14064.540999999999,14064.540999999999,14064.540999999999,14064.540999999999,14064.540999999999,14064.540999999999,14064.540999999999]
[]
{"$rows_left_out":98}
{"sheet":"Standard Report","index":7,"n_rows":98,"n_cols":34,"rows_kept":98,"cut":false,"hidden":false,"merged":[[89,31,89,32],[89,29,89,30],[60,2,60,12],[61,2,61,12],[1,8,1,20],[4,9,4,19],[5,9,5,19],[2,8,2,20]]}
["`"]
[null,null,null,null,"Date:","2018-02-09",null,null,{"$f":"IF('Capital Cont Inputs'!B52=\"Revenue Guarantee\",\"SUMMARY OF REVENUE GUARANTEE\",\"SUMMARY OF CONTRIBUTION CALCULATIONS\")","v":"SUMMARY OF CONTRIBUTION CALCULATIONS"}]
[null,null,null,null,"Project #",{"$f":"'Project Inputs'!B7","v":"25032"},null,null,{"$f":"'Project Inputs'!B17&\" Pool\"&\" - \"&'Project Inputs'!B28","v":"Network Pool - Estimated cost"}]
[]
[]
[null,null,null,null,null,null,null,null,null,{"$f":"IF('NPV Calc'!C2=\"Yes\",\"WARNING - The detailed report is set to include capital contributions. Therefore, the report is not correct.\",\"\")","v":""}]
[]
[null,null,null,null,"Facility Name:",null,{"$f":"'Project Inputs'!B9","v":"Hydro One Lake Superior Link proposal"}]
[null,null,null,null,"Description:",null,{"$f":"'Project Inputs'!B11","v":"Lake Superior Link 2018 Rates"}]
[null,null,null,null,"Customer:",null,{"$f":"Customer","v":"Lake Superior Link Project"}]
{"$rows_left_out":89}
{"sheet":"S92 Report Before Cont $M p1","index":8,"n_rows":86,"n_cols":21,"rows_kept":86,"cut":false,"hidden":false,"merged":[[60,2,60,12],[61,2,61,12],[4,9,4,19]]}
["`"]
[null,null,null,null,{"$f":"'Standard Report'!E2","v":"Date:"},{"$f":"DateCalculated","v":"2018-02-09"},null,null,null,null,null,null,null,null,{"$f":"'Standard Report'!I2","v":"SUMMARY OF CONTRIBUTION CALCULATIONS"}]
[null,null,null,null,{"$f":"#REF!","v":{"$error":"#REF!"}},{"$f":"'Standard Report'!F3","v":"25032"},null,null,null,null,null,null,null,null,{"$f":"'Project Inputs'!B17&\" Pool\"&\" - \"&'Project Inputs'!B28","v":"Network Pool - Estimated cost"}]
[]
[]
[]
[]
[null,null,null,null,{"$f":"'Standard Report'!E8","v":"Facility Name:"},null,{"$f":"'Standard Report'!G8","v":"Hydro One Lake Superior Link proposal"}]
[null,null,null,null,{"$f":"'Standard Report'!E9","v":"Description:"},null,{"$f":"'Standard Report'!G9","v":"Lake Superior Link 2018 Rates"}]
[null,null,null,null,{"$f":"'Standard Report'!E10","v":"Customer:"},null,{"$f":"'Standard Report'!G10","v":"Lake Superior Link Project"}]
{"$rows_left_out":77}
{"sheet":"S92 Report Before Cont $M p2","index":9,"n_rows":58,"n_cols":21,"rows_kept":58,"cut":false,"hidden":false,"merged":[[4,9,4,19]]}
["`"]
[null,null,null,null,{"$f":"'Standard Report'!E2","v":"Date:"},{"$f":"DateCalculated","v":"2018-02-09"},null,null,null,null,null,null,null,null,{"$f":"'S92 Report Before Cont $M p1'!O2","v":"SUMMARY OF CONTRIBUTION CALCULATIONS"}]
[null,null,null,null,{"$f":"'Standard Report'!E3","v":"Project #"},{"$f":"'Standard Report'!F3","v":"25032"},null,null,null,null,null,null,null,null,{"$f":"'Project Inputs'!B17&\" Pool\"&\" - \"&'Project Inputs'!B28","v":"Network Pool - Estimated cost"}]
[]
[]
[]
[]
[null,null,null,null,{"$f":"'Standard Report'!E8","v":"Facility Name:"},null,{"$f":"'Standard Report'!G8","v":"Hydro One Lake Superior Link proposal"}]
[null,null,null,null,{"$f":"'Standard Report'!E9","v":"Description:"},null,{"$f":"'Standard Report'!G9","v":"Lake Superior Link 2018 Rates"}]
[null,null,null,null,{"$f":"'Standard Report'!E10","v":"Customer:"},null,{"$f":"'Standard Report'!G10","v":"Lake Superior Link Project"}]
{"$rows_left_out":49}
{"sheet":"S92 Rate Impact p1","index":10,"n_rows":112,"n_cols":17,"rows_kept":112,"cut":false,"hidden":false,"merged":[[10,2,10,8],[70,2,70,8],[46,4,46,16]]}
[null,null,null,null,null,null,null,null,null,null,null,null,null,null,"Filed: xxx xxxx"]
[null,null,null,null,null,null,null,null,null,null,null,null,null,null,"RP-200x-xxxx"]
[null,null,null,null,null,null,null,null,null,null,null,null,null,null,"Exhibit B"]
[null,null,null,null,null,null,null,null,null,null,null,null,null,null,"Tab 4"]
[null,null,null,null,null,null,null,null,null,null,null,null,null,null,"Schedule 4"]
[null,null,null,null,null,null,null,null,null,null,null,null,null,null,"page 1 of 2"]
[]
[]
[]
[]
{"$rows_left_out":103}
{"sheet":"S92 Rate Impact p2","index":11,"n_rows":90,"n_cols":18,"rows_kept":90,"cut":false,"hidden":false,"merged":[[10,2,10,8],[58,2,58,8]]}
[null,null,null,null,null,null,null,null,null,null,null,null,null,null,{"$f":"'S92 Rate Impact p1'!O1","v":"Filed: xxx xxxx"}]
[null,null,null,null,null,null,null,null,null,null,null,null,null,null,{"$f":"'S92 Rate Impact p1'!O2","v":"RP-200x-xxxx"}]
[null,null,null,null,null,null,null,null,null,null,null,null,null,null,{"$f":"'S92 Rate Impact p1'!O3","v":"Exhibit B"}]
[null,null,null,null,null,null,null,null,null,null,null,null,null,null,{"$f":"'S92 Rate Impact p1'!O4","v":"Tab 4"}]
[null,null,null,null,null,null,null,null,null,null,null,null,null,null,{"$f":"'S92 Rate Impact p1'!O5","v":"Schedule 4"}]
[null,null,null,null,null,null,null,null,null,null,null,null,null,null,"page 2 of 2"]
[]
[]
[]
[]
{"$rows_left_out":81}
{"sheet":"Warnings","index":12,"n_rows":24,"n_cols":3,"rows_kept":24,"cut":false,"hidden":false,"merged":[[10,2,10,7],[11,2,11,7],[17,2,17,7],[18,2,18,7],[12,2,12,7],[13,2,13,7],[9,2,9,7],[3,2,3,7],[1,1,1,7],[23,2,23,7],[14,2,14,7],[15,2,15,7],[19,2,19,7],[20,2,20,7],[21,2,21,7],[22,2,22,7],[16,2,16,7],[4,2,4,7],[5,2,5,7],[6,2,6,7],[7,2,7,7],[8,2,8,7]]}
[]
[null,"Table for Project & Facility Type Check"]
[null,null,"Warning Message:"]
[null,{"$f":"Menus!$D$18&Menus!D23","v":"TransformationLine - Overhead"},"Warning: Transformation projects generally do not include this facility type"]
[null,{"$f":"Menus!$D$18&Menus!D24","v":"TransformationLine - Underground"},"Warning: Transformation projects generally do not include this facility type"]
[null,{"$f":"Menus!$D$18&Menus!D25","v":"TransformationNetwork - SS"},"Warning: Transformation projects generally do not include this facility type"]
[null,{"$f":"Menus!$D$18&Menus!D26","v":"TransformationNetwork - TS"},"Warning: Transformation projects generally do not include this facility type"]
[null,{"$f":"Menus!$D$18&Menus!D27","v":"TransformationStation - DESN"},"Check: ok"]
[null,{"$f":"Menus!$D$18&Menus!D28","v":"TransformationStation - single"},"Check: ok"]
[null,{"$f":"Menus!$D$18&Menus!D29","v":"TransformationN/A"},"Check: ok"]
{"$rows_left_out":15}
{"sheet":"Menus","index":13,"n_rows":42,"n_cols":5,"rows_kept":42,"cut":false,"hidden":false,"merged":[[1,3,1,4]]}
[]
[null,"Tab","Cell Name","Contents"]
[null,"Project Inputs",{"$f":"'Project Inputs'!A28","v":"Current stage of economic evaluation:"},{"$f":"'Standard Inputs'!E75","v":"Estimated cost"}]
[null,null,null,{"$f":"'Standard Inputs'!E76","v":"Actual cost"}]
[null,null,null,{"$f":"'Standard Inputs'!E77","v":"1st true-up"}]
[null,null,null,{"$f":"'Standard Inputs'!E78","v":"2nd true-up"}]
[null,null,null,{"$f":"'Standard Inputs'!E79","v":"3rd true-up"}]
[null,null,null,{"$f":"'Standard Inputs'!E80","v":"4th true-up"}]
[null,null,null,{"$f":"'Standard Inputs'!E81","v":"5th true-up"}]
[]
{"$rows_left_out":32}