{"text_format":"1","workbook":"xlsx","n_sheets":10,"sheets":["1. Info","2. Table of Contents","3. Rate Classes","4. RRR Data","5. UTRs and Sub-Transmission","6. Historical Wholesale","7. Current Wholesale","8. Forecast Wholesale","9. RTSR Rates to Forecast","hidden1"],"not_rendered":{"charts":0,"images":3,"macros":1,"external_links":2,"defined_names":20,"comments":0,"pivot_tables":0},"unopened":[],"bounds":{"document_bytes":16777216,"sheet_cells":100000,"rows_first":2000,"rows_last":500,"rows_between":2000,"halvings":0,"cell_chars":16384,"cell_head_chars":4096},"cells_cut":0,"cells_raw":0,"read":"whole","date_system":"1900"}

{"sheet":"1. Info","index":0,"n_rows":75,"n_cols":28,"rows_kept":75,"cut":false,"hidden":false,"merged":[[24,3,24,4],[20,3,20,4],[1,2,1,9],[2,2,2,9],[3,2,3,9],[4,2,4,9],[14,3,14,4],[16,3,16,4]]}
[null,null,null,null,null,null,null,null,null,null,null,null,null,null,null,null,null,null,null,null,null,null,null,null,null,null,null,"Alectra Utilities Corporation - Enersource Hydro"]
[null,null,null,null,null,null,null,null,null,null,null,null,null,null,null,null,null,null,null,null,null,null,null,null,null,null,null,"Alectra Utilities Corporation - Horizon Utilities"]
[null,null,null,null,null,null,null,null,null,null,null,null,null,null,null,null,null,null,null,null,null,null,null,null,null,null,null,"Alectra Utilities Corporation - Hydro One Brampton "]
[null,null,null,null,null,null,null,null,null,null,null,null,null,null,null,null,null,null,null,null,null,null,null,null,null,null,null,"Alectra Utilities Corporation - PowerStream Inc."]
[null,null,null,null,null,null,null,null,null,null,null,null,null,null,null,null,null,null,null,null,null,null,null,null,null,null,null,"Algoma Power Inc."]
[null,null,null,null,null,null,null,null,null,null,null,null,null,null,null,null,null,null,null,null,null,null,null,null,null,null,null,"Atikokan Hydro Inc."]
[null,null,null,null,null,null,null,null,null,null,null,null,null,null,null,null,null,null,null,null,null,null,null,null,null,null,null,"Attawapiskat Power Corp. "]
[null,null,null,null,null,null,null,null,null,null,null,null,null,null,null,null,null,null,null,null,null,null,null,null,null,null,null,"Bluewater Power Distribution Corporation"]
[null,null,null,null,null,null,null,null,null,null,null,null,null,null,null,null,null,null,null,null,null,null,null,null,null,null,null,"Brantford Power Inc."]
[null,null,null,null,null,null,null,null,null,null,null,null,null,null,null,null,null,null,null,null,null,null,null,null,null,null,null,"Burlington Hydro Inc."]
[null,null,null,null,null,null,null,null,null,null,null,null,null,null,null,null,null,null,null,null,null,null,null,null,null,null,null,"Canadian Niagara Power Inc."]
[null,null,null,null,null,null,null,null,null,null,null,null,null,null,null,null,null,null,null,null,null,null,null,null,null,null,null,"Centre Wellington Hydro Ltd."]
["Drop-down lists are shaded blue; Input cells are shaded green.",null,null,null,null,null,null,null,null,null,null,null,null,null,null,null,null,null,null,null,null,null,null,null,null,null,null,"Chapleau Public Utilities Corporation"]
[null,null,null,null,null,null,null,null,null,null,null,null,null,null,null,null,null,null,null,null,null,null,null,null,null,null,null,"COLLUS PowerStream Corporation"]
[null,null,"Utility Name   ","Kingston Hydro Corporation",null,null,null,null,null,null,null,null,null,null,null,null,null,null,null,null,null,null,null,null,null,null,null,"Cooperative Hydro Embrun Inc."]
[null,null,null,null,null,null,null,null,null,null,null,null,null,null,null,null,null,null,null,null,null,null,null,null,null,null,null,"E.L.K. Energy Inc."]
[null,null,"Service Territory",null,null,null,null,null,null,null,null,null,null,null,null,null,null,null,null,null,null,null,null,null,null,null,null,"Energy + Inc."]
[null,null,null,null,null,null,null,null,null,null,null,null,null,null,null,null,null,null,null,null,null,null,null,null,null,null,null,"Entegrus Powerlines Inc."]
[null,null,"Assigned EB Number","EB-2018-0047",null,null,null,null,null,null,null,null,null,null,null,null,null,null,null,null,null,null,null,null,null,null,null,"ENWIN Utilities Ltd."]
[null,null,null,null,null,null,null,null,null,null,null,null,null,null,null,null,null,null,null,null,null,null,null,null,null,null,null,"Erie Thames Powerlines Corporation"]
[null,null,"Name and Title","Sherry Gibson, Senior Advisor Rates and Regulatory Affairs",null,null,null,null,null,null,null,null,null,null,null,null,null,null,null,null,null,null,null,null,null,null,null,"Espanola Regional Hydro Distribution Corporation"]
[null,null,null,null,null,null,null,null,null,null,null,null,null,null,null,null,null,null,null,null,null,null,null,null,null,null,null,"Essex Powerlines Corporation"]
[null,null,"Phone Number","613-546-1181 ext 2383",null,null,null,null,null,null,null,null,null,null,null,null,null,null,null,null,null,null,null,null,null,null,null,"Festival Hydro Inc."]
[null,null,null,null,null,null,null,null,null,null,null,null,null,null,null,null,null,null,null,null,null,null,null,null,null,null,null,"Fort Albany Power Corporation"]
[null,null,"Email Address","sgibson@kingstonhydro.com",null,null,null,null,null,null,null,null,null,null,null,null,null,null,null,null,null,null,null,null,null,null,null,"Fort Frances Power Corporation"]
[null,null,null,null,null,null,null,null,null,null,null,null,null,null,null,null,null,null,null,null,null,null,null,null,null,null,null,"Greater Sudbury Hydro Inc."]
[null,null,"Date","2018-10-23",null,null,null,null,null,null,null,null,null,null,null,null,null,null,null,null,null,null,null,null,null,null,null,"Grimsby Power Inc."]
[null,null,null,null,null,null,null,null,null,null,null,null,null,null,null,null,null,null,null,null,null,null,null,null,null,null,null,"Guelph Hydro Electric Systems Inc."]
[null,null,"Last COS Re-based Year",2016,null,null,null,null,null,null,null,null,null,null,null,null,null,null,null,null,null,null,null,null,null,null,null,"Halton Hills Hydro Inc."]
[null,null,null,null,null,null,null,null,null,null,null,null,null,null,null,null,null,null,null,null,null,null,null,null,null,null,null,"Hearst Power Distribution Company Limited"]
{"$rows_left_out":46}
{"sheet":"2. Table of Contents","index":1,"n_rows":28,"n_cols":9,"rows_kept":28,"cut":false,"hidden":false,"merged":[]}
[]
[]
[]
[]
[]
[]
[]
[]
[]
[]
[]
[]
[]
[]
[]
[]
[]
[]
[]
[null,null,null,"1. Info",null,null,null,null,"6. Historical Wholesale"]
[]
[null,null,null,"2. Table of Contents",null,null,null,null,"7. Current Wholesale"]
[]
[null,null,null,"3. Rate Classes",null,null,null,null,"8. Forecast Wholesale"]
[]
[null,null,null,"4. RRR Data",null,null,null,null,"9. RTSR Rates to Forecast"]
[]
[null,null,null,"5. UTRs and Sub-Transmission"]

{"sheet":"3. Rate Classes","index":2,"n_rows":100,"n_cols":23,"rows_kept":100,"cut":false,"hidden":false,"merged":[[12,2,12,8]]}
[]
[]
[]
[]
[]
[]
[]
[]
[]
[]
[]
[]
[null,null,"1.  Select the appropriate rate classes that appear on your most recent Board-Approved Tariff of Rates and Charges.\n2.  Enter the RTS Network and Connection Rate as it appears on the Tariff of Rates and Charges"]
[]
[null,null,"Rate Class",null,"Unit",null,"RTSR-Network",null,"RTSR-Connection"]
[]
[null,null,"Residential",null,"kWh",null,6.1999999999999998E-3,null,5.4000000000000003E-3,null,null,{"$f":"IF(OR(ISBLANK(C17), ISERROR(FIND(\"Choose\", C17))=FALSE), 0, 1)","v":1},{"$f":"\"C\" & ROW(C17)","v":"C17"},{"$f":"IF(OR(C17=\"General Service Intermediate Rate Class 1,000 To 4,999 kW (formerly General Service > 50 kW Customers)\", C17=\"General Service Intermediate Rate Class 1,000 To 4,999 kW (formerly Large Use Customers)\"), \"x\", \"\")","v":""},null,null,null,null,null,null,null,null,"Choose Rate Class"]
[null,null,"General Service Less Than 50 kW",null,"kWh",null,5.4999999999999997E-3,null,4.8999999999999998E-3,null,null,1,"C18",{"$f":"IF(OR(C18=\"General Service Intermediate Rate Class 1,000 To 4,999 kW (formerly General Service > 50 kW Customers)\", C18=\"General Service Intermediate Rate Class 1,000 To 4,999 kW (formerly Large Use Customers)\"), \"x\", \"\")","v":""},null,null,null,null,null,null,null,null,"Residential"]
[null,null,"General Service 50 to 4,999 kW",null,"kW",null,2.4449000000000001,null,2.1294,null,null,1,"C19","",null,null,null,null,null,null,null,null,"Residential Regular"]
[null,null,"Large Use",null,"kW",null,2.9458000000000002,null,2.5657000000000001,null,null,1,"C20","",null,null,null,null,null,null,null,null,"Residential Urban"]
[null,null,"Unmetered Scattered Load",null,"kWh",null,6.1999999999999998E-3,null,5.4000000000000003E-3,null,null,1,"C21","",null,null,null,null,null,null,null,null,"Residential Urban Year-Round"]
[null,null,"Street Lighting",null,"kW",null,1.766,null,1.538,null,null,1,"C22","",null,null,null,null,null,null,null,null,"Residential Suburban"]
[null,null,"Standby Power",null,null,null,null,null,null,null,null,1,"C23","",null,null,null,null,null,null,null,null,"Residential Suburban Seasonal"]
[null,null,"Choose Rate Class",null,null,null,null,null,null,null,null,0,"C24","",null,null,null,null,null,null,null,null,"Residential Suburban Year Round"]
[null,null,"Choose Rate Class",null,null,null,null,null,null,null,null,0,"C25","",null,null,null,null,null,null,null,null,"Residential - Time of Use"]
[null,null,"Choose Rate Class",null,null,null,null,null,null,null,null,0,"C26","",null,null,null,null,null,null,null,null,"Residential - Hensall"]
[null,null,"Choose Rate Class",null,null,null,null,null,null,null,null,0,"C27","",null,null,null,null,null,null,null,null,"Residential – High Density [R1]"]
[null,null,"Choose Rate Class",null,null,null,null,null,null,null,null,0,"C28","",null,null,null,null,null,null,null,null,"Residential – Normal Density [R2]"]
[null,null,"Choose Rate Class",null,null,null,null,null,null,null,null,0,"C29","",null,null,null,null,null,null,null,null,"Seasonal Residential – High Density [R3]"]
[null,null,"Choose Rate Class",null,null,null,null,null,null,null,null,0,"C30","",null,null,null,null,null,null,null,null,"Seasonal Residential – Normal Density [R4]"]
{"$rows_left_out":71}
{"sheet":"4. RRR Data","index":3,"n_rows":30,"n_cols":9,"rows_kept":30,"cut":false,"hidden":false,"merged":[[12,1,12,8]]}
[]
[]
[]
[]
[]
[]
[]
[]
[]
[]
[]
[]
[]
[]
[null,"Rate Class","Rate Description","Unit","Rate","Non-Loss Adjusted Metered kWh","Non-Loss Adjusted Metered kW","Applicable \nLoss Factor\neg: (1.0325)","Loss Adjusted Billed kWh"]
[]
[null,"Residential","RTSR - Network","kWh",6.1999999999999998E-3,176056574.80000001,0,1.0392999999999999,{"$f":"F17*H17","v":182975598.18963999}]
[null,"Residential","RTSR - Connection","kWh",5.4000000000000003E-3,176056574.80000001,0,1.0392999999999999,{"$f":"F18*H18","v":182975598.18963999}]
[null,"General Service Less Than 50 kW","RTSR - Network","kWh",5.4999999999999997E-3,87047731.200000003,0,1.0392999999999999,{"$f":"F19*H19","v":90468707.036159992}]
[null,"General Service Less Than 50 kW","RTSR - Connection","kWh",4.8999999999999998E-3,87047731.200000003,0,1.0392999999999999,{"$f":"F20*H20","v":90468707.036159992}]
[null,"General Service 50 to 4,999 kW","RTSR - Network","kW",2.4449000000000001,263290212.5,649833.6]
[null,"General Service 50 to 4,999 kW","RTSR - Connection","kW",2.1294,263290212.5,649833.6]
[null,"Large Use","RTSR - Network","kW",2.9458000000000002,158182936.5,285841.7]
[null,"Large Use","RTSR - Connection","kW",2.5657000000000001,158182936.5,285841.7]
[null,"Unmetered Scattered Load","RTSR - Network","kWh",6.1999999999999998E-3,1270088.7,0,1.0392999999999999,{"$f":"F25*H25","v":1320003.1859099998}]
[null,"Unmetered Scattered Load","RTSR - Connection","kWh",5.4000000000000003E-3,1270088.7,0,1.0392999999999999,{"$f":"F26*H26","v":1320003.1859099998}]
[null,"Street Lighting","RTSR - Network","kW",1.766,1981443.2,5508]
[null,"Street Lighting","RTSR - Connection","kW",1.538,1981443.2,5508]
[null,"Standby Power","RTSR - Network",null,null,null,null,null,{"$f":"F29*H29","v":0}]
[null,"Standby Power","RTSR - Connection",null,null,null,null,null,{"$f":"F30*H30","v":0}]
{"$rows_left_out":1}
{"sheet":"5. UTRs and Sub-Transmission","index":4,"n_rows":75,"n_cols":10,"rows_kept":75,"cut":false,"hidden":false,"merged":[[48,4,48,5],[44,4,44,5],[59,4,59,5],[28,4,28,5],[17,4,17,5],[33,4,33,5],[19,4,19,5],[21,4,21,5],[23,4,23,5],[25,4,25,5],[35,4,35,5],[37,4,37,5],[38,4,39,5],[41,4,41,5],[69,4,69,5],[71,4,71,5],[74,4,74,5],[73,4,73,5],[50,4,50,5],[52,4,52,5],[54,4,54,5],[56,4,56,5],[65,4,65,5],[67,4,67,5]]}
[]
[]
[]
[]
[]
[]
[]
[]
[]
[]
[]
[]
[]
[]
[]
[]
[]
[null,"Uniform Transmission Rates","Unit",null,2017,null,null,2018,null,2019]
[]
[null,"Rate Description",null,null,"Rate",null,null,"Rate",null,"Rate"]
[]
[null,"Network Service Rate","kW",null,3.66,null,null,3.61,null,3.61]
[]
[null,"Line Connection Service Rate","kW",null,0.87,null,null,0.95,null,0.95]
[]
[null,"Transformation Connection Service Rate","kW",null,2.02,null,null,2.34,null,2.34]
[]
[]
[null,"Hydro One Sub-Transmission Rates","Unit",null,2017,null,null,2018,null,2019]
[]
{"$rows_left_out":46}
{"sheet":"6. Historical Wholesale","index":5,"n_rows":117,"n_cols":16,"rows_kept":117,"cut":false,"hidden":false,"merged":[[95,7,95,9],[95,11,95,13],[96,7,96,9],[96,11,96,13],[20,3,20,5],[20,7,20,9],[20,11,20,13],[96,3,96,5],[38,3,38,5],[38,7,38,9],[38,11,38,13],[95,3,95,5],[57,3,57,5],[57,7,57,9],[57,11,57,13],[76,3,76,5],[76,7,76,9],[76,11,76,13]]}
[]
[]
[]
[]
[]
[]
[]
[]
[]
[]
[]
[]
[]
[]
[]
[]
[]
[]
[]
[]
[null,"IESO",null,"Network",null,null,null,"Line Connection",null,null,null,"Transformation Connection",null,null,null,"Total Line"]
[null,"Month",null,"Units Billed","Rate","Amount",null,"Units Billed","Rate","Amount",null,"Units Billed","Rate","Amount",null,"Amount"]
[]
[null,"January",null,{"$f":"F24/E24","v":49241},3.66,180222.06,null,{"$f":"J24/I24","v":55969},0.87,48693.03,null,{"$f":"N24/M24","v":55969},2.02,113057.38,null,{"$f":"J24+N24","v":161750.41}]
[null,"February",null,52174,3.66,190956.84,null,52241,0.87,45449.67,null,52241,2.02,105526.82,null,150976.49]
[null,"March",null,50907,3.66,186319.62,null,60347,0.87,52501.89,null,60347,2.02,121900.94,null,174402.83000000002]
[null,"April",null,46827,3.66,171386.82,null,64526.735632183911,0.87,56138.26,null,64526.742574257427,2.02,130344.02,null,186482.28]
[null,"May",null,32117,3.66,117548.22,null,36132,0.87,31434.84,null,36132,2.02,72986.64,null,104421.48]
[null,"June",null,35008,3.66,128129.28,null,41186,0.87,35831.82,null,41186,2.02,83195.72,null,119027.54000000001]
[null,"July",null,40098,3.66,146758.68,null,47174,0.87,41041.379999999997,null,47174,2.02,95291.48,null,136332.85999999999]
{"$rows_left_out":88}
{"sheet":"7. Current Wholesale","index":6,"n_rows":117,"n_cols":16,"rows_kept":117,"cut":false,"hidden":false,"merged":[[12,1,12,11],[19,3,19,5],[19,7,19,9],[19,11,19,13],[38,3,38,5],[38,7,38,9],[38,11,38,13],[96,7,96,9],[96,11,96,13],[20,3,20,5],[20,7,20,9],[20,11,20,13],[96,3,96,5],[95,3,95,5],[95,7,95,9],[95,11,95,13],[57,3,57,5],[57,7,57,9],[57,11,57,13],[76,3,76,5],[76,7,76,9],[76,11,76,13]]}
[]
[]
[]
[]
[]
[]
[]
[]
[]
[]
[]
[]
[null,"The purpose of this sheet is to calculate the expected billing when current 2018 Uniform Transmission Rates are applied against historical 2017 transmission units."]
[]
[]
[]
[]
[]
[]
[null,"IESO",null,"Network",null,null,null,"Line Connection",null,null,null,"Transformation Connection",null,null,null,"Total Line"]
[]
[null,"Month",null,"Units Billed","Rate","Amount",null,"Units Billed","Rate","Amount",null,"Units Billed","Rate","Amount",null,"Amount"]
[]
[null,"January",null,{"$f":"'6. Historical Wholesale'!D24","v":49241},{"$f":"'5. UTRs and Sub-Transmission'!H22","v":3.61},{"$f":"D24*E24","v":177760.00999999998},null,{"$f":"'6. Historical Wholesale'!H24","v":55969},{"$f":"'5. UTRs and Sub-Transmission'!H24","v":0.95},{"$f":"H24*I24","v":53170.549999999996},null,{"$f":"'6. Historical Wholesale'!L24","v":55969},{"$f":"'5. UTRs and Sub-Transmission'!H26","v":2.34},{"$f":"L24*M24","v":130967.45999999999},null,{"$f":"J24+N24","v":184138.00999999998}]
[null,"February",null,{"$f":"'6. Historical Wholesale'!D25","v":52174},{"$f":"E24","v":3.61},{"$f":"D25*E25","v":188348.13999999998},null,{"$f":"'6. Historical Wholesale'!H25","v":52241},{"$f":"I24","v":0.95},{"$f":"H25*I25","v":49628.95},null,{"$f":"'6. Historical Wholesale'!L25","v":52241},{"$f":"M24","v":2.34},{"$f":"L25*M25","v":122243.93999999999},null,171872.88999999998]
[null,"March",null,{"$f":"'6. Historical Wholesale'!D26","v":50907},{"$f":"E25","v":3.61},183774.27,null,{"$f":"'6. Historical Wholesale'!H26","v":60347},{"$f":"I25","v":0.95},57329.649999999994,null,{"$f":"'6. Historical Wholesale'!L26","v":60347},{"$f":"M25","v":2.34},141211.97999999998,null,198541.62999999998]
[null,"April",null,{"$f":"'6. Historical Wholesale'!D27","v":46827},3.61,169045.47,null,{"$f":"'6. Historical Wholesale'!H27","v":64526.735632183911},0.95,61300.398850574711,null,{"$f":"'6. Historical Wholesale'!L27","v":64526.742574257427},2.34,150992.57762376236,null,212292.97647433708]
[null,"May",null,{"$f":"'6. Historical Wholesale'!D28","v":32117},3.61,115942.37,null,{"$f":"'6. Historical Wholesale'!H28","v":36132},0.95,34325.4,null,{"$f":"'6. Historical Wholesale'!L28","v":36132},2.34,84548.87999999999,null,118874.28]
[null,"June",null,{"$f":"'6. Historical Wholesale'!D29","v":35008},3.61,126378.87999999999,null,{"$f":"'6. Historical Wholesale'!H29","v":41186},0.95,39126.699999999997,null,{"$f":"'6. Historical Wholesale'!L29","v":41186},2.34,96375.239999999991,null,135501.94]
[null,"July",null,{"$f":"'6. Historical Wholesale'!D30","v":40098},3.61,144753.78,null,{"$f":"'6. Historical Wholesale'!H30","v":47174},0.95,44815.299999999996,null,{"$f":"'6. Historical Wholesale'!L30","v":47174},2.34,110387.15999999999,null,155202.46]
{"$rows_left_out":88}
{"sheet":"8. Forecast Wholesale","index":7,"n_rows":117,"n_cols":16,"rows_kept":117,"cut":false,"hidden":false,"merged":[[12,1,12,12],[19,3,19,5],[19,7,19,9],[19,11,19,13],[38,3,38,5],[38,7,38,9],[38,11,38,13],[96,7,96,9],[96,11,96,13],[20,3,20,5],[20,7,20,9],[20,11,20,13],[96,3,96,5],[95,3,95,5],[95,7,95,9],[95,11,95,13],[57,3,57,5],[57,7,57,9],[57,11,57,13],[76,3,76,5],[76,7,76,9],[76,11,76,13]]}
[]
[]
[]
[]
[]
[]
[]
[]
[]
[]
[]
[]
[null,"The purpose of this sheet is to calculate the expected billing when forecasted 2019 Uniform Transmission Rates are applied against historical 2017 transmission units."]
[]
[]
[]
[]
[]
[]
[null,"IESO",null,"Network",null,null,null,"Line Connection",null,null,null,"Transformation Connection",null,null,null,"Total Line"]
[]
[null,"Month",null,"Units Billed","Rate","Amount",null,"Units Billed","Rate","Amount",null,"Units Billed","Rate","Amount",null,"Amount"]
[]
[null,"January",null,{"$f":"'6. Historical Wholesale'!D24","v":49241},{"$f":"'5. UTRs and Sub-Transmission'!J22","v":3.61},{"$f":"D24*E24","v":177760.00999999998},null,{"$f":"'6. Historical Wholesale'!H24","v":55969},{"$f":"'5. UTRs and Sub-Transmission'!J24","v":0.95},{"$f":"H24*I24","v":53170.549999999996},null,{"$f":"'6. Historical Wholesale'!L24","v":55969},{"$f":"'5. UTRs and Sub-Transmission'!J26","v":2.34},{"$f":"L24*M24","v":130967.45999999999},null,{"$f":"J24+N24","v":184138.00999999998}]
[null,"February",null,{"$f":"'6. Historical Wholesale'!D25","v":52174},{"$f":"E24","v":3.61},188348.13999999998,null,{"$f":"'6. Historical Wholesale'!H25","v":52241},{"$f":"I24","v":0.95},49628.95,null,{"$f":"'6. Historical Wholesale'!L25","v":52241},{"$f":"M24","v":2.34},122243.93999999999,null,171872.88999999998]
[null,"March",null,{"$f":"'6. Historical Wholesale'!D26","v":50907},3.61,183774.27,null,{"$f":"'6. Historical Wholesale'!H26","v":60347},0.95,57329.649999999994,null,{"$f":"'6. Historical Wholesale'!L26","v":60347},2.34,141211.97999999998,null,198541.62999999998]
[null,"April",null,{"$f":"'6. Historical Wholesale'!D27","v":46827},3.61,169045.47,null,{"$f":"'6. Historical Wholesale'!H27","v":64526.735632183911},0.95,61300.398850574711,null,{"$f":"'6. Historical Wholesale'!L27","v":64526.742574257427},2.34,150992.57762376236,null,212292.97647433708]
[null,"May",null,{"$f":"'6. Historical Wholesale'!D28","v":32117},3.61,115942.37,null,{"$f":"'6. Historical Wholesale'!H28","v":36132},0.95,34325.4,null,{"$f":"'6. Historical Wholesale'!L28","v":36132},2.34,84548.87999999999,null,118874.28]
[null,"June",null,{"$f":"'6. Historical Wholesale'!D29","v":35008},3.61,126378.87999999999,null,{"$f":"'6. Historical Wholesale'!H29","v":41186},0.95,39126.699999999997,null,{"$f":"'6. Historical Wholesale'!L29","v":41186},2.34,96375.239999999991,null,135501.94]
[null,"July",null,{"$f":"'6. Historical Wholesale'!D30","v":40098},3.61,144753.78,null,{"$f":"'6. Historical Wholesale'!H30","v":47174},0.95,44815.299999999996,null,{"$f":"'6. Historical Wholesale'!L30","v":47174},2.34,110387.15999999999,null,155202.46]
{"$rows_left_out":88}
{"sheet":"9. RTSR Rates to Forecast","index":8,"n_rows":56,"n_cols":10,"rows_kept":56,"cut":false,"hidden":false,"merged":[]}
[]
[]
[]
[]
[]
[]
[]
[]
[]
[]
[]
[]
["The purpose of this sheet is to re-align the current RTS Network Rates to recover current wholesale network costs."]
[]
["Rate Class","Rate Description","Unit","Current RTSR-Network","Loss Adjusted Billed kWh","Billed kW","Billed Amount","Billed Amount %","Current Wholesale Billing","Adjusted RTSR Network"]
[]
["Residential","RTSR - Network","kWh",6.1999999999999998E-3,182975598.18963999,0,{"$f":"ROUND(D17*E17, 2)","v":1134448.71},{"$f":"G17/4080748.4","v":0.27800016046076254},{"$f":"H17*total_current_wholesale_network","v":1238669.3391714985},{"$f":"IF(ISERROR(I17/E17), 0, I17/E17)","v":6.7695875921537588E-3}]
["General Service Less Than 50 kW","RTSR - Network","kWh",5.4999999999999997E-3,90468707.036159992,0,{"$f":"ROUND(D18*E18, 2)","v":497577.89},0.12193299885873876,543289.85590952693,{"$f":"IF(ISERROR(I18/E18), 0, I18/E18)","v":6.0052793248429655E-3}]
["General Service 50 to 4,999 kW","RTSR - Network","kW",2.4449000000000001,null,649833.6,{"$f":"ROUND(D19*F19, 2)","v":1588778.17},0.3893349979626286,1734737.5765661567,{"$f":"IF(ISERROR(I19/F19), 0, I19/F19)","v":2.6695104355425094}]
["Large Use","RTSR - Network","kW",2.9458000000000002,null,285841.7,{"$f":"ROUND(D20*F20, 2)","v":842032.48},0.20634266008656649,919389.13268501859,{"$f":"IF(ISERROR(I20/F20), 0, I20/F20)","v":3.2164275985100095}]
["Unmetered Scattered Load","RTSR - Network","kWh",6.1999999999999998E-3,1320003.1859099998,0,{"$f":"ROUND(D21*E21, 2)","v":8184.02},2.0055193797294635E-3,8935.8774493792043,{"$f":"IF(ISERROR(I21/E21), 0, I21/E21)","v":6.7695877894558875E-3}]
["Street Lighting","RTSR - Network","kW",1.766,null,5508,{"$f":"ROUND(D22*F22, 2)","v":9727.1299999999992},2.3836632515741472E-3,10620.7513684204,{"$f":"IF(ISERROR(I22/F22), 0, I22/F22)","v":1.9282409891830792}]
["Standby Power","RTSR - Network",null,null,0,null,{"$f":"ROUND(D23*F23, 2)","v":0},0,0,{"$f":"IF(ISERROR(I23/F23), 0, I23/F23)","v":0}]
[]
["The purpose of this table is to re-align the current RTS Connection Rates to recover current wholesale connection costs."]
["Rate Class","Rate Description","Unit","Current RTSR-Connection","Loss Adjusted Billed kWh","Billed kW","Billed Amount","Billed Amount %","Current Wholesale Billing","Adjusted RTSR-Connection"]
[]
["Residential","RTSR - Connection","kWh",5.4000000000000003E-3,182975598.18963999,0,{"$f":"ROUND(D28*E28, 2)","v":988068.23},{"$f":"G28/3564103.93","v":0.27722767051857544},{"$f":"H28*Total_Current_Wholesale_Lineplus","v":1119012.392574358},{"$f":"IF(ISERROR(I28/E28), 0, I28/E28)","v":6.1156372961524014E-3}]
["General Service Less Than 50 kW","RTSR - Connection","kWh",4.8999999999999998E-3,90468707.036159992,0,{"$f":"ROUND(D29*E29, 2)","v":443296.66},0.12437815190198451,502044.73847602785,{"$f":"IF(ISERROR(I29/E29), 0, I29/E29)","v":5.5493745287568058E-3}]
["General Service 50 to 4,999 kW","RTSR - Connection","kW",2.1294,null,649833.6,{"$f":"ROUND(D30*F30, 2)","v":1383755.67},0.3882478449499086,1567138.4789135805,{"$f":"IF(ISERROR(I30/F30), 0, I30/F30)","v":2.4115996447607211}]
{"$rows_left_out":27}
{"sheet":"hidden1","index":9,"n_rows":22,"n_cols":2,"rows_kept":22,"cut":false,"hidden":true,"merged":[]}
[{"$f":"IF('3. Rate Classes'!L17=1, '3. Rate Classes'!C17, \"\")","v":"Residential"},1]
[{"$f":"IF('3. Rate Classes'!L18=1, '3. Rate Classes'!C18, \"\")","v":"General Service Less Than 50 kW"},2]
[{"$f":"IF('3. Rate Classes'!L19=1, '3. Rate Classes'!C19, \"\")","v":"General Service 50 to 4,999 kW"},3]
[{"$f":"IF('3. Rate Classes'!L20=1, '3. Rate Classes'!C20, \"\")","v":"Large Use"},4]
[{"$f":"IF('3. Rate Classes'!L21=1, '3. Rate Classes'!C21, \"\")","v":"Unmetered Scattered Load"},5]
[{"$f":"IF('3. Rate Classes'!L22=1, '3. Rate Classes'!C22, \"\")","v":"Street Lighting"},6]
[{"$f":"IF('3. Rate Classes'!L23=1, '3. Rate Classes'!C23, \"\")","v":"Standby Power"},7]
[{"$f":"IF('3. Rate Classes'!L24=1, '3. Rate Classes'!C24, \"\")","v":""},8]
[{"$f":"IF('3. Rate Classes'!L25=1, '3. Rate Classes'!C25, \"\")","v":""},9]
[{"$f":"IF('3. Rate Classes'!L26=1, '3. Rate Classes'!C26, \"\")","v":""},10]
[{"$f":"IF('3. Rate Classes'!L27=1, '3. Rate Classes'!C27, \"\")","v":""},11]
[{"$f":"IF('3. Rate Classes'!L28=1, '3. Rate Classes'!C28, \"\")","v":""},12]
[{"$f":"IF('3. Rate Classes'!L29=1, '3. Rate Classes'!C29, \"\")","v":""},13]
[{"$f":"IF('3. Rate Classes'!L30=1, '3. Rate Classes'!C30, \"\")","v":""},14]
[{"$f":"IF('3. Rate Classes'!L31=1, '3. Rate Classes'!C31, \"\")","v":""},15]
[{"$f":"IF('3. Rate Classes'!L32=1, '3. Rate Classes'!C32, \"\")","v":""},16]
[{"$f":"IF('3. Rate Classes'!L33=1, '3. Rate Classes'!C33, \"\")","v":""},17]
[{"$f":"IF('3. Rate Classes'!L34=1, '3. Rate Classes'!C34, \"\")","v":""},18]
[{"$f":"IF('3. Rate Classes'!L35=1, '3. Rate Classes'!C35, \"\")","v":""},19]
[{"$f":"IF('3. Rate Classes'!L36=1, '3. Rate Classes'!C36, \"\")","v":""},20]
[{"$f":"IF('3. Rate Classes'!L37=1, '3. Rate Classes'!C37, \"\")","v":""},21]
[{"$f":"IF('3. Rate Classes'!L38=1, '3. Rate Classes'!C38, \"\")","v":""},22]