{"text_format":"1","workbook":"xlsx","n_sheets":9,"sheets":["1. Information Sheet","List","GA Analysis ","GA 2014","GA 2015","GA 2016","GA 2017","GA Rates","2 1 5 TotalConsumptionData_Dist"],"not_rendered":{"charts":0,"images":9,"macros":1,"external_links":7,"defined_names":98,"comments":0,"pivot_tables":0},"unopened":[],"bounds":{"document_bytes":16777216,"sheet_cells":100000,"rows_first":2000,"rows_last":500,"rows_between":2000,"halvings":0,"cell_chars":16384,"cell_head_chars":4096},"cells_cut":0,"cells_raw":0,"read":"whole","date_system":"1900"}

{"sheet":"1. Information Sheet","index":0,"n_rows":33,"n_cols":9,"rows_kept":33,"cut":false,"hidden":false,"merged":[]}
[]
[]
[]
[]
[]
[]
[]
[]
[]
[null,null,null,"Version 1.0"]
[]
["Account 1589 Global Adjustment (GA) Analysis Workform"]
[]
[null,"Input cells"]
[null,"Drop down cells"]
[]
[null,"Utility Name   ","ORANGEVILLE HYDRO LIMITED"]
[]
["Note 1","Year(s) Requested for Disposition"]
[]
[]
[]
[]
[]
[]
["Note 7 ","Summary of GA  (if multiple years requested for disposition)"]
[]
[null,"Year","Annual Net Change in Expected GA Balance from GA Analysis (cell K51)"," Net Change in Principal Balance in the  GL (cell C62)","Reconciling Items (sum of cells C63 to C75)","Adjusted Net Change in Principal Balance in the GL (cell C76)","Unresolved Difference","$ Consumption at Actual Rate Paid (cell J51)","Unresolved Difference as % of Expected GA Payments to IESO"]
[null,2014,{"$f":"'GA 2014'!K51","v":0},{"$f":"'GA 2014'!C62","v":0},{"$f":"SUM('GA 2014'!$C$63:$C$75)","v":0},{"$f":"'GA 2014'!$C$76","v":0},{"$f":"F29-C29","v":0},{"$f":"'GA 2014'!$J$51","v":0},{"$f":"IF(ISERROR(G29/H29),0,G29/H29)","v":0}]
[null,2015,{"$f":"'GA 2015'!K51","v":0},{"$f":"'GA 2015'!C62","v":0},{"$f":"SUM('GA 2015'!$C$63:$C$75)","v":0},{"$f":"'GA 2015'!$C$76","v":0},{"$f":"F30-C30","v":0},{"$f":"'GA 2015'!$J$51","v":0},{"$f":"IF(ISERROR(G30/H30),0,G30/H30)","v":0}]
{"$rows_left_out":4}
{"sheet":"List","index":1,"n_rows":66,"n_cols":2,"rows_kept":66,"cut":false,"hidden":true,"merged":[]}
["ALECTRA UTILITIES CORPORATION","HHPNS717"]
["ALGOMA POWER INC.","WKBSV849"]
["ATIKOKAN HYDRO INC.","NJYBW716"]
["BLUEWATER POWER DISTRIBUTION CORPORATION","GQQHM388"]
["BRANTFORD POWER INC.","SFXZP935"]
["BURLINGTON HYDRO INC.","OARZC118"]
["CANADIAN NIAGARA POWER INC.","HJHBH994"]
["CENTRE WELLINGTON HYDRO LTD.","KQEEH473"]
["CHAPLEAU PUBLIC UTILITIES CORPORATION","KQEEH474"]
["COLLUS POWERSTREAM CORP.","CPEFQ593"]
["COOPERATIVE HYDRO EMBRUN INC.","QXHJU641"]
["E.L.K. ENERGY INC.","AVXSO594"]
["ENERGY+ INC.","JMNNR431"]
["ENTEGRUS POWERLINES INC.","JKBZG525"]
["ENWIN UTILITIES LTD.","YEOQG654"]
["ERIE THAMES POWERLINES CORPORATION","PTLUC812"]
["ESPANOLA REGIONAL HYDRO DISTRIBUTION CORPORATION","ADICB565"]
["ESSEX POWERLINES CORPORATION","LRECV427"]
["FESTIVAL HYDRO INC.","KTCNY552"]
["FORT FRANCES POWER CORPORATION","YEPCI143"]
["GREATER SUDBURY HYDRO INC.","GRHTW113"]
["GRIMSBY POWER INCORPORATED","GMGHU415"]
["GUELPH HYDRO ELECTRIC SYSTEMS INC.","YTPWF351"]
["HALTON HILLS HYDRO INC.","YCYKQ642"]
["HEARST POWER DISTRIBUTION COMPANY LTD.","ADZFM459"]
["HYDRO 2000 INC.","RVWKN794"]
["HYDRO HAWKESBURY INC.","KESKM585"]
["HYDRO ONE NETWORKS INC.","MQFNL784"]
["HYDRO ONE REMOTE COMMUNITIES INC.","FNDHH648"]
["HYDRO OTTAWA LIMITED","PTREM828"]
{"$rows_left_out":37}
{"sheet":"GA Analysis ","index":2,"n_rows":95,"n_cols":24,"rows_kept":95,"cut":false,"hidden":true,"merged":[[76,4,76,8],[77,4,77,8],[70,4,70,8],[71,4,71,8],[72,4,72,8],[73,4,73,8],[74,4,74,8],[75,4,75,8],[44,17,44,19],[44,20,44,22],[64,4,64,8],[69,4,69,8],[20,1,20,2],[20,4,20,5],[26,1,26,7],[44,14,44,16],[63,4,63,8],[65,4,65,8],[66,4,66,8],[67,4,67,8],[68,4,68,8],[64,0,64,2]]}
[]
[]
[]
[]
[]
[]
[]
[]
[]
[]
[]
["Account 1589 Global Adjustment (GA) Analysis Workform"]
[]
[null,"Input cells",null,null,null,null,null,null,null,null,null,null,null,null,null,null,null,null,null,null,null,null,null,2014]
[null,"Drop down cells"]
[null,null,null,null,null,null,null,null,null,null,null,null,null,null,null,null,null,null,null,null,null,null,null,2015]
["Note 1","Year(s) Requested for Disposition",null,null,null,null,null,null,null,null,null,null,null,null,null,null,null,null,null,null,null,null,null,2016]
[]
[]
["Note 2","Consumption Data Excluding for Loss Factor (Data to agree with RRR as applicable)"]
[null,"Year"]
[null,"Total Metered excluding WMP","C = A+B",{"$f":"D23+D24","v":0},"kWh",1]
[null,"RPP ","A",null,"kWh",{"$f":"IFERROR(D23/$D$22,0)","v":0}]
[null,"Non RPP","B = D+E",{"$f":"D25+D26","v":0},"kWh",{"$f":"IFERROR(D24/$D$22,0)","v":0}]
[null,"Non-RPP Class A","D",null,"kWh",{"$f":"IFERROR(D25/$D$22,0)","v":0}]
[null,"Non-RPP Class B*","E",null,"kWh",{"$f":"IFERROR(D26/$D$22,0)","v":0}]
[null,"*Non-RPP Class B consumption reported in this table is not expected to directly agree with the Non-RPP Class B Including Loss Adjusted Billed Consumption in the GA Analysis of Expected Balance table below.  The difference should be equal to the loss factor."]
[]
["Note 3","GA Billing Rate"]
[]
{"$rows_left_out":66}
{"sheet":"GA 2014","index":3,"n_rows":79,"n_cols":11,"rows_kept":79,"cut":false,"hidden":true,"merged":[[12,1,12,2],[12,4,12,5],[18,1,18,7],[55,7,55,9],[56,7,56,9],[24,1,24,5],[61,0,61,1],[60,3,60,7],[66,3,66,7],[67,3,67,7],[68,3,68,7],[61,3,61,7],[62,3,62,7],[63,3,63,7],[64,3,64,7],[65,3,65,7],[74,3,74,7],[69,3,69,7],[70,3,70,7],[71,3,71,7],[72,3,72,7],[73,3,73,7]]}
[]
[]
[]
[]
[]
[]
[]
[]
[]
[]
[]
["Note 2","Consumption Data Excluding for Loss Factor (Data to agree with RRR as applicable)"]
[null,"Year",null,2014]
[null,"Total Metered excluding WMP","C = A+B",{"$f":"D15+D16","v":0},"kWh",1]
[null,"RPP ","A",null,"kWh",{"$f":"IFERROR(D15/$D$14,0)","v":0}]
[null,"Non RPP","B = D+E",{"$f":"D17+D18","v":0},"kWh",{"$f":"IFERROR(D16/$D$14,0)","v":0}]
[null,"Non-RPP Class A","D",null,"kWh",{"$f":"IFERROR(D17/$D$14,0)","v":0}]
[null,"Non-RPP Class B*","E",null,"kWh",{"$f":"IFERROR(D18/$D$14,0)","v":0}]
[null,"*Non-RPP Class B consumption reported in this table is not expected to directly agree with the Non-RPP Class B Including Loss Adjusted Billed Consumption in the GA Analysis of Expected Balance table below.  The difference should be equal to the loss factor."]
[]
["Note 3","GA Billing Rate"]
[]
[null,"GA is billed on the "]
[]
[null,"Please confirm that the GA Rate used for unbilled revenue is the same as the one used for billed revenue in any particular month"]
[]
[]
[]
[]
[]
{"$rows_left_out":50}
{"sheet":"GA 2015","index":4,"n_rows":79,"n_cols":11,"rows_kept":79,"cut":false,"hidden":true,"merged":[[12,1,12,2],[12,4,12,5],[18,1,18,7],[55,7,55,9],[56,7,56,9],[24,1,24,5],[61,0,61,1],[60,3,60,7],[66,3,66,7],[67,3,67,7],[68,3,68,7],[61,3,61,7],[62,3,62,7],[63,3,63,7],[64,3,64,7],[65,3,65,7],[74,3,74,7],[69,3,69,7],[70,3,70,7],[71,3,71,7],[72,3,72,7],[73,3,73,7]]}
[]
[]
[]
[]
[]
[]
[]
[]
[]
[]
[]
["Note 2","Consumption Data Excluding for Loss Factor (Data to agree with RRR as applicable)"]
[null,"Year",null,2015]
[null,"Total Metered excluding WMP","C = A+B",{"$f":"D15+D16","v":0},"kWh",1]
[null,"RPP ","A",null,"kWh",{"$f":"IFERROR(D15/$D$14,0)","v":0}]
[null,"Non RPP","B = D+E",{"$f":"D17+D18","v":0},"kWh",{"$f":"IFERROR(D16/$D$14,0)","v":0}]
[null,"Non-RPP Class A","D",null,"kWh",{"$f":"IFERROR(D17/$D$14,0)","v":0}]
[null,"Non-RPP Class B*","E",null,"kWh",{"$f":"IFERROR(D18/$D$14,0)","v":0}]
[null,"*Non-RPP Class B consumption reported in this table is not expected to directly agree with the Non-RPP Class B Including Loss Adjusted Billed Consumption in the GA Analysis of Expected Balance table below.  The difference should be equal to the loss factor."]
[]
["Note 3","GA Billing Rate"]
[]
[null,"GA is billed on the "]
[]
[null,"Please confirm that the GA Rate used for unbilled revenue is the same as the one used for billed revenue in any paticular month"]
[]
[]
[]
[]
[]
{"$rows_left_out":50}
{"sheet":"GA 2016","index":5,"n_rows":79,"n_cols":11,"rows_kept":79,"cut":false,"hidden":false,"merged":[[12,1,12,2],[12,4,12,5],[18,1,18,7],[55,7,55,9],[56,7,56,9],[24,1,24,5],[61,0,61,1],[60,3,60,7],[66,3,66,7],[67,3,67,7],[68,3,68,7],[61,3,61,7],[62,3,62,7],[63,3,63,7],[64,3,64,7],[65,3,65,7],[74,3,74,7],[69,3,69,7],[70,3,70,7],[71,3,71,7],[72,3,72,7],[73,3,73,7]]}
[]
[]
[]
[]
[]
[]
[]
[]
[]
[]
[]
["Note 2","Consumption Data Excluding for Loss Factor (Data to agree with RRR as applicable)"]
[null,"Year",null,2016]
[null,"Total Metered excluding WMP","C = A+B",{"$f":"D15+D16","v":241665676},"kWh",1]
[null,"RPP ","A",117299185,"kWh",{"$f":"IFERROR(D15/$D$14,0)","v":0.4853779276457944}]
[null,"Non RPP","B = D+E",{"$f":"D17+D18","v":124366491},"kWh",{"$f":"IFERROR(D16/$D$14,0)","v":0.51462207235420554}]
[null,"Non-RPP Class A","D",null,"kWh",{"$f":"IFERROR(D17/$D$14,0)","v":0}]
[null,"Non-RPP Class B*","E",124366491,"kWh",{"$f":"IFERROR(D18/$D$14,0)","v":0.51462207235420554}]
[null,"*Non-RPP Class B consumption reported in this table is not expected to directly agree with the Non-RPP Class B Including Loss Adjusted Billed Consumption in the GA Analysis of Expected Balance table below.  The difference should be equal to the loss factor."]
[]
["Note 3","GA Billing Rate"]
[]
[null,"GA is billed on the ","2nd Estimate"]
[]
[null,"Please confirm that the GA Rate used for unbilled revenue is the same as the one used for billed revenue in any paticular month"]
[]
[]
[]
[]
[]
{"$rows_left_out":50}
{"sheet":"GA 2017","index":6,"n_rows":79,"n_cols":11,"rows_kept":79,"cut":false,"hidden":false,"merged":[[64,3,64,7],[12,1,12,2],[12,4,12,5],[18,1,18,7],[55,7,55,9],[56,2,56,4],[60,3,60,7],[61,3,61,7],[62,3,62,7],[63,3,63,7],[24,1,24,5],[61,0,61,1],[71,3,71,7],[72,3,72,7],[73,3,73,7],[74,3,74,7],[65,3,65,7],[66,3,66,7],[67,3,67,7],[68,3,68,7],[69,3,69,7],[70,3,70,7]]}
[]
[]
[]
[]
[]
[]
[]
[]
[]
[]
[]
["Note 2","Consumption Data Excluding for Loss Factor (Data to agree with RRR as applicable)"]
[null,"Year",null,2017]
[null,"Total Metered excluding WMP","C = A+B",{"$f":"VLOOKUP('1. Information Sheet'!C17,'2 1 5 TotalConsumptionData_Dist'!B4:U70,19,FALSE)","v":244388936.24000001},"kWh",1]
[null,"RPP ","A",{"$f":"VLOOKUP('1. Information Sheet'!C17,'2 1 5 TotalConsumptionData_Dist'!B4:U70,7,FALSE)","v":117466613.44},"kWh",{"$f":"IFERROR(D15/$D$14,0)","v":0.4806543833254503}]
[null,"Non RPP","B = D+E",{"$f":"VLOOKUP('1. Information Sheet'!C17,'2 1 5 TotalConsumptionData_Dist'!B4:U70,20,FALSE)","v":126922322.8},"kWh",{"$f":"IFERROR(D16/$D$14,0)","v":0.51934561667454959}]
[null,"Non-RPP Class A","D",{"$f":"VLOOKUP('1. Information Sheet'!C17,'2 1 5 TotalConsumptionData_Dist'!B4:U70,13,FALSE)","v":23243911},"kWh",{"$f":"IFERROR(D17/$D$14,0)","v":9.5110324377260358E-2}]
[null,"Non-RPP Class B*","E",{"$f":"D16-D17","v":103678411.8},"kWh",{"$f":"IFERROR(D18/$D$14,0)","v":0.42423529229728929}]
[null,"*Non-RPP Class B consumption reported in this table is not expected to directly agree with the Non-RPP Class B Including Loss Adjusted Billed Consumption in the GA Analysis of Expected Balance table below.  The difference should be equal to the loss factor."]
[]
["Note 3","GA Billing Rate"]
[]
[null,"GA is billed on the ","1st Estimate"]
[]
[null,"Please confirm that the GA Rate used for unbilled revenue is the same as the one used for billed revenue in any paticular month"]
[]
[]
[]
[]
[]
{"$rows_left_out":50}
{"sheet":"GA Rates","index":7,"n_rows":15,"n_cols":16,"rows_kept":15,"cut":false,"hidden":true,"merged":[]}
["GA Rates per IESO website"]
[null,2017,null,null,null,2016,null,null,null,2015,null,null,null,2014]
["($/kWh)","First Estimate","Second Estimate","Actual","($/kWh)","First Estimate","Second Estimate","Actual","($/kWh)","First Estimate","Second Estimate","Actual","($/kWh)","First Estimate","Second Estimate","Actual"]
["January",6.6869999999999999E-2,8.677E-2,8.2269999999999996E-2,"January",8.4229999999999999E-2,9.214E-2,9.1789999999999997E-2,"January",5.5490000000000005E-2,6.1609999999999998E-2,5.0680000000000003E-2,"January",3.6260000000000001E-2,1.806E-2,1.261E-2]
["February",0.10559,8.43E-2,8.6389999999999995E-2,"February",0.10384,9.6780000000000005E-2,9.851E-2,"February",6.9809999999999997E-2,4.095E-2,3.9609999999999999E-2,"February",2.231E-2,1.1180000000000001E-2,1.3300000000000001E-2]
["March",8.4089999999999998E-2,6.8860000000000005E-2,7.1349999999999997E-2,"March",9.0219999999999995E-2,0.10299,0.1061,"March",3.6040000000000003E-2,5.74E-2,6.2899999999999998E-2,"March",1.103E-2,-8.0000000000000002E-3,-2.7E-4]
["April",6.8739999999999996E-2,0.10218000000000001,0.10778,"April",0.12114999999999999,0.11176999999999999,0.11132,"April",6.7049999999999998E-2,9.2679999999999998E-2,9.5590000000000008E-2,"April",-9.6500000000000006E-3,5.4530000000000002E-2,5.1979999999999998E-2]
["May",0.10623,0.12776000000000001,0.12307,"May",0.10405,0.11493,0.10749,"May",9.4159999999999994E-2,9.7299999999999998E-2,9.6680000000000002E-2,"May",5.3560000000000003E-2,7.3520000000000002E-2,7.1959999999999996E-2]
["June",0.11954000000000001,0.12562999999999999,0.11848,"June",0.11650000000000001,9.3600000000000003E-2,9.5449999999999993E-2,"June",9.2280000000000001E-2,9.7680000000000003E-2,9.5400000000000013E-2,"June",7.1900000000000006E-2,6.6640000000000005E-2,6.0249999999999998E-2]
["July",0.10651999999999999,0.10197000000000001,0.1128,"July",7.6670000000000002E-2,8.412E-2,8.3059999999999995E-2,"July",8.8880000000000001E-2,8.4129999999999996E-2,7.8829999999999997E-2,"July",5.9760000000000001E-2,5.7529999999999998E-2,6.2560000000000004E-2]
["August",0.115,0.10476000000000001,0.10109,"August",8.5690000000000002E-2,7.0499999999999993E-2,7.1029999999999996E-2,"August",8.8050000000000003E-2,7.3550000000000004E-2,8.0099999999999991E-2,"August",6.1079999999999995E-2,6.8970000000000004E-2,6.7610000000000003E-2]
["September",0.12739,9.8949999999999996E-2,8.8639999999999997E-2,"September",7.0599999999999996E-2,9.1480000000000006E-2,9.5310000000000006E-2,"September",8.270000000000001E-2,7.1910000000000002E-2,6.7030000000000006E-2,"September",8.0489999999999992E-2,8.072E-2,7.9629999999999992E-2]
["October",0.10212,0.11973,0.12562999999999999,"October",9.7199999999999995E-2,0.1178,0.11226,"October",6.3710000000000003E-2,7.1929999999999994E-2,7.5439999999999993E-2,"October",7.492E-2,0.10135,0.10014000000000001]
["November ",0.11164,9.6689999999999998E-2,9.7040000000000001E-2,"November ",0.12271,0.115,0.11108999999999999,"November ",7.6230000000000006E-2,0.12447999999999999,0.11320000000000001,"November ",9.9010000000000001E-2,8.5040000000000004E-2,8.231999999999999E-2]
["December",8.3909999999999998E-2,9.6689999999999998E-2,9.2069999999999999E-2,"December",0.10594000000000001,7.8719999999999998E-2,8.7080000000000005E-2,"December",0.11462,8.8090000000000002E-2,9.4709999999999989E-2,"December",7.3180000000000009E-2,5.7889999999999997E-2,7.4439999999999992E-2]

{"sheet":"2 1 5 TotalConsumptionData_Dist","index":8,"n_rows":71,"n_cols":21,"rows_kept":71,"cut":false,"hidden":true,"merged":[[0,0,0,7],[1,0,1,7]]}
["2.1.5 TotalConsumptionData_Dist_Ret_Total_Combined_Without RateClass_2018"]
["Time run: 5/29/2018 3:56:03 PM"]
["",null,null,null,null,null,null,null,null,null,null,null,null,null,null,null,null,null,null,"H + F + J","F + J"]
["Filing_Year","Company_Name",null,null,null,"Ret_Metered_consumption_in_kWhs","Ret_Metered_consumption_in_kWs","Dist_RPPMeterCustkWh","Dist_RPPMeterCustkW","Dist_NonRPPMeterCustkWh","Dist_NonRPPMeterCustkW","IESOMeterCustkWh","IESOMeterCustKW","Class_A_Consumption_kWhs","Class_A_Consumption_kWs","TotConsmptionforDistCustkWh","TotConsmptionforDistCustkW","Calculated_TOTAL_KWH","Calculated_TOTAL_KW","Total Metered Excluding WMP","Non RPP"]
["2018","ALECTRA UTILITIES CORPORATION",null,null,null,2735166167,5493928,8730758764,3183669,9692001985,23895726,811776337,1381122,3450770317,6672805,19234537086,28460517,21969703253,33954445,21157926916,12427168152]
["2018","ALGOMA POWER INC.",null,null,null,7589178.4400000004,8592,107041096.09,9869.01,88433502.849999994,192374.8,0,0,58917721.789999999,99618.3,195474598.94,202243.81,203063777.38,210836.14,203063777.38,96022681.289999992]
["2018","ATIKOKAN HYDRO INC.",null,null,null,1232089.98,2603,13371836.82,0,15005971.630000001,42253.94,0,0,4563646.5599999996,18088.38,28377808.449999999,42253.94,29609898.43,44857.54,29609898.43,16238061.610000001]
["2018","BLUEWATER POWER DISTRIBUTION CORPORATION",null,null,null,60613020,100189,360840844,96062,439293405,938025,116775525,190405,280305798,480944,916909774,1224492,977522794,1324681,860747269,499906425]
["2018","BRANTFORD POWER INC.",null,null,null,158219509.30000001,332352,383768359.55000001,112785.16,350272883.18000001,978161.98,49798281,119621.52,116262049,226480.18,783839523.73000002,1210568.6599999999,942059033.02999997,1542920.96,892260752.02999997,508492392.48000002]
["2018","BURLINGTON HYDRO INC.",null,null,null,176577660,405566,762645853,366461,617809779,1631018,0,0,126515929,310497,1380455632,1997479,1557033292,2403045,1557033292,794387439]
["2018","CANADIAN NIAGARA POWER INC.",null,null,null,29686787.5,33427,254865795.34,45229.73,168246626.28999999,528462.72,0,0,58621262.450000003,176722.29,423112421.63,573692.44999999995,452799209.13,607120.19999999995,452799209.13,197933413.78999999]
["2018","CENTRE WELLINGTON HYDRO LTD.",null,null,null,15455698,22790,61928647,5373.88,57244721,150396.32,2990901.7,5479.21,0,0,122164269.7,161249.41,137619967.69999999,184040.21,134629066,72700419]
["2018","CHAPLEAU PUBLIC UTILITIES CORPORATION",null,null,null,478450,750,17529372,826.69,6565386,16771,0,0,0,0,24094758,17597.689999999999,24573208,18348.29,24573208,7043836]
["2018","COLLUS POWERSTREAM CORP.",null,null,null,36838997.079999998,62008,156368050.84,27806.93,95469385.260000005,223834.7,2622219.85,4948.96,43660807.75,88754.7,254459655.94999999,256590.59,291298653.02999997,318599.03000000003,288676433.18000001,132308382.34]
["2018","COOPERATIVE HYDRO EMBRUN INC.",null,null,null,798369,0,23247457,0,3782579,11209,0,0,0,0,27030036,11209,27828405,11209,27828405,4580948]
["2018","E.L.K. ENERGY INC.",null,null,null,1,1,107468847,7540,112352023,187474,0,0,10527574,55609,219820870,195014,219820871,195015,219820871,112352024]
["2018","ENERGY+ INC.",null,null,null,227507289,504762,650599864.13999999,121226.4,724724625.66999996,2171002.7599999998,40066139.259999998,67941.7,177256773.63999999,388700.96,1415390629.0699999,2360170.86,1642897918.0699999,2864932.86,1602831778.8099999,952231914.66999996]
["2018","ENTEGRUS POWERLINES INC.",null,null,null,136208932.96000001,265808,375649810.44019997,99051.963333000007,367692738.333,1063877.45,4583831.7300000004,11680.77,238476526,548902,747926380.50320005,1174610.1833329999,884135313.46319997,1440418.1833329999,879551481.73320007,503901671.29299998]
["2018","ENWIN UTILITIES LTD.",null,null,null,210569707,444018,911300246.80999994,483761.84,1002407655.7,2271498.2000000002,242857315.5,463568.8,495677164.07999998,975912,2156565218.0100002,3218828.84,2367134925.0100002,3662847.64,2124277609.51,1212977362.7]
["2018","ERIE THAMES POWERLINES CORPORATION",null,null,null,52664112,109464,170501882,53268.71,255076321,502211.92,0,0,108673765,247265.74,425578203,555480.63,478242315,664944.63,478242315,307740433]
["2018","ESPANOLA REGIONAL HYDRO DISTRIBUTION CORPORATION",null,null,null,8259498.4000000004,14739,37401936.700000003,2791.9,8855247.9000000004,21742.1,0,0,0,0,46257184.600000001,24534,54516683,39273,54516683,17114746.300000001]
["2018","ESSEX POWERLINES CORPORATION",null,null,null,68913583.099999994,169060,299644634.06999999,56516.35,111682700.55,322405.03999999998,10695832.890000001,20658.14,4507656.12,12525.04,422023167.50999999,399579.53,490936750.61000001,568640.38,480240917.71999997,180596283.64999998]
["2018","FESTIVAL HYDRO INC.",null,null,null,127658497.11,282391,192146831.27000001,54830.8,269823282.29000002,601038.38,3139758.12,5723.72,178028756.16999999,370404.2,465109871.68000001,661592.9,592768368.78999996,943984.14,589628610.67000008,397481779.40000004]
["2018","FORT FRANCES POWER CORPORATION",null,null,null,727134.55,0,52620671,0,18961128,49880,0,0,0,0,71581799,49880,72308933.549999997,49880,72308933.549999997,19688262.550000001]
["2018","GREATER SUDBURY HYDRO INC.",null,null,null,83591639.680000007,147260,514629970.98000002,173561.67,245875032.91999999,570066.76,3624729.23,6810.36,36594283.759999998,138457.79,764129733.13,750438.79,847721372.80999994,897699.23,844096643.58000004,329466672.60000002]
["2018","GRIMSBY POWER INCORPORATED",null,null,null,17783005.859999999,33510,105239592.08,7372.42,76441698.939999998,249262.46,3429861.18,6718.85,1987519.2,4930.41,185111152.19999999,263353.73,202894158.06,296864.11,199464296.88,94224704.799999997]
["2018","GUELPH HYDRO ELECTRIC SYSTEMS INC.",null,null,null,197114360.37,375574,477444082.88,94778.64,921412854.80999994,2146272.7000000002,6196613.7000000002,13103.85,562293627.92999995,1084589.18,1405053551.3900001,2254155.19,1602167911.76,2629729.92,1595971298.0599999,1118527215.1799998]
["2018","HALTON HILLS HYDRO INC.",null,null,null,67385238,128208,245359146,54012,164250010,471178,4234039,7376,44894121,128188,413843195,532566,481228433,660774,476994394,231635248]
["2018","HEARST POWER DISTRIBUTION COMPANY LTD.",null,null,null,4459529,8648,34531487,15231,38261730,97243,0,0,0,0,72793217,112474,77252746,121122,77252746,42721259]
["2018","HYDRO 2000 INC.",null,null,null,791335,0,6896834,5327,1308656,389.4,0,0,0,0,8205490,5716.4,8996825,5716.4,8996825,2099991]
{"$rows_left_out":41}