{"text_format":"1","workbook":"xlsx","n_sheets":11,"sheets":["1. Information Sheet","3. Rate Class Selection","4. Growth Factor - NUM_CALC1","5. Growth Factor - NUM_CALC2","6. Rev_Requ_Check","7. Growth Factor - DEN_CALC1","8. Revenue Proportions","9. Threshold Test","10b. Proposed ACM ICM Projects","11. Incremental Capital Adj.","12. Opt 1-Rate Rider Calc F & V"],"not_rendered":{"charts":0,"images":5,"macros":0,"external_links":6,"defined_names":11,"comments":0,"pivot_tables":0},"unopened":[],"bounds":{"document_bytes":16777216,"sheet_cells":100000,"rows_first":2000,"rows_last":500,"rows_between":2000,"halvings":0,"cell_chars":16384,"cell_head_chars":4096},"cells_cut":0,"cells_raw":0,"read":"whole","date_system":"1900"}

{"sheet":"1. Information Sheet","index":0,"n_rows":115,"n_cols":27,"rows_kept":115,"cut":false,"hidden":false,"merged":[[23,5,23,9],[13,5,13,11],[15,5,15,9],[17,5,17,9],[19,5,19,9],[21,5,21,9],[35,0,35,4],[35,5,35,7],[25,0,25,4],[25,5,25,7],[27,0,27,4],[27,5,27,7],[29,5,29,7],[31,0,31,4],[31,5,31,7],[33,0,33,4],[33,5,33,7],[90,3,90,6],[90,7,90,11],[63,0,63,12],[37,5,37,7],[39,5,39,7],[41,5,41,7],[43,5,43,7],[45,0,46,4],[45,5,45,7],[45,9,49,12],[46,5,46,7],[50,2,50,11],[52,2,52,13],[54,2,54,12]]}
[null,null,null,null,null,null,null,null,null,null,null,null,null,null,null,null,null,null,null,null,"a",null,null,null,null,null,{"$f":"IF(OR(F16=\"\", F16=\"(if applicable)\"), F14, F14 & \" - \" & F16)","v":"Burlington Hydro Inc"}]
[]
[]
[]
[]
[]
[]
[]
[]
[]
[]
["Note:  Depending on the selections made below, certain worksheets in this workbook will be hidden.",null,null,null,null,null,null,null,null,null,null,null,"Version",4]
[]
[null,null,null,null,"Utility Name   ","Burlington Hydro Inc"]
[]
[null,null,null,null,"Service Territory (if filing more than one model)"]
[]
[null,null,null,null,"Assigned EB Number","EB-2018-0021"]
[]
[null,null,null,null,"Name of Contact and Title","Sally Blackwell, Director Regulator Affairs"]
{"$rows_left_out":96}
{"sheet":"3. Rate Class Selection","index":1,"n_rows":33,"n_cols":17,"rows_kept":33,"cut":false,"hidden":false,"merged":[[22,1,22,9],[23,1,23,9],[24,1,24,9],[11,0,11,13],[17,1,17,9],[18,1,18,9],[19,1,19,9],[20,1,20,9],[21,1,21,9]]}
[]
[]
[]
[]
[]
[]
[]
[]
[]
[]
[]
["Select the appropriate rate classes as they appear on your most recent Board-Approved Tariff of Rates and Charges, excluding the MicroFit Class."]
[]
["How many classes are on your most recent Board-Approved Tariff of Rates and Charges?",null,null,null,null,null,null,null,null,5]
[]
["Select Your Rate Classes from the Blue Cells below.  Please ensure that a rate class is assigned to each shaded cell."]
[]
[null,"Rate Class Classification",null,null,null,null,null,null,null,null,null,null,null,null,null,null,"# of duplicates"]
[1,"RESIDENTIAL",null,null,null,null,null,null,null,null,null,null,null,null,null,{"$f":"COUNTIF($B$19:$J$40, B19)","v":1},{"$f":"COUNTIF(P19:P40, 2)/2","v":0}]
[2,"GENERAL SERVICE LESS THAN 50 KW",null,null,null,null,null,null,null,null,null,null,null,null,null,{"$f":"COUNTIF($B$19:$J$40, B20)","v":1}]
{"$rows_left_out":14}
{"sheet":"4. Growth Factor - NUM_CALC1","index":2,"n_rows":21,"n_cols":9,"rows_kept":21,"cut":false,"hidden":false,"merged":[[12,0,13,4],[14,2,14,4],[14,6,14,8]]}
[]
[]
[]
[]
[]
[]
[]
[]
[]
[]
[]
[]
[{"$f":"\"Input the billing determinants and base distribution rates associated with \" & '1. Information Sheet'!F14 & \"'s \" & '1. Information Sheet'!F46 & \".  Sheets 4 & 5 calculate the NUMERATOR portion of the growth factor calculation.\"","v":"Input the billing determinants and base distribution rates associated with Burlington Hydro Inc's 2017 Actual Distribution Revenues.  Sheets 4 & 5 calculate the NUMERATOR portion of the growth factor calculation."}]
[]
[null,null,"2017 Actual Distribution Demand",null,null,null,"Current Approved Distribution Rates"]
["Rate Class","Units","Billed Customers or Connections","Billed kWh","Billed kW\n(if applicable)",null,"Monthly Service Charge","Distribution Volumetric Rate kWh","Distribution Volumetric Rate kW"]
["RESIDENTIAL","$/kWh",60593,499660804,0,null,22.44,4.1999999999999997E-3,0]
["GENERAL SERVICE LESS THAN 50 KW","$/kWh",5523,165968773,0,null,26.22,1.4E-2,0]
["GENERAL SERVICE GREATER THAN 50 KW","$/kW",1006,null,2376074,null,61.46,0,3.0255999999999998]
["UNMETERED SCATTERED LOAD","$/kWh",582,3130312,0,null,9.42,1.6400000000000001E-2,0]
{"$rows_left_out":2}
{"sheet":"5. Growth Factor - NUM_CALC2","index":3,"n_rows":24,"n_cols":19,"rows_kept":24,"cut":false,"hidden":false,"merged":[[13,2,13,8]]}
[]
[]
[]
[]
[]
[]
[]
[]
[]
[]
[]
[{"$f":"IF('1. Information Sheet'!F26=\"COS\", \"Calculation of \" & '1. Information Sheet'!K26 & \" Revenue Requirement.  No input required.\", \"Calculation of \" & '1. Information Sheet'!F36 & \" Revenue Requirement.  No input required.\")","v":"Calculation of 2017 Revenue Requirement.  No input required."}]
[]
[null,null,{"$f":"+'4. Growth Factor - NUM_CALC1'!C15:E15","v":"2017 Actual Distribution Demand"}]
["Rate Class",null,"Billed Customers or Connections","Billed kWh","Billed kW\n(if applicable)",null,"Monthly Service Charge","Distribution Volumetric Rate kWh","Distribution Volumetric Rate kW",null,"Service Charge Revenue","Distribution Volumetric Rate Revenue \nkWh","Distribution Volumetric Rate Revenue \nkW","Revenue Requirement from Rates",null,"Service Charge % Revenue","Distribution Volumetric Rate % Revenue \nkWh","Distribution Volumetric Rate % Revenue \nkW","Total % Revenue"]
[null,null,"A","B","C",null,"D","E","F",null,"G = A * D *12","H = B * E","I = C * F","J = G + H + I",null,"K = G / J","L = H / J","M = I / J","N = J / R"]
[{"$f":"+'4. Growth Factor - NUM_CALC1'!A17","v":"RESIDENTIAL"},null,{"$f":"+'4. Growth Factor - NUM_CALC1'!C17","v":60593},{"$f":"+'4. Growth Factor - NUM_CALC1'!D17","v":499660804},{"$f":"+'4. Growth Factor - NUM_CALC1'!E17","v":0},null,{"$f":"+'4. Growth Factor - NUM_CALC1'!G17","v":22.44},{"$f":"+'4. Growth Factor - NUM_CALC1'!H17","v":4.1999999999999997E-3},{"$f":"+'4. Growth Factor - NUM_CALC1'!I17","v":0},null,{"$f":"G17*C17*12","v":16316483.040000003},{"$f":"H17*D17","v":2098575.3767999997},{"$f":"I17*E17","v":0},{"$f":"SUM(K17,L17,M17)","v":18415058.416800003},null,{"$f":"IF(ISERROR(K17/N17),0,ROUND(K17/N17,3))","v":0.88600000000000001},{"$f":"IF(ISERROR(L17/N17),0,ROUND(L17/N17,3))","v":0.114},{"$f":"IF(ISERROR(M17/N17),0,ROUND(M17/N17,3))","v":0},{"$f":"N17/N24","v":0.59859663477405056}]
[{"$f":"+'4. Growth Factor - NUM_CALC1'!A18","v":"GENERAL SERVICE LESS THAN 50 KW"},null,{"$f":"+'4. Growth Factor - NUM_CALC1'!C18","v":5523},{"$f":"+'4. Growth Factor - NUM_CALC1'!D18","v":165968773},{"$f":"+'4. Growth Factor - NUM_CALC1'!E18","v":0},null,{"$f":"+'4. Growth Factor - NUM_CALC1'!G18","v":26.22},{"$f":"+'4. Growth Factor - NUM_CALC1'!H18","v":1.4E-2},{"$f":"+'4. Growth Factor - NUM_CALC1'!I18","v":0},null,1737756.72,{"$f":"H18*D18","v":2323562.8220000002},0,4061319.5420000004,null,0.42799999999999999,0.57199999999999995,0,{"$f":"N18/N24","v":0.13201653535703206}]
[{"$f":"+'4. Growth Factor - NUM_CALC1'!A19","v":"GENERAL SERVICE GREATER THAN 50 KW"},null,{"$f":"+'4. Growth Factor - NUM_CALC1'!C19","v":1006},{"$f":"+'4. Growth Factor - NUM_CALC1'!D19","v":0},{"$f":"+'4. Growth Factor - NUM_CALC1'!E19","v":2376074},null,{"$f":"+'4. Growth Factor - NUM_CALC1'!G19","v":61.46},{"$f":"+'4. Growth Factor - NUM_CALC1'!H19","v":0},{"$f":"+'4. Growth Factor - NUM_CALC1'!I19","v":3.0255999999999998},null,741945.12,0,{"$f":"I19*E19","v":7189049.4943999993},7930994.6143999994,null,9.4E-2,0,0.90600000000000003,{"$f":"N19/N24","v":0.25780350945071445}]
[{"$f":"+'4. Growth Factor - NUM_CALC1'!A20","v":"UNMETERED SCATTERED LOAD"},null,{"$f":"+'4. Growth Factor - NUM_CALC1'!C20","v":582},{"$f":"+'4. Growth Factor - NUM_CALC1'!D20","v":3130312},{"$f":"+'4. Growth Factor - NUM_CALC1'!E20","v":0},null,{"$f":"+'4. Growth Factor - NUM_CALC1'!G20","v":9.42},{"$f":"+'4. Growth Factor - NUM_CALC1'!H20","v":1.6400000000000001E-2},{"$f":"+'4. Growth Factor - NUM_CALC1'!I20","v":0},null,65789.279999999999,51337.116800000003,{"$f":"I20*E20","v":0},117126.3968,null,0.56200000000000006,0.438,0,{"$f":"N20/N24","v":3.807289956991265E-3}]
{"$rows_left_out":5}
{"sheet":"6. Rev_Requ_Check","index":4,"n_rows":69,"n_cols":8,"rows_kept":69,"cut":false,"hidden":false,"merged":[[7,2,7,5]]}
[]
[]
[]
[]
[]
[]
[]
["Applicants Rate Base",null,{"$f":"+'4. Growth Factor - NUM_CALC1'!G15","v":"Current Approved Distribution Rates"}]
["Average Net Fixed Assets"]
["Gross Fixed Assets - Re-based Opening",null,{"$f":"+'[2]App.2-BA1_Fix Asset Cont.CGAAP'!$D$59","v":242255337},"A"]
["Add: CWIP Re-based Opening",null,null,"B"]
["Re-based Capital Additions",null,{"$f":"+'[2]App.2-BA1_Fix Asset Cont.CGAAP'!$E$59","v":7730045},"C"]
["Re-based Capital Disposals",null,{"$f":"+'[2]App.2-BA1_Fix Asset Cont.CGAAP'!$F$59","v":0},"D"]
["Re-based Capital Retirements",null,null,"E"]
["Deduct: CWIP Re-based Closing",null,null,"F"]
["Gross Fixed Assets - Re-based Closing",null,{"$f":"SUM(C10:C15)","v":249985382},"G"]
["Average Gross Fixed Assets",null,null,null,{"$f":"(C10+C16)/2","v":246120359.5},"H = ( A + G ) / 2"]
[]
["Accumulated Depreciation - Re-based Opening",null,{"$f":"-'[2]App.2-BA1_Fix Asset Cont.CGAAP'!$I$59","v":139112890},"I"]
["Re-based Depreciation Expense",null,{"$f":"-'[2]App.2-BA1_Fix Asset Cont.CGAAP'!$J$59","v":4510060},"J"]
{"$rows_left_out":50}
{"sheet":"7. Growth Factor - DEN_CALC1","index":5,"n_rows":24,"n_cols":19,"rows_kept":24,"cut":false,"hidden":false,"merged":[[13,2,13,4],[13,6,13,8]]}
[]
[]
[]
[]
[]
[]
[]
[]
[]
[]
[]
["Input the billing determinants associated with Burlington Hydro Inc. 2014 Board-Approved Distribution Revenues.  This sheet calculates the DENOMINATOR portion of the growth factor calculation."]
["Pseudo Revenue Requirement Calculation."]
[null,null,{"$f":"+'1. Information Sheet'!F47","v":"2014 Board-Approved Distribution Revenues"},null,null,null,"Current Approved Distribution Rates"]
["Rate Class",null,"Billed Customers or Connections","Billed kWh","Billed kW",null,"Monthly Service Charge","Distribution Volumetric Rate kWh","Distribution Volumetric Rate kW",null,"Service Charge Revenue","Distribution Volumetric Rate Revenue \nkWh","Distribution Volumetric Rate Revenue \nkW","Total Revenue By Rate Class",null,"Service Charge % Revenue","Distribution Volumetric Rate % Revenue \nkWh","Distribution Volumetric Rate % Revenue \nkW","Total % Revenue"]
[null,null,"A","B","C",null,"D","E","F",null,"G = A * D *12","H = B * E","I = C * F","J = G + H + I",null,"K = G / Jtotal","L = H / Jtotal","M = I / Jtotal","N = J / Jtotal"]
[{"$f":"+'4. Growth Factor - NUM_CALC1'!A17","v":"RESIDENTIAL"},null,59869,{"$f":"+'[5]I6.1 Revenue'!$D$25","v":553858289},0,null,{"$f":"'5. Growth Factor - NUM_CALC2'!G17","v":22.44},{"$f":"'5. Growth Factor - NUM_CALC2'!H17","v":4.1999999999999997E-3},{"$f":"'5. Growth Factor - NUM_CALC2'!I17","v":0},null,{"$f":"G17*C17*12","v":16121524.32},{"$f":"H17*D17","v":2326204.8137999997},0,{"$f":"SUM(K17,L17,M17)","v":18447729.1338},null,{"$f":"IF(ISERROR(K17/N24),0,ROUND(K17/N24,3))","v":0.51900000000000002},{"$f":"IF(ISERROR(L17/N24),0,ROUND(L17/N24,3))","v":7.4999999999999997E-2},{"$f":"IF(ISERROR(M17/N24),0,ROUND(M17/N24,3))","v":0},{"$f":"N17/N24","v":0.59389104057241549}]
[{"$f":"+'4. Growth Factor - NUM_CALC1'!A18","v":"GENERAL SERVICE LESS THAN 50 KW"},null,5224,{"$f":"+'[5]I6.1 Revenue'!$E$25","v":173842956},0,null,{"$f":"'5. Growth Factor - NUM_CALC2'!G18","v":26.22},{"$f":"'5. Growth Factor - NUM_CALC2'!H18","v":1.4E-2},{"$f":"'5. Growth Factor - NUM_CALC2'!I18","v":0},null,1643679.3599999999,2433801.3840000001,0,4077480.7439999999,null,{"$f":"IF(ISERROR(K18/N24),0,ROUND(K18/N24,3))","v":5.2999999999999999E-2},{"$f":"IF(ISERROR(L18/N24),0,ROUND(L18/N24,3))","v":7.8E-2},{"$f":"IF(ISERROR(M18/N24),0,ROUND(M18/N24,3))","v":0},{"$f":"N18/N24","v":0.13126706622829365}]
[{"$f":"+'4. Growth Factor - NUM_CALC1'!A19","v":"GENERAL SERVICE GREATER THAN 50 KW"},null,1012,0,{"$f":"+'[5]I6.1 Revenue'!$F$26","v":2451173},null,{"$f":"'5. Growth Factor - NUM_CALC2'!G19","v":61.46},{"$f":"'5. Growth Factor - NUM_CALC2'!H19","v":0},{"$f":"'5. Growth Factor - NUM_CALC2'!I19","v":3.0255999999999998},null,746370.24,0,7416269.0287999995,8162639.2687999997,null,{"$f":"IF(ISERROR(K19/N24),0,ROUND(K19/N24,3))","v":2.4E-2},{"$f":"IF(ISERROR(L19/N24),0,ROUND(L19/N24,3))","v":0},{"$f":"IF(ISERROR(M19/N24),0,ROUND(M19/N24,3))","v":0.23899999999999999},{"$f":"N19/N24","v":0.262781304625884}]
[{"$f":"+'4. Growth Factor - NUM_CALC1'!A20","v":"UNMETERED SCATTERED LOAD"},null,605,{"$f":"+'[5]I6.1 Revenue'!$L$25","v":3151827},null,null,{"$f":"'5. Growth Factor - NUM_CALC2'!G20","v":9.42},{"$f":"'5. Growth Factor - NUM_CALC2'!H20","v":1.6400000000000001E-2},{"$f":"'5. Growth Factor - NUM_CALC2'!I20","v":0},null,68389.200000000012,51689.962800000001,0,120079.16280000002,null,{"$f":"IF(ISERROR(K20/N24),0,ROUND(K20/N24,3))","v":2E-3},{"$f":"IF(ISERROR(L20/N24),0,ROUND(L20/N24,3))","v":2E-3},{"$f":"IF(ISERROR(M20/N24),0,ROUND(M20/N24,3))","v":0},{"$f":"N20/N24","v":3.8657299458985891E-3}]
{"$rows_left_out":5}
{"sheet":"8. Revenue Proportions","index":6,"n_rows":24,"n_cols":19,"rows_kept":24,"cut":false,"hidden":false,"merged":[[12,0,12,6],[13,2,13,4],[13,6,13,8]]}
[]
[]
[]
[]
[]
[]
[]
[]
[]
[]
[]
["Current Revenue from Rates"]
["This sheet is used to determine the applicant's most current allocation of revenues (after the most recent revenue to cost ratio adjustment, if applicable)  to appropriately allocate the incremental revenue requirement to the classes.\n"]
[null,null,"Most Recent Board-Approved Base Rates",null,null,null,{"$f":"+'4. Growth Factor - NUM_CALC1'!G15:I15","v":"Current Approved Distribution Rates"}]
["Rate Class",null,"Monthly Service Charge","Distribution Volumetric Rate kWh","Distribution Volumetric Rate kW",null,"Re-based Billed Customers or Connections","Re-based Billed kWh","Re-based Billed kW",null,"Current Base Service Charge Revenue","Current Base Distribution Volumetric Rate kWh Revenue","Current Base Distribution Volumetric Rate kW Revenue","Total Current Base Revenue",null,"Service Charge % Total Revenue","Distribution Volumetric Rate % Total Revenue ","Distribution Volumetric Rate % Total Revenue ","Total % Revenue"]
[null,null,"A","B","C",null,"D","E","F",null,"G = A * D *12","H = B * E","I = C * F","J = G + H + I",null,"L = G / Jtotal","M = H / Jtotal","N = I / Jtotal","O = J / Jtotal"]
[{"$f":"+'4. Growth Factor - NUM_CALC1'!A17","v":"RESIDENTIAL"},null,22.44,4.1999999999999997E-3,0,null,{"$f":"'4. Growth Factor - NUM_CALC1'!C17","v":60593},{"$f":"'4. Growth Factor - NUM_CALC1'!D17","v":499660804},{"$f":"'4. Growth Factor - NUM_CALC1'!E17","v":0},null,{"$f":"G17*C17*12","v":16316483.040000003},{"$f":"H17*D17","v":2098575.3767999997},0,{"$f":"SUM(K17,L17,M17)","v":18415058.416800003},null,{"$f":"IF(ISERROR(K17/N24),0,K17/N24)","v":0.53038071441475709},{"$f":"IF(ISERROR(L17/N24),0,L17/N24)","v":6.8215920359293414E-2},{"$f":"IF(ISERROR(M17/N24),0,M17/N24)","v":0},{"$f":"N17/N24","v":0.59859663477405056}]
[{"$f":"+'4. Growth Factor - NUM_CALC1'!A18","v":"GENERAL SERVICE LESS THAN 50 KW"},null,26.22,1.4E-2,0,null,{"$f":"'4. Growth Factor - NUM_CALC1'!C18","v":5523},{"$f":"'4. Growth Factor - NUM_CALC1'!D18","v":165968773},{"$f":"'4. Growth Factor - NUM_CALC1'!E18","v":0},null,1737756.72,2323562.8220000002,0,4061319.5420000004,null,{"$f":"IF(ISERROR(K18/N24),0,K18/N24)","v":5.6487212861568041E-2},{"$f":"IF(ISERROR(L18/N24),0,L18/N24)","v":7.5529322495463999E-2},{"$f":"IF(ISERROR(M18/N24),0,M18/N24)","v":0},{"$f":"N18/N24","v":0.13201653535703206}]
[{"$f":"+'4. Growth Factor - NUM_CALC1'!A19","v":"GENERAL SERVICE GREATER THAN 50 KW"},null,61.46,0,3.0255999999999998,null,{"$f":"'4. Growth Factor - NUM_CALC1'!C19","v":1006},{"$f":"'4. Growth Factor - NUM_CALC1'!D19","v":0},{"$f":"'4. Growth Factor - NUM_CALC1'!E19","v":2376074},null,741945.12,0,7189049.4943999993,7930994.6143999994,null,{"$f":"IF(ISERROR(K19/N24),0,K19/N24)","v":2.4117536961699475E-2},{"$f":"IF(ISERROR(L19/N24),0,L19/N24)","v":0},{"$f":"IF(ISERROR(M19/N24),0,M19/N24)","v":0.23368597248901496},{"$f":"N19/N24","v":0.25780350945071445}]
[{"$f":"+'4. Growth Factor - NUM_CALC1'!A20","v":"UNMETERED SCATTERED LOAD"},null,9.42,1.6400000000000001E-2,0,null,{"$f":"'4. Growth Factor - NUM_CALC1'!C20","v":582},{"$f":"'4. Growth Factor - NUM_CALC1'!D20","v":3130312},{"$f":"'4. Growth Factor - NUM_CALC1'!E20","v":0},null,65789.279999999999,51337.116800000003,0,117126.3968,null,{"$f":"IF(ISERROR(K20/N24),0,K20/N24)","v":2.138534710065343E-3},{"$f":"IF(ISERROR(L20/N24),0,L20/N24)","v":1.6687552469259225E-3},{"$f":"IF(ISERROR(M20/N24),0,M20/N24)","v":0},{"$f":"N20/N24","v":3.807289956991265E-3}]
{"$rows_left_out":5}
{"sheet":"9. Threshold Test","index":7,"n_rows":69,"n_cols":5,"rows_kept":69,"cut":false,"hidden":false,"merged":[[8,2,8,4],[68,2,70,5]]}
[]
[]
[]
[]
[]
[]
[]
["No Input Required."]
[null,null,{"$f":"IF('1. Information Sheet'!F26 = \"COS\", \"Preliminary Threshold Calculation\", \"Final Threshold Calculation\")","v":"Final Threshold Calculation"}]
[]
[]
[]
[null,null,"Year",null,{"$f":"+'1. Information Sheet'!K26","v":2019}]
[null,null,"Year in which Applicant is applying",null,{"$f":"+'1. Information Sheet'!F28","v":5}]
[]
[null,null,"Price Cap Index",null,1.2E-2]
[null,null,"Growth Factor Calculation"]
[null,null,{"$f":"'1. Information Sheet'!F46","v":"2017 Actual Distribution Revenues"},null,{"$f":"'5. Growth Factor - NUM_CALC2'!N24","v":30763718.582800001}]
[null,null,{"$f":"+'1. Information Sheet'!F47:F47","v":"2014 Board-Approved Distribution Revenues"},null,{"$f":"'7. Growth Factor - DEN_CALC1'!N24","v":31062480.9494}]
[null,null,"Growth Factor",null,{"$f":"IF(ISERROR(E18/E19-1),0,(E18/E19-1)/('1. Information Sheet'!I46-'1. Information Sheet'!I47))","v":-3.2060367520404531E-3}]
{"$rows_left_out":50}
{"sheet":"10b. Proposed ACM ICM Projects","index":8,"n_rows":79,"n_cols":15,"rows_kept":79,"cut":false,"hidden":false,"merged":[[12,3,12,6],[47,3,47,14],[48,3,48,5],[48,6,48,8],[48,9,48,11],[48,12,48,14],[50,1,53,1],[56,3,56,5],[56,6,56,8],[56,9,56,11],[56,12,56,14]]}
[]
[]
[]
[]
[]
[]
[]
[]
[]
[]
["Identify ALL Proposed ACM projects and related CAPEX costs in the relevant years"]
[]
[null,null,"Cost of Service","Price Cap IR"]
[null,null,"Test Year","Year 2","Year 3","Year 4","Year 5"]
[null,null,{"$f":"+'1. Information Sheet'!F32","v":2014},{"$f":"+C15+2","v":2016},{"$f":"D15+1","v":2017},{"$f":"E15+1","v":2018},{"$f":"F15+1","v":2019}]
["Distribution System Plan CAPEX",null,null,null,null,{"$f":"+'[6]Reply 2'!$C$4","v":10488183.83},{"$f":"+'[6]Reply 2'!$D$4","v":14623987}]
[]
["Materiality Threshold",null,null,{"$f":"'9. Threshold Test'!E62","v":6125396.6232946813},{"$f":"'9. Threshold Test'!E63","v":6135590.9093631711},{"$f":"'9. Threshold Test'!E64","v":6145874.4514096165},{"$f":"'9. Threshold Test'!E65","v":6156248.0309139118}]
[]
["Maximum Eligible Incremental Capital (Forecasted Capex less Threshold)",null,0,{"$f":"IF(D18>D16,0,D16-D18)","v":0},{"$f":"IF(E18>E16,0,E16-E18)","v":0},{"$f":"IF(F18>F16,0,F16-F18)","v":4342309.3785903836},{"$f":"IF(G18>G16,0,G16-G18)","v":8467738.9690860882}]
{"$rows_left_out":60}
{"sheet":"11. Incremental Capital Adj.","index":9,"n_rows":83,"n_cols":12,"rows_kept":83,"cut":false,"hidden":false,"merged":[]}
[]
[]
[]
[]
[]
[]
[]
[]
[]
[]
[]
[null,"Incremental Capital Adjustment"]
[]
[]
[]
[null,"Current Revenue Requirement"]
[]
[null,"Current Revenue Requirement - Total",null,null,{"$f":"'6. Rev_Requ_Check'!E62","v":29406581.15257962},"A"]
[]
[]
{"$rows_left_out":64}
{"sheet":"12. Opt 1-Rate Rider Calc F & V","index":10,"n_rows":26,"n_cols":26,"rows_kept":26,"cut":false,"hidden":false,"merged":[[12,0,12,3],[12,4,12,5]]}
[null,null,null,null,null,null,null,null,null,null,null,null,null,null,null,null,null,null,null,null,null,null,null,null,null,true]
[null,null,null,null,null,null,null,null,null,null,null,null,null,null,null,null,null,null,null,null,null,null,null,null,null,false]
[null,null,null,null,null,null,null,null,null,null,null,null,null,null,null,null,null,null,null,null,null,null,null,null,null,false]
[]
[]
[]
[]
[]
[]
[]
[]
[]
["Calculation of incremental rate rider.  Choose one of the 3 options:"]
[]
["Rate Class",null,"Service Charge % Revenue","Distribution Volumetric Rate % Revenue kWh","Distribution Volumetric Rate % Revenue kW","Service Charge Revenue","Distribution Volumetric Rate Revenue kWh","Distribution Volumetric Rate Revenue kW","Total Revenue by Rate Class",null,"Billed Customers or Connections","Billed kWh","Billed kW",null,"Service Charge Rate Rider","Distribution Volumetric Rate kWh Rate Rider","Distribution Volumetric Rate kW Rate Rider"]
[null,null,"From Sheet 8","From Sheet 8","From Sheet 8","Col C * Col Itotal","Col  D* Col Itotal","Col  E* Col Itotal",null,null,"From Sheet 4","From Sheet 4","From Sheet 4",null,"Col F / Col K / 12","Col G / Col L","Col H / Col M"]
[{"$f":"+'4. Growth Factor - NUM_CALC1'!A17","v":"RESIDENTIAL"},null,{"$f":"'8. Revenue Proportions'!P17","v":0.53038071441475709},{"$f":"'8. Revenue Proportions'!Q17","v":6.8215920359293414E-2},{"$f":"'8. Revenue Proportions'!R17","v":0},{"$f":"C17*$I$25","v":268614.73697144247},{"$f":"D17*$I$25","v":34548.39327028636},{"$f":"E17*$I$25","v":0},{"$f":"SUM(F17:H17)","v":303163.13024172885},null,{"$f":"'4. Growth Factor - NUM_CALC1'!C17","v":60593},{"$f":"'4. Growth Factor - NUM_CALC1'!D17","v":499660804},0,null,{"$f":"IFERROR(I17/K17/12,\"\")","v":0.4169391544701655},0,{"$f":"IFERROR(H17/M17,\"\")","v":""},"Note:  As per the OEB's letter issued July 16, 2015 (EB-2012-0410), Residential Rates will be applied on a fixed basis only."]
[{"$f":"+'4. Growth Factor - NUM_CALC1'!A18","v":"GENERAL SERVICE LESS THAN 50 KW"},null,{"$f":"'8. Revenue Proportions'!P18","v":5.6487212861568041E-2},{"$f":"'8. Revenue Proportions'!Q18","v":7.5529322495463999E-2},{"$f":"'8. Revenue Proportions'!R18","v":0},{"$f":"C18*$I$25","v":28608.313637125349},38252.312997725057,0,{"$f":"SUM(F18:H18)","v":66860.6266348504},null,{"$f":"'4. Growth Factor - NUM_CALC1'!C18","v":5523},{"$f":"'4. Growth Factor - NUM_CALC1'!D18","v":165968773},0,null,{"$f":"IFERROR(F18/K18/12,\"\")","v":0.43165419815808664},{"$f":"IFERROR(G18/L18,\"\")","v":2.3047897689600354E-4},""]
[{"$f":"+'4. Growth Factor - NUM_CALC1'!A19","v":"GENERAL SERVICE GREATER THAN 50 KW"},null,{"$f":"'8. Revenue Proportions'!P19","v":2.4117536961699475E-2},{"$f":"'8. Revenue Proportions'!Q19","v":0},{"$f":"'8. Revenue Proportions'!R19","v":0.23368597248901496},12214.482297898756,0,118351.76945171738,130566.25174961613,null,{"$f":"'4. Growth Factor - NUM_CALC1'!C19","v":1006},{"$f":"'4. Growth Factor - NUM_CALC1'!D19","v":0},{"$f":"'4. Growth Factor - NUM_CALC1'!E19","v":2376074},null,{"$f":"IFERROR(F19/K19/12,\"\")","v":1.0118027085734556},{"$f":"IFERROR(G19/L19,\"\")","v":""},{"$f":"IFERROR(H19/M19,\"\")","v":4.9809799464039156E-2}]
[{"$f":"+'4. Growth Factor - NUM_CALC1'!A20","v":"UNMETERED SCATTERED LOAD"},null,{"$f":"'8. Revenue Proportions'!P20","v":2.138534710065343E-3},{"$f":"'8. Revenue Proportions'!Q20","v":1.6687552469259225E-3},{"$f":"'8. Revenue Proportions'!R20","v":0},1083.0747103660506,845.15186834675978,0,1928.2265787128104,null,{"$f":"'4. Growth Factor - NUM_CALC1'!C20","v":582},{"$f":"'4. Growth Factor - NUM_CALC1'!D20","v":3130312},{"$f":"'4. Growth Factor - NUM_CALC1'!E20","v":0},null,0.1550794258828824,2.699896586496042E-4,{"$f":"IFERROR(H20/M20,\"\")","v":""}]
{"$rows_left_out":6}