{"text_format":"1","workbook":"xlsx","n_sheets":10,"sheets":["1. Info","2. Table of Contents","3. Rate Classes","4. RRR Data","5. UTRs and Sub-Transmission","6. Historical Wholesale","7. Current Wholesale","8. Forecast Wholesale","9. RTSR Rates to Forecast","hidden1"],"not_rendered":{"charts":0,"images":3,"macros":1,"external_links":2,"defined_names":20,"comments":0,"pivot_tables":0},"unopened":[],"bounds":{"document_bytes":16777216,"sheet_cells":100000,"rows_first":2000,"rows_last":500,"rows_between":2000,"halvings":0,"cell_chars":16384,"cell_head_chars":4096},"cells_cut":0,"cells_raw":0,"read":"whole","date_system":"1900"}

{"sheet":"1. Info","index":0,"n_rows":75,"n_cols":28,"rows_kept":75,"cut":false,"hidden":false,"merged":[[24,3,24,4],[20,3,20,4],[1,2,1,9],[2,2,2,9],[3,2,3,9],[4,2,4,9],[14,3,14,4],[16,3,16,4]]}
[null,null,null,null,null,null,null,null,null,null,null,null,null,null,null,null,null,null,null,null,null,null,null,null,null,null,null,"Alectra Utilities Corporation - Enersource Hydro"]
[null,null,null,null,null,null,null,null,null,null,null,null,null,null,null,null,null,null,null,null,null,null,null,null,null,null,null,"Alectra Utilities Corporation - Horizon Utilities"]
[null,null,null,null,null,null,null,null,null,null,null,null,null,null,null,null,null,null,null,null,null,null,null,null,null,null,null,"Alectra Utilities Corporation - Hydro One Brampton "]
[null,null,null,null,null,null,null,null,null,null,null,null,null,null,null,null,null,null,null,null,null,null,null,null,null,null,null,"Alectra Utilities Corporation - PowerStream Inc."]
[null,null,null,null,null,null,null,null,null,null,null,null,null,null,null,null,null,null,null,null,null,null,null,null,null,null,null,"Algoma Power Inc."]
[null,null,null,null,null,null,null,null,null,null,null,null,null,null,null,null,null,null,null,null,null,null,null,null,null,null,null,"Atikokan Hydro Inc."]
[null,null,null,null,null,null,null,null,null,null,null,null,null,null,null,null,null,null,null,null,null,null,null,null,null,null,null,"Attawapiskat Power Corp. "]
[null,null,null,null,null,null,null,null,null,null,null,null,null,null,null,null,null,null,null,null,null,null,null,null,null,null,null,"Bluewater Power Distribution Corporation"]
[null,null,null,null,null,null,null,null,null,null,null,null,null,null,null,null,null,null,null,null,null,null,null,null,null,null,null,"Brantford Power Inc."]
[null,null,null,null,null,null,null,null,null,null,null,null,null,null,null,null,null,null,null,null,null,null,null,null,null,null,null,"Burlington Hydro Inc."]
[null,null,null,null,null,null,null,null,null,null,null,null,null,null,null,null,null,null,null,null,null,null,null,null,null,null,null,"Canadian Niagara Power Inc."]
[null,null,null,null,null,null,null,null,null,null,null,null,null,null,null,null,null,null,null,null,null,null,null,null,null,null,null,"Centre Wellington Hydro Ltd."]
["Drop-down lists are shaded blue; Input cells are shaded green.",null,null,null,null,null,null,null,null,null,null,null,null,null,null,null,null,null,null,null,null,null,null,null,null,null,null,"Chapleau Public Utilities Corporation"]
[null,null,null,null,null,null,null,null,null,null,null,null,null,null,null,null,null,null,null,null,null,null,null,null,null,null,null,"COLLUS PowerStream Corporation"]
[null,null,"Utility Name   ","Algoma Power Inc.",null,null,null,null,null,null,null,null,null,null,null,null,null,null,null,null,null,null,null,null,null,null,null,"Cooperative Hydro Embrun Inc."]
[null,null,null,null,null,null,null,null,null,null,null,null,null,null,null,null,null,null,null,null,null,null,null,null,null,null,null,"E.L.K. Energy Inc."]
[null,null,"Service Territory","Algoma Region",null,null,null,null,null,null,null,null,null,null,null,null,null,null,null,null,null,null,null,null,null,null,null,"Energy + Inc."]
[null,null,null,null,null,null,null,null,null,null,null,null,null,null,null,null,null,null,null,null,null,null,null,null,null,null,null,"Entegrus Powerlines Inc."]
[null,null,"Assigned EB Number","EB 2019-0019",null,null,null,null,null,null,null,null,null,null,null,null,null,null,null,null,null,null,null,null,null,null,null,"ENWIN Utilities Ltd."]
[null,null,null,null,null,null,null,null,null,null,null,null,null,null,null,null,null,null,null,null,null,null,null,null,null,null,null,"Erie Thames Powerlines Corporation"]
[null,null,"Name and Title",null,null,null,null,null,null,null,null,null,null,null,null,null,null,null,null,null,null,null,null,null,null,null,null,"Espanola Regional Hydro Distribution Corporation"]
[null,null,null,null,null,null,null,null,null,null,null,null,null,null,null,null,null,null,null,null,null,null,null,null,null,null,null,"Essex Powerlines Corporation"]
[null,null,"Phone Number",null,null,null,null,null,null,null,null,null,null,null,null,null,null,null,null,null,null,null,null,null,null,null,null,"Festival Hydro Inc."]
[null,null,null,null,null,null,null,null,null,null,null,null,null,null,null,null,null,null,null,null,null,null,null,null,null,null,null,"Fort Albany Power Corporation"]
[null,null,"Email Address",null,null,null,null,null,null,null,null,null,null,null,null,null,null,null,null,null,null,null,null,null,null,null,null,"Fort Frances Power Corporation"]
[null,null,null,null,null,null,null,null,null,null,null,null,null,null,null,null,null,null,null,null,null,null,null,null,null,null,null,"Greater Sudbury Hydro Inc."]
[null,null,"Date",null,null,null,null,null,null,null,null,null,null,null,null,null,null,null,null,null,null,null,null,null,null,null,null,"Grimsby Power Inc."]
[null,null,null,null,null,null,null,null,null,null,null,null,null,null,null,null,null,null,null,null,null,null,null,null,null,null,null,"Guelph Hydro Electric Systems Inc."]
[null,null,"Last COS Re-based Year",2015,null,null,null,null,null,null,null,null,null,null,null,null,null,null,null,null,null,null,null,null,null,null,null,"Halton Hills Hydro Inc."]
[null,null,null,null,null,null,null,null,null,null,null,null,null,null,null,null,null,null,null,null,null,null,null,null,null,null,null,"Hearst Power Distribution Company Limited"]
{"$rows_left_out":46}
{"sheet":"2. Table of Contents","index":1,"n_rows":28,"n_cols":9,"rows_kept":28,"cut":false,"hidden":false,"merged":[]}
[]
[]
[]
[]
[]
[]
[]
[]
[]
[]
[]
[]
[]
[]
[]
[]
[]
[]
[]
[null,null,null,"1. Info",null,null,null,null,"6. Historical Wholesale"]
[]
[null,null,null,"2. Table of Contents",null,null,null,null,"7. Current Wholesale"]
[]
[null,null,null,"3. Rate Classes",null,null,null,null,"8. Forecast Wholesale"]
[]
[null,null,null,"4. RRR Data",null,null,null,null,"9. RTSR Rates to Forecast"]
[]
[null,null,null,"5. UTRs and Sub-Transmission"]

{"sheet":"3. Rate Classes","index":2,"n_rows":100,"n_cols":23,"rows_kept":100,"cut":false,"hidden":false,"merged":[[12,2,12,8]]}
[]
[]
[]
[]
[]
[]
[]
[]
[]
[]
[]
[]
[null,null,"1.  Select the appropriate rate classes that appear on your most recent Board-Approved Tariff of Rates and Charges.\n2.  Enter the RTS Network and Connection Rate as it appears on the Tariff of Rates and Charges"]
[]
[null,null,"Rate Class",null,"Unit",null,"RTSR-Network",null,"RTSR-Connection"]
[]
[null,null,"Residential – High Density [R1]",null,"kWh",null,6.6E-3,null,6.0000000000000001E-3,null,null,{"$f":"IF(OR(ISBLANK(C17), ISERROR(FIND(\"Choose\", C17))=FALSE), 0, 1)","v":1},{"$f":"\"C\" & ROW(C17)","v":"C17"},{"$f":"IF(OR(C17=\"General Service Intermediate Rate Class 1,000 To 4,999 kW (formerly General Service > 50 kW Customers)\", C17=\"General Service Intermediate Rate Class 1,000 To 4,999 kW (formerly Large Use Customers)\"), \"x\", \"\")","v":""},null,null,null,null,null,null,null,null,"Choose Rate Class"]
[null,null,"General Service 50 to 4,999 kW",null,"kW",null,2.5066000000000002,null,2.2787000000000002,null,null,1,"C18",{"$f":"IF(OR(C18=\"General Service Intermediate Rate Class 1,000 To 4,999 kW (formerly General Service > 50 kW Customers)\", C18=\"General Service Intermediate Rate Class 1,000 To 4,999 kW (formerly Large Use Customers)\"), \"x\", \"\")","v":""},null,null,null,null,null,null,null,null,"Residential"]
[null,null,"Seasonal Residential – Normal Density [R4]",null,"kWh",null,6.6E-3,null,6.0000000000000001E-3,null,null,1,"C19","",null,null,null,null,null,null,null,null,"Residential Regular"]
[null,null,"Street Lighting",null,"kW",null,1.8149999999999999,null,1.6437999999999999,null,null,1,"C20","",null,null,null,null,null,null,null,null,"Residential Urban"]
[null,null,"Choose Rate Class",null,null,null,null,null,null,null,null,0,"C21","",null,null,null,null,null,null,null,null,"Residential Urban Year-Round"]
[null,null,"Choose Rate Class",null,null,null,null,null,null,null,null,0,"C22","",null,null,null,null,null,null,null,null,"Residential Suburban"]
[null,null,"Choose Rate Class",null,null,null,null,null,null,null,null,0,"C23","",null,null,null,null,null,null,null,null,"Residential Suburban Seasonal"]
[null,null,"Choose Rate Class",null,null,null,null,null,null,null,null,0,"C24","",null,null,null,null,null,null,null,null,"Residential Suburban Year Round"]
[null,null,"Choose Rate Class",null,null,null,null,null,null,null,null,0,"C25","",null,null,null,null,null,null,null,null,"Residential - Time of Use"]
[null,null,"Choose Rate Class",null,null,null,null,null,null,null,null,0,"C26","",null,null,null,null,null,null,null,null,"Residential - Hensall"]
[null,null,"Choose Rate Class",null,null,null,null,null,null,null,null,0,"C27","",null,null,null,null,null,null,null,null,"Residential – High Density [R1]"]
[null,null,"Choose Rate Class",null,null,null,null,null,null,null,null,0,"C28","",null,null,null,null,null,null,null,null,"Residential – Normal Density [R2]"]
[null,null,"Choose Rate Class",null,null,null,null,null,null,null,null,0,"C29","",null,null,null,null,null,null,null,null,"Seasonal Residential – High Density [R3]"]
[null,null,"Choose Rate Class",null,null,null,null,null,null,null,null,0,"C30","",null,null,null,null,null,null,null,null,"Seasonal Residential – Normal Density [R4]"]
{"$rows_left_out":71}
{"sheet":"4. RRR Data","index":3,"n_rows":24,"n_cols":9,"rows_kept":24,"cut":false,"hidden":false,"merged":[[12,1,12,8]]}
[]
[]
[]
[]
[]
[]
[]
[]
[]
[]
[]
[]
[]
[]
[null,"Rate Class","Rate Description","Unit","Rate","Non-Loss Adjusted Metered kWh","Non-Loss Adjusted Metered kW","Applicable \nLoss Factor\neg: (1.0325)","Loss Adjusted Billed kWh"]
[]
[null,"Residential – High Density [R1]","RTSR - Network","kWh",6.6E-3,103931742,null,1.0829,{"$f":"F17*H17","v":112547683.4118}]
[null,"Residential – High Density [R1]","RTSR - Connection","kWh",6.0000000000000001E-3,103931742,null,1.0829,{"$f":"F18*H18","v":112547683.4118}]
[null,"General Service 50 to 4,999 kW","RTSR - Network","kW",2.5066000000000002,85867987,196648]
[null,"General Service 50 to 4,999 kW","RTSR - Connection","kW",2.2787000000000002,85867987,196648]
[null,"Seasonal Residential – Normal Density [R4]","RTSR - Network","kWh",6.6E-3,5439365,null,1.0829,{"$f":"F21*H21","v":5890288.3585000001}]
[null,"Seasonal Residential – Normal Density [R4]","RTSR - Connection","kWh",6.0000000000000001E-3,5439365,null,1.0829,{"$f":"F22*H22","v":5890288.3585000001}]
[null,"Street Lighting","RTSR - Network","kW",1.8149999999999999,595435.11416171514,1655]
[null,"Street Lighting","RTSR - Connection","kW",1.6437999999999999,595435.11416171514,1655]

{"sheet":"5. UTRs and Sub-Transmission","index":4,"n_rows":75,"n_cols":10,"rows_kept":75,"cut":false,"hidden":false,"merged":[[69,4,69,5],[71,4,71,5],[74,4,74,5],[73,4,73,5],[50,4,50,5],[52,4,52,5],[54,4,54,5],[56,4,56,5],[65,4,65,5],[67,4,67,5],[48,4,48,5],[44,4,44,5],[59,4,59,5],[28,4,28,5],[17,4,17,5],[33,4,33,5],[19,4,19,5],[21,4,21,5],[23,4,23,5],[25,4,25,5],[35,4,35,5],[37,4,37,5],[38,4,39,5],[41,4,41,5]]}
[]
[]
[]
[]
[]
[]
[]
[]
[]
[]
[]
[]
[]
[]
[]
[]
[]
[null,"Uniform Transmission Rates","Unit",null,2017,null,null,2018,null,2019]
[]
[null,"Rate Description",null,null,"Rate",null,null,"Rate",null,"Rate"]
[]
[null,"Network Service Rate","kW",null,3.66,null,null,3.61,null,3.71]
[]
[null,"Line Connection Service Rate","kW",null,0.87,null,null,0.95,null,0.94]
[]
[null,"Transformation Connection Service Rate","kW",null,2.02,null,null,2.34,null,2.25]
[]
[]
[null,"Hydro One Sub-Transmission Rates","Unit",null,2017,null,null,2018,null,2019]
[]
{"$rows_left_out":46}
{"sheet":"6. Historical Wholesale","index":5,"n_rows":117,"n_cols":16,"rows_kept":117,"cut":false,"hidden":false,"merged":[[76,7,76,9],[76,11,76,13],[95,7,95,9],[95,11,95,13],[96,7,96,9],[96,11,96,13],[20,3,20,5],[20,7,20,9],[20,11,20,13],[96,3,96,5],[38,3,38,5],[38,7,38,9],[38,11,38,13],[95,3,95,5],[57,3,57,5],[57,7,57,9],[57,11,57,13],[76,3,76,5]]}
[]
[]
[]
[]
[]
[]
[]
[]
[]
[]
[]
[]
[]
[]
[]
[]
[]
[]
[]
[]
[null,"IESO",null,"Network",null,null,null,"Line Connection",null,null,null,"Transformation Connection",null,null,null,"Total Line"]
[null,"Month",null,"Units Billed","Rate","Amount",null,"Units Billed","Rate","Amount",null,"Units Billed","Rate","Amount",null,"Amount"]
[]
[null,"January",null,42655,3.61,153984.54999999999,null,20951,0.95000000000000007,19903.45,null,45847,2.34,107281.98,null,{"$f":"J24+N24","v":127185.43}]
[null,"February",null,37471,3.61,135270.31,null,21320,0.95,20254,null,41941,2.34,98141.94,null,118395.94]
[null,"March",null,34238,3.61,123599.18,null,19403,0.95,18432.849999999999,null,36453.000000000007,2.34,85300.02,null,103732.87]
[null,"April",null,41801,3.61,150901.60999999999,null,29417.000000000004,0.95,27946.15,null,47270.000000000007,2.34,110611.8,null,138557.95000000001]
[null,"May",null,33936,3.6100000000000003,122508.96,null,27048,0.95,25695.599999999999,null,40767,2.34,95394.78,null,121090.38]
[null,"June",null,28094.279778393353,3.61,101420.35,null,17040.852631578946,0.95000000000000007,16188.81,null,32018.119658119656,2.34,74922.399999999994,null,91111.209999999992]
[null,"July",null,27198,3.61,98184.78,null,16568,0.95000000000000007,15739.6,null,32935,2.34,77067.899999999994,null,92807.5]
{"$rows_left_out":88}
{"sheet":"7. Current Wholesale","index":6,"n_rows":117,"n_cols":16,"rows_kept":117,"cut":false,"hidden":false,"merged":[[96,7,96,9],[96,11,96,13],[20,3,20,5],[20,7,20,9],[20,11,20,13],[96,3,96,5],[95,3,95,5],[95,7,95,9],[95,11,95,13],[57,3,57,5],[57,7,57,9],[57,11,57,13],[76,3,76,5],[76,7,76,9],[76,11,76,13],[12,1,12,11],[19,3,19,5],[19,7,19,9],[19,11,19,13],[38,3,38,5],[38,7,38,9],[38,11,38,13]]}
[]
[]
[]
[]
[]
[]
[]
[]
[]
[]
[]
[]
[null,"The purpose of this sheet is to calculate the expected billing when current 2018 Uniform Transmission Rates are applied against historical 2017 transmission units."]
[]
[]
[]
[]
[]
[]
[null,"IESO",null,"Network",null,null,null,"Line Connection",null,null,null,"Transformation Connection",null,null,null,"Total Line"]
[]
[null,"Month",null,"Units Billed","Rate","Amount",null,"Units Billed","Rate","Amount",null,"Units Billed","Rate","Amount",null,"Amount"]
[]
[null,"January",null,{"$f":"'6. Historical Wholesale'!D24","v":42655},{"$f":"'5. UTRs and Sub-Transmission'!H22","v":3.61},{"$f":"D24*E24","v":153984.54999999999},null,{"$f":"'6. Historical Wholesale'!H24","v":20951},{"$f":"'5. UTRs and Sub-Transmission'!H24","v":0.95},{"$f":"H24*I24","v":19903.45},null,{"$f":"'6. Historical Wholesale'!L24","v":45847},{"$f":"'5. UTRs and Sub-Transmission'!H26","v":2.34},{"$f":"L24*M24","v":107281.98},null,{"$f":"J24+N24","v":127185.43}]
[null,"February",null,{"$f":"'6. Historical Wholesale'!D25","v":37471},{"$f":"E24","v":3.61},{"$f":"D25*E25","v":135270.31},null,{"$f":"'6. Historical Wholesale'!H25","v":21320},{"$f":"I24","v":0.95},{"$f":"H25*I25","v":20254},null,{"$f":"'6. Historical Wholesale'!L25","v":41941},{"$f":"M24","v":2.34},{"$f":"L25*M25","v":98141.939999999988},null,118395.93999999999]
[null,"March",null,{"$f":"'6. Historical Wholesale'!D26","v":34238},{"$f":"E25","v":3.61},123599.18,null,{"$f":"'6. Historical Wholesale'!H26","v":19403},{"$f":"I25","v":0.95},18432.849999999999,null,{"$f":"'6. Historical Wholesale'!L26","v":36453.000000000007},{"$f":"M25","v":2.34},85300.020000000019,null,103732.87000000002]
[null,"April",null,{"$f":"'6. Historical Wholesale'!D27","v":41801},3.61,150901.60999999999,null,{"$f":"'6. Historical Wholesale'!H27","v":29417.000000000004},0.95,27946.15,null,{"$f":"'6. Historical Wholesale'!L27","v":47270.000000000007},2.34,110611.80000000002,null,138557.95000000001]
[null,"May",null,{"$f":"'6. Historical Wholesale'!D28","v":33936},3.61,122508.95999999999,null,{"$f":"'6. Historical Wholesale'!H28","v":27048},0.95,25695.599999999999,null,{"$f":"'6. Historical Wholesale'!L28","v":40767},2.34,95394.78,null,121090.38]
[null,"June",null,{"$f":"'6. Historical Wholesale'!D29","v":28094.279778393353},3.61,101420.35,null,{"$f":"'6. Historical Wholesale'!H29","v":17040.852631578946},0.95,16188.809999999998,null,{"$f":"'6. Historical Wholesale'!L29","v":32018.119658119656},2.34,74922.399999999994,null,91111.209999999992]
[null,"July",null,{"$f":"'6. Historical Wholesale'!D30","v":27198},3.61,98184.78,null,{"$f":"'6. Historical Wholesale'!H30","v":16568},0.95,15739.599999999999,null,{"$f":"'6. Historical Wholesale'!L30","v":32935},2.34,77067.899999999994,null,92807.5]
{"$rows_left_out":88}
{"sheet":"8. Forecast Wholesale","index":7,"n_rows":117,"n_cols":16,"rows_kept":117,"cut":false,"hidden":false,"merged":[[96,7,96,9],[96,11,96,13],[20,3,20,5],[20,7,20,9],[20,11,20,13],[96,3,96,5],[95,3,95,5],[95,7,95,9],[95,11,95,13],[57,3,57,5],[57,7,57,9],[57,11,57,13],[76,3,76,5],[76,7,76,9],[76,11,76,13],[12,1,12,12],[19,3,19,5],[19,7,19,9],[19,11,19,13],[38,3,38,5],[38,7,38,9],[38,11,38,13]]}
[]
[]
[]
[]
[]
[]
[]
[]
[]
[]
[]
[]
[null,"The purpose of this sheet is to calculate the expected billing when forecasted 2019 Uniform Transmission Rates are applied against historical 2017 transmission units."]
[]
[]
[]
[]
[]
[]
[null,"IESO",null,"Network",null,null,null,"Line Connection",null,null,null,"Transformation Connection",null,null,null,"Total Line"]
[]
[null,"Month",null,"Units Billed","Rate","Amount",null,"Units Billed","Rate","Amount",null,"Units Billed","Rate","Amount",null,"Amount"]
[]
[null,"January",null,{"$f":"'6. Historical Wholesale'!D24","v":42655},{"$f":"'5. UTRs and Sub-Transmission'!J22","v":3.71},{"$f":"D24*E24","v":158250.04999999999},null,{"$f":"'6. Historical Wholesale'!H24","v":20951},{"$f":"'5. UTRs and Sub-Transmission'!J24","v":0.94},{"$f":"H24*I24","v":19693.939999999999},null,{"$f":"'6. Historical Wholesale'!L24","v":45847},{"$f":"'5. UTRs and Sub-Transmission'!J26","v":2.25},{"$f":"L24*M24","v":103155.75},null,{"$f":"J24+N24","v":122849.69}]
[null,"February",null,{"$f":"'6. Historical Wholesale'!D25","v":37471},{"$f":"E24","v":3.71},139017.41,null,{"$f":"'6. Historical Wholesale'!H25","v":21320},{"$f":"I24","v":0.94},20040.8,null,{"$f":"'6. Historical Wholesale'!L25","v":41941},{"$f":"M24","v":2.25},94367.25,null,114408.05]
[null,"March",null,{"$f":"'6. Historical Wholesale'!D26","v":34238},3.71,127022.98,null,{"$f":"'6. Historical Wholesale'!H26","v":19403},0.94,18238.82,null,{"$f":"'6. Historical Wholesale'!L26","v":36453.000000000007},2.25,82019.250000000015,null,100258.07]
[null,"April",null,{"$f":"'6. Historical Wholesale'!D27","v":41801},3.71,155081.71,null,{"$f":"'6. Historical Wholesale'!H27","v":29417.000000000004},0.94,27651.980000000003,null,{"$f":"'6. Historical Wholesale'!L27","v":47270.000000000007},2.25,106357.50000000001,null,134009.48000000001]
[null,"May",null,{"$f":"'6. Historical Wholesale'!D28","v":33936},3.71,125902.56,null,{"$f":"'6. Historical Wholesale'!H28","v":27048},0.94,25425.119999999999,null,{"$f":"'6. Historical Wholesale'!L28","v":40767},2.25,91725.75,null,117150.87]
[null,"June",null,{"$f":"'6. Historical Wholesale'!D29","v":28094.279778393353},3.71,104229.77797783935,null,{"$f":"'6. Historical Wholesale'!H29","v":17040.852631578946},0.94,16018.401473684209,null,{"$f":"'6. Historical Wholesale'!L29","v":32018.119658119656},2.25,72040.76923076922,null,88059.170704453427]
[null,"July",null,{"$f":"'6. Historical Wholesale'!D30","v":27198},3.71,100904.58,null,{"$f":"'6. Historical Wholesale'!H30","v":16568},0.94,15573.919999999998,null,{"$f":"'6. Historical Wholesale'!L30","v":32935},2.25,74103.75,null,89677.67]
{"$rows_left_out":88}
{"sheet":"9. RTSR Rates to Forecast","index":8,"n_rows":44,"n_cols":10,"rows_kept":44,"cut":false,"hidden":false,"merged":[]}
[]
[]
[]
[]
[]
[]
[]
[]
[]
[]
[]
[]
["The purpose of this sheet is to re-align the current RTS Network Rates to recover current wholesale network costs."]
[]
["Rate Class","Rate Description","Unit","Current RTSR-Network","Loss Adjusted Billed kWh","Billed kW","Billed Amount","Billed Amount %","Current Wholesale Billing","Adjusted RTSR Network"]
[]
["Residential – High Density [R1]","RTSR - Network","kWh",6.6E-3,112547683.4118,null,{"$f":"ROUND(D17*E17, 2)","v":742814.71},{"$f":"G17/1277612.32","v":0.58140853713746277},{"$f":"H17*total_current_wholesale_network","v":862673.73113113351},{"$f":"IF(ISERROR(I17/E17), 0, I17/E17)","v":7.664962129648659E-3}]
["General Service 50 to 4,999 kW","RTSR - Network","kW",2.5066000000000002,null,196648,{"$f":"ROUND(D18*F18, 2)","v":492917.88},{"$f":"G18/1277612.32","v":0.38581177739425682},{"$f":"H18*total_current_wholesale_network","v":572454.07361527393},{"$f":"IF(ISERROR(I18/F18), 0, I18/F18)","v":2.9110597291367006}]
["Seasonal Residential – Normal Density [R4]","RTSR - Network","kWh",6.6E-3,5890288.3585000001,null,{"$f":"ROUND(D19*E19, 2)","v":38875.9},{"$f":"G19/1277612.32","v":3.0428557545531497E-2},{"$f":"H19*total_current_wholesale_network","v":45148.833555114754},{"$f":"IF(ISERROR(I19/E19), 0, I19/E19)","v":7.664961510748889E-3}]
["Street Lighting","RTSR - Network","kW",1.8149999999999999,null,1655,{"$f":"ROUND(D20*F20, 2)","v":3003.83},{"$f":"G20/1277612.32","v":2.3511279227488974E-3},{"$f":"H20*total_current_wholesale_network","v":3488.5216984779859},{"$f":"IF(ISERROR(I20/F20), 0, I20/F20)","v":2.107868095757091}]
[]
["The purpose of this table is to re-align the current RTS Connection Rates to recover current wholesale connection costs."]
["Rate Class","Rate Description","Unit","Current RTSR-Connection","Loss Adjusted Billed kWh","Billed kW","Billed Amount","Billed Amount %","Current Wholesale Billing","Adjusted RTSR-Connection"]
[]
["Residential – High Density [R1]","RTSR - Connection","kWh",6.0000000000000001E-3,112547683.4118,null,{"$f":"ROUND(D25*E25, 2)","v":675286.1},{"$f":"G25/1161450.12","v":0.58141635905982769},{"$f":"H25*Total_Current_Wholesale_Lineplus","v":776399.68991520791},{"$f":"IF(ISERROR(I25/E25), 0, I25/E25)","v":6.8984066697707503E-3}]
["General Service 50 to 4,999 kW","RTSR - Connection","kW",2.2787000000000002,null,196648,{"$f":"ROUND(D26*F26, 2)","v":448101.8},{"$f":"G26/1161450.12","v":0.38581234982351198},{"$f":"H26*Total_Current_Wholesale_Lineplus","v":515198.07466856868},{"$f":"IF(ISERROR(I26/F26), 0, I26/F26)","v":2.6198998955929818}]
["Seasonal Residential – Normal Density [R4]","RTSR - Connection","kWh",6.0000000000000001E-3,5890288.3585000001,null,{"$f":"ROUND(D27*E27, 2)","v":35341.730000000003},{"$f":"G27/1161450.12","v":3.0428969261288637E-2},{"$f":"H27*Total_Current_Wholesale_Lineplus","v":40633.604353868686},{"$f":"IF(ISERROR(I27/E27), 0, I27/E27)","v":6.898406645106301E-3}]
["Street Lighting","RTSR - Connection","kW",1.6437999999999999,null,1655,{"$f":"ROUND(D28*F28, 2)","v":2720.49},{"$f":"G28/1161450.12","v":2.3423218553716278E-3},{"$f":"H28*Total_Current_Wholesale_Lineplus","v":3127.8410623547916},{"$f":"IF(ISERROR(I28/F28), 0, I28/F28)","v":1.8899341766494209}]
[]
["The purpose of this table is to update the re-aligned RTS Network Rates to recover future wholesale network costs."]
{"$rows_left_out":15}
{"sheet":"hidden1","index":9,"n_rows":22,"n_cols":2,"rows_kept":22,"cut":false,"hidden":true,"merged":[]}
[{"$f":"IF('3. Rate Classes'!L17=1, '3. Rate Classes'!C17, \"\")","v":"Residential – High Density [R1]"},1]
[{"$f":"IF('3. Rate Classes'!L18=1, '3. Rate Classes'!C18, \"\")","v":"General Service 50 to 4,999 kW"},2]
[{"$f":"IF('3. Rate Classes'!L19=1, '3. Rate Classes'!C19, \"\")","v":"Seasonal Residential – Normal Density [R4]"},3]
[{"$f":"IF('3. Rate Classes'!L20=1, '3. Rate Classes'!C20, \"\")","v":"Street Lighting"},4]
[{"$f":"IF('3. Rate Classes'!L21=1, '3. Rate Classes'!C21, \"\")","v":""},5]
[{"$f":"IF('3. Rate Classes'!L22=1, '3. Rate Classes'!C22, \"\")","v":""},6]
[{"$f":"IF('3. Rate Classes'!L23=1, '3. Rate Classes'!C23, \"\")","v":""},7]
[{"$f":"IF('3. Rate Classes'!L24=1, '3. Rate Classes'!C24, \"\")","v":""},8]
[{"$f":"IF('3. Rate Classes'!L25=1, '3. Rate Classes'!C25, \"\")","v":""},9]
[{"$f":"IF('3. Rate Classes'!L26=1, '3. Rate Classes'!C26, \"\")","v":""},10]
[{"$f":"IF('3. Rate Classes'!L27=1, '3. Rate Classes'!C27, \"\")","v":""},11]
[{"$f":"IF('3. Rate Classes'!L28=1, '3. Rate Classes'!C28, \"\")","v":""},12]
[{"$f":"IF('3. Rate Classes'!L29=1, '3. Rate Classes'!C29, \"\")","v":""},13]
[{"$f":"IF('3. Rate Classes'!L30=1, '3. Rate Classes'!C30, \"\")","v":""},14]
[{"$f":"IF('3. Rate Classes'!L31=1, '3. Rate Classes'!C31, \"\")","v":""},15]
[{"$f":"IF('3. Rate Classes'!L32=1, '3. Rate Classes'!C32, \"\")","v":""},16]
[{"$f":"IF('3. Rate Classes'!L33=1, '3. Rate Classes'!C33, \"\")","v":""},17]
[{"$f":"IF('3. Rate Classes'!L34=1, '3. Rate Classes'!C34, \"\")","v":""},18]
[{"$f":"IF('3. Rate Classes'!L35=1, '3. Rate Classes'!C35, \"\")","v":""},19]
[{"$f":"IF('3. Rate Classes'!L36=1, '3. Rate Classes'!C36, \"\")","v":""},20]
[{"$f":"IF('3. Rate Classes'!L37=1, '3. Rate Classes'!C37, \"\")","v":""},21]
[{"$f":"IF('3. Rate Classes'!L38=1, '3. Rate Classes'!C38, \"\")","v":""},22]