{"text_format":"1","workbook":"xlsx","n_sheets":28,"sheets":["INDEX","Model Specs","1. Information Sheet","2. Current Tariff","3. Continuity Schedule","4. Billing Det. for Def-Var","5. Allocating Def-Var Balances","6. Class A Consumption Data","6.1a GA Allocation","6.1 GA","6.2a CBR B_Allocation","6.2 CBR B","8. Calculation of Def-Var RR","9. STS-Tax Change","10. Shared Tax - RR","11. RTSR - Current Rates","12. RTSR-UTRs & Sub-Tx","13. RTSR-Historic Wholesale","14. RTSR-Current Wholesale","15. RTSR-Forecast Wholesale","16. RTSR-Rates to Forecast","17. Rev2Cost-GDPIPI","18. Regulatory Charges","19. Additional Rates","20. Final Tariff Schedule","21. Bill Impacts","RATES","BoD Reporting"],"not_rendered":{"charts":0,"images":0,"macros":1,"external_links":21,"defined_names":214,"comments":2,"pivot_tables":0},"unopened":[],"bounds":{"document_bytes":16777216,"sheet_cells":100000,"rows_first":2000,"rows_last":500,"rows_between":2000,"halvings":0,"cell_chars":16384,"cell_head_chars":4096},"cells_cut":0,"cells_raw":0,"read":"whole","date_system":"1900"}

{"sheet":"INDEX","index":0,"n_rows":28,"n_cols":1,"rows_kept":28,"cut":false,"hidden":false,"merged":[]}
["INDEX"]
["Model Specs"]
["1. Information Sheet"]
["2. Current Tariff"]
["3. Continuity Schedule"]
["4. Billing Det. for Def-Var"]
["5. Allocating Def-Var Balances"]
["6. Class A Consumption Data"]
["6.1a GA Allocation"]
["6.1 GA"]
["6.2a CBR B_Allocation"]
["6.2 CBR B"]
["8. Calculation of Def-Var RR"]
["9. STS-Tax Change"]
["10. Shared Tax - RR"]
["11. RTSR - Current Rates"]
["12. RTSR-UTRs & Sub-Tx"]
["13. RTSR-Historic Wholesale"]
["14. RTSR-Current Wholesale"]
["15. RTSR-Forecast Wholesale"]
["16. RTSR-Rates to Forecast"]
["17. Rev2Cost-GDPIPI"]
["18. Regulatory Charges"]
["19. Additional Rates"]
["20. Final Tariff Schedule"]
["21. Bill Impacts"]
["RATES"]
["BoD Reporting"]

{"sheet":"Model Specs","index":1,"n_rows":40,"n_cols":14,"rows_kept":40,"cut":false,"hidden":false,"merged":[]}
["Back to Index",null,null,null,null,null,null,null,null,null,"Lists:"]
[null,"Model Specifications"]
[null,null,null,null,null,null,null,null,null,null,"Yes"]
[null,"Utility","Enersource rate zone",null,null,null,null,null,null,null,"No"]
[]
[null,"Applying for Rates Effective","2020-01-01",null,null,null,null,null,null,null,"kWh"]
[null,null,null,null,null,null,null,null,null,null,"kW"]
[null,null,null,null,null,null,null,null,null,null,"kVA"]
[null,"Line Loss Factor",1.036]
[null,null,null,null,null,null,null,null,null,null,"Alectra - PowerStream rate zone","PowerStream rate zone"]
[null,null,null,null,null,null,null,null,null,null,"Alectra - Enersource rate zone","Enersource rate zone"]
[null,null,null,null,null,null,null,null,null,null,"Alectra - Horizon rate zone","Horizon rate zone"]
[null,null,null,null,null,null,null,null,null,null,"Alectra - Brampton rate zone","Brampton rate zone"]
[null,null,"Rate Classes (select from the List)",null,null,null,null,null,null,null,"Alectra - Guelph rate zone","Guelph rate zone"]
[null,{"$f":"IFERROR(VLOOKUP(C15,$K$16:$L$31,2,FALSE),\"\")","v":"R"},"RESIDENTIAL SERVICE CLASSIFICATION"]
[null,"GSL","GENERAL SERVICE LESS THAN 50 kW SERVICE CLASSIFICATION",null,null,null,null,null,null,null,"RESIDENTIAL SERVICE CLASSIFICATION","R","R_TN","R_TC"]
[null,"GS50_499","GENERAL SERVICE 50 to 499 kW SERVICE CLASSIFICATION",null,null,null,null,null,null,null,"GENERAL SERVICE LESS THAN 50 kW SERVICE CLASSIFICATION","GSL","GSL_TN","GSL_TC"]
[null,"GS500","GENERAL SERVICE 500 to 4,999 kW SERVICE CLASSIFICATION",null,null,null,null,null,null,null,"GENERAL SERVICE 50 to 499 kW SERVICE CLASSIFICATION","GS50_499","GS50_499_TN","GS50_499_TC"]
[null,"LU","LARGE USE SERVICE CLASSIFICATION",null,null,null,null,null,null,null,"GENERAL SERVICE 50 to 699 KW SERVICE CLASSIFICATION","GS50_699","GS50_699_TN","GS50_699_TC"]
[null,"SB","STANDBY POWER SERVICE CLASSIFICATION ",null,null,null,null,null,null,null,"GENERAL SERVICE 50 to 4,999 kW SERVICE CLASSIFICATION","GS50","GS50_TN","GS50_TC"]
[null,"USL","UNMETERED SCATTERED LOAD SERVICE CLASSIFICATION",null,null,null,null,null,null,null,"GENERAL SERVICE 500 to 4,999 kW SERVICE CLASSIFICATION","GS500","GS500_TN","GS500_TC"]
[null,"SL","STREET LIGHTING SERVICE CLASSIFICATION",null,null,null,null,null,null,null,"GENERAL SERVICE 700 to 4,999 KW SERVICE CLASSIFICATION","GS700","GS700_TN","GS700_TC"]
[null,"",null,null,null,null,null,null,null,null,"LARGE USE SERVICE CLASSIFICATION","LU","LU_TN","LU_TC"]
[null,{"$f":"IFERROR(VLOOKUP(C24,$K$16:$L$31,2,FALSE),\"\")","v":""},null,null,null,null,null,null,null,null,"LARGE USE SERVICE WITH DEDICATED ASSETSCLASSIFICATION","LU_DA","LU_DA_TN","LU_DA_TC"]
[null,"",null,null,null,null,null,null,null,null,"UNMETERED SCATTERED LOAD SERVICE CLASSIFICATION","USL","USL_TN","USL_TC"]
[null,"",null,null,null,null,null,null,null,null,"STREET LIGHTING SERVICE CLASSIFICATION","SL","SL_TN","SL_TC"]
[null,"",null,null,null,null,null,null,null,null,"STANDBY POWER SERVICE CLASSIFICATION ","SB","SB","SB"]
[null,"",null,null,null,null,null,null,null,null,"SENTINEL LIGHTING SERVICE CLASSIFICATION","SEN","SEN_TN","SEN_TC"]
[null,"",null,null,null,null,null,null,null,null,"EMBEDDED DISTRIBUTOR SERVICE CLASSIFICATION","EMB","EMB","EMB"]
[null,"",null,null,null,null,null,null,null,null,"DISTRIBUTED GENERATION [DGEN] SERVICE CLASSIFICATION","DG","DG","DG"]
[null,"",null,null,null,null,null,null,null,null,"ENERGY FROM WASTE SERVICE CLASSIFICATION","WST","WST","WST"]
[]
[]
[null,"Have one or more Class A customers","Yes"]
[]
[null,null,null,null,null,null,null,null,null,null,"Newer Disposed"]
[null,null,null,null,null,null,null,null,null,null,2015]
[null,null,null,null,null,null,null,null,null,null,2016]
[null,null,null,null,null,null,null,null,null,null,2017]
[null,null,null,null,null,null,null,null,null,null,2018]

{"sheet":"1. Information Sheet","index":2,"n_rows":44,"n_cols":22,"rows_kept":44,"cut":false,"hidden":false,"merged":[[25,6,25,8],[29,6,29,8],[43,1,43,7],[27,6,27,8],[29,1,29,5],[31,1,31,5],[31,6,31,8],[36,3,36,12],[38,3,38,14],[40,3,40,13],[1,1,8,14],[13,6,13,12],[15,6,15,10],[23,6,23,10],[19,6,19,11],[21,6,21,8],[17,6,17,8]]}
["Back to Index",null,null,null,null,null,null,null,null,null,null,null,null,null,null,null,null,null,null,null,null,"a"]
[null,"INCENTIVE REGULATION MODEL FOR 2020 FILERS"]
[]
[]
[]
[]
[]
[]
[]
[]
[]
[null,null,null,null,null,null,null,null,null,null,null,null,null,"Version",1]
[]
[null,null,null,null,null,"Utility Name   ","Alectra - Enersource rate zone"]
[]
[null,null,null,null,null,"Service Territory"]
[]
[null,null,null,null,null,"Assigned EB Number","EB-2019-0018"]
[]
[null,null,null,null,null,"Name of Contact and Title","Indy J. Butany-DeSouza, Vice-President, Regulatory Affairs"]
[]
[null,null,null,null,null,"Phone Number   ","905-821-5727"]
[]
[null,null,null,null,null,"Email Address   ","indy.butany@alectrautilities.com"]
[]
[null,null,null,null,null,"We are applying for rates effective   ","2020-01-01"]
[]
[null,null,null,null,null,"Rate-Setting Method","Price Cap IR"]
[]
[null,"Please indicate in which Rate Year the Group 1 accounts were last cleared1",null,null,null,null,2019]
[]
[null,"Please indicate the last Cost of Service \nRe-Basing Year",null,null,null,null,2017]
[]
[]
[null,null,"Notes"]
[]
[null,null,null,"Pale gray cells represent input cells."]
[]
[null,null,null,"Pale blue cells represent drop-down lists.  "]
[]
[null,null,null,"White cells contain fixed values, automatically generated values or formulae. "]
[]
[]
[null,"Note:  \n1.  Rate year of application"]

{"sheet":"2. Current Tariff","index":3,"n_rows":441,"n_cols":5,"rows_kept":441,"cut":false,"hidden":false,"merged":[[6,1,6,4],[7,1,7,4],[9,1,9,4],[11,1,11,4],[13,1,13,4],[15,1,15,4],[0,1,0,4],[1,1,1,4],[2,1,2,4],[3,1,3,4],[4,1,4,4],[5,1,5,4],[27,1,27,2],[28,1,28,2],[29,1,29,2],[30,1,30,2],[31,1,31,2],[32,1,32,2],[17,1,17,4],[19,1,19,4],[21,1,21,4],[23,1,23,4],[25,1,25,2],[26,1,26,2],[39,1,39,2],[40,1,40,2],[42,1,42,2],[44,1,44,2],[45,1,45,2],[46,1,46,2],[33,1,33,2],[34,1,34,2],[35,1,35,2],[36,1,36,2],[37,1,37,2],[38,1,38,2],[60,1,60,4],[62,1,62,4],[64,1,64,4],[66,1,66,2],[67,1,67,2],[68,1,68,2],[47,1,47,2],[50,1,50,4],[52,1,52,4],[54,1,54,4],[56,1,56,4],[58,1,58,4],[75,1,75,2],[76,1,76,2],[77,1,77,2],[78,1,78,2],[79,1,79,2],[80,1,80,2],[69,1,69,2],[70,1,70,2],[71,1,71,2],[72,1,72,2],[73,1,73,2],[74,1,74,2],[89,1,89,2],[90,1,90,2],[91,1,91,2],[92,1,92,2],[95,1,95,4],[97,1,97,4],[81,1,81,2],[82,1,82,2],[83,1,83,2],[84,1,84,2],[85,1,85,2],[87,1,87,2],[111,1,111,4],[113,1,113,2],[114,1,114,2],[115,1,115,2],[116,1,116,2],[117,1,117,2],[99,1,99,4],[101,1,101,4],[103,1,103,4],[105,1,105,4],[107,1,107,4],[109,1,109,4],[124,1,124,2],[125,1,125,2],[126,1,126,2],[127,1,127,2],[128,1,128,2],[129,1,129,2],[118,1,118,2],[119,1,119,2],[120,1,120,2],[121,1,121,2],[122,1,122,2],[123,1,123,2],[138,1,138,2],[139,1,139,2],[140,1,140,2],[142,1,142,4],[143,1,143,4],[145,1,145,4],[130,1,130,2],[131,1,131,2],[132,1,132,2],[133,1,133,2],[135,1,135,2],[137,1,137,2],[159,1,159,4],[161,1,161,4],[163,1,163,2],[164,1,164,2],[165,1,165,2],[166,1,166,2],[147,1,147,4],[149,1,149,4],[151,1,151,4],[153,1,153,4],[155,1,155,4],[157,1,157,4],[173,1,173,2],[174,1,174,2],[175,1,175,2],[176,1,176,2],[177,1,177,2],[178,1,178,2],[167,1,167,2],[168,1,168,2],[169,1,169,2],[170,1,170,2],[171,1,171,2],[172,1,172,2],[187,1,187,2],[188,1,188,2],[189,1,189,2],[190,1,190,2],[193,1,193,4],[195,1,195,4],[179,1,179,2],[180,1,180,2],[181,1,181,2],[182,1,182,2],[183,1,183,2],[185,1,185,2],[209,1,209,4],[211,1,211,2],[212,1,212,2],[213,1,213,2],[214,1,214,2],[215,1,215,2],[197,1,197,4],[199,1,199,4],[201,1,201,4],[203,1,203,4],[205,1,205,4],[207,1,207,4],[222,1,222,2],[223,1,223,2],[224,1,224,2],[225,1,225,2],[226,1,226,2],[228,1,228,2],[216,1,216,2],[217,1,217,2],[218,1,218,2],[219,1,219,2],[220,1,220,2],[221,1,221,2],[240,1,240,4],[242,1,242,4],[244,1,244,4],[246,1,246,4],[248,1,248,4],[250,1,250,4],[230,1,230,2],[231,1,231,2],[232,1,232,2],[233,1,233,2],[236,1,236,4],[238,1,238,4],[258,1,258,2],[259,1,259,2],[260,1,260,2],[261,1,261,2],[262,1,262,2],[263,1,263,2],[252,1,252,2],[253,1,253,2],[254,1,254,2],[255,1,255,2],[256,1,256,2],[257,1,257,2],[272,1,272,2],[273,1,273,2],[274,1,274,2],[275,1,275,2],[278,1,278,4],[280,1,280,4],[264,1,264,2],[265,1,265,2],[266,1,266,2],[267,1,267,2],[268,1,268,2],[270,1,270,2],[294,1,294,2],[295,1,295,2],[296,1,296,2],[297,1,297,2],[298,1,298,2],[299,1,299,2],[282,1,282,4],[284,1,284,4],[286,1,286,4],[288,1,288,4],[290,1,290,4],[292,1,292,4],[306,1,306,2],[307,1,307,2],[308,1,308,2],[309,1,309,2],[310,1,310,2],[311,1,311,2],[300,1,300,2],[301,1,301,2],[302,1,302,2],[303,1,303,2],[304,1,304,2],[305,1,305,2],[323,1,323,4],[325,1,325,4],[327,1,327,4],[329,1,329,4],[331,1,331,4],[333,1,333,4],[313,1,313,2],[315,1,315,2],[316,1,316,2],[317,1,317,2],[318,1,318,2],[321,1,321,4],[350,1,350,4],[352,1,352,4],[354,1,354,4],[356,1,356,4],[358,1,358,2],[365,1,365,2],[335,1,335,4],[337,1,337,4],[342,1,342,4],[344,1,344,4],[346,1,346,4],[348,1,348,4],[381,1,381,2],[382,1,382,2],[383,1,383,2],[384,1,384,2],[385,1,385,2],[386,1,386,2],[366,1,366,2],[371,1,371,4],[373,1,373,4],[375,1,375,4],[377,1,377,4],[380,1,380,2],[395,1,395,2],[396,1,396,2],[397,1,397,2],[398,1,398,2],[401,1,401,2],[402,1,402,2],[387,1,387,2],[388,1,388,2],[389,1,389,2],[390,1,390,2],[393,1,393,2],[394,1,394,2],[418,1,418,2],[419,1,419,2],[420,1,420,2],[421,1,421,2],[422,1,422,2],[423,1,423,2],[407,1,407,4],[409,1,409,4],[411,1,411,4],[413,1,413,4],[415,1,415,4],[417,1,417,2],[436,1,436,4],[437,1,437,2],[438,1,438,2],[439,1,439,2],[440,1,440,2],[424,1,424,2],[425,1,425,2],[426,1,426,2],[427,1,427,2],[428,1,428,2],[429,1,429,2]]}
["Back to Index","Alectra Utilities Corporation"]
[null,"Enersource Rate Zone"]
[null,"TARIFF OF RATES AND CHARGES"]
[null,"Effective Date January 1, 2019"]
[null,"Implementation Date February 1, 2019"]
[null,"This schedule supersedes and replaces all previously "]
[null,"approved schedules of Rates, Charges and Loss Factors"]
[null,"EB-2018-0016"]
[]
[null,"RESIDENTIAL SERVICE CLASSIFICATION"]
[]
[null,"This classification refers to all residential services including, without limitation, single family or single unit dwellings, multifamily dwellings, row-type dwellings and subdivision developments.  Energy is supplied in single phase, 3-wire, or three phase, 4 wire, having a nominal voltage of 120/240 volts.  There shall be only one delivery point to a dwelling.  Class B consumers are defined in accordance with O. Reg. 429/04.  Further servicing details are available in the distributor’s Conditions of Service."]
[]
[null,"APPLICATION"]
[]
[null,"The application of these rates and charges shall be in accordance with the Licence of the Distributor and any Code or Order of the Ontario Energy Board, and amendments thereto as approved by the Ontario Energy Board, which may be applicable to the administration of this schedule."]
[]
[null,"No rates and charges for the distribution of electricity and charges to meet the costs of any work or service done or furnished for the purpose of the distribution of electricity shall be made except as permitted by this schedule, unless required by the Distributor’s Licence or a Code or Order of the Ontario Energy Ontario Energy Board, and amendments thereto as approved by the Ontario Energy Board, or as specified herein."]
[]
[null,"Unless specifically noted, this schedule does not contain any charges for the electricity commodity, be it under the Regulated Price Plan, a contract with a retailer or the wholesale market price, as applicable. In addition, the charges in the MONTHLY RATES AND CHARGES - Regulatory Component of this schedule do not apply to a customer that is an embedded wholesale market participant."]
[]
[null,"It should be noted that this schedule does not list any charges, assessments, or credits that are required by law to be invoiced by a distributor and that are not subject to Ontario Energy Board approval, such as the Global Adjustment and the HST."]
[]
[null,"MONTHLY RATES AND CHARGES - Delivery Component"]
[]
["R_F","Service Charge",null,"$",24.25]
["R_FRR19","Rate Rider for Recovery of 2019 Foregone Revenue - effective until December 31, 2019",null,"$",0.03]
["R_ICMF19","Rate Rider for Recovery of Incremental Capital (2019) - in effect from March 1, 2019 until the effective date of the next cost of service based rate order",null,"$",0.12]
["R_ICMF18","Rate Rider for Recovery of Incremental Capital (2018) - in effect until the effective date of the next cost of service based rate order",null,"$",0.16]
["R_ICMF17","Rate Rider for Recovery of Incremental Capital (2017) - in effect until the effective date of the next cost of service based rate order",null,"$",0.6]
["R_SME","Smart Metering Entity Charge - effective until December 31, 2022",null,"$",0.56999999999999995]
["R_LV","Low Voltage Service Rate ",null,"$/kWh",2.0000000000000001E-4]
["R_GA19","Rate Rider for Disposition of Global Adjustment Account (2019) - effective until December 31, 2019\n        Applicable only for Non-RPP Customers - Approved on an Interim Basis",null,"$/kWh",1.9E-3]
["R_GA18","Rate Rider for Disposition of Global Adjustment Account (2018) - effective until  April 30, 2019 - Applicable only for Non-RPP Customers ",null,"$/kWh",-5.0000000000000001E-4]
["R_DVA19","Rate Rider for Disposition of Deferral/Variance Accounts (2019) - effective until December 31, 2019 - Approved on an Interim Basis",null,"$/kWh",-4.0000000000000002E-4]
["R_DVA18","Rate Rider for Disposition of Deferral/Variance Accounts (2018) - effective until April 30, 2019",null,"$/kWh",-6.9999999999999999E-4]
["R_CBR18","Rate Rider for Disposition of Capacity Based Recovery Account (2018) - effective until April 30, 2019 -Applicable Only for Class  B Customers",null,"$/kWh",-5.0000000000000002E-5]
["R_LRV19","Rate Rider for Disposition of Lost Revenue Adjustment Mechanism Variance Account (LRAMVA) (2019) - effective until December 31, 2019",null,"$/kWh",2.0000000000000001E-4]
["R_LRV18","Rate Rider for Disposition of Lost Revenue Adjustment Mechanism Variance Account (LRAMVA) (2018) - effective until April 30, 2019",null,"$/kWh",-2.0000000000000001E-4]
["R_TN","Retail Transmission Rate - Network Service Rate",null,"$/kWh",7.6E-3]
["R_TC","Retail Transmission Rate - Line and Transformation Connection Service Rate",null,"$/kWh",7.3000000000000001E-3]
[null," -"]
[null,"MONTHLY RATES AND CHARGES - Regulatory Component"]
[]
[null,"Wholesale Market Service Rate (WMS) - not including CBR",null,"$/kWh",3.0000000000000001E-3]
[null,"Capacity Based Recovery (CBR) - Applicable for Class B Customers ",null,"$/kWh",4.0000000000000002E-4]
[null,"Rural or Remote Electricity Rate Protection Charge (RRRP)",null,"$/kWh",5.0000000000000001E-4]
[null,"Standard Supply Service - Administrative Charge (if applicable)",null,"$",0.25]
[]
[]
[null,"GENERAL SERVICE LESS THAN 50 KW SERVICE CLASSIFICATION"]
[]
[null,"This classification refers to a non-residential account whose monthly average peak demand is less than, or is forecast to be less than, 50 kW.  Class B consumers are defined in accordance with O. Reg. 429/04.  Further servicing details are available in the distributor’s Conditions of Service."]
[]
[null,"APPLICATION"]
[]
[null,"The application of these rates and charges shall be in accordance with the Licence of the Distributor and any Code or Order of the Ontario Energy Board, and amendments thereto as approved by the Ontario Energy Board, which may be applicable to the administration of this schedule."]
[]
[null,"No rates and charges for the distribution of electricity and charges to meet the costs of any work or service done or furnished for the purpose of the distribution of electricity shall be made except as permitted by this schedule, unless required by the Distributor’s Licence or a Code or Order of the Ontario Energy Board, and amendments thereto as approved by the Ontario Energy Board, or as specified herein."]
[]
[null,"Unless specifically noted, this schedule does not contain any charges for the electricity commodity, be it under the Regulated Price Plan, a contract with a retailer or the wholesale market price, as applicable. In addition, the charges in the MONTHLY RATES AND CHARGES - Regulatory Component of this schedule do not apply to a customer that is an embedded wholesale market participant."]
[]
[null,"It should be noted that this schedule does not list any charges, assessments, or credits that are required by law to be invoiced by a distributor and that are not subject to Ontario Energy Board approval, such as the Global Adjustment and the HST."]
[]
[null,"MONTHLY RATES AND CHARGES - Delivery Component"]
[]
["GSL_F","Service Charge",null,"$",44.52]
["GSL_FRR19","Rate Rider for Recovery of 2019 Foregone Revenue - effective until December 31, 2019",null,"$",0.1]
["GSL_ICMF19","Rate Rider for Recovery of Incremental Capital (2019) - in effect from March 1, 2019 until the effective date of the next cost of service based rate order",null,"$",0.21]
["GSL_ICMF18","Rate Rider for Recovery of Incremental Capital (2018) - in effect until the effective date of the next cost of service based rate order",null,"$",0.28999999999999998]
["GSL_ICMF17","Rate Rider for Recovery of Incremental Capital (2017) - in effect until the effective date of the next cost of service based rate order",null,"$",1.1000000000000001]
["GSL_SME","Smart Metering Entity Charge - effective until December 31, 2022",null,"$",0.56999999999999995]
["GSL_V","Distribution Volumetric Rate",null,"$/kWh",1.2999999999999999E-2]
["GSL_LV","Low Voltage Service Rate ",null,"$/kWh",2.0000000000000001E-4]
["GSL_GA19","Rate Rider for Disposition of Global Adjustment Account (2019) - effective until December 31, 2019\n        Applicable only for Non-RPP Customers  - Approved on an Interim Basis",null,"$/kWh",1.9E-3]
["GSL_GA18","Rate Rider for Disposition of Global Adjustment Account (2018) - effective until  April 30, 2019 - Applicable only for Non-RPP Customers ",null,"$/kWh",-5.0000000000000001E-4]
["GSL_DVA19","Rate Rider for Disposition of Deferral/Variance Accounts (2019) - effective until December 31, 2019 - Approved on an Interim Basis",null,"$/kWh",-4.0000000000000002E-4]
["GSL_DVA18","Rate Rider for Disposition of Deferral/Variance Accounts (2018) - effective until April 30, 2019",null,"$/kWh",-6.9999999999999999E-4]
["GSL_CBR18","Rate Rider for Disposition of Capacity Based Recovery Account (2018) - effective until April 30, 2019 - Applicable Only for Class  B Customers",null,"$/kWh",-5.0000000000000002E-5]
["GSL_LRV19","Rate Rider for Disposition of Lost Revenue Adjustment Mechanism Variance Account (LRAMVA) (2019) - effective until December 31, 2019",null,"$/kWh",2.9999999999999997E-4]
["GSL_LRV18","Rate Rider for Disposition of Lost Revenue Adjustment Mechanism Variance Account (LRAMVA) (2018) - effective until April 30, 2019",null,"$/kWh",5.9999999999999995E-4]
["GSL_ICMV19","Rate Rider for Recovery of Incremental Capital (2019) - in effect from March 1, 2019 until the effective date of the next cost of service based rate order",null,"$/kWh",1E-4]
["GSL_ICMV18","Rate Rider for Recovery of Incremental Capital (2018) - in effect until the effective date of the next cost of service based rate order",null,"$/kWh",1E-4]
["GSL_ICMV17","Rate Rider for Recovery of Incremental Capital (2017) - in effect until the effective date of the next cost of service based rate order",null,"$/kWh",2.9999999999999997E-4]
["GSL_TN","Retail Transmission Rate - Network Service Rate",null,"$/kWh",7.1000000000000004E-3]
["GSL_TC","Retail Transmission Rate - Line and Transformation Connection Service Rate",null,"$/kWh",6.4999999999999997E-3]
[]
[null,"MONTHLY RATES AND CHARGES - Regulatory Component"]
[]
[null,"Wholesale Market Service Rate (WMS) - not including CBR",null,"$/kWh",3.0000000000000001E-3]
[null,"Capacity Based Recovery (CBR) - Applicable for Class B Customers ",null,"$/kWh",4.0000000000000002E-4]
[null,"Rural or Remote Electricity Rate Protection Charge (RRRP)",null,"$/kWh",5.0000000000000001E-4]
[null,"Standard Supply Service - Administrative Charge (if applicable)",null,"$",0.25]
[]
[]
[null,"GENERAL SERVICE 50 TO 499 KW SERVICE CLASSIFICATION"]
[]
[null,"This classification refers to a non-residential account whose monthly average peak demand is equal to or greater than, or is forecast to be equal to or greater than, 50 kW but less than 500 kW.  Class B consumers are defined in accordance with O. Reg. 429/04.  Further servicing details are available in the distributor’s Conditions of Service."]
[]
[null,"APPLICATION"]
[]
[null,"The application of these rates and charges shall be in accordance with the Licence of the Distributor and any Code or Order of the Ontario Energy Board, and amendments thereto as approved by the Ontario Energy Board, which may be applicable to the administration of this schedule."]
[]
[null,"No rates and charges for the distribution of electricity and charges to meet the costs of any work or service done or furnished for the purpose of the distribution of electricity shall be made except as permitted by this schedule, unless required by the Distributor’s Licence or a Code or Order of the Ontario Energy Board, and amendments thereto as approved by the Ontario Energy Board, or as specified herein."]
[]
[null,"Unless specifically noted, this schedule does not contain any charges for the electricity commodity, be it under the Regulated Price Plan, a contract with a retailer or the wholesale market price, as applicable. In addition, the charges in the MONTHLY RATES AND CHARGES - Regulatory Component of this schedule do not apply to a customer that is an embedded wholesale market participant."]
[]
[null,"It should be noted that this schedule does not list any charges, assessments, or credits that are required by law to be invoiced by a distributor and that are not subject to Ontario Energy Board approval, such as the Global Adjustment and the HST."]
[]
[null,"Billing demands are established at the greater of 100% of the kW, or 90% of the kVA amounts."]
[]
[null,"MONTHLY RATES AND CHARGES - Delivery Component"]
[]
["GS50_499_F","Service Charge",null,"$",78.41]
["GS50_499_FRR19","Rate Rider for Recovery of 2019 Foregone Revenue - effective until December 31, 2019",null,"$",0.75]
["GS50_499_ICMF19","Rate Rider for Recovery of Incremental Capital (2019) - in effect from March 1, 2019 until the effective date of the next cost of service based rate order",null,"$",0.38]
["GS50_499_ICMF18","Rate Rider for Recovery of Incremental Capital (2018) - in effect until the effective date of the next cost of service based rate order",null,"$",0.51]
["GS50_499_ICMF17","Rate Rider for Recovery of Incremental Capital (2017) - in effect until the effective date of the next cost of service based rate order",null,"$",1.93]
["GS50_499_V","Distribution Volumetric Rate",null,"$/kW",4.7188999999999997]
["GS50_499_LV","Low Voltage Service Rate ",null,"$/kW",8.0199999999999994E-2]
["GS50_499_GA19","Rate Rider for Disposition of Global Adjustment Account (2019) - effective until December 31, 2019\n        Applicable only for Non-RPP Customers Non-Wholesale Market Participants - Approved on an Interim Basis",null,"$/kWh",1.9E-3]
["GS50_499_GA18","Rate Rider for Disposition of Global Adjustment Account (2018) - effective until  April 30, 2019\n        Applicable only for Non-RPP Customers Non-Wholesale Market Participants",null,"$/kWh",-5.0000000000000001E-4]
["GS50_499_DVA19","Rate Rider for Disposition of Deferral/Variance Accounts (2019) - effective until December 31, 2019 - Approved on an Interim Basis",null,"$/kW",0.2394]
["GS50_499_DVA19nonWMP","Rate Rider for Disposition of Deferral/Variance Accounts (2019) - effective until December 31, 2019\n        Applicable only for Non-Wholesale Market Participants - Approved on an Interim Basis",null,"$/kW",-0.379]
["GS50_499_DVA18","Rate Rider for Disposition of Deferral/Variance Accounts (2018) - effective until April 30, 2019",null,"$/kW",0.10050000000000001]
["GS50_499_DVA18nonWMP","Rate Rider for Disposition of Deferral/Variance Accounts (2018) - effective until April 30, 2019 - Applicable only for Non-Wholesale Market Participants",null,"$/kW",-0.3538]
["GS50_499_CBR18","Rate Rider for Disposition of Capacity Based Recovery Account (2018) - effective until April 30, 2019\n        Applicable Only for Non-Wholesale Market Participants Class  B Customers",null,"$/kW",-1.6060000000000001E-2]
["GS50_499_LRV19","Rate Rider for Disposition of Lost Revenue Adjustment Mechanism Variance Account (LRAMVA) (2019) - effective until December 31, 2019",null,"$/kW",0.22900000000000001]
["GS50_499_LRV18","Rate Rider for Disposition of Lost Revenue Adjustment Mechanism Variance Account (LRAMVA) (2018) - effective until April 30, 2019",null,"$/kW",0.45850000000000002]
["GS50_499_ICMV19","Rate Rider for Recovery of Incremental Capital (2019) - in effect from March 1, 2019 until the effective date of the next cost of service based rate order",null,"$/kW",2.2599999999999999E-2]
["GS50_499_ICMV18","Rate Rider for Recovery of Incremental Capital (2018) - in effect until the effective date of the next cost of service based rate order",null,"$/kW",3.0800000000000001E-2]
["GS50_499_ICMV17","Rate Rider for Recovery of Incremental Capital (2017) - in effect until the effective date of the next cost of service based rate order",null,"$/kW",0.1163]
["GS50_499_TN","Retail Transmission Rate - Network Service Rate",null,"$/kW",2.7288999999999999]
["GS50_499_TC","Retail Transmission Rate - Line and Transformation Connection Service Rate",null,"$/kW",2.5929000000000002]
[]
[null,"MONTHLY RATES AND CHARGES - Regulatory Component"]
[]
[null,"Wholesale Market Service Rate (WMS) - not including CBR",null,"$/kWh",3.0000000000000001E-3]
[null,"Capacity Based Recovery (CBR) - Applicable for Class B Customers ",null,"$/kWh",4.0000000000000002E-4]
[null,"Rural or Remote Electricity Rate Protection Charge (RRRP)",null,"$/kWh",5.0000000000000001E-4]
[null,"Standard Supply Service - Administrative Charge (if applicable)",null,"$",0.25]
[]
[null,"GENERAL SERVICE 500 TO 4,999 KW SERVICE CLASSIFICATION"]
[null,"This classification refers to a non-residential account whose monthly average peak demand is equal to or greater than, or is forecast to be equal to or greater than, 500 kW but less than 5,000 kW.  Class A and Class B consumers are defined in accordance with O. Reg. 429/04.  Further servicing details are available in the distributor’s Conditions of Service."]
[]
[null,"APPLICATION"]
[]
[null,"The application of these rates and charges shall be in accordance with the Licence of the Distributor and any Code or Order of the Ontario Energy Board, and amendments thereto as approved by the Ontario Energy Board, which may be applicable to the administration of this schedule."]
[]
[null,"No rates and charges for the distribution of electricity and charges to meet the costs of any work or service done or furnished for the purpose of the distribution of electricity shall be made except as permitted by this schedule, unless required by the Distributor’s Licence or a Code or Order of the Ontario Energy Board, and amendments thereto as approved by the Ontario Energy Board, or as specified herein."]
[]
[null,"Unless specifically noted, this schedule does not contain any charges for the electricity commodity, be it under the Regulated Price Plan, a contract with a retailer or the wholesale market price, as applicable. In addition, the charges in the MONTHLY RATES AND CHARGES - Regulatory Component of this schedule do not apply to a customer that is an embedded wholesale market participant."]
[]
[null,"The rate rider for the disposition of WMS Sub-Account CBR Class B is not applicable to wholesale market participant (WMP) customers.  It is not applicable to WMP customers that transitioned between Class A and Class B during the variance account accumulation period, or to customers that were in Class A for the entire period.  Customers that transitioned are to be charged or refunded their share of the variance disposed through customer specific billing adjustments.  The rate rider is to be consistently applied for the entire period to the sunset date of the rate rider.  In addition, this rate rider is applicable to all new non-RPP Class B customers."]
[]
[null,"The rate rider for the disposition of Global Adjustment is only applicable to non-RPP Class B customers.  It is not applicable to WMP customers that transitioned between Class A and Class B during the variance account accumulation period, or to customers that were in Class A for the entire period.  Customers that transitioned are to be charged or refunded their share of the variance disposed through customer specific billing adjustments.  The rate rider is to be consistently applied for the entire period to the sunset date of the rate rider.  In addition, this rate rider is applicable to all new non-RPP Class B customers."]
[]
[null,"It should be noted that this schedule does not list any charges, assessments, or credits that are required by law to be invoiced by a distributor and that are not subject to Ontario Energy Board approval, such as the Global Adjustment and the HST."]
[]
[null,"Billing demands are established at the greater of 100% of the kW, or 90% of the kVA amounts."]
[]
[null,"MONTHLY RATES AND CHARGES - Delivery Component"]
[]
["GS500_F","Service Charge",null,"$",1785.59]
["GS500_FRR19","Rate Rider for Recovery of 2019 Foregone Revenue - effective until December 31, 2019",null,"$",3.96]
["GS500_ICMF19","Rate Rider for Recovery of Incremental Capital (2019) - in effect from March 1, 2019 until the effective date of the next cost of service based rate order",null,"$",8.5399999999999991]
["GS500_ICMF18","Rate Rider for Recovery of Incremental Capital (2018) - in effect until the effective date of the next cost of service based rate order",null,"$",11.65]
["GS500_ICMF17","Rate Rider for Recovery of Incremental Capital (2017) - in effect until the effective date of the next cost of service based rate order",null,"$",44]
["GS500_V","Distribution Volumetric Rate",null,"$/kW",2.4281999999999999]
["GS500_LV","Low Voltage Service Rate ",null,"$/kW",7.8399999999999997E-2]
["GS500_GA19","Rate Rider for Disposition of Global Adjustment Account (2019) - effective May 1, 2019 until December 31, 2019\n        Applicable only for Non-RPP Customers Non-Wholesale Market Participants - Approved on an Interim Basis",null,"$/kWh",2.5999999999999999E-3]
["GS500_GA18","Rate Rider for Disposition of Global Adjustment Account (2018) - effective until  April 30, 2019\n        Applicable only for Non-RPP Customers Non-Wholesale Market Participants",null,"$/kWh",-5.0000000000000001E-4]
["GS500_DVA19","Rate Rider for Disposition of Deferral/Variance Accounts (2019) - effective until December 31, 2019 - Approved on an Interim Basis",null,"$/kW",0.3019]
["GS500_DVA19nonWMP","Rate Rider for Disposition of Deferral/Variance Accounts (2019) - effective until December 31, 2019\n        Applicable only for Non-Wholesale Market Participants - Approved on an Interim Basis",null,"$/kW",-0.47739999999999999]
["GS500_DVA18","Rate Rider for Disposition of Deferral/Variance Accounts (2018) - effective May 1, 2018 until April 30, 2019",null,"$/kW",0.12720000000000001]
["GS500_DVA18nonWMP","Rate Rider for Disposition of Deferral/Variance Accounts (2018) - effective until April 30, 2019 - Applicable only for Non-Wholesale Market Participants",null,"$/kW",-0.44650000000000001]
["GS500_CBR18","Rate Rider for Disposition of Capacity Based Recovery Account (2018) - effective until April 30, 2019\n        Applicable Only for Non-Wholesale Market Participants Class  B Customers",null,"$/kW",-1.9990000000000001E-2]
["GS500_LRV19","Rate Rider for Disposition of Lost Revenue Adjustment Mechanism Variance Account (LRAMVA) (2019) - effective until December 31, 2019",null,"$/kW",0.10009999999999999]
["GS500_LRV18","Rate Rider for Disposition of Lost Revenue Adjustment Mechanism Variance Account (LRAMVA) (2018) - effective until April 30, 2019",null,"$/kW",0.14099999999999999]
["GS500_ICMV19","Rate Rider for Recovery of Incremental Capital (2019) - in effect from March 1, 2019 until the effective date of the next cost of service based rate order",null,"$/kW",1.1599999999999999E-2]
["GS500_ICMV18","Rate Rider for Recovery of Incremental Capital (2018) - in effect until the effective date of the next cost of service based rate order",null,"$/kW",1.5800000000000002E-2]
["GS500_ICMV17","Rate Rider for Recovery of Incremental Capital (2017) - in effect until the effective date of the next cost of service based rate order",null,"$/kW",5.9799999999999999E-2]
["GS500_TN","Retail Transmission Rate - Network Service Rate ",null,"$/kW",2.6402000000000001]
["GS500_TC","Retail Transmission Rate - Line and Transformation Connection Service Rate ",null,"$/kW",2.5373000000000001]
[]
[null,"MONTHLY RATES AND CHARGES - Regulatory Component"]
[]
[null,"Wholesale Market Service Rate (WMS) - not including CBR",null,"$/kWh",3.0000000000000001E-3]
[null,"Capacity Based Recovery (CBR) - Applicable for Class B Customers ",null,"$/kWh",4.0000000000000002E-4]
[null,"Rural or Remote Electricity Rate Protection Charge (RRRP)",null,"$/kWh",5.0000000000000001E-4]
[null,"Standard Supply Service - Administrative Charge (if applicable)",null,"$",0.25]
[]
[]
[null,"LARGE USE SERVICE CLASSIFICATION"]
[]
[null,"This classification refers to an account whose monthly average peak demand is equal to or greater than, or is forecast to be equal to or greater than, 5,000 kW.  Class A and Class B consumers are defined in accordance with O. Reg. 429/04.  Further servicing details are available in the distributor’s Conditions of Service."]
[]
[null,"APPLICATION"]
[]
[null,"The application of these rates and charges shall be in accordance with the Licence of the Distributor and any Code or Order of the Ontario Energy Board, and amendments thereto as approved by the Ontario Energy Board, which may be applicable to the administration of this schedule."]
[]
[null,"No rates and charges for the distribution of electricity and charges to meet the costs of any work or service done or furnished for the purpose of the distribution of electricity shall be made except as permitted by this schedule, unless required by the Distributor’s Licence or a Code or Order of the Ontario Energy Board, and amendments thereto as approved by the Ontario Energy Board, or as specified herein."]
[]
[null,"Unless specifically noted, this schedule does not contain any charges for the electricity commodity, be it under the Regulated Price Plan, a contract with a retailer or the wholesale market price, as applicable. In addition, the charges in the MONTHLY RATES AND CHARGES - Regulatory Component of this schedule do not apply to a customer that is an embedded wholesale market participant."]
[]
[null,"It should be noted that this schedule does not list any charges, assessments, or credits that are required by law to be invoiced by a distributor and that are not subject to Ontario Energy Board approval, such as the Global Adjustment and the HST."]
[]
[null,"Billing demands are established at the greater of 100% of the kW, or 90% of the kVA amounts."]
[]
[null,"MONTHLY RATES AND CHARGES - Delivery Component"]
[]
["LU_F","Service Charge",null,"$",14078.67]
["LU_FRR19","Rate Rider for Recovery of 2019 Foregone Revenue - effective until December 31, 2019",null,"$",64.34]
["LU_ICMF19","Rate Rider for Recovery of Incremental Capital (2019) - in effect from March 1, 2019 until the effective date of the next cost of service based rate order",null,"$",67.349999999999994]
["LU_ICMF18","Rate Rider for Recovery of Incremental Capital (2018) - in effect until the effective date of the next cost of service based rate order",null,"$",91.89]
["LU_ICMF17","Rate Rider for Recovery of Incremental Capital (2017) - in effect until the effective date of the next cost of service based rate order",null,"$",346.9]
["LU_V","Distribution Volumetric Rate",null,"$/kW",3.0139]
["LU_LV","Low Voltage Service Rate ",null,"$/kW",8.3799999999999999E-2]
["LU_DVA19","Rate Rider for Disposition of Deferral/Variance Accounts (2019) - effective until December 31, 2019  - Approved on an Interim Basis",null,"$/kW",-0.22639999999999999]
["LU_DVA18","Rate Rider for Disposition of Deferral/Variance Accounts (2018) - effective until April 30, 2019",null,"$/kW",-0.40539999999999998]
["LU_LRV19","Rate Rider for Disposition of Lost Revenue Adjustment Mechanism Variance Account (LRAMVA) (2019) - effective until December 31, 2019",null,"$/kW",9.4100000000000003E-2]
["LU_LRV18","Rate Rider for Disposition of Lost Revenue Adjustment Mechanism Variance Account (LRAMVA) (2018) - effective until April 30, 2019",null,"$/kW",8.7999999999999995E-2]
["LU_ICMV19","Rate Rider for Recovery of Incremental Capital (2019) - in effect from March 1, 2019 until the effective date of the next cost of service based rate order",null,"$/kW",1.44E-2]
["LU_ICMV18","Rate Rider for Recovery of Incremental Capital (2018) - in effect until the effective date of the next cost of service based rate order",null,"$/kW",1.9699999999999999E-2]
["LU_ICMV17","Rate Rider for Recovery of Incremental Capital (2017) - in effect until the effective date of the next cost of service based rate order",null,"$/kW",7.4300000000000005E-2]
["LU_TN","Retail Transmission Rate - Network Service Rate – Interval Metered",null,"$/kW",2.8174000000000001]
["LU_TC","Retail Transmission Rate - Line and Transformation Connection Service Rate – Interval Metered ",null,"$/kW",2.71]
[]
[null,"MONTHLY RATES AND CHARGES - Regulatory Component"]
[]
[null,"Wholesale Market Service Rate (WMS) - not including CBR",null,"$/kWh",3.0000000000000001E-3]
[null,"Capacity Based Recovery (CBR) - Applicable for Class B Customers ",null,"$/kWh",4.0000000000000002E-4]
[null,"Rural or Remote Electricity Rate Protection Charge (RRRP)",null,"$/kWh",5.0000000000000001E-4]
[null,"Standard Supply Service - Administrative Charge (if applicable)",null,"$",0.25]
[]
[]
[null,"UNMETERED SCATTERED LOAD SERVICE CLASSIFICATION"]
[]
[null,"This classification applies to an account taking electricity at 750 volts or less whose average monthly maximum demand is less than, or is forecast to be less than, 50 kW and the consumption is unmetered. The amount of electricity consumed by unmetered connections will be based on detailed information/documentation provided by the device's manufacturer abd will be agreed to by Alectra Utilities and the customer and may be subject to periodic monitoring of actual consumption.  Eligible onmetered loads include cable TV power packs, bus  shelters, telephone booths, traffic lights, railway crossings, etc.   Class B consumers are defined in accordance with O. Reg. 429/04.  Further servicing details are available in the distributor’s Conditions of Service."]
[]
[null,"APPLICATION"]
[]
[null,"The application of these rates and charges shall be in accordance with the Licence of the Distributor and any Code or Order of the Ontario Energy Board, and amendments thereto as approved by the Ontario Energy Board, which may be applicable to the administration of this schedule."]
[]
[null,"No rates and charges for the distribution of electricity and charges to meet the costs of any work or service done or furnished for the purpose of the distribution of electricity shall be made except as permitted by this schedule, unless required by the Distributor’s Licence or a Code or Order of the Ontario Energy Board, and amendments thereto as approved by the Ontario Energy Board, or as specified herein."]
[]
[null,"Unless specifically noted, this schedule does not contain any charges for the electricity commodity, be it under the Regulated Price Plan, a contract with a retailer or the wholesale market price, as applicable. In addition, the charges in the MONTHLY RATES AND CHARGES - Regulatory Component of this schedule do not apply to a customer that is an embedded wholesale market participant."]
[]
[null,"It should be noted that this schedule does not list any charges, assessments, or credits that are required by law to be invoiced by a distributor and that are not subject to Ontario Energy Board approval, such as the Global Adjustment and the HST."]
[]
[null,"MONTHLY RATES AND CHARGES - Delivery Component"]
[]
["USL_F","Service Charge (per connection)",null,"$",9.19]
["USL_FRR19","Rate Rider for Recovery of 2019 Foregone Revenue - effective until December 31, 2019",null,"$",0.02]
["USL_ICMF19","Rate Rider for Recovery of Incremental Capital (2019) - in effect from March 1, 2019 until the effective date of the next cost of service based rate order",null,"$",0.04]
["USL_ICMF18","Rate Rider for Recovery of Incremental Capital (2018) - in effect until the effective date of the next cost of service based rate order",null,"$",0.06]
["USL_ICMF17","Rate Rider for Recovery of Incremental Capital (2017) - in effect until the effective date of the next cost of service based rate order",null,"$",0.23]
["USL_V","Distribution Volumetric Rate",null,"$/kWh",1.67E-2]
["USL_LV","Low Voltage Service Rate ",null,"$/kWh",2.0000000000000001E-4]
["USL_GA19","Rate Rider for Disposition of Global Adjustment Account (2019) - effective until December 31, 2019\n        Applicable only for Non-RPP Customers Non-Wholesale Market Participants - Approved on an Interim Basis",null,"$/kWh",1.9E-3]
["USL_GA18","Rate Rider for Disposition of Global Adjustment Account (2018) - effective until  April 30, 2019\n        Applicable only for Non-RPP Customers Non-Wholesale Market Participants",null,"$/kWh",-5.0000000000000001E-4]
["USL_DVA19","Rate Rider for Disposition of Deferral/Variance Accounts (2019) - effective until December 31, 2019  - Approved on an Interim Basis",null,"$/kWh",-4.0000000000000002E-4]
["USL_DVA18","Rate Rider for Disposition of Deferral/Variance Accounts (2018) - effective until April 30, 2019",null,"$/kWh",-6.9999999999999999E-4]
["USL_CBR18","Rate Rider for Disposition of Capacity Based Recovery Account (2018) - effective until April 30, 2019 - Applicable Only for Class  B Customers",null,"$/kWh",-5.0000000000000002E-5]
["USL_ICMV19","Rate Rider for Recovery of Incremental Capital (2019) - in effect from March 1, 2019 until the effective date of the next cost of service based rate order",null,"$/kWh",1E-4]
["USL_ICMV18","Rate Rider for Recovery of Incremental Capital (2018) - in effect until the effective date of the next cost of service based rate order",null,"$/kWh",1E-4]
["USL_ICMV17","Rate Rider for Recovery of Incremental Capital (2017) - in effect until the effective date of the next cost of service based rate order",null,"$/kWh",4.0000000000000002E-4]
["USL_TN","Retail Transmission Rate - Network Service Rate",null,"$/kWh",7.1000000000000004E-3]
["USL_TC","Retail Transmission Rate - Line and Transformation Connection Service Rate",null,"$/kWh",6.4999999999999997E-3]
[]
[null,"MONTHLY RATES AND CHARGES - Regulatory Component"]
[]
[null,"Wholesale Market Service Rate (WMS) - not including CBR",null,"$/kWh",3.0000000000000001E-3]
[null,"Capacity Based Recovery (CBR) - Applicable for Class B Customers ",null,"$/kWh",4.0000000000000002E-4]
[null,"Rural or Remote Electricity Rate Protection Charge (RRRP)",null,"$/kWh",5.0000000000000001E-4]
[null,"Standard Supply Service - Administrative Charge (if applicable)",null,"$",0.25]
[]
[]
[null,"STREET LIGHTING SERVICE CLASSIFICATION"]
[]
[null,"This classification refers to an account for roadway lighting.  Street Lighting is unmetered where energy consumption is estimated based on the connected wattage and calculated hours of use using methods established by the Ontario Energy Board.  Class B consumers are defined in accordance with O. Reg. 429/04.  Further servicing details are available in the distributor’s Conditions of Service."]
[]
[null,"APPLICATION"]
[]
[null,"The application of these rates and charges shall be in accordance with the Licence of the Distributor and any Code or Order of the Ontario Energy Board, and amendments thereto as approved by the Ontario Energy Board, which may be applicable to the administration of this schedule."]
[]
[null,"No rates and charges for the distribution of electricity and charges to meet the costs of any work or service done or furnished for the purpose of the distribution of electricity shall be made except as permitted by this schedule, unless required by the Distributor’s Licence or a Code or Order of the Ontario Energy Board, and amendments thereto as approved by the Ontario Energy Board, or as specified herein."]
[]
[null,"Unless specifically noted, this schedule does not contain any charges for the electricity commodity, be it under the Regulated Price Plan, a contract with a retailer or the wholesale market price, as applicable. In addition, the charges in the MONTHLY RATES AND CHARGES - Regulatory Component of this schedule do not apply to a customer that is an embedded wholesale market participant."]
[]
[null,"It should be noted that this schedule does not list any charges, assessments, or credits that are required by law to be invoiced by a distributor and that are not subject to Ontario Energy Board approval, such as the Global Adjustment and the HST."]
[]
[null,"MONTHLY RATES AND CHARGES - Delivery Component"]
[]
["SL_F","Service Charge (per luminaire)",null,"$",1.54]
["SL_ICMF19","Rate Rider for Recovery of Incremental Capital (2019) - in effect from March 1, 2019 until the effective date of the next cost of service based rate order",null,"$",0.01]
["SL_ICMF18","Rate Rider for Recovery of Incremental Capital (2018) - in effect until the effective date of the next cost of service based rate order",null,"$",0.01]
["SL_ICMF17","Rate Rider for Recovery of Incremental Capital (2017) - in effect until the effective date of the next cost of service based rate order",null,"$",0.04]
["SL_V","Distribution Volumetric Rate",null,"$/kW",11.7902]
["SL_LV","Low Voltage Service Rate ",null,"$/kW",5.8000000000000003E-2]
["SL_GA19","Rate Rider for Disposition of Global Adjustment Account (2019) - effective until December 31, 2019\n        Applicable only for Non-RPP Customers Non-Wholesale Market Participants - Approved on an Interim Basis",null,"$/kWh",1.9E-3]
["SL_GA18","Rate Rider for Disposition of Global Adjustment Account (2018) - effective until  April 30, 2019\n        Applicable only for Non-RPP Customers Non-Wholesale Market Participants",null,"$/kWh",-5.0000000000000001E-4]
["SL_DVA19","Rate Rider for Disposition of Deferral/Variance Accounts (2019) - effective until December 31, 2019 - Approved on an Interim Basis",null,"$/kW",-0.14599999999999999]
["SL_DVA18","Rate Rider for Disposition of Deferral/Variance Accounts (2018) - effective until April 30, 2019",null,"$/kW",-0.2616]
["SL_CBR18","Rate Rider for Disposition of Capacity Based Recovery Account (2018) - effective until April 30, 2019\n        Applicable Only for Non-Wholesale Market Participants Class  B Customers",null,"$/kW",-1.6549999999999999E-2]
["SL_LRV19","Rate Rider for Disposition of Lost Revenue Adjustment Mechanism Variance Account (LRAMVA) (2019) - effective until December 31, 2019",null,"$/kW",-4.2131999999999996]
["SL_LRV18","Rate Rider for Disposition of Lost Revenue Adjustment Mechanism Variance Account (LRAMVA) (2018)  - effective until April 30, 2019",null,"$/kW",-33.353200000000001]
["SL_ICMV19","Rate Rider for Recovery of Incremental Capital (2019) - in effect from March 1, 2019 until the effective date of the next cost of service based rate order",null,"$/kW",5.6399999999999999E-2]
["SL_ICMV18","Rate Rider for Recovery of Incremental Capital (2018) - in effect until the effective date of the next cost of service based rate order",null,"$/kW",7.6999999999999999E-2]
["SL_ICMV17","Rate Rider for Recovery of Incremental Capital (2017) - in effect until the effective date of the next cost of service based rate order",null,"$/kW",0.29049999999999998]
["SL_TN","Retail Transmission Rate - Network Service Rate",null,"$/kW",1.8898999999999999]
["SL_TC","Retail Transmission Rate - Line and Transformation Connection Service Rate",null,"$/kW",1.875]
[]
[null,"MONTHLY RATES AND CHARGES - Regulatory Component"]
[]
[null,"Wholesale Market Service Rate (WMS) - not including CBR",null,"$/kWh",3.0000000000000001E-3]
[null,"Capacity Based Recovery (CBR) - Applicable for Class B Customers ",null,"$/kWh",4.0000000000000002E-4]
[null,"Rural or Remote Electricity Rate Protection Charge (RRRP)",null,"$/kWh",5.0000000000000001E-4]
[null,"Standard Supply Service - Administrative Charge (if applicable)",null,"$",0.25]
[]
[]
[null,"STANDBY POWER SERVICE CLASSIFICATION"]
[]
[null,"This classification refers to an account that requires Alectra Utilities to provide distribution service on a standby basis as a back-up supply to an on-site generator.  Further servicing details are available in the distributor’s Conditions of Service."]
[]
[null,"APPLICATION"]
[]
[null,"The application of these rates and charges shall be in accordance with the Licence of the Distributor and any Code or Order of the Ontario Energy Board, and amendments thereto as approved by the Ontario Energy Board, which may be applicable to the administration of this schedule."]
[]
[null,"No rates and charges for the distribution of electricity and charges to meet the costs of any work or service done or furnished for the purpose of the distribution of electricity shall be made except as permitted by this schedule, unless required by the Distributor’s Licence or a Code or Order of the Ontario Energy Board, and amendments thereto as approved by the Ontario Energy Board, or as specified herein."]
[]
[null,"Unless specifically noted, this schedule does not contain any charges for the electricity commodity, be it under the Regulated Price Plan, a contract with a retailer or the wholesale market price, as applicable."]
[]
[null,"It should be noted that this schedule does not list any charges, assessments or credits that are required by law to be invoiced by a distributor and that are not subject to Ontario Energy Board approval, such as the Global Adjustment and the HST."]
[]
[null,"MONTHLY RATES AND CHARGES – Delivery Component "]
[]
[null,"A Standby Service Charge will be applied for a month where standby power is not provided.  The applicable rate is the approved Distribution Volumetric Rate of the applicable service class and is applied to gross metered demand or contracted amount, whichever is greater.  A monthly administration charge of $200, for simple metering arrangements, or $500, for complex metering arrangements, will also be applied.  "]
[]
[]
[]
[]
[null,"microFIT SERVICE CLASSIFICATION"]
[]
[null,"This classification applies to an electricity generation facility contracted under the Independent Electricity System Operator’s microFIT program and connected to the distributor’s distribution system.  Further servicing details are available in the distributor’s Conditions of Service."]
[]
[null,"APPLICATION"]
[]
[null,"The application of these rates and charges shall be in accordance with the Licence of the Distributor and any Code or Order of the Ontario Energy Board, and amendments thereto as approved by the Ontario Energy Board, which may be applicable to the administration of this schedule."]
[]
[null,"No rates and charges for the distribution of electricity and charges to meet the costs of any work or service done or furnished for the purpose of the distribution of electricity shall be made except as permitted by this schedule, unless required by the Distributor’s Licence or a Code or Order of the Ontario Energy Board, and amendments thereto as approved by the Ontario Energy Board, or as specified herein."]
[]
[null,"Unless specifically noted, this schedule does not contain any charges for the electricity commodity, be it under the Regulated Price Plan, a contract with a retailer or the wholesale market price, as applicable. In addition, the charges in the MONTHLY RATES AND CHARGES - Regulatory Component of this schedule do not apply to a customer that is an embedded wholesale market participant."]
[]
[null,"It should be noted that this schedule does not list any charges, assessments, or credits that are required by law to be invoiced by a distributor and that are not subject to Ontario Energy Board approval, such as the Global Adjustment and the HST."]
[]
[null,"MONTHLY RATES AND CHARGES - Delivery Component"]
[]
[null,"Service Charge",null,"$",5.4]
[]
[]
[]
[]
[null,"ALLOWANCES"]
[]
[null,"Transformer Allowance for Ownership - per kW of billing demand/month",null,"$/kW",-0.4]
[null,"Primary Metering Allowance for transformer losses - applied to measured demand and energy",null,"%",-1]
[]
[]
[null,"SPECIFIC SERVICE CHARGES"]
[]
[null,"APPLICATION"]
[]
[null,"The application of these rates and charges shall be in accordance with the Licence of the Distributor and any Code or Order of the Ontario Energy Board, and amendments thereto as approved by the Ontario Energy Board, which may be applicable to the administration of this schedule."]
[]
[null,"No charges to meet the costs of any work or service done or furnished for the purpose of the distribution of electricity shall be made except as permitted by this schedule, unless required by the Distributor’s Licence or a Code or Order of the Ontario Energy Board, and amendments thereto as approved by the Ontario Energy Board, or as specified herein."]
[]
[null,"It should be noted that this schedule does not list any charges, assessments or credits that are required by law to be invoiced by a distributor and that are not subject to Ontario Energy Board approval, such as the Global Adjustment and the HST."]
[]
[null,"Customer Administration"]
[null,"Arrears certificate",null,"$",15]
[null,"Request for other billing information",null,"$",15]
[null,"Credit reference/credit check (plus credit agency costs)",null,"$",15]
[null,"Credit reference/credit check (plus credit agency costs – General Service)",null,"$",25]
[null,"Income tax letter",null,"$",15]
[null,"Returned cheque (plus bank charges)",null,"$",12.5]
[null,"Account set up charge/change of occupancy charge (plus credit agency costs if applicable)",null,"$",30]
[null,"Account set up charge/change of occupancy charge (plus credit agency costs if applicable – Residential)",null,"$",20]
[null,"Meter dispute charge plus Measurement Canada fees (if meter found correct)",null,"$",10]
[null,"Special meter reads",null,"$",30]
[null,"Interval meter request change",null,"$",40]
[]
[null,"Non-Payment of Account"]
[null,"Late payment - per month",null,"%",1.5]
[null,"Late payment - per annum",null,"%",19.559999999999999]
[null,"Collection of account charge – no disconnection",null,"$",9]
[null,"Disconnect/reconnect at meter - during regular hours",null,"$",20]
[null,"Disconnect/reconnect at pole - during regular hours",null,"$",185]
[null,"Disconnect/reconnect at pole - after regular hours",null,"$",415]
[]
[null,"Other"]
[null,"Temporary service install and remove – overhead – no transformer",null,"$",400]
[null,"Specific Charge for Access to the Power Poles - $/pole/year (with the exception of wireless attachments)\n- in effect from January 1, 2019",null,"$",43.63]
[]
[]
[null,"RETAIL SERVICE CHARGES (if applicable)"]
[]
[null,"The application of these rates and charges shall be in accordance with the Licence of the Distributor and any Code or Order of the Ontario Energy Board, and amendments thereto as approved by the Ontario Energy Board, which may be applicable to the administration of this schedule."]
[]
[null,"No rates and charges for the distribution of electricity and charges to meet the costs of any work or service done or furnished for the purpose of the distribution of electricity shall be made except as permitted by this schedule, unless required by the Distributor’s Licence or a Code or Order of the Ontario Energy Board, and amendments thereto as approved by the Ontario Energy Board, or as specified herein."]
[]
[null,"Unless specifically noted, this schedule does not contain any charges for the electricity commodity, be it under the Regulated Price Plan, a contract with a retailer or the wholesale market price, as applicable."]
[]
[null,"It should be noted that this schedule does not list any charges, assessments, or credits that are required by law to be invoiced by a distributor and that are not subject to Ontario Energy Board approval, such as the Global Adjustment and the HST."]
[]
[null,"Retail Service Charges refer to services provided by a distributor to retailers or customers related to the supply of competitive electricity."]
[]
[null,"One-time charge, per retailer, to establish the service agreement between the distributor and the retailer",null,"$",100]
[null,"Monthly fixed charge, per retailer",null,"$",40]
[null,"Monthly variable charge, per customer, per retailer",null,"$/cust.",1]
[null,"Distributor-consolidated billing monthly charge, per customer, per retailer",null,"$/cust.",0.6]
[null,"Retailer-consolidated billing monthly credit, per customer, per retailer",null,"$/cust.",-0.6]
[null,"Service Transaction Requests (STR)"]
[null,"Request fee, per request, applied to the requesting party",null,"$",0.5]
[null,"Processing fee, per request, applied to the requesting party",null,"$",1]
[null,"Request for customer information as outlined in Section 10.6.3 and Chapter 11 of the Retail"]
[null,"Settlement Code directly to retailers and customers, if not delivered electronically through the"]
[null,"Electronic Business Transaction (EBT) system, applied to the requesting party"]
[null,"Up to twice a year",null,"$","no charge"]
[null,"More than twice a year, per request (plus incremental delivery costs)",null,"$",4]
[null,"Notice of switch letter charge, per letter",null,"$",2]
[null,"The new notice of switch letter service charge will apply only to letters that are sent by standard hard copy mail. In accordance with the Report of the Ontario Energy Board: Energy Retailer Services Charges issued on November 29, 2018, electricity distributors may opt out of applying the charge to energy retailers by notifying the OEB within 60 days of the issuance of this Order."]
[]
[]
[null,"LOSS FACTORS"]
[]
[null,"If the distributor is not capable of prorating changed loss factors jointly with distribution rates, the revised loss factors will be implemented upon the first subsequent billing for each billing cycle."]
[null,"Total Loss Factor - Secondary Metered Customer < 5,000 kW",null,null,1.036]
[null,"Total Loss Factor - Secondary Metered Customer > 5,000 kW",null,null,1.0145]
[null,"Total Loss Factor - Primary Metered Customer < 5,000 kW",null,null,1.0256000000000001]
[null,"Total Loss Factor - Primary Metered Customer > 5,000 kW",null,null,1.0044999999999999]

{"sheet":"3. Continuity Schedule","index":4,"n_rows":60,"n_cols":80,"rows_kept":60,"cut":false,"hidden":false,"merged":[[15,14,15,23],[15,34,15,43],[16,34,18,34],[16,35,18,35],[16,14,18,14],[15,24,15,33],[11,2,14,5],[59,2,60,3],[53,2,53,3],[54,2,54,3],[55,2,55,3],[56,2,56,3],[50,2,51,3],[16,2,18,2],[16,3,18,3],[16,8,18,8],[16,4,18,4],[16,5,18,5],[16,6,18,6],[16,7,18,7],[16,9,18,9],[16,10,18,10],[16,11,18,11],[16,20,18,20],[16,68,18,68],[16,64,18,64],[16,15,18,15],[16,12,18,12],[16,13,18,13],[16,43,18,43],[16,23,18,23],[16,24,18,24],[15,68,15,72],[16,44,18,44],[16,45,18,45],[16,46,18,46],[16,47,18,47],[16,48,18,48],[16,49,18,49],[16,69,18,69],[16,70,18,70],[16,71,18,71],[16,72,18,72],[16,73,18,73],[16,21,18,21],[16,22,18,22],[16,26,18,26],[16,25,18,25],[16,27,18,27],[16,28,18,28],[16,29,18,29],[16,30,18,30],[16,31,18,31],[16,32,18,32],[16,37,18,37],[16,38,18,38],[16,63,18,63],[16,74,18,74],[15,64,15,67],[16,33,18,33],[16,40,18,40],[16,41,18,41],[16,42,18,42],[16,36,18,36],[16,53,18,53],[15,44,15,53],[16,50,18,50],[16,51,18,51],[15,54,15,63],[16,54,18,54],[16,55,18,55],[16,56,18,56],[16,57,18,57],[1,2,8,5],[16,65,18,65],[16,66,18,66],[16,67,18,67],[16,58,18,58],[16,59,18,59],[16,60,18,60],[16,61,18,61],[16,62,18,62],[16,16,18,16],[16,17,18,17],[16,18,18,18],[16,19,18,19],[16,39,18,39],[16,52,18,52],[15,4,15,13]]}
["Back to Index","Back to Index",null,null,null,null,null,null,null,null,null,null,null,null,null,null,null,null,null,null,null,null,null,null,null,null,null,null,null,null,null,null,null,null,null,null,null,null,null,null,null,null,null,null,null,null,null,null,null,null,null,null,null,null,null,null,null,null,null,null,null,null,null,null,null,null,null,null,null,null,null,null,null,null,null,null,null,null,null,false]
[null,null,"INCENTIVE REGULATION MODEL FOR 2020 FILERS",null,null,null,null,null,null,null,null,null,null,null,null,null,null,null,null,null,null,null,null,null,null,null,null,null,null,null,null,null,null,null,null,null,null,null,null,null,null,null,null,null,null,null,null,null,null,null,null,null,null,null,null,null,null,null,null,null,null,null,null,null,null,null,null,null,null,null,null,null,null,null,null,null,null,null,null,false]
[null,null,null,null,null,null,null,null,null,null,null,null,null,null,null,null,null,null,null,null,null,null,null,null,null,null,null,null,null,null,null,null,null,null,null,null,null,null,null,null,null,null,null,null,null,null,null,null,null,null,null,null,null,null,null,null,null,null,null,null,null,null,null,null,null,null,null,null,null,null,null,null,null,null,null,null,null,null,null,false]
[null,null,null,null,null,null,null,null,null,null,null,null,null,null,null,null,null,null,null,null,null,null,null,null,null,null,null,null,null,null,null,null,null,null,null,null,null,null,null,null,null,null,null,null,null,null,null,null,null,null,null,null,null,null,null,null,null,null,null,null,null,null,null,null,null,null,null,null,null,null,null,null,null,null,null,null,null,null,null,false]
[null,null,null,null,null,null,null,null,null,null,null,null,null,null,null,null,null,null,null,null,null,null,null,null,null,null,null,null,null,null,null,null,null,null,null,null,null,null,null,null,null,null,null,null,null,null,null,null,null,null,null,null,null,null,null,null,null,null,null,null,null,null,null,null,null,null,null,null,null,null,null,null,null,null,null,null,null,null,null,false]
[null,null,null,null,null,null,null,null,null,null,null,null,null,null,null,null,null,null,null,null,null,null,null,null,null,null,null,null,null,null,null,null,null,null,null,null,null,null,null,null,null,null,null,null,null,null,null,null,null,null,null,null,null,null,null,null,null,null,null,null,null,null,null,null,null,null,null,null,null,null,null,null,null,null,null,null,null,null,null,false]
[null,null,null,null,null,null,null,null,null,null,null,null,null,null,null,null,null,null,null,null,null,null,null,null,null,null,null,null,null,null,null,null,null,null,null,null,null,null,null,null,null,null,null,null,null,null,null,null,null,null,null,null,null,null,null,null,null,null,null,null,null,null,null,null,null,null,null,null,null,null,null,null,null,null,null,null,null,null,null,false]
[null,null,null,null,null,null,null,null,null,null,null,null,null,null,null,null,null,null,null,null,null,null,null,null,null,null,null,null,null,null,null,null,null,null,null,null,null,null,null,null,null,null,null,null,null,null,null,null,null,null,null,null,null,null,null,null,null,null,null,null,null,null,null,null,null,null,null,null,null,null,null,null,null,null,null,null,null,null,null,false]
[null,null,null,null,null,null,null,null,null,null,null,null,null,null,null,null,null,null,null,null,null,null,null,null,null,null,null,null,null,null,null,null,null,null,null,null,null,null,null,null,null,null,null,null,null,null,null,null,null,null,null,null,null,null,null,null,null,null,null,null,null,null,null,null,null,null,null,null,null,null,null,null,null,null,null,null,null,null,null,false]
[null,null,null,null,null,null,null,null,null,null,null,null,null,null,null,null,null,null,null,null,null,null,null,null,null,null,null,null,null,null,null,null,null,null,null,null,null,null,null,null,null,null,null,null,null,null,null,null,null,null,null,null,null,null,null,null,null,null,null,null,null,null,null,null,null,null,null,null,null,null,null,null,null,null,null,null,null,null,null,true]
[null,null,null,null,null,null,null,null,null,null,null,null,null,null,null,null,null,null,null,null,null,null,null,null,null,null,null,null,null,null,null,null,null,null,null,null,null,null,null,null,null,null,null,null,null,null,null,null,null,null,null,null,null,null,null,null,null,null,null,null,null,null,null,null,null,null,null,null,null,null,null,null,null,null,null,null,null,null,null,true]
[null,null,"Please complete the following continuity schedule for the following Deferral/Variance Accounts.  Enter information into green cells only. Column CE shoudl match the latest 2.1.7 RRR filing.\n\nWhen inputting balances in the continuity schedule, Account 1580 RSVA - Wholesale Market Service Charge is to exclude any amounts relating to CBR. The CBR amounts are to be entered separately in the Class A and Class B 1580 sub-accounts. Only Class B amounts are to be disposed. Class A amounts are not to be disposed.\n\nIf you have received approval to dispose of balances from prior years, the starting point for entries in the schedule below will be the balance sheet date as per your general ledger for which you received approval.  For example, if in the 2020 EDR process (CoS or IRM) you received approval for the December 31, 2014 balances, the starting point for your entries below should be the 2013 year. This will allow for the correct starting point for the 2014 opening balance columns for both principal and interest.\n\nPlease refer to the footnotes for further instructions."]
[]
[]
[]
[null,null,null,null,2013,null,null,null,null,null,null,null,null,null,{"$f":"E16+1","v":2014},null,null,null,null,null,null,null,null,null,{"$f":"O16+1","v":2015},null,null,null,null,null,null,null,null,null,{"$f":"Y16+1","v":2016},null,null,null,null,null,null,null,null,null,{"$f":"AI16+1","v":2017},null,null,null,null,null,null,null,null,null,{"$f":"AS16+1","v":2018},null,null,null,null,null,null,null,null,null,2019,null,null,null,"Projected Interest on Dec-31-18 Balances",null,null,null,null,"2.1.7 RRR"]
[null,null,"Account Descriptions","Account Number","Opening Principal Amounts as of Jan 1, 2013","Transactions2 Debit / (Credit) during 2013","OEB-Approved Disposition during 2013","Principal Adjustments1 during 2013","Closing Principal Balance as of Dec 31, 2013","Opening Interest Amounts as of Jan 1, 2013","Interest Jan 1 to Dec 31, 2013","OEB-Approved Disposition during 2013","Interest Adjustments1 during 2013","Closing Interest Amounts as of Dec 31, 2013","Opening Principal Amounts as of Jan 1, 2014","Transactions2 Debit / (Credit) during 2014","OEB-Approved Disposition during 2014","Principal Adjustments1 during 2014","Closing Principal Balance as of Dec 31, 2014","Opening Interest Amounts as of Jan 1, 2014","Interest Jan 1 to Dec 31. 2014","OEB-Approved Disposition during 2014","Interest Adjustments1 during 2014","Closing Interest Amounts as of Dec 31, 2014","Opening Principal Amounts as of Jan 1, 2015","Transactions2 Debit / (Credit) during 2015","OEB-Approved Disposition during 2015","Principal Adjustments1 during 2015 ","Closing Principal Balance as of Dec 31, 15","Opening Interest Amounts as of Jan 1, 15","Interest Jan 1 to Dec 31, 15","OEB-Approved Disposition during 2015","Interest Adjustments1 during 2015","Closing Interest Amounts as of Dec 31, 15","Opening Principal Amounts as of Jan 1, 2016","Transactions2 Debit / (Credit) during 2016","OEB-Approved Disposition during 2016","Principal Adjustments1 during 2016","Closing Principal Balance as of Dec 31, 16","Opening Interest Amounts as of Jan 1, 16","Interest Jan 1 to Dec 31, 16","OEB-Approved Disposition during 2016","Interest Adjustments1 during 2016","Closing Interest Amounts as of Dec 31, 16","Opening Principal Amounts as of Jan 1, 2017","Transactions2 Debit / (Credit) during 2017","OEB-Approved Disposition during 2017","Principal Adjustments1 during 2017","Closing Principal Balance as of Dec 31, 17","Opening Interest Amounts as of Jan 1, 17","Interest Jan 1 to Dec 31, 17","OEB-Approved Disposition during 2017","Interest Adjustments1 during 2017","Closing Interest Amounts as of Dec 31, 17","Opening Principal Amounts as of Jan 1, 2018","Transactions2 Debit / (Credit) during 2018","OEB-Approved Disposition during 2018","Principal Adjustments1 during 2018","Closing Principal Balance as of Dec 31, 2018","Opening Interest Amounts as of Jan 1, 2018","Interest Jan 1 to Dec 31, 2018","OEB-Approved Disposition during 2018","Interest Adjustments1 during 2018","Closing Interest Amounts as of Dec 31, 2018","Principal Disposition during 2019 - instructed by OEB","Interest Disposition during 2019 - instructed by OEB","Closing Principal Balances as of Dec 31, 2018 Adjusted for Dispositions during 2019","Closing Interest Balances as of Dec 31, 2018 Adjusted for Disposition in 2019","Projected Interest from January 1, 2019 to December 31, 2019 on December 31, 2018 balance adjusted for disposition during 2019 3","Projected Interest from January 1, 2019 to April 30, 2019 on December 31, 2018 balance adjusted for disposition during 2019  3","Total Interest","Dispose of Account? (Y/N)","Total Claim","As of Dec 31-18","Variance                           RRR vs. 2018 Balance                        (Principal + Interest)"]
[]
[null,null,null,null,null,null,null,null,null,null,null,null,null,null,null,null,null,null,null,null,null,null,null,null,null,null,null,null,null,null,null,null,null,null,null,null,null,null,null,null,null,null,null,null,null,null,null,null,null,null,null,null,null,null,null,null,null,null,null,null,null,null,null,null,null,null,null,null,null,null,null,null,"Claim before Forecasted Transactions"]
[null,null,"Group 1 Accounts"]
[null,null,"LV Variance Account",1550,2495672.1800000006,null,null,null,{"$f":"E21+F21-G21+H21","v":2495672.1800000006},0,null,null,51131.899999999994,{"$f":"J21+K21-L21+M21","v":51131.899999999994},{"$f":"I21","v":2495672.1800000006},938909.09,1690690.02,null,{"$f":"O21+P21-Q21+SUM(R21:R21)","v":1743891.2500000005},51131.899999999994,20669.599999999999,41280.14,null,{"$f":"T21+U21-V21+W21","v":30521.360000000001},{"$f":"S21","v":1743891.2500000005},1545686.91,null,null,{"$f":"Y21+Z21-AA21+SUM(AB21:AB21)","v":3289578.16},{"$f":"X21","v":30521.360000000001},26398.21,null,null,{"$f":"AD21+AE21-AF21+AG21","v":56919.57},{"$f":"AC21","v":3289578.16},2290281.5499999998,1743890.16,null,{"$f":"AI21+AJ21-AK21+SUM(AL21:AL21)","v":3835969.55},{"$f":"AH21","v":56919.57},33128.83,49705.77,null,{"$f":"AN21+AO21-AP21+AQ21","v":40342.629999999997},{"$f":"AM21","v":3835969.55},2379788.37,1545688,null,{"$f":"AS21+AT21-AU21+SUM(AV21:AV21)","v":4670069.92},{"$f":"AR21","v":40342.629999999997},42417.74,24215.26,null,{"$f":"AX21+AY21-AZ21+BA21","v":58545.11},{"$f":"AW21","v":4670069.92},1802978.92,2290281.5499999998,null,{"$f":"BC21+BD21-BE21+SUM(BF21:BF21)","v":4182767.29},{"$f":"BB21","v":58545.11},76498.179999999993,55806.497853749999,null,{"$f":"BH21+BI21-BJ21+BK21","v":79236.79214624998},2379788.37,51921,{"$f":"BG21-BM21","v":1802978.92},{"$f":"BL21-BN21","v":27315.79214624998},{"$f":"+BO21*((2.45%*3/12)+(2.18%*9/12))","v":40521.951227000005},null,{"$f":"BP21+BQ21+BR21","v":67837.743373249978},null,{"$f":"SUM(BO21:BR21)","v":1870816.6633732498},{"$f":"+'[13]YTD 18 TB'!$H$25","v":4262004.08},{"$f":"BV21-SUM(BG21,BL21)","v":-2.1462496370077133E-3}]
[null,null,"Smart Metering Entity Charge Variance Account",1551,-36015.11,null,null,null,-36015.11,0,null,null,-147.97999999999999,-147.97999999999999,{"$f":"I22","v":-36015.11},-33601.449999999997,null,null,-69616.56,-147.97999999999999,-667.97999999999979,0,null,{"$f":"T22+U22-V22+W22","v":-815.95999999999981},-69616.56,-26931.200000000001,null,null,-96547.76,-815.95999999999981,-903.34,null,null,{"$f":"AD22+AE22-AF22+AG22","v":-1719.2999999999997},{"$f":"AC22","v":-96547.76},-33443.760000000002,-69616.56,null,{"$f":"AI22+AJ22-AK22+SUM(AL22:AL22)","v":-60374.959999999992},-1719.2999999999997,-621.30999999999995,-1581.74,null,{"$f":"AN22+AO22-AP22+AQ22","v":-758.86999999999966},{"$f":"AM22","v":-60374.959999999992},-26812.58,-26931.200000000001,null,{"$f":"AS22+AT22-AU22+SUM(AV22:AV22)","v":-60256.34},-758.86999999999966,-511.38000000000005,-433.8,null,{"$f":"AX22+AY22-AZ22+BA22","v":-836.44999999999982},{"$f":"AW22","v":-60256.34},-143033.29,-33443.759999999995,null,{"$f":"BC22+BD22-BE22+SUM(BF22:BF22)","v":-169845.87},-836.44999999999982,-2744.43,-904.48314199999959,null,{"$f":"BH22+BI22-BJ22+BK22","v":-2676.3968580000001},-26812.58,-486,-143033.28999999998,{"$f":"BL22-BN22","v":-2190.3968580000001},{"$f":"+BO22*((2.45%*3/12)+(2.18%*9/12))","v":-3214.67319275},null,{"$f":"BP22+BQ22+BR22","v":-5405.0700507500005},null,{"$f":"SUM(BO22:BR22)","v":-148438.36005074997},{"$f":"+'[13]YTD 18 TB'!$H$26","v":-172522.26},{"$f":"BV22-SUM(BG22,BL22)","v":6.857999978819862E-3}]
[null,null,"RSVA - Wholesale Market Service Charge",1580,-14447498.530000001,null,null,null,-14447498.530000001,0,null,null,-303050.23999999999,-303050.23999999999,-14447498.530000001,-1098113.8500000001,-9704806,null,-5840806.3800000008,-303050.23999999999,-35370.699999999997,-236108.65,null,{"$f":"T23+U23-V23+W23","v":-102312.29000000001},-5840806.3800000008,-15911140.41,null,null,-21751946.789999999,-102312.29000000001,-126678.56,null,null,{"$f":"AD23+AE23-AF23+AG23","v":-228990.85},-21751946.789999999,-6868014.8500000006,-5840806.0599999996,null,{"$f":"AI23+AJ23-AK23+SUM(AL23:AL23)","v":-22779155.580000002},-228990.85,-231088.58,-166561.26999999999,null,{"$f":"AN23+AO23-AP23+AQ23","v":-293518.16000000003},-22779155.580000002,-7283688.9299999997,-15911140.41,null,{"$f":"AS23+AT23-AU23+SUM(AV23:AV23)","v":-14151704.100000001},-293518.16000000003,-131490.29999999999,-237452.12,null,{"$f":"AX23+AY23-AZ23+BA23","v":-187556.34000000003},-14151704.100000001,336040.76,-6868015.1700000018,null,{"$f":"BC23+BD23-BE23+SUM(BF23:BF23)","v":-6947648.1699999999},-187556.34000000003,-186047.56,-175054.40282025008,null,{"$f":"BH23+BI23-BJ23+BK23","v":-198549.49717974995},-7283688.9299999997,-163032,336040.75999999978,-35517.497179749946,7552.5160809999952,null,-27964.981098749951,null,{"$f":"SUM(BO23:BR23)","v":308075.77890124981},{"$f":"+'[13]YTD 18 TB'!$H$30+478530.18","v":-7146197.6700000009},-2.820250578224659E-3]
[null,null,"Variance WMS – Sub-account CBR Class A",1580,0,null,null,null,0,0,null,null,0,0,0,null,null,null,0,0,null,null,null,0,0,163061.35,null,null,{"$f":"Y24+Z24-AA24+SUM(AB24:AB24)","v":163061.35},0,520.61,null,null,520.61,163061.35,-163061.35,null,null,{"$f":"AI24+AJ24-AK24+SUM(AL24:AL24)","v":0},520.61,-520.61,null,null,0,0,null,null,null,{"$f":"AS24+AT24-AU24+SUM(AV24:AV24)","v":0},0,null,null,null,0,0,null,0,null,{"$f":"BC24+BD24-BE24+SUM(BF24:BF24)","v":0},0,null,0,null,0,0,0,0,0,0,null,0,null,0,null,0]
[null,null,"Variance WMS – Sub-account CBR Class B",1580,0,null,null,null,0,0,null,null,0,0,0,null,null,null,0,0,null,null,null,0,0,1719663.73,null,null,1719663.73,0,5728.32,null,null,5728.32,1719663.73,-275214.3,null,null,{"$f":"AI25+AJ25-AK25+SUM(AL25:AL25)","v":1444449.43},5728.32,16472.099999999999,null,null,22200.42,1444449.43,35171.080000000075,1719663.73,null,{"$f":"AS25+AT25-AU25+SUM(AV25:AV25)","v":-240043.21999999997},22200.42,-2176.9000000000015,24644.62,null,-4621.1000000000022,-240043.21999999997,-509497.98,-275214.30000000005,null,{"$f":"BC25+BD25-BE25+SUM(BF25:BF25)","v":-474326.89999999991},-4621.1000000000022,-6794.68,-7212.2877475000014,null,-4203.4922525000011,35171.080000000075,3318,{"$f":"BG25-BM25","v":-509497.98},-7521.4922525000011,-11450.9671005,null,-18972.459353000002,null,-528470.43935300002,-478530.18,0.21225249994313344]
[null,null,"RSVA - Retail Transmission Network Charge",1584,5108991.5599999996,null,null,null,5108991.5599999996,0,null,null,48925.099999999984,48925.099999999984,5108991.5599999996,2422342.59,1692260,null,5839074.1499999994,48925.099999999984,71423.27,27552.22,null,92796.15,5839074.1499999994,-1557809.05,null,null,4281265.0999999996,92796.15,61504.020000000004,null,null,154300.16999999998,4281265.0999999996,-568200.56000000006,5839073.9800000004,null,-2126009.4400000009,154300.16999999998,-7166.82,157025.1,null,-9891.7500000000291,-2126009.4400000009,1964322.9400000002,-1557808.05,null,1396121.5499999993,-9891.7500000000291,-4203.1600000000017,-19861.830000000002,null,5766.919999999971,1396121.5499999993,193877.54,-568201.39000000013,null,2158200.4799999995,5766.919999999971,17160.59,125.98946824999621,null,22801.520531749979,1964322.9399999995,46237,{"$f":"BG26-BM26","v":193877.54000000004},-23435.479468250021,4357.3977115000016,null,-19078.08175675002,null,174799.45824325003,{"$f":"+'[13]YTD 18 TB'!$H$31","v":2181001.96},-4.0531749371439219E-2]
[null,null,"RSVA - Retail Transmission Connection Charge",1586,1710896.75,null,null,null,1710896.75,0,null,null,14045.729999999992,14045.729999999992,1710896.75,2297463.04,1028939,null,2979420.79,14045.729999999992,28329.71,10695.4,null,31680.039999999986,2979420.79,593534.94000000006,null,null,3572955.73,31680.039999999986,38091.94,null,null,69771.979999999981,3572955.73,333841.02,2979420.24,null,927376.50999999978,69771.979999999981,15523.13,64454.46,null,20840.649999999987,927376.50999999978,48373.089999999967,593534.93999999994,null,382214.6599999998,20840.649999999987,9516.9599999999991,11846.41,null,18511.199999999986,382214.6599999998,4539132.7699999996,333841.56999999983,null,4587505.8599999994,18511.199999999986,61615.77,14778.040860249979,null,65348.929139750006,48373.089999999967,4733,4539132.7699999996,60615.929139750006,102017.00900575001,null,162632.93814550003,null,{"$f":"SUM(BO27:BR27)","v":4701765.7081454992},{"$f":"+'[13]YTD 18 TB'!H32","v":4652855.03},0.24086025077849627]
[null,null,"RSVA - Power",1588,-1143566.33,null,null,null,-1143566.33,0,null,null,-36783.460000000006,-36783.460000000006,-1143566.33,-490296.98,716650,null,-2350513.31,-36783.460000000006,2506.5100000000002,-7074.25,null,-27202.700000000004,-2350513.31,1362015.65,null,null,-988497.66000000015,-27202.700000000004,-33475.46,null,null,-60678.16,-988497.66000000015,-2851171.44,-2350512.34,2500544.2639378831,1011387.5039378828,-60678.16,-6630.11,-53059.35,null,-14248.920000000006,1011387.5039378828,1318484.74,1362015.65,-998800.96393788327,{"$f":"AS28+AT28-AU28+AV28","v":-30944.370000000577},-14248.920000000006,-23231.5,7363.36,null,-44843.780000000006,-30944.370000000577,-4154227.8899999997,-350628.14606211707,-370191.18999999994,-4204735.3039378831,-44843.780000000006,-18098.75,-27686.914780526178,null,-35255.615219473824,319683.77606211649,-10550,-4524419.08,-24705.615219473824,-101686.31882300001,null,-126391.93404247383,null,-4650811.0140424743,{"$f":"+'[13]YTD 18 TB'!H33","v":-5371543.3200000003},-1131552.4008426433]
[null,null,"RSVA - Global Adjustment",1589,389458.42999999854,null,null,null,389458.42999999854,0,null,null,-20702.900000000009,-20702.900000000009,389458.42999999854,7999425.6600000001,-2771959,null,11160843.089999998,-20702.900000000009,59398.74,-101964.8,null,140660.63999999998,11160843.089999998,4890995.04,null,null,16051838.129999999,140660.63999999998,139600.71,null,null,280261.34999999998,16051838.129999999,-1033668.01,11160843.08,{"$f":"-2514038+157273+1530001","v":-826764},3030563.0399999991,280261.34999999998,96150.64,263430.19,null,112981.79999999999,3030563.0399999991,2524883.15,4890994.04,2871035.0510674599,{"$f":"AS29+AT29-AU29+SUM(AV29:AV29)","v":3535487.2010674593},112981.79999999999,17845.330000000009,70633.100000000006,null,60194.03,3535487.2010674593,-8449464.5800000448,-1860431,-538732.38467053697,-3592278.7636031229,60194.03,27103.32,10116.728484999992,null,77180.621515000006,5395918.2010674588,161593,{"$f":"BG29-BM29","v":-8988196.9646705817},-84412.378484999994,-202009.72678097134,null,-286422.10526597133,null,-9274619.069936553,{"$f":"+'[13]YTD 18 TB'!H34","v":-5020637.54},-1505539.3979118774]
[null,null,"Disposition and Recovery/Refund of Regulatory Balances (2009)4",1595,-2807103.74,null,null,null,-2807103.74,0,null,null,null,0,-2807103.74,null,-2805249,1855,0.25999999977648258,-192718.47,null,-192712,6,-0.47000000000116415,0.25999999977648258,null,null,null,0.25999999977648258,-0.47000000000116415,null,null,null,-0.47000000000116415,0.25999999977648258,null,null,null,0.25999999977648258,-0.47000000000116415,null,null,null,-0.47000000000116415,0.25999999977648258,null,null,null,0.25999999977648258,-0.47000000000116415,null,null,null,-0.47000000000116415,0.25999999977648258,null,0,null,0.25999999977648258,-0.47000000000116415,null,-0.46549550009234808,null,-4.5044999088160731E-3,0.25999999977648258,8.0816666597189647E-4,0,-5.3126665747879696E-3,0,null,-5.3126665747879696E-3,"No",{"$f":"IF(BT30=\"YES\",SUM(BO30:BR30),0)","v":0},null,-0.25549549986766651]
[null,null,"Disposition and Recovery/Refund of Regulatory Balances (2010)4",1595,null,null,null,null,0,0,null,null,null,0,0,null,null,null,0,null,null,null,null,0,0,null,null,null,0,0,null,null,null,0,0,null,null,null,0,0,null,null,null,0,0,null,null,null,0,0,null,null,null,0,0,null,0,null,0,0,null,-1.648208126425743E-10,null,1.648208126425743E-10,-0.18999999953439328,-3.8823333318870183E-3,0.18999999953439328,3.8823334967078311E-3,4.2702499895354894E-3,null,8.1525834862433214E-3,"No",0,null,-1.648208126425743E-10]
[null,null,"Disposition and Recovery/Refund of Regulatory Balances (2011)4",1595,null,null,null,null,0,0,null,null,null,0,0,null,null,null,0,null,null,null,null,0,0,null,null,null,0,0,null,null,null,0,0,null,null,null,0,0,null,null,null,0,0,null,null,null,0,0,null,null,null,0,0,null,-2.7939677238464355E-9,null,2.7939677238464355E-9,0,null,3.2917500000009454E-3,null,-3.2917500000009454E-3,-4.6566128730773926E-10,-9.5150123039881394E-12,3.2596290111541748E-9,-3.2917499904859329E-3,7.3260162025690088E-11,null,-3.2917499172257711E-3,"No",0,null,3.2917472060332215E-3]
[null,null,"Disposition and Recovery/Refund of Regulatory Balances (2012)4",1595,0,null,null,null,0,0,null,null,null,0,0,9885176.9800000004,10153475,null,-268298.01999999955,0,383549.67000000004,458332.08,null,-74782.409999999974,-268298.01999999955,-5335.64,null,null,-273633.65999999957,-74782.409999999974,-2969.19,null,null,-77751.599999999977,-273633.65999999957,5335.64,-268298.02,null,4.6566128730773926E-10,-77751.599999999977,17.910000000000025,-77733.69,null,2.9103830456733704E-11,4.6566128730773926E-10,null,null,null,4.6566128730773926E-10,2.9103830456733704E-11,null,null,null,2.9103830456733704E-11,4.6566128730773926E-10,null,0.19000000000005457,null,-0.18999999953439328,2.9103830456733704E-11,null,3.717141225934029E-11,null,-8.0675818026065859E-12,0,0,-0.18999999953439328,-8.0675818026065859E-12,-4.2702499895354894E-3,null,-4.2702499976030716E-3,"No",0,null,0.18999999954246086]
[null,null,"Disposition and Recovery/Refund of Regulatory Balances (2013)4",1595,0,null,null,null,0,0,null,null,null,0,0,null,null,null,0,0,null,null,null,0,0,null,null,null,0,0,null,null,null,0,0,null,null,null,0,0,null,null,null,0,0,null,null,null,0,0,null,null,null,0,0,null,4.6566128730773926E-10,null,-4.6566128730773926E-10,0,null,0,null,0,0,0,-4.6566128730773926E-10,0,-1.0465737432241441E-11,null,-1.0465737432241441E-11,"No",0,null,4.6566128730773926E-10]
[null,null,"Disposition and Recovery/Refund of Regulatory Balances (2014)4",1595,0,null,null,null,0,0,null,null,null,0,0,null,null,null,{"$f":"O35+P35-Q35+SUM(R35:R35)","v":0},0,null,null,null,0,0,null,null,null,0,0,null,null,null,0,0,null,null,null,0,0,null,null,null,0,0,null,null,null,0,0,null,null,null,0,0,null,null,null,0,0,null,null,null,0,null,null,0,0,0,null,{"$f":"BP35+BQ35+BR35","v":0},"No",0,null,0]
[null,null,"Disposition and Recovery/Refund of Regulatory Balances (2015)4",1595,0,null,null,null,0,0,null,null,null,0,0,null,null,null,0,0,null,null,null,0,0,null,null,null,0,0,null,null,null,0,0,null,null,null,0,0,null,null,null,0,0,null,null,null,0,0,null,null,null,0,0,null,null,null,0,0,null,null,null,0,null,null,0,0,0,null,0,"No",0,null,0]
[null,null,"Disposition and Recovery/Refund of Regulatory Balances (2016)4",1595,0,null,null,null,0,0,null,null,null,0,0,null,null,null,{"$f":"O37+P37-Q37+SUM(R37:R37)","v":0},{"$f":"N37","v":0},null,null,null,{"$f":"T37+U37-V37+W37","v":0},{"$f":"S37","v":0},null,null,null,{"$f":"Y37+Z37-AA37+SUM(AB37:AB37)","v":0},{"$f":"X37","v":0},null,null,null,{"$f":"AD37+AE37-AF37+AG37","v":0},{"$f":"AC37","v":0},-11165511,-11106926.08,null,{"$f":"AI37+AJ37-AK37+SUM(AL37:AL37)","v":-58584.919999999925},{"$f":"AH37","v":0},494808.82,441505.89,null,{"$f":"AN37+AO37-AP37+AQ37","v":53302.929999999993},{"$f":"AM37","v":-58584.919999999925},-13770.65,null,null,{"$f":"AS37+AT37-AU37+SUM(AV37:AV37)","v":-72355.56999999992},{"$f":"AR37","v":53302.929999999993},-682.80000000000007,null,null,{"$f":"AX37+AY37-AZ37+BA37","v":52620.12999999999},-72355.56999999992,null,-58584.919999999925,null,-13770.649999999994,52620.12999999999,-499.24,52287.946260999997,null,-167.05626100000518,null,null,-13770.649999999994,-167.05626100000518,-309.49535874999992,null,-476.5516197500051,"No",0,-13937.24,0.4662609999995766]
[null,null,"Disposition and Recovery/Refund of Regulatory Balances (2017)4",1595,0,null,null,null,0,0,null,null,null,0,0,null,null,null,0,0,null,null,null,null,null,null,null,null,null,null,null,null,null,0,0,null,null,null,{"$f":"AI38+AJ38-AK38+SUM(AL38:AL38)","v":0},0,null,null,null,0,0,7385427.3099999996,7383983.2999999998,null,1444.0099999997765,0,79526.209999999992,119045,null,-39518.790000000008,1444.0099999997765,{"$f":"-29215.66-437.38-188.61","v":-29841.65},null,null,-28397.640000000225,-39518.790000000008,{"$f":"1.73+188.61","v":190.34},0,null,-39328.450000000012,null,null,-28397.640000000225,-39328.450000000012,-638.23695900000507,null,-39966.686959000013,"Yes",-68364.326959000231,-67726.09,2.3283064365386963E-10]
[null,null,"Disposition and Recovery/Refund of Regulatory Balances (2018)4",1595,0,null,null,null,0,0,null,null,null,0,0,null,null,null,0,0,null,null,null,null,null,null,null,null,null,null,null,null,null,0,0,null,null,null,0,0,null,null,null,0,0,null,null,null,0,0,null,null,null,0,0,{"$f":"5415410.46-1944071.3","v":3471339.16},5415410.46,null,-1944071.2999999998,0,{"$f":"-42713.66+38040.12-36897.6","v":-41571.14},-36897.599999999999,null,-4673.5400000000009,null,null,-1944071.2999999998,-4673.5400000000009,-43693.002467500002,null,-48366.542467500003,"No",0,-1948744.84,0]
[null,null,"Disposition and Recovery/Refund of Regulatory Balances (2019)4\nNot to be disposed of unless rate rider has expired and balance has been audited",1595,0,null,null,null,0,0,null,null,null,0,0,null,null,null,0,0,null,null,null,null,null,null,null,null,null,null,null,null,null,0,0,null,null,null,0,0,null,null,null,0,0,null,null,null,0,0,null,null,null,0,0,null,null,null,0,0,null,null,null,0,-4771217.4819006361,-166830.15370699207,4771217.4819006361,166830.15370699207,{"$f":"+BO40*((2.45%*12/12)+(0*9/12))","v":116894.8283065656},null,283724.98201355769,"No",0,null,0]
[null,null,null,null,null,null,null,null,null,null,null,null,null,null,null,null,null,null,null,null,null,null,null,null,null,null,null,null,null,null,null,null,null,null,null,null,null,null,null,null,null,null,null,null,null,null,null,null,null,null,null,null,null,null,null,null,null,null,null,null,null,null,null,null,null,null,0,0,0,null,null,null,null,null,0]
[null,null,{"$f":"C29","v":"RSVA - Global Adjustment"},1589,{"$f":"E29","v":389458.42999999854},{"$f":"F29","v":0},0,0,389458.42999999854,0,0,0,-20702.900000000009,-20702.900000000009,{"$f":"O29","v":389458.42999999854},7999425.6600000001,-2771959,0,11160843.089999998,-20702.900000000009,59398.74,-101964.8,0,140660.63999999998,11160843.089999998,4890995.04,0,0,16051838.129999999,140660.63999999998,139600.71,0,0,280261.34999999998,16051838.129999999,-1033668.01,11160843.08,-826764,3030563.0399999991,280261.34999999998,96150.64,263430.19,0,112981.79999999999,3030563.0399999991,2524883.15,4890994.04,2871035.0510674599,3535487.2010674593,112981.79999999999,17845.330000000009,70633.100000000006,0,60194.03,3535487.2010674593,-8449464.5800000448,-1860431,-538732.38467053697,-3592278.7636031229,60194.03,27103.32,10116.728484999992,0,77180.621515000006,5395918.2010674588,161593,-8988196.9646705817,-84412.378484999994,{"$f":"BQ29","v":-202009.72678097134},{"$f":"BR29","v":0},{"$f":"BS29","v":-286422.10526597133},null,{"$f":"BU29","v":-9274619.069936553},{"$f":"BV29","v":-5020637.54},-1505539.3979118774]
[null,null,"Total Group 1 Balance excluding Account 1589 - Global Adjustment",null,{"$f":"SUM(E21:E40)-E29","v":-9118623.2200000007},0,0,0,-9118623.2200000007,0,0,0,-225878.95000000007,{"$f":"SUM(N21:N40)-N29","v":-225878.95000000007},{"$f":"SUM(O21:O40)-O29","v":-9118623.2200000007},13921879.419999998,2771959.0199999996,1855,2033152.1799999997,-418597.42000000004,470440.08000000007,101964.94000000002,6,-50116.280000000028,2033152.1799999997,-12117253.719999999,0,0,-10084101.539999999,-50116.280000000028,-31783.450000000012,0,0,-81899.729999999981,-10084101.539999999,-19295159.049999997,-9073774.6799999997,2500544.2639378831,-17804941.646062121,-81899.729999999981,313923.36000000004,413755.1700000001,0,-181731.54000000007,-17804941.646062121,5807295.370000001,-4890994.04,-998800.96393788327,-8105453.2000000048,-181731.54000000007,-30835.130000000012,-70633.100000000006,0,-141933.57000000007,-8105453.2000000048,5506768.3399999999,-114553.91606212128,-370191.18999999994,{"$f":"SUM(BG21:BG40)-BG29","v":-2854322.1339378832},-141933.57000000007,-100290.92000000001,-124757.67625077648,0,-117466.81374922358,-7334379.66583852,-234689.15678115876,4480057.5319006387,117222.34303193516,110351.00843031566,0,227573.35146225081,null,{"$f":"SUM(BU21:BU38)-BU29","v":1659373.4682580242},{"$f":"SUM(BV21:BV38)-BV29","v":-2154595.6900000004},817193.25768710626]
[null,null,"Total Group 1 Balance",null,{"$f":"SUM(E42,E43)","v":-8729164.7900000028},{"$f":"SUM(F42,F43)","v":0},0,0,-8729164.7900000028,0,0,0,-246581.85000000009,-246581.85000000009,{"$f":"SUM(O42,O43)","v":-8729164.7900000028},21921305.079999998,1.9999999552965164E-2,1855,13193995.269999998,-439300.32000000007,529838.82000000007,0.14000000001396984,6,90544.359999999957,13193995.269999998,-7226258.6799999988,0,0,5967736.5899999999,90544.359999999957,107817.25999999998,0,0,198361.62,5967736.5899999999,-20328827.059999999,2087068.4000000004,1673780.2639378831,-14774378.606062122,198361.62,410074.00000000006,677185.3600000001,0,-68749.740000000078,-14774378.606062122,8332178.5200000014,0,1872234.0871295766,-4569965.998932546,-68749.740000000078,-12989.800000000003,0,0,-81739.540000000066,-4569965.998932546,-2942696.2400000449,-1974984.9160621213,-908923.57467053691,-6446600.8975410061,-81739.540000000066,-73187.600000000006,-114640.94776577648,0,-40286.192234223578,-1938461.4647710612,-73096.156781158759,-4508139.432769943,32809.964546935167,-91658.718350655676,0,-58848.753803720523,null,{"$f":"SUM(BU42,BU43)","v":-7615245.6016785288},{"$f":"SUM(BV42,BV43)","v":-7175233.2300000004},-688346.14022477064]
[null,null,null,null,null,null,null,null,null,null,null,null,null,null,null,null,null,null,null,null,null,null,null,null,null,null,null,null,null,null,null,null,null,null,null,null,null,null,null,null,null,null,null,null,null,null,null,null,null,null,null,null,null,null,null,null,null,null,null,null,null,null,null,null,null,null,null,null,null,null,null,null,null,null,0]
[29,null,"LRAM Variance Account (only input amounts if applying for disposition of this account)",1568,0,null,null,61418.660000000091,61418.660000000091,0,null,null,5868.05,{"$f":"J46+K46-L46+M46","v":5868.05},61418.660000000091,12856.94000000009,null,null,{"$f":"O46+P46-Q46+SUM(R46:R46)","v":74275.60000000018},5868.05,688.52999999999975,null,null,{"$f":"T46+U46-V46+W46","v":6556.58},{"$f":"S46","v":74275.60000000018},{"$f":"2209737.02","v":2209737.02},null,null,{"$f":"Y46+Z46-AA46+SUM(AB46:AB46)","v":2284012.62},{"$f":"X46","v":6556.58},{"$f":"63436.96","v":63436.959999999999},null,null,{"$f":"AD46+AE46-AF46+AG46","v":69993.539999999994},{"$f":"AC46","v":2284012.62},{"$f":"1131354.02","v":1131354.02},null,null,{"$f":"AI46+AJ46-AK46+SUM(AL46:AL46)","v":3415366.64},{"$f":"AH46","v":69993.539999999994},{"$f":"29554.8","v":29554.799999999999},null,null,{"$f":"AN46+AO46-AP46+AQ46","v":99548.34},{"$f":"AM46","v":3415366.64},2243433.8600000008,null,null,{"$f":"AS46+AT46-AU46+SUM(AV46:AV46)","v":5658800.5000000009},{"$f":"AR46","v":99548.34},45357.110000000008,null,null,{"$f":"AX46+AY46-AZ46+BA46","v":144905.45000000001},{"$f":"AW46","v":5658800.5000000009},2903714.21,1974985.11,null,{"$f":"BC46+BD46-BE46+SUM(BF46:BF46)","v":6587529.6000000006},{"$f":"BB46","v":144905.45000000001},116480.1,114640.95,null,{"$f":"BH46+BI46-BJ46+BK46","v":146744.60000000003},{"$f":"+'[14]1.  LRAMVA Summary'!$R$68+'[14]1.  LRAMVA Summary'!$R$69","v":1938461.5347710615},{"$f":"+'[14]1.  LRAMVA Summary'!$R$83","v":73096.153706992074},{"$f":"BG46-BM46","v":4649068.0652289391},{"$f":"BL46-BN46","v":73648.446293007961},{"$f":"+BO46*((2.45%*12/12)+(0*9/12))","v":113902.16759810902},null,{"$f":"BP46+BQ46+BR46","v":187550.61389111698},null,{"$f":"SUM(BO46:BR46)","v":4836618.6791200554},{"$f":"+'[13]YTD 18 TB'!$H$29","v":6734274.2000000002},0]
[null,null,null,null,null,null,null,null,null,null,null,null,null,null,null,null,null,null,null,null,null,null,null,null,null,null,null,null,null,null,null,null,null,null,null,null,null,null,null,null,null,null,null,null,null,null,null,null,null,null,null,null,null,null,null,null,null,null,null,null,null,null,null,null,null,null,null,null,null,null,null,null,null,null,0]
[null,null,"Total including Account 1568",null,{"$f":"SUM(E44,E46)","v":-8729164.7900000028},{"$f":"SUM(F44,F46)","v":0},0,61418.660000000091,-8667746.1300000027,0,0,0,-240713.8000000001,-240713.8000000001,{"$f":"SUM(O44,O46)","v":-8667746.1300000027},21934162.02,1.9999999552965164E-2,{"$f":"SUM(R44,R46)","v":1855},13268270.869999997,-433432.27000000008,530527.35000000009,0.14000000001396984,6,97100.939999999959,13268270.869999997,-5016521.6599999983,0,0,8251749.21,97100.939999999959,171254.21999999997,0,0,268355.15999999997,8251749.21,-19197473.039999999,2087068.4000000004,1673780.2639378831,-11359011.966062121,268355.15999999997,439628.80000000005,677185.3600000001,0,30798.599999999919,-11359011.966062121,10575612.380000003,0,1872234.0871295766,1088834.5010674549,30798.599999999919,32367.310000000005,0,0,63165.909999999945,1088834.5010674549,-38982.030000044964,0.19393787882290781,-908923.57467053691,140928.70245899446,63165.909999999945,43292.5,2.2342235170071945E-3,0,106458.40776577646,7.0000000298023224E-2,-3.0741666851099581E-3,140928.63245899603,106458.41083994313,22243.449247453347,{"$f":"SUM(BR44,BR46)","v":0},{"$f":"SUM(BS44,BS46)","v":128701.86008739646},null,{"$f":"SUM(BU44,BU46)","v":-2778626.9225584734},{"$f":"SUM(BV44,BV46)","v":-440959.03000000026},-688346.14022477111]
[]
[]
[null,null,"For all OEB-Approved dispositions, please ensure that the disposition amount has the same sign (e.g: debit balances are to have a positive figure and credit balance are to have a negative figure) as per the related OEB decision."]
[]
[]
[null,1,"Please provide explanations for the nature of the adjustments.  If the adjustment relates to previously OEB-Approved disposed balances, please provide amounts for adjustments and include supporting documentations."]
[null,2,"For RSVA accounts only, report the net variance to the account during the year.  For all other accounts, record the transactions during the year."]
[null,3,"If the LDC’s rate year begins on January 1, 2017, the projected interest is recorded from January 1, 2016 to December 31, 2016 on the December 31, 2015 balances adjusted for the disposed balances approved by the OEB in the 2016 rate decision.  If the LDC’s rate year begins on May 1, 2017, the projected interest is recorded from January 1, 2016 to April 30, 2017 on the December 31, 2015 balances adjusted for the disposed interest balances approved by the OEB in the 2016 rate decision."]
[null,4,"Include Account 1595 as part of Group 1 accounts (lines 30-36) for review and disposition if the recovery (or refund) period has been completed. If the recovery (or refund) period has not been completed, do not include the respective balance in Account 1595 for disposition at this time."]
[]
[null,null,"Account 1595 - adjustments (2016):"]
[null,null,"These were required due to a comprehensive review of all the dispositions during 2015 and 2016. \nIt was determined that there were a number of reporting errors.  \nPast recovery billings were applied to the wrong year or there was transposition errors whereby billings were applied to interest rather than principal or vice versa."]

{"sheet":"4. Billing Det. for Def-Var","index":5,"n_rows":50,"n_cols":24,"rows_kept":50,"cut":false,"hidden":false,"merged":[[32,22,32,23],[14,11,15,11],[14,21,15,21],[14,9,15,9],[14,16,15,16],[14,17,15,17],[14,22,15,22],[14,18,15,18],[14,19,15,19],[14,20,15,20],[1,1,8,9],[14,23,15,23],[14,10,15,10],[14,12,15,12],[14,13,15,13],[14,14,15,14],[14,15,15,15],[12,1,12,7],[13,3,13,8],[14,3,15,3],[14,4,15,4],[14,5,15,5],[14,6,15,6],[14,7,15,7],[13,12,13,18],[14,8,15,8]]}
["Back to Index",null,null,null,null,null,null,null,null,null,"Yes"]
[null,{"$f":"+'1. Information Sheet'!B2","v":"INCENTIVE REGULATION MODEL FOR 2020 FILERS"}]
[]
[]
[]
[]
[]
[]
[]
[]
[]
[]
[null,"Information from the most recent RRR (2018 for 2020 IRM)"]
[null,null,null,null,null,null,null,null,null,null,null,null,null,null,null,null,null,null,null,null,null,null,"source: LRAMVA Workform"]
[null,null,null,"Total Metered \nkWh","Total Metered \nkW","Metered kWh for Non-RPP Customers (excluding WMP)","Metered kW for Non-RPP Customers\n(excluding WMP)","Metered kWh for Wholesale Market Participants (WMP)","Metered kW for Wholesale Market Participants (WMP)","Total Metered kWh less WMP consumption\n(if applicable)","Total Metered kW less WMP consumption \n(if applicable)","1595 Recovery Proportion (2009) 1","1595 Recovery Proportion (2010) 1","1595 Recovery Proportion (2011) 1","1595 Recovery Proportion (2012) 1","1595 Recovery Proportion (2013) 1","1595 Recovery Proportion (2014) 1","1595 Recovery Proportion (2015) 1","1595 Recovery Proportion (2016) 1","1595 Recovery Proportion (2017) 1","1595 Recovery Proportion (2018) 1","1595 Recovery Proportion (2019) 1","1568 LRAM Variance Account Class Allocation                           ($ amounts)","Number of Customers for Residential and GS<50 classes3"]
[null,"Rate Class","Unit"]
[{"$f":"'11. RTSR - Current Rates'!A16","v":"R_TN"},{"$f":"'Model Specs'!C15","v":"RESIDENTIAL SERVICE CLASSIFICATION"},"kWh",1490532667.2805483,0,47757735.712355211,0,null,null,{"$f":"D17-H17","v":1490532667.2805483},{"$f":"E17-I17","v":0},null,null,null,null,null,4.2831737001724511E-2,0.32918845870239549,null,{"$f":"IFERROR(VLOOKUP(B17,[15]ERZ!$A$2:$B$9,2,FALSE),0)","v":0.20484924659696371},null,null,{"$f":"'[16]1.  LRAMVA Summary'!$D$84","v":485983.58838381589},183533]
[{"$f":"'11. RTSR - Current Rates'!A17","v":"GSL_TN"},{"$f":"'Model Specs'!C16","v":"GENERAL SERVICE LESS THAN 50 kW SERVICE CLASSIFICATION"},"kWh",685616683.99168408,0,91858679.298262566,0,null,null,{"$f":"D18-H18","v":685616683.99168408},{"$f":"E18-I18","v":0},null,null,null,null,null,3.667843854000144E-2,0.13106269284318098,null,{"$f":"IFERROR(VLOOKUP(B18,[15]ERZ!$A$2:$B$9,2,FALSE),0)","v":9.0362231025399808E-2},null,null,{"$f":"'[16]1.  LRAMVA Summary'!$E$84","v":40152.932066721834},18506]
["GSG_TN",{"$f":"'Model Specs'!C17","v":"GENERAL SERVICE 50 to 499 kW SERVICE CLASSIFICATION"},"kW",2051428808.3748548,5710412.0095022377,1737284254.1930017,4887561.5315022394,1343047.064092664,4363.1609999999991,{"$f":"D19-H19","v":2050085761.3107622},{"$f":"E19-I19","v":5706048.8485022373},null,null,null,null,null,0.41382971137386221,0.17497138828089531,null,{"$f":"IFERROR(VLOOKUP(B19,[15]ERZ!$A$2:$B$9,2,FALSE),0)","v":0.29305621790938335},null,null,{"$f":"'[16]1.  LRAMVA Summary'!$F$84","v":1358523.5778057079}]
["LU_TN",{"$f":"'Model Specs'!C18","v":"GENERAL SERVICE 500 to 4,999 kW SERVICE CLASSIFICATION"},"kW",2037760513.1273,4585777.2030871157,1874772879.6415691,4243700.3540871153,13999209.232834941,27949.738000000001,2023761303.894465,4557827.4650871158,null,null,null,null,null,0.48383786561406839,0.15485395423253379,null,{"$f":"IFERROR(VLOOKUP(B20,[15]ERZ!$A$2:$B$9,2,FALSE),0)","v":0.2773941628225613},null,null,{"$f":"'[16]1.  LRAMVA Summary'!$G$84","v":473711.37148078694}]
["USL_TN",{"$f":"'Model Specs'!C19","v":"LARGE USE SERVICE CLASSIFICATION"},"kW",977049362,1753163,977049362,1753163,null,null,977049362,1753163,null,null,null,null,null,1.3570457298951785E-2,0.20618059253596072,null,{"$f":"IFERROR(VLOOKUP(B21,[15]ERZ!$A$2:$B$9,2,FALSE),0)","v":0.12936296658084911},null,null,{"$f":"'[16]1.  LRAMVA Summary'!$H$84","v":163129.89584502025}]
[null,{"$f":"'Model Specs'!C20","v":"STANDBY POWER SERVICE CLASSIFICATION "},"kW",null,null,null,null,null,null,0,0,null,null,null,null,null,null,null,null,{"$f":"IFERROR(VLOOKUP(B22,[15]ERZ!$A$2:$B$9,2,FALSE),0)","v":0}]
["SEN_TN",{"$f":"'Model Specs'!C21","v":"UNMETERED SCATTERED LOAD SERVICE CLASSIFICATION"},"kWh",11437642.31264231,null,444303.49806949811,0,null,null,11437642.31264231,0,null,null,null,null,null,4.1083640846538411E-4,2.3902169950551478E-3,null,{"$f":"IFERROR(VLOOKUP(B23,[15]ERZ!$A$2:$B$9,2,FALSE),0)","v":1.4926994947915366E-3}]
["SL_TN",{"$f":"'Model Specs'!C22","v":"STREET LIGHTING SERVICE CLASSIFICATION"},"kW",13289944.06494407,40571.730013897963,13289944.06494407,40571.730013897963,null,null,13289944.06494407,40571.730013897963,null,null,null,null,null,8.8409537629261983E-3,1.3526964099785945E-3,null,{"$f":"IFERROR(VLOOKUP(B24,[15]ERZ!$A$2:$B$9,2,FALSE),0)","v":3.4824755700509865E-3},null,null,{"$f":"'[16]1.  LRAMVA Summary'!$I$84","v":-132216.30344385389}]
[null,null,null,null,null,null,null,null,null,0,0]
[null,null,null,null,null,null,null,null,null,0,0]
[null,null,null,null,null,null,null,null,null,0,0]
[null,null,null,null,null,null,null,null,null,0,0]
[null,null,"Total",{"$f":"SUM(D17:D28)","v":7267115621.1519737},{"$f":"SUM(E17:E28)","v":12089923.942603251},4742457158.4082022,10924996.615603251,15342256.296927605,32312.899000000001,7251773364.8550453,12057611.043603251,{"$f":"SUM(L17:L28)","v":0},0,0,0,0,0.99999999999999989,1,0,{"$f":"SUM(T17:T28)","v":1},0,{"$f":"SUM(V17:V28)","v":0},2389285.0621381989,202039]
[]
[]
[null,"Threshold Test",null,null,null,null,null,null,null,null,null,null,null,null,null,null,null,null,null,null,null,null,"1568 Account Balance from Continuity Schedule",{"$f":"'3. Continuity Schedule'!BU46","v":4836618.6791200554}]
[null,"Total Claim (including Account 1568)",null,{"$f":"'3. Continuity Schedule'!BU48","v":-2778626.9225584734},null,null,null,null,null,null,null,null,null,null,null,null,null,null,null,null,null,null,{"$f":"IF(X32=W29,\"Total Balance of Account 1568 in Column R matches the amount entered on the Continuity Schedule\",\"Total Balance of Account 1568 in Column T DOES NOT MATCH the amount entered on the Continuity Schedule\")","v":"Total Balance of Account 1568 in Column T DOES NOT MATCH the amount entered on the Continuity Schedule"}]
[null,"Total Claim for Threshold Test (All Group 1 Accounts)",null,{"$f":"'3. Continuity Schedule'!BU44","v":-7615245.6016785288}]
[null,"Threshold Test (Total claim per kWh) 2",null,{"$f":"IFERROR(D34/D29,\"\")","v":-1.0479048357938977E-3}]
[null,"Exceeds Threshold?",null,{"$f":"IF(D35=\"\",\"\",IF(OR(D35>0.001,D35<-0.001),\"Yes\",\"No\"))","v":"Yes"}]
[null,"ELECT TO DISPOSE of the Group 1 Account Balances?",null,"Yes"]
[]
[]
[null,"As per Section 3.2.5 of the 2017 Filing Requirements for Electricity Distribution Rate Applications, an applicant may elect to dispose of the Group 1 account balances below the threshold. "]
[null,"1 Residual Account balance to be allocated to rate classes in proportion to the recovery share as established when rate riders were implemented."]
[null,"2 The Threshold Test does not include the amount in 1568."]
[null,"3 The proportion of customers for the Residential and GS<50 Classes will be used to allocate Account 1551."]
[]
[]
[null,null,null,"Total Metered kWh",{"$f":"J29","v":7251773364.8550453}]
[null,null,null,"WMP consumption",{"$f":"H29","v":15342256.296927605}]
[null,null,null,"Consumption Class A (full)",{"$f":"'6.1 GA'!E29","v":1695514662}]
[null,null,null,"Consumption Class A (partial)",{"$f":"'6.1 GA'!G29","v":328596811}]
[null,null,null,null,{"$f":"E46-E47-E48-E49","v":5212319635.5581179}]

{"sheet":"5. Allocating Def-Var Balances","index":6,"n_rows":32,"n_cols":26,"rows_kept":32,"cut":false,"hidden":false,"merged":[[13,14,14,14],[13,24,14,24],[10,1,11,7],[13,23,14,23],[1,1,8,7],[13,2,14,2],[13,3,14,3],[13,4,14,4],[13,5,14,5],[13,25,14,25],[13,15,14,15],[13,16,14,16],[13,17,14,17],[13,18,14,18],[13,19,14,19],[13,20,14,20],[13,21,14,21],[13,22,14,22]]}
["Back to Index"]
[null,{"$f":"+'1. Information Sheet'!B2","v":"INCENTIVE REGULATION MODEL FOR 2020 FILERS"}]
[]
[]
[]
[]
[]
[]
[]
[]
[null,"No input required.  This workshseet allocates the deferral/variance account balances (Group 1 and 1568) to the appropriate classes as per EDDVAR dated July 31, 2009"]
[]
[null,"Allocation of Group 1 Accounts (including Account 1568)"]
[null,null,"% of  Total kWh","% of  Total non-RPP kWh","% of Customer Numbers **","% of  Total kWh adjusted for WMP",null,null,"allocated based on Total less WMP",null,null,null,null,"allocated based on Total less WMP","1595_(2009)","1595_(2010)","1595_(2011)","1595_(2012)","1595_(2013)","1595_(2014)","1595_(2015)","1595_(2016)","1595_(2017)","1595_(2018)","1595_(2019)",1568]
[null,"Rate Class",null,null,null,null,1550,1551,1580,"1580 (Class A)","1580 (Class B)",1584,1586,1588]
[null,{"$f":"'4. Billing Det. for Def-Var'!B17","v":"RESIDENTIAL SERVICE CLASSIFICATION"},{"$f":"IFERROR('4. Billing Det. for Def-Var'!D17/'4. Billing Det. for Def-Var'!D$29,\"\")","v":0.2051065023572958},{"$f":"IFERROR('4. Billing Det. for Def-Var'!F17/'4. Billing Det. for Def-Var'!F$29,\"\")","v":1.0070251373316573E-2},{"$f":"IFERROR('4. Billing Det. for Def-Var'!X17/'4. Billing Det. for Def-Var'!X$29,\"\")","v":0.90840382302426759},{"$f":"IFERROR('4. Billing Det. for Def-Var'!J17/'4. Billing Det. for Def-Var'!J$29,\"\")","v":0.20554043711628631},{"$f":"IFERROR(G$28*C16,\"\")","v":383716.66237623373},{"$f":"IFERROR(H$28*E16,\"\")","v":-134841.97375355399},{"$f":"IFERROR(I$28*F16,\"\")","v":63322.030260303261},null,null,{"$f":"IFERROR(L$28*$C16,\"\")","v":35852.505494223195},{"$f":"IFERROR(M$28*$C16,\"\")","v":964362.71930119745},{"$f":"IFERROR(N$28*$F16,\"\")","v":-955929.72877152893},{"$f":"'4. Billing Det. for Def-Var'!L17*O$28","v":0},{"$f":"'4. Billing Det. for Def-Var'!M17*P$28","v":0},{"$f":"'4. Billing Det. for Def-Var'!N17*Q$28","v":0},{"$f":"'4. Billing Det. for Def-Var'!O17*R$28","v":0},{"$f":"'4. Billing Det. for Def-Var'!P17*S$28","v":0},{"$f":"'4. Billing Det. for Def-Var'!Q17*T$28","v":0},{"$f":"'4. Billing Det. for Def-Var'!R17*U$28","v":0},{"$f":"'4. Billing Det. for Def-Var'!S17*V$28","v":0},{"$f":"'4. Billing Det. for Def-Var'!T17*W$28","v":-14004.380871659692},{"$f":"'4. Billing Det. for Def-Var'!U17*X$28","v":0},{"$f":"'4. Billing Det. for Def-Var'!V17*Y$28","v":0},{"$f":"'4. Billing Det. for Def-Var'!W17","v":485983.58838381589}]
[null,{"$f":"'4. Billing Det. for Def-Var'!B18","v":"GENERAL SERVICE LESS THAN 50 kW SERVICE CLASSIFICATION"},{"$f":"IFERROR('4. Billing Det. for Def-Var'!D18/'4. Billing Det. for Def-Var'!D$29,\"\")","v":9.4345090918341687E-2},{"$f":"IFERROR('4. Billing Det. for Def-Var'!F18/'4. Billing Det. for Def-Var'!F$29,\"\")","v":1.9369427330598127E-2},{"$f":"IFERROR('4. Billing Det. for Def-Var'!X18/'4. Billing Det. for Def-Var'!X$29,\"\")","v":9.1596176975732413E-2},{"$f":"IFERROR('4. Billing Det. for Def-Var'!J18/'4. Billing Det. for Def-Var'!J$29,\"\")","v":9.4544692656068519E-2},{"$f":"IFERROR(G$28*C17,\"\")","v":176502.36819749788},{"$f":"IFERROR(H$28*E17,\"\")","v":-13596.386297195982},{"$f":"IFERROR(I$28*F17,\"\")","v":29126.929830997582},null,null,{"$f":"IFERROR(L$28*$C17,\"\")","v":16491.470780436295},443588.51321172831,{"$f":"IFERROR(N$28*$F17,\"\")","v":-439709.4979241041},{"$f":"'4. Billing Det. for Def-Var'!L18*O$28","v":0},{"$f":"'4. Billing Det. for Def-Var'!M18*P$28","v":0},{"$f":"'4. Billing Det. for Def-Var'!N18*Q$28","v":0},{"$f":"'4. Billing Det. for Def-Var'!O18*R$28","v":0},{"$f":"'4. Billing Det. for Def-Var'!P18*S$28","v":0},{"$f":"'4. Billing Det. for Def-Var'!Q18*T$28","v":0},{"$f":"'4. Billing Det. for Def-Var'!R18*U$28","v":0},{"$f":"'4. Billing Det. for Def-Var'!S18*V$28","v":0},{"$f":"'4. Billing Det. for Def-Var'!T18*W$28","v":-6177.5531065651476},{"$f":"'4. Billing Det. for Def-Var'!U18*X$28","v":0},{"$f":"'4. Billing Det. for Def-Var'!V18*Y$28","v":0},{"$f":"'4. Billing Det. for Def-Var'!W18","v":40152.932066721834}]
[null,{"$f":"'4. Billing Det. for Def-Var'!B19","v":"GENERAL SERVICE 50 to 499 kW SERVICE CLASSIFICATION"},{"$f":"IFERROR('4. Billing Det. for Def-Var'!D19/'4. Billing Det. for Def-Var'!D$29,\"\")","v":0.28228927614745519},{"$f":"IFERROR('4. Billing Det. for Def-Var'!F19/'4. Billing Det. for Def-Var'!F$29,\"\")","v":0.36632576661506805},{"$f":"IFERROR('4. Billing Det. for Def-Var'!X19/'4. Billing Det. for Def-Var'!X$29,\"\")","v":0},{"$f":"IFERROR('4. Billing Det. for Def-Var'!J19/'4. Billing Det. for Def-Var'!J$29,\"\")","v":0.28270130051861336},{"$f":"IFERROR(G$28*C18,\"\")","v":528111.48170823208},{"$f":"IFERROR(H$28*E18,\"\")","v":0},{"$f":"IFERROR(I$28*F18,\"\")","v":87093.423353668113},null,null,49344.012538454372,1327258.0383673201,{"$f":"IFERROR(N$28*$F18,\"\")","v":-1314790.3221360985},{"$f":"'4. Billing Det. for Def-Var'!L19*O$28","v":0},{"$f":"'4. Billing Det. for Def-Var'!M19*P$28","v":0},{"$f":"'4. Billing Det. for Def-Var'!N19*Q$28","v":0},{"$f":"'4. Billing Det. for Def-Var'!O19*R$28","v":0},{"$f":"'4. Billing Det. for Def-Var'!P19*S$28","v":0},{"$f":"'4. Billing Det. for Def-Var'!Q19*T$28","v":0},{"$f":"'4. Billing Det. for Def-Var'!R19*U$28","v":0},{"$f":"'4. Billing Det. for Def-Var'!S19*V$28","v":0},{"$f":"'4. Billing Det. for Def-Var'!T19*W$28","v":-20034.591098525103},{"$f":"'4. Billing Det. for Def-Var'!U19*X$28","v":0},{"$f":"'4. Billing Det. for Def-Var'!V19*Y$28","v":0},{"$f":"'4. Billing Det. for Def-Var'!W19","v":1358523.5778057079}]
[null,{"$f":"'4. Billing Det. for Def-Var'!B20","v":"GENERAL SERVICE 500 to 4,999 kW SERVICE CLASSIFICATION"},{"$f":"IFERROR('4. Billing Det. for Def-Var'!D20/'4. Billing Det. for Def-Var'!D$29,\"\")","v":0.28040843428940476},{"$f":"IFERROR('4. Billing Det. for Def-Var'!F20/'4. Billing Det. for Def-Var'!F$29,\"\")","v":0.39531677715162189},{"$f":"IFERROR('4. Billing Det. for Def-Var'!X20/'4. Billing Det. for Def-Var'!X$29,\"\")","v":0},{"$f":"IFERROR('4. Billing Det. for Def-Var'!J20/'4. Billing Det. for Def-Var'!J$29,\"\")","v":0.27907122879796692},524592.77141902142,0,85975.086180862549,null,null,49015.242400625932,1318414.7606166939,-1297907.5445959519,{"$f":"'4. Billing Det. for Def-Var'!L20*O$28","v":0},{"$f":"'4. Billing Det. for Def-Var'!M20*P$28","v":0},{"$f":"'4. Billing Det. for Def-Var'!N20*Q$28","v":0},{"$f":"'4. Billing Det. for Def-Var'!O20*R$28","v":0},{"$f":"'4. Billing Det. for Def-Var'!P20*S$28","v":0},{"$f":"'4. Billing Det. for Def-Var'!Q20*T$28","v":0},{"$f":"'4. Billing Det. for Def-Var'!R20*U$28","v":0},{"$f":"'4. Billing Det. for Def-Var'!S20*V$28","v":0},{"$f":"'4. Billing Det. for Def-Var'!T20*W$28","v":-18963.865243719727},{"$f":"'4. Billing Det. for Def-Var'!U20*X$28","v":0},{"$f":"'4. Billing Det. for Def-Var'!V20*Y$28","v":0},{"$f":"'4. Billing Det. for Def-Var'!W20","v":473711.37148078694}]
[null,{"$f":"'4. Billing Det. for Def-Var'!B21","v":"LARGE USE SERVICE CLASSIFICATION"},{"$f":"IFERROR('4. Billing Det. for Def-Var'!D21/'4. Billing Det. for Def-Var'!D$29,\"\")","v":0.13444802765435007},{"$f":"IFERROR('4. Billing Det. for Def-Var'!F21/'4. Billing Det. for Def-Var'!F$29,\"\")","v":0.2060217582077104},{"$f":"IFERROR('4. Billing Det. for Def-Var'!X21/'4. Billing Det. for Def-Var'!X$29,\"\")","v":0},{"$f":"IFERROR('4. Billing Det. for Def-Var'!J21/'4. Billing Det. for Def-Var'!J$29,\"\")","v":0.13473247340232206},251527.61049342563,0,41507.811686712288,null,null,23501.44239585389,632143.12595302088,-626615.27124870417,{"$f":"'4. Billing Det. for Def-Var'!L21*O$28","v":0},{"$f":"'4. Billing Det. for Def-Var'!M21*P$28","v":0},{"$f":"'4. Billing Det. for Def-Var'!N21*Q$28","v":0},{"$f":"'4. Billing Det. for Def-Var'!O21*R$28","v":0},{"$f":"'4. Billing Det. for Def-Var'!P21*S$28","v":0},{"$f":"'4. Billing Det. for Def-Var'!Q21*T$28","v":0},{"$f":"'4. Billing Det. for Def-Var'!R21*U$28","v":0},{"$f":"'4. Billing Det. for Def-Var'!S21*V$28","v":0},{"$f":"'4. Billing Det. for Def-Var'!T21*W$28","v":-8843.8121437193895},{"$f":"'4. Billing Det. for Def-Var'!U21*X$28","v":0},{"$f":"'4. Billing Det. for Def-Var'!V21*Y$28","v":0},{"$f":"'4. Billing Det. for Def-Var'!W21","v":163129.89584502025}]
[null,{"$f":"'4. Billing Det. for Def-Var'!B22","v":"STANDBY POWER SERVICE CLASSIFICATION "},{"$f":"IFERROR('4. Billing Det. for Def-Var'!D22/'4. Billing Det. for Def-Var'!D$29,\"\")","v":0},{"$f":"IFERROR('4. Billing Det. for Def-Var'!F22/'4. Billing Det. for Def-Var'!F$29,\"\")","v":0},{"$f":"IFERROR('4. Billing Det. for Def-Var'!X22/'4. Billing Det. for Def-Var'!X$29,\"\")","v":0},{"$f":"IFERROR('4. Billing Det. for Def-Var'!J22/'4. Billing Det. for Def-Var'!J$29,\"\")","v":0},0,0,0,null,null,0,0,0,{"$f":"'4. Billing Det. for Def-Var'!L22*O$28","v":0},{"$f":"'4. Billing Det. for Def-Var'!M22*P$28","v":0},{"$f":"'4. Billing Det. for Def-Var'!N22*Q$28","v":0},{"$f":"'4. Billing Det. for Def-Var'!O22*R$28","v":0},{"$f":"'4. Billing Det. for Def-Var'!P22*S$28","v":0},{"$f":"'4. Billing Det. for Def-Var'!Q22*T$28","v":0},{"$f":"'4. Billing Det. for Def-Var'!R22*U$28","v":0},{"$f":"'4. Billing Det. for Def-Var'!S22*V$28","v":0},{"$f":"'4. Billing Det. for Def-Var'!T22*W$28","v":0},{"$f":"'4. Billing Det. for Def-Var'!U22*X$28","v":0},{"$f":"'4. Billing Det. for Def-Var'!V22*Y$28","v":0},{"$f":"'4. Billing Det. for Def-Var'!W22","v":0}]
[null,{"$f":"'4. Billing Det. for Def-Var'!B23","v":"UNMETERED SCATTERED LOAD SERVICE CLASSIFICATION"},{"$f":"IFERROR('4. Billing Det. for Def-Var'!D23/'4. Billing Det. for Def-Var'!D$29,\"\")","v":1.5738902349855871E-3},{"$f":"IFERROR('4. Billing Det. for Def-Var'!F23/'4. Billing Det. for Def-Var'!F$29,\"\")","v":9.3686349339342864E-5},{"$f":"IFERROR('4. Billing Det. for Def-Var'!X23/'4. Billing Det. for Def-Var'!X$29,\"\")","v":0},{"$f":"IFERROR('4. Billing Det. for Def-Var'!J23/'4. Billing Det. for Def-Var'!J$29,\"\")","v":1.577220044971846E-3},2944.460077931476,0,485.90329385336571,null,null,275.11516040982212,7400.0631352402952,-7335.352356723628,{"$f":"'4. Billing Det. for Def-Var'!L23*O$28","v":0},{"$f":"'4. Billing Det. for Def-Var'!M23*P$28","v":0},{"$f":"'4. Billing Det. for Def-Var'!N23*Q$28","v":0},{"$f":"'4. Billing Det. for Def-Var'!O23*R$28","v":0},{"$f":"'4. Billing Det. for Def-Var'!P23*S$28","v":0},{"$f":"'4. Billing Det. for Def-Var'!Q23*T$28","v":0},{"$f":"'4. Billing Det. for Def-Var'!R23*U$28","v":0},{"$f":"'4. Billing Det. for Def-Var'!S23*V$28","v":0},{"$f":"'4. Billing Det. for Def-Var'!T23*W$28","v":-102.04739631346307},{"$f":"'4. Billing Det. for Def-Var'!U23*X$28","v":0},{"$f":"'4. Billing Det. for Def-Var'!V23*Y$28","v":0},{"$f":"'4. Billing Det. for Def-Var'!W23","v":0}]
[null,{"$f":"'4. Billing Det. for Def-Var'!B24","v":"STREET LIGHTING SERVICE CLASSIFICATION"},{"$f":"IFERROR('4. Billing Det. for Def-Var'!D24/'4. Billing Det. for Def-Var'!D$29,\"\")","v":1.8287783981669147E-3},{"$f":"IFERROR('4. Billing Det. for Def-Var'!F24/'4. Billing Det. for Def-Var'!F$29,\"\")","v":2.8023329723456726E-3},{"$f":"IFERROR('4. Billing Det. for Def-Var'!X24/'4. Billing Det. for Def-Var'!X$29,\"\")","v":0},{"$f":"IFERROR('4. Billing Det. for Def-Var'!J24/'4. Billing Det. for Def-Var'!J$29,\"\")","v":1.8326474637710526E-3},3421.3091009077039,0,564.59429485266696,null,null,319.66947324653529,8598.4875602984557,-8523.2970093634176,{"$f":"'4. Billing Det. for Def-Var'!L24*O$28","v":0},{"$f":"'4. Billing Det. for Def-Var'!M24*P$28","v":0},{"$f":"'4. Billing Det. for Def-Var'!N24*Q$28","v":0},{"$f":"'4. Billing Det. for Def-Var'!O24*R$28","v":0},{"$f":"'4. Billing Det. for Def-Var'!P24*S$28","v":0},{"$f":"'4. Billing Det. for Def-Var'!Q24*T$28","v":0},{"$f":"'4. Billing Det. for Def-Var'!R24*U$28","v":0},{"$f":"'4. Billing Det. for Def-Var'!S24*V$28","v":0},{"$f":"'4. Billing Det. for Def-Var'!T24*W$28","v":-238.07709849769637},{"$f":"'4. Billing Det. for Def-Var'!U24*X$28","v":0},{"$f":"'4. Billing Det. for Def-Var'!V24*Y$28","v":0},{"$f":"'4. Billing Det. for Def-Var'!W24","v":-132216.30344385389}]
[null,null,null,null,null,null,null,null,null,null,null,null,null,null,{"$f":"'4. Billing Det. for Def-Var'!L25*O$28","v":0},{"$f":"'4. Billing Det. for Def-Var'!M25*P$28","v":0},{"$f":"'4. Billing Det. for Def-Var'!N25*Q$28","v":0},{"$f":"'4. Billing Det. for Def-Var'!O25*R$28","v":0},{"$f":"'4. Billing Det. for Def-Var'!P25*S$28","v":0},{"$f":"'4. Billing Det. for Def-Var'!Q25*T$28","v":0},{"$f":"'4. Billing Det. for Def-Var'!R25*U$28","v":0},{"$f":"'4. Billing Det. for Def-Var'!S25*V$28","v":0},{"$f":"'4. Billing Det. for Def-Var'!T25*W$28","v":0},{"$f":"'4. Billing Det. for Def-Var'!U25*X$28","v":0},{"$f":"'4. Billing Det. for Def-Var'!V25*Y$28","v":0},{"$f":"'4. Billing Det. for Def-Var'!W25","v":0}]
[]
[]
[]
[null,null,{"$f":"SUM(C16:C27)","v":0.99999999999999989},{"$f":"SUM(D16:D27)","v":1.0000000000000002},{"$f":"SUM(E16:E27)","v":1},{"$f":"SUM(F16:F27)","v":1},{"$f":"'3. Continuity Schedule'!BU21","v":1870816.6633732498},{"$f":"'3. Continuity Schedule'!BU22","v":-148438.36005074997},{"$f":"'3. Continuity Schedule'!BU23+(IF('6.2 CBR B'!$U$18=\"TRUE\",'6.2a CBR B_Allocation'!D25,0))","v":308075.77890124981},null,null,{"$f":"'3. Continuity Schedule'!BU26","v":174799.45824325003},{"$f":"'3. Continuity Schedule'!BU27","v":4701765.7081454992},{"$f":"'3. Continuity Schedule'!BU28","v":-4650811.0140424743},{"$f":"IF('3. Continuity Schedule'!$BT30=\"Yes\",'3. Continuity Schedule'!$BU30,0)","v":0},{"$f":"IF('3. Continuity Schedule'!$BT31=\"Yes\",'3. Continuity Schedule'!$BU31,0)","v":0},{"$f":"IF('3. Continuity Schedule'!$BT32=\"Yes\",'3. Continuity Schedule'!$BU32,0)","v":0},{"$f":"IF('3. Continuity Schedule'!$BT33=\"Yes\",'3. Continuity Schedule'!$BU33,0)","v":0},{"$f":"IF('3. Continuity Schedule'!$BT34=\"Yes\",'3. Continuity Schedule'!$BU34,0)","v":0},{"$f":"IF('3. Continuity Schedule'!$BT35=\"Yes\",'3. Continuity Schedule'!$BU35,0)","v":0},{"$f":"IF('3. Continuity Schedule'!$BT36=\"Yes\",'3. Continuity Schedule'!$BU36,0)","v":0},{"$f":"IF('3. Continuity Schedule'!$BT37=\"Yes\",'3. Continuity Schedule'!$BU37,0)","v":0},{"$f":"IF('3. Continuity Schedule'!$BT38=\"Yes\",'3. Continuity Schedule'!$BU38,0)","v":-68364.326959000231},{"$f":"IF('3. Continuity Schedule'!$BT39=\"Yes\",'3. Continuity Schedule'!$BU39,0)","v":0},{"$f":"IF('3. Continuity Schedule'!$BT40=\"Yes\",'3. Continuity Schedule'!$BU40,0)","v":0},{"$f":"SUM(Z16:Z27)","v":2389285.0621381989}]
[null,null,null,null,null,null,{"$f":"SUM(G16:G27)-G28","v":0},{"$f":"SUM(H16:H27)-H28","v":0},0,0,0,0,0,0,null,0,0,0,0,0,0,0,null,null,null,0]
[]
[]
[null,"** Used to allocate Account 1551 as this account records the variances arising from the Smart Metering Entity Charges to Residential and GS<50 customers."]

{"sheet":"6. Class A Consumption Data","index":7,"n_rows":340,"n_cols":13,"rows_kept":340,"cut":false,"hidden":false,"merged":[[26,4,26,5],[26,7,26,8],[26,10,26,11],[13,2,13,3],[1,1,8,3]]}
["Back to Index"]
[null,{"$f":"+'1. Information Sheet'!B2","v":"INCENTIVE REGULATION MODEL FOR 2020 FILERS"}]
[]
[]
[]
[]
[]
[]
[]
[]
[]
[1,"Please select the Year the Account 1580 CBR Class B was Last Disposed.",2017,"(e.g. If in the 2018 EDR process, you received approval to dispose the GA variance account balance as at December 31, 2016, enter 2016.)"]
[]
[null,null,"Years since Account 1589 GA  balance was last disposed (up to 2016)",null,{"$f":"C12","v":2017},{"$f":"E14-1","v":2016}]
[]
[]
["2a","Did you have any customers who transitioned between Class A and Class B (transition customers)  during the period the Account 1589 GA balance accumulated (i.e. from the year after the balance was last disposed to 2017)?","Yes","(e.g. If you received approval to dispose of the GA variance account balance as at December 31, 2015, the period the GA variance accumulated would be 2016 and 2017.)"]
[]
["2b","Did you have any customers who transitioned between Class A and Class B (transition customers) during the period the Account 1580, sub-account CBR Class B balance accumulated (i.e. from the year after the balance was last disposed to 2017)?","Yes","(e.g. If you received approval to dispose of the CBR Class B balance as at December 31, 2016, the period the CBR Class B variance accumulated would be 2017.)"]
[]
[]
[]
["3a","Enter the number of transition customers you had during the period the Account 1589 GA balance accumulated.",33]
[]
[]
[null,null,"Transition Customers - Non-loss Adjusted Billing Determinants by Customer"]
[null,null,"Customer","Rate Class","2018 kWh",null,null,"2018 kW",null,null,"Class A/B"]
[null,null,null,null,"Jan to Jun","Jul to Dec",null,"Jan to Jun","Jul to Dec",null,"Jan to Jun","Jul to Dec","July to December"]
[null,null,"Customer 1","GENERAL SERVICE 500 to 4,999 kW SERVICE CLASSIFICATION",2561331,2389174,{"$f":"IF(D29<>\"\",E$27,\"\")","v":"2018 kWh"},6912.4873694999987,5984.4697747,{"$f":"IF(D29<>\"\",H$27,\"\")","v":"2018 kW"},"A","B"]
[null,null,"Customer 2","GENERAL SERVICE 500 to 4,999 kW SERVICE CLASSIFICATION",3848520,4672225,{"$f":"IF(D30<>\"\",E$27,\"\")","v":"2018 kWh"},8400,10025,{"$f":"IF(D30<>\"\",H$27,\"\")","v":"2018 kW"},"A","B"]
[null,null,"Customer 3","GENERAL SERVICE 500 to 4,999 kW SERVICE CLASSIFICATION",2774837,2868732,"2018 kWh",6417,6375,"2018 kW","A","B"]
[null,null,"Customer 4","GENERAL SERVICE 500 to 4,999 kW SERVICE CLASSIFICATION",2857375,2769214,"2018 kWh",4604,4448,"2018 kW","A","B"]
[null,null,"Customer 5","GENERAL SERVICE 500 to 4,999 kW SERVICE CLASSIFICATION",1438607,1300006,"2018 kWh",4034,3896,"2018 kW","A","B"]
[null,null,"Customer 6","GENERAL SERVICE 500 to 4,999 kW SERVICE CLASSIFICATION",1213637,816748,"2018 kWh",2905,2447,"2018 kW","A","B"]
[null,null,"Customer 7","GENERAL SERVICE 500 to 4,999 kW SERVICE CLASSIFICATION",2015656,2169594,{"$f":"IF(D35<>\"\",E$27,\"\")","v":"2018 kWh"},4743,5096,"2018 kW","B","A"]
[null,null,"Customer 8","LARGE USE SERVICE CLASSIFICATION",26194573,27725999,"2018 kWh",54081,57187,"2018 kW","B","A"]
[null,null,"Customer 9","GENERAL SERVICE 500 to 4,999 kW SERVICE CLASSIFICATION",2530311,2539816,"2018 kWh",5745,5836,"2018 kW","B","A"]
[null,null,"Customer 10","GENERAL SERVICE 500 to 4,999 kW SERVICE CLASSIFICATION",2038661,1859230,"2018 kWh",4542,4299,"2018 kW","B","A"]
[null,null,"Customer 11","GENERAL SERVICE 500 to 4,999 kW SERVICE CLASSIFICATION",4194295,4823148,"2018 kWh",8154,9775,"2018 kW","B","A"]
[null,null,"Customer 12","GENERAL SERVICE 500 to 4,999 kW SERVICE CLASSIFICATION",7270843,7432272,"2018 kWh",15477,16864,"2018 kW","B","A"]
[null,null,"Customer 13","GENERAL SERVICE 500 to 4,999 kW SERVICE CLASSIFICATION",2512207,2590613,"2018 kWh",6552,6348,"2018 kW","B","A"]
[null,null,"Customer 14","GENERAL SERVICE 500 to 4,999 kW SERVICE CLASSIFICATION",2301872,1974365,"2018 kWh",8531,8061,"2018 kW","B","A"]
[null,null,"Customer 15","GENERAL SERVICE 500 to 4,999 kW SERVICE CLASSIFICATION",1266000,1366789,"2018 kWh",4111.4935919999998,3716,"2018 kW","B","A"]
[null,null,"Customer 16","GENERAL SERVICE 500 to 4,999 kW SERVICE CLASSIFICATION",9187198,10064044,"2018 kWh",23678,22445,"2018 kW","B","A"]
[null,null,"Customer 17","LARGE USE SERVICE CLASSIFICATION",28684761,32541712,"2018 kWh",62751,69304,"2018 kW","B","A"]
[null,null,"Customer 18","GENERAL SERVICE 500 to 4,999 kW SERVICE CLASSIFICATION",897411,745215,"2018 kWh",6836,6726,"2018 kW","B","A"]
[null,null,"Customer 19","GENERAL SERVICE 500 to 4,999 kW SERVICE CLASSIFICATION",5373080,5654344,"2018 kWh",13126,14167,"2018 kW","B","A"]
[null,null,"Customer 20","GENERAL SERVICE 500 to 4,999 kW SERVICE CLASSIFICATION",2658418,2603135,"2018 kWh",6601,6670,"2018 kW","B","A"]
[null,null,"Customer 21","GENERAL SERVICE 500 to 4,999 kW SERVICE CLASSIFICATION",4188830,5111791,"2018 kWh",7965,9326,"2018 kW","B","A"]
[null,null,"Customer 22","GENERAL SERVICE 500 to 4,999 kW SERVICE CLASSIFICATION",11053536,11370180,"2018 kWh",19245,20227,"2018 kW","B","A"]
[null,null,"Customer 23","GENERAL SERVICE 500 to 4,999 kW SERVICE CLASSIFICATION",2090353,1974636,"2018 kWh",4340,4328,"2018 kW","B","A"]
[null,null,"Customer 24","GENERAL SERVICE 500 to 4,999 kW SERVICE CLASSIFICATION",2516374,2521883,"2018 kWh",4472,4542,"2018 kW","B","A"]
[null,null,"Customer 25","GENERAL SERVICE 500 to 4,999 kW SERVICE CLASSIFICATION",2617200,2631574,"2018 kWh",5783.3638150000006,5958,"2018 kW","B","A"]
[null,null,"Customer 26","GENERAL SERVICE 500 to 4,999 kW SERVICE CLASSIFICATION",2633257,2243379,"2018 kWh",6167,6279,"2018 kW","B","A"]
[null,null,"Customer 27","GENERAL SERVICE 500 to 4,999 kW SERVICE CLASSIFICATION",2350884,2056487,"2018 kWh",6375,5644,"2018 kW","B","A"]
[null,null,"Customer 28","GENERAL SERVICE 500 to 4,999 kW SERVICE CLASSIFICATION",2152851,2421142,"2018 kWh",4999,5282,"2018 kW","B","A"]
[null,null,"Customer 29","GENERAL SERVICE 500 to 4,999 kW SERVICE CLASSIFICATION",3966943,3793919,"2018 kWh",8023,8331,"2018 kW","B","A"]
[null,null,"Customer 30","GENERAL SERVICE 500 to 4,999 kW SERVICE CLASSIFICATION",3002890,3510372,"2018 kWh",5746,6855,"2018 kW","B","A"]
[null,null,"Customer 31","GENERAL SERVICE 500 to 4,999 kW SERVICE CLASSIFICATION",1436253,1558620,"2018 kWh",4429,4601,"2018 kW","B","A"]
[null,null,"Customer 32","GENERAL SERVICE 500 to 4,999 kW SERVICE CLASSIFICATION",8495106,9594345,"2018 kWh",15242,18148,"2018 kW","B","A"]
[null,null,"Customer 33","GENERAL SERVICE 500 to 4,999 kW SERVICE CLASSIFICATION",1363799.9999999998,1214238,"2018 kWh",3315.2312739999998,3292,"2018 kW","B","A"]
[null,null,"Customer 34",null,null,null,{"$f":"IF(D62<>\"\",E$27,\"\")","v":""}]
[null,null,"Customer 35",null,null,null,""]
[null,null,"Customer 36",null,null,null,""]
[null,null,"Customer 37",null,null,null,""]
[null,null,"Customer 38",null,null,null,""]
[null,null,"Customer 39",null,null,null,""]
[null,null,"Customer 40",null,null,null,""]
[null,null,"Customer 41",null,null,null,""]
[null,null,"Customer 42",null,null,null,""]
[null,null,"Customer 43",null,null,null,""]
[null,null,"Customer 44",null,null,null,""]
[null,null,"Customer 45",null,null,null,""]
[null,null,"Customer 46",null,null,null,""]
[null,null,"Customer 47",null,null,null,""]
[null,null,"Customer 48",null,null,null,""]
[null,null,"Customer 49",null,null,null,""]
[null,null,"Customer 50",null,null,null,""]
[null,null,"Customer 51",null,null,null,""]
[null,null,"Customer 52",null,null,null,""]
[null,null,"Customer 53",null,null,null,""]
[null,null,"Customer 54",null,null,null,""]
[null,null,"Customer 55",null,null,null,""]
[null,null,"Customer 56",null,null,null,""]
[null,null,"Customer 57",null,null,null,""]
[null,null,"Customer 58",null,null,null,""]
[null,null,"Customer 59",null,null,null,""]
[null,null,"Customer 60",null,null,null,""]
[null,null,"Customer 61",null,null,null,""]
[null,null,"Customer 62",null,null,null,""]
[null,null,"Customer 63",null,null,null,""]
[null,null,"Customer 64",null,null,null,""]
[null,null,"Customer 65",null,null,null,""]
[null,null,"Customer 66",null,null,null,{"$f":"IF(D94<>\"\",E$27,\"\")","v":""}]
[null,null,"Customer 67",null,null,null,""]
[null,null,"Customer 68",null,null,null,""]
[null,null,"Customer 69",null,null,null,""]
[null,null,"Customer 70",null,null,null,""]
[null,null,"Customer 71",null,null,null,""]
[null,null,"Customer 72",null,null,null,""]
[null,null,"Customer 73",null,null,null,""]
[null,null,"Customer 74",null,null,null,""]
[null,null,"Customer 75",null,null,null,""]
[null,null,"Customer 76",null,null,null,""]
[null,null,"Customer 77",null,null,null,""]
[null,null,"Customer 78",null,null,null,""]
[null,null,"Customer 79",null,null,null,""]
[null,null,"Customer 80",null,null,null,""]
[null,null,"Customer 81",null,null,null,""]
[null,null,"Customer 82",null,null,null,""]
[null,null,"Customer 83",null,null,null,""]
[null,null,"Customer 84",null,null,null,""]
[null,null,"Customer 85",null,null,null,""]
[null,null,"Customer 86",null,null,null,""]
[null,null,"Customer 87",null,null,null,""]
[null,null,"Customer 88",null,null,null,""]
[null,null,"Customer 89",null,null,null,""]
[null,null,"Customer 90",null,null,null,""]
[null,null,"Customer 91",null,null,null,""]
[null,null,"Customer 92",null,null,null,""]
[null,null,"Customer 93",null,null,null,""]
[null,null,"Customer 94",null,null,null,""]
[null,null,"Customer 95",null,null,null,""]
[null,null,"Customer 96",null,null,null,""]
[null,null,"Customer 97",null,null,null,""]
[null,null,"Customer 98",null,null,null,""]
[null,null,"Customer 99",null,null,null,""]
[null,null,"Customer 100",null,null,null,""]
[null,null,"Customer 101",null,null,null,""]
[null,null,"Customer 102",null,null,null,{"$f":"IF(D130<>\"\",E$27,\"\")","v":""}]
[null,null,"Customer 103",null,null,null,""]
[null,null,"Customer 104",null,null,null,""]
[null,null,"Customer 105",null,null,null,""]
[null,null,"Customer 106",null,null,null,""]
[null,null,"Customer 107",null,null,null,""]
[null,null,"Customer 108",null,null,null,""]
[null,null,"Customer 109",null,null,null,""]
[null,null,"Customer 110",null,null,null,""]
[null,null,"Customer 111",null,null,null,""]
[null,null,"Customer 112",null,null,null,""]
[null,null,"Customer 113",null,null,null,""]
[null,null,"Customer 114",null,null,null,""]
[null,null,"Customer 115",null,null,null,""]
[null,null,"Customer 116",null,null,null,""]
[null,null,"Customer 117",null,null,null,""]
[null,null,"Customer 118",null,null,null,""]
[null,null,"Customer 119",null,null,null,""]
[null,null,"Customer 120",null,null,null,""]
[null,null,"Customer 121",null,null,null,""]
[null,null,"Customer 122",null,null,null,""]
[null,null,"Customer 123",null,null,null,""]
[null,null,"Customer 124",null,null,null,""]
[null,null,"Customer 125",null,null,null,""]
[null,null,"Customer 126",null,null,null,""]
[null,null,"Customer 127",null,null,null,""]
[null,null,"Customer 128",null,null,null,""]
[null,null,"Customer 129",null,null,null,""]
[null,null,"Customer 130",null,null,null,""]
[null,null,"Customer 131",null,null,null,""]
[null,null,"Customer 132",null,null,null,""]
[null,null,"Customer 133",null,null,null,""]
[null,null,"Customer 134",null,null,null,""]
[null,null,"Customer 135",null,null,null,""]
[null,null,"Customer 136",null,null,null,""]
[null,null,"Customer 137",null,null,null,""]
[null,null,"Customer 138",null,null,null,""]
[null,null,"Customer 139",null,null,null,""]
[null,null,"Customer 140",null,null,null,""]
[null,null,"Customer 141",null,null,null,""]
[null,null,"Customer 142",null,null,null,""]
[null,null,"Customer 143",null,null,null,""]
[null,null,"Customer 144",null,null,null,""]
[null,null,"Customer 145",null,null,null,""]
[null,null,"Customer 146",null,null,null,""]
[null,null,"Customer 147",null,null,null,""]
[null,null,"Customer 148",null,null,null,""]
[null,null,"Customer 149",null,null,null,""]
[null,null,"Customer 150",null,null,null,""]
[]
[]
[]
[]
[]
[]
[]
["3b","Enter the number of customers who were Class A during the entire period since the Account 1589 GA balance accumulated (i.e. did not transition between Class A and B).",86]
[]
[]
[null,null,"Class A Customers - Billing Determinants by Customer"]
[null,null,"Customer","Rate Class","kWh",null,null,"kW"]
[null,null,"Customer A1","GENERAL SERVICE 500 to 4,999 kW SERVICE CLASSIFICATION",11136091,null,null,29591]
[null,null,"Customer A2","LARGE USE SERVICE CLASSIFICATION",142671512,null,null,223175]
[null,null,"Customer A3","LARGE USE SERVICE CLASSIFICATION",78474853,null,null,133608]
[null,null,"Customer A4","GENERAL SERVICE 500 to 4,999 kW SERVICE CLASSIFICATION",9462989,null,null,20631]
[null,null,"Customer A5","GENERAL SERVICE 500 to 4,999 kW SERVICE CLASSIFICATION",12696532,null,null,19417]
[null,null,"Customer A6","GENERAL SERVICE 500 to 4,999 kW SERVICE CLASSIFICATION",13331446,null,null,23070]
[null,null,"Customer A7","GENERAL SERVICE 500 to 4,999 kW SERVICE CLASSIFICATION",12004827,null,null,29818]
[null,null,"Customer A8","GENERAL SERVICE 500 to 4,999 kW SERVICE CLASSIFICATION",5068619,null,null,12672]
[null,null,"Customer A9","GENERAL SERVICE 500 to 4,999 kW SERVICE CLASSIFICATION",7004108,null,null,15224]
[null,null,"Customer A10","GENERAL SERVICE 500 to 4,999 kW SERVICE CLASSIFICATION",25754799,null,null,48738]
[null,null,"Customer A11","GENERAL SERVICE 500 to 4,999 kW SERVICE CLASSIFICATION",30699474,null,null,63364]
[null,null,"Customer A12","GENERAL SERVICE 500 to 4,999 kW SERVICE CLASSIFICATION",2964000,null,null,6993]
[null,null,"Customer A13","GENERAL SERVICE 500 to 4,999 kW SERVICE CLASSIFICATION",6640682,null,null,11767]
[null,null,"Customer A14","LARGE USE SERVICE CLASSIFICATION",253092104,null,null,454471]
[null,null,"Customer A15","GENERAL SERVICE 500 to 4,999 kW SERVICE CLASSIFICATION",9697459,null,null,17816]
[null,null,"Customer A16","GENERAL SERVICE 500 to 4,999 kW SERVICE CLASSIFICATION",10650238,null,null,22694]
[null,null,"Customer A17","LARGE USE SERVICE CLASSIFICATION",218868237,null,null,427795]
[null,null,"Customer A18","GENERAL SERVICE 500 to 4,999 kW SERVICE CLASSIFICATION",12141217,null,null,20284]
[null,null,"Customer A19","GENERAL SERVICE 500 to 4,999 kW SERVICE CLASSIFICATION",11141477,null,null,23479]
[null,null,"Customer A20","GENERAL SERVICE 500 to 4,999 kW SERVICE CLASSIFICATION",22757382,null,null,41862]
[null,null,"Customer A21","GENERAL SERVICE 500 to 4,999 kW SERVICE CLASSIFICATION",7021571,null,null,17008]
[null,null,"Customer A22","GENERAL SERVICE 500 to 4,999 kW SERVICE CLASSIFICATION",8961047,null,null,18038]
[null,null,"Customer A23","GENERAL SERVICE 500 to 4,999 kW SERVICE CLASSIFICATION",9024137,null,null,19447]
[null,null,"Customer A24","GENERAL SERVICE 500 to 4,999 kW SERVICE CLASSIFICATION",3941209,null,null,9385]
[null,null,"Customer A25","GENERAL SERVICE 500 to 4,999 kW SERVICE CLASSIFICATION",3766153,null,null,9401]
[null,null,"Customer A26","GENERAL SERVICE 500 to 4,999 kW SERVICE CLASSIFICATION",1874123,null,null,7182]
[null,null,"Customer A27","GENERAL SERVICE 500 to 4,999 kW SERVICE CLASSIFICATION",7449336,null,null,13364]
[null,null,"Customer A28","GENERAL SERVICE 500 to 4,999 kW SERVICE CLASSIFICATION",11557593,null,null,21513]
[null,null,"Customer A29","GENERAL SERVICE 500 to 4,999 kW SERVICE CLASSIFICATION",8345387,null,null,18862]
[null,null,"Customer A30","GENERAL SERVICE 500 to 4,999 kW SERVICE CLASSIFICATION",5230650,null,null,14331]
[null,null,"Customer A31","GENERAL SERVICE 500 to 4,999 kW SERVICE CLASSIFICATION",25895826,null,null,49690]
[null,null,"Customer A32","GENERAL SERVICE 500 to 4,999 kW SERVICE CLASSIFICATION",2198306,null,null,7852]
[null,null,"Customer A33","GENERAL SERVICE 500 to 4,999 kW SERVICE CLASSIFICATION",7999938,null,null,21249]
[null,null,"Customer A34","GENERAL SERVICE 500 to 4,999 kW SERVICE CLASSIFICATION",9534372,null,null,20630]
[null,null,"Customer A35","GENERAL SERVICE 500 to 4,999 kW SERVICE CLASSIFICATION",2821468,null,null,6466]
[null,null,"Customer A36","GENERAL SERVICE 500 to 4,999 kW SERVICE CLASSIFICATION",10773814,null,null,31698]
[null,null,"Customer A37","GENERAL SERVICE 500 to 4,999 kW SERVICE CLASSIFICATION",4240263,null,null,7317]
[null,null,"Customer A38","GENERAL SERVICE 500 to 4,999 kW SERVICE CLASSIFICATION",8314979,null,null,17337]
[null,null,"Customer A39","GENERAL SERVICE 500 to 4,999 kW SERVICE CLASSIFICATION",15137566,null,null,37398]
[null,null,"Customer A40","GENERAL SERVICE 500 to 4,999 kW SERVICE CLASSIFICATION",26630996,null,null,50371]
[null,null,"Customer A41","GENERAL SERVICE 500 to 4,999 kW SERVICE CLASSIFICATION",6614880,null,null,13890]
[null,null,"Customer A42","GENERAL SERVICE 500 to 4,999 kW SERVICE CLASSIFICATION",11018568,null,null,19795]
[null,null,"Customer A43","GENERAL SERVICE 500 to 4,999 kW SERVICE CLASSIFICATION",8933018,null,null,25489]
[null,null,"Customer A44","LARGE USE SERVICE CLASSIFICATION",75353562,null,null,116633]
[null,null,"Customer A45","GENERAL SERVICE 500 to 4,999 kW SERVICE CLASSIFICATION",6112342,null,null,10394]
[null,null,"Customer A46","GENERAL SERVICE 500 to 4,999 kW SERVICE CLASSIFICATION",20228269,null,null,39459]
[null,null,"Customer A47","GENERAL SERVICE 500 to 4,999 kW SERVICE CLASSIFICATION",6446133,null,null,10178]
[null,null,"Customer A48","GENERAL SERVICE 500 to 4,999 kW SERVICE CLASSIFICATION",12130023,null,null,24666]
[null,null,"Customer A49","GENERAL SERVICE 500 to 4,999 kW SERVICE CLASSIFICATION",10023603,null,null,25040]
[null,null,"Customer A50","LARGE USE SERVICE CLASSIFICATION",39415567,null,null,74167]
[null,null,"Customer A51","GENERAL SERVICE 500 to 4,999 kW SERVICE CLASSIFICATION",4983144,null,null,12869]
[null,null,"Customer A52","GENERAL SERVICE 500 to 4,999 kW SERVICE CLASSIFICATION",5631041,null,null,11623]
[null,null,"Customer A53","GENERAL SERVICE 500 to 4,999 kW SERVICE CLASSIFICATION",5569227,null,null,11243]
[null,null,"Customer A54","GENERAL SERVICE 500 to 4,999 kW SERVICE CLASSIFICATION",9430855,null,null,22320]
[null,null,"Customer A55","GENERAL SERVICE 500 to 4,999 kW SERVICE CLASSIFICATION",5735341,null,null,10239]
[null,null,"Customer A56","GENERAL SERVICE 500 to 4,999 kW SERVICE CLASSIFICATION",5745072,null,null,14452]
[null,null,"Customer A57","LARGE USE SERVICE CLASSIFICATION",54026482,null,null,79991]
[null,null,"Customer A58","GENERAL SERVICE 500 to 4,999 kW SERVICE CLASSIFICATION",7391467,null,null,16590]
[null,null,"Customer A59","GENERAL SERVICE 500 to 4,999 kW SERVICE CLASSIFICATION",8383236,null,null,13034]
[null,null,"Customer A60","GENERAL SERVICE 500 to 4,999 kW SERVICE CLASSIFICATION",5658935,null,null,13903]
[null,null,"Customer A61","GENERAL SERVICE 500 to 4,999 kW SERVICE CLASSIFICATION",6019259,null,null,12387]
[null,null,"Customer A62","GENERAL SERVICE 500 to 4,999 kW SERVICE CLASSIFICATION",19507701,null,null,38822]
[null,null,"Customer A63","GENERAL SERVICE 500 to 4,999 kW SERVICE CLASSIFICATION",12535726,null,null,22525]
[null,null,"Customer A64","GENERAL SERVICE 500 to 4,999 kW SERVICE CLASSIFICATION",5247364,null,null,15756]
[null,null,"Customer A65","GENERAL SERVICE 500 to 4,999 kW SERVICE CLASSIFICATION",12074202,null,null,20174]
[null,null,"Customer A66","GENERAL SERVICE 500 to 4,999 kW SERVICE CLASSIFICATION",3623556,null,null,7938]
[null,null,"Customer A67","GENERAL SERVICE 500 to 4,999 kW SERVICE CLASSIFICATION",10035637,null,null,17183]
[null,null,"Customer A68","GENERAL SERVICE 500 to 4,999 kW SERVICE CLASSIFICATION",8748315,null,null,20207]
[null,null,"Customer A69","GENERAL SERVICE 500 to 4,999 kW SERVICE CLASSIFICATION",19400953,null,null,42577]
[null,null,"Customer A70","GENERAL SERVICE 500 to 4,999 kW SERVICE CLASSIFICATION",20322643,null,null,34387]
[null,null,"Customer A71","GENERAL SERVICE 500 to 4,999 kW SERVICE CLASSIFICATION",23984994,null,null,36422]
[null,null,"Customer A72","GENERAL SERVICE 500 to 4,999 kW SERVICE CLASSIFICATION",2482272,null,null,6795]
[null,null,"Customer A73","GENERAL SERVICE 500 to 4,999 kW SERVICE CLASSIFICATION",16311852,null,null,27752]
[null,null,"Customer A74","GENERAL SERVICE 500 to 4,999 kW SERVICE CLASSIFICATION",8554746,null,null,18301]
[null,null,"Customer A75","GENERAL SERVICE 500 to 4,999 kW SERVICE CLASSIFICATION",28494213,null,null,51262]
[null,null,"Customer A76","GENERAL SERVICE 500 to 4,999 kW SERVICE CLASSIFICATION",17487615,null,null,38033]
[null,null,"Customer A77","GENERAL SERVICE 500 to 4,999 kW SERVICE CLASSIFICATION",12826158,null,null,30119]
[null,null,"Customer A78","GENERAL SERVICE 500 to 4,999 kW SERVICE CLASSIFICATION",15439796,null,null,23255]
[null,null,"Customer A79","GENERAL SERVICE 500 to 4,999 kW SERVICE CLASSIFICATION",5477941,null,null,12652]
[null,null,"Customer A80","GENERAL SERVICE 500 to 4,999 kW SERVICE CLASSIFICATION",10432330,null,null,49941]
[null,null,"Customer A81","GENERAL SERVICE 500 to 4,999 kW SERVICE CLASSIFICATION",10184516,null,null,18034]
[null,null,"Customer A82","GENERAL SERVICE 500 to 4,999 kW SERVICE CLASSIFICATION",5130058,null,null,9523]
[null,null,"Customer A83","GENERAL SERVICE 500 to 4,999 kW SERVICE CLASSIFICATION",10027924,null,null,18425]
[null,null,"Customer A84","GENERAL SERVICE 500 to 4,999 kW SERVICE CLASSIFICATION",8823298,null,null,17022]
[null,null,"Customer A85","GENERAL SERVICE 500 to 4,999 kW SERVICE CLASSIFICATION",11728540,null,null,22642]
[null,null,"Customer A86","GENERAL SERVICE 500 to 4,999 kW SERVICE CLASSIFICATION",4805508,null,null,11560]
[null,null,"Customer A87"]
[null,null,"Customer A88"]
[null,null,"Customer A89"]
[null,null,"Customer A90"]
[null,null,"Customer A91"]
[null,null,"Customer A92"]
[null,null,"Customer A93"]
[null,null,"Customer A94"]
[null,null,"Customer A95"]
[null,null,"Customer A96"]
[null,null,"Customer A97"]
[null,null,"Customer A98"]
[null,null,"Customer A99"]
[null,null,"Customer A100"]
[null,null,"Customer A101"]
[null,null,"Customer A102"]
[null,null,"Customer A103"]
[null,null,"Customer A104"]
[null,null,"Customer A105"]
[null,null,"Customer A106"]
[null,null,"Customer A107"]
[null,null,"Customer A108"]
[null,null,"Customer A109"]
[null,null,"Customer A110"]
[null,null,"Customer A111"]
[null,null,"Customer A112"]
[null,null,"Customer A113"]
[null,null,"Customer A114"]
[null,null,"Customer A115"]
[null,null,"Customer A116"]
[null,null,"Customer A117"]
[null,null,"Customer A118"]
[null,null,"Customer A119"]
[null,null,"Customer A120"]
[null,null,"Customer A121"]
[null,null,"Customer A122"]
[null,null,"Customer A123"]
[null,null,"Customer A124"]
[null,null,"Customer A125"]
[null,null,"Customer A126"]
[null,null,"Customer A127"]
[null,null,"Customer A128"]
[null,null,"Customer A129"]
[null,null,"Customer A130"]
[null,null,"Customer A131"]
[null,null,"Customer A132"]
[null,null,"Customer A133"]
[null,null,"Customer A134"]
[null,null,"Customer A135"]
[null,null,"Customer A136"]
[null,null,"Customer A137"]
[null,null,"Customer A138"]
[null,null,"Customer A139"]
[null,null,"Customer A140"]
[null,null,"Customer A141"]
[null,null,"Customer A142"]
[null,null,"Customer A143"]
[null,null,"Customer A144"]
[null,null,"Customer A145"]
[null,null,"Customer A146"]
[null,null,"Customer A147"]
[null,null,"Customer A148"]
[null,null,"Customer A149"]
[null,null,"Customer A150"]

{"sheet":"6.1a GA Allocation","index":8,"n_rows":189,"n_cols":14,"rows_kept":189,"cut":false,"hidden":false,"merged":[[1,1,8,6],[29,1,29,4],[15,1,15,5],[22,1,22,3],[36,7,36,9],[13,3,13,5],[10,1,11,5],[31,1,32,2],[31,3,32,3],[33,1,34,2],[33,3,34,3]]}
["Back to Index"]
[null,{"$f":"+'1. Information Sheet'!B2","v":"INCENTIVE REGULATION MODEL FOR 2020 FILERS"}]
[]
[]
[]
[]
[]
[]
[]
[]
[null,"This tab allocates the GA balance to former Class B non-interval customers who contributed to the current GA balance but are now Class A customers. The tables below calculate specific amounts for each customer who made the change. Consistent with both decisions for 2016 rates and EDDVAR, distributors are generally expected to settle the amount through 12 equal adjustments to bills. A one-time settlement is acceptable if the affected customer has expressed a clear preference for this approach. (see Filing Requirements section 3.2.5.2)"]
[]
[]
[null,"Year of Group 1 Account Balance Last Disposed",2017,"(e.g. If in the 2019 EDR process, you received approval to dispose the GA variance account balance as of December 31, 2016, please enter 2016 in cell C14.)"]
[]
[null,"Allocation of total Non-RPP Consumption (kWh) between Current Class B and Class A/B Transition Customers"]
[null,null,null,"Total",{"$f":"C14+1","v":2018},{"$f":"E17-1","v":2017},{"$f":"F17-1","v":2016}]
[null,"Total Non-RPP Class B Consumption for Years During Balance Accumulation (Non-RPP Consumption LESS WMP Consumption and Consumption for Class A customers who were Class A for partial or full year)","A",{"$f":"SUM(E18:G18)","v":2878155347.4082022},{"$f":"N25","v":2878155347.4082022},null,null,"from Cell N25"]
[null,"Transition Customers' Class B Consumption (i.e. full year or partial year)","B",{"$f":"SUM(E19:G19)","v":159809662},{"$f":"E189","v":159809662},{"$f":"F189","v":0},0]
[null,"Transition Customers' Portion of Total Consumption ","C=B/A",{"$f":"IFERROR(+D19/D18,0)","v":5.5525029996698977E-2}]
[null,null,null,null,null,null,null,null,null,null,null,"Sheet 4","total non-RPP kWh",{"$f":"'4. Billing Det. for Def-Var'!F29+'4. Billing Det. for Def-Var'!H29","v":4757799414.7051296}]
[null,null,null,null,null,null,null,null,null,null,null,"Sheet 4","WMP kWh",{"$f":"'4. Billing Det. for Def-Var'!H29","v":15342256.296927605}]
[null,"Allocation of Total GA Balance $",null,null,null,null,null,null,null,null,null,"Sheet 6.1","Class A (full)",{"$f":"'6.1 GA'!E29","v":1695514662}]
[null,null,null,null,null,null,null,null,null,null,null,"Sheet 6.1","Class A (partial)",{"$f":"SUM(IF('6. Class A Consumption Data'!$K$28:$L$61=\"a\",'6. Class A Consumption Data'!$E$28:$F$61))","v":168787149}]
[null,"Total GA Balance","D",{"$f":"'3. Continuity Schedule'!BU29","v":-9274619.069936553},null,null,null,null,null,null,null,null,null,{"$f":"N21-N22-N23-N24","v":2878155347.4082022}]
[null,"Transition Customers Portion of GA Balance","E=C*D",{"$f":"+D20*D25","v":-514973.50206618349}]
[null,"GA Balance to be disposed to Current Class B Customers through Rate Rider","F=D-E",{"$f":"+D25-D26","v":-8759645.5678703692}]
[]
[]
[null,"Allocation of GA Balances to Class A/B Transition Customers"]
[]
[null,"Default Monthly Equal Payments Recovery Period \n(in months)",null,12]
[]
[null,"Proposed Monthly Equal Payments Recovery Period \n(in months)",null,12]
[]
[]
[null,"# of Class A/B Transition Customers",{"$f":"COUNT($E$39:$E$188)-COUNTIF($E$39:$E$188,0)","v":33}]
[null,"Customer",null,"Total Metered Consumption (kWh) for Transition Customers During the Period WhenThey Were Class B Customers","Metered Consumption (kWh) for Transition Customers During the Period When They Were Class B Customers in 2018","Metered Consumption (kWh) for Transition Customers During the Period When They Were Class B Customers in 2017","Metered Consumption (kWh) for Transition Customers During the Period When They Were Class B Customers in 2016","% of kWh","Customer Specific GA Allocation for the Period When They Were a Class B customer","Monthly Equal Payments"]
[null,"Customer 1",null,{"$f":"SUM(E39:G39)","v":2389174},{"$f":"SUM(IF('6. Class A Consumption Data'!K29:L29=\"B\",'6. Class A Consumption Data'!E29:F29))","v":2389174},null,null,{"$f":"IFERROR(+D39/$D$189,0)","v":1.4950122352426976E-2},{"$f":"H39*$D$26","v":-7698.9168641472497},{"$f":"ROUND(IF(ISERROR(I39),0,IF(OR(ISBLANK($D$34), OR($D$34=0, $D$34=\"\")), I39/($D$32), I39/($D$34))),2)","v":-641.58000000000004}]
[null,"Customer 2",null,4672225,{"$f":"SUM(IF('6. Class A Consumption Data'!K30:L30=\"B\",'6. Class A Consumption Data'!E30:F30))","v":4672225},null,null,{"$f":"IFERROR(+D40/$D$189,0)","v":2.9236185982296867E-2},{"$f":"H40*$D$26","v":-15055.86108236168},{"$f":"ROUND(IF(ISERROR(I40),0,IF(OR(ISBLANK($D$34), OR($D$34=0, $D$34=\"\")), I40/($D$32), I40/($D$34))),2)","v":-1254.6600000000001}]
[null,"Customer 3",null,2868732,{"$f":"SUM(IF('6. Class A Consumption Data'!K31:L31=\"B\",'6. Class A Consumption Data'!E31:F31))","v":2868732},null,null,1.7950929650298614E-2,-9244.2531073579685,-770.35]
[null,"Customer 4",null,2769214,{"$f":"SUM(IF('6. Class A Consumption Data'!K32:L32=\"B\",'6. Class A Consumption Data'!E32:F32))","v":2769214},null,null,1.7328201344922436E-2,-8923.5645311026583,-743.63]
[null,"Customer 5",null,1300006,{"$f":"SUM(IF('6. Class A Consumption Data'!K33:L33=\"B\",'6. Class A Consumption Data'!E33:F33))","v":1300006},null,null,8.1347146582413776E-3,-4189.1624958636794,-349.1]
[null,"Customer 6",null,816748,{"$f":"SUM(IF('6. Class A Consumption Data'!K34:L34=\"B\",'6. Class A Consumption Data'!E34:F34))","v":816748},null,null,5.1107548178157087E-3,-2631.9033067321752,-219.33]
[null,"Customer 7",null,2015656,{"$f":"SUM(IF('6. Class A Consumption Data'!K35:L35=\"B\",'6. Class A Consumption Data'!E35:F35))","v":2015656},null,null,1.2612854409265942E-2,-6495.2858061905863,-541.27]
[null,"Customer 8",null,26194573,{"$f":"SUM(IF('6. Class A Consumption Data'!K36:L36=\"B\",'6. Class A Consumption Data'!E36:F36))","v":26194573},null,null,0.16391107191003257,-84409.858728931504,-7034.15]
[null,"Customer 9",null,2530311,{"$f":"SUM(IF('6. Class A Consumption Data'!K37:L37=\"B\",'6. Class A Consumption Data'!E37:F37))","v":2530311},null,null,1.583327921687238E-2,-8153.7192475044885,-679.48]
[null,"Customer 10",null,2038661,{"$f":"SUM(IF('6. Class A Consumption Data'!K38:L38=\"B\",'6. Class A Consumption Data'!E38:F38))","v":2038661},null,null,1.2756806906956603E-2,-6569.41752805752,-547.45000000000005]
[null,"Customer 11",null,4194295,{"$f":"SUM(IF('6. Class A Consumption Data'!K39:L39=\"B\",'6. Class A Consumption Data'!E39:F39))","v":4194295},null,null,2.6245565803148997E-2,-13515.770935356104,-1126.31]
[null,"Customer 12",null,7270843,{"$f":"SUM(IF('6. Class A Consumption Data'!K40:L40=\"B\",'6. Class A Consumption Data'!E40:F40))","v":7270843},null,null,4.5496892421936289E-2,-23429.694023652934,-1952.47]
[null,"Customer 13",null,2512207,{"$f":"SUM(IF('6. Class A Consumption Data'!K41:L41=\"B\",'6. Class A Consumption Data'!E41:F41))","v":2512207},null,null,1.5719994451899911E-2,-8095.3805953558713,-674.62]
[null,"Customer 14",null,2301872,{"$f":"SUM(IF('6. Class A Consumption Data'!K42:L42=\"B\",'6. Class A Consumption Data'!E42:F42))","v":2301872},null,null,1.4403834982142694E-2,-7417.5933439374267,-618.13]
[null,"Customer 15",null,1266000,{"$f":"SUM(IF('6. Class A Consumption Data'!K43:L43=\"B\",'6. Class A Consumption Data'!E43:F43))","v":1266000},null,null,7.9219240198380499E-3,-4079.5809555982187,-339.97]
[null,"Customer 16",null,9187198,{"$f":"SUM(IF('6. Class A Consumption Data'!K44:L44=\"B\",'6. Class A Consumption Data'!E44:F44))","v":9187198},null,null,5.7488376391159626E-2,-29604.990518254377,-2467.08]
[null,"Customer 17",null,28684761,{"$f":"SUM(IF('6. Class A Consumption Data'!K45:L45=\"B\",'6. Class A Consumption Data'!E45:F45))","v":28684761},null,null,0.17949328370396028,-92434.284906387446,-7702.86]
[null,"Customer 18",null,897411,{"$f":"SUM(IF('6. Class A Consumption Data'!K46:L46=\"B\",'6. Class A Consumption Data'!E46:F46))","v":897411},null,null,5.6154990178253431E-3,-2891.8331950587308,-240.99]
[null,"Customer 19",null,5373080,{"$f":"SUM(IF('6. Class A Consumption Data'!K47:L47=\"B\",'6. Class A Consumption Data'!E47:F47))","v":5373080},null,null,3.3621746850324985E-2,-17314.30872109453,-1442.86]
[null,"Customer 20",null,2658418,{"$f":"SUM(IF('6. Class A Consumption Data'!K48:L48=\"B\",'6. Class A Consumption Data'!E48:F48))","v":2658418},null,null,1.6634901586864002E-2,-8566.5335267136688,-713.88]
[null,"Customer 21",null,4188830,{"$f":"SUM(IF('6. Class A Consumption Data'!K49:L49=\"B\",'6. Class A Consumption Data'!E49:F49))","v":4188830},null,null,2.6211368872052304E-2,-13498.160421989325,-1124.8499999999999]
[null,"Customer 22",null,11053536,{"$f":"SUM(IF('6. Class A Consumption Data'!K50:L50=\"B\",'6. Class A Consumption Data'!E50:F50))","v":11053536},null,null,6.9166881787160031E-2,-35619.111340931522,-2968.26]
[null,"Customer 23",null,2090353,{"$f":"SUM(IF('6. Class A Consumption Data'!K51:L51=\"B\",'6. Class A Consumption Data'!E51:F51))","v":2090353},null,null,1.3080266698768188E-2,-6735.9907498243301,-561.33000000000004]
[null,"Customer 24",null,2516374,{"$f":"SUM(IF('6. Class A Consumption Data'!K52:L52=\"B\",'6. Class A Consumption Data'!E52:F52))","v":2516374},null,null,1.5746069220770896E-2,-8108.8084103969295,-675.73]
[null,"Customer 25",null,2617200,{"$f":"SUM(IF('6. Class A Consumption Data'!K53:L53=\"B\",'6. Class A Consumption Data'!E53:F53))","v":2617200},null,null,1.6376982262812121E-2,-8433.711909156129,-702.81]
[null,"Customer 26",null,2633257,{"$f":"SUM(IF('6. Class A Consumption Data'!K54:L54=\"B\",'6. Class A Consumption Data'!E54:F54))","v":2633257},null,null,1.6477458040052673E-2,-8485.4542720345162,-707.12]
[null,"Customer 27",null,2350884,{"$f":"SUM(IF('6. Class A Consumption Data'!K55:L55=\"B\",'6. Class A Consumption Data'!E55:F55))","v":2350884},null,null,1.4710524824212444E-2,-7575.5304859562102,-631.29]
[null,"Customer 28",null,2152851,{"$f":"SUM(IF('6. Class A Consumption Data'!K56:L56=\"B\",'6. Class A Consumption Data'!E56:F56))","v":2152851},null,null,1.3471344429725406E-2,-6937.385418515466,-578.12]
[null,"Customer 29",null,3966943,{"$f":"SUM(IF('6. Class A Consumption Data'!K57:L57=\"B\",'6. Class A Consumption Data'!E57:F57))","v":3966943},null,null,2.4822923409975051E-2,-12783.147799955501,-1065.26]
[null,"Customer 30",null,3002890,{"$f":"SUM(IF('6. Class A Consumption Data'!K58:L58=\"B\",'6. Class A Consumption Data'!E58:F58))","v":3002890},null,null,1.8790415813531976E-2,-9676.5662367743553,-806.38]
[null,"Customer 31",null,1436253,{"$f":"SUM(IF('6. Class A Consumption Data'!K59:L59=\"B\",'6. Class A Consumption Data'!E59:F59))","v":1436253},null,null,8.9872726218518627E-3,-4628.2072560985844,-385.68]
[null,"Customer 32",null,8495106,{"$f":"SUM(IF('6. Class A Consumption Data'!K60:L60=\"B\",'6. Class A Consumption Data'!E60:F60))","v":8495106},null,null,5.3157649504320961E-2,-27374.780926846888,-2281.23]
[null,"Customer 33",null,{"$f":"SUM(E71:G71)","v":1363799.9999999998},{"$f":"SUM(IF('6. Class A Consumption Data'!K61:L61=\"B\",'6. Class A Consumption Data'!E61:F61))","v":1363799.9999999998},null,null,8.5339020365364383E-3,-4394.7334180449052,-366.23]
[null,"Customer 34",null,0,{"$f":"SUM(IF('6. Class A Consumption Data'!K62:L62=\"B\",'6. Class A Consumption Data'!E62:F62))","v":0},null,null,0,0,0]
[null,"Customer 35",null,0,{"$f":"SUM(IF('6. Class A Consumption Data'!K63:L63=\"B\",'6. Class A Consumption Data'!E63:F63))","v":0},null,null,0,0,0]
[null,"Customer 36",null,0,{"$f":"SUM(IF('6. Class A Consumption Data'!K64:L64=\"B\",'6. Class A Consumption Data'!E64:F64))","v":0},null,null,0,0,0]
[null,"Customer 37",null,0,{"$f":"SUM(IF('6. Class A Consumption Data'!K65:L65=\"B\",'6. Class A Consumption Data'!E65:F65))","v":0},null,null,0,0,0]
[null,"Customer 38",null,0,{"$f":"SUM(IF('6. Class A Consumption Data'!K66:L66=\"B\",'6. Class A Consumption Data'!E66:F66))","v":0},null,null,0,0,0]
[null,"Customer 39",null,0,{"$f":"SUM(IF('6. Class A Consumption Data'!K67:L67=\"B\",'6. Class A Consumption Data'!E67:F67))","v":0},null,null,0,0,0]
[null,"Customer 40",null,0,{"$f":"SUM(IF('6. Class A Consumption Data'!K68:L68=\"B\",'6. Class A Consumption Data'!E68:F68))","v":0},null,null,0,0,0]
[null,"Customer 41",null,0,{"$f":"SUM(IF('6. Class A Consumption Data'!K69:L69=\"B\",'6. Class A Consumption Data'!E69:F69))","v":0},null,null,0,0,0]
[null,"Customer 42",null,0,{"$f":"SUM(IF('6. Class A Consumption Data'!K70:L70=\"B\",'6. Class A Consumption Data'!E70:F70))","v":0},null,null,0,0,0]
[null,"Customer 43",null,0,{"$f":"SUM(IF('6. Class A Consumption Data'!K71:L71=\"B\",'6. Class A Consumption Data'!E71:F71))","v":0},null,null,0,0,0]
[null,"Customer 44",null,0,{"$f":"SUM(IF('6. Class A Consumption Data'!K72:L72=\"B\",'6. Class A Consumption Data'!E72:F72))","v":0},null,null,0,0,0]
[null,"Customer 45",null,0,{"$f":"SUM(IF('6. Class A Consumption Data'!K73:L73=\"B\",'6. Class A Consumption Data'!E73:F73))","v":0},null,null,0,0,0]
[null,"Customer 46",null,0,{"$f":"SUM(IF('6. Class A Consumption Data'!K74:L74=\"B\",'6. Class A Consumption Data'!E74:F74))","v":0},null,null,0,0,0]
[null,"Customer 47",null,0,{"$f":"SUM(IF('6. Class A Consumption Data'!K75:L75=\"B\",'6. Class A Consumption Data'!E75:F75))","v":0},null,null,0,0,0]
[null,"Customer 48",null,0,{"$f":"SUM(IF('6. Class A Consumption Data'!K76:L76=\"B\",'6. Class A Consumption Data'!E76:F76))","v":0},null,null,0,0,0]
[null,"Customer 49",null,0,{"$f":"SUM(IF('6. Class A Consumption Data'!K77:L77=\"B\",'6. Class A Consumption Data'!E77:F77))","v":0},null,null,0,0,0]
[null,"Customer 50",null,0,{"$f":"SUM(IF('6. Class A Consumption Data'!K78:L78=\"B\",'6. Class A Consumption Data'!E78:F78))","v":0},null,null,0,0,0]
[null,"Customer 51",null,0,{"$f":"SUM(IF('6. Class A Consumption Data'!K79:L79=\"B\",'6. Class A Consumption Data'!E79:F79))","v":0},null,null,0,0,0]
[null,"Customer 52",null,0,{"$f":"SUM(IF('6. Class A Consumption Data'!K80:L80=\"B\",'6. Class A Consumption Data'!E80:F80))","v":0},null,null,0,0,0]
[null,"Customer 53",null,0,{"$f":"SUM(IF('6. Class A Consumption Data'!K81:L81=\"B\",'6. Class A Consumption Data'!E81:F81))","v":0},null,null,0,0,0]
[null,"Customer 54",null,0,{"$f":"SUM(IF('6. Class A Consumption Data'!K82:L82=\"B\",'6. Class A Consumption Data'!E82:F82))","v":0},null,null,0,0,0]
[null,"Customer 55",null,0,{"$f":"SUM(IF('6. Class A Consumption Data'!K83:L83=\"B\",'6. Class A Consumption Data'!E83:F83))","v":0},null,null,0,0,0]
[null,"Customer 56",null,0,{"$f":"SUM(IF('6. Class A Consumption Data'!K84:L84=\"B\",'6. Class A Consumption Data'!E84:F84))","v":0},null,null,0,0,0]
[null,"Customer 57",null,0,{"$f":"SUM(IF('6. Class A Consumption Data'!K85:L85=\"B\",'6. Class A Consumption Data'!E85:F85))","v":0},null,null,0,0,0]
[null,"Customer 58",null,0,{"$f":"SUM(IF('6. Class A Consumption Data'!K86:L86=\"B\",'6. Class A Consumption Data'!E86:F86))","v":0},null,null,0,0,0]
[null,"Customer 59",null,0,{"$f":"SUM(IF('6. Class A Consumption Data'!K87:L87=\"B\",'6. Class A Consumption Data'!E87:F87))","v":0},null,null,0,0,0]
[null,"Customer 60",null,0,{"$f":"SUM(IF('6. Class A Consumption Data'!K88:L88=\"B\",'6. Class A Consumption Data'!E88:F88))","v":0},null,null,0,0,0]
[null,"Customer 61",null,0,{"$f":"SUM(IF('6. Class A Consumption Data'!K89:L89=\"B\",'6. Class A Consumption Data'!E89:F89))","v":0},null,null,0,0,0]
[null,"Customer 62",null,0,{"$f":"SUM(IF('6. Class A Consumption Data'!K90:L90=\"B\",'6. Class A Consumption Data'!E90:F90))","v":0},null,null,0,0,0]
[null,"Customer 63",null,0,{"$f":"SUM(IF('6. Class A Consumption Data'!K91:L91=\"B\",'6. Class A Consumption Data'!E91:F91))","v":0},null,null,0,0,0]
[null,"Customer 64",null,0,{"$f":"SUM(IF('6. Class A Consumption Data'!K92:L92=\"B\",'6. Class A Consumption Data'!E92:F92))","v":0},null,null,0,0,0]
[null,"Customer 65",null,{"$f":"SUM(E103:G103)","v":0},{"$f":"SUM(IF('6. Class A Consumption Data'!K93:L93=\"B\",'6. Class A Consumption Data'!E93:F93))","v":0},null,null,0,0,0]
[null,"Customer 66",null,0,{"$f":"SUM(IF('6. Class A Consumption Data'!K94:L94=\"B\",'6. Class A Consumption Data'!E94:F94))","v":0},null,null,{"$f":"IFERROR(+D104/$D$189,0)","v":0},{"$f":"H104*$D$26","v":0},{"$f":"ROUND(IF(ISERROR(I104),0,IF(OR(ISBLANK($D$34), OR($D$34=0, $D$34=\"\")), I104/($D$32), I104/($D$34))),2)","v":0}]
[null,"Customer 67",null,0,{"$f":"SUM(IF('6. Class A Consumption Data'!K95:L95=\"B\",'6. Class A Consumption Data'!E95:F95))","v":0},null,null,0,0,0]
[null,"Customer 68",null,0,{"$f":"SUM(IF('6. Class A Consumption Data'!K96:L96=\"B\",'6. Class A Consumption Data'!E96:F96))","v":0},null,null,0,0,0]
[null,"Customer 69",null,0,{"$f":"SUM(IF('6. Class A Consumption Data'!K97:L97=\"B\",'6. Class A Consumption Data'!E97:F97))","v":0},null,null,0,0,0]
[null,"Customer 70",null,0,{"$f":"SUM(IF('6. Class A Consumption Data'!K98:L98=\"B\",'6. Class A Consumption Data'!E98:F98))","v":0},null,null,0,0,0]
[null,"Customer 71",null,0,{"$f":"SUM(IF('6. Class A Consumption Data'!K99:L99=\"B\",'6. Class A Consumption Data'!E99:F99))","v":0},null,null,0,0,0]
[null,"Customer 72",null,0,{"$f":"SUM(IF('6. Class A Consumption Data'!K100:L100=\"B\",'6. Class A Consumption Data'!E100:F100))","v":0},null,null,0,0,0]
[null,"Customer 73",null,0,{"$f":"SUM(IF('6. Class A Consumption Data'!K101:L101=\"B\",'6. Class A Consumption Data'!E101:F101))","v":0},null,null,0,0,0]
[null,"Customer 74",null,0,{"$f":"SUM(IF('6. Class A Consumption Data'!K102:L102=\"B\",'6. Class A Consumption Data'!E102:F102))","v":0},null,null,0,0,0]
[null,"Customer 75",null,0,{"$f":"SUM(IF('6. Class A Consumption Data'!K103:L103=\"B\",'6. Class A Consumption Data'!E103:F103))","v":0},null,null,0,0,0]
[null,"Customer 76",null,0,{"$f":"SUM(IF('6. Class A Consumption Data'!K104:L104=\"B\",'6. Class A Consumption Data'!E104:F104))","v":0},null,null,0,0,0]
[null,"Customer 77",null,0,{"$f":"SUM(IF('6. Class A Consumption Data'!K105:L105=\"B\",'6. Class A Consumption Data'!E105:F105))","v":0},null,null,0,0,0]
[null,"Customer 78",null,0,{"$f":"SUM(IF('6. Class A Consumption Data'!K106:L106=\"B\",'6. Class A Consumption Data'!E106:F106))","v":0},null,null,0,0,0]
[null,"Customer 79",null,0,{"$f":"SUM(IF('6. Class A Consumption Data'!K107:L107=\"B\",'6. Class A Consumption Data'!E107:F107))","v":0},null,null,0,0,0]
[null,"Customer 80",null,0,{"$f":"SUM(IF('6. Class A Consumption Data'!K108:L108=\"B\",'6. Class A Consumption Data'!E108:F108))","v":0},null,null,0,0,0]
[null,"Customer 81",null,0,{"$f":"SUM(IF('6. Class A Consumption Data'!K109:L109=\"B\",'6. Class A Consumption Data'!E109:F109))","v":0},null,null,0,0,0]
[null,"Customer 82",null,0,{"$f":"SUM(IF('6. Class A Consumption Data'!K110:L110=\"B\",'6. Class A Consumption Data'!E110:F110))","v":0},null,null,0,0,0]
[null,"Customer 83",null,0,{"$f":"SUM(IF('6. Class A Consumption Data'!K111:L111=\"B\",'6. Class A Consumption Data'!E111:F111))","v":0},null,null,0,0,0]
[null,"Customer 84",null,0,{"$f":"SUM(IF('6. Class A Consumption Data'!K112:L112=\"B\",'6. Class A Consumption Data'!E112:F112))","v":0},null,null,0,0,0]
[null,"Customer 85",null,0,{"$f":"SUM(IF('6. Class A Consumption Data'!K113:L113=\"B\",'6. Class A Consumption Data'!E113:F113))","v":0},null,null,0,0,0]
[null,"Customer 86",null,0,{"$f":"SUM(IF('6. Class A Consumption Data'!K114:L114=\"B\",'6. Class A Consumption Data'!E114:F114))","v":0},null,null,0,0,0]
[null,"Customer 87",null,0,{"$f":"SUM(IF('6. Class A Consumption Data'!K115:L115=\"B\",'6. Class A Consumption Data'!E115:F115))","v":0},null,null,0,0,0]
[null,"Customer 88",null,0,{"$f":"SUM(IF('6. Class A Consumption Data'!K116:L116=\"B\",'6. Class A Consumption Data'!E116:F116))","v":0},null,null,0,0,0]
[null,"Customer 89",null,0,{"$f":"SUM(IF('6. Class A Consumption Data'!K117:L117=\"B\",'6. Class A Consumption Data'!E117:F117))","v":0},null,null,0,0,0]
[null,"Customer 90",null,0,{"$f":"SUM(IF('6. Class A Consumption Data'!K118:L118=\"B\",'6. Class A Consumption Data'!E118:F118))","v":0},null,null,0,0,0]
[null,"Customer 91",null,0,{"$f":"SUM(IF('6. Class A Consumption Data'!K119:L119=\"B\",'6. Class A Consumption Data'!E119:F119))","v":0},null,null,0,0,0]
[null,"Customer 92",null,0,{"$f":"SUM(IF('6. Class A Consumption Data'!K120:L120=\"B\",'6. Class A Consumption Data'!E120:F120))","v":0},null,null,0,0,0]
[null,"Customer 93",null,0,{"$f":"SUM(IF('6. Class A Consumption Data'!K121:L121=\"B\",'6. Class A Consumption Data'!E121:F121))","v":0},null,null,0,0,0]
[null,"Customer 94",null,0,{"$f":"SUM(IF('6. Class A Consumption Data'!K122:L122=\"B\",'6. Class A Consumption Data'!E122:F122))","v":0},null,null,0,0,0]
[null,"Customer 95",null,0,{"$f":"SUM(IF('6. Class A Consumption Data'!K123:L123=\"B\",'6. Class A Consumption Data'!E123:F123))","v":0},null,null,0,0,0]
[null,"Customer 96",null,0,{"$f":"SUM(IF('6. Class A Consumption Data'!K124:L124=\"B\",'6. Class A Consumption Data'!E124:F124))","v":0},null,null,0,0,0]
[null,"Customer 97",null,{"$f":"SUM(E135:G135)","v":0},{"$f":"SUM(IF('6. Class A Consumption Data'!K125:L125=\"B\",'6. Class A Consumption Data'!E125:F125))","v":0},null,null,0,0,0]
[null,"Customer 98",null,0,{"$f":"SUM(IF('6. Class A Consumption Data'!K126:L126=\"B\",'6. Class A Consumption Data'!E126:F126))","v":0},null,null,0,0,0]
[null,"Customer 99",null,0,{"$f":"SUM(IF('6. Class A Consumption Data'!K127:L127=\"B\",'6. Class A Consumption Data'!E127:F127))","v":0},null,null,0,0,0]
[null,"Customer 100",null,0,{"$f":"SUM(IF('6. Class A Consumption Data'!K128:L128=\"B\",'6. Class A Consumption Data'!E128:F128))","v":0},null,null,0,0,0]
[null,"Customer 101",null,0,{"$f":"SUM(IF('6. Class A Consumption Data'!K129:L129=\"B\",'6. Class A Consumption Data'!E129:F129))","v":0},null,null,0,0,0]
[null,"Customer 102",null,{"$f":"SUM(E140:G140)","v":0},{"$f":"SUM(IF('6. Class A Consumption Data'!K130:L130=\"B\",'6. Class A Consumption Data'!E130:F130))","v":0},null,null,0,0,0]
[null,"Customer 103",null,0,{"$f":"SUM(IF('6. Class A Consumption Data'!K131:L131=\"B\",'6. Class A Consumption Data'!E131:F131))","v":0},null,null,0,0,0]
[null,"Customer 104",null,0,{"$f":"SUM(IF('6. Class A Consumption Data'!K132:L132=\"B\",'6. Class A Consumption Data'!E132:F132))","v":0},null,null,0,0,0]
[null,"Customer 105",null,0,{"$f":"SUM(IF('6. Class A Consumption Data'!K133:L133=\"B\",'6. Class A Consumption Data'!E133:F133))","v":0},null,null,0,0,0]
[null,"Customer 106",null,0,{"$f":"SUM(IF('6. Class A Consumption Data'!K134:L134=\"B\",'6. Class A Consumption Data'!E134:F134))","v":0},null,null,0,0,0]
[null,"Customer 107",null,0,{"$f":"SUM(IF('6. Class A Consumption Data'!K135:L135=\"B\",'6. Class A Consumption Data'!E135:F135))","v":0},null,null,0,0,0]
[null,"Customer 108",null,0,{"$f":"SUM(IF('6. Class A Consumption Data'!K136:L136=\"B\",'6. Class A Consumption Data'!E136:F136))","v":0},null,null,0,0,0]
[null,"Customer 109",null,0,{"$f":"SUM(IF('6. Class A Consumption Data'!K137:L137=\"B\",'6. Class A Consumption Data'!E137:F137))","v":0},null,null,0,0,0]
[null,"Customer 110",null,0,{"$f":"SUM(IF('6. Class A Consumption Data'!K138:L138=\"B\",'6. Class A Consumption Data'!E138:F138))","v":0},null,null,0,0,0]
[null,"Customer 111",null,0,{"$f":"SUM(IF('6. Class A Consumption Data'!K139:L139=\"B\",'6. Class A Consumption Data'!E139:F139))","v":0},null,null,0,0,0]
[null,"Customer 112",null,0,{"$f":"SUM(IF('6. Class A Consumption Data'!K140:L140=\"B\",'6. Class A Consumption Data'!E140:F140))","v":0},null,null,0,0,0]
[null,"Customer 113",null,0,{"$f":"SUM(IF('6. Class A Consumption Data'!K141:L141=\"B\",'6. Class A Consumption Data'!E141:F141))","v":0},null,null,0,0,0]
[null,"Customer 114",null,0,{"$f":"SUM(IF('6. Class A Consumption Data'!K142:L142=\"B\",'6. Class A Consumption Data'!E142:F142))","v":0},null,null,0,0,0]
[null,"Customer 115",null,0,{"$f":"SUM(IF('6. Class A Consumption Data'!K143:L143=\"B\",'6. Class A Consumption Data'!E143:F143))","v":0},null,null,0,0,0]
[null,"Customer 116",null,0,{"$f":"SUM(IF('6. Class A Consumption Data'!K144:L144=\"B\",'6. Class A Consumption Data'!E144:F144))","v":0},null,null,0,0,0]
[null,"Customer 117",null,0,{"$f":"SUM(IF('6. Class A Consumption Data'!K145:L145=\"B\",'6. Class A Consumption Data'!E145:F145))","v":0},null,null,0,0,0]
[null,"Customer 118",null,0,{"$f":"SUM(IF('6. Class A Consumption Data'!K146:L146=\"B\",'6. Class A Consumption Data'!E146:F146))","v":0},null,null,0,0,0]
[null,"Customer 119",null,0,{"$f":"SUM(IF('6. Class A Consumption Data'!K147:L147=\"B\",'6. Class A Consumption Data'!E147:F147))","v":0},null,null,0,0,0]
[null,"Customer 120",null,0,{"$f":"SUM(IF('6. Class A Consumption Data'!K148:L148=\"B\",'6. Class A Consumption Data'!E148:F148))","v":0},null,null,0,0,0]
[null,"Customer 121",null,0,{"$f":"SUM(IF('6. Class A Consumption Data'!K149:L149=\"B\",'6. Class A Consumption Data'!E149:F149))","v":0},null,null,0,0,0]
[null,"Customer 122",null,0,{"$f":"SUM(IF('6. Class A Consumption Data'!K150:L150=\"B\",'6. Class A Consumption Data'!E150:F150))","v":0},null,null,0,0,0]
[null,"Customer 123",null,0,{"$f":"SUM(IF('6. Class A Consumption Data'!K151:L151=\"B\",'6. Class A Consumption Data'!E151:F151))","v":0},null,null,0,0,0]
[null,"Customer 124",null,0,{"$f":"SUM(IF('6. Class A Consumption Data'!K152:L152=\"B\",'6. Class A Consumption Data'!E152:F152))","v":0},null,null,0,0,0]
[null,"Customer 125",null,0,{"$f":"SUM(IF('6. Class A Consumption Data'!K153:L153=\"B\",'6. Class A Consumption Data'!E153:F153))","v":0},null,null,0,0,0]
[null,"Customer 126",null,0,{"$f":"SUM(IF('6. Class A Consumption Data'!K154:L154=\"B\",'6. Class A Consumption Data'!E154:F154))","v":0},null,null,0,0,0]
[null,"Customer 127",null,0,{"$f":"SUM(IF('6. Class A Consumption Data'!K155:L155=\"B\",'6. Class A Consumption Data'!E155:F155))","v":0},null,null,0,0,0]
[null,"Customer 128",null,0,{"$f":"SUM(IF('6. Class A Consumption Data'!K156:L156=\"B\",'6. Class A Consumption Data'!E156:F156))","v":0},null,null,0,0,0]
[null,"Customer 129",null,0,{"$f":"SUM(IF('6. Class A Consumption Data'!K157:L157=\"B\",'6. Class A Consumption Data'!E157:F157))","v":0},null,null,0,0,0]
[null,"Customer 130",null,0,{"$f":"SUM(IF('6. Class A Consumption Data'!K158:L158=\"B\",'6. Class A Consumption Data'!E158:F158))","v":0},null,null,{"$f":"IFERROR(+D168/$D$189,0)","v":0},{"$f":"H168*$D$26","v":0},{"$f":"ROUND(IF(ISERROR(I168),0,IF(OR(ISBLANK($D$34), OR($D$34=0, $D$34=\"\")), I168/($D$32), I168/($D$34))),2)","v":0}]
[null,"Customer 131",null,0,{"$f":"SUM(IF('6. Class A Consumption Data'!K159:L159=\"B\",'6. Class A Consumption Data'!E159:F159))","v":0},null,null,0,0,0]
[null,"Customer 132",null,0,{"$f":"SUM(IF('6. Class A Consumption Data'!K160:L160=\"B\",'6. Class A Consumption Data'!E160:F160))","v":0},null,null,0,0,0]
[null,"Customer 133",null,0,{"$f":"SUM(IF('6. Class A Consumption Data'!K161:L161=\"B\",'6. Class A Consumption Data'!E161:F161))","v":0},null,null,0,0,0]
[null,"Customer 134",null,0,{"$f":"SUM(IF('6. Class A Consumption Data'!K162:L162=\"B\",'6. Class A Consumption Data'!E162:F162))","v":0},null,null,0,0,0]
[null,"Customer 135",null,0,{"$f":"SUM(IF('6. Class A Consumption Data'!K163:L163=\"B\",'6. Class A Consumption Data'!E163:F163))","v":0},null,null,0,0,0]
[null,"Customer 136",null,0,{"$f":"SUM(IF('6. Class A Consumption Data'!K164:L164=\"B\",'6. Class A Consumption Data'!E164:F164))","v":0},null,null,0,0,0]
[null,"Customer 137",null,0,{"$f":"SUM(IF('6. Class A Consumption Data'!K165:L165=\"B\",'6. Class A Consumption Data'!E165:F165))","v":0},null,null,0,0,0]
[null,"Customer 138",null,0,{"$f":"SUM(IF('6. Class A Consumption Data'!K166:L166=\"B\",'6. Class A Consumption Data'!E166:F166))","v":0},null,null,0,0,0]
[null,"Customer 139",null,0,{"$f":"SUM(IF('6. Class A Consumption Data'!K167:L167=\"B\",'6. Class A Consumption Data'!E167:F167))","v":0},null,null,0,0,0]
[null,"Customer 140",null,0,{"$f":"SUM(IF('6. Class A Consumption Data'!K168:L168=\"B\",'6. Class A Consumption Data'!E168:F168))","v":0},null,null,0,0,0]
[null,"Customer 141",null,0,{"$f":"SUM(IF('6. Class A Consumption Data'!K169:L169=\"B\",'6. Class A Consumption Data'!E169:F169))","v":0},null,null,0,0,0]
[null,"Customer 142",null,0,{"$f":"SUM(IF('6. Class A Consumption Data'!K170:L170=\"B\",'6. Class A Consumption Data'!E170:F170))","v":0},null,null,0,0,0]
[null,"Customer 143",null,0,{"$f":"SUM(IF('6. Class A Consumption Data'!K171:L171=\"B\",'6. Class A Consumption Data'!E171:F171))","v":0},null,null,0,0,0]
[null,"Customer 144",null,0,{"$f":"SUM(IF('6. Class A Consumption Data'!K172:L172=\"B\",'6. Class A Consumption Data'!E172:F172))","v":0},null,null,0,0,0]
[null,"Customer 145",null,0,{"$f":"SUM(IF('6. Class A Consumption Data'!K173:L173=\"B\",'6. Class A Consumption Data'!E173:F173))","v":0},null,null,0,0,0]
[null,"Customer 146",null,0,{"$f":"SUM(IF('6. Class A Consumption Data'!K174:L174=\"B\",'6. Class A Consumption Data'!E174:F174))","v":0},null,null,0,0,0]
[null,"Customer 147",null,0,{"$f":"SUM(IF('6. Class A Consumption Data'!K175:L175=\"B\",'6. Class A Consumption Data'!E175:F175))","v":0},null,null,0,0,0]
[null,"Customer 148",null,0,{"$f":"SUM(IF('6. Class A Consumption Data'!K176:L176=\"B\",'6. Class A Consumption Data'!E176:F176))","v":0},null,null,0,0,0]
[null,"Customer 149",null,0,{"$f":"SUM(IF('6. Class A Consumption Data'!K177:L177=\"B\",'6. Class A Consumption Data'!E177:F177))","v":0},null,null,0,0,0]
[null,"Customer 150",null,0,{"$f":"SUM(IF('6. Class A Consumption Data'!K178:L178=\"B\",'6. Class A Consumption Data'!E178:F178))","v":0},null,null,0,0,0]
[null,"Total for all Customers",null,{"$f":"SUM(D39:D188)","v":159809662},{"$f":"SUM(E39:E188)","v":159809662},0,0,{"$f":"SUM(H39:H188)","v":1},{"$f":"SUM(I39:I188)","v":-514973.50206618354}]

{"sheet":"6.1 GA","index":9,"n_rows":31,"n_cols":16,"rows_kept":31,"cut":false,"hidden":false,"merged":[[7,13,11,13],[11,1,12,5],[1,1,8,5],[5,10,6,11],[7,10,8,11],[5,12,6,12],[7,12,8,12]]}
["Back to Index"]
[null,{"$f":"+'1. Information Sheet'!B2","v":"INCENTIVE REGULATION MODEL FOR 2020 FILERS"}]
[]
[]
[]
[null,null,null,null,null,null,null,null,null,null,"Default Rate Rider Recovery Period (in months)",null,12]
[]
[null,null,null,null,null,null,null,null,null,null,"Proposed Rate Rider Recovery Period (in months)",null,12,{"$f":"IF(M8>0, \"Rate Rider Recovery to be used below\", \"If no rate rider recovery period is proposed then the default recovery period of 12 months will be used\")","v":"Rate Rider Recovery to be used below"}]
[]
[]
[]
[null,"The purpose of this tab is to calculate the GA rate riders for all current Class B customers who did not transition between Class A and B in the period since the Account 1589 GA was last disposed. Calculations in this tab will be modified upon completion of tab 6.1a, which allocates a portion of the GA balance to transition customers, if applicable.\nEffective January 2017, the billing determinant and all rate riders for the disposition of GA balances will be calculated on an energy basis (kWhs) regardless of the billing determinant used for distribution rates for the particular class (see Chapter 3, Filing Requirements, section 3.2.5.2)"]
[]
[null,null,"Total Metered Non-RPP 2018 Consumption excluding WMP",null,"Total Metered 2018 Consumption for Class A Customers that were Class A for the entire period GA blance accumulated",null,"Total Metered 2018 Consumption for Customers that Transitioned Between Class A and B during the period GA balance accumulated ",null,"Non-RPP Metered Consumption for Current Class B Customers (Non-RPP Consumption excluding WMP, Class A and Transition Customers' Consumption)",null,"% of total kWh","Total GA $ allocated to Current Class B Customers","GA Rate Rider",null,"Revenue Reconciliation","Variance"]
[null,null,"kWh","kW","kWh","kW","kWh","kW","kWh","kW"]
[]
[null,{"$f":"'4. Billing Det. for Def-Var'!B17","v":"RESIDENTIAL SERVICE CLASSIFICATION"},{"$f":"'4. Billing Det. for Def-Var'!F17","v":47757735.712355211},{"$f":"'4. Billing Det. for Def-Var'!G17","v":0},{"$f":"SUM(IF('6. Class A Consumption Data'!$D$191:$D$340=$B17,'6. Class A Consumption Data'!E$191:E$340))","v":0},null,{"$f":"SUM(IF('6. Class A Consumption Data'!$D$29:$D$178=$B17,'6. Class A Consumption Data'!E$29:F$178))","v":0},null,{"$f":"ROUND(C17-E17-G17,0)","v":47757736},null,{"$f":"IFERROR(I17/I$29,\"\")","v":1.7568676516577765E-2},{"$f":"IFERROR(L$29*K17,\"\")","v":-153895.37938178866},{"$f":"ROUND(IF(ISERROR(L17/I17),0,IF(OR(ISBLANK($M$8), OR($M$8=0, $M$8=\"\")), L17/I17/($M$6/12), L17/I17/($M$8/12))),4)","v":-3.2000000000000002E-3},"kwh",{"$f":"ROUND(M17,4)*I17","v":-152824.75520000001},{"$f":"L17-O17","v":-1070.6241817886475}]
[null,{"$f":"'4. Billing Det. for Def-Var'!B18","v":"GENERAL SERVICE LESS THAN 50 kW SERVICE CLASSIFICATION"},{"$f":"'4. Billing Det. for Def-Var'!F18","v":91858679.298262566},{"$f":"'4. Billing Det. for Def-Var'!G18","v":0},{"$f":"SUM(IF('6. Class A Consumption Data'!$D$191:$D$340=$B18,'6. Class A Consumption Data'!E$191:E$340))","v":0},null,{"$f":"SUM(IF('6. Class A Consumption Data'!$D$29:$D$178=$B18,'6. Class A Consumption Data'!E$29:F$178))","v":0},null,{"$f":"ROUND(C18-E18-G18,0)","v":91858679},null,{"$f":"IFERROR(I18/I$29,\"\")","v":3.379212566925608E-2},{"$f":"IFERROR(L$29*K18,\"\")","v":-296007.04384761758},{"$f":"ROUND(IF(ISERROR(L18/I18),0,IF(OR(ISBLANK($M$8), OR($M$8=0, $M$8=\"\")), L18/I18/($M$6/12), L18/I18/($M$8/12))),4)","v":-3.2000000000000002E-3},"kwh",{"$f":"ROUND(M18,4)*I18","v":-293947.77280000004},{"$f":"L18-O18","v":-2059.2710476175416}]
[null,{"$f":"'4. Billing Det. for Def-Var'!B19","v":"GENERAL SERVICE 50 to 499 kW SERVICE CLASSIFICATION"},{"$f":"'4. Billing Det. for Def-Var'!F19","v":1737284254.1930017},{"$f":"'4. Billing Det. for Def-Var'!G19","v":4887561.5315022394},{"$f":"SUM(IF('6. Class A Consumption Data'!$D$191:$D$340=$B19,'6. Class A Consumption Data'!E$191:E$340))","v":0},null,{"$f":"SUM(IF('6. Class A Consumption Data'!$D$29:$D$178=$B19,'6. Class A Consumption Data'!E$29:F$178))","v":0},null,1737284254,null,0.63909614718482721,{"$f":"IFERROR(L$29*K19,\"\")","v":-5598255.7331306012},-3.2000000000000002E-3,"kwh ",-5559309.6128000002,-38946.120330600999]
[null,{"$f":"'4. Billing Det. for Def-Var'!B20","v":"GENERAL SERVICE 500 to 4,999 kW SERVICE CLASSIFICATION"},{"$f":"'4. Billing Det. for Def-Var'!F20","v":1874772879.6415691},{"$f":"'4. Billing Det. for Def-Var'!G20","v":4243700.3540871153},{"$f":"SUM(IF('6. Class A Consumption Data'!$D$191:$D$340=$B20,'6. Class A Consumption Data'!E$191:E$340))","v":833612345},null,{"$f":"SUM(IF('6. Class A Consumption Data'!$D$29:$D$178=$B20,'6. Class A Consumption Data'!E$29:F$178))","v":213449766},null,827710769,null,0.30449062220723411,{"$f":"IFERROR(L$29*K20,\"\")","v":-2667229.9292756892},-3.2000000000000002E-3,"kwh",-2648674.4608,-18555.46847568918]
[null,{"$f":"'4. Billing Det. for Def-Var'!B21","v":"LARGE USE SERVICE CLASSIFICATION"},{"$f":"'4. Billing Det. for Def-Var'!F21","v":977049362},{"$f":"'4. Billing Det. for Def-Var'!G21","v":1753163},{"$f":"SUM(IF('6. Class A Consumption Data'!$D$191:$D$340=$B21,'6. Class A Consumption Data'!E$191:E$340))","v":861902317},null,{"$f":"SUM(IF('6. Class A Consumption Data'!$D$29:$D$178=$B21,'6. Class A Consumption Data'!E$29:F$178))","v":115147045},null,0,null,{"$f":"IFERROR(I21/I$29,\"\")","v":0},0,0,"kwh",0,0]
[null,{"$f":"'4. Billing Det. for Def-Var'!B22","v":"STANDBY POWER SERVICE CLASSIFICATION "},{"$f":"'4. Billing Det. for Def-Var'!F22","v":0},{"$f":"'4. Billing Det. for Def-Var'!G22","v":0},{"$f":"SUM(IF('6. Class A Consumption Data'!$D$191:$D$340=$B22,'6. Class A Consumption Data'!E$191:E$340))","v":0},null,{"$f":"SUM(IF('6. Class A Consumption Data'!$D$29:$D$178=$B22,'6. Class A Consumption Data'!E$29:F$178))","v":0},null,0,null,0,0,0,null,0,0]
[null,{"$f":"'4. Billing Det. for Def-Var'!B23","v":"UNMETERED SCATTERED LOAD SERVICE CLASSIFICATION"},{"$f":"'4. Billing Det. for Def-Var'!F23","v":444303.49806949811},{"$f":"'4. Billing Det. for Def-Var'!G23","v":0},{"$f":"SUM(IF('6. Class A Consumption Data'!$D$191:$D$340=$B23,'6. Class A Consumption Data'!E$191:E$340))","v":0},null,{"$f":"SUM(IF('6. Class A Consumption Data'!$D$29:$D$178=$B23,'6. Class A Consumption Data'!E$29:F$178))","v":0},null,444303,null,1.6344609975533703E-4,-1431.7299033075362,-3.2000000000000002E-3,"kwh",-1421.7696000000001,-9.9603033075361509]
[null,{"$f":"'4. Billing Det. for Def-Var'!B24","v":"STREET LIGHTING SERVICE CLASSIFICATION"},{"$f":"'4. Billing Det. for Def-Var'!F24","v":13289944.06494407},{"$f":"'4. Billing Det. for Def-Var'!G24","v":40571.730013897963},{"$f":"SUM(IF('6. Class A Consumption Data'!$D$191:$D$340=$B24,'6. Class A Consumption Data'!E$191:E$340))","v":0},null,{"$f":"SUM(IF('6. Class A Consumption Data'!$D$29:$D$178=$B24,'6. Class A Consumption Data'!E$29:F$178))","v":0},null,13289944,null,4.8889823223494848E-3,-42825.752331365249,-3.2000000000000002E-3,"kwh",-42527.820800000001,-297.93153136524779]
[]
[]
[]
[]
[null,null,{"$f":"SUM(C17:C28)","v":4742457158.4082022},{"$f":"SUM(D17:D28)","v":10924996.615603251},1695514662,0,{"$f":"SUM(G17:G28)","v":328596811},0,2718345685,0,1,{"$f":"'6.1a GA Allocation'!D27","v":-8759645.5678703692},null,null,{"$f":"SUM(O17:O28)","v":-8698706.1920000017},{"$f":"SUM(P17:P28)","v":-60939.375870369149}]
[null,null,null,null,null,null,null,null,null,null,null,"from Sheet 6.1a"]
[null,null,null,null,null,null,null,null,null,null,null,null,null,null,"NOTE: if rate rider is at 5 decimal places, then the balance dispostion is in full"]

{"sheet":"6.2a CBR B_Allocation","index":10,"n_rows":183,"n_cols":14,"rows_kept":183,"cut":false,"hidden":false,"merged":[[30,7,30,9],[1,1,8,6],[15,1,15,5],[22,1,22,3],[28,1,28,4],[10,1,11,5],[13,3,13,5],[24,7,25,9]]}
["Back to Index"]
[null,{"$f":"+'1. Information Sheet'!B2","v":"INCENTIVE REGULATION MODEL FOR 2020 FILERS"}]
[]
[]
[]
[]
[]
[]
[]
[]
[null,"This tab allocates the CBR Class B balance to transition customers (i.e Class A customers who were former Class B customers and Class B customers who were former Class A customers) who contributed to the current CBR Class B balance. The tables below calculate specific amounts for each customer who made the change. The general CBR Class B rate rider is not to be charged to the transition customers that are allocated amounts in the table below. Consistent with prior decisions, distributors are generally expected to settle the amount through 12 equal adjustments to bills."]
[]
[]
[null,"Please enter the Year the Account 1580 CBR Class B was Last Disposed.",2017,"(Note: Account 1580, Sub-account CBR Class B was established starting in 2015)"]
[]
[null,"Allocation of totalConsumption (kWh) between Current Class B and Class A/B Transition Customers"]
[null,null,null,"Total",{"$f":"C14+1","v":2018},{"$f":"E17-1","v":2017},{"$f":"F17-1","v":2016}]
[null,"Total Class B Consumption for Years During Balance Accumulation (Total Consumption LESS WMP Consumption and Consumption for Class A customers who were Class A for partial or full year)","A",{"$f":"SUM(E18:G18)","v":5387471553.8550463},{"$f":"N25","v":5387471553.8550463},null,null,"from Cell N25"]
[null,"Transition Customers' Class B Consumption (i.e. full year or partial year)","B",{"$f":"SUM(E19:G19)","v":159809662},{"$f":"E183","v":159809662},{"$f":"F183","v":0},0]
[null,"Transition Customers' Portion of Total Consumption ","C=B/A",{"$f":"IFERROR(+D19/D18,0)","v":2.9663202933414467E-2}]
[null,null,null,null,null,null,null,null,null,null,null,"Sheet 4","total kWh",{"$f":"'4. Billing Det. for Def-Var'!D29","v":7267115621.1519737}]
[null,null,null,null,null,null,null,null,null,null,null,"Sheet 4","WMP kWh",{"$f":"'4. Billing Det. for Def-Var'!H29","v":15342256.296927605}]
[null,"Allocation of Total CBR Class B Balance $",null,null,null,null,null,null,null,null,null,"Sheet 6.1","Class A (full)",{"$f":"'6.1 GA'!E29","v":1695514662}]
[null,null,null,null,null,null,null,null,null,null,null,"Sheet 6.1","Class A (partial)",{"$f":"SUM(IF('6. Class A Consumption Data'!$K$28:$L$61=\"a\",'6. Class A Consumption Data'!$E$28:$F$61))","v":168787149}]
[null,"Total CBR Class B Balance ","D",{"$f":"'3. Continuity Schedule'!BU25","v":-528470.43935300002},null,null,null,{"$f":"IF('6.2 CBR B'!U18=\"TRUE\",\"NO MONTHLY EQUAL PAYMENTS.The entire OEB-approved CBR Class B amount is transferred into Account 1580 WMS control account to be disposed through the general purpose Group 1 DVA rate riders.\",\"\")","v":""},null,null,null,null,null,{"$f":"N21-N22-N23-N24","v":5387471553.8550463}]
[null,"Transition Customers Portion of CBR Class B Balance","E=D*C",{"$f":"+D20*D25","v":-15676.125886838743}]
[null,"CBR Class B Balance to be disposed to Current Class B Customers through Rate Rider","F=D-E",{"$f":"+D25-D26","v":-512794.31346616126}]
[]
[null,"Allocation of CBR Class B Balances to Transition Customers"]
[]
[null,"# of Class A/B Transition Customers",{"$f":"'6. Class A Consumption Data'!C23","v":33}]
[null,"Customer",null,"Total Metered Consumption (kWh) for Transition Customers During the Period WhenThey Were Class B Customers","Metered Consumption (kWh) for Transition Customers During the Period When They Were Class B Customers in 2018","Metered Consumption (kWh) for Transition Customers During the Period When They Were Class B Customers in 2017","Metered Consumption (kWh) for Transition Customers During the Period When They Were Class B Customers in 2016","% of kWh","Customer Specific CBR Class B Allocation for the Period When They Were a Class B Customer","Monthly Equal Payments"]
[null,"Customer 1",null,{"$f":"SUM(E33:G33)","v":2389174},{"$f":"SUM(IF('6. Class A Consumption Data'!K29:L29=\"B\",'6. Class A Consumption Data'!E29:F29))","v":2389174},null,null,{"$f":"IFERROR(+D33/$D$183,0)","v":1.4950122352426976E-2},{"$f":"IF('6.2 CBR B'!U$18=\"TRUE\",\"\",+H33*$D$26)","v":-234.36000002028706},{"$f":"IF('6.2 CBR B'!U$18=\"TRUE\",\"\",+I33/12)","v":-19.530000001690588}]
[null,"Customer 2",null,4672225,{"$f":"SUM(IF('6. Class A Consumption Data'!K30:L30=\"B\",'6. Class A Consumption Data'!E30:F30))","v":4672225},null,null,{"$f":"IFERROR(+D34/$D$183,0)","v":2.9236185982296867E-2},{"$f":"IF('6.2 CBR B'!U$18=\"TRUE\",\"\",+H34*$D$26)","v":-458.31013190951592},{"$f":"IF('6.2 CBR B'!U$18=\"TRUE\",\"\",+I34/12)","v":-38.19251099245966}]
[null,"Customer 3",null,2868732,{"$f":"SUM(IF('6. Class A Consumption Data'!K31:L31=\"B\",'6. Class A Consumption Data'!E31:F31))","v":2868732},null,null,1.7950929650298614E-2,{"$f":"IF('6.2 CBR B'!U$18=\"TRUE\",\"\",+H35*$D$26)","v":-281.40103298386725},{"$f":"IF('6.2 CBR B'!U$18=\"TRUE\",\"\",+I35/12)","v":-23.450086081988939}]
[null,"Customer 4",null,2769214,{"$f":"SUM(IF('6. Class A Consumption Data'!K32:L32=\"B\",'6. Class A Consumption Data'!E32:F32))","v":2769214},null,null,1.7328201344922436E-2,{"$f":"IF('6.2 CBR B'!U$18=\"TRUE\",\"\",+H36*$D$26)","v":-271.63906567549253},{"$f":"IF('6.2 CBR B'!U$18=\"TRUE\",\"\",+I36/12)","v":-22.636588806291044}]
[null,"Customer 5",null,1300006,{"$f":"SUM(IF('6. Class A Consumption Data'!K33:L33=\"B\",'6. Class A Consumption Data'!E33:F33))","v":1300006},null,null,8.1347146582413776E-3,{"$f":"IF('6.2 CBR B'!U$18=\"TRUE\",\"\",+H37*$D$26)","v":-127.52081103610423},{"$f":"IF('6.2 CBR B'!U$18=\"TRUE\",\"\",+I37/12)","v":-10.626734253008687}]
[null,"Customer 6",null,816748,{"$f":"SUM(IF('6. Class A Consumption Data'!K34:L34=\"B\",'6. Class A Consumption Data'!E34:F34))","v":816748},null,null,5.1107548178157087E-3,{"$f":"IF('6.2 CBR B'!U$18=\"TRUE\",\"\",+H38*$D$26)","v":-80.116835900846652},{"$f":"IF('6.2 CBR B'!U$18=\"TRUE\",\"\",+I38/12)","v":-6.6764029917372207}]
[null,"Customer 7",null,2015656,{"$f":"SUM(IF('6. Class A Consumption Data'!K35:L35=\"B\",'6. Class A Consumption Data'!E35:F35))","v":2015656},null,null,1.2612854409265942E-2,{"$f":"IF('6.2 CBR B'!U$18=\"TRUE\",\"\",+H39*$D$26)","v":-197.72069351202202},{"$f":"IF('6.2 CBR B'!U$18=\"TRUE\",\"\",+I39/12)","v":-16.47672445933517}]
[null,"Customer 8",null,26194573,{"$f":"SUM(IF('6. Class A Consumption Data'!K36:L36=\"B\",'6. Class A Consumption Data'!E36:F36))","v":26194573},null,null,0.16391107191003257,{"$f":"IF('6.2 CBR B'!U$18=\"TRUE\",\"\",+H40*$D$26)","v":-2569.4905975083484},{"$f":"IF('6.2 CBR B'!U$18=\"TRUE\",\"\",+I40/12)","v":-214.12421645902904}]
[null,"Customer 9",null,2530311,{"$f":"SUM(IF('6. Class A Consumption Data'!K37:L37=\"B\",'6. Class A Consumption Data'!E37:F37))","v":2530311},null,null,1.583327921687238E-2,{"$f":"IF('6.2 CBR B'!U$18=\"TRUE\",\"\",+H41*$D$26)","v":-248.20447820515898},{"$f":"IF('6.2 CBR B'!U$18=\"TRUE\",\"\",+I41/12)","v":-20.683706517096581}]
[null,"Customer 10",null,2038661,{"$f":"SUM(IF('6. Class A Consumption Data'!K38:L38=\"B\",'6. Class A Consumption Data'!E38:F38))","v":2038661},null,null,1.2756806906956603E-2,{"$f":"IF('6.2 CBR B'!U$18=\"TRUE\",\"\",+H42*$D$26)","v":-199.97731098754568},{"$f":"IF('6.2 CBR B'!U$18=\"TRUE\",\"\",+I42/12)","v":-16.664775915628805}]
[null,"Customer 11",null,4194295,{"$f":"SUM(IF('6. Class A Consumption Data'!K39:L39=\"B\",'6. Class A Consumption Data'!E39:F39))","v":4194295},null,null,2.6245565803148997E-2,{"$f":"IF('6.2 CBR B'!U$18=\"TRUE\",\"\",+H43*$D$26)","v":-411.42879350147365},{"$f":"IF('6.2 CBR B'!U$18=\"TRUE\",\"\",+I43/12)","v":-34.285732791789471}]
[null,"Customer 12",null,7270843,{"$f":"SUM(IF('6. Class A Consumption Data'!K40:L40=\"B\",'6. Class A Consumption Data'!E40:F40))","v":7270843},null,null,4.5496892421936289E-2,{"$f":"IF('6.2 CBR B'!U$18=\"TRUE\",\"\",+H44*$D$26)","v":-713.21501306623293},{"$f":"IF('6.2 CBR B'!U$18=\"TRUE\",\"\",+I44/12)","v":-59.434584422186077}]
[null,"Customer 13",null,2512207,{"$f":"SUM(IF('6. Class A Consumption Data'!K41:L41=\"B\",'6. Class A Consumption Data'!E41:F41))","v":2512207},null,null,1.5719994451899911E-2,{"$f":"IF('6.2 CBR B'!U$18=\"TRUE\",\"\",+H45*$D$26)","v":-246.42861196838962},{"$f":"IF('6.2 CBR B'!U$18=\"TRUE\",\"\",+I45/12)","v":-20.535717664032468}]
[null,"Customer 14",null,2301872,{"$f":"SUM(IF('6. Class A Consumption Data'!K42:L42=\"B\",'6. Class A Consumption Data'!E42:F42))","v":2301872},null,null,1.4403834982142694E-2,{"$f":"IF('6.2 CBR B'!U$18=\"TRUE\",\"\",+H46*$D$26)","v":-225.79633043332055},{"$f":"IF('6.2 CBR B'!U$18=\"TRUE\",\"\",+I46/12)","v":-18.816360869443379}]
[null,"Customer 15",null,1266000,{"$f":"SUM(IF('6. Class A Consumption Data'!K43:L43=\"B\",'6. Class A Consumption Data'!E43:F43))","v":1266000},null,null,7.9219240198380499E-3,{"$f":"IF('6.2 CBR B'!U$18=\"TRUE\",\"\",+H47*$D$26)","v":-124.18507820095289},{"$f":"IF('6.2 CBR B'!U$18=\"TRUE\",\"\",+I47/12)","v":-10.348756516746073}]
[null,"Customer 16",null,9187198,{"$f":"SUM(IF('6. Class A Consumption Data'!K44:L44=\"B\",'6. Class A Consumption Data'!E44:F44))","v":9187198},null,null,5.7488376391159626E-2,{"$f":"IF('6.2 CBR B'!U$18=\"TRUE\",\"\",+H48*$D$26)","v":-901.19502533778666},{"$f":"IF('6.2 CBR B'!U$18=\"TRUE\",\"\",+I48/12)","v":-75.09958544481556}]
[null,"Customer 17",null,28684761,{"$f":"SUM(IF('6. Class A Consumption Data'!K45:L45=\"B\",'6. Class A Consumption Data'!E45:F45))","v":28684761},null,null,0.17949328370396028,{"$f":"IF('6.2 CBR B'!U$18=\"TRUE\",\"\",+H49*$D$26)","v":-2813.7593111853425},{"$f":"IF('6.2 CBR B'!U$18=\"TRUE\",\"\",+I49/12)","v":-234.47994259877854}]
[null,"Customer 18",null,897411,{"$f":"SUM(IF('6. Class A Consumption Data'!K46:L46=\"B\",'6. Class A Consumption Data'!E46:F46))","v":897411},null,null,5.6154990178253431E-3,{"$f":"IF('6.2 CBR B'!U$18=\"TRUE\",\"\",+H50*$D$26)","v":-88.029269520849397},{"$f":"IF('6.2 CBR B'!U$18=\"TRUE\",\"\",+I50/12)","v":-7.3357724600707828}]
[null,"Customer 19",null,5373080,{"$f":"SUM(IF('6. Class A Consumption Data'!K47:L47=\"B\",'6. Class A Consumption Data'!E47:F47))","v":5373080},null,null,3.3621746850324985E-2,{"$f":"IF('6.2 CBR B'!U$18=\"TRUE\",\"\",+H51*$D$26)","v":-527.05873616111842},{"$f":"IF('6.2 CBR B'!U$18=\"TRUE\",\"\",+I51/12)","v":-43.921561346759866}]
[null,"Customer 20",null,2658418,{"$f":"SUM(IF('6. Class A Consumption Data'!K48:L48=\"B\",'6. Class A Consumption Data'!E48:F48))","v":2658418},null,null,1.6634901586864002E-2,{"$f":"IF('6.2 CBR B'!U$18=\"TRUE\",\"\",+H52*$D$26)","v":-260.77081139085368},{"$f":"IF('6.2 CBR B'!U$18=\"TRUE\",\"\",+I52/12)","v":-21.730900949237807}]
[null,"Customer 21",null,4188830,{"$f":"SUM(IF('6. Class A Consumption Data'!K49:L49=\"B\",'6. Class A Consumption Data'!E49:F49))","v":4188830},null,null,2.6211368872052304E-2,{"$f":"IF('6.2 CBR B'!U$18=\"TRUE\",\"\",+H53*$D$26)","v":-410.89271810465834},{"$f":"IF('6.2 CBR B'!U$18=\"TRUE\",\"\",+I53/12)","v":-34.24105984205486}]
[null,"Customer 22",null,11053536,{"$f":"SUM(IF('6. Class A Consumption Data'!K50:L50=\"B\",'6. Class A Consumption Data'!E50:F50))","v":11053536},null,null,6.9166881787160031E-2,{"$f":"IF('6.2 CBR B'!U$18=\"TRUE\",\"\",+H54*$D$26)","v":-1084.2687460956145},{"$f":"IF('6.2 CBR B'!U$18=\"TRUE\",\"\",+I54/12)","v":-90.3557288413012}]
[null,"Customer 23",null,2090353,{"$f":"SUM(IF('6. Class A Consumption Data'!K51:L51=\"B\",'6. Class A Consumption Data'!E51:F51))","v":2090353},null,null,1.3080266698768188E-2,{"$f":"IF('6.2 CBR B'!U$18=\"TRUE\",\"\",+H55*$D$26)","v":-205.04790740331472},{"$f":"IF('6.2 CBR B'!U$18=\"TRUE\",\"\",+I55/12)","v":-17.087325616942895}]
[null,"Customer 24",null,2516374,{"$f":"SUM(IF('6. Class A Consumption Data'!K52:L52=\"B\",'6. Class A Consumption Data'!E52:F52))","v":2516374},null,null,1.5746069220770896E-2,{"$f":"IF('6.2 CBR B'!U$18=\"TRUE\",\"\",+H56*$D$26)","v":-246.8373633276814},{"$f":"IF('6.2 CBR B'!U$18=\"TRUE\",\"\",+I56/12)","v":-20.569780277306783}]
[null,"Customer 25",null,2617200,{"$f":"SUM(IF('6. Class A Consumption Data'!K53:L53=\"B\",'6. Class A Consumption Data'!E53:F53))","v":2617200},null,null,1.6376982262812121E-2,{"$f":"IF('6.2 CBR B'!U$18=\"TRUE\",\"\",+H57*$D$26)","v":-256.72763559836801},{"$f":"IF('6.2 CBR B'!U$18=\"TRUE\",\"\",+I57/12)","v":-21.393969633197333}]
[null,"Customer 26",null,2633257,{"$f":"SUM(IF('6. Class A Consumption Data'!K54:L54=\"B\",'6. Class A Consumption Data'!E54:F54))","v":2633257},null,null,1.6477458040052673E-2,{"$f":"IF('6.2 CBR B'!U$18=\"TRUE\",\"\",+H58*$D$26)","v":-258.30270653096892},{"$f":"IF('6.2 CBR B'!U$18=\"TRUE\",\"\",+I58/12)","v":-21.525225544247409}]
[null,"Customer 27",null,2350884,{"$f":"SUM(IF('6. Class A Consumption Data'!K55:L55=\"B\",'6. Class A Consumption Data'!E55:F55))","v":2350884},null,null,1.4710524824212444E-2,{"$f":"IF('6.2 CBR B'!U$18=\"TRUE\",\"\",+H59*$D$26)","v":-230.60403900582065},{"$f":"IF('6.2 CBR B'!U$18=\"TRUE\",\"\",+I59/12)","v":-19.217003250485053}]
[null,"Customer 28",null,2152851,{"$f":"SUM(IF('6. Class A Consumption Data'!K56:L56=\"B\",'6. Class A Consumption Data'!E56:F56))","v":2152851},null,null,1.3471344429725406E-2,{"$f":"IF('6.2 CBR B'!U$18=\"TRUE\",\"\",+H60*$D$26)","v":-211.17849114533934},{"$f":"IF('6.2 CBR B'!U$18=\"TRUE\",\"\",+I60/12)","v":-17.598207595444944}]
[null,"Customer 29",null,3966943,{"$f":"SUM(IF('6. Class A Consumption Data'!K57:L57=\"B\",'6. Class A Consumption Data'!E57:F57))","v":3966943},null,null,2.4822923409975051E-2,{"$f":"IF('6.2 CBR B'!U$18=\"TRUE\",\"\",+H61*$D$26)","v":-389.12727225412533},{"$f":"IF('6.2 CBR B'!U$18=\"TRUE\",\"\",+I61/12)","v":-32.427272687843775}]
[null,"Customer 30",null,3002890,{"$f":"SUM(IF('6. Class A Consumption Data'!K58:L58=\"B\",'6. Class A Consumption Data'!E58:F58))","v":3002890},null,null,1.8790415813531976E-2,{"$f":"IF('6.2 CBR B'!U$18=\"TRUE\",\"\",+H62*$D$26)","v":-294.56092375897271},{"$f":"IF('6.2 CBR B'!U$18=\"TRUE\",\"\",+I62/12)","v":-24.54674364658106}]
[null,"Customer 31",null,1436253,{"$f":"SUM(IF('6. Class A Consumption Data'!K59:L59=\"B\",'6. Class A Consumption Data'!E59:F59))","v":1436253},null,null,8.9872726218518627E-3,{"$f":"IF('6.2 CBR B'!U$18=\"TRUE\",\"\",+H63*$D$26)","v":-140.88561699948909},{"$f":"IF('6.2 CBR B'!U$18=\"TRUE\",\"\",+I63/12)","v":-11.740468083290757}]
[null,"Customer 32",null,8495106,{"$f":"SUM(IF('6. Class A Consumption Data'!K60:L60=\"B\",'6. Class A Consumption Data'!E60:F60))","v":8495106},null,null,5.3157649504320961E-2,{"$f":"IF('6.2 CBR B'!U$18=\"TRUE\",\"\",+H64*$D$26)","v":-833.30600547818653},{"$f":"IF('6.2 CBR B'!U$18=\"TRUE\",\"\",+I64/12)","v":-69.442167123182216}]
[null,"Customer 33",null,1363799.9999999998,{"$f":"SUM(IF('6. Class A Consumption Data'!K61:L61=\"B\",'6. Class A Consumption Data'!E61:F61))","v":1363799.9999999998},null,null,8.5339020365364383E-3,{"$f":"IF('6.2 CBR B'!U$18=\"TRUE\",\"\",+H65*$D$26)","v":-133.77852263069474},{"$f":"IF('6.2 CBR B'!U$18=\"TRUE\",\"\",+I65/12)","v":-11.148210219224561}]
[null,"Customer 34",null,0,{"$f":"SUM(IF('6. Class A Consumption Data'!K62:L62=\"B\",'6. Class A Consumption Data'!E62:F62))","v":0},null,null,0,{"$f":"IF('6.2 CBR B'!U$18=\"TRUE\",\"\",+H66*$D$26)","v":0},{"$f":"IF('6.2 CBR B'!U$18=\"TRUE\",\"\",+I66/12)","v":0}]
[null,"Customer 35",null,0,{"$f":"SUM(IF('6. Class A Consumption Data'!K63:L63=\"B\",'6. Class A Consumption Data'!E63:F63))","v":0},null,null,0,{"$f":"IF('6.2 CBR B'!U$18=\"TRUE\",\"\",+H67*$D$26)","v":0},{"$f":"IF('6.2 CBR B'!U$18=\"TRUE\",\"\",+I67/12)","v":0}]
[null,"Customer 36",null,0,{"$f":"SUM(IF('6. Class A Consumption Data'!K64:L64=\"B\",'6. Class A Consumption Data'!E64:F64))","v":0},null,null,0,{"$f":"IF('6.2 CBR B'!U$18=\"TRUE\",\"\",+H68*$D$26)","v":0},{"$f":"IF('6.2 CBR B'!U$18=\"TRUE\",\"\",+I68/12)","v":0}]
[null,"Customer 37",null,0,{"$f":"SUM(IF('6. Class A Consumption Data'!K65:L65=\"B\",'6. Class A Consumption Data'!E65:F65))","v":0},null,null,0,{"$f":"IF('6.2 CBR B'!U$18=\"TRUE\",\"\",+H69*$D$26)","v":0},{"$f":"IF('6.2 CBR B'!U$18=\"TRUE\",\"\",+I69/12)","v":0}]
[null,"Customer 38",null,0,{"$f":"SUM(IF('6. Class A Consumption Data'!K66:L66=\"B\",'6. Class A Consumption Data'!E66:F66))","v":0},null,null,0,{"$f":"IF('6.2 CBR B'!U$18=\"TRUE\",\"\",+H70*$D$26)","v":0},{"$f":"IF('6.2 CBR B'!U$18=\"TRUE\",\"\",+I70/12)","v":0}]
[null,"Customer 39",null,0,{"$f":"SUM(IF('6. Class A Consumption Data'!K67:L67=\"B\",'6. Class A Consumption Data'!E67:F67))","v":0},null,null,0,{"$f":"IF('6.2 CBR B'!U$18=\"TRUE\",\"\",+H71*$D$26)","v":0},{"$f":"IF('6.2 CBR B'!U$18=\"TRUE\",\"\",+I71/12)","v":0}]
[null,"Customer 40",null,0,{"$f":"SUM(IF('6. Class A Consumption Data'!K68:L68=\"B\",'6. Class A Consumption Data'!E68:F68))","v":0},null,null,0,{"$f":"IF('6.2 CBR B'!U$18=\"TRUE\",\"\",+H72*$D$26)","v":0},{"$f":"IF('6.2 CBR B'!U$18=\"TRUE\",\"\",+I72/12)","v":0}]
[null,"Customer 41",null,0,{"$f":"SUM(IF('6. Class A Consumption Data'!K69:L69=\"B\",'6. Class A Consumption Data'!E69:F69))","v":0},null,null,0,{"$f":"IF('6.2 CBR B'!U$18=\"TRUE\",\"\",+H73*$D$26)","v":0},{"$f":"IF('6.2 CBR B'!U$18=\"TRUE\",\"\",+I73/12)","v":0}]
[null,"Customer 42",null,0,{"$f":"SUM(IF('6. Class A Consumption Data'!K70:L70=\"B\",'6. Class A Consumption Data'!E70:F70))","v":0},null,null,0,{"$f":"IF('6.2 CBR B'!U$18=\"TRUE\",\"\",+H74*$D$26)","v":0},{"$f":"IF('6.2 CBR B'!U$18=\"TRUE\",\"\",+I74/12)","v":0}]
[null,"Customer 43",null,0,{"$f":"SUM(IF('6. Class A Consumption Data'!K71:L71=\"B\",'6. Class A Consumption Data'!E71:F71))","v":0},null,null,0,{"$f":"IF('6.2 CBR B'!U$18=\"TRUE\",\"\",+H75*$D$26)","v":0},{"$f":"IF('6.2 CBR B'!U$18=\"TRUE\",\"\",+I75/12)","v":0}]
[null,"Customer 44",null,0,{"$f":"SUM(IF('6. Class A Consumption Data'!K72:L72=\"B\",'6. Class A Consumption Data'!E72:F72))","v":0},null,null,0,{"$f":"IF('6.2 CBR B'!U$18=\"TRUE\",\"\",+H76*$D$26)","v":0},{"$f":"IF('6.2 CBR B'!U$18=\"TRUE\",\"\",+I76/12)","v":0}]
[null,"Customer 45",null,0,{"$f":"SUM(IF('6. Class A Consumption Data'!K73:L73=\"B\",'6. Class A Consumption Data'!E73:F73))","v":0},null,null,0,{"$f":"IF('6.2 CBR B'!U$18=\"TRUE\",\"\",+H77*$D$26)","v":0},{"$f":"IF('6.2 CBR B'!U$18=\"TRUE\",\"\",+I77/12)","v":0}]
[null,"Customer 46",null,0,{"$f":"SUM(IF('6. Class A Consumption Data'!K74:L74=\"B\",'6. Class A Consumption Data'!E74:F74))","v":0},null,null,0,{"$f":"IF('6.2 CBR B'!U$18=\"TRUE\",\"\",+H78*$D$26)","v":0},{"$f":"IF('6.2 CBR B'!U$18=\"TRUE\",\"\",+I78/12)","v":0}]
[null,"Customer 47",null,0,{"$f":"SUM(IF('6. Class A Consumption Data'!K75:L75=\"B\",'6. Class A Consumption Data'!E75:F75))","v":0},null,null,0,{"$f":"IF('6.2 CBR B'!U$18=\"TRUE\",\"\",+H79*$D$26)","v":0},{"$f":"IF('6.2 CBR B'!U$18=\"TRUE\",\"\",+I79/12)","v":0}]
[null,"Customer 48",null,0,{"$f":"SUM(IF('6. Class A Consumption Data'!K76:L76=\"B\",'6. Class A Consumption Data'!E76:F76))","v":0},null,null,0,{"$f":"IF('6.2 CBR B'!U$18=\"TRUE\",\"\",+H80*$D$26)","v":0},{"$f":"IF('6.2 CBR B'!U$18=\"TRUE\",\"\",+I80/12)","v":0}]
[null,"Customer 49",null,0,{"$f":"SUM(IF('6. Class A Consumption Data'!K77:L77=\"B\",'6. Class A Consumption Data'!E77:F77))","v":0},null,null,0,{"$f":"IF('6.2 CBR B'!U$18=\"TRUE\",\"\",+H81*$D$26)","v":0},{"$f":"IF('6.2 CBR B'!U$18=\"TRUE\",\"\",+I81/12)","v":0}]
[null,"Customer 50",null,0,{"$f":"SUM(IF('6. Class A Consumption Data'!K78:L78=\"B\",'6. Class A Consumption Data'!E78:F78))","v":0},null,null,0,{"$f":"IF('6.2 CBR B'!U$18=\"TRUE\",\"\",+H82*$D$26)","v":0},{"$f":"IF('6.2 CBR B'!U$18=\"TRUE\",\"\",+I82/12)","v":0}]
[null,"Customer 51",null,0,{"$f":"SUM(IF('6. Class A Consumption Data'!K79:L79=\"B\",'6. Class A Consumption Data'!E79:F79))","v":0},null,null,0,{"$f":"IF('6.2 CBR B'!U$18=\"TRUE\",\"\",+H83*$D$26)","v":0},{"$f":"IF('6.2 CBR B'!U$18=\"TRUE\",\"\",+I83/12)","v":0}]
[null,"Customer 52",null,0,{"$f":"SUM(IF('6. Class A Consumption Data'!K80:L80=\"B\",'6. Class A Consumption Data'!E80:F80))","v":0},null,null,0,{"$f":"IF('6.2 CBR B'!U$18=\"TRUE\",\"\",+H84*$D$26)","v":0},{"$f":"IF('6.2 CBR B'!U$18=\"TRUE\",\"\",+I84/12)","v":0}]
[null,"Customer 53",null,0,{"$f":"SUM(IF('6. Class A Consumption Data'!K81:L81=\"B\",'6. Class A Consumption Data'!E81:F81))","v":0},null,null,0,{"$f":"IF('6.2 CBR B'!U$18=\"TRUE\",\"\",+H85*$D$26)","v":0},{"$f":"IF('6.2 CBR B'!U$18=\"TRUE\",\"\",+I85/12)","v":0}]
[null,"Customer 54",null,0,{"$f":"SUM(IF('6. Class A Consumption Data'!K82:L82=\"B\",'6. Class A Consumption Data'!E82:F82))","v":0},null,null,0,{"$f":"IF('6.2 CBR B'!U$18=\"TRUE\",\"\",+H86*$D$26)","v":0},{"$f":"IF('6.2 CBR B'!U$18=\"TRUE\",\"\",+I86/12)","v":0}]
[null,"Customer 55",null,0,{"$f":"SUM(IF('6. Class A Consumption Data'!K83:L83=\"B\",'6. Class A Consumption Data'!E83:F83))","v":0},null,null,0,{"$f":"IF('6.2 CBR B'!U$18=\"TRUE\",\"\",+H87*$D$26)","v":0},{"$f":"IF('6.2 CBR B'!U$18=\"TRUE\",\"\",+I87/12)","v":0}]
[null,"Customer 56",null,0,{"$f":"SUM(IF('6. Class A Consumption Data'!K84:L84=\"B\",'6. Class A Consumption Data'!E84:F84))","v":0},null,null,0,{"$f":"IF('6.2 CBR B'!U$18=\"TRUE\",\"\",+H88*$D$26)","v":0},{"$f":"IF('6.2 CBR B'!U$18=\"TRUE\",\"\",+I88/12)","v":0}]
[null,"Customer 57",null,0,{"$f":"SUM(IF('6. Class A Consumption Data'!K85:L85=\"B\",'6. Class A Consumption Data'!E85:F85))","v":0},null,null,0,{"$f":"IF('6.2 CBR B'!U$18=\"TRUE\",\"\",+H89*$D$26)","v":0},{"$f":"IF('6.2 CBR B'!U$18=\"TRUE\",\"\",+I89/12)","v":0}]
[null,"Customer 58",null,0,{"$f":"SUM(IF('6. Class A Consumption Data'!K86:L86=\"B\",'6. Class A Consumption Data'!E86:F86))","v":0},null,null,0,{"$f":"IF('6.2 CBR B'!U$18=\"TRUE\",\"\",+H90*$D$26)","v":0},{"$f":"IF('6.2 CBR B'!U$18=\"TRUE\",\"\",+I90/12)","v":0}]
[null,"Customer 59",null,0,{"$f":"SUM(IF('6. Class A Consumption Data'!K87:L87=\"B\",'6. Class A Consumption Data'!E87:F87))","v":0},null,null,0,{"$f":"IF('6.2 CBR B'!U$18=\"TRUE\",\"\",+H91*$D$26)","v":0},{"$f":"IF('6.2 CBR B'!U$18=\"TRUE\",\"\",+I91/12)","v":0}]
[null,"Customer 60",null,0,{"$f":"SUM(IF('6. Class A Consumption Data'!K88:L88=\"B\",'6. Class A Consumption Data'!E88:F88))","v":0},null,null,0,{"$f":"IF('6.2 CBR B'!U$18=\"TRUE\",\"\",+H92*$D$26)","v":0},{"$f":"IF('6.2 CBR B'!U$18=\"TRUE\",\"\",+I92/12)","v":0}]
[null,"Customer 61",null,0,{"$f":"SUM(IF('6. Class A Consumption Data'!K89:L89=\"B\",'6. Class A Consumption Data'!E89:F89))","v":0},null,null,0,{"$f":"IF('6.2 CBR B'!U$18=\"TRUE\",\"\",+H93*$D$26)","v":0},{"$f":"IF('6.2 CBR B'!U$18=\"TRUE\",\"\",+I93/12)","v":0}]
[null,"Customer 62",null,0,{"$f":"SUM(IF('6. Class A Consumption Data'!K90:L90=\"B\",'6. Class A Consumption Data'!E90:F90))","v":0},null,null,0,{"$f":"IF('6.2 CBR B'!U$18=\"TRUE\",\"\",+H94*$D$26)","v":0},{"$f":"IF('6.2 CBR B'!U$18=\"TRUE\",\"\",+I94/12)","v":0}]
[null,"Customer 63",null,0,{"$f":"SUM(IF('6. Class A Consumption Data'!K91:L91=\"B\",'6. Class A Consumption Data'!E91:F91))","v":0},null,null,0,{"$f":"IF('6.2 CBR B'!U$18=\"TRUE\",\"\",+H95*$D$26)","v":0},{"$f":"IF('6.2 CBR B'!U$18=\"TRUE\",\"\",+I95/12)","v":0}]
[null,"Customer 64",null,0,{"$f":"SUM(IF('6. Class A Consumption Data'!K92:L92=\"B\",'6. Class A Consumption Data'!E92:F92))","v":0},null,null,0,{"$f":"IF('6.2 CBR B'!U$18=\"TRUE\",\"\",+H96*$D$26)","v":0},{"$f":"IF('6.2 CBR B'!U$18=\"TRUE\",\"\",+I96/12)","v":0}]
[null,"Customer 65",null,{"$f":"SUM(E97:G97)","v":0},{"$f":"SUM(IF('6. Class A Consumption Data'!K93:L93=\"B\",'6. Class A Consumption Data'!E93:F93))","v":0},null,null,0,{"$f":"IF('6.2 CBR B'!U$18=\"TRUE\",\"\",+H97*$D$26)","v":0},{"$f":"IF('6.2 CBR B'!U$18=\"TRUE\",\"\",+I97/12)","v":0}]
[null,"Customer 66",null,0,{"$f":"SUM(IF('6. Class A Consumption Data'!K94:L94=\"B\",'6. Class A Consumption Data'!E94:F94))","v":0},null,null,{"$f":"IFERROR(+D98/$D$183,0)","v":0},{"$f":"IF('6.2 CBR B'!U$18=\"TRUE\",\"\",+H98*$D$26)","v":0},{"$f":"IF('6.2 CBR B'!U$18=\"TRUE\",\"\",+I98/12)","v":0}]
[null,"Customer 67",null,0,{"$f":"SUM(IF('6. Class A Consumption Data'!K95:L95=\"B\",'6. Class A Consumption Data'!E95:F95))","v":0},null,null,0,{"$f":"IF('6.2 CBR B'!U$18=\"TRUE\",\"\",+H99*$D$26)","v":0},{"$f":"IF('6.2 CBR B'!U$18=\"TRUE\",\"\",+I99/12)","v":0}]
[null,"Customer 68",null,0,{"$f":"SUM(IF('6. Class A Consumption Data'!K96:L96=\"B\",'6. Class A Consumption Data'!E96:F96))","v":0},null,null,0,{"$f":"IF('6.2 CBR B'!U$18=\"TRUE\",\"\",+H100*$D$26)","v":0},{"$f":"IF('6.2 CBR B'!U$18=\"TRUE\",\"\",+I100/12)","v":0}]
[null,"Customer 69",null,0,{"$f":"SUM(IF('6. Class A Consumption Data'!K97:L97=\"B\",'6. Class A Consumption Data'!E97:F97))","v":0},null,null,0,{"$f":"IF('6.2 CBR B'!U$18=\"TRUE\",\"\",+H101*$D$26)","v":0},{"$f":"IF('6.2 CBR B'!U$18=\"TRUE\",\"\",+I101/12)","v":0}]
[null,"Customer 70",null,0,{"$f":"SUM(IF('6. Class A Consumption Data'!K98:L98=\"B\",'6. Class A Consumption Data'!E98:F98))","v":0},null,null,0,{"$f":"IF('6.2 CBR B'!U$18=\"TRUE\",\"\",+H102*$D$26)","v":0},{"$f":"IF('6.2 CBR B'!U$18=\"TRUE\",\"\",+I102/12)","v":0}]
[null,"Customer 71",null,0,{"$f":"SUM(IF('6. Class A Consumption Data'!K99:L99=\"B\",'6. Class A Consumption Data'!E99:F99))","v":0},null,null,0,{"$f":"IF('6.2 CBR B'!U$18=\"TRUE\",\"\",+H103*$D$26)","v":0},{"$f":"IF('6.2 CBR B'!U$18=\"TRUE\",\"\",+I103/12)","v":0}]
[null,"Customer 72",null,0,{"$f":"SUM(IF('6. Class A Consumption Data'!K100:L100=\"B\",'6. Class A Consumption Data'!E100:F100))","v":0},null,null,0,{"$f":"IF('6.2 CBR B'!U$18=\"TRUE\",\"\",+H104*$D$26)","v":0},{"$f":"IF('6.2 CBR B'!U$18=\"TRUE\",\"\",+I104/12)","v":0}]
[null,"Customer 73",null,0,{"$f":"SUM(IF('6. Class A Consumption Data'!K101:L101=\"B\",'6. Class A Consumption Data'!E101:F101))","v":0},null,null,0,{"$f":"IF('6.2 CBR B'!U$18=\"TRUE\",\"\",+H105*$D$26)","v":0},{"$f":"IF('6.2 CBR B'!U$18=\"TRUE\",\"\",+I105/12)","v":0}]
[null,"Customer 74",null,0,{"$f":"SUM(IF('6. Class A Consumption Data'!K102:L102=\"B\",'6. Class A Consumption Data'!E102:F102))","v":0},null,null,0,{"$f":"IF('6.2 CBR B'!U$18=\"TRUE\",\"\",+H106*$D$26)","v":0},{"$f":"IF('6.2 CBR B'!U$18=\"TRUE\",\"\",+I106/12)","v":0}]
[null,"Customer 75",null,0,{"$f":"SUM(IF('6. Class A Consumption Data'!K103:L103=\"B\",'6. Class A Consumption Data'!E103:F103))","v":0},null,null,0,{"$f":"IF('6.2 CBR B'!U$18=\"TRUE\",\"\",+H107*$D$26)","v":0},{"$f":"IF('6.2 CBR B'!U$18=\"TRUE\",\"\",+I107/12)","v":0}]
[null,"Customer 76",null,0,{"$f":"SUM(IF('6. Class A Consumption Data'!K104:L104=\"B\",'6. Class A Consumption Data'!E104:F104))","v":0},null,null,0,{"$f":"IF('6.2 CBR B'!U$18=\"TRUE\",\"\",+H108*$D$26)","v":0},{"$f":"IF('6.2 CBR B'!U$18=\"TRUE\",\"\",+I108/12)","v":0}]
[null,"Customer 77",null,0,{"$f":"SUM(IF('6. Class A Consumption Data'!K105:L105=\"B\",'6. Class A Consumption Data'!E105:F105))","v":0},null,null,0,{"$f":"IF('6.2 CBR B'!U$18=\"TRUE\",\"\",+H109*$D$26)","v":0},{"$f":"IF('6.2 CBR B'!U$18=\"TRUE\",\"\",+I109/12)","v":0}]
[null,"Customer 78",null,0,{"$f":"SUM(IF('6. Class A Consumption Data'!K106:L106=\"B\",'6. Class A Consumption Data'!E106:F106))","v":0},null,null,0,{"$f":"IF('6.2 CBR B'!U$18=\"TRUE\",\"\",+H110*$D$26)","v":0},{"$f":"IF('6.2 CBR B'!U$18=\"TRUE\",\"\",+I110/12)","v":0}]
[null,"Customer 79",null,0,{"$f":"SUM(IF('6. Class A Consumption Data'!K107:L107=\"B\",'6. Class A Consumption Data'!E107:F107))","v":0},null,null,0,{"$f":"IF('6.2 CBR B'!U$18=\"TRUE\",\"\",+H111*$D$26)","v":0},{"$f":"IF('6.2 CBR B'!U$18=\"TRUE\",\"\",+I111/12)","v":0}]
[null,"Customer 80",null,0,{"$f":"SUM(IF('6. Class A Consumption Data'!K108:L108=\"B\",'6. Class A Consumption Data'!E108:F108))","v":0},null,null,0,{"$f":"IF('6.2 CBR B'!U$18=\"TRUE\",\"\",+H112*$D$26)","v":0},{"$f":"IF('6.2 CBR B'!U$18=\"TRUE\",\"\",+I112/12)","v":0}]
[null,"Customer 81",null,0,{"$f":"SUM(IF('6. Class A Consumption Data'!K109:L109=\"B\",'6. Class A Consumption Data'!E109:F109))","v":0},null,null,0,{"$f":"IF('6.2 CBR B'!U$18=\"TRUE\",\"\",+H113*$D$26)","v":0},{"$f":"IF('6.2 CBR B'!U$18=\"TRUE\",\"\",+I113/12)","v":0}]
[null,"Customer 82",null,0,{"$f":"SUM(IF('6. Class A Consumption Data'!K110:L110=\"B\",'6. Class A Consumption Data'!E110:F110))","v":0},null,null,0,{"$f":"IF('6.2 CBR B'!U$18=\"TRUE\",\"\",+H114*$D$26)","v":0},{"$f":"IF('6.2 CBR B'!U$18=\"TRUE\",\"\",+I114/12)","v":0}]
[null,"Customer 83",null,0,{"$f":"SUM(IF('6. Class A Consumption Data'!K111:L111=\"B\",'6. Class A Consumption Data'!E111:F111))","v":0},null,null,0,{"$f":"IF('6.2 CBR B'!U$18=\"TRUE\",\"\",+H115*$D$26)","v":0},{"$f":"IF('6.2 CBR B'!U$18=\"TRUE\",\"\",+I115/12)","v":0}]
[null,"Customer 84",null,0,{"$f":"SUM(IF('6. Class A Consumption Data'!K112:L112=\"B\",'6. Class A Consumption Data'!E112:F112))","v":0},null,null,0,{"$f":"IF('6.2 CBR B'!U$18=\"TRUE\",\"\",+H116*$D$26)","v":0},{"$f":"IF('6.2 CBR B'!U$18=\"TRUE\",\"\",+I116/12)","v":0}]
[null,"Customer 85",null,0,{"$f":"SUM(IF('6. Class A Consumption Data'!K113:L113=\"B\",'6. Class A Consumption Data'!E113:F113))","v":0},null,null,0,{"$f":"IF('6.2 CBR B'!U$18=\"TRUE\",\"\",+H117*$D$26)","v":0},{"$f":"IF('6.2 CBR B'!U$18=\"TRUE\",\"\",+I117/12)","v":0}]
[null,"Customer 86",null,0,{"$f":"SUM(IF('6. Class A Consumption Data'!K114:L114=\"B\",'6. Class A Consumption Data'!E114:F114))","v":0},null,null,0,{"$f":"IF('6.2 CBR B'!U$18=\"TRUE\",\"\",+H118*$D$26)","v":0},{"$f":"IF('6.2 CBR B'!U$18=\"TRUE\",\"\",+I118/12)","v":0}]
[null,"Customer 87",null,0,{"$f":"SUM(IF('6. Class A Consumption Data'!K115:L115=\"B\",'6. Class A Consumption Data'!E115:F115))","v":0},null,null,0,{"$f":"IF('6.2 CBR B'!U$18=\"TRUE\",\"\",+H119*$D$26)","v":0},{"$f":"IF('6.2 CBR B'!U$18=\"TRUE\",\"\",+I119/12)","v":0}]
[null,"Customer 88",null,0,{"$f":"SUM(IF('6. Class A Consumption Data'!K116:L116=\"B\",'6. Class A Consumption Data'!E116:F116))","v":0},null,null,0,{"$f":"IF('6.2 CBR B'!U$18=\"TRUE\",\"\",+H120*$D$26)","v":0},{"$f":"IF('6.2 CBR B'!U$18=\"TRUE\",\"\",+I120/12)","v":0}]
[null,"Customer 89",null,0,{"$f":"SUM(IF('6. Class A Consumption Data'!K117:L117=\"B\",'6. Class A Consumption Data'!E117:F117))","v":0},null,null,0,{"$f":"IF('6.2 CBR B'!U$18=\"TRUE\",\"\",+H121*$D$26)","v":0},{"$f":"IF('6.2 CBR B'!U$18=\"TRUE\",\"\",+I121/12)","v":0}]
[null,"Customer 90",null,0,{"$f":"SUM(IF('6. Class A Consumption Data'!K118:L118=\"B\",'6. Class A Consumption Data'!E118:F118))","v":0},null,null,0,{"$f":"IF('6.2 CBR B'!U$18=\"TRUE\",\"\",+H122*$D$26)","v":0},{"$f":"IF('6.2 CBR B'!U$18=\"TRUE\",\"\",+I122/12)","v":0}]
[null,"Customer 91",null,0,{"$f":"SUM(IF('6. Class A Consumption Data'!K119:L119=\"B\",'6. Class A Consumption Data'!E119:F119))","v":0},null,null,0,{"$f":"IF('6.2 CBR B'!U$18=\"TRUE\",\"\",+H123*$D$26)","v":0},{"$f":"IF('6.2 CBR B'!U$18=\"TRUE\",\"\",+I123/12)","v":0}]
[null,"Customer 92",null,0,{"$f":"SUM(IF('6. Class A Consumption Data'!K120:L120=\"B\",'6. Class A Consumption Data'!E120:F120))","v":0},null,null,0,{"$f":"IF('6.2 CBR B'!U$18=\"TRUE\",\"\",+H124*$D$26)","v":0},{"$f":"IF('6.2 CBR B'!U$18=\"TRUE\",\"\",+I124/12)","v":0}]
[null,"Customer 93",null,0,{"$f":"SUM(IF('6. Class A Consumption Data'!K121:L121=\"B\",'6. Class A Consumption Data'!E121:F121))","v":0},null,null,0,{"$f":"IF('6.2 CBR B'!U$18=\"TRUE\",\"\",+H125*$D$26)","v":0},{"$f":"IF('6.2 CBR B'!U$18=\"TRUE\",\"\",+I125/12)","v":0}]
[null,"Customer 94",null,0,{"$f":"SUM(IF('6. Class A Consumption Data'!K122:L122=\"B\",'6. Class A Consumption Data'!E122:F122))","v":0},null,null,0,{"$f":"IF('6.2 CBR B'!U$18=\"TRUE\",\"\",+H126*$D$26)","v":0},{"$f":"IF('6.2 CBR B'!U$18=\"TRUE\",\"\",+I126/12)","v":0}]
[null,"Customer 95",null,0,{"$f":"SUM(IF('6. Class A Consumption Data'!K123:L123=\"B\",'6. Class A Consumption Data'!E123:F123))","v":0},null,null,0,{"$f":"IF('6.2 CBR B'!U$18=\"TRUE\",\"\",+H127*$D$26)","v":0},{"$f":"IF('6.2 CBR B'!U$18=\"TRUE\",\"\",+I127/12)","v":0}]
[null,"Customer 96",null,0,{"$f":"SUM(IF('6. Class A Consumption Data'!K124:L124=\"B\",'6. Class A Consumption Data'!E124:F124))","v":0},null,null,0,{"$f":"IF('6.2 CBR B'!U$18=\"TRUE\",\"\",+H128*$D$26)","v":0},{"$f":"IF('6.2 CBR B'!U$18=\"TRUE\",\"\",+I128/12)","v":0}]
[null,"Customer 97",null,0,{"$f":"SUM(IF('6. Class A Consumption Data'!K125:L125=\"B\",'6. Class A Consumption Data'!E125:F125))","v":0},null,null,0,{"$f":"IF('6.2 CBR B'!U$18=\"TRUE\",\"\",+H129*$D$26)","v":0},{"$f":"IF('6.2 CBR B'!U$18=\"TRUE\",\"\",+I129/12)","v":0}]
[null,"Customer 98",null,0,{"$f":"SUM(IF('6. Class A Consumption Data'!K126:L126=\"B\",'6. Class A Consumption Data'!E126:F126))","v":0},null,null,0,{"$f":"IF('6.2 CBR B'!U$18=\"TRUE\",\"\",+H130*$D$26)","v":0},{"$f":"IF('6.2 CBR B'!U$18=\"TRUE\",\"\",+I130/12)","v":0}]
[null,"Customer 99",null,0,{"$f":"SUM(IF('6. Class A Consumption Data'!K127:L127=\"B\",'6. Class A Consumption Data'!E127:F127))","v":0},null,null,0,{"$f":"IF('6.2 CBR B'!U$18=\"TRUE\",\"\",+H131*$D$26)","v":0},{"$f":"IF('6.2 CBR B'!U$18=\"TRUE\",\"\",+I131/12)","v":0}]
[null,"Customer 100",null,0,{"$f":"SUM(IF('6. Class A Consumption Data'!K128:L128=\"B\",'6. Class A Consumption Data'!E128:F128))","v":0},null,null,0,{"$f":"IF('6.2 CBR B'!U$18=\"TRUE\",\"\",+H132*$D$26)","v":0},{"$f":"IF('6.2 CBR B'!U$18=\"TRUE\",\"\",+I132/12)","v":0}]
[null,"Customer 101",null,0,{"$f":"SUM(IF('6. Class A Consumption Data'!K129:L129=\"B\",'6. Class A Consumption Data'!E129:F129))","v":0},null,null,0,{"$f":"IF('6.2 CBR B'!U$18=\"TRUE\",\"\",+H133*$D$26)","v":0},{"$f":"IF('6.2 CBR B'!U$18=\"TRUE\",\"\",+I133/12)","v":0}]
[null,"Customer 102",null,{"$f":"SUM(E134:G134)","v":0},{"$f":"SUM(IF('6. Class A Consumption Data'!K130:L130=\"B\",'6. Class A Consumption Data'!E130:F130))","v":0},null,null,0,{"$f":"IF('6.2 CBR B'!U$18=\"TRUE\",\"\",+H134*$D$26)","v":0},{"$f":"IF('6.2 CBR B'!U$18=\"TRUE\",\"\",+I134/12)","v":0}]
[null,"Customer 103",null,0,{"$f":"SUM(IF('6. Class A Consumption Data'!K131:L131=\"B\",'6. Class A Consumption Data'!E131:F131))","v":0},null,null,0,{"$f":"IF('6.2 CBR B'!U$18=\"TRUE\",\"\",+H135*$D$26)","v":0},{"$f":"IF('6.2 CBR B'!U$18=\"TRUE\",\"\",+I135/12)","v":0}]
[null,"Customer 104",null,0,{"$f":"SUM(IF('6. Class A Consumption Data'!K132:L132=\"B\",'6. Class A Consumption Data'!E132:F132))","v":0},null,null,0,{"$f":"IF('6.2 CBR B'!U$18=\"TRUE\",\"\",+H136*$D$26)","v":0},{"$f":"IF('6.2 CBR B'!U$18=\"TRUE\",\"\",+I136/12)","v":0}]
[null,"Customer 105",null,0,{"$f":"SUM(IF('6. Class A Consumption Data'!K133:L133=\"B\",'6. Class A Consumption Data'!E133:F133))","v":0},null,null,0,{"$f":"IF('6.2 CBR B'!U$18=\"TRUE\",\"\",+H137*$D$26)","v":0},{"$f":"IF('6.2 CBR B'!U$18=\"TRUE\",\"\",+I137/12)","v":0}]
[null,"Customer 106",null,0,{"$f":"SUM(IF('6. Class A Consumption Data'!K134:L134=\"B\",'6. Class A Consumption Data'!E134:F134))","v":0},null,null,0,{"$f":"IF('6.2 CBR B'!U$18=\"TRUE\",\"\",+H138*$D$26)","v":0},{"$f":"IF('6.2 CBR B'!U$18=\"TRUE\",\"\",+I138/12)","v":0}]
[null,"Customer 107",null,0,{"$f":"SUM(IF('6. Class A Consumption Data'!K135:L135=\"B\",'6. Class A Consumption Data'!E135:F135))","v":0},null,null,0,{"$f":"IF('6.2 CBR B'!U$18=\"TRUE\",\"\",+H139*$D$26)","v":0},{"$f":"IF('6.2 CBR B'!U$18=\"TRUE\",\"\",+I139/12)","v":0}]
[null,"Customer 108",null,0,{"$f":"SUM(IF('6. Class A Consumption Data'!K136:L136=\"B\",'6. Class A Consumption Data'!E136:F136))","v":0},null,null,0,{"$f":"IF('6.2 CBR B'!U$18=\"TRUE\",\"\",+H140*$D$26)","v":0},{"$f":"IF('6.2 CBR B'!U$18=\"TRUE\",\"\",+I140/12)","v":0}]
[null,"Customer 109",null,0,{"$f":"SUM(IF('6. Class A Consumption Data'!K137:L137=\"B\",'6. Class A Consumption Data'!E137:F137))","v":0},null,null,0,{"$f":"IF('6.2 CBR B'!U$18=\"TRUE\",\"\",+H141*$D$26)","v":0},{"$f":"IF('6.2 CBR B'!U$18=\"TRUE\",\"\",+I141/12)","v":0}]
[null,"Customer 110",null,0,{"$f":"SUM(IF('6. Class A Consumption Data'!K138:L138=\"B\",'6. Class A Consumption Data'!E138:F138))","v":0},null,null,0,{"$f":"IF('6.2 CBR B'!U$18=\"TRUE\",\"\",+H142*$D$26)","v":0},{"$f":"IF('6.2 CBR B'!U$18=\"TRUE\",\"\",+I142/12)","v":0}]
[null,"Customer 111",null,0,{"$f":"SUM(IF('6. Class A Consumption Data'!K139:L139=\"B\",'6. Class A Consumption Data'!E139:F139))","v":0},null,null,0,{"$f":"IF('6.2 CBR B'!U$18=\"TRUE\",\"\",+H143*$D$26)","v":0},{"$f":"IF('6.2 CBR B'!U$18=\"TRUE\",\"\",+I143/12)","v":0}]
[null,"Customer 112",null,0,{"$f":"SUM(IF('6. Class A Consumption Data'!K140:L140=\"B\",'6. Class A Consumption Data'!E140:F140))","v":0},null,null,0,{"$f":"IF('6.2 CBR B'!U$18=\"TRUE\",\"\",+H144*$D$26)","v":0},{"$f":"IF('6.2 CBR B'!U$18=\"TRUE\",\"\",+I144/12)","v":0}]
[null,"Customer 113",null,0,{"$f":"SUM(IF('6. Class A Consumption Data'!K141:L141=\"B\",'6. Class A Consumption Data'!E141:F141))","v":0},null,null,0,{"$f":"IF('6.2 CBR B'!U$18=\"TRUE\",\"\",+H145*$D$26)","v":0},{"$f":"IF('6.2 CBR B'!U$18=\"TRUE\",\"\",+I145/12)","v":0}]
[null,"Customer 114",null,0,{"$f":"SUM(IF('6. Class A Consumption Data'!K142:L142=\"B\",'6. Class A Consumption Data'!E142:F142))","v":0},null,null,0,{"$f":"IF('6.2 CBR B'!U$18=\"TRUE\",\"\",+H146*$D$26)","v":0},{"$f":"IF('6.2 CBR B'!U$18=\"TRUE\",\"\",+I146/12)","v":0}]
[null,"Customer 115",null,0,{"$f":"SUM(IF('6. Class A Consumption Data'!K143:L143=\"B\",'6. Class A Consumption Data'!E143:F143))","v":0},null,null,0,{"$f":"IF('6.2 CBR B'!U$18=\"TRUE\",\"\",+H147*$D$26)","v":0},{"$f":"IF('6.2 CBR B'!U$18=\"TRUE\",\"\",+I147/12)","v":0}]
[null,"Customer 116",null,0,{"$f":"SUM(IF('6. Class A Consumption Data'!K144:L144=\"B\",'6. Class A Consumption Data'!E144:F144))","v":0},null,null,0,{"$f":"IF('6.2 CBR B'!U$18=\"TRUE\",\"\",+H148*$D$26)","v":0},{"$f":"IF('6.2 CBR B'!U$18=\"TRUE\",\"\",+I148/12)","v":0}]
[null,"Customer 117",null,0,{"$f":"SUM(IF('6. Class A Consumption Data'!K145:L145=\"B\",'6. Class A Consumption Data'!E145:F145))","v":0},null,null,0,{"$f":"IF('6.2 CBR B'!U$18=\"TRUE\",\"\",+H149*$D$26)","v":0},{"$f":"IF('6.2 CBR B'!U$18=\"TRUE\",\"\",+I149/12)","v":0}]
[null,"Customer 118",null,0,{"$f":"SUM(IF('6. Class A Consumption Data'!K146:L146=\"B\",'6. Class A Consumption Data'!E146:F146))","v":0},null,null,0,{"$f":"IF('6.2 CBR B'!U$18=\"TRUE\",\"\",+H150*$D$26)","v":0},{"$f":"IF('6.2 CBR B'!U$18=\"TRUE\",\"\",+I150/12)","v":0}]
[null,"Customer 119",null,0,{"$f":"SUM(IF('6. Class A Consumption Data'!K147:L147=\"B\",'6. Class A Consumption Data'!E147:F147))","v":0},null,null,0,{"$f":"IF('6.2 CBR B'!U$18=\"TRUE\",\"\",+H151*$D$26)","v":0},{"$f":"IF('6.2 CBR B'!U$18=\"TRUE\",\"\",+I151/12)","v":0}]
[null,"Customer 120",null,0,{"$f":"SUM(IF('6. Class A Consumption Data'!K148:L148=\"B\",'6. Class A Consumption Data'!E148:F148))","v":0},null,null,0,{"$f":"IF('6.2 CBR B'!U$18=\"TRUE\",\"\",+H152*$D$26)","v":0},{"$f":"IF('6.2 CBR B'!U$18=\"TRUE\",\"\",+I152/12)","v":0}]
[null,"Customer 121",null,0,{"$f":"SUM(IF('6. Class A Consumption Data'!K149:L149=\"B\",'6. Class A Consumption Data'!E149:F149))","v":0},null,null,0,{"$f":"IF('6.2 CBR B'!U$18=\"TRUE\",\"\",+H153*$D$26)","v":0},{"$f":"IF('6.2 CBR B'!U$18=\"TRUE\",\"\",+I153/12)","v":0}]
[null,"Customer 122",null,0,{"$f":"SUM(IF('6. Class A Consumption Data'!K150:L150=\"B\",'6. Class A Consumption Data'!E150:F150))","v":0},null,null,0,{"$f":"IF('6.2 CBR B'!U$18=\"TRUE\",\"\",+H154*$D$26)","v":0},{"$f":"IF('6.2 CBR B'!U$18=\"TRUE\",\"\",+I154/12)","v":0}]
[null,"Customer 123",null,0,{"$f":"SUM(IF('6. Class A Consumption Data'!K151:L151=\"B\",'6. Class A Consumption Data'!E151:F151))","v":0},null,null,0,{"$f":"IF('6.2 CBR B'!U$18=\"TRUE\",\"\",+H155*$D$26)","v":0},{"$f":"IF('6.2 CBR B'!U$18=\"TRUE\",\"\",+I155/12)","v":0}]
[null,"Customer 124",null,0,{"$f":"SUM(IF('6. Class A Consumption Data'!K152:L152=\"B\",'6. Class A Consumption Data'!E152:F152))","v":0},null,null,0,{"$f":"IF('6.2 CBR B'!U$18=\"TRUE\",\"\",+H156*$D$26)","v":0},{"$f":"IF('6.2 CBR B'!U$18=\"TRUE\",\"\",+I156/12)","v":0}]
[null,"Customer 125",null,0,{"$f":"SUM(IF('6. Class A Consumption Data'!K153:L153=\"B\",'6. Class A Consumption Data'!E153:F153))","v":0},null,null,0,{"$f":"IF('6.2 CBR B'!U$18=\"TRUE\",\"\",+H157*$D$26)","v":0},{"$f":"IF('6.2 CBR B'!U$18=\"TRUE\",\"\",+I157/12)","v":0}]
[null,"Customer 126",null,0,{"$f":"SUM(IF('6. Class A Consumption Data'!K154:L154=\"B\",'6. Class A Consumption Data'!E154:F154))","v":0},null,null,0,{"$f":"IF('6.2 CBR B'!U$18=\"TRUE\",\"\",+H158*$D$26)","v":0},{"$f":"IF('6.2 CBR B'!U$18=\"TRUE\",\"\",+I158/12)","v":0}]
[null,"Customer 127",null,0,{"$f":"SUM(IF('6. Class A Consumption Data'!K155:L155=\"B\",'6. Class A Consumption Data'!E155:F155))","v":0},null,null,0,{"$f":"IF('6.2 CBR B'!U$18=\"TRUE\",\"\",+H159*$D$26)","v":0},{"$f":"IF('6.2 CBR B'!U$18=\"TRUE\",\"\",+I159/12)","v":0}]
[null,"Customer 128",null,0,{"$f":"SUM(IF('6. Class A Consumption Data'!K156:L156=\"B\",'6. Class A Consumption Data'!E156:F156))","v":0},null,null,0,{"$f":"IF('6.2 CBR B'!U$18=\"TRUE\",\"\",+H160*$D$26)","v":0},{"$f":"IF('6.2 CBR B'!U$18=\"TRUE\",\"\",+I160/12)","v":0}]
[null,"Customer 129",null,0,{"$f":"SUM(IF('6. Class A Consumption Data'!K157:L157=\"B\",'6. Class A Consumption Data'!E157:F157))","v":0},null,null,0,{"$f":"IF('6.2 CBR B'!U$18=\"TRUE\",\"\",+H161*$D$26)","v":0},{"$f":"IF('6.2 CBR B'!U$18=\"TRUE\",\"\",+I161/12)","v":0}]
[null,"Customer 130",null,0,{"$f":"SUM(IF('6. Class A Consumption Data'!K158:L158=\"B\",'6. Class A Consumption Data'!E158:F158))","v":0},null,null,{"$f":"IFERROR(+D162/$D$183,0)","v":0},{"$f":"IF('6.2 CBR B'!U$18=\"TRUE\",\"\",+H162*$D$26)","v":0},{"$f":"IF('6.2 CBR B'!U$18=\"TRUE\",\"\",+I162/12)","v":0}]
[null,"Customer 131",null,0,{"$f":"SUM(IF('6. Class A Consumption Data'!K159:L159=\"B\",'6. Class A Consumption Data'!E159:F159))","v":0},null,null,0,{"$f":"IF('6.2 CBR B'!U$18=\"TRUE\",\"\",+H163*$D$26)","v":0},{"$f":"IF('6.2 CBR B'!U$18=\"TRUE\",\"\",+I163/12)","v":0}]
[null,"Customer 132",null,0,{"$f":"SUM(IF('6. Class A Consumption Data'!K160:L160=\"B\",'6. Class A Consumption Data'!E160:F160))","v":0},null,null,0,{"$f":"IF('6.2 CBR B'!U$18=\"TRUE\",\"\",+H164*$D$26)","v":0},{"$f":"IF('6.2 CBR B'!U$18=\"TRUE\",\"\",+I164/12)","v":0}]
[null,"Customer 133",null,0,{"$f":"SUM(IF('6. Class A Consumption Data'!K161:L161=\"B\",'6. Class A Consumption Data'!E161:F161))","v":0},null,null,0,{"$f":"IF('6.2 CBR B'!U$18=\"TRUE\",\"\",+H165*$D$26)","v":0},{"$f":"IF('6.2 CBR B'!U$18=\"TRUE\",\"\",+I165/12)","v":0}]
[null,"Customer 134",null,0,{"$f":"SUM(IF('6. Class A Consumption Data'!K162:L162=\"B\",'6. Class A Consumption Data'!E162:F162))","v":0},null,null,0,{"$f":"IF('6.2 CBR B'!U$18=\"TRUE\",\"\",+H166*$D$26)","v":0},{"$f":"IF('6.2 CBR B'!U$18=\"TRUE\",\"\",+I166/12)","v":0}]
[null,"Customer 135",null,0,{"$f":"SUM(IF('6. Class A Consumption Data'!K163:L163=\"B\",'6. Class A Consumption Data'!E163:F163))","v":0},null,null,0,{"$f":"IF('6.2 CBR B'!U$18=\"TRUE\",\"\",+H167*$D$26)","v":0},{"$f":"IF('6.2 CBR B'!U$18=\"TRUE\",\"\",+I167/12)","v":0}]
[null,"Customer 136",null,0,{"$f":"SUM(IF('6. Class A Consumption Data'!K164:L164=\"B\",'6. Class A Consumption Data'!E164:F164))","v":0},null,null,0,{"$f":"IF('6.2 CBR B'!U$18=\"TRUE\",\"\",+H168*$D$26)","v":0},{"$f":"IF('6.2 CBR B'!U$18=\"TRUE\",\"\",+I168/12)","v":0}]
[null,"Customer 137",null,0,{"$f":"SUM(IF('6. Class A Consumption Data'!K165:L165=\"B\",'6. Class A Consumption Data'!E165:F165))","v":0},null,null,0,{"$f":"IF('6.2 CBR B'!U$18=\"TRUE\",\"\",+H169*$D$26)","v":0},{"$f":"IF('6.2 CBR B'!U$18=\"TRUE\",\"\",+I169/12)","v":0}]
[null,"Customer 138",null,0,{"$f":"SUM(IF('6. Class A Consumption Data'!K166:L166=\"B\",'6. Class A Consumption Data'!E166:F166))","v":0},null,null,0,{"$f":"IF('6.2 CBR B'!U$18=\"TRUE\",\"\",+H170*$D$26)","v":0},{"$f":"IF('6.2 CBR B'!U$18=\"TRUE\",\"\",+I170/12)","v":0}]
[null,"Customer 139",null,0,{"$f":"SUM(IF('6. Class A Consumption Data'!K167:L167=\"B\",'6. Class A Consumption Data'!E167:F167))","v":0},null,null,0,{"$f":"IF('6.2 CBR B'!U$18=\"TRUE\",\"\",+H171*$D$26)","v":0},{"$f":"IF('6.2 CBR B'!U$18=\"TRUE\",\"\",+I171/12)","v":0}]
[null,"Customer 140",null,0,{"$f":"SUM(IF('6. Class A Consumption Data'!K168:L168=\"B\",'6. Class A Consumption Data'!E168:F168))","v":0},null,null,0,{"$f":"IF('6.2 CBR B'!U$18=\"TRUE\",\"\",+H172*$D$26)","v":0},{"$f":"IF('6.2 CBR B'!U$18=\"TRUE\",\"\",+I172/12)","v":0}]
[null,"Customer 141",null,0,{"$f":"SUM(IF('6. Class A Consumption Data'!K169:L169=\"B\",'6. Class A Consumption Data'!E169:F169))","v":0},null,null,0,{"$f":"IF('6.2 CBR B'!U$18=\"TRUE\",\"\",+H173*$D$26)","v":0},{"$f":"IF('6.2 CBR B'!U$18=\"TRUE\",\"\",+I173/12)","v":0}]
[null,"Customer 142",null,0,{"$f":"SUM(IF('6. Class A Consumption Data'!K170:L170=\"B\",'6. Class A Consumption Data'!E170:F170))","v":0},null,null,0,{"$f":"IF('6.2 CBR B'!U$18=\"TRUE\",\"\",+H174*$D$26)","v":0},{"$f":"IF('6.2 CBR B'!U$18=\"TRUE\",\"\",+I174/12)","v":0}]
[null,"Customer 143",null,0,{"$f":"SUM(IF('6. Class A Consumption Data'!K171:L171=\"B\",'6. Class A Consumption Data'!E171:F171))","v":0},null,null,0,{"$f":"IF('6.2 CBR B'!U$18=\"TRUE\",\"\",+H175*$D$26)","v":0},{"$f":"IF('6.2 CBR B'!U$18=\"TRUE\",\"\",+I175/12)","v":0}]
[null,"Customer 144",null,0,{"$f":"SUM(IF('6. Class A Consumption Data'!K172:L172=\"B\",'6. Class A Consumption Data'!E172:F172))","v":0},null,null,0,{"$f":"IF('6.2 CBR B'!U$18=\"TRUE\",\"\",+H176*$D$26)","v":0},{"$f":"IF('6.2 CBR B'!U$18=\"TRUE\",\"\",+I176/12)","v":0}]
[null,"Customer 145",null,0,{"$f":"SUM(IF('6. Class A Consumption Data'!K173:L173=\"B\",'6. Class A Consumption Data'!E173:F173))","v":0},null,null,0,{"$f":"IF('6.2 CBR B'!U$18=\"TRUE\",\"\",+H177*$D$26)","v":0},{"$f":"IF('6.2 CBR B'!U$18=\"TRUE\",\"\",+I177/12)","v":0}]
[null,"Customer 146",null,0,{"$f":"SUM(IF('6. Class A Consumption Data'!K174:L174=\"B\",'6. Class A Consumption Data'!E174:F174))","v":0},null,null,0,{"$f":"IF('6.2 CBR B'!U$18=\"TRUE\",\"\",+H178*$D$26)","v":0},{"$f":"IF('6.2 CBR B'!U$18=\"TRUE\",\"\",+I178/12)","v":0}]
[null,"Customer 147",null,0,{"$f":"SUM(IF('6. Class A Consumption Data'!K175:L175=\"B\",'6. Class A Consumption Data'!E175:F175))","v":0},null,null,0,{"$f":"IF('6.2 CBR B'!U$18=\"TRUE\",\"\",+H179*$D$26)","v":0},{"$f":"IF('6.2 CBR B'!U$18=\"TRUE\",\"\",+I179/12)","v":0}]
[null,"Customer 148",null,0,{"$f":"SUM(IF('6. Class A Consumption Data'!K176:L176=\"B\",'6. Class A Consumption Data'!E176:F176))","v":0},null,null,0,{"$f":"IF('6.2 CBR B'!U$18=\"TRUE\",\"\",+H180*$D$26)","v":0},{"$f":"IF('6.2 CBR B'!U$18=\"TRUE\",\"\",+I180/12)","v":0}]
[null,"Customer 149",null,0,{"$f":"SUM(IF('6. Class A Consumption Data'!K177:L177=\"B\",'6. Class A Consumption Data'!E177:F177))","v":0},null,null,0,{"$f":"IF('6.2 CBR B'!U$18=\"TRUE\",\"\",+H181*$D$26)","v":0},{"$f":"IF('6.2 CBR B'!U$18=\"TRUE\",\"\",+I181/12)","v":0}]
[null,"Customer 150",null,0,{"$f":"SUM(IF('6. Class A Consumption Data'!K178:L178=\"B\",'6. Class A Consumption Data'!E178:F178))","v":0},null,null,0,{"$f":"IF('6.2 CBR B'!U$18=\"TRUE\",\"\",+H182*$D$26)","v":0},{"$f":"IF('6.2 CBR B'!U$18=\"TRUE\",\"\",+I182/12)","v":0}]
[null,"Total for all Customers",null,{"$f":"SUM(D33:D182)","v":159809662},{"$f":"SUM(E33:E182)","v":159809662},0,0,{"$f":"SUM(H33:H182)","v":1},{"$f":"SUM(I33:I182)","v":-15676.125886838745}]

{"sheet":"6.2 CBR B","index":11,"n_rows":36,"n_cols":22,"rows_kept":36,"cut":false,"hidden":false,"merged":[[10,10,14,12],[1,1,8,6],[18,2,18,3],[18,4,18,5],[18,6,18,7],[18,8,18,9],[12,1,12,6],[14,3,14,7]]}
["Back to Index"]
[null,{"$f":"+'1. Information Sheet'!B2","v":"INCENTIVE REGULATION MODEL FOR 2020 FILERS"}]
[]
[]
[]
[]
[]
[]
[]
[]
[null,null,null,null,null,null,null,null,null,null,"If the allocated Account 1580 sub-account CBR Class B amount does not produce a rate rider in one or more rate class (except for the Standby rate class), a distributor is to transfer the entire OEB-approved CBR Class B amount into Account 1580 WMS control account to be disposed through the general purpose Group 1 DVA rate riders. (see Accounting Guidance, Capacity Based Recovery xxxxx, 2018)"]
[]
[null,"The purpose of this tab is to calculate the CBR rate riders for all current Class B customers who did not transition between Class A and B in the period since the Account 1580, sub-account CBR Class B balance accumulated.\n"]
[]
[null,"Please select the Year the Account 1580 CBR Class B was Last Disposed.",2017,"(Note: Account 1580, Sub-account CBR Class B was established starting in 2015)"]
[]
[]
[null,null,null,null,null,null,null,null,null,null,null,null,null,null,null,null,null,null,null,null,false]
[null,null,"Total Metered Minus WMP",null,"Total Metered 2018 Consumption for Class A customers that were Class A for the entire period CBR Class B balance accumulated",null,"Total Metered 2018 Consumption for Customers that Transitioned Between Class A and B during the period CBR Class B balance accumulated",null,"Metered Consumption for Current Class B Customers (Total Consumption LESS WMP, Class A and Transition Customers' Consumption)",null,"% of total kWh","Total CBR $ allocated to Current Class B Customers","CBR Rate Rider",null,"Revenue Reconciliation","Variance",null,null,null,null,"CBR Rate Rider"]
[null,null,"kWh","kW","kWh","kW","kWh","kW","kWh","kW"]
[]
["R_CBR20",{"$f":"'4. Billing Det. for Def-Var'!B17","v":"RESIDENTIAL SERVICE CLASSIFICATION"},{"$f":"'4. Billing Det. for Def-Var'!D17-'4. Billing Det. for Def-Var'!H17","v":1490532667.2805483},{"$f":"'4. Billing Det. for Def-Var'!E17-'4. Billing Det. for Def-Var'!I17","v":0},{"$f":"SUM(IF('6. Class A Consumption Data'!$D$191:$D$340=$B22,'6. Class A Consumption Data'!E$191:E$340))","v":0},{"$f":"SUM(IF('6. Class A Consumption Data'!$D$191:$D$340=$B22,'6. Class A Consumption Data'!H$191:H$340))","v":0},{"$f":"SUM(IF('6. Class A Consumption Data'!$D$29:$D$178=$B22,'6. Class A Consumption Data'!E$29:F$178))","v":0},{"$f":"SUM(IF('6. Class A Consumption Data'!$D$29:$D$178=$B22,'6. Class A Consumption Data'!H$29:I$178))","v":0},{"$f":"ROUND(C22-E22-G22,0)","v":1490532667},{"$f":"ROUND(D22-F22-H22,0)","v":0},{"$f":"IFERROR(I22/I$34,\"\")","v":0.28512415264769081},{"$f":"IFERROR(L$34*K22,\"\")","v":-146210.04410959358},{"$f":"IF(U$18=\"TRUE\",0,U22)","v":-9.8092478847760524E-5},"kwh",{"$f":"IFERROR(IF(J22=0,ROUND(M22,4)*I22,ROUND(M22,4)*J22),\"\")","v":-149053.26670000001},{"$f":"L22-O22","v":2843.2225904064253},null,null,null,null,{"$f":"IFERROR(IF($J22=0,$L22/$I22,$L22/$J22),0)","v":-9.8092478847760524E-5},"kwh"]
["GSL_CBR20",{"$f":"'4. Billing Det. for Def-Var'!B18","v":"GENERAL SERVICE LESS THAN 50 kW SERVICE CLASSIFICATION"},{"$f":"'4. Billing Det. for Def-Var'!D18-'4. Billing Det. for Def-Var'!H18","v":685616683.99168408},{"$f":"'4. Billing Det. for Def-Var'!E18-'4. Billing Det. for Def-Var'!I18","v":0},{"$f":"SUM(IF('6. Class A Consumption Data'!$D$191:$D$340=$B23,'6. Class A Consumption Data'!E$191:E$340))","v":0},{"$f":"SUM(IF('6. Class A Consumption Data'!$D$191:$D$340=$B23,'6. Class A Consumption Data'!H$191:H$340))","v":0},{"$f":"SUM(IF('6. Class A Consumption Data'!$D$29:$D$178=$B23,'6. Class A Consumption Data'!E$29:F$178))","v":0},{"$f":"SUM(IF('6. Class A Consumption Data'!$D$29:$D$178=$B23,'6. Class A Consumption Data'!H$29:I$178))","v":0},{"$f":"ROUND(C23-E23-G23,0)","v":685616684},0,{"$f":"IFERROR(I23/I$34,\"\")","v":0.13115168851688078},{"$f":"IFERROR(L$34*K23,\"\")","v":-67253.840072941704},{"$f":"IF(U$18=\"TRUE\",0,U23)","v":-9.8092478847760511E-5},"kwh",{"$f":"IFERROR(IF(J23=0,ROUND(M23,4)*I23,ROUND(M23,4)*J23),\"\")","v":-68561.66840000001},{"$f":"L23-O23","v":1307.8283270583051},null,null,null,null,-9.8092478847760511E-5,"kwh"]
["GS50_499_CBR20",{"$f":"'4. Billing Det. for Def-Var'!B19","v":"GENERAL SERVICE 50 to 499 kW SERVICE CLASSIFICATION"},{"$f":"'4. Billing Det. for Def-Var'!D19-'4. Billing Det. for Def-Var'!H19","v":2050085761.3107622},{"$f":"'4. Billing Det. for Def-Var'!E19-'4. Billing Det. for Def-Var'!I19","v":5706048.8485022373},{"$f":"SUM(IF('6. Class A Consumption Data'!$D$191:$D$340=$B24,'6. Class A Consumption Data'!E$191:E$340))","v":0},{"$f":"SUM(IF('6. Class A Consumption Data'!$D$191:$D$340=$B24,'6. Class A Consumption Data'!H$191:H$340))","v":0},{"$f":"SUM(IF('6. Class A Consumption Data'!$D$29:$D$178=$B24,'6. Class A Consumption Data'!E$29:F$178))","v":0},{"$f":"SUM(IF('6. Class A Consumption Data'!$D$29:$D$178=$B24,'6. Class A Consumption Data'!H$29:I$178))","v":0},2050085761,5706049,0.39216112360469413,-201097.99414698753,-3.5242949043547918E-2,"kW",-200852.92480000001,-245.06934698752593,null,null,null,null,-3.5242949043547918E-2,"kW"]
["GS500_CBR20",{"$f":"'4. Billing Det. for Def-Var'!B20","v":"GENERAL SERVICE 500 to 4,999 kW SERVICE CLASSIFICATION"},{"$f":"'4. Billing Det. for Def-Var'!D20-'4. Billing Det. for Def-Var'!H20","v":2023761303.894465},{"$f":"'4. Billing Det. for Def-Var'!E20-'4. Billing Det. for Def-Var'!I20","v":4557827.4650871158},{"$f":"SUM(IF('6. Class A Consumption Data'!$D$191:$D$340=$B25,'6. Class A Consumption Data'!E$191:E$340))","v":833612345},{"$f":"SUM(IF('6. Class A Consumption Data'!$D$191:$D$340=$B25,'6. Class A Consumption Data'!H$191:H$340))","v":1724837},{"$f":"SUM(IF('6. Class A Consumption Data'!$D$29:$D$178=$B25,'6. Class A Consumption Data'!E$29:F$178))","v":213449766},{"$f":"SUM(IF('6. Class A Consumption Data'!$D$29:$D$178=$B25,'6. Class A Consumption Data'!H$29:I$178))","v":483462.04582519998},976699193,2349528,0.1868328926707169,-95806.844929977262,-4.0777060298909935E-2,"kW",-95860.742400000003,null,null,null,null,null,-4.0777060298909935E-2,"kW"]
["LU_CBR20",{"$f":"'4. Billing Det. for Def-Var'!B21","v":"LARGE USE SERVICE CLASSIFICATION"},{"$f":"'4. Billing Det. for Def-Var'!D21-'4. Billing Det. for Def-Var'!H21","v":977049362},{"$f":"'4. Billing Det. for Def-Var'!E21-'4. Billing Det. for Def-Var'!I21","v":1753163},{"$f":"SUM(IF('6. Class A Consumption Data'!$D$191:$D$340=$B26,'6. Class A Consumption Data'!E$191:E$340))","v":861902317},{"$f":"SUM(IF('6. Class A Consumption Data'!$D$191:$D$340=$B26,'6. Class A Consumption Data'!H$191:H$340))","v":1509840},{"$f":"SUM(IF('6. Class A Consumption Data'!$D$29:$D$178=$B26,'6. Class A Consumption Data'!E$29:F$178))","v":115147045},{"$f":"SUM(IF('6. Class A Consumption Data'!$D$29:$D$178=$B26,'6. Class A Consumption Data'!H$29:I$178))","v":243323},0,0,0,0,0,"kW",0,0,null,null,null,null,0,"kW"]
[null,{"$f":"'4. Billing Det. for Def-Var'!B22","v":"STANDBY POWER SERVICE CLASSIFICATION "},{"$f":"'4. Billing Det. for Def-Var'!D22-'4. Billing Det. for Def-Var'!H22","v":0},{"$f":"'4. Billing Det. for Def-Var'!E22-'4. Billing Det. for Def-Var'!I22","v":0},{"$f":"SUM(IF('6. Class A Consumption Data'!$D$191:$D$340=$B27,'6. Class A Consumption Data'!E$191:E$340))","v":0},{"$f":"SUM(IF('6. Class A Consumption Data'!$D$191:$D$340=$B27,'6. Class A Consumption Data'!H$191:H$340))","v":0},{"$f":"SUM(IF('6. Class A Consumption Data'!$D$29:$D$178=$B27,'6. Class A Consumption Data'!E$29:F$178))","v":0},{"$f":"SUM(IF('6. Class A Consumption Data'!$D$29:$D$178=$B27,'6. Class A Consumption Data'!H$29:I$178))","v":0},0,0,0,0,0,"kW",0,null,null,null,null,null,0,"kW"]
["USL_CBR20",{"$f":"'4. Billing Det. for Def-Var'!B23","v":"UNMETERED SCATTERED LOAD SERVICE CLASSIFICATION"},{"$f":"'4. Billing Det. for Def-Var'!D23-'4. Billing Det. for Def-Var'!H23","v":11437642.31264231},{"$f":"'4. Billing Det. for Def-Var'!E23-'4. Billing Det. for Def-Var'!I23","v":0},{"$f":"SUM(IF('6. Class A Consumption Data'!$D$191:$D$340=$B28,'6. Class A Consumption Data'!E$191:E$340))","v":0},{"$f":"SUM(IF('6. Class A Consumption Data'!$D$191:$D$340=$B28,'6. Class A Consumption Data'!H$191:H$340))","v":0},{"$f":"SUM(IF('6. Class A Consumption Data'!$D$29:$D$178=$B28,'6. Class A Consumption Data'!E$29:F$178))","v":0},{"$f":"SUM(IF('6. Class A Consumption Data'!$D$29:$D$178=$B28,'6. Class A Consumption Data'!H$29:I$178))","v":0},11437642,0,2.1879077565615272E-3,-1121.9466559532575,-9.8092478847760538E-5,"kwh",-1143.7642000000001,21.817544046742569,null,null,null,null,-9.8092478847760538E-5,"kwh"]
["SL_CBR20",{"$f":"'4. Billing Det. for Def-Var'!B24","v":"STREET LIGHTING SERVICE CLASSIFICATION"},{"$f":"'4. Billing Det. for Def-Var'!D24-'4. Billing Det. for Def-Var'!H24","v":13289944.06494407},{"$f":"'4. Billing Det. for Def-Var'!E24-'4. Billing Det. for Def-Var'!I24","v":40571.730013897963},{"$f":"SUM(IF('6. Class A Consumption Data'!$D$191:$D$340=$B29,'6. Class A Consumption Data'!E$191:E$340))","v":0},{"$f":"SUM(IF('6. Class A Consumption Data'!$D$191:$D$340=$B29,'6. Class A Consumption Data'!H$191:H$340))","v":0},{"$f":"SUM(IF('6. Class A Consumption Data'!$D$29:$D$178=$B29,'6. Class A Consumption Data'!E$29:F$178))","v":0},{"$f":"SUM(IF('6. Class A Consumption Data'!$D$29:$D$178=$B29,'6. Class A Consumption Data'!H$29:I$178))","v":0},13289944,40572,2.5422348034558457E-3,-1303.6435507079218,-3.2131606790592571E-2,"kW",-1302.3611999999998,-1.282350707921978,null,null,null,null,-3.2131606790592571E-2,"kW"]
[]
[]
[]
[]
[null,null,{"$f":"SUM(C22:C33)","v":7251773364.8550453},{"$f":"SUM(D22:D33)","v":12057611.043603251},1695514662,3234677,328596811,726785.04582519992,5227661891,8096149,1,{"$f":"'6.2a CBR B_Allocation'!D27","v":-512794.31346616126},null,null,{"$f":"SUM(O22:O33)","v":-516774.72769999999},{"$f":"SUM(P22:P33)","v":3926.5167638160251}]
[null,null,null,null,null,null,null,null,null,null,null,"from Sheet 6.2a"]
[null,null,null,null,null,null,null,null,null,null,null,null,null,null,"NOTE: if rate rider is at 5 decimal places, then the balance dispostion is in full"]

{"sheet":"8. Calculation of Def-Var RR","index":12,"n_rows":33,"n_cols":15,"rows_kept":33,"cut":false,"hidden":false,"merged":[[1,1,8,7],[16,10,17,10],[16,11,17,11],[17,12,17,13],[12,1,12,2],[13,1,13,2],[16,3,17,3],[16,4,17,4],[16,5,17,5],[16,6,17,6],[16,7,17,7],[16,8,17,8],[16,9,17,9],[14,1,14,2],[10,1,10,7]]}
["Back to Index"]
[null,{"$f":"+'1. Information Sheet'!B2","v":"INCENTIVE REGULATION MODEL FOR 2020 FILERS"}]
[]
[]
[]
[]
[]
[]
[]
[]
[null,"IInput required at cells D14 and D15.  This workshseet calculates rate riders related to the Deferral/Variance Account Disposition (if applicable) and rate riders for Account 1568.  Rate Riders will not be generated for the microFIT class."]
[]
[null,"Default Rate Rider Recovery Period (in months)",null,12]
[null,"DVA Proposed Rate Rider Recovery Period (in months)",null,12,{"$f":"IF(D14>0, \"Rate Rider Recovery to be used below\", \"If no rate rider recovery period is proposed then the default recovery period of 12 months will be used\")","v":"Rate Rider Recovery to be used below"}]
[null,"LRAM Proposed Rate Rider Recovery Period (in months)",null,12,{"$f":"IF(D15>0, \"Rate Rider Recovery to be used below\", \"If no rate rider recovery period is proposed then the default recovery period of 12 months will be used\")","v":"Rate Rider Recovery to be used below"}]
[]
[null,null,null,"Total Metered kWh","Metered kW \nor kVA","Total Metered kWh less WMP consumption ","Total Metered kW less WMP consumption ","Allocation of Group 1 Account Balances to All Classes 2","Allocation of Group 1 Account Balances to Non-WMP Classes Only \n(if Applicable) 2","Deferral/Variance Account Rate Rider 2","Deferral/Variance Account Rate Rider for Non-WMP \n(if applicable) 2","Account 1568 Rate Rider"]
[null,"Rate Class","Unit",null,null,null,null,null,null,null,null,null,"Revenue Reconciliation:",null,"Revenue\n Reconcilation 1"]
[null,{"$f":"'4. Billing Det. for Def-Var'!B17","v":"RESIDENTIAL SERVICE CLASSIFICATION"},{"$f":"'4. Billing Det. for Def-Var'!C17","v":"kWh"},{"$f":"'4. Billing Det. for Def-Var'!D17","v":1490532667.2805483},{"$f":"'4. Billing Det. for Def-Var'!E17","v":0},{"$f":"'4. Billing Det. for Def-Var'!J17","v":1490532667.2805483},{"$f":"'4. Billing Det. for Def-Var'!K17","v":0},{"$f":"IFERROR(SUM('5. Allocating Def-Var Balances'!G16:Y16)-I19,\"\")","v":342477.83403521514},null,{"$f":"ROUND(IF(C19=\"kWh\",IF(ISERROR(H19/D19),0,IF(OR(ISBLANK(D$14), OR(D$14=0, D$14=\"\")), H19/D19/(D$13/12), H19/D19/(D$14/12))),IF(ISERROR(H19/E19),0,IF(OR(ISBLANK(D$14), OR(D$14=0, D$14=\"\")), H19/E19/(D$13/12), H19/E19/(D$14/12)))),4)","v":2.0000000000000001E-4},{"$f":"ROUND(IF(C19=\"kWh\",IF(ISERROR(I19/F19),0,IF(OR(ISBLANK(D$14), OR(D$14=0, D$14=\"\")), I19/F19/(D$13/12), I19/F19/(D$14/12))),IF(ISERROR(I19/G19),0,IF(OR(ISBLANK(D$14), OR(D$14=0, D$14=\"\")), I19/G19/(D$13/12), I19/G19/(D$14/12)))),4)","v":0},{"$f":"IF(C19=\"kWh\",ROUND(IF(ISERROR('4. Billing Det. for Def-Var'!W17/D19), 0, IF(OR(ISBLANK(D$15), OR(D$15=0, D$15=\"\")), ('4. Billing Det. for Def-Var'!W17/D19)/(D$13/12), ('4. Billing Det. for Def-Var'!W17/D19)/(D$15/12))),4),ROUND(IF(ISERROR('4. Billing Det. for Def-Var'!W17/E19), 0, IF(OR(ISBLANK(D$15), OR(D$15=0, D$15=\"\")), ('4. Billing Det. for Def-Var'!W17/E19)/(D$13/12), ('4. Billing Det. for Def-Var'!W17/E19)/(D$15/12))),4))","v":2.9999999999999997E-4},{"$f":"IF(C19=\"kWh\",J19*D19,E19*J19)","v":298106.5334561097},{"$f":"IF(C19=\"kWh\",K19*F19,G19*K19)","v":0}]
[null,{"$f":"'4. Billing Det. for Def-Var'!B18","v":"GENERAL SERVICE LESS THAN 50 kW SERVICE CLASSIFICATION"},{"$f":"'4. Billing Det. for Def-Var'!C18","v":"kWh"},{"$f":"'4. Billing Det. for Def-Var'!D18","v":685616683.99168408},{"$f":"'4. Billing Det. for Def-Var'!E18","v":0},{"$f":"'4. Billing Det. for Def-Var'!J18","v":685616683.99168408},{"$f":"'4. Billing Det. for Def-Var'!K18","v":0},{"$f":"IFERROR(SUM('5. Allocating Def-Var Balances'!G17:Y17)-I20,\"\")","v":206225.84469279484},null,{"$f":"ROUND(IF(C20=\"kWh\",IF(ISERROR(H20/D20),0,IF(OR(ISBLANK(D$14), OR(D$14=0, D$14=\"\")), H20/D20/(D$13/12), H20/D20/(D$14/12))),IF(ISERROR(H20/E20),0,IF(OR(ISBLANK(D$14), OR(D$14=0, D$14=\"\")), H20/E20/(D$13/12), H20/E20/(D$14/12)))),4)","v":2.9999999999999997E-4},{"$f":"ROUND(IF(C20=\"kWh\",IF(ISERROR(I20/F20),0,IF(OR(ISBLANK(D$14), OR(D$14=0, D$14=\"\")), I20/F20/(D$13/12), I20/F20/(D$14/12))),IF(ISERROR(I20/G20),0,IF(OR(ISBLANK(D$14), OR(D$14=0, D$14=\"\")), I20/G20/(D$13/12), I20/G20/(D$14/12)))),4)","v":0},{"$f":"IF(C20=\"kWh\",ROUND(IF(ISERROR('4. Billing Det. for Def-Var'!W18/D20), 0, IF(OR(ISBLANK(D$15), OR(D$15=0, D$15=\"\")), ('4. Billing Det. for Def-Var'!W18/D20)/(D$13/12), ('4. Billing Det. for Def-Var'!W18/D20)/(D$15/12))),4),ROUND(IF(ISERROR('4. Billing Det. for Def-Var'!W18/E20), 0, IF(OR(ISBLANK(D$15), OR(D$15=0, D$15=\"\")), ('4. Billing Det. for Def-Var'!W18/E20)/(D$13/12), ('4. Billing Det. for Def-Var'!W18/E20)/(D$15/12))),4))","v":1E-4},{"$f":"IF(C20=\"kWh\",J20*D20,E20*J20)","v":205685.0051975052},{"$f":"IF(C20=\"kWh\",K20*F20,G20*K20)","v":0}]
[null,{"$f":"'4. Billing Det. for Def-Var'!B19","v":"GENERAL SERVICE 50 to 499 kW SERVICE CLASSIFICATION"},{"$f":"'4. Billing Det. for Def-Var'!C19","v":"kW"},{"$f":"'4. Billing Det. for Def-Var'!D19","v":2051428808.3748548},{"$f":"'4. Billing Det. for Def-Var'!E19","v":5710412.0095022377},{"$f":"'4. Billing Det. for Def-Var'!J19","v":2050085761.3107622},{"$f":"'4. Billing Det. for Def-Var'!K19","v":5706048.8485022373},{"$f":"IFERROR(SUM('5. Allocating Def-Var Balances'!G18:Y18)-I21,\"\")","v":1884678.9415154813},{"$f":"IFERROR('5. Allocating Def-Var Balances'!I18+'5. Allocating Def-Var Balances'!N18,0)","v":-1227696.8987824304},0.33,-0.2152,{"$f":"IF(C21=\"kWh\",ROUND(IF(ISERROR('4. Billing Det. for Def-Var'!W19/D21), 0, IF(OR(ISBLANK(D$15), OR(D$15=0, D$15=\"\")), ('4. Billing Det. for Def-Var'!W19/D21)/(D$13/12), ('4. Billing Det. for Def-Var'!W19/D21)/(D$15/12))),4),ROUND(IF(ISERROR('4. Billing Det. for Def-Var'!W19/E21), 0, IF(OR(ISBLANK(D$15), OR(D$15=0, D$15=\"\")), ('4. Billing Det. for Def-Var'!W19/E21)/(D$13/12), ('4. Billing Det. for Def-Var'!W19/E21)/(D$15/12))),4))","v":0.2379},1884435.9631357386,{"$f":"IF(C21=\"kWh\",K21*F21,G21*K21)","v":-1227941.7121976814}]
[null,{"$f":"'4. Billing Det. for Def-Var'!B20","v":"GENERAL SERVICE 500 to 4,999 kW SERVICE CLASSIFICATION"},{"$f":"'4. Billing Det. for Def-Var'!C20","v":"kW"},{"$f":"'4. Billing Det. for Def-Var'!D20","v":2037760513.1273},{"$f":"'4. Billing Det. for Def-Var'!E20","v":4585777.2030871157},{"$f":"'4. Billing Det. for Def-Var'!J20","v":2023761303.894465},{"$f":"'4. Billing Det. for Def-Var'!K20","v":4557827.4650871158},{"$f":"IFERROR(SUM('5. Allocating Def-Var Balances'!G19:Y19)-I22,\"\")","v":1873058.9091926212},{"$f":"IFERROR('5. Allocating Def-Var Balances'!I19+'5. Allocating Def-Var Balances'!N19,0)","v":-1211932.4584150894},0.40839999999999999,-0.26590000000000003,{"$f":"IF(C22=\"kWh\",ROUND(IF(ISERROR('4. Billing Det. for Def-Var'!W20/D22), 0, IF(OR(ISBLANK(D$15), OR(D$15=0, D$15=\"\")), ('4. Billing Det. for Def-Var'!W20/D22)/(D$13/12), ('4. Billing Det. for Def-Var'!W20/D22)/(D$15/12))),4),ROUND(IF(ISERROR('4. Billing Det. for Def-Var'!W20/E22), 0, IF(OR(ISBLANK(D$15), OR(D$15=0, D$15=\"\")), ('4. Billing Det. for Def-Var'!W20/E22)/(D$13/12), ('4. Billing Det. for Def-Var'!W20/E22)/(D$15/12))),4))","v":0.1033},1872831.4097407779,-1211926.3229666641]
[null,{"$f":"'4. Billing Det. for Def-Var'!B21","v":"LARGE USE SERVICE CLASSIFICATION"},{"$f":"'4. Billing Det. for Def-Var'!C21","v":"kW"},{"$f":"'4. Billing Det. for Def-Var'!D21","v":977049362},{"$f":"'4. Billing Det. for Def-Var'!E21","v":1753163},{"$f":"'4. Billing Det. for Def-Var'!J21","v":977049362},{"$f":"'4. Billing Det. for Def-Var'!K21","v":1753163},{"$f":"IFERROR(SUM('5. Allocating Def-Var Balances'!G20:Y20)-I23,\"\")","v":313220.90713658906},null,0.1787,0,{"$f":"IF(C23=\"kWh\",ROUND(IF(ISERROR('4. Billing Det. for Def-Var'!W21/D23), 0, IF(OR(ISBLANK(D$15), OR(D$15=0, D$15=\"\")), ('4. Billing Det. for Def-Var'!W21/D23)/(D$13/12), ('4. Billing Det. for Def-Var'!W21/D23)/(D$15/12))),4),ROUND(IF(ISERROR('4. Billing Det. for Def-Var'!W21/E23), 0, IF(OR(ISBLANK(D$15), OR(D$15=0, D$15=\"\")), ('4. Billing Det. for Def-Var'!W21/E23)/(D$13/12), ('4. Billing Det. for Def-Var'!W21/E23)/(D$15/12))),4))","v":9.2999999999999999E-2},313290.22810000001,0]
[null,{"$f":"'4. Billing Det. for Def-Var'!B22","v":"STANDBY POWER SERVICE CLASSIFICATION "},{"$f":"'4. Billing Det. for Def-Var'!C22","v":"kW"},{"$f":"'4. Billing Det. for Def-Var'!D22","v":0},{"$f":"'4. Billing Det. for Def-Var'!E22","v":0},{"$f":"'4. Billing Det. for Def-Var'!J22","v":0},{"$f":"'4. Billing Det. for Def-Var'!K22","v":0},{"$f":"IFERROR(SUM('5. Allocating Def-Var Balances'!G21:Y21)-I24,\"\")","v":0},null,0,0,{"$f":"IF(C24=\"kWh\",ROUND(IF(ISERROR('4. Billing Det. for Def-Var'!W22/D24), 0, IF(OR(ISBLANK(D$15), OR(D$15=0, D$15=\"\")), ('4. Billing Det. for Def-Var'!W22/D24)/(D$13/12), ('4. Billing Det. for Def-Var'!W22/D24)/(D$15/12))),4),ROUND(IF(ISERROR('4. Billing Det. for Def-Var'!W22/E24), 0, IF(OR(ISBLANK(D$15), OR(D$15=0, D$15=\"\")), ('4. Billing Det. for Def-Var'!W22/E24)/(D$13/12), ('4. Billing Det. for Def-Var'!W22/E24)/(D$15/12))),4))","v":0},0,0]
[null,{"$f":"'4. Billing Det. for Def-Var'!B23","v":"UNMETERED SCATTERED LOAD SERVICE CLASSIFICATION"},{"$f":"'4. Billing Det. for Def-Var'!C23","v":"kWh"},{"$f":"'4. Billing Det. for Def-Var'!D23","v":11437642.31264231},{"$f":"'4. Billing Det. for Def-Var'!E23","v":0},{"$f":"'4. Billing Det. for Def-Var'!J23","v":11437642.31264231},{"$f":"'4. Billing Det. for Def-Var'!K23","v":0},{"$f":"IFERROR(SUM('5. Allocating Def-Var Balances'!G22:Y22)-I25,\"\")","v":3668.1419143978669},null,2.9999999999999997E-4,0,{"$f":"IF(C25=\"kWh\",ROUND(IF(ISERROR('4. Billing Det. for Def-Var'!W23/D25), 0, IF(OR(ISBLANK(D$15), OR(D$15=0, D$15=\"\")), ('4. Billing Det. for Def-Var'!W23/D25)/(D$13/12), ('4. Billing Det. for Def-Var'!W23/D25)/(D$15/12))),4),ROUND(IF(ISERROR('4. Billing Det. for Def-Var'!W23/E25), 0, IF(OR(ISBLANK(D$15), OR(D$15=0, D$15=\"\")), ('4. Billing Det. for Def-Var'!W23/E25)/(D$13/12), ('4. Billing Det. for Def-Var'!W23/E25)/(D$15/12))),4))","v":0},3431.2926937926927,0]
[null,{"$f":"'4. Billing Det. for Def-Var'!B24","v":"STREET LIGHTING SERVICE CLASSIFICATION"},{"$f":"'4. Billing Det. for Def-Var'!C24","v":"kW"},{"$f":"'4. Billing Det. for Def-Var'!D24","v":13289944.06494407},{"$f":"'4. Billing Det. for Def-Var'!E24","v":40571.730013897963},{"$f":"'4. Billing Det. for Def-Var'!J24","v":13289944.06494407},{"$f":"'4. Billing Det. for Def-Var'!K24","v":40571.730013897963},{"$f":"IFERROR(SUM('5. Allocating Def-Var Balances'!G23:Y23)-I26,\"\")","v":4142.6863214442483},null,0.1021,0,{"$f":"IF(C26=\"kWh\",ROUND(IF(ISERROR('4. Billing Det. for Def-Var'!W24/D26), 0, IF(OR(ISBLANK(D$15), OR(D$15=0, D$15=\"\")), ('4. Billing Det. for Def-Var'!W24/D26)/(D$13/12), ('4. Billing Det. for Def-Var'!W24/D26)/(D$15/12))),4),ROUND(IF(ISERROR('4. Billing Det. for Def-Var'!W24/E26), 0, IF(OR(ISBLANK(D$15), OR(D$15=0, D$15=\"\")), ('4. Billing Det. for Def-Var'!W24/E26)/(D$13/12), ('4. Billing Det. for Def-Var'!W24/E26)/(D$15/12))),4))","v":-3.2587999999999999},4142.373634418982,0]
[]
[]
[null,null,null,null,null,null,null,null,null,null,null,null,{"$f":"SUM(M19:M28)","v":4581922.8059583437},{"$f":"SUM(N19:N28)","v":-2439868.0351643455},{"$f":"SUM(M29:N29)","v":2142054.7707939981}]
[]
[]
[null,"1 When calculating the revenue reconciliation for distributors with Class A customers, the balances of sub-account 1580-CBR Class A and B will not be taken into consideration since the rate riders, if any, are calculated outside of the model."]
[null,"2 Only for rate classes with WMP customers are the Deferral/Variance Account Rate Riders for Non-WMP (column H and J) calculated separately. For all rate classes without WMP customers, balances in account 1580 and 1588 are included in column H and disposed through a combined Deferral/Variance Account and Rate Rider."]

{"sheet":"9. STS-Tax Change","index":13,"n_rows":46,"n_cols":22,"rows_kept":46,"cut":false,"hidden":false,"merged":[[14,1,14,11],[18,1,18,8],[1,1,8,14]]}
["Back to Index",null,null,null,null,null,null,null,null,null,null,null,null,null,null,null,null,null,null,null,"Tax Rates","Effective"]
[null,{"$f":"+'1. Information Sheet'!B2","v":"INCENTIVE REGULATION MODEL FOR 2020 FILERS"},null,null,null,null,null,null,null,null,null,null,null,null,null,null,null,null,null,null,"Federal & Provincial","2016-01-01"]
[null,null,null,null,null,null,null,null,null,null,null,null,null,null,null,null,null,null,null,null,"As of June 20, 2012"]
[]
[null,null,null,null,null,null,null,null,null,null,null,null,null,null,null,null,null,null,null,null,"Federal income tax",0.38]
[null,null,null,null,null,null,null,null,null,null,null,null,null,null,null,null,null,null,null,null,"General corporate rate",-0.1]
[null,null,null,null,null,null,null,null,null,null,null,null,null,null,null,null,null,null,null,null,"Federal tax abatement",{"$f":"SUM(V5:V6)","v":0.28000000000000003}]
[null,null,null,null,null,null,null,null,null,null,null,null,null,null,null,null,null,null,null,null,"  Adjusted federal rate",-0.13]
[null,null,null,null,null,null,null,null,null,null,null,null,null,null,null,null,null,null,null,null,"Rate reduction",{"$f":"V7+V8","v":0.15000000000000002}]
[null,null,null,null,null,null,null,null,null,null,null,null,null,null,null,null,null,null,null,null,"Ontario income tax ",0.115]
[]
[null,null,null,null,null,null,null,null,null,null,null,null,null,null,null,null,null,null,null,null,"Combined federal and Ontario ",{"$f":"V9+V10","v":0.26500000000000001}]
[null,"Summary - Sharing of Tax Change Forecast Amounts"]
[null,null,null,null,null,null,null,null,null,null,null,null,null,null,null,null,null,null,null,null,"Federal & Ontario Small Business"]
[null,{"$f":"\"For the \" & '1. Information Sheet'!G32 & \" year, enter any Tax Credits from the Cost of Service Tax Calculation (Positive #)\"","v":"For the 2017 year, enter any Tax Credits from the Cost of Service Tax Calculation (Positive #)"},null,null,null,null,null,null,null,null,null,null,null,null,null,null,null,null,null,null,"Federal small business threshold",500000]
[null,null,null,null,null,null,null,null,null,null,null,null,null,null,null,null,null,null,null,null,"Ontario Small Business Threshold",500000]
[]
[null,"1. Tax Related Amounts Forecast from Capital Tax Rate Changes ",null,null,null,null,null,null,null,null,null,null,2018,null,{"$f":"M18+1","v":2019},null,null,null,null,null,"Federal small business rate",0.105]
[null,"Taxable Capital (if you are not claiming capital tax, please enter your OEB-Approved Rate Base)",null,null,null,null,null,null,null,null,null,null,null,null,{"$f":"M19","v":0}]
[null,null,null,null,null,null,null,null,null,null,null,null,null,null,null,null,null,null,null,null,"Ontario small business rate",4.4999999999999998E-2]
[null,"Deduction from taxable capital up to $15,000,000",null,null,null,null,null,null,null,null,null,null,null,null,{"$f":"M21","v":0}]
[]
[null,"Net Taxable Capital ",null,null,null,null,null,null,null,null,null,null,{"$f":"M19-M21","v":0},null,{"$f":"O19-O21","v":0}]
[]
[null,"Rate",null,null,null,null,null,null,null,null,null,null,null,null,0,null,null,null,null,null,"Ontario Tax Rate (Maximum 11.5%)"]
[null,null,null,null,null,null,null,null,null,null,null,null,null,null,null,null,null,null,null,null,"Federal tax rate (Maximum 15%)"]
[null,"Ontario Capital Tax (Deductible, not grossed-up)",null,null,null,null,null,null,null,null,null,null,{"$f":"IF(M23>0, M23*M25, 0)*181/365","v":0},null,0,null,null,null,null,null,"Combined tax rate (Maximum 26.5%)"]
[]
[null,"2. Tax Related Amounts Forecast from lncome Tax Rate Changes "]
[null,"Regulatory Taxable Income",null,null,null,null,null,null,null,null,null,null,null,null,{"$f":"M30","v":0}]
[]
[null,"Corporate Tax Rate",null,null,null,null,null,null,null,null,null,null,null,null,{"$f":"IF(ratebase>15000000, 26.5%, IF(ratebase<10000000, 15%, 15%+11.5%*((ratebase-10000000)/5000000)))","v":0.15}]
[]
[null,"Tax Impact ",null,null,null,null,null,null,null,null,null,null,{"$f":"M30*M32-M15","v":0},null,{"$f":"O30*O32-M15","v":0}]
[]
[null,"Grossed-up Tax Amount",null,null,null,null,null,null,null,null,null,null,{"$f":"M34/(1-M32)","v":0},null,{"$f":"O34/(1-O32)","v":0}]
[]
[null,"Tax Related Amounts Forecast from Capital Tax Rate Changes ",null,null,null,null,null,null,null,null,null,null,{"$f":"M27","v":0},null,{"$f":"O27","v":0}]
[]
[null,"Tax Related Amounts Forecast from lncome Tax Rate Changes ",null,null,null,null,null,null,null,null,null,null,{"$f":"M36","v":0},null,{"$f":"O36","v":0}]
[]
[null,"Total Tax Related Amounts",null,null,null,null,null,null,null,null,null,null,{"$f":"SUM(M40,M38)","v":0},null,{"$f":"SUM(O40,O38)","v":0}]
[]
[null,"Incremental Tax Savings",null,null,null,null,null,null,null,null,null,null,null,null,{"$f":"O42-M42","v":0}]
[]
[null,"Sharing of Tax Amount (50%)",null,null,null,null,null,null,null,null,null,null,null,null,{"$f":"0.5*O44","v":0}]

{"sheet":"10. Shared Tax - RR","index":14,"n_rows":48,"n_cols":17,"rows_kept":48,"cut":false,"hidden":false,"merged":[[1,1,8,6],[33,8,41,11]]}
["Back to Index"]
[null,{"$f":"+'1. Information Sheet'!B2","v":"INCENTIVE REGULATION MODEL FOR 2020 FILERS"}]
[]
[]
[]
[]
[]
[]
[]
[]
[]
[null,"Calculation of Rebased Revenue Requirement and Allocation of Tax Sharing Amount.  Enter data from the last OEB-Approved Cost of Service application in columns D through I."]
[null,"As per Chapter 3 Filing Requirements, shared tax rate riders are based on a 1 year disposition."]
[]
[null,"Rate Class",null,"Re-based Billed Customers or Connections","Re-based Billed kWh","Re-based Billed kW","Re-based Service Charge","Re-based Distribution Volumetric Rate kWh","Re-based Distribution Volumetric Rate kW","Service Charge Revenue","Distribution Volumetric Rate Revenue \nkWh","Distribution Volumetric Rate Revenue \nkW","Revenue Requirement from Rates","Service Charge \n% Revenue","Distribution Volumetric Rate \n% Revenue \nkWh","Distribution Volumetric Rate \n% Revenue \nkW","Total % Revenue"]
[null,null,null,"A","B","C","D","E","F","G = A * D *12","H = B * E","I = C * F","J = G + H + I","K = G / J","L = H / J","M = I / J","N = J / R"]
[null,{"$f":"'4. Billing Det. for Def-Var'!B17","v":"RESIDENTIAL SERVICE CLASSIFICATION"},{"$f":"'4. Billing Det. for Def-Var'!C17","v":"kWh"},140979.18172386964,1308264983.2731071,0,11.07,1.55E-2,0,{"$f":"G17*D17*12","v":18727674.500198841},{"$f":"E17*H17","v":20278107.240733158},{"$f":"F17*I17","v":0},{"$f":"J17+K17+L17","v":39005781.740932003},{"$f":"IF(ISERROR(J17/M17),0,J17/M17)","v":0.48012560354729},{"$f":"IF(ISERROR(K17/M17),0,K17/M17)","v":0.51987439645270994},{"$f":"IF(ISERROR(L17/M17),0,L17/M17)","v":0},{"$f":"IF(ISERROR(M17/M30),0,M17/M30)","v":0.56143283070244876}]
[null,{"$f":"'4. Billing Det. for Def-Var'!B18","v":"GENERAL SERVICE LESS THAN 50 kW SERVICE CLASSIFICATION"},{"$f":"'4. Billing Det. for Def-Var'!C18","v":"kWh"},8989.460008453565,354668870.2835499,0,24.39,1.61E-2,0,2631035.1552741891,5710168.8115651533,0,8341203.9668393424,0.31542630605053334,0.68457369394946666,0,{"$f":"IF(ISERROR(M18/M30),0,M18/M30)","v":0.12005978461533612}]
[null,{"$f":"'4. Billing Det. for Def-Var'!B19","v":"GENERAL SERVICE 50 to 499 kW SERVICE CLASSIFICATION"},{"$f":"'4. Billing Det. for Def-Var'!C19","v":"kW"},1490.7244903381991,1064497598.5537131,2979825.6981246667,121.18,0,2.7446000000000002,2167751.9248701958,0,8178429.6110729603,10346181.535943156,0.20952193012845524,0,0.79047806987154479,{"$f":"IF(ISERROR(M19/M30),0,M19/M30)","v":0.14891858917906109}]
[null,{"$f":"'4. Billing Det. for Def-Var'!B20","v":"GENERAL SERVICE 500 to 4,999 kW SERVICE CLASSIFICATION"},{"$f":"'4. Billing Det. for Def-Var'!C20","v":"kW"},114.61641141787759,806154179.88763332,1969146.4021656737,1093.3499999999999,0,3.1861000000000002,1503790.2410848374,0,6273897.3519400535,7777687.5930248909,0.1933467014583424,0,0.80665329854165757,{"$f":"IF(ISERROR(M20/M30),0,M20/M30)","v":0.11194876674113655}]
[null,{"$f":"'4. Billing Det. for Def-Var'!B21","v":"LARGE USE SERVICE CLASSIFICATION"},{"$f":"'4. Billing Det. for Def-Var'!C21","v":"kW"},6,382619513.4019751,719987.09163337958,4549.67,0,2.4121999999999999,327576.24,0,1736752.8624380382,2064329.1024380382,0.15868411660385065,0,0.84131588339614938,{"$f":"IF(ISERROR(M21/M30),0,M21/M30)","v":2.9713085592821667E-2}]
[null,{"$f":"'4. Billing Det. for Def-Var'!B22","v":"STANDBY POWER SERVICE CLASSIFICATION "},{"$f":"'4. Billing Det. for Def-Var'!C22","v":"kW"},1,0,54580,0,0,1.6224000000000001,0,0,88550.592000000004,88550.592000000004,0,0,1,{"$f":"IF(ISERROR(M22/M30),0,M22/M30)","v":1.2745600090041862E-3}]
[null,{"$f":"'4. Billing Det. for Def-Var'!B23","v":"UNMETERED SCATTERED LOAD SERVICE CLASSIFICATION"},{"$f":"'4. Billing Det. for Def-Var'!C23","v":"kWh"},1561.7181617727067,5931732.9043365736,0,1.05,1.9199999999999998E-2,0,19677.648838336107,113889.27176326221,0,133566.92060159831,0.14732426823727068,0.85267573176272937,0,{"$f":"IF(ISERROR(M23/M30),0,M23/M30)","v":1.9225061253642954E-3}]
[null,{"$f":"'4. Billing Det. for Def-Var'!B24","v":"STREET LIGHTING SERVICE CLASSIFICATION"},{"$f":"'4. Billing Det. for Def-Var'!C24","v":"kW"},22334.563518950279,33306954.548778366,100671.89144675127,2.2200000000000002,0,11.1563,594992.77214483556,0,1123125.8225473911,1718118.5946922265,0.34630483249697847,0,0.65369516750302159,{"$f":"IF(ISERROR(M24/M30),0,M24/M30)","v":2.4729877034827548E-2}]
[null,{"$f":"'4. Billing Det. for Def-Var'!B25","v":0},{"$f":"'4. Billing Det. for Def-Var'!C25","v":0},null,null,null,null,null,null,0,0,0,0,0,0,0,{"$f":"IF(ISERROR(M25/M30),0,M25/M30)","v":0}]
[null,null,null,null,null,null,null,null,null,{"$f":"G26*D26*12","v":0},{"$f":"E26*H26","v":0},{"$f":"F26*I26","v":0},{"$f":"J26+K26+L26","v":0},{"$f":"IF(ISERROR(J26/M26),0,J26/M26)","v":0},{"$f":"IF(ISERROR(K26/M26),0,K26/M26)","v":0},{"$f":"IF(ISERROR(L26/M26),0,L26/M26)","v":0},{"$f":"IF(ISERROR(M26/M31),0,M26/M31)","v":0}]
[null,null,null,null,null,null,null,null,null,0,0,0,0,0,0,0,0]
[null,null,null,null,null,null,null,null,null,0,0,0,0,0,0,0,0]
[null,null,null,null,null,null,null,null,null,0,0,0,0,0,0,0,0]
[null,"Total",null,{"$f":"SUM(D17:D29)","v":175477.26431480228},{"$f":"SUM(E17:E29)","v":3955443832.8530931},5824211.0833704714,null,null,null,{"$f":"SUM(J17:J29)","v":25972498.482411236},{"$f":"SUM(K17:K29)","v":26102165.324061573},17400756.239998445,69475420.046471238,null,null,null,{"$f":"SUM(Q17:Q29)","v":1.0000000000000002}]
[]
[]
[null,"Rate Class",null,"Total kWh\n(most recent RRR filing)","Total kW\n(most recent RRR filing)","Allocation of Tax Savings by Rate Class","Distribution Rate Rider"]
[null,{"$f":"B17","v":"RESIDENTIAL SERVICE CLASSIFICATION"},"kWh",{"$f":"'4. Billing Det. for Def-Var'!D17","v":1490532667.2805483},{"$f":"'4. Billing Det. for Def-Var'!E17","v":0},{"$f":"F$48*Q17","v":0},{"$f":"IFERROR(ROUND(F34/'4. Billing Det. for Def-Var'!X17,2),\"\")","v":0},"$/Customer","If the allocated tax sharing amount does not produce a rate rider in one or more rate class (except for the Standby rate class), a distributor is required to transfer the entire OEB-approved tax sharing amount into account 1595 for disposition at a later date (see Filing Requirements, Appendix B)"]
[null,"GENERAL SERVICE LESS THAN 50 kW SERVICE CLASSIFICATION","kWh",{"$f":"'4. Billing Det. for Def-Var'!D18","v":685616683.99168408},{"$f":"'4. Billing Det. for Def-Var'!E18","v":0},{"$f":"F$48*Q18","v":0},{"$f":"IFERROR(ROUND(IF(E35<>0,F35/E35,F35/D35),4),\"\")","v":0},"$/kWh"]
[null,"GENERAL SERVICE 50 to 499 kW SERVICE CLASSIFICATION","kW",{"$f":"'4. Billing Det. for Def-Var'!D19","v":2051428808.3748548},{"$f":"'4. Billing Det. for Def-Var'!E19","v":5710412.0095022377},0,{"$f":"IFERROR(ROUND(IF(E36<>0,F36/E36,F36/D36),4),\"\")","v":0},"$/kW"]
[null,"GENERAL SERVICE 500 to 4,999 kW SERVICE CLASSIFICATION","kW",{"$f":"'4. Billing Det. for Def-Var'!D20","v":2037760513.1273},{"$f":"'4. Billing Det. for Def-Var'!E20","v":4585777.2030871157},0,0,"$/kW"]
[null,"LARGE USE SERVICE CLASSIFICATION","kW",{"$f":"'4. Billing Det. for Def-Var'!D21","v":977049362},{"$f":"'4. Billing Det. for Def-Var'!E21","v":1753163},0,0,"$/kWh"]
[null,"STANDBY POWER SERVICE CLASSIFICATION ","kW",{"$f":"'4. Billing Det. for Def-Var'!D22","v":0},{"$f":"'4. Billing Det. for Def-Var'!E22","v":0},0,"","$/kWh"]
[null,"UNMETERED SCATTERED LOAD SERVICE CLASSIFICATION","kWh",{"$f":"'4. Billing Det. for Def-Var'!D23","v":11437642.31264231},{"$f":"'4. Billing Det. for Def-Var'!E23","v":0},0,0,"$/kW"]
[null,"STREET LIGHTING SERVICE CLASSIFICATION","kW",{"$f":"'4. Billing Det. for Def-Var'!D24","v":13289944.06494407},{"$f":"'4. Billing Det. for Def-Var'!E24","v":40571.730013897963},0,0,"$/kW"]
[null,0,0,{"$f":"'4. Billing Det. for Def-Var'!D25","v":0},{"$f":"'4. Billing Det. for Def-Var'!E25","v":0},0,{"$f":"IFERROR(ROUND(IF(E42<>\"\",F42/E42,F42/D42),4),\"\")","v":""}]
[null,null,null,null,null,{"$f":"F$48*Q30","v":0},""]
[null,null,null,null,null,{"$f":"F$48*Q31","v":0},""]
[null,null,null,null,null,0,""]
[null,null,null,null,null,0]
[]
[null,null,null,{"$f":"SUM(D34:D47)","v":7267115621.1519737},{"$f":"SUM(E34:E47)","v":12089923.942603251},{"$f":"ROUND('9. STS-Tax Change'!O46,2)","v":0}]

{"sheet":"11. RTSR - Current Rates","index":15,"n_rows":36,"n_cols":53,"rows_kept":36,"cut":false,"hidden":false,"merged":[[12,1,12,8],[1,1,8,4]]}
["Back to Index",null,null,null,null,null,null,null,null,null,null,null,null,null,null,null,null,null,null,null,null,null,null,null,null,null,null,null,null,null,null,null,null,null,null,null,null,null,null,null,null,null,null,null,null,null,null,null,null,null,null,null,1]
[null,{"$f":"+'1. Information Sheet'!B2","v":"INCENTIVE REGULATION MODEL FOR 2020 FILERS"}]
[]
[]
[]
[]
[]
[]
[]
[]
[]
[]
[null,"Columns F and G must match the data from the most recent RRR filing (Tab 4).\nRates have been imported from Tab \"RATES\".  Loss Factor has been imported from \"Model Specs\" tab. \nIf the data needs to be modified, please make the necessary adjustments and note the changes in your manager's summary.  "]
[]
[null,"Rate Class","Rate Description","Unit","Rate","Non-Loss Adjusted Metered kWh","Non-Loss Adjusted Metered kW","Applicable Loss Factor","Loss Adjusted Billed kWh"]
[{"$f":"IFERROR(VLOOKUP(B16,'Model Specs'!K$16:N$31,3,FALSE),\"\")","v":"R_TN"},{"$f":"'4. Billing Det. for Def-Var'!B17","v":"RESIDENTIAL SERVICE CLASSIFICATION"},"Retail Transmission Rate – Network Service Rate","$/kWh",{"$f":"IFERROR(VLOOKUP(A16,_xlnm.DATABASE,8,FALSE),0)","v":7.6E-3},{"$f":"'4. Billing Det. for Def-Var'!D17","v":1490532667.2805483},{"$f":"'4. Billing Det. for Def-Var'!E17","v":0},1,{"$f":"F16*H16","v":1490532667.2805483}]
[{"$f":"IFERROR(VLOOKUP(B17,'Model Specs'!K$16:N$31,3,FALSE),\"\")","v":"GSL_TN"},{"$f":"'4. Billing Det. for Def-Var'!B18","v":"GENERAL SERVICE LESS THAN 50 kW SERVICE CLASSIFICATION"},"Retail Transmission Rate – Network Service Rate","$/kWh",7.1000000000000004E-3,{"$f":"'4. Billing Det. for Def-Var'!D18","v":685616683.99168408},{"$f":"'4. Billing Det. for Def-Var'!E18","v":0},1,{"$f":"F17*H17","v":685616683.99168408}]
[{"$f":"IFERROR(VLOOKUP(B18,'Model Specs'!K$16:N$31,3,FALSE),\"\")","v":"GS50_499_TN"},{"$f":"'4. Billing Det. for Def-Var'!B19","v":"GENERAL SERVICE 50 to 499 kW SERVICE CLASSIFICATION"},"Retail Transmission Rate – Network Service Rate","$/kW",2.7288999999999999,{"$f":"'4. Billing Det. for Def-Var'!D19","v":2051428808.3748548},{"$f":"'4. Billing Det. for Def-Var'!E19","v":5710412.0095022377},1,2051428808.3748548]
[{"$f":"IFERROR(VLOOKUP(B19,'Model Specs'!K$16:N$31,3,FALSE),\"\")","v":"GS500_TN"},{"$f":"'4. Billing Det. for Def-Var'!B20","v":"GENERAL SERVICE 500 to 4,999 kW SERVICE CLASSIFICATION"},"Retail Transmission Rate – Network Service Rate","$/kW",2.6402000000000001,{"$f":"'4. Billing Det. for Def-Var'!D20","v":2037760513.1273},{"$f":"'4. Billing Det. for Def-Var'!E20","v":4585777.2030871157},1,2037760513.1273]
[{"$f":"IFERROR(VLOOKUP(B20,'Model Specs'!K$16:N$31,3,FALSE),\"\")","v":"LU_TN"},{"$f":"'4. Billing Det. for Def-Var'!B21","v":"LARGE USE SERVICE CLASSIFICATION"},"Retail Transmission Rate – Network Service Rate","$/kW",2.8174000000000001,{"$f":"'4. Billing Det. for Def-Var'!D21","v":977049362},{"$f":"'4. Billing Det. for Def-Var'!E21","v":1753163},1,977049362]
[{"$f":"IFERROR(VLOOKUP(B21,'Model Specs'!K$16:N$31,3,FALSE),\"\")","v":"SB"},{"$f":"'4. Billing Det. for Def-Var'!B22","v":"STANDBY POWER SERVICE CLASSIFICATION "},null,null,0,{"$f":"'4. Billing Det. for Def-Var'!D22","v":0},{"$f":"'4. Billing Det. for Def-Var'!E22","v":0},1,0]
[{"$f":"IFERROR(VLOOKUP(B22,'Model Specs'!K$16:N$31,3,FALSE),\"\")","v":"USL_TN"},{"$f":"'4. Billing Det. for Def-Var'!B23","v":"UNMETERED SCATTERED LOAD SERVICE CLASSIFICATION"},"Retail Transmission Rate – Network Service Rate","$/kWh",7.1000000000000004E-3,{"$f":"'4. Billing Det. for Def-Var'!D23","v":11437642.31264231},{"$f":"'4. Billing Det. for Def-Var'!E23","v":0},1,11437642.31264231]
[{"$f":"IFERROR(VLOOKUP(B23,'Model Specs'!K$16:N$31,3,FALSE),\"\")","v":"SL_TN"},{"$f":"'4. Billing Det. for Def-Var'!B24","v":"STREET LIGHTING SERVICE CLASSIFICATION"},"Retail Transmission Rate – Network Service Rate","$/kW",1.8898999999999999,{"$f":"'4. Billing Det. for Def-Var'!D24","v":13289944.06494407},{"$f":"'4. Billing Det. for Def-Var'!E24","v":40571.730013897963},1,13289944.06494407]
[]
[]
[]
[]
[]
[{"$f":"IFERROR(VLOOKUP(B29,'Model Specs'!K$16:N$31,4,FALSE),\"\")","v":"R_TC"},{"$f":"B16","v":"RESIDENTIAL SERVICE CLASSIFICATION"},"Retail Transmission Rate – Line and Transformation Connection Service Rate",{"$f":"D16","v":"$/kWh"},{"$f":"IFERROR(VLOOKUP(A29,_xlnm.DATABASE,8,FALSE),0)","v":7.3000000000000001E-3},{"$f":"F16","v":1490532667.2805483},{"$f":"G16","v":0},{"$f":"H16","v":1},{"$f":"F29*H29","v":1490532667.2805483}]
[{"$f":"IFERROR(VLOOKUP(B30,'Model Specs'!K$16:N$31,4,FALSE),\"\")","v":"GSL_TC"},{"$f":"B17","v":"GENERAL SERVICE LESS THAN 50 kW SERVICE CLASSIFICATION"},"Retail Transmission Rate – Line and Transformation Connection Service Rate",{"$f":"D17","v":"$/kWh"},6.4999999999999997E-3,{"$f":"F17","v":685616683.99168408},0,1,685616683.99168408]
[{"$f":"IFERROR(VLOOKUP(B31,'Model Specs'!K$16:N$31,4,FALSE),\"\")","v":"GS50_499_TC"},"GENERAL SERVICE 50 to 499 kW SERVICE CLASSIFICATION","Retail Transmission Rate – Line and Transformation Connection Service Rate","$/kW",2.5929000000000002,2051428808.3748548,5710412.0095022377,1,2051428808.3748548]
[{"$f":"IFERROR(VLOOKUP(B32,'Model Specs'!K$16:N$31,4,FALSE),\"\")","v":"GS500_TC"},"GENERAL SERVICE 500 to 4,999 kW SERVICE CLASSIFICATION","Retail Transmission Rate – Line and Transformation Connection Service Rate ","$/kW",2.5373000000000001,2037760513.1273,4585777.2030871157,1,2037760513.1273]
[{"$f":"IFERROR(VLOOKUP(B33,'Model Specs'!K$16:N$31,4,FALSE),\"\")","v":"LU_TC"},"LARGE USE SERVICE CLASSIFICATION","Retail Transmission Rate – Line and Transformation Connection Service Rate ","$/kW",2.71,977049362,1753163,1,977049362]
[{"$f":"IFERROR(VLOOKUP(B34,'Model Specs'!K$16:N$31,4,FALSE),\"\")","v":"SB"},"STANDBY POWER SERVICE CLASSIFICATION ",null,null,0,0,0,1,0]
[{"$f":"IFERROR(VLOOKUP(B35,'Model Specs'!K$16:N$31,4,FALSE),\"\")","v":"USL_TC"},"UNMETERED SCATTERED LOAD SERVICE CLASSIFICATION","Retail Transmission Rate – Line and Transformation Connection Service Rate","$/kWh",6.4999999999999997E-3,11437642.31264231,0,1,11437642.31264231]
[{"$f":"IFERROR(VLOOKUP(B36,'Model Specs'!K$16:N$31,4,FALSE),\"\")","v":"SL_TC"},"STREET LIGHTING SERVICE CLASSIFICATION","Retail Transmission Rate – Line and Transformation Connection Service Rate","$/kW",1.875,13289944.06494407,40571.730013897963,1,13289944.06494407]

{"sheet":"12. RTSR-UTRs & Sub-Tx","index":16,"n_rows":68,"n_cols":9,"rows_kept":68,"cut":false,"hidden":false,"merged":[[1,1,8,6]]}
["Back to Index"]
[null,{"$f":"+'1. Information Sheet'!B2","v":"INCENTIVE REGULATION MODEL FOR 2020 FILERS"}]
[]
[]
[]
[]
[]
[]
[]
[]
[]
[null,"Uniform Transmission Rates","Unit",null,2018,null,2019,null,2020]
[]
[null,"Rate Description",null,null,"Rate",null,"Rate",null,"Rate"]
[]
[null,"Network Service Rate","kW",null,3.61,null,3.71,null,{"$f":"G16","v":3.71}]
[]
[null,"Line Connection Service Rate","kW",null,0.95,null,0.94,null,{"$f":"G18","v":0.94}]
[]
[null,"Transformation Connection Service Rate","kW",null,2.34,null,2.25,null,{"$f":"G20","v":2.25}]
[]
[]
[null,"Hydro One Sub-Transmission Rates","Unit",null,{"$f":"E12","v":2018},null,{"$f":"G12","v":2019},null,{"$f":"I12","v":2020}]
[]
[]
[]
[null,"Rate Description",null,null,"Rate",null,"Rate",null,"Rate"]
[]
[null,"Network Service Rate","kW",null,3.1941999999999999,null,3.1941999999999999,null,{"$f":"G29","v":3.1941999999999999}]
[]
[null,"Line Connection Service Rate","kW",null,0.77100000000000002,null,0.77100000000000002,null,{"$f":"G31","v":0.77100000000000002}]
[]
[null,"Transformation Connection Service Rate","kW",null,1.7493000000000001,null,1.7493000000000001,null,{"$f":"G33","v":1.7493000000000001}]
[]
[null,"Both Line and Transformation Connection Service Rate","kW",null,{"$f":"SUM(E33,E31)","v":2.5203000000000002},null,{"$f":"SUM(G33,G31)","v":2.5203000000000002},null,{"$f":"G35","v":2.5203000000000002}]
[]
[]
[null,"If needed, add extra host here. (I)","Unit",null,{"$f":"E12","v":2018},null,{"$f":"G12","v":2019},null,{"$f":"I12","v":2020}]
[]
[]
[]
[null,"Rate Description",null,null,"Rate",null,"Rate",null,"Rate"]
[]
[null,"Network Service Rate","kW"]
[]
[null,"Line Connection Service Rate","kW"]
[]
[null,"Transformation Connection Service Rate","kW"]
[]
[null,"Both Line and Transformation Connection Service Rate","kW",null,{"$f":"E46+E48","v":0},null,{"$f":"G48+G46","v":0},null,{"$f":"I48+I46","v":0}]
[]
[]
[null,"If needed, add extra host here. (II)","Unit",null,{"$f":"E12","v":2018},null,{"$f":"G12","v":2019},null,{"$f":"I12","v":2020}]
[]
[]
[]
[null,"Rate Description",null,null,"Rate",null,"Rate",null,"Rate"]
[]
[null,"Network Service Rate","kW"]
[]
[null,"Line Connection Service Rate","kW"]
[]
[null,"Transformation Connection Service Rate","kW"]
[]
[null,"Both Line and Transformation Connection Service Rate","kW",null,{"$f":"E61+E63","v":0},null,{"$f":"G63+G61","v":0},null,{"$f":"I63+I61","v":0}]
[]
[null,null,null,null,"Historical 2018",null,"Current 2019",null,"Forecast 2020"]
[null,"Low Voltage Switchgear Credit (if applicable, enter as a negative value)","$"]

{"sheet":"13. RTSR-Historic Wholesale","index":17,"n_rows":112,"n_cols":16,"rows_kept":112,"cut":false,"hidden":false,"merged":[[52,3,52,5],[52,7,52,9],[52,11,52,13],[71,3,71,5],[71,7,71,9],[71,11,71,13],[90,3,90,5],[90,7,90,9],[90,11,90,13],[91,3,91,5],[91,7,91,9],[91,11,91,13],[1,1,8,10],[15,11,15,13],[33,3,33,5],[33,7,33,9],[33,11,33,13],[12,1,12,11],[15,3,15,5],[15,7,15,9]]}
["Back to Index"]
[null,{"$f":"+'1. Information Sheet'!B2","v":"INCENTIVE REGULATION MODEL FOR 2020 FILERS"}]
[]
[]
[]
[]
[]
[]
[]
[]
[]
[]
[null,"In the green shaded cells, enter billing detail for wholesale transmission for the same reporting period as the billing determinants on Tab 10.   For Hydro One Sub-transmission Rates, if you are charged a combined Line and Transformer connection rate, please ensure that both the Line Connection and Transformation Connection columns are completed. \nIf any of the Hydro One Sub-transmission rates (column E, I and M) are highlighted in orange, please double check the billing data entered in \"Units Billed\" and \"Amount\" columns. The highlighted rates do not match the Hydro One Sub-transmission rates approved for that time period. If data has been entered correctly, please provide explanation for the discrepancy in rates.\n"]
[]
[]
[null,"IESO",null,"Network",null,null,null,"Line Connection",null,null,null,"Transformation Connection",null,null,null,"Total Line"]
[null,"Month",null,"Units Billed","Rate","Amount",null,"Units Billed","Rate","Amount",null,"Units Billed","Rate","Amount",null,"Amount"]
[]
[null,"January",null,921050,{"$f":"IF(D19<>0,F19/D19,0)","v":3.61},3324990.5,null,958894.00000000012,{"$f":"IF(H19<>0,J19/H19,0)","v":0.95},910949.3,null,958894,{"$f":"IF(L19<>0,N19/L19,0)","v":2.34},2243811.96,null,{"$f":"J19+N19","v":3154761.26}]
[null,"February",null,881927.00000000012,3.61,3183756.47,null,930312.00000000012,0.95,883796.4,null,930312.00000000012,2.34,2176930.08,null,3060726.48]
[null,"March",null,850066,3.61,3068738.26,null,897488,0.95,852613.6,null,897488,2.34,2100121.92,null,2952735.52]
[null,"April",null,822450,3.61,2969044.5,null,897518.56842105265,0.95,852642.64,null,896508.61538461549,2.34,2097830.16,null,2950472.8000000003]
[null,"May",null,1046159.0000000001,3.61,3776633.99,null,1103287,0.95000000000000007,1048122.65,null,1103287,2.34,2581691.58,null,3629814.23]
[null,"June",null,1096071,3.61,3956816.31,null,1195012,0.95,1135261.3999999999,null,1195012,2.34,2796328.08,null,3931589.48]
[null,"July",null,1228279.6565096951,3.6100000000000003,4434089.5599999996,null,1257540.8105263158,0.95,1194663.77,null,1255331.1923076925,2.34,2937474.99,null,4132138.7600000002]
[null,"August",null,1136523.6509695291,3.61,4102850.38,null,1178378.7368421054,0.95,1119459.8,null,1178378.4615384617,2.34,2757405.6,null,3876865.4000000004]
[null,"September",null,1215145.4764542936,3.61,4386675.17,null,1249691.7789473685,0.94999999999999984,1187207.19,null,1249691.371794872,2.34,2924277.81,null,4111485]
[null,"October",null,869630,3.61,3139364.3,null,939586.86315789481,0.95,892607.52,null,939591.92307692312,2.34,2198645.1,null,3091252.62]
[null,"November",null,880999.22160664818,3.61,3180407.19,null,911127.70526315784,0.95,865571.32,null,910680.51709401724,2.34,2130992.41,null,2996563.73]
[null,"December",null,859640.67867036012,3.61,3103302.85,null,934056.76842105272,0.95,887353.93,null,928200.38034188049,2.34,2171988.89,null,3059342.8200000003]
[]
[null,"Total",null,{"$f":"SUM(D19:D30)","v":11807941.684210526},{"$f":"IF(D32<>0,F32/D32,0)","v":3.61},{"$f":"SUM(F19:F30)","v":42626669.479999997},null,{"$f":"SUM(H19:H30)","v":12452894.231578948},{"$f":"IF(H32<>0,J32/H32,0)","v":0.95},{"$f":"SUM(J19:J30)","v":11830249.52},null,{"$f":"SUM(L19:L30)","v":12443375.461538464},{"$f":"IF(L32<>0,N32/L32,0)","v":2.34},{"$f":"SUM(N19:N30)","v":29117498.580000006},null,{"$f":"SUM(P19:P30)","v":40947748.099999994}]
[]
[null,"Hydro One",null,"Network",null,null,null,"Line Connection",null,null,null,"Transformation Connection",null,null,null,"Total Line"]
[]
[null,"Month",null,"Units Billed","Rate","Amount",null,"Units Billed","Rate","Amount",null,"Units Billed","Rate","Amount",null,"Amount"]
[]
[null,"January",null,205107.10976144261,{"$f":"IF(D38<>0,F38/D38,0)","v":3.1941999999999999},655153.13,null,683389.90920881974,{"$f":"IF(H38<>0,J38/H38,0)","v":0.77100000000000002},526893.62,null,151961.48745212369,{"$f":"IF(L38<>0,N38/L38,0)","v":1.7493000000000001},265826.23,null,{"$f":"J38+N38","v":792719.85}]
[null,"February",null,183118.24870077017,{"$f":"IF(D39<>0,F39/D39,0)","v":3.1941999999999999},584916.31000000006,null,569188.72892347595,0.77100000000000013,438844.51,null,128065.84919682158,1.7493000000000001,224025.59,null,{"$f":"J39+N39","v":662870.1}]
[null,"March",null,170412.30041951037,3.1941999999999995,544330.97,null,529764.55252918287,0.77100000000000002,408448.47,null,119919.85937232035,1.7493000000000001,209775.81,null,618224.28]
[null,"April",null,187157.76720305553,3.1941999999999999,597819.34,null,661598.52140077821,0.77100000000000002,510092.46,null,146859.26370548218,1.7493000000000001,256900.91,null,766993.37]
[null,"May",null,228639.80026297664,3.1941999999999999,730321.25,null,720294.747081712,0.77100000000000002,555347.25,null,158336.79757617333,1.7493000000000001,276978.56,null,832325.81]
[null,"June",null,205091.57848600589,3.1941999999999999,655103.52,null,772279.3385214007,0.77100000000000002,595427.37,null,170971.60578517121,1.7493000000000001,299080.63,null,894508]
[null,"July",null,202067.1780101434,3.1941999999999995,645442.98,null,834654.51361867704,0.77100000000000002,643518.63,null,193829.48608014634,1.7493000000000001,339065.92,null,982584.55]
[null,"August",null,203232.09254273371,3.1941999999999999,649163.94999999995,null,821224.33203631639,0.77100000000000002,633163.96,null,181153.54141656662,1.7493000000000001,316891.89,null,950055.85]
[null,"September",null,206796.54373552065,3.1941999999999999,660549.52,null,826444.26718547347,0.77100000000000002,637188.53,null,182039.38718344481,1.7493000000000001,318441.5,null,955630.03]
[null,"October",null,211321.20718802829,3.1941999999999999,675002.2,null,660250.63553826197,0.77100000000000002,509053.24,null,146843.81181043846,1.7493000000000001,256873.88,null,765927.12]
[null,"November",null,182727.20869075198,3.1941999999999999,583667.25,null,572457.30220492871,0.77100000000000002,441364.58,null,128658.34905390727,1.7493000000000001,225062.05,null,666426.63]
[null,"December",null,177370.55287708974,3.1941999999999999,566557.02,null,556172.64591439685,0.77100000000000002,428809.11,null,124164.7287486423,1.7493000000000001,217201.36,null,646010.47]
[]
[null,"Total",null,{"$f":"SUM(D38:D49)","v":2363041.5878780293},{"$f":"IF(D51<>0,F51/D51,0)","v":3.1941999999999999},{"$f":"SUM(F38:F49)","v":7548027.4400000013},null,{"$f":"SUM(H38:H49)","v":8207719.4941634238},{"$f":"IF(H51<>0,J51/H51,0)","v":0.77100000000000013},{"$f":"SUM(J38:J49)","v":6328151.7300000004},null,{"$f":"SUM(L38:L49)","v":1832804.1673812382},{"$f":"IF(L51<>0,N51/L51,0)","v":1.7492999999999999},{"$f":"SUM(N38:N49)","v":3206124.3299999996},null,{"$f":"SUM(P38:P49)","v":9534276.0600000005}]
[]
[null,"Add Extra Host Here (I)",null,"Network",null,null,null,"Line Connection",null,null,null,"Transformation Connection",null,null,null,"Total Line"]
[null,"(if needed)"]
[null,"Month",null,"Units Billed","Rate","Amount",null,"Units Billed","Rate","Amount",null,"Units Billed","Rate","Amount",null,"Amount"]
[]
[null,"January",null,null,{"$f":"IF(D57<>0,F57/D57,0)","v":0},null,null,null,{"$f":"IF(H57<>0,J57/H57,0)","v":0},null,null,null,{"$f":"IF(L57<>0,N57/L57,0)","v":0},null,null,{"$f":"J57+N57","v":0}]
[null,"February",null,null,0,null,null,null,0,null,null,null,0,null,null,0]
[null,"March",null,null,0,null,null,null,0,null,null,null,0,null,null,0]
[null,"April",null,null,0,null,null,null,0,null,null,null,0,null,null,0]
[null,"May",null,null,0,null,null,null,0,null,null,null,0,null,null,0]
[null,"June",null,null,0,null,null,null,0,null,null,null,0,null,null,0]
[null,"July",null,null,0,null,null,null,0,null,null,null,0,null,null,0]
[null,"August",null,null,0,null,null,null,0,null,null,null,0,null,null,0]
[null,"September",null,null,0,null,null,null,0,null,null,null,0,null,null,0]
[null,"October",null,null,0,null,null,null,0,null,null,null,0,null,null,0]
[null,"November",null,null,0,null,null,null,0,null,null,null,0,null,null,0]
[null,"December",null,null,0,null,null,null,0,null,null,null,0,null,null,0]
[]
[null,"Total",null,{"$f":"SUM(D57:D68)","v":0},{"$f":"IF(D70<>0,F70/D70,0)","v":0},{"$f":"SUM(F57:F68)","v":0},null,{"$f":"SUM(H57:H68)","v":0},{"$f":"IF(H70<>0,J70/H70,0)","v":0},{"$f":"SUM(J57:J68)","v":0},null,{"$f":"SUM(L57:L68)","v":0},{"$f":"IF(L70<>0,N70/L70,0)","v":0},{"$f":"SUM(N57:N68)","v":0},null,{"$f":"SUM(P57:P68)","v":0}]
[]
[null,"Add Extra Host Here (II)",null,"Network",null,null,null,"Line Connection",null,null,null,"Transformation Connection",null,null,null,"Total Line"]
[null,"(if needed)"]
[null,"Month",null,"Units Billed","Rate","Amount",null,"Units Billed","Rate","Amount",null,"Units Billed","Rate","Amount",null,"Amount"]
[]
[null,"January",null,null,{"$f":"IF(D76<>0,F76/D76,0)","v":0},null,null,null,{"$f":"IF(H76<>0,J76/H76,0)","v":0},null,null,null,{"$f":"IF(L76<>0,N76/L76,0)","v":0},null,null,{"$f":"J76+N76","v":0}]
[null,"February",null,null,0,null,null,null,0,null,null,null,0,null,null,0]
[null,"March",null,null,0,null,null,null,0,null,null,null,0,null,null,0]
[null,"April",null,null,0,null,null,null,0,null,null,null,0,null,null,0]
[null,"May",null,null,0,null,null,null,0,null,null,null,0,null,null,0]
[null,"June",null,null,0,null,null,null,0,null,null,null,0,null,null,0]
[null,"July",null,null,0,null,null,null,0,null,null,null,0,null,null,0]
[null,"August",null,null,0,null,null,null,0,null,null,null,0,null,null,0]
[null,"September",null,null,0,null,null,null,0,null,null,null,0,null,null,0]
[null,"October",null,null,0,null,null,null,0,null,null,null,0,null,null,0]
[null,"November",null,null,0,null,null,null,0,null,null,null,0,null,null,0]
[null,"December",null,null,0,null,null,null,0,null,null,null,0,null,null,0]
[]
[null,"Total",null,{"$f":"SUM(D76:D87)","v":0},{"$f":"IF(D89<>0,F89/D89,0)","v":0},{"$f":"SUM(F76:F87)","v":0},null,{"$f":"SUM(H76:H87)","v":0},{"$f":"IF(H89<>0,J89/H89,0)","v":0},{"$f":"SUM(J76:J87)","v":0},null,{"$f":"SUM(L76:L87)","v":0},{"$f":"IF(L89<>0,N89/L89,0)","v":0},{"$f":"SUM(N76:N87)","v":0},null,{"$f":"SUM(P76:P87)","v":0}]
[]
[null,"Total",null,"Network",null,null,null,"Line Connection",null,null,null,"Transformation Connection",null,null,null,"Total Line"]
[]
[null,"Month",null,"Units Billed","Rate","Amount",null,"Units Billed","Rate","Amount",null,"Units Billed","Rate","Amount",null,"Amount"]
[]
[null,"January",null,{"$f":"D19+D38+D57+D76","v":1126157.1097614425},{"$f":"IF(D95<>0,F95/D95,0)","v":3.5342703034065348},{"$f":"F19+F38+F57+F76","v":3980143.63},null,{"$f":"H19+H38+H57+H76","v":1642283.9092088197},{"$f":"IF(H95<>0,J95/H95,0)","v":0.87551422256380107},{"$f":"J19+J38+J57+J76","v":1437842.92},null,{"$f":"L19+L38+L57+L76","v":1110855.4874521238},{"$f":"IF(L95<>0,N95/L95,0)","v":2.2591941241215334},{"$f":"N19+N38+N57+N76","v":2509638.19},null,{"$f":"J95+N95","v":3947481.11}]
[null,"February",null,{"$f":"D20+D39+D58+D77","v":1065045.2487007703},3.5385095465167673,{"$f":"F20+F39+F58+F77","v":3768672.7800000003},null,{"$f":"H20+H39+H58+H77","v":1499500.7289234761},0.88205419609869251,{"$f":"J20+J39+J58+J77","v":1322640.9100000001},null,{"$f":"L20+L39+L58+L77","v":1058377.8491968217},2.2685241115184236,{"$f":"N20+N39+N58+N77","v":2400955.67},null,3723596.58]
[null,"March",null,1020478.3004195103,3.5405644867849677,3613069.2299999995,null,1427252.5525291828,0.88355916250793687,1261062.0699999998,null,1017407.8593723204,2.270375355096105,2309897.73,null,3570959.8]
[null,"April",null,1009607.7672030556,3.5329203635996005,3566863.84,null,1559117.0898218309,0.87404282134815647,1362735.1,null,1043367.8790900977,2.2568560113749321,2354731.0700000003,null,3717466.1700000004]
[null,"May",null,1274798.8002629767,3.535424758063991,4506955.24,null,1823581.7470817119,0.87929696739180563,1603469.9,null,1261623.7975761732,2.2658657402405269,2858670.14,null,4462140.04]
[null,"June",null,1301162.5784860058,3.5444608585087756,4611919.83,null,1967291.3385214007,0.8797318099823338,1730688.77,null,1365983.6057851713,2.2660657835792621,3095408.71,null,4826097.4800000004]
[null,"July",null,1430346.8345198384,3.5512593291438836,5079532.5399999991,null,2092195.324144993,0.8785902438393034,1838182.3999999999,null,1449160.6783878389,2.2609921445322985,3276540.91,null,5114723.3100000005]
[null,"August",null,1339755.7435122628,3.5469258878056862,4752014.33,null,1999603.0688784218,0.87648583225222165,1752623.76,null,1359532.0029550283,2.2612910055208859,3074297.49,null,4826921.25]
[null,"September",null,1421942.0201898143,3.5495291779381049,5047224.6899999995,null,2076136.0461328421,0.87874574664711813,1824395.72,null,1431730.7589783168,2.2648946316652476,3242719.31,null,5067115.03]
[null,"October",null,1080951.2071880284,3.528712928609091,3814366.5,null,1599837.4986961568,0.87612695735806434,1401660.76,null,1086435.7348873615,2.2601603584537662,2455518.98,null,3857179.74]
[null,"November",null,1063726.4302974001,3.5385737655758236,3764074.44,null,1483585.0074680867,0.88093091627451847,1306935.8999999999,null,1039338.8661479244,2.2668780478999939,2356054.46,null,3662990.36]
[null,"December",null,1037011.2315474498,3.5388815071209581,3669859.87,null,1490229.4143354497,0.8831949143796276,1316163.04,null,1052365.1090905229,2.2703054570716343,2389190.25,null,3705353.29]
[]
[null,"Total",null,{"$f":"SUM(D95:D106)","v":14170983.272088557},{"$f":"IF(D108<>0,F108/D108,0)","v":3.5406644660166271},{"$f":"SUM(F95:F106)","v":50174696.919999987},null,{"$f":"SUM(H95:H106)","v":20660613.72574237},{"$f":"IF(H108<>0,J108/H108,0)","v":0.87888973149792227},{"$f":"SUM(J95:J106)","v":18158401.25},null,{"$f":"SUM(L95:L106)","v":14276179.628919702},{"$f":"IF(L108<>0,N108/L108,0)","v":2.264164766077966},{"$f":"SUM(N95:N106)","v":32323622.910000004},null,{"$f":"SUM(P95:P106)","v":50482024.160000004}]
[]
[null,null,null,null,null,null,null,null,null,null,null,null,null,"Low Voltage Switchgear Credit (if applicable)",null,{"$f":"'12. RTSR-UTRs & Sub-Tx'!E68","v":0}]
[]
[null,null,null,null,null,null,null,null,null,null,null,null,null,"Total including deduction for Low Voltage Switchgear Credit",null,{"$f":"P108+P110","v":50482024.160000004}]

{"sheet":"14. RTSR-Current Wholesale","index":18,"n_rows":113,"n_cols":16,"rows_kept":113,"cut":false,"hidden":false,"merged":[[1,1,8,9],[92,3,92,5],[92,7,92,9],[92,11,92,13],[72,3,72,5],[72,7,72,9],[72,11,72,13],[91,3,91,5],[91,7,91,9],[91,11,91,13],[34,3,34,5],[34,7,34,9],[34,11,34,13],[53,3,53,5],[53,7,53,9],[53,11,53,13],[12,1,12,11],[15,3,15,5],[15,7,15,9],[15,11,15,13],[16,3,16,5],[16,7,16,9],[16,11,16,13]]}
["Back to Index"]
[null,{"$f":"+'1. Information Sheet'!B2","v":"INCENTIVE REGULATION MODEL FOR 2020 FILERS"}]
[]
[]
[]
[]
[]
[]
[]
[]
[]
[]
[null,"The purpose of this sheet is to calculate the expected billing when current 2019 Uniform Transmission Rates are applied against historical 2018 transmission units."]
[]
[]
[null,"IESO",null,"Network",null,null,null,"Line Connection",null,null,null,"Transformation Connection",null,null,null,"Total Line"]
[]
[null,"Month",null,"Units Billed","Rate","Amount",null,"Units Billed","Rate","Amount",null,"Units Billed","Rate","Amount",null,"Amount"]
[]
[null,"January",null,{"$f":"'13. RTSR-Historic Wholesale'!D19","v":921050},{"$f":"'12. RTSR-UTRs & Sub-Tx'!G16","v":3.71},{"$f":"D20*E20","v":3417095.5},null,{"$f":"'13. RTSR-Historic Wholesale'!H19","v":958894.00000000012},{"$f":"'12. RTSR-UTRs & Sub-Tx'!G18","v":0.94},{"$f":"H20*I20","v":901360.3600000001},null,{"$f":"'13. RTSR-Historic Wholesale'!L19","v":958894},{"$f":"'12. RTSR-UTRs & Sub-Tx'!G20","v":2.25},{"$f":"L20*M20","v":2157511.5},null,{"$f":"J20+N20","v":3058871.8600000003}]
[null,"February",null,{"$f":"'13. RTSR-Historic Wholesale'!D20","v":881927.00000000012},{"$f":"E20","v":3.71},{"$f":"D21*E21","v":3271949.1700000004},null,{"$f":"'13. RTSR-Historic Wholesale'!H20","v":930312.00000000012},{"$f":"I20","v":0.94},{"$f":"H21*I21","v":874493.28},null,{"$f":"'13. RTSR-Historic Wholesale'!L20","v":930312.00000000012},{"$f":"M20","v":2.25},{"$f":"L21*M21","v":2093202.0000000002},null,2967695.2800000003]
[null,"March",null,{"$f":"'13. RTSR-Historic Wholesale'!D21","v":850066},{"$f":"E21","v":3.71},3153744.86,null,{"$f":"'13. RTSR-Historic Wholesale'!H21","v":897488},{"$f":"I21","v":0.94},843638.72,null,{"$f":"'13. RTSR-Historic Wholesale'!L21","v":897488},{"$f":"M21","v":2.25},2019348,null,2862986.7199999997]
[null,"April",null,{"$f":"'13. RTSR-Historic Wholesale'!D22","v":822450},3.71,3051289.5,null,{"$f":"'13. RTSR-Historic Wholesale'!H22","v":897518.56842105265},0.94,843667.45431578939,null,{"$f":"'13. RTSR-Historic Wholesale'!L22","v":896508.61538461549},2.25,2017144.384615385,null,2860811.8389311745]
[null,"May",null,{"$f":"'13. RTSR-Historic Wholesale'!D23","v":1046159.0000000001},3.71,3881249.8900000006,null,{"$f":"'13. RTSR-Historic Wholesale'!H23","v":1103287},0.94,1037089.7799999999,null,{"$f":"'13. RTSR-Historic Wholesale'!L23","v":1103287},2.25,2482395.75,null,3519485.53]
[null,"June",null,{"$f":"'13. RTSR-Historic Wholesale'!D24","v":1096071},3.71,4066423.41,null,{"$f":"'13. RTSR-Historic Wholesale'!H24","v":1195012},0.94,1123311.28,null,{"$f":"'13. RTSR-Historic Wholesale'!L24","v":1195012},2.25,2688777,null,3812088.2800000003]
[null,"July",null,{"$f":"'13. RTSR-Historic Wholesale'!D25","v":1228279.6565096951},3.71,4556917.5256509688,null,{"$f":"'13. RTSR-Historic Wholesale'!H25","v":1257540.8105263158},0.94,1182088.3618947368,null,{"$f":"'13. RTSR-Historic Wholesale'!L25","v":1255331.1923076925},2.25,2824495.182692308,null,4006583.544587045]
[null,"August",null,{"$f":"'13. RTSR-Historic Wholesale'!D26","v":1136523.6509695291},3.71,4216502.7450969527,null,{"$f":"'13. RTSR-Historic Wholesale'!H26","v":1178378.7368421054},0.94,1107676.0126315791,null,{"$f":"'13. RTSR-Historic Wholesale'!L26","v":1178378.4615384617},2.25,2651351.538461539,null,3759027.5510931183]
[null,"September",null,{"$f":"'13. RTSR-Historic Wholesale'!D27","v":1215145.4764542936},3.71,4508189.7176454291,null,{"$f":"'13. RTSR-Historic Wholesale'!H27","v":1249691.7789473685},0.94,1174710.2722105263,null,{"$f":"'13. RTSR-Historic Wholesale'!L27","v":1249691.371794872},2.25,2811805.586538462,null,3986515.8587489882]
[null,"October",null,{"$f":"'13. RTSR-Historic Wholesale'!D28","v":869630},3.71,3226327.3,null,{"$f":"'13. RTSR-Historic Wholesale'!H28","v":939586.86315789481},0.94,883211.65136842104,null,{"$f":"'13. RTSR-Historic Wholesale'!L28","v":939591.92307692312},2.25,2114081.826923077,null,2997293.478291498]
[null,"November",null,{"$f":"'13. RTSR-Historic Wholesale'!D29","v":880999.22160664818},3.71,3268507.1121606645,null,{"$f":"'13. RTSR-Historic Wholesale'!H29","v":911127.70526315784},0.94,856460.04294736835,null,{"$f":"'13. RTSR-Historic Wholesale'!L29","v":910680.51709401724},2.25,2049031.1634615387,null,2905491.2064089072]
[null,"December",null,{"$f":"'13. RTSR-Historic Wholesale'!D30","v":859640.67867036012},3.71,3189266.9178670361,null,{"$f":"'13. RTSR-Historic Wholesale'!H30","v":934056.76842105272},0.94,878013.36231578956,null,{"$f":"'13. RTSR-Historic Wholesale'!L30","v":928200.38034188049},2.25,2088450.855769231,null,2966464.2180850208]
[]
[null,"Total",null,{"$f":"SUM(D20:D31)","v":11807941.684210526},{"$f":"IF(D33<>0,F33/D33,0)","v":3.71},{"$f":"SUM(F20:F31)","v":43807463.648421049},null,{"$f":"SUM(H20:H31)","v":12452894.231578948},{"$f":"IF(H33<>0,J33/H33,0)","v":0.94},{"$f":"SUM(J20:J31)","v":11705720.577684211},null,{"$f":"SUM(L20:L31)","v":12443375.461538464},{"$f":"IF(L33<>0,N33/L33,0)","v":2.25},{"$f":"SUM(N20:N31)","v":27997594.788461544},null,{"$f":"SUM(P20:P31)","v":39703315.366145752}]
[]
[null,"Hydro One",null,"Network",null,null,null,"Line Connection",null,null,null,"Transformation Connection",null,null,null,"Total Line"]
[]
[null,"Month",null,"Units Billed","Rate","Amount",null,"Units Billed","Rate","Amount",null,"Units Billed","Rate","Amount",null,"Amount"]
[]
[null,"January",null,{"$f":"'13. RTSR-Historic Wholesale'!D38","v":205107.10976144261},{"$f":"'12. RTSR-UTRs & Sub-Tx'!G29","v":3.1941999999999999},{"$f":"D39*E39","v":655153.13},null,{"$f":"'13. RTSR-Historic Wholesale'!H38","v":683389.90920881974},{"$f":"'12. RTSR-UTRs & Sub-Tx'!G31","v":0.77100000000000002},{"$f":"H39*I39","v":526893.62},null,{"$f":"'13. RTSR-Historic Wholesale'!L38","v":151961.48745212369},{"$f":"'12. RTSR-UTRs & Sub-Tx'!G33","v":1.7493000000000001},{"$f":"L39*M39","v":265826.23},null,{"$f":"J39+N39","v":792719.85}]
[null,"February",null,{"$f":"'13. RTSR-Historic Wholesale'!D39","v":183118.24870077017},{"$f":"E39","v":3.1941999999999999},{"$f":"D40*E40","v":584916.31000000006},null,{"$f":"'13. RTSR-Historic Wholesale'!H39","v":569188.72892347595},{"$f":"I39","v":0.77100000000000002},{"$f":"H40*I40","v":438844.50999999995},null,{"$f":"'13. RTSR-Historic Wholesale'!L39","v":128065.84919682158},{"$f":"M39","v":1.7493000000000001},{"$f":"L40*M40","v":224025.59},null,662870.1]
[null,"March",null,{"$f":"'13. RTSR-Historic Wholesale'!D40","v":170412.30041951037},{"$f":"E40","v":3.1941999999999999},544330.97,null,{"$f":"'13. RTSR-Historic Wholesale'!H40","v":529764.55252918287},{"$f":"I40","v":0.77100000000000002},408448.47,null,{"$f":"'13. RTSR-Historic Wholesale'!L40","v":119919.85937232035},{"$f":"M40","v":1.7493000000000001},209775.81,null,618224.28]
[null,"April",null,{"$f":"'13. RTSR-Historic Wholesale'!D41","v":187157.76720305553},3.1941999999999999,597819.34,null,{"$f":"'13. RTSR-Historic Wholesale'!H41","v":661598.52140077821},0.77100000000000002,510092.46,null,{"$f":"'13. RTSR-Historic Wholesale'!L41","v":146859.26370548218},{"$f":"M41","v":1.7493000000000001},256900.91,null,766993.37]
[null,"May",null,{"$f":"'13. RTSR-Historic Wholesale'!D42","v":228639.80026297664},3.1941999999999999,730321.25,null,{"$f":"'13. RTSR-Historic Wholesale'!H42","v":720294.747081712},0.77100000000000002,555347.25,null,{"$f":"'13. RTSR-Historic Wholesale'!L42","v":158336.79757617333},1.7493000000000001,276978.56,null,832325.81]
[null,"June",null,{"$f":"'13. RTSR-Historic Wholesale'!D43","v":205091.57848600589},3.1941999999999999,655103.52,null,{"$f":"'13. RTSR-Historic Wholesale'!H43","v":772279.3385214007},0.77100000000000002,595427.37,null,{"$f":"'13. RTSR-Historic Wholesale'!L43","v":170971.60578517121},1.7493000000000001,299080.63,null,894508]
[null,"July",null,{"$f":"'13. RTSR-Historic Wholesale'!D44","v":202067.1780101434},3.1941999999999999,645442.98,null,{"$f":"'13. RTSR-Historic Wholesale'!H44","v":834654.51361867704},0.77100000000000002,643518.63,null,{"$f":"'13. RTSR-Historic Wholesale'!L44","v":193829.48608014634},1.7493000000000001,339065.92,null,982584.55]
[null,"August",null,{"$f":"'13. RTSR-Historic Wholesale'!D45","v":203232.09254273371},3.1941999999999999,649163.94999999995,null,{"$f":"'13. RTSR-Historic Wholesale'!H45","v":821224.33203631639},0.77100000000000002,633163.96,null,{"$f":"'13. RTSR-Historic Wholesale'!L45","v":181153.54141656662},1.7493000000000001,316891.89,null,950055.85]
[null,"September",null,{"$f":"'13. RTSR-Historic Wholesale'!D46","v":206796.54373552065},3.1941999999999999,660549.52,null,{"$f":"'13. RTSR-Historic Wholesale'!H46","v":826444.26718547347},0.77100000000000002,637188.53,null,{"$f":"'13. RTSR-Historic Wholesale'!L46","v":182039.38718344481},1.7493000000000001,318441.5,null,955630.03]
[null,"October",null,{"$f":"'13. RTSR-Historic Wholesale'!D47","v":211321.20718802829},3.1941999999999999,675002.2,null,{"$f":"'13. RTSR-Historic Wholesale'!H47","v":660250.63553826197},0.77100000000000002,509053.24,null,{"$f":"'13. RTSR-Historic Wholesale'!L47","v":146843.81181043846},1.7493000000000001,256873.88,null,765927.12]
[null,"November",null,{"$f":"'13. RTSR-Historic Wholesale'!D48","v":182727.20869075198},3.1941999999999999,583667.25,null,{"$f":"'13. RTSR-Historic Wholesale'!H48","v":572457.30220492871},0.77100000000000002,441364.58000000007,null,{"$f":"'13. RTSR-Historic Wholesale'!L48","v":128658.34905390727},1.7493000000000001,225062.05,null,666426.63000000012]
[null,"December",null,{"$f":"'13. RTSR-Historic Wholesale'!D49","v":177370.55287708974},3.1941999999999999,566557.02,null,{"$f":"'13. RTSR-Historic Wholesale'!H49","v":556172.64591439685},0.77100000000000002,428809.11,null,{"$f":"'13. RTSR-Historic Wholesale'!L49","v":124164.7287486423},1.7493000000000001,217201.36,null,646010.47]
[]
[null,"Total",null,{"$f":"SUM(D39:D50)","v":2363041.5878780293},{"$f":"IF(D52<>0,F52/D52,0)","v":3.1941999999999999},{"$f":"SUM(F39:F50)","v":7548027.4400000013},null,{"$f":"SUM(H39:H50)","v":8207719.4941634238},{"$f":"IF(H52<>0,J52/H52,0)","v":0.77100000000000013},{"$f":"SUM(J39:J50)","v":6328151.7300000004},null,{"$f":"SUM(L39:L50)","v":1832804.1673812382},{"$f":"IF(L52<>0,N52/L52,0)","v":1.7492999999999999},{"$f":"SUM(N39:N50)","v":3206124.3299999996},null,{"$f":"SUM(P39:P50)","v":9534276.0600000005}]
[]
[null,"Add Extra Host Here (I)",null,"Network",null,null,null,"Line Connection",null,null,null,"Transformation Connection",null,null,null,"Total Line"]
[]
[null,"Month",null,"Units Billed","Rate","Amount",null,"Units Billed","Rate","Amount",null,"Units Billed","Rate","Amount",null,"Amount"]
[]
[null,"January",null,{"$f":"'13. RTSR-Historic Wholesale'!D57","v":0},{"$f":"'12. RTSR-UTRs & Sub-Tx'!G44","v":0},{"$f":"D58*E58","v":0},null,{"$f":"'13. RTSR-Historic Wholesale'!H57","v":0},{"$f":"'12. RTSR-UTRs & Sub-Tx'!G46","v":0},{"$f":"H58*I58","v":0},null,{"$f":"'13. RTSR-Historic Wholesale'!L57","v":0},{"$f":"'12. RTSR-UTRs & Sub-Tx'!G48","v":0},{"$f":"L58*M58","v":0},null,{"$f":"J58+N58","v":0}]
[null,"February",null,{"$f":"'13. RTSR-Historic Wholesale'!D58","v":0},{"$f":"E58","v":0},{"$f":"D59*E59","v":0},null,{"$f":"'13. RTSR-Historic Wholesale'!H58","v":0},{"$f":"I58","v":0},{"$f":"H59*I59","v":0},null,{"$f":"'13. RTSR-Historic Wholesale'!L58","v":0},{"$f":"M58","v":0},{"$f":"L59*M59","v":0},null,0]
[null,"March",null,{"$f":"'13. RTSR-Historic Wholesale'!D59","v":0},{"$f":"E59","v":0},0,null,{"$f":"'13. RTSR-Historic Wholesale'!H59","v":0},{"$f":"I59","v":0},0,null,{"$f":"'13. RTSR-Historic Wholesale'!L59","v":0},{"$f":"M59","v":0},0,null,0]
[null,"April",null,{"$f":"'13. RTSR-Historic Wholesale'!D60","v":0},0,0,null,{"$f":"'13. RTSR-Historic Wholesale'!H60","v":0},0,0,null,{"$f":"'13. RTSR-Historic Wholesale'!L60","v":0},0,0,null,0]
[null,"May",null,{"$f":"'13. RTSR-Historic Wholesale'!D61","v":0},0,0,null,{"$f":"'13. RTSR-Historic Wholesale'!H61","v":0},0,0,null,{"$f":"'13. RTSR-Historic Wholesale'!L61","v":0},0,0,null,0]
[null,"June",null,{"$f":"'13. RTSR-Historic Wholesale'!D62","v":0},0,0,null,{"$f":"'13. RTSR-Historic Wholesale'!H62","v":0},0,0,null,{"$f":"'13. RTSR-Historic Wholesale'!L62","v":0},0,0,null,0]
[null,"July",null,{"$f":"'13. RTSR-Historic Wholesale'!D63","v":0},0,0,null,{"$f":"'13. RTSR-Historic Wholesale'!H63","v":0},0,0,null,{"$f":"'13. RTSR-Historic Wholesale'!L63","v":0},0,0,null,0]
[null,"August",null,{"$f":"'13. RTSR-Historic Wholesale'!D64","v":0},0,0,null,{"$f":"'13. RTSR-Historic Wholesale'!H64","v":0},0,0,null,{"$f":"'13. RTSR-Historic Wholesale'!L64","v":0},0,0,null,0]
[null,"September",null,{"$f":"'13. RTSR-Historic Wholesale'!D65","v":0},0,0,null,{"$f":"'13. RTSR-Historic Wholesale'!H65","v":0},0,0,null,{"$f":"'13. RTSR-Historic Wholesale'!L65","v":0},0,0,null,0]
[null,"October",null,{"$f":"'13. RTSR-Historic Wholesale'!D66","v":0},0,0,null,{"$f":"'13. RTSR-Historic Wholesale'!H66","v":0},0,0,null,{"$f":"'13. RTSR-Historic Wholesale'!L66","v":0},0,0,null,0]
[null,"November",null,{"$f":"'13. RTSR-Historic Wholesale'!D67","v":0},0,0,null,{"$f":"'13. RTSR-Historic Wholesale'!H67","v":0},0,0,null,{"$f":"'13. RTSR-Historic Wholesale'!L67","v":0},0,0,null,0]
[null,"December",null,{"$f":"'13. RTSR-Historic Wholesale'!D68","v":0},0,0,null,{"$f":"'13. RTSR-Historic Wholesale'!H68","v":0},0,0,null,{"$f":"'13. RTSR-Historic Wholesale'!L68","v":0},0,0,null,0]
[]
[null,"Total",null,{"$f":"SUM(D58:D69)","v":0},{"$f":"IF(D71<>0,F71/D71,0)","v":0},{"$f":"SUM(F58:F69)","v":0},null,{"$f":"SUM(H58:H69)","v":0},{"$f":"IF(H71<>0,J71/H71,0)","v":0},{"$f":"SUM(J58:J69)","v":0},null,{"$f":"SUM(L58:L69)","v":0},{"$f":"IF(L71<>0,N71/L71,0)","v":0},{"$f":"SUM(N58:N69)","v":0},null,{"$f":"SUM(P58:P69)","v":0}]
[]
[null,"Add Extra Host Here (II)",null,"Network",null,null,null,"Line Connection",null,null,null,"Transformation Connection",null,null,null,"Total Line"]
[]
[null,"Month",null,"Units Billed","Rate","Amount",null,"Units Billed","Rate","Amount",null,"Units Billed","Rate","Amount",null,"Amount"]
[]
[null,"January",null,{"$f":"'13. RTSR-Historic Wholesale'!D76","v":0},{"$f":"'12. RTSR-UTRs & Sub-Tx'!G59","v":0},{"$f":"D77*E77","v":0},null,{"$f":"'13. RTSR-Historic Wholesale'!H76","v":0},{"$f":"'12. RTSR-UTRs & Sub-Tx'!G61","v":0},{"$f":"H77*I77","v":0},null,{"$f":"'13. RTSR-Historic Wholesale'!L76","v":0},{"$f":"'12. RTSR-UTRs & Sub-Tx'!G63","v":0},{"$f":"L77*M77","v":0},null,{"$f":"J77+N77","v":0}]
[null,"February",null,{"$f":"'13. RTSR-Historic Wholesale'!D77","v":0},{"$f":"E77","v":0},{"$f":"D78*E78","v":0},null,{"$f":"'13. RTSR-Historic Wholesale'!H77","v":0},{"$f":"I77","v":0},{"$f":"H78*I78","v":0},null,{"$f":"'13. RTSR-Historic Wholesale'!L77","v":0},{"$f":"M77","v":0},{"$f":"L78*M78","v":0},null,0]
[null,"March",null,{"$f":"'13. RTSR-Historic Wholesale'!D78","v":0},{"$f":"E78","v":0},0,null,{"$f":"'13. RTSR-Historic Wholesale'!H78","v":0},{"$f":"I78","v":0},0,null,{"$f":"'13. RTSR-Historic Wholesale'!L78","v":0},{"$f":"M78","v":0},0,null,0]
[null,"April",null,{"$f":"'13. RTSR-Historic Wholesale'!D79","v":0},0,0,null,{"$f":"'13. RTSR-Historic Wholesale'!H79","v":0},0,0,null,{"$f":"'13. RTSR-Historic Wholesale'!L79","v":0},{"$f":"M79","v":0},0,null,0]
[null,"May",null,{"$f":"'13. RTSR-Historic Wholesale'!D80","v":0},0,0,null,{"$f":"'13. RTSR-Historic Wholesale'!H80","v":0},0,0,null,{"$f":"'13. RTSR-Historic Wholesale'!L80","v":0},0,0,null,0]
[null,"June",null,{"$f":"'13. RTSR-Historic Wholesale'!D81","v":0},0,0,null,{"$f":"'13. RTSR-Historic Wholesale'!H81","v":0},0,0,null,{"$f":"'13. RTSR-Historic Wholesale'!L81","v":0},0,0,null,0]
[null,"July",null,{"$f":"'13. RTSR-Historic Wholesale'!D82","v":0},0,0,null,{"$f":"'13. RTSR-Historic Wholesale'!H82","v":0},0,0,null,{"$f":"'13. RTSR-Historic Wholesale'!L82","v":0},0,0,null,0]
[null,"August",null,{"$f":"'13. RTSR-Historic Wholesale'!D83","v":0},0,0,null,{"$f":"'13. RTSR-Historic Wholesale'!H83","v":0},0,0,null,{"$f":"'13. RTSR-Historic Wholesale'!L83","v":0},0,0,null,0]
[null,"September",null,{"$f":"'13. RTSR-Historic Wholesale'!D84","v":0},0,0,null,{"$f":"'13. RTSR-Historic Wholesale'!H84","v":0},0,0,null,{"$f":"'13. RTSR-Historic Wholesale'!L84","v":0},0,0,null,0]
[null,"October",null,{"$f":"'13. RTSR-Historic Wholesale'!D85","v":0},0,0,null,{"$f":"'13. RTSR-Historic Wholesale'!H85","v":0},0,0,null,{"$f":"'13. RTSR-Historic Wholesale'!L85","v":0},0,0,null,0]
[null,"November",null,{"$f":"'13. RTSR-Historic Wholesale'!D86","v":0},0,0,null,{"$f":"'13. RTSR-Historic Wholesale'!H86","v":0},0,0,null,{"$f":"'13. RTSR-Historic Wholesale'!L86","v":0},0,0,null,0]
[null,"December",null,{"$f":"'13. RTSR-Historic Wholesale'!D87","v":0},0,0,null,{"$f":"'13. RTSR-Historic Wholesale'!H87","v":0},0,0,null,{"$f":"'13. RTSR-Historic Wholesale'!L87","v":0},0,0,null,0]
[]
[null,"Total",null,{"$f":"SUM(D77:D88)","v":0},{"$f":"IF(D90<>0,F90/D90,0)","v":0},{"$f":"SUM(F77:F88)","v":0},null,{"$f":"SUM(H77:H88)","v":0},{"$f":"IF(H90<>0,J90/H90,0)","v":0},{"$f":"SUM(J77:J88)","v":0},null,{"$f":"SUM(L77:L88)","v":0},{"$f":"IF(L90<>0,N90/L90,0)","v":0},{"$f":"SUM(N77:N88)","v":0},null,{"$f":"SUM(P77:P88)","v":0}]
[]
[null,"Total",null,"Network",null,null,null,"Line Connection",null,null,null,"Transformation Connection",null,null,null,"Total Line"]
[]
[null,"Month",null,"Units Billed","Rate","Amount",null,"Units Billed","Rate","Amount",null,"Units Billed","Rate","Amount",null,"Amount"]
[]
[null,"January",null,{"$f":"D20+D39+D58+D77","v":1126157.1097614425},{"$f":"IF(D96<>0,F96/D96,0)","v":3.6160572931627963},{"$f":"F20+F39+F58+F77","v":4072248.63},null,{"$f":"H20+H39+H58+H77","v":1642283.9092088197},{"$f":"IF(H96<>0,J96/H96,0)","v":0.86967543918034851},{"$f":"J20+J39+J58+J77","v":1428253.98},null,{"$f":"L20+L39+L58+L77","v":1110855.4874521238},{"$f":"IF(L96<>0,N96/L96,0)","v":2.181505837053753},{"$f":"N20+N39+N58+N77","v":2423337.73},null,{"$f":"J96+N96","v":3851591.71}]
[null,"February",null,{"$f":"D21+D40+D59+D78","v":1065045.2487007703},3.6213160752605784,{"$f":"F21+F40+F59+F78","v":3856865.4800000004},null,{"$f":"H21+H40+H59+H78","v":1499500.7289234761},0.87585005106524594,{"$f":"J21+J40+J59+J78","v":1313337.79},null,{"$f":"L21+L40+L59+L78","v":1058377.8491968217},2.1894142925973843,{"$f":"N21+N40+N59+N78","v":2317227.5900000003},null,3630565.3800000004]
[null,"March",null,1020478.3004195103,3.6238652291574951,3698075.83,null,1427252.5525291828,0.87727094113877846,1252087.19,null,1017407.8593723204,2.1909834777325545,2229123.81,null,3481211]
[null,"April",null,1009607.7672030556,3.6143826925076334,3649108.84,null,1559117.0898218309,0.8682862391499353,1353759.9143157895,null,1043367.8790900977,2.179523962917604,2274045.2946153851,null,3627805.2089311746]
[null,"May",null,1274798.8002629767,3.6174893944430173,4611571.1400000006,null,1823581.7470817119,0.87324685748164876,1592437.0299999998,null,1261623.7975761732,2.1871609550337427,2759374.31,null,4351811.34]
[null,"June",null,1301162.5784860058,3.6286986792179565,4721526.93,null,1967291.3385214007,0.8736574071900246,1718738.65,null,1365983.6057851713,2.1873305194483437,2987857.63,null,4706596.2799999993]
[null,"July",null,1430346.8345198384,3.6371321836758428,5202360.5056509692,null,2092195.324144993,0.87257961569185638,1825606.9918947369,null,1449160.6783878389,2.1830299081891344,3163561.1026923079,null,4989168.0945870448]
[null,"August",null,1339755.7435122628,3.6317565486536147,4865666.6950969528,null,1999603.0688784218,0.87059276899790761,1740839.972631579,null,1359532.0029550283,2.1832832342378667,2968243.4284615391,null,4709083.4010931179]
[null,"September",null,1421942.0201898143,3.6349859306889716,5168739.2376454286,null,2076136.0461328421,0.87272643119197191,1811898.8022105263,null,1431730.7589783168,2.1863378061195013,3130247.086538462,null,4942145.8887489885]
[null,"October",null,1080951.2071880284,3.6091633683900173,3901329.5,null,1599837.4986961568,0.87025394298051884,1392264.891368421,null,1086435.7348873615,2.1823248543724407,2370955.7069230769,null,3763220.5982914977]
[null,"November",null,1063726.4302974001,3.6213957390187823,3852174.3621606645,null,1483585.0074680867,0.87478952430387491,1297824.6229473683,null,1039338.8661479244,2.1880190258735857,2274093.2134615388,null,3571917.8364089071]
[null,"December",null,1037011.2315474498,3.6217774924795338,3755823.9378670361,null,1490229.4143354497,0.87692704206791661,1306822.4723157897,null,1052365.1090905229,2.1909242294832696,2305652.2157692309,null,3612474.6880850205]
[]
[null,"Total",null,{"$f":"SUM(D96:D107)","v":14170983.272088557},{"$f":"IF(D109<>0,F109/D109,0)","v":3.6239892534184146},{"$f":"SUM(F96:F107)","v":51355491.088421054},null,{"$f":"SUM(H96:H107)","v":20660613.72574237},{"$f":"IF(H109<>0,J109/H109,0)","v":0.87286237219636231},{"$f":"SUM(J96:J107)","v":18033872.307684209},null,{"$f":"SUM(L96:L107)","v":14276179.628919702},{"$f":"IF(L109<>0,N109/L109,0)","v":2.1857191440244415},{"$f":"SUM(N96:N107)","v":31203719.118461542},null,{"$f":"SUM(P96:P107)","v":49237591.42614574}]
[]
[null,null,null,null,null,null,null,null,null,null,null,null,null,"Low Voltage Switchgear Credit (if applicable)",null,{"$f":"'12. RTSR-UTRs & Sub-Tx'!G68","v":0}]
[]
[null,null,null,null,null,null,null,null,null,null,null,null,null,"Total including deduction for Low Voltage Switchgear Credit",null,{"$f":"P109+P111","v":49237591.42614574}]

{"sheet":"15. RTSR-Forecast Wholesale","index":19,"n_rows":113,"n_cols":16,"rows_kept":113,"cut":false,"hidden":false,"merged":[[1,1,8,9],[92,3,92,5],[92,7,92,9],[92,11,92,13],[72,3,72,5],[72,7,72,9],[72,11,72,13],[91,3,91,5],[91,7,91,9],[91,11,91,13],[34,3,34,5],[34,7,34,9],[34,11,34,13],[53,3,53,5],[53,7,53,9],[53,11,53,13],[12,1,12,12],[15,3,15,5],[15,7,15,9],[15,11,15,13],[16,3,16,5],[16,7,16,9],[16,11,16,13]]}
["Back to Index"]
[null,{"$f":"+'1. Information Sheet'!B2","v":"INCENTIVE REGULATION MODEL FOR 2020 FILERS"}]
[]
[]
[]
[]
[]
[]
[]
[]
[]
[]
[null,"The purpose of this sheet is to calculate the expected billing when forecasted 2019 Uniform Transmission Rates are applied against historical 2017 transmission units."]
[]
[]
[null,"IESO",null,"Network",null,null,null,"Line Connection",null,null,null,"Transformation Connection",null,null,null,"Total Line"]
[]
[null,"Month",null,"Units Billed","Rate","Amount",null,"Units Billed","Rate","Amount",null,"Units Billed","Rate","Amount",null,"Amount"]
[]
[null,"January",null,{"$f":"'13. RTSR-Historic Wholesale'!D19","v":921050},{"$f":"'12. RTSR-UTRs & Sub-Tx'!I16","v":3.71},{"$f":"D20*E20","v":3417095.5},null,{"$f":"'13. RTSR-Historic Wholesale'!H19","v":958894.00000000012},{"$f":"'12. RTSR-UTRs & Sub-Tx'!I18","v":0.94},{"$f":"H20*I20","v":901360.3600000001},null,{"$f":"'13. RTSR-Historic Wholesale'!L19","v":958894},{"$f":"'12. RTSR-UTRs & Sub-Tx'!I20","v":2.25},{"$f":"L20*M20","v":2157511.5},null,{"$f":"J20+N20","v":3058871.8600000003}]
[null,"February",null,{"$f":"'13. RTSR-Historic Wholesale'!D20","v":881927.00000000012},{"$f":"E20","v":3.71},3271949.1700000004,null,{"$f":"'13. RTSR-Historic Wholesale'!H20","v":930312.00000000012},{"$f":"I20","v":0.94},874493.28,null,{"$f":"'13. RTSR-Historic Wholesale'!L20","v":930312.00000000012},{"$f":"M20","v":2.25},2093202.0000000002,null,2967695.2800000003]
[null,"March",null,{"$f":"'13. RTSR-Historic Wholesale'!D21","v":850066},3.71,3153744.86,null,{"$f":"'13. RTSR-Historic Wholesale'!H21","v":897488},0.94,843638.72,null,{"$f":"'13. RTSR-Historic Wholesale'!L21","v":897488},2.25,2019348,null,2862986.7199999997]
[null,"April",null,{"$f":"'13. RTSR-Historic Wholesale'!D22","v":822450},3.71,3051289.5,null,{"$f":"'13. RTSR-Historic Wholesale'!H22","v":897518.56842105265},0.94,843667.45431578939,null,{"$f":"'13. RTSR-Historic Wholesale'!L22","v":896508.61538461549},2.25,2017144.384615385,null,2860811.8389311745]
[null,"May",null,{"$f":"'13. RTSR-Historic Wholesale'!D23","v":1046159.0000000001},3.71,3881249.8900000006,null,{"$f":"'13. RTSR-Historic Wholesale'!H23","v":1103287},0.94,1037089.7799999999,null,{"$f":"'13. RTSR-Historic Wholesale'!L23","v":1103287},2.25,2482395.75,null,3519485.53]
[null,"June",null,{"$f":"'13. RTSR-Historic Wholesale'!D24","v":1096071},3.71,4066423.41,null,{"$f":"'13. RTSR-Historic Wholesale'!H24","v":1195012},0.94,1123311.28,null,{"$f":"'13. RTSR-Historic Wholesale'!L24","v":1195012},2.25,2688777,null,3812088.2800000003]
[null,"July",null,{"$f":"'13. RTSR-Historic Wholesale'!D25","v":1228279.6565096951},3.71,4556917.5256509688,null,{"$f":"'13. RTSR-Historic Wholesale'!H25","v":1257540.8105263158},0.94,1182088.3618947368,null,{"$f":"'13. RTSR-Historic Wholesale'!L25","v":1255331.1923076925},2.25,2824495.182692308,null,4006583.544587045]
[null,"August",null,{"$f":"'13. RTSR-Historic Wholesale'!D26","v":1136523.6509695291},3.71,4216502.7450969527,null,{"$f":"'13. RTSR-Historic Wholesale'!H26","v":1178378.7368421054},0.94,1107676.0126315791,null,{"$f":"'13. RTSR-Historic Wholesale'!L26","v":1178378.4615384617},2.25,2651351.538461539,null,3759027.5510931183]
[null,"September",null,{"$f":"'13. RTSR-Historic Wholesale'!D27","v":1215145.4764542936},3.71,4508189.7176454291,null,{"$f":"'13. RTSR-Historic Wholesale'!H27","v":1249691.7789473685},0.94,1174710.2722105263,null,{"$f":"'13. RTSR-Historic Wholesale'!L27","v":1249691.371794872},2.25,2811805.586538462,null,3986515.8587489882]
[null,"October",null,{"$f":"'13. RTSR-Historic Wholesale'!D28","v":869630},3.71,3226327.3,null,{"$f":"'13. RTSR-Historic Wholesale'!H28","v":939586.86315789481},0.94,883211.65136842104,null,{"$f":"'13. RTSR-Historic Wholesale'!L28","v":939591.92307692312},2.25,2114081.826923077,null,2997293.478291498]
[null,"November",null,{"$f":"'13. RTSR-Historic Wholesale'!D29","v":880999.22160664818},3.71,3268507.1121606645,null,{"$f":"'13. RTSR-Historic Wholesale'!H29","v":911127.70526315784},0.94,856460.04294736835,null,{"$f":"'13. RTSR-Historic Wholesale'!L29","v":910680.51709401724},2.25,2049031.1634615387,null,2905491.2064089072]
[null,"December",null,{"$f":"'13. RTSR-Historic Wholesale'!D30","v":859640.67867036012},3.71,3189266.9178670361,null,{"$f":"'13. RTSR-Historic Wholesale'!H30","v":934056.76842105272},0.94,878013.36231578956,null,{"$f":"'13. RTSR-Historic Wholesale'!L30","v":928200.38034188049},2.25,2088450.855769231,null,2966464.2180850208]
[]
[null,"Total",null,{"$f":"SUM(D20:D31)","v":11807941.684210526},{"$f":"IF(D33<>0,F33/D33,0)","v":3.71},{"$f":"SUM(F20:F31)","v":43807463.648421049},null,{"$f":"SUM(H20:H31)","v":12452894.231578948},{"$f":"IF(H33<>0,J33/H33,0)","v":0.94},{"$f":"SUM(J20:J31)","v":11705720.577684211},null,{"$f":"SUM(L20:L31)","v":12443375.461538464},{"$f":"IF(L33<>0,N33/L33,0)","v":2.25},{"$f":"SUM(N20:N31)","v":27997594.788461544},null,{"$f":"SUM(P20:P31)","v":39703315.366145752}]
[]
[null,"Hydro One",null,"Network",null,null,null,"Line Connection",null,null,null,"Transformation Connection",null,null,null,"Total Line"]
[]
[null,"Month",null,"Units Billed","Rate","Amount",null,"Units Billed","Rate","Amount",null,"Units Billed","Rate","Amount",null,"Amount"]
[]
[null,"January",null,{"$f":"'13. RTSR-Historic Wholesale'!D38","v":205107.10976144261},{"$f":"'12. RTSR-UTRs & Sub-Tx'!I29","v":3.1941999999999999},{"$f":"D39*E39","v":655153.13},null,{"$f":"'13. RTSR-Historic Wholesale'!H38","v":683389.90920881974},{"$f":"'12. RTSR-UTRs & Sub-Tx'!I31","v":0.77100000000000002},{"$f":"H39*I39","v":526893.62},null,{"$f":"'13. RTSR-Historic Wholesale'!L38","v":151961.48745212369},{"$f":"'12. RTSR-UTRs & Sub-Tx'!I33","v":1.7493000000000001},{"$f":"L39*M39","v":265826.23},null,{"$f":"J39+N39","v":792719.85}]
[null,"February",null,{"$f":"'13. RTSR-Historic Wholesale'!D39","v":183118.24870077017},{"$f":"E39","v":3.1941999999999999},584916.31000000006,null,{"$f":"'13. RTSR-Historic Wholesale'!H39","v":569188.72892347595},{"$f":"I39","v":0.77100000000000002},438844.50999999995,null,{"$f":"'13. RTSR-Historic Wholesale'!L39","v":128065.84919682158},{"$f":"M39","v":1.7493000000000001},224025.59,null,662870.1]
[null,"March",null,{"$f":"'13. RTSR-Historic Wholesale'!D40","v":170412.30041951037},3.1941999999999999,544330.97,null,{"$f":"'13. RTSR-Historic Wholesale'!H40","v":529764.55252918287},0.77100000000000002,408448.47,null,{"$f":"'13. RTSR-Historic Wholesale'!L40","v":119919.85937232035},1.7493000000000001,209775.81,null,618224.28]
[null,"April",null,{"$f":"'13. RTSR-Historic Wholesale'!D41","v":187157.76720305553},3.1941999999999999,597819.34,null,{"$f":"'13. RTSR-Historic Wholesale'!H41","v":661598.52140077821},0.77100000000000002,510092.46,null,{"$f":"'13. RTSR-Historic Wholesale'!L41","v":146859.26370548218},1.7493000000000001,256900.91,null,766993.37]
[null,"May",null,{"$f":"'13. RTSR-Historic Wholesale'!D42","v":228639.80026297664},3.1941999999999999,730321.25,null,{"$f":"'13. RTSR-Historic Wholesale'!H42","v":720294.747081712},0.77100000000000002,555347.25,null,{"$f":"'13. RTSR-Historic Wholesale'!L42","v":158336.79757617333},1.7493000000000001,276978.56,null,832325.81]
[null,"June",null,{"$f":"'13. RTSR-Historic Wholesale'!D43","v":205091.57848600589},3.1941999999999999,655103.52,null,{"$f":"'13. RTSR-Historic Wholesale'!H43","v":772279.3385214007},0.77100000000000002,595427.37,null,{"$f":"'13. RTSR-Historic Wholesale'!L43","v":170971.60578517121},1.7493000000000001,299080.63,null,894508]
[null,"July",null,{"$f":"'13. RTSR-Historic Wholesale'!D44","v":202067.1780101434},3.1941999999999999,645442.98,null,{"$f":"'13. RTSR-Historic Wholesale'!H44","v":834654.51361867704},0.77100000000000002,643518.63,null,{"$f":"'13. RTSR-Historic Wholesale'!L44","v":193829.48608014634},1.7493000000000001,339065.92,null,982584.55]
[null,"August",null,{"$f":"'13. RTSR-Historic Wholesale'!D45","v":203232.09254273371},3.1941999999999999,649163.94999999995,null,{"$f":"'13. RTSR-Historic Wholesale'!H45","v":821224.33203631639},0.77100000000000002,633163.96,null,{"$f":"'13. RTSR-Historic Wholesale'!L45","v":181153.54141656662},1.7493000000000001,316891.89,null,950055.85]
[null,"September",null,{"$f":"'13. RTSR-Historic Wholesale'!D46","v":206796.54373552065},3.1941999999999999,660549.52,null,{"$f":"'13. RTSR-Historic Wholesale'!H46","v":826444.26718547347},0.77100000000000002,637188.53,null,{"$f":"'13. RTSR-Historic Wholesale'!L46","v":182039.38718344481},1.7493000000000001,318441.5,null,955630.03]
[null,"October",null,{"$f":"'13. RTSR-Historic Wholesale'!D47","v":211321.20718802829},3.1941999999999999,675002.2,null,{"$f":"'13. RTSR-Historic Wholesale'!H47","v":660250.63553826197},0.77100000000000002,509053.24,null,{"$f":"'13. RTSR-Historic Wholesale'!L47","v":146843.81181043846},1.7493000000000001,256873.88,null,765927.12]
[null,"November",null,{"$f":"'13. RTSR-Historic Wholesale'!D48","v":182727.20869075198},3.1941999999999999,583667.25,null,{"$f":"'13. RTSR-Historic Wholesale'!H48","v":572457.30220492871},0.77100000000000002,441364.58000000007,null,{"$f":"'13. RTSR-Historic Wholesale'!L48","v":128658.34905390727},1.7493000000000001,225062.05,null,666426.63000000012]
[null,"December",null,{"$f":"'13. RTSR-Historic Wholesale'!D49","v":177370.55287708974},3.1941999999999999,566557.02,null,{"$f":"'13. RTSR-Historic Wholesale'!H49","v":556172.64591439685},0.77100000000000002,428809.11,null,{"$f":"'13. RTSR-Historic Wholesale'!L49","v":124164.7287486423},1.7493000000000001,217201.36,null,646010.47]
[]
[null,"Total",null,{"$f":"SUM(D39:D50)","v":2363041.5878780293},{"$f":"IF(D52<>0,F52/D52,0)","v":3.1941999999999999},{"$f":"SUM(F39:F50)","v":7548027.4400000013},null,{"$f":"SUM(H39:H50)","v":8207719.4941634238},{"$f":"IF(H52<>0,J52/H52,0)","v":0.77100000000000013},{"$f":"SUM(J39:J50)","v":6328151.7300000004},null,{"$f":"SUM(L39:L50)","v":1832804.1673812382},{"$f":"IF(L52<>0,N52/L52,0)","v":1.7492999999999999},{"$f":"SUM(N39:N50)","v":3206124.3299999996},null,{"$f":"SUM(P39:P50)","v":9534276.0600000005}]
[]
[null,"Add Extra Host Here (I)",null,"Network",null,null,null,"Line Connection",null,null,null,"Transformation Connection",null,null,null,"Total Line"]
[]
[null,"Month",null,"Units Billed","Rate","Amount",null,"Units Billed","Rate","Amount",null,"Units Billed","Rate","Amount",null,"Amount"]
[]
[null,"January",null,{"$f":"'13. RTSR-Historic Wholesale'!D57","v":0},{"$f":"'12. RTSR-UTRs & Sub-Tx'!I44","v":0},{"$f":"D58*E58","v":0},null,{"$f":"'13. RTSR-Historic Wholesale'!H57","v":0},{"$f":"'12. RTSR-UTRs & Sub-Tx'!I46","v":0},{"$f":"H58*I58","v":0},null,{"$f":"'13. RTSR-Historic Wholesale'!L57","v":0},{"$f":"'12. RTSR-UTRs & Sub-Tx'!I48","v":0},{"$f":"L58*M58","v":0},null,{"$f":"J58+N58","v":0}]
[null,"February",null,{"$f":"'13. RTSR-Historic Wholesale'!D58","v":0},{"$f":"E58","v":0},0,null,{"$f":"'13. RTSR-Historic Wholesale'!H58","v":0},{"$f":"I58","v":0},0,null,{"$f":"'13. RTSR-Historic Wholesale'!L58","v":0},{"$f":"M58","v":0},0,null,0]
[null,"March",null,{"$f":"'13. RTSR-Historic Wholesale'!D59","v":0},0,0,null,{"$f":"'13. RTSR-Historic Wholesale'!H59","v":0},0,0,null,{"$f":"'13. RTSR-Historic Wholesale'!L59","v":0},0,0,null,0]
[null,"April",null,{"$f":"'13. RTSR-Historic Wholesale'!D60","v":0},0,0,null,{"$f":"'13. RTSR-Historic Wholesale'!H60","v":0},0,0,null,{"$f":"'13. RTSR-Historic Wholesale'!L60","v":0},0,0,null,0]
[null,"May",null,{"$f":"'13. RTSR-Historic Wholesale'!D61","v":0},0,0,null,{"$f":"'13. RTSR-Historic Wholesale'!H61","v":0},0,0,null,{"$f":"'13. RTSR-Historic Wholesale'!L61","v":0},0,0,null,0]
[null,"June",null,{"$f":"'13. RTSR-Historic Wholesale'!D62","v":0},0,0,null,{"$f":"'13. RTSR-Historic Wholesale'!H62","v":0},0,0,null,{"$f":"'13. RTSR-Historic Wholesale'!L62","v":0},0,0,null,0]
[null,"July",null,{"$f":"'13. RTSR-Historic Wholesale'!D63","v":0},0,0,null,{"$f":"'13. RTSR-Historic Wholesale'!H63","v":0},0,0,null,{"$f":"'13. RTSR-Historic Wholesale'!L63","v":0},0,0,null,0]
[null,"August",null,{"$f":"'13. RTSR-Historic Wholesale'!D64","v":0},0,0,null,{"$f":"'13. RTSR-Historic Wholesale'!H64","v":0},0,0,null,{"$f":"'13. RTSR-Historic Wholesale'!L64","v":0},0,0,null,0]
[null,"September",null,{"$f":"'13. RTSR-Historic Wholesale'!D65","v":0},0,0,null,{"$f":"'13. RTSR-Historic Wholesale'!H65","v":0},0,0,null,{"$f":"'13. RTSR-Historic Wholesale'!L65","v":0},0,0,null,0]
[null,"October",null,{"$f":"'13. RTSR-Historic Wholesale'!D66","v":0},0,0,null,{"$f":"'13. RTSR-Historic Wholesale'!H66","v":0},0,0,null,{"$f":"'13. RTSR-Historic Wholesale'!L66","v":0},0,0,null,0]
[null,"November",null,{"$f":"'13. RTSR-Historic Wholesale'!D67","v":0},0,0,null,{"$f":"'13. RTSR-Historic Wholesale'!H67","v":0},0,0,null,{"$f":"'13. RTSR-Historic Wholesale'!L67","v":0},0,0,null,0]
[null,"December",null,{"$f":"'13. RTSR-Historic Wholesale'!D68","v":0},0,0,null,{"$f":"'13. RTSR-Historic Wholesale'!H68","v":0},0,0,null,{"$f":"'13. RTSR-Historic Wholesale'!L68","v":0},0,0,null,0]
[]
[null,"Total",null,{"$f":"SUM(D58:D69)","v":0},{"$f":"IF(D71<>0,F71/D71,0)","v":0},{"$f":"SUM(F58:F69)","v":0},null,{"$f":"SUM(H58:H69)","v":0},{"$f":"IF(H71<>0,J71/H71,0)","v":0},{"$f":"SUM(J58:J69)","v":0},null,{"$f":"SUM(L58:L69)","v":0},{"$f":"IF(L71<>0,N71/L71,0)","v":0},{"$f":"SUM(N58:N69)","v":0},null,{"$f":"SUM(P58:P69)","v":0}]
[]
[null,"Add Extra Host Here (II)",null,"Network",null,null,null,"Line Connection",null,null,null,"Transformation Connection",null,null,null,"Total Line"]
[]
[null,"Month",null,"Units Billed","Rate","Amount",null,"Units Billed","Rate","Amount",null,"Units Billed","Rate","Amount",null,"Amount"]
[]
[null,"January",null,{"$f":"'13. RTSR-Historic Wholesale'!D76","v":0},{"$f":"'12. RTSR-UTRs & Sub-Tx'!I59","v":0},{"$f":"D77*E77","v":0},null,{"$f":"'13. RTSR-Historic Wholesale'!H76","v":0},{"$f":"'12. RTSR-UTRs & Sub-Tx'!I61","v":0},{"$f":"H77*I77","v":0},null,{"$f":"'13. RTSR-Historic Wholesale'!L76","v":0},{"$f":"'12. RTSR-UTRs & Sub-Tx'!I63","v":0},{"$f":"L77*M77","v":0},null,{"$f":"J77+N77","v":0}]
[null,"February",null,{"$f":"'13. RTSR-Historic Wholesale'!D77","v":0},{"$f":"E77","v":0},0,null,{"$f":"'13. RTSR-Historic Wholesale'!H77","v":0},{"$f":"I77","v":0},0,null,{"$f":"'13. RTSR-Historic Wholesale'!L77","v":0},{"$f":"M77","v":0},0,null,0]
[null,"March",null,{"$f":"'13. RTSR-Historic Wholesale'!D78","v":0},0,0,null,{"$f":"'13. RTSR-Historic Wholesale'!H78","v":0},0,0,null,{"$f":"'13. RTSR-Historic Wholesale'!L78","v":0},0,0,null,0]
[null,"April",null,{"$f":"'13. RTSR-Historic Wholesale'!D79","v":0},0,0,null,{"$f":"'13. RTSR-Historic Wholesale'!H79","v":0},0,0,null,{"$f":"'13. RTSR-Historic Wholesale'!L79","v":0},0,0,null,0]
[null,"May",null,{"$f":"'13. RTSR-Historic Wholesale'!D80","v":0},0,0,null,{"$f":"'13. RTSR-Historic Wholesale'!H80","v":0},0,0,null,{"$f":"'13. RTSR-Historic Wholesale'!L80","v":0},0,0,null,0]
[null,"June",null,{"$f":"'13. RTSR-Historic Wholesale'!D81","v":0},0,0,null,{"$f":"'13. RTSR-Historic Wholesale'!H81","v":0},0,0,null,{"$f":"'13. RTSR-Historic Wholesale'!L81","v":0},0,0,null,0]
[null,"July",null,{"$f":"'13. RTSR-Historic Wholesale'!D82","v":0},0,0,null,{"$f":"'13. RTSR-Historic Wholesale'!H82","v":0},0,0,null,{"$f":"'13. RTSR-Historic Wholesale'!L82","v":0},0,0,null,0]
[null,"August",null,{"$f":"'13. RTSR-Historic Wholesale'!D83","v":0},0,0,null,{"$f":"'13. RTSR-Historic Wholesale'!H83","v":0},0,0,null,{"$f":"'13. RTSR-Historic Wholesale'!L83","v":0},0,0,null,0]
[null,"September",null,{"$f":"'13. RTSR-Historic Wholesale'!D84","v":0},0,0,null,{"$f":"'13. RTSR-Historic Wholesale'!H84","v":0},0,0,null,{"$f":"'13. RTSR-Historic Wholesale'!L84","v":0},0,0,null,0]
[null,"October",null,{"$f":"'13. RTSR-Historic Wholesale'!D85","v":0},0,0,null,{"$f":"'13. RTSR-Historic Wholesale'!H85","v":0},0,0,null,{"$f":"'13. RTSR-Historic Wholesale'!L85","v":0},0,0,null,0]
[null,"November",null,{"$f":"'13. RTSR-Historic Wholesale'!D86","v":0},0,0,null,{"$f":"'13. RTSR-Historic Wholesale'!H86","v":0},0,0,null,{"$f":"'13. RTSR-Historic Wholesale'!L86","v":0},0,0,null,0]
[null,"December",null,{"$f":"'13. RTSR-Historic Wholesale'!D87","v":0},0,0,null,{"$f":"'13. RTSR-Historic Wholesale'!H87","v":0},0,0,null,{"$f":"'13. RTSR-Historic Wholesale'!L87","v":0},0,0,null,0]
[null,null,null,null,null,null,null,null,null,null,null,{"$f":"'13. RTSR-Historic Wholesale'!L88","v":0}]
[null,"Total",null,{"$f":"SUM(D77:D88)","v":0},{"$f":"IF(D90<>0,F90/D90,0)","v":0},{"$f":"SUM(F77:F88)","v":0},null,{"$f":"SUM(H77:H88)","v":0},{"$f":"IF(H90<>0,J90/H90,0)","v":0},{"$f":"SUM(J77:J88)","v":0},null,{"$f":"SUM(L77:L88)","v":0},{"$f":"IF(L90<>0,N90/L90,0)","v":0},{"$f":"SUM(N77:N88)","v":0},null,{"$f":"SUM(P77:P88)","v":0}]
[]
[null,"Total",null,"Network",null,null,null,"Line Connection",null,null,null,"Transformation Connection",null,null,null,"Total Line"]
[]
[null,"Month",null,"Units Billed","Rate","Amount",null,"Units Billed","Rate","Amount",null,"Units Billed","Rate","Amount",null,"Amount"]
[]
[null,"January",null,{"$f":"D20+D39+D58+D77","v":1126157.1097614425},{"$f":"IF(D96<>0,F96/D96,0)","v":3.6160572931627963},{"$f":"F20+F39+F58+F77","v":4072248.63},null,{"$f":"H20+H39+H58+H77","v":1642283.9092088197},{"$f":"IF(H96<>0,J96/H96,0)","v":0.86967543918034851},{"$f":"J20+J39+J58+J77","v":1428253.98},null,{"$f":"L20+L39+L58+L77","v":1110855.4874521238},{"$f":"IF(L96<>0,N96/L96,0)","v":2.181505837053753},{"$f":"N20+N39+N58+N77","v":2423337.73},null,{"$f":"J96+N96","v":3851591.71}]
[null,"February",null,{"$f":"D21+D40+D59+D78","v":1065045.2487007703},3.6213160752605784,{"$f":"F21+F40+F59+F78","v":3856865.4800000004},null,{"$f":"H21+H40+H59+H78","v":1499500.7289234761},0.87585005106524594,{"$f":"J21+J40+J59+J78","v":1313337.79},null,{"$f":"L21+L40+L59+L78","v":1058377.8491968217},2.1894142925973843,{"$f":"N21+N40+N59+N78","v":2317227.5900000003},null,3630565.3800000004]
[null,"March",null,1020478.3004195103,3.6238652291574951,3698075.83,null,1427252.5525291828,0.87727094113877846,1252087.19,null,1017407.8593723204,2.1909834777325545,2229123.81,null,3481211]
[null,"April",null,1009607.7672030556,3.6143826925076334,3649108.84,null,1559117.0898218309,0.8682862391499353,1353759.9143157895,null,1043367.8790900977,2.179523962917604,2274045.2946153851,null,3627805.2089311746]
[null,"May",null,1274798.8002629767,3.6174893944430173,4611571.1400000006,null,1823581.7470817119,0.87324685748164876,1592437.0299999998,null,1261623.7975761732,2.1871609550337427,2759374.31,null,4351811.34]
[null,"June",null,1301162.5784860058,3.6286986792179565,4721526.93,null,1967291.3385214007,0.8736574071900246,1718738.65,null,1365983.6057851713,2.1873305194483437,2987857.63,null,4706596.2799999993]
[null,"July",null,1430346.8345198384,3.6371321836758428,5202360.5056509692,null,2092195.324144993,0.87257961569185638,1825606.9918947369,null,1449160.6783878389,2.1830299081891344,3163561.1026923079,null,4989168.0945870448]
[null,"August",null,1339755.7435122628,3.6317565486536147,4865666.6950969528,null,1999603.0688784218,0.87059276899790761,1740839.972631579,null,1359532.0029550283,2.1832832342378667,2968243.4284615391,null,4709083.4010931179]
[null,"September",null,1421942.0201898143,3.6349859306889716,5168739.2376454286,null,2076136.0461328421,0.87272643119197191,1811898.8022105263,null,1431730.7589783168,2.1863378061195013,3130247.086538462,null,4942145.8887489885]
[null,"October",null,1080951.2071880284,3.6091633683900173,3901329.5,null,1599837.4986961568,0.87025394298051884,1392264.891368421,null,1086435.7348873615,2.1823248543724407,2370955.7069230769,null,3763220.5982914977]
[null,"November",null,1063726.4302974001,3.6213957390187823,3852174.3621606645,null,1483585.0074680867,0.87478952430387491,1297824.6229473683,null,1039338.8661479244,2.1880190258735857,2274093.2134615388,null,3571917.8364089071]
[null,"December",null,1037011.2315474498,3.6217774924795338,3755823.9378670361,null,1490229.4143354497,0.87692704206791661,1306822.4723157897,null,1052365.1090905229,2.1909242294832696,2305652.2157692309,null,3612474.6880850205]
[]
[null,"Total",null,{"$f":"SUM(D96:D107)","v":14170983.272088557},{"$f":"IF(D109<>0,F109/D109,0)","v":3.6239892534184146},{"$f":"SUM(F96:F107)","v":51355491.088421054},null,{"$f":"SUM(H96:H107)","v":20660613.72574237},{"$f":"IF(H109<>0,J109/H109,0)","v":0.87286237219636231},{"$f":"SUM(J96:J107)","v":18033872.307684209},null,{"$f":"SUM(L96:L107)","v":14276179.628919702},{"$f":"IF(L109<>0,N109/L109,0)","v":2.1857191440244415},{"$f":"SUM(N96:N107)","v":31203719.118461542},null,{"$f":"SUM(P96:P107)","v":49237591.42614574}]
[]
[null,null,null,null,null,null,null,null,null,null,null,null,null,"Low Voltage Switchgear Credit (if applicable)",null,{"$f":"'12. RTSR-UTRs & Sub-Tx'!I68","v":0}]
[]
[null,null,null,null,null,null,null,null,null,null,null,null,null,"Total including deduction for Low Voltage Switchgear Credit",null,{"$f":"P109+P111","v":49237591.42614574}]

{"sheet":"16. RTSR-Rates to Forecast","index":20,"n_rows":76,"n_cols":11,"rows_kept":76,"cut":false,"hidden":false,"merged":[[1,1,8,2]]}
["Back to Index"]
[null,{"$f":"+'1. Information Sheet'!B2","v":"INCENTIVE REGULATION MODEL FOR 2020 FILERS"}]
[]
[]
[]
[]
[]
[]
[]
[]
[]
[]
[null,"The purpose of this table is to re-align the current RTS Network Rates to recover current wholesale network costs."]
[]
[null,"Rate Class","Rate Description","Unit","Current RTSR-Network","Loss Adjusted Billed kWh","Billed kW","Billed Amount","Billed Amount %","Current Wholesale Billing","Adjusted RTSR Network"]
[]
[{"$f":"'11. RTSR - Current Rates'!A16","v":"R_TN"},{"$f":"'11. RTSR - Current Rates'!B16","v":"RESIDENTIAL SERVICE CLASSIFICATION"},{"$f":"IFERROR(VLOOKUP(A17,RTSR,3,FALSE),\"\")","v":"Retail Transmission Rate – Network Service Rate"},{"$f":"IFERROR(VLOOKUP(A17,RTSR,4,FALSE),\"\")","v":"$/kWh"},{"$f":"IFERROR(VLOOKUP(A17,_xlnm.DATABASE,8,FALSE),0)","v":7.6E-3},{"$f":"IF(D17=\"$/kWh\",IFERROR(VLOOKUP(A17,RTSR,9,FALSE),0),\"\")","v":1490532667.2805483},{"$f":"IFERROR(VLOOKUP(A17,RTSR,7,FALSE),0)","v":0},{"$f":"IF(G17=0,IF(ISERROR(E17*F17),0,ROUND(E17*F17,2)),IF(ISERROR(E17*G17),0,ROUND(E17*G17,2)))","v":11328048.27},{"$f":"IFERROR(H17/SUM(H$17:H$24),\"\")","v":0.23126166285282262},{"$f":"IFERROR(I17*total_wholesale_TN,\"\")","v":11876556.265731568},{"$f":"IF(G17=0,IF(ISERROR(J17/F17),0,J17/F17),IF(ISERROR(J17/G17),0,J17/G17))","v":7.9679946145696651E-3}]
[{"$f":"'11. RTSR - Current Rates'!A17","v":"GSL_TN"},{"$f":"'11. RTSR - Current Rates'!B17","v":"GENERAL SERVICE LESS THAN 50 kW SERVICE CLASSIFICATION"},"Retail Transmission Rate – Network Service Rate","$/kWh",7.1000000000000004E-3,685616683.99168408,0,{"$f":"IF(G18=0,IF(ISERROR(E18*F18),0,ROUND(E18*F18,2)),IF(ISERROR(E18*G18),0,ROUND(E18*G18,2)))","v":4867878.46},{"$f":"IFERROR(H18/SUM(H$17:H$24),\"\")","v":9.9377548576162392E-2},5103582.8102922384,{"$f":"IF(G18=0,IF(ISERROR(J18/F18),0,J18/F18),IF(ISERROR(J18/G18),0,J18/G18))","v":7.4437844490291612E-3}]
[{"$f":"'11. RTSR - Current Rates'!A18","v":"GS50_499_TN"},{"$f":"'11. RTSR - Current Rates'!B18","v":"GENERAL SERVICE 50 to 499 kW SERVICE CLASSIFICATION"},"Retail Transmission Rate – Network Service Rate","$/kW",2.7288999999999999,"",5710412.0095022377,15583143.33,0.31812926225902033,16337684.492909083,2.8610342766376324]
[{"$f":"'11. RTSR - Current Rates'!A19","v":"GS500_TN"},{"$f":"'11. RTSR - Current Rates'!B19","v":"GENERAL SERVICE 500 to 4,999 kW SERVICE CLASSIFICATION"},"Retail Transmission Rate – Network Service Rate","$/kW",2.6402000000000001,"",4585777.2030871157,12107368.970000001,0.247171464495787,12693611.942225371,2.7680393922496087]
[{"$f":"'11. RTSR - Current Rates'!A20","v":"LU_TN"},{"$f":"'11. RTSR - Current Rates'!B20","v":"LARGE USE SERVICE CLASSIFICATION"},"Retail Transmission Rate – Network Service Rate","$/kW",2.8174000000000001,"",1753163,4939361.4400000004,0.10083687082007045,5178527.020784393,2.9538194798683253]
[{"$f":"'11. RTSR - Current Rates'!A21","v":"SB"},{"$f":"'11. RTSR - Current Rates'!B21","v":"STANDBY POWER SERVICE CLASSIFICATION "},null,null,0,"",0,0,0,0,0]
[{"$f":"'11. RTSR - Current Rates'!A22","v":"USL_TN"},{"$f":"'11. RTSR - Current Rates'!B22","v":"UNMETERED SCATTERED LOAD SERVICE CLASSIFICATION"},"Retail Transmission Rate – Network Service Rate","$/kWh",7.1000000000000004E-3,11437642.31264231,0,81207.259999999995,1.6578430401869666E-3,85139.343476322625,7.4437844049569544E-3]
[{"$f":"'11. RTSR - Current Rates'!A23","v":"SL_TN"},{"$f":"'11. RTSR - Current Rates'!B23","v":"STREET LIGHTING SERVICE CLASSIFICATION"},"Retail Transmission Rate – Network Service Rate","$/kW",1.8898999999999999,"",40571.730013897963,76676.509999999995,1.5653479559503221E-3,80389.213002084885,1.9814095424214675]
[{"$f":"'11. RTSR - Current Rates'!A24","v":0},{"$f":"'11. RTSR - Current Rates'!B24","v":0},"",""]
[]
[]
[]
[]
[]
[]
[null,"The purpose of this table is to re-align the current RTS Connection Rates to recover current wholesale connection costs."]
[null,"Rate Class","Rate Description","Unit","Current RTSR-Connection","Loss Adjusted Billed kWh","Billed kW","Billed Amount","Billed Amount %","Current Wholesale Billing","Adjusted RTSR-Connection"]
[]
[{"$f":"'11. RTSR - Current Rates'!A29","v":"R_TC"},{"$f":"'11. RTSR - Current Rates'!B29","v":"RESIDENTIAL SERVICE CLASSIFICATION"},{"$f":"IFERROR(VLOOKUP(A35,RTSR,3,FALSE),\"\")","v":"Retail Transmission Rate – Line and Transformation Connection Service Rate"},{"$f":"IFERROR(VLOOKUP(A35,RTSR,4,FALSE),\"\")","v":"$/kWh"},{"$f":"IFERROR(VLOOKUP(A35,_xlnm.DATABASE,8,FALSE),0)","v":7.3000000000000001E-3},{"$f":"IF(D35=\"$/kWh\",IFERROR(VLOOKUP(A35,RTSR,9,FALSE),0),\"\")","v":1490532667.2805483},{"$f":"IFERROR(VLOOKUP(A35,RTSR,7,FALSE),0)","v":0},{"$f":"IF(G35=0,IF(ISERROR(E35*F35),0,ROUND(E35*F35,2)),IF(ISERROR(E35*G35),0,ROUND(E35*G35,2)))","v":10880888.470000001},{"$f":"IFERROR(H35/SUM(H$35:H$42),\"\")","v":0.23309077752518093},{"$f":"IFERROR(I35*total_wholesale_LinePlus,\"\")","v":11476828.468987493},{"$f":"IF(G35=0,IF(ISERROR(J35/F35),0,J35/F35),IF(ISERROR(J35/G35),0,J35/G35))","v":7.6998167976598409E-3}]
[{"$f":"'11. RTSR - Current Rates'!A30","v":"GSL_TC"},{"$f":"'11. RTSR - Current Rates'!B30","v":"GENERAL SERVICE LESS THAN 50 kW SERVICE CLASSIFICATION"},"Retail Transmission Rate – Line and Transformation Connection Service Rate","$/kWh",6.4999999999999997E-3,685616683.99168408,0,{"$f":"IF(G36=0,IF(ISERROR(E36*F36),0,ROUND(E36*F36,2)),IF(ISERROR(E36*G36),0,ROUND(E36*G36,2)))","v":4456508.45},{"$f":"IFERROR(H36/SUM(H$35:H$42),\"\")","v":9.5467481586826608E-2},4700588.8528552605,6.8560012651504767E-3]
[{"$f":"'11. RTSR - Current Rates'!A31","v":"GS50_499_TC"},{"$f":"'11. RTSR - Current Rates'!B31","v":"GENERAL SERVICE 50 to 499 kW SERVICE CLASSIFICATION"},"Retail Transmission Rate – Line and Transformation Connection Service Rate","$/kW",2.5929000000000002,"",5710412.0095022377,14806527.300000001,0.31718595134215338,15617472.27829829,2.7349116407556076]
[{"$f":"'11. RTSR - Current Rates'!A32","v":"GS500_TC"},{"$f":"'11. RTSR - Current Rates'!B32","v":"GENERAL SERVICE 500 to 4,999 kW SERVICE CLASSIFICATION"},"Retail Transmission Rate – Line and Transformation Connection Service Rate ","$/kW",2.5373000000000001,"",4585777.2030871157,11635492.5,0.2492559317367409,12272761.727396922,2.6762664612521903]
[{"$f":"'11. RTSR - Current Rates'!A33","v":"LU_TC"},{"$f":"'11. RTSR - Current Rates'!B33","v":"LARGE USE SERVICE CLASSIFICATION"},"Retail Transmission Rate – Line and Transformation Connection Service Rate ","$/kW",2.71,"",1753163,4751071.7300000004,0.10177762658600309,5011285.1941644484,2.8584251402547558]
[{"$f":"'11. RTSR - Current Rates'!A34","v":"SB"},{"$f":"'11. RTSR - Current Rates'!B34","v":"STANDBY POWER SERVICE CLASSIFICATION "},null,null,0,"",0,0,0,0,0]
[{"$f":"'11. RTSR - Current Rates'!A35","v":"USL_TC"},{"$f":"'11. RTSR - Current Rates'!B35","v":"UNMETERED SCATTERED LOAD SERVICE CLASSIFICATION"},"Retail Transmission Rate – Line and Transformation Connection Service Rate","$/kWh",6.4999999999999997E-3,11437642.31264231,0,74344.679999999993,1.5926143636008398E-3,78416.495334389256,6.856001717042118E-3]
[{"$f":"'11. RTSR - Current Rates'!A36","v":"SL_TC"},{"$f":"'11. RTSR - Current Rates'!B36","v":"STREET LIGHTING SERVICE CLASSIFICATION"},"Retail Transmission Rate – Line and Transformation Connection Service Rate","$/kW",1.875,"",40571.730013897963,76071.990000000005,1.6296168594941759E-3,80238.409108932974,1.9776925726718353]
[{"$f":"'11. RTSR - Current Rates'!A37","v":0},{"$f":"'11. RTSR - Current Rates'!B37","v":0},"",""]
[]
[]
[]
[]
[]
[null,"The purpose of this table is to update the re-aligned RTS Network Rates to recover future wholesale network costs."]
[null,"Rate Class","Rate Description","Unit","Adjusted RTSR-Network","Loss Adjusted Billed kWh","Billed kW","Billed Amount","Billed Amount %","Current Wholesale Billing","Proposed RTSR-Network"]
[]
[{"$f":"A17","v":"R_TN"},{"$f":"B17","v":"RESIDENTIAL SERVICE CLASSIFICATION"},{"$f":"IFERROR(VLOOKUP(A52,RTSR,3,FALSE),\"\")","v":"Retail Transmission Rate – Network Service Rate"},{"$f":"IFERROR(VLOOKUP(A52,RTSR,4,FALSE),\"\")","v":"$/kWh"},{"$f":"K17","v":7.9679946145696651E-3},{"$f":"IF(D52=\"$/kWh\",IFERROR(VLOOKUP(A52,RTSR,9,FALSE),0),\"\")","v":1490532667.2805483},{"$f":"IFERROR(VLOOKUP(A52,RTSR,7,FALSE),0)","v":0},{"$f":"IF(G52=0,IF(ISERROR(E52*F52),0,ROUND(E52*F52,2)),IF(ISERROR(E52*G52),0,ROUND(E52*G52,2)))","v":11876556.27},{"$f":"IFERROR(H52/SUM(H$52:H$59),\"\")","v":0.23126166297385931},{"$f":"IFERROR(I52*forecast_wholesale_TN,\"\")","v":11876556.271947464},{"$f":"IF(G52=0,IF(ISERROR(J52/F52),0,J52/F52),IF(ISERROR(J52/G52),0,J52/G52))","v":7.967994618739916E-3}]
[{"$f":"A18","v":"GSL_TN"},"GENERAL SERVICE LESS THAN 50 kW SERVICE CLASSIFICATION","Retail Transmission Rate – Network Service Rate","$/kWh",{"$f":"K18","v":7.4437844490291612E-3},685616683.99168408,0,{"$f":"IF(G53=0,IF(ISERROR(E53*F53),0,ROUND(E53*F53,2)),IF(ISERROR(E53*G53),0,ROUND(E53*G53,2)))","v":5103582.8099999996},{"$f":"IFERROR(H53/SUM(H$52:H$59),\"\")","v":9.9377548586767381E-2},5103582.8108368628,{"$f":"IF(G53=0,IF(ISERROR(J53/F53),0,J53/F53),IF(ISERROR(J53/G53),0,J53/G53))","v":7.443784449823518E-3}]
[{"$f":"A19","v":"GS50_499_TN"},"GENERAL SERVICE 50 to 499 kW SERVICE CLASSIFICATION","Retail Transmission Rate – Network Service Rate","$/kW",2.8610342766376324,"",5710412.0095022377,16337684.49,0.3181292622545398,16337684.492678983,2.8610342765973376]
[{"$f":"A20","v":"GS500_TN"},"GENERAL SERVICE 500 to 4,999 kW SERVICE CLASSIFICATION","Retail Transmission Rate – Network Service Rate","$/kW",2.7680393922496087,"",4585777.2030871157,12693611.939999999,0.24717146449298441,12693611.942081442,2.7680393922182231]
[{"$f":"A21","v":"LU_TN"},"LARGE USE SERVICE CLASSIFICATION","Retail Transmission Rate – Network Service Rate","$/kW",2.9538194798683253,"",1753163,5178527.0199999996,0.10083687082133144,5178527.0208491515,2.9538194799052637]
[{"$f":"A22","v":"SB"},"STANDBY POWER SERVICE CLASSIFICATION ",null,null,0,"",0,0,0,0,0]
[{"$f":"A23","v":"USL_TN"},"UNMETERED SCATTERED LOAD SERVICE CLASSIFICATION","Retail Transmission Rate – Network Service Rate","$/kWh",7.4437844049569544E-3,11437642.31264231,0,85139.34,1.6578429727674602E-3,85139.340013960769,7.4437841022405591E-3]
[{"$f":"A24","v":"SL_TN"},"STREET LIGHTING SERVICE CLASSIFICATION","Retail Transmission Rate – Network Service Rate","$/kW",1.9814095424214675,"",40571.730013897963,80389.210000000006,1.5653478977500608E-3,80389.210013181888,1.9814094687518706]
[{"$f":"A25","v":0},0,"",""]
[]
[]
[]
[]
[null,"The purpose of this table is to update the re-aligned RTS Connection Rates to recover future wholesale connection costs."]
[null,"Rate Class","Rate Description","Unit","Adjusted RTSR-Connection","Loss Adjusted Billed kWh","Billed kW","Billed Amount","Billed Amount %","Current Wholesale Billing","Proposed RTSR-Connection"]
[]
[{"$f":"A35","v":"R_TC"},{"$f":"B35","v":"RESIDENTIAL SERVICE CLASSIFICATION"},{"$f":"IFERROR(VLOOKUP(A68,RTSR,3,FALSE),\"\")","v":"Retail Transmission Rate – Line and Transformation Connection Service Rate"},{"$f":"IFERROR(VLOOKUP(A68,RTSR,4,FALSE),\"\")","v":"$/kWh"},{"$f":"K35","v":7.6998167976598409E-3},{"$f":"IF(D68=\"$/kWh\",IFERROR(VLOOKUP(A68,RTSR,9,FALSE),0),\"\")","v":1490532667.2805483},{"$f":"IFERROR(VLOOKUP(A68,RTSR,7,FALSE),0)","v":0},{"$f":"IF(G68=0,IF(ISERROR(E68*F68),0,ROUND(E68*F68,2)),IF(ISERROR(E68*G68),0,ROUND(E68*G68,2)))","v":11476828.470000001},{"$f":"IFERROR(H68/SUM(H$68:H$75),\"\")","v":0.23309077752749863},{"$f":"IFERROR(I68*forecast_wholesale_LNPlus,\"\")","v":11476828.46910161},{"$f":"IF(G68=0,IF(ISERROR(J68/F68),0,J68/F68),IF(ISERROR(J68/G68),0,J68/G68))","v":7.6998167977364021E-3}]
[{"$f":"A36","v":"GSL_TC"},"GENERAL SERVICE LESS THAN 50 kW SERVICE CLASSIFICATION","Retail Transmission Rate – Line and Transformation Connection Service Rate","$/kWh",{"$f":"K36","v":6.8560012651504767E-3},685616683.99168408,0,{"$f":"IF(G69=0,IF(ISERROR(E69*F69),0,ROUND(E69*F69,2)),IF(ISERROR(E69*G69),0,ROUND(E69*G69,2)))","v":4700588.8499999996},{"$f":"IFERROR(H69/SUM(H$68:H$75),\"\")","v":9.5467481521364098E-2},4700588.8496320434,6.8560012604492824E-3]
[{"$f":"A37","v":"GS50_499_TC"},"GENERAL SERVICE 50 to 499 kW SERVICE CLASSIFICATION","Retail Transmission Rate – Line and Transformation Connection Service Rate","$/kW",2.7349116407556076,"",5710412.0095022377,15617472.279999999,0.31718595135188565,15617472.278777486,2.7349116408395235]
[{"$f":"A38","v":"GS500_TC"},"GENERAL SERVICE 500 to 4,999 kW SERVICE CLASSIFICATION","Retail Transmission Rate – Line and Transformation Connection Service Rate ","$/kW",2.6762664612521903,"",4585777.2030871157,12272761.73,0.24925593177009719,12272761.729039306,2.6762664616103375]
[{"$f":"A39","v":"LU_TC"},"LARGE USE SERVICE CLASSIFICATION","Retail Transmission Rate – Line and Transformation Connection Service Rate ","$/kW",2.8584251402547558,"",1753163,5011285.1900000004,0.10177762649345744,5011285.1896077236,2.8584251376556109]
[{"$f":"A40","v":"SB"},"STANDBY POWER SERVICE CLASSIFICATION ",null,null,0,"",0,0,0,0,0]
[{"$f":"A41","v":"USL_TC"},"UNMETERED SCATTERED LOAD SERVICE CLASSIFICATION","Retail Transmission Rate – Line and Transformation Connection Service Rate","$/kWh",6.856001717042118E-3,11437642.31264231,0,78416.5,1.5926144582332591E-3,78416.499993861653,6.8560021244226136E-3]
[{"$f":"A42","v":"SL_TC"},"STREET LIGHTING SERVICE CLASSIFICATION","Retail Transmission Rate – Line and Transformation Connection Service Rate","$/kW",1.9776925726718353,"",40571.730013897963,80238.41,1.6296168774639027E-3,80238.409993719048,1.9776925944797805]
[{"$f":"A43","v":0},0,"",""]

{"sheet":"17. Rev2Cost-GDPIPI","index":21,"n_rows":39,"n_cols":31,"rows_kept":39,"cut":false,"hidden":false,"merged":[[10,2,10,9],[1,2,8,7],[36,2,36,6]]}
["Back to Index",null,null,null,null,null,null,null,null,null,null,null,null,null,null,null,null,null,null,null,null,null,null,null,null,null,false,0,null,null,"NO"]
[null,null,{"$f":"+'1. Information Sheet'!B2","v":"INCENTIVE REGULATION MODEL FOR 2020 FILERS"},null,null,null,null,null,null,null,null,null,null,null,null,null,null,null,true]
[]
[]
[]
[]
[]
[]
[]
[]
[null,null,"If applicable, please enter any adjustments related to the revenue to cost ratio model into columns C and E.  The Price Escalator and Stretch Factor have been set at the 2016 values and will be updated by OEB staff at a later date. "]
[null,null,"Price Escalator",1.4999999999999999E-2,"Productivity Factor",0,"# of Residential Customers\n(approved in the last CoS)\n",176865,"Effective Year of Residential Rate Design Transition (yyyy)",2016]
[null,null,"Choose Stretch Factor Group","III","Price Cap Index",{"$f":"D12-F12-D14","v":1.2E-2},"Billed kWh for Residential Class\n(approved in the last CoS)",1423857475,"OEB-approved # of Transition Years",4]
[null,null,"Associated Stretch Factor Value",{"$f":"IF(D13=\"I\", 0%, IF(D13=\"II\", 0.15%, IF(D13=\"III\", 0.3%, IF(D13=\"IV\", 0.45%, 0.6%))))","v":3.0000000000000001E-3},null,null,"Rate Design Transition Years Left",0]
[null,null,"Rate Class","Current MFC","MFC Adjustment from R/C Model","Current  Volumetric Charge","DVR Adjustment from R/C Model","Price Cap Index to be Applied to MFC and DVR","Proposed MFC","Proposed Volumetric Charge"]
[]
["R_F","R_V",{"$f":"'4. Billing Det. for Def-Var'!B17","v":"RESIDENTIAL SERVICE CLASSIFICATION"},{"$f":"IFERROR(VLOOKUP(A17,_xlnm.DATABASE,8,FALSE),\"\")","v":24.25},null,{"$f":"IFERROR(VLOOKUP(B17,_xlnm.DATABASE,8,FALSE),\"\")","v":0},null,{"$f":"F$13","v":1.2E-2},{"$f":"IFERROR(ROUND(J32*(1+F13),2),0)","v":24.54},{"$f":"IFERROR(ROUND(J33*(1+F13),4),0)","v":0}]
["GSL_F","GSL_V",{"$f":"'4. Billing Det. for Def-Var'!B18","v":"GENERAL SERVICE LESS THAN 50 kW SERVICE CLASSIFICATION"},44.52,null,1.2999999999999999E-2,null,{"$f":"F$13","v":1.2E-2},{"$f":"IFERROR(ROUND((D18+E18)*(1+F$13),2),0)","v":45.05},{"$f":"IFERROR((F18+G18)*(1+F$13),0)","v":1.3155999999999999E-2}]
["GS50_499_F","GS50_499_V",{"$f":"'4. Billing Det. for Def-Var'!B19","v":"GENERAL SERVICE 50 to 499 kW SERVICE CLASSIFICATION"},78.41,null,4.7188999999999997,null,1.2E-2,79.349999999999994,{"$f":"IFERROR((F19+G19)*(1+F$13),0)","v":4.7755267999999997}]
["GS500_F","GS500_V",{"$f":"'4. Billing Det. for Def-Var'!B20","v":"GENERAL SERVICE 500 to 4,999 kW SERVICE CLASSIFICATION"},1785.59,null,2.4281999999999999,null,1.2E-2,1807.02,{"$f":"IFERROR((F20+G20)*(1+F$13),0)","v":2.4573383999999998}]
["LU_F","LU_V",{"$f":"'4. Billing Det. for Def-Var'!B21","v":"LARGE USE SERVICE CLASSIFICATION"},14078.67,null,3.0139,null,1.2E-2,14247.61,{"$f":"IFERROR((F21+G21)*(1+F$13),0)","v":3.0500668000000002}]
[null,"SB_V",{"$f":"'4. Billing Det. for Def-Var'!B22","v":"STANDBY POWER SERVICE CLASSIFICATION "},"",null,"",null,1.2E-2,0,{"$f":"IFERROR((F22+G22)*(1+F$13),0)","v":0}]
["USL_F","USL_V",{"$f":"'4. Billing Det. for Def-Var'!B23","v":"UNMETERED SCATTERED LOAD SERVICE CLASSIFICATION"},9.19,null,1.67E-2,null,1.2E-2,9.3000000000000007,1.6900399999999999E-2]
["SL_F","SL_V",{"$f":"'4. Billing Det. for Def-Var'!B24","v":"STREET LIGHTING SERVICE CLASSIFICATION"},1.54,null,11.7902,null,1.2E-2,1.56,11.931682400000001]
["MF",null,"microFIT SERVICE CLASSIFICATION",5.4,null,"",null,1.2E-2,5.4,0]
[null,null,null,null,null,{"$f":"IFERROR(VLOOKUP(B27,RATES,4,FALSE),\"\")","v":""}]
[null,null,null,null,null,{"$f":"IFERROR(VLOOKUP(B28,RATES,4,FALSE),\"\")","v":""}]
[null,null,null,null,null,{"$f":"IFERROR(VLOOKUP(B29,RATES,4,FALSE),\"\")","v":""}]
[]
[]
[null,null,"Rate Design Transition",null,"Revenue from Rates","Current F/V Split","Decoupling MFC Split","Incremental Fixed Charge ($/month/year)","New F/V Split","Adjusted Rates1","Revenue at New F/V Split "]
[null,null,"Current Residential Fixed Rate (inclusive of R/C adj.)",{"$f":"D17+E17","v":24.25},{"$f":"D32*COS_RES_CUSTOMERS*12","v":51467715},{"$f":"IF(ISERROR(E32/E34), 0, E32/E34)","v":1},{"$f":"IF(ISERROR((1-F32)/YRS_LEFT), 0, (1-F32)/YRS_LEFT)","v":0},{"$f":"IF(ISERROR(ROUND(G32*E34/COS_RES_CUSTOMERS/12, 2)), 0, ROUND(G32*E34/COS_RES_CUSTOMERS/12, 2))","v":0},{"$f":"G32+F32","v":1},{"$f":"IF(ISERROR(ROUND(I32*E34/COS_RES_CUSTOMERS/12, 2)), 0, ROUND(I32*E34/COS_RES_CUSTOMERS/12, 2))","v":24.25},{"$f":"ROUND(J32*COS_RES_CUSTOMERS*12, 2)","v":51467715}]
[null,null,"Current Residential Variable Rate (inclusive of R/C adj.)",{"$f":"F17+G17","v":0},{"$f":"D33*COS_RES_KWH","v":0},{"$f":"IF(ISERROR(E33/E34), 0, E33/E34)","v":0},null,null,{"$f":"1-I32","v":0},{"$f":"IF(ISERROR(ROUND(I33*E34/COS_RES_KWH, 4)), 0, ROUND(I33*E34/COS_RES_KWH, 4))","v":0},{"$f":"ROUND(J33*COS_RES_KWH, 2)","v":0}]
[null,null,null,null,{"$f":"SUM(E32+E33)","v":51467715},null,null,null,null,null,{"$f":"SUM(K32+K33)","v":51467715}]
[]
[]
[null,null,{"$f":"IF((J32-D32)>=4, \"The Rate Design Transition has calculated a monthly fixed charge greater than or equal to $4.  Please refer to Section 3.2.3 of the Chapter 3 Filing Requirements for mitigation instructions.\", \"\")","v":""}]
[]
[null,null,"1 These are the residential rates to which the Price Cap Index will be applied to."]

{"sheet":"18. Regulatory Charges","index":22,"n_rows":35,"n_cols":5,"rows_kept":35,"cut":false,"hidden":false,"merged":[[23,3,23,4],[11,2,11,4],[1,1,8,6]]}
["Back to Index"]
[null,{"$f":"+'1. Information Sheet'!B2","v":"INCENTIVE REGULATION MODEL FOR 2020 FILERS"}]
[]
[]
[]
[]
[]
[]
[]
[]
[]
[null,null,"Update the following rates if an OEB Decision has been issued at the time of completing this application"]
[]
[null,null,"Regulatory Charges",null,"Proposed"]
[null,null,"Wholesale Market Service Rate (WMS) - not including CBR","$/kWh",3.0000000000000001E-3]
[null,null,"Capacity Based Recovery (CBR) - Applicable for Class B Customers ","$/kWh",4.0000000000000002E-4]
[null,"WMS","WMS unit rate","$/kWh",{"$f":"SUM(E15:E16)","v":3.4000000000000002E-3}]
[null,"RRA","Rural or Remote Electricity Rate Protection Charge (RRRP)","$/kWh",5.0000000000000001E-4]
[null,null,"Standard Supply Service - Administrative Charge (if applicable)","$",0.25]
[null,null,"Ontario Electricity Support Program (OESP)","$/kWh",0]
[]
[]
[null,null,"Time-of-Use RPP Prices"]
[null,null,"As of ","2019-05-01"]
[null,"OFF","Off-Peak","$/kWh",6.5000000000000002E-2]
[null,"MID","Mid-Peak","$/kWh",9.4E-2]
[null,"ON","On-Peak","$/kWh",0.13400000000000001]
[]
[]
[null,null,"Average IESO Wholesale Market Price"]
[null,"IESO","February 2019 IESO Market Summary Report","$/kWh",0.11210000000000001]
[]
[]
[null,null,"Smart Meter Entity Charge (SME)"]
[null,null,"Smart Meter Entity Charge (SME)","$",0.56999999999999995]

{"sheet":"19. Additional Rates","index":23,"n_rows":108,"n_cols":28,"rows_kept":108,"cut":false,"hidden":false,"merged":[[10,1,10,6],[1,1,8,6]]}
[null,"Back to Index",null,null,null,null,null,null,null,null,null,null,null,null,null,null,null,null,null,null,null,null,null,null,null,null,null,3]
[null,{"$f":"+'1. Information Sheet'!B2","v":"INCENTIVE REGULATION MODEL FOR 2020 FILERS"}]
[]
[]
[]
[]
[]
[]
[]
[]
[null,"In the Green Cells below, enter any proposed rate riders that are not already included in this model (e.g.:  proposed ICM rate riders).  Please note that existing SMIRR and SM Entity Charge do not need to be included below.\nIn column A, the rate rider descriptions must begin with \"Rate Rider for\". \nIn column B, choose the associated unit from the drop-down menu.\nIn column C, enter the rate. All rate riders with a \"$\" unit should be rounded to 2 decimal places and all others rounded to 4 decimal places.\nIn column E, enter the expiry date (e.g. April 30, 2018) or description of the expiry date in text (e.g. the effective date of  the next cost of service-based rate order).\nIn column G, choose the sub-total as applicable in the bill impact calculation from the drop-down menu"]
[]
[null,"RESIDENTIAL SERVICE CLASSIFICATION"]
["R_ICMF20","Rate Rider for Recovery of Incremental Capital (2020)","$",{"$f":"VLOOKUP(A14,'[18]Bill Impacts_2020'!$A$4:$M$10,11,FALSE)","v":0.12047495940337555}," - effective until ","next cost of service based rate order",null,"A"]
["R_ICMV20","Rate Rider for Recovery of Incremental Capital (2020)","$/kWh",{"$f":"VLOOKUP(A15,'[18]Bill Impacts_2020'!$B$4:$M$10,11,FALSE)","v":0}," - effective until ","next cost of service based rate order",null,"A"]
["R_MFF20","Rate Rider for Recovery of M-factor Capital (2020) ","$",{"$f":"VLOOKUP(A16,'[19]Bill Impacts_2020'!$A$4:$M$10,11,FALSE)","v":0.12047495940337555}," - effective until ","next cost of service based rate order",null,"A"]
["R_MFV20","Rate Rider for Recovery of M-factor Capital (2020) ","$/kWh",{"$f":"VLOOKUP(A17,'[19]Bill Impacts_2020'!$B$4:$M$10,11,FALSE)","v":0}," - effective until ","next cost of service based rate order",null,"A"]
[null,null,null,null," - effective until "]
[null,null,null,null," - effective until "]
[null,null,null,null," - effective until "]
[null,null,null,null," - effective until "]
[null,null,null,null," - effective until "]
[null,null,null,null," - effective until "]
[]
[]
[null,"GS<50 SERVICE CLASSIFICATION"]
["GSL_ICMF20","Rate Rider for Recovery of Incremental Capital (2020)","$",{"$f":"VLOOKUP(A27,'[18]Bill Impacts_2020'!$A$4:$M$10,11,FALSE)","v":0.22117712134590842}," - effective until ","next cost of service based rate order",null,"A"]
["GSL_ICMV20","Rate Rider for Recovery of Incremental Capital (2020)","$/kWh",{"$f":"VLOOKUP(A28,'[18]Bill Impacts_2020'!$B$4:$M$10,11,FALSE)","v":6.4584514319335334E-5}," - effective until ","next cost of service based rate order",null,"A"]
["GSL_MFF20","Rate Rider for Recovery of M-factor Capital (2020) ","$",{"$f":"VLOOKUP(A29,'[19]Bill Impacts_2020'!$A$4:$M$10,11,FALSE)","v":0.22117712134590842}," - effective until ","next cost of service based rate order",null,"A"]
["GSL_MFV20","Rate Rider for Recovery of M-factor Capital (2020) ","$/kWh",{"$f":"VLOOKUP(A30,'[19]Bill Impacts_2020'!$B$4:$M$10,11,FALSE)","v":6.4584514319335334E-5}," - effective until ","next cost of service based rate order",null,"A"]
[null,null,null,null," - effective until "]
[null,null,null,null," - effective until "]
[null,null,null,null," - effective until "]
[null,null,null,null," - effective until "]
[null,null,null,null," - effective until "]
[]
[]
[null,"GS>50 and <500 SERVICE CLASSIFICATION"]
["GSG_ICMF20","Rate Rider for Recovery of Incremental Capital (2020)","$",{"$f":"VLOOKUP(A39,'[18]Bill Impacts_2020'!$A$4:$M$10,11,FALSE)","v":0.38954398213685265}," - effective until ","next cost of service based rate order",null,"A"]
["GSG_ICMV20","Rate Rider for Recovery of Incremental Capital (2020)","$/kW",{"$f":"VLOOKUP(A40,'[18]Bill Impacts_2020'!$B$4:$M$10,11,FALSE)","v":2.3443681893962429E-2}," - effective until ","next cost of service based rate order",null,"A"]
["GS50_MFF20","Rate Rider for Recovery of M-factor Capital (2020) ","$",{"$f":"VLOOKUP(A41,'[19]Bill Impacts_2020'!$A$4:$M$10,11,FALSE)","v":0.38954398213685265}," - effective until ","next cost of service based rate order",null,"A"]
["GS50_MFV20","Rate Rider for Recovery of M-factor Capital (2020) ","$/kWh",{"$f":"VLOOKUP(A42,'[19]Bill Impacts_2020'!$B$4:$M$10,11,FALSE)","v":2.3443681893962429E-2}," - effective until ","next cost of service based rate order",null,"A"]
[null,null,null,null," - effective until "]
[null,null,null,null," - effective until "]
[null,null,null,null," - effective until "]
[null,null,null,null," - effective until "]
[null,null,null,null," - effective until "]
[]
[]
[null,"LARGE USER SERVICE CLASSIFICATION"]
["LU_ICMF20","Rate Rider for Recovery of Incremental Capital (2020)","$",{"$f":"VLOOKUP(A51,'[18]Bill Impacts_2020'!$A$4:$M$10,11,FALSE)","v":69.943389554784375}," - effective until ","next cost of service based rate order",null,"A"]
["LU_ICMV20","Rate Rider for Recovery of Incremental Capital (2020)","$/kW",{"$f":"VLOOKUP(A52,'[18]Bill Impacts_2020'!$B$4:$M$10,11,FALSE)","v":1.4973174439003444E-2}," - effective until ","next cost of service based rate order",null,"A"]
["LU_MFF20","Rate Rider for Recovery of M-factor Capital (2020) ","$",{"$f":"VLOOKUP(A53,'[19]Bill Impacts_2020'!$A$4:$M$10,11,FALSE)","v":69.943389554784375}," - effective until ","next cost of service based rate order",null,"A"]
["LU_MFV20","Rate Rider for Recovery of M-factor Capital (2020) ","$/kWh",{"$f":"VLOOKUP(A54,'[19]Bill Impacts_2020'!$B$4:$M$10,11,FALSE)","v":1.4973174439003444E-2}," - effective until ","next cost of service based rate order",null,"A"]
[null,null,null,null," - effective until "]
[null,null,null,null," - effective until "]
[null,null,null,null," - effective until "]
[null,null,null,null," - effective until "]
[null,null,null,null," - effective until "]
[]
[]
[null,"UNMETERED SCATTERED LOAD SERVICE CLASSIFICATION"]
["USL_ICMF20","Rate Rider for Recovery of Incremental Capital (2020)","$",{"$f":"VLOOKUP(A63,'[18]Bill Impacts_2020'!$A$4:$M$10,11,FALSE)","v":4.5656283584207064E-2}," - effective until ","next cost of service based rate order",null,"A"]
["USL_ICMV20","Rate Rider for Recovery of Incremental Capital (2020)","$/kWh",{"$f":"VLOOKUP(A64,'[18]Bill Impacts_2020'!$B$4:$M$10,11,FALSE)","v":8.2966260702530803E-5}," - effective until ","next cost of service based rate order",null,"A"]
["USL_MFF20","Rate Rider for Recovery of M-factor Capital (2020) ","$",{"$f":"VLOOKUP(A65,'[19]Bill Impacts_2020'!$A$4:$M$10,11,FALSE)","v":4.5656283584207064E-2}," - effective until ","next cost of service based rate order",null,"A"]
["USL_MFV20","Rate Rider for Recovery of M-factor Capital (2020) ","$/kWh",{"$f":"VLOOKUP(A66,'[19]Bill Impacts_2020'!$B$4:$M$10,11,FALSE)","v":8.2966260702530803E-5}," - effective until ","next cost of service based rate order",null,"A"]
[null,null,null,null," - effective until "]
[null,null,null,null," - effective until "]
[null,null,null,null," - effective until "]
[null,null,null,null," - effective until "]
[null,null,null,null," - effective until "]
[]
[]
[null,"GS>500 and <4999 SERVICE CLASSIFICATION"]
["GS500_ICMF20","Rate Rider for Recovery of Incremental Capital (2020)","$",{"$f":"VLOOKUP(A75,'[18]Bill Impacts_2020'!$A$4:$M$10,11,FALSE)","v":8.8708817633432293}," - effective until ","next cost of service based rate order",null,"A"]
["GS500_ICMV20","Rate Rider for Recovery of Incremental Capital (2020)","$/kW",{"$f":"VLOOKUP(A76,'[18]Bill Impacts_2020'!$B$4:$M$10,11,FALSE)","v":1.2063393666939237E-2}," - effective until ","next cost of service based rate order",null,"A"]
["GS500_MFF20","Rate Rider for Recovery of M-factor Capital (2020) ","$",{"$f":"VLOOKUP(A77,'[19]Bill Impacts_2020'!$A$4:$M$10,11,FALSE)","v":8.8708817633432293}," - effective until ","next cost of service based rate order",null,"A"]
["GS500_MFV20","Rate Rider for Recovery of M-factor Capital (2020) ","$/kWh",{"$f":"VLOOKUP(A78,'[19]Bill Impacts_2020'!$B$4:$M$10,11,FALSE)","v":1.2063393666939237E-2}," - effective until ","next cost of service based rate order",null,"A"]
[null,null,null,null," - effective until "]
[null,null,null,null," - effective until "]
[null,null,null,null," - effective until "]
[null,null,null,null," - effective until "]
[null,null,null,null," - effective until "]
[]
[]
[null,"STREET LIGHTING SERVICE CLASSIFICATION"]
["SL_ICMF20","Rate Rider for Recovery of Incremental Capital (2020)","$",{"$f":"VLOOKUP(A87,'[18]Bill Impacts_2020'!$A$4:$M$10,11,FALSE)","v":7.6507809270597261E-3}," - effective until ","next cost of service based rate order",null,"A"]
["SL_ICMV20","Rate Rider for Recovery of Incremental Capital (2020)","$/kW",{"$f":"VLOOKUP(A88,'[18]Bill Impacts_2020'!$B$4:$M$10,11,FALSE)","v":5.8574180055986733E-2}," - effective until ","next cost of service based rate order",null,"A"]
["SL_MFF20","Rate Rider for Recovery of M-factor Capital (2020) ","$",{"$f":"VLOOKUP(A89,'[19]Bill Impacts_2020'!$A$4:$M$10,11,FALSE)","v":7.6507809270597261E-3}," - effective until ","next cost of service based rate order",null,"A"]
["SL_MFV20","Rate Rider for Recovery of M-factor Capital (2020) ","$/kWh",{"$f":"VLOOKUP(A90,'[19]Bill Impacts_2020'!$B$4:$M$10,11,FALSE)","v":5.8574180055986733E-2}," - effective until ","next cost of service based rate order",null,"A"]
[null,null,null,null," - effective until "]
[null,null,null,null," - effective until "]
[null,null,null,null," - effective until "]
[null,null,null,null," - effective until "]
[null,null,null,null," - effective until "]
[]
[]
[null,"MICROFIT SERVICE CLASSIFICATION"]
[null,null,null,null," - effective until "]
[null,null,null,null," - effective until "]
[null,null,null,null," - effective until "]
[null,null,null,null," - effective until "]
[null,null,null,null," - effective until "]
[null,null,null,null," - effective until "]
[null,null,null,null," - effective until "]
[null,null,null,null," - effective until "]
[null,null,null,null," - effective until "]
[null,null,null,null," - effective until "]

{"sheet":"20. Final Tariff Schedule","index":24,"n_rows":410,"n_cols":5,"rows_kept":410,"cut":false,"hidden":false,"merged":[[388,1,388,2],[389,1,389,2],[352,1,352,2],[350,1,350,2],[348,1,348,2],[312,1,312,2],[314,1,314,2],[316,1,316,2],[308,1,308,2],[318,1,318,2],[380,1,380,2],[382,1,382,2],[384,1,384,2],[386,1,386,2],[230,1,230,2],[232,1,232,2],[234,1,234,2],[236,1,236,2],[193,1,193,2],[195,1,195,2],[196,1,196,2],[275,1,275,2],[277,1,277,2],[214,1,214,2],[286,1,286,2],[297,1,297,2],[185,1,185,2],[189,1,189,2],[191,1,191,2],[212,1,212,2],[213,1,213,2],[226,1,226,2],[267,1,267,2],[271,1,271,2],[273,1,273,2],[284,1,284,2],[285,1,285,2],[290,1,290,2],[295,1,295,2],[287,1,287,2],[291,1,291,2],[298,1,298,2],[301,1,301,2],[303,1,303,2],[339,1,339,2],[342,1,342,2],[354,1,354,2],[367,1,367,2],[322,1,322,2],[326,1,326,2],[336,1,336,2],[330,1,330,2],[332,1,332,2],[122,1,122,2],[128,1,128,2],[129,1,129,2],[130,1,130,2],[157,1,157,2],[161,1,161,2],[162,1,162,2],[163,1,163,2],[167,1,167,2],[43,1,43,2],[74,1,74,2],[75,1,75,2],[76,1,76,2],[80,1,80,2],[85,1,85,2],[86,1,86,2],[87,1,87,2],[116,1,116,2],[15,1,15,4],[16,1,16,4],[17,1,17,4],[19,1,19,4],[20,1,20,4],[22,1,22,4],[1,1,8,3],[10,1,10,4],[11,1,11,4],[12,1,12,4],[13,1,13,4],[14,1,14,4],[35,1,35,2],[36,1,36,2],[37,1,37,2],[41,1,41,2],[42,1,42,2],[24,1,24,4],[26,1,26,4],[28,1,28,4],[30,1,30,4],[32,1,32,4],[34,1,34,2],[38,1,38,2],[39,1,39,2],[40,1,40,2],[46,1,46,2],[47,1,47,2],[49,1,49,2],[51,1,51,2],[52,1,52,2],[53,1,53,2],[44,1,44,2],[45,1,45,2],[64,1,64,4],[66,1,66,4],[68,1,68,4],[70,1,70,2],[71,1,71,2],[54,1,54,2],[55,1,55,4],[56,1,56,4],[58,1,58,4],[60,1,60,4],[62,1,62,4],[82,1,82,2],[83,1,83,2],[72,1,72,2],[73,1,73,2],[77,1,77,2],[78,1,78,2],[79,1,79,2],[81,1,81,2],[95,1,95,2],[96,1,96,2],[97,1,97,4],[98,1,98,4],[100,1,100,4],[102,1,102,4],[84,1,84,2],[88,1,88,2],[89,1,89,2],[91,1,91,2],[93,1,93,2],[94,1,94,2],[114,1,114,2],[115,1,115,2],[119,1,119,2],[120,1,120,2],[121,1,121,2],[104,1,104,4],[106,1,106,4],[108,1,108,4],[109,1,109,4],[111,1,111,4],[113,1,113,2],[117,1,117,2],[118,1,118,2],[125,1,125,2],[126,1,126,2],[127,1,127,2],[131,1,131,2],[132,1,132,2],[123,1,123,2],[124,1,124,2],[141,1,141,4],[143,1,143,4],[145,1,145,4],[147,1,147,4],[149,1,149,4],[150,1,150,4],[134,1,134,2],[136,1,136,2],[137,1,137,2],[138,1,138,2],[139,1,139,2],[140,1,140,4],[159,1,159,2],[160,1,160,2],[164,1,164,2],[165,1,165,2],[166,1,166,2],[168,1,168,2],[151,1,151,4],[152,1,152,4],[153,1,153,4],[155,1,155,4],[158,1,158,2],[171,1,171,2],[172,1,172,2],[176,1,176,2],[169,1,169,2],[170,1,170,2],[173,1,173,2],[174,1,174,2],[175,1,175,2],[178,1,178,2],[180,1,180,2],[181,1,181,2],[182,1,182,2],[183,1,183,2],[208,1,208,2],[209,1,209,2],[210,1,210,2],[211,1,211,2],[201,1,201,2],[202,1,202,2],[203,1,203,2],[207,1,207,2],[200,1,200,2],[204,1,204,2],[205,1,205,2],[206,1,206,2],[223,1,223,2],[216,1,216,2],[221,1,221,2],[222,1,222,2],[215,1,215,2],[218,1,218,2],[220,1,220,2],[242,1,242,2],[243,1,243,2],[247,1,247,2],[248,1,248,2],[249,1,249,2],[251,1,251,2],[241,1,241,2],[240,1,240,2],[244,1,244,2],[245,1,245,2],[246,1,246,2],[250,1,250,2],[262,1,262,2],[263,1,263,2],[264,1,264,2],[252,1,252,2],[253,1,253,2],[257,1,257,2],[254,1,254,2],[255,1,255,2],[256,1,256,2],[259,1,259,2],[261,1,261,2],[282,1,282,2],[283,1,283,2],[281,1,281,2],[293,1,293,2],[294,1,294,2],[299,1,299,2],[288,1,288,2],[289,1,289,2],[292,1,292,2],[296,1,296,2],[304,1,304,2],[305,1,305,2],[306,1,306,2],[355,1,355,2],[356,1,356,2],[357,1,357,2],[358,1,358,2],[359,1,359,2],[360,1,360,2],[343,1,343,2],[369,1,369,2],[370,1,370,2],[371,1,371,2],[372,1,372,2],[376,1,376,2],[361,1,361,2],[362,1,362,2],[363,1,363,2],[364,1,364,2],[368,1,368,2],[375,1,375,2],[390,1,390,2],[391,1,391,2],[392,1,392,2],[393,1,393,2],[394,1,394,2],[395,1,395,2],[402,1,402,2],[407,1,407,2],[408,1,408,2],[409,1,409,2],[396,1,396,2],[397,1,397,2],[398,1,398,2],[399,1,399,2],[400,1,400,2],[401,1,401,2],[403,1,403,2]]}
["Back to Index"]
[null,"INCENTIVE REGULATION MODEL FOR 2020 FILERS"]
[]
[]
[]
[]
[]
[]
[]
[]
[null,"Alectra Utilities Corporation"]
[null,"Enersource Rate Zone"]
[null,"TARIFF OF RATES AND CHARGES"]
[null,"Effective Date January 1, 2020"]
[null,"Implementation Date January 1, 2020"]
[null,"This schedule supersedes and replaces all previously "]
[null,"approved schedules of Rates, Charges and Loss Factors"]
[null,"EB-2019-0018"]
[]
[null,"RESIDENTIAL SERVICE CLASSIFICATION"]
[null,"This classification refers to all residential services including, without limitation, single family or single unit dwellings, multifamily dwellings, row-type dwellings and subdivision developments.  Energy is supplied in single phase, 3-wire, or three phase, 4 wire, having a nominal voltage of 120/240 volts.  There shall be only one delivery point to a dwelling.  Class B consumers are defined in accordance with O. Reg. 429/04.  Further servicing details are available in the distributor’s Conditions of Service."]
[]
[null,"APPLICATION"]
[]
[null,"The application of these rates and charges shall be in accordance with the Licence of the Distributor and any Code or Order of the Ontario Energy Board, and amendments thereto as approved by the Ontario Energy Board, which may be applicable to the administration of this schedule."]
[]
[null,"No rates and charges for the distribution of electricity and charges to meet the costs of any work or service done or furnished for the purpose of the distribution of electricity shall be made except as permitted by this schedule, unless required by the Distributor’s Licence or a Code or Order of the Ontario Energy Ontario Energy Board, and amendments thereto as approved by the Ontario Energy Board, or as specified herein."]
[]
[null,"Unless specifically noted, this schedule does not contain any charges for the electricity commodity, be it under the Regulated Price Plan, a contract with a retailer or the wholesale market price, as applicable. In addition, the charges in the MONTHLY RATES AND CHARGES - Regulatory Component of this schedule do not apply to a customer that is an embedded wholesale market participant."]
[]
[null,"It should be noted that this schedule does not list any charges, assessments, or credits that are required by law to be invoiced by a distributor and that are not subject to Ontario Energy Board approval, such as the Debt Retirement Charge, the Global Adjustment and the HST."]
[]
[null,"MONTHLY RATES AND CHARGES - Delivery Component"]
[]
["R_F","Service Charge",null,"$",{"$f":"VLOOKUP(A35,RATES!A:I,9,FALSE)","v":24.54}]
["R_SME","Smart Metering Entity Charge - effective until December 31, 2022",null,"$",{"$f":"VLOOKUP(A36,RATES!A:I,9,FALSE)","v":0.56999999999999995}]
["R_ICMF17","Rate Rider for Recovery of Incremental Capital (2017) - in effect until the effective date of the next cost of service based rate order",null,"$",{"$f":"VLOOKUP(A37,RATES!A:I,9,FALSE)","v":0.6}]
["R_ICMF18","Rate Rider for Recovery of Incremental Capital (2018) - in effect until the effective date of the next cost of service based rate order",null,"$",{"$f":"VLOOKUP(A38,RATES!A:I,9,FALSE)","v":0.16}]
["R_ICMF19","Rate Rider for Recovery of Incremental Capital (2019) - in effect until the effective date of the next cost of service based rate order",null,"$",{"$f":"VLOOKUP(A39,RATES!A:I,9,FALSE)","v":0.12}]
["R_ICMF20","Rate Rider for Recovery of Incremental Capital (2020) - in effect until the effective date of the next cost of service based rate order",null,"$",{"$f":"VLOOKUP(A40,RATES!A:I,9,FALSE)","v":0.12}]
["R_MFF20","Rate Rider for Recovery of M-factor Capital (2020) - in effect until the effective date of the next cost of service based rate order",null,{"$f":"VLOOKUP(A41,RATES!A:I,7,FALSE)","v":"$"},{"$f":"VLOOKUP(A41,RATES!A:I,9,FALSE)","v":0.12}]
["R_LV","Low Voltage Service Rate ",null,"$/kWh",{"$f":"VLOOKUP(A42,RATES!A:I,9,FALSE)","v":2.0000000000000001E-4}]
["R_GA20","Rate Rider for Disposition of Global Adjustment Account (2020) - effective until December 31, 2020\n      Applicable only for Non-RPP Customers",null,"$/kWh",{"$f":"VLOOKUP(A43,RATES!A:I,9,FALSE)","v":-3.2000000000000002E-3}]
["R_CBR20","Rate Rider for Disposition of Capacity Based Recovery Account (2020) - effective until December 31, 2020\n        Applicable Only for Class B Customers",null,"$/kWh",{"$f":"VLOOKUP(A44,RATES!A:I,9,FALSE)","v":-1E-4}]
["R_DVA20","Rate Rider for Disposition of Deferral/Variance Accounts (2020) - effective until December 31, 2020",null,"$/kWh",{"$f":"VLOOKUP(A45,RATES!A:I,9,FALSE)","v":2.0000000000000001E-4}]
["R_LRV20","Rate Rider for Disposition of Lost Revenue Adjustment Mechanism Variance Account (LRAMVA) (2020) - effective until December 31, 2020",null,"$/kWh",{"$f":"VLOOKUP(A46,RATES!A:I,9,FALSE)","v":2.9999999999999997E-4}]
["R_TN","Retail Transmission Rate - Network Service Rate",null,"$/kWh",{"$f":"VLOOKUP(A47,RATES!A:I,9,FALSE)","v":8.0000000000000002E-3}]
["R_TC","Retail Transmission Rate - Line and Transformation Connection Service Rate",null,"$/kWh",{"$f":"VLOOKUP(A48,RATES!A:I,9,FALSE)","v":7.7000000000000002E-3}]
[]
[null,"MONTHLY RATES AND CHARGES - Regulatory Component"]
[]
[null,"Wholesale Market Service Rate (WMS) - not including CBR",null,"$/kWh",3.0000000000000001E-3]
[null,"Capacity Based Recovery (CBR) - Applicable for Class B Customers ",null,"$/kWh",4.0000000000000002E-4]
[null,"Rural or Remote Electricity Rate Protection Charge (RRRP)",null,"$/kWh",5.0000000000000001E-4]
[null,"Standard Supply Service - Administrative Charge (if applicable)",null,"$",0.25]
[null,"GENERAL SERVICE LESS THAN 50 KW SERVICE CLASSIFICATION"]
[null,"This classification refers to a non-residential account whose monthly average peak demand is less than, or is forecast to be less than, 50 kW.  Class B consumers are defined in accordance with O. Reg. 429/04.  Further servicing details are available in the distributor’s Conditions of Service."]
[]
[null,"APPLICATION"]
[]
[null,"The application of these rates and charges shall be in accordance with the Licence of the Distributor and any Code or Order of the Ontario Energy Board, and amendments thereto as approved by the Ontario Energy Board, which may be applicable to the administration of this schedule."]
[]
[null,"No rates and charges for the distribution of electricity and charges to meet the costs of any work or service done or furnished for the purpose of the distribution of electricity shall be made except as permitted by this schedule, unless required by the Distributor’s Licence or a Code or Order of the Ontario Energy Board, and amendments thereto as approved by the Ontario Energy Board, or as specified herein."]
[]
[null,"Unless specifically noted, this schedule does not contain any charges for the electricity commodity, be it under the Regulated Price Plan, a contract with a retailer or the wholesale market price, as applicable. In addition, the charges in the MONTHLY RATES AND CHARGES - Regulatory Component of this schedule do not apply to a customer that is an embedded wholesale market participant."]
[]
[null,"It should be noted that this schedule does not list any charges, assessments, or credits that are required by law to be invoiced by a distributor and that are not subject to Ontario Energy Board approval, such as the Debt Retirement Charge, the Global Adjustment and the HST."]
[]
[null,"MONTHLY RATES AND CHARGES - Delivery Component"]
[]
["GSL_F","Service Charge",null,"$",{"$f":"VLOOKUP(A71,RATES!A:I,9,FALSE)","v":45.05}]
["GSL_SME","Smart Metering Entity Charge - effective until December 31, 2022",null,"$",{"$f":"VLOOKUP(A72,RATES!A:I,9,FALSE)","v":0.56999999999999995}]
["GSL_ICMF17","Rate Rider for Recovery of Incremental Capital (2017) - in effect until the effective date of the next cost of service based rate order",null,"$",{"$f":"VLOOKUP(A73,RATES!A:I,9,FALSE)","v":1.1000000000000001}]
["GSL_ICMF18","Rate Rider for Recovery of Incremental Capital (2018) - in effect until the effective date of the next cost of service based rate order",null,"$",{"$f":"VLOOKUP(A74,RATES!A:I,9,FALSE)","v":0.28999999999999998}]
["GSL_ICMF19","Rate Rider for Recovery of Incremental Capital (2019) - in effect until the effective date of the next cost of service based rate order",null,"$",{"$f":"VLOOKUP(A75,RATES!A:I,9,FALSE)","v":0.21}]
["GSL_ICMF20","Rate Rider for Recovery of Incremental Capital (2020) - in effect until the effective date of the next cost of service based rate order",null,"$",{"$f":"VLOOKUP(A76,RATES!A:I,9,FALSE)","v":0.22}]
["GSL_MFF20","Rate Rider for Recovery of M-factor Capital (2020) - in effect until the effective date of the next cost of service based rate order",null,{"$f":"VLOOKUP(A77,RATES!A:I,7,FALSE)","v":"$"},{"$f":"VLOOKUP(A77,RATES!A:I,9,FALSE)","v":0.22}]
["GSL_V","Distribution Volumetric Rate",null,"$/kWh",{"$f":"VLOOKUP(A78,RATES!A:I,9,FALSE)","v":1.32E-2}]
["GSL_LV","Low Voltage Service Rate ",null,"$/kWh",{"$f":"VLOOKUP(A79,RATES!A:I,9,FALSE)","v":2.0000000000000001E-4}]
["GSL_GA20","Rate Rider for Disposition of Global Adjustment Account (2020) - effective until December 31, 2020\n      Applicable only for Non-RPP Customers",null,"$/kWh",{"$f":"VLOOKUP(A80,RATES!A:I,9,FALSE)","v":-3.2000000000000002E-3}]
["GSL_CBR20","Rate Rider for Disposition of Capacity Based Recovery Account (2020) - effective until December 31, 2020\n        Applicable Only for Class B Customers",null,"$/kWh",{"$f":"VLOOKUP(A81,RATES!A:I,9,FALSE)","v":-1E-4}]
["GSL_DVA20","Rate Rider for Disposition of Deferral/Variance Accounts (2020) - effective until December 31, 2020",null,"$/kWh",{"$f":"VLOOKUP(A82,RATES!A:I,9,FALSE)","v":2.9999999999999997E-4}]
["GSL_LRV20","Rate Rider for Disposition of Lost Revenue Adjustment Mechanism Variance Account (LRAMVA) (2020) - effective until December 31, 2020",null,"$/kWh",{"$f":"VLOOKUP(A83,RATES!A:I,9,FALSE)","v":1E-4}]
["GSL_ICMV17","Rate Rider for Recovery of Incremental Capital (2017) - in effect until the effective date of the next cost of service based rate order",null,"$/kWh",{"$f":"VLOOKUP(A84,RATES!A:I,9,FALSE)","v":2.9999999999999997E-4}]
["GSL_ICMV18","Rate Rider for Recovery of Incremental Capital (2018) - in effect until the effective date of the next cost of service based rate order",null,"$/kWh",{"$f":"VLOOKUP(A85,RATES!A:I,9,FALSE)","v":1E-4}]
["GSL_ICMV19","Rate Rider for Recovery of Incremental Capital (2019) - in effect until the effective date of the next cost of service based rate order",null,"$/kWh",{"$f":"VLOOKUP(A86,RATES!A:I,9,FALSE)","v":1E-4}]
["GSL_ICMV20","Rate Rider for Recovery of Incremental Capital (2020) - in effect until the effective date of the next cost of service based rate order",null,"$/kWh",{"$f":"VLOOKUP(A87,RATES!A:I,9,FALSE)","v":1E-4}]
["GSL_MFV20","Rate Rider for Recovery of M-factor Capital (2020) - in effect until the effective date of the next cost of service based rate order",null,{"$f":"VLOOKUP(A88,RATES!A:I,7,FALSE)","v":"$/kWh"},{"$f":"VLOOKUP(A88,RATES!A:I,9,FALSE)","v":1E-4}]
["GSL_TN","Retail Transmission Rate - Network Service Rate",null,"$/kWh",{"$f":"VLOOKUP(A89,RATES!A:I,9,FALSE)","v":7.4000000000000003E-3}]
["GSL_TC","Retail Transmission Rate - Line and Transformation Connection Service Rate",null,"$/kWh",{"$f":"VLOOKUP(A90,RATES!A:I,9,FALSE)","v":6.8999999999999999E-3}]
[]
[null,"MONTHLY RATES AND CHARGES - Regulatory Component"]
[]
[null,"Wholesale Market Service Rate (WMS) - not including CBR",null,"$/kWh",3.0000000000000001E-3]
[null,"Capacity Based Recovery (CBR) - Applicable for Class B Customers ",null,"$/kWh",4.0000000000000002E-4]
[null,"Rural or Remote Electricity Rate Protection Charge (RRRP)",null,"$/kWh",5.0000000000000001E-4]
[null,"Standard Supply Service - Administrative Charge (if applicable)",null,"$",0.25]
[null,"GENERAL SERVICE 50 TO 499 KW SERVICE CLASSIFICATION"]
[null,"This classification refers to a non-residential account whose monthly average peak demand is equal to or greater than, or is forecast to be equal to or greater than, 50 kW but less than 500 kW.  Class B consumers are defined in accordance with O. Reg. 429/04.  Further servicing details are available in the distributor’s Conditions of Service."]
[]
[null,"APPLICATION"]
[]
[null,"The application of these rates and charges shall be in accordance with the Licence of the Distributor and any Code or Order of the Ontario Energy Board, and amendments thereto as approved by the Ontario Energy Board, which may be applicable to the administration of this schedule."]
[]
[null,"No rates and charges for the distribution of electricity and charges to meet the costs of any work or service done or furnished for the purpose of the distribution of electricity shall be made except as permitted by this schedule, unless required by the Distributor’s Licence or a Code or Order of the Ontario Energy Board, and amendments thereto as approved by the Ontario Energy Board, or as specified herein."]
[]
[null,"Unless specifically noted, this schedule does not contain any charges for the electricity commodity, be it under the Regulated Price Plan, a contract with a retailer or the wholesale market price, as applicable. In addition, the charges in the MONTHLY RATES AND CHARGES - Regulatory Component of this schedule do not apply to a customer that is an embedded wholesale market participant."]
[]
[null,"It should be noted that this schedule does not list any charges, assessments, or credits that are required by law to be invoiced by a distributor and that are not subject to Ontario Energy Board approval, such as the Debt Retirement Charge, the Global Adjustment and the HST."]
[null,"Billing demands are established at the greater of 100% of the kW, or 90% of the kVA amounts."]
[]
[null,"MONTHLY RATES AND CHARGES - Delivery Component"]
[]
["GS50_499_F","Service Charge",null,"$",{"$f":"VLOOKUP(A114,RATES!A:I,9,FALSE)","v":79.349999999999994}]
["GS50_499_ICMF17","Rate Rider for Recovery of Incremental Capital (2017) - in effect until the effective date of the next cost of service based rate order",null,"$",{"$f":"VLOOKUP(A115,RATES!A:I,9,FALSE)","v":1.93}]
["GS50_499_ICMF18","Rate Rider for Recovery of Incremental Capital (2018) - in effect until the effective date of the next cost of service based rate order",null,"$",{"$f":"VLOOKUP(A116,RATES!A:I,9,FALSE)","v":0.51}]
["GS50_499_ICMF19","Rate Rider for Recovery of Incremental Capital (2019) - in effect until the effective date of the next cost of service based rate order",null,"$",{"$f":"VLOOKUP(A117,RATES!A:I,9,FALSE)","v":0.38}]
["GS50_499_ICMF20","Rate Rider for Recovery of Incremental Capital (2020) - in effect until the effective date of the next cost of service based rate order",null,"$",{"$f":"VLOOKUP(A118,RATES!A:I,9,FALSE)","v":0.39}]
["GS50_MFF20","Rate Rider for Recovery of M-factor Capital (2020) - in effect until the effective date of the next cost of service based rate order",null,{"$f":"VLOOKUP(A119,RATES!A:I,7,FALSE)","v":"$"},{"$f":"VLOOKUP(A119,RATES!A:I,9,FALSE)","v":0.39}]
["GS50_499_V","Distribution Volumetric Rate",null,"$/kW",{"$f":"VLOOKUP(A120,RATES!A:I,9,FALSE)","v":4.7755000000000001}]
["GS50_499_LV","Low Voltage Service Rate ",null,"$/kW",{"$f":"VLOOKUP(A121,RATES!A:I,9,FALSE)","v":8.0199999999999994E-2}]
["GS50_499_GA20","Rate Rider for Disposition of Global Adjustment Account (2020) - effective until December 31, 2020\n      Applicable only for Non Wholesale Market Participant Non-RPP Customers",null,"$/kWh",{"$f":"VLOOKUP(A122,RATES!A:I,9,FALSE)","v":-3.2000000000000002E-3}]
["GS50_499_CBR20","Rate Rider for Disposition of Capacity Based Recovery Account (2020) - effective until December 31, 2020\n        Applicable Only for Non Wholesale Market Participant Class B Customers",null,"$/kW",{"$f":"VLOOKUP(A123,RATES!A:I,9,FALSE)","v":-3.5200000000000002E-2}]
["GS50_499_DVA20nonWMP","Rate Rider for Disposition of Deferral/Variance Accounts (2020) - effective until December 31, 2020\n      Applicable only for Non-Wholesale Market Participants",null,"$/kW",{"$f":"VLOOKUP(A124,RATES!A:I,9,FALSE)","v":-0.2152}]
["GS50_499_DVA20","Rate Rider for Disposition of Deferral/Variance Accounts (2020) - effective until December 31, 2020",null,"$/kW",{"$f":"VLOOKUP(A125,RATES!A:I,9,FALSE)","v":0.33}]
["GS50_499_LRV20","Rate Rider for Disposition of Lost Revenue Adjustment Mechanism Variance Account (LRAMVA) (2020) - effective until December 31, 2020",null,"$/kW",{"$f":"VLOOKUP(A126,RATES!A:I,9,FALSE)","v":0.2379}]
["GS50_499_ICMV17","Rate Rider for Recovery of Incremental Capital (2017) - in effect until the effective date of the next cost of service based rate order",null,"$/kW",{"$f":"VLOOKUP(A127,RATES!A:I,9,FALSE)","v":0.1163}]
["GS50_499_ICMV18","Rate Rider for Recovery of Incremental Capital (2018) - in effect until the effective date of the next cost of service based rate order",null,"$/kW",{"$f":"VLOOKUP(A128,RATES!A:I,9,FALSE)","v":3.0800000000000001E-2}]
["GS50_499_ICMV19","Rate Rider for Recovery of Incremental Capital (2019) - in effect until the effective date of the next cost of service based rate order",null,"$/kW",{"$f":"VLOOKUP(A129,RATES!A:I,9,FALSE)","v":2.2599999999999999E-2}]
["GS50_499_ICMV20","Rate Rider for Recovery of Incremental Capital (2020) - in effect until the effective date of the next cost of service based rate order",null,"$/kW",{"$f":"VLOOKUP(A130,RATES!A:I,9,FALSE)","v":2.3400000000000001E-2}]
["GS50_MFV20","Rate Rider for Recovery of M-factor Capital (2020) - in effect until the effective date of the next cost of service based rate order",null,"$/kW",{"$f":"VLOOKUP(A131,RATES!A:I,9,FALSE)","v":2.3400000000000001E-2}]
["GS50_499_TN","Retail Transmission Rate - Network Service Rate",null,"$/kW",{"$f":"VLOOKUP(A132,RATES!A:I,9,FALSE)","v":2.8610000000000002}]
["GS50_499_TC","Retail Transmission Rate - Line and Transformation Connection Service Rate",null,"$/kW",{"$f":"VLOOKUP(A133,RATES!A:I,9,FALSE)","v":2.7349000000000001}]
[]
[null,"MONTHLY RATES AND CHARGES - Regulatory Component"]
[]
[null,"Wholesale Market Service Rate (WMS) - not including CBR",null,"$/kWh",3.0000000000000001E-3]
[null,"Capacity Based Recovery (CBR) - Applicable for Class B Customers ",null,"$/kWh",4.0000000000000002E-4]
[null,"Rural or Remote Electricity Rate Protection Charge (RRRP)",null,"$/kWh",5.0000000000000001E-4]
[null,"Standard Supply Service - Administrative Charge (if applicable)",null,"$",0.25]
[null,"GENERAL SERVICE 500 TO 4,999 KW SERVICE CLASSIFICATION"]
[null,"This classification refers to a non-residential account whose monthly average peak demand is equal to or greater than, or is forecast to be equal to or greater than, 500 kW but less than 5,000 kW.  Class A and Class B consumers are defined in accordance with O. Reg. 429/04.  Further servicing details are available in the distributor’s Conditions of Service."]
[]
[null,"APPLICATION"]
[]
[null,"The application of these rates and charges shall be in accordance with the Licence of the Distributor and any Code or Order of the Ontario Energy Board, and amendments thereto as approved by the Ontario Energy Board, which may be applicable to the administration of this schedule."]
[]
[null,"No rates and charges for the distribution of electricity and charges to meet the costs of any work or service done or furnished for the purpose of the distribution of electricity shall be made except as permitted by this schedule, unless required by the Distributor’s Licence or a Code or Order of the Ontario Energy Board, and amendments thereto as approved by the Ontario Energy Board, or as specified herein."]
[]
[null,"Unless specifically noted, this schedule does not contain any charges for the electricity commodity, be it under the Regulated Price Plan, a contract with a retailer or the wholesale market price, as applicable. In addition, the charges in the MONTHLY RATES AND CHARGES - Regulatory Component of this schedule do not apply to a customer that is an embedded wholesale market participant."]
[null,"The rate rider for the disposition of WMS Sub-Account CBR Class B is not applicable to wholesale market participant (WMP) customers.  It is not applicable to WMP customers that transitioned between Class A and Class B during the variance account accumulation period, or to customers that were in Class A for the entire period.  Customers that transitioned are to be charged or refunded their share of the variance disposed through customer specific billing adjustments.  The rate rider is to be consistently applied for the entire period to the sunset date of the rate rider.  In addition, this rate rider is applicable to all new non-RPP Class B customers."]
[null,"\nThe rate rider for the disposition of Global Adjustment is only applicable to non-RPP Class B customers.  It is not applicable to WMP customers that transitioned between Class A and Class B during the variance account accumulation period, or to customers that were in Class A for the entire period.  Customers that transitioned are to be charged or refunded their share of the variance disposed through customer specific billing adjustments.  The rate rider is to be consistently applied for the entire period to the sunset date of the rate rider. In addition, this rate rider is applicable to all new non-RPP Class B customers.\n"]
[null,"It should be noted that this schedule does not list any charges, assessments, or credits that are required by law to be invoiced by a distributor and that are not subject to Ontario Energy Board approval, such as the Debt Retirement Charge, the Global Adjustment and the HST."]
[null,"Billing demands are established at the greater of 100% of the kW, or 90% of the kVA amounts."]
[]
[null,"MONTHLY RATES AND CHARGES - Delivery Component"]
[]
["GS500_F","Service Charge",null,"$",{"$f":"VLOOKUP(A158,RATES!A:I,9,FALSE)","v":1807.02}]
["GS500_ICMF17","Rate Rider for Recovery of Incremental Capital (2017) - in effect until the effective date of the next cost of service based rate order",null,"$",{"$f":"VLOOKUP(A159,RATES!A:I,9,FALSE)","v":44}]
["GS500_ICMF18","Rate Rider for Recovery of Incremental Capital (2018) - in effect until the effective date of the next cost of service based rate order",null,"$",{"$f":"VLOOKUP(A160,RATES!A:I,9,FALSE)","v":11.65}]
["GS500_ICMF19","Rate Rider for Recovery of Incremental Capital (2019) - in effect until the effective date of the next cost of service based rate order",null,"$",{"$f":"VLOOKUP(A161,RATES!A:I,9,FALSE)","v":8.5399999999999991}]
["GS500_ICMF20","Rate Rider for Recovery of Incremental Capital (2020) - in effect until the effective date of the next cost of service based rate order",null,"$",{"$f":"VLOOKUP(A162,RATES!A:I,9,FALSE)","v":8.8699999999999992}]
["GS500_MFF20","Rate Rider for Recovery of M-factor Capital (2020) - in effect until the effective date of the next cost of service based rate order",null,{"$f":"VLOOKUP(A163,RATES!A:I,7,FALSE)","v":"$"},{"$f":"VLOOKUP(A163,RATES!A:I,9,FALSE)","v":8.8699999999999992}]
["GS500_V","Distribution Volumetric Rate",null,"$/kW",{"$f":"VLOOKUP(A164,RATES!A:I,9,FALSE)","v":2.4573}]
["GS500_LV","Low Voltage Service Rate ",null,"$/kW",{"$f":"VLOOKUP(A165,RATES!A:I,9,FALSE)","v":7.8399999999999997E-2}]
["GS500_GA20","Rate Rider for Disposition of Global Adjustment Account (2020) - effective until December 31, 2020\n      Applicable only for Non Wholesale Market Participant Non-RPP Customers",null,"$/kWh",{"$f":"VLOOKUP(A166,RATES!A:I,9,FALSE)","v":-3.2000000000000002E-3}]
["GS500_CBR20","Rate Rider for Disposition of Capacity Based Recovery Account (2020) - effective until December 31, 2020\n        Applicable Only for Non Wholesale Market Participant Class B Customers",null,"$/kW",{"$f":"VLOOKUP(A167,RATES!A:I,9,FALSE)","v":-4.0800000000000003E-2}]
["GS500_DVA20nonWMP","Rate Rider for Disposition of Deferral/Variance Accounts (2020) - effective until December 31, 2020\n      Applicable only for Non-Wholesale Market Participants",null,"$/kW",{"$f":"VLOOKUP(A168,RATES!A:I,9,FALSE)","v":-0.26590000000000003}]
["GS500_DVA20","Rate Rider for Disposition of Deferral/Variance Accounts (2020) - effective until December 31, 2020",null,"$/kW",{"$f":"VLOOKUP(A169,RATES!A:I,9,FALSE)","v":0.40839999999999999}]
["GS500_LRV20","Rate Rider for Disposition of Lost Revenue Adjustment Mechanism Variance Account (LRAMVA) (2020) - effective until December 31, 2020",null,"$/kW",{"$f":"VLOOKUP(A170,RATES!A:I,9,FALSE)","v":0.1033}]
["GS500_ICMV17","Rate Rider for Recovery of Incremental Capital (2017) - in effect until the effective date of the next cost of service based rate order",null,"$/kW",{"$f":"VLOOKUP(A171,RATES!A:I,9,FALSE)","v":5.9799999999999999E-2}]
["GS500_ICMV18","Rate Rider for Recovery of Incremental Capital (2018) - in effect until the effective date of the next cost of service based rate order",null,"$/kW",{"$f":"VLOOKUP(A172,RATES!A:I,9,FALSE)","v":1.5800000000000002E-2}]
["GS500_ICMV19","Rate Rider for Recovery of Incremental Capital (2019) - in effect until the effective date of the next cost of service based rate order",null,"$/kW",{"$f":"VLOOKUP(A173,RATES!A:I,9,FALSE)","v":1.1599999999999999E-2}]
["GS500_ICMV20","Rate Rider for Recovery of Incremental Capital (2020) - in effect until the effective date of the next cost of service based rate order",null,"$/kW",{"$f":"VLOOKUP(A174,RATES!A:I,9,FALSE)","v":1.21E-2}]
["GS500_MFV20","Rate Rider for Recovery of M-factor Capital (2020) - in effect until the effective date of the next cost of service based rate order",null,"$/kW",{"$f":"VLOOKUP(A175,RATES!A:I,9,FALSE)","v":1.21E-2}]
["GS500_TN","Retail Transmission Rate - Network Service Rate",null,"$/kW",{"$f":"VLOOKUP(A176,RATES!A:I,9,FALSE)","v":2.7679999999999998}]
["GS500_TC","Retail Transmission Rate - Line and Transformation Connection Service Rate",null,"$/kW",{"$f":"VLOOKUP(A177,RATES!A:I,9,FALSE)","v":2.6762999999999999}]
[]
[null,"MONTHLY RATES AND CHARGES - Regulatory Component"]
[]
[null,"Wholesale Market Service Rate (WMS) - not including CBR",null,"$/kWh",3.0000000000000001E-3]
[null,"Capacity Based Recovery (CBR) - Applicable for Class B Customers ",null,"$/kWh",4.0000000000000002E-4]
[null,"Rural or Remote Electricity Rate Protection Charge (RRRP)",null,"$/kWh",5.0000000000000001E-4]
[null,"Standard Supply Service - Administrative Charge (if applicable)",null,"$",0.25]
[null,"LARGE USE SERVICE CLASSIFICATION"]
[null,"This classification refers to an account whose monthly average peak demand is equal to or greater than, or is forecast to be equal to or greater than, 5,000 kW.  Class A and Class B consumers are defined in accordance with O. Reg. 429/04.  Further servicing details are available in the distributor’s Conditions of Service."]
[]
[null,"APPLICATION"]
[]
[null,"The application of these rates and charges shall be in accordance with the Licence of the Distributor and any Code or Order of the Ontario Energy Board, and amendments thereto as approved by the Ontario Energy Board, which may be applicable to the administration of this schedule."]
[]
[null,"No rates and charges for the distribution of electricity and charges to meet the costs of any work or service done or furnished for the purpose of the distribution of electricity shall be made except as permitted by this schedule, unless required by the Distributor’s Licence or a Code or Order of the Ontario Energy Board, and amendments thereto as approved by the Ontario Energy Board, or as specified herein."]
[]
[null,"Unless specifically noted, this schedule does not contain any charges for the electricity commodity, be it under the Regulated Price Plan, a contract with a retailer or the wholesale market price, as applicable. In addition, the charges in the MONTHLY RATES AND CHARGES - Regulatory Component of this schedule do not apply to a customer that is an embedded wholesale market participant."]
[]
[null,"It should be noted that this schedule does not list any charges, assessments, or credits that are required by law to be invoiced by a distributor and that are not subject to Ontario Energy Board approval, such as the Debt Retirement Charge, the Global Adjustment and the HST."]
[null,"Billing demands are established at the greater of 100% of the kW, or 90% of the kVA amounts."]
[]
[null,"MONTHLY RATES AND CHARGES - Delivery Component"]
[]
["LU_F","Service Charge",null,"$",{"$f":"VLOOKUP(A201,RATES!A:I,9,FALSE)","v":14247.61}]
["LU_ICMF17","Rate Rider for Recovery of Incremental Capital (2017) - in effect until the effective date of the next cost of service based rate order",null,"$",{"$f":"VLOOKUP(A202,RATES!A:I,9,FALSE)","v":346.9}]
["LU_ICMF18","Rate Rider for Recovery of Incremental Capital (2018) - in effect until the effective date of the next cost of service based rate order",null,"$",{"$f":"VLOOKUP(A203,RATES!A:I,9,FALSE)","v":91.89}]
["LU_ICMF19","Rate Rider for Recovery of Incremental Capital (2019) - in effect until the effective date of the next cost of service based rate order",null,"$",{"$f":"VLOOKUP(A204,RATES!A:I,9,FALSE)","v":67.349999999999994}]
["LU_ICMF20","Rate Rider for Recovery of Incremental Capital (2020) - in effect until the effective date of the next cost of service based rate order",null,"$",{"$f":"VLOOKUP(A205,RATES!A:I,9,FALSE)","v":69.94}]
["LU_MFF20","Rate Rider for Recovery of M-factor Capital (2020) - in effect until the effective date of the next cost of service based rate order",null,{"$f":"VLOOKUP(A206,RATES!A:I,7,FALSE)","v":"$"},{"$f":"VLOOKUP(A206,RATES!A:I,9,FALSE)","v":69.94}]
["LU_V","Distribution Volumetric Rate",null,"$/kW",{"$f":"VLOOKUP(A207,RATES!A:I,9,FALSE)","v":3.0501}]
["LU_LV","Low Voltage Service Rate ",null,"$/kW",{"$f":"VLOOKUP(A208,RATES!A:I,9,FALSE)","v":8.3799999999999999E-2}]
["LU_DVA20","Rate Rider for Disposition of Deferral/Variance Accounts (2020) - effective until December 31, 2020",null,"$/kW",{"$f":"VLOOKUP(A209,RATES!A:I,9,FALSE)","v":0.1787}]
["LU_LRV20","Rate Rider for Disposition of Lost Revenue Adjustment Mechanism Variance Account (LRAMVA) (2020) - effective until December 31, 2020",null,"$/kW",{"$f":"VLOOKUP(A210,RATES!A:I,9,FALSE)","v":9.2999999999999999E-2}]
["LU_ICMV17","Rate Rider for Recovery of Incremental Capital (2017) - in effect until the effective date of the next cost of service based rate order",null,"$/kW",{"$f":"VLOOKUP(A211,RATES!A:I,9,FALSE)","v":7.4300000000000005E-2}]
["LU_ICMV18","Rate Rider for Recovery of Incremental Capital (2018) - in effect until the effective date of the next cost of service based rate order",null,"$/kW",{"$f":"VLOOKUP(A212,RATES!A:I,9,FALSE)","v":1.9699999999999999E-2}]
["LU_ICMV19","Rate Rider for Recovery of Incremental Capital (2019) - in effect until the effective date of the next cost of service based rate order",null,"$/kW",{"$f":"VLOOKUP(A213,RATES!A:I,9,FALSE)","v":1.44E-2}]
["LU_ICMV20","Rate Rider for Recovery of Incremental Capital (2020) - in effect until the effective date of the next cost of service based rate order",null,"$/kW",{"$f":"VLOOKUP(A214,RATES!A:I,9,FALSE)","v":1.4999999999999999E-2}]
["LU_MFV20","Rate Rider for Recovery of M-factor Capital (2020) - in effect until the effective date of the next cost of service based rate order",null,"$/kW",{"$f":"VLOOKUP(A215,RATES!A:I,9,FALSE)","v":1.4999999999999999E-2}]
["LU_TN","Retail Transmission Rate - Network Service Rate – Interval Metered",null,"$/kW",{"$f":"VLOOKUP(A216,RATES!A:I,9,FALSE)","v":2.9538000000000002}]
["LU_TC","Retail Transmission Rate - Line and Transformation Connection Service Rate – Interval Metered ",null,"$/kW",{"$f":"VLOOKUP(A217,RATES!A:I,9,FALSE)","v":2.8584000000000001}]
[]
[null,"MONTHLY RATES AND CHARGES - Regulatory Component"]
[]
[null,"Wholesale Market Service Rate (WMS) - not including CBR",null,"$/kWh",3.0000000000000001E-3]
[null,"Capacity Based Recovery (CBR) - Applicable for Class B Customers ",null,"$/kWh",4.0000000000000002E-4]
[null,"Rural or Remote Electricity Rate Protection Charge (RRRP)",null,"$/kWh",5.0000000000000001E-4]
[null,"Standard Supply Service - Administrative Charge (if applicable)",null,"$",0.25]
[]
[null,"UNMETERED SCATTERED LOAD SERVICE CLASSIFICATION"]
[null,"This classification applies to an account taking electricity at 750 volts or less whose average monthly maximum demand is less than, or is forecast to be less than, 50 kW and the consumption is unmetered. The amount of electricity consumed by unmetered connections will be based on detailed information/documentation provided by the device's manufacturer abd will be agreed to by Alectra Utilities and the customer and may be subject to periodic monitoring of actual consumption.  Eligible onmetered loads include cable TV power packs, bus  shelters, telephone booths, traffic lights, railway crossings, etc.   Class B consumers are defined in accordance with O. Reg. 429/04.  Further servicing details are available in the distributor’s Conditions of Service."]
[]
[null,"APPLICATION"]
[]
[null,"The application of these rates and charges shall be in accordance with the Licence of the Distributor and any Code or Order of the Ontario Energy Board, and amendments thereto as approved by the Ontario Energy Board, which may be applicable to the administration of this schedule."]
[]
[null,"No rates and charges for the distribution of electricity and charges to meet the costs of any work or service done or furnished for the purpose of the distribution of electricity shall be made except as permitted by this schedule, unless required by the Distributor’s Licence or a Code or Order of the Ontario Energy Board, and amendments thereto as approved by the Ontario Energy Board, or as specified herein."]
[]
[null,"Unless specifically noted, this schedule does not contain any charges for the electricity commodity, be it under the Regulated Price Plan, a contract with a retailer or the wholesale market price, as applicable. In addition, the charges in the MONTHLY RATES AND CHARGES - Regulatory Component of this schedule do not apply to a customer that is an embedded wholesale market participant."]
[]
[null,"It should be noted that this schedule does not list any charges, assessments, or credits that are required by law to be invoiced by a distributor and that are not subject to Ontario Energy Board approval, such as the Debt Retirement Charge, the Global Adjustment and the HST."]
[]
[null,"MONTHLY RATES AND CHARGES - Delivery Component"]
[]
["USL_F","Service Charge (per connection)",null,"$",{"$f":"VLOOKUP(A241,RATES!A:I,9,FALSE)","v":9.3000000000000007}]
["USL_ICMF17","Rate Rider for Recovery of Incremental Capital (2017) - in effect until the effective date of the next cost of service based rate order",null,"$",{"$f":"VLOOKUP(A242,RATES!A:I,9,FALSE)","v":0.23}]
["USL_ICMF18","Rate Rider for Recovery of Incremental Capital (2018) - in effect until the effective date of the next cost of service based rate order",null,"$",{"$f":"VLOOKUP(A243,RATES!A:I,9,FALSE)","v":0.06}]
["USL_ICMF19","Rate Rider for Recovery of Incremental Capital (2019) - in effect until the effective date of the next cost of service based rate order",null,"$",{"$f":"VLOOKUP(A244,RATES!A:I,9,FALSE)","v":0.04}]
["USL_ICMF20","Rate Rider for Recovery of Incremental Capital (2020) - in effect until the effective date of the next cost of service based rate order",null,"$",{"$f":"VLOOKUP(A245,RATES!A:I,9,FALSE)","v":0.05}]
["USL_MFF20","Rate Rider for Recovery of M-factor Capital (2020) - in effect until the effective date of the next cost of service based rate order",null,{"$f":"VLOOKUP(A246,RATES!A:I,7,FALSE)","v":"$"},{"$f":"VLOOKUP(A246,RATES!A:I,9,FALSE)","v":0.05}]
["USL_V","Distribution Volumetric Rate",null,"$/kWh",{"$f":"VLOOKUP(A247,RATES!A:I,9,FALSE)","v":1.6899999999999998E-2}]
["USL_LV","Low Voltage Service Rate ",null,"$/kWh",{"$f":"VLOOKUP(A248,RATES!A:I,9,FALSE)","v":2.0000000000000001E-4}]
["USL_GA20","Rate Rider for Disposition of Global Adjustment Account (2020) - effective until December 31, 2020\n      Applicable only for Non-RPP Customers",null,"$/kWh",{"$f":"VLOOKUP(A249,RATES!A:I,9,FALSE)","v":-3.2000000000000002E-3}]
["USL_CBR20","Rate Rider for Disposition of Capacity Based Recovery Account (2020) - effective until December 31, 2020\n        Applicable Only for Class B Customers",null,"$/kWh",{"$f":"VLOOKUP(A250,RATES!A:I,9,FALSE)","v":-1E-4}]
["USL_DVA20","Rate Rider for Disposition of Deferral/Variance Accounts (2020) - effective until December 31, 2020",null,"$/kWh",{"$f":"VLOOKUP(A251,RATES!A:I,9,FALSE)","v":2.9999999999999997E-4}]
["USL_ICMV17","Rate Rider for Recovery of Incremental Capital (2017) - in effect until the effective date of the next cost of service based rate order",null,"$/kWh",{"$f":"VLOOKUP(A252,RATES!A:I,9,FALSE)","v":4.0000000000000002E-4}]
["USL_ICMV18","Rate Rider for Recovery of Incremental Capital (2018) - in effect until the effective date of the next cost of service based rate order",null,"$/kWh",{"$f":"VLOOKUP(A253,RATES!A:I,9,FALSE)","v":1E-4}]
["USL_ICMV19","Rate Rider for Recovery of Incremental Capital (2019) - in effect until the effective date of the next cost of service based rate order",null,"$/kWh",{"$f":"VLOOKUP(A254,RATES!A:I,9,FALSE)","v":1E-4}]
["USL_ICMV20","Rate Rider for Recovery of Incremental Capital (2020) - in effect until the effective date of the next cost of service based rate order",null,"$/kWh",{"$f":"VLOOKUP(A255,RATES!A:I,9,FALSE)","v":1E-4}]
["USL_MFV20","Rate Rider for Recovery of M-factor Capital (2020) - in effect until the effective date of the next cost of service based rate order",null,{"$f":"VLOOKUP(A256,RATES!A:I,7,FALSE)","v":"$/kWh"},{"$f":"VLOOKUP(A256,RATES!A:I,9,FALSE)","v":1E-4}]
["USL_TN","Retail Transmission Rate - Network Service Rate",null,"$/kWh",{"$f":"VLOOKUP(A257,RATES!A:I,9,FALSE)","v":7.4000000000000003E-3}]
["USL_TC","Retail Transmission Rate - Line and Transformation Connection Service Rate",null,"$/kWh",{"$f":"VLOOKUP(A258,RATES!A:I,9,FALSE)","v":6.8999999999999999E-3}]
[]
[null,"MONTHLY RATES AND CHARGES - Regulatory Component"]
[]
[null,"Wholesale Market Service Rate (WMS) - not including CBR",null,"$/kWh",3.0000000000000001E-3]
[null,"Capacity Based Recovery (CBR) - Applicable for Class B Customers ",null,"$/kWh",4.0000000000000002E-4]
[null,"Rural or Remote Electricity Rate Protection Charge (RRRP)",null,"$/kWh",5.0000000000000001E-4]
[null,"Standard Supply Service - Administrative Charge (if applicable)",null,"$",0.25]
[]
[null,"STREET LIGHTING SERVICE CLASSIFICATION"]
[null,"This classification refers to an account for roadway lighting.  Street Lighting is unmetered where energy consumption is estimated based on the connected wattage and calculated hours of use using methods established by the Ontario Energy Board.  Class B consumers are defined in accordance with O. Reg. 429/04.  Further servicing details are available in the distributor’s Conditions of Service."]
[]
[null,"APPLICATION"]
[]
[null,"The application of these rates and charges shall be in accordance with the Licence of the Distributor and any Code or Order of the Ontario Energy Board, and amendments thereto as approved by the Ontario Energy Board, which may be applicable to the administration of this schedule."]
[]
[null,"No rates and charges for the distribution of electricity and charges to meet the costs of any work or service done or furnished for the purpose of the distribution of electricity shall be made except as permitted by this schedule, unless required by the Distributor’s Licence or a Code or Order of the Ontario Energy Board, and amendments thereto as approved by the Ontario Energy Board, or as specified herein."]
[]
[null,"Unless specifically noted, this schedule does not contain any charges for the electricity commodity, be it under the Regulated Price Plan, a contract with a retailer or the wholesale market price, as applicable. In addition, the charges in the MONTHLY RATES AND CHARGES - Regulatory Component of this schedule do not apply to a customer that is an embedded wholesale market participant."]
[]
[null,"It should be noted that this schedule does not list any charges, assessments, or credits that are required by law to be invoiced by a distributor and that are not subject to Ontario Energy Board approval, such as the Debt Retirement Charge, the Global Adjustment and the HST."]
[]
[null,"MONTHLY RATES AND CHARGES - Delivery Component"]
[]
["SL_F","Service Charge (per luminaire)",null,"$",{"$f":"VLOOKUP(A282,RATES!A:I,9,FALSE)","v":1.56}]
["SL_ICMF17","Rate Rider for Recovery of Incremental Capital (2017) - in effect until the effective date of the next cost of service based rate order",null,"$",{"$f":"VLOOKUP(A283,RATES!A:I,9,FALSE)","v":0.04}]
["SL_ICMF18","Rate Rider for Recovery of Incremental Capital (2018) - in effect until the effective date of the next cost of service based rate order",null,"$",{"$f":"VLOOKUP(A284,RATES!A:I,9,FALSE)","v":0.01}]
["SL_ICMF19","Rate Rider for Recovery of Incremental Capital (2019) - in effect until the effective date of the next cost of service based rate order",null,"$",{"$f":"VLOOKUP(A285,RATES!A:I,9,FALSE)","v":0.01}]
["SL_ICMF20","Rate Rider for Recovery of Incremental Capital (2020) - in effect until the effective date of the next cost of service based rate order",null,"$",{"$f":"VLOOKUP(A286,RATES!A:I,9,FALSE)","v":0.01}]
["SL_MFF20","Rate Rider for Recovery of M-factor Capital (2020) - in effect until the effective date of the next cost of service based rate order",null,{"$f":"VLOOKUP(A287,RATES!A:I,7,FALSE)","v":"$"},{"$f":"VLOOKUP(A287,RATES!A:I,9,FALSE)","v":0.01}]
["SL_V","Distribution Volumetric Rate",null,"$/kW",{"$f":"VLOOKUP(A288,RATES!A:I,9,FALSE)","v":11.931699999999999}]
["SL_LV","Low Voltage Service Rate ",null,"$/kW",{"$f":"VLOOKUP(A289,RATES!A:I,9,FALSE)","v":5.8000000000000003E-2}]
["SL_GA20","Rate Rider for Disposition of Global Adjustment Account (2020) - effective until December 31, 2020\n      Applicable only for Non-RPP Customers",null,"$/kWh",{"$f":"VLOOKUP(A290,RATES!A:I,9,FALSE)","v":-3.2000000000000002E-3}]
["SL_CBR20","Rate Rider for Disposition of Capacity Based Recovery Account (2020) - effective until December 31, 2020\n        Applicable Only for Class B Customers",null,"$/kW",{"$f":"VLOOKUP(A291,RATES!A:I,9,FALSE)","v":-3.2099999999999997E-2}]
["SL_DVA20","Rate Rider for Disposition of Deferral/Variance Accounts (2020) - effective until December 31, 2020",null,"$/kW",{"$f":"VLOOKUP(A292,RATES!A:I,9,FALSE)","v":0.1021}]
["SL_LRV20","Rate Rider for Disposition of Lost Revenue Adjustment Mechanism Variance Account (LRAMVA) (2020) - effective until December 31, 2020",null,"$/kW",{"$f":"VLOOKUP(A293,RATES!A:I,9,FALSE)","v":-3.2587999999999999}]
["SL_ICMV17","Rate Rider for Recovery of Incremental Capital (2017) - in effect until the effective date of the next cost of service based rate order",null,"$/kW",{"$f":"VLOOKUP(A294,RATES!A:I,9,FALSE)","v":0.29049999999999998}]
["SL_ICMV18","Rate Rider for Recovery of Incremental Capital (2018) - in effect until the effective date of the next cost of service based rate order",null,"$/kW",{"$f":"VLOOKUP(A295,RATES!A:I,9,FALSE)","v":7.6999999999999999E-2}]
["SL_ICMV19","Rate Rider for Recovery of Incremental Capital (2019) - in effect until the effective date of the next cost of service based rate order",null,"$/kW",{"$f":"VLOOKUP(A296,RATES!A:I,9,FALSE)","v":5.6399999999999999E-2}]
["SL_ICMV20","Rate Rider for Recovery of Incremental Capital (2020) - in effect until the effective date of the next cost of service based rate order",null,"$/kW",{"$f":"VLOOKUP(A297,RATES!A:I,9,FALSE)","v":5.8599999999999999E-2}]
["SL_MFV20","Rate Rider for Recovery of M-factor Capital (2020) - in effect until the effective date of the next cost of service based rate order",null,"$/kW",{"$f":"VLOOKUP(A298,RATES!A:I,9,FALSE)","v":5.8599999999999999E-2}]
["SL_TN","Retail Transmission Rate - Network Service Rate",null,"$/kW",{"$f":"VLOOKUP(A299,RATES!A:I,9,FALSE)","v":1.9814000000000001}]
["SL_TC","Retail Transmission Rate - Line and Transformation Connection Service Rate",null,"$/kW",{"$f":"VLOOKUP(A300,RATES!A:I,9,FALSE)","v":1.9777}]
[]
[null,"MONTHLY RATES AND CHARGES - Regulatory Component"]
[]
[null,"Wholesale Market Service Rate (WMS) - not including CBR",null,"$/kWh",3.0000000000000001E-3]
[null,"Capacity Based Recovery (CBR) - Applicable for Class B Customers ",null,"$/kWh",4.0000000000000002E-4]
[null,"Rural or Remote Electricity Rate Protection Charge (RRRP)",null,"$/kWh",5.0000000000000001E-4]
[null,"Standard Supply Service - Administrative Charge (if applicable)",null,"$",0.25]
[null,"STANDBY POWER SERVICE CLASSIFICATION"]
[null,"This classification refers to an account that requires Alectra Utilities to provide distribution service on a standby basis as a back-up supply to an on-site generator.  Further servicing details are available in the distributor’s Conditions of Service."]
[]
[null,"APPLICATION"]
[]
[null,"The application of these rates and charges shall be in accordance with the Licence of the Distributor and any Code or Order of the Ontario Energy Board, and amendments thereto as approved by the Ontario Energy Board, which may be applicable to the administration of this schedule."]
[]
[null,"No rates and charges for the distribution of electricity and charges to meet the costs of any work or service done or furnished for the purpose of the distribution of electricity shall be made except as permitted by this schedule, unless required by the Distributor’s Licence or a Code or Order of the Ontario Energy Board, and amendments thereto as approved by the Ontario Energy Board, or as specified herein."]
[]
[null,"Unless specifically noted, this schedule does not contain any charges for the electricity commodity, be it under the Regulated Price Plan, a contract with a retailer or the wholesale market price, as applicable."]
[]
[null,"It should be noted that this schedule does not list any charges, assessments or credits that are required by law to be invoiced by a distributor and that are not subject to Ontario Energy Board approval, such as the Debt Retirement Charge, the Global Adjustment and the HST."]
[]
[null,"MONTHLY RATES AND CHARGES – Delivery Component "]
[]
[null,"A Standby Service Charge will be applied for a month where standby power is not provided.  The applicable rate is the approved Distribution Volumetric Rate of the applicable service class and is applied to gross metered demand or contracted amount, whichever is greater.  A monthly administration charge of $200, for simple metering arrangements, or $500, for complex metering arrangements, will also be applied.  "]
[]
[null,"microFIT SERVICE CLASSIFICATION"]
[]
[null,"This classification applies to an electricity generation facility contracted under the Independent Electricity System Operator’s microFIT program and connected to the distributor’s distribution system.  Further servicing details are available in the distributor’s Conditions of Service."]
[]
[null,"APPLICATION"]
[]
[null,"The application of these rates and charges shall be in accordance with the Licence of the Distributor and any Code or Order of the Ontario Energy Board, and amendments thereto as approved by the Ontario Energy Board, which may be applicable to the administration of this schedule."]
[]
[null,"No rates and charges for the distribution of electricity and charges to meet the costs of any work or service done or furnished for the purpose of the distribution of electricity shall be made except as permitted by this schedule, unless required by the Distributor’s Licence or a Code or Order of the Ontario Energy Board, and amendments thereto as approved by the Ontario Energy Board, or as specified herein."]
[]
[null,"Unless specifically noted, this schedule does not contain any charges for the electricity commodity, be it under the Regulated Price Plan, a contract with a retailer or the wholesale market price, as applicable. In addition, the charges in the MONTHLY RATES AND CHARGES - Regulatory Component of this schedule do not apply to a customer that is an embedded wholesale market participant."]
[]
[null,"It should be noted that this schedule does not list any charges, assessments, or credits that are required by law to be invoiced by a distributor and that are not subject to Ontario Energy Board approval, such as the Debt Retirement Charge, the Global Adjustment and the HST."]
[]
[null,"MONTHLY RATES AND CHARGES - Delivery Component"]
[null,"Service Charge",null,"$",5.4]
[]
[null,"ALLOWANCES"]
[null,"Transformer Allowance for Ownership - per kW of billing demand/month",null,"$/kW",-0.4]
[null,"Primary Metering Allowance for transformer losses - applied to measured demand and energy",null,"%",-1]
[null,"SPECIFIC SERVICE CHARGES"]
[]
[null,"APPLICATION"]
[]
[null,"The application of these rates and charges shall be in accordance with the Licence of the Distributor and any Code or Order of the Ontario Energy Board, and amendments thereto as approved by the Ontario Energy Board, which may be applicable to the administration of this schedule."]
[]
[null,"No charges to meet the costs of any work or service done or furnished for the purpose of the distribution of electricity shall be made except as permitted by this schedule, unless required by the Distributor’s Licence or a Code or Order of the Ontario Energy Board, and amendments thereto as approved by the Ontario Energy Board, or as specified herein."]
[]
[null,"It should be noted that this schedule does not list any charges, assessments or credits that are required by law to be invoiced by a distributor and that are not subject to Ontario Energy Board approval, such as the Debt Retirement Charge, the Global Adjustment and the HST."]
[null,"Customer Administration"]
[null,"Arrears certificate",null,"$",15]
[null,"Request for other billing information",null,"$",15]
[null,"Credit reference/credit check (plus credit agency costs)",null,"$",15]
[null,"Credit reference/credit check (plus credit agency costs – General Service)",null,"$",25]
[null,"Income tax letter",null,"$",15]
[null,"Returned cheque (plus bank charges)",null,"$",12.5]
[null,"Account set up charge/change of occupancy charge (plus credit agency costs if applicable)",null,"$",30]
[null,"Account set up charge/change of occupancy charge (plus credit agency costs if applicable – Residential)",null,"$",20]
[null,"Meter dispute charge plus Measurement Canada fees (if meter found correct)",null,"$",10]
[null,"Special meter reads",null,"$",30]
[null,"Interval meter request change",null,"$",40]
[]
[null,"Non-Payment of Account"]
[null,"Late payment - per month",null,"%",1.5]
[null,"Late payment - per annum",null,"%",19.559999999999999]
[null,"Collection of account charge – no disconnection",null,"$",9]
[null,"Disconnect/reconnect at meter - during regular hours",null,"$",20]
[null,"Disconnect/reconnect at pole - during regular hours",null,"$",185]
[null,"Disconnect/reconnect at pole - after regular hours",null,"$",415]
[]
[null,"Other"]
[null,"Temporary service install and remove – overhead – no transformer",null,"$",400]
[null,"Specific Charge for Access to the Power Poles - $/pole/year (with the exception of wireless attachments)\n- in effect from January 1, 2019",null,"$",43.63]
[]
[null,"RETAIL SERVICE CHARGES (if applicable)"]
[]
[null,"The application of these rates and charges shall be in accordance with the Licence of the Distributor and any Code or Order of the Ontario Energy Board, and amendments thereto as approved by the Ontario Energy Board, which may be applicable to the administration of this schedule."]
[]
[null,"No rates and charges for the distribution of electricity and charges to meet the costs of any work or service done or furnished for the purpose of the distribution of electricity shall be made except as permitted by this schedule, unless required by the Distributor’s Licence or a Code or Order of the Ontario Energy Board, and amendments thereto as approved by the Ontario Energy Board, or as specified herein."]
[]
[null,"Unless specifically noted, this schedule does not contain any charges for the electricity commodity, be it under the Regulated Price Plan, a contract with a retailer or the wholesale market price, as applicable."]
[]
[null,"It should be noted that this schedule does not list any charges, assessments, or credits that are required by law to be invoiced by a distributor and that are not subject to Ontario Energy Board approval, such as the Debt Retirement Charge, the Global Adjustment and the HST."]
[]
[null,"Retail Service Charges refer to services provided by a distributor to retailers or customers related to the supply of competitive electricity."]
[null,"One-time charge, per retailer, to establish the service agreement between the distributor and the retailer",null,"$",100]
[null,"Monthly fixed charge, per retailer",null,"$",40]
[null,"Monthly variable charge, per customer, per retailer",null,"$/cust.",1]
[null,"Distributor-consolidated billing monthly charge, per customer, per retailer",null,"$/cust.",0.6]
[null,"Retailer-consolidated billing monthly credit, per customer, per retailer",null,"$/cust.",-0.6]
[null,"Service Transaction Requests (STR)"]
[null,"Request fee, per request, applied to the requesting party",null,"$",0.5]
[null,"Processing fee, per request, applied to the requesting party",null,"$",1]
[null,"Request for customer information as outlined in Section 10.6.3 and Chapter 11 of the Retail"]
[null,"Settlement Code directly to retailers and customers, if not delivered electronically through the"]
[null,"Electronic Business Transaction (EBT) system, applied to the requesting party"]
[null,"Up to twice a year",null,"$","no charge"]
[null,"More than twice a year, per request (plus incremental delivery costs)",null,"$",4]
[null,"Notice of switch letter charge, per letter",null,"$",2]
[null,"The new notice of switch letter service charge will apply only to letters that are sent by standard hard copy mail. In accordance with the Report of the Ontario Energy Board: Energy Retailer Services Charges issued on November 29, 2018, electricity distributors may opt out of applying the charge to energy retailers by notifying the OEB within 60 days of the issuance of this Order."]
[null,"LOSS FACTORS"]
[]
[null,"If the distributor is not capable of prorating changed loss factors jointly with distribution rates, the revised loss factors will be implemented upon the first subsequent billing for each billing cycle.",null,null,1.036]
[null,"Total Loss Factor - Secondary Metered Customer > 5,000 kW",null,null,1.0145]
[null,"Total Loss Factor - Primary Metered Customer < 5,000 kW",null,null,1.0256000000000001]
[null,"Total Loss Factor - Primary Metered Customer > 5,000 kW",null,null,1.0044999999999999]

{"sheet":"21. Bill Impacts","index":25,"n_rows":483,"n_cols":22,"rows_kept":483,"cut":false,"hidden":false,"merged":[[440,5,441,5],[440,12,441,12],[440,13,441,13],[471,4,471,5],[476,4,476,5],[481,4,481,5],[428,4,428,5],[432,5,432,10],[433,5,433,7],[439,6,439,8],[439,9,439,11],[439,12,439,13],[386,12,386,13],[387,5,388,5],[387,12,388,12],[387,13,388,13],[417,4,417,5],[422,4,422,5],[365,4,365,5],[370,4,370,5],[375,4,375,5],[379,5,379,10],[380,5,380,7],[386,6,386,8],[386,9,386,11],[326,5,326,10],[327,5,327,7],[333,6,333,8],[333,9,333,11],[333,12,333,13],[334,5,335,5],[334,12,335,12],[334,13,335,13],[281,5,282,5],[281,12,282,12],[281,13,282,13],[312,4,312,5],[317,4,317,5],[322,4,322,5],[269,4,269,5],[273,5,273,10],[274,5,274,7],[280,6,280,8],[280,9,280,11],[280,12,280,13],[227,12,227,13],[228,5,229,5],[228,12,229,12],[228,13,229,13],[258,4,258,5],[263,4,263,5],[205,4,205,5],[210,4,210,5],[216,4,216,5],[220,5,220,10],[221,5,221,7],[227,6,227,8],[227,9,227,11],[167,5,167,10],[168,5,168,7],[174,6,174,8],[174,9,174,11],[174,12,174,13],[175,5,176,5],[175,12,176,12],[175,13,176,13],[122,5,123,5],[122,12,123,12],[122,13,123,13],[153,4,153,5],[158,4,158,5],[163,4,163,5],[36,15,36,16],[36,17,36,18],[37,15,37,16],[37,17,37,18],[110,4,110,5],[114,5,114,10],[115,5,115,7],[121,6,121,8],[121,9,121,11],[121,12,121,13],[68,12,68,13],[69,5,70,5],[69,12,70,12],[69,13,70,13],[100,4,100,5],[105,4,105,5],[68,6,68,8],[68,9,68,11],[10,4,10,10],[1,4,8,10],[36,4,38,5],[61,5,61,10],[62,5,62,7],[36,6,38,6],[36,7,36,12],[36,13,36,14],[37,7,37,8],[37,9,37,10],[37,11,37,12],[37,13,37,14]]}
["Back to Index"]
[null,null,null,null,{"$f":"+'1. Information Sheet'!B2","v":"INCENTIVE REGULATION MODEL FOR 2020 FILERS"}]
[]
[]
[]
[]
[]
[]
[]
[]
[null,null,null,null,"The bill comparisons below must be provided for typical customers and consumption levels. Bill impacts must be provided for residential customers consuming 750 kWh per month and general service customers consuming 2,000 kWh per month and having a monthly demand of less than 50 kW. Include bill comparisons for Non-RPP (retailer) as well. To assess the combined effects of the shift to fixed rates and other bill impacts associated with changes in the cost of distribution service, applicants are to include a total bill impact for a residential customer at the distributor’s 10th consumption percentile (In other words, 10% of a distributor’s residential customers consume at or less than this level of consumption on a monthly basis). Refer to page 9 of the Filing Requirements For Electricity Distribution Rate Applications issued July 14, 2016.\n\nFor certain classes where one or more customers have unique consumption and demand patterns and which may be significantly impacted by the proposed rate changes, the distributor must show a typical comparison, and provide an explanation.\n\nNote:  \n1. For those classes that are not eligible for the RPP price, the weighted average price including Class B GA through end of February 2017 of $0.1058/kWh (IESO's Monthly Market Report for February 2017, page 22) has been used to represent the cost of power. For those classes on a retailer contract, applicants should enter the contract price (plus GA) for a more accurate estimate. Changes to the cost of power can be made directly on the bill impact table for the specific class.\n2. Please enter the applicable billing determinant (e.g. number of connections or devices) to be applied to the monthly service charge for unmetered rate classes in column N. If the monthly service charge is applied on a per customer basis, enter the number “1”. Distributors should provide the number of connections or devices reflective of a typical customer in each class."]
[]
[null,null,null,null,"Table 1"]
[null,null,null,null,"RATE CLASSES / CATEGORIES \n(eg: Residential TOU, Residential Retailer)",null,"Units","RPP?\nNon-RPP Retailer?\nNon-RPP\nOther?","Current \nLoss Factor ","Proposed Loss Factor","Consumption (kWh)","Demand kW\n(if applicable)","RTSR\n","Billing Determinant Applied to Fixed Charge for Unmetered Classes (e.g. # of devices/connections)."]
[null,1,1,null,{"$f":"'4. Billing Det. for Def-Var'!B17","v":"RESIDENTIAL SERVICE CLASSIFICATION"},null,{"$f":"IF(ISERROR(VLOOKUP(E15,BILLING_DETERMINANTS,2,FALSE)),\"\",(VLOOKUP(E15,BILLING_DETERMINANTS,2,FALSE)))","v":"kWh"},"RPP",{"$f":"LLF","v":1.036},{"$f":"IF(ISBLANK(I15),\"\", I15)","v":1.036},750,null,"N/A",null,null,null,null,null,null,{"$f":"SUM(I15:L15)","v":752.072},78,1]
[null,2,2,null,{"$f":"'4. Billing Det. for Def-Var'!B18","v":"GENERAL SERVICE LESS THAN 50 kW SERVICE CLASSIFICATION"},null,"kWh","RPP",{"$f":"LLF","v":1.036},{"$f":"IF(ISBLANK(I16),\"\", I16)","v":1.036},2000,null,"N/A",null,null,null,null,null,null,2002.0719999999999,{"$f":"U15+68","v":146},2]
[null,3,3,null,{"$f":"'4. Billing Det. for Def-Var'!B19","v":"GENERAL SERVICE 50 to 499 kW SERVICE CLASSIFICATION"},null,"kW","Non-RPP (Other)",{"$f":"LLF","v":1.036},1.036,100000,230,"DEMAND",null,null,null,null,null,null,100232.072,{"$f":"U16+68","v":214},3]
[null,4,4,null,{"$f":"'4. Billing Det. for Def-Var'!B20","v":"GENERAL SERVICE 500 to 4,999 kW SERVICE CLASSIFICATION"},null,"kW","Non-RPP (Other)",{"$f":"LLF","v":1.036},1.036,400000,2250,"DEMAND",null,null,null,null,null,null,402252.07199999999,282,4]
[null,5,5,null,{"$f":"'4. Billing Det. for Def-Var'!B21","v":"LARGE USE SERVICE CLASSIFICATION"},null,"kW","Non-RPP (Other)",1.0145,1.0145,3000000,5000,"DEMAND",1,null,null,null,null,null,3005002.0290000001,350,5]
[null,6,6,null,{"$f":"'4. Billing Det. for Def-Var'!B22","v":"STANDBY POWER SERVICE CLASSIFICATION "},null,"kW",null,null,null,0,0,"DEMAND",null,null,null,null,null,null,{"$f":"SUM(I20:L20)","v":0},418,6]
[null,7,7,null,{"$f":"'4. Billing Det. for Def-Var'!B23","v":"UNMETERED SCATTERED LOAD SERVICE CLASSIFICATION"},null,"kWh","RPP",{"$f":"LLF","v":1.036},1.036,300,null,"N/A",1,null,null,null,null,null,302.072,486,7]
[null,8,8,null,{"$f":"'4. Billing Det. for Def-Var'!B24","v":"STREET LIGHTING SERVICE CLASSIFICATION"},null,"kW","Non-RPP (Other)",1.036,1.036,33,0.1,"DEMAND",1,null,null,null,null,null,35.172000000000004,554,8]
[null,9,{"$f":"IF(ISERROR(VLOOKUP(E23, E$15:V$33, 18, FALSE)),\"\", VLOOKUP(E23, E$15:V$33, 18, FALSE))","v":1},null,"RESIDENTIAL SERVICE CLASSIFICATION","(10th consumption percentile)","kWh","Non-RPP (Other)",1.036,1.036,750,null,"N/A",null,null,null,null,null,null,752.072,622]
[null,null,null,null,"Add additional scenarios if required",null,""]
[null,null,null,null,"Add additional scenarios if required",null,""]
[null,12,{"$f":"IF(ISERROR(VLOOKUP(E26, E$15:V$33, 18, FALSE)),\"\", VLOOKUP(E26, E$15:V$33, 18, FALSE))","v":0},null,"Add additional scenarios if required",null,"",null,null,null,null,null,null,null,null,null,null,null,null,0,68]
[null,13,0,null,"Add additional scenarios if required",null,"",null,null,null,null,null,null,null,null,null,null,null,null,0,136]
[null,14,0,null,"Add additional scenarios if required",null,"",null,null,null,null,null,null,null,null,null,null,null,null,0,204]
[null,15,0,null,"Add additional scenarios if required",null,"",null,null,{"$f":"IF(ISBLANK(I29),\"\", I29)","v":""},null,null,null,null,null,null,null,null,null,0,272]
[null,16,0,null,"Add additional scenarios if required",null,"",null,null,"",null,null,null,null,null,null,null,null,null,0,340]
[null,17,0,null,"Add additional scenarios if required",null,"",null,null,"",null,null,null,null,null,null,null,null,null,0,408]
[null,18,0,null,"Add additional scenarios if required",null,"",null,null,"",null,null,null,null,null,null,null,null,null,0,476]
[null,19,0,null,"Add additional scenarios if required",null,"",null,null,"",null,null,null,null,null,null,null,null,null,0,544]
[]
[]
[null,null,null,null,"Table 2"]
[null,null,null,null,"RATE CLASSES / CATEGORIES \n(eg: Residential TOU, Residential Retailer)",null,"Units","Sub-Total",null,null,null,null,null,"Total",null,"Total (Before Tax)",null,"Total"]
[null,null,null,null,null,null,null,"A",null,"B",null,"C",null,"A + B + C",null,"A + B + C",null,"A + B + C"]
[null,null,null,null,null,null,null,"$","%","$","%","$","%","$","%","$","%","$","%"]
[null,{"$f":"H15","v":"RPP"},{"$f":"B15","v":1},null,{"$f":"IF(ISBLANK(E15), \"\", IF(E15 = \"Add additional scenarios if required\", \"\", IF(O15=\"INTERVAL\", E15 & \" - \" & H15 & \" - Interval Customers\", E15 & \" - \" &H15)))","v":"RESIDENTIAL SERVICE CLASSIFICATION - RPP"},null,{"$f":"IF(ISBLANK(G15), \"\", G15)","v":"kWh"},{"$f":"IF(LEN($G40)>1, (SUMPRODUCT(--($C$72:$C$871=$B15), --($A$72:$A$871=$E15), --($B$72:$B$871=\"ST_A\"), $M$72:$M$871)), \"\")","v":0.57500000000000284},{"$f":"IF(LEN($G40)>1, (SUMPRODUCT(--($C$72:$C$871=$B15), --($A$72:$A$871=$E15), --($B$72:$B$871=\"ST_A\"), $N$72:$N$871)), \"\")","v":2.2718293164757125E-2},{"$f":"IF(LEN($G40)>1, (SUMPRODUCT(--($C$72:$C$871=$B15), --($A$72:$A$871=$E15), --($B$72:$B$871=\"ST_B\"), $M$72:$M$871)), \"\")","v":0.95000000000000284},{"$f":"IF(LEN($G40)>1, (SUMPRODUCT(--($C$72:$C$871=$B15), --($A$72:$A$871=$E15), --($B$72:$B$871=\"ST_B\"), $N$72:$N$871)), \"\")","v":3.3985071610123367E-2},{"$f":"IF(LEN($G40)>1, (SUMPRODUCT(--($C$72:$C$871=$B15), --($A$72:$A$871=$E15), --($B$72:$B$871=\"ST_C\"), $M$72:$M$871)), \"\")","v":1.5499999999999972},{"$f":"IF(LEN($G40)>1, (SUMPRODUCT(--($C$72:$C$871=$B15), --($A$72:$A$871=$E15), --($B$72:$B$871=\"ST_C\"), $N$72:$N$871)), \"\")","v":3.9613120376605693E-2},{"$f":"IF(LEN($G40)>1, (SUMPRODUCT(--($C$72:$C$871=$B15), --($A$72:$A$871=$E15), --($B$72:$B$871=$B40&\"_TOTAL\"), $M$72:$M$871)), \"\")","v":1.6274999999999835},{"$f":"IF(LEN($G40)>1, (SUMPRODUCT(--($C$72:$C$871=$B15), --($A$72:$A$871=$E15), --($B$72:$B$871=$B40&\"_TOTAL\"), $N$72:$N$871)), \"\")","v":1.487934530880626E-2},{"$f":"IF(LEN($G40)>1, (SUMPRODUCT(--($C$72:$C$871=$B15), --($A$72:$A$871=$E15), --($B$72:$B$871=$B40&\"_BT\"), $M$72:$M$871)), \"\")","v":1.5499999999999972},{"$f":"IF(LEN($G40)>1, (SUMPRODUCT(--($C$72:$C$871=$B15), --($A$72:$A$871=$E15), --($B$72:$B$871=$B40&\"_BT\"), $N$72:$N$871)), \"\")","v":1.4879345308806385E-2},{"$f":"IF(LEN($G40)>1, (SUMPRODUCT(--($C$72:$C$871=$B15), --($A$72:$A$871=$E15), --($B$72:$B$871=$B40&\"_NET\"), $M$72:$M$871)), \"\")","v":1.7514999999999965},{"$f":"IF(LEN($G40)>1, (SUMPRODUCT(--($C$72:$C$871=$B15), --($A$72:$A$871=$E15), --($B$72:$B$871=$B40&\"_NET\"), $N$72:$N$871)), \"\")","v":1.4879345308806382E-2}]
[null,{"$f":"H16","v":"RPP"},{"$f":"B16","v":2},null,{"$f":"IF(ISBLANK(E16), \"\", IF(E16 = \"Add additional scenarios if required\", \"\", IF(O16=\"INTERVAL\", E16 & \" - \" & H16 & \" - Interval Customers\", E16 & \" - \" &H16)))","v":"GENERAL SERVICE LESS THAN 50 kW SERVICE CLASSIFICATION - RPP"},null,{"$f":"IF(ISBLANK(G16), \"\", G16)","v":"kWh"},1.2699999999999818,1.72040097534541E-2,2.4699999999999847,3.090621527743001E-2,3.8699999999999761,3.6127977057334032E-2,4.0634999999999764,1.3814028199178933E-2,3.8700000000000045,1.3814028199179028E-2,4.3731000000000009,1.3814028199179016E-2]
[null,"Non-RPP (Other)",3,null,"GENERAL SERVICE 50 to 499 kW SERVICE CLASSIFICATION - Non-RPP (Other)",null,"kW",21.026999999999816,1.6700978850351076E-2,-438.55700000000013,-0.3055367063174132,-375.51400000000012,-0.14120358880641357,-424.33081999999922,-2.5584800401710631E-2,-375.51399999999921,-2.5584800401710624E-2,-424.33081999999899,-2.5584800401710617E-2]
[null,"Non-RPP (Other)",4,null,"GENERAL SERVICE 500 to 4,999 kW SERVICE CLASSIFICATION - Non-RPP (Other)",null,"kW",162.33500000000004,2.0977267896128707E-2,786.03499999999985,0.10452398492581254,1386.3349999999991,7.2319774391788175E-2,1566.5585500000016,2.0617662077420561E-2,1386.3349999999919,2.0617662077420419E-2,1566.5585499999906,2.0617662077420416E-2]
[null,"Non-RPP (Other)",5,null,"LARGE USE SERVICE CLASSIFICATION - Non-RPP (Other)",null,"kW",569.9800000000032,1.8547304607865415E-2,2595.4800000000032,8.6463689467872057E-2,4019.4800000000105,6.9715888346487884E-2,4220.454000000027,9.7868670523159288E-3,4019.4800000000396,9.7868670523159635E-3,0,0]
[null,0,6,null,"STANDBY POWER SERVICE CLASSIFICATION  - ",null,"kW",0,0,0,0,0,0,0,0,0,0,0,0]
[null,"RPP",7,null,"UNMETERED SCATTERED LOAD SERVICE CLASSIFICATION - RPP",null,"kWh",0.31000000000000227,2.1045485403937698E-2,0.49000000000000199,3.1492257403572761E-2,0.70000000000000284,3.5642673037540026E-2,0.79100000000000392,1.5281673998231769E-2,0.70000000000000284,1.5281673998231753E-2,0.79100000000000303,1.5281673998231752E-2]
[null,"Non-RPP (Other)",8,null,"STREET LIGHTING SERVICE CLASSIFICATION - Non-RPP (Other)",null,"kW",0.1613099999999994,6.7209979625763763E-2,1.460999999999979E-2,5.6471083712950126E-3,3.4029999999999561E-2,1.1482443906759841E-2,3.8453899999999486E-2,4.8294932026621031E-3,3.4029999999999561E-2,4.8294932026621048E-3,3.8453899999999486E-2,4.8294932026621031E-3]
[null,"Non-RPP (Other)",9,null,"RESIDENTIAL SERVICE CLASSIFICATION - Non-RPP (Other)",null,"kWh",0.57500000000000284,2.2718293164757125E-2,0.95000000000000284,3.3035779487910741E-2,1.5499999999999972,3.8816278796044178E-2,0,0,0,0,0,0]
[null,0,0,null,"",null,"","","","","","","","","","","","",""]
[null,0,0,null,"",null,"","","","","","","","","","","","",""]
[null,0,12,null,{"$f":"IF(ISBLANK(E26), \"\", IF(E26 = \"Add additional scenarios if required\", \"\", IF(O26=\"YES\", E26 & \" - \" & H26 & \" - Interval Customers\", E26 & \" - \" &H26)))","v":""},null,"","","","","","","","","",{"$f":"IF(LEN($G51)>1, (SUMPRODUCT(--($C$72:$C$871=$B26), --($A$72:$A$871=$E26), --($B$72:$B$871=$B51&\"_TOTAL\"), $M$72:$M$871)), \"\")","v":""},{"$f":"IF(LEN($G51)>1, (SUMPRODUCT(--($C$72:$C$871=$B26), --($A$72:$A$871=$E26), --($B$72:$B$871=$B51&\"_TOTAL\"), $N$72:$N$871)), \"\")","v":""},{"$f":"IF(LEN($G51)>1, (SUMPRODUCT(--($C$72:$C$871=$B26), --($A$72:$A$871=$E26), --($B$72:$B$871=$B51&\"_TOTAL\"), $M$72:$M$871)), \"\")","v":""},{"$f":"IF(LEN($G51)>1, (SUMPRODUCT(--($C$72:$C$871=$B26), --($A$72:$A$871=$E26), --($B$72:$B$871=$B51&\"_TOTAL\"), $N$72:$N$871)), \"\")","v":""}]
[null,0,13,null,"",null,"","","","","","","","","","","","",""]
[null,0,14,null,{"$f":"IF(ISBLANK(E28), \"\", IF(E28 = \"Add additional scenarios if required\", \"\", IF(O28=\"YES\", E28 & \" - \" & H28 & \" - Interval Customers\", E28 & \" - \" &H28)))","v":""},null,"","","","","","","","","","","","",""]
[null,0,15,null,{"$f":"IF(ISBLANK(E29), \"\", IF(E29 = \"Add additional scenarios if required\", \"\", IF(O29=\"YES\", E29 & \" - \" & J29 & \" - Interval Customers\", E29 & \" - \" &J29)))","v":""},null,{"$f":"IF(ISBLANK(I29), \"\", I29)","v":""},"","","","","","","","","","","",""]
[null,0,16,null,"",null,{"$f":"IF(ISBLANK(I30), \"\", I30)","v":""},"","","","","","","","","","","",""]
[null,0,17,null,"",null,{"$f":"IF(ISBLANK(I31), \"\", I31)","v":""},"","","","","","","","","","","",""]
[null,0,18,null,"",null,{"$f":"IF(ISBLANK(I32), \"\", I32)","v":""},"","","","","","","","","","","",""]
[null,0,19,null,"",null,{"$f":"IF(ISBLANK(I33), \"\", I33)","v":""},"","","","","","","","","","","",""]
[null,0,0,null,"",null,{"$f":"IF(ISBLANK(I34), \"\", I34)","v":""},"","","","","","","","","","","",""]
[]
[]
[null,null,null,null,"Customer Class:",{"$f":"E15","v":"RESIDENTIAL SERVICE CLASSIFICATION"},null,null,null,null,null,{"$f":"IF(O14=\"DEMAND - INTERVAL\",\"RTSR - INTERVAL METERED\",\"\")","v":""}]
[null,null,null,null,"RPP / Non-RPP:",{"$f":"H15","v":"RPP"}]
[null,null,null,null,"Consumption",{"$f":"K15","v":750},"kWh"]
[null,null,null,null,"Demand",{"$f":"L15","v":0},"kW"]
[null,null,null,null,"Current Loss Factor",{"$f":"I15","v":1.036}]
[null,null,null,null,"Proposed/Approved Loss Factor",{"$f":"J15","v":1.036}]
[]
[null,null,null,null,null,null,"Current OEB-Approved",null,null,"Proposed",null,null,"Impact"]
[null,null,null,null,null,null,"Rate","Volume","Charge","Rate","Volume","Charge","$ Change","% Change"]
[null,null,null,null,null,null,"($)",null,"($)","($)",null,"($)"]
[{"$f":"F62","v":"RESIDENTIAL SERVICE CLASSIFICATION"},null,null,"R_F","Monthly Service Charge",null,{"$f":"IFERROR(SUMIF(RATES!B:B,'21. Bill Impacts'!D72,RATES!H:H),\"\")","v":24.25},1,{"$f":"H72*G72","v":24.25},{"$f":"IFERROR(SUMIF(RATES!B:B,'21. Bill Impacts'!D72,RATES!I:I),\"\")","v":24.54},1,{"$f":"K72*J72","v":24.54},{"$f":"L72-I72","v":0.28999999999999915},{"$f":"IF(ISERROR(M72/I72), \"\", M72/I72)","v":1.1958762886597902E-2}]
[{"$f":"A72","v":"RESIDENTIAL SERVICE CLASSIFICATION"},null,null,"R_V","Distribution Volumetric Rate",null,{"$f":"IFERROR(SUMIF(RATES!B:B,'21. Bill Impacts'!D73,RATES!H:H),\"\")","v":0},{"$f":"IF($F65>0, $F65, $F64)","v":750},{"$f":"H73*G73","v":0},{"$f":"IFERROR(SUMIF(RATES!B:B,'21. Bill Impacts'!D73,RATES!I:I),\"\")","v":0},{"$f":"IF($F65>0, $F65, $F64)","v":750},{"$f":"K73*J73","v":0},0,{"$f":"IF(ISERROR(M73/I73), \"\", M73/I73)","v":""}]
[{"$f":"A73","v":"RESIDENTIAL SERVICE CLASSIFICATION"},null,null,"R_FRR","Fixed Rate Riders",null,{"$f":"IFERROR(SUMIF(RATES!B:B,'21. Bill Impacts'!D74,RATES!H:H),\"\")","v":0.91},1,0.91,{"$f":"IFERROR(SUMIF(RATES!B:B,'21. Bill Impacts'!D74,RATES!I:I),\"\")","v":1.1200000000000001},1,{"$f":"K74*J74","v":1.1200000000000001},0.21000000000000008,0.23076923076923084]
[{"$f":"A74","v":"RESIDENTIAL SERVICE CLASSIFICATION"},null,null,"R_VRR","Volumetric Rate Riders",null,{"$f":"IFERROR(SUMIF(RATES!B:B,'21. Bill Impacts'!D75,RATES!H:H),\"\")","v":2.0000000000000001E-4},{"$f":"IF($F65>0, $F65, $F64)","v":750},0.15,{"$f":"IFERROR(SUMIF(RATES!B:B,'21. Bill Impacts'!D75,RATES!I:I),\"\")","v":2.9999999999999997E-4},{"$f":"IF($F65>0, $F65, $F64)","v":750},0.22499999999999998,7.4999999999999983E-2,0.49999999999999989]
["RESIDENTIAL SERVICE CLASSIFICATION","ST_A",{"$f":"B15","v":1},null,"Sub-Total A (excluding pass through)",null,null,null,{"$f":"SUM(I72:I75)","v":25.31},null,null,{"$f":"SUM(L72:L75)","v":25.885000000000002},0.57500000000000284,{"$f":"IF((I76)=0,\"\",(M76/I76))","v":2.2718293164757125E-2}]
["RESIDENTIAL SERVICE CLASSIFICATION",null,null,null,"Line Losses on Cost of Power",null,{"$f":"IF((F64*12>=150000), 0, IF(F63=\"RPP\",(G91*0.65+G92*0.17+G93*0.18),IF(F63=\"Non-RPP (Retailer)\",G94,G95)))","v":8.2350000000000007E-2},{"$f":"IF(G77=0, 0, $F64*F66-F64)","v":27},{"$f":"H77*G77","v":2.2234500000000001},{"$f":"IF((F64*12>=150000), 0, IF(F63=\"RPP\",(J91*0.65+J92*0.17+J93*0.18),IF(F63=\"Non-RPP (Retailer)\",J94,J95)))","v":8.2350000000000007E-2},{"$f":"IF(G77=0, 0, $F64*F66-F64)","v":27},{"$f":"K77*J77","v":2.2234500000000001},{"$f":"L77-I77","v":0},{"$f":"IF(ISERROR(M77/I77), \"\", M77/I77)","v":0}]
["RESIDENTIAL SERVICE CLASSIFICATION",null,null,"R_DVA","Total Deferral/Variance Account Rate Riders",null,{"$f":"IFERROR(SUMIF(RATES!B:B,'21. Bill Impacts'!D78,RATES!H:H),\"\")","v":-4.0000000000000002E-4},{"$f":"IF($F65>0, $F65, $F64)","v":750},-0.3,{"$f":"IFERROR(SUMIF(RATES!B:B,'21. Bill Impacts'!D78,RATES!I:I),\"\")","v":1E-4},{"$f":"IF($F65>0, $F65, $F64)","v":750},7.4999999999999997E-2,0.375,-1.25]
["RESIDENTIAL SERVICE CLASSIFICATION",null,null,"R_GA","GA Rate Riders"]
["RESIDENTIAL SERVICE CLASSIFICATION",null,null,"R_LV","Low Voltage Service Charge",null,{"$f":"IFERROR(SUMIF(RATES!B:B,'21. Bill Impacts'!D80,RATES!H:H),\"\")","v":2.0000000000000001E-4},{"$f":"IF($F65>0, $F65, $F64)","v":750},0.15,{"$f":"IFERROR(SUMIF(RATES!B:B,'21. Bill Impacts'!D80,RATES!I:I),\"\")","v":2.0000000000000001E-4},{"$f":"IF($F65>0, $F65, $F64)","v":750},0.15,0,0]
["RESIDENTIAL SERVICE CLASSIFICATION",null,null,"R_SME","Smart Meter Entity Charge (if applicable) and/or \nany fixed ($) Deferral/Variance Account Rate Riders",null,{"$f":"IFERROR(SUMIF(RATES!B:B,'21. Bill Impacts'!D81,RATES!H:H),\"\")","v":0.56999999999999995},1,{"$f":"H81*G81","v":0.56999999999999995},{"$f":"IFERROR(SUMIF(RATES!B:B,'21. Bill Impacts'!D81,RATES!I:I),\"\")","v":0.56999999999999995},1,{"$f":"K81*J81","v":0.56999999999999995},0,{"$f":"IF(ISERROR(M81/I81), \"\", M81/I81)","v":0}]
["RESIDENTIAL SERVICE CLASSIFICATION","ST_B",{"$f":"B15","v":1},null,"Sub-Total B - Distribution (includes Sub-Total A)",null,null,null,{"$f":"SUM(I76:I81)","v":27.953449999999997},null,null,{"$f":"SUM(L76:L81)","v":28.903449999999999},0.95000000000000284,{"$f":"IF((I82)=0,\"\",(M82/I82))","v":3.3985071610123367E-2}]
["RESIDENTIAL SERVICE CLASSIFICATION",null,null,"R_TN","RTSR - Network",null,{"$f":"IFERROR(SUMIF(RATES!B:B,'21. Bill Impacts'!D83,RATES!H:H),\"\")","v":7.6E-3},{"$f":"$F$64","v":750},{"$f":"H83*G83","v":5.7},{"$f":"IFERROR(SUMIF(RATES!B:B,'21. Bill Impacts'!D83,RATES!I:I),\"\")","v":8.0000000000000002E-3},{"$f":"$F$64","v":750},{"$f":"K83*J83","v":6},0.29999999999999982,{"$f":"IF(ISERROR(M83/I83), \"\", M83/I83)","v":5.263157894736839E-2}]
["RESIDENTIAL SERVICE CLASSIFICATION",null,null,"R_TC","RTSR - Connection and/or Line and Transformation Connection",null,{"$f":"IFERROR(SUMIF(RATES!B:B,'21. Bill Impacts'!D84,RATES!H:H),\"\")","v":7.3000000000000001E-3},{"$f":"+H83","v":750},{"$f":"H84*G84","v":5.4749999999999996},{"$f":"IFERROR(SUMIF(RATES!B:B,'21. Bill Impacts'!D84,RATES!I:I),\"\")","v":7.7000000000000002E-3},{"$f":"+K83","v":750},{"$f":"K84*J84","v":5.7750000000000004},0.30000000000000071,{"$f":"IF(ISERROR(M84/I84), \"\", M84/I84)","v":5.4794520547945341E-2}]
["RESIDENTIAL SERVICE CLASSIFICATION","ST_C",{"$f":"B15","v":1},null,"Sub-Total C - Delivery (including Sub-Total B)",null,null,null,{"$f":"SUM(I82:I84)","v":39.128450000000001},null,null,{"$f":"SUM(L82:L84)","v":40.678449999999998},1.5499999999999972,{"$f":"IF((I85)=0,\"\",(M85/I85))","v":3.9613120376605693E-2}]
["RESIDENTIAL SERVICE CLASSIFICATION",null,null,"WMS","Wholesale Market Service Charge (WMSC)",null,{"$f":"IFERROR(SUMIF(RATES!B:B,'21. Bill Impacts'!D86,RATES!H:H),\"\")","v":3.4000000000000002E-3},{"$f":"F64*F66","v":777},{"$f":"H86*G86","v":2.6418000000000004},{"$f":"IFERROR(SUMIF(RATES!B:B,'21. Bill Impacts'!D86,RATES!I:I),\"\")","v":3.4000000000000002E-3},{"$f":"F64*F66","v":777},{"$f":"K86*J86","v":2.6418000000000004},0,{"$f":"IF(ISERROR(M86/I86), \"\", M86/I86)","v":0}]
["RESIDENTIAL SERVICE CLASSIFICATION",null,null,"RRA","Rural and Remote Rate Protection (RRRP)",null,{"$f":"IFERROR(SUMIF(RATES!B:B,'21. Bill Impacts'!D87,RATES!H:H),\"\")","v":5.0000000000000001E-4},{"$f":"F64*F66","v":777},0.38850000000000001,{"$f":"IFERROR(SUMIF(RATES!B:B,'21. Bill Impacts'!D87,RATES!I:I),\"\")","v":5.0000000000000001E-4},{"$f":"F64*F66","v":777},0.38850000000000001,0,0]
["RESIDENTIAL SERVICE CLASSIFICATION",null,null,null,"Standard Supply Service Charge",null,0.25,1,0.25,0.25,1,0.25,0,0]
["RESIDENTIAL SERVICE CLASSIFICATION"]
["RESIDENTIAL SERVICE CLASSIFICATION",null,null,null,null,null,null,null,null,null,null,null,0,""]
["RESIDENTIAL SERVICE CLASSIFICATION","RPP",null,"OFF","TOU - Off Peak",null,{"$f":"IFERROR(SUMIF(RATES!B:B,'21. Bill Impacts'!D91,RATES!H:H),\"\")","v":6.5000000000000002E-2},{"$f":"IF(AND(F64*12>=150000),0.65*F64*F66,0.65*F64)","v":487.5},31.6875,6.5000000000000002E-2,{"$f":"IF(AND(F64*12>=150000),0.65*F64*F67,0.65*F64)","v":487.5},31.6875,0,0]
["RESIDENTIAL SERVICE CLASSIFICATION","RPP",null,"MID","TOU - Mid Peak",null,{"$f":"IFERROR(SUMIF(RATES!B:B,'21. Bill Impacts'!D92,RATES!H:H),\"\")","v":9.4E-2},{"$f":"IF(AND(F64*12>=150000),0.17*F64*F66,0.17*F64)","v":127.50000000000001},11.985000000000001,{"$f":"G92","v":9.4E-2},{"$f":"IF(AND(F64*12>=150000),0.17*F64*F67,0.17*F64)","v":127.50000000000001},11.985000000000001,0,0]
["RESIDENTIAL SERVICE CLASSIFICATION","RPP",null,"ON","TOU - On Peak",null,{"$f":"IFERROR(SUMIF(RATES!B:B,'21. Bill Impacts'!D93,RATES!H:H),\"\")","v":0.13400000000000001},{"$f":"IF(AND(F64*12>=150000),0.18*F64*F66,0.18*F64)","v":135},18.09,0.13400000000000001,{"$f":"IF(AND(F64*12>=150000),0.18*F64*F67,0.18*F64)","v":135},18.09,0,0]
["RESIDENTIAL SERVICE CLASSIFICATION","Non-RPP (Retailer)",null,"IESO","Non-RPP Retailer Avg. Price",null,{"$f":"IFERROR(SUMIF(RATES!B:B,'21. Bill Impacts'!D94,RATES!H:H),\"\")","v":0.11210000000000001},{"$f":"IF(AND(F64*12>=150000),F64*F66,F64)","v":750},{"$f":"H94*G94","v":84.075000000000003},{"$f":"G94","v":0.11210000000000001},{"$f":"IF(AND(F64*12>=150000),F64*F67,F64)","v":750},{"$f":"K94*J94","v":84.075000000000003},0,0]
["RESIDENTIAL SERVICE CLASSIFICATION","Non-RPP (Other)",null,"IESO","Average IESO Wholesale Market Price",null,{"$f":"IFERROR(SUMIF(RATES!B:B,'21. Bill Impacts'!D95,RATES!H:H),\"\")","v":0.11210000000000001},{"$f":"IF(AND(F64*12>=150000),F64*F66,F64)","v":750},{"$f":"H95*G95","v":84.075000000000003},{"$f":"G95","v":0.11210000000000001},{"$f":"IF(AND(F64*12>=150000),F64*F67,F64)","v":750},{"$f":"K95*J95","v":84.075000000000003},0,0]
["RESIDENTIAL SERVICE CLASSIFICATION"]
["RESIDENTIAL SERVICE CLASSIFICATION","RPP_BT",1,null,"Total Bill on TOU (before Taxes)",null,null,null,{"$f":"SUM(I86:I93,I85)","v":104.17125},null,null,{"$f":"SUM(L86:L93,L85)","v":105.72125},{"$f":"L97-I97","v":1.5499999999999972},{"$f":"IF((I97)=0,\"\",(M97/I97))","v":1.4879345308806385E-2}]
["RESIDENTIAL SERVICE CLASSIFICATION","RPP",null,null,"HST",null,0.13,null,{"$f":"I97*G98","v":13.542262500000001},0.13,null,{"$f":"L97*J98","v":13.743762500000001},{"$f":"L98-I98","v":0.20149999999999935},{"$f":"IF((I98)=0,\"\",(M98/I98))","v":1.4879345308806363E-2}]
["RESIDENTIAL SERVICE CLASSIFICATION","RPP_NET",1,null,"Total Bill on TOU (before 8% Provincial Rebate)",null,null,null,{"$f":"SUM(I97:I98)","v":117.71351250000001},null,null,{"$f":"SUM(L97:L98)","v":119.4650125},{"$f":"SUM(M97:M98)","v":1.7514999999999965},{"$f":"IF((I99)=0,\"\",(M99/I99))","v":1.4879345308806382E-2}]
[{"$f":"A98","v":"RESIDENTIAL SERVICE CLASSIFICATION"},"RPP",null,null,"8% Provincial Rebate",null,-0.08,null,{"$f":"I97*G100","v":-8.3337000000000003},{"$f":"G100","v":-0.08},null,{"$f":"L97*J100","v":-8.4576999999999991},{"$f":"L100-I100","v":-0.12399999999999878},{"$f":"IF((I100)=0,\"\",(M100/I100))","v":1.4879345308806266E-2}]
["RESIDENTIAL SERVICE CLASSIFICATION","RPP_TOTAL",{"$f":"B15","v":1},null,"Total Bill on TOU",null,null,null,{"$f":"SUM(I97,I98,I100)","v":109.37981250000001},null,null,{"$f":"L97+L98+L100","v":111.0073125},{"$f":"L101-I101","v":1.6274999999999835},{"$f":"IF((I101)=0,\"\",(M101/I101))","v":1.487934530880626E-2}]
["RESIDENTIAL SERVICE CLASSIFICATION","RPP"]
["RESIDENTIAL SERVICE CLASSIFICATION","Non-RPP (Retailer)",null,null,"Total Bill on Non-RPP Avg. Price",null,null,null,{"$f":"SUM(I94,I86:I90,I85)","v":126.48375},null,null,{"$f":"SUM(L94,L86:L90,L85)","v":128.03375},{"$f":"L103-I103","v":1.5499999999999972},{"$f":"IF((I103)=0,\"\",(M103/I103))","v":1.2254538626503383E-2}]
["RESIDENTIAL SERVICE CLASSIFICATION","Non-RPP (Retailer)",null,null,"HST",null,0.13,null,{"$f":"I103*G104","v":16.442887500000001},0.13,null,{"$f":"L103*J104","v":16.644387500000001},{"$f":"L104-I104","v":0.20149999999999935},{"$f":"IF((I104)=0,\"\",(M104/I104))","v":1.2254538626503364E-2}]
["RESIDENTIAL SERVICE CLASSIFICATION","Non-RPP (Retailer)",null,null,"Provincial Rebate",null,-0.08,null,{"$f":"I103*G105","v":-10.1187},{"$f":"G105","v":-0.08},null,{"$f":"L103*J105","v":-10.242699999999999},{"$f":"L105-I105","v":-0.12399999999999878},{"$f":"IF((I105)=0,\"\",(M105/I105))","v":1.2254538626503284E-2}]
["RESIDENTIAL SERVICE CLASSIFICATION","Non-RPP (Retailer)_TOTAL",null,null,"Total Bill on Non-RPP Avg. Price",null,null,null,{"$f":"SUM(I103,I104,I105)","v":132.80793750000001},null,null,{"$f":"SUM(L103,L104,L105)","v":134.43543749999998},{"$f":"L106-I106","v":1.6274999999999693},{"$f":"IF((I106)=0,\"\",(M106/I106))","v":1.2254538626503173E-2}]
["RESIDENTIAL SERVICE CLASSIFICATION","Non-RPP (Retailer)"]
["RESIDENTIAL SERVICE CLASSIFICATION","Non-RPP (Other)",null,null,"Total Bill on Average IESO Wholesale Market Price",null,null,null,{"$f":"SUM(I95,I86:I90,I85)","v":126.48375},null,null,{"$f":"SUM(L95,L86:L90,L85)","v":128.03375},{"$f":"L108-I108","v":1.5499999999999972},{"$f":"IF((I108)=0,\"\",(M108/I108))","v":1.2254538626503383E-2}]
["RESIDENTIAL SERVICE CLASSIFICATION","Non-RPP (Other)",null,null,"HST",null,0.13,null,{"$f":"I108*G109","v":16.442887500000001},0.13,null,{"$f":"L108*J109","v":16.644387500000001},{"$f":"L109-I109","v":0.20149999999999935},{"$f":"IF((I109)=0,\"\",(M109/I109))","v":1.2254538626503364E-2}]
["RESIDENTIAL SERVICE CLASSIFICATION","Non-RPP (Other)",null,null,"Provincial Rebate",null,-0.08,null,{"$f":"I108*G110","v":-10.1187},{"$f":"G110","v":-0.08},null,{"$f":"L108*J110","v":-10.242699999999999},{"$f":"L110-I110","v":-0.12399999999999878},{"$f":"IF((I110)=0,\"\",(M110/I110))","v":1.2254538626503284E-2}]
["RESIDENTIAL SERVICE CLASSIFICATION","Non-RPP (Other)_TOTAL",null,null,"Total Bill on Average IESO Wholesale Market Price",null,null,null,{"$f":"SUM(I108,I109,I110)","v":132.80793750000001},null,null,{"$f":"SUM(L108,L109,L110)","v":134.43543749999998},{"$f":"L111-I111","v":1.6274999999999693},{"$f":"IF((I111)=0,\"\",(M111/I111))","v":1.2254538626503173E-2}]
["RESIDENTIAL SERVICE CLASSIFICATION","Non-RPP (Other)"]
[null,null,null,null,null,null,null,null,null,null,null,{"$f":"+L78/L101","v":6.7563116619006518E-4}]
[]
[null,null,null,null,"Customer Class:",{"$f":"E16","v":"GENERAL SERVICE LESS THAN 50 kW SERVICE CLASSIFICATION"},null,null,null,null,null,{"$f":"IF(O66=\"DEMAND - INTERVAL\",\"RTSR - INTERVAL METERED\",\"\")","v":""}]
[null,null,null,null,"RPP / Non-RPP:",{"$f":"H16","v":"RPP"}]
[null,null,null,null,"Consumption",{"$f":"K16","v":2000},"kWh"]
[null,null,null,null,"Demand",{"$f":"L16","v":0},"kW"]
[null,null,null,null,"Current Loss Factor",{"$f":"I16","v":1.036}]
[null,null,null,null,"Proposed/Approved Loss Factor",{"$f":"J16","v":1.036}]
[]
[null,null,null,null,null,null,"Current OEB-Approved",null,null,"Proposed",null,null,"Impact"]
[null,null,null,null,null,null,"Rate","Volume","Charge","Rate","Volume","Charge","$ Change","% Change"]
[null,null,null,null,null,null,"($)",null,"($)","($)",null,"($)"]
[{"$f":"F115","v":"GENERAL SERVICE LESS THAN 50 kW SERVICE CLASSIFICATION"},null,null,"GSL_F","Monthly Service Charge",null,{"$f":"IFERROR(SUMIF(RATES!B:B,'21. Bill Impacts'!D125,RATES!H:H),\"\")","v":44.52},1,{"$f":"H125*G125","v":44.52},{"$f":"IFERROR(SUMIF(RATES!B:B,'21. Bill Impacts'!D125,RATES!I:I),\"\")","v":45.05},1,{"$f":"K125*J125","v":45.05},{"$f":"L125-I125","v":0.52999999999999403},{"$f":"IF(ISERROR(M125/I125), \"\", M125/I125)","v":1.1904761904761771E-2}]
[{"$f":"A125","v":"GENERAL SERVICE LESS THAN 50 kW SERVICE CLASSIFICATION"},null,null,"GSL_V","Distribution Volumetric Rate",null,{"$f":"IFERROR(SUMIF(RATES!B:B,'21. Bill Impacts'!D126,RATES!H:H),\"\")","v":1.2999999999999999E-2},{"$f":"IF($F118>0, $F118, $F117)","v":2000},{"$f":"H126*G126","v":26},{"$f":"IFERROR(SUMIF(RATES!B:B,'21. Bill Impacts'!D126,RATES!I:I),\"\")","v":1.32E-2},{"$f":"IF($F118>0, $F118, $F117)","v":2000},{"$f":"K126*J126","v":26.4},0.39999999999999858,{"$f":"IF(ISERROR(M126/I126), \"\", M126/I126)","v":1.538461538461533E-2}]
[{"$f":"A126","v":"GENERAL SERVICE LESS THAN 50 kW SERVICE CLASSIFICATION"},null,null,"GSL_FRR","Fixed Rate Riders",null,{"$f":"IFERROR(SUMIF(RATES!B:B,'21. Bill Impacts'!D127,RATES!H:H),\"\")","v":1.7000000000000002},1,1.7000000000000002,{"$f":"IFERROR(SUMIF(RATES!B:B,'21. Bill Impacts'!D127,RATES!I:I),\"\")","v":2.04},1,{"$f":"K127*J127","v":2.04},0.33999999999999986,0.1999999999999999]
["GENERAL SERVICE LESS THAN 50 kW SERVICE CLASSIFICATION",null,null,"GSL_VRR","Volumetric Rate Riders",null,{"$f":"IFERROR(SUMIF(RATES!B:B,'21. Bill Impacts'!D128,RATES!H:H),\"\")","v":8.0000000000000004E-4},{"$f":"IF($F118>0, $F118, $F117)","v":2000},1.6,{"$f":"IFERROR(SUMIF(RATES!B:B,'21. Bill Impacts'!D128,RATES!I:I),\"\")","v":8.0000000000000015E-4},{"$f":"IF($F118>0, $F118, $F117)","v":2000},1.6000000000000003,0,0]
["GENERAL SERVICE LESS THAN 50 kW SERVICE CLASSIFICATION","ST_A",{"$f":"B16","v":2},null,"Sub-Total A (excluding pass through)",null,null,null,{"$f":"SUM(I125:I128)","v":73.820000000000007},null,null,{"$f":"SUM(L125:L128)","v":75.089999999999989},1.2699999999999818,{"$f":"IF((I129)=0,\"\",(M129/I129))","v":1.72040097534541E-2}]
["GENERAL SERVICE LESS THAN 50 kW SERVICE CLASSIFICATION",null,null,null,"Line Losses on Cost of Power",null,{"$f":"IF((F117*12>=150000), 0, IF(F116=\"RPP\",(G144*0.65+G145*0.17+G146*0.18),IF(F116=\"Non-RPP (Retailer)\",G147,G148)))","v":8.2350000000000007E-2},{"$f":"IF(G130=0, 0, $F117*F119-F117)","v":72},{"$f":"H130*G130","v":5.9292000000000007},{"$f":"IF((F117*12>=150000), 0, IF(F116=\"RPP\",(J144*0.65+J145*0.17+J146*0.18),IF(F116=\"Non-RPP (Retailer)\",J147,J148)))","v":8.2350000000000007E-2},{"$f":"IF(G130=0, 0, $F117*F119-F117)","v":72},{"$f":"K130*J130","v":5.9292000000000007},{"$f":"L130-I130","v":0},{"$f":"IF(ISERROR(M130/I130), \"\", M130/I130)","v":0}]
["GENERAL SERVICE LESS THAN 50 kW SERVICE CLASSIFICATION",null,null,"GSL_DVA","Total Deferral/Variance Account Rate Riders",null,{"$f":"IFERROR(SUMIF(RATES!B:B,'21. Bill Impacts'!D131,RATES!H:H),\"\")","v":-4.0000000000000002E-4},{"$f":"IF($F118>0, $F118, $F117)","v":2000},{"$f":"H131*G131","v":-0.8},{"$f":"IFERROR(SUMIF(RATES!B:B,'21. Bill Impacts'!D131,RATES!I:I),\"\")","v":1.9999999999999998E-4},{"$f":"IF($F118>0, $F118, $F117)","v":2000},{"$f":"K131*J131","v":0.39999999999999997},{"$f":"L131-I131","v":1.2},{"$f":"IF(ISERROR(M131/I131), \"\", M131/I131)","v":-1.4999999999999998}]
["GENERAL SERVICE LESS THAN 50 kW SERVICE CLASSIFICATION",null,null,"GSL_GA","GA Rate Riders"]
["GENERAL SERVICE LESS THAN 50 kW SERVICE CLASSIFICATION",null,null,"GSL_LV","Low Voltage Service Charge",null,{"$f":"IFERROR(SUMIF(RATES!B:B,'21. Bill Impacts'!D133,RATES!H:H),\"\")","v":2.0000000000000001E-4},{"$f":"IF($F118>0, $F118, $F117)","v":2000},0.4,{"$f":"IFERROR(SUMIF(RATES!B:B,'21. Bill Impacts'!D133,RATES!I:I),\"\")","v":2.0000000000000001E-4},{"$f":"IF($F118>0, $F118, $F117)","v":2000},0.4,0,0]
["GENERAL SERVICE LESS THAN 50 kW SERVICE CLASSIFICATION",null,null,"GSL_SME","Smart Meter Entity Charge (if applicable) and/or \nany fixed ($) Deferral/Variance Account Rate Riders",null,{"$f":"IFERROR(SUMIF(RATES!B:B,'21. Bill Impacts'!D134,RATES!H:H),\"\")","v":0.56999999999999995},1,{"$f":"H134*G134","v":0.56999999999999995},{"$f":"IFERROR(SUMIF(RATES!B:B,'21. Bill Impacts'!D134,RATES!I:I),\"\")","v":0.56999999999999995},1,{"$f":"K134*J134","v":0.56999999999999995},0,{"$f":"IF(ISERROR(M134/I134), \"\", M134/I134)","v":0}]
["GENERAL SERVICE LESS THAN 50 kW SERVICE CLASSIFICATION","ST_B",{"$f":"C129","v":2},null,"Sub-Total B - Distribution (includes Sub-Total A)",null,null,null,{"$f":"SUM(I129:I134)","v":79.919200000000004},null,null,{"$f":"SUM(L129:L134)","v":82.389199999999988},2.4699999999999847,{"$f":"IF((I135)=0,\"\",(M135/I135))","v":3.090621527743001E-2}]
["GENERAL SERVICE LESS THAN 50 kW SERVICE CLASSIFICATION",null,null,"GSL_TN","RTSR - Network",null,{"$f":"IFERROR(SUMIF(RATES!B:B,'21. Bill Impacts'!D136,RATES!H:H),\"\")","v":7.1000000000000004E-3},{"$f":"$F$117","v":2000},{"$f":"H136*G136","v":14.200000000000001},{"$f":"IFERROR(SUMIF(RATES!B:B,'21. Bill Impacts'!D136,RATES!I:I),\"\")","v":7.4000000000000003E-3},{"$f":"$F$117","v":2000},{"$f":"K136*J136","v":14.8},0.59999999999999964,{"$f":"IF(ISERROR(M136/I136), \"\", M136/I136)","v":4.2253521126760535E-2}]
["GENERAL SERVICE LESS THAN 50 kW SERVICE CLASSIFICATION",null,null,"GSL_TC","RTSR - Connection and/or Line and Transformation Connection",null,{"$f":"IFERROR(SUMIF(RATES!B:B,'21. Bill Impacts'!D137,RATES!H:H),\"\")","v":6.4999999999999997E-3},{"$f":"+H136","v":2000},{"$f":"H137*G137","v":13},{"$f":"IFERROR(SUMIF(RATES!B:B,'21. Bill Impacts'!D137,RATES!I:I),\"\")","v":6.8999999999999999E-3},{"$f":"+K136","v":2000},{"$f":"K137*J137","v":13.799999999999999},0.79999999999999893,{"$f":"IF(ISERROR(M137/I137), \"\", M137/I137)","v":6.1538461538461459E-2}]
["GENERAL SERVICE LESS THAN 50 kW SERVICE CLASSIFICATION","ST_C",{"$f":"C129","v":2},null,"Sub-Total C - Delivery (including Sub-Total B)",null,null,null,{"$f":"SUM(I135:I137)","v":107.11920000000001},null,null,{"$f":"SUM(L135:L137)","v":110.98919999999998},3.8699999999999761,{"$f":"IF((I138)=0,\"\",(M138/I138))","v":3.6127977057334032E-2}]
["GENERAL SERVICE LESS THAN 50 kW SERVICE CLASSIFICATION",null,null,null,"Wholesale Market Service Charge (WMSC)",null,{"$f":"G$86","v":3.4000000000000002E-3},{"$f":"F117*F119","v":2072},{"$f":"H139*G139","v":7.0448000000000004},{"$f":"J$86","v":3.4000000000000002E-3},{"$f":"F117*F119","v":2072},{"$f":"K139*J139","v":7.0448000000000004},0,{"$f":"IF(ISERROR(M139/I139), \"\", M139/I139)","v":0}]
["GENERAL SERVICE LESS THAN 50 kW SERVICE CLASSIFICATION",null,null,null,"Rural and Remote Rate Protection (RRRP)",null,{"$f":"G$87","v":5.0000000000000001E-4},{"$f":"F117*F119","v":2072},1.036,{"$f":"J$87","v":5.0000000000000001E-4},{"$f":"F117*F119","v":2072},1.036,0,0]
["GENERAL SERVICE LESS THAN 50 kW SERVICE CLASSIFICATION",null,null,null,"Standard Supply Service Charge",null,0.25,1,0.25,0.25,1,0.25,0,0]
["GENERAL SERVICE LESS THAN 50 kW SERVICE CLASSIFICATION"]
["GENERAL SERVICE LESS THAN 50 kW SERVICE CLASSIFICATION",null,null,null,null,null,null,null,null,null,null,null,{"$f":"L143-I143","v":0},{"$f":"IF(ISERROR(M143/I143), \"\", M143/I143)","v":""}]
["GENERAL SERVICE LESS THAN 50 kW SERVICE CLASSIFICATION","RPP",null,null,"TOU - Off Peak",null,{"$f":"G$91","v":6.5000000000000002E-2},{"$f":"IF(AND(F117*12>=150000),0.65*F117*F119,0.65*F117)","v":1300},{"$f":"H144*G144","v":84.5},6.5000000000000002E-2,{"$f":"IF(AND(F117*12>=150000),0.65*F117*F120,0.65*F117)","v":1300},{"$f":"K144*J144","v":84.5},{"$f":"L144-I144","v":0},{"$f":"IF(ISERROR(M144/I144), \"\", M144/I144)","v":0}]
["GENERAL SERVICE LESS THAN 50 kW SERVICE CLASSIFICATION","RPP",null,null,"TOU - Mid Peak",null,{"$f":"G$92","v":9.4E-2},{"$f":"IF(AND(F117*12>=150000),0.17*F117*F119,0.17*F117)","v":340},31.96,{"$f":"J92","v":9.4E-2},{"$f":"IF(AND(F117*12>=150000),0.17*F117*F120,0.17*F117)","v":340},31.96,0,0]
["GENERAL SERVICE LESS THAN 50 kW SERVICE CLASSIFICATION","RPP",null,null,"TOU - On Peak",null,{"$f":"G$93","v":0.13400000000000001},{"$f":"IF(AND(F117*12>=150000),0.18*F117*F119,0.18*F117)","v":360},48.24,0.13400000000000001,{"$f":"IF(AND(F117*12>=150000),0.18*F117*F120,0.18*F117)","v":360},48.24,0,0]
["GENERAL SERVICE LESS THAN 50 kW SERVICE CLASSIFICATION","Non-RPP (Retailer)",null,null,"Non-RPP Retailer Avg. Price",null,{"$f":"G$94","v":0.11210000000000001},{"$f":"IF(AND(F117*12>=150000),F117*F119,F117)","v":2000},{"$f":"H147*G147","v":224.20000000000002},{"$f":"G147","v":0.11210000000000001},{"$f":"IF(AND(F117*12>=150000),F117*F120,F117)","v":2000},{"$f":"K147*J147","v":224.20000000000002},0,0]
["GENERAL SERVICE LESS THAN 50 kW SERVICE CLASSIFICATION","Non-RPP (Other)",null,null,"Average IESO Wholesale Market Price",null,{"$f":"G$95","v":0.11210000000000001},{"$f":"IF(AND(F117*12>=150000),F117*F119,F117)","v":2000},{"$f":"H148*G148","v":224.20000000000002},{"$f":"G148","v":0.11210000000000001},{"$f":"IF(AND(F117*12>=150000),F117*F120,F117)","v":2000},{"$f":"K148*J148","v":224.20000000000002},0,0]
["GENERAL SERVICE LESS THAN 50 kW SERVICE CLASSIFICATION"]
["GENERAL SERVICE LESS THAN 50 kW SERVICE CLASSIFICATION","RPP_BT",2,null,"Total Bill on TOU (before Taxes)",null,null,null,{"$f":"SUM(I139:I146,I138)","v":280.14999999999998},null,null,{"$f":"SUM(L139:L146,L138)","v":284.02},{"$f":"L150-I150","v":3.8700000000000045},{"$f":"IF((I150)=0,\"\",(M150/I150))","v":1.3814028199179028E-2}]
["GENERAL SERVICE LESS THAN 50 kW SERVICE CLASSIFICATION","RPP",null,null,"HST",null,0.13,null,{"$f":"I150*G151","v":36.419499999999999},0.13,null,{"$f":"L150*J151","v":36.922599999999996},{"$f":"L151-I151","v":0.50309999999999633},{"$f":"IF((I151)=0,\"\",(M151/I151))","v":1.381402819917891E-2}]
["GENERAL SERVICE LESS THAN 50 kW SERVICE CLASSIFICATION","RPP_NET",2,null,"Total Bill on TOU (before 8% Provincial Rebate)",null,null,null,{"$f":"SUM(I150:I151)","v":316.56949999999995},null,null,{"$f":"SUM(L150:L151)","v":320.94259999999997},{"$f":"SUM(M150:M151)","v":4.3731000000000009},{"$f":"IF((I152)=0,\"\",(M152/I152))","v":1.3814028199179016E-2}]
[{"$f":"A151","v":"GENERAL SERVICE LESS THAN 50 kW SERVICE CLASSIFICATION"},"RPP",null,null,"8% Provincial Rebate",null,-0.08,null,{"$f":"I150*G153","v":-22.411999999999999},{"$f":"G153","v":-0.08},null,{"$f":"L150*J153","v":-22.721599999999999},{"$f":"L153-I153","v":-0.30959999999999965},{"$f":"IF((I153)=0,\"\",(M153/I153))","v":1.3814028199178997E-2}]
["GENERAL SERVICE LESS THAN 50 kW SERVICE CLASSIFICATION","RPP_TOTAL",{"$f":"C129","v":2},null,"Total Bill on TOU",null,null,null,{"$f":"SUM(I150,I151,I153)","v":294.15749999999997},null,null,{"$f":"L150+L151+L153","v":298.22099999999995},{"$f":"L154-I154","v":4.0634999999999764},{"$f":"IF((I154)=0,\"\",(M154/I154))","v":1.3814028199178933E-2}]
["GENERAL SERVICE LESS THAN 50 kW SERVICE CLASSIFICATION","RPP"]
["GENERAL SERVICE LESS THAN 50 kW SERVICE CLASSIFICATION","Non-RPP (Retailer)",null,null,"Total Bill on Non-RPP Avg. Price",null,null,null,{"$f":"SUM(I147,I139:I143,I138)","v":339.65000000000003},null,null,{"$f":"SUM(L147,L139:L143,L138)","v":343.52},{"$f":"L156-I156","v":3.8699999999999477},{"$f":"IF((I156)=0,\"\",(M156/I156))","v":1.139408214338274E-2}]
["GENERAL SERVICE LESS THAN 50 kW SERVICE CLASSIFICATION","Non-RPP (Retailer)",null,null,"HST",null,0.13,null,{"$f":"I156*G157","v":44.154500000000006},0.13,null,{"$f":"L156*J157","v":44.657600000000002},{"$f":"L157-I157","v":0.50309999999999633},{"$f":"IF((I157)=0,\"\",(M157/I157))","v":1.1394082143382809E-2}]
["GENERAL SERVICE LESS THAN 50 kW SERVICE CLASSIFICATION","Non-RPP (Retailer)",null,null,"Provincial Rebate",null,-0.08,null,{"$f":"I156*G158","v":-27.172000000000004},{"$f":"G158","v":-0.08},null,{"$f":"L156*J158","v":-27.4816},{"$f":"L158-I158","v":-0.3095999999999961},{"$f":"IF((I158)=0,\"\",(M158/I158))","v":1.1394082143382748E-2}]
["GENERAL SERVICE LESS THAN 50 kW SERVICE CLASSIFICATION","Non-RPP (Retailer)_TOTAL",null,null,"Total Bill on Non-RPP Avg. Price",null,null,null,{"$f":"SUM(I156,I157,I158)","v":356.63249999999999},null,null,{"$f":"SUM(L156,L157,L158)","v":360.69599999999997},{"$f":"L159-I159","v":4.0634999999999764},{"$f":"IF((I159)=0,\"\",(M159/I159))","v":1.1394082143382828E-2}]
["GENERAL SERVICE LESS THAN 50 kW SERVICE CLASSIFICATION","Non-RPP (Retailer)"]
["GENERAL SERVICE LESS THAN 50 kW SERVICE CLASSIFICATION","Non-RPP (Other)",null,null,"Total Bill on Average IESO Wholesale Market Price",null,null,null,{"$f":"SUM(I148,I139:I143,I138)","v":339.65000000000003},null,null,{"$f":"SUM(L148,L139:L143,L138)","v":343.52},{"$f":"L161-I161","v":3.8699999999999477},{"$f":"IF((I161)=0,\"\",(M161/I161))","v":1.139408214338274E-2}]
["GENERAL SERVICE LESS THAN 50 kW SERVICE CLASSIFICATION","Non-RPP (Other)",null,null,"HST",null,0.13,null,{"$f":"I161*G162","v":44.154500000000006},0.13,null,{"$f":"L161*J162","v":44.657600000000002},{"$f":"L162-I162","v":0.50309999999999633},{"$f":"IF((I162)=0,\"\",(M162/I162))","v":1.1394082143382809E-2}]
["GENERAL SERVICE LESS THAN 50 kW SERVICE CLASSIFICATION","Non-RPP (Other)",null,null,"Provincial Rebate",null,-0.08,null,{"$f":"I161*G163","v":-27.172000000000004},{"$f":"G163","v":-0.08},null,{"$f":"L161*J163","v":-27.4816},{"$f":"L163-I163","v":-0.3095999999999961},{"$f":"IF((I163)=0,\"\",(M163/I163))","v":1.1394082143382748E-2}]
["GENERAL SERVICE LESS THAN 50 kW SERVICE CLASSIFICATION","Non-RPP (Other)_TOTAL",null,null,"Total Bill on Average IESO Wholesale Market Price",null,null,null,{"$f":"SUM(I161,I162,I163)","v":356.63249999999999},null,null,{"$f":"SUM(L161,L162,L163)","v":360.69599999999997},{"$f":"L164-I164","v":4.0634999999999764},{"$f":"IF((I164)=0,\"\",(M164/I164))","v":1.1394082143382828E-2}]
["GENERAL SERVICE LESS THAN 50 kW SERVICE CLASSIFICATION","Non-RPP (Other)"]
[]
[]
[null,null,null,null,"Customer Class:",{"$f":"E17","v":"GENERAL SERVICE 50 to 499 kW SERVICE CLASSIFICATION"},null,null,null,null,null,{"$f":"IF(O119=\"DEMAND - INTERVAL\",\"RTSR - INTERVAL METERED\",\"\")","v":""}]
[null,null,null,null,"RPP / Non-RPP:",{"$f":"H17","v":"Non-RPP (Other)"}]
[null,null,null,null,"Consumption",{"$f":"K17","v":100000},"kWh"]
[null,null,null,null,"Demand",{"$f":"L17","v":230},"kW"]
[null,null,null,null,"Current Loss Factor",{"$f":"I17","v":1.036}]
[null,null,null,null,"Proposed/Approved Loss Factor",{"$f":"J17","v":1.036}]
[]
[null,null,null,null,null,null,"Current OEB-Approved",null,null,"Proposed",null,null,"Impact"]
[null,null,null,null,null,null,"Rate","Volume","Charge","Rate","Volume","Charge","$ Change","% Change"]
[null,null,null,null,null,null,"($)",null,"($)","($)",null,"($)"]
[{"$f":"F168","v":"GENERAL SERVICE 50 to 499 kW SERVICE CLASSIFICATION"},null,null,"GS50_499_F","Monthly Service Charge",null,{"$f":"IFERROR(SUMIF(RATES!B:B,'21. Bill Impacts'!D178,RATES!H:H),\"\")","v":78.41},1,{"$f":"H178*G178","v":78.41},{"$f":"IFERROR(SUMIF(RATES!B:B,'21. Bill Impacts'!D178,RATES!I:I),\"\")","v":79.349999999999994},1,{"$f":"K178*J178","v":79.349999999999994},{"$f":"L178-I178","v":0.93999999999999773},{"$f":"IF(ISERROR(M178/I178), \"\", M178/I178)","v":1.1988266802703708E-2}]
[{"$f":"A178","v":"GENERAL SERVICE 50 to 499 kW SERVICE CLASSIFICATION"},null,null,"GS50_499_V","Distribution Volumetric Rate",null,{"$f":"IFERROR(SUMIF(RATES!B:B,'21. Bill Impacts'!D179,RATES!H:H),\"\")","v":4.7188999999999997},{"$f":"IF($F171>0, $F171, $F170)","v":230},{"$f":"H179*G179","v":1085.347},{"$f":"IFERROR(SUMIF(RATES!B:B,'21. Bill Impacts'!D179,RATES!I:I),\"\")","v":4.7755000000000001},{"$f":"IF($F171>0, $F171, $F170)","v":230},{"$f":"K179*J179","v":1098.365},13.018000000000029,{"$f":"IF(ISERROR(M179/I179), \"\", M179/I179)","v":1.1994320710335063E-2}]
[{"$f":"A179","v":"GENERAL SERVICE 50 to 499 kW SERVICE CLASSIFICATION"},null,null,"GS50_499_FRR","Fixed Rate Riders",null,{"$f":"IFERROR(SUMIF(RATES!B:B,'21. Bill Impacts'!D180,RATES!H:H),\"\")","v":3.5699999999999994},1,3.5699999999999994,{"$f":"IFERROR(SUMIF(RATES!B:B,'21. Bill Impacts'!D180,RATES!I:I),\"\")","v":3.2100000000000004},1,{"$f":"K180*J180","v":3.2100000000000004},-0.35999999999999899,-0.10084033613445352]
[{"$f":"A180","v":"GENERAL SERVICE 50 to 499 kW SERVICE CLASSIFICATION"},null,null,"GS50_499_VRR","Volumetric Rate Riders",null,{"$f":"IFERROR(SUMIF(RATES!B:B,'21. Bill Impacts'!D181,RATES!H:H),\"\")","v":0.3987},{"$f":"IF($F171>0, $F171, $F170)","v":230},91.700999999999993,{"$f":"IFERROR(SUMIF(RATES!B:B,'21. Bill Impacts'!D181,RATES!I:I),\"\")","v":0.43099999999999994},{"$f":"IF($F171>0, $F171, $F170)","v":230},99.129999999999981,7.4289999999999878,8.1013293202909328E-2]
["GENERAL SERVICE 50 to 499 kW SERVICE CLASSIFICATION","ST_A",{"$f":"B17","v":3},null,"Sub-Total A (excluding pass through)",null,null,null,{"$f":"SUM(I178:I181)","v":1259.028},null,null,{"$f":"SUM(L178:L181)","v":1280.0549999999998},21.026999999999816,{"$f":"IF((I182)=0,\"\",(M182/I182))","v":1.6700978850351076E-2}]
["GENERAL SERVICE 50 to 499 kW SERVICE CLASSIFICATION",null,null,null,"Line Losses on Cost of Power",null,{"$f":"IF((F170*12>=150000), 0, IF(F169=\"RPP\",(G197*0.65+G198*0.17+G199*0.18),IF(F169=\"Non-RPP (Retailer)\",G200,G201)))","v":0},{"$f":"IF(G183=0, 0, $F170*F172-F170)","v":0},{"$f":"H183*G183","v":0},{"$f":"IF((F170*12>=150000), 0, IF(F169=\"RPP\",(J197*0.65+J198*0.17+J199*0.18),IF(F169=\"Non-RPP (Retailer)\",J200,J201)))","v":0},{"$f":"IF(G183=0, 0, $F170*F172-F170)","v":0},{"$f":"K183*J183","v":0},{"$f":"L183-I183","v":0},{"$f":"IF(ISERROR(M183/I183), \"\", M183/I183)","v":""}]
["GENERAL SERVICE 50 to 499 kW SERVICE CLASSIFICATION",null,null,"GS50_499_DVA","Total Deferral/Variance Account Rate Riders",null,{"$f":"IFERROR(SUMIF(RATES!B:B,'21. Bill Impacts'!D184,RATES!H:H),\"\")","v":-0.1396},{"$f":"IF($F171>0, $F171, $F170)","v":230},{"$f":"H184*G184","v":-32.107999999999997},{"$f":"IFERROR(SUMIF(RATES!B:B,'21. Bill Impacts'!D184,RATES!I:I),\"\")","v":7.9600000000000004E-2},{"$f":"IF($F171>0, $F171, $F170)","v":230},{"$f":"K184*J184","v":18.308},{"$f":"L184-I184","v":50.415999999999997},{"$f":"IF(ISERROR(M184/I184), \"\", M184/I184)","v":-1.5702005730659025}]
["GENERAL SERVICE 50 to 499 kW SERVICE CLASSIFICATION",null,null,"GS50_499_GA","GA Rate Riders",null,{"$f":"IFERROR(SUMIF(RATES!B:B,'21. Bill Impacts'!D185,RATES!H:H),\"\")","v":1.9E-3},{"$f":"+F170","v":100000},190,{"$f":"IFERROR(SUMIF(RATES!B:B,'21. Bill Impacts'!D185,RATES!I:I),\"\")","v":-3.2000000000000002E-3},{"$f":"+H185","v":100000},-320,-510,-2.6842105263157894]
[{"$f":"A185","v":"GENERAL SERVICE 50 to 499 kW SERVICE CLASSIFICATION"},null,null,"GS50_499_LV","Low Voltage Service Charge",null,{"$f":"IFERROR(SUMIF(RATES!B:B,'21. Bill Impacts'!D186,RATES!H:H),\"\")","v":8.0199999999999994E-2},{"$f":"IF($F171>0, $F171, $F170)","v":230},18.445999999999998,{"$f":"IFERROR(SUMIF(RATES!B:B,'21. Bill Impacts'!D186,RATES!I:I),\"\")","v":8.0199999999999994E-2},{"$f":"IF($F171>0, $F171, $F170)","v":230},18.445999999999998,0,0]
["GENERAL SERVICE 50 to 499 kW SERVICE CLASSIFICATION",null,null,null,"Smart Meter Entity Charge (if applicable) and/or \nany fixed ($) Deferral/Variance Account Rate Riders",null,0,1,{"$f":"H187*G187","v":0},0,1,{"$f":"K187*J187","v":0},0,{"$f":"IF(ISERROR(M187/I187), \"\", M187/I187)","v":""}]
["GENERAL SERVICE 50 to 499 kW SERVICE CLASSIFICATION","ST_B",{"$f":"C182","v":3},null,"Sub-Total B - Distribution (includes Sub-Total A)",null,null,null,{"$f":"SUM(I182:I187)","v":1435.366},null,null,{"$f":"SUM(L182:L187)","v":996.80899999999986},-438.55700000000013,{"$f":"IF((I188)=0,\"\",(M188/I188))","v":-0.3055367063174132}]
["GENERAL SERVICE 50 to 499 kW SERVICE CLASSIFICATION",null,null,"GS50_499_TN","RTSR - Network",null,{"$f":"IFERROR(SUMIF(RATES!B:B,'21. Bill Impacts'!D189,RATES!H:H),\"\")","v":2.7288999999999999},{"$f":"IF($F171>0, $F171, $F170*$F172)","v":230},{"$f":"H189*G189","v":627.64699999999993},{"$f":"IFERROR(SUMIF(RATES!B:B,'21. Bill Impacts'!D189,RATES!I:I),\"\")","v":2.8610000000000002},{"$f":"IF($F171>0, $F171, $F170*$F172)","v":230},{"$f":"K189*J189","v":658.03000000000009},30.383000000000152,{"$f":"IF(ISERROR(M189/I189), \"\", M189/I189)","v":4.8407783355931211E-2}]
["GENERAL SERVICE 50 to 499 kW SERVICE CLASSIFICATION",null,null,"GS50_499_TC","RTSR - Connection and/or Line and Transformation Connection",null,{"$f":"IFERROR(SUMIF(RATES!B:B,'21. Bill Impacts'!D190,RATES!H:H),\"\")","v":2.5929000000000002},{"$f":"IF($F171>0, $F171, $F170*$F172)","v":230},{"$f":"H190*G190","v":596.36700000000008},{"$f":"IFERROR(SUMIF(RATES!B:B,'21. Bill Impacts'!D190,RATES!I:I),\"\")","v":2.7349000000000001},{"$f":"IF($F171>0, $F171, $F170*$F172)","v":230},{"$f":"K190*J190","v":629.02700000000004},32.659999999999968,{"$f":"IF(ISERROR(M190/I190), \"\", M190/I190)","v":5.4764935014848179E-2}]
["GENERAL SERVICE 50 to 499 kW SERVICE CLASSIFICATION","ST_C",{"$f":"C182","v":3},null,"Sub-Total C - Delivery (including Sub-Total B)",null,null,null,{"$f":"SUM(I188:I190)","v":2659.38},null,null,{"$f":"SUM(L188:L190)","v":2283.866},-375.51400000000012,{"$f":"IF((I191)=0,\"\",(M191/I191))","v":-0.14120358880641357}]
["GENERAL SERVICE 50 to 499 kW SERVICE CLASSIFICATION",null,null,null,"Wholesale Market Service Charge (WMSC)",null,{"$f":"G$86","v":3.4000000000000002E-3},{"$f":"F170*F172","v":103600},{"$f":"H192*G192","v":352.24},{"$f":"J$86","v":3.4000000000000002E-3},{"$f":"F170*F172","v":103600},{"$f":"K192*J192","v":352.24},0,{"$f":"IF(ISERROR(M192/I192), \"\", M192/I192)","v":0}]
["GENERAL SERVICE 50 to 499 kW SERVICE CLASSIFICATION",null,null,null,"Rural and Remote Rate Protection (RRRP)",null,{"$f":"G$87","v":5.0000000000000001E-4},{"$f":"F170*F172","v":103600},51.800000000000004,{"$f":"J$87","v":5.0000000000000001E-4},{"$f":"F170*F172","v":103600},51.800000000000004,0,0]
["GENERAL SERVICE 50 to 499 kW SERVICE CLASSIFICATION",null,null,null,"Standard Supply Service Charge",null,0.25,1,0.25,0.25,1,0.25,0,0]
["GENERAL SERVICE 50 to 499 kW SERVICE CLASSIFICATION"]
["GENERAL SERVICE 50 to 499 kW SERVICE CLASSIFICATION",null,null,null,null,null,null,null,null,null,null,null,{"$f":"L196-I196","v":0},{"$f":"IF(ISERROR(M196/I196), \"\", M196/I196)","v":""}]
["GENERAL SERVICE 50 to 499 kW SERVICE CLASSIFICATION","RPP",null,null,"TOU - Off Peak",null,{"$f":"G$91","v":6.5000000000000002E-2},{"$f":"IF(AND(F170*12>=150000),0.65*F170*F172,0.65*F170)","v":67340},{"$f":"H197*G197","v":4377.1000000000004},6.5000000000000002E-2,{"$f":"IF(AND(F170*12>=150000),0.65*F170*F173,0.65*F170)","v":67340},{"$f":"K197*J197","v":4377.1000000000004},{"$f":"L197-I197","v":0},{"$f":"IF(ISERROR(M197/I197), \"\", M197/I197)","v":0}]
["GENERAL SERVICE 50 to 499 kW SERVICE CLASSIFICATION","RPP",null,null,"TOU - Mid Peak",null,{"$f":"G$92","v":9.4E-2},{"$f":"IF(AND(F170*12>=150000),0.17*F170*F172,0.17*F170)","v":17612},1655.528,{"$f":"J145","v":9.4E-2},{"$f":"IF(AND(F170*12>=150000),0.17*F170*F173,0.17*F170)","v":17612},1655.528,0,0]
["GENERAL SERVICE 50 to 499 kW SERVICE CLASSIFICATION","RPP",null,null,"TOU - On Peak",null,{"$f":"G$93","v":0.13400000000000001},{"$f":"IF(AND(F170*12>=150000),0.18*F170*F172,0.18*F170)","v":18648},2498.8320000000003,0.13400000000000001,{"$f":"IF(AND(F170*12>=150000),0.18*F170*F173,0.18*F170)","v":18648},2498.8320000000003,0,0]
["GENERAL SERVICE 50 to 499 kW SERVICE CLASSIFICATION","Non-RPP (Retailer)",null,null,"Non-RPP Retailer Avg. Price",null,{"$f":"G$94","v":0.11210000000000001},{"$f":"IF(AND(F170*12>=150000),F170*F172,F170)","v":103600},{"$f":"H200*G200","v":11613.560000000001},{"$f":"G200","v":0.11210000000000001},{"$f":"IF(AND(F170*12>=150000),F170*F173,F170)","v":103600},{"$f":"K200*J200","v":11613.560000000001},0,0]
["GENERAL SERVICE 50 to 499 kW SERVICE CLASSIFICATION","Non-RPP (Other)",null,null,"Average IESO Wholesale Market Price",null,{"$f":"G$95","v":0.11210000000000001},{"$f":"IF(AND(F170*12>=150000),F170*F172,F170)","v":103600},{"$f":"H201*G201","v":11613.560000000001},{"$f":"G201","v":0.11210000000000001},{"$f":"IF(AND(F170*12>=150000),F170*F173,F170)","v":103600},{"$f":"K201*J201","v":11613.560000000001},0,0]
["GENERAL SERVICE 50 to 499 kW SERVICE CLASSIFICATION"]
["GENERAL SERVICE 50 to 499 kW SERVICE CLASSIFICATION","RPP",null,null,"Total Bill on TOU (before Taxes)",null,null,null,{"$f":"SUM(I192:I199,I191)","v":11595.130000000001},null,null,{"$f":"SUM(L192:L199,L191)","v":11219.616},{"$f":"L203-I203","v":-375.51400000000103},{"$f":"IF((I203)=0,\"\",(M203/I203))","v":-3.2385492875026067E-2}]
["GENERAL SERVICE 50 to 499 kW SERVICE CLASSIFICATION","RPP",null,null,"HST",null,0.13,null,{"$f":"I203*G204","v":1507.3669000000002},0.13,null,{"$f":"L203*J204","v":1458.55008},{"$f":"L204-I204","v":-48.816820000000234},{"$f":"IF((I204)=0,\"\",(M204/I204))","v":-3.238549287502613E-2}]
["GENERAL SERVICE 50 to 499 kW SERVICE CLASSIFICATION","RPP",null,null,"8% Provincial Rebate",null,-0.08,null,{"$f":"I203*G205","v":-927.61040000000014},{"$f":"G205","v":-0.08},null,{"$f":"L203*J205","v":-897.56928000000005},{"$f":"L205-I205","v":30.041120000000092},{"$f":"IF((I205)=0,\"\",(M205/I205))","v":-3.2385492875026074E-2}]
["GENERAL SERVICE 50 to 499 kW SERVICE CLASSIFICATION","RPP_TOTAL",null,null,"Total Bill on TOU",null,null,null,{"$f":"SUM(I203,I204,I205)","v":12174.886500000002},null,null,{"$f":"L203+L204+L205","v":11780.596799999999},{"$f":"L206-I206","v":-394.28970000000299},{"$f":"IF((I206)=0,\"\",(M206/I206))","v":-3.238549287502622E-2}]
["GENERAL SERVICE 50 to 499 kW SERVICE CLASSIFICATION","RPP"]
["GENERAL SERVICE 50 to 499 kW SERVICE CLASSIFICATION","Non-RPP (Retailer)",null,null,"Total Bill on Non-RPP Avg. Price",null,null,null,{"$f":"SUM(I200,I192:I196,I191)","v":14677.23},null,null,{"$f":"SUM(L200,L192:L196,L191)","v":14301.716},{"$f":"L208-I208","v":-375.51399999999921},{"$f":"IF((I208)=0,\"\",(M208/I208))","v":-2.5584800401710624E-2}]
["GENERAL SERVICE 50 to 499 kW SERVICE CLASSIFICATION","Non-RPP (Retailer)",null,null,"HST",null,0.13,null,{"$f":"I208*G209","v":1908.0399},0.13,null,{"$f":"L208*J209","v":1859.2230800000002},{"$f":"L209-I209","v":-48.81681999999978},{"$f":"IF((I209)=0,\"\",(M209/I209))","v":-2.5584800401710562E-2}]
["GENERAL SERVICE 50 to 499 kW SERVICE CLASSIFICATION","Non-RPP (Retailer)",null,null,"8% Provincial Rebate",null,-0.08,null,{"$f":"I208*G210","v":-1174.1784},{"$f":"G210","v":-0.08},null,{"$f":"L208*J210","v":-1144.1372800000001},{"$f":"L210-I210","v":30.041119999999864},{"$f":"IF((I210)=0,\"\",(M210/I210))","v":-2.5584800401710562E-2}]
["GENERAL SERVICE 50 to 499 kW SERVICE CLASSIFICATION","Non-RPP (Retailer)_TOTAL",null,null,"Total Bill on Non-RPP Avg. Price",null,null,null,{"$f":"SUM(I208,I209,I210)","v":15411.091499999999},null,null,{"$f":"SUM(L208,L209,L210)","v":15016.801799999999},{"$f":"L211-I211","v":-394.28969999999936},{"$f":"IF((I211)=0,\"\",(M211/I211))","v":-2.5584800401710638E-2}]
["GENERAL SERVICE 50 to 499 kW SERVICE CLASSIFICATION","Non-RPP (Retailer)"]
["GENERAL SERVICE 50 to 499 kW SERVICE CLASSIFICATION","Non-RPP (Other)_BT",3,null,"Total Bill on Average IESO Wholesale Market Price",null,null,null,{"$f":"SUM(I201,I192:I196,I191)","v":14677.23},null,null,{"$f":"SUM(L201,L192:L196,L191)","v":14301.716},{"$f":"L213-I213","v":-375.51399999999921},{"$f":"IF((I213)=0,\"\",(M213/I213))","v":-2.5584800401710624E-2}]
["GENERAL SERVICE 50 to 499 kW SERVICE CLASSIFICATION","Non-RPP (Other)",null,null,"HST",null,0.13,null,{"$f":"I213*G214","v":1908.0399},0.13,null,{"$f":"L213*J214","v":1859.2230800000002},{"$f":"L214-I214","v":-48.81681999999978},{"$f":"IF((I214)=0,\"\",(M214/I214))","v":-2.5584800401710562E-2}]
["GENERAL SERVICE 50 to 499 kW SERVICE CLASSIFICATION","Non-RPP (Other)_NET",3,null,"Total Bill on Average IESO WMP (before 8% Provincial Rebate)",null,null,null,{"$f":"SUM(I213:I214)","v":16585.269899999999},null,null,{"$f":"SUM(L213:L214)","v":16160.93908},{"$f":"SUM(M213:M214)","v":-424.33081999999899},{"$f":"IF((I215)=0,\"\",(M215/I215))","v":-2.5584800401710617E-2}]
[{"$f":"A214","v":"GENERAL SERVICE 50 to 499 kW SERVICE CLASSIFICATION"},"Non-RPP (Other)",null,null,"8% Provincial Rebate",null,0,null,{"$f":"I213*G216","v":0},{"$f":"G216","v":0},null,{"$f":"L213*J216","v":0},{"$f":"L216-I216","v":0},{"$f":"IF((I216)=0,\"\",(M216/I216))","v":""}]
["GENERAL SERVICE 50 to 499 kW SERVICE CLASSIFICATION","Non-RPP (Other)_TOTAL",{"$f":"C182","v":3},null,"Total Bill on Average IESO Wholesale Market Price",null,null,null,{"$f":"SUM(I213,I214,I216)","v":16585.269899999999},null,null,{"$f":"SUM(L213,L214,L216)","v":16160.93908},{"$f":"L217-I217","v":-424.33081999999922},{"$f":"IF((I217)=0,\"\",(M217/I217))","v":-2.5584800401710631E-2}]
["GENERAL SERVICE 50 to 499 kW SERVICE CLASSIFICATION","Non-RPP (Other)"]
[]
[]
[null,null,null,null,"Customer Class:",{"$f":"E18","v":"GENERAL SERVICE 500 to 4,999 kW SERVICE CLASSIFICATION"},null,null,null,null,null,{"$f":"IF(O172=\"DEMAND - INTERVAL\",\"RTSR - INTERVAL METERED\",\"\")","v":""}]
[null,null,null,null,"RPP / Non-RPP:",{"$f":"H18","v":"Non-RPP (Other)"},null,null,"Class A"]
[null,null,null,null,"Consumption",{"$f":"K18","v":400000},"kWh"]
[null,null,null,null,"Demand",{"$f":"L18","v":2250},"kW"]
[null,null,null,null,"Current Loss Factor",{"$f":"I18","v":1.036}]
[null,null,null,null,"Proposed/Approved Loss Factor",{"$f":"J18","v":1.036}]
[]
[null,null,null,null,null,null,"Current OEB-Approved",null,null,"Proposed",null,null,"Impact"]
[null,null,null,null,null,null,"Rate","Volume","Charge","Rate","Volume","Charge","$ Change","% Change"]
[null,null,null,null,null,null,"($)",null,"($)","($)",null,"($)"]
[{"$f":"F221","v":"GENERAL SERVICE 500 to 4,999 kW SERVICE CLASSIFICATION"},null,null,"GS500_F","Monthly Service Charge",null,{"$f":"IFERROR(SUMIF(RATES!B:B,'21. Bill Impacts'!D231,RATES!H:H),\"\")","v":1785.59},1,{"$f":"H231*G231","v":1785.59},{"$f":"IFERROR(SUMIF(RATES!B:B,'21. Bill Impacts'!D231,RATES!I:I),\"\")","v":1807.02},1,{"$f":"K231*J231","v":1807.02},{"$f":"L231-I231","v":21.430000000000064},{"$f":"IF(ISERROR(M231/I231), \"\", M231/I231)","v":1.2001635313817878E-2}]
[{"$f":"A231","v":"GENERAL SERVICE 500 to 4,999 kW SERVICE CLASSIFICATION"},null,null,"GS500_V","Distribution Volumetric Rate",null,{"$f":"IFERROR(SUMIF(RATES!B:B,'21. Bill Impacts'!D232,RATES!H:H),\"\")","v":2.4281999999999999},{"$f":"IF($F224>0, $F224, $F223)","v":2250},{"$f":"H232*G232","v":5463.45},{"$f":"IFERROR(SUMIF(RATES!B:B,'21. Bill Impacts'!D232,RATES!I:I),\"\")","v":2.4573},{"$f":"IF($F224>0, $F224, $F223)","v":2250},{"$f":"K232*J232","v":5528.9250000000002},65.475000000000364,{"$f":"IF(ISERROR(M232/I232), \"\", M232/I232)","v":1.1984185816654379E-2}]
[{"$f":"A232","v":"GENERAL SERVICE 500 to 4,999 kW SERVICE CLASSIFICATION"},null,null,"GS500_FRR","Fixed Rate Riders",null,{"$f":"IFERROR(SUMIF(RATES!B:B,'21. Bill Impacts'!D233,RATES!H:H),\"\")","v":68.150000000000006},1,68.150000000000006,{"$f":"IFERROR(SUMIF(RATES!B:B,'21. Bill Impacts'!D233,RATES!I:I),\"\")","v":81.93},1,{"$f":"K233*J233","v":81.93},13.780000000000001,0.20220102714600147]
[{"$f":"A233","v":"GENERAL SERVICE 500 to 4,999 kW SERVICE CLASSIFICATION"},null,null,"GS500_VRR","Volumetric Rate Riders",null,{"$f":"IFERROR(SUMIF(RATES!B:B,'21. Bill Impacts'!D234,RATES!H:H),\"\")","v":0.18729999999999999},{"$f":"IF($F224>0, $F224, $F223)","v":2250},421.42500000000001,{"$f":"IFERROR(SUMIF(RATES!B:B,'21. Bill Impacts'!D234,RATES!I:I),\"\")","v":0.2147},{"$f":"IF($F224>0, $F224, $F223)","v":2250},483.07499999999999,61.649999999999977,0.14628937533368921]
["GENERAL SERVICE 500 to 4,999 kW SERVICE CLASSIFICATION","ST_A",{"$f":"B18","v":4},null,"Sub-Total A (excluding pass through)",null,null,null,{"$f":"SUM(I231:I234)","v":7738.6149999999998},null,null,{"$f":"SUM(L231:L234)","v":7900.95},162.33500000000004,{"$f":"IF((I235)=0,\"\",(M235/I235))","v":2.0977267896128707E-2}]
["GENERAL SERVICE 500 to 4,999 kW SERVICE CLASSIFICATION",null,null,null,"Line Losses on Cost of Power",null,{"$f":"IF((F223*12>=150000), 0, IF(F222=\"RPP\",(G250*0.65+G251*0.17+G252*0.18),IF(F222=\"Non-RPP (Retailer)\",G253,G254)))","v":0},{"$f":"IF(G236=0, 0, $F223*F225-F223)","v":0},{"$f":"H236*G236","v":0},{"$f":"IF((F223*12>=150000), 0, IF(F222=\"RPP\",(J250*0.65+J251*0.17+J252*0.18),IF(F222=\"Non-RPP (Retailer)\",J253,J254)))","v":0},{"$f":"IF(G236=0, 0, $F223*F225-F223)","v":0},{"$f":"K236*J236","v":0},{"$f":"L236-I236","v":0},{"$f":"IF(ISERROR(M236/I236), \"\", M236/I236)","v":""}]
["GENERAL SERVICE 500 to 4,999 kW SERVICE CLASSIFICATION",null,null,"GS500_DVA","Total Deferral/Variance Account Rate Riders",null,{"$f":"IFERROR(SUMIF(RATES!B:B,'21. Bill Impacts'!D237,RATES!H:H),\"\")","v":-0.17549999999999999},{"$f":"IF($F224>0, $F224, $F223)","v":2250},{"$f":"H237*G237","v":-394.875},{"$f":"IFERROR(SUMIF(RATES!B:B,'21. Bill Impacts'!D237,RATES!I:I),\"\")","v":0.10169999999999996},{"$f":"IF($F224>0, $F224, $F223)","v":2250},{"$f":"K237*J237","v":228.8249999999999},{"$f":"L237-I237","v":623.69999999999993},{"$f":"IF(ISERROR(M237/I237), \"\", M237/I237)","v":-1.5794871794871792}]
["GENERAL SERVICE 500 to 4,999 kW SERVICE CLASSIFICATION",null,null,"GS500_GA","GA Rate Riders",null,null,null,null,{"$f":"IFERROR(SUMIF(RATES!B:B,'21. Bill Impacts'!D291,RATES!I:I),\"\")","v":0},{"$f":"K248","v":0},0,0,""]
["GENERAL SERVICE 500 to 4,999 kW SERVICE CLASSIFICATION",null,null,"GS500_LV","Low Voltage Service Charge",null,{"$f":"IFERROR(SUMIF(RATES!B:B,'21. Bill Impacts'!D239,RATES!H:H),\"\")","v":7.8399999999999997E-2},{"$f":"IF($F224>0, $F224, $F223)","v":2250},176.4,{"$f":"IFERROR(SUMIF(RATES!B:B,'21. Bill Impacts'!D239,RATES!I:I),\"\")","v":7.8399999999999997E-2},{"$f":"IF($F224>0, $F224, $F223)","v":2250},176.4,0,0]
["GENERAL SERVICE 500 to 4,999 kW SERVICE CLASSIFICATION",null,null,null,"Smart Meter Entity Charge (if applicable) and/or \nany fixed ($) Deferral/Variance Account Rate Riders",null,0,1,{"$f":"H240*G240","v":0},0,1,{"$f":"K240*J240","v":0},0,{"$f":"IF(ISERROR(M240/I240), \"\", M240/I240)","v":""}]
["GENERAL SERVICE 500 to 4,999 kW SERVICE CLASSIFICATION","ST_B",{"$f":"C235","v":4},null,"Sub-Total B - Distribution (includes Sub-Total A)",null,null,null,{"$f":"SUM(I235:I240)","v":7520.1399999999994},null,null,{"$f":"SUM(L235:L240)","v":8306.1749999999993},786.03499999999985,{"$f":"IF((I241)=0,\"\",(M241/I241))","v":0.10452398492581254}]
["GENERAL SERVICE 500 to 4,999 kW SERVICE CLASSIFICATION",null,null,"GS500_TN","RTSR - Network",null,{"$f":"IFERROR(SUMIF(RATES!B:B,'21. Bill Impacts'!D242,RATES!H:H),\"\")","v":2.6402000000000001},{"$f":"IF($F224>0, $F224, $F223*$F225)","v":2250},{"$f":"H242*G242","v":5940.45},{"$f":"IFERROR(SUMIF(RATES!B:B,'21. Bill Impacts'!D242,RATES!I:I),\"\")","v":2.7679999999999998},{"$f":"IF($F224>0, $F224, $F223*$F225)","v":2250},{"$f":"K242*J242","v":6227.9999999999991},287.54999999999927,{"$f":"IF(ISERROR(M242/I242), \"\", M242/I242)","v":4.8405423831527794E-2}]
["GENERAL SERVICE 500 to 4,999 kW SERVICE CLASSIFICATION",null,null,"GS500_TC","RTSR - Connection and/or Line and Transformation Connection",null,{"$f":"IFERROR(SUMIF(RATES!B:B,'21. Bill Impacts'!D243,RATES!H:H),\"\")","v":2.5373000000000001},{"$f":"IF($F224>0, $F224, $F223*$F225)","v":2250},{"$f":"H243*G243","v":5708.9250000000002},{"$f":"IFERROR(SUMIF(RATES!B:B,'21. Bill Impacts'!D243,RATES!I:I),\"\")","v":2.6762999999999999},{"$f":"IF($F224>0, $F224, $F223*$F225)","v":2250},{"$f":"K243*J243","v":6021.6750000000002},312.75,{"$f":"IF(ISERROR(M243/I243), \"\", M243/I243)","v":5.4782642966933352E-2}]
["GENERAL SERVICE 500 to 4,999 kW SERVICE CLASSIFICATION","ST_C",{"$f":"C235","v":4},null,"Sub-Total C - Delivery (including Sub-Total B)",null,null,null,{"$f":"SUM(I241:I243)","v":19169.514999999999},null,null,{"$f":"SUM(L241:L243)","v":20555.849999999999},1386.3349999999991,{"$f":"IF((I244)=0,\"\",(M244/I244))","v":7.2319774391788175E-2}]
["GENERAL SERVICE 500 to 4,999 kW SERVICE CLASSIFICATION",null,null,null,"Wholesale Market Service Charge (WMSC)",null,{"$f":"G$86","v":3.4000000000000002E-3},{"$f":"F223*F225","v":414400},{"$f":"H245*G245","v":1408.96},{"$f":"J$86","v":3.4000000000000002E-3},{"$f":"F223*F225","v":414400},{"$f":"K245*J245","v":1408.96},0,{"$f":"IF(ISERROR(M245/I245), \"\", M245/I245)","v":0}]
["GENERAL SERVICE 500 to 4,999 kW SERVICE CLASSIFICATION",null,null,null,"Rural and Remote Rate Protection (RRRP)",null,{"$f":"G$87","v":5.0000000000000001E-4},{"$f":"F223*F225","v":414400},207.20000000000002,{"$f":"J$87","v":5.0000000000000001E-4},{"$f":"F223*F225","v":414400},207.20000000000002,0,0]
["GENERAL SERVICE 500 to 4,999 kW SERVICE CLASSIFICATION",null,null,null,"Standard Supply Service Charge",null,0.25,1,0.25,0.25,1,0.25,0,0]
["GENERAL SERVICE 500 to 4,999 kW SERVICE CLASSIFICATION"]
["GENERAL SERVICE 500 to 4,999 kW SERVICE CLASSIFICATION",null,null,null,null,null,null,null,null,null,null,null,{"$f":"L249-I249","v":0},{"$f":"IF(ISERROR(M249/I249), \"\", M249/I249)","v":""}]
["GENERAL SERVICE 500 to 4,999 kW SERVICE CLASSIFICATION","RPP",null,null,"TOU - Off Peak",null,{"$f":"G$91","v":6.5000000000000002E-2},{"$f":"IF(AND(F223*12>=150000),0.65*F223*F225,0.65*F223)","v":269360},{"$f":"H250*G250","v":17508.400000000001},6.5000000000000002E-2,{"$f":"IF(AND(F223*12>=150000),0.65*F223*F226,0.65*F223)","v":269360},{"$f":"K250*J250","v":17508.400000000001},{"$f":"L250-I250","v":0},{"$f":"IF(ISERROR(M250/I250), \"\", M250/I250)","v":0}]
["GENERAL SERVICE 500 to 4,999 kW SERVICE CLASSIFICATION","RPP",null,null,"TOU - Mid Peak",null,{"$f":"G$92","v":9.4E-2},{"$f":"IF(AND(F223*12>=150000),0.17*F223*F225,0.17*F223)","v":70448},6622.1120000000001,{"$f":"J198","v":9.4E-2},{"$f":"IF(AND(F223*12>=150000),0.17*F223*F226,0.17*F223)","v":70448},6622.1120000000001,0,0]
["GENERAL SERVICE 500 to 4,999 kW SERVICE CLASSIFICATION","RPP",null,null,"TOU - On Peak",null,{"$f":"G$93","v":0.13400000000000001},{"$f":"IF(AND(F223*12>=150000),0.18*F223*F225,0.18*F223)","v":74592},9995.3280000000013,0.13400000000000001,{"$f":"IF(AND(F223*12>=150000),0.18*F223*F226,0.18*F223)","v":74592},9995.3280000000013,0,0]
["GENERAL SERVICE 500 to 4,999 kW SERVICE CLASSIFICATION","Non-RPP (Retailer)",null,null,"Non-RPP Retailer Avg. Price",null,{"$f":"G$94","v":0.11210000000000001},{"$f":"IF(AND(F223*12>=150000),F223*F225,F223)","v":414400},{"$f":"H253*G253","v":46454.240000000005},{"$f":"G253","v":0.11210000000000001},{"$f":"IF(AND(F223*12>=150000),F223*F226,F223)","v":414400},{"$f":"K253*J253","v":46454.240000000005},0,0]
["GENERAL SERVICE 500 to 4,999 kW SERVICE CLASSIFICATION","Non-RPP (Other)",null,null,"Average IESO Wholesale Market Price",null,{"$f":"G$95","v":0.11210000000000001},{"$f":"IF(AND(F223*12>=150000),F223*F225,F223)","v":414400},{"$f":"H254*G254","v":46454.240000000005},{"$f":"G254","v":0.11210000000000001},{"$f":"IF(AND(F223*12>=150000),F223*F226,F223)","v":414400},{"$f":"K254*J254","v":46454.240000000005},0,0]
["GENERAL SERVICE 500 to 4,999 kW SERVICE CLASSIFICATION"]
["GENERAL SERVICE 500 to 4,999 kW SERVICE CLASSIFICATION","RPP",null,null,"Total Bill on TOU (before Taxes)",null,null,null,{"$f":"SUM(I245:I252,I244)","v":54911.764999999999},null,null,{"$f":"SUM(L245:L252,L244)","v":56298.1},{"$f":"L256-I256","v":1386.3349999999991},{"$f":"IF((I256)=0,\"\",(M256/I256))","v":2.5246593330227121E-2}]
["GENERAL SERVICE 500 to 4,999 kW SERVICE CLASSIFICATION","RPP",null,null,"HST",null,0.13,null,{"$f":"I256*G257","v":7138.52945},0.13,null,{"$f":"L256*J257","v":7318.7529999999997},{"$f":"L257-I257","v":180.2235499999997},{"$f":"IF((I257)=0,\"\",(M257/I257))","v":2.5246593330227097E-2}]
["GENERAL SERVICE 500 to 4,999 kW SERVICE CLASSIFICATION","RPP",null,null,"8% Provincial Rebate",null,-0.08,null,{"$f":"I256*G258","v":-4392.9412000000002},{"$f":"G258","v":-0.08},null,{"$f":"L256*J258","v":-4503.848},{"$f":"L258-I258","v":-110.90679999999975},{"$f":"IF((I258)=0,\"\",(M258/I258))","v":2.524659333022708E-2}]
["GENERAL SERVICE 500 to 4,999 kW SERVICE CLASSIFICATION","RPP_TOTAL",null,null,"Total Bill on TOU",null,null,null,{"$f":"SUM(I256,I257,I258)","v":57657.35325},null,null,{"$f":"L256+L257+L258","v":59113.004999999997},{"$f":"L259-I259","v":1455.6517499999973},{"$f":"IF((I259)=0,\"\",(M259/I259))","v":2.524659333022709E-2}]
["GENERAL SERVICE 500 to 4,999 kW SERVICE CLASSIFICATION","RPP"]
["GENERAL SERVICE 500 to 4,999 kW SERVICE CLASSIFICATION","Non-RPP (Retailer)",null,null,"Total Bill on Non-RPP Avg. Price",null,null,null,{"$f":"SUM(I253,I245:I249,I244)","v":67240.165000000008},null,null,{"$f":"SUM(L253,L245:L249,L244)","v":68626.5},{"$f":"L261-I261","v":1386.3349999999919},{"$f":"IF((I261)=0,\"\",(M261/I261))","v":2.0617662077420419E-2}]
["GENERAL SERVICE 500 to 4,999 kW SERVICE CLASSIFICATION","Non-RPP (Retailer)",null,null,"HST",null,0.13,null,{"$f":"I261*G262","v":8741.2214500000009},0.13,null,{"$f":"L261*J262","v":8921.4449999999997},{"$f":"L262-I262","v":180.2235499999988},{"$f":"IF((I262)=0,\"\",(M262/I262))","v":2.0617662077420402E-2}]
["GENERAL SERVICE 500 to 4,999 kW SERVICE CLASSIFICATION","Non-RPP (Retailer)",null,null,"8% Provincial Rebate",null,-0.08,null,{"$f":"I261*G263","v":-5379.2132000000011},{"$f":"G263","v":-0.08},null,{"$f":"L261*J263","v":-5490.12},{"$f":"L263-I263","v":-110.90679999999884},{"$f":"IF((I263)=0,\"\",(M263/I263))","v":2.0617662077420322E-2}]
["GENERAL SERVICE 500 to 4,999 kW SERVICE CLASSIFICATION","Non-RPP (Retailer)_TOTAL",null,null,"Total Bill on Non-RPP Avg. Price",null,null,null,{"$f":"SUM(I261,I262,I263)","v":70602.173250000007},null,null,{"$f":"SUM(L261,L262,L263)","v":72057.825000000012},{"$f":"L264-I264","v":1455.6517500000045},{"$f":"IF((I264)=0,\"\",(M264/I264))","v":2.0617662077420603E-2}]
["GENERAL SERVICE 500 to 4,999 kW SERVICE CLASSIFICATION","Non-RPP (Retailer)"]
["GENERAL SERVICE 500 to 4,999 kW SERVICE CLASSIFICATION","Non-RPP (Other)_BT",4,null,"Total Bill on Average IESO Wholesale Market Price",null,null,null,{"$f":"SUM(I254,I245:I249,I244)","v":67240.165000000008},null,null,{"$f":"SUM(L254,L245:L249,L244)","v":68626.5},{"$f":"L266-I266","v":1386.3349999999919},{"$f":"IF((I266)=0,\"\",(M266/I266))","v":2.0617662077420419E-2}]
["GENERAL SERVICE 500 to 4,999 kW SERVICE CLASSIFICATION","Non-RPP (Other)",null,null,"HST",null,0.13,null,{"$f":"I266*G267","v":8741.2214500000009},0.13,null,{"$f":"L266*J267","v":8921.4449999999997},{"$f":"L267-I267","v":180.2235499999988},{"$f":"IF((I267)=0,\"\",(M267/I267))","v":2.0617662077420402E-2}]
["GENERAL SERVICE 500 to 4,999 kW SERVICE CLASSIFICATION","Non-RPP (Other)_NET",4,null,"Total Bill on Average IESO WMP (before 8% Provincial Rebate)",null,null,null,{"$f":"SUM(I266:I267)","v":75981.386450000005},null,null,{"$f":"SUM(L266:L267)","v":77547.945000000007},{"$f":"SUM(M266:M267)","v":1566.5585499999906},{"$f":"IF((I268)=0,\"\",(M268/I268))","v":2.0617662077420416E-2}]
[{"$f":"A267","v":"GENERAL SERVICE 500 to 4,999 kW SERVICE CLASSIFICATION"},"Non-RPP (Other)",null,null,"8% Provincial Rebate",null,0,null,{"$f":"I266*G269","v":0},{"$f":"G269","v":0},null,{"$f":"L266*J269","v":0},{"$f":"L269-I269","v":0},{"$f":"IF((I269)=0,\"\",(M269/I269))","v":""}]
["GENERAL SERVICE 500 to 4,999 kW SERVICE CLASSIFICATION","Non-RPP (Other)_TOTAL",{"$f":"C235","v":4},null,"Total Bill on Average IESO Wholesale Market Price",null,null,null,{"$f":"SUM(I266,I267,I269)","v":75981.386450000005},null,null,{"$f":"SUM(L266,L267,L269)","v":77547.945000000007},{"$f":"L270-I270","v":1566.5585500000016},{"$f":"IF((I270)=0,\"\",(M270/I270))","v":2.0617662077420561E-2}]
["GENERAL SERVICE 500 to 4,999 kW SERVICE CLASSIFICATION","Non-RPP (Other)"]
[]
[]
[null,null,null,null,"Customer Class:",{"$f":"E19","v":"LARGE USE SERVICE CLASSIFICATION"},null,null,null,null,null,{"$f":"IF(O225=\"DEMAND - INTERVAL\",\"RTSR - INTERVAL METERED\",\"\")","v":""}]
[null,null,null,null,"RPP / Non-RPP:",{"$f":"H19","v":"Non-RPP (Other)"},null,null,"Class A"]
[null,null,null,null,"Consumption",{"$f":"K19","v":3000000},"kWh"]
[null,null,null,null,"Demand",{"$f":"L19","v":5000},"kW"]
[null,null,null,null,"Current Loss Factor",{"$f":"I19","v":1.0145}]
[null,null,null,null,"Proposed/Approved Loss Factor",{"$f":"J19","v":1.0145}]
[]
[null,null,null,null,null,null,"Current OEB-Approved",null,null,"Proposed",null,null,"Impact"]
[null,null,null,null,null,null,"Rate","Volume","Charge","Rate","Volume","Charge","$ Change","% Change"]
[null,null,null,null,null,null,"($)",null,"($)","($)",null,"($)"]
[{"$f":"F274","v":"LARGE USE SERVICE CLASSIFICATION"},null,null,"LU_F","Monthly Service Charge",null,{"$f":"IFERROR(SUMIF(RATES!B:B,'21. Bill Impacts'!D284,RATES!H:H),\"\")","v":14078.67},1,{"$f":"H284*G284","v":14078.67},{"$f":"IFERROR(SUMIF(RATES!B:B,'21. Bill Impacts'!D284,RATES!I:I),\"\")","v":14247.61},1,{"$f":"K284*J284","v":14247.61},{"$f":"L284-I284","v":168.94000000000051},{"$f":"IF(ISERROR(M284/I284), \"\", M284/I284)","v":1.1999713041075648E-2}]
[{"$f":"A284","v":"LARGE USE SERVICE CLASSIFICATION"},null,null,"LU_V","Distribution Volumetric Rate",null,{"$f":"IFERROR(SUMIF(RATES!B:B,'21. Bill Impacts'!D285,RATES!H:H),\"\")","v":3.0139},{"$f":"IF($F277>0, $F277, $F276)","v":5000},{"$f":"H285*G285","v":15069.5},{"$f":"IFERROR(SUMIF(RATES!B:B,'21. Bill Impacts'!D285,RATES!I:I),\"\")","v":3.0501},{"$f":"IF($F277>0, $F277, $F276)","v":5000},{"$f":"K285*J285","v":15250.5},181,{"$f":"IF(ISERROR(M285/I285), \"\", M285/I285)","v":1.2011015627592157E-2}]
[{"$f":"A285","v":"LARGE USE SERVICE CLASSIFICATION"},null,null,"LU_FRR","Fixed Rate Riders",null,{"$f":"IFERROR(SUMIF(RATES!B:B,'21. Bill Impacts'!D286,RATES!H:H),\"\")","v":570.48},1,570.48,{"$f":"IFERROR(SUMIF(RATES!B:B,'21. Bill Impacts'!D286,RATES!I:I),\"\")","v":646.02},1,{"$f":"K286*J286","v":646.02},75.539999999999964,0.13241480858224647]
[{"$f":"A286","v":"LARGE USE SERVICE CLASSIFICATION"},null,null,"LU_VRR","Volumetric Rate Riders",null,{"$f":"IFERROR(SUMIF(RATES!B:B,'21. Bill Impacts'!D287,RATES!H:H),\"\")","v":0.20249999999999999},{"$f":"IF($F277>0, $F277, $F276)","v":5000},1012.4999999999999,{"$f":"IFERROR(SUMIF(RATES!B:B,'21. Bill Impacts'!D287,RATES!I:I),\"\")","v":0.23139999999999999},{"$f":"IF($F277>0, $F277, $F276)","v":5000},1157,144.50000000000011,0.14271604938271618]
["LARGE USE SERVICE CLASSIFICATION","ST_A",{"$f":"B19","v":5},null,"Sub-Total A (excluding pass through)",null,null,null,{"$f":"SUM(I284:I287)","v":30731.149999999998},null,null,{"$f":"SUM(L284:L287)","v":31301.13},569.9800000000032,{"$f":"IF((I288)=0,\"\",(M288/I288))","v":1.8547304607865415E-2}]
["LARGE USE SERVICE CLASSIFICATION",null,null,null,"Line Losses on Cost of Power",null,{"$f":"IF((F276*12>=150000), 0, IF(F275=\"RPP\",(G303*0.65+G304*0.17+G305*0.18),IF(F275=\"Non-RPP (Retailer)\",G306,G307)))","v":0},{"$f":"IF(G289=0, 0, $F276*F278-F276)","v":0},{"$f":"H289*G289","v":0},{"$f":"IF((F276*12>=150000), 0, IF(F275=\"RPP\",(J303*0.65+J304*0.17+J305*0.18),IF(F275=\"Non-RPP (Retailer)\",J306,J307)))","v":0},{"$f":"IF(G289=0, 0, $F276*F278-F276)","v":0},{"$f":"K289*J289","v":0},{"$f":"L289-I289","v":0},{"$f":"IF(ISERROR(M289/I289), \"\", M289/I289)","v":""}]
["LARGE USE SERVICE CLASSIFICATION",null,null,"LU_DVA","Total Deferral/Variance Account Rate Riders",null,{"$f":"IFERROR(SUMIF(RATES!B:B,'21. Bill Impacts'!D290,RATES!H:H),\"\")","v":-0.22639999999999999},{"$f":"IF($F277>0, $F277, $F276)","v":5000},{"$f":"H290*G290","v":-1132},{"$f":"IFERROR(SUMIF(RATES!B:B,'21. Bill Impacts'!D290,RATES!I:I),\"\")","v":0.1787},{"$f":"IF($F277>0, $F277, $F276)","v":5000},{"$f":"K290*J290","v":893.5},{"$f":"L290-I290","v":2025.5},{"$f":"IF(ISERROR(M290/I290), \"\", M290/I290)","v":-1.7893109540636043}]
["LARGE USE SERVICE CLASSIFICATION",null,null,"LU_GA","GA Rate Riders",null,{"$f":"IFERROR(SUMIF(RATES!B:B,'21. Bill Impacts'!D291,RATES!H:H),\"\")","v":0},{"$f":"+F276","v":3000000},0,{"$f":"IFERROR(SUMIF(RATES!B:B,'21. Bill Impacts'!D291,RATES!I:I),\"\")","v":0},{"$f":"+F276","v":3000000},0,0,""]
["LARGE USE SERVICE CLASSIFICATION",null,null,"LU_LV","Low Voltage Service Charge",null,{"$f":"IFERROR(SUMIF(RATES!B:B,'21. Bill Impacts'!D292,RATES!H:H),\"\")","v":8.3799999999999999E-2},{"$f":"IF($F277>0, $F277, $F276)","v":5000},419,{"$f":"IFERROR(SUMIF(RATES!B:B,'21. Bill Impacts'!D292,RATES!I:I),\"\")","v":8.3799999999999999E-2},{"$f":"IF($F277>0, $F277, $F276)","v":5000},419,0,0]
["LARGE USE SERVICE CLASSIFICATION",null,null,null,"Smart Meter Entity Charge (if applicable) and/or \nany fixed ($) Deferral/Variance Account Rate Riders",null,null,1,{"$f":"H293*G293","v":0},null,1,{"$f":"K293*J293","v":0},0,{"$f":"IF(ISERROR(M293/I293), \"\", M293/I293)","v":""}]
["LARGE USE SERVICE CLASSIFICATION","ST_B",{"$f":"C288","v":5},null,"Sub-Total B - Distribution (includes Sub-Total A)",null,null,null,{"$f":"SUM(I288:I293)","v":30018.149999999998},null,null,{"$f":"SUM(L288:L293)","v":32613.63},2595.4800000000032,{"$f":"IF((I294)=0,\"\",(M294/I294))","v":8.6463689467872057E-2}]
["LARGE USE SERVICE CLASSIFICATION",null,null,"LU_TN","RTSR - Network",null,{"$f":"IFERROR(SUMIF(RATES!B:B,'21. Bill Impacts'!D295,RATES!H:H),\"\")","v":2.8174000000000001},{"$f":"IF($F277>0, $F277, $F276*$F278)","v":5000},{"$f":"H295*G295","v":14087},{"$f":"IFERROR(SUMIF(RATES!B:B,'21. Bill Impacts'!D295,RATES!I:I),\"\")","v":2.9538000000000002},{"$f":"IF($F277>0, $F277, $F276*$F278)","v":5000},{"$f":"K295*J295","v":14769.000000000002},682.00000000000182,{"$f":"IF(ISERROR(M295/I295), \"\", M295/I295)","v":4.8413430822744505E-2}]
["LARGE USE SERVICE CLASSIFICATION",null,null,"LU_TC","RTSR - Connection and/or Line and Transformation Connection",null,{"$f":"IFERROR(SUMIF(RATES!B:B,'21. Bill Impacts'!D296,RATES!H:H),\"\")","v":2.71},{"$f":"IF($F277>0, $F277, $F276*$F278)","v":5000},{"$f":"H296*G296","v":13550},{"$f":"IFERROR(SUMIF(RATES!B:B,'21. Bill Impacts'!D296,RATES!I:I),\"\")","v":2.8584000000000001},{"$f":"IF($F277>0, $F277, $F276*$F278)","v":5000},{"$f":"K296*J296","v":14292},742,{"$f":"IF(ISERROR(M296/I296), \"\", M296/I296)","v":5.4760147601476017E-2}]
["LARGE USE SERVICE CLASSIFICATION","ST_C",{"$f":"C288","v":5},null,"Sub-Total C - Delivery (including Sub-Total B)",null,null,null,{"$f":"SUM(I294:I296)","v":57655.149999999994},null,null,{"$f":"SUM(L294:L296)","v":61674.630000000005},4019.4800000000105,{"$f":"IF((I297)=0,\"\",(M297/I297))","v":6.9715888346487884E-2}]
["LARGE USE SERVICE CLASSIFICATION",null,null,null,"Wholesale Market Service Charge (WMSC)",null,{"$f":"G$86","v":3.4000000000000002E-3},{"$f":"F276*F278","v":3043500},{"$f":"H298*G298","v":10347.900000000001},{"$f":"J$86","v":3.4000000000000002E-3},{"$f":"F276*F278","v":3043500},{"$f":"K298*J298","v":10347.900000000001},0,{"$f":"IF(ISERROR(M298/I298), \"\", M298/I298)","v":0}]
["LARGE USE SERVICE CLASSIFICATION",null,null,null,"Rural and Remote Rate Protection (RRRP)",null,{"$f":"G$87","v":5.0000000000000001E-4},{"$f":"F276*F278","v":3043500},1521.75,{"$f":"J$87","v":5.0000000000000001E-4},{"$f":"F276*F278","v":3043500},1521.75,0,0]
["LARGE USE SERVICE CLASSIFICATION",null,null,null,"Standard Supply Service Charge",null,0.25,1,0.25,0.25,1,0.25,0,0]
["LARGE USE SERVICE CLASSIFICATION"]
["LARGE USE SERVICE CLASSIFICATION",null,null,null,null,null,null,null,null,null,null,null,{"$f":"L302-I302","v":0},{"$f":"IF(ISERROR(M302/I302), \"\", M302/I302)","v":""}]
["LARGE USE SERVICE CLASSIFICATION","RPP",null,null,"TOU - Off Peak",null,{"$f":"G$91","v":6.5000000000000002E-2},{"$f":"IF(AND(F276*12>=150000),0.65*F276*F278,0.65*F276)","v":1978275},{"$f":"H303*G303","v":128587.875},6.5000000000000002E-2,{"$f":"IF(AND(F276*12>=150000),0.65*F276*F279,0.65*F276)","v":1978275},{"$f":"K303*J303","v":128587.875},{"$f":"L303-I303","v":0},{"$f":"IF(ISERROR(M303/I303), \"\", M303/I303)","v":0}]
["LARGE USE SERVICE CLASSIFICATION","RPP",null,null,"TOU - Mid Peak",null,{"$f":"G$92","v":9.4E-2},{"$f":"IF(AND(F276*12>=150000),0.17*F276*F278,0.17*F276)","v":517395.00000000006},48635.130000000005,{"$f":"J251","v":9.4E-2},{"$f":"IF(AND(F276*12>=150000),0.17*F276*F279,0.17*F276)","v":517395.00000000006},48635.130000000005,0,0]
["LARGE USE SERVICE CLASSIFICATION","RPP",null,null,"TOU - On Peak",null,{"$f":"G$93","v":0.13400000000000001},{"$f":"IF(AND(F276*12>=150000),0.18*F276*F278,0.18*F276)","v":547830},73409.22,0.13400000000000001,{"$f":"IF(AND(F276*12>=150000),0.18*F276*F279,0.18*F276)","v":547830},73409.22,0,0]
["LARGE USE SERVICE CLASSIFICATION","Non-RPP (Retailer)",null,null,"Non-RPP Retailer Avg. Price",null,{"$f":"G$94","v":0.11210000000000001},{"$f":"IF(AND(F276*12>=150000),F276*F278,F276)","v":3043500},{"$f":"H306*G306","v":341176.35000000003},{"$f":"G306","v":0.11210000000000001},{"$f":"IF(AND(F276*12>=150000),F276*F279,F276)","v":3043500},{"$f":"K306*J306","v":341176.35000000003},0,0]
["LARGE USE SERVICE CLASSIFICATION","Non-RPP (Other)",null,null,"Average IESO Wholesale Market Price",null,{"$f":"G$95","v":0.11210000000000001},{"$f":"IF(AND(F276*12>=150000),F276*F278,F276)","v":3043500},{"$f":"H307*G307","v":341176.35000000003},{"$f":"G307","v":0.11210000000000001},{"$f":"IF(AND(F276*12>=150000),F276*F279,F276)","v":3043500},{"$f":"K307*J307","v":341176.35000000003},0,0]
["LARGE USE SERVICE CLASSIFICATION"]
["LARGE USE SERVICE CLASSIFICATION","RPP_BT",5,null,"Total Bill on TOU (before Taxes)",null,null,null,{"$f":"SUM(I298:I305,I297)","v":320157.27500000002},null,null,{"$f":"SUM(L298:L305,L297)","v":324176.755},{"$f":"L309-I309","v":4019.4799999999814},{"$f":"IF((I309)=0,\"\",(M309/I309))","v":1.2554704558876513E-2}]
["LARGE USE SERVICE CLASSIFICATION","RPP",null,null,"HST",null,0.13,null,{"$f":"I309*G310","v":41620.445750000006},0.13,null,{"$f":"L309*J310","v":42142.978150000003},{"$f":"L310-I310","v":522.53239999999641},{"$f":"IF((I310)=0,\"\",(M310/I310))","v":1.2554704558876483E-2}]
["LARGE USE SERVICE CLASSIFICATION","RPP_NET",5,null,"Total Bill on TOU (before 8% Provincial Rebate)",null,null,null,{"$f":"SUM(I309:I310)","v":361777.72075000004},null,null,{"$f":"SUM(L309:L310)","v":366319.73314999999},{"$f":"SUM(M309:M310)","v":4542.0123999999778},{"$f":"IF((I311)=0,\"\",(M311/I311))","v":1.2554704558876507E-2}]
[{"$f":"A310","v":"LARGE USE SERVICE CLASSIFICATION"},"RPP",null,null,"8% Provincial Rebate",null,0,null,{"$f":"I309*G312","v":0},{"$f":"G312","v":0},null,{"$f":"L309*J312","v":0},{"$f":"L312-I312","v":0},{"$f":"IF((I312)=0,\"\",(M312/I312))","v":""}]
["LARGE USE SERVICE CLASSIFICATION","RPP_TOTAL",{"$f":"C288","v":5},null,"Total Bill on TOU",null,null,null,{"$f":"SUM(I309,I310,I312)","v":361777.72075000004},null,null,{"$f":"L309+L310+L312","v":366319.73314999999},{"$f":"L313-I313","v":4542.0123999999487},{"$f":"IF((I313)=0,\"\",(M313/I313))","v":1.2554704558876428E-2}]
["LARGE USE SERVICE CLASSIFICATION","RPP"]
["LARGE USE SERVICE CLASSIFICATION","Non-RPP (Retailer)",5,null,"Total Bill on Non-RPP Avg. Price",null,null,null,{"$f":"SUM(I306,I298:I302,I297)","v":410701.4},null,null,{"$f":"SUM(L306,L298:L302,L297)","v":414720.88000000006},{"$f":"L315-I315","v":4019.4800000000396},{"$f":"IF((I315)=0,\"\",(M315/I315))","v":9.7868670523159635E-3}]
["LARGE USE SERVICE CLASSIFICATION","Non-RPP (Retailer)",null,null,"HST",null,0.13,null,{"$f":"I315*G316","v":53391.182000000008},0.13,null,{"$f":"L315*J316","v":53913.714400000012},{"$f":"L316-I316","v":522.53240000000369},{"$f":"IF((I316)=0,\"\",(M316/I316))","v":9.7868670523159357E-3}]
["LARGE USE SERVICE CLASSIFICATION","Non-RPP (Retailer)",null,null,"Provincial Rebate",null,-0.08,null,{"$f":"I315*G317","v":-32856.112000000001},{"$f":"G317","v":-0.08},null,{"$f":"L315*J317","v":-33177.670400000003},{"$f":"L317-I317","v":-321.55840000000171},{"$f":"IF((I317)=0,\"\",(M317/I317))","v":9.7868670523159184E-3}]
["LARGE USE SERVICE CLASSIFICATION","Non-RPP (Retailer)_TOTAL",5,null,"Total Bill on Non-RPP Avg. Price",null,null,null,{"$f":"SUM(I315,I316,I317)","v":431236.47000000003},null,null,{"$f":"SUM(L315,L316,L317)","v":435456.92400000006},{"$f":"L318-I318","v":4220.454000000027},{"$f":"IF((I318)=0,\"\",(M318/I318))","v":9.7868670523159288E-3}]
["LARGE USE SERVICE CLASSIFICATION","Non-RPP (Retailer)"]
["LARGE USE SERVICE CLASSIFICATION","Non-RPP (Other)_BT",5,null,"Total Bill on Average IESO Wholesale Market Price",null,null,null,{"$f":"SUM(I307,I298:I302,I297)","v":410701.4},null,null,{"$f":"SUM(L307,L298:L302,L297)","v":414720.88000000006},{"$f":"L320-I320","v":4019.4800000000396},{"$f":"IF((I320)=0,\"\",(M320/I320))","v":9.7868670523159635E-3}]
["LARGE USE SERVICE CLASSIFICATION","Non-RPP (Other)",null,null,"HST",null,0.13,null,{"$f":"I320*G321","v":53391.182000000008},0.13,null,{"$f":"L320*J321","v":53913.714400000012},{"$f":"L321-I321","v":522.53240000000369},{"$f":"IF((I321)=0,\"\",(M321/I321))","v":9.7868670523159357E-3}]
["LARGE USE SERVICE CLASSIFICATION","Non-RPP (Other)",null,null,"Provincial Rebate",null,-0.08,null,{"$f":"I320*G322","v":-32856.112000000001},{"$f":"G322","v":-0.08},null,{"$f":"L320*J322","v":-33177.670400000003},{"$f":"L322-I322","v":-321.55840000000171},{"$f":"IF((I322)=0,\"\",(M322/I322))","v":9.7868670523159184E-3}]
["LARGE USE SERVICE CLASSIFICATION","Non-RPP (Other)_TOTAL",5,null,"Total Bill on Average IESO Wholesale Market Price",null,null,null,{"$f":"SUM(I320,I321,I322)","v":431236.47000000003},null,null,{"$f":"SUM(L320,L321,L322)","v":435456.92400000006},{"$f":"L323-I323","v":4220.454000000027},{"$f":"IF((I323)=0,\"\",(M323/I323))","v":9.7868670523159288E-3}]
["LARGE USE SERVICE CLASSIFICATION","Non-RPP (Other)"]
[null,null,null,null,"NOTE: Board model does not populate customer count for MFC and FRR for USL, Sentinel and S/L classes. It requires manual input on Bill Impact sheet every time the bill impacts are executed. "]
[]
[null,null,null,null,"Customer Class:",{"$f":"E21","v":"UNMETERED SCATTERED LOAD SERVICE CLASSIFICATION"},null,null,null,null,null,{"$f":"IF(O278=\"DEMAND - INTERVAL\",\"RTSR - INTERVAL METERED\",\"\")","v":""}]
[null,null,null,null,"RPP / Non-RPP:",{"$f":"H21","v":"RPP"}]
[null,null,null,null,"Consumption",{"$f":"K21","v":300},"kWh"]
[null,null,null,null,"Demand",{"$f":"L21","v":0},"kW"]
[null,null,null,null,"Current Loss Factor",{"$f":"I21","v":1.036}]
[null,null,null,null,"Proposed/Approved Loss Factor",{"$f":"J21","v":1.036}]
[]
[null,null,null,null,null,null,"Current OEB-Approved",null,null,"Proposed",null,null,"Impact"]
[null,null,null,null,null,null,"Rate","Volume","Charge","Rate","Volume","Charge","$ Change","% Change"]
[null,null,null,null,null,null,"($)",null,"($)","($)",null,"($)"]
[{"$f":"F327","v":"UNMETERED SCATTERED LOAD SERVICE CLASSIFICATION"},null,null,"USL_F","Monthly Service Charge",null,{"$f":"IFERROR(SUMIF(RATES!B:B,'21. Bill Impacts'!D337,RATES!H:H),\"\")","v":9.19},1,{"$f":"H337*G337","v":9.19},{"$f":"IFERROR(SUMIF(RATES!B:B,'21. Bill Impacts'!D337,RATES!I:I),\"\")","v":9.3000000000000007},1,{"$f":"K337*J337","v":9.3000000000000007},{"$f":"L337-I337","v":0.11000000000000121},{"$f":"IF(ISERROR(M337/I337), \"\", M337/I337)","v":1.1969532100108945E-2}]
[{"$f":"A337","v":"UNMETERED SCATTERED LOAD SERVICE CLASSIFICATION"},null,null,"USL_V","Distribution Volumetric Rate",null,{"$f":"IFERROR(SUMIF(RATES!B:B,'21. Bill Impacts'!D338,RATES!H:H),\"\")","v":1.67E-2},{"$f":"IF($F330>0, $F330, $F329)","v":300},{"$f":"H338*G338","v":5.01},{"$f":"IFERROR(SUMIF(RATES!B:B,'21. Bill Impacts'!D338,RATES!I:I),\"\")","v":1.6899999999999998E-2},{"$f":"IF($F330>0, $F330, $F329)","v":300},{"$f":"K338*J338","v":5.0699999999999994},5.9999999999999609E-2,{"$f":"IF(ISERROR(M338/I338), \"\", M338/I338)","v":1.1976047904191539E-2}]
[{"$f":"A338","v":"UNMETERED SCATTERED LOAD SERVICE CLASSIFICATION"},null,null,"USL_FRR","Fixed Rate Riders",null,{"$f":"IFERROR(SUMIF(RATES!B:B,'21. Bill Impacts'!D339,RATES!H:H),\"\")","v":0.35},1,0.35,{"$f":"IFERROR(SUMIF(RATES!B:B,'21. Bill Impacts'!D339,RATES!I:I),\"\")","v":0.43},1,{"$f":"K339*J339","v":0.43},8.0000000000000016E-2,0.22857142857142862]
[{"$f":"A339","v":"UNMETERED SCATTERED LOAD SERVICE CLASSIFICATION"},null,null,"USL_VRR","Volumetric Rate Riders",null,{"$f":"IFERROR(SUMIF(RATES!B:B,'21. Bill Impacts'!D340,RATES!H:H),\"\")","v":6.0000000000000006E-4},{"$f":"IF($F330>0, $F330, $F329)","v":300},0.18000000000000002,{"$f":"IFERROR(SUMIF(RATES!B:B,'21. Bill Impacts'!D340,RATES!I:I),\"\")","v":8.0000000000000015E-4},{"$f":"IF($F330>0, $F330, $F329)","v":300},0.24000000000000005,6.0000000000000026E-2,0.33333333333333343]
["UNMETERED SCATTERED LOAD SERVICE CLASSIFICATION","ST_A",{"$f":"B21","v":7},null,"Sub-Total A (excluding pass through)",null,null,null,{"$f":"SUM(I337:I340)","v":14.729999999999999},null,null,{"$f":"SUM(L337:L340)","v":15.040000000000001},0.31000000000000227,{"$f":"IF((I341)=0,\"\",(M341/I341))","v":2.1045485403937698E-2}]
["UNMETERED SCATTERED LOAD SERVICE CLASSIFICATION",null,null,null,"Line Losses on Cost of Power",null,{"$f":"IF((F329*12>=150000), 0, IF(F328=\"RPP\",(G356*0.65+G357*0.17+G358*0.18),IF(F328=\"Non-RPP (Retailer)\",G359,G360)))","v":8.2350000000000007E-2},{"$f":"IF(G342=0, 0, $F329*F331-F329)","v":10.800000000000011},{"$f":"H342*G342","v":0.88938000000000106},{"$f":"IF((F329*12>=150000), 0, IF(F328=\"RPP\",(J356*0.65+J357*0.17+J358*0.18),IF(F328=\"Non-RPP (Retailer)\",J359,J360)))","v":8.2350000000000007E-2},{"$f":"IF(G342=0, 0, $F329*F331-F329)","v":10.800000000000011},{"$f":"K342*J342","v":0.88938000000000106},{"$f":"L342-I342","v":0},{"$f":"IF(ISERROR(M342/I342), \"\", M342/I342)","v":0}]
["UNMETERED SCATTERED LOAD SERVICE CLASSIFICATION",null,null,"USL_DVA","Total Deferral/Variance Account Rate Riders",null,{"$f":"IFERROR(SUMIF(RATES!B:B,'21. Bill Impacts'!D343,RATES!H:H),\"\")","v":-4.0000000000000002E-4},{"$f":"IF($F330>0, $F330, $F329)","v":300},{"$f":"H343*G343","v":-0.12000000000000001},{"$f":"IFERROR(SUMIF(RATES!B:B,'21. Bill Impacts'!D343,RATES!I:I),\"\")","v":1.9999999999999998E-4},{"$f":"IF($F330>0, $F330, $F329)","v":300},{"$f":"K343*J343","v":0.06},{"$f":"L343-I343","v":0.18},{"$f":"IF(ISERROR(M343/I343), \"\", M343/I343)","v":-1.4999999999999998}]
["UNMETERED SCATTERED LOAD SERVICE CLASSIFICATION",null,null,"USL_GA","GA Rate Riders",null,0,{"$f":"IF($F330>0, $F330, $F329)","v":300},0,0,{"$f":"IF($F330>0, $F330, $F329)","v":300},0,0,""]
["UNMETERED SCATTERED LOAD SERVICE CLASSIFICATION",null,null,"USL_LV","Low Voltage Service Charge",null,{"$f":"IFERROR(SUMIF(RATES!B:B,'21. Bill Impacts'!D345,RATES!H:H),\"\")","v":2.0000000000000001E-4},{"$f":"IF($F330>0, $F330, $F329)","v":300},6.0000000000000005E-2,{"$f":"IFERROR(SUMIF(RATES!B:B,'21. Bill Impacts'!D345,RATES!I:I),\"\")","v":2.0000000000000001E-4},{"$f":"IF($F330>0, $F330, $F329)","v":300},6.0000000000000005E-2,0,0]
["UNMETERED SCATTERED LOAD SERVICE CLASSIFICATION",null,null,null,"Smart Meter Entity Charge (if applicable) and/or \nany fixed ($) Deferral/Variance Account Rate Riders",null,0,1,{"$f":"H346*G346","v":0},0,1,{"$f":"K346*J346","v":0},0,{"$f":"IF(ISERROR(M346/I346), \"\", M346/I346)","v":""}]
["UNMETERED SCATTERED LOAD SERVICE CLASSIFICATION","ST_B",{"$f":"C341","v":7},null,"Sub-Total B - Distribution (includes Sub-Total A)",null,null,null,{"$f":"SUM(I341:I346)","v":15.559380000000001},null,null,{"$f":"SUM(L341:L346)","v":16.049380000000003},0.49000000000000199,{"$f":"IF((I347)=0,\"\",(M347/I347))","v":3.1492257403572761E-2}]
["UNMETERED SCATTERED LOAD SERVICE CLASSIFICATION",null,null,"USL_TN","RTSR - Network",null,{"$f":"IFERROR(SUMIF(RATES!B:B,'21. Bill Impacts'!D348,RATES!H:H),\"\")","v":7.1000000000000004E-3},{"$f":"$F$329","v":300},{"$f":"H348*G348","v":2.1300000000000003},{"$f":"IFERROR(SUMIF(RATES!B:B,'21. Bill Impacts'!D348,RATES!I:I),\"\")","v":7.4000000000000003E-3},{"$f":"$F$329","v":300},{"$f":"K348*J348","v":2.2200000000000002},8.9999999999999858E-2,{"$f":"IF(ISERROR(M348/I348), \"\", M348/I348)","v":4.2253521126760493E-2}]
["UNMETERED SCATTERED LOAD SERVICE CLASSIFICATION",null,null,"USL_TC","RTSR - Connection and/or Line and Transformation Connection",null,{"$f":"IFERROR(SUMIF(RATES!B:B,'21. Bill Impacts'!D349,RATES!H:H),\"\")","v":6.4999999999999997E-3},{"$f":"+H348","v":300},{"$f":"H349*G349","v":1.95},{"$f":"IFERROR(SUMIF(RATES!B:B,'21. Bill Impacts'!D349,RATES!I:I),\"\")","v":6.8999999999999999E-3},{"$f":"+K348","v":300},{"$f":"K349*J349","v":2.0699999999999998},0.11999999999999988,{"$f":"IF(ISERROR(M349/I349), \"\", M349/I349)","v":6.1538461538461479E-2}]
["UNMETERED SCATTERED LOAD SERVICE CLASSIFICATION","ST_C",{"$f":"C341","v":7},null,"Sub-Total C - Delivery (including Sub-Total B)",null,null,null,{"$f":"SUM(I347:I349)","v":19.639379999999999},null,null,{"$f":"SUM(L347:L349)","v":20.339380000000002},0.70000000000000284,{"$f":"IF((I350)=0,\"\",(M350/I350))","v":3.5642673037540026E-2}]
["UNMETERED SCATTERED LOAD SERVICE CLASSIFICATION",null,null,null,"Wholesale Market Service Charge (WMSC)",null,{"$f":"G$86","v":3.4000000000000002E-3},{"$f":"F329*F331","v":310.8},{"$f":"H351*G351","v":1.0567200000000001},{"$f":"J$86","v":3.4000000000000002E-3},{"$f":"F329*F331","v":310.8},{"$f":"K351*J351","v":1.0567200000000001},0,{"$f":"IF(ISERROR(M351/I351), \"\", M351/I351)","v":0}]
["UNMETERED SCATTERED LOAD SERVICE CLASSIFICATION",null,null,null,"Rural and Remote Rate Protection (RRRP)",null,{"$f":"G$87","v":5.0000000000000001E-4},{"$f":"F329*F331","v":310.8},0.15540000000000001,{"$f":"J$87","v":5.0000000000000001E-4},{"$f":"F329*F331","v":310.8},0.15540000000000001,0,0]
["UNMETERED SCATTERED LOAD SERVICE CLASSIFICATION",null,null,null,"Standard Supply Service Charge",null,0.25,1,0.25,0.25,1,0.25,0,0]
["UNMETERED SCATTERED LOAD SERVICE CLASSIFICATION"]
["UNMETERED SCATTERED LOAD SERVICE CLASSIFICATION",null,null,null,null,null,null,null,null,null,null,null,{"$f":"L355-I355","v":0},{"$f":"IF(ISERROR(M355/I355), \"\", M355/I355)","v":""}]
["UNMETERED SCATTERED LOAD SERVICE CLASSIFICATION","RPP",null,null,"TOU - Off Peak",null,{"$f":"G$91","v":6.5000000000000002E-2},{"$f":"IF(AND(F329*12>=150000),0.65*F329*F331,0.65*F329)","v":195},{"$f":"H356*G356","v":12.675000000000001},6.5000000000000002E-2,{"$f":"IF(AND(F329*12>=150000),0.65*F329*F332,0.65*F329)","v":195},{"$f":"K356*J356","v":12.675000000000001},{"$f":"L356-I356","v":0},{"$f":"IF(ISERROR(M356/I356), \"\", M356/I356)","v":0}]
["UNMETERED SCATTERED LOAD SERVICE CLASSIFICATION","RPP",null,null,"TOU - Mid Peak",null,{"$f":"G$92","v":9.4E-2},{"$f":"IF(AND(F329*12>=150000),0.17*F329*F331,0.17*F329)","v":51.000000000000007},4.7940000000000005,{"$f":"J304","v":9.4E-2},{"$f":"IF(AND(F329*12>=150000),0.17*F329*F332,0.17*F329)","v":51.000000000000007},4.7940000000000005,0,0]
["UNMETERED SCATTERED LOAD SERVICE CLASSIFICATION","RPP",null,null,"TOU - On Peak",null,{"$f":"G$93","v":0.13400000000000001},{"$f":"IF(AND(F329*12>=150000),0.18*F329*F331,0.18*F329)","v":54},7.2360000000000007,0.13400000000000001,{"$f":"IF(AND(F329*12>=150000),0.18*F329*F332,0.18*F329)","v":54},7.2360000000000007,0,0]
["UNMETERED SCATTERED LOAD SERVICE CLASSIFICATION","Non-RPP (Retailer)",null,null,"Non-RPP Retailer Avg. Price",null,{"$f":"G$94","v":0.11210000000000001},{"$f":"IF(AND(F329*12>=150000),F329*F331,F329)","v":300},{"$f":"H359*G359","v":33.630000000000003},{"$f":"G359","v":0.11210000000000001},{"$f":"IF(AND(F329*12>=150000),F329*F332,F329)","v":300},{"$f":"K359*J359","v":33.630000000000003},0,0]
["UNMETERED SCATTERED LOAD SERVICE CLASSIFICATION","Non-RPP (Other)",null,null,"Average IESO Wholesale Market Price",null,{"$f":"G$95","v":0.11210000000000001},{"$f":"IF(AND(F329*12>=150000),F329*F331,F329)","v":300},{"$f":"H360*G360","v":33.630000000000003},{"$f":"G360","v":0.11210000000000001},{"$f":"IF(AND(F329*12>=150000),F329*F332,F329)","v":300},{"$f":"K360*J360","v":33.630000000000003},0,0]
["UNMETERED SCATTERED LOAD SERVICE CLASSIFICATION"]
["UNMETERED SCATTERED LOAD SERVICE CLASSIFICATION","RPP_BT",7,null,"Total Bill on TOU (before Taxes)",null,null,null,{"$f":"SUM(I351:I358,I350)","v":45.8065},null,null,{"$f":"SUM(L351:L358,L350)","v":46.506500000000003},{"$f":"L362-I362","v":0.70000000000000284},{"$f":"IF((I362)=0,\"\",(M362/I362))","v":1.5281673998231753E-2}]
["UNMETERED SCATTERED LOAD SERVICE CLASSIFICATION","RPP",null,null,"HST",null,0.13,null,{"$f":"I362*G363","v":5.9548450000000006},0.13,null,{"$f":"L362*J363","v":6.0458450000000008},{"$f":"L363-I363","v":9.1000000000000192E-2},{"$f":"IF((I363)=0,\"\",(M363/I363))","v":1.5281673998231722E-2}]
["UNMETERED SCATTERED LOAD SERVICE CLASSIFICATION","RPP_NET",7,null,"Total Bill on TOU (before 8% Provincial Rebate)",null,null,null,{"$f":"SUM(I362:I363)","v":51.761344999999999},null,null,{"$f":"SUM(L362:L363)","v":52.552345000000003},{"$f":"SUM(M362:M363)","v":0.79100000000000303},{"$f":"IF((I364)=0,\"\",(M364/I364))","v":1.5281673998231752E-2}]
[{"$f":"A363","v":"UNMETERED SCATTERED LOAD SERVICE CLASSIFICATION"},"RPP",null,null,"8% Provincial Rebate",null,0,null,{"$f":"I362*G365","v":0},{"$f":"G365","v":0},null,{"$f":"L362*J365","v":0},{"$f":"L365-I365","v":0},{"$f":"IF((I365)=0,\"\",(M365/I365))","v":""}]
["UNMETERED SCATTERED LOAD SERVICE CLASSIFICATION","RPP_TOTAL",{"$f":"C341","v":7},null,"Total Bill on TOU",null,null,null,{"$f":"SUM(I362,I363,I365)","v":51.761344999999999},null,null,{"$f":"L362+L363+L365","v":52.552345000000003},{"$f":"L366-I366","v":0.79100000000000392},{"$f":"IF((I366)=0,\"\",(M366/I366))","v":1.5281673998231769E-2}]
["UNMETERED SCATTERED LOAD SERVICE CLASSIFICATION","RPP"]
["UNMETERED SCATTERED LOAD SERVICE CLASSIFICATION","Non-RPP (Retailer)",null,null,"Total Bill on Non-RPP Avg. Price",null,null,null,{"$f":"SUM(I359,I351:I355,I350)","v":54.731499999999997},null,null,{"$f":"SUM(L359,L351:L355,L350)","v":55.4315},{"$f":"L368-I368","v":0.70000000000000284},{"$f":"IF((I368)=0,\"\",(M368/I368))","v":1.2789709764943457E-2}]
["UNMETERED SCATTERED LOAD SERVICE CLASSIFICATION","Non-RPP (Retailer)",null,null,"HST",null,0.13,null,{"$f":"I368*G369","v":7.1150950000000002},0.13,null,{"$f":"L368*J369","v":7.2060950000000004},{"$f":"L369-I369","v":9.1000000000000192E-2},{"$f":"IF((I369)=0,\"\",(M369/I369))","v":1.2789709764943433E-2}]
["UNMETERED SCATTERED LOAD SERVICE CLASSIFICATION","Non-RPP (Retailer)",null,null,"Provincial Rebate",null,-0.08,null,{"$f":"I368*G370","v":-4.37852},{"$f":"G370","v":-0.08},null,{"$f":"L368*J370","v":-4.43452},{"$f":"L370-I370","v":-5.600000000000005E-2},{"$f":"IF((I370)=0,\"\",(M370/I370))","v":1.2789709764943417E-2}]
["UNMETERED SCATTERED LOAD SERVICE CLASSIFICATION","Non-RPP (Retailer)_TOTAL",null,null,"Total Bill on Non-RPP Avg. Price",null,null,null,{"$f":"SUM(I368,I369,I370)","v":57.468074999999992},null,null,{"$f":"SUM(L368,L369,L370)","v":58.203074999999998},{"$f":"L371-I371","v":0.73500000000000654},{"$f":"IF((I371)=0,\"\",(M371/I371))","v":1.2789709764943522E-2}]
["UNMETERED SCATTERED LOAD SERVICE CLASSIFICATION","Non-RPP (Retailer)"]
["UNMETERED SCATTERED LOAD SERVICE CLASSIFICATION","Non-RPP (Other)",null,null,"Total Bill on Average IESO Wholesale Market Price",null,null,null,{"$f":"SUM(I360,I351:I355,I350)","v":54.731499999999997},null,null,{"$f":"SUM(L360,L351:L355,L350)","v":55.4315},{"$f":"L373-I373","v":0.70000000000000284},{"$f":"IF((I373)=0,\"\",(M373/I373))","v":1.2789709764943457E-2}]
["UNMETERED SCATTERED LOAD SERVICE CLASSIFICATION","Non-RPP (Other)",null,null,"HST",null,0.13,null,{"$f":"I373*G374","v":7.1150950000000002},0.13,null,{"$f":"L373*J374","v":7.2060950000000004},{"$f":"L374-I374","v":9.1000000000000192E-2},{"$f":"IF((I374)=0,\"\",(M374/I374))","v":1.2789709764943433E-2}]
["UNMETERED SCATTERED LOAD SERVICE CLASSIFICATION","Non-RPP (Other)",null,null,"Provincial Rebate",null,-0.08,null,null,{"$f":"G375","v":-0.08},null,null,{"$f":"L375-I375","v":0},{"$f":"IF((I375)=0,\"\",(M375/I375))","v":""}]
["UNMETERED SCATTERED LOAD SERVICE CLASSIFICATION","Non-RPP (Other)_TOTAL",null,null,"Total Bill on Average IESO Wholesale Market Price",null,null,null,{"$f":"SUM(I373,I374,I375)","v":61.846594999999994},null,null,{"$f":"SUM(L373,L374,L375)","v":62.637594999999997},{"$f":"L376-I376","v":0.79100000000000392},{"$f":"IF((I376)=0,\"\",(M376/I376))","v":1.2789709764943469E-2}]
["UNMETERED SCATTERED LOAD SERVICE CLASSIFICATION","Non-RPP (Other)"]
[]
[]
[null,null,null,null,"Customer Class:",{"$f":"E22","v":"STREET LIGHTING SERVICE CLASSIFICATION"},null,null,null,null,null,{"$f":"IF(O331=\"DEMAND - INTERVAL\",\"RTSR - INTERVAL METERED\",\"\")","v":""}]
[null,null,null,null,"RPP / Non-RPP:",{"$f":"H22","v":"Non-RPP (Other)"}]
[null,null,null,null,"Consumption",{"$f":"K22","v":33},"kWh"]
[null,null,null,null,"Demand",{"$f":"L22","v":0.1},"kW"]
[null,null,null,null,"Current Loss Factor",{"$f":"I22","v":1.036}]
[null,null,null,null,"Proposed/Approved Loss Factor",{"$f":"J22","v":1.036}]
[]
[null,null,null,null,null,null,"Current OEB-Approved",null,null,"Proposed",null,null,"Impact"]
[null,null,null,null,null,null,"Rate","Volume","Charge","Rate","Volume","Charge","$ Change","% Change"]
[null,null,null,null,null,null,"($)",null,"($)","($)",null,"($)"]
[{"$f":"F380","v":"STREET LIGHTING SERVICE CLASSIFICATION"},null,null,"SL_F","Monthly Service Charge",null,{"$f":"IFERROR(SUMIF(RATES!B:B,'21. Bill Impacts'!D390,RATES!H:H),\"\")","v":1.54},1,{"$f":"H390*G390","v":1.54},{"$f":"IFERROR(SUMIF(RATES!B:B,'21. Bill Impacts'!D390,RATES!I:I),\"\")","v":1.56},1,{"$f":"K390*J390","v":1.56},{"$f":"L390-I390","v":2.0000000000000018E-2},{"$f":"IF(ISERROR(M390/I390), \"\", M390/I390)","v":1.2987012987012998E-2}]
[{"$f":"A390","v":"STREET LIGHTING SERVICE CLASSIFICATION"},null,null,"SL_V","Distribution Volumetric Rate",null,{"$f":"IFERROR(SUMIF(RATES!B:B,'21. Bill Impacts'!D391,RATES!H:H),\"\")","v":11.7902},{"$f":"IF($F383>0, $F383, $F382)","v":0.1},{"$f":"H391*G391","v":1.1790200000000002},{"$f":"IFERROR(SUMIF(RATES!B:B,'21. Bill Impacts'!D391,RATES!I:I),\"\")","v":11.931699999999999},{"$f":"IF($F383>0, $F383, $F382)","v":0.1},{"$f":"K391*J391","v":1.1931700000000001},1.4149999999999885E-2,{"$f":"IF(ISERROR(M391/I391), \"\", M391/I391)","v":1.200149276517776E-2}]
[{"$f":"A391","v":"STREET LIGHTING SERVICE CLASSIFICATION"},null,null,"SL_FRR","Fixed Rate Riders",null,{"$f":"IFERROR(SUMIF(RATES!B:B,'21. Bill Impacts'!D392,RATES!H:H),\"\")","v":6.0000000000000005E-2},1,6.0000000000000005E-2,{"$f":"IFERROR(SUMIF(RATES!B:B,'21. Bill Impacts'!D392,RATES!I:I),\"\")","v":0.08},1,{"$f":"K392*J392","v":0.08},1.9999999999999997E-2,0.33333333333333326]
[{"$f":"A392","v":"STREET LIGHTING SERVICE CLASSIFICATION"},null,null,"SL_VRR","Volumetric Rate Riders",null,{"$f":"IFERROR(SUMIF(RATES!B:B,'21. Bill Impacts'!D393,RATES!H:H),\"\")","v":-3.7892999999999999},{"$f":"IF($F383>0, $F383, $F382)","v":0.1},-0.37892999999999999,{"$f":"IFERROR(SUMIF(RATES!B:B,'21. Bill Impacts'!D393,RATES!I:I),\"\")","v":-2.7176999999999998},{"$f":"IF($F383>0, $F383, $F382)","v":0.1},-0.27177000000000001,0.10715999999999998,-0.28279629483017965]
["STREET LIGHTING SERVICE CLASSIFICATION","ST_A",{"$f":"B22","v":8},null,"Sub-Total A (excluding pass through)",null,null,null,{"$f":"SUM(I390:I393)","v":2.4000900000000005},null,null,{"$f":"SUM(L390:L393)","v":2.5613999999999999},0.1613099999999994,{"$f":"IF((I394)=0,\"\",(M394/I394))","v":6.7209979625763763E-2}]
["STREET LIGHTING SERVICE CLASSIFICATION",null,null,null,"Line Losses on Cost of Power",null,{"$f":"IF((F382*12>=150000), 0, IF(F381=\"RPP\",(G409*0.65+G410*0.17+G411*0.18),IF(F381=\"Non-RPP (Retailer)\",G412,G413)))","v":0.11210000000000001},{"$f":"IF(G395=0, 0, $F382*F384-F382)","v":1.1880000000000024},{"$f":"H395*G395","v":0.13317480000000029},{"$f":"IF((F382*12>=150000), 0, IF(F381=\"RPP\",(J409*0.65+J410*0.17+J411*0.18),IF(F381=\"Non-RPP (Retailer)\",J412,J413)))","v":0.11210000000000001},{"$f":"IF(G395=0, 0, $F382*F384-F382)","v":1.1880000000000024},{"$f":"K395*J395","v":0.13317480000000029},{"$f":"L395-I395","v":0},{"$f":"IF(ISERROR(M395/I395), \"\", M395/I395)","v":0}]
["STREET LIGHTING SERVICE CLASSIFICATION",null,null,"SL_DVA","Total Deferral/Variance Account Rate Riders",null,{"$f":"IFERROR(SUMIF(RATES!B:B,'21. Bill Impacts'!D396,RATES!H:H),\"\")","v":-0.14599999999999999},{"$f":"IF($F383>0, $F383, $F382)","v":0.1},{"$f":"H396*G396","v":-1.46E-2},{"$f":"IFERROR(SUMIF(RATES!B:B,'21. Bill Impacts'!D396,RATES!I:I),\"\")","v":7.0000000000000007E-2},{"$f":"IF($F383>0, $F383, $F382)","v":0.1},{"$f":"K396*J396","v":7.000000000000001E-3},{"$f":"L396-I396","v":2.1600000000000001E-2},{"$f":"IF(ISERROR(M396/I396), \"\", M396/I396)","v":-1.4794520547945207}]
["STREET LIGHTING SERVICE CLASSIFICATION",null,null,"SL_GA","GA Rate Riders",null,{"$f":"IFERROR(SUMIF(RATES!B:B,'21. Bill Impacts'!D397,RATES!H:H),\"\")","v":1.9E-3},{"$f":"+F382","v":33},6.2700000000000006E-2,{"$f":"IFERROR(SUMIF(RATES!B:B,'21. Bill Impacts'!D397,RATES!I:I),\"\")","v":-3.2000000000000002E-3},{"$f":"+H397","v":33},-0.1056,-0.16830000000000001,-2.6842105263157894]
["STREET LIGHTING SERVICE CLASSIFICATION",null,null,"SL_LV","Low Voltage Service Charge",null,{"$f":"IFERROR(SUMIF(RATES!B:B,'21. Bill Impacts'!D398,RATES!H:H),\"\")","v":5.8000000000000003E-2},{"$f":"IF($F383>0, $F383, $F382)","v":0.1},5.8000000000000005E-3,{"$f":"IFERROR(SUMIF(RATES!B:B,'21. Bill Impacts'!D398,RATES!I:I),\"\")","v":5.8000000000000003E-2},{"$f":"IF($F383>0, $F383, $F382)","v":0.1},5.8000000000000005E-3,0,0]
["STREET LIGHTING SERVICE CLASSIFICATION",null,null,null,"Smart Meter Entity Charge (if applicable) and/or \nany fixed ($) Deferral/Variance Account Rate Riders",null,0,1,{"$f":"H399*G399","v":0},0,1,{"$f":"K399*J399","v":0},0,{"$f":"IF(ISERROR(M399/I399), \"\", M399/I399)","v":""}]
["STREET LIGHTING SERVICE CLASSIFICATION","ST_B",{"$f":"C394","v":8},null,"Sub-Total B - Distribution (includes Sub-Total A)",null,null,null,{"$f":"SUM(I394:I399)","v":2.5871648000000005},null,null,{"$f":"SUM(L394:L399)","v":2.6017748000000003},1.460999999999979E-2,{"$f":"IF((I400)=0,\"\",(M400/I400))","v":5.6471083712950126E-3}]
["STREET LIGHTING SERVICE CLASSIFICATION",null,null,"SL_TN","RTSR - Network",null,{"$f":"IFERROR(SUMIF(RATES!B:B,'21. Bill Impacts'!D401,RATES!H:H),\"\")","v":1.8898999999999999},{"$f":"+H391","v":0.1},{"$f":"H401*G401","v":0.18898999999999999},{"$f":"IFERROR(SUMIF(RATES!B:B,'21. Bill Impacts'!D401,RATES!I:I),\"\")","v":1.9814000000000001},{"$f":"+K391","v":0.1},{"$f":"K401*J401","v":0.19814000000000001},9.1500000000000192E-3,{"$f":"IF(ISERROR(M401/I401), \"\", M401/I401)","v":4.8415260066670296E-2}]
["STREET LIGHTING SERVICE CLASSIFICATION",null,null,"SL_TC","RTSR - Connection and/or Line and Transformation Connection",null,{"$f":"IFERROR(SUMIF(RATES!B:B,'21. Bill Impacts'!D402,RATES!H:H),\"\")","v":1.875},{"$f":"+H401","v":0.1},{"$f":"H402*G402","v":0.1875},{"$f":"IFERROR(SUMIF(RATES!B:B,'21. Bill Impacts'!D402,RATES!I:I),\"\")","v":1.9777},{"$f":"+K401","v":0.1},{"$f":"K402*J402","v":0.19777},1.0270000000000001E-2,{"$f":"IF(ISERROR(M402/I402), \"\", M402/I402)","v":5.4773333333333341E-2}]
["STREET LIGHTING SERVICE CLASSIFICATION","ST_C",{"$f":"C394","v":8},null,"Sub-Total C - Delivery (including Sub-Total B)",null,null,null,{"$f":"SUM(I400:I402)","v":2.9636548000000005},null,null,{"$f":"SUM(L400:L402)","v":2.9976848},3.4029999999999561E-2,{"$f":"IF((I403)=0,\"\",(M403/I403))","v":1.1482443906759841E-2}]
["STREET LIGHTING SERVICE CLASSIFICATION",null,null,null,"Wholesale Market Service Charge (WMSC)",null,{"$f":"G$86","v":3.4000000000000002E-3},{"$f":"F382*F384","v":34.188000000000002},{"$f":"H404*G404","v":0.11623920000000001},{"$f":"J$86","v":3.4000000000000002E-3},{"$f":"F382*F384","v":34.188000000000002},{"$f":"K404*J404","v":0.11623920000000001},0,{"$f":"IF(ISERROR(M404/I404), \"\", M404/I404)","v":0}]
["STREET LIGHTING SERVICE CLASSIFICATION",null,null,null,"Rural and Remote Rate Protection (RRRP)",null,{"$f":"G$87","v":5.0000000000000001E-4},{"$f":"F382*F384","v":34.188000000000002},1.7094000000000002E-2,{"$f":"J$87","v":5.0000000000000001E-4},{"$f":"F382*F384","v":34.188000000000002},1.7094000000000002E-2,0,0]
["STREET LIGHTING SERVICE CLASSIFICATION",null,null,null,"Standard Supply Service Charge",null,0.25,1,0.25,0.25,1,0.25,0,0]
["STREET LIGHTING SERVICE CLASSIFICATION"]
["STREET LIGHTING SERVICE CLASSIFICATION",null,null,null,null,null,null,null,null,null,null,null,{"$f":"L408-I408","v":0},{"$f":"IF(ISERROR(M408/I408), \"\", M408/I408)","v":""}]
["STREET LIGHTING SERVICE CLASSIFICATION","RPP",null,null,"TOU - Off Peak",null,{"$f":"G$91","v":6.5000000000000002E-2},{"$f":"IF(AND(F382*12>=150000),0.65*F382*F384,0.65*F382)","v":21.45},{"$f":"H409*G409","v":1.39425},6.5000000000000002E-2,{"$f":"IF(AND(F382*12>=150000),0.65*F382*F385,0.65*F382)","v":21.45},{"$f":"K409*J409","v":1.39425},{"$f":"L409-I409","v":0},{"$f":"IF(ISERROR(M409/I409), \"\", M409/I409)","v":0}]
["STREET LIGHTING SERVICE CLASSIFICATION","RPP",null,null,"TOU - Mid Peak",null,{"$f":"G$92","v":9.4E-2},{"$f":"IF(AND(F382*12>=150000),0.17*F382*F384,0.17*F382)","v":5.61},0.52734000000000003,{"$f":"J357","v":9.4E-2},{"$f":"IF(AND(F382*12>=150000),0.17*F382*F385,0.17*F382)","v":5.61},0.52734000000000003,0,0]
["STREET LIGHTING SERVICE CLASSIFICATION","RPP",null,null,"TOU - On Peak",null,{"$f":"G$93","v":0.13400000000000001},{"$f":"IF(AND(F382*12>=150000),0.18*F382*F384,0.18*F382)","v":5.9399999999999995},0.79596,0.13400000000000001,{"$f":"IF(AND(F382*12>=150000),0.18*F382*F385,0.18*F382)","v":5.9399999999999995},0.79596,0,0]
["STREET LIGHTING SERVICE CLASSIFICATION","Non-RPP (Retailer)",null,null,"Non-RPP Retailer Avg. Price",null,{"$f":"G$94","v":0.11210000000000001},{"$f":"IF(AND(F382*12>=150000),F382*F384,F382)","v":33},{"$f":"H412*G412","v":3.6993},{"$f":"G412","v":0.11210000000000001},{"$f":"IF(AND(F382*12>=150000),F382*F385,F382)","v":33},{"$f":"K412*J412","v":3.6993},0,0]
["STREET LIGHTING SERVICE CLASSIFICATION","Non-RPP (Other)",null,null,"Average IESO Wholesale Market Price",null,{"$f":"G$95","v":0.11210000000000001},{"$f":"IF(AND(F382*12>=150000),F382*F384,F382)","v":33},{"$f":"H413*G413","v":3.6993},{"$f":"G413","v":0.11210000000000001},{"$f":"IF(AND(F382*12>=150000),F382*F385,F382)","v":33},{"$f":"K413*J413","v":3.6993},0,0]
["STREET LIGHTING SERVICE CLASSIFICATION"]
["STREET LIGHTING SERVICE CLASSIFICATION","RPP",null,null,"Total Bill on TOU (before Taxes)",null,null,null,{"$f":"SUM(I404:I411,I403)","v":6.0645380000000007},null,null,{"$f":"SUM(L404:L411,L403)","v":6.0985680000000002},{"$f":"L415-I415","v":3.4029999999999561E-2},{"$f":"IF((I415)=0,\"\",(M415/I415))","v":5.6113095507027179E-3}]
["STREET LIGHTING SERVICE CLASSIFICATION","RPP",null,null,"HST",null,0.13,null,{"$f":"I415*G416","v":0.78838994000000007},0.13,null,{"$f":"L415*J416","v":0.7928138400000001},{"$f":"L416-I416","v":4.4239000000000361E-3},{"$f":"IF((I416)=0,\"\",(M416/I416))","v":5.6113095507028359E-3}]
["STREET LIGHTING SERVICE CLASSIFICATION","RPP",null,null,"Provincial Rebate",null,-0.08,null,{"$f":"I415*G417","v":-0.48516304000000005},{"$f":"G417","v":-0.08},null,{"$f":"L415*J417","v":-0.48788544},{"$f":"L417-I417","v":-2.7223999999999582E-3},{"$f":"IF((I417)=0,\"\",(M417/I417))","v":5.611309550702704E-3}]
["STREET LIGHTING SERVICE CLASSIFICATION","RPP_TOTAL",null,null,"Total Bill on TOU",null,null,null,{"$f":"SUM(I415,I416,I417)","v":6.3677649000000009},null,null,{"$f":"L415+L416+L417","v":6.4034963999999999},{"$f":"L418-I418","v":3.5731499999998917E-2},{"$f":"IF((I418)=0,\"\",(M418/I418))","v":5.6113095507026199E-3}]
["STREET LIGHTING SERVICE CLASSIFICATION","RPP"]
["STREET LIGHTING SERVICE CLASSIFICATION","Non-RPP (Retailer)",null,null,"Total Bill on Non-RPP Avg. Price",null,null,null,{"$f":"SUM(I412,I404:I408,I403)","v":7.0462880000000006},null,null,{"$f":"SUM(L412,L404:L408,L403)","v":7.0803180000000001},{"$f":"L420-I420","v":3.4029999999999561E-2},{"$f":"IF((I420)=0,\"\",(M420/I420))","v":4.8294932026621048E-3}]
["STREET LIGHTING SERVICE CLASSIFICATION","Non-RPP (Retailer)",null,null,"HST",null,0.13,null,{"$f":"I420*G421","v":0.91601744000000007},0.13,null,{"$f":"L420*J421","v":0.92044134},{"$f":"L421-I421","v":4.4238999999999251E-3},{"$f":"IF((I421)=0,\"\",(M421/I421))","v":4.8294932026620857E-3}]
["STREET LIGHTING SERVICE CLASSIFICATION","Non-RPP (Retailer)",null,null,"Provincial Rebate",null,-0.08,null,{"$f":"I420*G422","v":-0.56370304000000004},{"$f":"G422","v":-0.08},null,{"$f":"L420*J422","v":-0.56642544000000006},{"$f":"L422-I422","v":-2.7224000000000137E-3},{"$f":"IF((I422)=0,\"\",(M422/I422))","v":4.8294932026621915E-3}]
["STREET LIGHTING SERVICE CLASSIFICATION","Non-RPP (Retailer)_TOTAL",null,null,"Total Bill on Non-RPP Avg. Price",null,null,null,{"$f":"SUM(I420,I421,I422)","v":7.3986024000000006},null,null,{"$f":"SUM(L420,L421,L422)","v":7.4343339000000004},{"$f":"L423-I423","v":3.5731499999999805E-2},{"$f":"IF((I423)=0,\"\",(M423/I423))","v":4.8294932026621412E-3}]
["STREET LIGHTING SERVICE CLASSIFICATION","Non-RPP (Retailer)"]
["STREET LIGHTING SERVICE CLASSIFICATION","Non-RPP (Other)_BT",8,null,"Total Bill on Average IESO Wholesale Market Price",null,null,null,{"$f":"SUM(I413,I404:I408,I403)","v":7.0462880000000006},null,null,{"$f":"SUM(L413,L404:L408,L403)","v":7.0803180000000001},{"$f":"L425-I425","v":3.4029999999999561E-2},{"$f":"IF((I425)=0,\"\",(M425/I425))","v":4.8294932026621048E-3}]
["STREET LIGHTING SERVICE CLASSIFICATION","Non-RPP (Other)",null,null,"HST",null,0.13,null,{"$f":"I425*G426","v":0.91601744000000007},0.13,null,{"$f":"L425*J426","v":0.92044134},{"$f":"L426-I426","v":4.4238999999999251E-3},{"$f":"IF((I426)=0,\"\",(M426/I426))","v":4.8294932026620857E-3}]
["STREET LIGHTING SERVICE CLASSIFICATION","Non-RPP (Other)_NET",8,null,"Total Bill on Average IESO WMP (before 8% Provincial Rebate)",null,null,null,{"$f":"SUM(I425:I426)","v":7.9623054400000006},null,null,{"$f":"SUM(L425:L426)","v":8.0007593400000001},{"$f":"SUM(M425:M426)","v":3.8453899999999486E-2},{"$f":"IF((I427)=0,\"\",(M427/I427))","v":4.8294932026621031E-3}]
[{"$f":"A426","v":"STREET LIGHTING SERVICE CLASSIFICATION"},"Non-RPP (Other)",null,null,"8% Provincial Rebate",null,0,null,{"$f":"I425*G428","v":0},{"$f":"G428","v":0},null,{"$f":"L425*J428","v":0},{"$f":"L428-I428","v":0},{"$f":"IF((I428)=0,\"\",(M428/I428))","v":""}]
["STREET LIGHTING SERVICE CLASSIFICATION","Non-RPP (Other)_TOTAL",8,null,"Total Bill on Average IESO Wholesale Market Price",null,null,null,{"$f":"SUM(I425,I426,I428)","v":7.9623054400000006},null,null,{"$f":"SUM(L425,L426,L428)","v":8.0007593400000001},{"$f":"L429-I429","v":3.8453899999999486E-2},{"$f":"IF((I429)=0,\"\",(M429/I429))","v":4.8294932026621031E-3}]
["STREET LIGHTING SERVICE CLASSIFICATION","Non-RPP (Other)"]
[]
[]
[null,null,null,null,"Customer Class:",{"$f":"E23","v":"RESIDENTIAL SERVICE CLASSIFICATION"},null,null,null,null,null,{"$f":"IF(O384=\"DEMAND - INTERVAL\",\"RTSR - INTERVAL METERED\",\"\")","v":""}]
[null,null,null,null,"RPP / Non-RPP:",{"$f":"H23","v":"Non-RPP (Other)"},null,null,"10th Percentile"]
[null,null,null,null,"Consumption",{"$f":"K23","v":750},"kWh"]
[null,null,null,null,"Demand",{"$f":"L23","v":0},"kW"]
[null,null,null,null,"Current Loss Factor",{"$f":"I23","v":1.036}]
[null,null,null,null,"Proposed/Approved Loss Factor",{"$f":"J23","v":1.036}]
[]
[null,null,null,null,null,null,"Current OEB-Approved",null,null,"Proposed",null,null,"Impact"]
[null,null,null,null,null,null,"Rate","Volume","Charge","Rate","Volume","Charge","$ Change","% Change"]
[null,null,null,null,null,null,"($)",null,"($)","($)",null,"($)"]
[{"$f":"F433","v":"RESIDENTIAL SERVICE CLASSIFICATION"},null,null,"R_F","Monthly Service Charge",null,{"$f":"IFERROR(SUMIF(RATES!B:B,'21. Bill Impacts'!D443,RATES!H:H),\"\")","v":24.25},1,{"$f":"H443*G443","v":24.25},{"$f":"IFERROR(SUMIF(RATES!B:B,'21. Bill Impacts'!D443,RATES!I:I),\"\")","v":24.54},1,{"$f":"K443*J443","v":24.54},{"$f":"L443-I443","v":0.28999999999999915},{"$f":"IF(ISERROR(M443/I443), \"\", M443/I443)","v":1.1958762886597902E-2}]
[{"$f":"A443","v":"RESIDENTIAL SERVICE CLASSIFICATION"},null,null,"R_V","Distribution Volumetric Rate",null,{"$f":"IFERROR(SUMIF(RATES!B:B,'21. Bill Impacts'!D444,RATES!H:H),\"\")","v":0},{"$f":"IF($F436>0, $F436, $F435)","v":750},{"$f":"H444*G444","v":0},{"$f":"IFERROR(SUMIF(RATES!B:B,'21. Bill Impacts'!D444,RATES!I:I),\"\")","v":0},{"$f":"IF($F436>0, $F436, $F435)","v":750},{"$f":"K444*J444","v":0},0,{"$f":"IF(ISERROR(M444/I444), \"\", M444/I444)","v":""}]
[{"$f":"A444","v":"RESIDENTIAL SERVICE CLASSIFICATION"},null,null,"R_FRR","Fixed Rate Riders",null,{"$f":"IFERROR(SUMIF(RATES!B:B,'21. Bill Impacts'!D445,RATES!H:H),\"\")","v":0.91},1,0.91,{"$f":"IFERROR(SUMIF(RATES!B:B,'21. Bill Impacts'!D445,RATES!I:I),\"\")","v":1.1200000000000001},1,{"$f":"K445*J445","v":1.1200000000000001},0.21000000000000008,0.23076923076923084]
[{"$f":"A445","v":"RESIDENTIAL SERVICE CLASSIFICATION"},null,null,"R_VRR","Volumetric Rate Riders",null,{"$f":"IFERROR(SUMIF(RATES!B:B,'21. Bill Impacts'!D446,RATES!H:H),\"\")","v":2.0000000000000001E-4},{"$f":"IF($F436>0, $F436, $F435)","v":750},0.15,{"$f":"IFERROR(SUMIF(RATES!B:B,'21. Bill Impacts'!D446,RATES!I:I),\"\")","v":2.9999999999999997E-4},{"$f":"IF($F436>0, $F436, $F435)","v":750},0.22499999999999998,7.4999999999999983E-2,0.49999999999999989]
["RESIDENTIAL SERVICE CLASSIFICATION","ST_A",{"$f":"B23","v":9},null,"Sub-Total A (excluding pass through)",null,null,null,{"$f":"SUM(I443:I446)","v":25.31},null,null,{"$f":"SUM(L443:L446)","v":25.885000000000002},0.57500000000000284,{"$f":"IF((I447)=0,\"\",(M447/I447))","v":2.2718293164757125E-2}]
["RESIDENTIAL SERVICE CLASSIFICATION",null,null,null,"Line Losses on Cost of Power",null,{"$f":"IF((F435*12>=150000), 0, IF(F434=\"RPP\",(G462*0.65+G463*0.17+G464*0.18),IF(F434=\"Non-RPP (Retailer)\",G465,G466)))","v":0.11210000000000001},{"$f":"IF(G448=0, 0, $F435*F437-F435)","v":27},{"$f":"H448*G448","v":3.0266999999999999},{"$f":"IF((F435*12>=150000), 0, IF(F434=\"RPP\",(J462*0.65+J463*0.17+J464*0.18),IF(F434=\"Non-RPP (Retailer)\",J465,J466)))","v":0.11210000000000001},{"$f":"IF(G448=0, 0, $F435*F437-F435)","v":27},{"$f":"K448*J448","v":3.0266999999999999},{"$f":"L448-I448","v":0},{"$f":"IF(ISERROR(M448/I448), \"\", M448/I448)","v":0}]
["RESIDENTIAL SERVICE CLASSIFICATION",null,null,"R_DVA","Total Deferral/Variance Account Rate Riders",null,{"$f":"IFERROR(SUMIF(RATES!B:B,'21. Bill Impacts'!D449,RATES!H:H),\"\")","v":-4.0000000000000002E-4},{"$f":"IF($F436>0, $F436, $F435)","v":750},{"$f":"H449*G449","v":-0.3},{"$f":"IFERROR(SUMIF(RATES!B:B,'21. Bill Impacts'!D449,RATES!I:I),\"\")","v":1E-4},{"$f":"IF($F436>0, $F436, $F435)","v":750},{"$f":"K449*J449","v":7.4999999999999997E-2},{"$f":"L449-I449","v":0.375},{"$f":"IF(ISERROR(M449/I449), \"\", M449/I449)","v":-1.25}]
["RESIDENTIAL SERVICE CLASSIFICATION",null,null,"R_GA","GA Rate Riders",null,0,{"$f":"IF($F436>0, $F436, $F435)","v":750},0,0,{"$f":"IF($F436>0, $F436, $F435)","v":750},0,0,""]
["RESIDENTIAL SERVICE CLASSIFICATION",null,null,"R_LV","Low Voltage Service Charge",null,{"$f":"IFERROR(SUMIF(RATES!B:B,'21. Bill Impacts'!D451,RATES!H:H),\"\")","v":2.0000000000000001E-4},{"$f":"IF($F436>0, $F436, $F435)","v":750},0.15,{"$f":"IFERROR(SUMIF(RATES!B:B,'21. Bill Impacts'!D451,RATES!I:I),\"\")","v":2.0000000000000001E-4},{"$f":"IF($F436>0, $F436, $F435)","v":750},0.15,0,0]
["RESIDENTIAL SERVICE CLASSIFICATION",null,null,"R_SME","Smart Meter Entity Charge (if applicable) and/or \nany fixed ($) Deferral/Variance Account Rate Riders",null,{"$f":"IFERROR(SUMIF(RATES!B:B,'21. Bill Impacts'!D452,RATES!H:H),\"\")","v":0.56999999999999995},1,{"$f":"H452*G452","v":0.56999999999999995},{"$f":"IFERROR(SUMIF(RATES!B:B,'21. Bill Impacts'!D452,RATES!I:I),\"\")","v":0.56999999999999995},1,{"$f":"K452*J452","v":0.56999999999999995},0,{"$f":"IF(ISERROR(M452/I452), \"\", M452/I452)","v":0}]
["RESIDENTIAL SERVICE CLASSIFICATION","ST_B",{"$f":"C447","v":9},null,"Sub-Total B - Distribution (includes Sub-Total A)",null,null,null,{"$f":"SUM(I447:I452)","v":28.756699999999999},null,null,{"$f":"SUM(L447:L452)","v":29.706700000000001},0.95000000000000284,{"$f":"IF((I453)=0,\"\",(M453/I453))","v":3.3035779487910741E-2}]
["RESIDENTIAL SERVICE CLASSIFICATION",null,null,"R_TN","RTSR - Network",null,{"$f":"IFERROR(SUMIF(RATES!B:B,'21. Bill Impacts'!D454,RATES!H:H),\"\")","v":7.6E-3},{"$f":"$F$435","v":750},{"$f":"H454*G454","v":5.7},{"$f":"IFERROR(SUMIF(RATES!B:B,'21. Bill Impacts'!D454,RATES!I:I),\"\")","v":8.0000000000000002E-3},{"$f":"H454","v":750},{"$f":"K454*J454","v":6},0.29999999999999982,{"$f":"IF(ISERROR(M454/I454), \"\", M454/I454)","v":5.263157894736839E-2}]
["RESIDENTIAL SERVICE CLASSIFICATION",null,null,"R_TC","RTSR - Connection and/or Line and Transformation Connection",null,{"$f":"IFERROR(SUMIF(RATES!B:B,'21. Bill Impacts'!D455,RATES!H:H),\"\")","v":7.3000000000000001E-3},{"$f":"+H454","v":750},{"$f":"H455*G455","v":5.4749999999999996},{"$f":"IFERROR(SUMIF(RATES!B:B,'21. Bill Impacts'!D455,RATES!I:I),\"\")","v":7.7000000000000002E-3},{"$f":"+K454","v":750},{"$f":"K455*J455","v":5.7750000000000004},0.30000000000000071,{"$f":"IF(ISERROR(M455/I455), \"\", M455/I455)","v":5.4794520547945341E-2}]
["RESIDENTIAL SERVICE CLASSIFICATION","ST_C",{"$f":"C447","v":9},null,"Sub-Total C - Delivery (including Sub-Total B)",null,null,null,{"$f":"SUM(I453:I455)","v":39.931699999999999},null,null,{"$f":"SUM(L453:L455)","v":41.481699999999996},1.5499999999999972,{"$f":"IF((I456)=0,\"\",(M456/I456))","v":3.8816278796044178E-2}]
["RESIDENTIAL SERVICE CLASSIFICATION",null,null,null,"Wholesale Market Service Charge (WMSC)",null,{"$f":"G$86","v":3.4000000000000002E-3},{"$f":"F435*F437","v":777},{"$f":"H457*G457","v":2.6418000000000004},{"$f":"J$86","v":3.4000000000000002E-3},{"$f":"F435*F437","v":777},{"$f":"K457*J457","v":2.6418000000000004},0,{"$f":"IF(ISERROR(M457/I457), \"\", M457/I457)","v":0}]
["RESIDENTIAL SERVICE CLASSIFICATION",null,null,null,"Rural and Remote Rate Protection (RRRP)",null,{"$f":"G$87","v":5.0000000000000001E-4},{"$f":"F435*F437","v":777},0.38850000000000001,{"$f":"J$87","v":5.0000000000000001E-4},{"$f":"F435*F437","v":777},0.38850000000000001,0,0]
["RESIDENTIAL SERVICE CLASSIFICATION",null,null,null,"Standard Supply Service Charge",null,0.25,1,0.25,0.25,1,0.25,0,0]
["RESIDENTIAL SERVICE CLASSIFICATION"]
["RESIDENTIAL SERVICE CLASSIFICATION",null,null,null,null,null,null,null,null,null,null,null,{"$f":"L461-I461","v":0},{"$f":"IF(ISERROR(M461/I461), \"\", M461/I461)","v":""}]
["RESIDENTIAL SERVICE CLASSIFICATION","RPP",null,null,"TOU - Off Peak",null,{"$f":"G$91","v":6.5000000000000002E-2},{"$f":"IF(AND(F435*12>=150000),0.65*F435*F437,0.65*F435)","v":487.5},{"$f":"H462*G462","v":31.6875},6.5000000000000002E-2,{"$f":"IF(AND(F435*12>=150000),0.65*F435*F438,0.65*F435)","v":487.5},{"$f":"K462*J462","v":31.6875},{"$f":"L462-I462","v":0},{"$f":"IF(ISERROR(M462/I462), \"\", M462/I462)","v":0}]
["RESIDENTIAL SERVICE CLASSIFICATION","RPP",null,null,"TOU - Mid Peak",null,{"$f":"G$92","v":9.4E-2},{"$f":"IF(AND(F435*12>=150000),0.17*F435*F437,0.17*F435)","v":127.50000000000001},11.985000000000001,{"$f":"J410","v":9.4E-2},{"$f":"IF(AND(F435*12>=150000),0.17*F435*F438,0.17*F435)","v":127.50000000000001},11.985000000000001,0,0]
["RESIDENTIAL SERVICE CLASSIFICATION","RPP",null,null,"TOU - On Peak",null,{"$f":"G$93","v":0.13400000000000001},{"$f":"IF(AND(F435*12>=150000),0.18*F435*F437,0.18*F435)","v":135},18.09,0.13400000000000001,{"$f":"IF(AND(F435*12>=150000),0.18*F435*F438,0.18*F435)","v":135},18.09,0,0]
["RESIDENTIAL SERVICE CLASSIFICATION","Non-RPP (Retailer)",null,null,"Non-RPP Retailer Avg. Price",null,{"$f":"G$94","v":0.11210000000000001},{"$f":"IF(AND(F435*12>=150000),F435*F437,F435)","v":750},{"$f":"H465*G465","v":84.075000000000003},{"$f":"G465","v":0.11210000000000001},{"$f":"IF(AND(F435*12>=150000),F435*F438,F435)","v":750},{"$f":"K465*J465","v":84.075000000000003},0,0]
["RESIDENTIAL SERVICE CLASSIFICATION","Non-RPP (Other)",null,null,"Average IESO Wholesale Market Price",null,{"$f":"G$95","v":0.11210000000000001},{"$f":"IF(AND(F435*12>=150000),F435*F437,F435)","v":750},{"$f":"H466*G466","v":84.075000000000003},{"$f":"G466","v":0.11210000000000001},{"$f":"IF(AND(F435*12>=150000),F435*F438,F435)","v":750},{"$f":"K466*J466","v":84.075000000000003},0,0]
["RESIDENTIAL SERVICE CLASSIFICATION"]
["RESIDENTIAL SERVICE CLASSIFICATION","RPP_BT",9,null,"Total Bill on TOU (before Taxes)",null,null,null,{"$f":"SUM(I457:I464,I456)","v":104.97450000000001},null,null,{"$f":"SUM(L457:L464,L456)","v":106.52449999999999},{"$f":"L468-I468","v":1.5499999999999829},{"$f":"IF((I468)=0,\"\",(M468/I468))","v":1.4765490666780817E-2}]
["RESIDENTIAL SERVICE CLASSIFICATION","RPP",null,null,"HST",null,0.13,null,{"$f":"I468*G469","v":13.646685000000002},0.13,null,{"$f":"L468*J469","v":13.848184999999999},{"$f":"L469-I469","v":0.20149999999999757},{"$f":"IF((I469)=0,\"\",(M469/I469))","v":1.47654906667808E-2}]
["RESIDENTIAL SERVICE CLASSIFICATION","RPP_NET",9,null,"Total Bill on TOU (before 8% Provincial Rebate)",null,null,null,{"$f":"SUM(I468:I469)","v":118.62118500000001},null,null,{"$f":"SUM(L468:L469)","v":120.37268499999999},{"$f":"SUM(M468:M469)","v":1.7514999999999805},{"$f":"IF((I470)=0,\"\",(M470/I470))","v":1.4765490666780814E-2}]
[{"$f":"A469","v":"RESIDENTIAL SERVICE CLASSIFICATION"},"RPP",null,null,"8% Provincial Rebate",null,-0.08,null,{"$f":"I468*G471","v":-8.3979600000000012},{"$f":"G471","v":-0.08},null,{"$f":"L468*J471","v":-8.52196},{"$f":"L471-I471","v":-0.12399999999999878},{"$f":"IF((I471)=0,\"\",(M471/I471))","v":1.4765490666780833E-2}]
["RESIDENTIAL SERVICE CLASSIFICATION","RPP_TOTAL",{"$f":"C447","v":9},null,"Total Bill on TOU",null,null,null,{"$f":"SUM(I468,I469,I471)","v":110.22322500000001},null,null,{"$f":"L468+L469+L471","v":111.85072499999998},{"$f":"L472-I472","v":1.6274999999999693},{"$f":"IF((I472)=0,\"\",(M472/I472))","v":1.4765490666780699E-2}]
["RESIDENTIAL SERVICE CLASSIFICATION","RPP"]
["RESIDENTIAL SERVICE CLASSIFICATION","Non-RPP (Retailer)",null,null,"Total Bill on Non-RPP Avg. Price",null,null,null,{"$f":"SUM(I465,I457:I461,I456)","v":127.28700000000001},null,null,{"$f":"SUM(L465,L457:L461,L456)","v":128.83699999999999},{"$f":"L474-I474","v":1.5499999999999829},{"$f":"IF((I474)=0,\"\",(M474/I474))","v":1.2177205841916165E-2}]
["RESIDENTIAL SERVICE CLASSIFICATION","Non-RPP (Retailer)",null,null,"HST",null,0.13,null,{"$f":"I474*G475","v":16.547310000000003},0.13,null,{"$f":"L474*J475","v":16.748809999999999},{"$f":"L475-I475","v":0.20149999999999579},{"$f":"IF((I475)=0,\"\",(M475/I475))","v":1.2177205841916042E-2}]
["RESIDENTIAL SERVICE CLASSIFICATION","Non-RPP (Retailer)",null,null,"Provincial Rebate",null,-0.08,null,{"$f":"I474*G476","v":-10.182960000000001},{"$f":"G476","v":-0.08},null,{"$f":"L474*J476","v":-10.30696},{"$f":"L476-I476","v":-0.12399999999999878},{"$f":"IF((I476)=0,\"\",(M476/I476))","v":1.2177205841916177E-2}]
["RESIDENTIAL SERVICE CLASSIFICATION","Non-RPP (Retailer)_TOTAL",null,null,"Total Bill on Non-RPP Avg. Price",null,null,null,{"$f":"SUM(I474,I475,I476)","v":133.65135000000001},null,null,{"$f":"SUM(L474,L475,L476)","v":135.27884999999998},{"$f":"L477-I477","v":1.6274999999999693},{"$f":"IF((I477)=0,\"\",(M477/I477))","v":1.217720584191607E-2}]
["RESIDENTIAL SERVICE CLASSIFICATION","Non-RPP (Retailer)"]
["RESIDENTIAL SERVICE CLASSIFICATION","Non-RPP (Other)",null,null,"Total Bill on Average IESO Wholesale Market Price",null,null,null,{"$f":"SUM(I466,I457:I461,I456)","v":127.28700000000001},null,null,{"$f":"SUM(L466,L457:L461,L456)","v":128.83699999999999},{"$f":"L479-I479","v":1.5499999999999829},{"$f":"IF((I479)=0,\"\",(M479/I479))","v":1.2177205841916165E-2}]
["RESIDENTIAL SERVICE CLASSIFICATION","Non-RPP (Other)",null,null,"HST",null,0.13,null,{"$f":"I479*G480","v":16.547310000000003},0.13,null,{"$f":"L479*J480","v":16.748809999999999},{"$f":"L480-I480","v":0.20149999999999579},{"$f":"IF((I480)=0,\"\",(M480/I480))","v":1.2177205841916042E-2}]
["RESIDENTIAL SERVICE CLASSIFICATION","Non-RPP (Other)",null,null,"Provincial Rebate",null,-0.08,null,{"$f":"I479*G481","v":-10.182960000000001},{"$f":"G481","v":-0.08},null,{"$f":"L479*J481","v":-10.30696},{"$f":"L481-I481","v":-0.12399999999999878},{"$f":"IF((I481)=0,\"\",(M481/I481))","v":1.2177205841916177E-2}]
["RESIDENTIAL SERVICE CLASSIFICATION","Non-RPP (Other)_TOTAL",null,null,"Total Bill on Average IESO Wholesale Market Price",null,null,null,{"$f":"SUM(I479,I480,I481)","v":133.65135000000001},null,null,{"$f":"SUM(L479,L480,L481)","v":135.27884999999998},{"$f":"L482-I482","v":1.6274999999999693},{"$f":"IF((I482)=0,\"\",(M482/I482))","v":1.217720584191607E-2}]
["RESIDENTIAL SERVICE CLASSIFICATION","Non-RPP (Other)"]

{"sheet":"RATES","index":26,"n_rows":261,"n_cols":11,"rows_kept":261,"cut":false,"hidden":false,"merged":[[10,7,12,7],[10,8,12,8]]}
["Back to Index"]
[]
[]
[]
[null,null,"Rates"]
[]
[]
["A",null,"MONTHLY RATES AND CHARGES  - DELIVERY COMPONENT"]
[]
[1,2,3,4,5,6,7,8,9]
[null,null,"Description",null,null,null,null,2019,2020]
[]
[null,null,null,"Effective until","Type","Customers","Billing\nDeterminant",null,null,"2019 CC","2020 CC"]
[null,null,"RESIDENTIAL"]
["R_F","R_F","Service Charge",null,"Rate",null,"$",24.25,{"$f":"ROUND('17. Rev2Cost-GDPIPI'!I17,2)","v":24.54},{"$f":"IFERROR(VLOOKUP(A15,'2. Current Tariff'!A:F,5,FALSE),0)-H15","v":0},{"$f":"IFERROR(VLOOKUP(A15,'20. Final Tariff Schedule'!A:E,5,FALSE),0)-I15","v":0}]
["R_V","R_V","Distribution Volumetric Rate",null,"Rate",null,"$/kWh",0,{"$f":"ROUND('17. Rev2Cost-GDPIPI'!J17,4)","v":0},{"$f":"IFERROR(VLOOKUP(A16,'2. Current Tariff'!A:F,5,FALSE),0)-H16","v":0},{"$f":"IFERROR(VLOOKUP(A16,'20. Final Tariff Schedule'!A:E,5,FALSE),0)-I16","v":0}]
["R_LV","R_LV","Low Voltage Service Rate ",null,"Rate",null,"$/kWh",2.0000000000000001E-4,{"$f":"H17","v":2.0000000000000001E-4},{"$f":"IFERROR(VLOOKUP(A17,'2. Current Tariff'!A:F,5,FALSE),0)-H17","v":0},{"$f":"IFERROR(VLOOKUP(A17,'20. Final Tariff Schedule'!A:E,5,FALSE),0)-I17","v":0}]
["R_SME","R_SME","Smart Metering Entity Charge - effective until December 31, 2022",null,"Rate",null,"$",0.56999999999999995,0.56999999999999995,{"$f":"IFERROR(VLOOKUP(A18,'2. Current Tariff'!A:F,5,FALSE),0)-H18","v":0},{"$f":"IFERROR(VLOOKUP(A18,'20. Final Tariff Schedule'!A:E,5,FALSE),0)-I18","v":0}]
["R_FRR19","R_FRR","Rate Rider for Recovery of 2019 Foregone Revenue - effective until December 31, 2019","2019-12-31","Rate Rider",null,"$",0.03,null,{"$f":"IFERROR(VLOOKUP(A19,'2. Current Tariff'!A:F,5,FALSE),0)-H19","v":0},{"$f":"IFERROR(VLOOKUP(A19,'20. Final Tariff Schedule'!A:E,5,FALSE),0)-I19","v":0}]
["R_ICMF17","R_FRR","Rate Rider for Recovery of Incremental Capital Module (2017) - in effect until the effective date of the next cost of service based rate order","next COS","Rate Rider",null,"$",0.6,{"$f":"H20","v":0.6},{"$f":"IFERROR(VLOOKUP(A20,'2. Current Tariff'!A:F,5,FALSE),0)-H20","v":0},{"$f":"IFERROR(VLOOKUP(A20,'20. Final Tariff Schedule'!A:E,5,FALSE),0)-I20","v":0}]
["R_GA18",null,"Rate Rider for Disposition of Global Adjustment Account (2018) - effective until  April 30, 2019\n        Applicable only for Non-RPP Customers","2019-04-30","Rate Rider","non-RPP","$/kWh",-5.0000000000000001E-4,null,{"$f":"IFERROR(VLOOKUP(A21,'2. Current Tariff'!A:F,5,FALSE),0)-H21","v":0},{"$f":"IFERROR(VLOOKUP(A21,'20. Final Tariff Schedule'!A:E,5,FALSE),0)-I21","v":0}]
["R_DVA18",null,"Rate Rider for Disposition of Deferral/Variance Accounts (2018) - effective until April 30, 2019","2019-04-30","Rate Rider",null,"$/kWh",-6.9999999999999999E-4,null,{"$f":"IFERROR(VLOOKUP(A22,'2. Current Tariff'!A:F,5,FALSE),0)-H22","v":0},{"$f":"IFERROR(VLOOKUP(A22,'20. Final Tariff Schedule'!A:E,5,FALSE),0)-I22","v":0}]
["R_CBR18",null,"Rate Rider for Disposition of Capacity Based Recovery Account (2018) - effective until April 30, 2019\n        Applicable Only for Class B Customers","2019-04-30","Rate Rider","Class B","$/kWh",-5.0000000000000002E-5,null,{"$f":"IFERROR(VLOOKUP(A23,'2. Current Tariff'!A:F,5,FALSE),0)-H23","v":0},{"$f":"IFERROR(VLOOKUP(A23,'20. Final Tariff Schedule'!A:E,5,FALSE),0)-I23","v":0}]
["R_GA19","R_GA","Rate Rider for Disposition of Global Adjustment Account (2019) - effective until  December 31, 2019\n        Applicable only for Non-RPP Customers","2019-12-31","Rate Rider","non-RPP","$/kWh",1.9E-3,null,{"$f":"IFERROR(VLOOKUP(A24,'2. Current Tariff'!A:F,5,FALSE),0)-H24","v":0},{"$f":"IFERROR(VLOOKUP(A24,'20. Final Tariff Schedule'!A:E,5,FALSE),0)-I24","v":0}]
["R_DVA19","R_DVA","Rate Rider for Disposition of Deferral/Variance Accounts (2019) - effective until December 31, 2019","2019-12-31","Rate Rider",null,"$/kWh",-4.0000000000000002E-4,null,{"$f":"IFERROR(VLOOKUP(A25,'2. Current Tariff'!A:F,5,FALSE),0)-H25","v":0},{"$f":"IFERROR(VLOOKUP(A25,'20. Final Tariff Schedule'!A:E,5,FALSE),0)-I25","v":0}]
["R_CBR20","R_DVA","Rate Rider for Disposition of Capacity Based Recovery Account (2020) - effective until December 31, 2020\n        Applicable Only for Class B Customers","2020-12-31","Rate Rider","Class B","$/kWh",null,{"$f":"+ROUND(VLOOKUP(A26,'6.2 CBR B'!$A:$M,13,FALSE),4)","v":-1E-4},{"$f":"IFERROR(VLOOKUP(A26,'2. Current Tariff'!A:F,5,FALSE),0)-H26","v":0},{"$f":"IFERROR(VLOOKUP(A26,'20. Final Tariff Schedule'!A:E,5,FALSE),0)-I26","v":0}]
["R_LRV19","R_VRR","Rate Rider for Disposition of Lost Revenue Adjustment Mechanism Variance Account (LRAMVA) (2019) - effective until December 31, 2019","2019-12-31","Rate Rider",null,"$/kWh",2.0000000000000001E-4,null,{"$f":"IFERROR(VLOOKUP(A27,'2. Current Tariff'!A:F,5,FALSE),0)-H27","v":0},{"$f":"IFERROR(VLOOKUP(A27,'20. Final Tariff Schedule'!A:E,5,FALSE),0)-I27","v":0}]
["R_ICMF19","R_FRR","Rate Rider for Recovery of Incremental Capital Module (2019) - in effect until the effective date of the next cost of service based rate order","next COS","Rate Rider",null,"$",0.12,0.12,{"$f":"IFERROR(VLOOKUP(A28,'2. Current Tariff'!A:F,5,FALSE),0)-H28","v":0},{"$f":"IFERROR(VLOOKUP(A28,'20. Final Tariff Schedule'!A:E,5,FALSE),0)-I28","v":0}]
["R_MFF20","R_FRR","Rate Rider for Recovery of M-factor Capital (2020) - in effect until the effective date of the next cost of service based rate order","next COS","Rate Rider",null,"$",null,{"$f":"ROUND(VLOOKUP(A29,'19. Additional Rates'!$A:$G,4,FALSE),2)","v":0.12},{"$f":"IFERROR(VLOOKUP(A29,'2. Current Tariff'!A:F,5,FALSE),0)-H29","v":0},{"$f":"IFERROR(VLOOKUP(A29,'20. Final Tariff Schedule'!A:E,5,FALSE),0)-I29","v":0}]
["R_LRV18",null,"Rate Rider for Disposition of Lost Revenue Adjustment Mechanism Variance Account (LRAMVA) (2018) - effective until April 30, 2019","2019-04-30","Rate Rider",null,"$/kWh",-2.0000000000000001E-4,null,{"$f":"IFERROR(VLOOKUP(A30,'2. Current Tariff'!A:F,5,FALSE),0)-H30","v":0},{"$f":"IFERROR(VLOOKUP(A30,'20. Final Tariff Schedule'!A:E,5,FALSE),0)-I30","v":0}]
["R_ICMF18","R_FRR","Rate Rider for Recovery of Incremental Capital Module (2018) - in effect until the effective date of the next cost of service based rate order","next COS","Rate Rider",null,"$",0.16,0.16,{"$f":"IFERROR(VLOOKUP(A31,'2. Current Tariff'!A:F,5,FALSE),0)-H31","v":0},{"$f":"IFERROR(VLOOKUP(A31,'20. Final Tariff Schedule'!A:E,5,FALSE),0)-I31","v":0}]
["R_GA20","R_GA","Rate Rider for Disposition of Global Adjustment Account (2020) - effective until  December 31, 2020","2020-12-31","Rate Rider","non-RPP","$/kWh",null,{"$f":"+ROUND('6.1 GA'!M17,4)","v":-3.2000000000000002E-3},{"$f":"IFERROR(VLOOKUP(A32,'2. Current Tariff'!A:F,5,FALSE),0)-H32","v":0},{"$f":"IFERROR(VLOOKUP(A32,'20. Final Tariff Schedule'!A:E,5,FALSE),0)-I32","v":0}]
["R_DVA20","R_DVA","Rate Rider for Disposition of Deferral/Variance Accounts (2020) - effective until December 31, 2020","2020-12-31","Rate Rider",null,"$/kWh",null,{"$f":"+ROUND('8. Calculation of Def-Var RR'!J19,4)","v":2.0000000000000001E-4},{"$f":"IFERROR(VLOOKUP(A33,'2. Current Tariff'!A:F,5,FALSE),0)-H33","v":0},{"$f":"IFERROR(VLOOKUP(A33,'20. Final Tariff Schedule'!A:E,5,FALSE),0)-I33","v":0}]
["R_LRV20","R_VRR","Rate Rider for Disposition of Lost Revenue Adjustment Mechanism Variance Account (LRAMVA) (2020) - effective until December 31, 2020","2020-12-31","Rate Rider",null,"$/kWh",null,{"$f":"+ROUND('8. Calculation of Def-Var RR'!L19,4)","v":2.9999999999999997E-4},{"$f":"IFERROR(VLOOKUP(A34,'2. Current Tariff'!A:F,5,FALSE),0)-H34","v":0},{"$f":"IFERROR(VLOOKUP(A34,'20. Final Tariff Schedule'!A:E,5,FALSE),0)-I34","v":0}]
["R_MFV20","R_VRR","Rate Rider for Recovery of M-factor Capital (2020) - in effect until the effective date of the next cost of service based rate order","next COS","Rate Rider",null,"$/kWh",null,{"$f":"ROUND(VLOOKUP(A35,'19. Additional Rates'!$A:$G,4,FALSE),4)","v":0},{"$f":"IFERROR(VLOOKUP(A35,'2. Current Tariff'!A:F,5,FALSE),0)-H35","v":0},{"$f":"IFERROR(VLOOKUP(A35,'20. Final Tariff Schedule'!A:E,5,FALSE),0)-I35","v":0}]
["R_ICMF20","R_FRR","Rate Rider for Recovery of Incremental Capital Module (2020) - in effect until the effective date of the next cost of service based rate order","next COS","Rate Rider",null,"$",null,{"$f":"+ROUND('19. Additional Rates'!D14,2)","v":0.12},{"$f":"IFERROR(VLOOKUP(A36,'2. Current Tariff'!A:F,5,FALSE),0)-H36","v":0},{"$f":"IFERROR(VLOOKUP(A36,'20. Final Tariff Schedule'!A:E,5,FALSE),0)-I36","v":0}]
["R_TN","R_TN","Retail Transmission Rate – Network Service Rate",null,"Rate",null,"$/kWh",7.6E-3,{"$f":"ROUND(VLOOKUP(B37,RTSR_TY,11,FALSE),4)","v":8.0000000000000002E-3},{"$f":"IFERROR(VLOOKUP(A37,'2. Current Tariff'!A:F,5,FALSE),0)-H37","v":0},{"$f":"IFERROR(VLOOKUP(A37,'20. Final Tariff Schedule'!A:E,5,FALSE),0)-I37","v":0}]
["R_TC","R_TC","Retail Transmission Rate – Line and Transformation Connection Service Rate",null,"Rate",null,"$/kWh",7.3000000000000001E-3,{"$f":"ROUND(VLOOKUP(B38,RTSR_TY,11,FALSE),4)","v":7.7000000000000002E-3},{"$f":"IFERROR(VLOOKUP(A38,'2. Current Tariff'!A:F,5,FALSE),0)-H38","v":0},{"$f":"IFERROR(VLOOKUP(A38,'20. Final Tariff Schedule'!A:E,5,FALSE),0)-I38","v":0}]
[null,null,"GENERAL SERVICE LESS THAN 50 KW",null,null,null,null,null,null,{"$f":"IFERROR(VLOOKUP(A39,'2. Current Tariff'!A:F,5,FALSE),0)-H39","v":0},{"$f":"IFERROR(VLOOKUP(A39,'20. Final Tariff Schedule'!A:E,5,FALSE),0)-I39","v":0}]
["GSL_F","GSL_F","Service Charge",null,"Rate",null,"$",44.52,{"$f":"ROUND('17. Rev2Cost-GDPIPI'!I18,2)","v":45.05},{"$f":"IFERROR(VLOOKUP(A40,'2. Current Tariff'!A:F,5,FALSE),0)-H40","v":0},{"$f":"IFERROR(VLOOKUP(A40,'20. Final Tariff Schedule'!A:E,5,FALSE),0)-I40","v":0}]
["GSL_V","GSL_V","Distribution Volumetric Rate",null,"Rate",null,"$/kWh",1.2999999999999999E-2,{"$f":"ROUND('17. Rev2Cost-GDPIPI'!J18,4)","v":1.32E-2},{"$f":"IFERROR(VLOOKUP(A41,'2. Current Tariff'!A:F,5,FALSE),0)-H41","v":0},{"$f":"IFERROR(VLOOKUP(A41,'20. Final Tariff Schedule'!A:E,5,FALSE),0)-I41","v":0}]
["GSL_LV","GSL_LV","Low Voltage Service Rate ",null,"Rate",null,"$/kWh",2.0000000000000001E-4,2.0000000000000001E-4,{"$f":"IFERROR(VLOOKUP(A42,'2. Current Tariff'!A:F,5,FALSE),0)-H42","v":0},{"$f":"IFERROR(VLOOKUP(A42,'20. Final Tariff Schedule'!A:E,5,FALSE),0)-I42","v":0}]
["GSL_SME","GSL_SME","Smart Metering Entity Charge - effective until December 31, 2022",null,"Rate",null,"$",0.56999999999999995,0.56999999999999995,{"$f":"IFERROR(VLOOKUP(A43,'2. Current Tariff'!A:F,5,FALSE),0)-H43","v":0},{"$f":"IFERROR(VLOOKUP(A43,'20. Final Tariff Schedule'!A:E,5,FALSE),0)-I43","v":0}]
["GSL_FRR19","GSL_FRR","Rate Rider for Recovery of 2019 Foregone Revenue - effective until December 31, 2019","2019-12-31","Rate Rider",null,"$",0.1,null,{"$f":"IFERROR(VLOOKUP(A44,'2. Current Tariff'!A:F,5,FALSE),0)-H44","v":0},{"$f":"IFERROR(VLOOKUP(A44,'20. Final Tariff Schedule'!A:E,5,FALSE),0)-I44","v":0}]
["GSL_ICMF17","GSL_FRR","Rate Rider for Recovery of Incremental Capital Module (2017) - in effect until the effective date of the next cost of service based rate order","next COS","Rate Rider",null,"$",1.1000000000000001,1.1000000000000001,{"$f":"IFERROR(VLOOKUP(A45,'2. Current Tariff'!A:F,5,FALSE),0)-H45","v":0},{"$f":"IFERROR(VLOOKUP(A45,'20. Final Tariff Schedule'!A:E,5,FALSE),0)-I45","v":0}]
["GSL_GA18",null,"Rate Rider for Disposition of Global Adjustment Account (2018) - effective until  April 30, 2019\n        Applicable only for Non-RPP Customers","2019-04-30","Rate Rider",null,"$/kWh",-5.0000000000000001E-4,null,{"$f":"IFERROR(VLOOKUP(A46,'2. Current Tariff'!A:F,5,FALSE),0)-H46","v":0},{"$f":"IFERROR(VLOOKUP(A46,'20. Final Tariff Schedule'!A:E,5,FALSE),0)-I46","v":0}]
["GSL_DVA18",null,"Rate Rider for Disposition of Deferral/Variance Accounts (2018) - effective until April 30, 2019","2019-04-30","Rate Rider",null,"$/kWh",-6.9999999999999999E-4,null,{"$f":"IFERROR(VLOOKUP(A47,'2. Current Tariff'!A:F,5,FALSE),0)-H47","v":0},{"$f":"IFERROR(VLOOKUP(A47,'20. Final Tariff Schedule'!A:E,5,FALSE),0)-I47","v":0}]
["GSL_ICMV17","GSL_VRR","Rate Rider for Recovery of Incremental Capital Module (2017) - in effect until the effective date of the next cost of service based rate order","next COS","Rate Rider",null,"$/kWh",2.9999999999999997E-4,2.9999999999999997E-4,{"$f":"IFERROR(VLOOKUP(A48,'2. Current Tariff'!A:F,5,FALSE),0)-H48","v":0},{"$f":"IFERROR(VLOOKUP(A48,'20. Final Tariff Schedule'!A:E,5,FALSE),0)-I48","v":0}]
["GSL_CBR18",null,"Rate Rider for Disposition of Capacity Based Recovery Account (2018) - effective until April 30, 2019\n        Applicable Only for Class B Customers","2019-04-30","Rate Rider",null,"$/kWh",-5.0000000000000002E-5,null,{"$f":"IFERROR(VLOOKUP(A49,'2. Current Tariff'!A:F,5,FALSE),0)-H49","v":0},{"$f":"IFERROR(VLOOKUP(A49,'20. Final Tariff Schedule'!A:E,5,FALSE),0)-I49","v":0}]
["GSL_LRV18",null,"Rate Rider for Disposition of Lost Revenue Adjustment Mechanism Variance Account (LRAMVA) (2018) - effective until April 30, 2019","2019-04-30","Rate Rider",null,"$/kWh",5.9999999999999995E-4,null,{"$f":"IFERROR(VLOOKUP(A50,'2. Current Tariff'!A:F,5,FALSE),0)-H50","v":0},{"$f":"IFERROR(VLOOKUP(A50,'20. Final Tariff Schedule'!A:E,5,FALSE),0)-I50","v":0}]
["GSL_GA19","GSL_GA","Rate Rider for Disposition of Global Adjustment Account (2019) - effective until  December 31, 2019\n        Applicable only for Non-RPP Customers","2019-12-31","Rate Rider",null,"$/kWh",1.9E-3,null,{"$f":"IFERROR(VLOOKUP(A51,'2. Current Tariff'!A:F,5,FALSE),0)-H51","v":0},{"$f":"IFERROR(VLOOKUP(A51,'20. Final Tariff Schedule'!A:E,5,FALSE),0)-I51","v":0}]
["GSL_DVA19","GSL_DVA","Rate Rider for Disposition of Deferral/Variance Accounts (2019) - effective until December 31, 2019","2019-12-31","Rate Rider",null,"$/kWh",-4.0000000000000002E-4,null,{"$f":"IFERROR(VLOOKUP(A52,'2. Current Tariff'!A:F,5,FALSE),0)-H52","v":0},{"$f":"IFERROR(VLOOKUP(A52,'20. Final Tariff Schedule'!A:E,5,FALSE),0)-I52","v":0}]
["GSL_CBR20","GSL_DVA","Rate Rider for Disposition of Capacity Based Recovery Account (2020) - effective until December 31, 2020\n        Applicable Only for Class B Customers","2019-12-31","Rate Rider",null,"$/kWh",null,{"$f":"+ROUND(VLOOKUP(A53,'6.2 CBR B'!$A:$M,13,FALSE),4)","v":-1E-4},{"$f":"IFERROR(VLOOKUP(A53,'2. Current Tariff'!A:F,5,FALSE),0)-H53","v":0},{"$f":"IFERROR(VLOOKUP(A53,'20. Final Tariff Schedule'!A:E,5,FALSE),0)-I53","v":0}]
["GSL_LRV19","GSL_VRR","Rate Rider for Disposition of Lost Revenue Adjustment Mechanism Variance Account (LRAMVA) (2019) - effective until December 31, 2019","2019-12-31","Rate Rider",null,"$/kWh",2.9999999999999997E-4,null,{"$f":"IFERROR(VLOOKUP(A54,'2. Current Tariff'!A:F,5,FALSE),0)-H54","v":0},{"$f":"IFERROR(VLOOKUP(A54,'20. Final Tariff Schedule'!A:E,5,FALSE),0)-I54","v":0}]
["GSL_ICMF19","GSL_FRR","Rate Rider for Recovery of Incremental Capital Module (2019) - in effect until the effective date of the next cost of service based rate order","next COS","Rate Rider",null,"$",0.21,0.21,{"$f":"IFERROR(VLOOKUP(A55,'2. Current Tariff'!A:F,5,FALSE),0)-H55","v":0},{"$f":"IFERROR(VLOOKUP(A55,'20. Final Tariff Schedule'!A:E,5,FALSE),0)-I55","v":0}]
["GSL_ICMV19","GSL_VRR","Rate Rider for Recovery of Incremental Capital Module (2019) - in effect until the effective date of the next cost of service based rate order","next COS","Rate Rider",null,"$/kWh",1E-4,1E-4,{"$f":"IFERROR(VLOOKUP(A56,'2. Current Tariff'!A:F,5,FALSE),0)-H56","v":0},{"$f":"IFERROR(VLOOKUP(A56,'20. Final Tariff Schedule'!A:E,5,FALSE),0)-I56","v":0}]
["GSL_MFF20","GSL_FRR","Rate Rider for Recovery of M-factor Capital (2020) - in effect until the effective date of the next cost of service based rate order","next COS","Rate Rider",null,"$",null,{"$f":"ROUND(VLOOKUP(A57,'19. Additional Rates'!$A:$G,4,FALSE),2)","v":0.22},{"$f":"IFERROR(VLOOKUP(A57,'2. Current Tariff'!A:F,5,FALSE),0)-H57","v":0},{"$f":"IFERROR(VLOOKUP(A57,'20. Final Tariff Schedule'!A:E,5,FALSE),0)-I57","v":0}]
["GSL_MFV20","GSL_VRR","Rate Rider for Recovery of M-factor Capital (2020) - in effect until the effective date of the next cost of service based rate order","next COS","Rate Rider",null,"$/kWh",null,{"$f":"ROUND(VLOOKUP(A58,'19. Additional Rates'!$A:$G,4,FALSE),4)","v":1E-4},{"$f":"IFERROR(VLOOKUP(A58,'2. Current Tariff'!A:F,5,FALSE),0)-H58","v":0},{"$f":"IFERROR(VLOOKUP(A58,'20. Final Tariff Schedule'!A:E,5,FALSE),0)-I58","v":0}]
["GSL_ICMV18","GSL_VRR","Rate Rider for Recovery of Incremental Capital Module (2018) - in effect until the effective date of the next cost of service based rate order","2020-12-31","Rate Rider",null,"$/kWh",1E-4,1E-4,{"$f":"IFERROR(VLOOKUP(A59,'2. Current Tariff'!A:F,5,FALSE),0)-H59","v":0},{"$f":"IFERROR(VLOOKUP(A59,'20. Final Tariff Schedule'!A:E,5,FALSE),0)-I59","v":0}]
["GSL_ICMF18","GSL_FRR","Rate Rider for Recovery of Incremental Capital Module (2018) - in effect until the effective date of the next cost of service based rate order","2020-12-31","Rate Rider",null,"$",0.28999999999999998,0.28999999999999998,{"$f":"IFERROR(VLOOKUP(A60,'2. Current Tariff'!A:F,5,FALSE),0)-H60","v":0},{"$f":"IFERROR(VLOOKUP(A60,'20. Final Tariff Schedule'!A:E,5,FALSE),0)-I60","v":0}]
["GSL_GA20","GSL_GA","Rate Rider for Disposition of Global Adjustment Account (2020) - effective until  December 31, 2020","2020-12-31","Rate Rider","non-RPP","$/kWh",null,{"$f":"+ROUND('6.1 GA'!M18,4)","v":-3.2000000000000002E-3},{"$f":"IFERROR(VLOOKUP(A61,'2. Current Tariff'!A:F,5,FALSE),0)-H61","v":0},{"$f":"IFERROR(VLOOKUP(A61,'20. Final Tariff Schedule'!A:E,5,FALSE),0)-I61","v":0}]
["GSL_DVA20","GSL_DVA","Rate Rider for Disposition of Deferral/Variance Accounts (2020) - effective until December 31, 2020","2020-12-31","Rate Rider",null,"$/kWh",null,{"$f":"+ROUND('8. Calculation of Def-Var RR'!J20,4)","v":2.9999999999999997E-4},{"$f":"IFERROR(VLOOKUP(A62,'2. Current Tariff'!A:F,5,FALSE),0)-H62","v":0},{"$f":"IFERROR(VLOOKUP(A62,'20. Final Tariff Schedule'!A:E,5,FALSE),0)-I62","v":0}]
["GSL_LRV20","GSL_VRR","Rate Rider for Disposition of Lost Revenue Adjustment Mechanism Variance Account (LRAMVA) (2020) - effective until December 31, 2020","2020-12-31","Rate Rider",null,"$/kWh",null,{"$f":"+ROUND('8. Calculation of Def-Var RR'!L20,4)","v":1E-4},{"$f":"IFERROR(VLOOKUP(A63,'2. Current Tariff'!A:F,5,FALSE),0)-H63","v":0},{"$f":"IFERROR(VLOOKUP(A63,'20. Final Tariff Schedule'!A:E,5,FALSE),0)-I63","v":0}]
["GSL_ICMF20","GSL_FRR","Rate Rider for Recovery of Incremental Capital Module (2020) - in effect until the effective date of the next cost of service based rate order","2020-12-31","Rate Rider",null,"$",null,{"$f":"+ROUND('19. Additional Rates'!D27,2)","v":0.22},{"$f":"IFERROR(VLOOKUP(A64,'2. Current Tariff'!A:F,5,FALSE),0)-H64","v":0},{"$f":"IFERROR(VLOOKUP(A64,'20. Final Tariff Schedule'!A:E,5,FALSE),0)-I64","v":0}]
["GSL_ICMV20","GSL_VRR","Rate Rider for Recovery of Incremental Capital Module (2020) - in effect until the effective date of the next cost of service based rate order","2020-12-31","Rate Rider",null,"$/kWh",null,{"$f":"+ROUND('19. Additional Rates'!D28,4)","v":1E-4},{"$f":"IFERROR(VLOOKUP(A65,'2. Current Tariff'!A:F,5,FALSE),0)-H65","v":0},{"$f":"IFERROR(VLOOKUP(A65,'20. Final Tariff Schedule'!A:E,5,FALSE),0)-I65","v":0}]
["GSL_TN","GSL_TN","Retail Transmission Rate – Network Service Rate","2020-12-31","Rate Rider",null,"$/kWh",7.1000000000000004E-3,{"$f":"ROUND(VLOOKUP(B66,RTSR_TY,11,FALSE),4)","v":7.4000000000000003E-3},{"$f":"IFERROR(VLOOKUP(A66,'2. Current Tariff'!A:F,5,FALSE),0)-H66","v":0},{"$f":"IFERROR(VLOOKUP(A66,'20. Final Tariff Schedule'!A:E,5,FALSE),0)-I66","v":0}]
["GSL_TC","GSL_TC","Retail Transmission Rate – Line and Transformation Connection Service Rate","2020-12-31","Rate Rider",null,"$/kWh",6.4999999999999997E-3,{"$f":"ROUND(VLOOKUP(B67,RTSR_TY,11,FALSE),4)","v":6.8999999999999999E-3},{"$f":"IFERROR(VLOOKUP(A67,'2. Current Tariff'!A:F,5,FALSE),0)-H67","v":0},{"$f":"IFERROR(VLOOKUP(A67,'20. Final Tariff Schedule'!A:E,5,FALSE),0)-I67","v":0}]
[null,null,"GENERAL SERVICE 50 - 499 KW",null,"Rate Rider",null,null,null,null,{"$f":"IFERROR(VLOOKUP(A68,'2. Current Tariff'!A:F,5,FALSE),0)-H68","v":0},{"$f":"IFERROR(VLOOKUP(A68,'20. Final Tariff Schedule'!A:E,5,FALSE),0)-I68","v":0}]
["GS50_499_F","GS50_499_F","Service Charge",null,"Rate Rider",null,"$",78.41,{"$f":"ROUND('17. Rev2Cost-GDPIPI'!I19,2)","v":79.349999999999994},{"$f":"IFERROR(VLOOKUP(A69,'2. Current Tariff'!A:F,5,FALSE),0)-H69","v":0},{"$f":"IFERROR(VLOOKUP(A69,'20. Final Tariff Schedule'!A:E,5,FALSE),0)-I69","v":0}]
["GS50_499_V","GS50_499_V","Distribution Volumetric Rate",null,"Rate Rider",null,"$/kW",4.7188999999999997,{"$f":"ROUND('17. Rev2Cost-GDPIPI'!J19,4)","v":4.7755000000000001},{"$f":"IFERROR(VLOOKUP(A70,'2. Current Tariff'!A:F,5,FALSE),0)-H70","v":0},{"$f":"IFERROR(VLOOKUP(A70,'20. Final Tariff Schedule'!A:E,5,FALSE),0)-I70","v":0}]
["GS50_499_LV","GS50_499_LV","Low Voltage Service Rate ",null,"Rate Rider",null,"$/kW",8.0199999999999994E-2,8.0199999999999994E-2,{"$f":"IFERROR(VLOOKUP(A71,'2. Current Tariff'!A:F,5,FALSE),0)-H71","v":0},{"$f":"IFERROR(VLOOKUP(A71,'20. Final Tariff Schedule'!A:E,5,FALSE),0)-I71","v":0}]
["GS50_499_TA",null,"Transformer Discount",null,"Rate Rider",null,"$/kW",-0.4,-0.4,{"$f":"IFERROR(VLOOKUP(A72,'2. Current Tariff'!A:F,5,FALSE),0)-H72","v":0.4},{"$f":"IFERROR(VLOOKUP(A72,'20. Final Tariff Schedule'!A:E,5,FALSE),0)-I72","v":0.4}]
["GS50_499_FRR19","GS50_499_FRR","Rate Rider for Recovery of 2019 Foregone Revenue - effective until December 31, 2019","2019-12-31","Rate Rider",null,"$",0.75,null,{"$f":"IFERROR(VLOOKUP(A73,'2. Current Tariff'!A:F,5,FALSE),0)-H73","v":0},{"$f":"IFERROR(VLOOKUP(A73,'20. Final Tariff Schedule'!A:E,5,FALSE),0)-I73","v":0}]
["GS50_499_ICMF17","GS50_499_FRR","Rate Rider for Recovery of Incremental Capital Module (2017) - in effect until the effective date of the next cost of service based rate order","next COS","Rate Rider",null,"$",1.93,1.93,{"$f":"IFERROR(VLOOKUP(A74,'2. Current Tariff'!A:F,5,FALSE),0)-H74","v":0},{"$f":"IFERROR(VLOOKUP(A74,'20. Final Tariff Schedule'!A:E,5,FALSE),0)-I74","v":0}]
["GS50_499_GA18",null,"Rate Rider for Disposition of Global Adjustment Account (2018) - effective until  April 30, 2019\n        Applicable only for Non-RPP Customers","2019-04-30","Rate Rider",null,"$/kWh",-5.0000000000000001E-4,null,{"$f":"IFERROR(VLOOKUP(A75,'2. Current Tariff'!A:F,5,FALSE),0)-H75","v":0},{"$f":"IFERROR(VLOOKUP(A75,'20. Final Tariff Schedule'!A:E,5,FALSE),0)-I75","v":0}]
["GS50_499_DVA18",null,"Rate Rider for Disposition of Deferral/Variance Accounts (2018) - effective until April 30, 2019","2019-04-30","Rate Rider",null,"$/kW",0.10050000000000001,null,{"$f":"IFERROR(VLOOKUP(A76,'2. Current Tariff'!A:F,5,FALSE),0)-H76","v":0},{"$f":"IFERROR(VLOOKUP(A76,'20. Final Tariff Schedule'!A:E,5,FALSE),0)-I76","v":0}]
["GS50_499_DVA18nonWMP",null,"Rate Rider for Disposition of Deferral/Variance Accounts (2018) - effective until April 30, 2019\n         Applicable only for Non-Wholesale Market Participants","2019-04-30","Rate Rider",null,"$/kW",-0.3538,null,{"$f":"IFERROR(VLOOKUP(A77,'2. Current Tariff'!A:F,5,FALSE),0)-H77","v":0},{"$f":"IFERROR(VLOOKUP(A77,'20. Final Tariff Schedule'!A:E,5,FALSE),0)-I77","v":0}]
["GS50_499_ICMV17","GS50_499_VRR","Rate Rider for Recovery of Incremental Capital Module (2017) - in effect until the effective date of the next cost of service based rate order","next COS","Rate Rider",null,"$/kW",0.1163,0.1163,{"$f":"IFERROR(VLOOKUP(A78,'2. Current Tariff'!A:F,5,FALSE),0)-H78","v":0},{"$f":"IFERROR(VLOOKUP(A78,'20. Final Tariff Schedule'!A:E,5,FALSE),0)-I78","v":0}]
["GS50_499_CBR18",null,"Rate Rider for Disposition of Capacity Based Recovery Account (2018) - effective until April 30, 2019\n        Applicable Only for Non-WMP Class B Customers","2019-04-30","Rate Rider",null,"$/kW",-1.6060000000000001E-2,null,{"$f":"IFERROR(VLOOKUP(A79,'2. Current Tariff'!A:F,5,FALSE),0)-H79","v":0},{"$f":"IFERROR(VLOOKUP(A79,'20. Final Tariff Schedule'!A:E,5,FALSE),0)-I79","v":0}]
["GS50_499_GA19","GS50_499_GA","Rate Rider for Disposition of Global Adjustment Account (2019) - effective until  December 31, 2019\n        Applicable only for Non-RPP Customers","2019-12-31","Rate Rider",null,"$/kWh",1.9E-3,null,{"$f":"IFERROR(VLOOKUP(A80,'2. Current Tariff'!A:F,5,FALSE),0)-H80","v":0},{"$f":"IFERROR(VLOOKUP(A80,'20. Final Tariff Schedule'!A:E,5,FALSE),0)-I80","v":0}]
["GS50_499_DVA19nonWMP","GS50_499_DVA","Rate Rider for Disposition of Deferral/Variance Accounts (2019) - effective until December 31, 2019\n         Applicable only for Non-Wholesale Market Participants","2019-12-31","Rate Rider",null,"$/kW",-0.379,null,{"$f":"IFERROR(VLOOKUP(A81,'2. Current Tariff'!A:F,5,FALSE),0)-H81","v":0},{"$f":"IFERROR(VLOOKUP(A81,'20. Final Tariff Schedule'!A:E,5,FALSE),0)-I81","v":0}]
["GS50_499_DVA19","GS50_499_DVA","Rate Rider for Disposition of Deferral/Variance Accounts (2019) - effective until December 31, 2019","2019-12-31","Rate Rider",null,"$/kW",0.2394,null,{"$f":"IFERROR(VLOOKUP(A82,'2. Current Tariff'!A:F,5,FALSE),0)-H82","v":0},{"$f":"IFERROR(VLOOKUP(A82,'20. Final Tariff Schedule'!A:E,5,FALSE),0)-I82","v":0}]
["GS50_499_CBR20","GS50_499_DVA","Rate Rider for Disposition of Capacity Based Recovery Account (2020) - effective until December 31, 2020\n        Applicable Only for Non-WMP Class  B Customers","2020-12-31","Rate Rider",null,"$/kW",null,{"$f":"+ROUND(VLOOKUP(A83,'6.2 CBR B'!$A:$M,13,FALSE),4)","v":-3.5200000000000002E-2},{"$f":"IFERROR(VLOOKUP(A83,'2. Current Tariff'!A:F,5,FALSE),0)-H83","v":0},{"$f":"IFERROR(VLOOKUP(A83,'20. Final Tariff Schedule'!A:E,5,FALSE),0)-I83","v":0}]
["GS50_499_LRV19","GS50_499_VRR","Rate Rider for Disposition of Lost Revenue Adjustment Mechanism Variance Account (LRAMVA) (2019) - effective until December 31, 2019","2019-12-31","Rate Rider",null,"$/kW",0.22900000000000001,null,{"$f":"IFERROR(VLOOKUP(A84,'2. Current Tariff'!A:F,5,FALSE),0)-H84","v":0},{"$f":"IFERROR(VLOOKUP(A84,'20. Final Tariff Schedule'!A:E,5,FALSE),0)-I84","v":0}]
["GS50_499_ICMF19","GS50_499_FRR","Rate Rider for Recovery of Incremental Capital Module (2019) - in effect until the effective date of the next cost of service based rate order","next COS","Rate Rider",null,"$",0.38,0.38,{"$f":"IFERROR(VLOOKUP(A85,'2. Current Tariff'!A:F,5,FALSE),0)-H85","v":0},{"$f":"IFERROR(VLOOKUP(A85,'20. Final Tariff Schedule'!A:E,5,FALSE),0)-I85","v":0}]
["GS50_499_ICMV19","GS50_499_VRR","Rate Rider for Recovery of Incremental Capital Module (2019) - in effect until the effective date of the next cost of service based rate order","next COS","Rate Rider",null,"$/kW",2.2599999999999999E-2,2.2599999999999999E-2,{"$f":"IFERROR(VLOOKUP(A86,'2. Current Tariff'!A:F,5,FALSE),0)-H86","v":0},{"$f":"IFERROR(VLOOKUP(A86,'20. Final Tariff Schedule'!A:E,5,FALSE),0)-I86","v":0}]
["GS50_MFF20","GS50_FRR","Rate Rider for Recovery of M-factor Capital (2020) - in effect until the effective date of the next cost of service based rate order","next COS","Rate Rider",null,"$",null,{"$f":"ROUND(VLOOKUP(A87,'19. Additional Rates'!$A:$G,4,FALSE),2)","v":0.39},{"$f":"IFERROR(VLOOKUP(A87,'2. Current Tariff'!A:F,5,FALSE),0)-H87","v":0},{"$f":"IFERROR(VLOOKUP(A87,'20. Final Tariff Schedule'!A:E,5,FALSE),0)-I87","v":0}]
["GS50_MFV20","GS50_VRR","Rate Rider for Recovery of M-factor Capital (2020) - in effect until the effective date of the next cost of service based rate order","next COS","Rate Rider",null,"$/kWh",null,{"$f":"ROUND(VLOOKUP(A88,'19. Additional Rates'!$A:$G,4,FALSE),4)","v":2.3400000000000001E-2},{"$f":"IFERROR(VLOOKUP(A88,'2. Current Tariff'!A:F,5,FALSE),0)-H88","v":0},{"$f":"IFERROR(VLOOKUP(A88,'20. Final Tariff Schedule'!A:E,5,FALSE),0)-I88","v":0}]
["GS50_499_ICMF18","GS50_499_FRR","Rate Rider for Recovery of Incremental Capital Module (2018) - in effect until the effective date of the next cost of service based rate order","next COS","Rate Rider",null,"$",0.51,0.51,{"$f":"IFERROR(VLOOKUP(A89,'2. Current Tariff'!A:F,5,FALSE),0)-H89","v":0},{"$f":"IFERROR(VLOOKUP(A89,'20. Final Tariff Schedule'!A:E,5,FALSE),0)-I89","v":0}]
["GS50_499_LRV18",null,"Rate Rider for Disposition of Lost Revenue Adjustment Mechanism Variance Account (LRAMVA) (2018) - effective until April 30, 2019","2019-04-30","Rate Rider",null,"$/kW",0.45850000000000002,null,{"$f":"IFERROR(VLOOKUP(A90,'2. Current Tariff'!A:F,5,FALSE),0)-H90","v":0},{"$f":"IFERROR(VLOOKUP(A90,'20. Final Tariff Schedule'!A:E,5,FALSE),0)-I90","v":0}]
["GS50_499_ICMV18","GS50_499_VRR","Rate Rider for Recovery of Incremental Capital Module (2018) - in effect until the effective date of the next cost of service based rate order","next COS","Rate Rider",null,"$/kW",3.0800000000000001E-2,3.0800000000000001E-2,{"$f":"IFERROR(VLOOKUP(A91,'2. Current Tariff'!A:F,5,FALSE),0)-H91","v":0},{"$f":"IFERROR(VLOOKUP(A91,'20. Final Tariff Schedule'!A:E,5,FALSE),0)-I91","v":0}]
["GS50_499_GA20","GS50_499_GA","Rate Rider for Disposition of Global Adjustment Account (2020) - effective until  December 31, 2020","2020-12-31","Rate Rider","non-RPP","$/kWh",null,{"$f":"+ROUND('6.1 GA'!M19,4)","v":-3.2000000000000002E-3},{"$f":"IFERROR(VLOOKUP(A92,'2. Current Tariff'!A:F,5,FALSE),0)-H92","v":0},{"$f":"IFERROR(VLOOKUP(A92,'20. Final Tariff Schedule'!A:E,5,FALSE),0)-I92","v":0}]
["GS50_499_DVA20","GS50_499_DVA","Rate Rider for Disposition of Deferral/Variance Accounts (2020) - effective until December 31, 2020","2020-12-31","Rate Rider",null,"$/kW",null,{"$f":"+ROUND('8. Calculation of Def-Var RR'!J21,4)","v":0.33},{"$f":"IFERROR(VLOOKUP(A93,'2. Current Tariff'!A:F,5,FALSE),0)-H93","v":0},{"$f":"IFERROR(VLOOKUP(A93,'20. Final Tariff Schedule'!A:E,5,FALSE),0)-I93","v":0}]
["GS50_499_DVA20nonWMP","GS50_499_DVA","Rate Rider for Disposition of Deferral/Variance Accounts (2020) - effective until December 31, 2020\n         Applicable only for Non-Wholesale Market Participants","2020-12-31","Rate Rider",null,"$/kW",null,{"$f":"+ROUND('8. Calculation of Def-Var RR'!K21,4)","v":-0.2152},{"$f":"IFERROR(VLOOKUP(A94,'2. Current Tariff'!A:F,5,FALSE),0)-H94","v":0},{"$f":"IFERROR(VLOOKUP(A94,'20. Final Tariff Schedule'!A:E,5,FALSE),0)-I94","v":0}]
["GS50_499_LRV20","GS50_499_VRR","Rate Rider for Disposition of Lost Revenue Adjustment Mechanism Variance Account (LRAMVA) (2020) - effective until December 31, 2020","2020-12-31","Rate Rider",null,"$/kW",null,{"$f":"+ROUND('8. Calculation of Def-Var RR'!L21,4)","v":0.2379},{"$f":"IFERROR(VLOOKUP(A95,'2. Current Tariff'!A:F,5,FALSE),0)-H95","v":0},{"$f":"IFERROR(VLOOKUP(A95,'20. Final Tariff Schedule'!A:E,5,FALSE),0)-I95","v":0}]
["GS50_499_ICMF20","GS50_499_FRR","Rate Rider for Recovery of Incremental Capital Module (2020) - in effect until the effective date of the next cost of service based rate order","next COS","Rate Rider",null,"$",null,{"$f":"+ROUND('19. Additional Rates'!D39,2)","v":0.39},{"$f":"IFERROR(VLOOKUP(A96,'2. Current Tariff'!A:F,5,FALSE),0)-H96","v":0},{"$f":"IFERROR(VLOOKUP(A96,'20. Final Tariff Schedule'!A:E,5,FALSE),0)-I96","v":0}]
["GS50_499_ICMV20","GS50_499_VRR","Rate Rider for Recovery of Incremental Capital Module (2020) - in effect until the effective date of the next cost of service based rate order","next COS","Rate Rider",null,"$/kW",null,{"$f":"+ROUND('19. Additional Rates'!D40,4)","v":2.3400000000000001E-2},{"$f":"IFERROR(VLOOKUP(A97,'2. Current Tariff'!A:F,5,FALSE),0)-H97","v":0},{"$f":"IFERROR(VLOOKUP(A97,'20. Final Tariff Schedule'!A:E,5,FALSE),0)-I97","v":0}]
["GS50_499_TN","GS50_499_TN","Retail Transmission Rate - Network Service Rate",null,"Rate Rider",null,"$/kW",2.7288999999999999,{"$f":"ROUND(VLOOKUP(B98,RTSR_TY,11,FALSE),4)","v":2.8610000000000002},{"$f":"IFERROR(VLOOKUP(A98,'2. Current Tariff'!A:F,5,FALSE),0)-H98","v":0},{"$f":"IFERROR(VLOOKUP(A98,'20. Final Tariff Schedule'!A:E,5,FALSE),0)-I98","v":0}]
["GS50_499_TC","GS50_499_TC","Retail Transmission Rate - Line and Transformation Connection Service Rate",null,"Rate Rider",null,"$/kW",2.5929000000000002,{"$f":"ROUND(VLOOKUP(B99,RTSR_TY,11,FALSE),4)","v":2.7349000000000001},{"$f":"IFERROR(VLOOKUP(A99,'2. Current Tariff'!A:F,5,FALSE),0)-H99","v":0},{"$f":"IFERROR(VLOOKUP(A99,'20. Final Tariff Schedule'!A:E,5,FALSE),0)-I99","v":0}]
[null,null,"GENERAL SERVICE 500 - 4999 KW",null,"Rate Rider",null,null,null,null,{"$f":"IFERROR(VLOOKUP(A100,'2. Current Tariff'!A:F,5,FALSE),0)-H100","v":0},{"$f":"IFERROR(VLOOKUP(A100,'20. Final Tariff Schedule'!A:E,5,FALSE),0)-I100","v":0}]
["GS500_F","GS500_F","Service Charge",null,"Rate Rider",null,"$",1785.59,{"$f":"ROUND('17. Rev2Cost-GDPIPI'!I20,2)","v":1807.02},{"$f":"IFERROR(VLOOKUP(A101,'2. Current Tariff'!A:F,5,FALSE),0)-H101","v":0},{"$f":"IFERROR(VLOOKUP(A101,'20. Final Tariff Schedule'!A:E,5,FALSE),0)-I101","v":0}]
["GS500_V","GS500_V","Distribution Volumetric Rate",null,"Rate Rider",null,"$/kW",2.4281999999999999,{"$f":"ROUND('17. Rev2Cost-GDPIPI'!J20,4)","v":2.4573},{"$f":"IFERROR(VLOOKUP(A102,'2. Current Tariff'!A:F,5,FALSE),0)-H102","v":0},{"$f":"IFERROR(VLOOKUP(A102,'20. Final Tariff Schedule'!A:E,5,FALSE),0)-I102","v":0}]
["GS500_LV","GS500_LV","Low Voltage Service Rate ",null,"Rate Rider",null,"$/kW",7.8399999999999997E-2,7.8399999999999997E-2,{"$f":"IFERROR(VLOOKUP(A103,'2. Current Tariff'!A:F,5,FALSE),0)-H103","v":0},{"$f":"IFERROR(VLOOKUP(A103,'20. Final Tariff Schedule'!A:E,5,FALSE),0)-I103","v":0}]
["GS500_TA",null,"Transformer Discount",null,"Rate Rider",null,"$/kW",-0.4,-0.4,{"$f":"IFERROR(VLOOKUP(A104,'2. Current Tariff'!A:F,5,FALSE),0)-H104","v":0.4},{"$f":"IFERROR(VLOOKUP(A104,'20. Final Tariff Schedule'!A:E,5,FALSE),0)-I104","v":0.4}]
["GS500_FRR19","GS500_FRR","Rate Rider for Recovery of 2019 Foregone Revenue - effective until December 31, 2019","2019-12-31","Rate Rider",null,"$",3.96,null,{"$f":"IFERROR(VLOOKUP(A105,'2. Current Tariff'!A:F,5,FALSE),0)-H105","v":0},{"$f":"IFERROR(VLOOKUP(A105,'20. Final Tariff Schedule'!A:E,5,FALSE),0)-I105","v":0}]
["GS500_ICMF17","GS500_FRR","Rate Rider for Recovery of Incremental Capital Module (2017) - in effect until the effective date of the next cost of service based rate order","next COS","Rate Rider",null,"$",44,44,{"$f":"IFERROR(VLOOKUP(A106,'2. Current Tariff'!A:F,5,FALSE),0)-H106","v":0},{"$f":"IFERROR(VLOOKUP(A106,'20. Final Tariff Schedule'!A:E,5,FALSE),0)-I106","v":0}]
["GS500_GA18",null,"Rate Rider for Disposition of Global Adjustment Account (2018) - effective until  April 30, 2019\n        Applicable only for Non-RPP Customers","2019-04-30","Rate Rider",null,"$/kWh",-5.0000000000000001E-4,null,{"$f":"IFERROR(VLOOKUP(A107,'2. Current Tariff'!A:F,5,FALSE),0)-H107","v":0},{"$f":"IFERROR(VLOOKUP(A107,'20. Final Tariff Schedule'!A:E,5,FALSE),0)-I107","v":0}]
["GS500_DVA18",null,"Rate Rider for Disposition of Deferral/Variance Accounts (2018) - effective until April 30, 2019","2019-04-30","Rate Rider",null,"$/kW",0.12720000000000001,null,{"$f":"IFERROR(VLOOKUP(A108,'2. Current Tariff'!A:F,5,FALSE),0)-H108","v":0},{"$f":"IFERROR(VLOOKUP(A108,'20. Final Tariff Schedule'!A:E,5,FALSE),0)-I108","v":0}]
["GS500_DVA18nonWMP",null,"Rate Rider for Disposition of Deferral/Variance Accounts (2018) - effective until April 30, 2019\n         Applicable only for Non-Wholesale Market Participants","2019-04-30","Rate Rider",null,"$/kW",-0.44650000000000001,null,{"$f":"IFERROR(VLOOKUP(A109,'2. Current Tariff'!A:F,5,FALSE),0)-H109","v":0},{"$f":"IFERROR(VLOOKUP(A109,'20. Final Tariff Schedule'!A:E,5,FALSE),0)-I109","v":0}]
["GS500_ICMV17","GS500_VRR","Rate Rider for Recovery of Incremental Capital Module (2017) - in effect until the effective date of the next cost of service based rate order","next COS","Rate Rider",null,"$/kW",5.9799999999999999E-2,5.9799999999999999E-2,{"$f":"IFERROR(VLOOKUP(A110,'2. Current Tariff'!A:F,5,FALSE),0)-H110","v":0},{"$f":"IFERROR(VLOOKUP(A110,'20. Final Tariff Schedule'!A:E,5,FALSE),0)-I110","v":0}]
["GS500_CBR18",null,"Rate Rider for Disposition of Capacity Based Recovery Account (2018) - effective until April 30, 2019\n        Applicable Only for Non-WMP Class B Customers","2019-04-30","Rate Rider",null,"$/kW",-1.9990000000000001E-2,null,{"$f":"IFERROR(VLOOKUP(A111,'2. Current Tariff'!A:F,5,FALSE),0)-H111","v":0},{"$f":"IFERROR(VLOOKUP(A111,'20. Final Tariff Schedule'!A:E,5,FALSE),0)-I111","v":0}]
["GS500_GA19","GS500_GA","Rate Rider for Disposition of Global Adjustment Account (2019) - effective until  December 31, 2019\n        Applicable only for Non-RPP Customers","2019-12-31","Rate Rider",null,"$/kWh",2.5999999999999999E-3,null,{"$f":"IFERROR(VLOOKUP(A112,'2. Current Tariff'!A:F,5,FALSE),0)-H112","v":0},{"$f":"IFERROR(VLOOKUP(A112,'20. Final Tariff Schedule'!A:E,5,FALSE),0)-I112","v":0}]
["GS500_DVA19nonWMP","GS500_DVA","Rate Rider for Disposition of Deferral/Variance Accounts (2019) - effective until December 31, 2019\n          Applicable only for Non-Wholesale Market Participants","2019-12-31","Rate Rider",null,"$/kW",-0.47739999999999999,null,{"$f":"IFERROR(VLOOKUP(A113,'2. Current Tariff'!A:F,5,FALSE),0)-H113","v":0},{"$f":"IFERROR(VLOOKUP(A113,'20. Final Tariff Schedule'!A:E,5,FALSE),0)-I113","v":0}]
["GS500_DVA19","GS500_DVA","Rate Rider for Disposition of Deferral/Variance Accounts (2019) - effective until December 31, 2019","2019-12-31","Rate Rider",null,"$/kW",0.3019,null,{"$f":"IFERROR(VLOOKUP(A114,'2. Current Tariff'!A:F,5,FALSE),0)-H114","v":0},{"$f":"IFERROR(VLOOKUP(A114,'20. Final Tariff Schedule'!A:E,5,FALSE),0)-I114","v":0}]
["GS500_CBR20","GS500_DVA","Rate Rider for Disposition of Capacity Based Recovery Account (2020) - effective until December 31, 2020\n        Applicable Only for Non-WMP Class  B Customers","2020-12-31","Rate Rider",null,"$/kW",null,{"$f":"+ROUND(VLOOKUP(A115,'6.2 CBR B'!$A:$M,13,FALSE),4)","v":-4.0800000000000003E-2},{"$f":"IFERROR(VLOOKUP(A115,'2. Current Tariff'!A:F,5,FALSE),0)-H115","v":0},{"$f":"IFERROR(VLOOKUP(A115,'20. Final Tariff Schedule'!A:E,5,FALSE),0)-I115","v":0}]
["GS500_LRV19","GS500_VRR","Rate Rider for Disposition of Lost Revenue Adjustment Mechanism Variance Account (LRAMVA) (2019) - effective until December 31, 2019","2019-12-31","Rate Rider",null,"$/kW",0.10009999999999999,null,{"$f":"IFERROR(VLOOKUP(A116,'2. Current Tariff'!A:F,5,FALSE),0)-H116","v":0},{"$f":"IFERROR(VLOOKUP(A116,'20. Final Tariff Schedule'!A:E,5,FALSE),0)-I116","v":0}]
["GS500_ICMF19","GS500_FRR","Rate Rider for Recovery of Incremental Capital Module (2019) - in effect until the effective date of the next cost of service based rate order","next COS","Rate Rider",null,"$",8.5399999999999991,8.5399999999999991,{"$f":"IFERROR(VLOOKUP(A117,'2. Current Tariff'!A:F,5,FALSE),0)-H117","v":0},{"$f":"IFERROR(VLOOKUP(A117,'20. Final Tariff Schedule'!A:E,5,FALSE),0)-I117","v":0}]
["GS500_ICMV19","GS500_VRR","Rate Rider for Recovery of Incremental Capital Module (2019) - in effect until the effective date of the next cost of service based rate order","next COS","Rate Rider",null,"$/kW",1.1599999999999999E-2,1.1599999999999999E-2,{"$f":"IFERROR(VLOOKUP(A118,'2. Current Tariff'!A:F,5,FALSE),0)-H118","v":0},{"$f":"IFERROR(VLOOKUP(A118,'20. Final Tariff Schedule'!A:E,5,FALSE),0)-I118","v":0}]
["GS500_MFF20","GS500_FRR","Rate Rider for Recovery of M-factor Capital (2020) - in effect until the effective date of the next cost of service based rate order","next COS","Rate Rider",null,"$",null,{"$f":"ROUND(VLOOKUP(A119,'19. Additional Rates'!$A:$G,4,FALSE),2)","v":8.8699999999999992},{"$f":"IFERROR(VLOOKUP(A119,'2. Current Tariff'!A:F,5,FALSE),0)-H119","v":0},{"$f":"IFERROR(VLOOKUP(A119,'20. Final Tariff Schedule'!A:E,5,FALSE),0)-I119","v":0}]
["GS500_MFV20","GS500_VRR","Rate Rider for Recovery of M-factor Capital (2020) - in effect until the effective date of the next cost of service based rate order","next COS","Rate Rider",null,"$/kWh",null,{"$f":"ROUND(VLOOKUP(A120,'19. Additional Rates'!$A:$G,4,FALSE),4)","v":1.21E-2},{"$f":"IFERROR(VLOOKUP(A120,'2. Current Tariff'!A:F,5,FALSE),0)-H120","v":0},{"$f":"IFERROR(VLOOKUP(A120,'20. Final Tariff Schedule'!A:E,5,FALSE),0)-I120","v":0}]
["GS500_ICMF18","GS500_FRR","Rate Rider for Recovery of Incremental Capital Module (2018) - in effect until the effective date of the next cost of service based rate order","next COS","Rate Rider",null,"$",11.65,11.65,{"$f":"IFERROR(VLOOKUP(A121,'2. Current Tariff'!A:F,5,FALSE),0)-H121","v":0},{"$f":"IFERROR(VLOOKUP(A121,'20. Final Tariff Schedule'!A:E,5,FALSE),0)-I121","v":0}]
["GS500_LRV18",null,"Rate Rider for Disposition of Lost Revenue Adjustment Mechanism Variance Account (LRAMVA) (2018) - effective until April 30, 2019","2019-04-30","Rate Rider",null,"$/kW",0.14099999999999999,null,{"$f":"IFERROR(VLOOKUP(A122,'2. Current Tariff'!A:F,5,FALSE),0)-H122","v":0},{"$f":"IFERROR(VLOOKUP(A122,'20. Final Tariff Schedule'!A:E,5,FALSE),0)-I122","v":0}]
["GS500_ICMV18","GS500_VRR","Rate Rider for Recovery of Incremental Capital Module (2018) - in effect until the effective date of the next cost of service based rate order","next COS","Rate Rider",null,"$/kW",1.5800000000000002E-2,1.5800000000000002E-2,{"$f":"IFERROR(VLOOKUP(A123,'2. Current Tariff'!A:F,5,FALSE),0)-H123","v":0},{"$f":"IFERROR(VLOOKUP(A123,'20. Final Tariff Schedule'!A:E,5,FALSE),0)-I123","v":0}]
["GS500_GA20","GS500_GA","Rate Rider for Disposition of Global Adjustment Account (2020) - effective until  December 31, 2020","2020-12-31","Rate Rider","non-RPP","$/kWh",null,{"$f":"+ROUND('6.1 GA'!M20,4)","v":-3.2000000000000002E-3},{"$f":"IFERROR(VLOOKUP(A124,'2. Current Tariff'!A:F,5,FALSE),0)-H124","v":0},{"$f":"IFERROR(VLOOKUP(A124,'20. Final Tariff Schedule'!A:E,5,FALSE),0)-I124","v":0}]
["GS500_DVA20","GS500_DVA","Rate Rider for Disposition of Deferral/Variance Accounts (2020) - effective until December 31, 2020","2020-12-31","Rate Rider",null,"$/kW",null,{"$f":"+ROUND('8. Calculation of Def-Var RR'!J22,4)","v":0.40839999999999999},{"$f":"IFERROR(VLOOKUP(A125,'2. Current Tariff'!A:F,5,FALSE),0)-H125","v":0},{"$f":"IFERROR(VLOOKUP(A125,'20. Final Tariff Schedule'!A:E,5,FALSE),0)-I125","v":0}]
["GS500_DVA20nonWMP","GS500_DVA","Rate Rider for Disposition of Deferral/Variance Accounts (2020) - effective until December 31, 2020\n         Applicable only for Non-Wholesale Market Participants","2020-12-31","Rate Rider",null,"$/kW",null,{"$f":"+ROUND('8. Calculation of Def-Var RR'!K22,4)","v":-0.26590000000000003},{"$f":"IFERROR(VLOOKUP(A126,'2. Current Tariff'!A:F,5,FALSE),0)-H126","v":0},{"$f":"IFERROR(VLOOKUP(A126,'20. Final Tariff Schedule'!A:E,5,FALSE),0)-I126","v":0}]
["GS500_LRV20","GS500_VRR","Rate Rider for Disposition of Lost Revenue Adjustment Mechanism Variance Account (LRAMVA) (2020) - effective until December 31, 2020","2020-12-31","Rate Rider",null,"$/kW",null,{"$f":"+ROUND('8. Calculation of Def-Var RR'!L22,4)","v":0.1033},{"$f":"IFERROR(VLOOKUP(A127,'2. Current Tariff'!A:F,5,FALSE),0)-H127","v":0},{"$f":"IFERROR(VLOOKUP(A127,'20. Final Tariff Schedule'!A:E,5,FALSE),0)-I127","v":0}]
["GS500_ICMF20","GS500_FRR","Rate Rider for Recovery of Incremental Capital Module (2020) - in effect until the effective date of the next cost of service based rate order","next COS","Rate Rider",null,"$",null,{"$f":"+ROUND('19. Additional Rates'!D75,2)","v":8.8699999999999992},{"$f":"IFERROR(VLOOKUP(A128,'2. Current Tariff'!A:F,5,FALSE),0)-H128","v":0},{"$f":"IFERROR(VLOOKUP(A128,'20. Final Tariff Schedule'!A:E,5,FALSE),0)-I128","v":0}]
["GS500_ICMV20","GS500_VRR","Rate Rider for Recovery of Incremental Capital Module (2020) - in effect until the effective date of the next cost of service based rate order","next COS","Rate Rider",null,"$/kW",null,{"$f":"+ROUND('19. Additional Rates'!D76,4)","v":1.21E-2},{"$f":"IFERROR(VLOOKUP(A129,'2. Current Tariff'!A:F,5,FALSE),0)-H129","v":0},{"$f":"IFERROR(VLOOKUP(A129,'20. Final Tariff Schedule'!A:E,5,FALSE),0)-I129","v":0}]
["GS500_TN","GS500_TN","Retail Transmission Rate - Network Service Rate",null,"Rate Rider",null,"$/kW",2.6402000000000001,{"$f":"ROUND(VLOOKUP(B130,RTSR_TY,11,FALSE),4)","v":2.7679999999999998},{"$f":"IFERROR(VLOOKUP(A130,'2. Current Tariff'!A:F,5,FALSE),0)-H130","v":0},{"$f":"IFERROR(VLOOKUP(A130,'20. Final Tariff Schedule'!A:E,5,FALSE),0)-I130","v":0}]
["GS500_TC","GS500_TC","Retail Transmission Rate - Line and Transformation Connection Service Rate",null,"Rate Rider",null,"$/kW",2.5373000000000001,{"$f":"ROUND(VLOOKUP(B131,RTSR_TY,11,FALSE),4)","v":2.6762999999999999},{"$f":"IFERROR(VLOOKUP(A131,'2. Current Tariff'!A:F,5,FALSE),0)-H131","v":0},{"$f":"IFERROR(VLOOKUP(A131,'20. Final Tariff Schedule'!A:E,5,FALSE),0)-I131","v":0}]
[null,null,"LARGE USE",null,"Rate Rider",null,null,null,null,{"$f":"IFERROR(VLOOKUP(A132,'2. Current Tariff'!A:F,5,FALSE),0)-H132","v":0},{"$f":"IFERROR(VLOOKUP(A132,'20. Final Tariff Schedule'!A:E,5,FALSE),0)-I132","v":0}]
["LU_F","LU_F","Service Charge",null,"Rate Rider",null,"$",14078.67,{"$f":"ROUND('17. Rev2Cost-GDPIPI'!I21,2)","v":14247.61},{"$f":"IFERROR(VLOOKUP(A133,'2. Current Tariff'!A:F,5,FALSE),0)-H133","v":0},{"$f":"IFERROR(VLOOKUP(A133,'20. Final Tariff Schedule'!A:E,5,FALSE),0)-I133","v":0}]
["LU_V","LU_V","Distribution Volumetric Rate",null,"Rate Rider",null,"$/kW",3.0139,{"$f":"ROUND('17. Rev2Cost-GDPIPI'!J21,4)","v":3.0501},{"$f":"IFERROR(VLOOKUP(A134,'2. Current Tariff'!A:F,5,FALSE),0)-H134","v":0},{"$f":"IFERROR(VLOOKUP(A134,'20. Final Tariff Schedule'!A:E,5,FALSE),0)-I134","v":0}]
["LU_LV","LU_LV","Low Voltage Service Rate ",null,"Rate Rider",null,"$/kW",8.3799999999999999E-2,8.3799999999999999E-2,{"$f":"IFERROR(VLOOKUP(A135,'2. Current Tariff'!A:F,5,FALSE),0)-H135","v":0},{"$f":"IFERROR(VLOOKUP(A135,'20. Final Tariff Schedule'!A:E,5,FALSE),0)-I135","v":0}]
["LU_TA",null,"Transformer Discount",null,"Rate Rider",null,"$/kW",-0.4,-0.4,{"$f":"IFERROR(VLOOKUP(A136,'2. Current Tariff'!A:F,5,FALSE),0)-H136","v":0.4},{"$f":"IFERROR(VLOOKUP(A136,'20. Final Tariff Schedule'!A:E,5,FALSE),0)-I136","v":0.4}]
["LU_FRR19","LU_FRR","Rate Rider for Recovery of 2019 Foregone Revenue - effective until December 31, 2019","2019-12-31","Rate Rider",null,"$",64.34,null,{"$f":"IFERROR(VLOOKUP(A137,'2. Current Tariff'!A:F,5,FALSE),0)-H137","v":0},{"$f":"IFERROR(VLOOKUP(A137,'20. Final Tariff Schedule'!A:E,5,FALSE),0)-I137","v":0}]
["LU_ICMF17","LU_FRR","Rate Rider for Recovery of Incremental Capital Module (2017) - in effect until the effective date of the next cost of service based rate order","next COS","Rate Rider",null,"$",346.9,346.9,{"$f":"IFERROR(VLOOKUP(A138,'2. Current Tariff'!A:F,5,FALSE),0)-H138","v":0},{"$f":"IFERROR(VLOOKUP(A138,'20. Final Tariff Schedule'!A:E,5,FALSE),0)-I138","v":0}]
["LU_DVA18",null,"Rate Rider for Disposition of Deferral/Variance Accounts (2018) - effective until April 30, 2019","2019-04-30","Rate Rider",null,"$/kW",-0.40539999999999998,null,{"$f":"IFERROR(VLOOKUP(A139,'2. Current Tariff'!A:F,5,FALSE),0)-H139","v":0},{"$f":"IFERROR(VLOOKUP(A139,'20. Final Tariff Schedule'!A:E,5,FALSE),0)-I139","v":0}]
["LU_ICMV17","LU_VRR","Rate Rider for Recovery of Incremental Capital Module (2017) - in effect until the effective date of the next cost of service based rate order","next COS","Rate Rider",null,"$/kW",7.4300000000000005E-2,7.4300000000000005E-2,{"$f":"IFERROR(VLOOKUP(A140,'2. Current Tariff'!A:F,5,FALSE),0)-H140","v":0},{"$f":"IFERROR(VLOOKUP(A140,'20. Final Tariff Schedule'!A:E,5,FALSE),0)-I140","v":0}]
["LU_GA19","LU_GA","Rate Rider for Disposition of Global Adjustment Account (2019) - effective until  December 31, 2019\n        Applicable only for Non-RPP Customers","2019-12-31","Rate Rider",null,"$/kWh",0,0,{"$f":"IFERROR(VLOOKUP(A141,'2. Current Tariff'!A:F,5,FALSE),0)-H141","v":0},{"$f":"IFERROR(VLOOKUP(A141,'20. Final Tariff Schedule'!A:E,5,FALSE),0)-I141","v":0}]
["LU_DVA19","LU_DVA","Rate Rider for Disposition of Deferral/Variance Accounts (2019) - effective until December 31, 2019","2019-12-31","Rate Rider",null,"$/kW",-0.22639999999999999,null,{"$f":"IFERROR(VLOOKUP(A142,'2. Current Tariff'!A:F,5,FALSE),0)-H142","v":0},{"$f":"IFERROR(VLOOKUP(A142,'20. Final Tariff Schedule'!A:E,5,FALSE),0)-I142","v":0}]
["LU_CBR20","LU_DVA","Rate Rider for Disposition of Capacity Based Recovery Account (2020) - effective until December 31, 2020\n        Applicable Only for Non-WMP Class  B Customers","2020-12-31","Rate Rider",null,"$/kW",null,{"$f":"+ROUND(VLOOKUP(A143,'6.2 CBR B'!$A:$M,13,FALSE),4)","v":0},{"$f":"IFERROR(VLOOKUP(A143,'2. Current Tariff'!A:F,5,FALSE),0)-H143","v":0},{"$f":"IFERROR(VLOOKUP(A143,'20. Final Tariff Schedule'!A:E,5,FALSE),0)-I143","v":0}]
["LU_LRV19","LU_VRR","Rate Rider for Disposition of Lost Revenue Adjustment Mechanism Variance Account (LRAMVA) (2019) - effective until December 31, 2019","2019-12-31","Rate Rider",null,"$/kW",9.4100000000000003E-2,null,{"$f":"IFERROR(VLOOKUP(A144,'2. Current Tariff'!A:F,5,FALSE),0)-H144","v":0},{"$f":"IFERROR(VLOOKUP(A144,'20. Final Tariff Schedule'!A:E,5,FALSE),0)-I144","v":0}]
["LU_ICMF19","LU_FRR","Rate Rider for Recovery of Incremental Capital Module (2019) - in effect until the effective date of the next cost of service based rate order","next COS","Rate Rider",null,"$",67.349999999999994,67.349999999999994,{"$f":"IFERROR(VLOOKUP(A145,'2. Current Tariff'!A:F,5,FALSE),0)-H145","v":0},{"$f":"IFERROR(VLOOKUP(A145,'20. Final Tariff Schedule'!A:E,5,FALSE),0)-I145","v":0}]
["LU_ICMV19","LU_VRR","Rate Rider for Recovery of Incremental Capital Module (2019) - in effect until the effective date of the next cost of service based rate order","next COS","Rate Rider",null,"$/kW",1.44E-2,1.44E-2,{"$f":"IFERROR(VLOOKUP(A146,'2. Current Tariff'!A:F,5,FALSE),0)-H146","v":0},{"$f":"IFERROR(VLOOKUP(A146,'20. Final Tariff Schedule'!A:E,5,FALSE),0)-I146","v":0}]
["LU_MFF20","LU_FRR","Rate Rider for Recovery of M-factor Capital (2020) - in effect until the effective date of the next cost of service based rate order","next COS","Rate Rider",null,"$",null,{"$f":"ROUND(VLOOKUP(A147,'19. Additional Rates'!$A:$G,4,FALSE),2)","v":69.94},{"$f":"IFERROR(VLOOKUP(A147,'2. Current Tariff'!A:F,5,FALSE),0)-H147","v":0},{"$f":"IFERROR(VLOOKUP(A147,'20. Final Tariff Schedule'!A:E,5,FALSE),0)-I147","v":0}]
["LU_MFV20","LU_VRR","Rate Rider for Recovery of M-factor Capital (2020) - in effect until the effective date of the next cost of service based rate order","next COS","Rate Rider",null,"$/kWh",null,{"$f":"ROUND(VLOOKUP(A148,'19. Additional Rates'!$A:$G,4,FALSE),4)","v":1.4999999999999999E-2},{"$f":"IFERROR(VLOOKUP(A148,'2. Current Tariff'!A:F,5,FALSE),0)-H148","v":0},{"$f":"IFERROR(VLOOKUP(A148,'20. Final Tariff Schedule'!A:E,5,FALSE),0)-I148","v":0}]
["LU_LRV18",null,"Rate Rider for Disposition of Lost Revenue Adjustment Mechanism Variance Account (LRAMVA) (2018) - effective until April 30, 2019","2019-04-30","Rate Rider",null,"$/kW",8.7999999999999995E-2,null,{"$f":"IFERROR(VLOOKUP(A149,'2. Current Tariff'!A:F,5,FALSE),0)-H149","v":0},{"$f":"IFERROR(VLOOKUP(A149,'20. Final Tariff Schedule'!A:E,5,FALSE),0)-I149","v":0}]
["LU_ICMV18","LU_VRR","Rate Rider for Recovery of Incremental Capital Module (2018) - in effect until the effective date of the next cost of service based rate order","next COS","Rate Rider",null,"$/kW",1.9699999999999999E-2,1.9699999999999999E-2,{"$f":"IFERROR(VLOOKUP(A150,'2. Current Tariff'!A:F,5,FALSE),0)-H150","v":0},{"$f":"IFERROR(VLOOKUP(A150,'20. Final Tariff Schedule'!A:E,5,FALSE),0)-I150","v":0}]
["LU_ICMF18","LU_FRR","Rate Rider for Recovery of Incremental Capital Module (2018) - in effect until the effective date of the next cost of service based rate order","next COS","Rate Rider",null,"$",91.89,91.89,{"$f":"IFERROR(VLOOKUP(A151,'2. Current Tariff'!A:F,5,FALSE),0)-H151","v":0},{"$f":"IFERROR(VLOOKUP(A151,'20. Final Tariff Schedule'!A:E,5,FALSE),0)-I151","v":0}]
["LU_GA20","LU_GA","Rate Rider for Disposition of Global Adjustment Account (2020) - effective until  December 31, 2020","2020-12-31","Rate Rider","non-RPP","$/kWh",null,{"$f":"+ROUND('6.1 GA'!M21,4)","v":0},{"$f":"IFERROR(VLOOKUP(A152,'2. Current Tariff'!A:F,5,FALSE),0)-H152","v":0},{"$f":"IFERROR(VLOOKUP(A152,'20. Final Tariff Schedule'!A:E,5,FALSE),0)-I152","v":0}]
["LU_DVA20","LU_DVA","Rate Rider for Disposition of Deferral/Variance Accounts (2020) - effective until December 31, 2020","2020-12-31","Rate Rider",null,"$/kW",null,{"$f":"+ROUND('8. Calculation of Def-Var RR'!J23,4)","v":0.1787},{"$f":"IFERROR(VLOOKUP(A153,'2. Current Tariff'!A:F,5,FALSE),0)-H153","v":0},{"$f":"IFERROR(VLOOKUP(A153,'20. Final Tariff Schedule'!A:E,5,FALSE),0)-I153","v":0}]
["LU_DVA20nonWMP","LU_DVA","Rate Rider for Disposition of Deferral/Variance Accounts (2020) - effective until December 31, 2020\n         Applicable only for Non-Wholesale Market Participants","2020-12-31","Rate Rider",null,"$/kW",null,{"$f":"+ROUND('8. Calculation of Def-Var RR'!K23,4)","v":0},{"$f":"IFERROR(VLOOKUP(A154,'2. Current Tariff'!A:F,5,FALSE),0)-H154","v":0},{"$f":"IFERROR(VLOOKUP(A154,'20. Final Tariff Schedule'!A:E,5,FALSE),0)-I154","v":0}]
["LU_LRV20","LU_VRR","Rate Rider for Disposition of Lost Revenue Adjustment Mechanism Variance Account (LRAMVA) (2020) - effective until December 31, 2020","2020-12-31","Rate Rider",null,"$/kW",null,{"$f":"+ROUND('8. Calculation of Def-Var RR'!L23,4)","v":9.2999999999999999E-2},{"$f":"IFERROR(VLOOKUP(A155,'2. Current Tariff'!A:F,5,FALSE),0)-H155","v":0},{"$f":"IFERROR(VLOOKUP(A155,'20. Final Tariff Schedule'!A:E,5,FALSE),0)-I155","v":0}]
["LU_ICMF20","LU_FRR","Rate Rider for Recovery of Incremental Capital Module (2020) - in effect until the effective date of the next cost of service based rate order","next COS","Rate Rider",null,"$",null,{"$f":"+ROUND('19. Additional Rates'!D51,2)","v":69.94},{"$f":"IFERROR(VLOOKUP(A156,'2. Current Tariff'!A:F,5,FALSE),0)-H156","v":0},{"$f":"IFERROR(VLOOKUP(A156,'20. Final Tariff Schedule'!A:E,5,FALSE),0)-I156","v":0}]
["LU_ICMV20","LU_VRR","Rate Rider for Recovery of Incremental Capital Module (2020) - in effect until the effective date of the next cost of service based rate order","next COS","Rate Rider",null,"$/kW",null,{"$f":"+ROUND('19. Additional Rates'!D52,4)","v":1.4999999999999999E-2},{"$f":"IFERROR(VLOOKUP(A157,'2. Current Tariff'!A:F,5,FALSE),0)-H157","v":0},{"$f":"IFERROR(VLOOKUP(A157,'20. Final Tariff Schedule'!A:E,5,FALSE),0)-I157","v":0}]
["LU_TN","LU_TN","Retail Transmission Rate - Network Service Rate – Interval Metered",null,"Rate",null,"$/kW",2.8174000000000001,{"$f":"ROUND(VLOOKUP(B158,RTSR_TY,11,FALSE),4)","v":2.9538000000000002},{"$f":"IFERROR(VLOOKUP(A158,'2. Current Tariff'!A:F,5,FALSE),0)-H158","v":0},{"$f":"IFERROR(VLOOKUP(A158,'20. Final Tariff Schedule'!A:E,5,FALSE),0)-I158","v":0}]
["LU_TC","LU_TC","Retail Transmission Rate - Line and Transformation Connection Service Rate – Interval Metered ",null,"Rate",null,"$/kW",2.71,{"$f":"ROUND(VLOOKUP(B159,RTSR_TY,11,FALSE),4)","v":2.8584000000000001},{"$f":"IFERROR(VLOOKUP(A159,'2. Current Tariff'!A:F,5,FALSE),0)-H159","v":0},{"$f":"IFERROR(VLOOKUP(A159,'20. Final Tariff Schedule'!A:E,5,FALSE),0)-I159","v":0}]
[null,null,"UNMETERED SCATTERED LOAD",null,null,null,null,null,null,{"$f":"IFERROR(VLOOKUP(A160,'2. Current Tariff'!A:F,5,FALSE),0)-H160","v":0},{"$f":"IFERROR(VLOOKUP(A160,'20. Final Tariff Schedule'!A:E,5,FALSE),0)-I160","v":0}]
["USL_F","USL_F","Service Charge",null,"Rate",null,"$",9.19,{"$f":"ROUND('17. Rev2Cost-GDPIPI'!I23,2)","v":9.3000000000000007},{"$f":"IFERROR(VLOOKUP(A161,'2. Current Tariff'!A:F,5,FALSE),0)-H161","v":0},{"$f":"IFERROR(VLOOKUP(A161,'20. Final Tariff Schedule'!A:E,5,FALSE),0)-I161","v":0}]
["USL_V","USL_V","Distribution Volumetric Rate",null,"Rate",null,"$/kWh",1.67E-2,{"$f":"ROUND('17. Rev2Cost-GDPIPI'!J23,4)","v":1.6899999999999998E-2},{"$f":"IFERROR(VLOOKUP(A162,'2. Current Tariff'!A:F,5,FALSE),0)-H162","v":0},{"$f":"IFERROR(VLOOKUP(A162,'20. Final Tariff Schedule'!A:E,5,FALSE),0)-I162","v":0}]
["USL_LV","USL_LV","Low Voltage Service Rate ",null,"Rate",null,"$/kWh",2.0000000000000001E-4,2.0000000000000001E-4,{"$f":"IFERROR(VLOOKUP(A163,'2. Current Tariff'!A:F,5,FALSE),0)-H163","v":0},{"$f":"IFERROR(VLOOKUP(A163,'20. Final Tariff Schedule'!A:E,5,FALSE),0)-I163","v":0}]
["USL_FRR19","USL_FRR","Rate Rider for Recovery of 2019 Foregone Revenue - effective until December 31, 2019","2019-12-31","Rate Rider",null,"$",0.02,null,{"$f":"IFERROR(VLOOKUP(A164,'2. Current Tariff'!A:F,5,FALSE),0)-H164","v":0},{"$f":"IFERROR(VLOOKUP(A164,'20. Final Tariff Schedule'!A:E,5,FALSE),0)-I164","v":0}]
["USL_ICMF17","USL_FRR","Rate Rider for Recovery of Incremental Capital Module (2017) - in effect until the effective date of the next cost of service based rate order","next COS","Rate Rider",null,"$",0.23,0.23,{"$f":"IFERROR(VLOOKUP(A165,'2. Current Tariff'!A:F,5,FALSE),0)-H165","v":0},{"$f":"IFERROR(VLOOKUP(A165,'20. Final Tariff Schedule'!A:E,5,FALSE),0)-I165","v":0}]
["USL_GA18",null,"Rate Rider for Disposition of Global Adjustment Account (2018) - effective until  April 30, 2019\n        Applicable only for Non-RPP Customers","2019-04-30","Rate Rider",null,"$/kWh",-5.0000000000000001E-4,null,{"$f":"IFERROR(VLOOKUP(A166,'2. Current Tariff'!A:F,5,FALSE),0)-H166","v":0},{"$f":"IFERROR(VLOOKUP(A166,'20. Final Tariff Schedule'!A:E,5,FALSE),0)-I166","v":0}]
["USL_DVA18",null,"Rate Rider for Disposition of Deferral/Variance Accounts (2018) - effective until April 30, 2019","2019-04-30","Rate Rider",null,"$/kWh",-6.9999999999999999E-4,null,{"$f":"IFERROR(VLOOKUP(A167,'2. Current Tariff'!A:F,5,FALSE),0)-H167","v":0},{"$f":"IFERROR(VLOOKUP(A167,'20. Final Tariff Schedule'!A:E,5,FALSE),0)-I167","v":0}]
["USL_ICMV17","USL_VRR","Rate Rider for Recovery of Incremental Capital Module (2017) - in effect until the effective date of the next cost of service based rate order","next COS","Rate Rider",null,"$/kWh",4.0000000000000002E-4,4.0000000000000002E-4,{"$f":"IFERROR(VLOOKUP(A168,'2. Current Tariff'!A:F,5,FALSE),0)-H168","v":0},{"$f":"IFERROR(VLOOKUP(A168,'20. Final Tariff Schedule'!A:E,5,FALSE),0)-I168","v":0}]
["USL_CBR18",null,"Rate Rider for Disposition of Capacity Based Recovery Account (2018) - effective until April 30, 2019\n        Applicable Only for Class B Customers","2019-04-30","Rate Rider",null,"$/kWh",-5.0000000000000002E-5,null,{"$f":"IFERROR(VLOOKUP(A169,'2. Current Tariff'!A:F,5,FALSE),0)-H169","v":0},{"$f":"IFERROR(VLOOKUP(A169,'20. Final Tariff Schedule'!A:E,5,FALSE),0)-I169","v":0}]
["USL_GA19","USL_GA","Rate Rider for Disposition of Global Adjustment Account (2019) - effective until  December 31, 2019\n        Applicable only for Non-RPP Customers","2019-12-31","Rate Rider",null,"$/kWh",1.9E-3,null,{"$f":"IFERROR(VLOOKUP(A170,'2. Current Tariff'!A:F,5,FALSE),0)-H170","v":0},{"$f":"IFERROR(VLOOKUP(A170,'20. Final Tariff Schedule'!A:E,5,FALSE),0)-I170","v":0}]
["USL_DVA19","USL_DVA","Rate Rider for Disposition of Deferral/Variance Accounts (2019) - effective until December 31, 2019","2019-12-31","Rate Rider",null,"$/kWh",-4.0000000000000002E-4,null,{"$f":"IFERROR(VLOOKUP(A171,'2. Current Tariff'!A:F,5,FALSE),0)-H171","v":0},{"$f":"IFERROR(VLOOKUP(A171,'20. Final Tariff Schedule'!A:E,5,FALSE),0)-I171","v":0}]
["USL_CBR20","USL_DVA","Rate Rider for Disposition of Capacity Based Recovery Account (2020) - effective until December 31, 2020\n        Applicable Only for Class B Customers","2020-12-31","Rate Rider",null,"$/kWh",null,{"$f":"+ROUND(VLOOKUP(A172,'6.2 CBR B'!$A:$M,13,FALSE),4)","v":-1E-4},{"$f":"IFERROR(VLOOKUP(A172,'2. Current Tariff'!A:F,5,FALSE),0)-H172","v":0},{"$f":"IFERROR(VLOOKUP(A172,'20. Final Tariff Schedule'!A:E,5,FALSE),0)-I172","v":0}]
["USL_LRV19","USL_VRR","Rate Rider for Disposition of Lost Revenue Adjustment Mechanism Variance Account (LRAMVA) (2019) - effective until December 31, 2019","2019-12-31","Rate Rider",null,"$/kWh",0,null,{"$f":"IFERROR(VLOOKUP(A173,'2. Current Tariff'!A:F,5,FALSE),0)-H173","v":0},{"$f":"IFERROR(VLOOKUP(A173,'20. Final Tariff Schedule'!A:E,5,FALSE),0)-I173","v":0}]
["USL_ICMF19","USL_FRR","Rate Rider for Recovery of Incremental Capital Module (2019) - in effect until the effective date of the next cost of service based rate order","next COS","Rate Rider",null,"$",0.04,0.04,{"$f":"IFERROR(VLOOKUP(A174,'2. Current Tariff'!A:F,5,FALSE),0)-H174","v":0},{"$f":"IFERROR(VLOOKUP(A174,'20. Final Tariff Schedule'!A:E,5,FALSE),0)-I174","v":0}]
["USL_ICMV19","USL_VRR","Rate Rider for Recovery of Incremental Capital Module (2019) - in effect until the effective date of the next cost of service based rate order","next COS","Rate Rider",null,"$/kWh",1E-4,1E-4,{"$f":"IFERROR(VLOOKUP(A175,'2. Current Tariff'!A:F,5,FALSE),0)-H175","v":0},{"$f":"IFERROR(VLOOKUP(A175,'20. Final Tariff Schedule'!A:E,5,FALSE),0)-I175","v":0}]
["USL_MFF20","USL_FRR","Rate Rider for Recovery of M-factor Capital (2020) - in effect until the effective date of the next cost of service based rate order","next COS","Rate Rider",null,"$",null,{"$f":"ROUND(VLOOKUP(A176,'19. Additional Rates'!$A:$G,4,FALSE),2)","v":0.05},{"$f":"IFERROR(VLOOKUP(A176,'2. Current Tariff'!A:F,5,FALSE),0)-H176","v":0},{"$f":"IFERROR(VLOOKUP(A176,'20. Final Tariff Schedule'!A:E,5,FALSE),0)-I176","v":0}]
["USL_MFV20","USL_VRR","Rate Rider for Recovery of M-factor Capital (2020) - in effect until the effective date of the next cost of service based rate order","next COS","Rate Rider",null,"$/kWh",null,{"$f":"ROUND(VLOOKUP(A177,'19. Additional Rates'!$A:$G,4,FALSE),4)","v":1E-4},{"$f":"IFERROR(VLOOKUP(A177,'2. Current Tariff'!A:F,5,FALSE),0)-H177","v":0},{"$f":"IFERROR(VLOOKUP(A177,'20. Final Tariff Schedule'!A:E,5,FALSE),0)-I177","v":0}]
["USL_ICMV18","USL_VRR","Rate Rider for Recovery of Incremental Capital Module (2018) - in effect until the effective date of the next cost of service based rate order","next COS","Rate Rider",null,"$/kWh",1E-4,1E-4,{"$f":"IFERROR(VLOOKUP(A178,'2. Current Tariff'!A:F,5,FALSE),0)-H178","v":0},{"$f":"IFERROR(VLOOKUP(A178,'20. Final Tariff Schedule'!A:E,5,FALSE),0)-I178","v":0}]
["USL_ICMF18","USL_FRR","Rate Rider for Recovery of Incremental Capital Module (2018) - in effect until the effective date of the next cost of service based rate order","next COS","Rate Rider",null,"$",0.06,0.06,{"$f":"IFERROR(VLOOKUP(A179,'2. Current Tariff'!A:F,5,FALSE),0)-H179","v":0},{"$f":"IFERROR(VLOOKUP(A179,'20. Final Tariff Schedule'!A:E,5,FALSE),0)-I179","v":0}]
["USL_GA20","USL_GA","Rate Rider for Disposition of Global Adjustment Account (2020) - effective until  December 31, 2020","2020-12-31","Rate Rider","non-RPP","$/kWh",null,{"$f":"+ROUND('6.1 GA'!M23,4)","v":-3.2000000000000002E-3},{"$f":"IFERROR(VLOOKUP(A180,'2. Current Tariff'!A:F,5,FALSE),0)-H180","v":0},{"$f":"IFERROR(VLOOKUP(A180,'20. Final Tariff Schedule'!A:E,5,FALSE),0)-I180","v":0}]
["USL_DVA20","USL_DVA","Rate Rider for Disposition of Deferral/Variance Accounts (2020) - effective until December 31, 2020","2020-12-31","Rate Rider",null,"$/kWh",null,{"$f":"+ROUND('8. Calculation of Def-Var RR'!J25,4)","v":2.9999999999999997E-4},{"$f":"IFERROR(VLOOKUP(A181,'2. Current Tariff'!A:F,5,FALSE),0)-H181","v":0},{"$f":"IFERROR(VLOOKUP(A181,'20. Final Tariff Schedule'!A:E,5,FALSE),0)-I181","v":0}]
["USL_LRV20","USL_VRR","Rate Rider for Disposition of Lost Revenue Adjustment Mechanism Variance Account (LRAMVA) (2020) - effective until December 31, 2020","2020-12-31","Rate Rider",null,"$/kWh",null,{"$f":"+ROUND('8. Calculation of Def-Var RR'!L25,4)","v":0},{"$f":"IFERROR(VLOOKUP(A182,'2. Current Tariff'!A:F,5,FALSE),0)-H182","v":0},{"$f":"IFERROR(VLOOKUP(A182,'20. Final Tariff Schedule'!A:E,5,FALSE),0)-I182","v":0}]
["USL_ICMF20","USL_FRR","Rate Rider for Recovery of Incremental Capital Module (2020) - in effect until the effective date of the next cost of service based rate order","next COS","Rate Rider",null,"$",null,{"$f":"+ROUND('19. Additional Rates'!D63,2)","v":0.05},{"$f":"IFERROR(VLOOKUP(A183,'2. Current Tariff'!A:F,5,FALSE),0)-H183","v":0},{"$f":"IFERROR(VLOOKUP(A183,'20. Final Tariff Schedule'!A:E,5,FALSE),0)-I183","v":0}]
["USL_ICMV20","USL_VRR","Rate Rider for Recovery of Incremental Capital Module (2020) - in effect until the effective date of the next cost of service based rate order","next COS","Rate Rider",null,"$/kWh",null,{"$f":"+ROUND('19. Additional Rates'!D64,4)","v":1E-4},{"$f":"IFERROR(VLOOKUP(A184,'2. Current Tariff'!A:F,5,FALSE),0)-H184","v":0},{"$f":"IFERROR(VLOOKUP(A184,'20. Final Tariff Schedule'!A:E,5,FALSE),0)-I184","v":0}]
["USL_TN","USL_TN","Retail Transmission Rate - Network Service Rate",null,"Rate",null,"$/kWh",7.1000000000000004E-3,{"$f":"ROUND(VLOOKUP(B185,RTSR_TY,11,FALSE),4)","v":7.4000000000000003E-3},{"$f":"IFERROR(VLOOKUP(A185,'2. Current Tariff'!A:F,5,FALSE),0)-H185","v":0},{"$f":"IFERROR(VLOOKUP(A185,'20. Final Tariff Schedule'!A:E,5,FALSE),0)-I185","v":0}]
["USL_TC","USL_TC","Retail Transmission Rate - Line and Transformation Connection Service Rate",null,"Rate",null,"$/kWh",6.4999999999999997E-3,{"$f":"ROUND(VLOOKUP(B186,RTSR_TY,11,FALSE),4)","v":6.8999999999999999E-3},{"$f":"IFERROR(VLOOKUP(A186,'2. Current Tariff'!A:F,5,FALSE),0)-H186","v":0},{"$f":"IFERROR(VLOOKUP(A186,'20. Final Tariff Schedule'!A:E,5,FALSE),0)-I186","v":0}]
[null,null,"STREET LIGHTING",null,"Rate Rider",null,null,null,null,{"$f":"IFERROR(VLOOKUP(A187,'2. Current Tariff'!A:F,5,FALSE),0)-H187","v":0},{"$f":"IFERROR(VLOOKUP(A187,'20. Final Tariff Schedule'!A:E,5,FALSE),0)-I187","v":0}]
["SL_F","SL_F","Service Charge",null,"Rate Rider",null,"$",1.54,{"$f":"ROUND('17. Rev2Cost-GDPIPI'!I24,2)","v":1.56},{"$f":"IFERROR(VLOOKUP(A188,'2. Current Tariff'!A:F,5,FALSE),0)-H188","v":0},{"$f":"IFERROR(VLOOKUP(A188,'20. Final Tariff Schedule'!A:E,5,FALSE),0)-I188","v":0}]
["SL_V","SL_V","Distribution Volumetric Rate",null,"Rate Rider",null,"$/kW",11.7902,{"$f":"ROUND('17. Rev2Cost-GDPIPI'!J24,4)","v":11.931699999999999},{"$f":"IFERROR(VLOOKUP(A189,'2. Current Tariff'!A:F,5,FALSE),0)-H189","v":0},{"$f":"IFERROR(VLOOKUP(A189,'20. Final Tariff Schedule'!A:E,5,FALSE),0)-I189","v":0}]
["SL_LV","SL_LV","Low Voltage Service Rate ",null,"Rate Rider",null,"$/kW",5.8000000000000003E-2,5.8000000000000003E-2,{"$f":"IFERROR(VLOOKUP(A190,'2. Current Tariff'!A:F,5,FALSE),0)-H190","v":0},{"$f":"IFERROR(VLOOKUP(A190,'20. Final Tariff Schedule'!A:E,5,FALSE),0)-I190","v":0}]
["SL_FRR19","SL_FRR","Rate Rider for Recovery of 2019 Foregone Revenue - effective until December 31, 2019","2019-12-31","Rate Rider",null,"$",0,null,{"$f":"IFERROR(VLOOKUP(A191,'2. Current Tariff'!A:F,5,FALSE),0)-H191","v":0},{"$f":"IFERROR(VLOOKUP(A191,'20. Final Tariff Schedule'!A:E,5,FALSE),0)-I191","v":0}]
["SL_ICMF17","SL_FRR","Rate Rider for Recovery of Incremental Capital Module (2017) - in effect until the effective date of the next cost of service based rate order","next COS","Rate Rider",null,"$",0.04,0.04,{"$f":"IFERROR(VLOOKUP(A192,'2. Current Tariff'!A:F,5,FALSE),0)-H192","v":0},{"$f":"IFERROR(VLOOKUP(A192,'20. Final Tariff Schedule'!A:E,5,FALSE),0)-I192","v":0}]
["SL_GA18",null,"Rate Rider for Disposition of Global Adjustment Account (2018) - effective until  April 30, 2019\n        Applicable only for Non-RPP Customers","2019-04-30","Rate Rider",null,"$/kWh",-5.0000000000000001E-4,null,{"$f":"IFERROR(VLOOKUP(A193,'2. Current Tariff'!A:F,5,FALSE),0)-H193","v":0},{"$f":"IFERROR(VLOOKUP(A193,'20. Final Tariff Schedule'!A:E,5,FALSE),0)-I193","v":0}]
["SL_DVA18",null,"Rate Rider for Disposition of Deferral/Variance Accounts (2018) - effective until April 30, 2019","2019-04-30","Rate Rider",null,"$/kW",-0.2616,null,{"$f":"IFERROR(VLOOKUP(A194,'2. Current Tariff'!A:F,5,FALSE),0)-H194","v":0},{"$f":"IFERROR(VLOOKUP(A194,'20. Final Tariff Schedule'!A:E,5,FALSE),0)-I194","v":0}]
["SL_ICMV17","SL_VRR","Rate Rider for Recovery of Incremental Capital Module (2017) - in effect until the effective date of the next cost of service based rate order","next COS","Rate Rider",null,"$/kW",0.29049999999999998,0.29049999999999998,{"$f":"IFERROR(VLOOKUP(A195,'2. Current Tariff'!A:F,5,FALSE),0)-H195","v":0},{"$f":"IFERROR(VLOOKUP(A195,'20. Final Tariff Schedule'!A:E,5,FALSE),0)-I195","v":0}]
["SL_CBR18",null,"Rate Rider for Disposition of Capacity Based Recovery Account (2018) - effective until April 30, 2019\n        Applicable Only for Non-WMP Class B Customers","2019-04-30","Rate Rider",null,"$/kW",-1.6549999999999999E-2,null,{"$f":"IFERROR(VLOOKUP(A196,'2. Current Tariff'!A:F,5,FALSE),0)-H196","v":0},{"$f":"IFERROR(VLOOKUP(A196,'20. Final Tariff Schedule'!A:E,5,FALSE),0)-I196","v":0}]
["SL_GA19","SL_GA","Rate Rider for Disposition of Global Adjustment Account (2019) - effective until  December 31, 2019\n        Applicable only for Non-RPP Customers","2019-12-31","Rate Rider",null,"$/kWh",1.9E-3,null,{"$f":"IFERROR(VLOOKUP(A197,'2. Current Tariff'!A:F,5,FALSE),0)-H197","v":0},{"$f":"IFERROR(VLOOKUP(A197,'20. Final Tariff Schedule'!A:E,5,FALSE),0)-I197","v":0}]
["SL_DVA19","SL_DVA","Rate Rider for Disposition of Deferral/Variance Accounts (2019) - effective until December 31, 2019","2019-12-31","Rate Rider",null,"$/kW",-0.14599999999999999,null,{"$f":"IFERROR(VLOOKUP(A198,'2. Current Tariff'!A:F,5,FALSE),0)-H198","v":0},{"$f":"IFERROR(VLOOKUP(A198,'20. Final Tariff Schedule'!A:E,5,FALSE),0)-I198","v":0}]
["SL_CBR20","SL_DVA","Rate Rider for Disposition of Capacity Based Recovery Account (2020) - effective until December 31, 2020\n        Applicable Only for Non-WMP Class  B Customers","2020-12-31","Rate Rider",null,"$/kW",null,{"$f":"+ROUND(VLOOKUP(A199,'6.2 CBR B'!$A:$M,13,FALSE),4)","v":-3.2099999999999997E-2},{"$f":"IFERROR(VLOOKUP(A199,'2. Current Tariff'!A:F,5,FALSE),0)-H199","v":0},{"$f":"IFERROR(VLOOKUP(A199,'20. Final Tariff Schedule'!A:E,5,FALSE),0)-I199","v":0}]
["SL_LRV19","SL_VRR","Rate Rider for Disposition of Lost Revenue Adjustment Mechanism Variance Account (LRAMVA) (2019) - effective until December 31, 2019","2019-12-31","Rate Rider",null,"$/kW",-4.2131999999999996,null,{"$f":"IFERROR(VLOOKUP(A200,'2. Current Tariff'!A:F,5,FALSE),0)-H200","v":0},{"$f":"IFERROR(VLOOKUP(A200,'20. Final Tariff Schedule'!A:E,5,FALSE),0)-I200","v":0}]
["SL_ICMF19","SL_FRR","Rate Rider for Recovery of Incremental Capital Module (2019) - in effect until the effective date of the next cost of service based rate order","next COS","Rate Rider",null,"$",0.01,0.01,{"$f":"IFERROR(VLOOKUP(A201,'2. Current Tariff'!A:F,5,FALSE),0)-H201","v":0},{"$f":"IFERROR(VLOOKUP(A201,'20. Final Tariff Schedule'!A:E,5,FALSE),0)-I201","v":0}]
["SL_ICMV19","SL_VRR","Rate Rider for Recovery of Incremental Capital Module (2019) - in effect until the effective date of the next cost of service based rate order","next COS","Rate Rider",null,"$/kW",5.6399999999999999E-2,5.6399999999999999E-2,{"$f":"IFERROR(VLOOKUP(A202,'2. Current Tariff'!A:F,5,FALSE),0)-H202","v":0},{"$f":"IFERROR(VLOOKUP(A202,'20. Final Tariff Schedule'!A:E,5,FALSE),0)-I202","v":0}]
["SL_MFF20","SL_FRR","Rate Rider for Recovery of M-factor Capital (2020) - in effect until the effective date of the next cost of service based rate order","next COS","Rate Rider",null,"$",null,{"$f":"ROUND(VLOOKUP(A203,'19. Additional Rates'!$A:$G,4,FALSE),2)","v":0.01},{"$f":"IFERROR(VLOOKUP(A203,'2. Current Tariff'!A:F,5,FALSE),0)-H203","v":0},{"$f":"IFERROR(VLOOKUP(A203,'20. Final Tariff Schedule'!A:E,5,FALSE),0)-I203","v":0}]
["SL_MFV20","SL_VRR","Rate Rider for Recovery of M-factor Capital (2020) - in effect until the effective date of the next cost of service based rate order","next COS","Rate Rider",null,"$/kWh",null,{"$f":"ROUND(VLOOKUP(A204,'19. Additional Rates'!$A:$G,4,FALSE),4)","v":5.8599999999999999E-2},{"$f":"IFERROR(VLOOKUP(A204,'2. Current Tariff'!A:F,5,FALSE),0)-H204","v":0},{"$f":"IFERROR(VLOOKUP(A204,'20. Final Tariff Schedule'!A:E,5,FALSE),0)-I204","v":0}]
["SL_LRV18",null,"Rate Rider for Disposition of Lost Revenue Adjustment Mechanism Variance Account (LRAMVA) (2018) - effective until April 30, 2019","2019-04-30","Rate Rider",null,"$/kW",-33.353200000000001,null,{"$f":"IFERROR(VLOOKUP(A205,'2. Current Tariff'!A:F,5,FALSE),0)-H205","v":0},{"$f":"IFERROR(VLOOKUP(A205,'20. Final Tariff Schedule'!A:E,5,FALSE),0)-I205","v":0}]
["SL_ICMF18","SL_FRR","Rate Rider for Recovery of Incremental Capital Module (2018) - in effect until the effective date of the next cost of service based rate order","next COS","Rate Rider",null,"$",0.01,0.01,{"$f":"IFERROR(VLOOKUP(A206,'2. Current Tariff'!A:F,5,FALSE),0)-H206","v":0},{"$f":"IFERROR(VLOOKUP(A206,'20. Final Tariff Schedule'!A:E,5,FALSE),0)-I206","v":0}]
["SL_ICMV18","SL_VRR","Rate Rider for Recovery of Incremental Capital Module (2018) - in effect until the effective date of the next cost of service based rate order","next COS","Rate Rider",null,"$/kW",7.6999999999999999E-2,7.6999999999999999E-2,{"$f":"IFERROR(VLOOKUP(A207,'2. Current Tariff'!A:F,5,FALSE),0)-H207","v":0},{"$f":"IFERROR(VLOOKUP(A207,'20. Final Tariff Schedule'!A:E,5,FALSE),0)-I207","v":0}]
["SL_GA20","SL_GA","Rate Rider for Disposition of Global Adjustment Account (2020) - effective until  December 31, 2020","2020-12-31","Rate Rider","non-RPP","$/kWh",null,{"$f":"+ROUND('6.1 GA'!M24,4)","v":-3.2000000000000002E-3},{"$f":"IFERROR(VLOOKUP(A208,'2. Current Tariff'!A:F,5,FALSE),0)-H208","v":0},{"$f":"IFERROR(VLOOKUP(A208,'20. Final Tariff Schedule'!A:E,5,FALSE),0)-I208","v":0}]
["SL_DVA20","SL_DVA","Rate Rider for Disposition of Deferral/Variance Accounts (2020) - effective until December 31, 2020","2020-12-31","Rate Rider",null,"$/kW",null,{"$f":"+ROUND('8. Calculation of Def-Var RR'!J26,4)","v":0.1021},{"$f":"IFERROR(VLOOKUP(A209,'2. Current Tariff'!A:F,5,FALSE),0)-H209","v":0},{"$f":"IFERROR(VLOOKUP(A209,'20. Final Tariff Schedule'!A:E,5,FALSE),0)-I209","v":0}]
["SL_LRV20","SL_VRR","Rate Rider for Disposition of Lost Revenue Adjustment Mechanism Variance Account (LRAMVA) (2020) - effective until December 31, 2020","2020-12-31","Rate Rider",null,"$/kW",null,{"$f":"+ROUND('8. Calculation of Def-Var RR'!L26,4)","v":-3.2587999999999999},{"$f":"IFERROR(VLOOKUP(A210,'2. Current Tariff'!A:F,5,FALSE),0)-H210","v":0},{"$f":"IFERROR(VLOOKUP(A210,'20. Final Tariff Schedule'!A:E,5,FALSE),0)-I210","v":0}]
["SL_ICMF20","SL_FRR","Rate Rider for Recovery of Incremental Capital Module (2020) - in effect until the effective date of the next cost of service based rate order","next COS","Rate Rider",null,"$",null,{"$f":"+ROUND('19. Additional Rates'!D87,2)","v":0.01},{"$f":"IFERROR(VLOOKUP(A211,'2. Current Tariff'!A:F,5,FALSE),0)-H211","v":0},{"$f":"IFERROR(VLOOKUP(A211,'20. Final Tariff Schedule'!A:E,5,FALSE),0)-I211","v":0}]
["SL_ICMV20","SL_VRR","Rate Rider for Recovery of Incremental Capital Module (2020) - in effect until the effective date of the next cost of service based rate order","next COS","Rate Rider",null,"$/kW",null,{"$f":"+ROUND('19. Additional Rates'!D88,4)","v":5.8599999999999999E-2},{"$f":"IFERROR(VLOOKUP(A212,'2. Current Tariff'!A:F,5,FALSE),0)-H212","v":0},{"$f":"IFERROR(VLOOKUP(A212,'20. Final Tariff Schedule'!A:E,5,FALSE),0)-I212","v":0}]
["SL_TN","SL_TN","Retail Transmission Rate - Network Service Rate",null,"Rate",null,"$/kW",1.8898999999999999,{"$f":"ROUND(VLOOKUP(B213,RTSR_TY,11,FALSE),4)","v":1.9814000000000001},{"$f":"IFERROR(VLOOKUP(A213,'2. Current Tariff'!A:F,5,FALSE),0)-H213","v":0},{"$f":"IFERROR(VLOOKUP(A213,'20. Final Tariff Schedule'!A:E,5,FALSE),0)-I213","v":0}]
["SL_TC","SL_TC","Retail Transmission Rate - Line and Transformation Connection Service Rate",null,"Rate",null,"$/kW",1.875,{"$f":"ROUND(VLOOKUP(B214,RTSR_TY,11,FALSE),4)","v":1.9777},{"$f":"IFERROR(VLOOKUP(A214,'2. Current Tariff'!A:F,5,FALSE),0)-H214","v":0},{"$f":"IFERROR(VLOOKUP(A214,'20. Final Tariff Schedule'!A:E,5,FALSE),0)-I214","v":0}]
[null,null,"MICROFIT ",null,null,null,null,null,null,{"$f":"IFERROR(VLOOKUP(A215,'2. Current Tariff'!A:F,5,FALSE),0)-H215","v":0},{"$f":"IFERROR(VLOOKUP(A215,'20. Final Tariff Schedule'!A:E,5,FALSE),0)-I215","v":0}]
[null,null,"Service Charge",null,"Rate",null,"$",5.4,{"$f":"H216","v":5.4}]
[null,null,null,null,null,null,null,null,null,{"$f":"IFERROR(VLOOKUP(A217,'2. Current Tariff'!A:F,5,FALSE),0)-H217","v":0},{"$f":"IFERROR(VLOOKUP(B217,'2. Current Tariff'!B:G,5,FALSE),0)-I217","v":0}]
[null,null,null,null,null,null,null,null,null,{"$f":"IFERROR(VLOOKUP(A218,'2. Current Tariff'!A:F,5,FALSE),0)-H218","v":0},{"$f":"IFERROR(VLOOKUP(B218,'2. Current Tariff'!B:G,5,FALSE),0)-I218","v":0}]
[null,null,null,null,null,null,null,null,null,{"$f":"IFERROR(VLOOKUP(A219,'2. Current Tariff'!A:F,5,FALSE),0)-H219","v":0},{"$f":"IFERROR(VLOOKUP(B219,'2. Current Tariff'!B:G,5,FALSE),0)-I219","v":0}]
[null,"WMS","WMS unit rate",null,"Rate",null,"$/kWh",{"$f":"'18. Regulatory Charges'!E17","v":3.4000000000000002E-3},{"$f":"H220","v":3.4000000000000002E-3}]
[null,"RRA","Rural or Remote Electricity Rate Protection Charge (RRRP)",null,"Rate",null,"$/kWh",{"$f":"'18. Regulatory Charges'!E18","v":5.0000000000000001E-4},{"$f":"H221","v":5.0000000000000001E-4}]
[null,null,null,null,null,null,null,null,null,{"$f":"IFERROR(VLOOKUP(A222,'2. Current Tariff'!A:F,5,FALSE),0)-H222","v":0},{"$f":"IFERROR(VLOOKUP(B222,'2. Current Tariff'!B:G,5,FALSE),0)-I222","v":0}]
[null,"OFF","TOU OFF-Peak",null,"Rate",null,"$/kWh",{"$f":"'18. Regulatory Charges'!E25","v":6.5000000000000002E-2},{"$f":"H223","v":6.5000000000000002E-2}]
[null,"MID","TOU MID-Peak",null,"Rate",null,"$/kWh",{"$f":"'18. Regulatory Charges'!E26","v":9.4E-2},{"$f":"H224","v":9.4E-2}]
[null,"ON","TOU ON-Peak",null,"Rate",null,"$/kWh",{"$f":"'18. Regulatory Charges'!E27","v":0.13400000000000001},0.13400000000000001]
[null,"IESO","Average IESO Wholesale Market Price",null,"Rate",null,"$/kWh",{"$f":"'18. Regulatory Charges'!E31","v":0.11210000000000001},0.11210000000000001]
[null,null,null,null,null,null,null,null,null,{"$f":"IFERROR(VLOOKUP(A227,'2. Current Tariff'!A:F,5,FALSE),0)-H227","v":0},{"$f":"IFERROR(VLOOKUP(B227,'2. Current Tariff'!B:G,5,FALSE),0)-I227","v":0}]
[null,null,null,null,null,null,null,null,null,{"$f":"IFERROR(VLOOKUP(A228,'2. Current Tariff'!A:F,5,FALSE),0)-H228","v":0},{"$f":"IFERROR(VLOOKUP(B228,'2. Current Tariff'!B:G,5,FALSE),0)-I228","v":0}]
[null,null,null,null,null,null,null,null,null,{"$f":"IFERROR(VLOOKUP(A229,'2. Current Tariff'!A:F,5,FALSE),0)-H229","v":0},{"$f":"IFERROR(VLOOKUP(B229,'2. Current Tariff'!B:G,5,FALSE),0)-I229","v":0}]
[null,null,null,null,null,null,null,null,null,{"$f":"IFERROR(VLOOKUP(A230,'2. Current Tariff'!A:F,5,FALSE),0)-H230","v":0},{"$f":"IFERROR(VLOOKUP(B230,'2. Current Tariff'!B:G,5,FALSE),0)-I230","v":0}]
[null,null,null,null,null,null,null,null,null,{"$f":"IFERROR(VLOOKUP(A231,'2. Current Tariff'!A:F,5,FALSE),0)-H231","v":0},{"$f":"IFERROR(VLOOKUP(B231,'2. Current Tariff'!B:G,5,FALSE),0)-I231","v":0}]
[null,null,null,null,null,null,null,null,null,{"$f":"IFERROR(VLOOKUP(A232,'2. Current Tariff'!A:F,5,FALSE),0)-H232","v":0},{"$f":"IFERROR(VLOOKUP(B232,'2. Current Tariff'!B:G,5,FALSE),0)-I232","v":0}]
[null,null,null,null,null,null,null,null,null,{"$f":"IFERROR(VLOOKUP(A233,'2. Current Tariff'!A:F,5,FALSE),0)-H233","v":0},{"$f":"IFERROR(VLOOKUP(B233,'2. Current Tariff'!B:G,5,FALSE),0)-I233","v":0}]
[null,null,null,null,null,null,null,null,null,{"$f":"IFERROR(VLOOKUP(A234,'2. Current Tariff'!A:F,5,FALSE),0)-H234","v":0},{"$f":"IFERROR(VLOOKUP(B234,'2. Current Tariff'!B:G,5,FALSE),0)-I234","v":0}]
[null,null,null,null,null,null,null,null,null,{"$f":"IFERROR(VLOOKUP(A235,'2. Current Tariff'!A:F,5,FALSE),0)-H235","v":0},{"$f":"IFERROR(VLOOKUP(B235,'2. Current Tariff'!B:G,5,FALSE),0)-I235","v":0}]
[null,null,null,null,null,null,null,null,null,{"$f":"IFERROR(VLOOKUP(A236,'2. Current Tariff'!A:F,5,FALSE),0)-H236","v":0},{"$f":"IFERROR(VLOOKUP(B236,'2. Current Tariff'!B:G,5,FALSE),0)-I236","v":0}]
[null,null,null,null,null,null,null,null,null,{"$f":"IFERROR(VLOOKUP(A237,'2. Current Tariff'!A:F,5,FALSE),0)-H237","v":0},{"$f":"IFERROR(VLOOKUP(B237,'2. Current Tariff'!B:G,5,FALSE),0)-I237","v":0}]
[null,null,null,null,null,null,null,null,null,{"$f":"IFERROR(VLOOKUP(A238,'2. Current Tariff'!A:F,5,FALSE),0)-H238","v":0},{"$f":"IFERROR(VLOOKUP(B238,'2. Current Tariff'!B:G,5,FALSE),0)-I238","v":0}]
[null,null,null,null,null,null,null,null,null,{"$f":"IFERROR(VLOOKUP(A239,'2. Current Tariff'!A:F,5,FALSE),0)-H239","v":0},{"$f":"IFERROR(VLOOKUP(B239,'2. Current Tariff'!B:G,5,FALSE),0)-I239","v":0}]
[null,null,null,null,null,null,null,null,null,{"$f":"IFERROR(VLOOKUP(A240,'2. Current Tariff'!A:F,5,FALSE),0)-H240","v":0},{"$f":"IFERROR(VLOOKUP(B240,'2. Current Tariff'!B:G,5,FALSE),0)-I240","v":0}]
[null,null,null,null,null,null,null,null,null,{"$f":"IFERROR(VLOOKUP(A241,'2. Current Tariff'!A:F,5,FALSE),0)-H241","v":0},{"$f":"IFERROR(VLOOKUP(B241,'2. Current Tariff'!B:G,5,FALSE),0)-I241","v":0}]
[null,null,null,null,null,null,null,null,null,{"$f":"IFERROR(VLOOKUP(A242,'2. Current Tariff'!A:F,5,FALSE),0)-H242","v":0},{"$f":"IFERROR(VLOOKUP(B242,'2. Current Tariff'!B:G,5,FALSE),0)-I242","v":0}]
[null,null,null,null,null,null,null,null,null,{"$f":"IFERROR(VLOOKUP(A243,'2. Current Tariff'!A:F,5,FALSE),0)-H243","v":0},{"$f":"IFERROR(VLOOKUP(B243,'2. Current Tariff'!B:G,5,FALSE),0)-I243","v":0}]
[null,null,null,null,null,null,null,null,null,{"$f":"IFERROR(VLOOKUP(A244,'2. Current Tariff'!A:F,5,FALSE),0)-H244","v":0},{"$f":"IFERROR(VLOOKUP(B244,'2. Current Tariff'!B:G,5,FALSE),0)-I244","v":0}]
[null,null,null,null,null,null,null,null,null,{"$f":"IFERROR(VLOOKUP(A245,'2. Current Tariff'!A:F,5,FALSE),0)-H245","v":0},{"$f":"IFERROR(VLOOKUP(B245,'2. Current Tariff'!B:G,5,FALSE),0)-I245","v":0}]
[null,null,null,null,null,null,null,null,null,{"$f":"IFERROR(VLOOKUP(A246,'2. Current Tariff'!A:F,5,FALSE),0)-H246","v":0},{"$f":"IFERROR(VLOOKUP(B246,'2. Current Tariff'!B:G,5,FALSE),0)-I246","v":0}]
[null,null,null,null,null,null,null,null,null,{"$f":"IFERROR(VLOOKUP(A247,'2. Current Tariff'!A:F,5,FALSE),0)-H247","v":0},{"$f":"IFERROR(VLOOKUP(B247,'2. Current Tariff'!B:G,5,FALSE),0)-I247","v":0}]
[null,null,null,null,null,null,null,null,null,{"$f":"IFERROR(VLOOKUP(A248,'2. Current Tariff'!A:F,5,FALSE),0)-H248","v":0},{"$f":"IFERROR(VLOOKUP(B248,'2. Current Tariff'!B:G,5,FALSE),0)-I248","v":0}]
[null,null,null,null,null,null,null,null,null,{"$f":"IFERROR(VLOOKUP(A249,'2. Current Tariff'!A:F,5,FALSE),0)-H249","v":0},{"$f":"IFERROR(VLOOKUP(B249,'2. Current Tariff'!B:G,5,FALSE),0)-I249","v":0}]
[null,null,null,null,null,null,null,null,null,{"$f":"IFERROR(VLOOKUP(A250,'2. Current Tariff'!A:F,5,FALSE),0)-H250","v":0},{"$f":"IFERROR(VLOOKUP(B250,'2. Current Tariff'!B:G,5,FALSE),0)-I250","v":0}]
[null,null,null,null,null,null,null,null,null,{"$f":"IFERROR(VLOOKUP(A251,'2. Current Tariff'!A:F,5,FALSE),0)-H251","v":0},{"$f":"IFERROR(VLOOKUP(B251,'2. Current Tariff'!B:G,5,FALSE),0)-I251","v":0}]
[null,null,null,null,null,null,null,null,null,{"$f":"IFERROR(VLOOKUP(A252,'2. Current Tariff'!A:F,5,FALSE),0)-H252","v":0},{"$f":"IFERROR(VLOOKUP(B252,'2. Current Tariff'!B:G,5,FALSE),0)-I252","v":0}]
[null,null,null,null,null,null,null,null,null,{"$f":"IFERROR(VLOOKUP(A253,'2. Current Tariff'!A:F,5,FALSE),0)-H253","v":0},{"$f":"IFERROR(VLOOKUP(B253,'2. Current Tariff'!B:G,5,FALSE),0)-I253","v":0}]
[null,null,null,null,null,null,null,null,null,{"$f":"IFERROR(VLOOKUP(A254,'2. Current Tariff'!A:F,5,FALSE),0)-H254","v":0},{"$f":"IFERROR(VLOOKUP(B254,'2. Current Tariff'!B:G,5,FALSE),0)-I254","v":0}]
[null,null,null,null,null,null,null,null,null,{"$f":"IFERROR(VLOOKUP(A255,'2. Current Tariff'!A:F,5,FALSE),0)-H255","v":0},{"$f":"IFERROR(VLOOKUP(B255,'2. Current Tariff'!B:G,5,FALSE),0)-I255","v":0}]
[null,null,null,null,null,null,null,null,null,{"$f":"IFERROR(VLOOKUP(A256,'2. Current Tariff'!A:F,5,FALSE),0)-H256","v":0},{"$f":"IFERROR(VLOOKUP(B256,'2. Current Tariff'!B:G,5,FALSE),0)-I256","v":0}]
[null,null,null,null,null,null,null,null,null,{"$f":"IFERROR(VLOOKUP(A257,'2. Current Tariff'!A:F,5,FALSE),0)-H257","v":0},{"$f":"IFERROR(VLOOKUP(B257,'2. Current Tariff'!B:G,5,FALSE),0)-I257","v":0}]
[null,null,null,null,null,null,null,null,null,{"$f":"IFERROR(VLOOKUP(A258,'2. Current Tariff'!A:F,5,FALSE),0)-H258","v":0},{"$f":"IFERROR(VLOOKUP(B258,'2. Current Tariff'!B:G,5,FALSE),0)-I258","v":0}]
[null,null,null,null,null,null,null,null,null,{"$f":"IFERROR(VLOOKUP(A259,'2. Current Tariff'!A:F,5,FALSE),0)-H259","v":0},{"$f":"IFERROR(VLOOKUP(B259,'2. Current Tariff'!B:G,5,FALSE),0)-I259","v":0}]
[null,null,null,null,null,null,null,null,null,{"$f":"IFERROR(VLOOKUP(A260,'2. Current Tariff'!A:F,5,FALSE),0)-H260","v":0},{"$f":"IFERROR(VLOOKUP(B260,'2. Current Tariff'!B:G,5,FALSE),0)-I260","v":0}]
[null,null,null,null,null,null,null,null,null,{"$f":"IFERROR(VLOOKUP(A261,'2. Current Tariff'!A:F,5,FALSE),0)-H261","v":0},{"$f":"IFERROR(VLOOKUP(B261,'2. Current Tariff'!B:G,5,FALSE),0)-I261","v":0}]

{"sheet":"BoD Reporting","index":27,"n_rows":80,"n_cols":12,"rows_kept":80,"cut":false,"hidden":false,"merged":[[13,1,13,5],[1,1,1,5],[2,1,3,1],[2,2,3,2],[2,3,3,3],[2,4,2,5],[15,1,15,5],[16,1,17,1],[16,2,17,2],[16,3,17,3],[16,4,16,5],[16,8,16,9],[16,10,16,11],[25,1,25,9],[27,1,27,5],[28,1,29,1],[28,2,29,2],[28,3,29,3],[28,4,28,5],[16,6,16,7],[39,1,39,5],[41,1,41,5],[42,1,43,1],[42,2,43,2],[42,3,43,3],[42,4,42,5],[53,1,53,5],[56,1,56,9],[69,1,70,1],[69,2,70,2],[69,3,70,3],[69,4,69,5],[68,1,68,5]]}
["Back to Index"]
[null,"Distribution Bill Impacts"]
[null,"Customer Class","Billing Units","Average Monthly Volume","2020 vs. 2019"]
[null,null,null,null,"$","%"]
[null,"Residential",{"$f":"'21. Bill Impacts'!G15","v":"kWh"},{"$f":"'21. Bill Impacts'!K15","v":750},{"$f":"'21. Bill Impacts'!H40","v":0.57500000000000284},{"$f":"'21. Bill Impacts'!I40","v":2.2718293164757125E-2}]
[null,"GS<50",{"$f":"'21. Bill Impacts'!G16","v":"kWh"},{"$f":"'21. Bill Impacts'!K16","v":2000},{"$f":"'21. Bill Impacts'!H41","v":1.2699999999999818},{"$f":"'21. Bill Impacts'!I41","v":1.72040097534541E-2}]
[null,"GS>50 to 499",{"$f":"'21. Bill Impacts'!G17","v":"kW"},{"$f":"'21. Bill Impacts'!L17","v":230},{"$f":"'21. Bill Impacts'!H42","v":21.026999999999816},{"$f":"'21. Bill Impacts'!I42","v":1.6700978850351076E-2}]
[null,"GS>500 to 4,999","kW",2250,{"$f":"+'21. Bill Impacts'!H43","v":162.33500000000004},{"$f":"+'21. Bill Impacts'!I43","v":2.0977267896128707E-2}]
[null,"Large User",{"$f":"'21. Bill Impacts'!G18","v":"kW"},5000,{"$f":"+'21. Bill Impacts'!H44","v":569.9800000000032},{"$f":"+'21. Bill Impacts'!I44","v":1.8547304607865415E-2}]
[null,"Unmetered Scattered Load",{"$f":"'21. Bill Impacts'!G19","v":"kW"},300,{"$f":"+'21. Bill Impacts'!H46","v":0.31000000000000227},{"$f":"+'21. Bill Impacts'!I46","v":2.1045485403937698E-2}]
[null,"Standby Power",{"$f":"'21. Bill Impacts'!G20","v":"kW"}]
[null,"Sentinel Lighting",{"$f":"'21. Bill Impacts'!G21","v":"kWh"},{"$f":"'21. Bill Impacts'!L21","v":0}]
[null,"Street Lighting",{"$f":"'21. Bill Impacts'!G22","v":"kW"},{"$f":"'21. Bill Impacts'!L22","v":0.1},{"$f":"'21. Bill Impacts'!H47","v":0.1613099999999994},{"$f":"'21. Bill Impacts'!I47","v":6.7209979625763763E-2}]
[null,"Table excludes the impact of HST (13%) & Provincial Rebate (8%)"]
[]
[null,"Distribution Bill and Horizon Rate Rider Bill Impacts"]
[null,"Customer Class","Billing Units","Average Monthly Volume","2017 vs. 2016",null,2018,null,2019,null,2020]
[null,null,null,null,"$","%","$","%","$","%","$","%"]
[null,"Residential ","kWh",750,{"$f":"+C59+C61","v":2.125},{"$f":"E19/SUM([21]Residential!$K$7+[21]Residential!$K$8)","v":7.4132216989359845E-2},{"$f":"+#REF!+#REF!","v":{"$error":"#REF!"}},{"$f":"G19/SUM([21]Residential!$L$7+[21]Residential!$L$8)","v":{"$error":"#REF!"}},{"$f":"+#REF!+#REF!","v":{"$error":"#REF!"}},{"$f":"I19/SUM([21]Residential!$M$7+[21]Residential!$M$8)","v":{"$error":"#REF!"}},{"$f":"+#REF!+#REF!","v":{"$error":"#REF!"}},{"$f":"K19/SUM([21]Residential!$M$7+[21]Residential!$M$8)","v":{"$error":"#REF!"}}]
[null,"GS < 50kW ","kWh",2000,{"$f":"+D59+D61","v":5.1399999999999579},{"$f":"E20/SUM('[21]GS < 50 kW'!$K$7+'[21]GS < 50 kW'!$K$8)","v":7.9284281968223944E-2},{"$f":"+#REF!+#REF!","v":{"$error":"#REF!"}},{"$f":"G20/SUM('[21]GS < 50 kW'!$L$7+'[21]GS < 50 kW'!$L$8)","v":{"$error":"#REF!"}},{"$f":"+#REF!+#REF!","v":{"$error":"#REF!"}},{"$f":"I20/SUM('[21]GS < 50 kW'!$M$7+'[21]GS < 50 kW'!$M$8)","v":{"$error":"#REF!"}},{"$f":"+#REF!+#REF!","v":{"$error":"#REF!"}},{"$f":"K20/SUM('[21]GS < 50 kW'!$M$7+'[21]GS < 50 kW'!$M$8)","v":{"$error":"#REF!"}}]
[null,"GS > 50kW","kW",250,{"$f":"+E59+E61","v":-354.48700000000031},{"$f":"E21/SUM('[21]GS > 50 kW 250'!$K$7+'[21]GS > 50 kW 250'!$K$8)","v":-0.34897150535781996},{"$f":"+#REF!+#REF!","v":{"$error":"#REF!"}},{"$f":"G21/SUM('[21]GS > 50 kW 250'!$L$7+'[21]GS > 50 kW 250'!$L$8)","v":{"$error":"#REF!"}},{"$f":"+#REF!+#REF!","v":{"$error":"#REF!"}},{"$f":"I21/SUM('[21]GS > 50 kW 250'!$M$7+'[21]GS > 50 kW 250'!$M$8)","v":{"$error":"#REF!"}},{"$f":"+#REF!+#REF!","v":{"$error":"#REF!"}},{"$f":"K21/SUM('[21]GS > 50 kW 250'!$M$7+'[21]GS > 50 kW 250'!$M$8)","v":{"$error":"#REF!"}}]
[null,"LU (1) - Class A","kW",5000,{"$f":"+F59+F61","v":1548.6699999999992},{"$f":"E22/SUM('[21]Large User 5,000'!$K$7+'[21]Large User 5,000'!$K$8)","v":5.0450699912368405E-2},{"$f":"+#REF!+#REF!","v":{"$error":"#REF!"}},{"$f":"G22/SUM('[21]Large User 5,000'!$L$7+'[21]Large User 5,000'!$L$8)","v":{"$error":"#REF!"}},{"$f":"+#REF!+#REF!","v":{"$error":"#REF!"}},{"$f":"I22/SUM('[21]Large User 5,000'!$M$7+'[21]Large User 5,000'!$M$8)","v":{"$error":"#REF!"}},{"$f":"+#REF!+#REF!","v":{"$error":"#REF!"}},{"$f":"K22/SUM('[21]Large User 5,000'!$M$7+'[21]Large User 5,000'!$M$8)","v":{"$error":"#REF!"}}]
[null,"LU (1) - Class A","kW",10000,{"$f":"+G59+G61","v":4589.4600000000137},{"$f":"E23/SUM('[21]Large User 10,000'!$K$7+'[21]Large User 10,000'!$K$8)","v":0.12177122358659813},{"$f":"+#REF!+#REF!","v":{"$error":"#REF!"}},{"$f":"G23/SUM('[21]Large User 10,000'!$L$7+'[21]Large User 10,000'!$L$8)","v":{"$error":"#REF!"}},{"$f":"+#REF!+#REF!","v":{"$error":"#REF!"}},{"$f":"I23/SUM('[21]Large User 10,000'!$M$7+'[21]Large User 10,000'!$M$8)","v":{"$error":"#REF!"}},{"$f":"+#REF!+#REF!","v":{"$error":"#REF!"}},{"$f":"K23/SUM('[21]Large User 10,000'!$M$7+'[21]Large User 10,000'!$M$8)","v":{"$error":"#REF!"}}]
[null,"LU (2) - Class A","kW",20000,{"$f":"+H59+H61","v":0},{"$f":"E24/SUM('[21]Super User'!$K$7+'[21]Super User'!$K$8)","v":0},{"$f":"+#REF!+#REF!","v":{"$error":"#REF!"}},{"$f":"G24/SUM('[21]Super User'!$L$7+'[21]Super User'!$L$8)","v":{"$error":"#REF!"}},{"$f":"+#REF!+#REF!","v":{"$error":"#REF!"}},{"$f":"I24/SUM('[21]Super User'!$M$7+'[21]Super User'!$M$8)","v":{"$error":"#REF!"}},{"$f":"+#REF!+#REF!","v":{"$error":"#REF!"}},{"$f":"K24/SUM('[21]Super User'!$M$7+'[21]Super User'!$M$8)","v":{"$error":"#REF!"}}]
[null,"Street Lighting","kW",4973,{"$f":"([21]StreetLighting!$L$7+[21]StreetLighting!$L$8)-([21]StreetLighting!$K$7+[21]StreetLighting!$K$8)","v":-6930.5675750000082},{"$f":"E25/([21]StreetLighting!$K$7+[21]StreetLighting!$K$8)","v":-6.1722264151348245E-2},{"$f":"([21]StreetLighting!$M$7+[21]StreetLighting!$M$8)-([21]StreetLighting!$L$7+[21]StreetLighting!$L$8)","v":-5926.391678},{"$f":"G25/([21]StreetLighting!$L$7+[21]StreetLighting!$L$8)","v":-5.6251225190498404E-2},{"$f":"([21]StreetLighting!$N$7+[21]StreetLighting!$N$8)-([21]StreetLighting!$M$7+[21]StreetLighting!$M$8)","v":-2891.6209729999973},{"$f":"I25/([21]StreetLighting!$M$7+[21]StreetLighting!$M$8)","v":-2.9082156052899499E-2},{"$f":"([21]StreetLighting!$N$7+[21]StreetLighting!$N$8)-([21]StreetLighting!$M$7+[21]StreetLighting!$M$8)","v":-2891.6209729999973},{"$f":"K25/([21]StreetLighting!$M$7+[21]StreetLighting!$M$8)","v":-2.9082156052899499E-2}]
[null,"Table excludes the impact of HST (13%) and OCEB (10%)"]
[]
[null,"Distribution Bill and All Rate Rider Bill Impacts"]
[null,"Customer Class","Billing Units","Average Monthly Volume",{"$f":"E3","v":"2020 vs. 2019"}]
[null,null,null,null,"$","%"]
[null,{"$f":"B5","v":"Residential"},{"$f":"C5","v":"kWh"},750,{"$f":"'21. Bill Impacts'!J40","v":0.95000000000000284},{"$f":"'21. Bill Impacts'!K40","v":3.3985071610123367E-2}]
[null,{"$f":"B6","v":"GS<50"},{"$f":"C6","v":"kWh"},2000,{"$f":"'21. Bill Impacts'!J41","v":2.4699999999999847},{"$f":"'21. Bill Impacts'!K41","v":3.090621527743001E-2}]
[null,{"$f":"B7","v":"GS>50 to 499"},"kW",230,{"$f":"'21. Bill Impacts'!J42","v":-438.55700000000013},{"$f":"'21. Bill Impacts'!K42","v":-0.3055367063174132}]
[null,"GS>500 to 4,999","kW",2250,{"$f":"+'21. Bill Impacts'!J43","v":786.03499999999985},{"$f":"+'21. Bill Impacts'!K43","v":0.10452398492581254}]
[null,{"$f":"B9","v":"Large User"},"kW",5000,{"$f":"+'21. Bill Impacts'!J44","v":2595.4800000000032},{"$f":"+'21. Bill Impacts'!K44","v":8.6463689467872057E-2}]
[null,{"$f":"B10","v":"Unmetered Scattered Load"},"kW",300,{"$f":"+'21. Bill Impacts'!J46","v":0.49000000000000199},{"$f":"+'21. Bill Impacts'!K46","v":3.1492257403572761E-2}]
[null,"Standby Power",{"$f":"'21. Bill Impacts'!G46","v":"kWh"}]
[null,"Sentinel Lighting",{"$f":"'21. Bill Impacts'!G47","v":"kW"},{"$f":"'21. Bill Impacts'!L47","v":3.4029999999999561E-2}]
[null,{"$f":"B13","v":"Street Lighting"},"kW",0.1,{"$f":"'21. Bill Impacts'!J47","v":1.460999999999979E-2},{"$f":"'21. Bill Impacts'!K47","v":5.6471083712950126E-3}]
[null,"Table excludes the impact of HST (13%) & Provincial Rebate (8%)"]
[]
[null,"Total Bill Impacts"]
[null,"Customer Class","Billing Units","Average Monthly Volume",{"$f":"E3","v":"2020 vs. 2019"}]
[null,null,null,null,"$","%"]
[null,{"$f":"B5","v":"Residential"},{"$f":"C5","v":"kWh"},750,{"$f":"'21. Bill Impacts'!P40","v":1.5499999999999972},{"$f":"'21. Bill Impacts'!Q40","v":1.4879345308806385E-2}]
[null,{"$f":"B6","v":"GS<50"},{"$f":"C6","v":"kWh"},2000,{"$f":"'21. Bill Impacts'!P41","v":3.8700000000000045},{"$f":"'21. Bill Impacts'!Q41","v":1.3814028199179028E-2}]
[null,{"$f":"B7","v":"GS>50 to 499"},"kW",230,{"$f":"'21. Bill Impacts'!P42","v":-375.51399999999921},{"$f":"'21. Bill Impacts'!Q42","v":-2.5584800401710624E-2}]
[null,"GS>500 to 4,999","kW",2250,{"$f":"+'21. Bill Impacts'!P43","v":1386.3349999999919},{"$f":"+'21. Bill Impacts'!Q43","v":2.0617662077420419E-2}]
[null,{"$f":"B9","v":"Large User"},"kW",5000,{"$f":"+'21. Bill Impacts'!P44","v":4019.4800000000396},{"$f":"+'21. Bill Impacts'!Q44","v":9.7868670523159635E-3}]
[null,"Unmetered Scattered Load","kW",300,{"$f":"+'21. Bill Impacts'!P46","v":0.70000000000000284},{"$f":"+'21. Bill Impacts'!Q46","v":1.5281673998231753E-2}]
[null,"Standby Power",{"$f":"'21. Bill Impacts'!G60","v":0}]
[null,"Sentinel Lighting",{"$f":"'21. Bill Impacts'!G61","v":0},{"$f":"'21. Bill Impacts'!L61","v":0}]
[null,"Street Lighting","kW",0.1,{"$f":"'21. Bill Impacts'!P47","v":3.4029999999999561E-2},{"$f":"'21. Bill Impacts'!Q47","v":4.8294932026621048E-3}]
[null,"Table excludes the impact of HST (13%) & Provincial Rebate (8%)"]
[]
[]
[null,"Bill Impacts Breakdown 2018"]
[null,"Charge Type","Res","GS<50","GS>50","LU","USL","Stand By","Sentinel","S/L"]
[null,"Distribution",{"$f":"TRANSPOSE('21. Bill Impacts'!H40:H47)","v":0.57500000000000284},1.2699999999999818,21.026999999999816,162.33500000000004,569.9800000000032,0,0.31000000000000227,0.1613099999999994]
[null,"Variance Account Rater Riders/Adders",{"$f":"TRANSPOSE('21. Bill Impacts'!J40:J47)","v":0.95000000000000284},2.4699999999999847,-438.55700000000013,786.03499999999985,2595.4800000000032,0,0.49000000000000199,1.460999999999979E-2]
[null,"Transmission",{"$f":"TRANSPOSE('21. Bill Impacts'!L40:L47)","v":1.5499999999999972},3.8699999999999761,-375.51400000000012,1386.3349999999991,4019.4800000000105,0,0.70000000000000284,3.4029999999999561E-2]
[null,"Total Bill Before Tax",{"$f":"TRANSPOSE('21. Bill Impacts'!P40:P47)","v":1.5499999999999972},3.8700000000000045,-375.51399999999921,1386.3349999999919,4019.4800000000396,0,0.70000000000000284,3.4029999999999561E-2]
[null,"HST",{"$f":"C64-C62","v":0.20149999999999935},{"$f":"D64-D62","v":0.50309999999999633},-48.81681999999978,180.2235499999988,-4019.4800000000396,0,9.1000000000000192E-2,4.4238999999999251E-3]
[null,"Total Bill",{"$f":"TRANSPOSE('21. Bill Impacts'!R40:R47)","v":1.7514999999999965},4.3731000000000009,-424.33081999999899,1566.5585499999906,0,0,0.79100000000000303,3.8453899999999486E-2]
[null,"8% Provincial Rebate",{"$f":"C66-C64","v":-0.12400000000001299},{"$f":"D66-D64","v":-0.30960000000002452},0,1.0913936421275139E-11,4220.454000000027,0,8.8817841970012523E-16,0]
[null,"Total Bill (with 8% Rebate)",{"$f":"TRANSPOSE('21. Bill Impacts'!N40:N47)","v":1.6274999999999835},4.0634999999999764,-424.33081999999922,1566.5585500000016,4220.454000000027,0,0.79100000000000392,3.8453899999999486E-2]
[]
[]
[null,"Total Bill Impacts including HST"]
[null,"Customer Class","Billing Units","Average Monthly Volume","2020 vs. 2019\nafter 8% rebate"]
[null,null,null,null,"$","%"]
[null,{"$f":"B5","v":"Residential"},{"$f":"C5","v":"kWh"},750,{"$f":"'21. Bill Impacts'!N40","v":1.6274999999999835},{"$f":"'21. Bill Impacts'!O40","v":1.487934530880626E-2}]
[null,{"$f":"B6","v":"GS<50"},{"$f":"C6","v":"kWh"},2000,{"$f":"'21. Bill Impacts'!N41","v":4.0634999999999764},{"$f":"'21. Bill Impacts'!O41","v":1.3814028199178933E-2}]
[null,{"$f":"B7","v":"GS>50 to 499"},"kW",230,{"$f":"'21. Bill Impacts'!N42","v":-424.33081999999922},{"$f":"'21. Bill Impacts'!O42","v":-2.5584800401710631E-2}]
[null,"GS>500 to 4,999","kW",2250,{"$f":"+'21. Bill Impacts'!N43","v":1566.5585500000016},{"$f":"+'21. Bill Impacts'!O43","v":2.0617662077420561E-2}]
[null,{"$f":"B9","v":"Large User"},"kW",5000,{"$f":"+'21. Bill Impacts'!N44","v":4220.454000000027},{"$f":"+'21. Bill Impacts'!O44","v":9.7868670523159288E-3}]
[null,{"$f":"B10","v":"Unmetered Scattered Load"},"kW",300,{"$f":"+'21. Bill Impacts'!N46","v":0.79100000000000392},{"$f":"'21. Bill Impacts'!S46","v":1.5281673998231752E-2}]
[null,"Standby Power",{"$f":"'21. Bill Impacts'!G87","v":5.0000000000000001E-4}]
[null,"Sentinel Lighting",{"$f":"'21. Bill Impacts'!G88","v":0.25},{"$f":"'21. Bill Impacts'!L88","v":0.25}]
[null,{"$f":"B13","v":"Street Lighting"},"kW",0.1,{"$f":"'21. Bill Impacts'!N47","v":3.8453899999999486E-2},{"$f":"'21. Bill Impacts'!O47","v":4.8294932026621031E-3}]